##TITLE=NES1037_878015026_9242866_9XMLrb76ax
##JCAMPDX= 6.0         $$ Bruker NMR JCAMP-DX V2.0
##DATA TYPE= NMR SPECTRUM
##DATA CLASS= NTUPLES
##ORIGIN= BRUKER
##OWNER= Administrator
$$ 1.72 TOPSPIN		Version 2.1
$$ 2015-08-24 13:48:04.045 -0700  Administrator@X
$$ Compression mode = diff/dup
##.OBSERVE FREQUENCY= 400.02188249412
##.OBSERVE NUCLEUS= ^1H
##.ACQUISITION MODE= SIMULTANEOUS (DQD)
##.ACQUISITION SCHEME= undefined
##.AVERAGES= 8
##.DIGITISER RES= 22
##SPECTROMETER/DATA SYSTEM= spect
##.PULSE SEQUENCE= zg30
##.SOLVENT NAME= COFFEE_meoh
##.SHIFT REFERENCE= INTERNAL, COFFEE_meoh, 1, 14.98509
##AUDIT TRAIL= $$ (NUMBER, WHEN, WHO, WHERE, PROCESS, VERSION, WHAT)
$$ ##TITLE= Audit trail, TOPSPIN		Version 2.1
$$ ##JCAMPDX= 5.01
$$ ##ORIGIN= Bruker BioSpin GmbH
$$ ##OWNER= Administrator
$$ $$ E:\/data/COFFEE/nmr/NES1037_878015026_9242866_9XMLrb76ax/40/pdata/1/auditp.txt
$$ ##AUDIT TRAIL=  $$ (NUMBER, WHEN, WHO, WHERE, PROCESS, VERSION, WHAT)
(   1,<2015-08-24 13:47:56.842 -0700>,<Administrator>,<X>,<go>,<TOPSPIN 2.1>,
      <created by zg
	started at 2015-08-24 13:46:50.030 -0700,
	POWCHK enabled, PULCHK disabled,
       configuration hash MD5:
       21 0F 79 D6 B3 7B B4 F6 88 20 88 DB 03 48 BD 9F
       data hash MD5: 64K
       B0 E9 F4 A6 20 2B CE 5D 0C 6C 7E 49 F8 13 2F F4>)
(   2,<2015-08-24 13:47:59.936 -0700>,<Administrator>,<X>,<proc1d>,<TOPSPIN 2.1>,
      <Start of raw data processing
       efp LB = 0 FT_mod = 6 PKNL = 1 PHC0 = 0 PHC1 = 0 SI = 32K 
       data hash MD5: 32K
       6E 19 34 2B 3F CE AF 31 0A 8E D8 E9 4A 3F 2B 7C>)
(   3,<2015-08-24 13:48:00.217 -0700>,<Administrator>,<X>,<proc1d>,<TOPSPIN 2.1>,
      <pk PHC0 = 90.17029 PHC1 = 0 
       data hash MD5: 32K
       0A F4 31 90 89 00 00 C3 74 D9 CA 5B 32 A2 70 41>)
(   4,<2015-08-24 13:48:00.326 -0700>,<Administrator>,<X>,<proc1d>,<TOPSPIN 2.1>,
      <abs ABSG = 1 
       data hash MD5: 32K
       AB 6B E1 B2 3C C5 7F 1C 76 DE CD 8B 69 50 A5 2B>)
(   5,<2015-08-24 13:48:00.389 -0700>,<Administrator>,<X>,<proc1d>,<TOPSPIN 2.1>,
      <abs ABSG = 2 
       data hash MD5: 32K
       D9 76 8B FB 14 99 AB C7 C6 EF A4 0B B3 56 EE 14>)
(   6,<2015-08-24 13:48:00.451 -0700>,<Administrator>,<X>,<proc1d>,<TOPSPIN 2.1>,
      <abs ABSG = 3 
       data hash MD5: 32K
       E1 1F CE DB 47 83 93 D5 FD 6B 7A 09 65 84 B6 81>)
(   7,<2015-08-24 13:48:00.514 -0700>,<Administrator>,<X>,<proc1d>,<TOPSPIN 2.1>,
      <abs ABSG = 4 
       data hash MD5: 32K
       FF 73 CF 9C 60 A6 3C 36 EF 86 1A 73 C1 BF BD 5D>)
(   8,<2015-08-24 13:48:00.576 -0700>,<Administrator>,<X>,<proc1d>,<TOPSPIN 2.1>,
      <abs ABSG = 5 
       data hash MD5: 32K
       4C 7E 43 0A DE 07 80 94 4F 75 05 D7 22 2F 0B E1>)
$$ ##END=
$$ 
$$ $$ hash MD5
$$ $$ B0 CA F0 93 FC 58 30 FD 88 89 3F E5 C5 D3 35 80
##$RELAX= 
##$RELAX= 
##$RELAX= 
##$RELAX= 
##$RELAX= 
##$RELAX= 
##$RELAX= 
$$ Bruker specific parameters
$$ --------------------------
##$DU= <E:\>
##$EXPNO= 40
##$NAME= <NES1037_878015026_9242866_9XMLrb76ax>
$$ [...]
150 150 150 150 150 150 150 150
##$TP07= 0
##$TPNAME0= <>
##$TPNAME1= <>
##$TPNAME2= <>
##$TPNAME3= <>
##$TPNAME4= <>
##$TPNAME5= <>
##$TPNAME6= <>
##$TPNAME7= <>
##$TPOAL= (0..7)
0.5 0.5 0.5 0.5 0.5 0.5 0.5 0.5
##$TPOFFS= (0..7)
0 0 0 0 0 0 0 0
##$TUNHIN= 0
##$TUNHOUT= 0
##$TUNXOUT= 0
##$USERA1= <user>
##$USERA2= <user>
##$USERA3= <user>
##$USERA4= <user>
##$USERA5= <user>
##$V9= 5
##$VALIST= <valist>
##$VCLIST= <CCCCCCCCCCCCCCC>
##$VD= 0
##$VDLIST= <DDDDDDDDDDDDDDD>
##$VPLIST= <PPPPPPPPPPPPPPP>
##$VTLIST= <TTTTTTTTTTTTTTT>
##$WBST= 2048
##$WBSW= 25
##$XGAIN= (0..3)
0 0 0 0
##$XL= 0
##$YL= 0
##$YMAX_a= 559929
##$YMIN_a= -470474
##$ZGOPTNS= <>
##$ZL1= 120
##$ZL2= 120
##$ZL3= 120
##$ZL4= 120
##$ABSF1= 14.98509
##$ABSF2= -5.573092
##$ABSG= 5
##$ABSL= 3
##$ALPHA= 0
##$AQORDER= 0
##$ASSFAC= 0
##$ASSFACI= 0
##$ASSFACX= 0
##$ASSWID= 0
##$AUNMP= <proc_prof1d_extract_pilot.lims>
##$AXLEFT= 0
##$AXNAME= <>
##$AXNUC= <1H>
##$AXRIGHT= 0
##$AXTYPE= 0
##$AXUNIT= <>
##$AZFE= 0.1
##$AZFW= 0.1
##$BCFW= 0
##$BC_mod= 0
##$BYTORDP= 0
##$COROFFS= 0
##$CY= 15
##$DATMOD= 1
##$DC= 0
##$DFILT= <>
##$DTYPP= 0
##$F1P= 0
##$F2P= 0
##$FCOR= 0.5
##$FTSIZE= 32768
##$FT_mod= 6
##$GAMMA= 0
##$GB= 0
##$INTBC= 1
##$INTSCL= 1
##$ISEN= 128
##$LB= 0
##$LEV0= 0
##$LPBIN= 0
##$MAXI= 10000
##$MC2= 0
##$MEAN= 0
##$ME_mod= 0
##$MI= 0
##$NCOEF= 0
##$NC_proc= -8
##$NLEV= 6
##$NOISF1= 0
##$NOISF2= 0
##$NSP= 0
##$NTH_PI= 0
##$NZP= 0
##$OFFSET= 14.98509
##$PC= 1
##$PHC0= 90.17029
##$PHC1= 0
##$PH_mod= 1
##$PKNL= yes
##$PPARMOD= 0
##$PPDIAG= 0
##$PPIPTYP= 0
##$PPMPNUM= 2147483647
##$PPRESOL= 1
##$PSCAL= 4
##$PSIGN= 0
##$PYNMP= <proc.py>
##$REVERSE= no
##$SF= 400.02
##$SI= 32768
##$SIGF1= 0
##$SIGF2= 0
##$SINO= 400
##$SIOLD= 32768
##$SPECTYP= <>
##$SREGLST= <1H.CDCl3>
##$SSB= 0
##$STSI= 32768
##$STSR= 0
##$SW_p= 8223.68421052631
##$SYMM= 0
##$S_DEV= 0
##$TDeff= 65536
##$TDoff= 0
##$TI= <>
##$TILT= no
##$TM1= 0
##$TM2= 0
##$TOPLEV= 0
##$USERP1= <user>
##$USERP2= <user>
##$USERP3= <user>
##$USERP4= <user>
##$USERP5= <user>
##$WDW= 1
##$XDIM= 32768
##$YMAX_p= 424443139
##$YMIN_p= -696286
##$CURPLOT= <Network HP LaserJet P1505>
##$CURPRIN= <$Network HP LaserJet P1505>
##$DFORMAT= <normdp>
##$LAYOUT= <+/1D_H.xwp>
##$LFORMAT= <normlp>
##$PFORMAT= <normpl>
##$SURQMSG= 1
$$ End of Bruker specific parameters
$$ ---------------------------------
##NTUPLES= NMR SPECTRUM
##VAR_NAME=  FREQUENCY,     SPECTRUM/REAL,   SPECTRUM/IMAG
##SYMBOL=    X,             R,               I
##VAR_TYPE=  INDEPENDENT,   DEPENDENT,       DEPENDENT
##VAR_FORM=  AFFN,          ASDF,            ASDF
##VAR_DIM=   32768,         32768,           32768
##UNITS=     HZ,            ARBITRARY UNITS, ARBITRARY UNITS
##FACTOR=    0.250966925370066, 1,           1
##FIRST=     8223.43324360094, 55202,        -17407
##LAST=      0,             15617,           171931
##MIN=       0,             -696286,         0
##MAX=       8223.43324360094, 424443139,    0
$$ Real data points
##PAGE= N=1
##DATA TABLE= (X++(R..R)), XYDATA
$$ [...]
23839 -13658 41973 82690 -10392 -7356 -143469 337362 -166809 -34362 -94983 21063 224659
23828 224659 127929 -496519 -194424 -216155 42486 40784 58859 -118799 -138903 -102478 63028
23816 61953 171988 315456 -317600 -60631 -3753 -36411 105108 170216 -135663 165285 141010
23805 141010 206893 65916 58643 29685 146863 64760 64323 -195986 26923 -300098 -96743
23793 -4541 210419 36175 -184874 -44627 89773 42738 114484 -16144 -45137 -417764 82833
23781 -217056 60581 127026 215774 157337 -49450 -262657 54896 181196 173359 -229832 3976
23769 220456 -92116 -111986 239606 -193026 169474 -36110 -136961 228603 28125 242272
23759 242272 -218257 252964 -2689 250413 -284006 -16979 -15056 -282880 127876 247137
23749 247137 182584 -66613 -79335 -15543 -450074 -88500 -16373 102177 -49867 -7878 -97134
23738 -97134 -38510 -100905 -154120 384136 -122755 -78481 -191923 -128448 -251835 -117908 -2079
23726 -75932 42175 96300 -245653 -47683 -276752 -140345 -13662 -418061 -59630 75508 176910
23715 176910 -84232 302533 -157439 -292626 259921 44367 50330 -333571 -188351 -69549
23704 216705 -111030 269577 174541 75967 -104866 71837 -42574 -207458 221148 -147831
23693 -151484 -857 101704 41093 243084 -100590 -124309 452298 211027 -158610 -35734 81184
23681 -35114 22297 2829 -349682 289 188484 -77084 -134902 -56338 49620 20554 148158 98700
23669 98700 38680 -123614 144482 -116416 12569 -246277 -155362 7170 29590 24892 -140720
23657 -36291 72608 18101 138550 -207015 232238 100814 -128327 -123839 30332 -19710 44399
23645 172577 232653 -32290 -10427 86849 -346959 185221 -178809 81159 7117 316856 51320
23633 349642 38677 115157 -36630 -60916 136628 13049 -20457 145956 -58426 -25512 237
23621 102248 12257 13953 -110771 297387 -31799 137643 -42571 60096 289079 149626 -22421
23609 -123099 -56520 -220936 -80676 29378 29352 31925 23066 -5404 14342 50296 -316654 156894
23596 -77888 -11394 319625 55736 -126548 -222567 340172 -132704 -71804 40776 118676 83636
23585 83636 22048 211150 414343 23991 -164973 -72680 177025 -36512 -164499 27356 20993
23574 20993 -116172 13594 -137086 -5988 56380 -137946 -274340 -50996 119882 -562999 109201
23562 144163 -536602 -24960 120394 -73704 49803 233409 168712 1252 202348 83517 153403
23551 153403 -114660 -130653 -268913 -116762 -134363 441729 -76973 265116 -89963 -114520
23541 -114520 70203 307937 -101108 166830 118358 -228976 119329 -21898 79365 29315
23530 -370332 -140013 21821 118682 -130605 -170048 -69435 678 50671 -252544 166451 270323
23519 270323 242484 127295 -279218 -233595 226427 86064 -362005 -50609 -143232 39520 -41275
23507 41837 -136261 -131121 -179421 88828 106314 -75520 -114201 47540 -147442 -10008 24642
23495 82806 -94975 -93426 -375906 -103937 -91295 -40050 17491 -230954 160217 17288 -153690
23483 2870 -152521 352542 27372 134812 40090 -280705 -158184 -12746 46508 -275054 70479
23471 217848 -179668 -182230 -55914 15225 33746 -179288 14078 -84677 -4680 25930 -115413
23459 66568 -61296 215406 -125086 -188528 95658 222965 169996 -364771 -63195 -290073 -34029
23447 -29772 -62183 -45657 18043 68672 -259634 119950 91889 253012 5623 -10369 93992
23435 -158374 -55953 67999 -152298 152100 -95406 -161702 30314 -96253 -79614 16233 36896
23424 36896 -115500 34739 89054 -169296 20241 -17066 -95942 44385 130518 -69127 -42186
23413 -42186 -134724 -42640 -97889 46765 38339 -73956 121445 -155547 -66171 92202 -44534
23401 158783 62004 79835 -135579 37346 -107523 138245 -43014 -211389 -203250 248586 2094
23389 75678 107540 -190657 -568179 -137885 -65520 -42496 -98935 5091 109573 -135839 258538
23377 -39381 110353 47531 174142 197182 -185477 60027 51072 -68251 128036 -209300 61036
23365 -258002 -97895 -99976 -251941 -105535 -122610 -257983 10557 295569 -108523 149763
23354 178677 -265463 -35656 -255809 -152364 -121037 -167735 -31215 253806 65080 40228 5960
23342 37645 -66429 -4894 -101406 -25779 1995 -247688 -84812 -4843 -119969 237159 48134 -133505
23329 -150207 -93688 -90410 228565 135392 96570 147192 -275644 -69714 138251 48789 210293
23318 210293 251408 277704 -44876 -175133 -85026 1897 -19457 -400780 -54952 -178964 -396519
23307 -396519 -79034 74656 195089 252389 -84328 -68942 -102172 -78118 -35357 314145 -80309
23295 -52327 72005 -40825 -5466 105914 -239045 62638 175954 43639 284384 12106 241178
23284 241178 -110935 -2914 -61460 -38190 -223189 -51799 -22313 202043 -270442 -245772 -55221
23272 -165427 68874 77444 -265555 96228 129275 136363 31830 -92984 -18262 -85279 141452
23260 -44200 1413 280954 198727 -163969 57327 -312483 -107463 258156 -107016 7563 -57611
23248 34899 147764 8999 -387682 -222112 -173104 116897 -198171 -10706 -49599 -129638 -11713
23236 -261590 -145741 -117271 30994 -184765 -177432 -123563 -70202 -131053 205072 87531 -113522
23224 276809 254792 -83404 64128 -174698 -193450 -136836 -248337 -158132 211827 150132 -193110
23212 98622 111144 -101289 -280339 112710 70930 -205391 14150 -66416 26710 182233 15269
23200 -158097 -233525 83991 56390 56490 -111275 -195119 -82585 90449 116218 -154313 -137696
23189 -137696 -145599 -126802 78716 189507 -146689 -176384 -65487 142772 96354 -257821 47255
23177 -233773 -97096 -166059 -12431 149433 147978 -156366 -115730 -124820 129593 -77745 -63139
23166 -63139 -91162 -45513 144421 133419 -3988 -28490 90348 -166933 -135664 150877 -53248
23154 -24585 -214626 -108590 156746 84979 -29742 -169738 -514230 354114 50556 164280
23144 164280 -235691 45812 135937 2804 116078 -185010 -26701 -108715 209720 -85266 -325709
23133 -325709 -88057 -204994 -81794 257053 -56060 182 79422 458686 130579 391494 -65001
23121 30724 -189327 -273418 172771 -48953 -266193 172231 107079 -178948 -83990 143614
23110 -187863 18468 42789 -25511 -168131 -56209 156909 -74040 -247739 -4699 -121959 -11157
23098 182919 -15830 191365 53203 41879 -23617 -130116 155793 -45089 -84577 -3554 -4392
23087 -4392 -254959 137367 -99394 -268550 -26707 -95604 -101574 -30067 22296 -78977 146149
23075 295437 189985 -85793 74870 6971 -94894 24920 293792 -2047 -380130 -170365 216926
23063 137690 131673 90462 3560 -211548 -41877 137393 88668 61830 -211504 -352907 206955
23051 5288 110737 48711 6581 69678 224469 -94088 -134109 338978 -31664 -8753 10128 26572
23039 26572 130374 88490 -327163 -149958 -391350 18012 -56608 -40121 -60783 -88261 146684
23027 163570 117397 102745 127642 -65075 -185558 339752 -59467 -43868 479381 377533 -428986
23015 31859 24332 -42913 67287 -156289 364440 -88582 -116012 -80499 -160079 15637 71875
23004 71875 -196145 -17460 124615 492969 -2845 40749 -138627 183829 213421 219750 -61392
22992 -44472 -208630 243098 -178990 -60828 40982 19730 52442 -100101 15737 82132 91486
22981 91486 78953 -56651 -50025 -267583 -42656 -135234 -47765 20286 165740 -85082 10676
22969 -310399 -57029 -222891 -135941 -223845 191751 206989 195213 -4369 -372860 -139325 -155818
22958 -155818 290499 86340 -144637 6294 101719 -244662 -329293 212755 -202211 -105009 -35801
22946 72764 -270397 -111160 -292374 49837 -68094 -121715 -165409 372175 -188624 88301 9574
22934 105490 -262721 93334 -153700 96000 -3734 -235903 57203 274350 -19204 -110309 -212419
22923 -212419 57487 -190561 95550 -187278 -117836 -2679 237744 -173801 -103772 -96989 73353
22911 -133637 -8326 3618 265861 62590 -236539 -27331 -97681 -64954 -53902 30596 107455
22900 107455 -118359 -272884 -55313 310057 148418 139195 -66092 -208262 -47314 100797
22889 -79463 -235396 -45369 206048 -215662 263221 -53897 -112437 35055 -222531 202395
22878 -36259 -43702 -296246 212596 90061 -212228 55759 144140 9211 -8717 33909 127780 -89511
22865 -252120 -17032 -16399 106636 -361394 150964 82913 -8172 -128578 -33317 -435623 -59617
22853 27882 -77493 82332 -226856 114746 57383 279755 -1631 -95759 1402 -300585 -84127
22841 75821 257251 -100639 207070 -252826 -42611 6363 -166497 47702 42104 -97691 -392313
22830 -392313 19908 -18060 -119615 149703 -399474 -9941 100066 197856 83147 66281 141617
22819 141617 -24579 291957 -20094 -89056 304514 2669 -68908 -260012 -78892 -25665 -270761
22808 -270761 39625 53511 -127611 72592 -15989 23328 -150941 175108 -113940 113261
22797 92049 128332 -89251 54098 213874 -64179 -132994 -131019 -261830 11591 210093 295082
22786 295082 -165566 71183 -4524 40714 -19337 -210431 205180 52902 -72550 99899 42625
22774 32293 -171750 -103883 140114 -133350 -237748 -201963 4417 -281397 48603 -98769 101978
22762 209442 -282015 -256960 -11548 -7110 -20426 -89063 174681 45631 -24310 113120 -47915
22750 -71371 -170812 -136307 47866 -8386 -216196 157074 -117388 135156 -194241 113014 140440
22739 140440 107549 -279886 -401193 -150233 281603 461761 -57079 -111371 27411 22928 90012
22728 90012 -171436 -13342 153342 117054 12872 -341075 -173084 15184 6997 71886 -106986
22716 -119715 -79926 -113221 -54059 301613 -182357 -94639 115351 131515 117712 144340 -148157
22704 -99358 -7958 104072 84847 -76123 -184673 -189470 358910 -196179 -59941 29748 -170163
22692 -215544 51590 -77101 -66712 -82633 -347796 75342 -45297 -261926 100071 174672 -466038
22680 24471 -177406 -92821 -23757 -184611 115385 53509 77847 175000 -103742 -46618 48946
22668 -97061 45777 -239307 198532 -56860 83249 -46809 -145860 -168609 -321609 163891 -347582
22656 260318 101139 -215988 -85842 -171062 73523 -221438 -164354 -71585 -142237 208162 -304926
22644 159120 -198471 78952 9959 -333950 -142357 -271446 214626 -215520 -84926 -225409
22634 -225409 -159283 -118542 -215033 81383 -142182 -138212 10183 -124479 198319 218050 182494
22623 182494 -14378 -72086 -244702 -61514 -192758 -228067 -43441 -18473 -269123 -311888 119901
22611 -162688 7389 -210264 31758 62022 -267958 32439 -224191 272538 139887 -86445 -171187
22600 -171187 -76546 89546 48203 -17904 -257963 -197028 47679 -303563 94161 69195 94727
22589 94727 33286 69026 -103670 -188596 178663 -71281 99393 -159340 -145178 -78145 24517
22577 9754 -96378 -57380 49640 -201084 223307 -159706 -11806 -67433 -101963 -272901 -63223
22565 7613 241444 -360579 65668 -109688 -66617 -36736 78257 -22815 -128600 -274075 99917
22553 -233793 74181 -24401 -97722 138210 -53864 -223633 -102503 76673 64727 -13607 54215
22541 -87897 -17862 123524 -241393 60335 364810 97864 -77903 -197909 208845 -166758
22530 10776 -129584 -150512 -79522 -251716 36820 82817 -14784 -27288 -62168 -8229 -69346
22519 -69346 -262893 206449 -164080 83797 -216507 -249824 -83298 178193 -210323 78532
22508 167139 14241 -176169 80350 -170425 586924 99059 296007 -374374 -82775 -46882
22498 -46882 367950 146910 -131035 99357 144788 -1259 242378 -234012 -258001 38853 -99916
22486 -52728 -183731 -53136 -279947 -114638 88967 178716 -298309 217941 -12153 54696 -190760
22474 -49325 245787 -118936 72790 186441 -253958 87070 278826 33992 -19164 131601
22463 -133956 -328448 144721 10180 -124270 -203154 213852 -19991 -20502 27815 -92824 -24439
22451 -6057 10960 -2834 -86338 -105607 -341011 166631 96628 2938 -26208 25957 22097 -94568
22438 -110218 149828 -11098 -171306 -208162 38531 57152 -156619 -187715 -57319 -423829 50570
22426 -215593 -62035 103225 36802 -153066 -38149 -60931 252625 -91817 -175456 -106165 261109
22414 47126 91947 -137097 21764 94001 287921 227050 197127 14624 77494 -127388 -179718
22403 -179718 44103 156399 -157912 -196393 -73425 -117046 2049 -2325 -76034 27036 105130
22392 105130 -122083 46311 -101181 -127588 29173 -48886 -205361 306618 122599 -165344
22381 11277 -54630 -92986 -163459 -227088 -111230 126274 -231251 118019 78792 47136 -296925
22369 -476428 259041 -120676 -142747 172237 -97597 -114857 -156775 96143 53290 -107501 -231938
22358 -231938 -50643 -25397 -173940 389866 -180106 218120 3044 119053 -125948 98584
22347 -1173 24448 129046 -17983 82515 -177225 32517 109913 -238240 -87328 -130450 -208743
22336 -208743 -313728 -48338 103456 -231695 -360411 -47821 -220872 108727 191964 -271671
22325 235162 57145 230725 -424130 -234557 34141 131016 -107616 36431 -184074 115527
22314 222176 -65742 -19003 -316493 -79372 39259 43157 -108791 -109327 -76201 -27989 -226510
22303 -226510 -98097 359517 -25571 86559 -131510 75930 -136148 -19826 -137537 -195617 5443
22291 -290923 -149497 105339 77026 -274536 -149524 76040 -227516 -240505 -119444 -176 -105978
22280 -105978 290649 67488 92834 -44569 229534 -260558 -29336 97757 -114863 121200
22269 -286872 -46843 -258135 -86155 -381240 -73564 147985 23470 -123578 -66950 -120417 -34718
22257 -196471 -63479 83520 -76013 -122734 -346690 45221 -116621 -317672 261205 -223225
22246 -205430 131079 269258 -75875 129063 -3388 236450 -75355 13892 116585 -127139
22235 322 44616 130605 -26302 67999 -241620 -29323 245662 107338 -36156 102785 -227691
22223 -166264 -110717 -197695 52522 -18265 246550 -35878 -136372 -19297 -245157 216650 -166854
22211 -314569 -37452 -122250 -135882 -342969 -352793 104428 28851 25751 -148877 -94836 -16255
22199 -85112 -199535 -215499 -235798 350703 147098 -213066 -346369 -11638 6893 154173 19930
22187 -202217 295630 -136806 -37764 42337 63010 138274 -118528 -2933 337846 -129650 185714
22175 54313 -365039 -82575 -89374 175337 -170252 88849 279285 37341 203339 91583 34260
22163 -201545 -29354 -24308 -101489 -240657 -33220 101479 14568 47443 -82688 -379438 -358237
22152 -358237 -59195 75195 -123904 -58017 23199 289259 -116378 -59577 133886 349294
22142 349294 -360846 -99525 -34579 74884 -156091 -129269 -75841 -27707 -134420 -355669 -55143
22130 135255 109173 25692 -109207 -124568 229499 -209397 102597 -64167 144855 -134530
22119 434036 -211450 -140046 -47038 -166416 -382365 -44050 6958 279832 66906 56815 -395974
22107 -152853 -8953 273865 -33195 28883 -42271 -75989 21934 -34614 161563 72348 449 -104697
22094 58219 -4578 24756 -184267 -58120 42452 -71125 -395111 -248552 -4888 -205034 -85780
22082 -418340 -276763 160418 -43816 -90151 145218 -75509 221493 -223141 -38994 152102
22071 -179808 2608 39600 226914 38224 -120303 -155371 36929 -84381 337723 203015 -167301
22059 -150976 -34885 -55842 56064 -109160 57117 -1995 -153242 118159 -151620 60239 20787
22047 121392 10174 -98641 -129851 -81954 17081 51907 189865 219121 45391 -97175 -35210
22035 23311 149362 98604 -153505 -336913 23149 97357 33203 24919 -59101 128037 -276371
22023 53122 -397203 -91732 131905 142012 62226 -5326 -3082 45467 -20262 5821 -130231 -174641
22011 -174641 91312 -94925 -300028 -185516 306328 -1863 210857 165559 -33515 173923 4832
21999 -209080 -37821 -88209 92815 -118792 67547 -302349 47307 -331977 320385 -89175 21993
21987 -188037 -35810 214987 286888 29382 -16630 71279 13590 -212367 -116273 85929 -21370
21975 -39534 165248 97330 -41144 -38543 88301 109288 -55663 290708 17245 -301398 -395548
21964 -395548 251094 82442 68044 57074 -82471 -24511 -54072 90222 60401 -270 133667
21952 -89355 -25823 20628 -44593 -293140 -162733 329130 53908 -102311 146910 -49385 60120
21940 76976 -6164 74179 213992 -184449 -306362 -130391 216209 97508 98158 -123730 259681
21928 -221443 -64522 50181 -110846 -81015 30469 -291071 -173969 -102539 3450 -17623 54850
21916 -377346 -133340 -502545 -2260 -120094 -362810 -169283 -38685 61428 241315 76247
21905 70508 -246446 -139780 -15478 -203232 -53001 -50776 -28081 4984 115183 74784 292135
21894 292135 -133066 -18046 -110787 147428 131894 -151402 -203725 195495 193050 -172526 -93237
21883 -93237 -96863 40694 42695 -195684 24194 -16911 49755 -143256 -90113 -55792 -14639 133850
21870 -83480 -110819 -149279 181142 -269230 -23758 266066 -184020 -57661 6430 -183113 -89847
21858 216747 65449 -66970 -222122 -144366 27888 108719 -101304 202200 -86062 78193 -315271
21846 -266377 -26495 -112836 195384 48316 -40797 -78270 -342085 199879 -36429 -146941 2535
21834 11789 -180872 100120 -141504 -279937 6728 16337 -261819 -103145 184099 69455 92679
21823 92679 -59912 63418 170284 54856 715 -69874 208412 -156238 -19348 60578 -119939
21811 -57208 5190 -703 -117419 -287448 -28847 -8993 122815 -162896 1140 -348238 -193099
21800 -193099 -264328 38255 154807 74848 -324263 141845 -98018 -110798 -115721 24125 -21959
21788 -183225 247812 -60979 -222781 -70262 41391 91215 97510 150016 -73912 -13851 -174797
21777 -174797 -72054 195047 -174341 111444 -55284 51674 -69962 169432 -13151 -46974 -159940
21766 -159940 87039 240433 21484 159582 81672 171652 116951 92081 254926 27847 186717
21755 186717 342645 -100278 -169602 87528 164144 -362802 32660 110805 247794 168805 268372
21744 268372 -218080 -156571 -31666 -212560 -299452 12927 176869 -203656 68055 -129245
21733 2006 -158450 122386 -337529 -30834 -89940 22622 49282 123202 95902 -293692 -99507
21721 -284147 -131184 164371 -66382 -43554 17280 40445 -40911 9744 46659 435957 -42218
21709 20058 21426 -301448 -26276 7679 -183189 -202246 107354 -144311 -135414 378896 -26729
21697 -83936 -145024 -108561 -81450 -152643 -47022 106481 -126947 -40503 -154262 328134 -276253
21685 -7024 -84777 -163498 -385710 -107704 -77036 -109684 202958 -233930 57509 178923 119348
21674 119348 106171 20599 -187563 66923 -368116 -80929 -48346 114638 -200090 34555 -168792
21662 -144162 67065 -225814 121862 -100212 15653 129976 40357 -103367 -4998 55195 -18261
21650 1442 -331680 21374 235283 381666 -90230 -74477 -15004 50978 279928 204059 -300053
21638 17707 60966 151492 -297247 -430354 29318 -348922 -225545 -390909 -358733 -129289
21627 -105455 -210176 304786 -38529 6003 -110098 -18190 -207046 -108896 -222181 -36970 -201338
21616 -201338 -78176 189416 -85870 -322114 -78808 175542 1082 23796 -13501 -53352 -14462
21604 -38571 138825 134636 -54494 310083 193458 -9119 -3763 64487 -287254 -51345 -88483
21593 -88483 -264847 103211 -6341 -182852 -123358 75740 -49816 -32828 -10051 -86740 -330525
21582 -330525 285545 -250497 -69144 119740 128712 -110739 -85005 61291 175750 30748 -94512
21570 -177052 -36112 180312 97437 -222309 -34137 -110249 -177669 126288 171066 -107677 134407
21558 -2194 -19904 -130562 42808 -20738 -89424 -166886 60716 -20681 136471 -276504 109546
21546 -84461 76534 -388191 -89156 203662 189235 -63424 -139842 77378 74755 -137278 79007
21534 17980 -158537 43778 -5335 -92445 -2237 -226885 -193848 -333850 -228611 311807 33241
21522 -61113 -144199 -221781 -24256 -161621 -248961 -189056 35605 193683 -289207 -113286 57329
21510 44879 6400 -117074 -76504 -231561 -158760 -54646 -393471 -51704 -51566 -296947 208326
21498 49639 120162 23902 -142497 174375 155434 -134870 72548 -112914 -20869 103808 216635
21487 216635 121795 -250959 187862 -174894 262136 49620 75066 -10654 -119417 72256
21476 -408766 -30902 -136546 -93779 76595 -119848 97239 147160 -149277 -139929 -69654 68028
21464 -342691 14011 -176663 -257603 83113 -100460 -378966 -141222 -99778 -148004 -127778 38391
21452 -16441 -29493 112689 -156550 -177906 10525 -173815 -216379 -98527 -79397 188317 -442785
21440 169288 -41325 -202244 51258 3744 -399040 -34072 -109577 -313153 128276 87461 -283206
21428 -10233 65842 26086 -349671 67646 7560 79292 121753 -362472 -22533 368786 -92340
21416 148487 15265 180523 -318927 276300 -121033 283535 24626 -92674 231513 -71267
21405 229099 -42951 93712 237524 179070 -103698 -42892 -6558 140371 -168463 -289530 -79297
21393 -257004 265165 -423448 -142913 152410 128830 37017 -185549 32358 129001 -28845
21382 270540 282714 84187 -81859 -226978 86642 3601 -23334 -472815 -142838 -87512 -66686
21371 -66686 62058 113605 -76485 -220358 86021 -3116 -122956 22361 -133238 -30038 -264062
21360 -264062 -119116 61388 -61157 -53044 -327218 -216155 -6950 -69954 235935 -30851 -104208
21349 -104208 36187 -115063 -343982 10258 -386131 -196844 -326298 104360 178583 -178377
21338 -142108 -157270 -50558 115526 -167849 99970 6640 124342 -266716 -80712 -204317 -126991
21327 -126991 -211099 -117854 -280740 -267325 99457 -275546 38812 -118204 -110940 -11269 189338
21315 -381075 106805 112743 -164021 -53292 198182 171166 -84923 -104166 -23701 38241 -99803
21303 52174 21821 265651 35799 -65091 -192432 -29746 -54280 -301292 -100753 -165276 -12651
21291 -31745 -166045 20036 -217599 -431266 142274 152226 197630 -14898 249300 246515 -65422
21279 -226057 133769 141357 -22708 218116 -61695 -22169 -90564 -39212 -292421 -115035 -75608
21268 -75608 -90587 151926 -33647 -155729 -232775 -116261 -18109 -167062 -192040 -206261 -425822
21257 -425822 16732 -84128 255042 -100553 -274128 -149407 -1196 -28872 92933 -183781 -178482
21246 -178482 -13923 12629 -156361 -15974 120291 -212427 -454347 159707 -138853 -171175
21236 -171175 85582 19512 -104608 42721 -135575 -109206 85274 65006 -94193 -179091 113648
21224 -123367 -373229 -36239 -144653 118096 68295 14860 -113881 265701 -27414 -219859
21214 -219859 -32366 -27912 -147967 39490 -190867 147344 -78828 -171624 -81294 96521 24830
21202 25616 -120930 214237 26939 5587 204448 -28809 115500 172604 293639 -8060 -240047
21191 -240047 -29673 -300285 30753 137963 117588 -6668 -107400 38590 59195 -149575 8504
21179 -220074 -171667 277525 38247 -207599 -30252 -32228 31275 50263 -122131 20487 77119
21168 77119 9045 -143992 -304007 -27253 -428902 -74134 -1406 71517 162216 -251292 121715
21156 -285389 -234959 -126174 -5907 227037 160483 -130718 -88708 -106874 -52323 284712 77545
21144 -72860 -109570 3483 -127651 -229487 63640 -228170 -11995 -142487 -217131 -231269 25589
21132 279426 347705 76135 -214529 -72514 -73087 146016 -435108 42750 -42202 89393 381933
21121 381933 24445 -338743 -3150 -87361 125055 -29068 108442 300330 -57814 -195630 13900
21109 195332 18233 -311311 -53224 55328 -378527 -197112 -76934 -37761 -73075 -73655 49979
21097 -11669 -410872 -260037 -199682 -28255 -119275 -250068 -234824 152928 216972 22708 -77122
21085 6452 174699 -205114 -167993 -2954 147769 -207206 -1441 -150061 -222994 149350 -433968
21073 312965 17044 -38793 80358 261160 -448687 87490 -423467 50313 5022 -293986 -12912
21061 -128440 131223 -27522 37941 -319193 38063 -151566 -66608 -42464 -117193 263911 55866
21049 -72278 -136526 83067 55485 -329098 194521 148686 -8140 182731 231982 -138775 116477
21037 -285735 95549 -77985 -19936 123251 142575 -216958 19524 -55207 -220988 251498 -411782
21025 -195761 -143378 -79220 -154167 -10776 176219 128286 -33802 -309969 -13952 -13978 -112415 -19794
21012 -153347 -33518 -84189 22403 124191 143328 180898 -9441 -58385 26201 -194891 189984
21000 5514 112309 -22898 -210107 -82931 41071 63409 -77109 -437407 15141 287225 -81161
20988 -28861 -94800 277905 113890 153732 89585 -367165 -119029 -352865 -312938 -36346 -70068
20977 -70068 -73805 67826 -44074 -259798 -181373 163063 -47552 -2990 -43304 -167072 241307
20965 163791 143147 -128957 -171369 -375391 -67017 22033 -132894 -231605 -18186 -119421 -159319
20954 -159319 -200733 98356 -8964 -91524 -111380 262365 41707 118489 12948 184042 316632
20943 316632 -8869 34042 14300 -44898 83553 -218389 53824 4815 -67160 256952 -67939
20931 -61814 218893 -251448 -273432 40747 -6483 -133201 158552 -32023 -18746 -41435 -93146
20920 -93146 -138274 139861 154673 -120740 -136537 -128191 -27208 -137868 -462615 -328166 -79720
20908 76018 147585 246940 -239139 -173497 138470 47482 -246693 -125229 90119 -49423 -42706
20897 -42706 -373257 -21768 6027 15428 -230914 -136377 -311347 215528 -74703 -541438 105929
20885 -33106 287422 -67489 -75948 -381477 -167601 -384108 97919 -138289 26830 127981 -48641
20873 169489 -88786 -103705 29245 168888 -90296 235372 1835 7454 220631 182842 123702
20862 123702 -63093 -272475 101759 49040 -172714 -36676 -75692 -310670 -199387 73521
20851 128902 -119259 -84292 182298 -276058 -219950 -104128 35926 -64470 49167 -116864
20840 147294 -66192 59281 -2037 48890 18190 9466 10053 -3328 446748 -164323 34353 -133339
20827 93994 -122098 32375 -41604 67576 -354409 -312430 -225220 61095 176739 169630 -258500
20815 137013 171106 16888 -173255 -296836 -63541 130990 16121 -166505 19658 -37679 -65977
20804 -65977 -110066 126014 -26175 -130411 -11332 -192727 -276313 -26836 -131461 128778 -106499
20792 162380 -15845 11550 58479 -133111 62396 232424 -3677 -124888 -90292 -204813 -285301
20781 -285301 -177875 -138352 -276339 -154151 103719 -181278 206869 -214253 -53837 -96791
20771 -96791 65431 -16293 114006 105391 -224961 -2445 -157349 -64637 211118 267371 -103302
20759 245130 -102009 -110013 -94903 146916 -306517 110529 -83057 -66107 244187 -62410 -216504
20748 -216504 -53629 72715 25161 122734 -71516 18010 -204715 70724 -281045 3544 179521
20737 179521 -33649 -294989 -240924 -126645 172266 -126220 -364881 -269735 -217542 -265685
20727 -265685 -313966 -404634 -217738 197406 75155 -35714 -27408 143740 -148414 -105321 31172
20715 95269 64567 96407 -166817 187690 -443939 -22532 9670 -103608 175393 -108594 -72350
20704 -72350 54502 -115564 -115508 73466 -83170 155255 52282 -351414 -104338 -144115 -120479
20693 -120479 441236 287116 -21145 127641 -302184 689 -224745 -157074 200240 -158389
20682 -275930 -246206 115155 -16473 -86422 154768 -370651 143547 -98197 -129886 -157489 -62893
20670 -144872 -427261 -308255 184420 -82335 -24864 -117408 221954 -167959 66062 -149131
20659 -6900 330630 11159 54673 277228 -81416 59692 68057 -193006 26474 85616 -155747
20647 10055 45203 132904 40819 358204 -29929 132429 -125995 -125824 124033 -220387 -306216
20636 -306216 6037 -233116 -36852 -542096 -11920 -98929 -287630 -236516 -84661 45221 -121696
20624 -4962 -150785 139120 94691 -58895 206662 -64095 -108209 13970 -215052 -193191 -17235
20612 27884 10749 -118911 152261 -222827 -100965 -133494 -75429 68459 -289867 -182702
20602 -182702 -420494 -36629 -19722 -62423 70580 -72398 -114506 88855 161154 -19345 170557
20590 -325747 104091 10724 261965 68050 142240 -234644 -335857 -138491 -191978 -42402
20579 333730 -425468 -114342 106523 -100901 227246 -152579 171647 135488 14180 -43384
20568 -9292 -94545 1499 -21798 -84321 -179033 56712 42624 -172085 -144897 -53379 -6649 -258397
20556 -258397 102153 -387205 -72548 -84081 -39782 308876 -296001 168420 -163498 -113275
20546 -113275 134730 119819 80075 -158043 -149762 41328 -40248 -282142 168367 43722 134874
20535 134874 -97826 -232962 -65 -253163 -107942 63774 -4466 -86246 6275 56767 -157902 72418
20522 -5723 2272 146437 65302 -702 -11951 29742 -230928 -128117 24378 69516 94474 -31077
20509 29023 -184738 -151307 149977 -106694 -206961 3656 -129354 -102688 -79521 162497 -70497
20497 -108898 -165672 -70024 -68517 76499 -60689 -328118 -210566 -317948 -66203 -44763 37195
20485 -83080 -283532 88605 96156 9819 -244437 309697 -103043 282617 -37590 -34666 -92067
20474 -92067 -31043 210108 -215536 -43912 189660 -141746 82158 -61935 72836 102791 21435
20462 -123137 -242185 -18839 -87479 -24259 185841 -138447 13505 -29341 -53063 217775 -75175
20450 114167 27302 -37310 377370 -350746 -7021 -33441 -95208 -4380 -86042 -371509 -186007
20439 -186007 193830 71949 150897 -186692 121905 15766 134453 -160189 -28106 -27464 -329985
20428 -329985 -140570 -28230 121532 -177716 66923 226504 372448 82127 -419869 134405
20417 -35541 -119687 71216 -143041 107817 169419 -246570 -21081 78753 -105087 39413 49302
20406 49302 -85890 262522 113294 -440711 273452 -30845 195754 -147603 -305232 79666
20395 133055 -125389 -231505 -91815 -969 -217367 99695 -151319 -233622 15632 35439 -146892
20383 33088 -354422 -146967 82076 257280 -63902 239004 -59570 -233798 -256031 26124 118479
20372 118479 -160008 -250705 274947 16308 72889 -113769 -51875 -88244 134220 -128061
20361 183114 -52451 -126623 24072 -70393 68497 -29043 -45449 287207 82091 158178 70449
20349 186085 90078 -51254 107790 -287204 -169447 -136224 -164828 199477 -321395 163569
20338 -51886 85139 101246 -205098 139822 -11790 -89790 -65312 -213666 -168642 36047 -42796
20326 -123601 -142582 47784 -32865 -127668 39894 -215122 -20639 124889 -10606 223244 13128
20314 -183349 4450 -391555 71780 148523 -366260 139683 -5285 -118351 27306 -131370 -271067
20303 -271067 -18499 -40761 104792 -17294 -11126 32440 -159221 -15397 -232810 -101605 -234895
20292 -234895 -139162 -234503 -256911 -80703 -220428 -94635 -387407 -110394 5226 275454 -90348
20280 -8949 -38812 140300 -151621 -21213 -395891 -423019 6394 -287726 -33299 212416 192397
20269 192397 -179693 -120010 215738 -12400 108338 -110775 47386 81165 -241728 80407
20258 -261345 -36347 -105796 22668 -161351 -107433 -34742 -229921 -297116 175732 -201857 -24785
20246 -198396 -217725 -252573 119865 65421 -441145 156767 155289 70817 -46417 71332 -167405
20234 -77336 -161679 56561 -108685 49576 77981 153646 -132848 -285877 -112694 81457 105257
20223 105257 -25256 -83961 -259065 85053 161044 -28300 -173107 211206 -6475 145028 -200942
20211 -340324 97472 -46414 -200485 -41665 7093 -31433 232246 42849 -98046 -124039 100941
20199 69225 -33381 -74080 -442924 -1100 313213 75938 -147357 393178 -534071 252070 -255474
20187 124905 -17708 553298 6638 218055 165150 -126065 -86169 -108912 -35423 48996 -128845
20175 -322608 94403 -214145 -199280 -155491 91606 378279 -150177 -19655 -125495 -225085 -409084
20164 -409084 2608 14502 254744 36582 298228 -205010 24646 94032 -10963 126224 257391
20153 257391 428814 416132 -204180 197945 118026 110550 209893 131639 31623 -61987 -317294
20142 -317294 -259054 18472 -5146 -11681 -327923 -63344 -103505 -13465 -205062 -177287 -131179
20131 -131179 -99568 -287158 97623 -306448 206577 -351708 -27047 -171896 41544 -203951
20120 38753 78787 74283 102497 -1533 42835 -69551 -234554 -76755 -162365 -64988 -34633 35660
20107 -219624 126895 -79363 -157413 -371917 -40089 7312 76396 -226017 -299730 -72236 -189626
20096 -189626 -42683 -168101 -151532 -386192 -260188 31522 -196233 -215669 -85197 -186256
20086 -186256 53215 -435868 148693 22118 63437 -67143 167863 -27248 47310 -167870 -158902
20075 -158902 -79170 -341996 48261 81787 -221187 -278369 -348956 182882 -345727 -77031 -130872
20064 -130872 52293 93028 -157149 -274254 -54076 -93313 126760 -368136 -78059 1841 -12825
20052 266020 -183489 -52172 139389 25721 -282661 -70301 16692 98907 -155134 -117806 -38740
20040 -34516 -58179 -81526 -204736 -20473 46709 -192315 287849 74992 -69424 -205900 -81594
20028 215100 54514 -249986 -176408 -382515 -12696 -96056 2485 -959 155976 14095 -52966
20016 -124493 -51708 -46770 218059 268116 -312587 46149 -70373 67858 -92408 -41286 6450
20004 -14656 215540 2268 72699 -62902 65665 -37261 -46836 -166157 -6695 -212409 -275506 45541
19991 28295 178274 -272208 -165261 -274361 -73525 84834 21608 -169842 -64570 -324911
19981 -324911 -164418 50549 77906 321394 -166848 -148741 -123430 -257143 139727 268425
19971 268425 62518 -100382 -26348 525612 -133851 -55865 -127109 -11566 337067 32652 -68949
19959 528969 -131189 -37295 -32482 11290 -295749 127915 -111680 -212934 -353936 67276
19948 -341208 13134 -98908 -10987 -15871 -287374 -388743 161953 -150915 201184 311224
19938 311224 -90567 49514 -89819 387486 -29623 171765 -70934 -324947 -54840 66415 -506844
19926 -339572 -304704 75268 331259 -32900 -180334 -48449 -47033 -63949 45698 -69341 32508
19914 -87760 -128710 -63685 -143052 -71075 -200720 66870 -252407 -83340 33535 -129897 -100530
19903 -100530 -23642 -154271 1508 -175875 168155 -33564 -13650 20106 -43822 -359428 244382
19891 -63623 251764 -100824 130921 -320087 71087 -36120 -26569 -89574 -313233 -59380 -296042
19880 -296042 -99387 -44797 99741 -72351 -36762 128192 76390 38403 -233585 30049 -282583
19868 37176 -352195 -112468 -16902 -314081 -415311 472 -138128 -211081 207857 -181785 -63800
19856 -81696 -140344 -267842 -74404 155741 -83036 104986 -22849 13687 85889 -352330 122757
19844 -149884 -85060 -71722 -125134 1142 31658 28623 188933 134102 -116190 103445 -291282
19832 -4092 -144956 -135833 325898 12743 -131609 -77076 164643 24053 -139070 -89610 -76564
19821 -76564 306734 -131072 -29045 85304 -15276 -226699 -213134 -87672 -1350 -143345 81212
19809 247552 -212199 -217829 -379689 -204857 -114663 -56978 54907 144991 -12650 -169879 -272148
19798 -272148 238422 -49333 -549559 -76191 63858 -298261 -225532 18338 53050 176011 -138614
19786 54821 -280149 48184 -196877 45058 75997 -12621 261822 82549 189250 -174920 188016
19774 -144102 -226338 -17473 41889 86729 30411 -118101 293512 -228787 -414252 -334599 211219
19762 -330055 -34440 -540845 18496 8464 77718 -65781 18776 -155679 -258563 -349633 -311553
19751 -311553 64258 156457 -257861 -26571 -13671 35404 159735 25377 114781 -191845 72891
19739 -195064 145839 43295 180817 185128 3842 225856 366539 117808 -218683 -51691 31732
19727 89348 215260 453761 -104578 -114354 -45168 -72941 2210 180577 -235856 -161809 -316407
19716 -316407 -25733 85227 247871 215023 -127194 -306659 177783 -3150 -42062 -110135 133618
19704 5322 70805 109823 -10287 -550998 49911 50938 3787 -202615 -243135 -201203 -19303 -87935
19692 -87935 -90801 462015 -120344 -212110 324879 -161867 -170099 -212596 164752 -54999 -120698
19681 -120698 -272138 105771 -109261 -693 79872 -119094 -229381 -20074 28331 -240463 80427
19669 -94529 -263589 730 136945 -254420 218904 119538 -88882 -65531 46371 -30564 -291610
19658 -291610 57562 55261 -210179 37496 47194 -95702 -276701 -163204 269468 -9578 -26288
19647 -26288 414106 -90932 -79125 -152670 -45776 -358366 -185156 -31014 -195018 50039 -61186
19635 35551 61226 -57370 216350 54054 183463 127089 -3412 172049 62057 198807 72439
19623 -192769 99092 -34599 -80829 15652 5984 -11528 -233003 185475 -51826 136101 -222301
19611 -31649 -459201 105699 -166037 57108 -160026 -80559 -83337 196265 -34231 -248861 -181094
19600 -181094 74538 -48042 49296 232715 -11293 222131 -27420 264301 288751 -14117 69062
19588 -81624 68168 -31367 -316876 -77940 -41326 -113660 17866 -390194 190704 -94576 -72064
19577 -72064 98096 663 -234734 3916 -183846 -138170 -488886 -192580 -139335 28560 -39428
19565 -96021 -147329 -40248 355565 96698 23225 -81765 -182621 46168 183468 -50896 117137
19553 -179345 -54156 5882 140525 14968 -12419 13200 -206880 -334574 20367 43981 -13634
19541 -306578 140935 15501 -278723 -39163 -125670 -56538 -259735 -130623 -243717 -118845
19530 59395 -250589 -131611 161012 128546 139207 3018 142622 -280700 -1626 -246630 -100850
19518 -198 -82360 -100522 160233 -175897 -22933 -232749 -192755 -21250 211174 -32355 32887
19506 -63259 18641 -80603 -259171 -23521 331711 175087 -409909 4899 108358 -46347 -106854
19495 -106854 6328 -68695 89404 45755 -318171 29816 -96605 28169 -109587 4073 -150781
19483 -52191 179399 -409440 35181 -253817 -28391 -346405 -127079 -66599 36540 29504 -223035
19471 172688 93788 -317297 264950 -15684 28217 -181409 -78872 149391 43592 -206920
19460 -124234 -375593 12181 -205840 -361253 -1857 -116247 -57073 -102535 -395267 -62272 -173899
19449 -173899 -73882 -89705 184555 -303596 122271 42614 -91823 -219952 -102333 13707
19438 -192648 -54780 -65755 -77466 229590 -144301 24550 -28668 -8329 -54382 -45181 -45493 -196697
19426 -196697 -8961 108453 -296887 -56101 -46271 80182 -132578 63512 -162313 451646 121768
19414 -38235 -186504 449981 -119006 210822 -10847 -220047 -321924 -33790 -358999 -86074
19403 2311 -408662 -159769 -327941 -23733 -33325 -227877 -102278 -8316 -96641 -178566 -130702
19392 -130702 -126077 -5500 82669 143213 -83919 -60222 -127575 -166461 -64126 -228893 -93886 142671
19379 -80513 59866 40089 -228730 -120991 25609 -173605 185563 -344243 -56105 55627 -104536
19367 -29896 192007 -142806 -276916 -533444 -104201 -210000 147674 -110949 137675 72545
19357 72545 -199859 -46546 15042 -135104 -257955 -160436 -39329 -24889 68180 7947 -273080
19345 -193776 119127 -228921 -73404 -19072 93838 -192027 5575 173856 -94161 -139066 -358596
19334 -358596 -144387 12441 61109 -32896 -221805 -245541 -275161 74188 -196364 -101824 -105237
19323 -105237 228788 -269207 -108347 3889 -124173 234846 -235169 72666 -236564 33517
19312 -109614 229491 -197541 -82250 -235017 104903 -13175 -56482 -89667 -346399 59431
19301 11749 -165501 -19318 -42085 86783 49019 -259211 -165528 -255941 6625 34625 -124602
19289 -424440 -32856 -316851 -114462 -7666 76431 248321 -55794 -41015 177807 -221558 -282065
19278 -282065 -5672 -173911 -177296 68268 -118171 34485 -206961 -96220 -215533 96865 18086
19266 -134114 -203938 -351072 148017 -159025 23061 -208898 -69353 -39212 -20069 -141063
19256 -141063 113528 109507 43674 152895 -135841 -181950 344762 -89942 -166559 -129916 -98511
19245 -98511 -13169 -40390 22890 119421 20361 57119 -51222 58877 120648 -210930 208516
19233 -76839 136276 -291439 95749 104234 128977 -254555 -77573 21409 -7227 -108530 1879
19221 169048 16853 -17746 358056 -91776 177530 130199 -320155 -409356 -172322 -75471 -130105
19210 -130105 160973 -66239 14641 -246050 61152 -202014 -50651 -594166 -27238 -272921
19200 -272921 -123724 128926 627 -177679 -10916 -336000 215191 168810 -158085 14758 -155836
19188 -196698 -29255 -371687 -61698 204618 -87650 21554 -46606 -173235 -225816 -211215 177388
19176 -76648 130173 -82044 245899 87776 -134987 60740 -115922 -249941 -89776 -145590 -112487
19165 -112487 -92284 39017 -214049 111469 -42950 146467 -91600 -114315 -78986 91936 129394
19154 129394 -327243 -307976 141136 -250011 -12193 -246146 -36131 209601 -185858 -153825
19144 -153825 -40207 136703 138632 77959 -299844 -299705 -139032 125160 -70731 150224 -393049
19132 18630 -214478 -27479 -387547 64223 -324794 -102231 -61357 274332 235227 -164672
19121 31087 -36933 244095 140343 70558 -13106 -1493 -208853 9618 38209 -259419 -75079
19109 -30227 -229110 181378 -86327 -79945 -22038 -224772 23480 121908 15794 -445444 189281
19097 48119 -37089 -123611 -71706 -286246 -97885 51965 -152608 -135911 24486 -209425 271368
19085 -35289 36931 -338110 173652 -53963 415595 172422 107435 24315 -68436 3365 101358
19074 101358 195877 186074 -138639 52807 -306971 79211 -136906 -9958 -10173 193387 17258
19062 -216673 76810 -29356 72135 19244 88433 -106551 -45081 -76591 -210789 -280683 364053
19050 -112191 -371681 -55026 183024 -222775 -101485 36490 366249 12747 -128897 141074
19039 -307668 99469 145900 -203978 192473 -74007 63597 51 -306421 28916 -232524 -452283
19028 -452283 57406 329257 -70288 27055 77089 -37152 122881 -23550 -149780 240872 -50061
19016 137925 -181113 49317 -157952 -139775 175450 -137177 15471 143335 -180970 -11117
19005 -175767 101275 18883 -11514 -181117 128030 -20765 96636 -202084 -95192 -402266
18995 -402266 51510 -236103 -103158 -77897 -89537 147366 -98537 -22526 41806 -149968 193134
18983 120044 8974 164565 9845 -152796 -122147 -30158 77074 381726 235497 246139 87244
18971 -17658 -89945 -101541 -302459 148778 200705 -30121 -373706 -76019 -172817 -97128 -135149
18960 -135149 -65729 -35783 -18113 3428 -52105 97784 -243288 -158096 -10053 62240 -309628
18948 -287412 -15596 23777 -85350 -191900 -417717 280972 98109 -177187 -159341 -15881 -70914
18937 -70914 218069 -200331 59460 -281296 22173 -193047 76668 -134176 -220441 -99925 -111547
18926 -111547 -299513 145766 -20023 22513 68239 -90717 5134 -220917 53256 -144436 -61130
18914 149134 43765 160469 245739 230030 197164 -367 -22628 80193 -148712 34332 -281212
18902 -64461 36840 -153928 290613 1306 -184258 123016 -41604 -124731 99669 307942 -142625
18890 -45724 -530425 -87939 -275676 54149 23494 -220862 23843 238326 -170508 -123519 128859
18878 -10450 -111841 100621 -279760 -36056 -102902 -51990 82806 80124 -284157 -91735 48709
18866 -10861 -2938 72563 -334921 4041 83284 -121273 -63745 -307459 28006 -289390 -161762
18855 -161762 -102757 -7404 35395 -134644 -706 -136325 13117 -139081 3048 -195907 281347
18843 -105583 -273942 -2627 -20778 208345 -121972 -37409 -51281 507 -34881 71297 -128028
18831 -189012 -96877 4510 -451608 22343 -89860 -67199 103406 203314 31853 165909 189412
18820 189412 -98347 -304003 51076 176439 295051 3796 212737 237185 15784 -98550 -1320
18808 80831 -120337 -386724 169973 -314628 -147012 139854 -52001 414220 -206210 -295484
18798 -295484 164059 -43463 89028 -389474 223430 -253113 -189387 -68611 -18052 -94264 152767
18786 201230 119174 25595 267850 177744 112164 -380362 24522 171565 128113 135568 133364
18775 133364 -158567 19879 73563 245878 -42452 173603 164258 175741 -147981 -162930 25697
18763 238303 173125 -282752 -22233 -495986 45744 72572 15058 -31424 248624 29924 -119511
18751 -384695 122115 232141 -122185 -227428 -156046 -146923 96290 -73736 178053 -254834
18740 358571 52793 41692 -156814 243462 -46114 280338 -56985 -35167 -71813 -16169 -146660
18729 -146660 -194540 -396454 -243425 -109437 56872 -39772 64166 -231849 65295 -106445
18718 88239 292745 -242412 -48777 -18066 363790 -122957 47995 -130727 215255 92193
18707 -271013 -13710 -69074 -187036 34345 -12652 50353 -167022 83417 -86589 -95123 -63215
18696 -63215 283144 -81901 -83361 103442 -148191 34804 -38687 -164618 -72161 -150270 -217794
18685 -217794 -28662 32406 -255440 -128641 67572 -67579 -15794 -428075 -122177 -112967 -54707
18673 65489 -224296 12542 -179031 248748 349647 251270 273227 -21801 133427 -120874
18662 -141435 -91654 -64515 89229 -196440 -17571 -200639 14383 -83491 63622 -304400 -56627
18650 -14325 -78187 -182059 125514 -323256 -379999 -225774 73157 19034 -185396 -139124 -59854
18638 -192861 -84345 -264344 -196969 -68702 -405306 152651 99507 55219 104784 -255369 -424026
18627 -424026 284327 -300939 228722 -90415 104050 1699 63902 43812 68665 -123725 326859
18615 -134200 -94844 221128 101642 -199233 -78383 78339 -75460 -277796 -35179 -38385 -69307
18604 -69307 69878 -205593 -118825 143792 -287450 -135288 -187514 224541 -210431 -250915
18594 -250915 -157829 -156225 -4171 308616 78426 111822 92034 -46275 -363435 445022 95428
18582 -100077 -126569 216288 160805 117541 -231491 -156887 264773 48747 -403195 -32005 73912
18570 -140122 91940 125367 -429593 -136586 -45121 16323 -104738 -142814 -113356 -142510 60416
18558 -4798 -67759 -359837 550 9411 -36238 4314 -178757 59083 145405 86920 -183938 -78832
18545 93584 -127267 -259176 -76166 -51327 -350021 -64668 226727 -11235 -12063 175582 -119475
18533 -244918 194982 -386569 -401725 -69562 135689 -30374 20457 151497 -214110 109582
18522 -52905 -166655 -140662 -319644 82709 -114515 50173 242269 -134786 113592 -41892
18511 -102499 3010 -124048 46263 118788 62840 -200280 -160565 203892 36502 -152876 48025
18499 -37654 84075 31483 -31418 42033 -471863 -118637 140553 329694 -51106 129420 -73331
18487 -102973 -117808 -63425 69491 -338706 -36709 -207273 84892 67488 -193609 -30360 -52459
18476 -52459 -252264 -79339 -327624 -57078 -50757 -326751 198138 -65742 -55758 44109 59032
18465 59032 35710 -135641 188181 368362 -63732 -151811 35885 -81473 228392 -101775 2691
18453 -223709 -33870 -250736 52477 54335 -290085 -205994 24174 95311 28177 -87233 -235118
18442 -235118 65839 -174669 -79668 -234052 -18732 271401 125081 169680 -84216 -212541
18432 -212541 -201036 33500 -71616 -479239 -304008 119309 52935 185631 33999 -11141 -110215
18421 -110215 175205 50337 -31701 -102910 -23231 85435 42491 87549 37139 6292 40186
18410 40186 86031 -60570 -263463 -152832 102509 -113079 -123103 -11726 31932 -151947 -144844
18399 -144844 -89200 47890 -90816 292601 -82455 -310058 37712 95057 -46580 38526 -166408
18387 -171340 -161663 159298 -192954 422662 50289 -25878 365782 -175887 83820 -33555 116136
18375 23117 284815 -144956 143676 196686 -133788 27252 84381 -122937 -12148 43414 -86221
18363 112381 90789 -16618 61192 122675 -89928 42278 68449 124094 -3164 363632 22560
18351 -121494 181691 -181325 -216366 -83755 19339 -72362 -32177 98701 354123 -129685 101314
18339 -87669 -36658 130933 -892 -35487 25501 -10228 -111794 80523 -511065 -65324 -33507
18328 -33507 -248773 -17000 16873 -188779 235757 -64935 -321027 -114734 -306968 -140271
18317 -2819 -303452 -393395 -206426 -109669 -56646 -34579 -125066 256612 14627 -358496 198960
18305 -185651 109707 137337 245698 -297928 -139998 -177246 102673 -196819 -129112 -9239
18294 289743 -405936 65141 -111528 68766 68061 -2600 -109760 -200137 51945 -286766 103485
18282 49213 135067 40759 188490 -342386 62068 18058 17270 -85881 -66352 99090 328711
18271 328711 29716 -105729 15523 131604 -134756 219317 -56417 85528 -302217 9610 -208327
18259 -303970 -21857 -261650 67096 56408 -362157 -197210 67733 22260 20255 12238 292764
18248 292764 -86695 -251717 -130665 -136120 5128 81186 -86356 214443 1180 -14012 -43798
18237 -43798 162380 -15235 -210603 -20902 -26363 -81677 -58525 146202 -79971 -34558 195897
18225 -110547 40250 -49807 -7539 195847 -65672 72733 74100 -259011 222012 -179153 -40321
18213 -74852 -173423 -217518 -182671 429489 226419 187370 135387 -250876 -123651 32534 70495
18202 70495 204 -202002 -46853 100377 18898 7734 -261864 258478 193374 -64296 163452
18190 -29852 -12302 17535 394997 -27406 15782 3947 -171742 -273111 -126064 -155999 -30657
18178 -35313 -84309 -169495 -108507 -90948 -27758 -328749 44557 124216 4509 272431 81136
18166 -39022 48842 -41498 171690 -264280 -2297 -245176 20334 197928 -19862 -110695 -30601
18154 214658 -35638 -131450 230007 204753 63986 -41314 -166959 108237 -187987 -119052 499482
18142 -286253 130607 67076 -308274 -106482 -80064 82235 2001 15255 156815 -139941 167296
18130 -292388 -44534 -75641 -359121 -67431 -20841 -96438 102815 -329091 -12559 -20341 40500
18118 -11329 -235572 -242938 -162569 -102229 -70620 28300 -41089 245621 47130 307318 -63410
18106 -269537 90301 263451 -115056 -11936 48840 63684 -126323 -83941 -20873 161819 -245326
18094 -397523 -41087 -282260 -15833 122700 21763 180431 91706 -191325 230834 -81166
18083 180071 266760 274351 117983 139400 145992 106651 -100631 -211709 -115950 27336 -105743
18071 308423 -57883 -83175 -184159 -1091 213900 -312143 118346 -169976 -168527 -35507 -59684
18060 -59684 -357118 -4273 -247360 -370877 198561 -205986 199020 44766 379288 -292711
18049 -28222 -27653 48813 -157525 -399094 175220 -93989 -180628 -148101 85034 -57756 17844
18037 5428 92024 1378 36338 -1371 53308 55554 -84007 -122609 243890 -167521 -157491 177507
18024 -228712 -73558 -238564 -65991 56161 -131351 -4464 -249220 -2149 86949 -108525 -8252
18012 17700 145558 46810 150818 -165808 -135089 -106097 8220 75188 -32184 96742 77457
18001 77457 192654 39289 -22672 102776 217277 98601 109776 -168573 115773 138260 93168
17990 93168 -23636 -40830 -174651 -140466 -183007 3983 166442 -31694 193245 198392 9066 38489
17978 38489 49034 -36808 -30506 278900 -102946 92545 -66591 -77876 -17148 -265885 -52586
17966 147790 -34911 240170 14549 -93762 -63618 255190 -100756 -191566 -7651 -100414 191846
17954 135963 -230774 -7489 210008 99583 111818 152253 7910 -294803 113392 -281202 55748
17942 -102189 112281 80599 13332 -301304 -111954 -133873 244137 -38348 -70742 -64012 -79363
17931 -79363 -180915 74577 95672 1945 77212 -65532 168830 45868 93777 -224981 -202205
17920 -202205 -156728 -97294 -58473 174954 122245 -93881 178422 -109593 117334 65740 -2182
17908 -10313 129033 83221 -221371 -156652 -124301 -201783 68217 68638 58051 176525 85661
17896 128624 -35759 120075 -175601 23105 272162 -484340 25361 311230 -24515 301237
17885 190726 226845 -17190 67307 -31591 330426 121207 117719 18807 74150 -154096 -1843
17873 -102925 -83158 -22158 20144 84555 -14527 113004 33964 61652 155773 -350174 -82597
17861 157816 -10002 -31688 35277 117143 5218 -70189 -197611 24436 -95758 -168103 -133112
17850 -133112 -187914 81524 -26816 235086 25251 -61540 409795 287450 -93378 37367 189419
17839 189419 249863 384588 -75469 66817 80389 224217 39005 180993 50550 111266 252320
17828 252320 70364 85857 169672 -66018 -144356 72807 -62303 -172141 -224708 220339 -167472
17816 148238 -61283 -38507 -265664 15029 324182 100675 263094 222375 103169 429415
17806 429415 -119977 -213495 -286275 205581 290020 -162214 58035 -214164 270228 230032
17796 230032 180700 -55857 429442 129833 -377533 -164418 214727 -26796 108801 35463
17785 258876 67220 268465 -42482 178046 29504 -35493 344597 43670 -99686 4189 -35904
17773 -127172 89385 12570 58453 190939 -92834 82733 185420 -340739 115727 -27744 151221
17761 303385 371117 196644 -27578 -238471 300861 331891 164749 -21419 14667 135280
17751 135280 -126660 -129963 126903 -220840 70681 -95714 -139143 186343 236180 41190 215553
17740 215553 -58971 -116244 -43050 103674 51403 61960 224295 283348 234339 74304 -172745
17728 37496 -188700 80159 -265429 167548 20379 183459 30892 182637 363150 360293 -196402
17716 -5380 365275 278172 47285 -68923 -119512 113675 62149 369431 -72922 58942 -106079
17704 270792 190552 164579 57577 -191078 35144 226515 88979 -30412 -42742 194351 9267
17692 -5553 -29442 112735 46963 189363 28086 5531 -102351 -112282 -182215 -284387 107365
17680 -9378 323405 -293840 7531 -10012 108698 -203015 -153138 104314 -200018 41803 -16081
17668 -104496 55794 53872 108192 107978 -107502 -113498 -53492 217950 109154 -80235 115356
17656 132466 86588 -51892 -227624 41574 -15420 -15766 -100420 26033 54487 406151 -123995
17644 92577 242102 118982 63934 18308 -14750 112384 157994 -312100 63343 -108863 241712
17632 381012 337395 204118 483069 -48272 -87836 -16936 29675 -36442 12848 285848 -301710
17620 176752 133700 98810 -39880 177920 -216908 135024 175159 9193 212684 351593 331794
17609 331794 -67062 365593 265803 209145 -20020 -605 -14353 115561 -193483 265434 167802
17598 167802 -67355 120837 -146193 328345 107422 307092 253943 168393 108911 393646
17588 393646 213621 -85470 113733 -23631 -4822 3185 320331 -256544 113402 121648 44704
17576 -42432 118634 480034 194714 181259 24270 -38907 -209471 106642 186464 -201743
17565 19342 172908 -62483 237617 385372 91200 -35207 -76853 -25781 350548 457795 64659
17553 93011 -97220 333836 -20145 197972 -109143 162074 192033 278301 233350 71254 -15744
17541 242407 -39234 193774 351424 -2524 259136 433420 274069 -78683 -214892 110784
17530 -287145 -149302 130973 246839 549138 358798 267233 395363 312758 262845 681923
17520 681923 331564 293971 174566 409575 283773 -159576 165115 76470 272986 340326
17510 340326 -204313 457257 355601 569263 488171 465238 398510 489604 59431 191020
17500 191020 334485 158300 322445 125715 178756 226292 22265 293368 -143632 239862
17489 -78882 235448 105514 84487 297493 111259 99619 144149 235263 184186 164282 126295
17478 126295 193827 -66879 201971 -43117 -34254 241381 421370 358983 206818 -24532 365804
17466 230008 309251 346204 71354 -70957 266413 489450 166293 -236155 223409 224556 7485
17454 40681 100108 195567 329182 2956 77483 284543 238094 350392 87136 302134 312094
17443 312094 229316 253605 518214 223063 316324 282543 217309 357481 284210 -75881 100377
17431 366765 215869 -102560 355425 -134561 128846 -158171 -12362 -269845 141166 95780
17421 95780 528651 368926 344559 189709 270349 9753 326505 -39516 145748 129459 237211
17410 237211 215655 -51050 10248 121731 176969 123615 76051 135602 -100872 344822 174957
17399 174957 146957 111352 378235 68588 148580 -12331 1801 338178 17489 348613 63365
17387 181712 -38348 -134615 90431 88298 80587 87344 282896 65739 -141787 192004 295063
17376 295063 65235 296390 153046 102982 482781 230007 -67707 59922 276212 328621
17366 328621 159173 28269 193128 -59010 282002 173195 416984 183026 140262 50091
17355 -65063 58940 31629 204413 168294 28847 292255 -5171 49674 160862 -114638 262546
17343 232586 224090 51982 267342 -473478 194202 145008 70072 221114 -115211 37532 36329
17332 36329 -31615 119074 327122 344616 -218304 -6946 229517 61103 248519 365597 301808
17321 301808 324408 574784 117769 -90125 333581 86591 123223 -83356 171853 -39579 407682
17309 92409 3716 -14143 97548 -144455 15829 358833 -33734 198300 12931 443423 90174
17297 214507 160850 -174519 -145342 6795 241583 -4610 213832 153007 241816 -107162 379371
17285 210915 20654 128536 100762 212597 -42915 225072 468339 251556 254865 174520 308790
17274 308790 238239 190638 15200 126280 -33584 185276 207091 366962 331970 352006 144551
17262 160247 352369 66410 -25860 41661 472457 280521 87097 -110068 479970 336089
17252 336089 328184 240654 195167 393142 -90379 589252 91037 445290 264533 292509 375441
17241 375441 628796 302640 254498 -44468 414168 493792 80863 387536 295040 197583 561932
17230 561932 -22703 383726 -5765 263975 297785 348301 -58523 221766 143753 148154 283349
17219 283349 159987 46261 280180 229414 133490 297614 410166 424798 69350 -83060 -22800
17207 321955 189732 432427 277301 48665 389582 541229 170564 1103 459057 221907
17196 67722 35795 437236 119476 316100 351238 341252 189140 213525 226683 344715 187041
17185 187041 361141 322421 103778 227752 169871 237983 498124 361387 216485 434321
17175 434321 288147 519594 50194 581711 460051 549093 340382 233246 483536 258353
17165 258353 449671 371519 579571 545425 435561 595387 198989 190033 262761 363052
17155 363052 235724 272093 184529 257423 431741 331775 372469 531457 427857 47201 627475
17144 627475 285839 450032 224052 260841 396489 451180 291631 608975 323352 57193
17133 335825 418613 -81528 402731 408607 531090 409895 283758 360626 546612 536502 342664
17122 342664 428911 551839 304881 518596 695022 412068 371147 545744 694650 274516
17111 610718 254288 276605 611206 456139 413917 337737 593709 408027 415026 465443 280311
17100 280311 467313 604838 407876 681835 348618 459703 395352 802538 286686 402171
17090 402171 634306 544957 158495 542261 494443 169600 498851 619342 720709 389534
17080 389534 398682 371588 677203 509778 388494 639342 367619 424625 590449 690163
17070 690163 737363 476390 354233 389249 515601 772254 682012 453633 293681 439036
17060 439036 277604 497602 541481 544934 787178 480594 893470 505721 855159 713566
17050 713566 405599 480927 522011 619884 1004794 562577 783909 569155 891464 337065
17039 424679 679785 790241 788907 464244 387348 815287 705606 782832 533967 736306
17029 736306 694847 270988 827045 535426 932747 339114 1082764 759343 1034426 592414
17019 592414 632516 472686 1012079 677148 855934 788170 857991 705581 476945 555463
17009 555463 757037 1013079 824093 612128 762448 761302 985913 929388 797159 835858
16999 835858 811959 1069600 706944 971607 1108008 1031636 834347 902142 805120 922204
16989 922204 617711 1314351 965611 807893 1484149 858605 1005291 775101 913351 780676
16979 780676 1029906 682475 1211295 1090187 753804 1241999 1021876 951054 1304830 949549
16969 949549 1177511 887823 1072682 978371 1182056 1275347 1333464 1393790 1229228 1097371
16959 1097371 1316566 1153303 1415168 1223252 1264788 1280438 1552069 1570622 1589180 1394511
16949 1394511 1424869 1083062 1674936 1432688 1576001 1542700 1605420 1145133 1606714 1749769
16939 1749769 1543514 1254643 1829547 1585345 1467404 1522611 1493948 1745556 1903403 1649616
16929 1649616 1896849 1749381 1659289 1846231 1526201 1919746 1934648 1691778 1841587 1810651
16919 1810651 2005313 1949845 1881859 2093142 2224980 1940651 1872052 2005432 2051019 1771627
16909 1771627 2228854 1927618 1736635 2261430 2138602 2213252 2235883 2373606 2337708 2163664
16899 2163664 2627165 2712788 2706995 2826563 2421683 2415273 2645835 2276261 2648735 2729866
16889 2729866 2838714 2744637 2753262 3047671 2898569 2872014 3074854 3201529 2977228 3461507
16879 3461507 3221948 3231223 3036071 3384737 3642350 3674475 3310705 3683951 3470181 3750717
16869 3750717 3782967 3645673 3580947 3746334 4057896 4037280 4266122 4077231 4483806 4168732
16859 4168732 4671469 4452067 4595087 4559731 4759769 5318192 5062715 4943921 5067493 5430455
16849 5430455 5356584 5225096 5263416 5374174 5556649 6092518 6081967 6134344 6181801 6337295
16839 6337295 6771001 6949972 6696973 6923922 6828511 7105052 7208563 7565618 7728584 7895744
16829 7895744 8025363 8049190 8411295 8575088 8630663 8887546 8988303 9474790 9379312 9680765
16819 9680765 10196491 10194048 10363332 10667459 11001953 11360499 11868190 11859117 12471260 12283229
16809 12283229 12595520 13190570 13642391 13685923 14327430 14957078 15021979 15843453 16088850 16505058
16799 16505058 16906733 17633021 18136263 18485950 18686772 19530139 20208397 20783471 21375789
16790 21375789 22186185 22979279 23517035 24493627 25342205 25951481 26894913 27848978 29142970
16781 29142970 29583496 30929963 32095234 32969555 34155999 35528913 36771411 38130954
16773 38130954 39180983 40858024 42408913 44079393 45644239 47595116 49399449 50853590
16765 50853590 53168333 54880204 56864696 59208833 61286721 63416415 65587059 67764283
16757 67764283 70654668 72915226 75238030 77717465 80107605 82812828 85401092 87488700
16749 87488700 89593776 92347529 94390947 96373941 97800485 99648402 101492272 102368078
16741 102368078 103377850 104243964 104956111 105108138 104920807 104681993 104294210 103572312 102614064
16732 102614064 101519665 99813737 98395707 96289476 94538360 92641199 90616839 88296330
16724 88296330 86151403 83801532 81296641 79219380 76679431 74536940 71917289 69423035
16716 69423035 67399648 65363575 63167140 60738657 58853218 56989222 54834268 53098773
16708 53098773 51586174 49582124 47758293 46295573 45188227 43425355 41872071 40207412
16700 40207412 39258710 37719614 36819186 35431825 34343422 33278771 32099877 31231228
16692 31231228 30244360 29438335 28309661 27763036 26679043 26050582 25413444 24877724 24017725
16683 24017725 23254284 22584378 21911318 21515169 20900019 20194921 19682884 19092798 18594378
16674 18594378 18190724 17665706 17663735 17060983 16799381 15893515 15467079 15581654 15180970 14704226
16664 14704226 14331809 14241572 13596046 13367662 13191083 12801029 12488921 12140793 11980290
16655 11980290 12150452 11391888 11490242 11147028 10821057 10646695 10646947 10507391 10210210 9818098
16645 9818098 9946245 9480713 9201190 9181260 9026000 8741637 8518055 8430792 8597714 8009025
16635 8009025 8042626 7906494 7879086 7608730 7547795 7443936 7325287 7383099 7209828 6865722
16625 6865722 6727060 6761866 6759251 6459971 6444991 6097279 5956107 6244860 5952312 6038429
16615 6038429 6187895 5945510 5591756 5596628 5714310 5269502 5473846 5239843 5225027 5195782
16605 5195782 5191730 5153823 5101001 4860977 4613481 5206443 4754860 4467351 4924502 4722331
16595 4722331 4494809 4396510 4202427 4416966 4473680 4313932 4103660 4515524 4280804 4395468
16585 4395468 4046518 4094619 3898623 4191105 4141177 3762172 3874175 3473597 3743611 3799937
16575 3799937 3532200 3752836 3619873 3508905 3470417 3513563 3508722 3550061 3409074 3543627
16565 3543627 3134514 3132084 3056274 3007609 3391609 3081429 2878215 3443294 2995350 3142385
16555 3142385 3064683 2905617 2998286 3049516 2785375 2824216 2732399 2645529 2716154 2766534 3072674
16544 3072674 2911365 2807298 2630510 2766449 2612891 2551148 2692835 2873800 2897275 2372724
16534 2372724 2932815 2352261 2558228 2796993 2483423 2279984 2269480 2421672 2388157 2438123
16524 2438123 2632389 2566002 2328642 2455721 2401050 2134919 2443378 2437453 2030324 2232106
16514 2232106 2241987 2201582 2140133 2261057 2473337 1861580 2087993 2203784 2214065 2370551
16504 2370551 2193760 1899537 2208089 2270695 2042396 2186238 2295945 2168503 1806549 2074623
16494 2074623 2017804 1942091 2219456 1995911 2049904 2010304 2040571 1886540 1816506 1835952 1917461
16483 1917461 1632190 1826394 1973724 1873084 1956659 1687757 2151375 1614675 1691003 1944374
16473 1944374 1692285 1949028 1920895 1703710 1772725 1743098 1454195 1690173 1746907 1972587
16463 1972587 1730982 1760725 1825026 1995074 2355642 1855913 1773156 1872384 1795666 1786123 1911720
16452 1911720 2126445 1664376 1892654 1714727 1572968 1757783 1826004 1793653 1782721 1847539
16442 1847539 1817114 1886230 2024134 1763732 1719537 1411009 1978203 1964534 1826216 1527114
16432 1527114 1911205 1479431 1685273 1650730 1755987 1855674 1443901 1829290 1666030 1845634
16422 1845634 1602067 1604274 1674419 1607490 1588047 1572763 1448623 1593024 1650249 1864950 1950881
16411 1950881 1679817 1688146 1765249 1524466 1785166 1844720 1594297 1736301 1639091 1635433 1334485
16400 1334485 1592429 1523849 1572931 1841562 1569604 1779353 1737830 1848574 1478383 1718864
16390 1718864 1599970 1686425 1551224 1884618 1667961 1665801 1431101 1597254 1783421 1560511
16380 1560511 1718460 1583045 1613240 1565108 1593025 1739961 1379764 1647502 1740083 1377147
16370 1377147 1604438 1549410 1815266 1338701 1427703 1475306 1738637 1582997 1583930 1600078 1659846
16359 1659846 1769194 1690860 1712373 1402272 1406498 1766911 1815729 1642284 1707852 1518921
16349 1518921 1540043 1747268 1704178 1597210 1803561 1513668 1463725 1813848 1708138 1646510
16339 1646510 1661618 1526436 1520334 1422561 1591724 1780993 1700663 1710336 1518142 1289812 1846181
16328 1846181 1690999 1512536 1841371 1436022 1596563 1675428 1365087 1498589 1846088 1294058
16318 1294058 1660338 1243442 1409750 1404613 1657790 1588209 1473584 1784352 1553953 1338755
16308 1338755 1315330 1549911 1503036 1294735 1603816 1293109 1538457 1568218 1398920 1548859
16298 1548859 1512785 1470967 1424946 1548811 1507461 1481567 1282549 1462688 1272081 1665233
16288 1665233 1263614 1605887 1429296 1235389 1605904 1671142 1393900 1590397 1336053 1667722
16278 1667722 1902406 1375763 1588694 1507026 1080700 1539053 1416812 1274075 1299252 1474489
16268 1474489 1534882 1371742 1316715 1242224 1334872 1749309 1208341 1325560 1558496 1056948
16258 1056948 1399564 1225882 1166402 1280840 1375525 1349827 1379337 1296361 1318455 1344661 1030866
16247 1030866 1375184 1103721 1087919 1206318 1309303 1256050 1544248 1446855 1067938 1235812
16237 1235812 1282685 1298105 1442400 1251545 1389608 1118384 1009797 1097650 1188015 1011011
16227 1011011 1428092 1455813 1053121 1371379 1285792 931122 1198406 1090535 1223924 1326063
16217 1326063 751579 1238719 868772 1247791 1185332 1172344 1002051 1097493 862080 1152285
16207 1152285 1074835 1066839 1325627 776834 1218949 1142017 979345 939000 1224616 1115051
16197 1115051 780220 800328 972619 983259 837904 827952 1112586 972985 755981 1025095
16187 1025095 1023652 1125858 948876 585182 735096 922260 1022412 590477 804538 721337
16177 721337 953623 1007990 937145 890764 925334 686427 420685 946115 787863 769842
16167 769842 795992 714334 970017 804287 897183 854360 848948 360737 793387 828307 986275
16156 986275 1010617 648868 963713 605378 495092 665794 748519 494818 574065 566763
16146 566763 649957 442394 606704 618060 639490 723401 560478 530080 653375 444078
16136 444078 482087 1129185 720591 618956 177119 727897 491778 551802 563664 243877
16125 134023 496693 448484 480770 484142 332431 559984 316995 428204 547932 519926
16115 519926 264236 288546 731892 562733 639353 122121 220336 231617 381298 112 497861
16104 497861 389294 401608 169258 509482 234789 751789 560432 464196 220568 252689
16094 252689 395725 368189 160034 283302 187837 470288 223145 589448 277331 306860
16084 306860 342402 371045 454697 434295 675583 208435 278722 310825 380982 402755 426490
16073 426490 371497 172474 245492 248443 71093 216068 274266 331048 177723 430027 128502
16061 434408 313176 110079 548015 264568 349830 364678 294723 410968 77012 256589
16051 256589 338029 518930 -47310 134503 172469 248209 17142 465236 231755 45580 417154
16040 417154 139462 210850 498874 179591 -55563 -36244 22436 -41869 228162 402010
16030 402010 -54062 379022 118425 105381 173281 508872 87093 177407 -79444 180422 141935
16019 141935 272012 222619 87304 36030 182101 153992 433435 157663 236340 209309 -108106
16007 58748 -90468 198397 39453 -86486 150787 203895 72252 151902 310845 253364 180888
15996 180888 245363 -154956 84381 -63726 150476 45794 177156 71259 447499 512054 851493
15985 851493 955221 256045 436005 16612 146842 203794 277498 48818 126237 51646 96553
15974 96553 344526 265568 32051 431220 -91963 -9833 172195 125157 257344 247849 -21327
15962 72011 112148 282740 84040 105443 192858 -182578 86516 171188 -11644 158090 135525
15951 135525 -45331 -274793 -332966 169348 81794 105424 -109521 -140080 232064 254708 111791
15939 -272134 118971 -148212 -22927 -9261 -80504 21769 -108921 -235723 64162 -77431 47062
15927 -27551 184192 -167374 366360 -45456 316447 105007 -42651 67139 -173827 -92379
15917 -92379 -141914 247783 -156667 -56664 60556 51647 280392 22505 28175 31566 -42589 193855
15904 138961 -146551 282241 -25421 133536 -149262 19984 284656 -285129 -4114 209275
15893 -118686 45115 311134 89367 209468 -25118 -1883 39708 144662 -95481 -223938 10303
15881 119660 9367 180299 20462 -120547 -38466 -199916 -292717 -5504 151200 157550 -102825
15869 -157536 52795 -125323 86097 232063 -102228 97897 -127268 349235 -187129 71211
15858 -121903 -51121 201630 -102 55978 120022 -175610 355923 -8515 -321937 -107751 -152086
15847 -152086 -105123 53738 2110 -102417 89276 -276676 -150627 -28503 -295 55256 -199822
15835 22719 -369705 155100 26171 -103787 317710 -54394 134634 -52897 -77758 -144209 357812
15823 -35976 -10020 -270460 -135931 37872 48747 114635 32302 90525 -59672 -193797 -214914
15812 -214914 139002 -130448 79946 14040 59860 -200692 287156 -42813 -291059 -167940
15802 -167940 112807 273585 302142 -292814 -302327 -172364 165852 -242079 33131 -56077
15791 83946 204115 -172841 -190384 95525 37610 310024 -85402 -518292 127376 -21408 -9905
15779 -350686 -26661 25086 -6599 127952 17699 -387286 -63443 33231 -70990 23887 -10852
15767 -185229 -169950 -193643 66737 366436 156631 -545778 341734 209282 92911 127367
15757 127367 -106093 -61774 -56411 173485 -253642 422677 -31002 116623 48490 271862
15747 271862 -48303 -46655 -184828 -121254 213352 -188949 -122547 -158641 84776 -52078 173460
15735 65902 -223888 104594 184840 -27402 87283 -59256 147344 11650 -250565 84595 -117378
15723 37566 -148783 37506 -103903 102433 -61143 11658 -18966 88388 262347 12969 -244192
15711 139295 -129794 199892 -136572 74436 89719 254343 -81134 -367553 53107 -130115
15700 -64240 -305783 -48725 -171706 312884 458904 -2729 203504 214452 50014 622 27834
15689 27834 34582 -151891 297719 -80612 -364706 -309231 -178919 108809 -140945 -172631 -240472
15678 -240472 -172131 -45234 186487 -68318 52672 -161454 -252987 77238 -107265 -158759 53636
15666 -135663 149721 91404 123715 -153418 -105853 27742 -68006 283403 197433 -157441 139794
15654 -175926 -412128 160610 4631 -264670 -168917 -203789 309172 157243 -105483 267326
15643 -91630 -191058 10730 262385 -51025 -141202 -194740 -265516 104816 48671 80893 37417
15631 2703 -391197 156275 -166416 -47049 232878 262756 247597 -193472 10976 -319987 -342499
15620 -342499 61611 -142919 68971 -352618 -43167 407847 -200497 257719 233204 53072
15609 184052 -24362 -134757 -219394 -378320 -254760 -99855 63777 -54334 -68584 -113502 -115807
15598 -115807 -252880 178271 50656 -244235 -39665 168323 238311 -409333 -53719 42568
15587 -110449 -219630 -96742 114323 -69687 175297 -223801 -90617 149876 -162816 -23121
15576 157008 32697 -51786 -168217 240530 90102 7917 80540 -156232 -26862 10349 57375
15565 57375 -151233 74451 -74120 -253573 -57712 -6296 -62808 158225 -126362 94781 71173
15554 71173 192482 -30888 40473 -26685 -76107 -162041 245364 -832 -6554 -189921 143245
15542 38976 198246 14300 196714 -190640 -176826 292810 135755 -224125 -321680 37005
15531 -206188 -174810 -41501 -12240 -31805 125403 139869 -44733 -205151 -214714 202877 55086
15519 -384547 141159 -322352 -57573 137625 116285 38866 9481 -358020 -233581 -60306 170565
15507 -14034 227135 -43875 -158211 -131667 -100407 178478 -90658 -2244 -248881 291292 -183428
15495 31866 168685 54909 -126901 -217968 -113726 -253901 -41597 111711 7763 -66372 -109969
15484 -109969 143285 -53574 46719 99044 -73127 309974 -190671 -120184 90068 171733 274453
15473 274453 162253 13501 72470 -292582 125955 -82608 60385 -8344 88101 60733 147478
15462 147478 38152 -225240 65563 87347 -202697 53820 -10609 -33032 268283 41464 232310
15451 232310 158042 -49616 -288686 85940 -9860 -42074 18443 68785 306000 19150 398698
15440 398698 179942 178609 151799 93389 168666 -58870 352817 473043 -30310 81341 -55086
15428 28369 487353 134829 -100071 -85303 -132970 38406 -2704 57511 124673 21841 -42664
15416 23517 -171507 233542 -75195 30305 2472 -63679 25610 -2580 218262 72598 178905
15405 178905 -156154 -398753 -246832 -142827 -25805 296586 150241 104675 -327827 -50524
15394 13503 83592 -44038 44956 -91527 -21154 -133339 -63553 53224 326317 12336 110707
15383 110707 -47316 137564 -105521 -145652 502123 174306 28395 -94696 -242922 -47028
15372 114437 165704 92296 -34064 -45763 -269496 160849 89081 157015 -150584 -149928 -43555
15360 123943 -20829 -88851 -55976 29671 235449 208104 348541 333071 -176741 -43299 -23339
15349 -23339 -166952 273562 -188155 117462 42312 358105 15459 297435 72895 -87086
15338 7827 357911 38850 -58523 -39064 316884 53891 -172366 215854 68382 -59022 -51963
15327 -51963 -120841 -116933 347530 89941 49716 13605 57255 199641 61170 -45796 76519
15315 109621 110539 179193 -524014 115108 -184147 159558 105548 69211 -198853 169224 111403
15304 111403 16966 179438 55821 92303 -189465 210998 77090 -191259 379477 -56622
15293 -67368 -378881 -90359 33680 155131 75162 22232 -146322 55038 -260060 88167 224969
15282 224969 -41722 53063 254181 318394 26330 153659 110415 -121947 90844 -230506 18870
15270 -92601 -221226 -20869 -4913 179093 298910 243055 132598 -116344 129894 299468
15260 299468 190492 204483 163524 16634 286992 -968 25495 344140 97493 -214635 -422849
15249 -422849 157406 173491 83632 119828 -145734 12227 327699 -11963 -160201 195826
15238 95033 232448 122374 17076 252106 -82335 -32644 -202866 -139096 207725 -101358
15227 242377 226043 -155634 98952 16143 80664 -146544 166588 -124278 127322 246666
15217 246666 158549 -121709 -71959 110599 -157023 154753 -119419 11070 48150 -177762
15206 250072 220553 12640 -136983 -146133 123937 304556 129873 -48664 151810 234656 -166000
15194 -333963 70745 -143281 -388087 130844 -16813 -195333 -36509 103000 163881 121350
15184 121350 -84724 174485 323866 -31087 -114317 -25393 111179 121910 183219 178312 -149589
15172 169188 -22121 141973 23246 309734 143184 15732 60013 16998 -203888 -58824 382975
15160 176526 -80097 262617 103061 -162061 347025 -63796 54451 96229 180473 -65916 40793
15148 -121582 -54007 15232 23033 -86333 313846 -108825 279694 -115861 147167 85344 99383
15137 99383 19728 -449886 276094 139166 -107404 -360365 328391 168124 -85414 71997
15126 341799 179395 -17703 137968 -140066 124556 -172149 -107790 160260 178541 225360
15116 225360 163654 12842 45948 72978 112470 -5554 -85288 -171178 -7225 -72508 112908 257545
15104 257545 317764 -166574 -100312 157478 121962 135856 27897 151164 46325 -52327 -145151
15093 -145151 150153 412681 16714 136817 64227 -59946 164167 89105 139431 -213908
15082 115239 61203 83078 346772 -169065 -42067 73112 175254 193522 -161107 169302
15071 107765 149167 -60595 230726 -23074 318373 -29990 248491 170866 101762 -74776 357215
15059 104448 220724 179581 -122207 140194 -89176 123346 47714 375567 90438 -246394
15048 30109 305100 206417 119732 186307 239868 382423 -30884 68217 509757 406396 401963
15037 401963 326686 145930 291589 620045 -68039 38200 317598 242317 404108 349080
15027 349080 212615 356162 494208 483663 224834 454848 234305 125516 -62389 99511
15016 142906 582696 93926 78128 -56160 390697 -31158 281424 63792 60635 486681 133206
15004 297069 118564 403661 215294 153176 -59630 269373 138152 399640 163341 191099
14994 191099 131736 207888 280436 177528 355562 339691 410606 318860 139298 360024 596553
14983 596553 290833 216646 320977 341882 585723 275915 612394 408969 133334 417696
14973 417696 233670 284533 431970 588919 392386 40066 360617 157817 365376 30020
14962 68215 393732 187669 499968 -179658 431576 292147 342196 160321 -37975 405639
14951 631432 107391 308303 271291 477567 97700 640438 174096 343586 320235 348307
14941 348307 552178 407528 463906 308286 365073 314191 182535 233630 386107 489457
14931 489457 546295 515489 652773 700008 606454 826120 620375 867347 806389 715278 957992
14920 957992 663610 685541 809360 1083044 1016872 799396 687444 759974 947951 719756
14910 719756 331996 311738 444489 431112 504545 465510 234952 391461 258336 519363
14900 519363 274619 164419 403940 308584 394918 262009 320614 75003 398663 114226
14889 618842 428794 112262 537912 340672 716362 640207 393334 359017 421367 400784
14879 400784 566009 518829 601559 76335 456528 285895 261978 338882 312561 287463 416636
14868 416636 322164 471748 619831 277672 81355 775749 268929 490877 236962 336762
14858 336762 391445 227092 94287 351401 252618 169825 49467 281542 452896 476538 455076
14847 455076 201540 208835 182685 242078 277863 595843 229527 568559 611439 654149 934741
14836 934741 711219 793928 833119 406058 301610 198889 449049 321652 339521 341579
14826 341579 55322 424191 118630 544412 443595 388641 402738 589181 399965 670836
14816 670836 376468 696957 241308 329189 414322 318863 619869 475274 577210 252341
14805 659650 310379 431947 492563 381815 727454 761899 718274 630913 769327 507163
14795 507163 310685 410220 267512 412013 466912 783255 101335 602368 557737 755036
14785 755036 349228 425604 549015 337829 254304 775334 324672 445442 560608 514251
14775 514251 655362 465887 551041 545458 458343 104585 356320 485703 526910 545292 510245
14764 510245 545668 630415 383529 538660 720899 620305 576702 547596 744618 442814
14754 442814 733192 577165 676298 628968 448148 582983 575900 595671 375794 309708 761475
14743 761475 757940 223048 699483 524047 665848 551507 435415 868185 448828 755307
14733 755307 831725 160920 611984 608114 637667 507322 894199 752348 852016 774431 777654
14722 777654 682021 1113439 1242744 1054044 807660 747750 922524 776069 844704 930845
14712 930845 836169 999080 785791 640319 231171 984157 895436 799306 885931 751026
14702 751026 726957 980514 907258 921685 1155198 1228026 1030321 997998 913145 975368 1027698
14691 1027698 1079413 922514 820442 775781 1049581 799940 927519 680481 886693 753347
14681 753347 803402 719951 1010286 727963 922948 956196 963208 955608 528794 848513 757452
14670 757452 687440 579103 821220 652191 469570 673050 763249 916440 922441 710761
14660 710761 1003659 1004452 1006933 1002038 1081691 829923 989523 1062722 859257 1121507 872145
14649 872145 790545 942557 1078738 941182 941756 924672 898463 798022 985765 906409 1049541
14638 1049541 925529 939998 927032 947477 911052 1204008 788365 1266452 945436 1090003
14628 1090003 862892 1078912 1005175 1243132 883197 950174 1181621 952436 1114182 929387
14618 929387 1309646 932137 1084866 1022706 1170384 1104732 1367707 1399781 1184062 1384624
14608 1384624 1156622 1228137 1228365 1442733 1211096 1113080 1174940 1152738 1458988 1063500 1105099
14597 1105099 1506328 1069366 1621529 1318422 1645098 1348463 1290583 1251914 1265667 1597121
14587 1597121 1261438 1691592 1184048 1803105 1552693 1364971 1679027 1287378 1725493
14578 1725493 1590634 1684203 1589003 1687163 1540178 1612947 1698199 1901643 1832346 1956098
14568 1956098 1685245 1993849 1916076 1704381 1969061 2043418 2142724 2354154 2202408 2380183
14558 2380183 2467397 2451862 2560639 2740750 3003586 3334379 3970806 4201880 5945022 8254526
14548 8254526 12643595 20103159 28574260 27599433 16449394 8029293 4712735 2937495
14540 2937495 2388678 1771498 1904875 1644140 2111939 1806926 1861853 1512771 1767657 2153327
14530 2153327 1731378 1665660 1820332 2021635 2070373 1877629 1866880 2088427 1794484 2168626
14520 2168626 1864034 1777125 2072529 2241634 2274314 2297805 2367361 2320820 2115146 1717377
14510 1717377 2006671 2226433 2237230 2267619 2275290 2304285 2536783 2261426 2354142 2722608
14500 2722608 2774889 2433845 2732307 2513853 2776422 2856347 2938614 2843569 2398056 2519764
14490 2519764 2852067 2788929 2986006 2800886 3158151 2902578 3010506 3119844 3128144 2954095
14480 2954095 3095466 3121845 3002777 3125310 3169628 3452845 3220789 3506335 3440955 3737959
14470 3737959 3302097 3140761 3789346 3925627 3531423 3780987 3739595 4002620 3970185 3877985
14460 3877985 3731910 3833147 3896198 3968924 4064013 4113895 4164974 4153872 4661271 4440866
14450 4440866 4506531 4338759 4629449 4501989 4401950 4608350 4709473 4911306 4623339 4506626
14440 4506626 4796889 4725895 5009648 5346383 5056896 5154741 5656682 5261580 5683147 5589899
14430 5589899 5472886 5623962 5431589 5935051 5995981 6142317 5974805 5846861 6088885 6274529
14420 6274529 6051530 6370437 6777822 6905467 6790908 7039986 7083390 7057106 7267874 7376887
14410 7376887 7469183 7489727 7511593 7988364 8126924 8382685 8361399 8444484 8477787 8928794
14400 8928794 8758738 8872113 9068822 9231581 9244745 9041371 9565056 9562724 10233234 10086280
14390 10086280 10337237 10513441 10952581 10644984 11064155 11146155 11223193 11545494 11932997 12324983
14380 12324983 12299943 12622103 12989225 12734519 13229597 13417926 13450935 13978592 14120146 14566251
14370 14566251 14685057 15240176 15480353 15922130 16560613 16493881 16931575 17565705 17757048
14361 17757048 18180234 18525243 18760811 19252800 19399269 20153071 20595432 20935647 21228670
14352 21228670 21752722 22400008 23110976 23906162 24326415 25127933 25467760 26413171 26810354
14343 26810354 27981313 28576476 29053675 29829739 30778582 31744064 32677109 33899482 34569324
14334 34569324 35750196 36611396 37525798 38875281 40168052 41106596 43069356 44023399 45859592
14325 45859592 47487961 48762820 50633027 52493358 53793066 55800585 58150999 60369880
14317 60369880 62273387 64985659 67595246 69938603 73361633 75896797 79060660 82347312
14309 82347312 85855570 89660425 93704690 97690992 101976730 106940335 111798985 117092352
14301 117092352 123051239 128835177 135236671 142194669 149764402 157196186 165374079 174159691
14293 174159691 183527864 193565623 203803418 215255839 226702313 238585012 251714480
14286 251714480 264846296 278725148 292896002 307577428 321992185 336957277 351379737
14279 351379737 365428774 378986091 391571917 402321989 411976376 419244391 423644425
14272 423644425 424443139 422885197 420930055 419179271 417437962 413173652 405652772 395519374
14264 395519374 383215345 369666575 355766296 341118376 326279168 311394101 296620145
14257 296620145 282189457 268068343 254483345 241552897 229051422 217105156 205815042
14250 205815042 195144784 184961630 175465274 166580171 158458354 150388179 143232492 136349489
14242 136349489 129395631 123463484 117453440 112039523 106941317 102024596 97875621 93502500
14234 93502500 89405729 85807042 82290823 78689436 75855325 72874849 69588727 67038709
14226 67038709 64260782 61917163 59460287 57190120 55371703 53467199 51959775 49938180
14218 49938180 48330664 46550753 45067932 43725733 42016076 41092841 39911185 38619117
14210 38619117 37310383 35940760 35243029 34454102 33497143 32577495 31241655 30234763 29761604
14201 29761604 28785244 28080462 27576299 26481059 25677843 25252005 24764148 24328795 23763133
14192 23763133 22604553 22502995 21807104 21262076 20799676 20105748 19894053 19382575 18986795
14183 18986795 18171798 17873944 17558373 17319307 16669845 16633293 16302750 15973807 15346362
14174 15346362 15417935 15004384 14614279 14516505 14171292 13829933 13711902 13409829 13045692 12831529
14164 12831529 12778291 12163195 11855079 12155291 11728341 11495805 11393240 10622405 10844658
14155 10844658 10977075 10564524 10358120 10217305 9926908 10043478 9608241 9470245 9298033
14146 9298033 9038483 9347506 8941463 8948056 8719990 8601737 8329993 8444140 8293107 7945489
14136 7945489 8040600 8097851 7838689 7620418 7608047 7640650 7545730 7315425 7180319 7068215
14126 7068215 6780988 6886201 6720524 6655164 6796851 6366767 6573111 6360908 6258750 6275470
14116 6275470 6436687 6058268 5833931 5932450 5858018 5673198 5522565 5681753 5300235 5620168
14106 5620168 5566866 5220780 5004830 5140690 4934367 5227032 4786279 5068559 4944506 4639876
14096 4639876 4505110 4464785 4877471 4773429 4416447 4288356 4464599 4603006 4178811 4437200
14086 4437200 4354583 3997617 4225883 4099027 4209067 3953038 3965958 4112993 3827501 3876142
14076 3876142 3897298 3500413 3713614 3768077 3646034 3634124 3613172 3518182 3327457 3455632
14066 3455632 3452553 3519339 3528182 3589505 3224674 3421584 3287025 3066543 3469043 2922706
14056 2922706 3069100 2945292 2997949 3142924 2916941 2955761 2823896 2781195 2797303 2914747
14046 2914747 2824208 2626697 2606178 3191554 2881338 2709146 2435616 2371121 2585039 2713639
14036 2713639 2810174 2802435 2674436 2305011 2476261 2581566 2506076 2507483 2523059 2231809 1972380
14025 1972380 2153329 2109183 2204957 1856072 2472562 1958869 2299202 2049028 1924810 2136712
14015 2136712 1950128 2006670 2051781 2039299 1884334 2107076 1817380 1983870 1835090 2101894
14005 2101894 1879261 1808189 1844620 2120991 2054172 1927167 2183269 1908726 1838583 1941258
13995 1941258 1709903 1811833 2037855 2128886 2661171 2889481 4643109 7586043 14264321
13986 14264321 24288592 28974104 21602252 12462183 7878422 5480134 4587292 3829937
13978 3829937 3264685 2895440 2487487 2550044 2523865 2266754 2197924 2258557 2297689 1971827
13968 1971827 2029880 1966759 2102942 1714959 1936273 1610242 1737455 1759524 1787028 1457039
13958 1457039 1721058 1603667 1839628 1679564 1586844 1672403 1518526 1619611 1621693 1750950
13948 1750950 1192839 1317002 1627477 1593485 1369934 1380662 1527805 1407404 1503464 1531246
13938 1531246 1217810 1154902 1406974 1546801 1443227 1217827 1161634 1198876 1214053 1153325
13928 1153325 1192646 1341155 1181917 1621916 937641 1258217 1173277 1323989 1091751 1122372
13918 1122372 1217546 997014 1363852 969439 1132736 1058886 1170156 1293650 833038 1023334
13908 1023334 1033240 1240170 842557 998089 1223781 1192726 1071170 822456 925226 997115
13898 997115 1307855 1067300 1293521 1225407 831426 1221862 991245 1007939 1066619 950509
13888 950509 979747 758756 955827 1224876 722242 919920 1071293 899569 664625 930921
13878 930921 1016465 808856 835160 1020859 1047215 1182310 942993 874012 906936 971187 940139
13867 940139 1078738 911750 823031 573881 832959 838295 886037 704484 710510 673498 598401
13856 598401 809456 829780 966173 1020033 847475 814679 606224 554886 652494 945542
13846 945542 693780 1067292 1108763 990039 891414 869749 802122 646914 738468 782171 694514
13835 694514 664051 287593 975041 721515 1038506 333198 716544 546756 734683 632690
13825 632690 697124 674384 688927 482961 170227 829868 575590 544349 764151 766415 567614
13814 567614 527091 384635 666010 506462 1168312 773138 510384 572649 547402 987478
13804 987478 537858 462832 660115 552990 860286 889350 617077 659314 787973 581318
13794 581318 471145 464119 404446 771835 347864 577376 991746 665781 390189 462145
13784 462145 337783 351002 194587 698368 614807 541613 709805 931515 506381 680269
13774 680269 763963 887294 515960 684424 662531 557804 450125 300299 510165 730633
13764 730633 532966 747173 57295 564143 310756 730322 440853 617731 354880 707282
13754 707282 473618 506471 644415 438659 589730 602610 510122 600332 303634 544569
13744 544569 567641 498346 648133 239760 290452 516914 717263 484306 473821 483759 510728
13733 510728 606665 666353 408252 506269 448350 361652 273848 433100 687917 498640 246229
13721 330499 270181 363331 347335 394566 502446 632725 282368 768673 369883 539674
13711 539674 332547 613921 279596 619112 611820 301775 536607 508562 247989 651601
13701 651601 457248 159360 423081 441281 321724 329834 416648 468879 636707 298195
13690 303406 226318 568414 266026 733441 352404 525741 231181 558025 637373 237093
13679 585724 153164 561615 886088 176958 358763 148442 311621 493782 459759 139598
13668 38988 356042 401672 735960 261986 178484 326772 562356 260816 98216 346017
13658 346017 320171 393662 328184 28099 91483 165775 47190 444612 241589 667612 453122
13647 453122 387273 73097 101958 410055 670168 -52371 305041 246494 372289 243121
13637 243121 129967 197643 424894 317846 365406 565684 366808 404994 214790 19165
13626 68138 565724 235277 421899 166225 303097 574198 655391 273351 207712 456752
13616 456752 146590 130847 448664 -86256 297145 300881 300727 573687 329527 498014 292998
13605 292998 383484 383633 154776 259130 231973 260457 355502 406429 508260 -56950 287902
13593 518276 198233 524887 82672 249882 237565 182321 462317 278055 235228 296233
13583 296233 162151 180282 150386 257726 100008 -12567 695198 77449 443382 480680
13573 480680 162233 353364 336111 651654 78249 463426 517418 272663 477596 222361
13562 168203 401970 53615 153952 111577 116317 290977 353399 407428 333585 256659 -70561
13550 239676 235258 344905 219527 112826 419640 121373 347757 147123 315497 153714
13539 155301 -127562 188654 267442 223980 3089 463364 125757 276641 121616 130077 98895
13528 98895 643570 -131820 283106 171212 69274 79771 140103 150965 -151214 95265 287026
13517 287026 -144775 315799 171514 246628 459587 244627 220115 148279 257865 274227
13507 274227 270854 254678 397685 408665 107520 135068 353860 112178 305572 393091 290917
13496 290917 505010 90178 -49548 34879 236049 134617 163703 29576 164138 196968 196385
13485 196385 333521 44559 104092 266376 81300 16319 237950 65819 419871 67241 77634
13474 77634 192043 587870 294355 281882 280356 349990 301154 519097 185235 331390 -71970
13462 115343 -32432 107924 143576 378417 198237 189128 98309 218534 256096 272402 383131
13451 383131 536958 224708 213301 -56706 136856 267129 431498 -137565 530115 -43340
13440 296785 221998 548495 382927 -48205 146812 78452 412032 286225 201347 144466
13430 144466 258815 49083 265233 99668 300946 279668 -82853 69409 381792 -97502 118679
13418 -117970 394554 -62639 -130507 96340 97237 121210 358446 196286 152107 121705 -152653
13406 246229 48935 191943 188499 275837 -14679 113450 136284 87656 -62726 291691 79372
13394 -91349 180521 92611 555995 -60115 449598 67646 82550 105389 70679 530252 212696
13382 114522 33959 187243 89004 216597 -79871 207783 147960 197139 333998 462170
13372 462170 153858 246481 105066 -33512 288698 82680 -147094 65244 327480 211367
13362 211367 -102055 41998 41977 40728 -19562 111970 2786 103729 362846 -89892 -83436 77517
13349 120532 670373 -27635 423937 171505 -150603 156480 -83244 376425 206803 169635
13339 169635 -94238 242313 161656 284686 380099 107556 304095 96214 -137073 204640
13328 -82034 87750 316472 186746 196318 13717 246667 63274 -82049 -25564 17635 419003
13317 419003 51958 81374 190483 178415 183489 -817 149032 117657 -95255 126147 320262
13306 320262 54713 -108411 140097 34407 332494 271556 101716 105537 50833 1210 -114410
13294 99381 -114247 367857 229138 187913 246652 -207513 -192259 -172899 -72844 72469 389472
13283 389472 221448 -3502 261222 -5315 162548 83784 248890 97656 -21071 -10315 -145664
13272 -145664 108575 271133 58377 15421 -6128 91117 226053 -44849 56887 231385 171626
13261 171626 340228 200768 257404 -164810 -214063 182628 -105368 212668 349749 41247
13250 -73521 197908 -228339 116978 -133031 -33146 201529 40174 118637 235984 165373
13240 165373 -63964 153655 259861 -16908 183867 235068 61830 240770 -176756 214622
13229 -256578 179711 155759 -77368 74784 523034 68211 49369 -218621 -16018 126884 202402
13218 202402 91113 132701 388652 -137778 -30936 -76953 -50486 265135 -149667 -13830 -299370
13207 -299370 -123115 192507 -51839 147662 -211334 -111760 103237 166797 -107625 172611
13196 9188 117872 -75061 6358 -37477 73742 -94957 274344 221814 4016 99247 285642 99735
13183 417455 -88645 165087 -87982 -41463 -112945 96772 110250 22515 38936 -21157 114295
13171 -226514 233992 203564 191838 144365 144582 141044 -121820 222421 -210571 93805 -351838
13159 -82518 128880 145887 97237 209991 125324 39893 -70990 119425 -111194 168672 274464
13148 274464 -57299 196179 309742 116009 -55217 -235620 -195658 480742 29852 -67480
13137 194789 -22624 -429 176122 13607 -24219 250533 157127 205905 99850 -86241 -203860
13126 -203860 98303 104250 108437 -100647 197826 287240 -189323 73996 54431 137129 251727
13115 251727 -33133 255978 75250 -13014 260789 308954 112615 177206 105358 -134465 114238
13103 -133731 152812 -37559 -167691 -141503 207705 -131031 -125044 468279 52407 -49518 127558
13091 -137027 70234 162440 17594 -86380 157062 14149 443241 60819 130579 20596 167674
13080 167674 -296745 -138989 -210607 163029 12824 11498 198095 134888 188630 -61058 63025
13068 -52511 -106953 424572 -62210 -223589 335326 -2832 -134947 268918 -17284 335145 70717
13056 -139736 -54221 102391 190058 337488 -190900 89756 55560 331777 231531 69770
13045 -58178 140053 96428 -38678 -162993 -130248 71361 205854 197790 -256365 273388 114909
13033 79002 210980 140935 70159 123470 137427 94557 -85634 306832 -81301 90718 189308
13022 189308 338476 151075 155679 2067 -160908 -233763 382400 81672 203697 -100178 332062
13010 -6099 26025 62983 29104 243530 278101 24230 66594 253881 86037 305339 -184234
12998 125466 -202055 151940 344043 80458 296502 -131706 -79835 -141673 112645 -61756
12987 -402902 -233642 -101736 335450 -234542 10903 -89913 105817 76366 11607 67359
12977 67359 120634 195302 -79128 -244534 -76120 88692 280078 234096 80479 -27763 204956
12965 -22764 -254830 42868 -13652 -8700 -78850 -134379 -226436 144336 63827 37230 209834
12954 209834 -67483 106034 -236719 90051 140399 -30542 -33837 120606 -89927 -43719 -65449
12943 -65449 -248205 20407 204307 19570 -159480 -62130 -178714 -25520 74089 -313870 -18196
12931 63929 -251376 222497 218476 216582 155955 34576 -172999 184937 252688 -329140 131430
12919 264797 -45374 24212 -311168 154363 -78420 -219393 70922 -131200 -233092 197825
12908 -95856 92181 -233055 452005 -93618 112544 -280621 105194 184396 -158314 205600
12897 23304 -112631 -214170 -204022 271069 102604 -197629 57326 -145084 90512 155915
12887 155915 -12316 249140 117822 102290 112850 -85760 252189 83127 -93320 -219655 153062
12875 165762 110936 52081 139812 352986 -28909 59767 56870 -58165 -168793 55729 -63781
12863 -120283 76704 -160528 -137940 -8643 66968 117653 82020 -74784 -248688 397064 375223
12852 375223 181816 56944 161437 -105547 -295938 200286 -161063 -116702 319338 -75547
12841 43625 63390 -39131 -37670 94145 62029 305169 139038 205349 -252528 -172437 188957
12829 201249 -158419 -232240 -90887 -106035 -170398 -217302 52927 87706 55734 36905 113569
12818 113569 -187740 128716 84104 74639 -69992 -264773 -45685 -633 -22630 98134 -99674
12806 4380 125588 -53408 150723 -166901 21556 -150745 -265237 -48037 303637 -215610
12795 240465 -191466 -139080 -307233 -75162 -32653 -62868 251642 46765 -54978 65998 -95343
12783 -36619 208956 -208446 -215101 -73499 296529 -245761 80036 118727 -28149 -236878 -116969
12771 -221753 24260 -140157 -258599 64484 -207011 10496 -269779 -11450 -20708 135597 -21520
12759 134060 -288361 -280986 197603 95380 296607 -59332 -260 -160701 -27665 -53417 59980
12747 35310 -105828 -345651 208319 -209274 -31782 -194904 45487 -35051 -88153 128088
12736 -223070 -81685 -233595 198065 1080 -178530 221857 -138841 -94913 75154 140916 -110635
12724 -135597 -104357 -77492 4665 -17410 -120882 337404 17234 132588 156359 -62328 138167
12712 97349 107667 120102 170365 -37996 257550 207238 161841 106391 340931 290197 286096
12701 286096 251622 48768 -143389 50205 126022 -143458 6299 -161203 -145752 4997 17514
12690 17514 -53467 73716 -149134 -10266 108607 -88853 -34239 254686 311074 19972 57778
12679 57778 367748 -69829 170795 -242046 -102902 90658 192942 182923 -525575 148599
12668 -71216 153848 -146959 -56827 59700 102000 59004 -204046 32070 63383 -42724 240401
12656 109075 63270 202995 55759 -89494 -95895 -36846 166491 65260 65706 -222748 -47258
12644 98045 93412 129460 -101406 -416542 -4472 -42702 38207 -142776 206449 -1094 -72397
12633 -72397 64432 127176 123709 141273 265742 480631 572056 128536 370295 -313960 -59064
12621 204327 143159 151039 -186166 -371357 -109905 -126055 -323950 338711 -256635 19940
12610 -116238 101120 197109 -119200 -47673 -262964 26742 296549 84078 -199879 198416
12599 -170974 -66686 -306339 -97647 -32740 -35891 278348 230091 262224 -191066 -204373 265379
12587 229627 -161782 -175253 -11305 -169434 -19502 112459 278103 154082 -275949 -73509
12576 -103695 -230998 -178677 -131178 56395 97807 -51200 47003 -6236 -143756 -177494 -275436
12565 -275436 40379 185783 -53704 -141402 37737 81108 179309 77135 -186552 99365 29463
12553 239933 -21932 -87633 -164202 327535 -230994 159066 32349 192661 -55338 -272208
12543 -272208 -147442 -227145 173155 -130689 -42508 -108940 29391 175156 86122 -209492
12532 50310 -234514 7392 414019 244175 87654 12265 22793 -131010 -33994 -195556 -273655
12521 -273655 -11849 711 -60714 117069 312589 200256 161008 14177 -58557 -170594 -54284
12509 -122189 -251978 89664 8107 -113837 -241537 -85930 28618 -28630 151164 148322 -249391
12497 213667 -38951 118933 143632 119603 -104366 -91285 -122099 -64407 -252373 -182927 229857
12485 5096 42414 -117639 156434 -94414 -90189 -239532 -255959 99056 17570 -53502 110923
12473 111477 18197 -130248 -79675 23319 279732 112743 -301730 -282465 -46363 -29533 -117306
12462 -117306 131643 -276971 36998 -136769 -216392 153133 174538 270178 -200511 -78861
12451 7936 12329 -23192 -8855 64946 -109872 157909 -150644 266737 -143495 -117877 -212452
12440 -212452 117556 -167013 -95568 57297 -206908 83045 -37184 -107431 -42547 -92334 -205686
12429 -205686 68165 -211535 -242955 123236 159352 -140263 37420 208251 -233989 -41423
12418 -28692 116545 177657 -19483 -19934 -218114 55211 -275386 124518 33675 -380241 -250688
12407 -250688 2636 314760 -24755 -135830 17446 -17324 -205319 -53787 -224924 -5497 70944
12395 138486 96336 6160 30253 -2282 67370 -47953 150921 -188739 -15389 187997 24456
12383 247888 62202 207804 68374 177504 303401 -125306 -67664 -256147 -125124 -101124
12373 -101124 -50628 -112796 -145355 -131303 92190 124037 -56615 90665 -92520 107839 -104513
12361 62150 -135222 -94673 -207472 -103012 111401 -60980 -179339 214770 -169296 -63109
12350 36892 -83826 255847 45608 -300247 139169 203144 -263927 100743 38885 8238 282711
12339 282711 -6002 209627 -260629 -313766 250290 52561 111646 -127030 -138318 53554 -56789
12327 183005 82783 49664 -140626 15730 384897 47193 216070 184740 296174 94121 -62362
12315 43832 70334 430341 174752 259769 428864 52136 -149961 190896 -294 -30453 -51951
12304 -51951 131094 54775 100834 115120 -333992 -33511 -11193 104040 55752 -72386 -159631
12293 -159631 -294923 -96610 8775 -93071 150305 77905 -73055 -246851 -114449 -21435 131737
12281 -234055 117114 -38217 178211 -384581 47793 -156062 39843 193416 23261 57094
12271 57094 -65066 6417 151150 -263468 96591 -186769 -291596 -169996 -86192 135380 -77242
12259 204489 174911 -59516 -56286 66329 240497 134577 9334 269271 -147329 -208069 -35848
12247 -255013 177965 34786 -273640 -166432 10410 -20235 31640 -72494 -88252 70316 -16368
12235 -249119 -225688 -252838 -21294 190456 253243 -14189 -96576 428871 460233 22764 223338
12224 223338 248574 318319 238333 153118 -120017 17104 -79438 155439 252597 245116 114838
12212 -95942 -202935 74488 76863 -46232 254695 -56676 114694 7256 -159511 369895 -48945
12200 292747 149880 34067 274423 37036 157622 56217 -6158 255432 137847 114882 36912
12188 92168 -17864 109832 -31059 51156 -203070 -96904 343689 119432 -54235 54419 219794
12177 219794 178270 355514 354358 260409 -90572 -12205 131776 77259 17867 289109 249143
12166 249143 131075 -41191 381566 -49267 167095 389514 -177664 -252394 -54010 -103667
12156 -103667 -38524 70372 -77196 290576 -247076 -259429 66212 183865 306272 111307
12145 128197 239884 -260199 278798 -47535 -345742 96593 23901 359569 209722 176440
12135 176440 -79395 -322474 -96143 177981 -1723 -70732 269623 -94027 -128489 -227449 364085
12123 363850 15747 -119764 99641 -261303 58484 44706 -18544 181133 14094 -198402 -54415
12111 -102182 -104322 -158089 114115 167770 57122 191032 -53060 -85089 12116 193051 -4047
12099 85225 -139128 -161882 -44315 -48365 98705 -257672 -172297 -53923 -195291 -39631 343664
12087 -148088 191126 -60138 -173848 188865 -3366 212211 5517 -243129 43030 -72516 111693
12075 71207 -26592 -220667 -196580 -157543 -245461 94461 -56772 57572 80587 -29779 -267158
12064 -267158 -33570 41192 -23937 211764 63178 -177405 99091 -19353 210707 87395 81139
12053 81139 -126394 -16773 128607 227192 84963 153710 39547 -7389 237466 61873 39215
12042 39215 -76096 96175 8198 -371474 -205447 -103655 61203 -183264 -197652 -119938 -248751
12031 -248751 112194 16763 -361899 -104328 369584 -180675 159792 -138107 -102703 70166
12020 245520 22772 -254020 291124 -1304 -189346 174477 -8023 -137994 -130791 -5094 108721
12008 128878 64718 69974 -11348 -25824 -29298 -192386 120598 -5578 212577 331831 -37676
11996 14718 -233815 30364 146954 -1448 74345 33868 116107 -233284 124684 94425 -9068
11984 -124739 8935 189424 -198297 525271 76425 -80288 -19584 -214065 -197708 -175466 -12441
11972 33112 32977 187091 49841 -277123 241054 -116101 -103359 -229335 -467693 122575 -4118
11960 -142173 -231619 -301669 130600 14670 -280859 -8488 -216692 10770 24477 -205510 -83957
11948 -198707 128880 -8398 187736 120500 49352 150625 -209985 -247614 -112636 131199
11937 86583 307194 -37603 -290475 -106894 -234014 123132 260243 129387 -108588 -223204
11927 -223204 -134343 271987 -278017 -250223 -111630 31143 88469 303932 60450 -59062 -287149
11916 -287149 -257359 258130 66014 239154 191957 -436445 -123953 -106740 155904 -10722
11905 50738 307035 432843 -57457 98401 48284 -41662 13524 220085 -17262 -97701 55086
11893 -15487 32987 -104108 -162657 -240916 -201308 -189850 76816 -86142 -364624 94278 171877
11882 171877 95205 68665 180340 142591 12069 83305 -215503 -679391 14496 20762 -38529
11870 92113 88792 -464331 34327 -30144 -102803 -129248 -93021 -97793 382810 -52958 116660
11858 319849 148046 -101850 -134530 -109845 179985 -175757 -46859 -121787 -43890 -26802 -40183
11847 -40183 190285 41872 -9274 -259874 237709 -4201 71181 -149061 138734 2337 -486675
11835 -125664 139424 -106785 -194098 -197398 53842 -196392 -99390 -115475 -374355 22251 -37653
11823 -137186 40230 86904 -54365 -159923 -79538 -187514 -221950 -420825 -168440 -43955 -335946
11812 -335946 -59201 -113193 -112302 -130190 64226 296949 253617 171616 42675 -113378 -123812
11801 -123812 161863 -396559 300040 -99129 -1383 4545 -12632 -291411 -203688 -116792 20378
11789 83485 -66393 19951 -4696 -57839 55420 -106838 163345 71172 -324746 -89425 -7299
11777 -153595 -148039 103968 -180591 -270809 218451 -98785 -166390 -201956 14137 81734 41773
11766 41773 -62804 87867 -54514 99564 12974 36050 20408 -2396 35520 76046 -177764 -58965
11753 72229 -144761 -25499 -16681 -8114 -202125 -308062 180327 -75999 177320 -66100 279592
11741 209070 196230 -38226 -5786 2877 -3104 216722 -206192 -105098 -64900 97619 -45866
11729 159620 75923 90816 -63978 125532 341484 -77469 125349 43284 -226871 228858
11718 -263798 213811 238822 -86974 262957 -3277 -136694 16113 157564 -171727 -420136
11708 -420136 -394742 -90959 -142987 84844 -176709 415111 63568 203783 269357 -61069 102994
11696 343731 147424 -158179 59953 -12727 280001 7839 -47799 -128129 226667 117217 -42293
11684 -57126 -119489 86712 114891 -182456 23188 46447 75862 13399 180386 1230 -51224
11672 -30599 -139703 -101096 -40903 -77721 -199926 -46369 -94385 -125828 -76759 323806 263520
11661 263520 -34000 -32754 162783 -132813 -60145 -381420 192708 -109189 6327 -101166 65394
11649 172912 141325 113275 -305380 174627 35303 195876 112038 -96686 -105557 -165951 382341
11637 57893 -229079 98290 29987 -80560 174951 56197 33652 -143704 10202 201883 -36711
11625 -98295 173590 222384 27220 -14086 112664 -75137 233667 -85846 18617 -119474 -6721
11613 -50663 -332216 32061 836 -265182 275061 -36471 -25430 -22339 -39171 140274 112980
11602 112980 435955 288181 -280053 -134950 -103127 51437 3651 205689 103035 -295929
11591 -250877 2691 223788 -68715 231427 135558 13452 -267483 -79462 330985 93158 143931
11580 143931 334262 257327 365863 -67754 -132488 -47814 34282 123514 258138 22447 285877
11569 285877 -88212 -159980 -60939 28476 -238292 -84015 52442 207237 158842 -185925 -40029
11557 425214 229105 -181567 -307543 152538 96534 236650 37857 324083 -33121 -120092
11547 -120092 -32805 72300 26307 -1178 104991 188662 -82612 -10585 187718 -45067 -34490
11536 -34490 363545 174730 -74068 145751 117084 334475 -217205 64183 91271 -285564
11525 -230071 199586 -107576 -29115 -74730 48015 -382966 -75975 175190 -415163 -441420
11515 -441420 129914 -17794 120703 -464197 28469 224126 -85145 334629 -17245 -288217
11505 -288217 92419 -21172 145419 23250 255047 -127208 43341 164213 -106358 185740
11494 78672 47103 -105086 165397 220286 6824 136480 -224149 -32840 80845 97018 -120740
11482 41086 249870 -271520 66919 -52793 259422 11114 161048 14214 183624 63141 -81983
11470 207619 -10626 366155 73201 143625 27794 89960 -24928 227182 408016 144320 -105897
11458 -260105 138249 -216513 117457 -81407 231708 93034 -39816 -15556 -51161 86749 -268635
11446 61764 -84644 -28825 46770 44043 28817 106436 52998 -100378 -109034 -264686 -116069
11434 -43090 44906 -96969 -5250 81359 -62825 -352797 173279 -107587 -75802 -10213 50828
11422 142258 -4659 -119216 148229 4797 -39207 905 -119034 227417 311824 27608 -90713
11410 23854 199840 50921 -225181 175691 89192 68412 362840 248768 179792 148376 254037
11399 254037 -100226 16171 -25552 86854 -335142 -63943 -102985 -198226 -240677 -67313 -71364
11388 -71364 -41397 -149351 179798 -202639 68148 52466 -116333 6210 318764 -109020 -161692
11377 -161692 -150825 -308320 -20369 -183110 -254521 132832 -35100 160392 -35791 -126846 -65773
11366 -65773 -190968 186146 153831 -109051 -328074 38300 -180756 -78605 -75831 174123 10406
11354 137768 30464 92316 44092 -335006 -359728 -249884 -136648 -40633 -102999 271785 52888
11342 -82260 107515 -12574 -137554 -10590 -272393 84384 -213283 -128774 -45146 -126587 26639
11330 151299 163717 -48785 -174465 -49768 -301794 -16668 -205629 -144297 299484 125508
11319 287453 50634 -162329 16972 -287114 -317801 15036 64109 61068 46923 234273 -145246
11307 -51400 32796 93473 202436 -71135 67412 137603 -103126 142267 153998 41326 218063
11296 218063 -251879 117544 -87823 -218112 22130 246447 18344 -137974 25217 -137512
11285 164002 342350 103363 -151000 -15516 -381018 -301415 60335 -276937 -131647 -124366
11275 -124366 -225080 -71484 242820 101413 315253 -358986 -250362 -179621 -123443 -226740
11265 -226740 3949 -80020 -249027 4874 -267771 24829 194076 -85693 -133644 -288437 -169115
11254 -169115 -97271 17808 -160448 35054 -82963 -34092 -50960 -190257 256732 -120147 -103179
11243 -103179 -151400 -157055 -212077 154028 -292621 -59977 -101089 89959 185183 200023 5029
11231 -171374 -225102 178485 18421 -50143 251605 95500 19788 -136410 34717 80248 244135
11220 244135 255510 -191215 97193 -11186 70434 -138329 -65529 41870 -99092 -150598 -9801
11208 -278873 238264 38670 -43541 188187 -17719 -131743 -341305 -229376 168887 86928
11198 86928 25690 68309 -16188 51700 -148791 24873 51438 51636 191347 -225314 -188557
11187 -188557 -157815 164859 -106773 17150 20406 -84743 -188537 5109 135835 144543 -168434
11175 160857 -198438 27449 65429 172199 -132643 -417827 -9388 -318604 146180 55517
11164 73028 -223295 -38917 -118366 94804 -455444 -337036 -150795 -25982 2338 -246245 -76461
11152 -212285 -304137 295904 -26121 8431 -129411 64130 -209306 -186544 -54141 229701 -239820
11140 -272957 142752 -33871 30103 -167734 -113861 -45819 360177 -34294 111360 -22858 -68863
11129 -68863 284465 108965 -101536 -142971 8535 231996 138474 141733 236068 31815 -2125
11117 115947 53413 -209665 154721 160912 -185724 -28734 -55042 -180001 -5126 -319559 -16812
11105 155419 -133463 -34795 -47492 -209560 -319625 140709 -641 299709 190830 -172338
11094 -4295 130202 -85123 -217830 -154965 182120 13602 -127991 321394 124869 187236 36566
11082 146848 -117485 160009 -70423 62028 269698 187299 160198 277985 146538 300893
11072 300893 -248882 35680 34451 313783 218360 279557 -1013 492570 38409 -1926 100792
11060 64834 -44986 98063 379671 378080 162176 531045 190854 639724 593407 671825 695109
11049 695109 270925 183287 623278 746658 16611 517143 664682 167730 494429 163783
11038 390550 349233 325761 428115 450100 254032 284175 626170 224053 529686 493268
11028 493268 582419 255589 488914 78288 22406 510888 168345 520931 -1763 66577 523998
11017 523998 39751 368894 370461 519253 335136 416652 432902 361024 266682 336640 485410
11006 485410 194505 103873 151322 318582 263608 581443 295374 560970 463043 203465
10995 430526 325190 194287 301326 18544 228188 331272 309445 488007 533770 193181
10984 293517 231207 430710 409833 632744 445668 735840 544760 562353 912017 940699
10974 940699 715299 863370 1251810 1172625 1602160 1371595 1311077 1235036 1203007 1336002
10964 1336002 1117315 1087257 943461 919430 1006329 1020104 859270 1121807 1216662 1391786
10954 1391786 888740 1094649 802916 862053 1249644 741588 752381 393791 412271 472244
10944 472244 129469 319546 293396 193976 396291 593838 170610 -240503 174728 14862
10933 127368 243362 90798 26653 260489 35856 -436886 97768 138644 194374 -30104 47020
10921 -134136 97054 -10494 71800 86872 373100 59696 -108084 169681 105202 -42933 260612
10909 -206971 262848 -427 -93518 3497 -63492 -1504 -181914 151832 -96984 171150 15214
10897 -227516 -7973 -111782 -258546 174388 133454 -254396 214628 -32558 -55163 -124169 161581
10885 -322400 93339 44024 205509 -273527 -187333 140709 147867 -233139 44149 -315743 -303303
10874 -303303 182737 44732 11121 106244 -1300 -59392 94583 260137 20634 6134 -132792
10862 252551 93580 -95682 115713 34723 70384 6197 -94886 282676 -34784 -165216 313537
10850 -229205 -19910 -18339 -323505 -114564 -29877 8331 -30057 19888 -109831 -180086 50079
10838 -82622 53830 -116361 -53051 -109093 282861 -232682 -216810 -174610 -104893 -112071 70473
10826 168179 30447 36712 -261591 92968 -227082 -28026 223565 -53554 53526 -197097 48507
10814 201037 60738 64749 183278 -49335 -23531 -15047 26607 214816 33954 -120181 -257309
10803 -257309 -70074 136876 -81496 60623 76560 10707 24754 -40051 141932 166720 -198341
10791 -154112 6145 -24680 26868 -87618 -89323 -79638 -275188 -242891 84999 -15492 35998 -116845
10778 -19430 -260365 -51547 93755 -269525 -113436 -98731 95042 119259 -47834 -263089 -146651
10767 -146651 -50362 -40494 -93649 -37555 -300537 62984 -63563 191824 -114603 -115142 -119418 160983
10754 -241068 -112583 208075 -100655 -129552 -213729 125888 -378153 -17028 -8024 102939
10743 -186464 -181217 -133696 -361983 -192143 51501 108944 296669 137285 -231808 271954
10732 112751 -25613 -300147 -40045 120324 -155222 -269868 84856 133048 92427 -182882
10721 -179100 207599 79735 -335459 -263299 156333 -87454 202634 -355622 121138 -83390
10710 196842 -136137 -111607 -124200 -170681 207002 -191054 -279123 -58288 100335 -13216 -14334
10699 -14334 -359265 131616 50943 -164888 130233 -174247 -292822 273795 -44797 -111004
10689 -111004 -268059 -224440 -227592 223390 65536 -199486 -99684 -77167 -89761 -120409 8856
10677 11538 114681 -286041 87379 185427 -69499 -146155 34450 108449 81521 -52500 292494
10665 -72707 51557 132314 62645 104761 -76464 -45293 -98396 -309040 224737 185496 -134346
10653 -220044 -155153 -155319 -32797 -17189 198152 223816 -115682 -28767 21713 -122423 6938
10641 -197430 -96218 -41190 -369367 190790 -63287 -9310 26018 16033 55294 -83966 -136539
10630 -136539 176096 106172 -20440 -72575 -37463 -151552 240799 -97311 202376 -90377 -58950
10619 -58950 -44876 -63401 -284338 173179 172680 20209 190952 -83363 239766 -74566 130612
10607 -75789 128891 -204087 61150 72912 -157232 279141 121703 35381 98798 8685 28320
10596 28320 57428 72753 4621 -37533 -163259 -125127 -218698 1561 -113931 92102 -61031 163913
10583 25341 -151040 -206986 95435 -54130 -161629 -56682 -268435 -114945 102487 83537 -287914
10571 162752 -35617 -221226 -2716 -45537 135532 -177516 117707 -218601 -200508 7418 85049
10560 85049 177261 -82497 247632 47541 -80196 431677 -175503 -367942 58369 -23725 -315604
10549 -315604 67075 -120308 -129729 126975 -134337 -266530 -226174 19225 -41633 -342924 15583
10537 -166827 27361 -320274 68119 -166802 77187 245682 -74768 -169230 226097 -265405
10526 -140235 -55050 -204177 -22965 -122459 -166631 -312621 62958 -262703 -193176 -94506 -126323
10515 -126323 -325530 -255382 182391 -26726 34345 -1680 -239983 131257 -145829 193741
10504 34861 70310 35547 -1355 -16359 -132344 49066 63878 189571 87143 -58640 -198302
10493 -198302 -265635 87968 -194401 -158757 99638 -175952 211449 -183785 -8250 -246290 223267
10481 158931 181171 237416 82060 433884 -8156 67076 150334 -97656 115314 -118402 -339445
10470 -339445 -135492 28230 -122628 112017 -206954 -364400 114170 -57157 14537 -218476
10459 -193115 -280843 71754 -199211 163584 79097 -105808 56768 -66858 -24980 -11219 -280360
10448 -280360 -28930 192265 103025 91264 120441 31196 -4408 -105361 -330155 49779 -197936
10436 39441 -53094 160028 -144922 -260059 -142967 284439 -109995 89162 35876 -114521
10425 -231808 -209881 -323744 -119467 87449 -198569 37596 -3427 -243710 -17112 140388 58563
10413 -9487 -249586 -134012 -201080 -230726 -228878 -566454 216590 -179520 250150 40022 160062
10402 160062 -125558 133186 93645 72050 -22777 -181206 -99917 171380 417571 -300681
10391 180055 87186 329258 138017 -147024 -16678 -252682 -24354 -194739 149116 136548
10381 136548 86251 126825 -83004 257561 317046 166271 131862 -249525 147240 234819 219213
10370 219213 -61005 18450 163857 -33431 -4475 -103755 239272 241717 99688 -55489 302671
10358 124833 131850 143688 -80617 464373 240475 304665 74675 -30830 150943 46814 101460
10347 101460 118102 162267 159298 268455 389370 338862 -65164 193957 11075 -152941 116982
10335 296357 182798 165997 22905 -174836 212875 110155 -251361 -158951 118835 155655
10325 155655 -125225 268292 -121865 372165 -258725 -89600 32387 -159213 116666 118742
10315 118742 108846 32553 190696 271049 -20829 267539 -169299 -297697 138546 -192352
10304 -323753 1372 -59004 178622 -233 327444 -75083 -113425 51777 -90430 -343411 231827
10292 -8211 222039 172694 -160417 52923 -10819 104509 72729 43754 49274 -329131 38879
10280 -22375 -206228 -90892 64926 -303555 306468 -352484 -72039 -55334 -173147 164160
10269 31586 -69167 -5606 -204834 91560 19432 79549 -35642 233790 -40494 124546 420292
10258 420292 176324 340133 -108878 333109 178586 115030 36979 -131899 95190 -96483
10247 -27641 -133032 219079 -246450 -23943 -196020 163220 -256697 11469 -116160 -46250
10236 -20077 -59368 -107357 140568 -256500 109487 129899 -291609 279589 -88030 -248682
10226 -248682 -134276 -120133 -13743 -1513 -18430 -373595 -107591 150374 -427431 30778 -289743
10214 -16223 1804 -92146 -319449 104354 -34081 43693 67760 144291 -233281 -5944 -19480
10203 -19480 -96491 -76119 -164067 -125895 -80674 111943 89083 -293651 198673 -100937 225470
10191 -153772 -224945 930 -86237 97983 -127194 22795 -38097 -14644 60661 -161341 205698
10179 -91188 -272546 -16530 -33999 -123662 -259305 331252 -205971 109039 -33466 138507
10168 100022 -5804 -109742 -41474 -20231 -47214 136619 6135 -80307 -154282 -287588 -59209
10156 126674 -112985 -178234 -284415 -33478 -459609 27317 -257513 -182286 -61060 62474 -56098
10144 -33141 327834 -74925 -140457 59622 -185943 177589 -18703 -60073 -94770 -2943 3438
10132 8824 151598 -313489 81135 135106 60405 125949 80314 -243829 -41609 -115664 -7769
10120 -239296 -130517 -316074 -65613 -6113 -46049 -204576 -108624 105431 -123023 205319
10109 -313188 72568 -133700 -207626 -450021 -59546 76767 -94409 158051 39356 73548 112043
10098 112043 -217418 520 185247 161757 -28538 -36741 -69302 -12921 -94041 200621 -155302
10086 101012 -195721 -216052 -192811 -106197 -60013 -130066 -83636 -268855 -52500 13156 329958
10075 329958 -262618 87513 -311431 -15070 -110029 -107692 -382597 -133738 -67188 -8476 -85323
10064 -85323 -9926 -143715 237841 -171131 -2222 -232879 42413 16703 -118597 177489 -243292
10052 60860 -251477 106205 266347 -28101 122666 -33642 95770 -161998 -141259 53651 -149928
10040 -157732 -69600 -173213 -244913 48942 -73635 -43357 163283 122011 -229640 92832 149735
10029 149735 56311 82374 -48477 -170608 -65720 131951 -24188 -88387 -125053 -187832 -304667
10018 -304667 312892 223900 -185809 -65279 -22261 306964 -185048 -202783 11381 -205774
10007 -147223 -2068 -212632 -159320 -141342 18763 21281 -273412 -112985 -103519 -70860 226406
9995 -46285 180962 -163542 120221 132793 21051 -225121 -167778 176703 -166220 -89181 -415755
9984 -415755 -183939 -66409 -154025 -202812 -50449 109428 -329469 112287 61840 66988 350997
9973 350997 -500772 -141284 -34541 10862 149280 -53433 -105958 -299346 49021 -135175 210388
9961 -176494 -210561 -205791 -66151 -18530 -197504 99183 34598 -482276 -315805 -71278 -199211
9950 -199211 237606 252207 -46937 -251754 -9238 67496 86141 -213980 -75240 -188108 -149835
9939 -149835 35987 33885 -7497 -56758 148837 -185891 138986 190890 -41762 -232428 181534
9927 -218273 -273959 -246643 -21128 -33228 -155293 95623 -265919 -383308 -374943 -161000 -53783
9915 -312287 52490 268034 166563 -60144 14930 -109352 -5106 -156614 -181557 122373 -42873
9903 -105901 90787 113362 208576 84527 73960 -107929 -4623 -175128 44449 24695 209630
9892 209630 -376433 -317073 -31110 -58370 17220 163895 151286 -101875 -353116 -241253 47799
9880 -249784 326332 -140488 10886 232481 -224037 168767 143076 83597 -88597 27792 -297866
9868 -163683 145752 207916 -187959 20114 -91728 2624 158317 229360 -49736 -224115 189008
9856 -120478 22175 59188 120008 -30168 -36908 -76158 -85719 -148027 107679 78486 39048 -19113
9843 49351 121765 123753 3302 -156070 -11526 -300127 -187725 82665 -72890 -6680 276256 -259452
9830 -113425 22326 -334102 -65111 -361503 337374 -151875 272668 -129327 -51678 -123250
9820 -123250 112464 -213922 -214923 -58486 -358893 6193 -256900 -10195 394585 -265407 140122
9808 283163 -7442 -71130 126067 -61437 55483 -79841 140513 -135911 -21004 36304 -265532
9796 -4742 -156322 80288 20386 -77567 -134541 -223731 53704 -286758 305338 60486 36805
9785 36805 129487 -565369 -89882 88758 69777 -52646 -240860 -144024 -248123 43520 -30971
9773 -91109 -101601 -1525 -13087 -263719 18950 56463 -210501 -251726 14580 -190409 -113457
9762 -113457 -193585 -12783 -228195 -266405 -143170 84420 -127629 72372 -162987 -625078 -127695
9750 -261868 -59010 -241966 -175153 -141540 -217292 -40980 -100818 17403 32142 -40872 111148
9738 -144258 273721 95832 61665 57992 62203 104620 219354 -97210 -60666 -9829 74675 2688
9725 -152024 -67659 -195295 35510 -89830 -360598 112380 111522 10035 -213840 -146005 12004
9713 -330715 23500 147426 235559 -33000 -43166 69059 -121221 -58396 -73294 -121434 -61649
9702 -61649 81031 59625 41791 -174638 62 -260400 113667 -22931 -282675 -12821 33533 -213442
9689 42401 -110795 -47050 184695 87497 65939 -203614 -24128 72001 91346 80663 55968
9678 55968 205107 -160993 1866 -230497 156464 82412 -79762 96814 -159027 -146226 -27456
9666 -351585 -115854 -261760 1516 -80368 219982 -318759 -26447 -78550 35122 -228996 -158868
9655 -158868 -396054 -172247 328608 -277088 -131464 -84617 -26799 -240143 -231567 -294957 -155803
9644 -155803 -99209 -15070 -189834 -161738 -125080 -171950 -131095 199767 -31848 -63559 -120539
9633 -120539 12143 38625 -200874 -230179 176276 -34079 98876 -65892 -174833 -196725 -41586
9621 -85868 68828 75914 -254881 -83338 94705 -35 172013 113910 -148254 211873 273321 -238315
9608 146822 -343738 201212 -137731 45748 78172 3423 256985 -13981 -248682 -217417 -102880
9596 131179 -565590 76564 -232775 -124140 -67958 -201182 129199 159241 -164579 -173934 98443
9584 -367394 128875 -66463 -161111 -350156 1392 -62534 13277 304578 -160552 -240633 -83443
9572 144293 108475 31370 167760 141957 -108596 -44822 -179474 -173229 -73564 15257 -47918
9560 -79884 -142317 145800 177817 -29235 -7760 225344 75734 -189998 66792 162485 118067
9549 118067 -90528 59002 -98215 147946 65724 -76452 66153 -165620 32264 -176786 107585
9537 -171193 -73023 39938 -13033 224867 -91985 11789 135997 -87367 -107795 -59461 -42987
9526 -42987 14237 -337345 -48948 78086 -148381 -159245 -191759 -78585 -220506 182847 246539
9515 246539 -63238 -66212 16252 20891 -202420 -400908 -106349 105907 235150 60389 6274
9503 -173733 -25858 -66111 -11187 -153576 -20884 -186036 208124 -60606 -326700 225872 74417
9491 35407 -23023 45596 10707 -70476 -185543 67395 -157065 -108640 -749 124605 -44581 64308
9478 196617 -193795 153422 -58568 -223420 88224 -216111 -342328 260169 175738 -169534
9467 230428 85019 32071 -218625 -323477 -311507 -57680 48867 -226408 -95891 -165598 -18957
9455 -323479 -250332 342737 -355102 38489 20625 103892 -299872 -251433 -204973 225101 25751
9443 222485 -69374 -73132 -229067 -340387 144578 174006 22266 -289320 -85837 -101294 -20289
9431 13577 16695 -88601 191387 80437 -397114 227083 -49362 -353536 -114006 -465358 71978
9419 -77394 31261 -109073 34075 166378 52100 -3868 100375 -286974 98082 -320291 128452
9407 183681 -31321 167751 203095 243283 -191525 137461 85265 78067 -30417 -131357 72508
9395 -141326 -30603 -143999 -3461 97150 96199 -49823 32937 -217482 -82209 36025 -162986 -442519
9383 -442519 -232625 -303895 55409 -88806 -420313 -81779 -272832 -226454 -150351 -178262 218201
9371 79844 117006 113749 7284 2516 83480 -189889 11348 -137240 -6603 55668 237990 -64710
9358 -98225 340301 -243880 135301 66503 -42430 -28862 -28732 108798 -131058 -204788 -260240
9347 -260240 -8919 -71317 -238776 -206616 -69230 -56895 -195778 -148564 105311 -234751 -229048
9336 -229048 -10251 -198984 -5910 -32051 -320411 -232250 -141043 -225895 -46339 75936 209592
9325 209592 125171 -302815 -232658 -140010 -269718 125575 214037 198164 -117190 53106 -70948
9313 -106534 111509 172483 -41911 213903 -142881 -280405 -109849 -17509 -184813 35623
9302 -88 -125083 -121528 -7845 -30008 7991 5181 145798 120944 -195781 -131160 -216634 -226289 -109140
9288 -191674 -170750 -354846 -7095 -228161 210817 -9356 -61748 34540 -153591 190972 -269019
9276 12122 -3542 -77895 -358338 334997 -238034 194823 -159835 -9877 -106511 -113218 -77496
9265 -77496 -40943 216668 2142 38219 107991 164002 -706 148691 -220330 -490665 -52553 -62967
9253 -62967 -161854 -208179 138306 -191969 -148102 184015 -95712 -101746 26784 -241798 -160922
9242 -160922 47774 -195864 -105839 -126415 72930 77076 -463373 -105033 -196148 76111 106500
9231 106500 -117838 -23805 -231679 20423 -326978 29962 25997 -116249 -45847 -226064 -113326
9220 -113326 -250267 16787 -12086 -29586 -193176 331093 -29538 83849 -135223 -260452 -49790
9208 -14928 -27419 69740 107943 -292021 26889 -202409 -45662 211799 -60745 -232193 104967
9196 -125486 122576 32653 156923 -18887 -5721 117221 -271337 -126166 -431210 146073
9185 144619 -22202 -74591 27386 -94898 68974 77993 -74734 141840 23439 301739 -214109
9173 -67358 -176801 -261516 45478 -160043 41921 -75264 -231717 151027 -17311 -67681 -178034
9162 -178034 -533800 115929 38404 169548 102793 68959 -270178 240936 -17014 222793
9151 -203726 -42287 132397 41998 -284490 -156918 -52146 95621 -134493 54548 -8902 181077
9139 -66306 -52238 138994 130827 118183 187904 -137997 131980 -174296 -382064 -238962 21503
9127 -245889 15678 -219132 77930 4676 214003 276977 126841 -59650 -14873 -289479 19903
9115 49633 122072 -100416 -114635 57124 352972 67718 -162862 -291328 272620 -262129 -158586
9104 -158586 -229214 -156234 -71116 -58574 -144099 177833 -159128 -167515 185704 -132633 59094
9092 -188070 -178232 71816 -60445 -41622 36108 -477698 -114359 -120883 -274367 -60633 197255
9080 -253450 -60279 -139380 -309033 308156 157948 159130 308046 -225511 -372067 65571 17364
9068 -128071 -62660 22870 -270792 -113747 184892 -341615 217905 9439 -41759 44911 15425
9056 -242425 82766 109983 -747 -49958 -325091 19253 -55558 121360 12237 158103 -31585
9044 105503 98731 -2486 -59794 27017 -244982 199029 -254846 141660 -159282 -51028 108453
9032 -77984 103574 -25461 -152237 -310863 -42076 -33501 51702 -75006 -210328 276869 115396
9020 -194601 -380604 5890 -39720 185263 -105663 74372 -94284 -25619 -149558 7338 44878
9009 44878 265737 101009 -341791 -17577 -571936 -69525 -107852 183292 115828 -22688 -270
8997 125639 278104 78411 -180792 -195195 -113371 -71728 -266281 105478 7476 -9216 -82618
8986 -82618 -442129 -175830 43924 -149355 -160606 -235754 -13229 763 -136813 -29676 -103777
8975 -103777 -112947 216450 -31698 -220372 159913 -291376 -90488 75603 131966 -19521 -124226
8964 -124226 106136 39749 159130 -38333 -110300 -95684 8693 113249 142511 -253886 180546
8952 -170488 -61733 -281319 52490 177695 25718 9316 -151325 -183679 226378 -256191 107609
8940 85228 -69313 71483 199209 -137425 -160156 234479 -55779 -145693 -163795 40675 40535 204343
8928 204343 -85630 -42044 -7799 119174 80914 31933 305996 481136 1755774 3672525
8918 3672525 1808934 484109 110049 -113958 88790 -11002 282221 -11681 -45862 90350
8907 16608 158831 19571 -79665 -210033 -108719 -135988 -416350 -421623 123644 -192485 -280496
8896 -280496 -176609 -76391 43124 51494 -113985 102447 57254 -242454 -2397 22142 -37949
8884 -88971 169395 -154725 -4330 10860 -50151 -253819 117583 -69942 81072 -115248 -137590
8873 -137590 97474 188078 281216 14809 -84738 -104960 42687 -224263 -36107 -46726 -3173 -18351
8861 -18351 -184489 -153607 215563 160667 -48034 -125403 -192216 -91976 -109533 -70556 29741
8849 -97737 111282 -119498 -113027 -1490 23964 164722 -166282 -251816 -102541 -112650 -21767
8837 -17615 -213230 -351259 -387307 249955 58186 -196671 43290 -139582 -165479 -103451 141271
8825 -53212 -161405 -80375 -45693 -114666 189760 64905 -102985 144056 -146218 -206892 -27854
8813 -158941 -468426 -248798 -313416 74831 6688 -65064 -108487 23775 -41336 -95203 -38524
8801 -65742 159593 37281 41005 -299527 -9527 -89310 106812 -91770 -36855 -13770 3192 56470
8789 56470 201164 -64563 58137 -15572 228019 -79733 21907 -180492 164065 -63256 -99565
8778 -99565 84166 238437 -53808 -259073 335394 61567 -100216 155450 22475 119675 95450
8767 95450 186648 -79633 109360 373843 -194151 -344354 2968 325184 -148579 36280 -162108
8755 33142 333068 153479 -488464 42712 -323657 -404321 94886 -82600 -329282 252611 87891
8743 -4759 -102182 106728 -79834 44169 59093 -31462 -52661 -179759 -57485 95811 33014 -363611
8730 -161731 2326 14597 28217 -110374 -89428 277817 -244327 -364436 141215 111151 60265
8719 60265 229326 -122744 -53288 -90555 -145568 -64914 53787 -51750 -27582 -83254 154645
8707 -285306 167444 -89170 -341836 -156572 -48595 -60496 31375 164511 127803 18418 143135
8696 143135 138040 29765 -204493 -147746 145267 264026 -55997 238655 17222 -263214 -291662
8685 -291662 -345286 -251787 132040 100386 9901 97221 -284659 -201230 -138524 86046 377512
8674 377512 240086 -39329 88663 -120222 -173292 22883 -54252 -226245 -53840 480091 -254240
8662 -85938 -76256 -71203 -191330 24260 -5798 44964 59802 42970 -73444 163203 256862 11245
8649 101378 10310 -241936 45027 135705 17831 -31789 -67212 -161880 -138997 -248858 129139
8637 -75487 -184532 122369 135314 -220830 -27895 170909 -27717 -139472 30648 -53015 270536
8625 -60371 189128 -136166 -104428 6657 -136349 -228802 19577 -246731 -163961 -213132 -4091
8613 6484 100046 -42488 216079 431700 -305687 -66185 -89948 56759 -72758 -26097 -211731
8602 -211731 3524 -168429 -128031 -53685 -141824 49501 18135 6042 21913 131648 -117384
8590 8586 -32345 70693 60276 -357835 -18776 67371 -288282 -28713 -244705 1330 -28460 -104880
8578 -104880 -67282 -265805 -74547 97290 158997 -430530 -80196 -26534 -16450 -128989 -191724
8567 -191724 -341800 -138037 -50102 138667 -180717 -186160 -102298 -152022 -324322 104561 -50259
8555 -244030 201448 85466 -125032 -233217 5717 77058 -106018 56858 -91534 -9411 116572
8543 41717 -93258 -147979 -132659 30858 97407 -446463 47836 -105935 203483 -17536 -70398
8532 -70398 -123159 -47630 66486 171993 275189 -145744 -41974 -130538 181294 -198762 -120519
8521 -120519 -127795 17552 170410 -207169 48353 49613 -345666 -361170 -142241 -205060 -177935
8510 -177935 -78599 278444 81065 358063 13305 59701 -101701 -65916 -79562 131954 -233950
8498 -105416 17740 -74189 7501 154884 398313 111931 -283412 -208311 -113469 41895 -169759
8486 -91459 173918 -40761 -358481 -147164 -60729 60740 367974 -185777 19600 -117160 -88801
8475 -88801 -74896 -202290 12568 375589 -180343 19813 113791 -156094 -80021 131689 -78781
8463 -150112 84416 89854 95656 -60575 -49023 30222 108145 93662 -97201 -2485 -387440 -63286
8450 113384 -14940 -119145 -202428 -171816 -125251 167402 9748 30881 -212283 -214443 131439
8438 120687 -145162 22238 21067 -23295 -54786 116358 -192309 12914 -89246 65015 340333
8427 340333 110102 -58091 129714 55177 -155904 63439 29498 -231518 108646 207591 -223268
8415 -32495 87207 91331 -107094 -34569 -186885 -177442 -33068 -123603 -9828 170433 -33112 -80252
8403 -80252 5166 -111288 275462 -234 -337022 -141416 351273 -92662 -26600 -136204 111412
8391 -293369 -245132 -64677 -105761 -148439 -195563 146841 -13112 -63699 -119715 -106155 119042
8379 -95221 -100805 57053 -203515 267476 -22035 28918 190555 -43054 -282008 -9378 142545
8367 -3072 -148484 -31326 -291736 272507 16550 -167712 66157 -24931 -15994 -77396 -203770
8356 -203770 -77364 -204991 142927 -75049 58232 13365 -155886 24602 96723 -21855 -23046
8345 -23046 107672 130198 -101845 -244116 31501 284583 -240973 89955 193722 -115731
8334 -221212 -165099 72413 -69217 -115793 -343850 83178 -52912 -316084 -422720 -144963 14267
8322 71501 278922 -181154 169144 -335037 214454 -155071 215795 -175857 2591 98725
8312 98725 -74231 -48392 -34733 -35334 -200754 -164106 -82780 136097 176956 220521 -130303 -71469
8300 -71469 -444248 97687 -87315 -88293 -60235 -218257 -283048 115068 -98355 -64461 100446
8288 -13922 -179122 -46655 -233833 -447965 144835 -251612 133506 -287196 -98464 -32545
8277 -244586 -185089 -239585 -36889 -43605 -76504 -5988 -336358 -85075 157634 -164378 89047
8265 182368 -218379 6131 -31109 59560 -145154 40995 -94616 -234484 55120 -129910 -106963
8254 -106963 27514 -135709 -186912 308504 -206161 179963 -19380 37367 -36957 -35478 -38329
8243 -38329 -516434 28045 170464 247442 72142 311966 259213 -49448 -329632 77507 -25101
8231 -199635 213982 130178 -18262 -34025 -162709 -109017 -151290 -120879 -74225 -89135 -276633
8220 -276633 19016 -77317 -158061 -41598 -280796 273410 -291945 -35475 -83683 -45124 -83505
8209 -83505 -87345 96214 60790 111591 -156319 -101672 -324467 -35665 -179729 -50968 -1588 -58806
8197 -58806 218706 128805 10075 -211632 -262151 -123432 -101776 -116472 -45167 111257 246757
8186 246757 -122867 61258 49826 299755 121267 -8799 -223110 -139930 126018 -99102 67016
8174 -11360 30501 -120759 5517 -178488 -117770 271880 245674 -21935 222209 -26192 -45548
8163 -45548 -27055 157895 224344 178984 12475 -175300 13607 154646 -20672 -147682 330347
8151 -75834 -78822 212783 -279056 -90219 70471 49071 -321805 32983 -120221 -230872 -19263
8139 -108081 69888 113275 -498787 -18939 239917 -393594 29705 -110809 184313 -76037 -251231
8128 -251231 -171156 -261418 -67244 13727 35284 -271802 -218736 -22070 -226714 186899 -60655
8116 -132445 84613 112793 -255655 -190656 -112281 108036 -63686 -60892 -130828 -182698 -424080
8105 -424080 8684 199120 -132041 76667 -176474 155815 -17769 -147583 -46630 -78970 -228931
8094 -228931 -297484 210480 -26030 7275 128864 -96153 -235975 37881 -39912 215908 -290767
8082 -183791 7664 263159 104840 -324384 -46853 11958 -88988 41131 -43775 -234125 -206179
8071 -206179 -36946 19893 -99053 -115616 258360 58128 47588 4693 69478 -52333 -169195
8060 -169195 -386065 55483 -200004 -348615 33234 -45129 -18949 115171 -132495 -97624 -225282
8049 -225282 -333250 -178207 39373 -57851 -83852 -115542 142197 151474 -189856 311757 -249114
8037 -143115 296573 -150833 -253173 -41316 275058 -70796 399 -35878 15462 -305877 -79760
8025 94831 30074 42886 -315053 -154895 -161383 -333022 -89293 -103766 -345881 -172046 -161276
8014 -161276 -58529 94317 108830 138425 59522 -96399 -204407 50195 -13581 -123576 -61245
8002 18341 -93027 -242574 2483 -235838 94164 -190908 -411779 -112014 5245 -281789 -118957
7990 -109209 -52399 -252245 35701 -27575 -212995 -120455 27611 -239442 -232481 258217 -126618
7978 -82389 287918 18739 114414 -155864 -185753 8403 -15368 115854 -379563 -56367 -9801
7966 96451 270067 217750 9820 85627 61044 -39586 203032 -311562 55042 -186908 -405015
7955 -405015 -135492 -250108 -125696 95081 192054 98998 -219846 -136424 296964 -109546
7944 -10154 44197 -137445 -41438 73537 -144134 163310 323093 28062 217490 180290 -78509
7932 -252554 152857 -384646 -87753 -42456 175941 -72688 -78024 404686 -118729 1474 -128852
7920 97516 -233463 59468 36944 -268795 -169780 -78419 -16155 -298810 -37596 -124716 -92122
7909 -92122 126846 -107165 -116241 -91854 117595 -42719 -66833 -242553 32759 -238261 -26914
7897 -267888 153246 20455 551854 -157387 16377 219712 123504 -29865 -223965 -351380
7887 -351380 -157516 -278609 -296522 27675 -120605 -222354 -114838 -209458 114278 204955
7877 204955 -215771 -161414 -92631 145029 6391 11477 -131095 -161956 -170968 -196206 71619 9375
7864 -73080 -318741 -44064 -121666 -199094 292045 -21160 -103741 -109106 219555 76480 183457
7853 183457 4622 -81075 157899 -170801 169725 36268 113737 -212320 -203494 59661 -69641
7841 244941 -108604 -163135 -90912 108986 -115905 100536 130206 107528 -130414 -142054 191821
7829 -93202 186624 -107681 28489 -350739 -82723 -81088 -202717 -180271 5331 -4596 -92313 177923
7816 192572 -104185 -184298 -70095 -97104 -79472 60263 285596 -125900 -26702 110640 42071
7804 23818 -73539 -50401 2526 -181589 52557 -24457 -47885 -117648 -187109 150057 -30108 310665
7791 -92286 -19971 11309 -22053 -42629 37219 135905 -114724 135873 -2985 281377 -107312
7779 -29687 161546 -205016 -8484 -35893 -123849 18633 50855 -270853 -97162 73250 -113715
7767 27896 13657 -160176 -84886 -110097 -284389 14902 288560 -27056 103051 -111727 -132291
7756 -132291 8007 105608 -171702 72956 -158689 -59099 -284962 -228828 -36571 -107593 -101003
7745 -101003 44554 -53570 -182888 172800 97904 77714 245286 93400 262883 -51013 -87943
7734 -87943 -135251 -15066 -19257 -24311 -14458 -269763 -111194 128396 -77325 129140 548069
7723 548069 111115 -113308 185869 37695 3893 -65500 89538 -279294 -83765 186199 149840
7712 149840 213683 45008 -112181 264051 -48077 -25370 299774 -252406 -59238 -217100 49373
7700 149308 -122932 -111895 56171 -294318 -57878 65692 -153785 218563 -11276 -237721 -389997
7689 -389997 -169432 -131760 -59133 -193190 91493 -92335 -29448 33496 -49965 172285 -50836
7677 -137458 250313 598 -64656 167941 127363 -306930 -159982 39305 -143128 -417200 186501
7665 -28027 155951 489573 230247 -99059 -80786 89993 -91551 105168 -236102 17384 -349165
7653 -2845 172467 -51994 165878 158040 -144445 380211 67653 61102 131566 12518 159403
7642 159403 -171051 -187912 -28296 129555 194976 32018 -87459 37461 168134 173022 87545
7631 87545 -375919 -57047 109785 -50397 37167 -257090 -158905 42118 66956 -178140 26756
7619 183788 -330349 -103010 334715 230013 -266449 -167617 -84061 -151699 86444 155312 -141804
7607 -282887 117871 59861 -25572 107950 -5354 88833 38642 -105787 -281593 111757 -27027
7595 -8809 -85440 -135948 -211534 -269344 -376398 133345 -2030 -162642 132369 122561 -390040
7583 -455059 -243853 -161485 242968 100100 -42345 -37759 -134541 -209989 -216013 -383680 -103438
7571 235442 -21467 222394 -70630 254081 -137775 6623 37204 141613 115627 66598 137407
7560 137407 283541 -171277 104495 -232460 10627 281643 54423 40020 36810 177308 -69691
7548 -148726 -206287 193860 176770 50015 -27288 24778 -151934 -98357 -76316 -121997 -242545
7537 -242545 -64658 155297 -23772 -174629 269027 63502 -51161 -211275 287650 -188506
7526 -79227 -231538 97342 -59840 -133449 -354475 -25177 265621 -141916 39455 -277330 -181720
7515 -181720 -185698 48828 2237 -159974 185050 58878 -4031 201920 -107327 -120834 -213704
7504 -213704 184583 -84411 301309 -180549 -21463 -292853 4221 -73290 -142173 303933 73614
7492 -217815 -118550 348845 -70714 -40469 -136144 -66378 -192746 29041 -114124 -199788 4407
7480 -215563 -38668 86017 129563 -208478 99566 -218812 71276 -190857 -254436 90389 -80351
7468 56478 46731 114481 39094 74201 -12364 -463931 -5586 -125273 57584 -66182 -368447 13039
7455 -47788 -223983 -51958 136676 133828 -124763 -97685 280569 -37113 67858 146666 152752
7444 152752 30191 -159403 54087 354175 -386192 -112120 -23730 -52518 -115958 -156140 -58333
7432 6083 106368 -89066 300194 62630 180354 -4367 -260645 -179044 -200662 -55861 72975
7420 30261 -70138 -118599 77625 -146695 -2255 -13072 222743 206852 -87686 -299882 241389
7408 116454 -122508 218547 -151820 -200286 -237834 -46185 113216 92258 24 -18209 272028
7396 290248 92270 -272041 77741 -120305 -165494 194813 -71574 14527 96431 62071 172101
7385 172101 207294 99111 62233 96150 -239033 -124688 180890 -273926 592 -196438 -344465
7374 -344465 -280613 20059 -134776 -197182 -95875 69526 140765 -270170 1227 -101246 -114866
7363 -114866 48915 206534 194269 -13106 130904 -55924 59741 157069 3979 239519 170933
7352 170933 2556 -118227 123278 -166962 48160 -188339 72505 -375669 -61987 121980 -197498
7340 -85345 -126708 227033 41346 70012 -94995 152635 -128778 93258 -73943 -38564 63770
7328 -382897 -289541 -4956 112911 95162 117521 -83906 -120293 25061 176706 -131347 17713
7316 -506794 -219913 119174 -239500 83398 51960 1363 65874 -112766 -30176 -149541 -50368
7304 -135387 -203565 -161286 288272 170975 76712 105143 -104128 78582 -202943 -316405 270684
7292 -52151 -99205 -203525 -41763 8789 169881 -68421 -1142 80089 121391 -58882 -262686 89102
7279 -90985 9550 -285678 -10587 -291333 227863 345058 54997 132181 -70878 116862 -56381
7267 -313397 67357 -122890 -9655 -238812 398642 79410 50665 37566 -239898 253407 -343175
7255 -48861 136621 -230729 -114244 148154 324744 -174479 28017 55303 -6345 417151 -183677
7243 -187338 -31190 -234834 55053 -264869 -261526 -170521 -22849 -101215 229132 82138 67234
7232 67234 -69943 32591 -108481 -297297 -45646 -280525 -42020 -157335 -62797 205781 158480
7221 158480 27152 -386950 30404 158423 106462 98965 -134134 -11393 -258214 151321 196765
7210 196765 27625 -6684 79022 93284 -183906 51205 198534 -246702 11391 222686 -127857
7198 -54860 -52208 8515 -318573 -74436 34872 -97637 38178 -258555 55863 -318132 186884
7186 -17807 -81560 -60983 133861 -237590 -216517 370216 175172 -332377 -78442 257981 -191626
7174 -125092 192779 56177 246776 65593 -12855 145874 35302 -65843 109734 -174859 71282
7162 -141275 385243 191318 95534 -179924 -140299 -281671 268352 157775 215814 4330 -402693
7150 190389 35648 117350 167512 -307262 -101408 49909 -235368 -41718 -190301 218461 121403
7139 121403 -38859 -61315 228246 107310 -93315 -91955 -340849 -24496 -488547 -144497 8009
7127 56213 1675 84845 -138548 93128 406655 -136718 154936 -5696 275913 272638 -43431
7115 223732 -11419 55088 -120102 30506 135177 230421 -235707 198285 256692 52388 -297447
7103 -186432 -204932 50596 17043 33765 -138119 -67190 -241382 113472 -136495 -108563 -196012
7092 -196012 -117553 109221 205588 -384675 -250066 -237276 -118849 68011 2097 102542 169075
7081 169075 92687 79341 -134418 40706 63615 -87314 189588 -188592 83423 71873 88481
7070 88481 100226 171780 70643 86259 -31768 133602 64407 142952 278429 -71339 128009
7058 7648 -1383 219359 -102143 178642 -103440 140907 -177443 -25182 154357 -50614 -12734
7046 66408 -352141 -91207 -238884 61110 -245477 263077 -177080 -71754 -9447 -114137 -34724
7034 76604 685 -37853 140234 1117 -9808 -228661 57892 71948 166117 46719 -30399 88291
7021 68827 123340 380688 407727 130679 -406598 3997 -263900 56342 103827 299154 111990
7009 -265757 71813 61916 -82243 200666 44599 -22149 8852 -86334 7712 -32317 -305561 -25342
6996 278087 -21319 -266789 -181318 89035 -290247 -129638 125871 -143058 -86466 102419
6985 -134189 -448977 163336 -21713 -253475 -134 185170 86106 -69664 -261061 -422521 -89541
6973 283826 -128648 -171309 119510 -147614 62849 -55999 -67173 -91003 360489 -162598 111540
6961 -177809 54215 -62615 -174136 -300623 27503 207489 101015 115128 263836 -42604 -54523
6950 -54523 111435 -114670 -1349 153926 -96215 -115366 -21201 -129335 165104 18543 29825
6939 29825 255399 -210589 -30089 -36124 12417 19465 192142 -172837 -46040 -43689 -81085 -136716
6927 -136716 -861 -51106 172214 19948 -216666 -147745 -123313 -260085 370124 -438350 -98952
6915 -116657 -110789 -200689 64991 -4748 18181 317940 -24055 -246730 -122309 -322189 -28629
6903 -180155 36781 74170 71920 101316 190955 -137493 -11839 31097 175750 -206117 13832
6891 30783 -242496 221722 -29724 45016 116461 -380819 128205 -106783 139873 -84393 -339722
6880 -339722 -243266 -173716 -212153 -94714 76014 -167142 -452358 140215 -99389 -265592 72557
6868 188996 -38052 -140422 -120705 85118 -73170 31936 -214434 -10941 7216 -75675 90372
6856 59150 75292 -210432 -209509 35928 -39862 106293 75643 92017 -7792 -136982 -31517 -185532
6844 -185532 -110644 198336 -9375 -152929 -37212 13823 -8313 141010 156175 18429 -189387
6832 55109 103246 -514539 119320 58270 -50890 -84708 -104809 186128 -38925 114118 -217532
6820 10691 -128760 -93472 -76660 90944 196384 39883 -205686 123417 -22379 139910 -430021
6808 -123722 -105084 -249165 329606 202957 -21346 -203679 -217118 87547 -102857 -44649 66155
6796 -57627 -46486 -39493 18807 125431 -182491 -188092 130500 24676 110898 -59117 69371 4105
6783 -103758 -27649 -290787 173087 263542 10197 466827 -57962 88972 30828 237432 198441
6772 198441 134583 -59079 225914 261881 144414 -95477 -165436 220556 -213607 239875 -80396
6760 197797 -376282 -99470 145351 -4033 109422 196311 -34012 10314 -109317 -62309 -308174
6749 -308174 -21015 -14125 313133 8616 512489 120308 -138932 156081 -72804 -118691 -93075
6738 -93075 -184395 -187956 -143925 143961 155973 -69571 -32976 -154389 -67575 -373838 -238429
6727 -238429 -263046 -110944 -144839 -197167 -476614 148512 -214914 80728 121368 378854 -73292
6715 -78322 45451 -22940 -157080 -159406 -173508 62631 -19133 -162285 -43371 -25073 -78663 -334263
6703 -334263 -41581 -147349 85420 -330729 87778 -25919 -14057 232253 106300 39066 290065
6692 290065 -103100 265990 512525 -290376 -188171 21292 -82678 83164 -215383 -38577
6681 -70332 -168141 21584 -18731 -246260 -25564 -250710 -93864 -168471 -12512 -148969 -16635
6669 -204225 60608 256082 -72577 128619 59640 66371 -216919 133674 97431 77911 2802
6657 -9233 2921 -52160 -205372 219607 -292418 -210332 -125679 91155 -139980 271924 146867
6646 146867 -36426 -25230 141084 -105447 -305087 -323404 234348 -72972 -96373 -19630 187257
6634 -50927 -25780 -253107 -121873 224820 -222509 -148442 11038 -357208 -45035 -46818 -76446
6623 -76446 125863 -258797 -41977 99268 -102910 213860 234900 73417 -67618 -346866 -3268
6611 344659 157574 88375 -75819 -56641 -90403 11948 210963 270963 142366 85643 -241876
6599 -77724 29823 -178081 64129 109656 111265 54517 -255193 -300476 -157681 157941 -103531
6587 184436 49141 -138439 -9572 -114488 121522 -259119 41328 -121825 -67504 -27629 169381
6575 256722 -36221 264946 -8758 80591 49747 199947 -252773 -248688 -93648 -139114 2011 27066
6563 27066 51495 -118616 -177214 55033 129090 -79129 -424880 -174565 -191857 392794 130373
6551 -37462 -17588 56588 323184 -3209 -57209 -21853 -93032 3332 17924 168495 -570 -67739
6539 -67739 -29674 169194 74643 -205675 117128 -379141 -6648 160338 -6639 45028 64259
6528 64259 309810 -76014 -185926 65114 -150064 -91556 206349 -107737 95256 36906 413715
6517 413715 86631 18922 39065 5199 -88180 -40130 137484 -131235 -62394 -168810 -248689
6506 -248689 73673 332867 -50576 -67938 -274064 203673 -75059 -135272 -174822 -22155 -97617
6495 -97617 130274 248244 135920 18810 -161799 48246 -184440 -60804 -14672 -266841 -64327
6483 -128312 208493 -77033 156048 103847 6455 53164 -102562 -141103 127420 -152956 232798
6471 206479 -5198 -25086 -77227 -29571 139379 -3861 -176262 -7928 40710 266998 244623 -66454
6458 253657 2213 54782 -17817 -116438 -85844 -69000 124646 -320 214626 -270330 -142308
6447 -142308 -200686 -192155 -36986 166337 -253081 388052 79237 -40549 -52489 -122722 -58006
6435 40498 -57053 339583 304362 -311300 -37224 238356 304498 -149789 70361 4463 -275336
6423 47322 -34642 135547 47716 -79583 -58766 -59285 -70095 53647 -245481 320460 -33330 36871
6410 -152052 160126 145392 -60940 75240 37408 -290887 201101 -28922 139575 -21872 260046
6398 -10236 -179350 65098 -14554 -253314 -107016 -13193 66265 39929 293491 -54180 -5739
6386 53252 65548 14582 183515 -339560 218132 -17113 -97045 37254 -121217 -220397 93018
6374 -163223 96525 -44224 182443 188728 -176087 -26321 97671 228173 123673 -154160 -369742
6363 -369742 280674 208387 27579 -120639 16670 -152597 30540 22515 -157704 6502 294715
6352 294715 90975 -495344 -99354 -425207 -179152 71376 143611 79547 22414 33240 26467
6341 26467 -223722 -113379 47812 181295 -140129 -41778 51802 82384 -156282 -141032 -88742
6330 -88742 -131283 61608 257026 -223403 -121137 134797 232250 -217989 -258946 85760 314365
6319 314365 -164595 52335 -182327 -22779 22942 -34332 107537 184785 -73998 -320778 69815
6307 -394198 14797 -21137 36551 -12204 -83506 92122 81912 -78604 -2167 -121341 -38214 -74756
6295 -74756 -85352 -48032 28892 2888 -171695 -151045 229210 -28567 -47675 279738 -1797 -263273
6283 -263273 155005 -36145 210891 -94678 387105 -32561 -417642 -79773 -222304 -86393 4240
6271 -54359 -34859 -107400 -81580 210542 -157607 -98020 -201540 -302944 -29554 -212558 132350
6259 127117 25457 1215 198155 -107838 -105868 -97220 -117892 183633 -357066 -15645 84811
6247 -13371 163696 45199 -15101 101040 234617 -422381 -260971 115556 -17088 -26843 155403
6235 2963 -290234 46764 -7156 -29588 -10466 -27206 -152739 65450 208156 226181 233751 -111760
6222 -325216 -166654 -158848 -27190 -207839 -306960 72552 -15620 -122672 37084 108946 15211
6210 31479 40653 177410 -195398 -108547 -41421 -12731 283911 -87319 114042 -205047 54478
6198 -43847 1490 -163729 -138426 241083 102493 -184507 53309 -12284 -127504 10192 186961
6187 186961 244257 -213314 17712 410159 -165265 -221855 146755 180068 110585 -110128 -63964
6176 -63964 -29768 -117459 105384 -215131 -22389 79825 -172119 -27497 70981 196914 -148895
6164 -204119 -28146 168979 295568 273640 -50899 -75791 122270 307395 91270 7693 -163969
6152 -4141 -234778 156150 -31062 138623 -115973 -364938 -85677 341649 -30922 -152769 104759
6140 141830 -170102 25328 -168795 -18342 -163794 110334 -57974 -90419 65670 -122520 79500
6128 76125 65339 81351 142400 -39585 69373 158652 194097 -29282 -77573 -164520 174597 38099
6115 336694 -167252 56420 272687 -121683 220568 105392 -104347 -286979 34216 -195990
6104 107418 21567 105656 -303036 -144534 -148805 32960 -20413 -105819 433367 -68957 -17639
6092 -63888 -136446 -80876 -126228 -76987 -10186 -34663 -155083 234148 -21584 19322 -191962
6080 -39483 52726 21931 219213 159737 -234808 75494 -22904 87067 -203445 305181 105174
6068 -91377 -131481 -31688 -362126 83758 147603 52970 -31598 120720 -90214 430640 98261
6056 177385 67353 260854 114489 -292623 45708 65858 -114459 179345 -133452 167018
6045 45710 -190973 17535 -77634 10980 -114056 -323787 111688 41419 177488 -67696 -11536
6033 222919 -56045 172383 107414 -100063 135311 276898 -402049 32430 -143772 188978
6022 205977 110531 -270932 -17753 -46327 5068 217044 233730 -382446 61653 -171124 8501
6010 -96649 -147826 -231133 153076 35739 -336709 294338 -201080 136346 112729 -8295 130910
5998 51223 -95377 -50709 347808 35534 95505 28115 6493 63545 246212 16654 182996
5987 182996 -188386 -6513 -186849 -394536 151250 9594 47001 478488 207806 157962 37916
5975 -168315 160874 108914 106139 61785 -60414 135245 -145930 -61022 -30867 -46850 -29028
5964 -29028 74708 -301508 35865 220857 200393 204681 61480 -4245 -54653 -110093 84 -21782
5951 -375603 11844 47757 191863 31557 -202044 151577 -374475 -25413 -138785 43592 -218788
5939 -123538 -193239 -115505 31315 -23951 51291 -488785 2514 -38415 -202069 -205357 -107258 -96038
5927 -96038 -111565 -111268 -307896 -224960 206359 48892 -256778 -165750 254262 95962 -10467
5915 -9363 89732 -21034 -129167 178954 -85948 -32587 78591 -198685 160984 43880 -189233
5903 -319852 -202504 -43735 283605 194404 384627 114861 -142578 266781 203803 -121488
5892 -29003 -12422 -23355 41715 -109442 73634 105625 17503 -179674 184863 -107019 -85365
5881 -85365 28596 32471 157575 272842 -11456 180156 -65061 147598 -9383 92986 -75115
5869 53577 148638 175989 -247118 -39074 -198093 -96261 118591 18572 -118988 38981 153225
5858 153225 269036 234024 3202 52559 218564 270735 117149 -120651 -215020 -276789 -131955
5846 -19142 250411 -96238 154840 25667 56621 -132007 -253825 -240894 54638 -113658 161452
5834 -209563 -3348 -231352 41746 -100754 13433 29116 277803 126834 -195559 -102699 119519
5822 118837 -127205 -282162 53219 -264782 5543 -91937 92466 153009 -304931 112633 -96481
5810 190370 -100774 -5785 -124497 -184814 -83036 -276392 -237031 -35441 -64147 -95570 -338400
5799 -338400 -15398 230852 -128468 57371 83291 -148043 -42640 8708 132440 231104 -37260
5787 -197044 -170929 -122146 151539 180721 -228177 -318185 39858 -93241 302599 83091 -82383
5775 -141312 -204042 347801 132492 -348773 88140 -280790 118828 55875 243603 62425
5764 -239629 -163348 -117895 -22329 104470 35831 -331381 60806 -43361 163730 163991 -182594
5752 -44377 -167898 -108645 166290 56000 95448 23267 77502 -222493 219803 -119823 161956
5740 -199789 -206307 66133 57136 -107054 144929 4198 -463985 -153980 84275 69700 -51472
5728 -136752 -8589 -335604 -36421 -171174 135309 100307 73025 -184303 109903 -95394 -260337
5717 -260337 180364 -117319 -302127 24578 -301337 -16721 -73292 -151617 26120 -147875 318019
5705 279720 -421611 284418 134570 -115753 317156 -85533 17827 120069 45107 -116456
5694 98620 -71137 285387 -69407 76252 -18000 212029 307404 170575 -143436 -118787 -94963
5683 -94963 -42373 26637 -199953 18647 131369 152776 -246520 297212 81005 204729 -36541
5671 199671 149920 197396 -17272 228043 91086 -232600 117968 32387 -150273 188266 10407
5659 36807 145116 -87616 -127899 -252507 -193353 61162 252383 -47710 -230403 -42819 262103
5647 81844 292997 16678 25473 129889 -396993 149814 -81193 144635 255053 96843 -69829
5635 9636 -199408 339828 -99479 223892 -283276 -11870 425397 -40118 -65542 73466 322393
5624 322393 137330 495052 78343 130700 -79986 -51231 77655 62724 -148145 -150071 -300304
5613 -300304 181810 4180 -216586 275749 -84279 140058 247725 138333 -47546 10409 -47177
5601 -93137 -69782 -11756 -148271 22363 10153 -48444 142697 -251005 50588 -148268 37823
5589 129052 -160059 103017 -183075 -191587 258840 -51811 284854 168934 -483820 303828
5578 -152565 5121 270075 86569 214202 159181 -110221 262697 147210 421925 59178 -17575
5566 86719 113635 -219637 248939 -209331 -66164 153066 -33774 -113399 173070 -20003 -67653
5555 -67653 59871 38014 -164034 -137251 -35627 -267982 182461 -120670 7295 338779 9365
5543 85125 -98169 50665 53528 -184277 71364 110822 117049 -33245 52049 114943 -122380 75878
5530 27476 -131432 -116402 -28105 -306407 -109536 19519 -68552 56120 -99625 -157570 -388563
5519 -388563 22702 22872 -106484 61734 15300 -84964 138649 -114595 157995 -46072 -22004
5507 -93998 5978 39469 -213305 -217264 36942 179749 -55469 -130543 -63345 -119417 61238 -31619
5494 35458 78823 55435 76885 290482 -7444 -166539 -107523 -77239 -173522 -292734 -216852
5483 -216852 -182727 168375 -189676 -56137 -155412 42779 -81002 273119 87047 53258 64057
5472 64057 -115328 196241 -106641 55045 -156740 78046 -140608 -122426 -128553 107015 215229
5461 215229 -187869 -346348 52983 -55413 -13779 -100930 125888 -393920 209840 -80662 125653
5449 -99269 89742 119098 369259 132340 -168940 -831 -139288 29417 211885 4270 4767 -314321
5436 -16051 -36219 -172318 -294198 -364508 175980 -214504 -128914 -384727 34628 440707 -222811
5424 -102247 -278968 123362 28114 115330 62321 71449 -402689 -183672 163378 -100434 -8847
5412 70937 -360740 93453 -165206 36123 328646 27994 57643 -138738 -27690 -140944 125109
5400 61804 269574 206241 18576 -47305 -219421 42627 -3545 70405 309246 -212107 49367
5388 230842 -271648 74787 -29974 100105 36663 156992 -122241 -198898 77560 363950 230950
5377 230950 -82420 -143662 176044 -164955 -135329 -196507 143815 95010 135040 -37619 179370
5365 134914 14323 134270 -25039 229220 -87979 25532 192241 176700 56881 62568 132757
5354 132757 101754 333039 -63179 69586 251108 -154031 -34904 221773 -215364 267018
5343 241431 -34601 142755 -175248 194915 -106987 51950 -66569 173895 -168 345136 -10720
5331 276327 302159 -320835 -84325 -106910 -60431 163215 -26965 -10944 -196327 -229338 4078
5319 70659 -302851 278039 -171951 57398 11287 23921 300630 -215866 -26948 -173719 230329
5307 -53216 -94428 -119187 -123721 -253223 247309 24557 140567 218992 279411 253203 -33984
5295 -216434 -38397 220915 64007 -123771 -32921 358648 11217 -245801 -94092 -268492 -159045
5284 -159045 221732 -18885 -156459 -252070 67219 -99997 222777 230063 316055 -255283 -53286
5272 214553 32559 -122959 -13995 -43746 -82737 -259200 -38304 299993 -282069 -42259 -394148
5261 -394148 191872 39035 -212597 58161 -123991 -146049 -191923 201504 -30008 -291044 354232
5249 -62847 190897 384966 -223706 -92793 45466 22603 -38574 -33347 110423 82572 -71032
5237 103010 -148219 210841 -76502 74768 -106594 -45940 78124 -354139 -218810 274848
5226 -150263 56788 136541 -263920 -149566 2586 379898 -90967 -27902 -119782 -283909 -18144
5214 -15320 -12930 -207687 299901 -90777 613 -48845 -37668 -100910 195759 -99596 191100 235529
5202 235529 -121941 -207579 -51725 14091 183594 -289827 276221 -244744 444043 -263809
5191 -77786 -125103 -83651 -48093 274210 41345 71406 126503 -248667 379852 -170945 -21256
5179 -51452 147552 108858 265719 72324 16604 -46433 40425 87986 -123620 86567 101649
5168 101649 73006 154785 34944 -86431 189312 -153613 164167 -310895 151083 11715 17176
5157 17176 86255 -184494 -21496 98887 180720 -48275 -303468 292916 21808 32342 75785
5146 75785 -88911 -158088 143617 -312528 -39485 -102246 -171263 282333 -9299 385383 23937
5134 -12427 511947 -28887 -207314 -280468 -82211 -184155 -11887 275832 132427 -36868 231922
5122 104894 272725 19090 268505 47952 210198 109335 -245150 -43572 40526 16829 15892
5111 15892 -114093 95461 -14693 -39498 384711 -228754 109398 288355 -140685 83142 28018
5099 -70975 167252 17908 -7905 -243695 -195036 60200 310471 -10448 -145613 -94366 140271
5087 110635 -1630 125608 -15713 240288 -189038 -131085 16836 332999 -94569 58226 -172615
5075 -168469 186565 158879 83177 -266103 60276 -9844 48393 -249262 -206564 43214 -284521
5063 184084 -163803 131656 47622 109662 -234794 -123070 -68963 40707 -31471 -216982 26676
5051 256762 -122088 128644 71926 -366328 88037 -112407 3071 190337 116073 5844 -138439
5039 -98388 201468 280545 -159326 19135 -91633 -148329 -118186 118492 -82179 234569 322637
5028 322637 -60507 106814 48468 -191398 411 -235625 139407 69109 11311 -66191 211407
5016 -16203 16582 -116314 145787 82472 134802 -112072 -63580 107279 -89031 55062 -224016
5004 97542 -187879 -231329 15224 -61685 91198 36662 119413 -231555 91084 196392 -228752
4992 113948 33800 46401 218953 51804 -23033 52856 -131696 83826 -104991 -8091 -436131
4981 -436131 176020 -333805 -24404 -316 53490 -70569 -128591 -143711 264443 -172869 -84448
4969 -42970 -269186 99174 55817 85624 -267278 -188802 -114682 -27727 161479 -351908 -233063
4958 -233063 -147203 -38884 51684 183974 2577 244924 -6811 110015 -179027 322981 127912
4946 81380 142495 35694 -7367 12775 64178 58863 59867 -94609 -4061 -100758 192338 -91319
4933 -140366 42018 330412 -260165 29442 256952 133835 -283451 -178887 368018 186819
4923 186819 27370 -364875 -108503 154978 -51248 175942 -330260 90099 -79452 -592 -35312
4912 -35312 135208 160800 70984 163532 94734 334507 67803 102006 199447 187763 -149925
4900 139961 -108641 -58703 31160 -78013 162291 72568 82306 -338940 184180 106660 395846
4889 395846 -208384 273465 20412 -83912 153755 222499 -6471 -124082 -112587 236064 396670
4878 396670 135075 -367322 92003 186796 61095 54945 167957 -143699 985 194317 -122871
4866 11768 139130 -45089 -141049 -324059 -184631 -107688 -105621 -78218 138732 -119126 -1198
4854 95308 -142123 132938 103198 -68493 243832 160506 89932 -54879 200324 -152759 -159854
4843 -159854 135910 -196679 136365 -93614 -112836 40354 -60088 -382583 -7471 -58559 -104472
4832 -104472 156458 -273341 78103 205526 -43043 63882 43920 126939 -53519 164119 -58848
4820 10449 143086 20220 -95855 84427 -332967 -64443 139863 -161 22968 207470 -25529
4808 11142 16242 -149299 -20210 318402 145421 12627 -36198 189559 -119685 157307 -86188
4796 88464 105002 184030 -292896 -192611 -7944 73252 -267083 394872 -20451 213056 -16194
4784 -148150 247426 178530 -9437 23903 36014 -297669 57661 148978 9118 181348 277426
4773 277426 -11489 -35015 -299075 -106771 171703 219723 74482 77243 -102970 118952 41070
4761 93378 -21261 15291 -12174 -316717 -196216 74598 99007 266071 35410 -28662 -177818
4750 -177818 -42086 4606 44121 31933 30837 2888 105398 -4541 -208401 314577 41530 45551
4738 45551 -126886 59092 -112353 234771 -117343 42143 -120539 -85286 89766 -175265 -58635
4726 -120684 223362 -140008 152094 34602 193607 14944 265467 182779 -97367 -117123 91660
4714 -177174 -185785 -157885 -13186 -111817 34794 -59672 334712 -66186 59589 52654 -159719 -195450
4702 -195450 126820 -187398 77506 206142 -158251 155994 -47489 153543 87978 -211461
4691 364723 242766 -40253 294678 -156999 -119316 -192902 68922 -161096 -40493 -16425 119818
4679 -33337 247640 -209997 21346 -301462 80716 43339 33738 22788 30330 -253586 -6670 24581
4666 11872 -241938 -167506 236514 -249634 187057 -87027 -204849 193555 -305488 201856
4655 -38653 -38945 21050 176545 -20654 75302 -385805 -31502 -65551 -54065 148132 -44161 156000
4642 -53652 286540 13723 201993 -309850 -118447 153647 -129187 341723 125674 67176
4632 67176 -69683 166259 -64216 -50671 75424 56975 2718 115567 -22707 -120304 -21418 -168270
4620 -168270 234631 -8240 -44784 -120408 25052 -117375 -37039 27802 -212928 13261 529565
4609 529565 -318176 -171363 -115082 159596 21431 127607 56400 -60212 -76878 185135 -190475
4597 -120654 137991 -15729 -170893 19021 -49637 -232178 14950 113006 366359 -57245 69977
4585 72934 621 47043 37583 161406 -44836 144669 28595 -25832 -38966 -48221 308363 -3575
4572 -181223 -277995 -135661 142690 -59372 -99841 -22193 -23918 79985 49990 35250 -101423
4560 375391 -140838 102595 281917 -13398 7783 91001 444468 -156674 45546 90521 -110698
4548 -97455 -58459 -38722 -42556 -112301 107950 -2450 217680 105075 223988 54818 -348545
4536 -127466 -62817 10317 93888 -46721 -261481 82427 -23073 4485 -252103 35427 -65503
4524 221124 155558 152820 -1218 -298101 419474 287615 108618 -59730 -22373 -184090 -38350
4512 -66312 -23684 -134295 74786 -57921 47866 -135572 -26079 -26977 -23092 36692 363568 253659
4500 253659 383806 88584 -58550 -76540 59061 246671 -285595 77704 -316335 -66278 -85256
4489 -85256 29146 53844 120664 154481 -7652 -84838 -295658 365223 -48058 -411449 -336127
4478 -336127 33219 48262 -290666 128388 93514 65664 39453 -5347 92323 132307 -69519
4466 -63081 -59397 -48050 282656 -53459 280630 122725 -39261 34061 287626 76887 -57634
4454 -86564 132441 -165461 17321 120933 -17036 -18774 -241543 -48953 238476 189432 265860
$$ [...]
##END NTUPLES=NMR SPECTRUM
##END=
