##TITLE=NES1038_872015070_9266380_ttNlsKnYZi
##JCAMPDX= 6.0         $$ Bruker NMR JCAMP-DX V2.0
##DATA TYPE= NMR SPECTRUM
##DATA CLASS= NTUPLES
##ORIGIN= BRUKER
##OWNER= Administrator
$$ 1.72 TOPSPIN		Version 2.1
$$ 2015-07-09 17:56:52.300 -0700  Administrator@X
$$ Compression mode = diff/dup
##.OBSERVE FREQUENCY= 400.02188249412
##.OBSERVE NUCLEUS= ^1H
##.ACQUISITION MODE= SIMULTANEOUS (DQD)
##.ACQUISITION SCHEME= undefined
##.AVERAGES= 8
##.DIGITISER RES= 22
##SPECTROMETER/DATA SYSTEM= spect
##.PULSE SEQUENCE= zg30
##.SOLVENT NAME= COFFEE_meoh
##.SHIFT REFERENCE= INTERNAL, COFFEE_meoh, 1, 14.98509
##AUDIT TRAIL= $$ (NUMBER, WHEN, WHO, WHERE, PROCESS, VERSION, WHAT)
$$ ##TITLE= Audit trail, TOPSPIN		Version 2.1
$$ ##JCAMPDX= 5.01
$$ ##ORIGIN= Bruker BioSpin GmbH
$$ ##OWNER= Administrator
$$ $$ E:\/data/COFFEE/nmr/NES1038_872015070_9266380_ttNlsKnYZi/10/pdata/1/auditp.txt
$$ ##AUDIT TRAIL=  $$ (NUMBER, WHEN, WHO, WHERE, PROCESS, VERSION, WHAT)
(   1,<2015-07-09 17:56:44.988 -0700>,<Administrator>,<X>,<go>,<TOPSPIN 2.1>,
      <created by zg
	started at 2015-07-09 17:55:38.816 -0700,
	POWCHK enabled, PULCHK disabled,
       configuration hash MD5:
       21 0F 79 D6 B3 7B B4 F6 88 20 88 DB 03 48 BD 9F
       data hash MD5: 64K
       2C ED D4 FE 9B E7 03 E7 9C 9B 40 44 3D AE BD 3F>)
(   2,<2015-07-09 17:56:48.160 -0700>,<Administrator>,<X>,<proc1d>,<TOPSPIN 2.1>,
      <Start of raw data processing
       efp LB = 0 FT_mod = 6 PKNL = 1 PHC0 = 0 PHC1 = 0 SI = 32K 
       data hash MD5: 32K
       87 8F 4B 13 D9 9A 76 F2 16 98 40 AC FA 40 48 BE>)
(   3,<2015-07-09 17:56:48.456 -0700>,<Administrator>,<X>,<proc1d>,<TOPSPIN 2.1>,
      <pk PHC0 = 90.9668 PHC1 = 0 
       data hash MD5: 32K
       B1 44 45 AC A6 06 E2 A1 2F 3B D3 D7 DD 99 7A F7>)
(   4,<2015-07-09 17:56:48.566 -0700>,<Administrator>,<X>,<proc1d>,<TOPSPIN 2.1>,
      <abs ABSG = 1 
       data hash MD5: 32K
       42 6B 29 4A 89 E6 59 56 94 5F 69 39 27 42 85 F7>)
(   5,<2015-07-09 17:56:48.628 -0700>,<Administrator>,<X>,<proc1d>,<TOPSPIN 2.1>,
      <abs ABSG = 2 
       data hash MD5: 32K
       C9 FD A9 6A 5B 2D 2E E1 5F A3 A9 DE 38 0A 0A 32>)
(   6,<2015-07-09 17:56:48.691 -0700>,<Administrator>,<X>,<proc1d>,<TOPSPIN 2.1>,
      <abs ABSG = 3 
       data hash MD5: 32K
       D8 2F 04 9D B6 ED 73 7C 4C CD C7 61 86 90 77 E1>)
(   7,<2015-07-09 17:56:48.753 -0700>,<Administrator>,<X>,<proc1d>,<TOPSPIN 2.1>,
      <abs ABSG = 4 
       data hash MD5: 32K
       71 17 EB 57 51 7F 23 94 0C B6 D0 EF CD A2 54 60>)
(   8,<2015-07-09 17:56:48.816 -0700>,<Administrator>,<X>,<proc1d>,<TOPSPIN 2.1>,
      <abs ABSG = 5 
       data hash MD5: 32K
       7A FE DA 31 1D 81 C6 48 9A 54 BD F5 7C 73 4D C4>)
$$ ##END=
$$ 
$$ $$ hash MD5
$$ $$ 6A 6B E4 06 BA CA C9 D1 64 9B 67 C5 50 0F 3B 5F
##$RELAX= 
##$RELAX= 
##$RELAX= 
##$RELAX= 
##$RELAX= 
##$RELAX= 
##$RELAX= 
$$ Bruker specific parameters
$$ --------------------------
##$DU= <E:\>
##$EXPNO= 10
##$NAME= <NES1038_872015070_9266380_ttNlsKnYZi>
$$ [...]
150 150 150 150 150 150 150 150
##$TP07= 0
##$TPNAME0= <>
##$TPNAME1= <>
##$TPNAME2= <>
##$TPNAME3= <>
##$TPNAME4= <>
##$TPNAME5= <>
##$TPNAME6= <>
##$TPNAME7= <>
##$TPOAL= (0..7)
0.5 0.5 0.5 0.5 0.5 0.5 0.5 0.5
##$TPOFFS= (0..7)
0 0 0 0 0 0 0 0
##$TUNHIN= 0
##$TUNHOUT= 0
##$TUNXOUT= 0
##$USERA1= <user>
##$USERA2= <user>
##$USERA3= <user>
##$USERA4= <user>
##$USERA5= <user>
##$V9= 5
##$VALIST= <valist>
##$VCLIST= <CCCCCCCCCCCCCCC>
##$VD= 0
##$VDLIST= <DDDDDDDDDDDDDDD>
##$VPLIST= <PPPPPPPPPPPPPPP>
##$VTLIST= <TTTTTTTTTTTTTTT>
##$WBST= 2048
##$WBSW= 25
##$XGAIN= (0..3)
0 0 0 0
##$XL= 0
##$YL= 0
##$YMAX_a= 629314
##$YMIN_a= -523006
##$ZGOPTNS= <>
##$ZL1= 120
##$ZL2= 120
##$ZL3= 120
##$ZL4= 120
##$ABSF1= 14.98509
##$ABSF2= -5.573092
##$ABSG= 5
##$ABSL= 3
##$ALPHA= 0
##$AQORDER= 0
##$ASSFAC= 0
##$ASSFACI= 0
##$ASSFACX= 0
##$ASSWID= 0
##$AUNMP= <proc_prof1d_extract_pilot.lims>
##$AXLEFT= 0
##$AXNAME= <>
##$AXNUC= <1H>
##$AXRIGHT= 0
##$AXTYPE= 0
##$AXUNIT= <>
##$AZFE= 0.1
##$AZFW= 0.1
##$BCFW= 0
##$BC_mod= 0
##$BYTORDP= 0
##$COROFFS= 0
##$CY= 15
##$DATMOD= 1
##$DC= 0
##$DFILT= <>
##$DTYPP= 0
##$F1P= 0
##$F2P= 0
##$FCOR= 0.5
##$FTSIZE= 32768
##$FT_mod= 6
##$GAMMA= 0
##$GB= 0
##$INTBC= 1
##$INTSCL= 1
##$ISEN= 128
##$LB= 0
##$LEV0= 0
##$LPBIN= 0
##$MAXI= 10000
##$MC2= 0
##$MEAN= 0
##$ME_mod= 0
##$MI= 0
##$NCOEF= 0
##$NC_proc= -8
##$NLEV= 6
##$NOISF1= 0
##$NOISF2= 0
##$NSP= 0
##$NTH_PI= 0
##$NZP= 0
##$OFFSET= 14.98509
##$PC= 1
##$PHC0= 90.9668
##$PHC1= 0
##$PH_mod= 1
##$PKNL= yes
##$PPARMOD= 0
##$PPDIAG= 0
##$PPIPTYP= 0
##$PPMPNUM= 2147483647
##$PPRESOL= 1
##$PSCAL= 4
##$PSIGN= 0
##$PYNMP= <proc.py>
##$REVERSE= no
##$SF= 400.02
##$SI= 32768
##$SIGF1= 0
##$SIGF2= 0
##$SINO= 400
##$SIOLD= 32768
##$SPECTYP= <>
##$SREGLST= <1H.CDCl3>
##$SSB= 0
##$STSI= 32768
##$STSR= 0
##$SW_p= 8223.68421052631
##$SYMM= 0
##$S_DEV= 0
##$TDeff= 65536
##$TDoff= 0
##$TI= <>
##$TILT= no
##$TM1= 0
##$TM2= 0
##$TOPLEV= 0
##$USERP1= <user>
##$USERP2= <user>
##$USERP3= <user>
##$USERP4= <user>
##$USERP5= <user>
##$WDW= 1
##$XDIM= 32768
##$YMAX_p= 448870700
##$YMIN_p= -882189
##$CURPLOT= <Network HP LaserJet P1505>
##$CURPRIN= <$Network HP LaserJet P1505>
##$DFORMAT= <normdp>
##$LAYOUT= <+/1D_H.xwp>
##$LFORMAT= <normlp>
##$PFORMAT= <normpl>
##$SURQMSG= 1
$$ End of Bruker specific parameters
$$ ---------------------------------
##NTUPLES= NMR SPECTRUM
##VAR_NAME=  FREQUENCY,     SPECTRUM/REAL,   SPECTRUM/IMAG
##SYMBOL=    X,             R,               I
##VAR_TYPE=  INDEPENDENT,   DEPENDENT,       DEPENDENT
##VAR_FORM=  AFFN,          ASDF,            ASDF
##VAR_DIM=   32768,         32768,           32768
##UNITS=     HZ,            ARBITRARY UNITS, ARBITRARY UNITS
##FACTOR=    0.250966925370066, 1,           1
##FIRST=     8223.43324360094, 2540,         -122969
##LAST=      0,             103295,          -76790
##MIN=       0,             -882189,         0
##MAX=       8223.43324360094, 448870700,    0
$$ Real data points
##PAGE= N=1
##DATA TABLE= (X++(R..R)), XYDATA
$$ [...]
19488E2984i0647k10332A20205m8477a06672B3224a27220I5175K7970a55371N9683
$$ 52984 -90647 -300979 120205 71728 -106672 23224 -127220 95175 123145 -155371 -95688
19477i5688j21233h1960r8375b3137B21844b5595D9409d83176F1365J7133b42061
$$ -95688 -216921 -81960 -180335 -23137 221844 -25595 49409 -483176 61365 78498 -242061
19465b81963E6J00963a46218j08659l7444a07016H9690c28662F4622I433c9612
$$ -281963 56 101019 -146218 -254877 -292321 -107016 89690 -328662 64622 9433 -39612
19453e71528f0523j52235L8980F6746H671N3685b36288A44833E9294b18258B02677
$$ -571528 -60523 -212758 -173778 66746 8671 62356 -236288 144833 59294 -218258 202677
19441C7102P2176Q2864a42035C17719a0553j80837L8838j96961I6150d22780C7373
$$ 37102 109278 192142 -142035 317719 -10553 -191390 -152552 -349513 96150 -422780 37373
19429a18003k62872J41452m8265a32164j2091N8210d1162h985B63490o5143d1129
$$ -118003 -380875 -239423 -287688 -132164 -144255 -86045 -41162 -8985 263490 198347 -41129
19417b6185F6892a70185l04559g7453j6483A40910b89419P9994e1467k4512q9829
$$ -26185 66892 -170185 -474744 -77453 -93936 140910 -289419 -209425 -51467 -75979 -165808
19406a65808e207p1476B65950i9796G0642R9559C1837J46623F36b29444m2539
$$ -165808 -5207 -76683 265950 -99796 70642 170201 31837 178460 636 -229444 -271983
19395b71983d4463D2037k0214a64786A99005a11063j5012L87e9612p425j66759
$$ -271983 -44463 42037 21823 -164786 199005 -111063 -126075 -125688 -59612 -67037 -233796
19384b33796R3387m5613l1j64922D2714J20101b93128c2996j77487R1508l5077
$$ -233796 -140409 -186022 -186053 -350975 42714 162815 -293128 -32996 -210483 -118975 -154052
19373a54052a8479A06345a76787B0505h6466B202i157j65058f5653j24383j7431
$$ -154052 -18479 106345 -176787 20505 -86466 2202 -9157 -174215 -65653 -190036 -207467
19362b07467A18568J87401A24532d3633l9201n1832b0814j60851H5772a4920E9019
$$ -207467 118568 305969 124532 -43633 -82834 -134666 -20814 -181665 85772 -14920 59019
19350h4782J6719A44195g59894b28252b9581p313r9574I945b714j416j63520L7451
$$ -84782 -68063 144195 -759894 -228252 -29581 -36894 -136468 9945 -2714 -4130 -167650 -130199
19338a30199L3686C9470g270F88b19562c1091l5033k73098a29611k2537A7727
$$ -130199 -96513 39470 -7270 688 -219562 -31091 -66124 -339222 -129611 -152148 17727
19326H4015c22205J29020m2608M9774c9188j64140K974j389l2899a05752B0670
$$ 84015 -322205 -193185 -235793 -186019 -39188 -203328 -200354 -201743 -234642 -105752 20670
19314B08036k6615G29a481j09707p6853j39113A15101B1804f2948l28051A84439
$$ 208036 181421 729 -1481 -111188 -188041 -327154 115101 21804 -62948 -390999 184439
19302c2037k2281j10314A32837a55353C5144J89869a28786a9916D7514c91459
$$ -32037 -54318 -164632 132837 -155353 35144 225013 -128786 -19916 47514 -391459
19291a34554L6356j71364C44815b3070D7386a8227j05809d0326p7893N5086j41812
$$ -134554 -98198 -269562 344815 -23070 47386 -18227 -124036 -40326 -118219 -63133 -204945
19280b04945d7129k38606C732b07098K3101C0147h6568K8450B0754a3323A44659
$$ -204945 -47129 -285735 3732 -207098 -183997 30147 -86568 -58118 20754 -13323 144659
19268a10097j60350L4719J08752E6548J37554l1482a18905M3282A11381f9487
$$ -110097 -270447 -235728 -126976 56548 194102 162620 -118905 -75623 111381 -69487
19257b31783D5174a81896G2959b41922e6770A7609J64523F9362a71947d5764j26692
$$ -231783 45174 -181896 72959 -241922 -56770 17609 182132 69362 -171947 -45764 -172456
19246a72456N9492j41015E9622g0559j18352J9188A94106a57200k3725e7015k17491
$$ -172456 -112964 -253979 59622 -70559 -188911 -169723 194106 -157200 -180925 -57015 -274506
19235b74506a00561A40029J21987d70049J81842C59062a88528A8452a78283K6359
$$ -274506 -100561 140029 262016 -470049 -288207 359062 -188528 18452 -178283 -151924
19225a51924J0774K3564J9425a7708k3177k1167j03147B36622d95547A44180a49615
$$ -151924 -141150 -117586 -98161 -17708 -40885 -62052 -165199 236622 -495547 144180 -149615
19213F7250b10246M9170O1045m588C6471J15831a20001j18653m9785H3494B9487
$$ 67250 -210246 -161076 -100031 -104619 36471 152302 -120001 -238654 -288439 83494 29487
19201b80979d8526M395q1259N5009B303i5900j97622B194N1229b82615d8005a6465
$$ -280979 -48526 -44131 -125390 -70381 2303 -95900 -293522 2194 53423 -282615 -48005 -16465
19188b01089H32c30663p4989G603a85729P8153N2045j01804j90813H050c91515
$$ -201089 832 -330663 -405652 7603 -185729 -107576 -55531 -157335 -348148 8050 -391515
19176C8301a43054A40225a29855C12574A18399n2214L41914b10460E7601a02683
$$ 38301 -143054 140225 -129855 312574 118399 66185 408099 -210460 57601 -102683
19165f033I4778f7636p439A11172m2110Q9346a4337j84101N777j08366A4220a75152
$$ -6033 94778 -67636 -75075 111172 69062 158408 -14337 -198438 -192661 -301027 14220 -175152
19152b74531J7035N8054F7724J9487l2259K7629a00499h107j23220p6227f2430
$$ -274531 -257496 -199442 67724 87211 54952 82581 -100499 -8107 -131327 -207554 -62430
19140A81534E3080a18565A03122J61062a06284j95150a37293A36026e11A77652
$$ 181534 53080 -118565 103122 264184 -106284 -301434 -137293 136026 -511 177652
19129b88103J28875b989A0527h858C57608g930q0071E0804a10043j18821C146
$$ -288103 -159228 -2989 10527 -8858 357608 -7930 -88001 50804 -110043 -228864 3146
19117h1936K1538A63337J66679H8099d5352l61582C9664J20086G6872a66604L958
$$ -81936 -60398 163337 330016 88099 -45352 -406934 39664 159750 76872 -166604 -162646
19106a62646q0786E0331b47215K9104g9684K2129k48693J21273K4707l5056A68237
$$ -162646 -243432 50331 -247215 -218111 -79684 -57555 -306248 -184975 -160268 -195324 168237
19094i1659E3747d3570m0701j20561H9884R0129A725J00707K25087h1881r8185
$$ -91659 53747 -43570 -84271 -204832 89884 180013 1725 102432 327519 -81881 -180066
19083a80066J6366H1217g0150I9530g3658A00952e6276H6710c3749A05606f0537
$$ -180066 -163700 81217 -70150 99530 -73658 100952 -56276 86710 -33749 105606 -60537
19071a74562B20656a77937a25H1232a88068H683e4827b1162C2475K34915m0546
$$ -174562 220656 -177937 -125 81232 -188068 8683 -54827 -21162 32475 267390 226844
19060B26844n4007H2927P8394A9472g4469l53648A11600D7006g6770A05968J7610
$$ 226844 172837 82927 161321 19472 -74469 -428117 111600 47006 -76770 105968 123578
19049A23578b53383I0494a94921p8628F8129J9146j399e0450B1615b4713k86153
$$ 123578 -253383 90494 -194921 -273549 68129 87275 85876 -50450 21615 -24713 -310866
19038c10866J49412N6607B21186c6231C85460a51922F6980b21716P6324A71978
$$ -310866 -161454 -104847 221186 -36231 385460 -151922 66980 -221716 -145392 171978
19027i7312I4670b00078A05537i9385L2796E7402b23603g6314H2602i5006m5451
$$ -97312 94670 -200078 105537 -99385 -66589 57402 -223603 -76314 82602 -95006 -140457
19016a40457A47270a31176C7306c53839a32966b1227k65482L2141i32E37932A98301
$$ -140457 147270 -131176 37306 -353839 -132966 -21227 -286709 -254568 -932 537932 198301
19004b51658J7336J6285B56580h9484o5411P7409L6678A12658f9374A87564a4652
$$ -251658 -234322 -218037 256580 -89484 -154895 -77486 -40808 112658 -69374 187564 -14652
18992c17575j62837A42071h7798l16313B8901K1147J28005b77314a27899k0425
$$ -317575 -480412 142071 -87798 -404111 28901 50048 178053 -277314 -127899 -148324
18982a48324A27284b30203j40265B12153b94179O6361a8816P333H1849g7357B9182
$$ -148324 127284 -230203 -370468 212153 -294179 -227818 -18816 -11483 81849 -77357 29182
18970f208o414A5696c9838A31938l6382J05853d1813l79286a89687A36922a26279
$$ -6208 -12622 15696 -39838 131938 95556 201409 -41813 -421099 -189687 136922 -126279
18958b29930e5905g872G1116b80984g5592n8268J2961G875L5928D011a42339C89854
$$ -229930 -55905 -7872 71116 -280984 -75592 -133860 -120899 7875 43803 4011 -142339 389854
18945b36158C0155J29584b65745A42815C9210Q7374b60520A14675a01301C00937
$$ -236158 30155 159739 -265745 142815 39210 126584 -260520 114675 -101301 300937
18934A26550a26345a0361j62304k7807f0021a6361l07013a06541A63281B1072
$$ 126550 -126345 -10361 -172665 -200472 -60021 -16361 -323374 -106541 163281 21072
18923C11457b21634P2654k12581A75004a91874e4918m9635k01115R9800G1979
$$ 311457 -221634 -148980 -361561 175004 -191874 -54918 -104553 -305668 -205868 71979
18912G1430d1782B11572h9584F3853L05732b30172O6992a5972B34582j08168a67154
$$ 71430 -41782 211572 -89584 63853 369585 -230172 -163180 -15972 234582 126414 -167154
18900A65653e1495G8523C7345a08426c5454l9376c6416l7018j96725A07402i2794
$$ 165653 -51495 78523 37345 -108426 -35454 -74830 -36416 -73434 -270159 107402 -92794
18888A2424h5441m7306J7330q3016j50309f938q75251B2647b24806f4620m6147
$$ 12424 -85441 -132747 -115417 -198433 -348742 -6938 -882189 22647 -224806 -64620 -110767
18877a10767A00896b12586D8677a47961F6244b07088J2658A37585g0550l14004
$$ -110767 100896 -212586 48677 -147961 66244 -207088 -194430 137585 -70550 -384554
18867c84554A12041a83656j38116O8953j41762p627a91955M675c364j02341A52951
$$ -384554 112041 -183656 -321772 -252819 -394581 -402208 -191955 -187280 -3364 -105705 152951
18855B9538K5797b98876j24275A02730b28789A22459L06279d5479A77187b18917
$$ 29538 55335 -298876 -423151 102730 -228789 122459 428738 -45479 177187 -218917
18844D0280a44251D3170b69155R3509q1572R6407m155P3085m0734k32762C05100
$$ 40280 -144251 43170 -269155 -175646 -257218 -160811 -164966 -91881 -132615 -365377 305100
18832B02106b31779k33571a39131j86068a39021n9166C8055J90831i123k38666
$$ 202106 -231779 -465350 -139131 -325199 -139021 -198187 38055 228886 -9123 -247789
18822b47789L2345g9069E0050a73036m7222B50107c76227a20489A66365b51A64901
$$ -247789 -215444 -79069 50050 -173036 -220258 250107 -376227 -120489 166365 -251 164901
18810H417L47400j72513o9084E2345J68552M9147a42447r277A51552a6992j66175
$$ 8417 355817 183304 114220 52345 220897 270044 -142447 -151724 151552 -16992 -183167
18799a83167C27840O4927f1831B48495A5395a12215j3756j04247K3629A26231
$$ -183167 327840 392767 -61831 248495 15395 -112215 -125971 -230218 -206589 126231
18788G3418b90825f5435q355K1460B3401b53597j63512a39063l3550A00649a98251
$$ 73418 -290825 -65435 -73790 -52330 23401 -253597 -417109 -139063 -172613 100649 -198251
18776a13736D8976M7430J17644I1948b85001i0254o8991D8645j3944K10531c86516
$$ -113736 48976 96406 214050 91948 -285001 -90254 -159245 48645 34701 245232 -386516
18764c11903L1980d3280K1527l590A84436k5687i7437k2262F582b39908A81858
$$ -311903 -279923 -43280 -21753 -25343 184436 158749 -97437 -119699 6582 -239908 181858
18752b49177h5822A57205b56742H477b04238e6968G0759a40852j90533f3968D4377
$$ -249177 -85822 157205 -256742 8477 -204238 -56968 70759 -140852 -331385 -63968 44377
18740I4474N9344o9609a75753F358a68101O0042A1618f6073A6115J14601i1027
$$ 94474 153818 84209 -175753 6358 -168101 -108059 11618 -66073 16115 130716 -91027
18728c49889C3162a72721F0056b9508j26027C40650G0988A2701b6365j10858A56975
$$ -349889 33162 -172721 60056 -29508 -155535 340650 70988 12701 -26365 -137223 156975
18716c00667a49372A60089j8269b41240f2395C97522a88873A38469b5695k79828
$$ -300667 -149372 160089 141820 -241240 -62395 397522 -188873 138469 -25695 -305523
18706c05523h2886A74101a77867N7816I2650c95933L4455J50899g4531k2571k5840
$$ -305523 -82886 174101 -177867 -120051 92650 -395933 -361478 -210579 -74531 -97102 -122942
18695a22942m02781D7065M20N7539a3807K672k34546d5564o040F5252N9038A3315
$$ -122942 -525723 47065 47485 105024 -13807 -11135 -245681 -45564 -51604 65252 124290 13315
18682A17377b87894G91c2170H155O5502d2763C749c39957J02423j2375F7965J61196
$$ 117377 -287894 791 -32170 8155 73657 -42763 3749 -339957 -237534 -249909 67965 229161
18670B29161a22167j20240f6725Q005C357c18356I3369b9520j62447B9519a33446
$$ 229161 -122167 -242407 -66725 -58720 3357 -318356 93369 -29520 -191967 29519 -133446
18658b84392e4482B8359a91689D3785J79370d74898g9068k08436I2379b08506
$$ -284392 -54482 28359 -191689 43785 223155 -474898 -79068 -287504 92379 -208506
18647F1665K0440b37538A05672d8225A61119D2691a89172A57434c59272e9470
$$ 61665 82105 -237538 105672 -48225 161119 42691 -189172 157434 -359272 -59470
18636e6581a7756m35353J79709Q5511f2594j40769k1502j9778B81174b74842J15210
$$ -56581 -17756 -453109 -273400 -187889 -62594 -203363 -224865 -244643 281174 -274842 -159632
18625a59632A53559Q637l9800b2716A26149O3418H0342Q9340o2837a21994k22664
$$ -159632 153559 162196 122396 -22716 126149 189567 80342 169682 106845 -121994 -344658
18614c44658P3260R4020B01779d2259C2545Q0414b47360H5412L03630c02024q9328
$$ -344658 -271398 -177378 201779 -42259 32545 112959 -247360 85412 389042 -302024 -391352
18603c91352C574b86028e1055A97777J23465A9248J52652B6093b08388L0782Q7585
$$ -391352 3574 -286028 -51055 197777 321242 19248 171900 26093 -208388 -177606 -90021
18592i0021D9917L82883a31432j92574B583b27083c8103l44513a36910m5812d770
$$ -90021 49917 432800 -131432 -324006 2583 -227083 -38103 -382616 -136910 -182722 -4770
18580a67774p0099B01320J46762b91439J4337B13827a76195G6660a62684H6099
$$ -167774 -237873 201320 348082 -291439 -277102 213827 -176195 76660 -162684 86099
18569a69305N0822D33635a7229o1002E0168H684P2322q821N1519C9536c29408
$$ -169305 -118483 433635 -17229 -78231 50168 8684 81006 72185 123704 39536 -329408
18557a80586n5652A6995J35453k6407e7335j12972m5046b354j2462A19771c12546
$$ -180586 -236238 16995 152448 126041 -57335 -170307 -215353 -2354 -14816 119771 -312546
18545c2916B17687J45627a62817B84389A39671P5371b0916I911d1222k7309k9501
$$ -32916 217687 363314 -162817 284389 139671 215042 -20916 9911 -41222 -68531 -98032
18534i8032B69883b33871c836k13330R2774e8652K7495k15107a9473A4450J12248
$$ -98032 269883 -233871 -3836 -217166 -124392 -58652 -31157 -246264 -19473 14450 126698
18523A26698b01061h4764F354a88374e1457A80328l0717a01447A76009E5458c12848
$$ 126698 -201061 -84764 6354 -188374 -51457 180328 149611 -101447 176009 55458 -312848
18511a29409I0003c31250a17853C7340a63853A21651P4766c10030C44161o4898
$$ -129409 90003 -331250 -117853 37340 -163853 121651 196417 -310030 344161 279263
18501B79263a606l57756a37403a8441k64744J02986k16188b9110l9523B7200J2959
$$ 279263 -1606 -359362 -137403 -18441 -283185 -180199 -396387 -29110 -68633 27200 40159
18490D0159c09363A69695a88554m9857b3387B4711c63304G120g2398B6785d4076
$$ 40159 -309363 169695 -188554 -238411 -23387 24711 -363304 7120 -72398 26785 -44076
18478H090g4641A47417a52692B2050b5226B05895C8236b76857R7856F346L2223
$$ 8090 -74641 147417 -152692 22050 -25226 205895 38236 -276857 -179001 6346 38569
18467C8569c26620A11128b50599B8235J06228c93547b8521J0578A20067E3374
$$ 38569 -326620 111128 -250599 28235 134463 -393547 -28521 -17943 120067 53374
18456D0574b1630j68878m5248B25557I7270i412k741j21338j36831d0948A16104
$$ 40574 -21630 -190508 -235756 225557 97270 -9412 -12153 -133491 -270322 -40948 116104
18444A34076M492n9427K9916d94004K29674k6778D232e357A02087a3058j26199
$$ 134076 138568 79141 109057 -494004 -264330 -291108 4232 -5357 102087 -13058 -139257
18433a39257A40570C018h1946j62724R8530F0179a07152c6237p9502B61506b1510
$$ -139257 140570 3018 -81946 -244670 -146140 60179 -107152 -36237 -115739 261506 -21510
18421D8709b7372k9802m2741e414J187p3503j45375A17069K48875a07798A35253
$$ 48709 -27372 -57174 -99915 -5414 -4227 -77730 -223105 117069 365944 -107798 135253
18409b549p9666m9777A53025A496a33045M1369G764a14935K0093j31988R9551
$$ -2549 -82215 -131992 153025 1496 -133045 -91676 7764 -114935 -94842 -226830 -127279
18398a27279J3863j43643B13829q4724b99292b4554C35537A49089A1089J50378
$$ -127279 -113416 -257059 213829 129105 -299292 -24554 335537 149089 11089 161467
18388A61467h8776L0748j16246k6624A2921J87303h2842B37774r5568d6099C2072
$$ 161467 -88776 -58028 -174274 -200898 12921 200224 -82842 237774 142206 -46099 32072
18376A61858b63335a21723k29054B05814m2381d61189J04130B22297p3881D3375
$$ 161858 -263335 -121723 -350777 205814 163433 -461189 -357059 222297 148416 43375
18365h409p4202j60295A73940O817D9857K1435g8952A68987q0038j3460b23538
$$ -8409 -82611 -242906 173940 180757 49857 71292 -78952 168987 88949 75489 -223538
18353D96256e8217A19027n0917J01565d5401j48313g5560q8631j33987E1548k1259
$$ 496256 -58217 119027 68110 169675 -45401 -193714 -75560 -164191 -298178 51548 30289
18342C0289h8816c7130r592k01555h2334B0996a75305A19351A728J95753h6856
$$ 30289 -88816 -37130 -46722 -248277 -82334 20996 -175305 119351 1728 197481 -86856
18330C8691f3517A83443b15548K5792g4510A59453h0436b377B82248B1633c8304
$$ 38691 -63517 183443 -215548 -189756 -74510 159453 -80436 -2377 282248 21633 -38304
18318A71545b84630J24342d9559C17243G6029a36487j26101I7210g2237a4744
$$ 171545 -284630 -160288 -49559 317243 76029 -136487 -262588 97210 -72237 -14744
18307A59460B8631J9048e123G2741d01684J99039n4558J12285l22364E9785h5959
$$ 159460 28631 47679 -5123 72741 -401684 -202645 -257203 -144918 -467282 59785 -85959
18295I332a60329C4054a91523M9403I3271a04621c2753j2923j94559c7980C63753
$$ 9332 -160329 34054 -191523 -142120 93271 -104621 -32753 -45676 -240235 -37980 363753
18283a60122g9166A54498b9388A13653a0186A75170a89943C10182a64531N6447
$$ -160122 -79166 154498 -29388 113653 -10186 175170 -189943 310182 -164531 -108084
18273a08084A2253d51106A45963a8490E4825g0529c277k31073A35268j2564M1647
$$ -108084 12253 -451106 145963 -18490 54825 -70529 -3277 -234350 135268 122704 164351
18262A64351i4910A13695b08934A73399a3854B7615J37785f1936b479E6753b62769
$$ 164351 -94910 113695 -208934 173399 -13854 27615 165400 -61936 -2479 56753 -262769
18250B0174b12105g1654a5984m2644D7815b21426i3144B17652e44460g1165A50291
$$ 20174 -212105 -71654 -15984 -58628 47815 -221426 -93144 217652 -544460 -71165 150291
18238a13781F7763c7238l7775o7919n75102A5059a23712J333A19117C7150d5585
$$ -113781 67763 -37238 -75013 -142932 -718034 15059 -123712 -122379 119117 37150 -45585
18226A6261K15317r098a0535j52027A85671a66048d4138I5601a16182b5145j67914
$$ 16261 231578 222480 -10535 -162562 185671 -166048 -44138 95601 -116182 -25145 -193059
18215a93059h0265B432a96632e5576B1626l174e1208r7652G8159B4803b10146
$$ -193059 -80265 2432 -196632 -55576 21626 18452 -51208 -148860 78159 24803 -210146
18203a80923B90298B2799J69781a37069C02580a91232A22959J71938a44539A83607
$$ -180923 290298 22799 192580 -137069 302580 -191232 122959 294897 -144539 183607
18192b52739k8777A73309g5731F417b3696l83199J98092E08655A03723B4750J6283
$$ -252739 -281516 173309 -75731 6417 -23696 -406895 -208803 508655 103723 24750 41033
18181D1033h6503D6805B1343J52208d545I9736a1318B76473e4939j31772j8800
$$ 41033 -86503 46805 21343 173551 -4545 99736 -11318 276473 -54939 -186711 -205511
18170b05511D512d0420G1437b5637k18596A68119a14922l8582l01K0622P878l60524
$$ -205511 4512 -40420 71437 -25637 -244233 168119 -114922 -153504 -153805 -133183 -125305 -485829
18158d85829J82227E7423Q6184a06322B04366b2795j13435b3605k58910M4329
$$ -485829 -303602 57423 143607 -106322 204366 -22795 -136230 -23605 -282515 -238186
18148b38186C23046a70655j36388A64169c5570j81967k0200e5359a8129B33299
$$ -238186 323046 -170655 -307043 164169 -35570 -217537 -237737 -55359 -18129 233299
18137g6972k11061A85973a32078A62489d2011j01975O7153K8855m9746L4278a3721
$$ -76972 -288033 185973 -132078 162489 -42011 -143986 -76833 -47978 -97724 -63446 -13721
18125I2039P5146p6484a50510A25650K12724c12273e0728j57006A70788O9886
$$ 92039 167185 90701 -150510 125650 338374 -312273 -50728 -207734 170788 240674
18115B40674b8610C12223b06819D5400g5133a9996O470l37866A71076P2137i0018
$$ 240674 -28610 312223 -206819 45400 -75133 -19996 -13526 -351392 171076 243213 -90018
18103D94232F5213b8329A66703a78351B67424d7071p4787o661k2658a4912j02363
$$ 494232 65213 -28329 166703 -178351 267424 -47071 -121858 -128519 -151177 -14912 -117275
18092a17275K8578H5039l0652K1791a97343G616a96224K5396M7383I3400B661
$$ -117275 -88697 85039 54387 76178 -197343 7616 -196224 -170828 -123445 93400 2661
18080a34358B62051e4968r5928b0874f002j43697E5576b69569j05145a83472O0218
$$ -134358 262051 -54968 -150896 -20874 -6002 -149699 55576 -269569 -374714 -183472 -123254
18069a23254B12605p4751K1896g750L547k32097H7102j9125b27152A60862e4447
$$ -123254 212605 137854 159750 -7750 -4203 -236300 87102 67977 -227152 160862 -54447
18057a31442N149D6135k2261m131J32292C2564a40779J7441j16882A15846m8719
$$ -131442 -126293 46135 23874 19743 152035 32564 -140779 -123338 -240220 115846 67127
18046F7127B075a9967A18742b20281H8269Q5923q2266a15037C09479m3392j30181
$$ 67127 2075 -19967 118742 -220281 88269 174192 91926 -115037 309479 266087 135906
18035A35906a64886B4188a27527C10399j33224m1439A3343J48831b4950n7638
$$ 135906 -164886 24188 -127527 310399 177175 135736 13343 162174 -24950 -82588
18025h2588r3523l0833A11793g6551I3730a81299B44570c3829A7963J40605b9763
$$ -82588 -176111 -206944 111793 -76551 93730 -181299 244570 -33829 17963 158568 -29763
18013i9048a432k0164R669B2961g7676o6594H2597K89887A81647E3295a66887
$$ -99048 -1432 -21596 -11927 22961 -77676 -144270 82597 372484 181647 53295 -166887
18001a22965N2031A7293L4797c52604O7310G6190a24979n3861B3751a99561A28351
$$ -122965 -70934 17293 52090 -352604 -285294 76190 -124979 -178840 23751 -199561 128351
17989D6064N0597a00945B0335b3148F4057J20391A7397c5609G7253B8346R499
$$ 46064 96661 -100945 20335 -23148 64057 184448 17397 -35609 77253 28346 37845
17978C7845i6420o3733d6467k31444I7662K623j5854b24292C31207a36202H027
$$ 37845 -96420 -160153 -46467 -277911 97662 100285 84431 -224292 331207 -136202 8027
17966a49376B10609g3811j52201d6017j14176H6707a35441O450j74878I5992a28432
$$ -149376 210609 -73811 -226012 -46017 -160193 86707 -135441 -128991 -303869 95992 -128432
17954A26385m1233L327Q266M01293B28916F0671J74016j0814D393f6917B54323
$$ 126385 85152 88479 96745 498038 228916 60671 234687 223873 4393 -66917 254323
17942b56506e9365l16003D4622q898M21311e9139j81666N6579I5593O6948J51143
$$ -256506 -59365 -375368 44622 35724 457035 -59139 -240805 -184226 95593 162541 313684
17931C13684f2347A50189c8685A85125P4041I1769c4292C24569A00424K8634c40783
$$ 313684 -62347 150189 -38685 185125 259166 91769 -34292 324569 100424 129058 -340783
17919G380J41744B8249M8293c9596j30099A09543a01035h126C31071b50777A04997
$$ 7380 149124 28249 76542 -39596 -169695 109543 -101035 -8126 331071 -250777 104997
17907a53427b049j48737A74925o398J36565r6687l0551c9533D16051I2369K1719
$$ -153427 -2049 -150786 174925 168527 305092 208405 177854 -39533 416051 92369 114088
17896A14088J5491k2308k9918b34289F9850a10848G5948J20753B5282c2945j24275
$$ 114088 129579 107271 77353 -234289 69850 -110848 75948 196701 25282 -32945 -157220
17885a57220L5031A99739c43740a20153e5944A95251c54143NJ50651c7076C05515
$$ -157220 -122189 199739 -343740 -120153 -55944 195251 -354143 -354138 -203487 -37076 305515
17873a1532G390J7412J92004g9978I4141P1738f7148l37207A52074C0340h3547
$$ -11532 7390 24802 216806 -79978 94141 165879 -67148 -404355 152074 30340 -83547
17861B25692H305b92563d8796A61466K08771a33588E6739c90845C30866a63487
$$ 225692 8305 -292563 -48796 161466 370237 -133588 56739 -390845 330866 -163487
17850b0854k0167D1853e3412C3127b9855j2667n8649q8778D68060A70701a72977
$$ -20854 -41021 41853 -53412 33127 -29855 -42522 -101171 -189949 468060 170701 -172977
17838D7421b55945a14248q6495I1086a33705k9276L0918E46325H372R0181a98638
$$ 47421 -255945 -114248 -200743 91086 -133705 -162981 -132063 546325 8372 98553 -198638
17826a54363h287n3959B25726k3362M5459M8395e0366B51017H719K80611j00669
$$ -154363 -8287 -62246 225726 202364 247823 296218 -50366 251017 8719 289330 188661
17815A88661j8052m2199K19566E3286J41285b01627A35994D7918H152O3395J09396
$$ 188661 170609 128410 347976 53286 194571 -201627 135994 47918 8152 71547 180943
17804A80943f1823C4214J59079a19601G521a14450I9771J15656G681a7311k97202
$$ 180943 -61823 34214 193293 -119601 7521 -114450 99771 215427 7681 -17311 -314513
17793c14513B39427n1641B5358N978Q9141A0109K97792p1488L5050c54931e0949
$$ -314513 239427 187786 25358 31336 120477 10109 307901 236413 271463 -354931 -50949
17781g1511p9640A22194J3465h314k6366a1151A33785J280J63837k3535a12200
$$ -71511 -151151 122194 135659 -8314 -34680 -11151 133785 135065 298902 275367 -112200
17769C0089J68991F4564a07437d8899j52241J7727P4900k85104f8777C51931A48830
$$ 30089 199080 64564 -107437 -48899 -201140 -183413 -108513 -393617 -68777 351931 148830
17757a97900A43968c22281E04119G8095J95c3794G6369Q1668n9448A8655b31422
$$ -197900 143968 -322281 504119 78095 78290 -33794 76369 158037 98589 18655 -231422
17745i3642o3167G0420K16008A17902c6505A45330J5321a64569B2347L31920b7400
$$ -93642 -156809 70420 286428 117902 -36505 145330 160651 -164569 22347 354267 -27400
17733A01798J96791q3245k5928F9547h5791F560J26718j988A8075J21089a25094
$$ 101798 298589 215344 189416 69547 -85791 6560 133278 131290 18075 139164 -125094
17721g0539C6783J00947K1350M7654K08419A04841g7751q5118B87336D8603a1184
$$ -70539 36783 137730 159080 206734 415153 104841 -77751 -162869 287336 48603 -11184
17709F7685d28j09219B84006c56333a24467A15350b7990B80656b11166H3155a24559
$$ 67685 -428 -109647 284006 -356333 -124467 115350 -27990 280656 -211166 83155 -124559
17697A55308f9673A69290D6745f4966E5356J29395r140b4487o5573j82850A28991
$$ 155308 -69673 169290 46745 -64966 55356 184751 175611 -24487 -90060 -272910 128991
17685f161F7402l2993K50468j28862J3071L0816N4304M1711a5463A01027e9621
$$ -6161 67402 34409 284877 156015 169086 199902 254206 295917 -15463 101027 -59621
17673B83492B0020f527A62691e7884C03007m9216a06627H5865C0807J59068b39995
$$ 283492 20020 -6527 162691 -57884 303007 253791 -106627 85865 30807 189875 -239995
17661A95946m6229o0567F561b6232A49856J77007j58198n0432J92113A32558j4001
$$ 195946 149717 89150 6561 -26232 149856 326863 168665 118233 310346 132558 118557
17650A18557j6980J85020l1703G0480f7786B7708h037A19977K3302a22090A26527
$$ 118557 101577 286597 254894 70480 -67786 27708 -8037 119977 143279 -122090 126527
17638A20064n6200J3027J71157b7874I3268a11948A90595e9830A20726J86143
$$ 120064 63864 76891 248048 -27874 93268 -111948 190595 -59830 120726 306869
17628C06869b05597C37058a20776C2942j5657p702d4186a513B36672q02K5942
$$ 306869 -205597 337058 -120776 32942 17285 9583 -44186 -1513 236672 235870 261812
17617B61812b3922B47430Q7206i4909o5278B13143j0018F185L3828K73763c9841
$$ 261812 -23922 247430 334636 -94909 -160187 213143 203125 6185 40013 313776 -39841
17605b02947A26531a1031A30968C1515J69546J535e0402C88357H4704K38956q6176
$$ -202947 126531 -11031 130968 31515 201061 202596 -50402 388357 84704 323660 237484
17594B37484a16869I3362g9452C73989f3287B68087b97228a04058A34694J08482
$$ 237484 -116869 93362 -79452 373989 -63287 268087 -297228 -104058 134694 243176
17584B43176j10505K64714E8091h0355A28322K66773j72j63746o3575a80986A83658
$$ 243176 132671 397385 58091 -80355 128322 395095 394923 231177 167602 -180986 183658
17572H9823J27293J64494a0044c363m02626G1198J27338R2350A16795J14642A06579
$$ 89823 217116 381610 -10044 -3363 -405989 71198 198536 290886 116795 231437 106579
17560A17945O7102o3652E3230O4022K7789d1819K0146D80817r2223m1343c8536
$$ 117945 185047 121395 53230 117252 145041 -41819 -21673 480817 388594 347251 -38536
17548A31812m4822m887L796d9338B68024a18955j70514C45502b54579E3049J87018
$$ 131812 86990 82103 85899 -49338 268024 -118955 -289469 345502 -254579 53049 240067
17537B40067A15483c5346a0640D2871M57729j48919A38982D4728h3198C08829
$$ 240067 115483 -35346 -10640 42871 500600 351681 138982 44728 -83198 308829
17526B01309q082P9490J93385k18656L34998L13320m19955m5992n8588J04611
$$ 201309 193227 272717 466102 247446 582444 895764 475809 429817 371229 475840
17516D75840I2269O5694M212K39270A87609n3331L4085L4071M06264j56173J27194
$$ 475840 92269 157963 162175 401445 187609 134278 168363 202434 608698 452525 579719
17505E79719J6037Q2461k68467r471A2483L88663q9669A24589a7339l8543A57366
$$ 579719 595756 678217 409750 400279 12483 401146 311477 124589 -17339 -55882 157366
17493A03443c8476A75607M383q3288B8683K43963p4363j2028F8379J89883D8747
$$ 103443 -38476 175607 179990 96702 28683 272646 198283 186255 68379 258262 48747
17481A99159J32296K20597A62109J13536K77444A2717J50103F3238c8404B29140
$$ 199159 331455 552052 162109 275645 553089 12717 162820 63238 -38404 229140
17470I0924M5768N0520K45094A77649b24799E7326c1797C27247j00376L84841
$$ 90924 136692 187212 432306 177649 -224799 57326 -31797 327247 226871 611712
17460F11712k68881k090g9539C81497A66086o1470J01658j5997k5445d8307q7800
$$ 611712 342831 340741 -79539 381497 166086 104616 206274 190277 164832 -48307 -136107
17449a36107A25220J1594a57221D35178r7681J61820k3267k965B21193J77548
$$ -136107 125220 136814 -157221 435178 337497 499317 476050 473085 221193 398741
17439C98741j92085L66213B83924R715A02699K66843p1575j2468K60772j82619
$$ 398741 206656 572869 283924 293639 102699 369542 297967 285499 546271 363652
17429C63652L1625m1047j43378J84234a47649A99003j4695J40776K10713B30345
$$ 363652 395277 354230 210852 395086 -147649 199003 184308 325084 535797 230345
17418D33509B05018J68918A66329K21133l61p1303A1296L92604A45670m6320a4297
$$ 433509 205018 373936 166329 387462 387101 315798 11296 403900 145670 99350 -14297
17406D36002j50028J23584F3390J6397J5338k1889J70941r516a39907A31649K79423
$$ 436002 285974 409558 63390 79787 95125 73236 244177 234661 -139907 131649 411072
17395D11072J18273k10388m2775I1263Q3633p8922R3439l5165L97418B28104J7897
$$ 411072 529345 318957 276182 91263 174896 95974 189413 154248 551666 228104 246001
17384B46001J46577j20135r4208n3542K68416b34085A09588b97635c790B50314
$$ 246001 392578 272443 178235 124693 393109 -234085 109588 -297635 -3790 250314
17373D49476a70013D47709A56790P1383J03335A57711K02103D9564L68743j91718
$$ 449476 -170013 447709 156790 228173 331508 157711 359814 49564 418307 226589
17363B26589j7340L5956O7677A6018M14785F6686K14298I90L64932p0960o9139
$$ 226589 209249 245205 312882 16018 430803 66686 280984 990 365922 294962 225823
17352B25823F5475J76655K28653j44789k305A60586d2350C55523q7881L7688A01806
$$ 225823 65475 242130 470783 325994 323689 160586 -42350 355523 267642 305330 101806
17340E08922A41032J59301K89888B87972A36279J78692a8039B32984p9635L16971
$$ 508922 141032 300333 590221 287972 136279 314971 -18039 232984 153349 470320
17330D70320b9568m0020D2371K41690J88218G7909K73539n6644l6372j16073N47644
$$ 470320 -29568 -69588 42371 284061 472279 77909 351448 294804 258432 142359 690003
17319F90003E6321J50517b4969E19991B00899K7773m0461K27516A93837a8594
$$ 690003 56321 206838 -24969 519991 200899 228672 188211 415727 193837 -18594
17308A00297J96875A46663J97681R7169j97459J71216A77379P1988r1121Q5309
$$ 100297 297172 146663 344344 441513 244054 415270 177379 249367 158246 243555
17298B43555K68313R659q3037B02651J79900A17382J7273a41711C23187j29051
$$ 243555 511868 521527 438490 202651 382551 117382 134655 -141711 323187 194136
17288A94136a1481B51248K49044K2611k54140N5217p0727j15109J72778J18285
$$ 194136 -11481 251248 500292 522903 268763 323980 253253 138144 310922 429207
17278D29207j40033L17478k49391A5034K66121K54137A23399L87155A68929a38554
$$ 429207 289174 606652 357261 15034 281155 535292 123399 510554 168929 -138554
17267a65082A06386k9813J56497J22146J90634N8410j98600j02928L49891o5964
$$ -165082 106386 76573 233070 355216 545850 604260 405660 302732 652623 586659
17257E86659A57614J13962M77644B85026j10887K34774o6526A55724J31748n3548
$$ 586659 157614 271576 749220 285026 174139 408913 342387 155724 287472 233924
17247B33924L9458L1183K21537A28390K31865K55590B64927J99634j00505k1286
$$ 233924 273382 304565 526102 128390 360255 615845 264927 464561 364056 342770
17237C42770J56065j70416A43127L40284j4551k29813p1993J1979J45022J93185
$$ 342770 498835 328419 143127 483411 468860 239047 167054 179033 324055 517240
17227E17240j93961E5825K25714L00578o4447o5894l1744A81899J92497K52116
$$ 517240 323279 55825 281539 582117 517670 451776 420032 181899 374396 626512
17217F26512A64123P17111B65248J62871r9028q3079K79070n7394j97037L16222
$$ 626512 164123 881234 265248 428119 329091 246012 525082 467688 270651 586873
17207E86873A25361L36040A22877L74564k31301J76073K14766A68787M07499B85364
$$ 586873 125361 461401 122877 497441 266140 442213 656979 168787 576286 285364
17196C67505K58487k22468J352j19599P2385j0658l8357J16977O8874Q4540k40386
$$ 367505 625992 403524 404876 285277 357662 347004 308647 425624 494498 579038 338652
17185C38652L13828k02087j36649J10013P0698P143M556k23317L18206j48275
$$ 338652 652480 450393 313744 423757 494455 501598 506154 282837 601043 452768
17175D52768B11173L28797Q9651J84524k76069j25905J75050l1771j72304M39716
$$ 452768 211173 539970 629621 814145 538076 412171 587221 555450 383146 822862
17165H22862l30173J36533K75959B97675K9436K59752J74939B35304J71034K27738
$$ 822862 492689 629222 905181 297675 327111 586863 761802 235304 406338 634076
17155F34076k90935o4146L64250p3651j57305n0078L83499l54119m1411L64923
$$ 634076 343141 278995 643245 569594 412289 362211 745710 391591 350180 715103
17145G15103j55300m749j64070K13135r8706j40372L39948j70102O9578o2187
$$ 715103 559803 555054 390984 604119 505413 365041 704989 534887 604465 542278
17135E42278M991L45216q3649k11809j62978J39911k27250L04331p6317K26371
$$ 542278 547269 892485 808836 597027 434049 573960 346710 651041 574724 801095
17125H01095j20087j16744J23718K8688P1410j96401O6967k5484K19888j35077
$$ 801095 681008 564264 687982 716670 788080 591679 658646 633162 853050 717973
17115G17973j19460K39946k65321j15346M06711k33965Q5438J36449O1164k64726
$$ 717973 598513 838459 573138 457792 864503 630538 715976 852425 913589 648863
17105F48863M1785j00320J37963J06643q1044j62442K53704p6702r1832R8052
$$ 648863 690648 590328 728291 834934 753890 591448 845152 768450 676618 774670
17095G74670K63878j10160C61652Q30046m45999j73355N29583k50917R3216k29942
$$ 774670 1038548 928388 361652 1191698 745699 572344 1101927 851010 944226 714284
17085G14284R8074k59058J48985j57583K52175O6097J09418k05062k4650J36556
$$ 714284 812358 553300 702285 544702 796877 862974 972392 767330 742680 879236
17075H79236q6779n4787m8776K32777P0818j92756r318J29712l13104K35323Q2240
$$ 879236 792457 737670 688894 921671 992489 799733 790415 920127 607023 842346 924586
17064I24586j26527J04375k89138J28777K69540j63173j0532J41345k09955O96069
$$ 924586 798059 902434 613296 742073 1011613 848440 837908 979253 769298 1465367
17054A465367F30241L71357N1762J30349j75233p4301k57004K45662J51800N0208
$$ 1465367 630241 1001598 1053360 1183709 1008476 934175 677171 922833 1074633 1124841
17044A124841n01083M39487o0384j69052L57841j96282K17585k35599J4209m3850
$$ 1124841 623758 1063245 1002861 833809 1191650 995368 1212953 977354 991563 947713
17034I47713N3807J8130k20405K00815M32263o27621N1856K35809L55627k78879
$$ 947713 1001520 1019650 799245 1000060 1432323 804702 856558 1092367 1447994 1169115
17024A169115J12081k61441N14352l04513k08639Q0595l8903N8091L06582m00962
$$ 1169115 1281196 1019755 1534107 1229594 1020955 1101550 1062647 1120738 1427320 1026358
17014A026358J35489P6308L7561K16809n12076K56218J16909q9197K05054l87327
$$ 1026358 1161847 1238155 1275716 1492525 980449 1236667 1353576 1264379 1469433 1082106
17004A082106R9095J32486K63822k58144p7104L59413q7640l40737L47602k7436
$$ 1082106 1181201 1313687 1577509 1319365 1242261 1601674 1514034 1173297 1520899 1493463
16994A493463r3144M43468o3255k35197j37042K90670j50843j62971r5480M84630
$$ 1493463 1400319 1843787 1780532 1545335 1408293 1698963 1548120 1385149 1289669 1774299
16984A774299k76145J55849l32994M59446k95613l00719N78084N8280j52940K04819
$$ 1774299 1498154 1654003 1321009 1780455 1484842 1184123 1762207 1820487 1667547 1872366
16974A872366j72337j2787O176K32579k90999J80339m5335K37122k21336j62165
$$ 1872366 1700029 1687242 1693418 1925997 1634998 1815337 1770002 2007124 1785788 1623623
16964A623623K50388K91198k74815j24474L33953j73174L70821o10638M92932
$$ 1623623 1874011 2165209 1890394 1765920 2099873 1926699 2297520 1686882 2179814
16955B179814k12489n5118K09160P7415j63431m3691J35716n1659L50748l55244
$$ 2179814 1967325 1912207 2121367 2198782 2035351 1991660 2127376 2075717 2426465 2071221
16945B071221K31278l7961M8136q5069K0602J18468L11427m47634N70465k38659
$$ 2071221 2302499 2264538 2312674 2227605 2248207 2366675 2678102 2230468 2800933 2562274
16935B562274J13641l33763M29897j11824K5604Q8152k89687J62617J74212J50689
$$ 2562274 2675915 2342152 2772049 2660225 2685829 2773981 2484294 2646911 2821123 2971812
16925B971812j22236j21333J53743M1000l9732O085J48932J41601j40810P0889
$$ 2971812 2849576 2728243 2881986 2922986 2883254 2889339 3038271 3179872 3039062 3109951
16915C109951L34231m87061J04142R2305O0743K13768j66711J40597r977J86657
$$ 3109951 3444182 2957121 3061263 3153568 3214311 3428079 3261368 3401965 3391988 3578645
16905C578645P3772j01636j90698J67549K36779j04505J26213m01011Q29159n14865
$$ 3578645 3652417 3550781 3360083 3527632 3764411 3659906 3786119 3385108 4214267 3699402
16895C699402L50199N5072r7227O1372L33400j01215m4589J83248m20108M02834
$$ 3699402 4049601 4104673 4007446 4068818 4402218 4301003 4256414 4439662 4019554 4422388
16885D422388j11457K03067n2201N23235k43301m53577P41552k22521K20541M3163
$$ 4422388 4310931 4513998 4461797 4985032 4741731 4288154 5029706 4807185 5027726 5070889
16875E070889O1091k9326p75M76069k53897J16370K39053o19965O11973j27322
$$ 5070889 5131980 5102654 5101879 5577948 5324051 5440421 5679474 5059509 5671482 5544160
16865E544160L53899l57734L83523J39771J28816J70115k24448R3787L60004k5422
$$ 5544160 5898059 5540325 5923848 6063619 6192435 6362550 6138102 6231889 6591893 6566471
16855F566471K56049J34170J56999j77899L94853P2157N5543j62960M08947o603
$$ 6566471 6822520 6956690 7113689 6935790 7330643 7402800 7458343 7295383 7704330 7697727
16845G697727L11677j28736J30953j5904M39730P6068M0251L80532j05325M56071
$$ 7697727 8009404 7880668 8011621 7995717 8435447 8511515 8551766 8932298 8826973 9283044
16835I283044J25427N10109o2054r7150R6653K04247R1108M65400K1358J12019
$$ 9283044 9408471 9918580 9856526 9759376 9856029 10060276 10151384 10616784 10638142 10750161
16825A0750161K30163Q1300O93124j1655J32810N08909P4843M71845K7864P7056
$$ 10750161 10980324 11061624 11754748 11743093 11875903 12384812 12459655 12931500 12959364 13036420
16815A3036420M86726J56468L84653J99997K84523L90798Q3006M01179N41964
$$ 13036420 13523146 13679614 14064267 14264264 14548787 14939585 15022591 15423770 15965734
16806A5965734L31566R0541N58392N75801j2147O80137M89334k27660Q14288N49916
$$ 15965734 16297300 16387841 16946233 17522034 17509887 18190024 18679358 18451698 19265986 19815902
16796A9815902J83420O03080O42451K28613O48184O56324L78459q72J110412N42191
$$ 19815902 19999322 20602402 21244853 21473466 22121650 22777974 23156433 23155561 24265973 24808164
16786B4808164L81916J199351J11050R14248O08169O77332R06390O23164N12373
$$ 24808164 25190080 26389431 26500481 27414729 28022898 28700230 29606620 30229784 30742157
16777C0742157Q74429J012359P59211N75863J433774R56085P03227J079614J130359
$$ 30742157 31616586 32628945 33388156 33964019 35397793 36353878 37057105 38136719 39267078
16768C9267078J101223N61131J259820J297969Q23076J032046J549874J368151
$$ 39267078 40368301 40929432 42189252 43487221 44310297 45342343 46892217 48260368
16760D8260368J220308J401107J181356J034436J834004Q89546J944765J213810
$$ 48260368 49480676 50881783 52063139 53097575 54931579 55821125 57765890 58979700
16752E8979700J049018J689013J437273J284558J465455J588248J127941K039051
$$ 58979700 60028718 61717731 63155004 64439562 65905017 67493265 68621206 70660257
16744G0660257J121085J430647J218393J299307J359041J106296J508791J392162
$$ 70660257 71781342 73211989 74430382 75729689 77088730 78195026 79703817 81095979
16736H1095979Q05269O81742J195213N91507J305161J41799R65751M1290L35582
$$ 81095979 81901248 82582990 83778203 84369710 85674871 85816670 86782421 86823711 87159293
16727H7159293p1531K33655L4187J70803j7064n18956o90623o10864o83626o70511
$$ 87159293 87087762 87321417 87355604 87526407 87509343 86990387 86299764 85688900 85005274 84334763
16717H4334763n59668j029656r73018j305328o64586j379403j243455q38571j748648
$$ 84334763 83775095 82745439 81772421 80467093 79802507 78423104 77179649 76341078 74592430
16708G4592430j297829j361735j424597j322368j437716j229155j615593j056153
$$ 74592430 73294601 71932866 70508269 69185901 67748185 66519030 64903437 63847284
16700F3847284j785551j185380j480218j459386j281554j315782j212279j212140
$$ 63847284 62061733 60876353 59396135 57936749 56655195 55339413 54127134 52914994
16692E2914994j603182o82830j447031j200809j134398j078247j211034j215938
$$ 52914994 51311812 50628982 49181951 47981142 46846744 45768497 44557463 43341525
16684D3341525q15483j030865o63145j361175q49089j026820p49911j174129o46643
$$ 43341525 42526042 41495177 40832032 39470857 38621768 37594948 36845037 35670908 35024265
16675C5024265j010140p97178n56105q76820n57535q34620l23028r28987p24015
$$ 35024265 34014125 33216947 32660842 31784022 31226487 30391867 30068839 29139852 28415837
16666B8415837l71741n30478j164471l61698o45389n13600j11548p14358l45551
$$ 28415837 28044096 27513618 26349147 25987449 25342060 24828460 24716912 24002554 23657003
16657B3657003n97595j44132j115021k89438l73937o39072k96774n10461j27137
$$ 23657003 23059408 22915276 21800255 21510817 21136880 20497808 20201034 19690573 19563436
16648A9563436k80334n61736k89722m90627j34619m42529p78045O017J2m92477
$$ 19563436 19283102 18721366 18431644 17941017 17806398 17363869 16585824 16591841 16591853 16099376
16638A6099376m08845q9344k06130l41131k13510o4473n36239Q7547k74586r35263
$$ 16099376 15690531 15601187 15395057 15053926 14840416 14775943 14239704 14327251 14052665 13117402
16628A3117402K34112l93865J81682m81218j13977k07555j05029l99425L47687
$$ 13117402 13351514 12957649 13139331 12658113 12544136 12336581 12231552 11832127 12179814
16619A2179814m93292q8725k64574j93733k68757o8030k89789k8478o9926m60781
$$ 12179814 11686522 11597797 11333223 11139490 10870733 10802703 10512914 10484436 10414510 9953729
16609I953729N6459l26635M4550l83098j48255L72803n14832N519r2496j56097
$$ 9953729 10010188 9683553 9728103 9345005 9196750 9569553 9054721 9060240 8967744 8811647
16599H811647j51651m5481j7150q5515j34539k44503R4050j52440k39331J00869
$$ 8811647 8659996 8614515 8597365 8511850 8377311 8132808 8226858 8074418 7835087 7935956
16589G935956m66224l5703j19917k91629M34678j47236k60722J5686R7989p5367
$$ 7935956 7469732 7434029 7314112 7022483 7457161 7309925 7049203 7064889 7162878 7087511
16579G087511l96079k22918K34556N416l29611K04633k14340m88833N22574m61516
$$ 7087511 6691432 6468514 6703070 6708486 6378875 6583508 6369168 5880335 6402909 5941393
16569E941393K57519m36625R6460J6018n7491l33538L09856r8003J58896l50106
$$ 5941393 6198912 5762287 5858747 5874765 5817274 5483736 5793592 5695589 5854485 5504379
16559E504379J0933r3905N328j48787J04310l92423p704K10385k10309J23719
$$ 5504379 5515312 5421407 5426735 5277948 5382258 4989835 4982131 5192516 4982207 5105926
16549E105926k37868J44321l73162K34854P6945R400j89835m5855l02471k8223
$$ 5105926 4868058 5012379 4639217 4874071 4951016 4960416 4770581 4724726 4422255 4394032
16539D394032m675Q0317L87900m91484m7529L4329q6998j76923L53146k88417
$$ 4394032 4389357 4469674 4857574 4366090 4318561 4352890 4265892 4088969 4442115 4153698
16529D153698J92525m16393L22148m24432L44512n29772K16090R3597J13185n53341
$$ 4153698 4346223 3929830 4251978 3827546 4172058 3642286 3858376 3951973 4065158 3511817
16519C511817L73410j29992M3685l24672L45642L4677j27594k72821L36012l26873
$$ 3511817 3885227 3755235 3798920 3474248 3819890 3854567 3726973 3454152 3790164 3463291
16509C463291k45484K7886J68515o181K08376k88524L3251J21110k05559J57642
$$ 3463291 3217807 3245693 3414208 3408027 3616403 3327879 3361130 3482240 3276681 3434323
16499C434323j21703K10543n80894L09284R0688k27126J42303L03505m8706m57198
$$ 3434323 3312620 3523163 2942269 3251553 3342241 3115115 3257418 3560923 3512217 3055019
16489C055019l9281M6653j98965M02205o63251L06494J33488o9736p1541J487
$$ 3055019 3015738 3062391 2863426 3265631 2602380 2908874 3042362 2972626 2901085 2902572
16479B902572m7245J6429m128l93290J16502K36337o7106J03918j68781Q1225
$$ 2902572 2855327 2871756 2867628 2474338 2590840 2827177 2760071 2863989 2695208 2776433
16469B776433L9567M6216l51587P638K9376R3227k48241m0520K06030p5361O9783
$$ 2776433 2816000 2862216 2510629 2518267 2547643 2640870 2392629 2352109 2558139 2482778 2552561
16458B552561j93224J54565J88516j82299k01078J59633k07000J81253P333k70011
$$ 2552561 2359337 2513902 2702418 2520119 2319041 2478674 2271674 2452927 2460260 2190249
16448B190249j35998K31976r2069M66109l23828k92878r5025K79091J34350j28568
$$ 2190249 2054251 2286227 2194158 2660267 2336439 2043561 1948536 2227627 2361977 2233409
16438B233409o0277R6694n8217n3187j32762M5080J61457m35008j5219K63289
$$ 2233409 2173132 2269826 2211609 2158422 2025660 2070740 2232197 1797189 1781970 2045259
16428B045259j03539J4752q0576r6214K22644o4746L15897k0066j94786k06223
$$ 2045259 1941720 1956472 1875896 1779682 2002326 1937580 2253477 2233411 2038625 1832402
16418A832402J53926k30102r2359M03091l36910L2665N5476m935J14185r394p7582
$$ 1832402 1986328 1756226 1663867 2066958 1730048 1762713 1818189 1813254 1927439 1918045 1840463
16407A840463n2738L1030j23365J40721j48829J77973r7942k50642K48408k9269
$$ 1840463 1787725 1818755 1695390 1836111 1687282 1865255 1767313 1516671 1765079 1735810
16397A735810q8594j08088N35971R718l58648k20118M10482k97874J64875r9860
$$ 1735810 1647216 1539128 2075099 2084817 1726169 1506051 1916533 1618659 1783534 1683674
16387A683674m62l4919k8913L0733j10948P6611k6736j89141K51563O7928p7207
$$ 1683674 1683212 1648293 1619380 1650113 1539165 1615776 1589040 1399899 1651462 1719390 1642183
16376A642183m54154p9592N95206l20519j36259M80601m89604J65143j59038K93645
$$ 1642183 1188029 1108437 1703643 1383124 1246865 1727466 1237862 1403005 1243967 1537612
16366A537612k70947K24522J24744j83235r1487L3327J72219Q6803j81545j82870
$$ 1537612 1266665 1491187 1615931 1432696 1341209 1374536 1546755 1633558 1452013 1269143
16356A269143m2687M62360j23351k81026J80569l09580K22406j55851J61286J81398
$$ 1269143 1226456 1688816 1565465 1284439 1465008 1155428 1377834 1221983 1383269 1564667
16346A564667k47458K1865J03214k58011O5445j04617J54535J70909o1201k30068
$$ 1564667 1317209 1339074 1442288 1184277 1249722 1145105 1299640 1470549 1409348 1179280
16336A179280L07617j40869m02294L6450J68032J25240K2491k7312Q6942r2153
$$ 1179280 1486897 1346028 943734 980184 1148216 1273456 1295947 1268635 1355577 1263424
16326A263424n5925l2690j88774o1784L95284m40642L39544j29606l4683R3045
$$ 1263424 1207499 1174809 986035 924251 1319535 878893 1218437 1088831 1054148 1147193
16316A147193j44154j27214K97881J30541j98948j98249K66548k98586J94891
$$ 1147193 1003039 875825 1173706 1304247 1105299 907050 1173598 875012 1069903
16307A069903R7931n9269j54266n640m8171J63632j82669P8841L40746l19924
$$ 1069903 1167834 1108565 954299 948659 900488 1064120 881451 960292 1301038 981114
16297I81114Q6368m0296J42927l28241J18891K53002j89862k8336j36645P60r3204
$$ 981114 1067482 1027186 1170113 841872 960763 1213765 1023903 995567 858922 859682 766478
16286G66478p4500p880J79209p9888K41604j57591o5226p9064k8117L36739J2625
$$ 766478 691978 684098 863307 783419 1025023 867432 802206 723142 695025 1031764 1044389
16275A044389k34990Q4787j08368J086J53462J51857k17361J7333L35127m98190
$$ 1044389 809399 894186 785818 786904 940366 1092223 874862 892195 1227322 729132
16265G29132J65614j33791j02356K19109k2444j41006J97650j26873J12202q2262
$$ 729132 894746 760955 658599 877708 855264 714258 911908 785035 897237 814975
16255H14975j60681J75194L00299l82406J80303m1529M6563p2796K13914k92679
$$ 814975 654294 829488 1129787 747381 927684 886155 932718 859922 1073836 781157
16245G81157j19738K52871k74895L35283D69674P9550P8950p7264M96957m23528
$$ 781157 661419 914290 639395 974678 469674 549224 628174 550910 1047867 624339
16235F24339J43224R2939j78933M4232j17998K89090j95327L45634l14070K13058
$$ 624339 767563 860502 681569 725801 607803 896893 701566 1047200 733130 946188
16225I46188k90162J56620k84641L60244l54815R352K94433l53799K83860j36084
$$ 946188 656026 812646 528005 888249 533434 542786 837219 483420 767280 631196
16215F31196j16776J00368J28019Q4192l64645J91389j20449J46297P2214r3656
$$ 631196 514420 614788 742807 826999 462354 653743 533294 679591 751805 658149
16205F58149o8279K65258k60579q5763J78347l03021m9535M9281K95373J14832
$$ 658149 589870 855128 594549 508786 687133 384112 334577 383858 679231 794063
16195G94063k55521j50595K72627K68347C58646K85857K9061J9288k67002L17796
$$ 794063 538542 387947 660574 928921 358646 644503 673564 692852 425850 743646
16185G43646j12313k13712J21538J49794j02733m4574B32179K13675Q4711J43883
$$ 743646 631333 417621 539159 688953 586220 541646 232179 445854 530565 674448
16175F74448k19235j68560M03514j64673Q0430j60155j1344B01799M27803J17084
$$ 674448 455213 286653 690167 525494 605924 445769 434425 201799 629602 746686
16165G46686k81755J2625J22810Q1515B58478J61857K05872k99247j9890J12205
$$ 746686 464931 477556 600366 681881 258478 420335 626207 326960 307070 419275
16155D19275L56955j39683J1136k38672K66618j51947j11599N6372M5886j02298
$$ 419275 776230 636547 647683 409011 675629 523682 412083 468455 514341 412043
16145D12043K8958A96182J02946K03788L90450D29665P6994K9980J26573j61853
$$ 412043 441001 196182 299128 502916 893366 429665 506659 536639 663212 501359
16135E01359o6321j82897J25115j5821A03004M86224A82640L6601K98687O4774
$$ 501359 435038 252141 377256 361435 103004 589228 182640 219241 517928 582702
16125E82702j38008A60136L04345j73186J76513O4799j30909J93171k55335r4372
$$ 582702 444694 160136 464481 291295 467808 532607 401698 594869 339534 245162
16115B45162r4646p1948K72626e9685H63795A79621J10232J91872A40713K51298
$$ 245162 150516 78568 351194 -59685 863795 179621 289853 481725 140713 392011
16105C92011E7601R4860J83640N8196K48823k09050J95632j59439j37955K74987
$$ 392011 57601 152461 336101 394297 643120 434070 629702 470263 332308 607295
16095F07295m4182j25193p3683f2243C97958O5137o5708A63837O858A721J24115
$$ 607295 563113 437920 364237 -62243 397958 463095 397387 163837 170695 1721 125836
16084A25836Q9655K73999j83389J4750o8994J32587l6229N161B889J14442J22162
$$ 125836 215491 489490 306101 320851 251857 384444 348215 353376 2889 117331 239493
16073B39493J15619a26578B28850M03121l01132c2450E75892j07646A84108r0642
$$ 239493 355112 -126578 228850 631971 330839 -32450 575892 468246 184108 93466
16063I3466M56909A82183L08626A46513J49714J2284J31195H9006N37256A91926
$$ 93466 550375 182183 490809 146513 296227 308511 439706 89006 626262 191926
16052B34520R8246J2631j3308j60816K34319A81585K23216j40008K39330l6072
$$ 234520 332766 345397 332089 171273 405592 181585 404801 264793 504123 468051
16042D68051j65502J95051B01291J28952j64609J4522P695Q3564g1934E11486
$$ 468051 302549 497600 201291 330243 165634 180156 187851 271415 -71934 511486
16031D20762A05861J17479o692K09183A45875B7822L10389J24905j16364e4600
$$ 420762 105861 223340 216648 425831 145875 27822 338211 463116 346752 -54600
16020B09951J38777j37477c49670E4806M4107c7653B89896I0785P4225J9510l4735
$$ 209951 348728 211251 -349670 54806 98913 -37653 289896 90785 165010 184520 149785
16009A49785J37358J75175l4346j4817j85083o8236M492J10330J4761p9476J04640
$$ 149785 287143 462318 427972 413155 228072 159836 164328 274658 289419 209943 314583
15998C14583o4030K25952k15267I3580L98047j09869A36802J15112L86660R0590
$$ 314583 250553 476505 261238 93580 491627 381758 136802 251914 638574 729164
15988G29164N02187l07198m0960o5673C24086Q7668j52947j4211m1616q4221l6490
$$ 729164 1231351 924153 883193 817520 324086 411754 258807 244596 202980 118759 82269
15977H2269K09568g814A08537Q654L3371J53846b19136B24440A03483J8162J50081
$$ 82269 291837 -7814 108537 117191 150562 304408 -219136 224440 103483 121645 271726
15966B71726K31549j69788H6865K22635B7447L08366K955b63238A48043C6865
$$ 271726 503275 333487 86865 309500 27447 335813 338768 -263238 148043 36865
15955a94177H4254J14361e5216C16022j221H4236J30633n5158N4245j1377F1453
$$ -194177 84254 198615 -55216 316022 314801 84236 214869 159711 213956 202579 61453
15943h2199A35686M8948D0840K87976B5581e6303L319I155c0017I0102L54124
$$ -82199 135686 184634 40840 328816 25581 -56303 -52984 9155 -30017 90102 444226
15932D44226j1682h421C06666f9343A79112a26642A10794j0130b61830A87587
$$ 444226 432544 -8421 306666 -69343 179112 -126642 110794 100664 -261830 187587
15921D3885a000o4439C50979A6280J38395l1853J2560D4208K75879b86173G100
$$ 43885 -1000 -65439 350979 16280 154675 122822 135382 44208 320087 -286173 7100
15909B56873c91346a09703A59677m6633L568g6296E1438Q7150D1470K90372A0130
$$ 256873 -391346 -109703 159677 113044 116612 -76296 51438 138588 41470 331842 10130
15897A50411J86335d6195A06965O5370B4546b67538A94753Q4233h1086k4561B50484
$$ 150411 336746 -46195 106965 172335 24546 -267538 194753 278986 -81086 -105647 250484
15885b90230B33120h2809C6502J71500n8805a8073A63464k4797a7842A15567J15348
$$ -290230 233120 -82809 36502 208002 149197 -18073 163464 138667 -17842 115567 230915
15874B30915l5179l914D213f5020j17442d0646A2616J05947L1420a62241c9229
$$ 230915 195736 191822 4213 -65020 -182462 -40646 12616 118563 149983 -162241 -39229
15862h4190o9721C63586a12066A00680a10139C9835M5666m1690Q0775i9295j83093
$$ -84190 -153911 363586 -112066 100680 -110139 39835 85501 43811 124586 -99295 -282388
15851b82388j3425I6158O4135p3482g7472C01183a73385B45855L0227a88648i654
$$ -282388 -295813 96158 160293 86811 -77472 301183 -173385 245855 276082 -188648 -9654
15839c65113A63017c39A73283A3194Q0452O5905A6381d31459B42853b64729C65172
$$ -365113 163017 -339 173283 13194 93646 159551 16381 -431459 242853 -264729 365172
15827a44867m8883b8277l60751a40967G5723c1907j81778r4126B65516b19691
$$ -144867 -193750 -28277 -389028 -140967 75723 -31907 -213685 -307811 265516 -219691
15816A23454b11079A34677h350M124B10295b32736B38106q5094J10587Q2590A50103
$$ 123454 -211079 134677 -8350 -4226 210295 -232736 238106 153012 263599 346189 150103
15804i5693J6679l03307C22208a0453D67609A67124e8886B59482a60979A97983
$$ -95693 -79014 -382321 322208 -10453 467609 167124 -58886 259482 -160979 197983
15793a3205j24993b7853C05332d68275e8413I1487b04675g683k46618j43745a80873
$$ -13205 -138198 -27853 305332 -468275 -58413 91487 -204675 -7683 -254301 -398046 -180873
15781g9206A64445n7254c21139b0269l6451B67046a40529q4532D2314b5268H7479
$$ -79206 164445 107191 -321139 -20269 -56720 267046 -140529 -225061 42314 -25268 87479
15769A220J61012N6500a72446B58443A22724l9563J47318A790b15925B4391b06089
$$ 1220 162232 218732 -172446 258443 122724 83161 230479 1790 -215925 24391 -206089
15757A52887B2143L23201D632c63637B1405K68289J12418o8352b5736H1740a03863
$$ 152887 22143 345344 4632 -363637 21405 289694 402112 333760 -25736 81740 -103863
15745I783b07674B38096O1553p7862c3366A60802B2504j0814c2751A44033J80595
$$ 9783 -207674 238096 299649 221787 -33366 160802 22504 11690 -32751 144033 324628
15734C24628a18992C071b10916O0645I0968P8295D0605M30569j41163c44013a30823
$$ 324628 -118992 3071 -210916 -150271 90968 169263 40605 471174 330011 -344013 -130823
15722a94337Q4227E8546j6337J38893A2955J8058g9388B35535D6805a85942F4172
$$ -194337 -110110 58546 42209 181102 12955 31013 -79388 235535 46805 -185942 64172
15710a478l18426A47933A909J4700J70332K09162j69181a60849I156e9676K7408
$$ -1478 -319904 147933 1909 16609 186941 396103 226922 -160849 9156 -59676 -32268
15699c2268B1340a2775k828E6994f5795j58129A07253O1729H0427P664f7604B22669
$$ -32268 21340 -12775 -15603 56994 -65795 -223924 107253 168982 80427 88091 -67604 222669
15686d9306l4815I2734e9277m72776D04199A8679J2946b30799B67976D2477b16586
$$ -49306 -84121 92734 -59277 -532053 404199 18679 31625 -230799 267976 42477 -216586
15674a13140K3840h33k2437D49783A53311h3871c9747C26237f2796A75132f1507
$$ -113140 -89300 -833 -23270 449783 153311 -83871 -39747 326237 -62796 175132 -61507
15662D5019f7885D5839J69829g5711b9695A3926a52781A25410h0336F4452e9409
$$ 45019 -67885 45839 215668 -75711 -29695 13926 -152781 125410 -80336 64452 -59409
15650A71211a61656E7915J76148c0065j93797A94278E0803O5100i9726J9016C3727
$$ 171211 -161656 57915 234063 -30065 -223862 194278 50803 115903 -99726 -80710 33727
15638c03474A67457f2996k3540k09001C142d5016j73038D5339L6512c36242J44037
$$ -303474 167457 -62996 -86536 -295537 3142 -45016 -218054 45339 81851 -336242 -192205
15627a92205A07445f2305j51208n7432i5266j23693A03766d57748F5171a67243
$$ -192205 107445 -62305 -213513 -270945 -95266 -218959 103766 -457748 65171 -167243
15616e9806B17604p2382C6427d16858A92294n0514D2686j6469d9859D8410b57120
$$ -59806 217604 145222 36427 -416858 192294 141780 42686 26217 -49859 48410 -257120
15604A21713D0663i838o3232A07906A8125j538J87610J16452H1058N3014N4028
$$ 121713 40663 -9838 -73070 107906 18125 16587 204197 320649 81058 134072 188100
15593A88100J03634h5589j06695b495n1282P843m86850a88676i215A64570a88748
$$ 188100 291734 -85589 -192284 -2495 -53777 -45934 -532784 -188676 -9215 164570 -188748
15581I7840a06822H8134i8860A68747a69009N1488B42585r0362E4783J33218e7716
$$ 97840 -106822 88134 -98860 168747 -169009 -117521 242585 152223 54783 188001 -57716
15569C9172J43017k9808l525E0881p746n616M28552a04217j3853A9444K8201J07033
$$ 39172 182189 152381 148856 50881 43135 37519 466071 -104217 -118070 19444 47645 154678
15557A54678G0883N7476b1299k5633o1808n838A97893a64593e8852A09242a07201
$$ 154678 70883 128359 -21299 -46932 -108740 -114578 197893 -164593 -58852 109242 -107201
15545B21573j02736D000M0266K61452E2424j72q178e48921G2894K49359F7675
$$ 221573 118837 4000 44266 305718 52424 52252 44074 -548921 72894 322253 67675
15533a4542A63075F0872J85650I893b44430A06090C2677J9034P508d5232A8124
$$ -14542 163075 60872 246522 9893 -244430 106090 32677 51711 59219 -45232 18124
15521B06055b5369l801l44856J36701A1942c269j05111A86055A9735a95659d7965
$$ 206055 -25369 -29170 -374026 -237325 11942 -3269 -108380 186055 19735 -195659 -47965
15509D9374c52011A13632b1341A33111b34069N5133q0652A84480a88649A12148
$$ 49374 -352011 113632 -21341 133111 -234069 -178936 -259588 184480 -188649 112148
15498B26143a93069m7726k62675a19744l2992e3997I527J22474B3041D373O9700
$$ 226143 -193069 -240795 -503470 -119744 -152736 -53997 9527 132001 23041 4373 74073
15487G4073a16375C0372a9640A46086b49684A29674l8948i813B57M17513R6190
$$ 74073 -116375 30372 -19640 146086 -249684 129674 90726 -9813 257 417770 513960
15476E13960p7132F5534A2684J35630P4449J03505J26547C3741i9603M2501q5036
$$ 513960 436828 65534 12684 148314 222763 326268 452815 33741 -99603 -57102 -142138
15465a42138A89363b60610E8749a46745c2882H2702g946A60938a49776j84560
$$ -142138 189363 -260610 58749 -146745 -32882 82702 -7946 160938 -149776 -334336
15455c34336A54786P5314A8461J38446E6841J9733Q0056J10093L56669H1119L36650
$$ -334336 154786 230100 18461 156907 56841 76574 156630 266723 623392 81119 417769
15444D17769L64736A86013Q8364J53571K4497a79529A33087g8828A88032A4978
$$ 417769 782505 186013 274377 427948 452445 -179529 133087 -78828 188032 14978
15433a10626A1334a21164d2770k40251J20367A61770M4344P490Q64a9100B228
$$ -110626 11334 -121164 -42770 -283021 -162654 161770 206114 213604 214468 -19100 2228
15421A75488h4609A27403h7786I0398g2129C8998a5896j0604k63214e516B09615
$$ 175488 -84609 127403 -87786 90398 -72129 38998 -15896 -26500 -289714 -5516 209615
15409c4962j73157e5593r261k7630o4544j0573e5227D7102c60928f5550k37345
$$ -34962 -208119 -55593 -64854 -92484 -157028 -167601 -55227 47102 -360928 -65550 -302895
15398c02895A62160c14333a31379a0890m7851j01679G1352M6488a23872L6282
$$ -302895 162160 -314333 -131379 -10890 -58741 -160420 71352 117840 -123872 -87590
15388h7590i221B45902l8305b14848A25605D4058a52839A10385M6155a86064B02123
$$ -87590 -9221 245902 207597 -214848 125605 44058 -152839 110385 156540 -186064 202123
15376a51490O1391e415B83539C2332L62920l9101j33370r2389K48012d1680C3101
$$ -151490 -90099 -5415 283539 32332 395252 356151 222781 130392 378404 -41680 33101
15364C79554j70342Q3261g9057b2936B33666O1678q951J65130K8986j89498j37485
$$ 379554 209212 292473 -79057 -22936 233666 295344 286393 451523 480509 291011 153526
15353A53526O3874M5227g918A12040D1553C376J12651N1448D6227K3182N1694
$$ 153526 217400 262627 -7918 112040 41553 3376 116027 167475 46227 69409 121103
15342A21103J9810l0861N2417K2570K32304b130A01985L4243g4978A21160a53164
$$ 121103 140913 110052 162469 185039 417343 -2130 101985 136228 -74978 121160 -153164
15330A15426h0175A3944d6811K1792l4168A07045J76218P5650F1066J3454b10335
$$ 115426 -80175 13944 -46811 -25019 -59187 107045 283263 358913 61066 74520 -210335
15318a68189A94171K32649G8896a51000A24132P4673H3692K95333I8433L15882
$$ -168189 194171 426820 78896 -151000 124132 198805 83692 379025 98433 414315
15308D14315Q407j50679B1457K52004D601J8188R2119C4514J07152b13045C0712
$$ 414315 422722 272043 21457 273461 4601 22789 114908 34514 141666 -213045 30712
15296a15416C88884j63186p8218a28070B37731L9956c7431D6371J06177j5451
$$ -115416 388884 225698 147480 -128070 237731 277687 -37431 46371 152548 137097
15286A37097a07660B28419E6846K77287j02634b11485F667b81316B25593r8907
$$ 137097 -107660 228419 56846 334133 231499 -211485 6667 -281316 225593 126686
15276A26686j9668J98649a66355I2749a24951B7935K18063c3511A0804K03457
$$ 126686 107018 305667 -166355 92749 -124951 27935 245998 -33511 10804 214261
15266B14261K11307a45955A80776j9967b90871e7680p7564b7273H0357J75173
$$ 214261 425568 -145955 180776 160809 -290871 -57680 -135244 -27273 80357 255530
15256B55530D84J05674E2361Q7095j5949B6880K59570j7108P23617J588299j051344
$$ 255530 484 106158 52361 139456 123507 26880 286450 269342 992959 2581258 1529914
15245A529914L47615Q6467I42345B49098I987L62735e4878D3280A0906J75590
$$ 1529914 1877529 1963996 942345 249098 9987 372722 -54878 43280 10906 186496
15235A86496b6905n4592L6465A16877m0008L2987L1482B6464l46J11972h301F7278
$$ 186496 -26905 -81497 -45032 116877 76869 109856 141338 26464 26118 138090 -8301 67278
15222B69403a88648B69546r3482a43326B90274D7377K21973J06746G543g4834
$$ 269403 -188648 269546 176064 -143326 290274 47377 269350 376096 7543 -74834
15211A80478q1157l4889a19810h951I2119e989k41572A05109a50855k5255A82253
$$ 180478 99321 64432 -119810 -8951 92119 -5989 -247561 105109 -150855 -176110 182253
15199B42679a01692B13553k1697Q7002Q01i9841A80670a49746C31592e6295A90728
$$ 242679 -101692 213553 191856 278858 279659 -99841 180670 -149746 331592 -56295 190728
15187A97611j0758N9780J66395A02496l5385P62J70076r8709d7813q287j48974
$$ 197611 186853 246633 413028 102496 67111 67873 237949 139240 -47813 -56100 -205074
15176b05074I7526e1801j70833A39569l2289N6970J99587m8926E2444J19360c9510
$$ -205074 97526 -51801 -222634 139569 107280 164250 363837 314911 52444 171804 -39510
15164A46415e4715B95407A24163d40018A9543O5201k169f8849J9572B71143J366
$$ 146415 -54715 295407 124163 -440018 19543 84744 82575 -68849 -49277 271143 272509
15153B72509e9097m9162M0174A72259F9288M5940Q3285l537d7370p5038C54012
$$ 272509 -59097 -108259 -68085 172259 69288 115228 198513 194976 -47370 -122408 354012
15141C38809g4811k0432j14821A14588n3762L4179K5923l7116i7329A75899a84086
$$ 338809 -74811 -95243 -210064 114588 60826 95005 120928 83812 -97329 175899 -184086
15129B17782J9036E339K04150n746L6271L94B9563J55888g3181B26504M6106H2410
$$ 217782 236818 5339 209489 203743 240014 240408 29563 185451 -73181 226504 272610 82410
15116A39355J9536i5824H9941a09719C27782b42368F567O8577a05527b1769E5060
$$ 139355 158891 -95824 89941 -109719 327782 -242368 6567 75144 -105527 -21769 55060
15104D1496K9228R0066m1264a93312C76839g3987I4617l0145N8041m887c006D5253
$$ 41496 70724 160790 119526 -193312 376839 -73987 94617 64472 122513 117626 -3006 45253
15091B32916A01545K1048L26711k04096H7868L96067c4952A72590J9081J09979
$$ 232916 101545 122593 449304 245208 87868 483935 -34952 172590 191671 301650
15081C01650b9377A21959R8614A6321J74634a944D21052F1880k31R1188J24889
$$ 301650 -29377 121959 220573 16321 190955 -1944 421052 61880 61649 152837 277726
15070B77726b4874l3446G9340R257N9166h7275A72441R5501J05566j60416c0367
$$ 277726 -24874 -58320 79340 88597 147763 -87275 172441 267942 373508 213092 -30367
15058I6656L04290j77828Q9639I3946M69900B44857o2502J93946O364H7393J35869
$$ 96656 400946 223118 312757 93946 563846 244857 182355 376301 382665 87393 223262
15047B23262J23568K1714r8659J98818B19676L47009B06040J39878J6128I6789
$$ 223262 346830 368544 269885 468703 219676 566685 206040 345918 362046 96789
15036B0856b7847A39829K26768j54756J13990l644m2315q6339K96274A42986J41063
$$ 20856 -27847 139829 366597 211841 325831 322187 279872 193533 489807 142986 284049
15025B84049J67227p2830J10763F9466b72381A39512J88755r2993R1351j815I9457
$$ 284049 451276 378446 489209 69466 -272381 139512 328267 235274 326625 324810 99457
15013D84005A2868K05257J05285j50094E0725L31683a27759E75638A26468J32421
$$ 484005 12868 218125 323410 173316 50725 382408 -127759 575638 126468 258889
15003B58889j15679N95776C54689J99680A51302L25388l5420j2863j50216j033
$$ 258889 143210 738986 354689 554369 151302 476690 441270 428407 278191 277158
14993B77158m6521a81730D20916k5507m5291P8966j50751A04540L03857K4677
$$ 277158 230637 -181730 420916 395409 350118 429084 278333 104540 408397 433074
14983D33074k05069J98141r3245l6852J5632L08643l0506k23470L33154j41834
$$ 433074 228005 426146 332901 296049 311681 620324 589818 366348 699502 557668
14973E57668J02123A41336M24704m0099p4669Q7857R9008j87019J83770l01812
$$ 557668 659791 141336 566040 525941 451272 539129 638137 451118 634888 333076
14963C33076j09852J78341L15714j74773m179j42205n5784o4265A12947K77269
$$ 333076 223224 401565 717279 542506 538327 396122 340338 276073 112947 390216
14953C90216n7524q9917L72468k06886j1528J55181B74624j0988N23490A68569
$$ 390216 332692 242775 615243 408357 396829 552010 274624 263636 787126 168569
14942E61390j77383P0859J84315B92561J15778A59521M33488J1225j70085K54724
$$ 561390 384007 454866 639181 292561 408339 159521 593009 604234 434149 688873
14932F88873l3615J65504J22129m66362M09877J268L6195j29663K5596J04516
$$ 688873 655258 820762 942891 476529 886406 887674 923869 794206 819802 924318
14922I24318j1674k06420M44841K56385j84540J59665o1139l21037j08374k0496
$$ 924318 912644 706224 1151065 1407450 1222910 1382575 1321436 1000399 892025 871529
14912H71529k53993j05992K92381k61203n2597G7560J75408O2070j31480M93722
$$ 871529 617536 511544 803925 542722 490125 77560 252968 315038 183558 677280
14902F77280j28975c6073C54172A61636N2839K77710R9689j77902R9113A23700
$$ 677280 548305 -36073 354172 161636 214475 492185 591874 413972 513085 123700
14891A67187K03244M5274K41059j34681l6444J37733B67827K15209q7264E2855
$$ 167187 370431 415705 656764 522083 485639 623372 267827 483036 395772 52855
14880D15360j74468K69869N9019q344j83448J14867g7426C61491A60270O4118
$$ 415360 240892 510761 569780 561436 377988 492855 -77426 361491 160270 224388
14870B24388J82859J4828K68464j63206j02314M31207D00368M38121m02226m1266
$$ 224388 407247 422075 690539 527333 425019 856226 400368 838489 436263 394997
14860C94997n1054J62159j63917A59663n8518N54903k85817k287A07073L54435
$$ 394997 343943 506102 342185 159663 101145 656048 370231 367944 107073 461508
14850D61508p4614J60871J95352l49421j30381N33969C60929K97930J23856j4616
$$ 461508 386894 547765 743117 393696 263315 797284 360929 658859 782715 768099
14840G68099K18757r6037k93374L11219j56236J03921m24514L68196k51922n8578
$$ 768099 986856 890819 597445 908664 752428 856349 431835 800031 548109 489531
14830D89531j09194l9941J51982L97819C87000K10515B60833L7297O48785D22414
$$ 489531 380337 340396 492378 890197 387000 597515 260833 298130 946915 422414
14819F19492J15245L540B00196k7161N54228k12651R3404p9267L30675l18861
$$ 619492 734737 738277 200196 173035 727263 514612 608016 528749 859424 540563
14809E40563K69389K3252j85304K7274q5068p142L2710M50126j52996r0690l50156
$$ 540563 809952 833204 647900 675174 590106 582964 615674 1065800 912804 822114 471958
14798D71958K11124l02696L57776B76189L51926q0768j12195K14395p5387j38639
$$ 471958 683082 380386 738162 276189 628115 547347 435152 649547 574160 435521
14788D35521r3022M61055k62201J27642j2721M0344P0101j39057r4238K38588
$$ 435521 342499 803554 541353 668995 656274 696618 766719 627662 533424 772012
14778G72012p8152j57072O97J87551j75600N8398J00919j78846J82514B41399
$$ 772012 693860 536788 537485 725036 549436 607834 708753 529907 712421 241399
14767F50779j70448K74856N7803k97633j01157N88926l17861C36331j1166L01964
$$ 650779 480331 755187 812990 515357 414200 1003126 685265 336331 325165 627129
14757F27129j29347M3105M60375l79323J46827l00030L37450L7432C07934O27905
$$ 627129 497782 540887 1001262 621939 768766 468736 806186 843618 307934 935839
14747I35839j32268Q638J25967l21693N2492K2707n1460C01138M23707k53610
$$ 935839 803571 812209 938176 616483 668975 691682 640222 301138 724845 471235
14737D71235J13579J71747K04498j45998l6895j60859o720o9161L38689L68839
$$ 471235 584814 756561 961059 815061 778166 617307 610587 541426 880115 1248954
14727A248954n24710R4554J72140J55759j22283M14639j99934n8158k26107L09436
$$ 1248954 724244 818798 990938 1146697 1024414 1439053 1239119 1180961 954854 1264290
14717A264290j51246l66599J97686k44212J24825J94220m26801K49231k71248
$$ 1264290 1113044 746445 944131 699919 824744 1018964 592163 841394 570146
14708E70146O99749m06862J36560k26592L21911j28336p3454J87136L00010l88654
$$ 570146 1269895 863033 999593 773001 1094912 966576 893122 1080258 1380268 991614
14698I91614J29029J50027m09513L57293j77439K02920j78130o6882j30704J63374
$$ 991614 1120643 1270670 861157 1218450 1041011 1243931 1065801 998919 868215 1031589
14688A031589l19825J23639P0107j93184Q5456M19716l99819L71039k8295J07362
$$ 1031589 711764 835403 905510 712326 797782 1217498 817679 1188718 1160423 1267785
14678A267785l60481p4007J22471k7475m0720J00397m14420N79471l90633K82336
$$ 1267785 907304 833297 955768 928293 887573 987970 573550 1153021 762388 1044724
14668A044724r3247j12385K72696j21873R2716l40234L61055o0381M8197j87518
$$ 1044724 951477 839092 1111788 989915 1082631 742397 1103452 1043071 1091268 903750
14658I03750j95071K37835j77166J74319K21327l30013M51059k51526Q8544n1465
$$ 903750 708679 946514 769348 943667 1164994 834981 1286040 1034514 1123058 1071593
14648A071593J58789j80961J23760l26114m6783P4371M75583K21942j58641j47051
$$ 1071593 1230382 1049421 1173181 847067 800284 874655 1350238 1572180 1413539 1266488
14638A266488J61185l00453J92345k79442K56100k54170K01650M1746o3013k9105
$$ 1266488 1427673 1127220 1319565 1040123 1296223 1042053 1243703 1285449 1222436 1193331
14628A193331O6596o5906k12620m7420M29122o9681J43549o1973r3018Q7584j82967
$$ 1193331 1259927 1194021 981401 933981 1363103 1293422 1436971 1374998 1281980 1369564 1186597
14617A186597L37603j1032j19857j62723J0125J1971K85127J43374r7116j83327
$$ 1186597 1524200 1513168 1393311 1230588 1240713 1252684 1537811 1681185 1584069 1400742
14607A400742J2397j47615N11504m11894L30806k11969j2757n586m4827L14885
$$ 1400742 1413139 1265524 1777028 1365134 1695940 1483971 1471214 1465628 1420801 1735686
14597A735686k76435L20388l85088k4476K47410P4977j81655J19431k16840J78902
$$ 1735686 1459251 1779639 1394551 1370075 1617485 1692462 1510807 1630238 1413398 1592300
14587A592300j43327L63063l3717K37924k53718L64903j42532J68905l11596o6907
$$ 1592300 1448973 1812036 1778319 2016243 1762525 2127428 1984896 2153801 1842205 1775298
14577A775298L22886l31762K94355Q348j81260L82612p8547k31925L71844j24187
$$ 1775298 2098184 1766422 2060777 2069125 1887865 2270477 2191930 1960005 2331849 2207662
14567B207662j70473K52644l59561L64130R6379N9526R8033j60548J85170K26352
$$ 2207662 2037189 2289833 1930272 2294402 2390781 2450307 2548340 2387792 2572962 2799314
14557B799314K00588j81994N34186J27761J12187N90910M67133J188537K076284
$$ 2799314 2999902 2817908 3352094 3479855 3592042 4182952 4650085 5838622 7914906
14548G914906L575096Q005704J6722420L722084A8738284o803114n463496k918884
$$ 7914906 11490002 19495706 36218126 39940210 18738284 11935170 6471674 3552790
14540C552790n68753q49628p7772k07461K47897l72949M82431K03785l66292K50787
$$ 3552790 2984037 2134409 2056637 1849176 2097073 1724124 2206555 2410340 2044048 2294835
14530B294835j19879k50302K23451O2403n36743O13847k66431N56387j49460n1882
$$ 2294835 2174956 1924654 2148105 2210508 1673765 2287612 2021181 2577568 2428108 2376226
14520B376226N5807Q6422J5038m1696m6644Q1938k27409J71633J81197R6071M1181
$$ 2376226 2432033 2518455 2533493 2491797 2445153 2527091 2299682 2471315 2652512 2748583 2789764
14509B789764M7496n834J64702k4261l84348L51464p5443J43476l92055K84938
$$ 2789764 2837260 2831426 2996128 2971867 2587519 2938983 2863540 3007016 2614961 2899899
14499B899899J71467J5900J3610P5482r9837N094K98675k58033L15362l43296
$$ 2899899 3071366 3087266 3100876 3176358 3076521 3081615 3380290 3122257 3437619 3094323
14489C094323K18807K69748k81442k5690K46158J37746j50837J85685P8968J43550
$$ 3094323 3313130 3582878 3301436 3275746 3521904 3659650 3508813 3694498 3773466 3917016
14479C917016j44778J66355l32057K20780L7274K37979j35085R2889K650q6443
$$ 3917016 3772238 3938593 3606536 3827316 3864590 4102569 3967484 4060373 4063023 3976580
14469C976580L40226k36342K54502R0887k62397J7143L24192P8066k71672J21352
$$ 3976580 4316806 4080464 4334966 4425853 4163456 4180599 4504791 4582857 4311185 4432537
14459D432537K20441O6270n9304L44521j27k90824J5746P4993J76514K16984K88131
$$ 4432537 4652978 4719248 4659944 5004465 5004338 4713514 4729260 4804253 4980767 5197751 5485882
14448E485882j79812K4899K73829l00067J09997O0786K33358q092l60k34356O63855
$$ 5485882 5306070 5330969 5604798 5304731 5414728 5475514 5708872 5700780 5700420 5466064 6129919
14437F129919n4022M7226L731R1588j19025O10590n82697N91644J24334R7674
$$ 6129919 6075897 6123123 6126854 6218442 6099417 6710007 6127310 6718954 6843288 6940962
14427F940962K18746k30652J56649L38523q5155L76984l7792L90600j23234K29040
$$ 6940962 7159708 6929056 7085705 7424228 7339073 7716057 7678265 8068865 7945631 8174671
14417H174671O2620j3901l7388J95602Q4859K49700L41655k52890M36710k63628
$$ 8174671 8237291 8223390 8186002 8381604 8466463 8716163 9057818 8804928 9241638 8978010
14407H978010L17760L28147O9789L71607o64359P00835K90785o3382K29996J16996
$$ 8978010 9295770 9623917 9693706 10065313 9400954 10101789 10392574 10329192 10559188 10676184
14397A0676184J1816K26949N8359J85762L83406Q2227K19120K50142K05937J40870
$$ 10676184 10688000 10914949 10973308 11159070 11542476 11624703 11843823 12093965 12299902 12440772
14387A2440772L08145J46441Q5638L39597K39633R7193M19788K74616O6435Q21121
$$ 12440772 12748917 12895358 12980996 13320593 13560226 13657419 14077207 14351823 14418258 15239379
14377A5239379P5602J20116M44715j29284O38083J13812N76567J29796M31906
$$ 15239379 15314981 15435097 15879812 15750528 16388611 16502423 17078990 17208786 17640692
14368A7640692M02681L36776L29652M30009M37161O99126K95825K29289K56139
$$ 17640692 18043373 18380149 18709801 19139810 19576971 20276097 20571922 20801211 21057350
14359B1057350Q86325M40399M83856M27015O62503O59814K08671O13152P51763
$$ 21057350 21943675 22384074 22867930 23294945 23957448 24617262 24825933 25439085 26190848
14350B6190848O37215N23746Q06913M24656J242704O83632Q00456P47171M81276
$$ 26190848 26828063 27351809 28158722 28583378 29826082 30509714 31310170 32057341 32538617
14341C2538617J329540N79283J442286O94652J133859R49133J164426J160930
$$ 32538617 33868157 34447440 35889726 36584378 37718237 38667370 39831796 40992726
14333D0992726J063659J420585J471005J626813J086228J634294J591341J924028
$$ 40992726 42056385 43476970 44947975 46574788 47661016 49295310 50886651 52810679
14325E2810679J374071K263151J563869J941138J943412K414481K487082K065630
$$ 52810679 54184750 56447901 58011770 59952908 61896320 64310801 66797883 68863513
14317F8863513K584852K413803K960601K926604L084091L644645L374996M114175
$$ 68863513 71448365 73862168 76822769 79749373 82833464 86478109 89853105 93967280
14309I3967280L526311M105385L968014M783280N021942M907763N841816N851468
$$ 93967280 97493591 101598976 105566990 110350270 115372212 120279975 126121791 131973259
14301A31973259O081307O296287O840129P695922P318645Q351608Q456409R242739
$$ 131973259 138054566 144350853 151190982 158886904 166205549 174557157 183013566 192256305
14293A92256305R775219R966870J0773215J1343895J1426430J2064320J2611528
$$ 192256305 202031524 211998394 222771609 234115504 245541934 257606254 270217782
14286B70217782J3336644J2885394J3692074J4072620J3776406J4394470J4245649
$$ 270217782 283554426 296439820 310131894 324204514 337980920 352375390 366621039
14279C66621039J3625628J3497385J2338177J1850931J0332996Q536253O121707
$$ 366621039 380246667 393744052 406082229 417933160 428266156 436802409 442924116
14272D42924116L290413J642418J013753j076921m490343m888628o555487r061475
$$ 442924116 446214529 447856947 448870700 447793779 443303436 438414808 431859321 422797846
14264D22797846j1020459j2386823j3604502j4457351j4665998j5163981j5211456
$$ 422797846 411777387 399390564 385786062 371328711 356662713 341498732 326287276
14257C26287276j4830044j4533463j4590812j4078541j2303755j1712917j2298151
$$ 326287276 311457232 296923769 282332957 268254416 255950661 244237744 231939593
14250B31939593j1833698j0856270j0120280r813239r304736q732207p528209
$$ 231939593 220105895 209249625 199129345 189316106 180011370 171279163 163750954
14243A63750954p792194p510643o788896o275144o441156n578949n088386m882061
$$ 163750954 155958760 148448117 141659221 135384077 128942921 123363972 118275586 113393525
14235A13393525n083377m775827m278917l698167l467395m033431l362639l398710
$$ 113393525 108310148 103534321 99255404 95557237 92089842 88056411 84693772 81295062
14227H1295062l055859l086846k355625k756503k395300k515883k243923j897738
$$ 81295062 78239203 75152357 72796732 70040229 67644929 65129046 62885123 60987385
14219F0987385k241114k131282j695241j480513k102478j325993j095755j728512
$$ 60987385 58746271 56614989 54919748 53439235 51336757 50010764 48915009 47186497
14211D7186497j555612j434485j372649j175683n39825j021580j561076p96427
$$ 47186497 45630885 44196400 42823751 41648068 41108243 40086663 38525587 37729160
14203C7729160j523363j051500o21047o98925j125239j044080n31677j065014
$$ 37729160 36205797 35154297 34533250 33834325 32709086 31665006 31133329 30068315
14195C0068315n24749o52204p02126q23088p28477m59215p75235o18880n58092
$$ 30068315 29543566 28891362 28189236 27366148 26637671 26178456 25403221 24784341 24226249
14186B4226249l29631o36363n55262n85446m16849m91735l30965o82910k84205
$$ 24226249 23896618 23260255 22704993 22119547 21702698 21210963 20879998 20197088 19912883
14177A9912883l77718k82524o60855k87450o10468j27657K6431q48747j64450
$$ 19912883 19535165 19252641 18591786 18304336 17693868 17566211 17592642 16743895 16579445
14168A6579445l0451m51668j50437o35075m11615J52410l92651j86707j72927
$$ 16579445 16548994 16097326 15946889 15311814 14900199 15052609 14659958 14473251 14300324
14159A4300324Q6792n60993l15464k30029k01129k33700m61576j25933o6703l30644
$$ 14300324 14387116 13826123 13510659 13280630 13079501 12845801 12384225 12258292 12191589 11860945
14149A1860945O0767K8960r51136K92853k30412k54919J21946l45022k3760l93328
$$ 11860945 11921712 11950672 10999536 11292389 11061977 10807058 10929004 10583982 10560222 10166894
14139A0166894j43112j19940l99691J20461n7083k32798j13044o2971l45128l7185
$$ 10166894 10023782 9903842 9504151 9624612 9567529 9334731 9221687 9158716 8813588 8776403
14129H776403l15399K96499j82098k80204j18982M643l1994L2074p1795n12061
$$ 8776403 8461004 8757503 8575405 8295201 8176219 8180862 8148868 8180942 8109147 7597086
14119G597086K7462j8733o2994R8011l7809n31695J68185m24237n656k58037K07940
$$ 7597086 7624548 7605815 7542821 7640832 7603023 7071328 7239513 6815276 6809620 6551583 6759523
14108F759523n62993L37715N2955k07934o6487o0332q2607J71737J5863n88291
$$ 6759523 6196530 6534245 6587200 6379266 6312779 6252447 6169840 6341577 6357440 5769149
14098E769149L6942K20559l65622J5169O9390k85063j14360P8299J22954m87201
$$ 5769149 5806091 6026650 5661028 5676197 5745587 5460524 5346164 5424463 5547417 5060216
14088E060216M01795r6455k68066K08312k92165J37409k42978n0369j32752j38631
$$ 5060216 5462011 5365556 5097490 5305802 5013637 5151046 4908068 4857699 4724947 4586316
14078D586316J08096K03966k13733l03968J30866m80515N19014K94236l79894
$$ 4586316 4694412 4898378 4684645 4380677 4511543 4031028 4550042 4844278 4464384
14069D464384K34541m17595M0438k2632J38316m14962j51352K10595L56508j76900
$$ 4464384 4698925 4281330 4321768 4299136 4437452 4022490 3871138 4081733 4438241 4261341
14059D261341l08151r9253N5433J48193j63317n377l43475j30110J69062K56518
$$ 4261341 3953190 3853937 3909370 4057563 3894246 3888869 3545394 3415284 3584346 3840864
14049C840864o08136K91445j55511J34299j78326J22828K006j51686m9813K3608
$$ 3840864 3232728 3524173 3368662 3502961 3324635 3447463 3449469 3297783 3247970 3271578
14039C271578K51952n59480J64143J73794k57376K56230L5945J43788k25559l3899
$$ 3271578 3523530 2964050 3128193 3301987 3044611 3300841 3336786 3480574 3255015 3221116
14029C221116K10606p95467J36138K41481J1769k248m67389J07163J1523J65780
$$ 3221116 3431722 2636255 2772393 3013874 3025643 3023395 2556006 2663169 2674692 2840472
14019B840472o5315k14425j13519M29822j30658l32069n7323J19385J10890r2968
$$ 2840472 2775157 2560732 2447213 2877035 2746377 2414308 2356985 2476370 2587260 2494292
14009B494292K86161l60541l34036O12341k47782P8591k19889o7888K40737m10206
$$ 2494292 2780453 2419912 2085876 2698217 2450435 2529026 2309137 2241249 2481986 2071780
13999B071780K36595q9423J4366m2324J18656n1543k20441M93284K03655L53390
$$ 2071780 2308375 2218952 2233318 2190994 2309650 2258107 2037666 2530950 2734605 3087995
13989C087995J021818K102362N285934J3632489J8396811j6528003j2723260n679733
$$ 3087995 4109813 6212175 11498109 25130598 43527409 26999406 14276146 8596413
13981H596413k389722r87724r82903n75710L7434m56006r6009k16380Q4116n20895
$$ 8596413 6206691 5218967 4236064 3660354 3697788 3241782 3145773 2929393 3013509 2492614
13971B492614L16212j11207K7680k67712o6778J8862R8367n7970k81597N1552
$$ 2492614 2808826 2697619 2725299 2457587 2390809 2409671 2508038 2450068 2168471 2220023
13961B220023L1999N3961p8873q2894O6203l15793J06487j23201L19927l97170
$$ 2220023 2252022 2305983 2227110 2144216 2210419 1894626 2001113 1877912 2197839 1800669
13951A800669Q2908j08344o0295K00475J32246J04839r5960m63695M29287k05590
$$ 1800669 1883577 1775233 1714938 1915413 2047659 2152498 2056538 1592843 2022130 1816540
13941A816540o9199J018P2439j15527p9489K28716N790o6418j06950n3861L32033
$$ 1816540 1747341 1748359 1820798 1705271 1625782 1854498 1860288 1793870 1686920 1633059 1965092
13930A965092k06735k5149p6926o8049L79594k20867J2928r1243o8813K5337k66082
$$ 1965092 1758357 1733208 1656282 1588233 1967827 1746960 1759888 1668645 1599832 1625169 1359087
13919A359087K07873m7432j99752J82717j30770J77378O8117L57658m52893J38874
$$ 1359087 1566960 1519528 1319776 1502493 1371723 1549101 1617218 1974876 1521983 1660857
13909A660857k23150j44226K41049l06888J21437J62395o5094J5568K84463j92850
$$ 1660857 1437707 1293481 1534530 1227642 1349079 1511474 1446380 1461948 1746411 1553561
13899A553561J52385n67023L16818j06218O2028P7984l39155K19405M8652j35868
$$ 1553561 1705946 1138923 1455741 1349523 1411551 1489535 1150380 1369785 1418437 1282569
13889A282569M9286R483j29233r0191J34483l0834P9234j23473J65708j43116
$$ 1282569 1331855 1341338 1212105 1121914 1256397 1225563 1304797 1181324 1347032 1203916
13879A203916K75944n31036L98300j00574P0477l7776n0281K30572l25397J437
$$ 1203916 1479860 948824 1347124 1246550 1317027 1279251 1228970 1459542 1134145 1135582
13869A135582j34947J62871N6572k97677L74949j77343O7860j4375Q9534K86192
$$ 1135582 1000635 1163506 1220078 922401 1297350 1120007 1187867 1173492 1263026 1549218
13859A549218m67632Q4076j69221J29409M9478k17738j02901P1098o482n5976
$$ 1549218 1081586 1165662 996441 1125850 1175328 957590 854689 925787 919305 863329
13849H63329K44722l29975K94534Q3342j98599j41018K52245k10162N5684J01771
$$ 863329 1108051 778076 1072610 1155952 957353 816335 1068580 858418 914102 1015873
13839A015873j5428k36028N58667l10501P7001l4139k54863K27180m88262L41187
$$ 1015873 1000445 764417 1323084 1012583 1089584 1055445 800582 1027762 539500 880687
13829H80687J13642K2426k5405o5255J67902l7744j37186j10065M7910O8657Q4449
$$ 880687 994329 1016755 991350 926095 1093997 1056253 919067 809002 856912 925569 1010018
13818A010018j85999K39020Q2900m21689J45858K20793o7490j74786k4745K99748
$$ 1010018 824019 1063039 1145939 724250 870108 1090901 1023411 848625 823880 1123628
13808A123628l67522R5585O0002Q7815l66574L39J95707k42506L8806L46514k49828
$$ 1123628 756106 851691 911693 999508 632934 633273 828980 586474 625280 971794 721966
13797G21966K31072k1269j81669o8156J37967R7706k67684k0820p4273N09313
$$ 721966 953038 931769 750100 681944 819911 917617 649933 629113 554840 1064153
13787A064153m55490J65926K19974j33659o7165Q2367m2153j83866J98522K20870
$$ 1064153 608663 774589 994563 860904 793739 876106 833953 650087 848609 1069479
13777A069479m87231K77971j64192J40478j12713N41012j63460E39955L32259
$$ 1069479 582248 860219 696027 836505 723792 1264804 1101344 539955 872214
13768H72214j52552k87073P34629k55457k68171J79640l428r6001J48452C90335
$$ 872214 719662 432589 1167218 911761 643590 823230 819802 723801 872253 390335
13757H27026j31169q027P1922n2561p3047j7785J54446J74612j81236k33667K62404
$$ 827026 695857 687830 759752 707191 634144 616359 770805 945417 764181 530514 792918
13746G92918k18700J15939I5608O62012j93733Q7081k90563L18313l547k34141
$$ 792918 574218 690157 95608 757620 563887 650968 360405 678718 675171 441030
13736D41030M40338Q5294k99958N9618C30620J47691K42405k82163m0813K93251
$$ 441030 881368 966662 666704 726322 330620 478311 720716 438553 397740 690991
13726F90991R8836l20382J98441K15365m01741B33298N24712C56143M03785k8005
$$ 690991 789827 469445 667886 883251 481510 233298 758010 356143 759928 731923
13716G31923j02036L5828j40905K00270l11906L22417k40363n6378L42047B72776
$$ 731923 629887 665715 524810 725080 413174 735591 495228 438850 780897 272776
13705E23879K27668l57693j86087K79220K86071j78267B36793J05509L39397l06805
$$ 523879 751547 393854 207767 486987 773058 594791 236793 342302 681699 374894
13695C74894l4556R3536K0689l3273K18007k01083j24816K59033j20211p4819
$$ 374894 340338 433874 454563 421290 639297 438214 313398 572431 452220 377401
13685C77401M08896C92991K74666j86758P372L15656B43334J90972J3706L59425
$$ 377401 786297 392991 667657 480899 488271 803927 243334 434306 448012 807437
13675H07437k90132B22071M85589C15514L72556C22062m8098K06593B07185L45181
$$ 807437 517305 222071 707660 315514 688070 322062 273964 480557 207185 552366
13665E52366j583j7461B64210L64006j39520J576A93933M16140o145k44476J57162
$$ 552366 550783 533322 264210 628216 488696 490272 193933 610073 603928 359452 516614
13654E16614j65091k7562N1245J87562N2769k26444A92135O02704i5900D01876
$$ 516614 351523 323961 375206 562768 615537 389093 192135 794839 -95900 401876
13643A96083N38749k60889q7778N9125L83112l86922j86471A08848L78622Q9593
$$ 196083 734832 473943 386165 445290 828402 441480 255009 108848 487470 577063
13633E77063j17405J11755N0309j88721J32799k156B34291b3018B50010J72074
$$ 577063 459658 571413 621722 433001 565800 563644 234291 -23018 250010 422084
13623D22084j81021M52655k66092K21717k41953r4165N4979j42197M74797A64519
$$ 422084 241063 693718 427626 649343 407390 313225 368204 226007 700804 164519
13612E22381j06031q3470K38922R9805C11449M1027N89640D59879O751a996E70268
$$ 522381 416350 332880 571802 671607 311449 352476 942116 459879 466630 -1996 570268
13600F31113j11324O9680A27638J24710K58205n4845J04524j300i2576F04161
$$ 631113 519789 589469 127638 252348 510553 455708 560232 558932 -92576 604161
13589C39147J58007Q3162j35184K26788B57699K52044M1075q7747l4471a2678
$$ 339147 497154 580316 445132 671920 257699 509743 550818 463071 428600 -12678
13578B47651K39543B37028j16312L74282k14831A18699K70975P6955k01018H3948
$$ 247651 487194 237028 120716 494998 280167 118699 389674 466629 265611 83948
13567D95601A27036j1158L46166j61736J82696k27102J17628R8056N0197k57148
$$ 495601 127036 115878 462044 300308 483004 255902 373530 471586 521783 264635
13557B64635p4085L0731M691J65762N8552j40468R7127J93497k95232J85302j80296
$$ 264635 190550 221281 225972 391734 450286 309818 406945 600442 305210 490512 310216
13546C10216j1663K81077k55990n528R74K1907J01076A58282N57134B55814j05027
$$ 310216 298553 579630 323640 318112 319086 340993 442069 158282 715416 255814 150787
13535A50787L0044l1296J01444m5561J65475M4492A06119J46378m4259K94766
$$ 150787 180831 149535 250979 205418 370893 415385 106119 252497 208238 503004
13525E03004j79249K87299R7350k39957j90890A7280M28815A33472K91897J93202
$$ 503004 323755 611054 708404 468447 277557 17280 446095 133472 425369 618571
13515F18571k29749Q2659j75091K4048M9825e1351C23020a49111a7412D12473
$$ 618571 388822 471481 296390 320438 370263 -51351 323020 -149111 -17412 412473
13504C05678M0592J65500B52962o1980m1153o7680J3546K58579j34059k2180M20597
$$ 305678 346270 511770 252962 190982 149829 82149 95695 354274 220215 198035 618632
13493F18632A46551K14660R0098A64518K6410J76260j21574A08169J55155G7917
$$ 618632 146551 361211 451309 164518 190928 367188 245614 108169 263324 77917
13482D07693p2693j51859J20142r9166J10430O2041j10642D0054J51352h4121
$$ 407693 335000 183141 303283 204117 314547 376588 265946 40054 191406 -84121
13471D36160j7924p9216j43308n0243L20637q9455G7735L42568a12662C25200
$$ 436160 418236 339020 195712 145469 466106 376651 77735 420303 -112662 325200
13460B09254E6758J29662l5241K28796F4027L99128A4600J72859k1052m9520B585
$$ 209254 56758 186420 151179 379975 64027 463155 14600 187459 166407 116887 2585
13448I3232L8252l2223M3001j1826N2673J70087J1995f3259C22034q789r4839
$$ 93232 131484 99261 142262 130436 183109 353196 365191 -63259 322034 313245 218406
13437B18406J9503a64120A95930J05325R9550p6770L17872k39565c30465a36885
$$ 218406 237909 -164120 195930 301255 400805 324035 641907 402342 -330465 -136885
13426d3121C04859J23158H5409Q8121h8371A07233K13109g5374B34550j3165r428
$$ -43121 304859 428017 85409 173530 -88371 107233 320342 -75374 234550 221385 211957
13415B11957A01359K02074b4053j4112F35790B17762n9038o6260A2494O4603J04091
$$ 211957 101359 303433 -24053 -38165 635790 217762 158724 92464 12494 77097 181188
13404A81188m0257c0283C5776O6312K96534A51644K08206A10052N8778K65990
$$ 181188 140931 -30283 35776 102088 398622 151644 359850 110052 168830 434820
13394D34820p9855A40274P9809J06086k7556j05228P33I3434K95736j76563N3956
$$ 434820 354965 140274 220083 326169 298613 193385 194118 93434 389170 212607 266563
13383B66563q7368l9919L97387b84092B09304r5639m1154K4378O3996L0423H3308
$$ 266563 179195 139276 536663 -284092 209304 113665 72511 96889 160885 191308 83308
13371a15227H6244R0385K16350M321A63161C2561J01055J83688n1526G6606M44903
$$ -115227 86244 176629 392979 397300 163161 32561 133616 317304 265778 76606 521509
13360E21509A60393L85078k43545p0366H4614K98942G0349L8630M18359B57070
$$ 521509 160393 545471 301926 231560 84614 383556 70349 108979 527338 257070
13349E16405j76061I7702N5107E514J09701B2687N7987d4386A41051K80069j70634
$$ 516405 340344 97702 152809 5514 115215 22687 80674 -44386 141051 421120 250486
13338B50486k6859o242K43317A73551k6538J78415j16591b9932C56471j43180
$$ 250486 223627 217385 460702 173551 147013 325428 208837 -29932 356471 213291
13328B13291p963J89358A17771J92908j49350P0664g2498I1492a81415C8237Q3685
$$ 213291 205328 394686 117771 310679 161329 231993 -72498 91492 -181415 38237 121922
13317A21922K6546r161J1439L8593l5939J33241b24880G5799B8489L19189J74857
$$ 121922 148468 139307 150746 189339 153400 286641 -224880 75799 28489 347678 522535
13306E22535h5880B64418K864K0108j37102m6059K10378a8980m1930J8218B8886
$$ 522535 -85880 264418 267282 287390 150288 104229 314607 -18980 -60910 -42692 28886
13294B9764N0513L4196K56643n2173L2798L2962I0778l5923Q3310A6478O167a72296
$$ 29764 80277 114473 371116 318943 351741 384703 90778 54855 138165 16478 22645 -172296
13281G5878Q5953b50514A24111M4525G5766a54411A20579b31414C82613m5344
$$ 75878 161831 -250514 124111 168636 75766 -154411 120579 -231414 382613 337269
13271C37269A64587L4761J14200J9521A23079b7296C00545E9446e2807H7952K31474
$$ 337269 164587 199348 313548 333069 123079 -27296 300545 59446 -52807 87952 319426
13260C19426J15369A56769a51349A79344A2827R1102K44828E0680J6499b21B79929
$$ 319426 434795 156769 -151349 179344 12827 103929 348757 50680 67179 -221 279929
13248C0354L69961a5036A72423A7136J38353C4098J01943n6966J74908j5972b02205
$$ 30354 400315 -15036 172423 17136 155489 34098 136041 79075 253983 238011 -202205
13236B25968a2556B29529j08953f9309B01547F4474j1847J45449p4554K220M0955
$$ 225968 -12556 229529 120576 -69309 201547 64474 52627 198076 123522 125742 166697
13225A66697J33790R635C4564K81495p5078n8797R5870l7796J25663F9623h381
$$ 166697 300487 310122 34564 316059 240981 182184 278054 240258 365921 69623 -8381
13213C19857o7084A25625m5433b53582i0770B55868j26451E1410Q5011g6847A31678
$$ 319857 252773 125625 80192 -253582 -90770 255868 129417 51410 136421 -76847 131678
13201A55793a83743L6628B38708K3858q2240F4712d0630C23869F9893N5100C856
$$ 155793 -183743 -147115 238708 262566 180326 64712 -40630 323869 69893 124993 3856
13189A61299F5536K7804a17056j20993C8203i1408B73251Q8942l3364h804F1989
$$ 161299 65536 93340 -117056 -238049 38203 -91408 273251 362193 328829 -8804 61989
13177h6511B81287B2631J27011f7325C84493C6082K96057h7420I3508l4122K36059
$$ -86511 281287 22631 149642 -67325 384493 36082 332139 -87420 93508 59386 295445
13166B95445I5150l7364J51715H0630a66766C80616j74991r9810J06325A5877
$$ 295445 95150 57786 209501 80630 -166766 380616 205625 105815 212140 15877
13155A41357A8018a58564P6765E04869l5770C4763N8443K19825b32562d5955F1329
$$ 141357 18018 -158564 -81799 504869 469099 34763 93206 313031 -232562 -45955 61329
13143E76856a21344D38829A45130F8551i7787j51875C75858n5317a8785D2636
$$ 576856 -121344 438829 145130 68551 -97787 -249662 375858 320541 -18785 42636
13132G7239a4689C15437A35238J26157G2941J90938O7882K98172A19933b16007
$$ 77239 -14689 315437 135238 261395 72941 263879 331761 629933 119933 -216007
13121C19119A38236n4878a96281h1740B37041F6040K47134c30190I0422o974a30460
$$ 319119 138236 83358 -196281 -81740 237041 66040 313174 -330190 90422 83448 -130460
13109C15759A27899m3280a5548j01143C37328A36438C7296i9951E831J8063J40822
$$ 315759 127899 84619 -15548 -116691 337328 136438 37296 -99951 5831 23894 164716
13098A64716o8210b30481o2738A29510m4530P2861J41882a35152j73832B0610
$$ 164716 96506 -230481 -293219 129510 84980 157841 299723 -135152 -308984 20610
13087b41625J12996G2252a02727J8591j90561A28835K40159b45143i9465F4110
$$ -241625 -128629 72252 -102727 -84136 -274697 128835 368994 -245143 -99465 64110
13076b43480D8626a30073B96325j33012a6088A92938F001k820M14072b38448E8065
$$ -243480 48626 -130073 296325 163313 -16088 192938 6001 3181 417253 -238448 58065
13064C1568b01186O516G5464C5669c4136B63662G7980c5485j20993A26730g8954
$$ 31568 -201186 -194670 75464 35669 -34136 263662 77980 -35485 -156478 126730 -78954
13052A60653J12826f7812C69262A66452h2077c2118B98562j29499J11671A27774
$$ 160653 273479 -67812 369262 166452 -82077 -32118 298562 169063 280734 127774
13041d7686I3848K61124A05522J67275C965L16632l1545H0665K8878P0473m1789
$$ -47686 93848 354972 105522 272797 3965 320597 289052 80665 109543 180016 138227
13030A38227D7948J70796d7345j95615B93977g2206A83497p8495l3376a52825
$$ 138227 47948 218744 -47345 -242960 293977 -72206 183497 105002 71626 -152825
13019A26847a01782D2945K17763j29471C8903A9064b27690A20513f8231f618p0921
$$ 126847 -101782 42945 260708 131237 38903 19064 -227690 120513 -68231 -6618 -77539
13008g7539b2012A10664b26629a02758A64610h9628f754m7423H5343i7500A13174
$$ -77539 -22012 110664 -226629 -102758 164610 -89628 -6754 -54177 85343 -97500 113174
12996a55597c7013A33054B7838J43507a31381D7265R2871C1242J3154e6079b4738
$$ -155597 -37013 133054 27838 171345 -131381 47265 140136 31242 44396 -56079 -24738
12984I5425M8909B7300K2703j135J29914N629l8877K7112G9764a20749N6501C25930
$$ 95425 144334 27300 50003 48868 178782 184411 145534 172646 79764 -120749 -64248 325930
12971B55625A3340K77771F7555R0281c3353A37260P3788j00179d0051A03273D5580
$$ 255625 13340 291111 67555 157836 -33353 137260 211048 110869 -40051 103273 45580
12959A94135J1040a83849h4213K4295D3424k0610L35910A39961N3825b50713R1513
$$ 194135 205175 -183849 -84213 -59918 43424 22814 358724 139961 193786 -250713 -159200
12948a59200B64175c8798j92740O922C06795A29855a85233m9881c4093p3966i303
$$ -159200 264175 -38798 -231538 -224616 306795 129855 -185233 -235114 -34093 -108059 -9303
12936e3782p6726B9690a76250C89425j24010g353C7300b07901J5699C06857d4547
$$ -53782 -130508 29690 -176250 389425 265415 -7353 37300 -207901 -192202 306857 -44547
12924c23867D6384A2365e9461A61683p9114B0382O1039f4106p6870j7453A5140
$$ -323867 46384 12365 -59461 161683 82569 20382 81421 -64106 -140976 -158429 15140
12912B2033i4939h948F5805Q1942M6187b6704n5907A2927K36444a87798D864f1012
$$ 22033 -94939 -8948 65805 147747 193934 -26704 -82611 12927 249371 -187798 4864 -61012
12899a55924B9619N2724a32963A04732c365I2060J07799e8114C55434h4684A07733
$$ -155924 29619 82343 -132963 104732 -3365 92060 199859 -58114 355434 -84684 107733
12887A13083a19959A77940n8283e6986A42111a06258B53380J24119O1029a86443
$$ 113083 -119959 177940 119657 -56986 142111 -106258 253380 377499 438528 -186443
12876a01734A45033c9218A49527E4339O275K72660a0883H8005c37923A34274E2534
$$ -101734 145033 -39218 149527 54339 60614 333274 -10883 88005 -337923 134274 52534
12864A550K20967A9642J92868M4426b3133B96051H089a79154e2157n5602K6577
$$ 1550 222517 19642 212510 256936 -23133 296051 8089 -179154 -52157 -107759 -81182
12853h1182D525O8369B3810O6010a25445k06495C39690b97444A24559E236a10422
$$ -81182 4525 72894 23810 89820 -125445 -331940 339690 -297444 124559 5236 -110422
12841a86366H4151C9301O0334e6938E4861b2924n5670C7948J38745c03698J51472
$$ -186366 84151 39301 99635 -56938 54861 -22924 -78594 37948 176693 -303698 -152226
12830a52226B58543P9600c8829E2983K11885H3584c02786B856d1836A10155a76932
$$ -152226 258543 338143 -38829 52983 264868 83584 -302786 2856 -41836 110155 -176932
12818A94231n8829C5486g3700j70047A32983h2953B6222d4531q3591H8899a484
$$ 194231 135402 35486 -73700 -243747 132983 -82953 26222 -44531 -128122 88899 -1484
12806A71821A2870K94985i7904C1233a67670A84885q1522j8659a6898N416j5868
$$ 171821 12870 307855 -97904 31233 -167670 184885 103363 84704 -16898 -11482 -27350
12795b7350r0696A24360M0105E6306J69649F8362i4608j7370C69393a53325E7504
$$ -27350 -118046 124360 164465 56306 225955 68362 -94608 -111978 369393 -153325 57504
12783a69485A9981R0830a36065j4253B23528A06353B0914J8494i3354j25447B44812
$$ -169485 19981 110811 -136065 -150318 223528 106353 20914 39408 -93354 -218801 244812
12771C61617A66956o0184R0304i3272A80688n6884J48005F1742a59493q4843h1338
$$ 361617 166956 106772 197076 -93272 180688 123804 271809 61742 -159493 -244336 -81338
12759c5879B50628a21404C52519A26965h3066F6433P8950b78990b0956B24184
$$ -35879 250628 -121404 352519 126965 -83066 66433 145383 -278990 -20956 224184
12748d5905B41669C0790c3653D3093k293H174M31413B0094J37751b59958C89527
$$ -45905 241669 30790 -33653 43093 40800 8174 439587 20094 157845 -259958 389527
12736a51985A43353J24729J3257j05414j2785a74566j9670A36412a69875a1056
$$ -151985 143353 268082 281339 175925 163140 -174566 -194236 136412 -169875 -11056
12725A69260J23055P2194b58275d5102H2683g9967K0821C00575a49692F2905e7674
$$ 169260 292315 364509 -258275 -45102 82683 -79967 -59146 300575 -149692 62905 -57674
12713I7114D6714K39315p1138a7468j40881p4703h2795A30689F1016J33167J5156
$$ 97114 46714 286029 214891 -17468 -158349 -233052 -82795 130689 61016 194183 209339
12702B09339a91957H9481L0317g8144E6945a21928B6812N6730b8594r6990d4797
$$ 209339 -191957 89481 119798 -78144 56945 -121928 26812 83542 -28594 -125584 -44797
12690A8192K4556N4042a59605a1657b603j78736a4370I6041P5785a15821B86985
$$ 18192 42748 96790 -159605 -11657 -2603 -181339 -14370 96041 171826 -115821 286985
12678c7883J2340B11471a01306d5234C4511c3915A80213b6957C6476J51797L179
$$ -37883 -25543 211471 -101306 -45234 34511 -33915 180213 -26957 36476 188273 191452
12667A91452B2823K88599h9161A18063k671b62262b6543k0718D02302h7090l8667
$$ 191452 22823 311422 -89161 118063 115392 -262262 -26543 -47261 402302 -87090 -125757
12656a25757N5954j41509A65485f0818m8326r4002j4356D0275a08091b8461B04774
$$ -125757 -69803 -211312 165485 -60818 -109144 -203146 -217502 40275 -108091 -28461 204774
12644A57569b40339a651j07084r0016B14508m1372H736J74264A9223K6826K5115
$$ 157569 -240339 -1651 -108735 -198751 214508 173136 8736 183000 19223 46049 71164
12633G1164b51064D2771A855b37505A41903P9029r9348h163k62191A36387D260
$$ 71164 -251064 42771 1855 -237505 141903 220932 121584 -8163 -270354 136387 4260
12621D19779f9502j43820B49500j7872H0116a09303A84863b22300h121j9951A11538
$$ 419779 -69502 -213322 249500 231628 80116 -109303 184863 -222300 -8121 -28072 111538
12609e6531C04996f4390D5956K12446b05610C4274L3233k688J30858j9200d393
$$ -56531 304996 -64390 45956 258402 -205610 34274 67507 64819 195677 176477 -4393
12597A90698P8537c5122j10643l1173f8348j56628A41974a03360B30158g721n6136
$$ 190698 269235 -35122 -145765 -176938 -68348 -224976 141974 -103360 230158 -7721 -63857
12586f3857B07743b52714H6100e0765a8641m99789D3293K23600f0915A38711b66149
$$ -63857 207743 -252714 86100 -50765 -18641 -518430 43293 266893 -60915 138711 -266149
12574E5752a59759c2455j4218m8383I0335j5525R2263a1074C22638A17442a79105
$$ 55752 -159759 -32455 -46673 -95056 90335 74810 167073 -11074 322638 117442 -179105
12562h9125F8813J25574E040c7496D514a16248j03730q425e1617B11929a72894
$$ -89125 68813 194387 5040 -37496 4514 -116248 -219978 -228403 -51617 211929 -172894
12550c5134j850E3416O8211j5221K64580a60839F5692d1780j08432A51826b89040
$$ -35134 -36984 53416 121627 106406 370986 -160839 65692 -41780 -150212 151826 -289040
12538c4758Q721k36156b924n4591B6262P5655g8525C2674L2230k8353H083b69799
$$ -34758 -26037 -262193 -2924 -57515 26262 101917 -78525 32674 64904 36551 8083 -269799
12525g40m40585g1190A22158L89589D0259J13666a51481n020C93205b02160j18156
$$ -740 -441325 -71190 122158 511747 40259 153925 -151481 -156501 393205 -202160 -320316
12514c20316F980J4462l922K53208c4332j74659j9686e7438j87833A62237i1782
$$ -320316 6980 21442 17520 270728 -34332 -208991 -228677 -57438 -245271 162237 -91782
12502C67712j29309a17230C12997a48774P1008c6393a0702D33755d6646A1515
$$ 367712 238403 -117230 312997 -148774 -77766 -36393 -10702 433755 -46646 11515
12491a30577j01004C51336H8761b53279A07128a00625B17196h0409a8429j10815
$$ -130577 -231581 351336 88761 -253279 107128 -100625 217196 -80409 -18429 -129244
12481a29244D98730H1831g8307c0208j63786Q2201G8661a68871A43272c5405c665
$$ -129244 498730 81831 -78307 -30208 -193994 -111793 78661 -168871 143272 -35405 -3665
12469b81829c1640B31978r4841o1034a78182l3397D07822j21058b9934R753l55880
$$ -281829 -31640 231978 137137 76103 -178182 -211579 407822 286764 -29934 -20181 -376061
12458c76061a61368A11522a52191B83203g194A6939f3601H5706a37734o1618O8151
$$ -376061 -161368 111522 -152191 283203 -7194 16939 -63601 85706 -137734 -199352 -131201
12447a31201B7796b16993A2495f8090J692D45K2203J61392J37789a62568a4411
$$ -131201 27796 -216993 12495 -68090 -66398 445 22648 184040 321829 -162568 -14411
12435H800a09391c0118j47694A5907J46552A7609g0754C8078J5671i0013B42966
$$ 8800 -109391 -30118 -177812 15907 162459 17609 -70754 38078 53749 -90013 242966
12423C902J27442K224h6575A49369a24999C96019a7647j40854N9206A50501J28220
$$ 3902 131344 133568 -86575 149369 -124999 396019 -17647 -158501 -99295 150501 278721
12412B78721a04887j0022G1270I850i0264k39865G9441G892J55944e7894A85673
$$ 278721 -104887 -114909 71270 9850 -90264 -330129 79441 7892 163836 -57894 185673
12400A1300a80665I3191b0265j97954j31961G7889K02095J69972b69680O5209
$$ 11300 -180665 93191 -20265 -218219 -350180 77889 279984 449956 -269680 -204471
12390b04471B4055J58778a15322A17776A4683b30868R3646B786L28131c31830
$$ -204471 24055 182833 -115322 117776 14683 -230868 -137222 2786 330917 -331830
12379h3282p4778a8102j22079d4175J716o0435A8062P7343c3355n2693o0629F0062
$$ -83282 -158060 -18102 -140181 -44175 -42459 -102894 18062 95405 -33355 -86048 -146677 60062
12366h7381C15549d12241a68344I5984l9916J84383A6905Q0074J5373J13476a40261
$$ -87381 315549 -412241 -168344 95984 56068 240451 16905 96979 112352 225828 -140261
12354g9139C0750a27604A28674l9226f668k6756I4222a52523p6097H1412a37184
$$ -79139 30750 -127604 128674 89448 -6668 -33424 94222 -152523 -228620 81412 -137184
12342a74504A18794g6080p7965N2207G053F90J97911i0869A96445r5093b03917
$$ -174504 118794 -76080 -154045 -101838 7053 690 198601 -90869 196445 101352 -203917
12330e5422A07731D0961d021D67980H7864j7900c004E5849a79652k321F3709K82761
$$ -55422 107731 40961 -4021 467980 87864 69964 -3004 55849 -179652 -181973 63709 346470
12318C46470B5227J25847A4990K34982A11344d7533B70388H7073p053a0125B92082
$$ 346470 25227 151074 14990 249972 111344 -47533 270388 87073 80020 -10125 292082
12306a67833a284A85335a24539B2055a05504h886A5278a32891b6462q7407E081
$$ -167833 -1284 185335 -124539 22055 -105504 -8886 15278 -132891 -26462 -113869 5081
12294A49863a67617A49397D4665c39361e1893A58263K06362a8606G2274M0370
$$ 149863 -167617 149397 44665 -339361 -51893 158263 364625 -18606 72274 112644
12284A12644N7034q4016P8333k2124F4024a81681H5362D1208f9898a1311A8766
$$ 112644 169678 85662 163995 141871 64024 -181681 85362 41208 -69898 -11311 18766
12272A12161j969B0915K14871b404E3042J2371a75279C4950J49455g1315G5259
$$ 112161 110192 20915 235786 -2404 53042 65413 -175279 34950 184405 -71315 75259
12260B68742E0347f4015k8778A00069m980b44r1113B45024b9867j37777A0080
$$ 268742 50347 -64015 -92793 100069 95089 -244 -91357 245024 -29867 -167644 10080
12248i9101a3432G3644P7080J7025Q4119q7489B2764Q1422g2502p1187a5145r278
$$ -99101 -13432 73644 150724 167749 251868 164379 22764 104186 -72502 -143689 -15145 -24423
12236b4423n9563A24662C8701c7272A41510J43148H8461J3726a03987l2643D47564
$$ -24423 -83986 124662 38701 -37272 141510 284658 88461 102187 -103987 -136630 447564
12224B98279n5928A05323J07372i2715B49861J30407q8315e0511B11418a8908
$$ 298279 242351 105323 212695 -92715 249861 380268 291953 -50511 211418 -18908
12213E8536K94330N8603a22902B46225K34839q2462A18871a26727D73640E4729
$$ 58536 352866 411469 -122902 246225 481064 398602 118871 -126727 473640 54729
12202B16028p2040m7087Q3249J29702F3583K24394h164j89486C40663b32770A44919
$$ 216028 143988 96901 180150 309852 63583 287977 -8164 -197650 340663 -232770 144919
12190F02629B37870K02996H9344m3368j0649f0731A09254A6786K5665K32212O3979
$$ 602629 237870 440866 89344 45976 35327 -60731 109254 16786 42451 274663 338642
12179C38642I5161Q252A2541K99396I2898K6824J92277a08524A87835a05107a230
$$ 338642 95161 103413 12541 311937 92898 119722 311999 -108524 187835 -105107 -1230
12167C9524j5557J14443C8573M9056a07346A05091b771A22594N8536E3819K09520
$$ 39524 23967 138410 38573 87629 -107346 105091 -2771 122594 181130 53819 263339
12156B63339j22654E9512i9035A73403b6588j53891A35539N6112p3844J95029
$$ 263339 140685 59512 -99035 173403 -26588 -180479 135539 191651 117807 312836
12146C12836e0525C43306C402d50429A26023a41907A34441L19705c3403j0093
$$ 312836 -50525 343306 3402 -450429 126023 -141907 134441 454146 -33403 -43496
12136d3496A46526F4604J57536A09074L66176E8153a93615A71759i1540k23016
$$ -43496 146526 64604 222140 109074 475250 58153 -193615 171759 -91540 -314556
12126c14556D0523R4886k9177f0320B11601a38720k66965J37310A52293Q3496
$$ -314556 40523 135409 106232 -60320 211601 -138720 -405685 -268375 152293 235789
12116B35789i097a949G135L51976G0526K6343j2146b16031j7383Q8153A66429
$$ 235789 -9097 -1949 7135 359111 70526 96869 84723 -216031 -233414 -145261 166429
12104a24397B92651A32353b0990r744m0477k02003b8450A72381k4607D1101h6659
$$ -124397 292651 132353 -20990 -30734 -71211 -273214 -28450 172381 147774 41101 -86659
12092F9549a20157A66251a92233f9154j59320F258b55559A81429D4343K59011
$$ 69549 -120157 166251 -192233 -69154 -228474 6258 -255559 181429 44343 303354
12082C03354j02674C300g3139B14357p9746c63597J12417a357k3211E7212J42293
$$ 303354 200680 3300 -73139 214357 134611 -363597 -251180 -1357 -24568 57212 199505
12071A99505C8354h5564E6938c9457j64712j42226H7716f310A4677O26158Q9791
$$ 199505 38354 -85564 56938 -39457 -204169 -346395 87716 -6310 14677 640835 730626
12060G30626A067J72286e2592A33689A5262j830i3573d3874I0327J68059A23040
$$ 730626 1067 173353 -52592 133689 15262 13432 -93573 -43874 90327 258386 123040
12048a99094L4206I4743i5614A15485c3849a10j14626c5414f315l01717H0788
$$ -199094 -164888 94743 -95614 115485 -33849 -110 -114736 -35414 -6315 -308032 80788
12036b549A04869a59970a0549j34544f0293r0726C09388I0267J4300J06035M2249
$$ -2549 104869 -159970 -10549 -145093 -60293 -151019 309388 90267 104567 210602 252851
12025B52851J02884a12521B40398m2080a59369A19157i2383I2703K57109A62034
$$ 252851 355735 -112521 240398 198318 -159369 119157 -92383 92703 349812 162034
12014a83222a2047j88896C4326R3150g9996A06836c3864J5851A97140a31106k075
$$ -183222 -12047 -200943 34326 127476 -79996 106836 -33864 -18013 197140 -131106 -133181
12003a33181j03753a12397a7842o9750j86674C4159K25401a85651f078j51269
$$ -133181 -236934 -112397 -17842 -87592 -274266 34159 259560 -185651 -6078 -157347
11993a57347b6602n21122A38980d6514A91936a87047C30498h8542B8812i5265
$$ -157347 -26602 -547724 138980 -46514 191936 -187047 330498 -88542 28812 -95265
11982b60121a04953d3279A49705i8135k3189I2849A5225Q0837A2297f5530q4266
$$ -260121 -104953 -43279 149705 -98135 -121324 92849 15225 96062 12297 -65530 -149796
11971a49796o5253P5099D64353B01547B275b06803B91411b52502F3950c55425
$$ -149796 -215049 -139950 464353 201547 2275 -206803 291411 -252502 63950 -355425
11960B69889G8096B8038M4051c06356B52781C8044c5522j6243j39155e7542A64720
$$ 269889 78096 28038 72089 -306356 252781 38044 -35522 -51765 -190920 -57542 164720
11948E267M4104g5133k09575A68635O4297K6939e9474K8491B8673J9134B2487
$$ 5267 49371 -75133 -284708 168635 232932 259871 -59474 -30983 28673 47807 22487
11936A75617F7564D588a91493B0632a03644B02272A2285c39669b7447A7218J66306
$$ 175617 67564 4588 -191493 20632 -103644 202272 12285 -339669 -27447 17218 183524
11925A83524a98936C65207A1054R5196e0218B12622B3515J76810O5742b0279B32673
$$ 183524 -198936 365207 11054 106250 -50218 212622 23515 200325 266067 -20279 232673
11913A96191a1262A48354a69815F9244a52486K6049H5272a72661D203L03424G4372
$$ 196191 -11262 148354 -169815 69244 -152486 -126437 85272 -172661 4203 307627 74372
11901a84452P7198j50953A05042A2245a6670k25949Q5075C3073K9191b91221h9028
$$ -184452 -107254 -258207 105042 12245 -16670 -242619 -157544 33073 62264 -291221 -89028
11889a53501B17604i6615j53386B65178a3228A19708J1549M2998I687g9521C60796
$$ -153501 217604 -96615 -250001 265178 -13228 119708 131257 174255 9687 -79521 360796
11877A4928a281o8364E5885a55438A22799d907E3608b36351j812J7909I2428j8620
$$ 14928 -1281 -69645 55885 -155438 122799 -4907 53608 -236351 -238163 -220254 92428 73808
11865G3808c28522B38740A2931J07336d877j428n1823G6019c7630q1581A52953
$$ 73808 -328522 238740 12931 120267 -4877 -6305 -58128 76019 -37630 -119211 152953
11853b13024h4383j731D44845a43386G3157d4134I2395g7172k8051c73m5995H6267
$$ -213024 -84383 -86114 444845 -143386 73157 -44134 92395 -77172 -105223 -373 -46368 86267
11840a08037A78314b48932M3354D9063A1760a10072D2177L5816J90941A21861
$$ -108037 178314 -248932 -205578 49063 11760 -110072 42177 77993 268934 121861
11829I1248m426g153q167B50J89362a27317B99066a44903K8947k70092a13208
$$ 91248 86822 -7153 -15320 250 189612 -127317 299066 -144903 -115956 -386048 -113208
11817C3142J2532b79427K2394Q6001m2009b1699D0607i3673C58628d8095e09m80329
$$ 33142 45674 -279427 -257033 -171032 -213041 -21699 40607 -93673 358628 -48095 -509 -480838
11805d80838a02689q0470P6323H3572d79493d0691A26379D1016P9260a51604A90179
$$ -480838 -102689 -183159 -106836 83572 -479493 -40691 126379 41016 120276 -151604 190179
11793F6329N9635A3719J35476k3792a77332D7958J74826a73860C29477i4463G4556
$$ 66329 125964 13719 149195 125403 -177332 47958 222784 -173860 329477 -94463 74556
11781b29187e4464j05682j23078d7296A67383I430Q7994J01675c44074B05100
$$ -229187 -54464 -160146 -283224 -47296 167383 9430 97424 199099 -344074 205100
11770a9906A4681K153c4364k7195r1923Q481p7795E4164a63630k20517i187C41127
$$ -19906 14681 16834 -34364 -61559 -153482 -145001 -222796 54164 -163630 -384147 -9187 341127
11757b73535k03950A57889C503a54139R378q4484E1865d7761j7939K6631B29243
$$ -273535 -477485 157889 3503 -154139 -144761 -229245 51865 -47761 -65700 -39069 229243
11745b2401A94490a83475a9726C34036a69492B0875R6277e6939C5753J66003E6486
$$ -22401 194490 -183475 -19726 334036 -169492 20875 117152 -56939 35753 201756 56486
11733e9876l13535c4755k0302I2830b89043k2431B3364K540a03419k04202J12904
$$ -59876 -373411 -34755 -55057 92830 -289043 -311474 23364 25904 -103419 -307621 -194717
11722a94717a5146j9416n6899F3531h8068A96163I478g6680j43202C8980e650
$$ -194717 -15146 -34562 -91461 63531 -88068 196163 9478 -76680 -219882 38980 -5650
11710A57002J3900k4017b22217p891F538J91974C8247b9924B03756b44570B9417
$$ 157002 170902 146885 -222217 -230108 6538 198512 38247 -29924 203756 -244570 29417
11698e9238C7300b0278j95707c1699D400A43a14179r0385e7185A12211J03059
$$ -59238 37300 -20278 -215985 -31699 4400 143 -114179 -204564 -57185 112211 215270
11687B15270a00041B16233J06008A57437k4756i8997b6768A15545a04463j80956
$$ 215270 -100041 216233 322241 157437 132681 -98997 -26768 115545 -104463 -285419
11677b85419A92338B0622K76722b06918A46900c8078B01268d6857B31801P3141
$$ -285419 192338 20622 297344 -206918 146900 -38078 201268 -46857 231801 304942
11667C04942c2245I0171b36488m038H6116a66147A73007e5323I0839i2557L477
$$ 304942 -32245 90171 -236488 -240526 86116 -166147 173007 -55323 90839 -92557 -89080
11656h9080k47735L3586a8690r2467q5645g8139A05410J60676a91685C15836A28163
$$ -89080 -336815 -303229 -18690 -111157 -196802 -78139 105410 266086 -191685 315836 128163
11644b85686A5030P1106B901a96997f701j5654B81731B9518J77105M4678a03530
$$ -285686 15030 86136 2901 -196997 -6701 -22355 281731 29518 206623 251301 -103530
11632D5388J50982a65456M7347K2270L3413b4594A95804a14907A56279b23640
$$ 45388 196370 -165456 -118109 -95839 -62426 -24594 195804 -114907 156279 -223640
11621a9368B41932a36470E6970M4003m2639P7136a30851J6566k06N1597n219C00020
$$ -19368 241932 -136470 56970 100973 58334 135470 -130851 -114285 -114491 -62894 -68113 300020
11608b31074b3352A56488b73044E7495h0972D0713P7871e11397a14419A92270
$$ -231074 -23352 156488 -273044 57495 -80972 40713 118584 -511397 -114419 192270
11597A9130a51686j44484A85076F6537d3608j3790r3466A66534l2578J48903m2936
$$ 19130 -151686 -296170 185076 66537 -43608 -57398 -150864 166534 133956 282859 239923
11586B39923a8227B08551o1037K24928D3467K00904j6859b64440C10952k3898
$$ 239923 -18227 208551 147514 372442 43467 244371 227512 -264440 310952 287054
11576B87054j8000N5920G2051i6010B20024I9530e4873B38039Q8284I6042g7030
$$ 287054 269054 324974 72051 -96010 220024 99530 -54873 238039 326323 96042 -77030
11564G9528B7413a05484C04259l4513a77007H1223b81720c4441F0088B120K50192
$$ 79528 27413 -105484 304259 269746 -177007 81223 -281720 -34441 60088 2120 252312
11553B52312L4201m6957p9410a08293K292N195A86520a28788B6160c7465A10937
$$ 252312 286513 239556 160146 -108293 -106001 -100806 186520 -128788 26160 -37465 110937
11541b6380B09789Q3589a10940c8942C13162H6829c8417G4975J09848A094L3396
$$ -26380 209789 293378 -110940 -38942 313162 86829 -38417 74975 184823 1094 34490
11530C4490b1950r5352A28933J06352a49954m9447A93596a3922B54370P1084d7989
$$ 34490 -21950 -117302 128933 235285 -149954 -199401 193596 -13922 254370 325454 -47989
11518f3791A3244M2873K9414O0446b3659H5473L92451D1133d2358B51677a29193
$$ -63791 13244 56117 85531 145977 -23659 85473 477924 41133 -42358 251677 -129193
11506F073J09876J02170c2015B73699c3569A06170l8487l3540R7464E9837J73460
$$ 6073 115949 218119 -32015 273699 -33569 106170 67683 34143 131607 59837 233297
11495B33297C5423M44415B9021a24932B8264a11659l3613O7679n02489A57727
$$ 233297 35423 479838 29021 -124932 28264 -111659 -145272 -77593 -580082 157727
11484H2752M3980k2104d3967n5453B2834f7288A21167m4960R2064J1550J7462
$$ 82752 126732 104628 -43967 -99420 22834 -67288 121167 76207 168271 179821 197283
11473A97283o2298N4594J16833l3874r4968c1918G232a03098B8043J01222a86321
$$ 197283 134985 189579 306412 272538 177570 -31918 7232 -103098 28043 129265 -186321
11461B48983h3950l8065A28126o05Q7132r902b75641R1707A82241e5429J7477
$$ 248983 -83950 -122015 128126 127521 214653 204751 -275641 -183934 182241 -55429 -37952
11450c7952B63604e8208r5340d9410G3492a27658k2466D1022R9312P8153f6347
$$ -37952 263604 -58208 -153548 -49410 73492 -127658 -150124 41022 140334 218487 -66347
11438c00962A72346L1441E0547J28178a18409B22375d138j00492B38845q9070
$$ -300962 172346 203787 50547 178725 -118409 222375 -4138 -104630 238845 149775
11428A49775A0932b07657B4066J6457L6294a88064L6742A97097h3269B84960I5115
$$ 149775 10932 -207657 24066 40523 76817 -188064 -151322 197097 -83269 284960 95115
11416b57834G1610g0442E5040J652B7388K69278F0179A8450J70801B2555b8264
$$ -257834 71610 -70442 55040 56692 27388 296666 60179 18450 189251 22555 -28264
11404A6740P1219k6231a81810A32591b48345N131A42822c6809l09632a06530C87970
$$ 16740 87959 61728 -181810 132591 -248345 -243214 142822 -36809 -346441 -106530 387970
11392a47176I3568I166b73194A55784b89736N9237e440k94904b4155J0442k57792
$$ -147176 93568 9166 -273194 155784 -289736 -230499 -5440 -300344 -24155 -13713 -271505
11381b71505G8176a73838C57418A05794p173B0294B594a66961K3978A4866L90273
$$ -271505 78176 -173838 357418 105794 98621 20294 2594 -166961 -142983 14866 405139
11370D05139b16749F4786a78664B9928B059b59094b628B54197b9687A61164a43138
$$ 405139 -216749 64786 -178664 29928 2059 -259094 -2628 254197 -29687 161164 -143138
11358C9223c0991A7676b76335L2508A56087C5895k998c5219B568K06361d05175
$$ 39223 -30991 17676 -276335 -243827 156087 35895 32897 -35219 2568 208929 -405175
11346f4181j32815a2796j59020B15361p9955b50995q2454A86850a26186f0471
$$ -64181 -196996 -12796 -171816 215361 135406 -250995 -333449 186850 -126186 -60471
11335F4711A9449P3727c2675k50072J30906j26308C4467b46525K6513A09390c92697
$$ 64711 19449 93176 -32675 -282747 -151841 -278149 34467 -246525 -220012 109390 -392697
11323I1606d3752B49982h078A12355J84547g4503j09698j14119A79660A289a3608
$$ 91606 -43752 249982 -8078 112355 296902 -74503 -184201 -298320 179660 1289 -13608
11311D92529A85153a12853l8271m2962C160a13910H3983b5259H7381a97657p1598
$$ 492529 185153 -112853 -151124 -194086 3160 -113910 83983 -25259 87381 -197657 -269255
11300b69255G4636a02598n3126A51151a32991n4345D5042a99536j49174f563m5986
$$ -269255 74636 -102598 -155724 151151 -132991 -187336 45042 -199536 -348710 -6563 -52549
11289e2549r2822k19636A76956a96062c3935C8083c52838A66238h9463b8967C4414
$$ -52549 -145371 -365007 176956 -196062 -33935 38083 -352838 166238 -89463 -28967 34414
11277D7292K13804E9540f4440A35699o5249a74750h3302A04303i3867G9926B7318
$$ 47292 261096 59540 -64440 135699 70450 -174750 -83302 104303 -93867 79926 27318
11265c61712a26766A60121j526o276R2013g7317C769O4489M6915E993L6344c24144
$$ -361712 -126766 160121 158595 152319 244332 -77317 3769 68258 115173 5993 42337 -324144
11252d6690C7401b95962C81685a51225k67490E1315Q1743C0898a98286A91855
$$ -46690 37401 -295962 381685 -151225 -418715 51315 133058 30898 -198286 191855
11241A91311a72840O3616B91091q4733e6994q0720j04454A06931A9940N1650B7438
$$ 191311 -172840 -109224 291091 206358 -56994 -137714 -242168 106931 19940 71590 27438
11229B63433A08681Q2537a46432O5875D8618b11918J1780C8111K43902C2030J8440
$$ 263433 108681 191218 -146432 -80557 48618 -211918 -200138 38111 282013 32030 50470
11218E0470e574C2654a29820j97836d6846A03647b84286R4251c2029J415F4096
$$ 50470 -5574 32654 -129820 -327656 -46846 103647 -284286 -190035 -32029 -30614 64096
11206A3131N2643a67227I9708b29323A30293a20443b0941C5953a86328N3528F225
$$ 13131 65774 -167227 99708 -229323 130293 -120443 -20941 35953 -186328 -132800 6225
11194a82088A21485J74628a23123B72730m3919c931e36l02532a2964j07938l339
$$ -182088 121485 296113 -123123 272730 228811 -3931 -536 -303068 -12964 -120902 -124241
11183a24241J1773j2271I9342B1422e6405j51819G1767c19574P4614k53430K04259
$$ -124241 -112468 -124739 99342 21422 -56405 -208224 71767 -319574 -244960 -498390 -294131
11172b94131o80A3864M46144I5955N9287o5583K57801A59544b00125A55555H875
$$ -294131 -294811 13864 460008 95955 155242 89659 347460 159544 -200125 155555 8875
11160H6249b9791r5225j61011J26001m2916Q1914n1666j7773Q6298F8027L43309
$$ 86249 -29791 -125016 -286027 -160026 -202942 -121028 -172694 -190467 -104169 68027 411336
11149D11336i4517B63663c63207b6476q9907c6899A50109c64042f6794k41447
$$ 411336 -94517 263663 -363207 -26476 -116383 -36899 150109 -364042 -66794 -308241
11139c08241d9884b1390j16838E9374i3164A45307B5012a30650p8147A2356c80201
$$ -308241 -49884 -21390 -138228 59374 -93164 145307 25012 -130650 -208797 12356 -380201
11127F1390d0170D0870a13824e676D84533A35681a05656k73205A47149a6869j38241
$$ 61390 -40170 40870 -113824 -5676 484533 135681 -105656 -378861 147149 -16869 -155110
11116a55110A26146c8503j64033O5722N4598C57503I1320a81316A03787a83547
$$ -155110 126146 -38503 -202536 -136814 -82216 357503 91320 -181316 103787 -183547
11105b50524H3899c70012A89474n8986c56602h1206A84455i2041F6333K57518
$$ -250524 83899 -370012 189474 130488 -356602 -81206 184455 -92041 66333 323851
11095C23851K927m0539a6388C19947F7259M1337c1737h830B04888l9047b62793
$$ 323851 326778 286239 -16388 319947 67259 108596 -31737 -8830 204888 165841 -262793
11083A66555O92O7824D6484k0993R7216K56381A0208b967H1963N5708J33835c0165
$$ 166555 167247 235071 46484 25491 122707 379088 10208 -2967 81963 137671 271506 -30165
11070B35705c7140q0208D53712m5545I6695Q9070L05528p7951A48058i2686A75403
$$ 235705 -37140 -117348 453712 408167 96695 185765 491293 413342 148058 -92686 175403
11058F50052A72828n0773J83365P0384r0016K94742C3113M54982A59509K54254
$$ 650052 172828 122055 305420 375804 285788 580530 33113 488095 159509 413763
11048D13763K35479k8251B08673L75861J00827k28959j57702L79237k29437J91403
$$ 413763 649242 620991 208673 584534 685361 456402 298700 677937 448500 639903
11038F39903k83750J69255O5289j30398n0216I9457L46357J35858B78673P7053
$$ 639903 356153 525408 590697 460299 410083 99457 445814 581672 278673 355726
11028C55726J27513Q7159j32796J05951j69708j65605M50858k37973K77338j15136
$$ 355726 483239 570398 437602 543553 373845 208240 659098 421125 698463 583327
11018E83327m8185j0264r295j41824L05327B82192j39486k4128K8127J83522h9101
$$ 583327 535142 524878 515583 373759 679086 282192 142706 118578 146705 330227 -89101
11006E29904j70404o3112O2228j64506Q6638L24187j46480A49739J4945L12423
$$ 529904 359500 296388 358616 194110 280748 604935 458455 149739 164684 477107
10996D77107m4666K8635n4500A89783J81927A61992K45500K19335B89098J81602
$$ 477107 432441 461076 406576 189783 371710 161992 407492 626827 289098 470700
10986D70700O0834L49139C88574J5891j34383N26553k24724q7421N1120P6608
$$ 470700 531534 880673 388574 404465 270082 796635 571911 484490 535610 612218
10976F12218J97596j10113K4228K90509K49061k23929Q2559K23945k36567M25558
$$ 612218 809814 699701 723929 1014438 1263499 1039570 1122129 1346074 1109507 1535065
10966A535065J85154J14423k59062J63817k45610j50080j73215J54772j19396
$$ 1535065 1720219 1834642 1575580 1739397 1493787 1343707 1170492 1325264 1205868
10957A205868l21641K35387k88330L03125K22019j023k86927j5376P7196K8800
$$ 1205868 884227 1119614 831284 1134409 1356428 1355405 1068478 1053102 1130298 1159098
10947A159098p1405k69032k32538k4210k21584K01332A15516J79355J19439k2360
$$ 1159098 1087693 818661 586123 561913 340329 541661 115516 294871 414310 391950
10937C91950j20440A05480P5567A5526K57986A35894a41724F3503a0026B46570
$$ 391950 271510 105480 181047 15526 273512 135894 -141724 63503 -10026 246570
10926E3021L10618a78079N7073B31949m9401C0102a56797F2386L1959b14854b2686
$$ 53021 363639 -178079 -121006 231949 182548 30102 -156797 62386 94345 -214854 -22686
10914c46029B95524F1856b78586A59874P6971A5633a36273m393I8684a44932B24518
$$ -346029 295524 61856 -278586 159874 236845 15633 -136273 -140666 98684 -144932 224518
10902A52043F3305N1599A9996e6801j62801B84292A23346c60681R1862b1411A51352
$$ 152043 63305 114904 19996 -56801 -219602 284292 123346 -360681 -268819 -21411 151352
10890a92691N0870A74694a07939a7561j7861j97647B9998R8285J56546J58491
$$ -192691 -141821 174694 -107939 -17561 -35422 -233069 29998 128283 284829 443320
10880D43320b84893D7771b88277f5200j18207A87471C5005i8492C58602a12787
$$ 443320 -284893 47771 -288277 -65200 -183407 187471 35005 -98492 358602 -112787
10869C3099a69916e3312A71703a10633B19640a7018E0623N2797D9721r017A0364
$$ 33099 -169916 -53312 171703 -110633 219640 -17018 50623 103420 49721 40704 10364
10857A97372d6774r6738A01482a38932m5428q3846h485j10980e7777j24441j50966
$$ 197372 -46774 -143512 101482 -138932 -184360 -268206 -8485 -119465 -57777 -182218 -333184
10846c33184a00886A47443a61710G1991R4418l2012a59528N8904q5808n363c890
$$ -333184 -100886 147443 -161710 71991 166409 134397 -159528 -100624 -186432 -191795 -3890
10834H3167J25054a20141C4414g6427F763b13723a0095k13493O3731A66123c24399
$$ 83167 208221 -120141 34414 -76427 6763 -213723 -10095 -223588 -159857 166123 -324399
10822a68783B37970a45639a8770m3076A64828a15567j4438e8350G1415j5359O6537
$$ -168783 237970 -145639 -18770 -61846 164828 -115567 -130005 -58350 71415 56056 122593
10811A22593N2265b55460B45410g8831j34575P1616H5403a66606M0708e0461G2600
$$ 122593 174858 -255460 245410 -78831 -213406 -141790 85403 -166606 -125898 -50461 72600
10799c75243a28534H1386d16463a93899K382h9389l22015G1846J8384d2443a215
$$ -375243 -128534 81386 -416463 -193899 -191517 -89389 -411404 71846 90230 -42443 -1215
10787A55841H851J5418R5292c42584E0407g3348a7483j02517C53700I8132e7581
$$ 155841 8851 24269 119561 -342584 50407 -73348 -17483 -120000 353700 98132 -57581
10775h0108m7620b2533A01578c1134A24139P8838a64528f5685K3712j38203e125
$$ -80108 -127728 -22533 101578 -31134 124139 202977 -164528 -65685 -41973 -180176 -5125
10763b74968H9517D0710d1715E4110M0019f8168k04699b4882k45746P2143j46920
$$ -274968 89517 40710 -41715 54110 94129 -68168 -272867 -24882 -270628 -198485 -345405
10752c45405C47737c34887J18548B02751a2713C28208C8720e3180k42153l8467
$$ -345405 347737 -334887 -216339 202751 -12713 328208 38720 -53180 -295333 -333800
10742c33800B4383g5357A26215L6680b4674A56139b72974A89927J98304H4198
$$ -333800 24383 -75357 126215 162895 -24674 156139 -272974 189927 388231 84198
10731a48242K2070B12817J12893i2905B9722a58095b8508p1066I1493R7145i9172
$$ -148242 -126172 212817 325710 -92905 29722 -158095 -28508 -99574 91493 188638 -99172
10719h6249A45748d66253e5708n9630n2857l5160q0973B16388a73974a5739j59389
$$ -86249 145748 -466253 -55708 -115338 -168195 -203355 -284328 216388 -173974 -15739 -175128
10708a75128C67615a2644j6633r295C25249b31078d1438l15542i1303k03907B7122
$$ -175128 367615 -12644 -29277 -38572 325249 -231078 -41438 -356980 -91303 -295210 27122
10696a53561l3260B08782c19556f5145A2181J86229i947j45750A85744c73629
$$ -153561 -186821 208782 -319556 -65145 12181 198410 -9947 -155697 185744 -373629
10685a83544p6992A15376b85894B42534b79609A74019F826a58200j90369C01916
$$ -183544 -260536 115376 -285894 242534 -279609 174019 6826 -158200 -348569 301916
10674a32170k51698A73572e91637b07964I4164a58598H3330j7524b39373h8144
$$ -132170 -383868 173572 -591637 -207964 94164 -158598 83330 65806 -239373 -88144
10663f7251j06842M6515i583j7018A78830k4648g7356B32362c11569J17508B6447
$$ -67251 -174093 -127578 -9583 -26601 178830 154182 -77356 232362 -311569 -194061 26447
10651a33024D025b87057d8178j33660A81720a27522M2757k23863M4462B34387
$$ -133024 4025 -287057 -48178 -181838 181720 -127522 -84765 -308628 -264166 234387
10640A59499e8158j08381K083A16448j3663j7731h4711l21991A1198a10362l6386
$$ 159499 -58158 -166539 -164456 116448 102785 85054 -84711 -406702 11198 -110362 -146748
10629a46748P0519G434J64905c34366A58196J58813B8385f7843B8751b85859R0106
$$ -146748 -76229 7434 172339 -334366 158196 317009 28385 -67843 28751 -285859 -195753
10618a95753A46389l2597g6505j76941a00939b8021q6379g058m13438F4471a12578
$$ -195753 146389 113792 -76505 -253446 -100939 -28021 -114400 -7058 -420496 64471 -112578
10606i3570p8623l1331O3647D3236e8512k94302A38003A7222a08078d2582K0431
$$ -93570 -172193 -203524 -139877 43236 -58512 -352814 138003 17222 -108078 -42582 -22151
10595b2151j09133O4805L2712j03543j44051c711j07733j29906F0354N2456a71462
$$ -22151 -131284 -66479 -33767 -137310 -281361 -3711 -111444 -241350 60354 112810 -171462
10583B25539b90249J30475O0959A71930c28960B93604a283o3168A98896d524E703
$$ 225539 -290249 -159774 -98815 171930 -328960 293604 -1283 -64451 198896 -4524 5703
10571g5153A33907b55574e0549j52765L251A90998b24169J06084l51030a04038
$$ -75153 133907 -255574 -50549 -203314 -200063 190998 -224169 -118085 -469115 -104038
10560b48868a18104o5263h7389A4755J81208e698E5922a88711F8417b4853A29244
$$ -248868 -118104 -183367 -87389 14755 195963 -5698 55922 -188711 68417 -24853 129244
10548a38556K7234j65625J12674e8603j56242B0250a05380C8505K03641E4955
$$ -138556 -111322 -276947 -164273 -58603 -214845 20250 -105380 38505 242146 54955
10537I2067f8771l36045f2431C4114J53368d2390k85484a18441j3897k15121G9482
$$ 92067 -68771 -404816 -62431 34114 187482 -42390 -327874 -118441 -132338 -347459 79482
10525c3619B83083a41961I4813a98229P5804C58151a86952K0727A30571F3139
$$ -33619 283083 -141961 94813 -198229 -122425 358151 -186952 -166225 130571 63139
10514B8236o818a15013m58094A79138a76211A07300L01362g1789q6745c1340D5507
$$ 28236 21418 -115013 -573107 179138 -176211 107300 408662 -71789 -158534 -31340 45507
10502f9401A4524f5486B78847I1313a727E4411a4818O607H8367K8428b94372A90739
$$ -69401 14524 -65486 278847 91313 -1727 54411 -14818 -8211 88367 116795 -294372 190739
10489A45224b47041b8130k81524p9297A88681b55518f5988B77616h9465H0929
$$ 145224 -247041 -28130 -309654 -388951 188681 -255518 -65988 277616 -89465 80929
10478F7068J10113q5759f2073o2483B66660J75371f4422B4656L96800B1641g7516
$$ 67068 177181 91422 -62073 -124556 266660 442031 -64422 24656 421456 21641 -77516
10466a78717A42546b8540k46677h2190a0247A03662d0058C53597D5880b87022
$$ -178717 142546 -28540 -275217 -82190 -10247 103662 -40058 353597 45880 -287022
10455A25590j5884a72981D7419J11334B7696j0463i1283B28103b13898B19535
$$ 125590 109706 -172981 47419 158753 27696 17233 -91283 228103 -213898 219535
10444A18929b1259m7484r0465a1834k82350D5484c68851B73906i1049a624o7349
$$ 118929 -21259 -68743 -159208 -11834 -294184 45484 -368851 273906 -91049 -1624 -68973
10433f8973A74211n6042b12982f3945j78800A95707H8069b11585f5967A06190
$$ -68973 174211 118169 -212982 -63945 -242745 195707 88069 -211585 -65967 106190
10422b67585H9451h4708G5606Q869J77002j08097a48178B02114a08921j34012
$$ -267585 89451 -84708 75606 84475 261477 153380 -148178 202114 -108921 -242933
10412b42933A6644K14694i5142p0233M1901j490j22283H32a99405A97767h5449
$$ -242933 16644 231338 -95142 -165375 -123474 -124964 -247247 832 -199405 197767 -85449
10400C7534c83154B513h9362A17261K6328b40154B09070F7190c65818b7033q5464
$$ 37534 -383154 2513 -89362 117261 143589 -240154 209070 67190 -365818 -27033 -112497
10389a12497a467j06846K7285D03216H9043a64088A56048a38144D82149a36334
$$ -112497 -1467 -108313 -81028 403216 89043 -164088 156048 -138144 482149 -136334
10378a28706K3347B16060G4702a09855j038G0352J89673b7227A54779f0557q4106
$$ -128706 -105359 216060 74702 -109855 -110893 70352 260025 -27227 154779 -60557 -144663
10367a44663L4463b6007A33074e8036D38679B15259P8511K4806c8673i46B14441
$$ -144663 -110200 -26007 133074 -58036 438679 215259 293770 318576 -38673 -946 214441
10355A54355l0456a81935g4647A28920k1824K03751B4415J32659L01267j06334
$$ 154355 123899 -181935 -74647 128920 107096 310847 24415 157074 458341 352007
10345C52007J9277j30409a16448A72557J2254p8736B668M54369k04465E5084Q2412
$$ 352007 371284 240875 -116448 172557 184811 106075 2668 457037 252572 55084 137496
10334A37496a23463G7667J33635B2940L082J91577J22098A42655a36603B56446
$$ 137496 -123463 77667 211302 22940 26022 217599 339697 142655 -136603 256446
10323C03839A02634J01565F3802J00233K0199p3924a22936A07566B4674J09601
$$ 303839 102634 204199 63802 164035 184234 110310 -122936 107566 24674 134275
10313A34275a00156D0035L17763j43857b07619A58838Q2608e3550A29056e2225
$$ 134275 -100156 40035 357798 213941 -207619 158838 241446 -53550 129056 -52225
10302a79557C0068K1023J3601h3876D022a42360d9875a3989A06643c0985A49281
$$ -179557 30068 51091 64692 -83876 4022 -142360 -49875 -13989 106643 -30985 149281
10290H1037c2710A27120c3645r7041j29437C66562I9270a91090Q3521k0772L5689
$$ 81037 -32710 127120 -33645 -130686 -260123 366562 99270 -191090 -107569 -128341 -92652
10279i2652A28444K9139i739q7415A41597b33848A13753a61365N4019G6308e1317
$$ -92652 128444 157583 -9739 -97154 141597 -233848 113753 -161365 -107346 76308 -51317
10267a54971A14604K2397b837j25226a4891m9635j20380M6300A73643D3242d7280
$$ -154971 114604 137001 -2837 -128063 -14891 -64526 -184906 -138606 173643 43242 -47280
10255C1071a94238A25547K56708j4897M2404D1124J0474K02093n6368r7378c68420
$$ 31071 -194238 125547 382255 367358 409762 41124 51598 253691 197323 99945 -368420
10243C93847j78325n9669c2015l11106A7605e53248B64180e2309l7567j02704
$$ 393847 215522 155853 -32015 -343121 17605 -553248 264180 -52309 -89876 -192580
10233a92580K3067f6441a3613n4950b8647m25472i9898c6734j0923j98291j16898
$$ -192580 -169513 -66441 -13613 -68563 -28647 -454119 -99898 -36734 -47657 -245948 -362846
10222c62846A93195b89847b8959j39650A88132a92671A96851h4051G3258f4977
$$ -362846 193195 -289847 -28959 -168609 188132 -192671 196851 -84051 73258 -64977
10211c59851a43238l1014E4696O7535g7136j1612A03522c30739A10027H662c3586
$$ -359851 -143238 -174252 54696 122231 -77136 -88748 103522 -330739 110027 8662 -33586
10199d1386J9315p909k99130p8331e2234o1975k2280k24260I953O8858d9419p4260
$$ -41386 -22071 -29980 -329110 -407441 -52234 -114209 -136489 -360749 9953 78811 -49419 -123679
10187a23679H363a83639C5255f7606G7430b18429B71978c3308l18852g8050B35153
$$ -123679 8363 -183639 35255 -67606 77430 -218429 271978 -33308 -352160 -78050 235153
10175f3906m38587A23803K8056p0933a43172A00219O7860a47226q1240H3843i4401
$$ -63906 -502493 123803 151859 80926 -143172 100219 168079 -147226 -228466 83843 -94401
10163d93863J10194a62283C27124i2953A44948a25024C5947a98399j58555J11657
$$ -493863 -383669 -162283 327124 -92953 144948 -125024 35947 -198399 -356954 -245297
10153b45297b1614B3159a69709K990N2591o7828d5590B8513c18786A58106J4149
$$ -245297 -21614 23159 -169709 -166719 -114128 -181956 -45590 28513 -318786 158106 172255
10142A72255P9023a95962C0446c1500F8171i9416G848R1108b91906R9806R3431
$$ 172255 251278 -195962 30446 -31500 68171 -99416 7848 98956 -291906 -192100 -98669
10131i8669j67051F7385f776j02332A61849a41760j8092d3218B7285h8936E8075
$$ -98669 -265720 67385 -6776 -109108 161849 -141760 -159852 -43218 27285 -88936 58075
10119h4585A11496e7243k06715J22725j43562Q1602A97436P7645b41342b0647
$$ -84585 111496 -57243 -263958 -141233 -284795 -203193 197436 275081 -241342 -20647
10108b04292H9633J80767A29399M8576g2462A32423B6465J11516l1707a4849n0261
$$ -204292 89633 270400 129399 177975 -72462 132423 26465 137981 106274 -14849 -65110
10097f5110A83152b12664A1675e1068j9268c1836A70045a42108r2966B00084a61494
$$ -65110 183152 -212664 11675 -51068 -70336 -31836 170045 -142108 -235074 200084 -161494
10085H1219A7439R1597D7847b91999B33684n3450a52127O7475k5476J6339a8691
$$ 81219 17439 109036 47847 -291999 233684 180234 -152127 -84652 -110128 -93789 -18691
10073b91012h8369A75160B0858R6108b19973J06526B2938a30435d4672C2238m806
$$ -291012 -88369 175160 20858 116966 -219973 -113447 22938 -130435 -44672 32238 27432
10062B7432a85366o6146j5741E5650a89870f5528C0107Q3856h0107q2723k21458
$$ 27432 -185366 -251512 -267253 55650 -189870 -65528 30107 113963 -80107 -162830 -384288
10051c84288c5487j42943j07130A1900M2491b66185R3537C6842a80446j9971O1458
$$ -384288 -35487 -178430 -285560 11900 54391 -266185 -172648 36842 -180446 -200417 -138959
10040a38959n8271P0128e6041A56246h5025j56005C14470b26369g8056l35877
$$ -138959 -197230 -127102 -56041 156246 -85025 -241030 314470 -226369 -78056 -413933
10030d13933a04448A8975Q4028a61900A30344c13803C2375K3931c5928j66615
$$ -413933 -104448 18975 103003 -161900 130344 -313803 32375 56306 -35928 -202543
10020b02543o8093D0325L370c2771k12608j2094k11578J76347B3887f112B52525
$$ -202543 -270636 40325 43695 -32771 -245379 -257473 -469051 -292704 23887 -6112 252525
10008I6297a85016H5487J24516a07741k5939K714a2066j5976k8214J3285D472
$$ 96297 -185016 85487 210003 -107741 -133680 -130966 -12066 -28042 -56256 -42971 4472
9996a5465n3587C20423d02146A07492A2761J24775g0740j48864A96412c42240
$$ -15465 -69052 320423 -402146 107492 12761 137536 -70740 -219604 196412 -342240
9985a78497f9803K3860B09504g3918L0369a705o7091B8456K3882a33979A35014
$$ -178497 -69803 -45943 209504 -73918 -43549 -1705 -68796 28456 52338 -133979 135014
9973a7017k29015A1771a5636o5925n3050A08365a80269k754N9953B37976G3910
$$ -17017 -246032 11771 -15636 -81561 -134611 108365 -180269 -183023 -123070 237976 73910
9961F4151J44959I6144d41547G1032a87932a5899k4872A77558a61980K7457H2644
$$ 64151 209110 96144 -441547 71032 -187932 -15899 -40771 177558 -161980 -134523 82644
9949e5407l26582h955B6512b997j22075D7949o995L78864b93754D1534J0959J04338
$$ -55407 -381989 -8955 26512 -2997 -125072 47949 40954 419818 -293754 41534 52493 156831
9937A56831j4212J52955A3792c02402Q7120e7540j69550j29887g2849q7817o803
$$ 156831 142619 295574 13792 -302402 -215282 -57540 -227090 -356977 -72849 -160666 -167469
9926a67469g8708H0651b44423A77665E070c05506i6653A3614c2055G1641h817
$$ -167469 -78708 80651 -244423 177665 5070 -305506 -96653 13614 -32055 71641 -8817
9914d24681N8471E5459b00608l37325A58974a8367k00070A26709J6850b1720A24818
$$ -424681 -366210 55459 -200608 -537933 158974 -18367 -218437 126709 143559 -21720 124818
9902a10158L4109k9442H9660i1132k8620A07530J4887b12306o5996j51382B6198
$$ -110158 -76049 -105491 89660 -91132 -119752 107530 122417 -212306 -278302 -429684 26198
9890a01453B46573L1264a98262i279l07156B06779f3214o2897B83931a48166j44132
$$ -101453 246573 277837 -198262 -9279 -316435 206779 -63214 -126111 283931 -148166 -292298
9879b92298M4799A06681b69969B34875b951k604j87452k6321f9691G8a52199D00703
$$ -292298 -247499 106681 -269969 234875 -2951 -5555 -193007 -219328 -69691 78 -152199 400703
9866I1822b21088c2402D2319b7227B95172A33742a7409k0411A94675h5728j03765
$$ 91822 -221088 -32402 42319 -27227 295172 133742 -17409 -37820 194675 -85728 -189493
9855a89493k97825b10106c0086A95692n6466c85569A5120h5668q9160Q2752a1859
$$ -189493 -487318 -210106 -30086 195692 139226 -385569 15120 -85668 -174828 -92076 -11859
9843B4180b97731G6455R497Q6633g4785C1560j4217J40303b92623A9859c6061
$$ 24180 -297731 76455 85952 172585 -74785 31560 17343 157646 -292623 19859 -36061
9831f7132j0782m2755E4445b02301A4561M06664A6360c01954h0259C11271H3881
$$ -67132 -77914 -120669 54445 -202301 14561 421225 16360 -301954 -80259 311271 83881
9819A46522a84408m6184B032J66669C5083J08790c5554B01317i3711a3017k43085
$$ 146522 -184408 -230592 2032 168701 35083 143873 -35554 201317 -93711 -13017 -256102
9808b56102q4152J35343P7917A00121b4527j5187A157N7138b93791A46944a07204
$$ -256102 -340254 -204911 -126994 100121 -24527 -39714 1157 58295 -293791 146944 -107204
9796b09441K6495b2062A55207K03044e2948j73557E3131K26178e4033p8599N3055
$$ -209441 -182946 -22062 155207 358251 -52948 -226505 53131 279309 -54033 -132632 -79577
9785g9577j19081B3384b52192a15915A36966e9706k0762A8817H910P0416O5957
$$ -79577 -198658 23384 -252192 -115915 136966 -59706 -80468 18817 8910 79326 145283
9774A45283a32717L8865j30505G7933L12959a30927A2994b57376d679k8853q4853
$$ 145283 -132717 -93852 -224357 77933 390892 -130927 12994 -257376 -4679 -33532 -118385
9763a18385A50462b24118l151i3268D1899M938f2345o4609G0222h2077j92004
$$ -118385 150462 -224118 -227269 -93268 41899 46837 -62345 -126954 70222 -82077 -274081
9752b74081N8712p9580J9376B37924J71919H9276c1486j25516A72033g9212k70531
$$ -274081 -215369 -294949 -275573 237924 409843 89276 -31486 -157002 172033 -79212 -349743
9741c49743N9518E9456a2391j31260d5956m2393D11237a59125F337J1080g2205
$$ -349743 -290225 59456 -12391 -143651 -45956 -88349 411237 -159125 6337 17417 -72205
9729a73865k8839D8597h1068o435A77557b59678P7104O4653N7800A66827a52173
$$ -173865 -202704 48597 -81068 -87503 177557 -259678 -182574 -117921 -60121 166827 -152173
9717A52756f9945N85p6581M4030b867A55691b03564j12599F9631i2536G575b98510
$$ 152756 -69945 -69360 -145941 -101911 -2867 155691 -203564 -316163 69631 -92536 7575 -298510
9704a61095E5433a35184c0452H4777J0440a65576B0845J05246d45111K05631R4589
$$ -161095 55433 -135184 -30452 84777 95217 -165576 20845 126091 -445111 -239480 -144891
9693a44891H7875a76361A32683a43899c7831A76935h7229k04073F5740c62581
$$ -144891 87875 -176361 132683 -143899 -37831 176935 -87229 -291302 65740 -362581
9682a94464N6668D8268Q7299b05069e0410q3066F925K44926I5092a21433A20917
$$ -194464 -137796 48268 135567 -205069 -50410 -133476 6925 251851 95092 -121433 120917
9670B3311a01172F7904a07826B15303b67520A83328K4831c48435A54205K6220
$$ 23311 -101172 67904 -107826 215303 -267520 183328 208159 -348435 154205 180425
9660A80425d59211a08904A52772b52845C5332b72044L2887g6888I9589f8367j19700
$$ 180425 -459211 -108904 152772 -252845 35332 -272044 -239157 -76888 99589 -68367 -188067
9649a88067Q0048m07410b07119A27457b9435l12775A4416J46275N8823d6027A41288
$$ -188067 -108019 -515429 -207119 127457 -29435 -342210 14416 160691 219514 -46027 141288
9637C928R9641c08188O0116a9145m9839j09632a7997n2930F4495m994b28500M78
$$ 3928 103569 -308188 -248072 -19145 -68984 -178616 -17997 -70927 64495 59501 -228500 -228022
9625b28022E5952J01414c6412o483A29337h2435j09490a4493j47682j99478J32461
$$ -228022 55952 157366 -36412 -42895 129337 -82435 -191925 -14493 -162175 -361653 -229192
9614b29192G2267L6274D2692A7602d8855G4261K36861e07826a69766b9726B7767
$$ -229192 72267 108541 42692 17602 -48855 74261 311122 -507826 -169766 -29726 27767
9602b95103J28789r2768B56115p3764b59548A66189J82509C2203J28476h2714
$$ -295103 -166314 -259082 256115 182351 -259548 166189 348698 32203 160679 -82714
9591b9514C5901n24a67108A24381d70030K29034q5928a13787j83708g1061C9987
$$ -29514 35901 35377 -167108 124381 -470030 -240996 -326924 -113787 -297495 -71061 39987
9579a27371j33002d8532q768n2002B62393b32674i9245j3736l73417b4937C90243
$$ -127371 -260373 -48532 -57300 -109302 262393 -232674 -99245 -112981 -486398 -24937 390243
9567b80121c0143j77737E303c3754p3166C29813C007d5295n2796j46307k234J15999
$$ -280121 -30143 -207880 5303 -33754 -106920 329813 3007 -45295 -98091 -244398 -246632 -130633
9555a30633E1781J42699g7046k1567A45615J75567b71379a31100I6069a42610
$$ -130633 51781 194480 -77046 -98613 145615 321182 -271379 -131100 96069 -142610
9544b87979A23544d6305L228m62990d4570l24712a19320d4030k10279b9334j9251
$$ -287979 123544 -46305 -43077 -506067 -44570 -369282 -119320 -44030 -254309 -29334 -48585
9533d8585j52046B37897h5958A92807J9863a03208A08797O5234a52632b4906E213
$$ -48585 -200631 237897 -85958 192807 212670 -103208 108797 174031 -152632 -24906 5213
9521a25790j16625A63044h6877b1770l9580j33364b778A16896c14177P7044a01497
$$ -125790 -242415 163044 -86877 -21770 -61350 -194714 -2778 116896 -314177 -237133 -101497
9509b38303c4794l6495j13319q4073f5006D01880A10263k5189a08876C02011L10295
$$ -238303 -34794 -71289 -184608 -268681 -65006 401880 110263 85074 -108876 302011 612306
9498F12306b68273A62318L9857b97351f0536I18a88808F6375a51675B32730a72036
$$ 612306 -268273 162318 202175 -297351 -60536 918 -188808 66375 -151675 232730 -172036
9486a46675B89469j44050k3083c91100a16093C618b5962j55455J2287c091A0480
$$ -146675 289469 145419 122336 -391100 -116093 3618 -25962 -181417 -169130 -3091 10480
9474a73881Q4458F9484K64196h8072j10016j22414E4035b74554J3706a04823I3435
$$ -173881 -89423 69484 333680 -88072 -198088 -320502 54035 -274554 -260848 -104823 93435
9462c71992f6081j54131j76147I936a56378I2183b33102c2377l0421o3875C0229
$$ -371992 -66081 -220212 -396359 9936 -156378 92183 -233102 -32377 -62798 -126673 30229
9450g1619A95911b00168l1117A14934c88262i0978o8109m977h1244A07752b22934
$$ -71619 195911 -200168 -231285 114934 -388262 -90978 -159087 -164064 -81244 107752 -222934
9438c73824G5842M728b22164K3221b017C72364d6584l0257k88892A3149b3369
$$ -373824 75842 80570 -222164 -198943 -2017 372364 -46584 -76841 -365733 13149 -23369
9426A03758P165f3486A0366K36888b6520p2000d0856k07541d0234P771p3475l9986
$$ 103758 110923 -63486 10366 247254 -26520 -98520 -40856 -248397 -40234 -32463 -105938 -145924
9414a45924K7735C9832a89181Q6925K5877A25616P2140a10673L4338B52119b95191
$$ -145924 -118189 39832 -189181 -102256 -76379 125616 197756 -110673 -76335 252119 -295191
9402g3470m0599j57409A02905a88260c4125l90671a05883I9962b4474j31595q5916
$$ -73470 -114069 -271478 102905 -188260 -34125 -424796 -105883 99962 -24474 -156069 -241985
9391b41985h9491l3369k4922G8857K4281i8455j4245A13637j0905g5344A85686
$$ -241985 -89491 -122860 -147782 78857 103138 -98455 -112700 113637 102732 -75344 185686
9379a35324k30599a33617a004E9000J46590a41818H0293B7788b07998f2997m79254
$$ -135324 -365923 -133617 -1004 59000 205590 -141818 80293 27788 -207998 -62997 -542251
9368e42251a72503c906G5247c71730h9445k0055k07247a44655E9121K36437b82656
$$ -542251 -172503 -3906 75247 -371730 -89445 -109500 -316747 -144655 59121 295558 -282656
9356g3343a9616m76947a69756e5654A71411c46289A18882b08526b8055A13406
$$ -73343 -19616 -496563 -169756 -55654 171411 -346289 118882 -208526 -28055 113406
9345b40946C9297a12338J9975j76723j93547A94043g4656B59794C6163a43062
$$ -240946 39297 -112338 -92363 -269086 -462633 194043 -74656 259794 36163 -143062
9334b88614B43684c53346A33077c62329P8860A67591H0196a62429A52848L03817
$$ -288614 243684 -353346 133077 -362329 -283469 167591 80196 -162429 152848 456665
9324D56665a01633r2296J1458C32247b32632H0216b32441J10301P439A27883c90597
$$ 456665 -101633 -193929 -182471 332247 -232632 80216 -232441 -122140 -114701 127883 -390597
9312a06907A18704b46106b7503k65886P1305P0551A4725c4195a4566m3210E4408
$$ -106907 118704 -246106 -27503 -293389 -222084 -151533 14725 -34195 -14566 -57776 54408
9300A11581a86929c0966j7969a0920j22709D5018k411K63375a75241g5289A20200
$$ 111581 -186929 -30966 -48935 -10920 -133629 45018 42607 305982 -175241 -75289 120200
9288a9114c857k14077A27280a7311j62508D8285R94J17329b2824E46a31455k2873
$$ -19114 -3857 -217934 127280 -17311 -179819 48285 49279 166608 -22824 546 -131455 -154328
9276a54328f4098k22903J40384d1096p9383a0876l22050J51048g18B8548a79486
$$ -154328 -64098 -287001 -146617 -41096 -120479 -10876 -332926 -181878 -718 28548 -179486
9264E9316g6963r358C9836c2462B20607a6356m04147a95445M3609m3031E7833
$$ 59316 -76963 -86321 39836 -32462 220607 -16356 -420503 -195445 -151836 -194867 57833
9252A15740a01485q1012K541K8016c1160m5334j61276B519K55336h9672H1157
$$ 115740 -101485 -182497 -179956 -151940 -31160 -76494 -237770 2519 257855 -89672 81157
9240A34891n0522a20878e6271r4229C2691c6378p4030k35232A02445a99809D9228
$$ 134891 84369 -120878 -56271 -150500 32691 -36378 -110408 -345640 102445 -199809 49228
9228d01382J83821J02230A23138b8861l18263e7889F4821Q8237C0093a34529p4268
$$ -401382 -217561 -115331 123138 -28861 -347124 -57889 64821 153058 30093 -134529 -208797
9217b08797N5768k2556f3054o2802B3959N8198Q1240a15164A55392J06177q0266
$$ -208797 -153029 -175585 -63054 -125856 23959 82157 163397 -115164 155392 261569 181303
9206A81303J4776g6088k17589G9782c11024B18545a74369j09476m830e6576A06278
$$ 181303 196079 -76088 -293677 79782 -311024 218545 -174369 -283845 -288675 -56576 106278
9194c13712c3918j87150C2589J11032b34024M0759n0721b4993m10120B36752C3592
$$ -313712 -33918 -221068 32589 143621 -234024 -193265 -243986 -24993 -435113 236752 33592
9182b7602j54979B39500j15855k8669i5331d4077H6715J17063b22694b1217m5799
$$ -27602 -182581 239500 123645 94976 -95331 -44077 86715 203778 -222694 -21217 -67016
9171f7016F8149g333k2086l36992c1999D0095a08430L8425H7425B9676J25667
$$ -67016 68149 -7333 -29419 -366411 -31999 40095 -108430 -70005 87425 29676 155343
9160A55343e8402j64537C0304a27103E025h168k23907g7407B04149a04603D3355
$$ 155343 -58402 -222939 30304 -127103 5025 -8168 -232075 -77407 204149 -104603 43355
9148f6902j9846c8998E5595J53292Q2175a8389I4285L75K73134A01225D293a23374
$$ -66902 -86748 -38998 55595 208887 291062 -18389 94285 94660 367794 101225 4293 -123374
9135h9999B4880M5098N2156f8290n6317D5872b88167A97585a66838N4758A33866
$$ -89999 24880 69978 122134 -68290 -124607 45872 -288167 197585 -166838 -112080 133866
9123a55777K2031N9048L7160j86724a00902r1935j17197M771G1407a64968P5638
$$ -155777 -133746 -74698 -37538 -224262 -100902 -192837 -310034 -305263 71407 -164968 -89330
9112h9330J3080D26051I7977C0489i5535j73425E3006a19160H9248L9694b34087
$$ -89330 -76250 426051 97977 30489 -95535 -268960 53006 -119160 89248 128942 -234087
9100C48668b36222E35190f9715l342m4887k4705j71411i6498B95694j26785d547
$$ 348668 -236222 535190 -69715 -73057 -117944 -142649 -314060 -96498 295694 168909 -4547
9088b51739B01720C6379b72133a21975F0395j5487d1520q328n9797A04686K01837
$$ -251739 201720 36379 -272133 -121975 60395 44908 -41520 -49848 -109645 104686 306523
9077C06523f9660o1462d2463A04400d3009B15669m5506g0200j7031k1623j54560
$$ 306523 -69660 -131122 -42463 104400 -43009 215669 170163 -70200 -87231 -108854 -263414
9066b63414k6835J34048f475j95558B3984a07132A36615E271R1347a53482j22442
$$ -263414 -290249 -156201 -6475 -202033 23984 -107132 136615 5271 96618 -153482 -275924
9055b75924e4998a4925A10617b82769d1037A14941a80054D0400b703l26242H6618
$$ -275924 -54998 -14925 110617 -282769 -41037 114941 -180054 40400 -2703 -328945 86618
9043b21420A43525O1258h3407m6501j93122C7271b31908K7273B19992o6969a09589
$$ -221420 143525 204783 -83407 -129908 -323030 37271 -231908 -204635 219992 153023 -109589
9031I1180b22466e4004j8101l1462k0516A90337B8246R1421e7403j61193A18457
$$ 91180 -222466 -54004 -72105 -103567 -124083 190337 28246 119667 -57403 -218596 118457
9019A46687F1123A2915d1261d15H0483P5220a54969K5913j37867m1842A48065
$$ 146687 61123 12915 -41261 -415 80483 155703 -154969 -129056 -266923 -308765 148065
9007A88292a38775M5842j83739J24003r9630e5274A30366N4975b8076B64679d00701
$$ 188292 -138775 -92933 -276672 -152669 -252299 -55274 130366 185341 -28076 264679 -400701
8995B35115c63977d297H5743c8155J807B1062b9744J283A08903b74905D6961O8910
$$ 235115 -363977 -4297 85743 -38155 -36348 21062 -29744 -28461 108903 -274905 46961 115871
8983A15871a08895A42218a20236A44057J7490c22224K3411J17417e0082j00296
$$ 115871 -108895 142218 -120236 144057 161547 -322224 -298813 -181396 -50082 -150378
8973a50378n012A5337a33197A01437C754c8890j0114j34628B18540D4529h8378
$$ -150378 -155390 15337 -133197 101437 3754 -38890 -49004 -183632 218540 44529 -88378
8961A70367b90885A4830P0315R084i4973j81560B38073m5050A8290b71106A0034
$$ 170367 -290885 14830 85145 94229 -94973 -276533 238073 193023 18290 -271106 10034
8949a79780A04360L0199b39090A34819a42130B67431E65b49684h4230P586k06275
$$ -179780 104360 134559 -239090 134819 -142130 267431 565 -249684 -84230 -76644 -282919
8938b82919c0555j41001n0351G4905J04775N2576F5019b45645A01693A6334c6279
$$ -282919 -30555 -171556 -221907 74905 179680 232256 65019 -245645 101693 16334 -36279
8926a45477d2854l4384m1419k19637A49756D0908a65533B58365M50884j90876
$$ -145477 -42854 -77238 -118657 -338294 149756 40908 -165533 258365 709249 518373
8916E18373A44166l521A3672b92916A72293A7213h3606D3182i7980A66981c9316
$$ 518373 144166 140645 13672 -292916 172293 17213 -83606 43182 -97980 166981 -39316
8904E1907a11752i518j64614a2929A33372c47236R2262F1253a03211A82623a31547
$$ 51907 -111752 -9518 -174132 -12929 133372 -347236 -254974 61253 -103211 182623 -131547
8892c5903l41441B20776a51522j14379a11192F542a58477j04485A19692d8534
$$ -35903 -377344 220776 -151522 -265901 -111192 6542 -158477 -262962 119692 -48534
8881D3180K50219b22341B3236i1834j91396B29928c72536D4037L9730A7439b59535
$$ 43180 293399 -222341 23236 -91834 -283230 229928 -372536 44037 83767 17439 -259535
8869a41762B28005j07145k3812L3784a14718J3217j03543A68173B9643M5111j5931
$$ -141762 228005 120860 97048 130832 -114718 -101501 -205044 168173 29643 74754 58823
8858E8823d1857p1299j65297E8541d2027B61812A07928l6499b23340R8882A89889
$$ 58823 -41857 -113156 -278453 58541 -42027 261812 107928 71429 -223340 -124458 189889
8846a48309j55624a32565a0116A74675m7584a18927B22031a37678a0637D23143
$$ -148309 -303933 -132565 -10116 174675 127091 -118927 222031 -137678 -10637 423143
$$ [...]
##END NTUPLES=NMR SPECTRUM
##END=
