##TITLE=NES1044_936998_9268534_vTlQDmBc9A
##JCAMPDX= 6.0         $$ Bruker NMR JCAMP-DX V2.0
##DATA TYPE= NMR SPECTRUM
##DATA CLASS= NTUPLES
##ORIGIN= BRUKER
##OWNER= Administrator
$$ 1.72 TOPSPIN		Version 2.1
$$ 2015-07-12 01:22:12.331 -0700  Administrator@X
$$ Compression mode = diff/dup
##.OBSERVE FREQUENCY= 400.02188249412
##.OBSERVE NUCLEUS= ^1H
##.ACQUISITION MODE= SIMULTANEOUS (DQD)
##.ACQUISITION SCHEME= undefined
##.AVERAGES= 8
##.DIGITISER RES= 22
##SPECTROMETER/DATA SYSTEM= spect
##.PULSE SEQUENCE= zg30
##.SOLVENT NAME= COFFEE_meoh
##.SHIFT REFERENCE= INTERNAL, COFFEE_meoh, 1, 14.98509
##AUDIT TRAIL= $$ (NUMBER, WHEN, WHO, WHERE, PROCESS, VERSION, WHAT)
$$ ##TITLE= Audit trail, TOPSPIN		Version 2.1
$$ ##JCAMPDX= 5.01
$$ ##ORIGIN= Bruker BioSpin GmbH
$$ ##OWNER= Administrator
$$ $$ E:\/data/COFFEE/nmr/NES1044_936998_9268534_vTlQDmBc9A/10/pdata/1/auditp.txt
$$ ##AUDIT TRAIL=  $$ (NUMBER, WHEN, WHO, WHERE, PROCESS, VERSION, WHAT)
(   1,<2015-07-12 01:22:04.910 -0700>,<Administrator>,<X>,<go>,<TOPSPIN 2.1>,
      <created by zg
	started at 2015-07-12 01:20:59.128 -0700,
	POWCHK enabled, PULCHK disabled,
       configuration hash MD5:
       21 0F 79 D6 B3 7B B4 F6 88 20 88 DB 03 48 BD 9F
       data hash MD5: 64K
       7C 93 83 46 A7 C0 C3 19 BC CC DC 54 21 3B 65 EF>)
(   2,<2015-07-12 01:22:08.160 -0700>,<Administrator>,<X>,<proc1d>,<TOPSPIN 2.1>,
      <Start of raw data processing
       efp LB = 0 FT_mod = 6 PKNL = 1 PHC0 = 0 PHC1 = 0 SI = 32K 
       data hash MD5: 32K
       34 DF FD 73 68 32 6B 83 F4 14 D9 14 76 38 E7 00>)
(   3,<2015-07-12 01:22:08.456 -0700>,<Administrator>,<X>,<proc1d>,<TOPSPIN 2.1>,
      <pk PHC0 = 93.47717 PHC1 = 0 
       data hash MD5: 32K
       BC 4B 3A 0C 42 F2 8E 0A 51 DF 30 E2 70 3E 6C 49>)
(   4,<2015-07-12 01:22:08.566 -0700>,<Administrator>,<X>,<proc1d>,<TOPSPIN 2.1>,
      <abs ABSG = 1 
       data hash MD5: 32K
       00 27 87 C6 AE 62 2B A6 94 AC 08 73 88 E8 2E 0C>)
(   5,<2015-07-12 01:22:08.628 -0700>,<Administrator>,<X>,<proc1d>,<TOPSPIN 2.1>,
      <abs ABSG = 2 
       data hash MD5: 32K
       70 6C C0 C0 B2 5B 0C F0 A3 A0 02 C7 C5 6F EA DE>)
(   6,<2015-07-12 01:22:08.675 -0700>,<Administrator>,<X>,<proc1d>,<TOPSPIN 2.1>,
      <abs ABSG = 3 
       data hash MD5: 32K
       4B 07 6E 86 DE 74 BB 2C 4E 53 6C 86 BB 90 CF 06>)
(   7,<2015-07-12 01:22:08.753 -0700>,<Administrator>,<X>,<proc1d>,<TOPSPIN 2.1>,
      <abs ABSG = 4 
       data hash MD5: 32K
       F9 B0 D6 5F AC 7D 98 FF A5 CD A1 06 0D 47 6A BA>)
(   8,<2015-07-12 01:22:08.800 -0700>,<Administrator>,<X>,<proc1d>,<TOPSPIN 2.1>,
      <abs ABSG = 5 
       data hash MD5: 32K
       FD BB 48 71 92 6C 9E D6 28 DA 36 34 4A 14 5C D6>)
$$ ##END=
$$ 
$$ $$ hash MD5
$$ $$ 5A 3C D2 57 80 91 A7 E8 DD 25 25 0D 6F 10 F9 6B
##$RELAX= 
##$RELAX= 
##$RELAX= 
##$RELAX= 
##$RELAX= 
##$RELAX= 
##$RELAX= 
$$ Bruker specific parameters
$$ --------------------------
##$DU= <E:\>
##$EXPNO= 10
##$NAME= <NES1044_936998_9268534_vTlQDmBc9A>
##$PROCNO= 1
$$ [...]
150 150 150 150 150 150 150 150
##$TP07= 0
##$TPNAME0= <>
##$TPNAME1= <>
##$TPNAME2= <>
##$TPNAME3= <>
##$TPNAME4= <>
##$TPNAME5= <>
##$TPNAME6= <>
##$TPNAME7= <>
##$TPOAL= (0..7)
0.5 0.5 0.5 0.5 0.5 0.5 0.5 0.5
##$TPOFFS= (0..7)
0 0 0 0 0 0 0 0
##$TUNHIN= 0
##$TUNHOUT= 0
##$TUNXOUT= 0
##$USERA1= <user>
##$USERA2= <user>
##$USERA3= <user>
##$USERA4= <user>
##$USERA5= <user>
##$V9= 5
##$VALIST= <valist>
##$VCLIST= <CCCCCCCCCCCCCCC>
##$VD= 0
##$VDLIST= <DDDDDDDDDDDDDDD>
##$VPLIST= <PPPPPPPPPPPPPPP>
##$VTLIST= <TTTTTTTTTTTTTTT>
##$WBST= 2048
##$WBSW= 25
##$XGAIN= (0..3)
0 0 0 0
##$XL= 0
##$YL= 0
##$YMAX_a= 622018
##$YMIN_a= -520387
##$ZGOPTNS= <>
##$ZL1= 120
##$ZL2= 120
##$ZL3= 120
##$ZL4= 120
##$ABSF1= 14.98509
##$ABSF2= -5.573092
##$ABSG= 5
##$ABSL= 3
##$ALPHA= 0
##$AQORDER= 0
##$ASSFAC= 0
##$ASSFACI= 0
##$ASSFACX= 0
##$ASSWID= 0
##$AUNMP= <proc_prof1d_extract_pilot.lims>
##$AXLEFT= 0
##$AXNAME= <>
##$AXNUC= <1H>
##$AXRIGHT= 0
##$AXTYPE= 0
##$AXUNIT= <>
##$AZFE= 0.1
##$AZFW= 0.1
##$BCFW= 0
##$BC_mod= 0
##$BYTORDP= 0
##$COROFFS= 0
##$CY= 15
##$DATMOD= 1
##$DC= 0
##$DFILT= <>
##$DTYPP= 0
##$F1P= 0
##$F2P= 0
##$FCOR= 0.5
##$FTSIZE= 32768
##$FT_mod= 6
##$GAMMA= 0
##$GB= 0
##$INTBC= 1
##$INTSCL= 1
##$ISEN= 128
##$LB= 0
##$LEV0= 0
##$LPBIN= 0
##$MAXI= 10000
##$MC2= 0
##$MEAN= 0
##$ME_mod= 0
##$MI= 0
##$NCOEF= 0
##$NC_proc= -8
##$NLEV= 6
##$NOISF1= 0
##$NOISF2= 0
##$NSP= 0
##$NTH_PI= 0
##$NZP= 0
##$OFFSET= 14.98509
##$PC= 1
##$PHC0= 93.47717
##$PHC1= 0
##$PH_mod= 1
##$PKNL= yes
##$PPARMOD= 0
##$PPDIAG= 0
##$PPIPTYP= 0
##$PPMPNUM= 2147483647
##$PPRESOL= 1
##$PSCAL= 4
##$PSIGN= 0
##$PYNMP= <proc.py>
##$REVERSE= no
##$SF= 400.02
##$SI= 32768
##$SIGF1= 0
##$SIGF2= 0
##$SINO= 400
##$SIOLD= 32768
##$SPECTYP= <>
##$SREGLST= <1H.CDCl3>
##$SSB= 0
##$STSI= 32768
##$STSR= 0
##$SW_p= 8223.68421052631
##$SYMM= 0
##$S_DEV= 0
##$TDeff= 65536
##$TDoff= 0
##$TI= <>
##$TILT= no
##$TM1= 0
##$TM2= 0
##$TOPLEV= 0
##$USERP1= <user>
##$USERP2= <user>
##$USERP3= <user>
##$USERP4= <user>
##$USERP5= <user>
##$WDW= 1
##$XDIM= 32768
##$YMAX_p= 450070024
##$YMIN_p= -703684
##$CURPLOT= <Network HP LaserJet P1505>
##$CURPRIN= <$Network HP LaserJet P1505>
##$DFORMAT= <normdp>
##$LAYOUT= <+/1D_H.xwp>
##$LFORMAT= <normlp>
##$PFORMAT= <normpl>
##$SURQMSG= 1
$$ End of Bruker specific parameters
$$ ---------------------------------
##NTUPLES= NMR SPECTRUM
##VAR_NAME=  FREQUENCY,     SPECTRUM/REAL,   SPECTRUM/IMAG
##SYMBOL=    X,             R,               I
##VAR_TYPE=  INDEPENDENT,   DEPENDENT,       DEPENDENT
##VAR_FORM=  AFFN,          ASDF,            ASDF
##VAR_DIM=   32768,         32768,           32768
##UNITS=     HZ,            ARBITRARY UNITS, ARBITRARY UNITS
##FACTOR=    0.250966925370066, 1,           1
##FIRST=     8223.43324360094, -198924,      -191743
##LAST=      0,             -191280,         -307844
##MIN=       0,             -703684,         0
##MAX=       8223.43324360094, 450070024,    0
$$ Real data points
##PAGE= N=1
##DATA TABLE= (X++(R..R)), XYDATA
$$ [...]
$$ plain form
19466 -155493 -261258 -50379 -186676 126062 -160788 -144122 -13531 41749 -195658 38671
19455 92788 -81201 -262780 -290640 -83195 -447394 109597 -5984 -148740 -79317 -48780 -189539
19444 -189539 109118 -28734 -176284 -61741 245243 6956 123843 175205 9123 -225194 -100182
19432 -200114 -24171 -6380 -273643 -239775 166938 -116392 -237026 -307767 -154257 308135
19421 -47748 -354749 116348 36288 -315480 -109955 -105650 27765 17601 -14971 -377766 -534935
19410 -534935 -120335 -104582 61124 -85463 8585 -102570 -111889 127018 -220399 -196220 -66556
19398 -56980 -284477 59444 207552 -17456 -7321 -16901 133582 -105433 -72266 253985 -276102
19386 -100443 -123993 -170965 -316017 -10695 -254354 101889 85276 117763 -174425 -139603 -284831
$$ packed form
19466a55493j05765e0379j36297A26062a60788J6666a3531D1749a95658C8671
19455I2788h1201j81579k7860h3195l64199A09597e984j42756O9423L0537j40759
19444a89539A09118b8734j47550f1741B45243F956J16887N1362I123b25194a00182
19432b00114b4171f380k67263L3868A66938a16392j20634p0741J53510C08135
19421d7748l07001A16348C6288c15480a09955M305B7765j0164a4971l62795j57169
19410e34935a20335J5753F1124h5463H585a02570r319A27018b20399K4179f6556
19398e6980k27497E9444J48108a7456g321r580A33582a05433L3167B53985b76102
19386a00443k3550m6972j45052a0695k43659A01889j6613L2487a74425L4822j45228
$$ plain form
19375 -284831 -25487 93914 -182875 -282420 -151345 -186189 40360 65664 -300141 -208052 54477
19363 -154124 192728 6040 17054 43412 -213686 26491 30076 -88010 -370931 -252346 -171483
19352 -171483 315395 -145197 -259531 56379 94731 -313374 -482839 -156705 -156335 3684 3345
19341 3345 37065 -146776 -369179 -480794 64462 -265028 -199495 -242360 -7247 76370 -254952
19329 -140243 -185131 25673 -441468 41338 -65813 -177439 287441 -30021 168063 44211 -76510
19317 -49530 121996 -133030 225456 -40859 1510 -68130 -81874 -33827 -298423 -241097 -57258
19305 325017 146125 -164534 -41312 -174210 128113 252131 -106213 -240962 -312472 -76000
19294 -27944 -366665 -140505 -98705 -37392 12103 -21680 126598 143355 48444 -302466 -305527
$$ packed form
19375b84831b5487I3914a82875r9545J31075l4844D0360K5304c00141R2089E4477
19363a54124A92728F040J1014K6358b13686B6491L585h8010k82921J18585Q0863
19352a71483C15395a45197j14334E6379L8352c13374j69465a56705L70C684l39
19341C345L3720a46776k22403j11615F4462b65028O5533m2865g247G6370b54952
19329a40243m4888B5673d41468D1338f5813j11626B87441c0021A68063D4211g6510
19317d9530A21996a33030B25456d0859A510f8130j3744c3827k64596N7326e7258
19305C25017A46125a64534d1312j32898A28113J24018a06213j34749p1510g6000
19294b7944l38721a40505M1800c7392A2103b1680A26598J6757D8444c02466l061
$$ plain form
19283 -305527 -14920 84371 2529 -139295 -87266 72862 -154591 -83594 239504 156661 81944
19272 81944 -84544 -151577 -196679 -82977 124838 -78844 -79903 34767 -431377 -101776 51609
19260 -12757 143274 -308441 -401875 -86759 181660 -477406 96761 343558 -28841 -49749 362202
19248 -170705 -92431 -168534 -33475 -80086 -234742 -96587 57817 -108065 31119 -24871 -168948
19237 -168948 193867 73149 -281783 163250 -256830 223044 -40414 -247548 -91067 79918
19226 77530 -245217 -64411 -140875 -167651 -172890 -220183 -374088 -184109 -108141 -9867 -287199
19215 -287199 -221775 143339 -286858 -334766 57426 -110064 -216443 108968 -156716 -160300
19205 -160300 -211889 -250789 -226356 41346 358429 -92080 -120722 14775 133309 5010 180360
$$ packed form
19283c05527a4920H4371B529a39295N2029G2862a54591P0997B39504q2843p4717
19272H1944h4544o7033m5102h2977A24838g8844j059C4767d31377a01776E1609
19260a2757A43274c08441r3434h6759A81660d77406I6761K46797b8841k0908C62202
19248a70705P8274p6103c3475m6611j54656i6587E7817a08065C1119b4871j44077
19237a68948A93867G3149b81783A63250b56830B23044d0414k07134i1067G9918
19226G7530b45217f4411p6464k6776n239m7293j53905a84109P5968i867k77332
19215b87199O5424A43339b86858m7908E7426a10064j06379A08968a56716l584
19205a60300n1589l8900K4433D1346L17083i2080k8642A4775J18534E010J75350
$$ plain form
19194 180360 329899 -150812 146565 -53765 15148 -237964 -116575 20168 -36122 -247002
19184 -247002 -151096 -241421 -181668 -76135 -25612 -150517 -115683 -177703 125114 -306102 71255
19172 70894 -63156 -255489 -196842 -109454 1549 94119 77703 56992 94060 -42237 -44155 -206284
19160 -206284 -213156 63008 2272 -98791 426592 -110037 33846 115791 117751 -95687 -203180
19149 -203180 -7421 -165872 135183 9683 25316 -163236 -235528 188328 -24964 14334 -195723
19137 -173867 -41002 -310507 -268919 -231262 -56760 -274935 -351212 582 -39336 -75544 -327997
19126 -327997 -85057 231770 -211372 -125424 125015 -1405 25795 3999 -301561 -114746 -260875
19115 -260875 -101203 -215672 47407 141470 -137034 -322969 -182956 -266054 -76403 -204481
$$ packed form
19194A80360J49539a50812A46565e3765A5148b37964a16575B0168c6122k10880
19184b47002R5906r0325N9753g6135b5612j24905L4834o2020A25114c06102G1255
19172G0894f3156j92333N8647Q7388A549R2570j6416k0711L7068d2237j918j62129
19160b06284o872F3008B272i8791D26592a10037C3846Q1945J960i5687j07493
19149b03180g421j58451A35183I683J5633a63236p2292A88328b4964A4334a95723
19137a73867d1002k69505M1588L7657e6760k18175p6277E82c9336l6208k52453
19126c27997h5057B31770b11372Q5948A25015a405B5795C999c01561a14746j46129
19115b60875a01203j14469D7407R4063a37034j85935J40013q3098g6403j28078
$$ plain form
19105 -204481 39413 210218 -138690 -58623 -176345 159829 109615 386593 222173 -8087
19094 -113105 -250232 -118132 -262250 -13171 118320 -8961 65170 -57913 -60437 -452297 243654
19082 -105296 118936 -236921 -218518 -94885 -24796 72477 -238100 -152153 -352334 -178404
19072 -178404 129419 -180574 148538 -221983 -111195 149625 -28149 -16898 14224 -340539
19061 -210901 -170101 -58432 -62293 -182215 -187985 -78715 -344650 -50344 -125966 100300 279979
19050 279979 -310944 -8777 -127948 21793 88165 -126997 134693 64208 97212 25480 -232300
19038 -111835 -272930 150700 -196594 -15891 -52120 22936 -124331 32035 -260040 118218
19027 283049 74949 69006 -241364 32839 -35917 154334 -315394 -95117 17648 -216914 80355
$$ packed form
19105b04481C9413J70805a38690e8623j17722A59829n0214K76978j64420h087
19094a13105j37127a18132j44118a3171A18320h961F5170e7913k524l91860B43654
19082a05296A18936b36921J8403i4885b4796G2477b38100Q5947k00181J73930
19072a78404A29419a80574A48538b21983J10788A49625b8149J1251A4224c40539
19061b10901M0800e8432l861j19922n770g8715k65935e0344p5622A00300J79679
19050B79979c10944h777j19171B1793O6372a26997A34693F4208L3004B5480b32300
19038a11835j61095A50700a96594a5891l6229B2936a24331C2035b60040A18218
19027B83049G4949n943b41364C2839c5917A54334c15394i5117A7648b16914H0355
$$ plain form
19015 -106875 165584 193318 167920 -54152 233502 132206 299007 2338 -78245 390502 -64220
19003 5241 80552 132529 117621 132056 -30282 -94040 44527 347822 6309 -39588 130622 -325261
18990 19207 -285048 113967 -193682 -215038 54420 5333 -175097 -54509 93736 -60142 -186429
18979 -186429 -45257 238400 12979 -76066 84589 -87737 169796 297608 399730 328685 305261
18968 305261 -60227 -325129 96475 81939 80232 8823 -133656 -94448 357647 91476 214116
18957 214116 -86771 49445 225450 -415654 -46226 240187 -37222 254912 -56592 -295921
18947 -295921 -11425 -135894 10126 -365148 -165353 -439446 -17645 -157267 -99190 -81429
18937 -81429 -156944 -11245 109581 -211130 2295 55384 89920 -45692 -341529 187918 76875
$$ packed form
19015a06875A65584K7734k5398e4152B33502j01296J66801B338g8245C90502f4220
19003E241P5311N1977j4908J4435c0282o3758D4527L03295F309c9588A30622c25261
18990A9207b85048A13967a93682k1356E4420E333a75097e4509I3736f0142j26287
18979a86429d5257B38400A2979g6066H4589h7737A69796J27812J02122p1045k3424
18968C05261f0227k64902I6475j4536j707H823a33656L9208C57647I1476J22640
18957B14116h6771D9445J76005d15654d6226B40187c7222B54912e6592k39329
18947b95921a1425j24469A0126c65148a65353k74093a7645j39622N8077J7761
18937h1429p5515a1245A09581b11130B295N3089L4536d5692k95837A87918G6875
$$ plain form
18925 308259 -245064 18892 17076 -127621 -7378 112917 -40298 141561 -137329 63485 25579
18913 74852 36692 25361 71603 43586 388549 775917 701986 258033 564248 -178917 -156104
18902 -156104 -213263 96823 29286 60989 -73461 -160091 30888 63134 -40587 -195210 -190272
18891 -190272 14632 -18030 268398 13333 81841 58861 175437 -16731 -51119 10099 -52493
18879 61065 -101846 131082 -145745 -151620 158881 85996 338035 17642 -111008 -162136 -65806
18867 -25988 178737 -235361 20621 -163457 -384562 -337891 -145326 -268124 283855 -373197
18856 33633 -60633 -90875 -95504 -18192 62751 367970 -60748 345230 241226 50840 157648
18845 157648 128170 -80878 -248627 -89408 -69117 -254684 -310676 -156329 248927 -270176
$$ packed form
18925C08259b45064A8892j816a27621g378A12917d0298A41561a37329F3485B5579
18913G4852C6692j1331M6242k8017L44963L87368p3931B58033L06215a78917K2813
18902a56104n7159I6823B9286L1703g3461q6630C0888L2246d0587j54623M938
18891a90272A4632a8030B68398A3333O8508k2980J16576a6731l4388A0099e2493
18879F1065a01846A31082a45745n875A58881p2885K52039A7642a11008n1128f5806
18867b5988A78737b35361B0621a63457k21105M6671a45326j22798B83855c73197
18856C3633f0633l0242m629a8192F2751L05219f0748C45230j04004E0840J06808
18845A57648k9478h0878j67749h9408K0291j85567n5992J54347B48927b70176
$$ plain form
18834 -170610 -19929 -205775 -148875 96950 -23173 250397 -164710 -144529 -266493 -6493 -264529
18823 -264529 164105 -400011 -152182 -251915 -97258 -124142 -47088 208001 132502 15988 -539
18811 -372179 233553 222981 -70201 33665 252874 -90720 161193 -29927 -88289 -157885 113823
18799 -10198 144503 -38497 -263566 -143399 156878 -163229 184636 -142025 -282810 -212946
18789 -212946 113013 59643 103892 -110285 -53347 -55981 -170589 -129261 -141752 -261991 259498
18777 -304490 -144134 53840 -151774 -178141 53710 -446702 157657 -7482 -53006 -564216 -86001
18765 139199 -109505 51899 -178885 -54512 -161151 199373 -217444 -43226 35664 5109 -218950
18753 -53284 -165097 67864 80713 -268647 -107938 -216392 -73748 -58929 -64815 -337495 -194705
$$ packed form
18834a70610a9929j85846N6900I6950b3173B50397a64710K0181j21964f493k58036
18823b64529A64105d00011a52182r9733i7258k6884d7088B08001p5499A5988e39
18811c72179B33553j0572g0201C3665K19209i0720A61193b9927n8362o9596A13823
18799a0198A44503c8497k25069J20167A56878a63229A84636a42025j40785O9864
18789b12946A13013n3370M4249a10285e3347k634j14608M1328j2491j20239B59498
18777c04490a44134E3840a51774k6367E3710d46702A57657g482m5524n11210h6001
18765A39199a09505E1899a78885e4512j06639A99373b17444d3226C5664E109b18950
18753e3284j11813F7864J2849b68647a07938j08454g3748J4819n886k72680J42790
$$ plain form
18742 -194705 -157945 -565092 -200460 72936 -272983 375911 -182890 -76512 -172603 -243998
18732 -243998 111985 -210130 178834 238039 -69396 109739 -216272 -174819 -130211 -172962
18722 -172962 -49896 138426 66515 80901 -178340 -402536 248057 -206996 -68452 6391 401748
18711 401748 31772 -72472 -83149 -145150 -30726 32544 63280 69984 87856 -102385 3484 -114535
18698 -132910 6977 2182 111694 -148044 283765 -211650 184736 51316 132895 -315625 -251686
18687 -251686 32375 -116325 74504 182943 145872 -180083 -391153 93578 -104312 -101217 -121733
18676 -121733 -205575 113440 114876 -264605 90193 -55302 36965 -157107 197138 65231 -223217
18664 -125965 -452439 99950 -108773 -51082 327821 256928 -249874 -263844 -213639 -264267 29349
$$ packed form
18742a94705L6760m07147b00460G2936b72983C75911a82890g6512r6091p1395
18732b43998A11985b10130A78834N9205f9396A09739b16272M1453M4608m2751
18722a72962d9896A38426F6515J4386a78340k24196B48057b06996f8452F391L95357
18711D01748C1772g2472j0677o2001c0726C2544L0736O704J7872a02385C484a14535
18698a32910F977B182J09512a48044B83765b11650A84736E1316Q1579c15625O3939
18687b51686C2375a16325G4504J08439l7071a80083k11070I3578a04312L095k0516
18676a21733q3842A13440J436b64605I0193e5302C6965a57107A97138F5231b23217
18664a25965l26474I9950a08773e1082C27821p0893b49874j3970N0205n0628B9349
$$ plain form
18652 80749 -52516 67193 13037 67758 109696 82874 -73988 -16692 -190317 -99539 -335296
18641 -335296 -158401 -42196 -79217 -102334 39470 179767 -214149 30846 2711 -230495 172985
18629 196280 13775 -120353 271407 -226208 -426385 -115224 -93376 -185415 -252755 -145983
18619 -145983 110694 -348242 98615 23183 144558 94717 -120676 67725 204353 72680
18608 -10326 115023 -91512 -441837 6744 -261776 -21998 -276808 -91419 -18357 -277065 -36166
18596 -25353 -133964 -122003 81486 187854 -22235 323952 -54325 -156306 -81949 -263181 60963
18584 343345 228651 -188213 18579 140187 -243065 180830 -125034 -34452 -485785 -161253
18573 201240 -21956 134025 -266834 -203983 -127923 -63914 14147 195958 -212579 -103613
$$ packed form
18652H0749e2516F7193A3037N4721M1938k6822g3988a6692j73625R0778k35757
18641c35296a58401d2196l7021k3117C9470J40297b14149C0846B711b30495A72985
18629A96280A3775a20353B71407b26208k00177a15224K1848r2039o7340J06772
18619a45983A10694c48242I8615B3183J21375m9841a20676F7725J36628G2680
18608a0326A15023i1512l50325F744b61776b1998k54810i1419a8357k58708c6166
18596b5353j08611J1961H1486J06368b2235C23952e4325j01981P4357j81232F0963
18584C43345j14694a88213A8579J21608b43065A80830a25034c4452m51333a61253
18573B01240b1956A34025b66834O2851P6060f3914A4147J81811b12579a03613
$$ plain form
18562 -123196 -89493 -323583 39201 141565 44017 -129038 135696 -59772 -83463 -108243 -208242
18551 -208242 202528 11626 104066 -147549 -58050 -15214 -53590 -16209 -51749 -136147 50347
18539 390869 203589 -118371 -487305 -426279 -273205 -138299 -246173 -215786 -393775 -204246
18529 -204246 80566 288890 179115 167829 137464 77269 -245856 -144704 -213100 -25436 -133637
18518 -133637 352926 -167102 148842 113942 -324900 125332 -376270 -238201 26354 -60678
18507 -70019 148576 29742 -49831 162598 236809 -357129 -152412 -264799 -112142 79002
18496 161955 63966 -112144 259411 -32525 14409 -11728 -335746 -26133 -210824 -121107 -109292
18485 -109292 -134251 147583 -139222 -96252 61942 -190872 -193133 -148185 -303149 -189430 36988
$$ packed form
18562a23196L3703k34090C9201J02364D4017a29038A35696e9772k3691k4780r9999
18551b08242B02528A1626R2440a47549e8050a5214l8376a6209l5540q4398E0347
18539C90869j87280a18371l68934O1026J53074J34906j07874L0387j77989J89529
18529b04246H0566K08324j09775j1286l0365o0195b45856J01152o8396b5436j08201
18518a33637C52926a67102A48842l4900c24900A25332c76270J38069B6354f0678
18507g0019A48576B9742d9831A62598P4211c57129a52412j12387a12142G9002
18496A61955F3966a12144B59411c2525A4409a1728l24018b6133j84691Q9717J1815
18485a09292k4959A47583a39222M2970F1942a90872k261M4948j54964J13719C6988
$$ plain form
18473 12288 24827 -145678 -292676 -232681 -223488 55172 186007 177226 -378035 -347755 191078
18461 20315 -322193 -246905 -150319 -46953 277026 -34718 182923 69836 -204985 1264 -10999
18449 -280026 -267837 57321 121011 -27448 285494 -97827 -279361 -54299 -122895 -205134 -93184
18437 -167718 157030 -156024 277223 -197192 105596 -49250 -113252 -151500 11548 -303465
18426 -221371 -169337 162444 -152332 -336704 -107230 -349102 -162843 -127596 -124723 198407
18415 -167188 17933 -47501 -96033 140958 -156041 -166977 -153206 -146014 43645 32680 -145226
18403 -6416 217673 17063 104238 291641 85601 236272 -354712 16030 235937 255878 113254
18391 21350 -189269 159594 -295994 -162878 -43476 93244 -569205 -143488 117218 47008
$$ packed form
18473A2288J2539a45678j46998N9995R193E5172J30835q781c78035L0280A91078
18461B0315c22193P5288R6586d6953B77026c4718A82923F9836b04985A264a0999
18449b80026J2189E7321O3690b7448B85494i7827j81534e4299o8596q2239i3184
18437a67718A57030a56024B77223a97192A05596d9250o4002l8248A1548c03465
18426b21371N2034A62444a52332j84372a07230k41872a62843L5247K873A98407
18415a67188A7933d7501m8532A40958a56041j0936J3771P192D3645j0965a45226
18403f416B17673A7063Q7175J87403H5601J50671c54712A6030K19907J9941A13254
18391B1350a89269A59594b95994J33116d3476I3244e69205a43488A17218D7008
$$ plain form
18380 -47164 487759 -56050 -118062 224651 276606 160010 -64918 38477 104807 405570 6196
18368 157485 -188053 -70969 -55989 9321 38988 86662 170580 24953 86209 66204 -585 202267
18355 137276 -67750 -331207 37349 -10241 -150596 125787 74325 -459686 26231 118723 75238
18344 75238 -15780 168011 -120918 -166893 -210609 -59032 -235955 -422950 100229 -134671
18333 162043 61000 -174218 -301879 -10603 -142786 69550 241300 316068 36837 -282759
18322 -183746 59234 -163235 -163206 -64763 157486 -185558 227302 -51537 -10815 -95949 -51012
18311 -51012 100217 112641 53099 -221335 288375 52742 362498 -107403 -41892 -170679
18301 -170679 14089 32778 -66833 127425 -168517 -14327 -229444 -242278 134566 -59241 -227026
$$ packed form
18380d7164D87759e6050o2012B24651N1955j16596f4918C8477O6330L00763F196
18368A57485a88053g0969J4980I321K9667M7674Q3918B4953O1256k0005e85B02267
18355A37276f7750k63457C7349a0241j40355A25787n1462d59686B6231R2492m3485
18344G5238a5780A68011a20918m5975m3716e9032j76923j86995A00229a34671
18333A62043F1000a74218j27661a0603j32183F9550J71750P4768C6837b82759
18322a83746E9234a63235K9f4763A57486a85558B27302e1537a0815q5134M4937
18311e1012A00217J2424E3099b21335B88375E2742L09756a07403d1892j28787
18301a70679A4089J8689f6833A27425a68517a4327k15117j2834A34566e9241j67785
$$ plain form
18290 -227026 -533240 124382 -179004 -314049 167841 -87560 -140792 -70508 218593 246063
18280 246063 314779 -85248 -39018 -71118 72546 -218457 124559 -280274 -82647 109338 -114893
18268 149991 -65286 220320 -63277 221644 99947 -39503 -291843 133101 35943 403825
18258 403825 192347 -247167 -141281 -90854 284703 28726 -380203 -49113 -30702 -111753
18248 -111753 133590 30704 212972 -279113 -32823 307288 -24460 299960 -207328 -86401
18237 63586 -86062 38089 150936 303233 -227542 -304970 -332160 -69227 -51320 -389317 83044
18225 -286745 -298160 158132 217356 -6715 29340 -45233 95821 -212566 -67070 -107881 -254287
18214 -254287 -230585 -195660 -130543 -46502 105416 -85777 150951 14606 -309871 16538 303070
$$ packed form
18290b27026l06214A24382a79004j35045A67841h7560n3232P0284B18593K7470
18280B46063O8716h5248c9018l2100G2546b18457A24559b80274h2647A09338a14893
18268A49991f5286B20320f3277B21644I9947c9503k52340A33101C5943L67882
18258D03825A92347b47167J05886N0427B84703B8726c80203d9113J8411q1051
18248a11753A33590C0704J82268b79113c2823C07288b4460B99960b07328h6401
18237F3586h6062C8089J12847J52297b27542p7428k7190f9227J7907l37997H3044
18225b86745j1415A58132N9224f715B9340d5233I5821b12566f7070m0811j46406
18214b54287K3702L4925O5117d6502A05416h5777A50951A4606c09871A6538K86532
$$ plain form
18203 303070 -118792 261368 -312669 -242942 -84701 2780 145311 -182092 -2074 69562 -66781
18191 25215 41992 10524 130791 134828 -260803 292127 -256852 -42015 239286 -244474 -179905
18180 -179905 195854 34001 123488 16019 339505 139615 60498 284742 -321494 -120011
18169 -129264 -236677 -363491 -58975 224351 125047 -154608 -36669 125082 -98349 -202275
18159 -202275 -181483 98455 91227 12805 -361024 -89424 -284042 113537 -107726 -41026 57452
18147 -109126 26155 17201 9595 -72846 249349 -215873 33767 -255037 86568 108531 66610
18136 66610 200823 -367460 382 10436 318378 215743 370150 -63527 -396141 -20176 94524
18124 274003 -57406 -129708 -205231 -148127 478332 -203513 -60117 -82661 -122781 -51308 46875
$$ packed form
18203C03070a18792B61368c12669O9727h4701B780J42531a82092b074F9562f6781
18191B5215J6777A0524J20267M037b60803B92127b56852d2015B39286b44474O4569
18180a79905A95854C4001Q9487A6019L23486A39615F0498K24244c21494a20011
18169a29264j07413j26814e8975B24351r9304a54608c6669A25082i8349j03926
18159b02275K0792I8455p228A2805c61024h9424j94618A13537a07726d1026E7452
18147a09126B6155q954p606g2846B49349b15873C3767b55037H6568K1963m1921
18136F6610J34213c67460C82J0054L07942j02635J54407f3527l32614b0176I4524
18124B74003e7406p2302p5523N7104D78332b03513f0117k2544m0120e1308D6875
$$ plain form
18112 -64027 -243175 -168256 -38495 -175632 190919 201459 -90460 -392876 -5127 251242 136736
18101 136736 -63060 -297311 -53258 191520 -188059 175188 61729 33666 -191941 -45149
18090 -118868 -203150 2225 -175747 83644 -27037 90687 -98634 -187717 -217292 260508 -138416
18078 -94714 26675 -56009 -51560 -263642 105768 -35138 129412 -88739 -332412 117906 -345559
18066 -314141 299455 -413562 -383819 -155382 -137193 -204348 -38740 -195581 -79383 203719
18055 420379 -158341 165890 15164 -42461 -59321 576115 97533 16534 160664 -193790
18044 -145993 36105 -133491 -78635 -151191 214308 154410 70705 -183276 145139 142002 -58466
18032 -161718 -276330 269681 -125150 286485 -214380 -183050 -108162 -56294 -36452 -305762
$$ packed form
18112f4027j79148P4919c8495j37137A90919J0540i0460l02416e127B51242j14506
18101A36736f3060k34251e3258A91520a88059A75188F1729k8063a91941d5149
18090a18868q4282B225a75747H3644b7037I0687i8634q9083k9575B60508a38416
18078i4714B6675e6009M449k12082A05768c5138A29412h8739k43673A17906c45559
18066c14141B99455d13562K9743a55382J8189o7155c8740j56841g9383B03719
18055D20379a58341A65890A5164d2461j6860E76115I7533A6534J44130a93790
18044a45993C6105a33491N4856p2556B14308n9898G0705a83276A45139l137e8466
18032a61718j14612B69681a25150B86485b14380L1330P4888N1868J9842k69310
$$ plain form
18022 -305762 -186019 91888 14113 22249 30342 -230576 -94745 -148283 -45062 -104916 110741
18010 172544 301818 -389434 398670 -208358 92054 84947 -173383 -25805 -58002 312067
17999 -79611 84682 87547 165137 269983 -176787 -104811 -74181 -62020 40931 -117519 143000
17987 -80643 18343 -171219 -215231 -118748 43076 -102906 119803 -301036 -316625 12684 123004
17976 123004 -167782 -366687 65420 34358 -40738 -125317 -40115 128203 150643 85385 81683
17965 81683 276858 -183101 -56957 229380 -240352 244662 -212936 175711 55595 116091
17955 116091 -3615 91875 -142760 107243 72168 -46431 -211805 -121631 31720 77568 293849
17944 293849 101829 127868 144241 -135690 -184107 -271623 -138346 63607 -122879 344531
$$ packed form
18022c05762J19743I1888A4113Q136Q093b30576i4745n3538d5062n9854A10741
18010A72544J29274c89434C98670b08358I2054p107a73383b5805l2197C12067
17999g9611H4682K865P7590J04846a76787P1976L0630J2161D0931a17519A43000
17987h0643A8343a71219m4012R6483D3076a02906A19803c01036j5589A2684J10320
17976A23004a67782j98905F5420l1062d0738q4579d0115A28203K2440o5258l702
17965H1683J95175a83101e6957B29380b40352B44662b12936A75711E5595O0496
17955A16091c615I1875a42760A07243l5075d6431j65374R0174C1720M5848K16281
17944B93849A01829K6039J6373a35690m8417q7516J33277F3607a22879C44531
$$ plain form
17933 -394087 120693 158312 258268 -8890 190383 24450 -74189 27405 51743 195279 34 171718
17921 171718 19721 -126733 -208564 -209323 104204 78838 -212638 65310 93573 43447 -46776
17909 398795 55184 -354008 -192812 272761 -58573 44354 128283 194103 -115055 -130422 131780
17897 -131946 46183 -36592 215111 171202 327369 30425 -104245 -30474 -246151 13661 172302
17886 172302 -37995 -54905 -290684 72431 -72364 186747 213489 -15005 -43164 30387 220567
17875 220567 -125123 299232 -139354 -47168 267134 -111962 -60026 -29184 28269 -198537
17864 343838 -88733 -62938 135844 257953 97256 -79143 244350 -47578 -380760 -175635
17853 302432 6417 -187093 -69277 104334 11032 96490 153300 -125909 -324840 169098 -72009
$$ packed form
17933c94087A20693L7619R9956h890A90383B4450g4189B7405K4338J43536C4J71684
17921A71718A9721a26733q1831p59A04204k5366b12638F5310K8263D3447d6776
17909C98795E5184c54008J61196B72761e8573D4354Q3929O5820a15055j5367A31780
17897a31946D6183c6592B15111m3909J56167C0425a04245c0474k15677A3661J58641
17886A72302c7995j6910k35779G2431g2364A86747K6742a5005k8159C0387J90180
17875B20567a25123B99232a39354d7168B67134a11962N1936b9184B8269a98537
17864C43838h8733K5795A35844J22109I7256g9143B44350d7578l33182a75635
17853C02432F417a87093f9277A04334A1032Q5458N6810a25909j98931A69098g2009
$$ plain form
17841 -211566 84201 38578 -96093 369381 -12507 -240079 -212416 -173899 62624 235330 35627
17829 137518 -37717 310547 -203086 -60294 327483 -41037 251958 317997 59596 -59659 111974
17817 -129079 275509 129704 -97490 50047 -8346 179450 810 -52578 240638 -50907 -179512
17806 -179512 -167446 104420 129179 -141621 105033 217628 -112993 -218458 -170211 291530
17795 147008 -213240 -168380 -202261 20607 -96682 -209788 -109727 101129 148175 -69125 -118850
17784 -118850 -110035 377955 -181196 163634 -6286 -61394 36847 161012 -23005 -106421 -9495
17772 -142285 320777 321391 31682 -106924 -145269 -168245 149392 50055 374798 405727 298071
17761 298071 32345 294262 254951 -22237 274703 106494 196483 124163 -147067 -187113 68317
$$ packed form
17841b11566H4201C8578i6093C69381a2507k27572K7663L8517F2624J72706C5627
17829A37518c7717C10547b03086f0294C27483d1037B51958O6039E9596e9659A11974
17817a29079B75509A29704i7490E0047h346A79450H10e2578B40638e0907j28605
17806a79512J2066A04420K4759a41621A05033J12595a12993j05465M8247B91530
17795A47008b13240M4860l3881B0607i6682j13106J00061A01129M7046f9125m9725
17784a18850Q815C77955a81196A63634f286n5108C6847J24165b3005q3416i495
17772a42285C20777O14C1682a06924l8345k2976A49392E0055L24743L0929j07656
17761B98071C2345K61917l9311b2237B74703A06494Q9989p2320a47067m0046F8317
$$ plain form
17749 -102620 -31523 77165 164625 29359 20902 -72126 210604 -108603 -73833 -167708 18373
17737 324465 79953 -280476 -9113 404454 -97838 165948 -130364 147593 4447 24701 -47235
17725 53220 -64975 -238629 32289 -67964 -67281 327020 -20435 72924 -28139 223519 97643
17713 -23821 -2709 67493 -150361 160424 136141 51003 126929 66563 253024 -12804 -125836
17702 -125836 -375476 -129236 -216990 347932 156367 -350165 168762 -230301 346743 210251
17692 210251 112021 -118495 85819 -174923 82851 -191244 -171390 -133768 -24274 127612 228388
17681 228388 363546 127977 170000 182768 61568 122614 175188 -21178 -411434 124227 177724
17670 177724 348721 199760 10941 350425 -61343 -105728 211601 75330 188365 -71929
$$ packed form
17749a02620c1523G7165Q7460B9359q457g2126B10604a08603L4770r3875A8373
17737C24465G9953b80476i113D04454i7838A65948a30364A47593D447K0254d7235
17725E3220f4975j73654C2289f7964O83C27020b0435G2924b8139B23519I7643
17713b3821b709F7493a50361A60424k4283E1003P5926o0366J86461a2804j13032
17702a25836k49640a29236q7754C47932A56367c50165A68762b30301C46743j36492
17692B10251r8230a18495H5819a74923H2851a91244J9854L7622b4274A27612J00776
17681B28388J35158A27977M2023J2768F1568O1046N2574b1178l90256A24227N3497
17670A77724J70997j48961A0941L39484f1343m4385B11601G5330J13035g1929
$$ plain form
17659 119320 230223 -174528 393181 45987 22677 -264723 -71078 472013 413801 -78002
17648 287615 174279 97400 -105935 -61445 28938 -113154 406920 223755 -203165 358948
17637 -81835 -13885 181677 250437 84172 61446 -341066 151479 -339089 102525 104912 7587
17625 28924 -186638 136452 96509 -28354 8939 207740 -92053 318419 157162 404321 -121484
17613 155426 108835 -214785 255692 -70664 143364 -94504 4979 347626 287843 199621 239784
17602 239784 455770 193903 340105 61798 247950 139278 214195 228852 132925 304166
17592 304166 436185 250860 28183 141314 94727 -64999 28860 42002 -124315 203248
17581 264557 257463 -221821 341953 116966 211127 210928 103783 191073 237357 150885 474560
$$ packed form
17659A19320J10903a74528C93181D5987B2677b64723g1078D72013n8212g8002
17648B87615j13336p6879a05935M4490B8938a13154D06920j83165b03165C58948
17637h1835a3885A81677O8760H4172k2726c41066A51479c39089A02525K387G587
17625B8924a86638A36452l9943b8354H939J98801i2053C18419A57162K47159a21484
17613A55426m6591b14785B55692g0664A43364i4504D979L42647n9783q8222M0163
17602B39784K15986A93903J46202F1798J86152j08672P4917J4657r5927J71241
17592C04166J32019j85325B8183J13131m6587f4999B8860J3142a24315B03248
17581B64557p094b21821C41953A16966R4161j99A03783Q7290M6284q6472L23675
$$ plain form
17570 474560 17685 -134547 124494 382953 143250 239747 356537 -42385 129362 238348
17560 238348 235307 -175909 219503 -19682 -251876 34908 99489 -88221 -47725 51693 122442
17549 122442 197241 -213955 192082 -45187 130636 219146 509763 309390 376483 190297
17539 190297 31481 2358 -89449 134534 380330 198903 611756 -5238 489235 192978 297248
17528 297248 328928 612243 490231 747027 898393 1043301 639137 786642 554388 555533
17518 555533 198437 378304 430104 41580 405843 527423 347580 700344 380489 747897
17508 747897 972474 1042105 648450 492774 523870 330392 353546 192208 311472 223834
17498 223834 570859 363418 253032 190244 500502 234473 311440 628534 227760 199624
$$ packed form
17570D74560A7685a34547A24494K58459A43250R6497J16790d2385A29362J08986
17560B38348l041a75909B19503a9682k32194C4908O4581h8221M0496E1693P0749
17549A22442P4799b13955A92082d5187A30636Q8510K90617k00373O7093j86186
17539A90297C1481B358h9449A34534K45796j81427M12853e238D89235A92978J04270
17528B97248L1680K83315j22012K56796J51366J44908m04164J47505k32254J145
17518E55533A98437J79867N1800D1580L64263J21580j79843L52764l19855L67408
17508G47897K24577O9631l93655j55676L1096j93478K3154j61338J19264q7638
17498B23834L47025k07441j10386o2788L10258B34473P6967L17094B27760k8136
$$ plain form
17488 199624 36525 449112 350328 197584 206389 305923 212062 22058 116132 628106 377719
17477 377719 298529 211768 136863 205876 47623 528680 45115 387708 159689 378748 340043
17466 340043 79118 235366 308777 38642 -216149 167085 291193 467387 236250 196660
17456 196660 404755 439195 305356 48145 158393 325550 129676 462935 112475 558445
17446 558445 511179 327246 511348 628017 262135 128250 256499 363256 255512 661490
17436 661490 350799 386806 423854 194152 198709 418531 507425 163394 240981 162995 444315
17425 444315 357258 429670 -129601 281324 285260 410084 224818 97541 350726 263411 427753
17414 427753 322111 480652 657195 456982 430648 -48923 99303 297364 300979 368443 310963
$$ packed form
17488A99624C6525M12587r8784j52744Q805R9534r3861B2058R4074N11974k50387
17477C77719p9190q6761p4905O9013D7623M81057D5115L42593A59689K19059l8705
17466C40043G9118J56248P3411C8642b16149A67085J24108J76194k31137l9590
17456A96660K08095L4440j33839D8145J10248J67157A29676L33259A12475M45970
17446E58445m7266j83933J84102J16669B62135A28250J28249J06757j07744M05978
17436F61490l10691L6007L7048A94152M557K19822Q8894A63394P7587p7986K81320
17425D44315q7057P2412a29601B81324L936J24824j85266I7541K53185q7315J64342
17414D27753j05642J58541J76543k00213k6334d8923I9303J98061L615O7464n7480
$$ plain form
17403 310963 -34751 329149 85781 98232 284061 4382 344665 1235 192493 305640 278984
17392 278984 296940 57953 257330 44569 519925 403143 112303 42712 83032 292883
17382 292883 211519 589604 227397 272504 246085 175668 36519 117671 357916 320726 142465
17370 151595 141257 -221393 450198 188662 170337 283502 262409 123639 185586 444662
17360 444662 175670 509669 -90711 109504 323164 349979 218821 203647 3266 43769 328934
17349 328934 236537 164806 84575 353832 146755 284682 247233 426821 193138 19152
17338 354448 253487 165762 288389 315738 450336 198398 154256 56104 -20502 291409
17327 270352 115032 57281 299078 235853 99261 225584 400558 462733 -58898 135288
$$ packed form
17403C10963c4751C29149H5781J2451J85829D382L40283A235J91258J13147k6656
17392B78984J7956E7953J99377D4569M75356j16782A12303D2712M0320K09851
17382B92883q1364L78085B27397M5107k6419p0417C6519Q1152K40245l7190A42465
17370A51595j0338b21393D50198A88662j8325J13165k1093A23639O1947K59076
17360D44662A75670L33999i0711A09504K13660K6815j31158j5174C266M0503K85165
17349C28934r2397p1731q0231K69257A46755J37927l7449J79588A93138A9152
17338C54448j00961q7725J22627K7349J34598A98398m4142E6104b0502B91409
17327B70352A15032E7281K41797o3225I9261J26323J74974O2175e8898A35288
$$ plain form
17316 323212 271241 312019 117659 199072 37249 213531 493007 202459 447572 274056
17306 274056 178942 59830 154744 331590 259908 230765 -27015 376379 242769 -132716 172154
17294 417025 299487 214989 492596 195840 387487 333845 129503 236076 417483 337848
17284 337848 127678 217742 402312 488264 175479 459379 228176 380714 411177 155553
17273 246734 164915 441100 256976 222036 169006 -9435 161130 344404 448565 290053
17263 290053 282694 161998 93168 236157 248724 46222 340716 255009 184945 250027 196137
17252 196137 233857 239709 325650 315422 521615 531855 498152 138842 309934 343159 187361
17241 187361 284316 354889 364573 335303 335180 649010 280642 323966 261762 52202 433255
$$ packed form
17316C23212n1971M0778A17659Q1413C7249J76282K79476B02459K45113j73516
17306B74056r5114E9830R4914J76846p1682k9143b7015C76379j33610a32716A72154
17294D17025j17538q4498K77607A95840J91647n3642A29503J06573J81407p9635
17284C37848A27678R0064J84570Q5952A75479K83900B28176J52538L0463A55553
17273B46734q1819K76185j84124l4940n3030i435A61130J83274J04161j58512
17263B90053p359j20696o8830J42989J2567D6222K94494q5707p0064O5082n3890
17252A96137L7720N852Q5941j0228K06193J0240l3703A38842J71092L3225j55798
17241A87361R6955P0573R684k9270j23L13830B80642M3324o2204E2202L81053
$$ plain form
17230 433255 633013 379737 334314 80843 164936 473470 542878 336025 306236 92854 160551
17219 160551 302216 446008 406113 297878 386030 283514 451370 469589 -164001 428730
17208 298323 242141 464279 384257 187133 643791 692324 511815 484260 547832 150149
17197 552559 428034 202939 315268 353275 425850 421372 495046 459133 381589 276494 683286
17186 683286 547017 412959 565243 423891 34977 508604 236160 255626 279977 283862
17176 283862 372347 193617 384957 500670 161169 531101 560796 458679 663633 432701
17166 432701 442290 409690 356096 284402 642850 363912 557773 406000 553832 679732
17156 679732 197956 623023 662098 484824 419939 273316 414416 398335 517661 614863
$$ packed form
17230D33255J99758k53276m5423H0843Q4093L08534O9408k06853k9789I2854O7697
17219A60551J41665J43792l9895j08235Q8152j02516J67856J8219a64001D28730
17208B98323n6182K22138q0022A87133M56658M8533j80509k7555O3572A50149
17197E52559j24525B02939J12329L8007P2575m478P3674l5913p7544j05095M06792
17186F83286j36269j34058J52284j41352C4977M73627B36160J9466K4351L885
17176B83862Q8485j78730J91340J15713A61169L69932K9695j02117K04954k30932
17166D32701R589l2600n3594p1694L58448k78938J93861j51773J47832J25900
17156F79732A97956M25067L9075j77274o4885j46623J41100j6081J19326R7202
$$ plain form
17146 614863 561018 315370 789258 395067 725491 470026 424367 807530 444956 487115
17136 487115 835100 769069 638197 341375 646590 737689 673701 671782 308177 660798
17126 660798 819734 886478 635734 477903 825488 543194 896385 566905 665640 492059
17116 492059 742372 973642 707775 46656 621909 720736 686401 519768 484864 875523
17106 875523 1114521 817546 372472 838143 694291 628688 551053 653529 976480 742954
17096 742954 755010 608012 210625 830077 625615 802351 725446 712520 1119072 596495
17086 596495 432596 643195 847490 842505 460829 656087 742905 583246 690779 733446
17076 733446 856018 978548 711454 577940 915665 896851 872872 748051 1109179 671537
$$ packed form
17146F14863n3845k45648M73888l94191L30424k55465m5659L83163l62574M2159
17136D87115L47985o6031j30872k96822L05215R1099o3988j919C08177L52621
17126F60798J58936O6744k50744j57831L47585k82294L53191l29480R8735j73581
17116D92059K50313K31270k65867D6656N75253R8827l4335j66633l4904L90659
17106H75523K38998k96975C72472M65671j43852o5603p7635J02476L22951k33526
17096G42954J2056j46998B10625O19452k04462J76736p6905j2926M06552n22577
17086E96495j63899K10599K04295m985l81676J95258Q6818j59659J07533M2667
17076G33446J22572J22530k67094j33514L37725j8814k3979j24821L61128m37642
$$ plain form
17066 671537 465016 925568 1055314 939037 769836 766882 480520 979118 977705 541988
17056 541988 823685 685494 814931 1010162 1000295 1026255 834453 758831 504090 507695 623163
17045 623163 1087176 1022502 800775 530622 1076829 775881 1032503 870612 1108652 1209705
17035 1209705 964937 983609 910135 1001983 1179912 1064974 1097640 993762 810790 749169
17025 749169 1460777 957530 798520 1423550 1091395 1062490 1226634 992299 1029181 689157
17015 689157 774446 978034 1460892 832372 806745 1271465 1246730 1203097 1045290 1120535
17005 1120535 1411376 988246 1232329 1156152 1242950 1391235 1211713 1186277 1347068 870923
16995 870923 1691139 857897 1158313 1485861 1316468 1203381 1441452 1169889 1376448 1422613
$$ packed form
17066F71537k06521M60552J29746j16277j69201k954k86362M98598j413m35717
17056E41988K81697j38191J29437J95231r867K5960j91802p5622k54741L605J15468
17045F23163M64013o4674k21727k70153N46207l00948K56622j61891K38040J01053
17035A209705k44768J8672p3474R1848J77929j14938L2666j03878j82972o1621
17025G49169P11608n03247j59010O25030l32155k8905J64144k34335L6882l40024
17015F89157Q5289K03588M82858o28520k5627M64720k4735m3633j57807P5245
17005A120535K90841m23130K44083p6177Q6798J48285j79522k5436J60791m76145
16995H70923Q20216q33242L00416L27548j69393j13087K38071k71563K06559M6165
$$ plain form
16985 1422613 1311336 1377280 1406953 1051900 1607688 1388558 1548379 1213165 1373387 1513218
16975 1513218 1513253 1260801 1400393 1578788 1779407 1664484 1570468 1513886 1899491 1786874
16965 1786874 1574476 1495065 1344077 1956456 1730151 1588119 1655559 1599349 1468656 1630360
16955 1630360 1518200 1613470 1956214 1721576 1941534 1544692 1897984 2063836 2007568 1753840
16945 1753840 1870970 1902411 1824696 1982775 2034723 2277638 1906755 1990509 2180614 2337623
16935 2337623 2086455 2110886 2211891 1844648 2266357 2239924 2149364 2081100 2156240 2166734
16925 2166734 2273822 2125434 2433355 2298160 2324843 2558310 2340619 2619426 2552647 2507396
16915 2507396 2338028 2766456 2716967 2585342 2720902 2907981 2632927 2761054 2775358 2806326
$$ packed form
16985A422613j11277O5944K9673l55053N55788k19130J59821l35214J60222J39831
16975A513218L5k52452J39592J78395K00619j14923r4016n6582L85605j12617
16965A786874k12398p9411j50988O12379k26305j42032O7440n6210j30693J61704
16955A630360j12160R5270L42744k34638K19958l96842L53292J65852n6268k53728
16945A753840J17130L1441p7715J58079N1948K42915l70883Q3754J90105J57009
16935B337623k51168K4431J01005l67243M21709k6433r0560o8264P5140J0494
16925B166734J07088j48388L07921j35195K6683K33467k17691K78807o6779m5251
16915B507396j69368M28428m9489j31625J35560J87079k75054J28127J4304L0968
$$ plain form
16905 2806326 3099873 3011000 3074345 2651118 2989234 2975462 3061103 3123635 3139486 3129923 3350815
16894 3350815 3311716 2998540 3541686 3434685 3361727 3625914 3493839 3455008 3490863 3622005
16884 3622005 3821888 3610936 3586692 3684124 3861978 3909907 3849130 4018889 3595440 4191334
16874 4191334 3939987 4356477 4127659 4030320 4529864 4358334 4406369 4292087 4333981 4757922
16864 4757922 4670030 4769340 4808523 4933681 5041049 4886822 5019984 5298372 5295354 5396534
16854 5396534 5281625 5773496 5901971 5828438 5784556 5696695 6087025 6127655 5939607 5864772
16844 5864772 6286199 6464307 6469267 6504479 6766334 6557235 7007916 7230853 7224925 7095582
16834 7095582 7476805 7270947 7378273 7869222 7901014 8075663 8467986 8138406 8591291 8431224
$$ packed form
16905B806326K93547q8873O3345m23227L38116j3772Q5641O2532J5851r563K20892
16894C350815l9099l13176N43146j07001p2958K64187j32075l8831L5855J31142
16884C622005J99883k10952k4244R7432J77854M7929o0777J69759m23449N95894
16874D191334k51347M16490k28818r7339M99544j71530M8035j14282M1894M23941
16864D757922q7892R9310L9183J25158J07368j54227J33162K78388l018J01180
16854E396534j14909M91871J28475p3533m3882q7861L90330M0630j88048p4835
16844E864772M21427J78108M960L5212K61855k09099M50681K22937n928j29343
16834G095582L81223k05858J07326M90949L1792J74649L92323l29580M52885j60067
$$ plain form
16824 8431224 8801474 9009037 9063836 9151465 9558317 9706905 9876136 10087116 10184413 10370707
16814 10370707 10572895 10682283 10879871 11243396 11307023 11862611 12063722 11897109 12361381
16805 12361381 12509499 12730820 13468799 13408348 13906438 14227747 14351868 14840108 15164354
16796 15164354 15132778 15859449 16428058 16715445 17173059 17489803 17885275 18429410 18541442
16787 18541442 19278145 19712021 20159483 20616703 21091027 21780984 22549625 23006722 23870018
16778 23870018 24072208 25102248 25476088 26778409 27424147 28207896 28835077 29466234 30479554
16769 30479554 31280716 32291031 33548182 34409064 35368747 36651303 37831707 38660939 40327484
16760 40327484 41170896 42663838 43910052 45542342 47238951 48257969 50422376 51631383
$$ packed form
16824H431224L70250K07563N4799Q7629M06852J48588J69231K10980R7297J86294
16814A0370707K02188J09388J97588L63525O3627N55588K01111j66613M64272
16805A2361381J48118K21321P37979o0451M98090L21309J24121M88240L24246
16796A5164354l1576P26671N68609K87387M57614L16744L95472N44135J12032
16787A8541442P36703M33876M47462M57220M74324O89957P68641M57097Q63296
16778B3870018K02190J030040L73840J302321O45738P83749O27181O31157J013320
16769C0479554Q01162J010315J257151Q60882R59683J282556J180404Q29232J666545
16760D0327484Q43412J492942J246214J632290J696609J019018K164407J209007
$$ plain form
16752 51631383 53035882 54727319 57001907 58389643 60529441 62680925 64524751 66498289
16744 66498289 68530288 70605548 72931910 75248031 77093554 79007650 81328493 83626096
16736 83626096 85546366 87752408 89678155 91766865 93369190 95039435 96970178 98492597
16728 98492597 99798491 101279687 102117120 103302084 103654449 104140280 104449121 104443739 103984200
16719 103984200 103966640 103239637 102408792 101781469 100585576 98931907 97817286 96078257 94680506
16710 94680506 92384254 90684412 88398570 86654540 84406183 82253499 80193953 78015393
16702 78015393 75836017 73412173 71312457 69299930 67263844 64896556 62976475 61286544
16694 61286544 59226173 57544093 55185328 53468143 52167292 50305980 48526904 47285307
$$ packed form
16752E1631383J404499J691437K274588J387736K139798K151484J843826J973538
16744F6498289K031999K075260K326362K316121J845523J914096K320843K297603
16736H3626096J920270K206042J925747K088710J602325J670245J930743J522419
16728I8492597J305894J481196Q37433J184964L52365M85831L08841n382m59539
16719A03984200j7560p27003q30845o27323j195893j653669j114621j739029j397751
16710I4680506k296252j699842k285842j744030k248357k152684k059546k178560
16702G8015393k179376k423844k099716k012527k036086k367288j920081j689931
16694F1286544k060371j682080k358765j717185j300851j861312j779076j241597
$$ plain form
16686 47285307 45667401 44136790 42936612 41449879 40192610 38897001 37887676 36648248
16678 36648248 35604796 34430293 33224063 32483666 31595995 30346141 29586819 28613128 28233932
16669 28233932 27381637 26709398 25617963 25182901 24183230 23422588 23034653 22388915 21879812
16660 21879812 21049673 20866285 20171845 19704713 19190630 18758739 18219724 17841046 17567206
16651 17567206 16897577 16681887 16230699 15974814 15313157 15201349 14736750 14310395 13856152
16642 13856152 13986323 13687311 13048078 12916145 12485819 12452404 12093431 11859426 11769015 11482965
16632 11482965 11227011 10999310 10412497 10602340 10491769 10275908 9971399 9724833 9393813
16623 9393813 9306523 9340256 9260428 8720996 9063862 8485381 8427791 8329420 8010644 7812712
$$ packed form
16686D7285307j617906j530611j200178j486733j257269j295609j009325j239428
16678C6648248j043452j174503j206230p40397q87671j249854p59322r73691l79196
16669B8233932q52295o72239j091435m35062r99671p60642l87935o45738n09103
16660B1879812q30139j83388o94440m67132n14083m31891n39015l78678k73840
16651A7567206o69629k15690m51188k55885o61657j11808m64599m26355m54243
16642A3856152J30171k99012o39233j31933m30326l3415l58973k34005r0411k86050
16632A1482965k55954k27701n86813J89843j10571k15861l04509k46566l31020
16623I393813q7290L3733p9828n39432L42866n78481n7590r8371l18776j97932
$$ plain form
16613 7812712 7670682 7695878 7664770 7269416 7431163 7001161 7390602 7000752 7021774 6773956
16603 6773956 6961376 6671487 6457954 6578433 6498988 6107051 5989756 6015622 5856608 5913448
16593 5913448 5888598 5787631 5373666 5423801 5252034 5005690 5363840 5485541 5569444 5206489
16583 5206489 4889061 5111956 4961495 4707486 4708789 4508842 4480917 4652023 4327164 4545817
16573 4545817 4384327 4436371 4414659 4042979 4189174 4226065 3963088 4103759 4186830 4201878
16563 4201878 3633223 3813456 3685189 3870641 3604719 3598748 3511154 3237386 4095681 3560970
16553 3560970 3661053 3425465 3566622 3310606 3314140 3175093 3090834 2924705 3072453 3255353
16543 3255353 2986111 3376244 3455875 2814853 3106718 2766507 2689105 2422511 2916271 2658846
$$ packed form
16613G812712j42030K5196l1108l95354J61747m30002L89441l89850K1022k47818
16603F773956J87420k89889k13533J20479p9445l91937j17295K5866j59014N6840
16593E913448k4850j00967m13965N0135j71767k46344L58150J21701Q3903l62955
16583E206489l17428K22895j50461k54009J303j99947k7925J71106l24859K18653
16573D545817j61490N2044k1712l71680J46195L6891k62977J40671Q3071J5048
16563D201878n68655J80233j28267J85452k65922n971q7594k73768Q58295n34711
16553C560970J00083k35588J41157k56016L534j39047q4259j66129J47748J82900
16543C255353k69242L90133P9631o41022K91865l40211p7402k66594M93760k57425
$$ plain form
16533 2658846 2588699 2777013 3006448 2565244 2535731 2494338 2558544 2967863 2442678 2539207
16523 2539207 2298091 2471270 1861828 2499847 2517588 2265705 2301136 2249987 2040847 2544522
16513 2544522 2370076 2400188 1690351 2413719 2272812 2219220 2303123 2204953 1869393 2350228
16503 2350228 1984326 1911855 2326718 1862300 1919543 1787929 1926278 1980763 1881028 1798325
16493 1798325 2067559 1442764 1994083 2206468 1645259 1775929 1753959 1888672 1750092 1754698
16483 1754698 1732657 1969307 1746147 1429318 1306084 2027047 1429411 1538838 1740734 1864391
16473 1864391 1360494 1467524 1671225 1498954 1133227 1455845 1555000 1337457 1431898 1306821
16463 1306821 1517764 1816997 1467359 1346817 1256142 1619849 1529721 1359350 1399270 1250483
$$ packed form
16533B658846p0147J88314K29435m41204k9513m1393O4206M09319n25185R6529
16523B539207k41116J73179o09442O38019J7741k51883L5431n1149k09140N03675
16513B544522j74446L0112p09837P23368j40907n3592Q3903r8170l35560M80835
16503B350228l65902p2471M14863m64418N7243j31614J38349N4485r9735q2703
16493A798325K69234o24795N51319K12385n61209J30670k1970J34713j38580M606
16483A754698k2041K36650k23160l16829j23234P20963n97636J09427K01896J23657
16473A864391n03897J07030K03701j72271l65727L22618R9155k17543R4441j25077
16463A306821K10943K99233l49638j20542r0675L63707r0128j70371L9920j48787
$$ plain form
16453 1250483 1355926 1331457 1347580 1352195 1570029 1401440 1532358 1373430 1510513 1334313
16443 1334313 1214043 1124337 1188245 1224750 1017364 1296347 1324995 1281320 1316716 1226413 1285965
16432 1285965 1000434 1284918 1432837 1180931 1347955 1110380 1488386 815329 1009621
16423 1009621 769273 1125398 1097235 1183119 924251 913512 1001175 1196688 1047427 1169308
16413 1169308 796177 1036160 1209029 1096110 809611 1032192 877766 980632 1021686 859675
16403 859675 1041028 1349495 1246255 1115715 1035810 1116824 1043236 841182 1085975 646330
16393 646330 966722 561230 944883 701424 1003599 880743 832152 839115 1098170 670604
16383 670604 750276 945114 812243 750938 896603 669731 951905 662178 971906 725393
$$ packed form
16453A250483J05443k4469J6123M615K17834j68589J30918j58928J37083j76200
16443A334313j20270q9706O3908L6505k07386K78983K8648m3675L5396r0303N9552
16432A285965k85531K84484J47919k51906J67024k37575L78006o73057J94292
16423A009621k40348L56125k8163Q5884k58868j0739Q7663J95513j49261J21881
16413A169308l73131K39983J72869j12919k86499K22581j54426J02866M1054j62011
16403H59675J81353L08467j03240j30540p9905Q1014p3588k02054K44793m39645
16393F46330L20392m05492L83653k43459L02175j22856m8591O963K59055m27566
16383F70604P9672J94838j32871o1305J45665k26872K82174k89727L09728k46513
$$ plain form
16373 725393 1003483 871404 750263 748346 662353 791247 798490 966614 476140 799442
16363 799442 880674 809414 519730 866707 737506 674401 648293 599745 1028485 1025619 694030
16352 694030 458786 848335 826459 445390 875062 326189 852850 749834 671126 571271
16342 571271 776092 979131 214403 590308 705863 876855 932845 499580 522554 706722
16332 706722 741392 602584 699739 781905 598089 685891 603940 688425 382716 160151 411640
16321 411640 467712 494127 358305 915267 641797 620991 362505 734267 679156 512141
16311 512141 749832 346121 516218 610149 539049 698847 847186 523894 508429 529147
16301 529147 733547 450367 354055 244792 356087 525096 572214 641633 565937 376123
$$ packed form
16373G25393K78090j32079j21141j917q5993J28894P243J68124D76140L23302
16363G99442Q1232p1260k89684L46977j29201o3105k6108m8548M28740k866l31589
16352F94030k35244L89549k1876l81069M29672C26189N26661j03016p8708r9855
16342E71271K04821K03039B14403L75905J15555J70992N5990m33265K2974J84168
16332G06722L4670j38808R7155Q2166j83816Q7802q1951Q4485l05709A60151K51489
16321D11640N6072K6415j35822N56962k73470k0806k58486L71762n5111j67015
16311E12141K37691C46121J70097R3931p1100J59798J48339l23292j5465K0718
16301E29147K04400k83180r6312j09263J11295J69009M7118O9419p5696j89814
$$ plain form
16291 376123 559697 -5960 493104 358777 404058 689071 587855 367815 127377 383206
16281 383206 532310 710690 604868 376381 321658 701401 223323 273520 678821 419330
16271 419330 117672 374312 204359 490459 289003 540460 677551 276972 114131 211789
16261 211789 404561 342616 428224 416224 495064 470579 461871 292070 717762 251232 630461
16250 630461 635739 358923 321247 370439 236911 289707 415169 270264 580088 501060 539862
16239 539862 402091 199813 296698 476903 391989 105529 193098 446912 31980 315380
16229 315380 347477 110910 -136032 420213 338426 193008 244805 167408 250554 301121 349978
16218 349978 480011 138600 216695 393592 504420 143878 378500 152260 384330 140960
$$ packed form
16291C76123J83574e960D93104j34327M5281K85013j01216k20040A27377K55829
16281C83206J49104J78380j05822k28487n4723L79743B23323N0197M05301k59491
16271D19330A17672K56640j69953K86100k01456K51457J37091B76972A14131R7658
16261B11789J92772o1945Q5608j2000P8840k4485q708j69801M25692B51232L79229
16250F30461N278k76816l7676M9192j33528N2796J25462j44905L09824p9028L8802
16239E39862j37771A99813R6885J80205q4914A05529Q7569K53814C1980K83400
16229C15380L2097A10910a36032D20213q1787j45418N1797p7397Q3146N0567M8857
16218C49978J30033A38600P8095J76897J10828A43878K34622A52260K32070A40960
$$ plain form
16207 379522 303470 585778 120479 340029 424983 233470 639593 153334 455806 266031
16197 266031 217862 432293 62533 104932 408704 216309 76351 351874 425137 258390
16187 258390 240904 150964 57192 71144 226945 130206 131508 63713 155497 110268 43310
16175 444727 187612 162126 349173 432171 451672 459689 184444 53503 -17947 96951 39242
16163 -540 -152134 6070 298295 186714 373509 183060 47243 302452 367050 377754 411626
16152 411626 224123 194404 214418 373484 387929 651396 161183 -206223 -98727 337095
16141 29197 323477 183706 99770 146127 177244 316902 126913 190323 1495 42670 -185923
16129 168281 305571 582234 586360 209484 90329 422114 658755 353533 10350 213995
$$ packed form
16207C79522p6052K82308A20479K19550Q4954j91513M06123A53334L02472j89775
16197B66031m8169K14431F2533M2399L03772j92395G6351K75523P3263j66747
16187B58390j7486q9940E7192J3952J55801r6739J302F3713R1784m5229D3310
16175D44727A87612k5486J87047Q2998J9501Q017A84444E3503a7947I6951C9242
16163e40j51594F070K92225j11581J86795A83060D7243K55209O4598J0704L3872
16152D11626j87503k9719K0014J59066J4445K63467A61183b06223i8727C37095
16141B9197K94280j39771q3936M6357L1117J39658A26913O3410A495M1175a85923
16129A68281J37290K76663M126B09484I0329L31785K36641l05222A0350K03645
$$ plain form
16119 213995 179229 -16225 250660 123815 325924 279149 27484 58366 176032 -210648
16108 -32730 213639 -118552 -191311 -181679 189769 1393 125355 -34725 342419 48628 -25681
16096 136087 238237 295946 50290 378039 263289 -106177 206276 -29051 283606 193682
16086 193682 148088 83796 -76482 272208 -162511 206291 -29773 -243556 63144 2121 153830
16075 153830 117415 289173 71220 18110 81839 210378 157704 168696 37457 -84942 448120
16063 200535 40030 84272 33914 146270 305071 -233977 178712 260545 226007 183384 61567
16051 255932 -46058 80301 128663 -73541 315846 34381 23492 183245 77680 114808 -120423
16039 382485 194657 -87980 185692 81366 17847 232948 -415728 -130856 223558 480975
$$ packed form
16119B13995l4766a6225B50660A23815K02109m6775B7484L0882J17666b10648
16108c2730B13639a18552p2759R632A89769A393J23962c4725C42419D8628b5681
16096A36087J02150N7709E0290L27749j14750a06177B06276b9051B83606q9924
16086A93682m5594o4292g6482B72208a62511B06291b9773k13783F3144B121J51709
16075A53830l6415J71758G1220A8110O3729J28539n2674J0992C7457h4942D48120
16063B00535D0030M4242C3914J12356J58801b33977A78712Q1833l4538m2623F1567
16051B55932d6058H0301M8362g3541C15846C4381j0889J59753G7680L7128a20423
16039C82485j87828h7980A85692H1366A7847K15101d15728a30856B23558K57417
$$ plain form
16029 480975 44262 -64398 -74438 -46804 174169 161726 -25968 -849 -98574 450685 211848
16017 186393 238523 55868 77700 12818 -24872 52845 -212241 -187147 156649 -57607 -42134
16006 -42134 12371 443471 -123502 37470 338742 24144 332843 62786 277040 5844 49284
15995 49284 -23092 193183 -84394 199907 -31915 319165 424675 818112 462844 885950
15985 885950 1441869 1156421 1405305 716895 384477 273791 325195 30105 96748 150754
15975 150754 421257 -2167 -42755 -13491 -177440 128767 80039 94926 -39953 156097 79036
15964 79036 254623 -33570 264789 -18713 -72532 348859 101918 51731 153945 -277 -142055
15953 -142055 -113684 -126613 -41048 43011 -116234 -61933 172840 25801 25717 -406340 -163207
$$ packed form
16029D80975D4262f4398j0040K7634A74169j2443b5968h49r7725D50685B11848
16017A86393N2130E5868K1832A2818b4872E2845b12241K5094A56649e7607J5473
16006d2134A2371M31100a23502C7470L01272B4144L08699F2786K14254E844M3440
15995D9284b3092A93183h4394A99907c1915C19165J05510L93437l55268M23106
15985H85950N55919k85448K48884o88410l32418j10686N1404C0105O6643N4006
15975A50754K70503b167m0588a3491j63949A28767m8728J4887c9953A56097p7061
15964G9036J75587c3570B64789a8713n3819C48859A01918n0187J02214b77j41778
15953a42055K8371j2929d1048D3011a16234N4301A72840B5801q4d06340a63207
$$ plain form
15941 180473 142449 166186 -51862 -55739 -54181 151873 12858 -351032 -136953 -44710 -111328
15930 -111328 229259 -70170 -184383 57828 -94316 147848 131274 -66608 -39962 -106953 7241
15918 65730 126443 418750 277704 -30341 23700 -200701 1843 146851 320362 -345012 273955
15906 -92038 3724 -69242 -207596 174012 31448 -85794 -202440 158516 -144824 -28522 167951
15894 -66268 -51175 -237870 -78336 -173592 -317040 6780 -119535 200337 259627 116251 43254
15882 153423 -47180 260117 -4307 72127 256520 -134246 105420 25743 11915 42799 -258821
15870 106073 -37438 -86472 1958 -74815 272128 151997 154029 -51249 180469 256842 -363217
15858 -209957 97939 -163166 130498 115343 -139032 243102 308621 -92745 153097 43932
$$ packed form
15941A80473l8024K3737e1862l877J558A51873A2858c51032a36953d4710o6618
15930a11328B29259g0170j14213E7828i4316A47848j6574f6608K6646o6991G241
15918F5730O0713K92307j41046c0341B3700b00701A843J45008J73511c45012B73955
15906i2038C724f9242j38354A74012C1448h5794j16646A58516a44824b8522A67951
15894f6268J5093j86695g8336r5256j43448F780a19535B00337N9290A16251D3254
15882A53423d7180B60117d307G2127J84393a34246A05420B5743A1915L0884b58821
15870A06073c7438m9034A958g4815B72128j20131K032e1249A80469P6373c63217
15858b09957I7939a63166A30498j5155a39032B43102O5519i2745A53097D3932
$$ plain form
15847 170257 -244695 -224896 88979 150662 -166763 7287 216405 -39326 137840 79258 162365
15836 162365 -109048 -18313 -49011 324189 -113820 -353092 40319 -57526 -83791 -47088 -69064
15825 -69064 313238 -227754 -10678 -381452 -106366 -275794 -67277 210075 13163 -194722
15814 46765 -170693 124583 242293 -23529 -62082 32444 -172120 -135300 25365 -2471 49060
15802 10784 112287 1852 54356 91828 -90754 -400869 -76767 -265518 -268152 4332 -338435
15790 56646 -26636 425966 -67719 -271989 9439 104904 151070 99854 63581 -72852 -174945
15779 -174945 32633 -247685 -9906 -73798 -233232 -241450 -70312 -30283 67984 9817 -88621 -133568
15767 -133568 24458 -21321 181033 86456 -92467 36712 176135 -223432 -221575 -457687 -4452
$$ packed form
15847A70257b44695J9799H8979O1683a66763G287K09118c9326A37840n8582Q3107
15836A62365a09048a8313l0698C24189a13820k39272D0319e7526k6265L6703k1976
15825f9064C13238b27754a0678l70774a06366j69428f7277B10075A3163a94722
15814D6765a70693A24583J17710b3529l8553C2444a72120L6820B5365b471D9060
15802A0784J01503A852N2504L7472i0754l10115g6767j88751k634D332c38435
15790E6646b6636D25966f7719k04270I439R5465M6166n1216l6273g2852j02093
15779a74945C2633b47685i906o3892j59434q218g0312c0283F7984I817h8621m4947
15767a33568B4458b1321A81033H6456i2467C6712J39423b23432J857k36112d452
$$ plain form
15755 311767 -67393 6320 115934 20633 -80761 -118844 318535 -271915 -54690 -8026 250161
15743 -129921 272145 17825 -128906 4902 -120214 67107 -59684 34420 12081 102048 -17042
15731 23852 214349 -9797 47038 100906 306570 -154763 -95174 -36403 -311139 26183 -316701
15719 -191058 165777 -310454 41490 150007 73653 -82671 -239184 -53440 33888 -63 157679
15707 130297 -220023 -63864 55968 -108077 45741 87633 129339 25625 -165665 -199835 30169
15695 -125167 245048 -36714 -112023 288892 48286 68841 -259899 -16067 99222 108735 414649
15684 414649 151258 -144836 -90612 -123594 121430 -134407 43742 54395 -8459 -523866 216321
15672 -14700 43419 137846 217611 352327 96748 9634 108244 310943 -354469 352207 3872
$$ packed form
15755C11767f7393F320J09614B0633h0761l8083C18535b71915e4690h026B50161
15743a29921B72145A7825a28906D902a20214F7107e9684C4420A2081Q9967a7042
15731B3852J90497i797D7038N3868K05664a54763N9589c6403k74736B6183c16701
15719a91058A65777c10454D1490J08517G3653h2671j56513e3440C3888f3A57679
15707A30297b20023f3864E5968a08077D5741M1892M1706B5625a65665l4170C0169
15695a25167B45048c6714p5309B88892D8286K0555b59899a6067I9222R513L05914
15684D14649A51258a44836N4224l2982A21430a34407D3742J0653h459n15407B16321
15672a4700D3419R4427P9765J34716I6748I634R8610K02699c54469C52207C872
$$ plain form
15660 -186969 -47137 -220863 182831 -173294 -251027 -353781 105991 -54245 -9780 -29472 106010
15648 -88999 -18506 123737 365123 251195 -85083 75957 326339 296221 67207 -18155 -197361
15637 -197361 -317932 -309044 239567 -340974 -115511 -127658 -154192 119328 -96576 -32305 -84866
15626 -84866 302061 -215668 -134987 -189177 45226 207833 -177586 37804 81880 -11416 -47842
15615 -47842 -156146 132246 54712 25600 71040 50062 -354168 -465 -153592 -108382 -53968
15603 -304925 225282 180987 280284 -185437 -79109 -334497 -27733 63545 156873 136244 101835
15592 101835 -46828 10080 191061 -189543 84139 -151937 -208493 -212955 -211087 22538 92461
15581 92461 -450568 158595 -85237 55837 241303 40291 -16649 -72805 -30147 -235479 -197322
$$ packed form
15660a86969d7137j73726A82831a73294p7733j02754A05991e4245i780j9692A06010
15648h8999a8506A23737K41386j13928h5083G5957K50382l0118F7207a8155j79206
15637a97361j20571Q888B39567c40974a15511j2147k6534A19328i6576c2305n2561
15626h4866C02061b15668Q0681n4190D5226J62607a77586C7804M4076a1416l6426
15615d7842j08304A32246E4712B5600M5440k0978c54168d65j53127M5210e3968
15603c04925B25282m4295R9297a85437g9109k55388b7733F3545R3328k0629l4409
15592A01835d6828A0080J80981a89543H4139a51937n6556m462J868B2538O9923
15581I2461d50568A58595h5237E5837J85466D0291a6649n6156c0147k05332L8157
$$ plain form
15570 -197322 15070 98613 -16397 83623 -118115 -60062 -37627 239693 129366 -178666 170253
15558 -27285 -125438 300182 167734 -183599 -187448 343541 335351 -40100 155557 -267425 223989
15546 -147438 221878 -18002 103429 -149304 204273 43458 131291 -60660 -151474 261544
15535 -233552 -85699 39948 -116168 -70021 214410 150622 282059 -293091 63719 154326 -287256
15523 75377 -153020 67769 230610 -4017 340695 51984 265795 24889 64797 113251 -154594
15511 208240 -160289 9195 242403 217495 29436 97379 98859 168348 308778 219551 187974
15500 187974 171730 315267 244011 45660 53304 -16743 61441 -109662 118035 -111327 412429
15488 84820 57880 49894 -149167 122790 158251 342910 -92118 90386 291864 104468 -68628
$$ packed form
15570a97322A5070Q3543a6397H3623a18115N8053K2435B39693j10327a78666A70253
15558b7285r8153C00182j32448a83599l849C43541q190d0100A55557b67425B23989
15546a47438B21878a8002A03429a49304B04273D3458Q7833f0660r0814B61544
15535b33552h5699C9948a16168M6147B14410o3788J31437b93091F3719R0607b87256
15523G5377a53020F7769J62841d017C40695E1984K13811B4889L9908M8454a54594
15511B08240a60289I195K33208k4908B9436O7943J480O9489J40430q9227l1577
15500A87974j6244J43537p1256D5660P644a6743F1441a09662A18035a11327D12429
15488H4820k6940p986a49167A22790L5461J84659i2118I0386K01478A04468f8628
$$ plain form
15476 431275 473479 338673 667593 405038 337067 490594 181623 -96946 114062 -43300
15465 244236 8712 61347 194606 -151710 148563 169048 121449 -75420 153446 152485 -78245
15453 -291809 -384553 117430 95806 363573 -22389 -69053 -96931 110132 191059 617919 308796
15441 733274 1263880 1044586 794296 332143 345354 27666 -295923 -219837 269527 213929
15431 213929 235420 100587 281514 -12520 -167586 -371238 -17555 36891 -64491 -98980 -214252
15420 -214252 -79581 264754 -78536 -29259 125191 -121676 41962 -117080 -381847 -83842
15409 249540 -92747 38069 104534 403030 22329 259866 135005 -189647 -5644 22026 153730
15398 153730 300033 130276 358072 -36424 104570 261213 116818 -84751 -97501 12513
$$ packed form
15476D31275M2204j34806L28920k62555o7971J53527A81623i6946A14062d3300
15465B44236H712N2635J33259a51710A48563K0485m7599g5420A53446r61g8245
15453b91809r2744A17430k1624K67767b2389m6664k7878A10132Q0927M26860C08796
15441G33274N30606k19294k50290C32143J3211B7666b95923P6086B69527n5598
15431B13929K1491A00587J80927a2520j55066k03652a7555C6891f4491l4489j15272
15420b14252g9581B64754g8536b9259A25191a21676D1962a17080k64767h3842
15409B49540i2747C8069O6465K98496B2329K37537j24861a89647e644B2026J31704
15398A53730J46303A30276K27796c6424A04570J56643A16818h4751j2750A2513
$$ plain form
15387 125113 311711 -421552 305380 -126274 -107442 -72602 52857 -167518 -88724 120948
15376 -1303 364622 208945 154913 284601 488379 116549 -50167 74091 -59160 194764 -164031
15364 -156556 -47741 198199 124041 173414 37588 133869 241541 255057 255528 45695 190245
15353 190245 90616 84661 -31834 12662 -109609 417119 241691 417649 139295 20380 257223
15342 257223 380268 295295 407791 428484 414132 337706 58793 256275 11215 44186 266790
15331 266790 345126 83741 4797 78165 2887 79828 201585 556876 -32870 51742 -191087
15319 237876 280980 75723 120293 128773 -118788 233784 -57911 205235 -131571 161948 433299
15308 433299 128775 177463 83583 109226 41575 117157 -58955 256581 -426945 -77774 -58468
$$ packed form
15387A25113J86598d21552C05380a26274J8832L4840E2857a67518P8794A20948
15376a303C64622j55677n4032J29688K03778A16549e0167G4091e9160A94764a64031
15364a56556d7741A98199p4158M9373C7588R6281J07672J3516M71D5695J44550
15353A90245I0616n955c1834A2662a09609D17119j75428J75958A39295B0380K36843
15342B57223J23045q4973J12496K0693j4352p6426E8793J97482A1215L2971K22604
15331B66790P8336H3741D797P3368B887P6941J21757L55291c2870E1742a91087
15319B37876M3104G5723M4570Q480a18788B33784e7911B05235a31571A61948K71351
15308D33299A28775M8688H3583K5643D1575P5582e8955B56581d26945g7774J9306
$$ plain form
15297 -58468 175219 136781 209512 186177 -15172 63441 75814 -2074 -114742 119884 -16859
15285 252391 63789 -76986 112765 -142221 -220441 -37436 84516 224602 -329016 13489 194877
15274 194877 5212 99918 -93309 273152 92375 187811 38424 -155118 263097 -198108 21158
15262 168150 266340 131103 91241 -135251 -76030 63141 -114843 90374 125455 218387 342186
15251 342186 27046 278601 271898 -234768 203142 269855 120830 304384 699390 1793031
15241 1793031 1606440 1296368 2015284 710463 194900 -9542 175655 278889 -51837 -146230
15231 -146230 73017 -139970 -188556 187423 370947 -258384 -46209 -65735 64155 -61610 -48042
15220 -48042 -379813 -100433 92661 -120360 -91453 -299511 -39566 42602 -67869 -33640 175932
$$ packed form
15297e8468A75219l8438P2731k3335a5172F3441J2373b074j12668A19884a6859
15285B52391F3789g6986A12765a42221p8220c7436H4516J40086c29016A3489J81388
15274A94877E212R4706i3309B73152I2375R5436C8424a55118B63097a98108B1158
15262A68150R8190A31103l9862a35251N9221F3141a14843I0374L5081R2932J23799
15251C42186B7046K51555o703b34768B03142O6713A20830J83554L95006J093641
15241A793031j86591l10072P18916G10463A94900i542A75655J03234e1837r4393
15231a46230G3017a39970m8586A87423J83524b58384d6209j9526F4155f1610J3568
15220d8042l31771a00433I2661a20360K8907k08058c9566D2602f7869c3640A75932
$$ plain form
15208 187226 369077 119007 77889 64601 180007 -55417 -40829 336240 -175530 44943
15197 -37949 234764 -33777 48464 82170 5077 -147044 256520 281448 -161472 -157943 243540
15185 78154 261183 80298 -145802 -13195 3111 54639 77347 71818 279401 392261 119920
15173 -62391 -82665 -43683 48367 -213984 78155 83257 339216 53902 213951 42270 215011
15162 215011 -267358 -132076 -49151 -28945 538035 197629 -66502 292089 253878 59886
15151 313870 251833 95516 -185774 199547 -216397 -234333 78816 273763 343728 -140242
15140 143992 285800 173250 41956 -222276 -102668 200459 178211 -11326 238489 -108529
15129 193624 206148 46693 44794 -31349 -240257 478134 -33870 175778 157919 476506 225871
$$ packed form
15208A87226J81851A19007m1118j3288J15406e5417J4588C36240a75530D4943
15197c7949B34764c3777D8464L3706E077a47044B56520K4928a61472L529B43540
15185G8154J83029H0298a45802a3195C111N1528K2708n529K07583J12860A19920
15173f2391k0274L8982D8367b13984G8155N102K55959E3902J60049D2270J72741
15162B15011b67358a32076d9151K0206E38035A97629f6502B92089l8211E9886
15151C13870o2037I5516a85774A99547b16397j7936G8816J94947O9965a40242
15140A43992J41808j12550D1956b22276a02668B00459k2248a1326B38489a08529
15129A93624J2524D6693j899c1349k08908D78134c3870A75778j7859L18587B25871
$$ plain form
15117 219297 602687 142419 160758 61149 193672 -56072 147837 -384960 44689 52621 135003
15106 135003 -67 70851 163490 -310147 -63420 -123502 205819 396537 -43491 -306710 106310
15094 -152876 53951 220695 378034 215244 14065 446783 -215788 68873 -25015 2961 -67273
15082 195527 16187 248995 151799 270979 -41804 -65455 -25615 229190 206874 117679 433167
15071 433167 -192995 254327 255918 383975 249766 238410 -290095 142323 -75637 231738
15060 50270 199658 235840 78257 447370 413234 38343 -2654 172703 216924 258890 463146
15049 463146 510559 208299 237376 546559 314520 299697 347057 389458 261325 454894
15039 454894 326273 432538 231548 176078 440640 196575 85813 564663 314388 221067
$$ packed form
15117B19297L83390A42419J8339F1149J32523e6072A47837c84960D4689P932Q2382
15106A35003f7G0851R2639c10147f3420o0082B05819J90718d3491k63219A06310
15094a52876E3951J66744J57339j62790A4065M32718b15788F8873b5015B961f7273
15082A95527A6187K32808r7196J19180d1804k3651b5615B29190k2316q9195L15488
15071D33167a92995B54327J591J28057j34209j1356b90095A42323g5637B31738
15060E0270J49388L6182G8257L69113l4136C8343b654A72703M4221M1966K04256
15049D63146M7413B08299K9077L09183k32039j4823M7360M2401j28133J93569
15039D54894j28621J06265k00990n5470K64562A96575H5813M78850k50275r3321
$$ plain form
15029 221067 612394 293186 588992 574253 638693 318796 305728 196956 291070 720689
15019 720689 388030 250448 481853 452597 422561 328693 -18800 285339 423208 497269
15009 497269 -32300 271191 352668 538541 389828 333123 148355 352806 159835 699504
14999 699504 527337 274325 537179 378488 395837 270264 314543 311048 260543 339075 506535
14988 506535 289991 369270 541405 501981 531738 563452 598719 854071 404829 738570
14978 738570 587302 472116 245353 355150 411167 476696 143188 749192 655947 515580
14968 515580 551902 467523 165831 276558 -113795 262036 481510 232235 94356 382472
14958 382472 480043 240481 143457 414203 609469 -57487 254507 411755 484326 439625
$$ packed form
15029B21067L91327B93186K95806j4739O4440C18796j3068j08772R4114M29619
15019G20689l32659j37582K31405k9256l0036r3868a8800B85339J37869P4061
15009D97269c2300B71191Q1477J85873j48713n6705A48355K04451A59835N39669
14999F99504j72167k53012K62854j58691J7349j25573M4279l495n0505P8532J67460
14988E06535k16544P9279J72135l9424K9757L1714L5267K55352D04829L33741
14978G38570j51268j15186k26763J09797N6017O5529A43188O06004r3245j40367
14968E15580L6322q4379A65831J10727a13795B62036K19474B32235I4356K88116
14958C82472R7571k39562r7024K70746J95266e7487B54507J57248P2571m4701
$$ plain form
14948 439625 418153 454352 266322 384036 494590 942163 491422 467255 387879 209327
14938 209327 412841 442703 372903 542889 586040 781567 774307 471875 787833 939101
14928 939101 1311526 1283914 1317188 1608444 1523490 1421500 1312084 1420163 960750 1758402
14918 1758402 1924539 1681723 2144223 1612704 1306461 991812 948203 1025683 757610 563956
14908 563956 297257 325651 492565 163885 468361 200612 592186 481091 338193 260000
14898 260000 414090 224414 833415 96417 364710 497874 235188 160620 435666 318211
14888 318211 404593 530601 747452 733999 949590 905915 619185 526612 862320 801711
14878 801711 730559 666071 248434 429150 304255 273595 299741 480214 723946 598196
$$ packed form
14948D39625k1472L6199j88030J17714J10554M47573m50741k4167p9376j78552
14938B09327K03514K9862o9800J69986M3151J95527p260l02432L15958J51268
14928I39101L72425k7612L3274K91256q4954j01990j09416J08079m59413P97652
14918A758402J66137k42816M62500n31519l06243l14649m3609P7480k68073j93654
14908E63956k66699K8394J66914A63885L04476B00612L91574j11095j42898p8193
14898B60000J54090j89676O09001I6417K68293J33164B35188p4568K75046j17455
14888C18211Q6382J26008K16851j3453K15591m3675k86730r2573L35708o0609
14878H01711p1152o4488B48434J80716j24895l0660K6146J80473K43732j25750
$$ plain form
14868 598196 436213 565496 561862 699721 574401 738120 221885 390367 369683 262704
14858 262704 176949 400350 545208 261135 492829 280027 592534 442100 419859 511943
14848 511943 686388 374684 509574 536919 940341 1166632 876094 841296 871878 794074
14838 794074 804810 580962 770923 878113 776640 369059 648195 621912 66374 515992
14828 515992 470266 416441 602304 525332 222896 616499 454158 577856 554664 891574
14818 891574 978512 307914 572742 809519 634317 629836 689176 499510 804119 657086
14808 657086 569129 511899 573411 822892 861332 987013 726768 463168 610083 396839
14798 396839 151160 585578 563866 475128 382644 605273 905559 573692 572883 566469 425927
$$ packed form
14868E98196j61983J29283l634J37859j25320J63719B21885J68482k0684j06979
14858B62704q5755K23401J44858B61135K31694k12802L12507j50434k2241R2084
14848E11943J74445l11704J34890K7345M03422K26291k90538l4798L0582p7804
14838G94074J0736k23848J89961J07190j01473C69059K79136k6283F6374M49618
14828E15992m5726n3825J85863p6972B22896L93603j62341J23698k3192L36910
14818H91574Q6938C07914K64828K36777j75202m481N9340j89666L04609j47033
14808F57086q7957n7230O1512K49481L8440J25681k60245k63600J46915k13244
14798C96839A51160M34418k1712q8738r2484K22629L00286l31867q09o414j40542
$$ plain form
14787 425927 387052 684755 595492 625957 534979 589748 488137 692348 880420 1112913
14777 1112913 705869 1310490 847635 611228 642227 759678 678520 701963 739913 363165
14766 497822 568736 643352 720638 322839 227826 532617 530899 700709 619455 643585 607998
14755 607998 477019 837688 564427 556896 406763 432968 398703 615891 420051 483851
14745 483851 823908 1034456 531893 644013 649042 484731 565698 784536 563879 724512
14735 724512 884549 952689 765023 1064803 647049 815686 1340368 931936 1671090 1649227
14725 1649227 1297666 1643044 794993 1396925 774219 818355 734145 1153127 770224 846531
14715 846531 770668 693402 1127918 949734 860843 724228 1073146 989808 761760 1118116
$$ packed form
14787D25927l8875K97703q9263L0465r0978N4769j01611K04211J88072K32493
14777A112913m07044O04621m62855k36407L0999J17451q1158K3443L7950C63165
14766D97822P0914P4616P7286C22839r5013L04791j718J69810q1254K4130l5587
14755F07998j30979L60669k73261p531j50133K6205l4265K17188j95840O3800
14745D83851L40057K10548n02563J12120N029j64311Q0967K18838k20657J60633
14735G24512J60037O8140j87666K99780m17754J68637N24682m08432P39154k1863
14725A649227l51561L45378G94993O01932o22706M4136q4210M18982l82903P6307
14715H46531p5863p7266M34516j78184q8891j36615L48918q3338k28048L56356
$$ plain form
14705 1118116 1130896 1221451 1342731 1545329 1823959 1738100 2013597 1401704 1020575 1127953
14695 1127953 1096320 1169028 891259 1159920 575389 853599 735586 818861 768035 846874
14685 846874 765290 951606 869565 506991 741449 778507 964420 1143941 871824 765203
14675 765203 881198 974027 878320 830722 776032 1027418 731298 1162564 792065 1021256
14665 1021256 773139 812868 755192 944534 597087 1342989 1040148 1043678 858820 1148767
14655 1148767 1024946 1232478 1374334 1385406 1346792 1414756 1387467 1137872 1107574 1142439
14645 1142439 1111463 957093 1194759 949945 990488 1154403 1176500 1308564 1206780 1209958
14635 1209958 1041685 877086 1270735 696344 1076753 1080246 1407780 1166571 1110053 934681
$$ packed form
14705A118116J2780R0555J21280K02598K78630q5859K75497o11893l81129J07378
14695A127953l1633P2708k77769K68661E75389K78210j18013Q3275n0826P8839
14685H46874q1584J86316q2041l62574K34458L7058J85913J79521k72117j06621
14675G65203J15995R2829r5707m7598n4690K51386k96120M31266l70499K29191
14665A021256k48117L9729n7676J89342l47447P45902l02841L530j84858K89947
14655A148767j23821K07532J41856J1072l8614O7964k7289k49595l0298L4865
14645A142439l0976j54370K37666k44814M0543J63915K2097J32064j01784L178
14635A209958j68273j64599L93649n74391L80409L493L27534k41209n6518j75372
$$ plain form
14625 934681 1140851 1178233 1631459 1335539 1332831 1203639 882770 1386311 1482227 1584723
14615 1584723 1326355 1231357 1362927 1353614 1439858 1464604 1234532 1300061 1314361 1478924 1605522
14604 1605522 1528921 1474659 1338867 1278752 1623606 1597997 1500973 1570949 1291309 1713764
14594 1713764 1257414 1838157 1645330 1677507 1681620 1706912 1670752 1390849 1707375 1609932
14584 1609932 1878177 1393884 1778363 1788542 1774993 1579129 2040148 1694399 1943896 1956104
14574 1956104 1935425 2065903 2024891 2171995 1601877 2273577 2013533 1678103 2379769 2063754
14564 2063754 2373206 2144428 2430617 2506943 2203500 2464376 2711212 3085536 2896388 2856681
14554 2856681 3084145 3342049 3907574 4575957 5500791 7020576 10854170 18141619 37218007
$$ packed form
14625I34681K06170L7382M53226k95920k708j29192l20869N03541R5916J02496
14615A584723k58368r4998J31570r313Q6244K4746k30072O5529J4300J64563J26598
14604A605522p6601n4262j35792o0115L44854k5609r7024O9976k79640M22455
14594A713764m56350N80743j92827L2177M113K5292l6160k79903L16526r7443
14584A609932K68245m84293L84479J0179j3549j95864M61019l45749K49497J2208
14574A956104k0679J30478m1012J47104n70118O71700k60044l35430P01666l16015
14564B063754L09452k28778K86189P6326l03443K60876K46836L74324j89148l9707
14554B856681K27464K57904N65525O68383R24834J519785L833594P287449J9076388
$$ plain form
14545 37218007 44479301 17528138 7072522 3793181 2475124 2774535 3212161 4853385
14537 4853385 4990132 2410939 2080220 1923781 2021047 2022332 1922927 1976508 1984438 2176356
14527 2176356 2017924 2550947 2020960 2033688 2156363 2003176 1996163 2184201 1927975 2404666
14517 2404666 2119112 2409312 2529985 2064766 2353915 2235873 2541456 2767864 2623512
14508 2623512 2483975 2741659 2656387 2753100 2708443 3151666 2860260 3199898 2718725 2822973
14498 2822973 2479638 3165265 3530590 3032489 3120795 3088316 3372963 2821668 3096114 3186065
14488 3186065 3360119 3512885 3328896 3373339 3332711 3325265 3531298 3262089 3141089 3658844
14478 3658844 3528568 3664161 4059365 3515476 3738279 3685736 3727482 3463842 3713348 3996731
$$ packed form
14545C7218007P261294A7528138G072522l279341j318057K99411M37626J641224
14537D853385J36747B410939l30719j56439R7266J285r9405N3581P930J91918
14527B176356j58432N33023n29987J2728J22675j53187p013J88038k56226M76691
14517B404666k85554K90200J20673m65219K89149j18042L05583K26408j44352
14508B623512j39537K57684q5272R6713m4657M43223k91406L39638m81173J04248
14498B822973l43335O85627L65325m98101Q8306l2479K84647n51295K74446Q9951
14488C186065J74054J52766j83989M4443m0628p446K06033k69209j21000N17755
14478C658844j30276J35593L95204n43889K22803n2543M1746k63640K49506K83383
$$ plain form
14468 3996731 3809679 3957821 4280388 3979366 4155892 4330417 4029117 4520748 4422589 4773366
14458 4773366 4619671 4403272 4768664 4697947 4744693 4587626 4774236 4844896 4851448 4828323
14448 4828323 4898621 5135536 5177100 4894890 5388553 5299992 5093988 5549409 5458893 5819282
14438 5819282 5817148 5991748 5822951 5953438 5751181 6168779 5764243 6210681 6222894 6529428
14428 6529428 6495164 6612667 6691358 6854650 7233861 7217925 7264069 7631933 7700326 7617586
14418 7617586 7681912 7914604 8004478 8228608 8056430 7828991 8488604 8356780 8322467 8981155
14408 8981155 8558145 9277992 9297962 9560945 9391377 9585249 9632046 9817329 9984812 9796931
14398 9796931 10250263 10377674 10598756 10871956 10789274 11079902 11466351 11208716 11499841 11773874
$$ packed form
14468C996731j87052J48142L22567l01022J76526J74525l01300M91631r8159L50777
14458D773366j53695k16399L65392p0717M6746j57067J86610P0660O552k3125
14448D828323P0298K36915M1564k82210M93663q8561k06004M55421r0516L60389
14438E819282k134J74600j68797J30487k02257M17598m04536M46438J2213L06534
14428F529428l4264J17503P8691J63292L79211j5936M6144L67864O8393q2740
14418G617586O4326K32692Q9874K24130j72178k27439O59613j31824l4313O58688
14408H981155m23010P19847J9970K62983j69568J93872M6797J85283J67483j87881
14398I796931M53332J27411K21082K73200q2682K90628L86449k57635K91125K74033
$$ plain form
14388 11773874 11728760 12275345 12474224 12633614 12815721 13350523 13522602 13488551 13962294 14165276
14378 14165276 14535122 14377639 14782007 14894425 15314620 15686124 15899837 16408290 16710140
14369 16710140 17137318 17197684 18078120 18230082 18942852 19016979 19245313 19707806 19848880 20618150
14359 20618150 21079560 21444608 21779317 22414429 22696784 23508325 23763738 24290977 25348761
14350 25348761 25895604 26127197 27202666 27492336 28487797 28962601 29834686 30582483 31509468
14341 31509468 32521861 33535471 34227612 35132552 36166431 37358790 38096751 39035248 40358950
14332 40358950 41495078 43106129 44062567 45501393 46737911 48580923 49928271 51965536
14324 51965536 53530266 55427816 57405256 59884011 61505010 63575982 66029901 68508534
$$ packed form
14388A1773874m5114N46585J98879J59390J82107N34802J72079l4051M73743K02982
14378A4165276L69846j57483M04368J12418M20195L71504K13713N08453L01850
14369A6710140M27178O0366Q80436J51962P12770P4127K28334M62493J41074P69270
14359B0618150M61410L65048L34709O35112K82355Q11541K55413N27239J057784
14350B5348761N46843K31593J075469K89670R95461M74804Q72085P47797R26985
14341C1509468J012393J013610O92141R04940J033879J192359P37961R38497J323702
14332D0358950J136128J611051R56438J438826J236518J843012J347348K037265
14324E1965536J564730J897550J977440K478755J620999K070972K453919K478633
$$ plain form
14316 68508534 71007328 73571621 76241465 79857205 82661525 86380953 89767910 93522534
14308 93522534 97381944 101685717 106266615 111060756 116113764 121514899 126919819 133068444
14300 133068444 139634874 146275677 153385512 160976310 169033828 177866405 186665002 196011283
14292 196011283 205558719 216249125 227013860 238466606 250622993 263069315 276358174
14285 276358174 289780115 303912810 318029943 332348359 347179299 361557085 375857173
14278 375857173 389463008 402909185 415210393 426387874 436164889 443244373 446118822
14271 446118822 447708835 449800380 450070024 446804699 442763569 436823667 428791891 418454403
14263 418454403 406242746 392850998 378572922 363628282 348099052 332535002 317254615
$$ packed form
14316F8508534K498794K564293K669844L615740K804320L719428L386957L754624
14308I3522534L859410M303773M580898M794141N053008N401135N404920O148625
14300A33068444O566430O640803P109835P590798Q057518Q832577Q798597R346281
14292A96011283R547436J0690406J0764735J1452746J2156387J2446322J3288859
14285B76358174J3421941J4132695J4117133J4318416J4830940J4377786J4300088
14278C75857173J3605835J3446177J2301208J1177481R777015P079484K874449
14271D46118822J590013K091545K69644l265325m041130n939902q031776j0337488
14263D18454403j2211657j3391748j4278076j4944640j5529230j5564050j5280387
$$ plain form
14256 317254615 301719435 287084017 272541182 258913396 245874198 233091000 221067594
14249 221067594 209694823 201177907 190637043 181392770 171862741 164270825 156198593 148602887
14241 148602887 141395840 134991684 128567752 123357887 117774904 112504394 107572694 102753335
14233 102753335 98500876 94391594 90899940 87120545 83940990 80553878 77188726 74373286
14225 74373286 71738876 69002658 66747379 63936754 62054371 60015707 58178117 55893305
14217 55893305 53870878 51956012 50394893 48897426 47838095 46196981 44404380 42929441
14209 42929441 42073379 40657476 40171853 38825909 37555033 36263249 35479205 34404156
14201 34404156 33630828 33289691 31761975 31228403 30128861 29316943 28589292 28030784 27550888
$$ packed form
14256C17254615j5535180j4635418j4542835j3627786j3039198j2783198j2023406
14249B21067594j1372771q516916j0540864r244273r530029p591916q072232p595706
14241A48602887p207047o404156o423932n209865n582983n270510m931700m819359
14233A02753335m252459m109282l491654l779395l179555l387112l365152k815440
14225G4373286k634410k736218k255279k810625j882383k038664j837590k284812
14217E5893305k022427j914866j561119j497467j059331j641114j792601j474939
14209D2929441q56062j415903m85623j345944j270876j291784p84044j075049
14201C4404156p73328l41137j527716n33572j099542q11918p27651n58508m79896
$$ plain form
14192 27550888 26629694 25934893 25141258 24842833 23999279 23854524 23057146 22370522 22243877
14183 22243877 21516603 21031799 20882693 20375640 19998860 19141927 19179913 18467695 18038786
14174 18038786 17609683 17595425 16937147 17183437 16655026 16129430 15983382 15523697 15156415
14165 15156415 14874443 15051117 14706897 14003312 13980753 13700341 13500547 13519586 13011505 12786530
14155 12786530 12348514 12574712 12278823 11906255 11545407 11591981 11444542 11248338 10938157
14146 10938157 10988721 10471500 10527547 10628146 10382462 9942981 9924624 9482525 9340268 9622034
14136 9622034 9328084 9049630 9132996 8687259 8504168 8729363 8258812 8589218 8271009 8013783
14126 8013783 7834583 8104440 7810011 8022271 7658388 7355784 7203267 7433714 7031182
$$ packed form
14192B7550888r21194o94801p93635k98425q43554j44755p97378o86624j26645
14183B2243877p27274m84804j49106n07053l76780q56933L7986p12218m28909
14174A8038786m29103j4258o58278K46290n28411n25596j46048m59685l67282
14165A5156415k81972J76674l44220p03585k2559k80412j99794J9039n08081k24975
14155A2786530m38016K26198k95889l72568l60848M6574j47439j96204l10181
14146A0938157N0564n17221N6047J00599k45684m39481j8357m42099j42257K81766
14136I622034k93950k78454Q3366m45737j83091K25195m70551L30406l18209k57226
14126H013783j79200K69857k94429K12260l63883l02604j52517K30447m02532
$$ plain form
14117 7031182 7205599 7105034 6881434 6798962 6518381 6622364 6583797 6845419 6366732 6452853
14107 6452853 6279085 6450458 6104170 6114548 6002051 6077632 5591590 5903753 6010014 5847671
14097 5847671 5609630 6030999 5268490 5584835 5481044 5460742 5188978 5097650 5260904 5010082
14087 5010082 4972400 5101979 4998565 4795793 4905448 4872819 4640139 4759830 4452135 4466324
14077 4466324 4513374 4520793 4377706 4533886 4383353 4386789 4473170 4167416 4145917 4043881 3858633
14066 3858633 3770807 4068416 4277696 3579357 3948839 3866219 4067611 3977479 3809332 3788575
14056 3788575 3568849 3808078 3794886 3377134 3524670 3472474 3463202 3600930 3406740 3362759
14046 3362759 3112797 3231349 3290828 3213383 3273613 3298540 3440853 3094888 3401960 2823585
$$ packed form
14117G031182J74417j00565k23600q2472k80581J03983l8567K61622m78687Q6121
14107F452853j73768J71373l46288J0378j12497P5581m86042L12163J06261j62343
14097E847671k38041M21369p62509L16345j03791k0302k71764r1328J63254k50822
14087E010082l7682J29579j03414k02772J09655l2629k32680J19691l07695J4189
14077D466324M7050P419j43087J56180j50533L436Q6381l05754k1499j02036j85248
14066C858633q7826K97609K09280o98339L69482q2620K01392r0132j68147k0757
14056C788575k19726K39229j3192m17752J47536n2196r272J37728j94190m3981
14046C362759k49962J18552N9479p7445O0230K4927J42313l45965L07072n78375
$$ plain form
14036 2823585 2965493 3087987 2971927 3297802 3110388 2867942 3118026 2920532 2984783 2926833
14026 2926833 2894273 2900026 2593820 2670974 2222374 2781016 2810189 2452121 2607586 2521145
14016 2521145 2507194 2277810 2545277 2207693 2402176 2369185 2412154 2339656 2208108 2309735
14006 2309735 2385395 2231311 2284495 2106361 2046457 2207737 2053327 2182704 2200297 1966144
13996 1966144 2483458 2214007 1827869 2220938 2151516 2398262 2370979 3780815 5826662
13987 5826662 11437702 27420072 48344727 26417556 12914057 7916276 5784724 4542333
13979 4542333 4034560 3451643 3314415 2810359 2633974 2651401 2555811 2398506 2497045 2301858
13969 2301858 2553175 2211923 2274793 2367472 2180270 1925927 2064903 2173753 2137806 1817769
$$ packed form
14036B823585J41908J22494j16060L25875j87414k42446K50084j97494O4251n7950
14026B926833l2560N753l06206P7154m48600N58642K9173l58068J55465q6441
14016B521145j3951k29384K67467l37584J94483l2991M2969p2498j31548J01627
14006B309735P5660j54084N3184j78134n9904J61280j54410J29377J7593k34153
13996A966144N17314k69451l86138L93069o9422K46746k7283J409836K045847
13987E826662N611040J5982370K0924655k1927171A2914057m997781k131552j242391
13979D542333n07773n82917j37228n04056j76385J7427r5590j57305R8539j95187
13969B301858K51317l41252O2870R2679j87202k54343J38976J08850l5947l20037
$$ plain form
13959 1817769 2056247 1814500 2185230 1763175 1825771 1715722 2158066 1608054 1762362 2146236
13949 2146236 1660420 1693716 1545006 1858542 1494069 1695533 1964723 1762058 1727437 1836594
13939 1836594 1857906 1367321 1984971 1660505 1598813 1792266 1603705 1616835 1704306 1595537
13929 1595537 1193689 1815505 1470733 1484409 1933133 1901317 1694242 1473472 1661509 1713877
13919 1713877 1274324 1580285 1572723 1542630 1314343 1501633 1163471 1240505 1390851 1361935
13909 1361935 1611094 1189423 1427096 1373750 1222010 1329249 1153345 1492727 1424061 1172941
13899 1172941 1221780 1558045 1319018 1327463 1103881 1216378 1364440 1074494 1354649 1214879
13889 1214879 1283510 1482025 1158319 1184490 1029413 1134583 1234544 1206839 1129863 834172
$$ packed form
13959A817769K38478k41747L70730m22055O2596j10049M42344n50012J54308L83874
13949B146236m85816L3296j48710L13536l64473K01464K69190k02665l4621J09157
13939A836594K1312m90585O17650l24466o1692J93453j88561J3130Q7471j08769
13929A595537m01848O21816l44772J3676M48724l1816k07075k20770J88037N2368
13919A713877m39553L05961p562l0093k28287J87290l38162P7034J50346k8916
13909A361935K49159m21671K37673n3346j51740J07239j75904L39382o8666k51120
13899A172941M8839L36265k39027Q445k23582J12497J48062k89946K80155j39770
13889A214879O8631J98515l23706K6171j55077J05170R9961k7705p6976k95691
$$ plain form
13879 834172 1418320 897153 1164945 1178704 1289383 1390338 1131031 1154266 997980 1233812
13869 1233812 1377541 1205346 1085549 1057408 1259110 865623 1086084 1083735 889135 941932
13859 941932 1285941 1065280 968146 1053030 839101 1034550 1141079 806335 943809 704960
13849 704960 967775 610700 915809 1052373 970968 728668 947957 1121403 965341 900626
13839 900626 889290 848803 1085292 660466 830904 706993 1107150 940690 703143 979311
13829 979311 900356 1154345 938223 1027462 868692 1068151 1100387 720748 945002 782737
13819 782737 1073233 940140 650350 817138 922509 903070 950956 819504 693081 660590
13809 660590 547619 946589 647322 842965 1292078 872269 1092355 859284 472054 860915
$$ packed form
13879H34172N84148n21167K67792J3759J10679J00955k59307K3235j56286K35832
13869A233812J43729j72195j19797k8141K01702l93487K20461k349j94600N2797
13859I41932L44009k20661r7134Q4884k13929J95449J06529l34744J37474k38849
13849G04960K62815l57075L05109J36564q1405k42300K19289J73446j56062o4715
13839I00626j1336m0487K36489m24826J70438j23911M00157j66460k37547K76168
13829I79311p8955K53989k16122Q9239j58770J99459L2236l79639K24254j62265
13819G82737K90496j33093k89790J66788J05371j9439M7886j31452j26423l2491
13809F60590j12971L98970k99267J95643M49113m19809K20086k33071l87230L88861
$$ plain form
13799 860915 734064 909054 804797 627190 693753 542427 743633 801484 799166 764366
13789 764366 384284 758260 580359 958185 924510 631534 765139 859998 567957 910025
13779 910025 442134 454863 788897 683332 794702 490102 782053 698996 225558 522334
13769 522334 617411 884468 623571 810677 491022 839451 701163 562608 349481 540272
13759 540272 427401 810917 654830 539270 462273 480054 465667 507141 703879 421215
13749 421215 920302 888263 606264 622170 402895 388446 561169 814662 619916 676643
13739 676643 593718 596384 382827 747001 320749 769252 708746 464026 506760 602183 707095
13728 707095 435345 404438 792367 611727 425770 482583 348793 614200 597592 643336
$$ packed form
13799H60915j26851J74990j04257j77607O6563j51326K01206N7851k318l4800
13789G64366l80082L73976j77901L77826l3675k92976J33605R4859k92041L42068
13779I10025D42134J2729L34034j05565J11370l04600K91951q3057B25558K96776
13769E22334R5077K67057k60897J87106l19655L48429j38288j38555k13127J90791
13759E40272j12871L83516j56087j15560p6997J7781j4387M1474J96738k82664
13749D21215M99087l2039k81999J5906k19275j4449J72723K53493j94746N6727
13739F76643q2925K666k13557L64174C20749M48503o0506k44720M2734R5423J04912
13728G07095k71750l0907L87929j80640j85957N6813j33790K65407j6608M5744
$$ plain form
13718 643336 605260 729499 262723 269684 605312 -74766 519635 482671 466789 895422 528842
13707 528842 374137 410660 373164 585141 448884 620797 749935 507126 540249 515936
13697 515936 337419 523256 656673 327710 391215 602400 361115 442924 391435 385044
13687 385044 439382 439900 238912 595704 326043 445334 428718 491180 636671 347033 335182
13676 335182 294317 71664 588171 401779 492315 525423 471341 466478 339778 532542 706488
13665 706488 694233 834100 331206 547976 520864 109691 705199 660859 -1829 386646
13654 400662 366070 273631 453443 -10614 213602 425040 518275 525805 412843 444329 343604
13643 343604 471884 562160 633712 463128 319555 557339 513610 706937 195441 586472
$$ packed form
13718F43336l8076J24239B62723O961L35628g4766E19635l6964j5882M28633l66580
13707E28842j54705L6523l7496K11977j36257J71913J29138k42809L3123k4313
13697E15936j78517J85837J33417C27710O3505K11185k41285Q1809n1489o391
13687C85044N4338N18k00988L56792k69661J19291j6616O2462J45491k89638j1851
13676C35182m0865G1664N16507j86392R0536L3108n4082m863j26700J92764J73946
13665G06488j2255J39867C31206K16770k7112A09691N95508m4340a829C86646
13654D00662l4592r2439J79812a0614B13602K11438R3235P530j12962L1486j00725
13643C43604J28280R0276P1552j70584j43573K37784m3729J93327A95441L91031
$$ plain form
13633 586472 672499 662374 221713 471130 175526 463713 299439 -22995 406829 379728
13623 379728 369266 203147 426736 540114 262217 370681 820917 537599 635539 483718
13613 483718 678678 511842 98383 327541 30108 302864 194484 601001 516335 356358
13603 356358 406188 334504 307578 285169 469088 282080 269725 340300 184001 496405 337448
13592 337448 255095 341315 501971 194320 335826 312000 290331 573867 -28500 298391
13581 279246 265735 389742 431861 101717 262554 191998 333530 202435 167566 408413
13571 408413 205366 347921 357763 132554 441153 490700 303960 477750 203102 237707
13561 237707 279771 -80931 463142 299660 591699 195712 348104 340848 213129 384982
$$ packed form
13633E86472Q6027j0125B21713K49417A75526K88187j64274b2995D06829k7101
13623C79728j0462j66119K23589J13378B62217J08464M50236k83318R7940j51821
13613D83718J94960j66836I8383K29158C0108K72756j08380M06517q4666j59977
13603C56358M9830p1684k6926k2409J83919j87008j2355P0575j56299L12404j58957
13592C37448q2353Q6220J60656A94320J41506k3826k1669K83536b8500B98391
13581B79246j3511J24007M2119A01717J60837p0556J41532j31095l4869K40847
13571D08413k03047J42555R842A32554L08599M9547j86740J73790B03102L4605
13561B37707M2064h0931D63142j63482K92039A95712J52392p256j27719J71853
$$ plain form
13551 384982 189884 185145 351080 179553 482490 164776 288157 665375 261014 111180
13540 2314 128730 455801 188841 351662 438997 429966 614861 246475 273347 150756 222960
13529 222960 311247 127569 156659 448548 128177 318287 176004 154591 516325 581832
13519 581832 279051 -13316 252392 270258 202669 243582 156338 282534 105638 -43814 340901
13507 121110 42435 32989 309103 31523 171876 316944 240131 499280 270141 305268 183413
13496 183413 80673 248783 332825 349562 168639 330579 183313 166053 284454 382297
13486 382297 275339 366796 146804 456975 -39128 41678 210078 162083 -130516 435249
13475 -13979 330090 433650 196206 311194 -56638 126715 238747 183631 453819 401398
$$ packed form
13551C84982A89884m739J65935j71527L02937A64776J23381L77218B61014A11180
13540B314J26416L27071A88841J62821Q7335r031J84895B46475K6872j22591P2204
13529B22960Q8287A27569K9090K91889A28177J90110j42283k1413L61734O5507
13519E81832B79051a3316B52392J7866o7589M0913q7244J26196A05638d3814C40901
13507A21110D2435r446K76114C1523J40353J45068p6813K59149k29139L5127j21855
13496A83413H0673J68110Q4042J6737A68639J61940j47266j7260J18401R7843
13486C82297j06958R1457A46804L10171c9128D1678J68400m7995a30516D35249
13475a3979C30090J03560A96206J14988e6638A26715J12032n5116K70188n2421
$$ plain form
13465 401398 519110 404653 374933 217623 -135980 137999 265898 187145 289874 351770
13455 351770 210040 457304 205793 254490 197314 269583 471045 205827 75970 405533
13445 405533 195607 17587 141289 -19741 291631 250114 58347 3368 -33557 188179 28029
13433 -11836 164835 14382 140044 -257971 101492 20370 175019 -163251 38455 213875
13423 213875 259123 41321 21721 74384 -73948 243077 542854 206119 -67962 249559 19943
13411 3897 161868 283183 -103998 -134054 -4303 95964 187193 31708 227485 490208 359710
13400 359710 182502 320192 327238 -51027 272925 167775 249521 253627 -27973 150841 229017
13389 229017 129272 -234126 169286 117680 137323 384517 -288791 47936 53213 552456 -51778
$$ packed form
13465D01398J17712j14457k9720j57310a35980A37999J27899p8753J02729O1896
13455C51770j41730K47264B05793M8697n7176P2269K01462B05827G5970L29563
13445D05533A95607A7587J23702a9741B91631m1517E8347C368c3557A88179B8029
13433a1836A64835A4382J25662b57971A01492B0370J54649a63251C8455J75420
13423B13875M5248D1321j9600N2663g3948B43077K99777B06119f7962B49559A9943
13411C897J57971J21315a03998l0056d303I5964R1229C1708J95777K62723j30498
13400C59710j77208J37690P046e1027B72925j05150Q1746M106b7973A50841P8176
13389B29017r9745b34126A69286n1606J9643K47194b88791D7936N277M99243e1778
$$ plain form
13377 276579 222357 -99297 73624 269603 184055 -32242 210693 348699 329611 10516 438871
13366 438871 181910 248830 216062 210384 239574 391552 291120 186596 123741 5793 83468
13355 83468 293391 410829 -45686 336239 -136834 204460 179212 244811 307631 -52349 262664
13343 -63091 311269 191895 315256 306122 135348 552004 388130 328462 518322 523390 462731
13332 462731 312689 453475 304380 89758 359422 277196 235913 240868 158456 181937 130729
13321 130729 109792 44680 278490 335435 165652 261626 163588 8938 120978 112092 139606
13310 139606 62681 100234 52645 238138 264136 90046 285538 440527 504467 430853 176651
13298 170395 194702 100282 -228788 -16298 34881 -73100 87331 161535 -61814 240592 -78456
$$ packed form
13377B76579n4222i9297G3624J95979q5548c2242B10693J38006j9088A0516M28355
13366D38871A81910O6920l2768n678K9190J51978j00432j04524o2855E793P7675
13355H3468K09923J17438d5686C36239a36834B04460k5248O5599O2820e2349B62664
13343f3091C11269j19374J23361r134A35348M16656j63874n9668J89860N068o0659
13332D62731j50042J40786j49095H9758K69664q2226m1283M955q2412K3481n1208
13321A30729k0937D4680K33810N6945A65652R5974r8038H938J12040q886K7514
13310A39606F2681L7553m7589J85493K5998I0046J95492J54989O3940p3614A76651
13298A70395K4307r4420b28788a6298C4881g3100H7331P4204f1814B40592g8456
$$ plain form
13286 104722 5240 235761 -81676 254820 280183 36636 309568 458234 328236 676 -195063
13274 133638 175081 93420 -16275 45843 57865 516278 141517 72839 198501 381873 469388
13263 469388 136276 -10798 -128779 284050 -170312 17464 124785 12226 103271 -245407
13252 -41649 272846 -17734 24611 -70753 87968 178828 -83654 68357 19641 454087 96053
13240 236307 -84238 68604 3613 33926 14335 180526 -124544 240842 342562 107164 154760
13229 154760 177560 -74588 109635 195112 -31674 -154570 154866 293643 -138839 -252886
13219 -252886 149965 -148540 42342 -21787 132906 -8743 -20518 116255 -182441 223745
13208 267205 8051 165124 75970 131038 37198 -99668 60876 123527 306603 72315 128650
$$ packed form
13286A04722E240K30521h1676B54820K5363C6636K72932J48666j29998F76a95063
13274A33638M1443q1661a6275D5843J2022M58413A41517o8678J25662J83372Q7515
13263D69388A36276a0798j17981B84050a70312A7464J07321A2226R1045b45407
13252d1649B72846a7734B4611g0753H7968R0860h3654F8357A9641M34446I6053
13240B36307h4238F8604C613L0313A4335J66191a24544B40842J01720A07164M7596
13229A54760K2800g4588A09635Q5477c1674j22896A54866J38777a38839j14047
13219b52886A49965a48540D2342b1787A32906h743j1775A16255a82441B23745
13208B67205H051J57073G5970N5068C7198i9668F0876O2651J83076G2315N6335
$$ plain form
13197 128650 279400 15373 -141644 -82773 281642 12535 200857 179127 276199 261745 13607
13185 83966 158621 -45989 -176043 425123 -218888 -207830 -40702 68088 116150 14686 324052
13174 324052 38457 210617 -130538 39268 -26482 95493 -181474 5578 269901 249294 210641
13163 210641 70511 92472 100323 -14194 210499 -102671 184847 417 167753 90895 183046
13152 183046 401165 158100 4460 192880 243585 13693 152648 -256895 -15018 -114892 -186275
13141 -186275 -19680 111018 -2676 161125 85205 -35404 193233 138829 395705 -474980 -27887
13129 -159059 165524 190917 168348 24109 -61820 51677 23441 -164423 142614 -32078 199072
13117 109226 218442 124494 -248614 -4608 49956 203634 697 59029 -42123 -164133 131726
$$ packed form
13197A28650J50750A5373a41644N8871B81642A2535J88322k1730R7072j4454A3607
13185H3966P4655d5989j30054D25123b18888J1058d0702F8088M8062A4686L09366
13174C24052C8457J72160a30538C9268b6482I5493a81474E578K64323k0607l8653
13163B10641G0511K1961P851a4194B10499a02671A84847D17J67336p6858R2151
13152A83046K18119A58100D460J88420N0705A3693J38955b56895a5018r9874p1383
13141a86275a9680A11018b676A61125p5920c5404A93233n4404K56876d74980b7887
13129a59059A65524K5393k2569B4109f1820E1677B3441a64423A42614c2078A99072
13117A09226J09216r3948b48614d608D9956J53678F97N8332d2123j22010A31726
$$ plain form
13105 116141 128933 -218881 356333 50927 22854 93647 -196428 145535 146134 74044 171309
13094 171309 145159 57711 10331 -38778 -25272 -72289 -177587 23360 184872 59532 184938
13083 184938 -157026 -29153 202442 10104 -141977 -55159 -271072 -219017 65997 198630
13073 198630 18901 119397 86528 -29737 -67237 -22189 230892 135859 128962 151569 -87836
13061 149285 162223 78741 -50558 197825 260621 -154924 70668 30323 169960 255251 17950
13049 400762 99315 81564 -37532 22681 32919 364519 -65749 -147375 -4911 196744 167551
13038 167551 -241552 -139386 -347304 283165 342783 145178 71070 130384 266922 286312
13028 286312 86566 -184081 -96413 -317933 -148083 5460 -348939 133147 297742 44854
$$ packed form
13105A16141J2792b18881C56333E0927B2854P0793a96428A45535N99p2090R7265
13094A71309k6150E7711A0331c8778J3506m7017j05298B3360J61512E9532J25406
13083A84938a57026b9153B02442A0104a41977e5159k15913N2055F5997J32633
13073A98630A8901J00496l2869b9737l7500b2189B30892r5033o897K2607h7836
13061A49285J2938G8741e0558A97825O2796a54924G0668C0323J39637Q5291A7950
13049D00762I9315j7751c7532B2681J0238L31600f5749q1626d911A96744k9193
13038A67551b41552J02166k07918B83165N9618A45178G1070N9314J36538J9390
13028B86312H6566a84081Q7668k21520a48083E460c48939A33147J64595D4854
$$ plain form
13017 86611 234745 -132089 195396 194256 189458 347079 15341 50616 46360 -35960 51278
13005 173378 -47111 17715 -106733 422769 87924 243896 291499 150525 -16712 110360
12994 265841 100788 -144764 -214315 227394 225424 194725 63243 -7462 363137 -166560 -76433
12982 164332 -93287 -20598 -101911 206116 -210463 -131067 -271765 184329 -66711 53144 139984
12971 139984 -13924 -132430 242265 78192 40949 145518 -189405 51971 69559 -41543 -19023
12959 44054 -171316 -40647 -347797 -169581 45748 29890 263954 -40494 121062 287946
12949 287946 105117 -98378 84076 143461 -106832 110327 -19029 -90535 73684 159207 10334
12937 88043 -185770 -134331 37863 190721 210347 472059 135390 130418 226697 -54936 -93107
$$ packed form
13017H6611J48134a32089A95396j140m798J57621A5341L5275m256c5960E1278
13005A73378d7111A7715a06733D22769H7924J55972M7603j40974a6712A10360
12994B65841A00788a44764o9551B27394j970l0699F3243g462C63137a66560g6433
12982A64332i3287b0598q1313B06116b10463P9396j40698A84329f6711E3144Q6840
12971A39984a3924j18506B42265G8192l7243J04569a89405E1971J7588d1543a9023
12959D4054a71316d0647l07150a69581D5748j5858K34064d0494A21062J66884
12949B87946A05117i8378H4076N9385a06832A10327a9029p1506G3684Q5523A0334
12937H8043a85770N1439C7863J52858J9626K61712A35390m972R6279e4936l8171
$$ plain form
12926 -93107 222084 30958 -131121 -2526 99730 54788 -182970 -19566 -23591 122191 -107479
12914 125760 -248138 -379985 258913 -139915 -265783 5691 -137746 -80695 68191 261147
12904 261147 -66909 -60143 -219717 68735 -213856 86948 233309 17618 16060 76208 -9207
12892 -47727 -162003 -264897 -56822 289313 104314 168447 -41751 -136261 -21561 177525 328940
12881 328940 -82730 91659 12455 -121966 -23190 -157105 -91708 -27201 182446 123315 -9989
12869 236468 28610 -103130 -46346 98664 52439 -59802 334425 128589 -42912 -85692 92745
12857 216535 316527 220338 192686 11460 -142438 -141941 45698 155469 44794 -38229 -42833 -244174
12845 -244174 -45451 37181 -88863 -98111 -41647 -146046 -367839 30276 -59314 83465 -133816
$$ packed form
12926i3107B22084C0958a31121b526I9730m4942a82970a9566m025A22191a07479
12914A25760b48138j31847B58913a39915j25868E691a37746N7051F8191J92956
12904B61147f6909O766j59574F8735b13856H6948J46361A7618j558O0148i207
12892d7727j14276j02894e6822B89313A04314O4133d1751r4510b1561A77525J51415
12881C28940h2730I1659A2455a21966b3190j33915O5397b7201A82446n9131i989
12869B36468B8610a03130d6346I8664m6225e9802C34425A28589d2912m2780I2745
12857B16535R9992r6189k7652A1460a42438M97D5698J09771D4794c8229m604k01341
12845b44174d5451C7181h8863r248d1647j04399k21793C0276e9314H3465a33816
$$ plain form
12833 268217 77037 -219929 -276250 216190 -251268 -43238 212368 -116633 -82589 -180581
12823 -180581 22144 40074 -21539 146357 -62987 22710 74183 -284362 79937 -110008 -148806
12812 -148806 26271 -37835 127084 271592 67933 -6824 3917 -126789 246518 -186813 30632
12800 -108619 -144842 132780 256359 -281953 -30303 170150 34046 -180055 -90158 155670
12789 -211253 289122 -32262 67340 -452005 -127386 -161672 -69158 -76514 80958 -29389 -212816
12778 -212816 -150118 -40713 -154450 -43638 -114314 -34802 165374 250763 307284 87520 14339
12766 30093 -84215 -133017 67800 -172924 -168560 91415 2342 -433913 -1615 116763 64371 -302114
12753 -52837 -35889 -210258 -69135 126112 -108481 265312 269489 111976 -161419 128815
$$ packed form
12833B68217G7037b19929n6321B16190b51268d3238B12368a16633L4044r7992
12823a80581B2144J7930b1539A46357f2987B2710N1473b84362G9937a10008l8798
12812a48806B6271c7835A27084J44508F7933f824C917a26789B46518a86813C0632
12800a08619l6223A32780J23579b81953c0303A70150C4046a80055Q9897A55670
12789b11253B89122c2262F7340d52005a27386l4286f9158p356H0958b9389j83427
12778b12816O2698d0713j13737d3638p0676c4802A65374Q5389N6521H7520A4339
12766C0093h4215m8802F7800a72924M364I1415B342d33913a615A16763n2392c02114
12753e2837J6948j74369f9135A26112a08481B65312M177A11976a61419A28815
$$ plain form
12742 10201 15719 123143 -237672 310592 188983 -57176 98295 163206 -20238 -149861 -35830
12730 45347 77279 202065 -26170 -267792 4921 -15288 -46205 -63578 -130780 -36606 -24629
12719 -24629 -65071 328535 256650 -300677 -98600 181012 -263577 -53528 255068 -46938 150778
12707 373393 279956 -56302 -141868 86592 473019 88828 151676 -97986 176239 -120145 33681
12695 -169197 185069 226330 88109 -115962 -209164 128741 187073 -52393 -117913 -91653 -32521
12683 -246538 -91870 -287537 -108441 124307 -28631 105012 133614 -57359 -53317 -268328 -54332
12671 162690 9868 269010 -111370 -39894 29537 -48797 19257 79100 -143019 93582 -83023
12659 226709 164207 -105206 108336 45490 160914 -91955 127341 -31292 201410 -36532
$$ packed form
12742A0201N518J07424b37672C10592j21609e7176I8295O4911b0238j29623c5830
12730D5347L1932J24786b6170k41622D921a5288l0917j7373o7202c6606J1977
12719b4629m0442C28535p1885c00677i8600A81012b63577e3528B55068d6938A50778
12707C73393r3437e6302q5566H6592L86427H8828O2848i7986A76239a20145C3681
12695a69197A85069M1261H8109a15962r3202A28741N8332e2393o5520K6260c2521
12683b46538i1870j95667a08441A24307b8631A05012K8602e7359M042k15011e4332
12671A62690I868K59142a11370c9894B9537d8797A9257N9843a43019I3582h3023
12659B26709o2502a05206A08336D5490J15424i1955A27341c1292B01410c6532
$$ plain form
12648 -142367 108595 95527 -299997 -59223 56896 -129796 235595 139732 -7450 -191876 -212231
12637 -212231 -19871 84053 -85856 228490 -492031 -146158 84603 30898 206207 50457 190251
12626 190251 521534 29731 266604 -26968 -23800 37460 -112247 184649 219284 28951 174465
12615 174465 31083 -256878 -236222 84298 -130834 -152400 -2594 137001 306085 159335 196381
12604 196381 -29041 234910 -53428 154559 -13818 94470 382058 105145 294450 -154091
12593 -263457 -192752 132251 -138084 -105170 123410 -129715 309852 54082 -5134 -38507 -232461
12582 -232461 -280208 -238008 158560 -107839 126620 133536 128691 94799 122124 -246253 228454
12570 236099 205045 -33458 433692 17009 -140857 15418 -251112 228041 -56648 142961
$$ packed form
12648a42367A08595j3068b99997e9223E6896a29796B35595r5863g450j84426k0355
12637b12231a9871H4053h5856B28490d92031a46158H4603C0898J75309E0457J39794
12626A90251L31283B9731K36873b6968L168C7460a12247A84649L4635B8951J45514
12615A74465C1083b56878K0656H4298a30834k1566b594A37001J69084j46750L7046
12604A96381b9041B34910e3428A54559a3818I4470K87588A05145J89305a54091
12593b63457P0705A32251a38084L2914A23410a29715C09852E4082e134l3373j93954
12582b32461m7747M2200A58560a07839A26620O916m845l3892K7325b46253B28454
12570B36099l1054c3458D33692A7009a40857A5418b51112B28041e6648A42961
$$ plain form
12559 -62479 -236107 -108328 55198 143151 91684 -146909 343594 -269239 -7490 -58004 11508
12547 -336235 -44987 338401 -109175 225306 17541 95866 -252388 23436 148082 -166684
12536 -319714 194026 -117324 -126441 6833 291358 19134 -74774 -111650 77700 117656 173238
12525 173238 -11776 -98380 -277063 -80326 -31361 7077 96011 -856 4864 -165882 81839 63726
12513 63726 169183 -146996 7305 234255 144361 -128121 117626 274727 45179 -57663 -36872
12502 -36872 -352779 -265065 -65987 36794 124803 -188718 -63511 40369 141136 -4897 157768
12490 -104327 -351400 204603 -90361 -342640 -105999 367171 -13493 -78843 134713 -231681
12479 204565 256619 233140 177329 269205 22041 80479 -223783 50989 -47431 3202 193279
$$ packed form
12559f2479j73628a08328E5198Q7953n1467a46909C43594b69239g490n0514A1508
12547c36235d4987C38401a09175B25306A7541P8325b52388B3436J24646a66684
12536c19714A94026a17324r117F833K84525A9134g4774l6876G7700L9956N5582
12525A73238a1776q6604j78683h0326c1361G077Q8934h56D864a65882H1839j8113
12513F3726J05457a46996G305K26950q9894a28121A17626J57101D5179e7663K0791
12502c6872l15907Q7714f5987C6794Q8009a88718f3511D0369J00767d897A57768
12490a04327k47073B04603i0361k52279a05999C67171a3493o5350A34713b31681
12479B04565N2054k3479n5811R1876B2041N8438b23783E0989d7431C202J90077
$$ plain form
12468 193279 210202 216373 -277298 68595 77924 -149875 147207 -216030 59809 91683 -50334
12456 31422 -120887 -30605 36794 -15120 168528 207439 236736 117360 137544 -58656 -22899
12444 -132510 127755 24986 -123137 -38230 7543 -42004 -13474 42563 -48350 -82021 98285
12432 130601 250132 181241 121350 -72280 -161616 114286 121637 48532 115794 125943 -112101
12420 -218845 -286556 -112623 -92433 -171007 100482 -155546 -277084 -461831 -118628 -10793
12409 99087 -151591 -28563 -231721 -127045 163877 29105 168118 123418 -106026 -394310
12399 -394310 201281 -96394 -335223 44696 123406 -96742 192243 168793 -186047 43598 98488
12388 98488 -82495 206764 -69415 157628 -155428 -128062 -163870 121553 -244256 67376 179061
$$ packed form
12468A93279J6923O171b77298F8595R329a49875A47207b16030E9809L1874e0334
12456C1422a20887c0605C6794a5120A68528L8911K9297A17360K0184e8656b2899
12444a32510A27755B4986a23137c8230G543d2004a3474D2563d8350l3671I8285
12432A30601J19531o8891n9891g2280q9336A14286P351D8532O7262J0149a12101
12420b18845o7711a12623K0190p8574A00482a55546j21538j84747a18628a0793
12409I9087a51591b8563k03158J04676A63877B9105J39013m4700a06026k88284
12399c94310B01281i6394k38829D4696P8710i6742A92243k3450a86047D3598N4890
12388I8488h2495B06764f9415A57628a55428K7366l5808A21553b44256F7376J11685
$$ plain form
12377 179061 10872 -31184 84695 54984 12499 444145 152874 114556 -170147 -8625 -173901
12366 -173901 -2688 -121028 18767 -148274 -59911 -16031 -35144 -205974 -118424 -78142 -12193
12354 127188 115183 202532 77717 21167 -158432 283162 153719 152398 77427 268 139042
12343 139042 23606 14050 -111309 257734 173540 77394 -180237 200978 -107632 269579
12332 165227 107999 225388 -187514 -112667 65370 198016 152642 401055 243788 170501
12322 170501 306377 221713 348896 102318 -71373 89897 -74786 124772 43206 280890
12312 280890 218653 -19862 180109 -48885 -28440 -46914 -92130 -41615 -300796 171978 -231611
12300 113855 141613 114695 -112052 -33319 -338095 234862 144386 80149 -329738 -39675 -47108
$$ packed form
12377A79061A0872c1184H4695k9711A2499M31646A52874l8318a70147h625j65276
12366a73901b688j18340A8767a48274e9911a6031j9113j70830Q7550M0282a2193
12354A27188j2005Q7349G7717B1167a58432B83162j29443j321p4971B68J38774
12343A39042B3606r556a11309B57734q4194G7394a80237B00978a07632B69579
12332A65227n7228J17389a87514P4847F5370J32646m5374K48413j57267p3287
12322A70501J35876q4664J27183A02318g1373H9897g4786A24772D3206K37684
12312B80890o2237a9862A80109d8885K0445j8474m5216d1615k59181A71978b31611
12300A13855K7758k6918a12052c3319l04776B34862r0476o4237c29738c9675p433
$$ plain form
12289 -47108 -59775 238645 61141 486880 188082 375273 141587 -122423 22670 -175877
12278 -191243 -103163 192277 -55969 -12779 130778 -89922 -69708 163989 -167105 224349
12267 83120 171672 -101050 67483 416810 -37171 224160 186456 -44773 -159317 168294 89890
12256 89890 -128707 -98065 119796 57791 67585 488036 436184 7144 256571 65210 80864
12245 80864 36897 273148 76544 -1281 55756 -66981 -15348 342720 393159 83327 -52315
12233 -60760 397016 254083 146114 398535 290951 58422 -101217 332366 220888 148593
12223 148593 -115715 66909 45659 67530 434446 123599 -76510 611240 489892 -130043
12212 -159565 130993 92903 -136069 148287 53461 66330 -147009 470745 317692 73688
$$ packed form
12289d7108j2667B38645F1141M25739A88082J87191A41587a22423B2670a75877
12278a91243Q8080A92277e5969a2779A30778h9922K0214A63989a67105B24349
12267H3120Q8552a01050F7483L49327c7171B24160l7704d4773j14544A68294p8404
12256H9890a28707L0642A19796E7791R794M20451n1852G144K49427F5210J5654
12245H0864C6897K36251G6544a281E5756f6981a5348C42720N0439H3327e2315
12233f0760C97016j42933j07969K52421j07584E8422a01217C32366j11478p2295
12223A48593a15715F6909k1250K1871L66916A23599g6510F11240j21348a30043
12212a59565A30993l8090a36069A48287E3461J2869a47009D70745j53053G3688
$$ plain form
12201 -186342 -36689 159667 55976 88803 287125 311760 126141 159691 451045 534425 334598
12190 334598 484243 201783 56556 214050 112357 235846 81067 171397 -41363 134631
12179 25626 445109 -64444 616805 -35844 383687 38746 370457 346814 290628 120238 241589
12168 241589 284071 225230 201812 -57913 122588 410901 266881 536646 253749 177735
12158 177735 166632 147337 103255 153629 490286 -146540 61073 -29307 184977 -14071 -135640
12147 -135640 384365 -209399 -30397 184937 307265 -75773 125997 198555 34278 127153
12137 127153 243939 18471 38458 249858 -41613 -14677 137448 177229 200063 13251 239904
12126 239904 26727 -3919 -51105 105442 390936 195832 413834 92480 85920 -27249 208273
$$ packed form
12201a86342c6689A59667E5976L2827J98322K4635A26141L3550K91354Q3380j99827
12190C34598J49645B01783E6556J57494j01693J23489H1067R0330d1363A34631
12179B5626M19483f4444F16805c5844C83687C8746L31711k3643n6186A20238J21351
12168B41589M2482n8841k3418e7913A22588K88313j44020K69765B53749p6014
12158A77735j1103j9295m4082N0374L36657a46540F1073b9307A84977a4071j21569
12147a35640C84365b09399c0397A84937J22328g5773A25997P2558C4278R2875
12137A27153J16786A8471J9987K11400d1613a4677A37448L9781K2834A3251K26653
12126B39904B6727c919m7186A05442K85494j95104K18002I2480o560b7249B08273
$$ plain form
12114 -70037 -217011 81048 140406 195517 294556 -82534 -1188 349733 351422 212768 -85643
12102 85869 193564 42675 -109089 114825 -31646 -9270 157436 631534 422900 156767
12091 54285 18698 -55308 -20538 255243 -105544 -48045 -208022 55776 173071 180132 124745
12080 124745 187504 99114 182243 -22153 96521 189369 -182596 18720 -86374 174225 223185
12069 223185 61210 -39799 321350 314549 207370 75900 -230761 41505 -156933 31913 28328
12058 28328 165725 44236 296961 -234883 63787 -375346 -84362 232623 275279 -93322 -55392
12047 -55392 -68487 -29858 6515 29877 135820 171273 92362 200767 -270568 -9056 132639
12035 -128647 188372 -109449 453905 99991 71981 -234251 -176845 304448 116973 -117251
$$ packed form
12114g0037j46974H1048N9358N5111R9039h2534a188C49733J689j38654h5643
12102H5869J07695D2675a09089A14825c1646i270A57436M74098k08634A56767
12091E4285A8698e5308b0538B55243a05544d8045j59977E5776J17295P061n5387
12080A24745O2759q8390Q3129b2153I6521R2848a82596A8720h6374A74225M8960
12069B23185F1210c9799C21350o801j07179G5900b30761D1505a56933C1913l585
12058B8328J37397D4236K52725b34883F3787c75346h4362B32623M2656i3322L7930
12047e5392j3095b9858F515K3362J05943L5453p8911J08405b70568i056A32639
12035a28647A88372a09449D53905I9991k8010b34251N7406C04448A16973a17251
$$ plain form
12024 269168 60692 -185971 -116325 -49019 147690 254844 7056 81954 80068 303235 -80002
12012 -91316 234191 -8843 -81209 251548 144850 185876 120951 -70317 71677 103940 24115
12000 27564 15530 86826 48722 -474898 87970 -61881 131431 160449 -31113 -56627 -191203
11989 -191203 -183126 -77511 -142090 -54983 77161 -213950 110826 -391123 -247652 87710 132949
11978 132949 347503 -76618 -92172 -89615 181946 -158614 108006 -105737 -126506 145588
11967 -106412 -86582 120862 -65084 7137 -168324 -205718 -114119 -46968 -10080 249297 -154786
11955 325136 245529 -126799 -80128 70500 -15285 954 73780 -47785 -69296 23280 67997 -95001
11942 151875 -99916 -4451 -374610 -382903 65558 -176760 -6764 14262 -229773 -140180 -329850
$$ packed form
12024B69168F0692a85971O9646d9019A47690J07154G056P4898j886K23167h0002
12012i1316B34191h843p2366B51548j06698M1026o4925g0317G1677L2263B4115
12000B7564j2034P1296l8104d74898H7970f1881A31431K9018c1113k5514j34576
11989a91203Q077g7511o4579e4983G7161b13950A10826c91123J43471H7710M5239
11978A32949K14554g6618j5554K557A81946a58614A08006a05737k0769A45588
11967a06412J9830A20862f5084G137a68324l7394R1599d6968a0080B49297a54786
11955C25136p9607a26799M6671G0500a5285I54P2826d7785k1511B3280M4717i5001
11942A51875i9916d451l70159q293F5558a76760f764A4262b29773Q9593j89670
$$ plain form
11931 -329850 -282391 10946 -3272 -73453 -38829 16787 -236373 503 -365623 -100619 308487
11919 -63855 269002 300992 -7267 -345786 129194 -141729 -68555 12707 92847 148493 -182599
11907 -140786 19733 236238 53074 -14833 -202732 -311626 -23249 -244224 -186880 -19560 -24398
11896 -24398 34703 -215756 57969 -304494 -177616 -93571 -373505 254516 104820 -162953
11885 -418990 186882 -317313 204449 -332132 -115609 -283439 101337 -34945 -320303 455588
11874 252688 -296851 -200205 23653 -25306 -18603 451627 -74261 51673 -272843 41511 81923
11863 81923 49275 -73692 84742 -225735 -80939 45588 -427798 -86295 -409090 -111332 -105006
11852 -105006 204385 204335 -80464 58444 -476553 -216535 -90064 -209705 84645 49558 18063
$$ packed form
11931c29850M7459A0946c272p0181L4624A6787b36373E03c65623a00619C08487
11919f3855B69002L1990g267l38519A29194a41729f8555A2707Q0140N5646a82599
11907a40786A9733K16505E3074a4833j87899j08894b3249k20975N7344a9560m838
11896b4398C4703b15756E7969c04494J26878Q4045k79934B54516A04820a62953
11885d18990A86882c17313B04449c32132a15609j67830A01337c4945k85358D55588
11874B52688b96851R6646B3653b5306O703D51627g4261E1673b72843D1511M0412
11863H1923l2648g3692H4742b25735h0939D5588d27798h6295l22795a11332O326
11852a05006B04385n0h0464E8444d76553b16535i0064j19641H4645l5087A8063
$$ plain form
11840 -105024 -171833 -164065 -242810 -32147 -122473 8526 -129721 233500 -3384 -89303 -340700
11829 -340700 -206105 -228687 -346479 -72564 -80735 -270895 128085 21017 229340 8171 -121489
11817 34139 -370451 -138441 -174416 -107322 -64098 -119281 -129550 89699 -109570 93114 -208018
11805 -173277 -60996 -4079 -109952 -16030 -175814 235222 -264181 84281 90646 -837 -185866
11794 -185866 66712 111642 -79553 6068 110539 -75941 126943 176307 35674 100224 -284123
11782 108216 280526 -246068 23414 364855 72231 103748 -38733 79080 69345 -47937 89904
11770 -221648 -97089 59903 49890 8383 91501 -121222 40458 -143845 -32908 271656 -55739
11758 -225512 204575 354534 -31735 168743 135549 -50435 214070 33939 -184275 -140248
$$ packed form
11840a05024o6809P768p8745c2147r0326H526a29721B33500c384q5919k51397
11829c40700J34595k2582j17792g2564q171j90160A28085B1017K08323H171a21489
11817C4139c70451a38441l5975O7094M3224n5183j0269H9699a09570I3114b08018
11805a73277f0996d079j05873a6030j59784B35222b64181H4281O365h37j85029
11794a85866F6712M4930g9553F068J04471g5941A26943M9364C5674O4550b84123
11782A08216J72310b46068B3414L41441G2231L1517c8733G9080r735d7937H9904
11770b21648i7089E9903j0013H383Q3118a21222D0458a43845c2908B71656e5739
11758b25512B04575J49959c1735A68743l3194e0435B14070C3939a84275M4027
$$ plain form
11748 -140248 -56051 332013 40657 -224995 16178 -203862 -265416 -461862 113599 4195 87416
11737 87416 45160 -221406 256479 407738 -102667 228157 -353651 -358957 -304458 230754
11726 37348 323055 50157 42854 -14214 6355 -5974 -129370 32844 194081 162746 -433737
11714 76390 105297 42785 45241 12936 -14387 394977 -29391 -56251 65583 -114017 -159899
11703 -159899 -18745 382011 -170601 29917 -22006 -283605 160458 -132574 151881 -209942
11692 -179866 21624 -103038 158368 -46643 -91196 167483 330237 -29324 70806 21644 -29105
11680 85407 21187 -3685 184763 154848 -89744 114703 177644 91328 23649 178062 160718
11669 160718 76261 87741 -181955 -97935 191569 58612 -91952 53601 218949 111538 134547
$$ packed form
11748a40248e6051C32013D0657b24995A6178b03862o1554j96446A13599D195Q3221
11737H7416m2256b21406B56479J51259a02667B28157c53651n306N4499B30754
11726C7348K85707E0157p303a4214F355e974j23396C2844J61237l1335d33737
11714G6390K8907D2785K456A2936a4387C94977b9391k6860F5583a14017m5882
11703a59899a8745C82011a70601B9917b2006k61599A60458a32574A51881b09942
11692a79866B1624a03038A58368d6643m4553A67483J62754b9324G0806B1644b9105
11680H5407B1187c685A84763k9915h9744A14703O2941q6316B3649J54413j7344
11669A60718G6261J1480a81955Q4020A91569E8612i1952E3601J65348j07411K3009
$$ plain form
11658 134547 117688 -240007 -25845 298023 -180762 -179094 -134726 68496 68092 257365 116801
11646 118720 197840 74613 362417 226725 220785 -23062 -189384 51198 -262808 51400 -153612
11634 -10513 -337729 126759 -17382 148786 -97005 60135 264764 -289561 -78477 249370
11623 175546 99688 -69424 24629 -341152 -24453 172444 73583 159637 4891 -11021 -279280
11612 -279280 134646 59958 -99406 6826 -14624 309851 -316674 -165379 -54968 -424532 310263
11600 -146684 -79126 -381132 -121028 81983 -44219 -3077 127295 90051 -24797 164557 -12121
11588 173203 158578 213051 -247603 171555 181538 68726 248376 24794 310783 -69033 153510
11576 176501 -94429 -71810 -130103 -257858 14923 -99989 168176 284134 204922 113394 -113371
$$ packed form
11658A34547j6859b40007b5845B98023a80762J668M4368F8496m04J89273A16801
11646A18720P9120G4613K87804j35692n940b3062j66322E1198b62808E1400a53612
11634a0513l27216A26759a7382A48786i7005F0135K04629b89561g8477B49370
11623A75546p5858f9424B4629c41152b4453A72444G3583Q6054D891a1021k68259
11612b79280A34646E9958i9406F826a4624C09851c16674J51295e4968l69564C10263
11600a46684O7558l02006a21028H1983d4219c077A27295l7244b4797A64557a2121
11588A73203j4625N4473b47603A71555R983F8726J79650B4794K85989f9033A53510
11576A76501i4429K2619n8293j27755A4923i9989A68176J15958p9212r1528a13371
$$ plain form
11564 498849 156595 -229643 218634 61768 -29839 -342448 -23441 190610 362405 191867
11554 191867 -53935 114194 -114867 -398302 -29699 94989 -39956 -38264 198476 231882 239582
11543 239582 -1821 -19871 19446 -67798 1602 -274992 -25623 10609 89845 275184 -97899
11531 480984 -34787 128495 -509092 107277 234850 -30388 411514 178039 -76553 64249
11520 -90165 109163 -123675 -40729 326546 -284796 59357 -357014 71132 290558 125082
11509 -26633 -60520 51216 177597 269653 252768 359223 106840 210776 -30706 -192253 365523
11497 118 -50158 541624 207481 195482 -275073 84630 163569 306027 37520 128006 161648
11486 161648 365404 -61670 -8124 258708 -137655 280941 84826 427579 374062 95216 223120
$$ packed form
11564D98849A56595b29643B18634F1768b9839l12609b3441A90610J71795j70538
11554A91867e3935A14194a14867k83435b9699I4989c9956J692A98476L3406P700
11543B39582a821j8050A9446f7798A602b74992b5623A0609P9236J85339i7899
11531D80984c4787A28495e09092A07277J27573c0388D11514A78039g6553F4249
11520i0165A09163a23675d0729C26546b84796E9357c57014G1132K19426A25082
11509b6633l3887E1216J26381R2056j6885J06455A06840J03936c0706j61547C65523
11497A18e0158E41624B07481j1999b75073H4630P8939J42458C7520R0486L3642
11486A61648K03756f1670h124B58708a37655B80941H4826L42753n3517I5216J27904
$$ plain form
11475 223120 394103 21970 156675 -139821 70639 49039 97025 98940 176589 136717 507551
11464 507551 77508 312553 111139 213919 197446 221680 378490 194963 72101 148344
11454 148344 -98743 179822 -63544 190460 70400 -130957 208983 -156276 33256 -120816
11443 -156428 112815 28529 438946 211908 95117 191820 -288453 267656 198376 256502
11433 256502 -120381 376518 247640 126699 -172397 5089 112574 258058 79530 46794
11423 46794 219191 89867 230395 -74456 -6368 80224 44720 -165881 -106575 -239129 -19987
11411 -346300 -210450 -144066 -7258 93289 -208351 8009 -43810 281457 -358428 -95842 217951
11399 173797 195324 216539 94462 -97583 191923 167029 -33408 -51192 173828 6669 -270420
$$ packed form
11475B23120J70983B1970J34705a39821G0639k1600M7986J915P7649l9872L70834
11464E07551G7508K35045A11139J02780j6473K4234J56810j83527G2101P6243
11454A48344i8743A79822f3544A90460G0400a30957B08983a56276C3256a20816
11443a56428A12815B8529M10417B11908I5117R6703b88453B67656o9280N8126
11433B56502a20381C76518j28878j20941a72397E089J07485J45484G9530l2736
11423D6794J72397H9867J40528g4456f368H0224l5504a65881N9306j32554a9987
11411c46300J35850O6384g258I3289b08351H009d3810B81457c58428i5842B17951
11399A73797K1527K1215I4462i7583A91923k4894c3408j7784A73828F669b70420
$$ plain form
11387 -242587 33779 -196204 139302 -272015 74660 -14140 -232280 9731 44472 -34167 -84917
11376 -84917 158336 -43823 -318918 -300245 76210 -136955 223732 34213 -110072 121537
11365 161270 -211360 -27988 -200221 -440238 -197201 202517 112441 -202217 76462 -166190
11354 198356 176089 -130385 -487130 -155787 128810 -104090 184001 181509 -24451 -134897
11344 -134897 -67371 -91381 -173274 -2706 451720 -142207 -291044 -337869 146235 78398 -66247
11332 38819 -133457 114444 112545 -101427 -53985 -223861 -236962 -88459 -182387 105314 -172774
11320 399970 -201965 79016 352758 6803 38867 -71891 38501 -156409 180837 200450 -285613
11308 -20747 -149416 -7151 -37335 191092 -154100 -114437 130929 149744 150383 -273375 -108181
$$ packed form
11387b42587C3779a96204A39302b72015G4660a4140k18140I731L4741c4167n0750
11376h4917A58336d3823k75095J8673G6210a36955B23732C4213a10072A21537
11365A61270b11360b7988j72233k40017a97201B02517r0076b02217G6462a66190
11354A98356k2267a30385l56745a55787A28810a04090A84001k492b4451j10446
11344a34897f7371k4010q1893b706D51720a42207j48837m6825A46235o7837f6247
11332C8819a33457A14444j899a01427M7442j69876j3101h8459r3928A05314a72774
11320C99970b01965G9016K73742F803L2064g1891C8501a56409A80837J9613b85613
11308b0747j28669g151l0184A91092a54100L9663A30929J8815O39b73375a08181
$$ plain form
11296 -74306 -107003 82414 -221442 24842 -78392 269148 63203 -161955 -60056 -309116 385778
11284 -186197 278048 -244693 -148451 -192709 -387831 278224 179224 48385 125596 -142693
11273 -225317 302710 -233200 -283496 116387 -124169 -243925 432054 191054 198295 -165665
11262 -193604 61671 -45963 -134436 -107682 -38172 124521 164168 -95750 -68780 -3770 142831
11250 -146708 -318564 -108295 -4111 -24721 -11943 182552 -167246 -184841 -140746 201508 79706
11238 -79624 -113938 -380233 -59127 28081 -6578 185579 245490 -92092 105752 -149463 11666
11226 -29116 27831 33258 159205 -175439 89836 -89884 74106 -68114 -62279 262070 -18765
11214 -178229 -96886 -111846 -113492 102099 -128713 39756 -13039 -423934 -244268 135032 -10501
$$ packed form
11296g4306l2697H2414b21442B4842g8392B69148F3203a61955f0056k49060C85778
11284a86197B78048b44693R6242m4258j95122B78224r9000D8385P7211a42693
11273b25317C02710b33200n0296A16387a24169j19756D32054A91054P241a65665
11262a93604F1671d5963q8473K6754c8172A24521L9647i5750K6970c770A42831
11250a46708j71856a08295d111k0610a1943A82552a67246j7595M4095B01508G9706
11238g9624l4314k66295e9127B8081f578A85579N9911i2092A05752a49463A1666
11226b9116B7831N427J25947a75439H9836h9884G4106f8114N835B62070a8765
11214a78229Q1343j4960j646A02099a28713C9756a3039m10895J79666A35032a0501
$$ plain form
11202 16053 -58807 -248506 -279029 -47329 56334 -268727 132315 -1885 -19398 -302825 -100295
11190 -127662 162655 -61220 -57820 -122871 -260854 -183303 -111944 -47962 -196200 -13707 -119319
11179 -119319 -40052 -68588 -58987 -220442 265842 -72096 -74436 -168201 223597 87103 129551
11168 129551 -165971 -40770 100016 32221 10928 -89026 -125664 -164576 153240 -360549 -148746
11156 194577 -39717 37251 102674 -23567 61326 -248295 200086 128588 52926 -120208 53654
11144 91275 -170033 27258 -279723 -236977 -68128 -248813 -81144 176116 -205834 -199355 -74963
11132 -304397 258482 20577 73550 -18092 191725 104024 334159 424991 14293 35453 218149
11121 218149 138688 -286397 -103836 -181132 43726 -68582 329578 169845 -6085 220930 3678
$$ packed form
11202A6053e8807j89699l0523d7329E6334b68727A32315a885j7513k83427a00295
11190a27662A62655f1220L400o5051j37983P7551P1359d7962j48238a3707j05612
11179a19319d0052k8536R601j61455B65842g2096k340r3765B23597H7103M2448
11168A29551a65971d0770A00016C2221A0928h9026l6638l8912A53240c60549a48746
11156A94577c9717C7251O5423b3567F1326b48295B00086p1498E2926a20208E3654
11144I1275a70033B7258b79723M2746f8128j80685h1144A76116b05834O479g4963
11132c04397B58482B0577N2973a8092A91725q7701K30135R0832A4293K1160J82696
11121B18149p9461b86397a03836p7296D3726f8582C29578j59733f085B20930C678
$$ plain form
11109 53196 -30987 -13303 95751 -111888 -225383 160616 204853 -44757 186425 20590 94882
11098 94882 223691 168643 -34335 201967 317550 93091 99224 -96375 -180371 -29076 101968
11086 183674 220917 196144 44487 -107036 116409 273370 278806 177869 79089 662961 231476
11074 378417 43399 265559 259626 203102 168011 495414 337980 205856 267251 327876 450175
11063 450175 631957 305992 339727 515119 412374 381757 616766 413265 448340 407395
11053 407395 588605 109332 612866 525125 364438 561363 507213 606450 798059 938008
11043 938008 911325 915450 618178 971309 1193813 846226 683588 984023 695046 1059030
11033 1059030 1004482 723994 674313 1104689 486895 856949 754041 775119 731316 785005
$$ packed form
11109E3196c0987a3303I5751a11888j13495A60616M4237d4757A86425B0590P4292
11098I4882J28809n5048c4335B01967J15583I3091O133i6375q3996b9076A01968
11086A83674L7243k4773D4487a07036A16409J56961N436j00937G9089N83872B31476
11074C78417D3399K22160n933n6524l5091L27403j57434j32124O1395O0625J22299
11063D50175J81782C05992L3735J75392j02745l0617K35009k03501L5075m0945
11053D07395J81210A09332N03534q7741j60687J96925n4150R9237J91609J39949
11043I38008k6683M125k97272L53131K22504l47587j62638L00435k88977L63984
11033A059030n4548k80488m9681M30376D86895L70054j02908K1078m3803N3689
$$ plain form
11023 785005 699316 742423 521879 599744 797978 347179 918987 912157 590221 756502
11013 756502 752159 877991 720899 521451 815801 646847 702584 717384 650505 723148 855441
11002 855441 569271 953148 582484 708030 626599 705878 677552 676619 606122 660157 710538
10991 710538 702318 311848 431567 954238 882739 530279 1126321 846252 608964 831495
10981 831495 1035895 957187 939132 802570 940667 1244665 1301553 1565257 1567588 1969824
10971 1969824 2015974 2119926 2684364 2355017 2705737 2954501 2696248 3142071 2979216 3046494
10961 3046494 2484000 2303050 1980958 1942158 1759631 1862660 1806157 1507316 1757869 1856843
10951 1856843 1565836 1494572 1178333 1252754 1094427 896561 861189 969447 642304 560298
$$ packed form
11023G85005q5689M3107k20544P7865J98234C47179N71808o830l21936J66281
11013G56502m343J25832j57092j99448K94350j68954N5737J4800o6879P2643J32293
11002H55441k86170L83877l70664J25546q1431P9279k8326r33p0497N4035N0381
10991G10538q220C11848J19719N22671p1499l52460N96042k80069k37288K22531
10981H31495K04400p8708j8055j36562J38097L03998N6888K63704K331M02236
10971A969824M6150J03952N64438l29347L50720K48764k58253M45823j62855O7278
10961C046494n62494j80950l22092l8800j82527J03029n6503k98841K50553R8974
10951A856843k91007p1264l16239P4421j58327j97866l5372J08258l27143q2006
$$ plain form
10941 560298 -21808 260436 569220 58905 216983 152788 208895 251106 -91185 104259 -13763
10929 176143 25377 47399 98073 328403 216709 220208 14366 202192 29197 36678 5616
10917 -419403 59663 -165111 -150606 100025 104143 -301141 195558 95950 -439168 13111 53102
10906 53102 112354 87268 -13323 233345 -127797 50504 -100745 39564 -137866 -13547 108473
10894 -74414 73232 154668 141138 17455 -246158 129657 15132 -4087 131697 -162081 -470554
10883 -470554 -278799 -211108 52873 -159256 165937 72034 95654 -329282 57122 -153663
10872 -217087 -297879 -196833 -71128 -279142 -40089 -58394 121220 -147437 -162104 -200979 118426
10860 -91273 53571 -176496 -324813 -193182 348591 -275331 33763 -122105 136895 -115622
$$ packed form
10941E60298b1808B60436L08784E8905J58078o4195N6107M2211i1185A04259a3763
10929A76143B5377K2022N0674K30330j11694L499A4366J87826B9197P481E616
10917d19403E9663a65111J4505A00025M118c01141A95558I5950d39168A3111L9991
10906E3102N9252k5086a3323B33345a27797E0504a00745C9564a37866a3547A08473
10894g4414G3232Q1436j3530A7455b46158A29657A5132d087A31697a62081l08473
10883d70554J91755O7691E2873a59256A65937G2034K3620c29282E7122a53663
10872b17087q0792J01046g1128k08014d0089j8305A21220a47437j4667l8875A18426
10860i1273E3571a76496j48317J31631C48591b75331C3763a22105A36895a15622
$$ plain form
10849 -186966 225070 173814 -29719 429322 -13797 90384 177321 208057 112261 88305 51606
10838 51606 236183 -167610 -284720 -204707 131243 -74629 39376 269897 -35571 -269431
10828 -269431 157265 145650 77797 88235 -91608 43216 -159048 -114820 -152162 -143970 -45114
10816 34338 55322 -444868 137966 -215151 234100 -103987 267061 305612 26422 -157494
10805 195597 100296 -17724 108138 -5179 -156807 -72092 -250518 -61325 -252324 199763 92942
10793 -85694 349115 -10818 -245917 237193 -168163 -44430 -129816 55362 -293442 -3317 -112413
10782 -112413 -36202 -384106 -479582 7900 -21455 -380626 -71342 162502 -35723 109727 -47498
10770 -56005 -170032 146725 -19419 31140 -44893 -175635 -212998 -47756 -14441 373396 35152
$$ packed form
10849a86966B25070n1256b9719D29322a3797I0384Q6937L0736r5796k3956l6699
10838E1606J84577a67610j17110Q0013A31243g4629C9376K30521c5571k33860
10828b69431A57265j1615o7853J0438i1608D3216a59048M4228l7342Q192d5114
10816C4338K0984d44868A37966b15151B34100a03987B67061L8551B6422a57494
10805A95597r5301a7724A08138e179j51628g2092j78426f1325j90999A99763I2942
10793h5694C49115a0818k35099B37193a68163d4430q5386E5362b93442c317j09096
10782a12413c6202l47904r5476G900b1455l59171g1342A62502c5723A09727d7498
10770e6005j14027A46725a9419C1140d4893j30742l7363d7756a4441C73396C5152
$$ plain form
10758 -112163 -314392 -461255 -252572 -177616 -92485 -87096 -37754 26244 94600 -71172 116333
10746 -279934 -5472 -26612 -146677 -362681 122260 -53805 -114495 -100547 -34422 -334234 150993
10734 -291805 -257025 -122255 -129870 -190905 -180977 31476 -24819 -54771 116832 -214399 -194079
10723 -194079 -262295 -67815 101588 -37607 116447 34753 -109849 -70904 -19103 -200451 11059
10711 -81062 -20320 22562 69534 -109234 -36463 59884 -81192 -321380 39051 -56851 177544
10699 -291395 -95868 169844 -146039 -134225 -86867 -145267 111907 -78732 -108247 234355 -135358
10687 -232242 193847 -264491 77150 48969 44397 -181933 119515 -95772 -21716 -58265 -118040
10676 -118040 179031 122595 146642 5029 -173894 -39069 91208 -214268 210779 -166280 -431637
$$ packed form
10758a12163k02229j46863K08683P4956Q5131N389c7754B6244O8356g1172A16333
10746b79934e472k1140j20065k16004A22260e3805o0690J3948c4422k99812A50993
10734b91805L4780a22255p615o1035R928C1476b4819k9952A16832b14399K0320
10723a94079o8216f7815A01588c7607A16447C4753a09849L8945a9103j81348A1059
10711h1062b0320B2562M6972a09234c6463E9884h1192k40188C9051e6851A77544
10699b91395i5868A69844a46039J1814M7358n8400A11907g8732k9515B34355a35358
10687b32242A93847b64491G7150k8181m572a81933A19515i5772b1716l6549n9775
10676a18040A79031n6436K4047E029a73894c9069I1208b14268B10779a66280k65357
$$ plain form
10665 -431637 -116841 -249806 216617 -43730 -128022 116141 263053 -256783 225109 -117476
10654 160634 185831 -54748 -42008 -69880 240680 98029 -159805 -398267 -68891 -52503 -362096
10643 -362096 -87861 -169333 -192005 -229821 -19838 229702 -26434 -222051 130357 -246222 -221839
10632 -221839 -15886 -241734 330905 160795 -74925 245218 -119182 -174411 -233279 -106560
10621 52623 -251935 -103261 12144 -298348 -6328 184322 -349040 -440165 302325 -281665
10610 190378 249054 -200027 -232897 -193629 69439 114195 185825 66201 -92656 190882 -258124
10598 -28580 -56872 -82246 68796 -52348 -72067 6305 37520 -2282 90953 91605 -100246 72033
10585 3727 -42147 -70854 -13210 -255413 -340654 -3278 28045 -79356 107727 -243649 -296293
$$ packed form
10665d31637a16841j32965B16617d3730q4292A16141J46912b56783B25109a17476
10654A60634K5197e4748J2740k7872B40680I8029a59805k38462f8891J6388l09593
10643c62096h7861q1472k2672l7816a9838B29702b6434j95617A30357b46222K4383
10632b21839a5886k25848C30905A60795g4925B45218a19182n5229n8868a06560
10621E2623b51935a03261A2144b98348f328A84322c49040r1125C02325b81665
10610A90378N8676b00027l2870L9268F9439M4756P1630F6201i2656A90882b58124
10598b8580k8292k5374F8796e2348j9719F305L1215b282I0953O52a00246G2033
10585C727d2147k8707a3210k42203q5241c278B8045g9356A07727b43649n2644
$$ plain form
10574 -296293 -432198 -228603 -15964 -280500 356247 288504 -195745 105819 -117926 -97619
10564 -97619 -212966 274389 7584 -390008 -161772 -436674 40776 -304310 -37077 153619
10553 -130395 136815 -33356 21967 -45634 -278156 -190770 -66616 14159 -171518 -74799 440326
10541 -149439 22659 155580 19056 -4120 17922 177554 188091 68840 -22666 -85172 -48845
10530 -48845 -249637 28540 -15950 -80901 83508 -137038 121404 108948 -345182 -327294 117805
10518 -240007 -284851 103107 -187218 55301 -358894 -33370 68310 -236267 74933 259612
10508 259612 -228263 -203132 -162077 -508814 -183171 62734 77894 -103416 -15457 -223258
10498 -223258 65348 28206 -104124 74090 -56055 -26456 210412 -123879 2005 -354841 74719
$$ packed form
10574b96293j35905K03595a5964k64536C56247o7743a95745A05819a17926K0307
10564i7619j15347B74389G584c90008a61772k74902D0776c04310c7077A53619
10553a30395A36815c3356B1967d5634k32522Q7386f6616A4159a71518g4799D40326
10541a49439B2659J32921A9056d120A7922J59632J0537F8840b2666o2506L6327
10530d8845k00792B8540a5950o4951H3508a37038A21404j2456c45182J7888A17805
10518b40007m4844A03107a87218E5301c58894c3370F8310b36267G4933J84679
10508B59612b28263K5131M1055l46737a83171F2734J5160a03416a5457k07801
10498b23258F5348B8206a04124G4090e6055b6456B10412a23879B005c54841G4719
$$ plain form
10486 948 187560 -28958 -199456 -76628 -11931 51227 -209637 -139113 108184 96402 229956
10475 229956 628601 470027 477795 489447 207248 395921 50997 -295025 151015 105023
10465 105023 -121400 -92102 144059 118938 -160068 89955 142688 -50740 -221620 -20915 168442
10453 32257 -208340 57642 89481 201996 -119654 32417 -160895 260212 146581 267860
10443 267860 327604 -203052 -99567 74029 146991 141393 -79156 -21340 -94724 -234074 473349
10431 -19571 113034 13243 -156141 -204236 277229 -189628 -163049 -124568 -159306 41577 84973
10420 84973 281106 -57205 -150951 94400 95124 -85963 -134646 -125158 -168096 -2564 -144064 56274
10407 94205 -204554 -10915 -232472 -32307 -29245 122728 2108 32947 -74169 54347 -222180
$$ packed form
10486I48J86612b8958j70498g6628a1931E1227b09637P0524A08184j1782J33554
10475B29956L98645j58574P768J1652B07248J88673E0997b95025A51015m5992
10465A05023a21400K9298A44059k5121a60068H9955N2733e0740j70880b0915A68442
10453C2257b08340E7642L1839J12515a19654C2417a60895B60212j13631J21279
10443B67860N9744b03052i9567G4029P2962n598g9156b1340p3384j39350D73349
10431a9571A13034A3243a56141m8095B77229a89628K6579L8481l4738D1577M3396
10420H4973J96133e7205r3746I4400P24h5963m8683R488m2938b564j41500E6274
10407I4205b04554a0915k21557c2307L062A22728B108L0839g4169E4347b22180
$$ plain form
10395 -9186 193945 125944 424263 -59833 24718 9345 235697 35780 -38143 -105983 -55771
10384 -55771 -28500 185023 111849 -26558 -58735 127006 70709 129611 -18859 23363 -108777
10372 390255 -8854 -56206 170026 201938 130472 310981 216238 328845 400926 625846 581855
10361 581855 414359 104918 376847 276497 212443 -171320 -71505 186090 307170 416069
10351 416069 249806 311488 408952 346448 690115 797628 127367 20600 289276 136825
10340 521284 406476 464854 160469 221220 -27694 155441 342694 162526 162321 157686 172675
10329 172675 519871 24921 259165 283968 143911 -104321 -113094 280687 146941 270730
10319 270730 209371 350648 144912 98868 177327 350908 -89789 78582 309847 27799 188900
$$ packed form
10395i186A93945o8001K98319e9833B4718I345K26352C5780c8143o7840N0212
10384e5771K7271A85023p3174b6558l2177A27006n6297N8902a8859B3363a08777
10372C90255h854m7352A70026L1912p1466J80509r4743J12607P2081K24920m3991
10361E81855j67496A04918K71929j00350o4054a71320g1505A86090J21080J08899
10351D16069j66263O1682R7464o2504L43667J07513A27367B0600K68676A36825
10340E21284j14808N8378A60469O0751b7694A55441J87253A62526k05m635J4989
10329A72675L47196B4921K34244K4803j40057a04321q773B80687j33746J23789
10319B70730o1359J41277A44912m6044P8459J73581h9789G8582K31265B7799J61101
$$ plain form
10308 188900 328781 -408473 -298293 -86186 -213292 -99772 173929 -40382 -276682 -65935
10297 150611 -395434 60202 84165 122996 52605 -64387 -255368 51087 -33808 126117 -176637
10285 -153915 127754 268626 -25173 -82035 135346 95934 -130886 -11714 106516 228502
10275 228502 243382 46164 275749 -66477 22905 180131 63420 -161415 -40771 -311096 99412
10263 -1075 260725 42324 -115998 99835 -142363 44230 -148194 -2553 135160 210499 512386
10252 512386 514725 168376 187531 103156 386883 402065 202621 129386 -221063 -12140 -2731
10240 69525 203799 40018 -146669 -139242 -152288 -148946 -33360 -267642 -6906 -103557 -114761 -19012
10227 -352029 126767 -154986 -60126 189568 57339 -131594 65151 -330102 -226346 8229
$$ packed form
10308A88900J39881d08473J10180h6186j27106i9772A73929d0382k36300f5935
10297A50611c95434F0202K3963L8831E2605f4387j90981E1087c3808A26117a76637
10285a53915A27754J40872b5173n6862A35346l9412a30886a1714A06516J21986
10275B28502J4880D6164K29585f6477B2905J57226F3420a61415d0771k70325I9412
10263a075B60725D2324a15998I9835a42363D4230a48194b553A35160P5339L01887
10252E12386K339A68376J9155q4375K83727J5182j99444p3235b21063a2140b731
10240F9525J34274D0018a46669P427j3046L342c3360k34282f906r6651j1204a9012
10227c52029A26767a54986f0126A89568E7339a31594F5151c30102J03756H229
$$ plain form
10216 -361392 205381 -394005 23517 -47361 218587 -108097 -103426 -187891 -228456 -264532 72549
10204 -340934 -2338 -25685 -139292 -110496 -91481 -34093 7655 -226023 -237352 -110671 153531
10192 -252738 -208546 -294339 103225 -35555 274327 155029 -133573 -186873 -8016 -279852 65230
10180 -162646 -351510 -113578 -194865 -153543 -68577 209808 87163 119273 -495452 -152774
10169 -285108 -3058 47376 7845 -186624 52146 -15201 -65320 92330 -173270 81496 177697
10158 177697 -302944 -319565 -159089 -121923 -211807 -56187 -294875 277770 176387 -17945
10147 85560 -266290 975 162242 -89566 -27156 -191589 -42234 -12761 -49555 84512 -167221
10135 42394 18685 -213195 -182998 -205106 -30948 81115 112040 -281138 -103366 353021 -89476
$$ packed form
10216c61392B05381c94005B3517d7361B18587a08097M671q4465m0565l6076G2549
10204c40934b338k3347j13607K8796J9015c4093G655b26023j1329a10671A53531
10192b52738M4192q5793A03225c5555B74327j19298a33573n3300h016k71836F5230
10180a62646j88864a13578q1287M1322f8577B09808H7163L2110d95452a52774
10169b85108c058D7376G845a86624E2146a5201n0119I2330a73270H1496R6201
10158A77697c02944j6621a59089L7166q9884e6187k38688B77770j01383a7945
10147H5560b66290I75J61267h9566b7156j64433d2234a2761l6794H4512a67221
10135D2394A8685b13195L0197k2108c0948H1115L0925b81138a03366C53021h9476
$$ plain form
10123 -215282 -37701 55956 -264980 -313566 -188664 366651 -131624 -283820 -186239 -17665
10112 37634 -340533 -148012 -24476 -138786 -165000 -124828 110972 -194921 -11495 -14668 3161
10100 -217671 125695 -15912 196901 -358778 -191738 -29755 -22342 -54095 -187453 10161 -46970
10088 18746 46833 125022 -135952 17089 304419 -32969 27099 -121672 -52807 -81269 -38866
10076 124502 107713 89026 98143 -49653 -216397 88231 67414 10696 -44390 211378 92282
10064 69402 -172115 -164125 -55340 -166947 -318242 182458 -45155 195659 -290740 40889 -147741
10052 204007 -9558 57427 -9663 54815 73010 -42059 -227802 72969 -169611 -330280 -214043
10041 -214043 167297 7213 -164129 -47650 66562 -213644 -79493 -122943 -222914 12012 -49661
$$ packed form
10123b15282c7701E5956b64980m8586J24902C66651a31624j52196R7581a7665
10112C7634c40533a48012b4476j14310k6214M0172A10972a94921a1495l173C161
10100b17671A25695a5912A96901c58778J67040b9755P413l1753j33358A0161d6970
10088A8746K8087P8189a35952A7089K87330c2969B7099a21672e2807k8462c8866
10076A24502j6789j8687R117d9653j66744H8231k0817A0696d4390B11378I2282
10064F9402a72115P990e5340j11607j51295A82458d5155A95659b90740D0889a47741
10052B04007i558E7427i663E4815J8195d2059j85743G2969a69611j60669J16237
10041b14043A67297G213a64129d7650F6562b13644g9493m3450r9971A2012d9661
$$ plain form
10029 -148981 -191534 208752 17465 -273940 -115241 259467 74726 -96315 -352941 -316902
10019 -316902 -73270 -33365 -72304 -32487 -222623 -136393 253421 -125286 -118350 61595 460797
10008 460797 83687 80766 -110882 -5291 -59094 120176 -107142 148192 26076 52132 266475
9997 266475 71317 -409891 35730 -209184 43922 130645 -5662 -216316 34019 64519 -206257
9985 -92418 -340362 -132676 -212337 -99149 37884 -46746 23207 67472 -218396 -467903 -121397
9973 -60394 -337007 171247 -271436 44367 -5758 114589 308663 155737 71692 275124 131946
9961 -222202 -62270 -300919 120895 149064 -151418 51619 130453 -94854 -61010 162456 -214881
9949 18315 -15838 -288895 -51941 -76434 -188369 -248176 77401 13380 11462 72966 -184983
$$ packed form
10029a48981m2553B08752A7465b73940a15241B59467G4726i6315k56626L6039
10019c16902g3270c3365l8939c2487j90136Q6230B53421a25286O936F1595L99202
10008D60797H3687k921a10882e291n3803A20176a07142A48192B6076K6056K14343
9997B66475G1317d09891C5730b09184D3922Q6723e662k10654C4019L0500b06257
9985i2418k47944a32676p9661i9149C7884d6746B3207M4265b18396k49507a21397
9973f0394k76613A71247b71436D4367e758A14589J94074j52926G1692K03432A31946
9961b22202f2270k38649A20895K8169a51418E1619P8834i4854L3844A62456b14881
9949A8315a5838k73057e1941k4493j11935n9807G7401A3380j918O1504a84983
$$ plain form
9937 118153 -299957 -357432 208320 233331 -85693 27378 -200599 -162512 -116418 170822 -260177
9925 -144806 -91350 -42137 45274 -71705 125405 -275855 -81193 -99054 -379321 -60837 89909
9913 -85833 -65372 110928 -302543 -33368 -112305 -148657 -130183 180373 -125940 -501000 -499008
9902 -499008 -29095 137975 -89762 -133487 93932 -398291 -95224 -96763 117874 -98340 6870
9890 -291291 -165052 219643 -92314 -228083 -348448 -109718 -198340 -49548 -318548 131668
9879 -56734 -117348 54664 -438771 30549 -97 -165797 -268254 30625 -94473 -20317 22241 -208121
9866 268818 -123877 -184677 153207 -376358 41464 98522 -146405 -101788 -467011 259430
9855 263231 -201306 -336436 238790 153958 -206444 -35867 7157 -46322 -59688 4252 -64353
$$ packed form
9937A18153b99957n7475B08320K5011h5693B7378b00599L8087M6094A70822b60177
9925a44806N3456d2137D5274g1705A25405b75855h1193j7861k80267f0837H9909
9913h5833K0461A10928c02543c3368p8937l6352J8474A80373a25940l75060J992
9902d99008b9095A37975h9762m3725I3932c98291i5224j539A17874i8340F870
9890b91291J26239B19643i2314j35769j20365a09718q8622d9548k69000A31668
9879e6734o0614E4664d38771C0549i7j65700j02457C0625i4473b0317B2241b08121
9866B68818a23877o0800A53207c76358D1464N7058a46405M4617l65223B59430
9855B63231b01306j35130B38790q4832b06444c5867G157d6322j3366D252f4353
$$ plain form
9843 -282640 -88868 86921 -7901 -130551 -201124 52470 -121727 -68751 370866 -62168 -14933
9831 -23043 64841 250230 -191545 39261 -9052 -198842 -2265 -128669 -318225 -64930 126933
9819 -41727 -157684 -264231 -198659 -65442 -171789 236203 -213426 -77796 29605 -120024 -427015
9808 -427015 -370385 19024 53886 -122669 -102749 -83771 -174257 -153556 130214 223503 234751
9797 234751 4079 -167897 275830 106559 264733 -88940 -101324 152715 -173961 3573 -404851
9785 -17135 -306204 -115211 -11898 195358 -164050 -119524 -489157 134409 74922 -136825
9774 -104242 -255950 290636 287824 -101099 -106465 343842 -123599 -368501 -241615 -240914 -45745
9762 -280907 101467 323673 315822 -211350 -165853 41870 -321028 -59281 -28192 11042 142939
$$ packed form
9843b82640h8868H6921g901j22650p0573E2470a21727N2976C70866f2168a4933
9831b3043F4841J85389a91545C9261i052j89790b265j26404j89556f4930A26933
9819d1727j15957j06547O5572f5442j06347B36203b13426g7796B9605a20024l06991
9808d27015N6630A9024L4862a22669J9920J8978r0486K0701A30214R3289J1248
9797B34751D079a67897B75830A06559J58174h8940j2384A52715a73961C573d04851
9785a7135k89069a15211a1898A95358a64050M4526l69633A34409n9487a36825
9774a04242j51708B90636k812a01099n366C43842a23599k44902J26886P01d5745
9762b80907A01467K22206p851b11350M5497D1870c21028e9281b8192A1042J31897
$$ plain form
9751 142939 -259781 233376 -251272 -30800 141858 116927 362962 -472690 -198022 -93236
9740 130750 -26111 -107970 -199333 -105835 -66309 -162524 -190262 -20623 -232749 -34543 65375
9728 -301695 -188752 138600 89135 244382 -173952 -230873 -212072 -101069 -242325 -5783 -252734
9717 -252734 204001 -279722 -340514 -164791 199883 -134825 -119717 108817 79741 -14201
9706 -162467 -261235 54975 -385406 -151472 -168994 29168 -107976 -108702 -345063 -49401 245266
9694 -105962 -40240 -170455 -198152 -703684 183588 37529 -218153 -258686 49313 165522 -40845
9682 -131353 -10421 -104515 -47060 -333249 190464 -270396 -53484 -397544 -207439 181209
9671 -316727 -262384 -69198 -214087 -405667 -200687 -284667 -282812 12542 -142596 -297820 -207254
$$ packed form
9751A42939b59781B33376b51272c0800A41858k4931K46035d72690a98022i3236
9740A30750b6111q1859r1363R3498L9526r6215k7738b0623k12126c4543F5375
9728c01695J12943A38600m9465J55247a73952n6921J8801a01069j41256e783k46951
9717b52734B04001b79722o0792a64791A99883a34825J5108A08817k9076a4201
9706a62467r8768E4975c85406a51472j7522B9168a07976p26k36361d9401B45266
9694a05962d0240j30215k7697n05532A83588C7529b18153m0533D9313J16209d0845
9682a31353a0421r4094d7060k86189A90464b70396e3484l44060J90105A81209
9671c16727N4343f9198j44889j91580b00687q3980J855A2542a42596j55224R0566
$$ plain form
9660 -207254 -37625 -77157 -4855 -131531 -88822 -497900 -15784 129993 -68284 -292387 -286385
9649 -286385 -77497 -122389 -410971 6183 93700 94899 -204039 221 -138860 -72966 64859 -243300
9636 -329226 15744 -69301 -197236 -3851 251685 213009 -93753 -63877 -131720 9051 -145025
9624 -65662 -200691 -241948 5676 63352 54093 -156391 -102854 -110868 -121769 -309464 -125180 28252
9611 87199 47078 32515 -123545 136626 -25154 20570 -55499 213652 6116 70669 38820
9600 38820 -28399 187767 -299180 -82802 53809 153414 -312234 -181356 -120026 -135837 -197798
9589 -197798 -390986 246151 -151370 278034 91102 -261938 328219 169928 -136650 139060
9578 -81731 -51438 -207335 -247599 57854 674 9244 -338253 -255936 -127532 74552 111692 1525
$$ packed form
9660b07254c7625l9532d855j26676M2709m09078a5784A29993f8284k24103O002
9649b86385g7497m4892k88582F183Q7517J199b04039B21a38860O5894F4859b43300
9636c29226A5744f9301j27935c851B51685l8676i3753K9876o7843I051a45025
9624f5662j35029m1257E676N7676r259a56391N3537q014j0901j87695a25180B8252
9611H7199m0121j4563a23545A36626b5154B0570e5499B13652F116O4553l1849
9600C8820b8399A87767b99180h2802E3809R9605c12234J30878O1330j5811o1961
9589a97798j93188B46151a51370B78034I1102b61938C28219j58291a36650A39060
9578h1731L0293j55897m0264E7854F74Q570c38253Q2317a27532G4552L7140A525
$$ plain form
9565 -51356 -202930 93628 -103351 -251723 -110502 -296614 -210429 -230078 -132056 99335 -125651
9553 -328547 -202039 41184 -335156 224866 -198781 124370 152377 -179143 -411383 143785
9542 167201 186419 -151300 -100612 -333260 -29710 283815 -215920 26903 -146108 3117 -58773
9530 -181507 -298045 3769 -154802 -69233 121599 -187271 9646 -133445 -52702 216942 -324104
9518 -125468 -85923 328791 -147660 -71367 -198053 -46235 22218 187265 -31680 -40074 -237086
9507 -237086 -89768 3296 73471 -200148 -74378 -26443 16930 -326776 150527 97285 -195569
9495 12703 -211759 -311531 -153767 15053 -181720 -285044 81662 -144292 145753 -24297 -24654
9484 -24654 54307 -376843 -326423 -347133 103118 -287231 -42361 -90433 -171301 96488 -88403
$$ packed form
9565e1356j51574I3628a03351j48372a10502j86112Q6185j9649R8022I9335a25651
9553c28547J26508D1184c35156B24866a98781A24370K8007a79143k32240A43785
9542A67201J9218a51300N0688k32648b9710B83815b15920B6903a46108C117e8773
9530a81507j16538C769a54802f9233A21599a87271I646a33445e2702B16942c24104
9518a25468L9545C28791a47660g1367j26686d6235B2218J65047c1680q394j97012
9507b37086h9768C296P0175b00148g4378b6443A6930c26776A50527n3242a95569
9495A2703b11759r9772a53767A5053a81720j03324H1662a44292A45753b4297l57
9484b4654E4307c76843N0420k0710A03118b87231d2361m8072q0868I6488h8403
$$ plain form
9472 -73487 -128324 -144338 -334463 -611389 75769 -14311 -249838 -9313 -363685 -94493 -164380
9461 -164380 -109118 135918 -42260 274577 53848 43129 -137801 -127866 -206662 -268687 13335
9449 -219128 -7576 -196395 136263 -75191 -137989 188716 10147 109504 -116376 -231171 248382
9437 192283 -178906 -54416 4067 -96504 236108 72619 109753 -49921 107473 -10373 -185228
9426 -185228 85173 -133000 501978 -341748 -153092 -88739 -83579 -230713 -140465 20160 82264
9415 82264 110663 -124726 386485 66107 -113722 -420135 -71104 -119917 -33030 -158752 -17433
9403 -112786 -143960 275279 -152425 -226150 -11337 -13948 306735 -97554 41687 484 -335198
9391 -476825 -50867 -252443 -49562 -247870 884 135784 125823 224318 -182841 -387253 -372288
$$ packed form
9472g3487n4837j6014j90125k76926G5769a4311k35527i313l54372i4493o9887
9461a64380N5262A35918d2260B74577E3848j0719a37801R935p8796o2025A3335
9449b19128g576j88819A36263g5191o2798A88716A0147R9357a16376j14795B48382
9437A92283a78906e4416D067i6504B36108G2619L7134d9921A07473a0373j74855
9426a85228H5173a33000E01978c41748a53092O4353N160j47134R0248B0160O2104
9415H2264K8399a24726C86485F6107a13722l06413g1104m8813c3030j25722a7433
9403a12786l1174B75279a52425p3725a1337k611C06735i7554D1687D84c35198
9391d76825e0867k01576d9562j98308H84J34900r961R8495a82841k04412J4965
$$ plain form
9380 -372288 -138723 -326513 215321 6665 109530 92658 -133208 -61650 61320 -112691 -88629
9369 -88629 -3004 -65686 110692 -216851 215602 74981 168338 -314963 197548 -161900 -569263
9358 -569263 149637 -127252 87276 -154464 158043 -173472 139921 -116455 -189043 -103892
9348 -103892 151831 365954 11369 -57291 -1010 9863 -50315 30764 -161682 -32445 -126376
9337 -126376 -69704 196634 72689 -68673 -74381 48410 255715 -24147 -98878 -249464 -5478
9325 -160687 -31093 185551 25908 -70754 -121602 -108304 -123596 -95220 39715 -206893 -89433
9313 -53419 174751 -143703 -263051 114488 -102179 87693 -183777 -100890 -276691 -89774
9302 -61690 -178800 -29619 39178 -83687 205047 -147479 -88786 334848 -76845 1856 57085
$$ packed form
9380c72288a38723j87790B15321F665J02865j6872a33208f1650F1320a12691K4062
9369h8629c004o2682A10692b16851B15602G4981R3357c14963A97548a61900m07363
9358e69263A49637a27252H7276a54464A58043a73472A39921a16455p2588Q5151
9348a03892A51831K14123A1369e7291a010I863e0315C0764a61682c2445r3931
9337a26376N6672A96634G2689f8673n708D8410K07305b4147p4731j50586e478
9325a60687c1093A85551B5908g0754n0848J3298j5292K8376C9715b06893h9433
9313e3419A74751a43703j19348A14488a02179H7693a83777Q2887j75801h9774
9302f1690j17110b9619C9178h3687B05047a47479N8693C34848g6845A856N5229
$$ plain form
9291 57085 -314411 -179072 -217875 66664 -198084 -49527 -75149 76574 -133220 210158 -473318
9279 -184633 46122 -82441 69037 -60526 -219099 -157471 -175907 -68459 -373375 -180738 28611
9267 -142999 103127 117308 -146679 -218228 183676 91221 -44275 185201 150803 -123267 113293
9255 -265912 -72362 -165028 -201950 -108230 -77977 1844 -98066 -305662 -407868 -17078 -208637
9244 -208637 -138114 -28502 -46770 249793 -32057 -23389 63810 -158994 307933 -52637 -122930
9233 -122930 -106774 -146679 97117 169092 35576 813 -377951 328238 -183342 55366 -338226
9221 -350634 -272476 -60301 -328655 -21076 -260355 -206545 17699 4811 -18222 140428 152188
9210 152188 -101572 257431 -185967 42317 104802 -428757 -437784 6112 -39198 -195276 120802
$$ packed form
9291E7085c14411J35339l8803F6664a98084d9527k5622G6574a33220B10158d73318
9279a84633D6122h2441F9037f0526j58573O1628j8436f8459l04916a80738B8611
9267a42999A03127J4181a46679p1549A83676I1221d4275A85201l4398a23267A13293
9255b65912g2362r2666l6922R3720L0253A844i8066k07596j02206a7078j91559
9244b08637P0523b8502j8268B49793c2057Q668F3810a58994C07933e2637p0293
9233a22930J6156l9905I7117P1975C5576H13c77951C28238a83342E5366c38226
9221c50634P8158f0301k68354b1076k39279N3810A7699D811a8222A40428J1760
9210A52188a01572B57431a85967D2317O2485d28757r027F112c9198j56078A20802
$$ plain form
9198 -136606 -428346 -22385 -89124 -234472 79483 -299080 20489 30778 -274053 -141185 -74442
9187 -74442 -128444 256444 -358890 -327582 133278 435220 361394 78462 -304712 135674 146718
9176 146718 58768 251151 -60185 -164079 -46729 -150547 85037 68991 314629 -218963 311458
9164 123236 215480 -125623 8186 -79780 40078 28248 138764 -249775 -170130 -93890 -137449
9153 -137449 -102224 54670 79276 -104543 -38016 9456 121410 -33396 -36584 -50472 228445
9141 130926 -209589 -39176 -13576 -243854 -87475 -93551 153726 -50967 223801 -3311 130140
9129 -169723 157849 -251441 -11645 -86140 68701 -566974 -97677 -95830 -228640 -185290 -690826
9118 -690826 78430 -51087 -148448 -115762 292449 30753 -249525 -131977 149402 151049 -13677
$$ packed form
9198a36606k91740b2385o6739j45348G9483b99080B0489J0289b74053J32868O6743
9187g4442n4002B56444c58890L1308A33278L01942p3826G8462c04712A35674J1044
9176A46718E8768J92383f0185j03894d6729j03818H5037j6046K45638b18963C11458
9164A23236R2244a25623H186g9780D0078j1830J10516b49775P9645P6240m3559
9153a37449L5225E4670K4606a04543c8016I456J11954c3396l188j3888B28445
9141A30926b09589c9176a3576k30278h7475o076A53726e0967B23801c311A30140
9129a69723A57849b51441a1645p4495F8701e66974i7677J847j32810M3350n05536
9118f90826G8430e1087r7361L2686B92449C0753b49525J17548A49402J647a3677
$$ plain form
9106 -484590 195922 163956 21266 264304 -208404 -29304 -179883 53321 165747 -67079 -278897
9095 -278897 -169610 -243215 114019 85376 15775 -78950 -175924 -483960 -208314 -30611 103914
9083 -365697 -57905 -59496 -316987 70051 -113724 57546 -134893 -95641 -225086 203204 -114585
9071 -305748 -222224 -211335 62993 -353166 -59140 -175474 98869 -162331 -385684 157202 41978
9059 66014 -162317 129 -310932 -132755 -148837 123783 -10776 308652 -220499 173338 -20679
9047 40251 250368 -410293 -274048 -198869 162714 -205628 -30260 99303 -266890 -63496 -209998
9036 -209998 88919 -33865 219610 185554 100348 86953 -43579 -158876 -94893 -142689 -323008
9025 -323008 87065 78447 155985 -402423 -141725 195237 -348721 -220668 -154913 -310795 -289262
$$ packed form
9106d84590A95922l1966B1266K43038b08404b9304j50579E3321J12426f7079k11818
9095b78897J09287p3605A14019k8643A5775g8950r6974l08036b08314c0611A03914
9083c65697e7905j591k57491G0051a13724E7546a34893L9252j29445B03204a14585
9071c05748Q3524J0889F2993c53166e9140j16334I8869a62331k23353A57202D1978
9059F6014a62317A29c10932a32755j6082A23783a0776C08652b20499A73338b0679
9047D0251K10117d10293J36245P5179A62714b05628c0260I9303b66890f3496j46502
9036b09998H8919c3865B19610l4056q5206j3395d3579j15297O3983m7796j80319
9025c23008H7065q618P7538d02423a41725A95237c48721J28053O5755j55882K1533
$$ plain form
9014 -289262 -421250 -37186 200266 -113868 -233107 99109 -47563 76185 107766 217814 -276189
9002 61802 35824 321129 124412 -167069 115584 75041 -82447 14631 -105054 -10272 198003
8990 -34716 -37456 65423 103608 198756 -32810 -281368 -141496 -206797 -182089 -95882 -212520
8979 -212520 -32361 264921 -13287 86284 49923 -145847 -183409 -11031 -247053 -126490 -31179
8967 265525 -104983 261322 39488 -46248 332741 -138321 123575 -27276 -275211 87455
8956 115183 117860 -181811 226404 -573373 -510141 -64576 130807 -122902 -120644 13394 78437
8945 78437 80522 160147 60337 -211144 -31924 202746 29013 -116694 111776 164557 141125
8934 141125 -179247 -478218 -152154 -142876 -208994 326185 110888 -366475 -34093 -337316
$$ packed form
9014b89262j31988c7186B00266a13868j19239I9109d7563G6185L1581J10048b76189
9002F1802k5978K85305A24412a67069A15584m0543h2447A4631a05054a0272A98003
8990c4716k740F5423L8185R5148c2810k48558J39872o5301K4708Q6207j16638
8979b12520c2361B64921a3287H6284l6361a45847l7562a1031k36022J20563c1179
8967B65525a04983B61322C9488d6248C32741a38321A23575b7276k47935H7455
8956A15183K677a81811B26404e73373O3232f4576A30807a22902K258A3394O5043
8945G8437K085P9625F0337b11144c1924B02746B9013a16694A11776N2781k3432
8934A41125a79247k98971a52154R278o6118C26185A10888c66475c4093l03223
$$ plain form
8924 -337316 -74987 61046 -66171 240895 44289 562977 449402 100330 187992 -103421 -63869
8913 -63869 -23275 -170592 -192503 20333 157561 -143926 4999 -293568 -136127 27646 36817
8902 36817 197446 56596 46268 -228337 16924 -163191 -121893 -47298 183419 -115899 121911
8890 100279 -355326 330205 -22969 -228949 -345750 -267680 -39007 -86706 -148443 -116108 -84424
8879 -84424 43216 -4195 183246 -124524 139677 134106 154686 -64237 39133 -255269 -97197
$$ packed form
8924c37316g4987F1046f6171B40895D4289N18688j13575A00330Q7662a03421L9552
8913f3869b3275j47317k1911B0333J37228a43926D999b93568a36127B7646R171
8902C6817J60629E6596j0328b28337A6924a63191M1298d7298A83419a15899A21911
8890A00279c55326C30205b2969k05980j16801P8070c9007m7699o1737L2335L1684
8879h4424D3216d195A83246a24524A39677n571K0580f4237C9133b55269i7197
$$ [...]
##END NTUPLES=NMR SPECTRUM
##END=
