##TITLE=NES1045_Brazil_9268490_HpCFHjx8nf
##JCAMPDX= 6.0         $$ Bruker NMR JCAMP-DX V2.0
##DATA TYPE= NMR SPECTRUM
##DATA CLASS= NTUPLES
##ORIGIN= BRUKER
##OWNER= Administrator
$$ 1.72 TOPSPIN		Version 2.1
$$ 2015-07-12 00:45:56.331 -0700  Administrator@X
$$ Compression mode = diff/dup
##.OBSERVE FREQUENCY= 400.02188249412
##.OBSERVE NUCLEUS= ^1H
##.ACQUISITION MODE= SIMULTANEOUS (DQD)
##.ACQUISITION SCHEME= undefined
##.AVERAGES= 8
##.DIGITISER RES= 22
##SPECTROMETER/DATA SYSTEM= spect
##.PULSE SEQUENCE= zg30
##.SOLVENT NAME= COFFEE_meoh
##.SHIFT REFERENCE= INTERNAL, COFFEE_meoh, 1, 14.98509
##AUDIT TRAIL= $$ (NUMBER, WHEN, WHO, WHERE, PROCESS, VERSION, WHAT)
$$ ##TITLE= Audit trail, TOPSPIN		Version 2.1
$$ ##JCAMPDX= 5.01
$$ ##ORIGIN= Bruker BioSpin GmbH
$$ ##OWNER= Administrator
$$ $$ E:\/data/COFFEE/nmr/NES1045_Brazil_9268490_HpCFHjx8nf/10/pdata/1/auditp.txt
$$ ##AUDIT TRAIL=  $$ (NUMBER, WHEN, WHO, WHERE, PROCESS, VERSION, WHAT)
(   1,<2015-07-12 00:45:48.972 -0700>,<Administrator>,<X>,<go>,<TOPSPIN 2.1>,
      <created by zg
	started at 2015-07-12 00:44:42.456 -0700,
	POWCHK enabled, PULCHK disabled,
       configuration hash MD5:
       21 0F 79 D6 B3 7B B4 F6 88 20 88 DB 03 48 BD 9F
       data hash MD5: 64K
       E8 EF 34 D3 C6 8C 9A 31 8A BF 9E 67 78 02 CA DC>)
(   2,<2015-07-12 00:45:52.160 -0700>,<Administrator>,<X>,<proc1d>,<TOPSPIN 2.1>,
      <Start of raw data processing
       efp LB = 0 FT_mod = 6 PKNL = 1 PHC0 = 0 PHC1 = 0 SI = 32K 
       data hash MD5: 32K
       5E E1 00 82 F0 33 E1 68 AD 18 A9 49 51 84 70 6A>)
(   3,<2015-07-12 00:45:52.456 -0700>,<Administrator>,<X>,<proc1d>,<TOPSPIN 2.1>,
      <pk PHC0 = 93.6969 PHC1 = 0 
       data hash MD5: 32K
       3B FE 1A F0 EC 84 75 FB 4B DF 2F 2D 64 30 CE 77>)
(   4,<2015-07-12 00:45:52.566 -0700>,<Administrator>,<X>,<proc1d>,<TOPSPIN 2.1>,
      <abs ABSG = 1 
       data hash MD5: 32K
       78 34 47 34 07 96 D2 C6 15 78 6E 6A D4 96 10 5E>)
(   5,<2015-07-12 00:45:52.628 -0700>,<Administrator>,<X>,<proc1d>,<TOPSPIN 2.1>,
      <abs ABSG = 2 
       data hash MD5: 32K
       0C BC FA 7E BC 17 09 3B C0 65 6A FD 59 32 C7 9F>)
(   6,<2015-07-12 00:45:52.691 -0700>,<Administrator>,<X>,<proc1d>,<TOPSPIN 2.1>,
      <abs ABSG = 3 
       data hash MD5: 32K
       04 17 82 F8 CF 0E 67 43 D4 00 BE 61 52 79 01 39>)
(   7,<2015-07-12 00:45:52.753 -0700>,<Administrator>,<X>,<proc1d>,<TOPSPIN 2.1>,
      <abs ABSG = 4 
       data hash MD5: 32K
       0F C8 B1 C6 5E 3A 8B B7 FA 2C E9 39 08 25 5F 26>)
(   8,<2015-07-12 00:45:52.816 -0700>,<Administrator>,<X>,<proc1d>,<TOPSPIN 2.1>,
      <abs ABSG = 5 
       data hash MD5: 32K
       95 65 F3 89 04 E2 79 E6 79 22 F1 90 72 4A ED CF>)
$$ ##END=
$$ 
$$ $$ hash MD5
$$ $$ 49 F3 A1 3B F8 6E 0D 53 44 9B 1D 94 33 01 B9 A5
##$RELAX= 
##$RELAX= 
##$RELAX= 
##$RELAX= 
##$RELAX= 
##$RELAX= 
##$RELAX= 
$$ Bruker specific parameters
$$ --------------------------
##$DU= <E:\>
##$EXPNO= 10
##$NAME= <NES1045_Brazil_9268490_HpCFHjx8nf>
##$PROCNO= 1
$$ [...]
150 150 150 150 150 150 150 150
##$TP07= 0
##$TPNAME0= <>
##$TPNAME1= <>
##$TPNAME2= <>
##$TPNAME3= <>
##$TPNAME4= <>
##$TPNAME5= <>
##$TPNAME6= <>
##$TPNAME7= <>
##$TPOAL= (0..7)
0.5 0.5 0.5 0.5 0.5 0.5 0.5 0.5
##$TPOFFS= (0..7)
0 0 0 0 0 0 0 0
##$TUNHIN= 0
##$TUNHOUT= 0
##$TUNXOUT= 0
##$USERA1= <user>
##$USERA2= <user>
##$USERA3= <user>
##$USERA4= <user>
##$USERA5= <user>
##$V9= 5
##$VALIST= <valist>
##$VCLIST= <CCCCCCCCCCCCCCC>
##$VD= 0
##$VDLIST= <DDDDDDDDDDDDDDD>
##$VPLIST= <PPPPPPPPPPPPPPP>
##$VTLIST= <TTTTTTTTTTTTTTT>
##$WBST= 2048
##$WBSW= 25
##$XGAIN= (0..3)
0 0 0 0
##$XL= 0
##$YL= 0
##$YMAX_a= 639447
##$YMIN_a= -530348
##$ZGOPTNS= <>
##$ZL1= 120
##$ZL2= 120
##$ZL3= 120
##$ZL4= 120
##$ABSF1= 14.98509
##$ABSF2= -5.573092
##$ABSG= 5
##$ABSL= 3
##$ALPHA= 0
##$AQORDER= 0
##$ASSFAC= 0
##$ASSFACI= 0
##$ASSFACX= 0
##$ASSWID= 0
##$AUNMP= <proc_prof1d_extract_pilot.lims>
##$AXLEFT= 0
##$AXNAME= <>
##$AXNUC= <1H>
##$AXRIGHT= 0
##$AXTYPE= 0
##$AXUNIT= <>
##$AZFE= 0.1
##$AZFW= 0.1
##$BCFW= 0
##$BC_mod= 0
##$BYTORDP= 0
##$COROFFS= 0
##$CY= 15
##$DATMOD= 1
##$DC= 0
##$DFILT= <>
##$DTYPP= 0
##$F1P= 0
##$F2P= 0
##$FCOR= 0.5
##$FTSIZE= 32768
##$FT_mod= 6
##$GAMMA= 0
##$GB= 0
##$INTBC= 1
##$INTSCL= 1
##$ISEN= 128
##$LB= 0
##$LEV0= 0
##$LPBIN= 0
##$MAXI= 10000
##$MC2= 0
##$MEAN= 0
##$ME_mod= 0
##$MI= 0
##$NCOEF= 0
##$NC_proc= -8
##$NLEV= 6
##$NOISF1= 0
##$NOISF2= 0
##$NSP= 0
##$NTH_PI= 0
##$NZP= 0
##$OFFSET= 14.98509
##$PC= 1
##$PHC0= 93.6969
##$PHC1= 0
##$PH_mod= 1
##$PKNL= yes
##$PPARMOD= 0
##$PPDIAG= 0
##$PPIPTYP= 0
##$PPMPNUM= 2147483647
##$PPRESOL= 1
##$PSCAL= 4
##$PSIGN= 0
##$PYNMP= <proc.py>
##$REVERSE= no
##$SF= 400.02
##$SI= 32768
##$SIGF1= 0
##$SIGF2= 0
##$SINO= 400
##$SIOLD= 32768
##$SPECTYP= <>
##$SREGLST= <1H.CDCl3>
##$SSB= 0
##$STSI= 32768
##$STSR= 0
##$SW_p= 8223.68421052631
##$SYMM= 0
##$S_DEV= 0
##$TDeff= 65536
##$TDoff= 0
##$TI= <>
##$TILT= no
##$TM1= 0
##$TM2= 0
##$TOPLEV= 0
##$USERP1= <user>
##$USERP2= <user>
##$USERP3= <user>
##$USERP4= <user>
##$USERP5= <user>
##$WDW= 1
##$XDIM= 32768
##$YMAX_p= 447455664
##$YMIN_p= -703104
##$CURPLOT= <Network HP LaserJet P1505>
##$CURPRIN= <$Network HP LaserJet P1505>
##$DFORMAT= <normdp>
##$LAYOUT= <+/1D_H.xwp>
##$LFORMAT= <normlp>
##$PFORMAT= <normpl>
##$SURQMSG= 1
$$ End of Bruker specific parameters
$$ ---------------------------------
##NTUPLES= NMR SPECTRUM
##VAR_NAME=  FREQUENCY,     SPECTRUM/REAL,   SPECTRUM/IMAG
##SYMBOL=    X,             R,               I
##VAR_TYPE=  INDEPENDENT,   DEPENDENT,       DEPENDENT
##VAR_FORM=  AFFN,          ASDF,            ASDF
##VAR_DIM=   32768,         32768,           32768
##UNITS=     HZ,            ARBITRARY UNITS, ARBITRARY UNITS
##FACTOR=    0.250966925370066, 1,           1
##FIRST=     8223.43324360094, 38671,        -60159
##LAST=      0,             97655,           -277061
##MIN=       0,             -703104,         0
##MAX=       8223.43324360094, 447455664,    0
$$ Real data points
##PAGE= N=1
##DATA TABLE= (X++(R..R)), XYDATA
$$ [...]
23745 -23698 -28445 -91727 -30221 -161313 30396 165867 -202415 -108137 -116082 17086 204128
23734 204128 191317 -22869 -8389 -94703 -372541 -69514 188109 50261 11273 50227 -118279
23722 -176733 -63995 75135 -272323 -29431 16457 -173491 33047 520956 -91773 -20446 11034
23710 -46901 103438 -103738 95273 78393 -103570 -140547 -367330 31909 -123633 -129043 90844
23698 146439 11625 -98129 308610 -57570 -93213 -182400 -132147 320447 -201794 -220335 127762
23686 269238 -23765 -37614 1267 -143379 -156993 -57821 -23163 135719 -180058 -88993 44351
23674 38231 241436 144350 -1126 172014 -155628 -284466 -95227 -314398 -193894 -208264 -233042
23663 -233042 -99732 -166238 160444 131304 229379 120702 -91173 -2377 -60563 299179 103779
23651 303440 20465 -433034 253172 2917 147948 71630 183392 -59993 147324 -151556
23640 -111976 250099 -228134 -225386 -142305 -66501 -118269 8880 -1611 28757 -48708 72610 -475833
23627 104047 52993 194317 -168931 290638 63855 -215491 -187188 -168983 -180011 -189337 -216440
23616 -216440 -505933 -43609 269070 215520 -36015 -311291 -96924 -36385 -65325 -180884 99637
23604 -3106 -28724 -46323 -15596 12488 -225933 -5264 11754 -208803 173645 -106443 -347860
23593 -347860 -62776 -162656 -139663 382057 78540 -262968 -292405 286185 -44258 398775 -52712
23581 370475 310128 421071 157460 105141 142073 237986 133971 491255 -232907 -102358
23570 -276446 -129617 -64584 18797 -48708 -279754 -202338 130006 122623 52421 69265 107815
23559 107815 248407 78994 -31766 175557 225944 473 -9277 330042 235267 -204938 -68879
23547 -128383 -182298 -327469 -116449 -125336 -163249 30167 -26692 197805 -286979 -178318 -308064
23536 -308064 109488 36857 -150655 112034 -61876 44462 93085 -157682 -78654 -10287 -70154
23525 -70154 -421891 -23496 165151 -182013 -29240 -139436 -82607 -177208 -78233 55370 -115440
23513 -37931 -92936 -63539 -195491 -349419 -135875 309833 132331 -20945 -202699 -200384 262517
23501 -261453 -34430 -49164 26154 -143207 -26189 -181220 4641 -18877 -275128 -190682 -126417
23490 -126417 18966 -421083 155937 56327 59902 134789 160539 116094 -197388 -114600 -164844
23479 -164844 208840 206739 153554 -97248 -206768 -83375 -164793 117198 -42143 -181792 96431
23467 -29464 190094 92715 80746 -185936 144690 -216494 548 -114871 -3851 -106169 -126931
23456 -126931 -160527 60710 -67879 -54066 76418 -119475 -253708 54756 28843 214805 -153843
23444 59199 -108188 -117985 -125867 911 75096 261935 29292 -88828 -53614 157268 -89159 272394
23431 -58928 -82943 -84915 -41922 165599 -63933 -307443 88345 -33862 30046 -218354 -300421
23420 -300421 -214126 -72038 -122399 -206784 134065 -57214 -511280 -259942 112976 -68227 -9832
23408 86369 -378274 -119768 186908 -166540 -187522 230461 -96710 -206542 21095 272107
23398 272107 -28421 15445 -337538 -267123 -103862 -115233 16981 -335855 295989 156198
23388 156198 -55063 -8279 87487 116274 302963 -313785 -135868 48101 197568 265711 -33457
23376 -371904 -517669 -14824 -131981 -182796 -154119 246885 195554 126012 57912 84733 -333810
23364 -251353 -109040 225248 -111194 -96905 14077 51420 19681 -20701 -66033 147325 -86472
23352 -115384 -192558 24726 158436 34873 79417 -223871 284272 66684 -282941 94074 26934
23340 185921 -102579 -3283 114778 -250467 -141766 131080 -218179 -228221 162817 -102271
23329 36262 78594 -189818 -212892 -170279 -179679 -277817 38641 -142239 7093 35847 -199143
23317 -119389 -189079 -110726 8015 -167231 -120096 -19069 413885 86788 -172081 -65029 -132173
23306 -132173 -103112 255707 -389478 97169 88080 107639 103259 27900 44943 -59864 -241876
23295 -241876 235555 383714 44580 282597 -302627 -83580 -159086 106575 -15318 25462
23284 196221 131423 -145469 75216 -167484 -151701 32784 -111156 104399 128043 62928 -122615
23272 -120036 -50053 215169 -174516 -2741 -220753 -27433 78543 -47093 -54220 -196993 -169189
23261 -169189 -85013 47661 -62139 31873 -366704 244519 -191032 -300781 -82178 95343 -231930
23249 301832 -7590 -169378 -268221 -165197 178054 -53962 17840 142437 -55227 -108207 -355225
23238 -355225 -125199 -216997 -42452 -107670 237960 -60949 198257 10706 89741 -64718 -120042
23227 -120042 65631 -347852 269973 -72162 -123325 -57463 112369 2936 -6232 180896 -159393
23215 138308 158829 -215784 -283123 132700 -14508 154879 -140050 100058 -173045 61629
23204 -318725 111840 -13202 246244 -110986 59395 387316 -6763 47051 115016 -328683 2227
23192 -220921 127897 -330586 216851 -16623 -249962 -233462 87436 304755 -59522 3756 -134334
23180 394014 -141399 211159 101828 -23823 -51363 -347424 -116686 215206 -215913 40339
23169 -28637 13875 50909 10132 -54731 261663 29541 -277501 -81385 -80213 77875 -117305
23157 14343 -146948 49453 -78438 91520 -18109 -132433 147743 -3849 -44315 -62307 -205480
23146 -205480 -10682 -126547 56126 -110566 -102864 47341 66762 79199 -99765 95732 -35839
23134 -100415 -193662 232031 -44820 257342 243229 48111 56383 68991 -262087 193390 -148824
23122 -33044 -68456 -154867 -305497 169314 -84403 -54534 138616 208197 -463412 253616 -19077
23110 257988 287748 -206627 27113 51663 202451 -209031 185866 72237 -81318 102880
23099 136924 87547 218624 119281 42642 47994 169282 -162222 -295430 100260 318028
23089 318028 42827 189803 234421 31150 -139807 14010 50294 45458 -149606 -354566 -92751
23077 -4978 -128867 -198586 207488 62551 -358623 146279 -258558 252825 -159178 -219533
23067 -219533 -250825 -258223 -5350 46546 69972 -242056 23471 116031 131104 45488 264519
23056 264519 240543 98011 91493 105161 -223939 280074 279222 -137574 48002 -91599 54653
23044 -15227 10428 134134 13240 -30550 130400 -396049 -228427 209396 128106 7778 33670
23033 33670 161171 -123205 -23226 46139 262515 -36827 150282 103310 -63053 184520 245764
23022 245764 173208 -362869 397015 52427 76594 -64561 -185366 -172921 -302611 6919 -160452
23010 -152303 32314 -245936 137410 -402585 126507 995 215956 -165142 -123178 14769 -7480
22998 -97359 -41947 -74109 65384 -88514 218524 -123780 -64756 -32610 56200 126018 -189666
22986 -55350 255087 24719 -241832 -225421 -47321 221646 -174454 -57974 -265874 -22717 -212373
22975 -212373 -231668 -209895 -155565 29371 -236212 -135953 79105 -483828 -174627 467139
22964 34725 -318808 29728 50279 -73415 -58436 -96021 36375 -54747 223406 44481 -109216
22952 -102013 -1541 -21581 -140543 -75882 74506 121669 -130050 55297 198642 -139157 -186107
22941 -186107 -16948 78750 -344914 60639 -162686 -138045 -242448 -135710 -248570 62314
22930 -87107 -45845 -127102 204249 -84540 -59444 19142 94365 116134 110919 31207 170885
22919 170885 -33037 276453 -377502 -334828 79579 -104748 -254366 -5489 12804 73728 -66125
22907 -64598 -98516 -220003 -40322 -115978 -96894 229153 -310971 -1116 270649 -355571 -79156
22895 110908 349289 18554 -72633 -2371 110290 -477072 -221260 79180 169472 187302 382644
22884 382644 209233 -219399 -243803 94215 -175647 48542 -167666 132518 -63824 -431705
22874 -431705 -181467 -66566 -46197 128300 184224 17621 -706 -97659 164657 50822 -164775
22862 -180051 -69434 -37268 -147557 -73232 397102 62764 -76401 190793 143800 -29661 -316372
22851 -316372 -40280 37170 -78744 279799 -92928 152707 87459 -65992 -130828 -105086 -143498
22840 -143498 -413333 7313 23014 -84984 -182622 59015 186529 -42541 -67743 31393 149134
22829 149134 -216543 -86594 -255222 -66160 -141330 -65058 188554 -203421 14572 186032
22819 186032 -76620 -18457 -226698 -12912 11752 -156576 -60609 156889 -299031 -61185 163858
22807 -169721 -154608 -128685 139312 -36613 47453 32131 86329 -190974 -500561 -492874 41858
22795 197243 78082 80526 -71766 353459 65455 -208366 -81921 -125143 94822 3228 83008
22784 83008 89969 -115462 276662 7666 -304464 -94241 -132800 -258791 -196598 23858 45258
22773 45258 -58610 -32689 -147900 210789 28690 -307231 -184452 -32004 -154127 -86359 -240259
22762 -240259 77564 16156 -21169 158431 128460 -129293 198328 -81237 28866 165531 -145536
22750 -177025 -106512 -306613 -82091 -193745 -72830 40747 61314 38927 173080 20144 -153003
22738 -262656 -57852 -281061 -145112 140619 -106292 -115532 -103795 -176836 62024 -179907 158454
22726 -371472 38943 29121 -102226 -21008 -104633 448449 63852 168694 13476 134529 -104255
22714 -45500 279948 38830 183614 78241 -239722 -135806 -199891 -97074 -72479 186729 -170655
22702 192635 -196629 -37764 54943 -153235 -159314 -32508 -31659 36451 210410 -210818 -75912
22690 -29431 28063 -338318 -102328 119536 -180035 23286 -153375 -29435 17283 -243958
22679 100412 363976 69651 -226471 15787 -6248 -57424 -90177 45728 -79390 103929 -85605
22667 -252052 -43078 138730 -137157 -4796 198450 28563 27243 -166375 80353 -88438 -65857
22656 -65857 26079 -205029 83369 41254 -22031 65490 -129659 -131517 161307 -201895 11557
22644 -218697 -96127 -222436 250626 -130242 104106 -18413 -83581 -205674 171787 -122051
22633 49293 53554 -29182 -205171 357395 -10230 260754 -219496 76379 -179974 -262830 -169407
22622 -169407 -80359 80473 327723 -133514 101016 -185437 -230500 39198 -10957 289398
22611 -29588 -145006 -78616 22699 -148451 -77502 -143944 172983 271507 292926 663 1771 -262509
22598 -408066 76386 -69492 303113 5463 -219007 31389 276352 -75503 87879 136238 28664
22586 -150224 -176248 -89720 -301349 229969 -75935 -102300 -107038 15858 201978 -304565 -138724
22574 -256051 -16046 -60938 120357 -234723 -44678 -145736 -308058 -176872 9433 -87527 227970
22562 -102735 -1138 48438 152141 -24183 -236320 -112599 -230601 -11577 -26039 -130678 -37545
22550 161512 -31513 161842 -152758 -119962 145712 -2844 -184492 -113229 146445 -272924
22539 -184949 134372 70552 116515 -68783 -183055 -347750 -197501 -162053 -82759 -40515 -11229
22527 -125143 -33008 42973 17694 62128 149596 -106392 -34930 247033 -33420 -27432 -89904
22516 -89904 -43074 -200354 20055 35002 46906 -65959 105548 -113264 76906 -328449 49248
22504 -214113 -119292 -73604 -411233 -188058 -239823 342750 -382176 364616 -118516 -213388
22494 -213388 -332421 -977 -210751 -314170 -47105 117370 4793 -246922 -248446 -262758 -150191
22483 -150191 -54298 18729 -471768 28793 -261274 129341 62645 -256447 -137378 76676
22472 -185032 -35306 50837 106945 85416 48781 132233 -84775 48709 -88874 -129836 205054
22460 -294648 85459 491675 -34127 -106998 -87795 169941 -64337 26311 -160252 -58338 79530
22448 119317 1266 -41216 -132574 -427358 -234620 -160483 39487 -121521 -110520 -81230 -270327
22437 -270327 -160091 50590 -276968 -178759 -73610 -22824 -123813 -214447 141458 52654 281514
22426 281514 -260473 -146811 153412 -122980 -85349 140392 -16441 52553 220128 104290
22415 -1736 67563 -240337 107322 -107410 -67713 -18506 -61403 12493 194727 -244113 319761
22403 -141493 -80817 -114152 146565 239673 -387090 -15313 -237786 60146 -78901 126682 9414
22391 -134697 -88143 -105408 -31680 -335002 152630 -114425 11662 -392829 145009 -137613
22380 -146334 91220 -47956 147185 73743 -7205 40698 30304 -170392 98080 -285565 -3767
22368 283305 -113889 -103040 -68048 -5184 -424863 117 -118342 -111931 143719 1892 -105269
22356 -81811 -89165 191250 1236 87985 159057 -129610 -235684 61385 75958 21509 -73150
22344 -18154 -260013 -224048 -204820 -51378 97223 -151148 -224510 181187 9844 -42196 -106886
22333 -106886 -149497 -28623 144295 304234 -89740 -57894 166512 72756 84870 105908 -71318
22321 102525 37161 -214471 -179335 -42576 141642 -95579 277407 -250086 11023 43710 -64253
22309 -200650 22473 -86727 -163972 -476854 4254 -260317 238563 -27206 67892 -163400 137103
22297 -190726 -155993 101927 221143 -339296 -180587 273648 -356549 10433 213912 396604
22287 396604 -277451 154710 246585 185408 69913 162127 -134373 53112 -125605 -46840 -129216
22276 -129216 4870 124163 -138762 119918 -4406 -253052 -47605 -113892 -374710 242995 -287423
22264 -39536 3910 -229312 -39629 -96314 14537 335941 -68604 134380 -110490 -279887 88722
22252 138542 -52458 -336786 -125217 384144 -22330 -11154 -439122 -145401 74981 -30756
22241 -497044 -73874 -112984 -24835 131933 -38346 132893 -76360 -269136 -20593 65099 406634
22230 406634 -344216 -209626 -176020 -43920 -92371 -83366 205872 154674 -53210 -74397 55679
22218 -58877 52443 -193411 -422522 -249377 382495 -501700 -218044 -50087 -240103 163460
22207 -42491 -90300 42273 40184 -162274 -268188 -45323 58006 -17956 196231 -237079 27381
22195 -40538 -210166 -377293 97061 -79537 -311962 174896 26440 265995 186337 99493 -59747
22183 -209353 -202055 -187745 184054 271020 -309678 -181545 333052 -154799 -117070 -186402 -41774
22171 -220245 -191873 -185554 -213100 51706 -76862 -120298 -370073 3302 -341288 -374670 -168356
22159 -260403 -159569 33789 -37035 -115379 -99283 50372 -199594 -106350 -130479 -368670 286170
22147 -242184 -6189 -10011 -60659 90114 -45827 -61915 -26906 232900 -173003 -120910 -110675
22136 -110675 -253476 13120 -170636 -59400 -154068 -275870 269270 -28217 -16768 -120864
22126 -120864 65623 -78838 -11963 -46708 -201114 -16099 -111299 149501 -193024 51908 -76193
22114 331210 49196 195921 -240281 193820 -89845 -149398 204685 -375929 -247905 -239008
22104 -239008 -207664 -85712 5542 137549 -21993 -47836 172852 45932 7926 136240 88592
22093 88592 -141284 116731 -336130 110274 -94489 -3539 -257080 -136946 -65463 -249803
22083 -249803 6025 16554 -19709 -156138 -31589 188715 101660 -164004 -33772 72427 80585
22072 80585 -289310 -59047 355265 -224651 74783 -53933 -132298 -255565 12462 -27070 -119441
22061 -119441 -85283 49776 -50251 177602 -324260 169754 118174 -45423 149431 342685
22051 342685 77800 -10779 -103736 -93844 -94407 8502 -110835 146044 -119316 -17950 255256
22039 -56104 160185 84438 -110373 -102906 -105508 -33768 -50085 -144781 119121 236733 -156847
22027 -94192 115791 -94668 -197621 -218904 -132605 107569 -41030 152327 -31265 1375 1415 -74510
22014 -217736 202825 208561 270564 -392197 39476 20849 33034 177884 -17883 -80779 -137372
22003 -137372 -87719 138065 390908 -41823 -224028 -140868 -417935 96004 25369 63708 -222937
21991 -24664 169496 -309332 -279600 -98739 -287128 8821 -150295 -11550 139841 -151443 -49714
21979 -322945 80018 -426616 157220 26208 -16361 -283422 -27236 118257 52346 -23360 28963
21967 89451 -300042 30964 81469 -101693 -419598 -9057 -192113 -222853 172731 -57810 -230000
21956 -230000 -102736 205817 -131521 89989 -351290 -68551 -308296 136597 7154 125850
21946 125850 -159911 -155113 177088 -150685 -368920 149534 -268424 -2237 210303 -107763
21935 -103117 12556 -244235 31987 112037 -300588 -141687 -123015 -145458 -190261 -167809 -83798
21923 -26398 -354066 148857 67522 -300835 244241 109037 229776 -207098 -180241 -9127
21912 74733 235035 -267001 -197672 -37478 279785 -71945 -135038 65935 183939 177534 120975
21901 120975 -284361 -314597 -47314 -291315 8762 74872 24982 -81144 -56107 -264043 89832
21889 -73954 -119589 -162419 9221 71736 40377 393852 128136 168806 12268 -117038 -32930
21877 33973 -182150 -151267 -94465 -32423 213194 -60 7680 173445 -313772 -135624 149176
21865 -280652 -51245 -7040 44845 -321728 -45486 -364630 -78946 48467 -263925 -96460 82769
21853 246512 90525 69114 14603 -25397 -114027 96851 -134902 -202549 -120461 -72869 -193283
21842 -193283 159532 -180721 141345 -203460 -155591 192707 -271067 16026 -169484 -51987
21831 -149775 -127538 139643 -225391 37962 182682 -192884 -46352 138892 -169199 58035
21820 -305667 -55601 -405585 192637 -63948 107276 102806 132209 85263 -90202 135058 20878
21808 -90615 -30430 144784 95099 -249715 -40825 -19274 -93477 52547 28752 -45977 -121256
21797 -121256 -259751 -72208 95131 67697 -133518 123873 153495 220841 -130029 -46928 -65369
21786 -65369 -16995 318117 -32093 -181874 -133643 -138438 240787 -199724 175711 -213279 370189
21774 9873 92747 184102 61134 257847 122549 123141 265786 28678 38179 -207968 227076
21762 -17617 129368 13595 -67936 90105 234009 -75853 58614 -257279 -161732 -248567 124965
21750 -185672 72246 -321581 -259331 102638 -129913 48090 -314143 -199130 -426979 -237775
21740 -237775 88268 98752 -101329 190287 46755 169983 -175974 4517 -90837 -117411 -542512
21729 -542512 -123343 -257943 -26028 -94176 160031 -6315 45623 130591 -69528 -140231 -80171
21718 -80171 -109443 90423 182142 336945 205695 -55951 253268 25976 128821 -143966 -91691
21707 -91691 -16359 -135209 -305139 -55504 -413798 -4868 168757 -58984 -267025 -211607 3145
21695 -6948 -7238 37081 44273 -145506 -121340 69791 109373 16194 -235713 6760 -121081 62412
21682 -197941 178524 97910 463687 -120369 11690 165478 223124 -219563 245034 -53275
21671 -186296 -89538 -219529 -143843 16142 -225168 115205 -44548 133047 -310282 -81780
21660 239807 -286499 11263 -109890 -422655 78827 -91124 207778 -330145 3341 -166066
21649 80514 -44284 -163214 -305902 -273194 -346729 91394 -192905 281240 -57536 -202816 -232508
21638 -232508 -325563 209662 -44781 113611 -132115 -9288 21937 -232447 -82183 21823 -84194
21626 -88852 -57010 139492 155139 -244992 -124834 287993 -68416 107880 -516688 -119181
21615 -5877 275571 134025 251819 -102811 -154353 169883 -94413 23098 122007 -14303 -425412
21604 -425412 98714 -39341 33303 -280738 314566 -77987 -183713 70652 124317 -201175 -276434
21593 -276434 -156599 -95716 -150013 -68443 17532 200847 -75534 -24612 235923 -139418 -132379
21582 -132379 165708 48811 -173855 -32324 -253722 -36737 -57257 -305778 -143285 69825
21571 207222 72097 8976 83872 -271230 -66202 166785 24589 -39135 -86838 -306043 -159685
21560 -159685 -191746 56925 217431 67686 323632 -275248 21844 -303657 -131777 67811
21549 -138860 -79744 -185030 -11396 70627 258623 366616 7312 -90670 98936 19918 52795
21538 52795 -365640 -305853 -16956 -306140 -79368 56466 -83729 -193873 -82079 106704 -286405
21526 102326 -214983 -40545 -81106 -79788 -139401 -55111 22001 107107 22789 -230720 97718
21514 -74411 13422 -47501 -264697 143628 -251216 454629 221646 98664 76626 -110629
21503 -242155 194481 105497 -279091 -151111 -66322 -314546 50091 -38082 27079 29253 195710
21492 195710 35326 -123885 -179708 -9020 -97695 -274004 45304 -54064 -26495 -128069 -180193
21481 -180193 -132348 11327 161759 53460 -216536 -84493 305814 206396 -34944 13694 56802
21470 56802 -351730 203630 -3176 16547 75732 30892 -363622 175161 97268 -283915 -125562
21458 -45675 -257318 -140999 -10665 -134526 115357 115182 -63157 52912 8044 6024 552559
21447 552559 109158 186855 690694 226236 399561 560765 520441 179754 342885 187158
21437 187158 361895 -47140 89283 -345236 -167957 -180751 60164 154213 -61767 159162 2145
21425 199352 -218835 310307 -198052 89340 -172404 -228095 -74378 11974 -20638 3696 -243356
21413 38547 -107379 69498 -104215 -145531 -116503 -301644 21237 -39804 -98607 30511 100750
21402 100750 -123643 -148587 -181576 -55867 -114744 -30557 -485208 48534 -191089 46149 5301
21390 -29262 71230 -142886 -142189 -327888 -46069 149055 -124131 -193876 -255160 -226200 -72535
21378 -124728 -75108 -102901 112725 -130198 -80380 -108924 10853 1703 -41669 -176369 -246224
21367 -246224 -51545 -312913 -188 60468 282427 -139482 -207171 42036 150530 115457 144908
21356 144908 -331107 192777 -18636 34767 -401876 -109719 -60551 151413 -204325 -72329
21345 131210 264924 -23982 -138626 -255745 -76634 43685 84913 -127975 65393 28769 -30486
21333 -259984 -226439 69862 210918 170664 36129 130931 -89593 -302833 -66246 -55176 -354485
21322 -354485 5030 540763 268500 -212310 -11204 133362 -240638 -98318 -344635 -78875
21311 78891 -126710 42577 -194241 15023 -267467 167909 -121090 22324 -321957 324 21870
21300 21870 -94889 83803 157223 -201899 -401132 -182100 -290900 -34406 -175617 139350
21289 -378837 1531 -353732 298340 -254441 -97303 -4350 -114793 -163213 39269 -171948 -191860
21278 -191860 243489 -98573 71139 147760 -243742 -30421 108519 -57660 -184243 -200940 49543
21266 -81581 -207338 -308018 96137 -90609 375419 138264 -162638 394956 39683 -111440
21255 -136950 203210 144423 -19065 -139999 119513 236823 -57551 -172663 50721 95150
21245 95150 44166 -63557 -253891 -131269 169975 230967 45410 -198114 -99169 142278 -428173
21233 210076 -136538 139965 -291095 218499 -313014 -33581 1929 213038 -19355 -30477
21223 -30477 -43206 -29684 60577 -228371 -178757 270686 -19502 -150297 -65403 -135213 -391356
21212 -391356 -217556 -9058 -116417 -134885 164105 74322 -244666 20933 -15226 -78885 -160004
21201 -160004 -237107 -305428 -98784 -321036 36387 14604 -35142 235469 -226102 -136315 130989
21189 -51122 100767 158123 -230338 -107199 208277 -113259 -57004 -78648 92241 -272036
21178 188393 11531 117068 -108835 46003 32034 -64474 -154664 -189919 -59726 -141222 -20197
21166 164050 -303377 -153894 -32660 -68498 275101 264453 -136911 -208506 -25702 219370
21155 -5695 243397 -118694 23457 -231954 27726 257782 157510 -200148 -250160 -74412 -142286
21144 -142286 26416 74585 -274131 86349 -68431 -251702 35002 -128424 -381810 33034 -459387
21132 -117257 -305287 -71634 -113086 -380196 -178502 -237225 -32287 -48131 -167056 119588
21121 -231184 -58512 276655 110965 -12893 -14576 -117625 -131285 -191607 -235254 44856 220799
21110 220799 -239168 258792 -119068 -2020 -188309 90426 -12568 129722 234534 -271878
21099 -104265 -137652 -189015 219756 200962 331195 25772 -117201 -155967 -315137 51839 -35364
21087 -9925 33437 -87883 -36978 190916 61966 -72312 16186 -44429 156649 -470998 180836
21075 117353 -8778 -145972 -76531 -192152 1777 -174312 161079 -261398 10045 -141561 94474
21063 -327592 -169019 287842 130164 41610 -106513 202855 318115 -356987 -72101 -267203
21053 -267203 114525 56169 -227631 9220 -225176 -183527 559 56865 -77475 17873 -46584
21041 -145021 -56149 -130249 -198569 -124821 319738 59803 -258969 -35400 43243 -359561 -72507
21029 215446 -146738 79216 -288790 197441 -208407 -94097 -36384 -339481 -44698 -12832
21018 -161336 112975 221504 -142760 -152255 -162863 51263 -95940 106327 -196027 122996
21007 255433 -252419 173033 -54697 285939 6932 33096 249718 434898 104304 40461
20996 -184388 -355140 -242638 -111041 -94736 -95711 -102205 -99134 -213513 -356681 -6668 -270985
20985 -270985 -194213 323979 92112 -437243 -226953 -378590 185343 -1793 -175918 15309
20974 -17988 101612 51998 230594 41900 -242889 -116075 -329468 118098 -77051 236890
20963 -96650 -171272 115082 -403745 -278045 -101524 58266 -289164 159036 -200900 -10538
20952 189688 -223334 -222062 256571 116477 77697 -10853 -37687 -201036 -21433 -256809 60581
20940 -107206 124087 -175193 244979 433464 15560 346312 -67634 -840 -140318 17693 -19944
20928 -118481 131248 -198981 172402 -293136 142382 238667 -247727 97478 -170758 -175094
20918 -175094 162791 299129 -21597 172694 -87082 -82590 254283 -111546 138013 -56845
20907 168241 5674 -414563 -262787 -140289 -119916 -30014 -33827 -30044 33338 30523 -213538
20895 268852 -295313 38814 16694 48032 -175860 -74477 -170657 136652 79530 -181379 -213849
20884 -213849 -44826 -198694 51960 38274 116943 86170 -313095 -402895 -403584 -183469 180884
20872 -179059 78094 -168065 -19432 199602 -168280 -151857 -21274 -208500 -298374 -179953
20862 -179953 -93092 89490 206242 80668 -233605 -202490 -69228 -283648 -83096 -425444 -25620
20850 94922 7057 241241 103882 37729 182805 -200130 179117 1686 99514 -39328 -9267
20838 71008 -469974 -330196 134961 67929 -79324 -92698 -85098 -160056 -154358 79486 191126
20827 191126 -412145 -9043 9833 253089 -119538 -144672 45941 -11697 -11973 -256388 71836
20815 34243 -235232 -4344 -110807 -200743 -349940 23371 -312626 38395 -26772 -238890 -101307
20803 13345 -22868 -93127 -146000 -45727 -144145 62714 191654 -278746 89575 187105 -253910
20791 -332164 -17633 -111841 144533 -140980 -157439 59620 296491 23875 -340466 -146591
20780 -41383 -81858 307352 98950 -126487 -231102 -59082 34795 -33361 -25664 -87292 14080
20768 269109 -85201 136594 -324231 191514 -426255 438662 -170241 -100760 -129351 -148573
20758 -148573 -130275 -94253 -127856 -307493 -97488 152563 -30515 -38523 -222177 -296739 -15347
20746 -78746 -47427 -66233 -325380 -306003 -239742 -308554 150398 -25956 -182544 -71372 -79517
20735 -79517 -223445 -407840 23803 -1342 179433 -124741 -187031 -112800 -135980 93921 -142971
20723 -261583 -82666 -225654 -196272 -26530 90245 -176604 -118582 -298007 158672 110401 -5394
20711 -19537 -205506 20612 30064 70231 -315023 -233862 -304745 53644 8487 -55927 -83583 253733
20698 -71388 204990 54880 167412 -137123 170118 -128538 -124907 -133300 69350 -164306 309859
20686 -92107 -65225 -7600 118703 -432852 -67919 -216396 331804 -266988 -295236 467795 -192259
20674 24194 90695 -167018 142269 87750 -28742 221320 -26847 29931 -40678 -88277 -325090
20663 -325090 -42750 49178 -229046 -62581 -64527 -398209 -214786 110172 -168586 88953 -196510
20651 -56663 -317994 140615 -171818 -26206 -280681 18963 -236870 -60564 -158089 -84720 105058
20639 4300 163221 46136 -292626 -123670 12654 -54917 -66221 128242 16355 -148884 157194
20627 -24295 -238629 -206372 39180 413818 -315775 -238340 195830 -130638 -121571 204416 -184669
20615 79001 -8903 -310443 181363 -331669 4948 -167455 -351786 -57020 22085 117613 -78280
20603 -15085 16426 -52817 -173271 -169301 -231262 49868 269966 -105848 -191582 -29589 423620
20591 295463 -112243 -61019 303927 147328 181329 97827 260776 124941 -177840 277060
20580 -176047 151433 74526 363999 -113464 -88840 -69473 -209602 -348077 -119884 -37322
20569 -242975 179002 -59556 -67404 -54750 -84526 -28219 -107009 -24492 69621 -25632 152396
20557 -161995 57486 -91829 50902 -605374 -86676 -192478 -59570 -130701 -47331 -28643 -231711
20546 -231711 -59494 -44536 -292681 -186747 -135618 149850 81758 -381311 -25466 -48016 -112526
20535 -112526 -147006 -291664 -31149 -268052 19852 276721 -238674 227789 -39462 -297856
20525 -297856 -50589 -178682 37694 71683 -387266 38960 -72630 -124999 278056 121676 117581
20514 117581 115178 397133 -435975 -124478 -17735 -325978 -306764 -56855 227128 -27882 221445
20502 -102688 -200219 97329 340583 -466676 -174781 176104 -279198 269 -115101 288380
20491 28001 -230629 1854 -64625 -285834 -25777 -229463 -283454 -27416 89860 150586 -106958
20479 22435 62094 -197008 278257 182162 4557 -483693 -120443 -144374 218143 -67178 235333
20467 -194891 -18826 186367 -101178 -268861 125588 -158199 -296218 199600 -311742 -620
20456 -302065 -267030 -98090 -286034 -116880 47844 -115641 -138998 -4618 149268 -33909 81674
20444 -106448 144991 -412122 -84456 37334 -218881 -437431 -54670 56691 85567 -227869
20433 208536 221872 233262 -300048 208043 -171203 99386 -9822 -189583 -187713 -235046 -26972
20421 -64326 149690 -51460 -100100 -82087 -348675 166744 -60849 439072 265048 -158171
20410 -279814 29096 14809 198231 -36418 73497 107455 7835 -58901 207665 15282 -106492
20398 153878 -118446 142918 -210910 -69652 -305274 -257030 -320125 -414532 -181659 -109759
20388 -109759 -176110 -115990 -106349 -33153 -148916 -271169 -85920 32996 -163563 219129 215812
20377 215812 -104391 -2795 -145050 198350 -17588 185232 -334481 -38942 -453627 271626
20366 79222 29940 -45721 -375616 -47804 -130360 -77769 216485 236063 133609 -321013 122862
20354 -176046 -181650 -120987 -94367 -168380 -368047 -106436 125753 166450 160621 -162165 -13370
20342 394073 10624 -171467 75312 -150200 93020 -52561 43449 280155 46282 -247175 -57953
20330 -116334 -41428 -212281 40651 -52769 111955 59865 285514 18690 78607 -305418 61426
20318 -293021 -90870 19345 -129162 29761 2961 -109669 5730 191988 -526470 -11497 115215
20306 -45629 -64163 -128247 -111225 -170195 -28498 -301230 -98637 -43368 -344214 -79833 36918
20294 -221182 50700 60654 -97081 -14958 173654 351256 14101 -43633 -35117 91737 -166759
20282 -118612 -275827 -87117 18467 126273 97188 -152223 -182702 -183135 -1759 -53163 313322
20270 -256819 71004 -166713 -206194 -185131 -173970 -292604 -8454 366758 -137157 -97721 -401999
20259 -401999 -27914 89047 -87962 -55967 -110770 -177983 -222305 41635 86193 -118027 7240
20247 -335278 380271 112393 261622 -223 100245 -290016 -199004 93946 95164 -116728 -88049
20236 -88049 -380236 174067 -13836 57764 153930 -248308 -211326 -163399 -110267 25796 -80288
20224 -114853 -48430 -39606 204764 -64111 -278071 147095 125963 -246220 54062 -18142 3028
20212 -107372 43215 -136934 102883 -390068 190470 -146546 85244 11496 -2156 481160
20201 341261 -39445 -395663 69121 -304020 -172966 -410251 -42564 -129248 -7265 23713 -178295
20189 -182637 -362394 -111556 -218864 420078 177573 -128711 100759 -4912 -160369 -265225
20179 -265225 -48983 -33890 257632 -3792 -118363 -144833 -67157 226608 -251198 192197 -148971
20167 -302561 -210827 -290887 -132126 -86460 -52893 69479 284579 -34099 -345311 97151 273235
20156 273235 -22957 -113466 83504 -103796 371781 191562 343812 256900 195728 138359 -112061
20144 305191 204367 30233 93216 339568 -185634 -225274 132145 -129744 52282 -158628
20133 147945 352290 -256316 132031 -246396 -209509 -16071 131326 -221299 42643 16743
20122 -53225 294433 -374855 -11550 -187063 -49327 129240 -65080 235298 -302598 27419
20111 -373210 19424 -118425 -386054 -224697 -248747 202919 -158938 161144 -57945 125835
20100 105949 -265083 91222 275134 -159821 -107627 45476 98061 -244583 -53269 -129748 237369
20088 -194697 8166 73416 -206830 20622 250952 -48718 -152682 92201 -125270 -41995 -358169
20077 -358169 12997 -20184 -410464 -25760 -136922 -111267 -49094 -369334 -194807 -4025 -317366
20066 -317366 -9192 205321 -104142 1440 -111586 -286422 86770 28349 -170353 182571 -216148
20054 -247515 -256334 -188566 193730 -148658 45012 -161064 181952 -71930 -106242 -45943 -126250
20043 -126250 -45185 -97349 -224509 -226313 29909 91849 -89336 -3050 -67963 60982 -60943 -134979
20031 -134979 -66573 -120083 -295376 -296746 -124726 401204 218947 -304163 -125295 140739
20020 43589 11486 -67330 -322675 16764 -77110 -352070 156871 -360303 279083 -173874
20009 -82535 165981 -171148 -38314 -117343 155062 -277032 101322 8708 -50100 -259254 -146216
19998 -146216 -318058 -118577 -53205 -151547 395619 10614 255039 49685 355399 27965
19987 -327009 531428 -80692 437568 195126 -174216 -42440 67185 327394 7068 412157
19977 412157 -313029 -173742 17423 -289805 8479 114371 124458 109297 -100574 226970
19966 88115 -280933 179192 60331 11839 53173 55392 159041 -63208 -9259 30609 185782
19955 185782 -84998 346124 -46105 66398 158287 -98296 -283959 57162 -172278 61699 -171351
19943 -33217 -12580 -90885 -5198 253323 224182 37759 113899 -20311 -68003 26204 -522295
19931 -169745 -168882 -289079 262075 -38694 -197454 -393677 -56618 72054 63444 33614 294341
19920 294341 -489312 -41225 -18468 -133313 -21384 -87788 -196980 14611 -177565 -241031 38492
19908 -50865 -145411 -31305 46186 105069 -248123 -126927 -298986 -316865 175762 -122452 39035
19896 76467 -147323 -146160 -103283 -118762 -24901 6664 210668 -227865 -123561 51355 -299710
19884 53911 -165088 -170609 -56089 -283743 -130971 -67272 -88892 -94124 -138933 82665 400969
19873 400969 -28122 -507952 -45080 6736 -20279 107729 -288072 -98863 -82884 -107678 -272904
19862 -272904 -10908 -345777 -230332 -153818 -377832 -125843 -25744 177708 -116672 33979
19851 182627 -122444 -308256 -143989 -31964 66742 -90397 -129815 -187347 5401 -165357 9839
19839 -104961 -177840 -309641 -42900 -102951 41754 -53627 163222 -71453 172466 -129200 91817
19827 64806 -86304 10371 -377732 -16231 -52507 152831 92717 209273 69599 -41540 -108622
19816 -108622 -88435 -100233 45155 -262539 27983 181476 -220276 -284614 -220753 39365 -98705
19804 -148648 -6366 105504 161478 -169632 138146 193983 190453 90841 -288424 -287211 -50537
19792 -31747 28136 228970 -131725 -381509 -392837 -27386 -209296 -127460 20622 -55724 104562
19780 -395669 273976 -35548 176561 -166832 213701 107243 -194669 -167432 127717 184304
19770 184304 178747 -332986 -262121 -36960 15905 -203992 225372 -188953 -163900 -282389 -220275
19759 -220275 -131383 -97412 77227 -140949 1515 65625 -337735 199571 -149926 -74932 140586
19747 -52207 4091 224304 -151270 -33936 -242505 37577 -64473 68172 20100 -259284 -152211
19736 -152211 -186949 -85477 304530 359520 240891 169531 62797 -58348 64189 -124602 578216
19724 -99148 41268 -157654 -335631 -65486 -174167 211333 -14608 -92136 -100507 -162698 64341
19712 82461 109428 -215765 -171449 133018 -334025 40919 -43249 -75942 -39846 25194 120444
19701 120444 52035 463138 -30196 -87623 95439 205968 -148290 -137025 257505 47332 -181436
19689 -89601 -123848 -72408 -17178 -270740 -170915 -258235 -58404 -74541 58471 -138791 303423
19677 54405 14340 -285582 -101266 86103 -149854 -320298 -149863 164795 363132 -104733
19666 -5547 -146423 -119862 39392 25340 -99305 -114146 -4789 -121615 -274943 -4804 63948 -40406
19653 -304173 -140133 -177313 -122482 81343 -101476 46619 47139 -288371 -196708 -78103 -136027
19642 -136027 -199761 92948 57539 164807 18407 -170693 60575 -40700 -310439 84459 -235589
19630 -3109 100903 -235350 123768 -127285 -225782 -111388 207844 72914 -75984 -200815
19620 -200815 26216 -233459 -65249 -245506 -602 157100 -340278 118938 106542 103853 -5449
19608 26799 48131 -278107 -204635 -133940 31893 121464 151028 -189789 197168 -56898 24507
19596 5091 -33446 327534 13628 -128224 164175 199289 -212683 -165647 -21685 107169 -321348
19584 -193619 -477321 139938 -190653 271867 232767 -49000 175708 -362927 51077 194496
19574 194496 2641 -40866 -237202 -14624 302054 24256 -17196 -81292 -33861 -106184 -52855
19562 -91978 -231242 -108276 -228098 63240 -155248 -256786 37068 -145360 227482 -337693
19551 -34133 -17596 -104471 72585 97482 -8875 444245 -158159 -180826 -261614 -186620 98471
19539 -82062 -195593 166087 -175939 -200658 139543 221205 -63251 34968 155291 84229 -8484
19527 -233889 -232543 -7852 -72111 -175667 -12903 -14279 117496 -38952 -88515 -36787 37816 -72677
19514 168185 257941 11990 -237442 -194871 -58129 -299958 127250 -139623 147786 86426
19504 86426 -285955 78938 -230948 -211988 -65213 -229133 -271848 -106980 -193357 -29093 102576
19492 -46741 108575 -300259 -97222 -219510 -75663 139696 -170385 -115241 -257118 185084
19481 -230227 50971 96011 -143019 -178248 -164235 -139588 11210 -254629 -65686 -27036 -80785
19470 -80785 166954 -221871 -207156 -100844 -281911 197776 225721 -341832 250958 -173899
19459 3488 -396367 -281612 10712 -56573 -128711 -161079 -198559 337451 41793 -326660 -177901
19448 -177901 43598 -153485 -168217 92416 19706 -27480 64888 -215973 190096 59401 -76531
19436 -175097 288772 29697 -126404 -71210 11930 -47586 223995 181778 -170842 190518
19425 172071 -388796 -236983 -63124 80595 104324 -193157 1655 -304330 146053 -51923 62305
19413 -87456 -185715 180560 -95174 -3805 -27854 -644 -9525 -267949 -89502 -285759 118970 75453
19401 75453 -264100 -253842 -81447 -231251 -108871 99856 74391 271903 102899 -160909
19390 -210472 -244945 -11850 108523 -40186 271900 -145984 58180 152379 -107031 -38797 -100385
19379 -100385 -26816 -279418 -15622 -210512 -373662 68175 -34916 25386 -31557 102318 -232059
19367 -277903 150141 -545837 35486 -73423 -10319 -357067 -51978 74818 102487 -478105 -26529
19355 -196129 -23700 113456 101379 -351931 -167663 -176939 10141 -72291 -309220 -208472 -136288
19344 -136288 -94448 -62695 -142515 -236635 212924 -292869 131834 47114 -174605 269587
19333 -62629 116050 -184136 -501518 -132614 -142915 -354690 -85620 -2968 8835 11835 -252709
19321 19652 -439977 103535 -516 -6028 225859 9963 74627 129396 -20034 -229792 -307926 -304388
19309 -304388 145446 -191715 197165 -100985 64472 -410156 539 153933 -40374 178470
19298 -160571 81799 78775 4157 -7928 -251628 -135545 -74970 -101428 232377 -73174 232306
19286 -268758 133277 78324 -270807 -99444 -129430 -374841 -3737 83179 -168766 -49311 48012
19274 -211328 -21273 -102301 473742 -199289 107648 25022 -270046 -140308 45442 -290840
19263 -7648 -83922 302994 -59288 -256706 124440 281365 -134015 -87998 39033 -105530 -315039
19252 -315039 -97330 -56685 -134894 -102709 241814 -151604 -375717 51263 188278 108720 62302
19241 62302 21831 139385 67512 87452 -110457 -89615 115585 32203 -250517 -43674 -310701
19230 -310701 127357 3414 65251 -22575 13000 -52722 -169693 19980 130269 -71652 16599
19218 -78596 113378 1640 -53635 24809 -21314 -286437 -101445 -310571 -150092 -446297 -311123
19207 -311123 -381617 -99328 -61148 -241937 -43324 187146 -163126 205879 -112664 -49378
19196 -141083 -203930 -122429 -109018 -98414 -58359 -132159 285101 150447 -99288 463966 -223155
19184 -402378 131167 -70044 -143162 338791 -283235 -34402 -180749 120958 -147592 -129223
19174 -129223 -321779 -271798 137495 -92075 127066 -70250 -12808 -81810 -196282 -62178 -58779
19163 -58779 -130169 69002 -274100 -162246 221087 240647 94077 -99420 -234518 240607 -48029
19151 -155110 -165382 -131241 30139 -9934 -28340 -153268 -170564 -113644 -155794 141658 -199542
19139 -41382 4111 -99660 43902 -32245 -266250 -61789 -69702 -128912 -112434 -56776 -126999 -41990
19126 266636 -113373 -225423 -144069 223269 41480 -240708 -6534 -113909 -46262 223652
19115 143884 -51777 -152016 66878 -9883 103362 -41190 131652 -22001 -419194 -99513 -49375
19103 103302 5241 -343526 -287758 225689 -256545 -174273 -257653 12850 -207515 218113 -130524
19091 22851 -141431 -320809 -242631 -49164 -113854 -187779 -118065 -128173 -39864 -10680 -133455
19080 -133455 -1953 -12538 144840 80881 -127591 -288428 -74854 -122881 -60997 285125 35782
19068 -47021 303047 48319 -15597 -472989 18046 -282249 -70697 279097 -79373 62699 86127
19057 86127 -256432 262929 -69975 298144 -53188 -13196 8592 158340 -382459 -310 -229744
19046 -229744 -104269 108803 -12423 -181334 2233 -116474 18633 -26389 207279 -182394
19035 -1686 188867 -124811 73062 109450 23661 -39066 293024 34108 65157 113550 24451
19023 120729 -257134 67069 -7608 -111762 -275612 -26732 19676 -23351 -336119 -244579 12350
19011 -35176 -125026 -148204 162473 -89599 286921 125574 -12367 -152085 -310049 -310559 327191
18999 33640 35333 -41420 113095 -224577 4928 -177383 114663 -90086 224379 12888 -96790
18987 -206010 15463 26078 -137963 -411028 -64612 -312188 -72708 -163264 -81579 -46356 -144663
18976 -144663 -107745 -214037 59695 139577 111590 -321069 -129726 3723 35713 21537 -87454
18964 -391290 -53983 161100 -155937 -40440 -262371 10318 32941 -118065 -14609 5944 98296
18953 98296 -32303 -120453 152679 -207705 -98779 -186583 -10279 -91241 -142887 10767 -85910
18941 109836 120656 235064 -83841 49765 20913 -248824 15692 -239049 -72853 66483 -36979
18929 -193711 90400 89993 106567 134546 -1778 -246412 -108267 -327475 -190728 8078 -199483
18917 -24612 84947 -184324 -166 -142807 -309765 23009 59308 -82601 94871 156980 -132796
18905 74071 196716 130437 272460 109456 99585 4505 -101505 -300379 45607 12814 -75585
18893 -87764 -147816 -144191 -9726 -23022 -80816 -14897 -95486 -59281 -242211 -142035 -26518 -75403
18881 -75403 170112 -144358 27727 -112322 -235735 34220 -234896 -44232 -6081 -322076 -151916
18869 151894 263195 55221 -129816 -193954 90984 -10691 237929 33749 -215826 -141268 196237
18857 -107444 -234919 134089 12987 -213367 -61497 -538 13322 -339295 273571 -37213 54632
18845 -152658 -54904 -48129 88689 21820 11642 135842 51267 153984 69386 229167 -200255
18833 -71752 -83790 55456 64232 147039 377717 63696 299979 236924 -196639 -182855 213438
18821 149458 107563 -335769 6079 18280 14465 -202363 43865 -84868 -55509 -98616 -379556
18810 -379556 -34613 -235297 232602 -109279 15164 -152374 -210757 -51393 -136743 -1423 5497
18798 -101165 -235608 -174098 313748 -85276 -100442 -246566 11066 -41859 169949 41290 -70761
18786 155961 245019 77013 -143899 -340903 -225255 23877 227034 257437 113750 -134711
18775 -282009 -120148 -68495 41382 5463 -305964 192205 113594 288276 189263 30986 -194356
18763 -229065 245931 315479 111170 -358001 -35991 -339822 -20420 -57728 -3146 -49742 130740
18751 -200869 -402574 -31546 -487274 -263823 -208514 -118719 -86921 10977 -393780 21530 12666
18740 12666 -46511 40147 -377033 -51592 -307665 15680 -248001 172108 -301433 -300287 -296056
18729 -296056 39409 27074 -320450 12157 -92148 178769 -118181 165706 -49334 -23308 -70569
18718 -70569 37380 -135719 101592 -204502 39096 -432289 38760 -117646 140008 -177936
18707 39955 -84970 154284 -8752 -46384 117996 84108 120003 276952 182831 -76446 -21114
18695 -122020 35238 54673 -152324 9764 38054 -43405 -171240 -203682 59105 235285 -271179
18683 -27309 104404 51353 102562 -91140 -457364 -126422 -144158 -69201 19981 200162 -171291
18671 -246657 -195762 -215033 -243192 7346 -414168 -215429 -80761 -94258 122097 53440 -62036
18659 -162702 -154011 -333993 -50192 -222472 -317326 253990 335528 -52622 299209 417988 -36473
18647 -302597 -245958 -19470 147165 248888 64110 -135656 -67908 -93344 109797 60362 -49416
18635 -195919 6546 -98597 108496 480786 22328 82920 184600 -477500 -138846 81311 -53538
18623 -222082 113506 185579 -118481 252804 46099 85533 -5813 -1525 -74335 109252 34934
18611 12265 258255 -119637 -198059 156222 33083 47240 -25985 -112098 95247 -434982 11030
18599 -187943 86291 -189388 18808 -4797 113375 -8059 -301313 -107864 -20473 331711 30473
18587 -419800 -76439 188757 -200985 -127073 -347364 -162093 -92350 49481 23469 63416 59699
18576 59699 70581 -152877 -244724 -55654 91761 -166308 -139171 -377880 3706 25765 -217317
18564 1953 23430 191989 91562 -3727 214376 196954 -5011 -64267 -89977 -222468 -414482
18553 -414482 231845 -151337 86481 156461 -148956 -24388 -221192 -73735 93111 -123097
18542 -112328 -70065 81118 131346 6969 135685 166481 37250 121575 -70309 -105248 72217
18530 -82242 86478 -131489 -289996 72716 98813 46923 207744 -572544 -133457 177923
18519 -84779 131668 -108570 -174255 43636 -152246 87029 -223927 -426971 -221846 -253565
18509 -253565 -160334 107532 106938 -156048 -196993 176785 -246977 176154 -76044 -116103 -125791
18498 -125791 67440 -142616 107228 -36068 -300071 20997 113954 64079 -115457 -9472 -53465
18487 -53465 263877 -332373 -202642 -139164 -171413 -327966 -28631 90541 -186218 -11563 -132173
18476 -132173 -128751 -208527 74933 -119014 53493 -271167 96278 -139618 -179434 44511 151621
18465 151621 -78893 -19482 -49446 211927 -189998 152617 -18444 74120 -191885 124660
18454 30083 49753 -67018 -8794 89689 -213824 414435 -285171 103409 237027 14454 103604
18443 103604 -150896 -24998 4665 -123388 -67473 -299553 59277 363956 274067 2688 2687 109252
18431 109252 -303382 -33791 -103273 -254472 -290933 -49141 -268864 71395 14925 -170778 103023
18419 -225846 35358 -91667 160855 -162954 141147 19166 38545 3990 -8822 92372 223429
18408 223429 81897 -5608 -141426 157921 100436 -69282 132687 -51788 -57075 1858 190801
18397 190801 71755 -63520 93224 165649 -176708 144194 -108352 67639 -147855 56413 -396682
18385 -408177 -16129 131030 -442758 68 -180176 23045 59439 -132754 1954 -201310 -59027
18373 -7312 -69747 -209202 -139906 -287251 -285687 -48756 -53267 -48790 162648 52251 252189 -199062
18360 124752 -69565 -118148 408557 49268 247291 -115502 -51156 167958 -75125 -347350
18350 -347350 -271773 -106165 148787 40329 -143575 -128460 -97586 -93350 103994 -109641 78669
18338 92503 -54665 59370 -182255 36066 190036 -59434 24827 81247 5534 20364 371628
18327 371628 115800 34419 -427286 273044 -71242 -6746 220110 367790 44911 -327863
18316 -127981 -72851 -354901 -193288 -197046 53113 -244157 120637 -234746 48590 -127419
18305 51703 113880 -200068 308770 86902 -210198 164110 -86947 -270744 104115 -103128
18294 -196383 -121522 -198497 211475 -106741 -81846 239499 -229769 71150 -186730 112843
18283 119701 -112540 9679 -253770 113953 -70258 199764 -36484 -118308 5524 -124550 -128502
18272 -128502 -163455 183745 -155660 -66868 290606 -28840 95105 114428 118210 -79740 -50825
18261 -50825 188630 -57467 27139 48595 106533 -277219 -79624 -359825 117117 169802 -149176
18249 -178871 45160 150084 3308 -95907 -369111 64337 270485 -368686 -190038 115230
18238 -204334 77059 -137035 -37663 -78730 8264 17702 139020 7593 177056 -114602 -66838
18227 -66838 27792 -384448 215931 -145633 -18889 421759 -255165 -156206 63367 149333 65290
18215 4178 28291 68329 -155840 -90982 -213591 -256739 -66390 61302 161052 -353979 66986
18203 -196190 -249911 -51223 200167 -169748 285330 -89189 170901 28887 -25424 -346394
18193 -346394 -27709 63462 -28293 70929 90821 -127818 4536 -4582 -43737 -47829 160498 284007
18181 284007 151194 -51461 -154478 98115 -132118 -69974 -74895 -134680 379355 -155573 16098
18169 27667 47864 -133213 460802 149145 42654 -308406 -104295 37693 -222361 156372
18158 -86492 55443 -133023 175918 -153179 -16422 -35641 -17994 -56080 58796 103146 30386
18146 -15438 80453 66557 128798 -217686 -278542 -182309 -123399 69587 -125098 147339 -304844
18134 50723 78776 -146429 58182 -15529 -240312 147860 -137467 -47353 120029 -18659 308415
18122 26135 -57508 284470 309000 26398 -75678 -304932 132442 -242185 31563 -107959 156222
18110 136296 -178492 -345363 -35059 -58964 328359 184860 148805 -261477 -49560 -156314
18100 -156314 91513 -44867 -389141 -84627 -93321 13362 -140820 -5413 -160531 -91292 -107454
18089 -107454 170200 -268701 87581 -268872 -9242 78553 -138497 -203657 -473571 -1119 193542
18077 39023 43320 112080 -106376 82437 51255 145759 -84153 86695 -192248 -89255 173925
18065 152521 -165729 82425 -21660 7485 -217683 -201832 -149579 92306 -235696 -84953 -211369
18054 -211369 -74260 -155917 6067 -159969 107067 337927 -288109 174273 213685 -256419
18043 247006 146283 137378 -61476 -22187 252813 157155 -226340 -373937 -77156 -34822 236104
18031 -314650 215980 -180147 172055 229865 44374 -89907 14916 215990 132707 71371 -36416
18019 103380 56530 1217 -102613 349779 396062 -174230 -40483 -216572 99381 -133389 77967
18007 526868 61803 51498 11984 30356 -208408 -75046 11208 -162898 -39742 -64270 -136509
17996 -136509 139925 59659 45104 50880 -121465 137580 -202664 -89118 98364 108503 -278305
17984 -52241 50554 135664 -78865 109428 247450 56323 25086 45775 271792 -180053 -54787
17972 -7780 -68446 148122 -20219 138532 25373 116344 66402 89772 205123 138992 101262
17961 101262 -101650 -13789 100272 10256 165508 322960 -408729 -146786 196712 289091
17951 289091 10981 -282796 180200 78496 -55362 -179201 48004 57726 -95884 -7488 -299180
17940 -299180 242633 229836 -33847 92277 -60480 -203868 -126374 -152925 -150760 150940 -198684
17928 300503 8170 105788 258167 -65002 153296 315815 337722 -195397 -219626 71550 -454651
17916 156419 -152259 136286 63331 -123941 421681 -308710 -87908 298225 41113 233049
17906 233049 64461 -27003 186193 127957 255814 190176 36176 65168 137154 223085 -117817
17894 -17103 77601 -240383 -28431 -35143 228789 -367322 -203178 66857 103029 116890 -14992
17882 -63657 -100741 322307 344853 83330 132114 14562 131937 110602 -132536 71799 6871
17870 -159747 -41573 -136399 -37550 291102 88351 161741 218831 62560 7844 -146778 -89094
17859 -89094 -77936 -125578 226095 -202136 70417 -32047 50601 -197509 137066 189076 458123
17848 458123 -192256 44042 -282243 312051 143530 -112464 -20039 -176232 -166010 -57532
17837 70342 185758 13885 332341 44119 -186882 -34899 324634 -135039 158694 121761
17827 121761 -185293 245655 102272 -4554 180615 -40834 -122352 136214 56402 -70215 237895
17815 34903 131033 39850 181454 -7495 85157 99274 -2776 180616 61547 -75088 -71532 -61942
17803 -61942 109137 237100 -87752 37328 -86420 193807 208052 79191 77825 -135465 110162
17791 80898 303893 -172138 -67118 49282 -241521 328121 49637 -107307 301983 164233
17781 164233 204378 69869 38924 107406 -106105 -72004 -147601 136801 168243 11936 235629
17770 235629 210294 71525 -15914 299605 64923 301161 231383 267828 118131 151750 21628
17758 158443 35644 193541 10668 24635 317000 -137114 -187565 181850 67550 220607
17748 220607 -102307 -125783 149484 -191376 40599 217766 51855 217620 404462 -24129
17737 34425 293495 143755 -330103 -53726 -107950 7724 310861 -140316 156231 29635 68804
17726 68804 113836 -5909 105338 -201605 -215104 178611 306421 -75125 -30883 251168 79041
17714 -152515 47895 154886 -52991 144493 89718 555901 -62595 -79541 218963 -21772 163433
17702 213973 62422 58393 -237284 238792 99176 8304 49196 131396 235230 29647 59039
17691 59039 87503 138212 -85639 83365 129407 -77967 10299 65722 439248 212695 104494
17679 186518 -15433 118069 92251 2343 157418 350207 100063 396571 12408 155646
17669 155646 132720 99600 -145140 130560 124413 380785 100181 180786 -25679 177180 215655
17658 215655 224883 7645 312285 15851 266615 218811 -334339 244308 432320 -178645 218120
17646 276615 108717 -45578 34354 -43466 299913 110645 152 177367 -137837 117194 201422
17635 201422 207650 171337 -55959 72447 251968 -84259 10226 74493 -82595 251110 247240
17624 247240 184879 -120243 -75925 391070 154792 -84648 -28029 287927 226784 118646
17614 118646 127728 382280 13865 225640 -21120 308806 -160006 -92854 253888 -26957 212756
17602 46586 231712 41543 -77289 117945 161647 35448 -55186 -47224 251135 74552 217809
17591 217809 77973 49558 -73422 117162 60058 170412 63695 -140663 115793 217800
17581 217800 273085 119789 189257 558833 244137 171365 197507 -71692 136932 219758 131534
17570 131534 402711 211025 141628 -118209 81693 313403 284638 -13544 169335 108067
17560 108067 -38489 190835 249808 353369 328487 243319 -34113 115964 121043 247653 412943
17549 412943 142803 130540 378246 373609 -157585 187455 160613 -145721 292683 336405
17539 336405 157063 307470 256308 272715 55192 309339 -28892 37105 346060 10595 557676
17528 557676 32450 336497 -4395 227438 727364 507988 888222 478813 768138 686707
17518 686707 342149 499776 309712 430831 372809 383855 426956 95675 189748 469259
17508 469259 709000 868138 597351 568026 409805 424755 131145 281720 159415 207959
17498 207959 371302 368277 272689 236352 47125 139592 -83177 100728 182500 164502 218582
17487 218582 187665 453047 18582 361673 168233 457677 33415 126851 -166037 357593
17476 334931 209538 179757 517553 201883 124756 343954 -72059 318035 77189 280828
17466 280828 504848 411051 560699 433120 -43159 312201 60596 481589 319361 204459
17456 204459 317681 18651 123259 98658 162629 470668 350619 49760 569598 542214
17446 542214 661379 451101 255577 613983 468854 246356 543280 714511 483692 187729
17435 572168 529070 246325 157522 314954 347489 491680 373331 535086 621054 512261
17425 512261 344839 233036 447319 -75363 605599 107030 344660 301033 353462 527222
17415 527222 662647 751292 361412 370389 501687 265060 410055 209147 337172 569941
17405 569941 212106 326364 241265 495672 188060 267598 478074 105077 255533 96825
17394 459429 -91518 122373 298936 -8745 106239 21379 378531 380169 -57112 594225 344048
17383 344048 308213 96611 374214 212959 -40043 415592 582888 -25396 250808 490075
17373 490075 374540 8159 451789 484763 558746 16690 -222829 131664 274502 236080 238415
17362 238415 49935 386440 581851 308108 315456 365851 274086 447209 296467 132926
17351 140307 392408 222653 -30200 410634 413814 344460 212627 345046 308180 197653
17341 197653 29850 340395 644979 405454 157283 340456 443734 297010 242519 54761
17330 343873 190916 99242 320695 191373 378059 270897 211831 -18523 177995 453112
17320 453112 254569 184696 491002 395124 388297 182201 565855 225051 260223 519867
17310 519867 154081 179134 87464 -9707 269286 -19136 311795 398366 234421 319719 180983
17299 180983 368942 178269 198327 324770 375284 428920 636245 418661 552400 548914
17289 548914 386361 261151 190675 187802 337784 703817 523296 281775 559077 316991
17279 316991 108945 399776 282906 46094 234635 439296 258290 366676 193511 -20779
17268 141784 302164 367647 234983 124697 410751 212746 247016 514766 274861 450136
17258 450136 474033 693925 405226 557000 335693 286201 352120 367644 245405 141572
17248 141572 420898 283791 473413 285602 68358 240400 300802 493289 636249 200637
17237 594490 234813 412114 427204 527259 394510 578319 421936 582628 16889 451584
17227 451584 466399 276455 320612 705252 400367 202782 208711 620436 494373 111863
17216 268561 224680 600009 339616 606375 617192 484736 281144 664385 705506 560388
17206 560388 488270 465942 796975 614768 307064 562090 506199 295537 556314 387419
17196 387419 390842 225681 546532 569138 887907 496732 675339 343382 862705 521679
17186 521679 402545 486655 450674 554977 476727 387369 693885 413619 501812 534236 764883
17175 764883 684957 543643 554256 565609 391783 773957 582823 620187 264410 506878
17165 506878 551674 732331 657298 650217 719934 796545 435606 674527 863286 759617 885367
17154 885367 737314 643943 750208 141961 892154 614479 651170 787209 701176 838957
17144 838957 528107 823495 356064 774754 683119 731016 919551 700439 739256 901560
17134 901560 407818 390715 1311337 284693 825596 669914 747719 1068115 703199 592265
17124 592265 888648 971522 845865 483429 672560 940015 802448 776809 645136 893836
17114 893836 819734 684402 627933 569463 513715 733922 765653 819718 1280688 885122 669168
17103 669168 1130320 592585 1018572 963908 855333 597381 951523 886749 918796 1146761
17093 1146761 1036024 694633 884130 945340 762794 939180 1098032 989027 811662 638056
17083 638056 1126836 826134 730026 883366 889644 1162370 1016278 987732 1015049 1134812
17073 1134812 989764 948329 704669 1092976 826885 1207122 862391 860552 649323 793577
17063 793577 1103633 1082694 1198068 1456603 960663 700321 1193221 989417 1131628 1255721
17053 1255721 1352969 1171911 1162934 1295745 1049073 1211271 893476 1158163 1283279 993444
17043 993444 1347875 1401738 1200622 1208702 1418706 1451268 1183142 1400709 1246528 1309557
17033 1309557 1285588 1706922 1577762 1184335 1535461 1105085 1663637 1483588 1426186 1823010
17023 1823010 1573796 1461775 1521649 1181336 1449826 1208367 1736529 1668861 1027308 1492404
17013 1492404 1496092 1408230 1552788 1400678 1506906 1649464 1450669 1510186 1132604 1445288
17003 1445288 1586406 1490581 1685247 1517529 1682597 1712616 1677843 1941508 1693695 1555684
16993 1555684 1919866 1670556 1990608 1698251 1881125 1568113 1909182 1815641 2024225 1987765
16983 1987765 1898172 1628969 1967895 1988280 1982166 1888176 1946428 1967585 1761913 1915150 2058011
16972 2058011 2444193 1818071 2081427 2194695 2202823 2146152 2129697 2102854 1969590 1922614
16962 1922614 2369521 2124581 2326497 2381924 2193423 2419296 2332020 2702300 2712932 2501681
16952 2501681 2282534 2504686 2580817 2270688 2566281 2661549 2536161 2623269 2698112 2914984
16942 2914984 2647606 2693749 2604361 2807135 2681260 2964156 2740276 3034760 2833178 3187795
16932 3187795 3219586 2690803 3149140 3281966 3040786 3245480 3446899 3351669 3380190 3155409
16922 3155409 3454354 3150943 3055933 3405158 3556886 3592295 3420378 3637678 3496515 3688093
16912 3688093 3817820 4085561 3899731 4143916 4127604 4087315 4323352 3812987 4059209 3665364
16902 3665364 4296523 4002158 4145801 4388779 4306090 4562141 4523149 4515553 4786109 4666126
16892 4666126 4604094 4699363 5049098 4909094 4765049 4902909 4849865 5123166 5263696 5182866
16882 5182866 5278214 5468608 5446661 5250136 5617432 5451710 5670323 5811048 5941644 6002757
16872 6002757 6271447 6243938 6231802 6210396 6081856 6367482 6367441 6390824 6801175 6862537 6737188
16861 6737188 6823730 6995871 7162801 7042515 7695152 7581931 7607459 7780783 7465773 7871435
16851 7871435 7850358 8204755 8193534 8702992 8587741 8554079 9066921 9024506 9184115 9246880
16841 9246880 9215086 9532470 9668463 9830921 10138743 10299967 10621205 10401407 10891224 11173092
16831 11173092 10997606 11294974 11543147 11723154 11942194 12249025 12175458 12313418 12595706
16822 12595706 12905590 13341579 13613988 14009487 13850363 14211753 14565406 14813711 15224867
16813 15224867 15287410 15617283 16078269 15844851 16249010 16955837 17290742 17536281 17858146
16804 17858146 18476617 18905836 19353307 19561172 19970627 20132842 20702687 21015509 22060560
16795 22060560 22135795 22810645 23245381 23766608 24197796 24683750 25252552 26047955 26489443
16786 26489443 26892319 27740567 28162277 29041534 29457726 30377686 30913407 31575664 32559620
16777 32559620 33240925 33974883 35039697 35618764 36342669 36946570 38323595 38727032 39503724
16768 39503724 40815584 41789159 42757220 43555639 44654863 45732169 47035932 48112459
16760 48112459 48994129 50504581 51638172 52487081 53763641 54809004 56153979 57101873
16752 57101873 58452006 59626828 60668047 61881208 63179069 64512486 65601414 66794505
16744 66794505 67658194 68985099 69985218 70979758 71919013 72969557 73877055 74520954 75929198
16735 75929198 76469289 76859070 77543667 78154481 78809226 79249027 79456388 79703306 79723818
16726 79723818 80048297 79975741 80081270 79916590 79838656 79395999 79035840 78480927 78035973 77236883
16716 77236883 76963021 75943411 75253479 74343025 73774648 72587224 71911383 70644444 69835982
16707 69835982 68352096 67650296 66554638 65481724 64004376 63255739 61781638 60571526
16699 60571526 59749498 58478749 57476261 56245177 55328980 53941533 52623157 51300509
16691 51300509 50563199 49452347 48447620 47422974 46291373 45473026 44765135 43830619 42676794
16682 42676794 41917988 40926323 39938016 39335527 38355768 37403000 36605243 35742899 35156251
16673 35156251 34413123 33316008 33124022 32367025 31638677 31012532 30354062 29467227 28959641
16664 28959641 28527796 27503293 27356321 26696025 26078744 25891754 25359767 24532130 24152477
16655 24152477 23870938 23247772 22749991 22541843 21924139 21505673 21531403 20781681 20377195
16646 20377195 19715665 19673469 19235850 18661131 18505200 18146912 17901613 17623015 17247224
16637 17247224 17221016 17050174 16167523 16291032 15968389 15605655 15446215 15363777 15148319 14696205
16627 14696205 14150004 14316002 14034759 13637906 13271263 13445126 13195285 13178844 12957429
16618 12957429 12446381 12318203 12124795 12024739 11864432 11537435 11431953 11388707 11211253
16609 11211253 10987635 10962573 10970220 10432239 10359233 10387301 10065664 10233163 9689138 9856026
16599 9856026 9425871 9500674 9329556 9365690 9315992 8935176 8598734 8848873 8632173 8564731
16589 8564731 8277894 8415359 8280857 8470808 8427240 7784365 8092969 7683937 7445431 7237869
16579 7237869 7602475 7195919 7138767 6864404 7451539 7037634 7010657 6840977 6806448 6505450
16569 6505450 6703727 6504794 6888977 6417553 6409248 6644071 6332974 6097436 6143498 6073561
16559 6073561 6044841 5973951 6004197 6185139 5599097 5384011 5675397 5695713 5506934 5656223
16549 5656223 5538275 5613014 5012520 4991455 5429323 5200769 5076976 5029136 5400061 4764612
16539 4764612 4827059 4832931 4965472 4932727 4697624 4802253 4793188 4838056 4489985 4624738 4813487
16528 4813487 4604656 4079674 4313907 4402637 4041220 4183471 4223396 3813356 4246869 4210480
16518 4210480 3637528 4058375 3904839 4098189 3918841 3884921 3957473 4212758 3944136 4129064
16508 4129064 3664285 3766155 3787577 3596060 3793565 3584072 3925726 3417369 3553361 3746168
16498 3746168 3787633 3512626 3362697 3339347 3303050 3278607 3116484 3275438 3256669 3672982
16488 3672982 3609364 3517298 3262237 3080881 3108807 3082687 3170009 3396904 3098520 2993701
16478 2993701 3009366 3001057 2914318 3182956 2828665 2610005 3140027 3154431 2965727 2770156
16468 2770156 3053983 2895330 2650420 2768248 2947148 2638772 2745198 2948001 2639882
16459 2639882 2531448 2829875 2682022 2672035 2430862 2604516 2792837 2569396 2550506 2687365
16449 2687365 2429477 2320105 2227010 2394867 2609439 2418805 2179027 2360825 2480984 2567064
16439 2567064 2065400 2325075 2244292 2188074 2300550 2052310 2076069 2488294 2018533 1980675
16429 1980675 2590420 2411249 2273085 2212692 2431008 2306282 2050942 2104242 1914967 2062372
16419 2062372 2024486 2076795 1812985 1984372 2086229 1860814 2240127 1719424 2007357 1978073
16409 1978073 2050216 1867623 1988086 1928666 2024634 1770476 1972909 2071641 2145420 1844980
16399 1844980 1669125 1984754 1678672 1889621 1645154 1674769 1621099 1850059 1838759 1770976
16389 1770976 1758139 1762315 1401943 1502825 1658111 1822798 1573086 1537213 1692933 1804153
16379 1804153 1561762 1969320 1408801 1972249 1747401 1535635 1741526 1461461 1606819
16370 1606819 1583087 1565592 1543131 1816926 1483504 1717544 1685165 1193759 1576128 1271721
16360 1271721 1512525 1774984 1586584 1188546 1629404 1278529 1209055 1565605 1459324 1185344
16350 1185344 1564397 1470018 1098340 1250491 990344 1507901 1362113 1387883 1628273 904396
16340 904396 1353140 1368319 1345660 1133945 1268525 1127897 1142621 1225546 1236942 1186687 1053703
16329 1053703 1287989 1511911 1266753 1379775 1329824 1278665 1287517 1012431 1181917 1194612
16319 1194612 1186882 1279813 1215161 1033236 986840 1132216 1413725 1342803 1148439 937898
16309 937898 1485329 634013 1218342 1205293 1216629 1411556 907207 1256849 1406665 1081827
16299 1081827 1093038 955132 1258071 1135857 920148 1234375 1030071 1206729 1111285 913410
16289 913410 1138124 942810 1348739 923554 891323 977428 1177510 785112 1064698 824340
16279 824340 1008930 755853 1117453 1014601 1087162 984562 680807 827346 911031 1085708
16269 1085708 873980 1040417 619643 1019305 717282 1107972 723596 920467 983632 831929
16259 831929 536304 671325 867211 796270 714768 552434 630415 1211194 1054956 717394
16249 717394 563266 1019940 1142343 867509 487356 1157956 888662 670351 797040 1012815
16239 1012815 751867 717534 864989 501882 370147 1139230 536711 697402 601250 938806
16229 938806 830384 841951 686153 737022 532056 731181 673073 495813 679362 742064
16219 742064 808586 890607 1074317 579431 1142843 639233 915029 649370 635303 1053097
16209 1053097 866735 920174 332089 492233 706960 417465 534946 506596 550410 930667
16199 930667 673840 450877 237903 537281 562353 340376 726040 788870 310283 792303
16189 792303 754670 738138 624125 514967 648663 507353 660019 416119 710472 553777
16179 553777 512728 578099 498688 716281 642613 662531 718218 370101 379417 277649 578817
16168 578817 712878 424572 231594 492096 497542 432126 609103 379909 632751 463741
16158 463741 368623 758647 551759 616886 660433 489405 754889 540547 506640 682847
16148 682847 596313 570904 620274 374632 338219 557082 721586 178475 379947 247081
16138 247081 384352 496803 294702 810554 338075 139265 287783 466738 462024 610974
16128 610974 43085 312111 383594 503159 293995 399715 546530 457955 373510 236974
16118 236974 499538 232499 86904 477314 490155 372435 485234 562197 508926 769870
16108 769870 102355 143094 288432 279440 132332 599047 300508 132631 285678 617370
16098 617370 383014 299474 368782 473615 264770 339874 524942 147487 663397 309039
16087 248403 321138 288735 41344 305282 286296 338314 -59193 394912 189732 212088 440225
16076 440225 563836 432366 102664 275007 167692 328350 269700 194289 459202 334546
16066 334546 46760 76849 293325 158022 411254 533719 173936 182884 286634 -34977
16055 106908 173910 144591 341873 357049 288671 117870 238894 658167 444078 215949
16044 50639 380870 49473 258074 661220 210541 282482 331769 67847 21600 36763 80319
16033 80319 492152 183437 -24598 -22894 -130862 -53989 134117 418186 210462 114502 180075
16022 180075 253537 -201737 -186275 206527 198507 360322 471690 139264 155606 243840 266484
16011 266484 -30594 268263 468888 378751 12180 326972 361136 446450 449319 431297 306661
16000 306661 254272 96880 349219 164566 458526 555396 375899 229247 562628 684563
15990 684563 1116556 1096571 1252132 1208253 879653 743664 388219 660609 41050 192593
15980 192593 173914 202880 386809 358296 430249 248900 97726 80637 191051 493100 18211
15968 152070 -142075 31336 -253791 309649 -38485 348242 -353864 6221 142508 7167 237949
15957 237949 -208315 30905 115015 239902 17491 321377 249340 394823 120921 -129476
15946 -168203 37728 37273 -79333 39981 66014 24977 -153274 384214 33779 162508 281045
15935 281045 116415 66238 -446688 434372 242884 -9291 119729 195727 -30036 221855
15924 117174 27283 -213621 -76194 112526 55031 146864 31060 -74449 186719 230136 90555
15912 82931 -160206 50111 33851 438223 74702 256662 80296 384945 -37756 -133376 263279
15900 17091 270359 425488 -24607 -91285 -142943 127462 -106833 260679 188194 -101804
15889 23594 26952 287642 172224 121412 244527 -107727 -52015 -69959 203404 -213333 11078
15877 65094 -28651 77745 262288 125117 98483 212774 256121 159072 -13321 369400 113547
15865 27115 165725 161235 248524 112729 -89512 -155827 28618 -40605 128521 68734 75441
15854 75441 425486 56871 89359 239369 -270386 -188716 -40882 349687 90676 94255 196167
15843 196167 164967 366165 43397 54379 191153 120572 105589 149135 40981 -63582 176274
15831 280575 -108019 9305 105723 234805 64019 5993 49413 213279 237804 -110430 -210278
15820 -210278 315300 -14172 201539 47274 -52659 213172 -142853 225138 208187 29418
15809 167812 -284624 433634 111763 -76075 -144330 383364 244777 -120391 -78168 116545
15798 189227 11700 76349 69489 -56574 19339 -517 125409 124826 -47949 166887 184245 144719
15786 144719 133944 204771 251617 -54635 -25046 -334719 -207847 -82143 -142291 125275 274661
15775 274661 -125439 -7106 -85302 460469 -256618 79339 -100478 -63527 53194 299187 -143137
15763 -121354 -18894 3785 -311611 166489 -119066 183591 39157 113109 140176 281666 -168323
15751 -148239 321 -50171 -164565 281245 -14291 143034 125302 159366 69222 -228595 -146048
15740 -146048 -17493 217884 -138085 142517 30954 171877 162176 -324565 200383 -231995
15729 -93071 -199447 184782 -402272 154719 67240 193902 -272993 17552 -113733 -255776
15719 -255776 18422 -3814 -79922 97673 -134610 154947 46452 178859 -165250 351489 -169836
15707 -62308 -74985 244889 418119 -186724 -12254 -121833 -242762 70459 65581 -118296 171230
15695 115825 16061 214912 117514 447225 -11477 -325689 190658 -57066 109251 -236091
15684 17550 112404 52242 -58829 83222 284215 -100159 81736 -207687 -201996 176096 -266223
15672 -8604 -255907 -83331 47669 -94715 78212 230093 -128533 38369 -136543 -163893 -46494
15660 83665 136729 43282 -36289 75958 -125516 -292535 81185 129144 -194912 -62037 -144085
15649 -144085 -81304 207420 171208 -162863 24020 -125361 186636 -128716 216698 -246441
15638 -54025 40804 90790 52826 320287 41490 -30177 43340 -100813 -295104 -278212 -128685
15626 -22951 283566 1899 -79601 109800 -92 113265 43489 324748 248138 25457 240540
15615 240540 -133828 182160 -28805 -148048 -304264 -68523 56382 240744 -14702 -118993
15605 -118993 59966 -140660 136652 -74500 -246631 -47357 -164030 -235522 -268028 245644
15594 31498 88917 132472 251241 135791 221989 80212 -201179 412196 -33860 126947 85910
15583 85910 82367 24522 61741 136429 35051 155074 -62194 -48905 -136721 -3405 -346010 69300
15570 -33082 -308635 -177296 -93163 172693 159466 -441516 -161940 223240 -332441 156184
15559 -36016 -353213 -232692 -30064 301526 -29028 210497 142514 229563 7872 109854 -193768
15547 -53108 -69403 -214408 68098 -8742 153643 93505 -1681 314276 125066 281001 100497
15535 436790 276320 290896 -203608 -101853 -32368 24943 -90243 -42747 -67952 -33880 65265
15523 195018 27448 192079 -176909 125392 -46166 390996 -110280 158444 237913 198009
15513 198009 346058 -123540 23083 195310 -67113 221934 175216 -11764 198820 -63820
15502 -15803 114803 351254 -147606 184949 169111 131688 281453 16418 -76950 404442
15491 -245613 82484 -62575 -54465 -247544 -66239 57740 -89145 -129131 -7572 -37165 -32149 -88366
15479 -88366 203235 367023 213747 263834 452748 -143707 125902 379278 118126 17435
15468 -329344 -47794 96561 153061 -52946 423842 -252566 7330 -125164 175729 19877 103976
15457 103976 122741 -87650 84911 -86896 136802 254355 51552 9063 12621 310331 482341
15446 482341 635394 1052167 836251 223654 447367 420246 127030 20188 307762 -199109
15435 -69138 -217382 -36591 -99963 -212001 81078 149 28325 111525 -17601 48972 190156
15424 190156 -21260 -47101 166937 -98980 34448 -139091 -150457 -341619 -169597 47608 -247347
15412 -215148 132292 -56374 -247829 54598 -290783 107434 283615 -8474 -111974 32943
15401 48647 -182246 82720 249598 80895 298033 203709 78818 72159 114642 -209686 145293
15389 39045 -181073 -15857 -56926 80006 -171796 6784 -176482 -299475 -94937 65785 -59555
15377 -62247 335327 243578 299409 120971 65648 482361 185462 106422 76723 368960 288268
15366 288268 270582 349337 21725 -151466 -64502 285219 -35406 483211 195057 42268 -40481
15354 -49963 35493 -127893 16064 160017 18439 420609 10994 -116691 7993 121402 -188639
15342 482751 314834 158767 20733 236535 364754 18491 88116 25844 128677 18741
15331 224201 -103023 136709 240877 -100337 83786 206253 -58595 285955 289859 -195841
15320 -90979 -143137 -145951 -76732 442510 79999 394730 -28634 235063 -119574 272894 -169812
15308 6783 348324 142514 191795 21382 237570 -396212 198825 62416 -25419 -222541 -141569
15297 -141569 91223 -23718 -189412 127937 298340 300892 172759 -129000 -2969 53958 142486
15286 142486 -276826 280857 199325 36152 161531 73834 -441016 -152684 160207 -251807
15275 111687 -274501 -94236 5437 49272 165434 149401 -181647 124759 181535 -285669 -132
15263 195452 -123271 168803 -308392 215634 322146 -71759 -191472 -56006 53742 -57415
15252 71549 341318 8525 813267 634625 966804 2190591 2078729 2036075 2217575 1213021
15242 1213021 431653 57220 114 -116939 116383 30397 -133614 105574 60086 41881 3695
15230 -254849 27282 235454 38287 250760 158030 -125167 51606 -323480 224622 134831
15220 134831 -97777 -161540 156136 16685 239268 -45434 38271 189044 107072 -50107 -142141
15209 -142141 273964 320308 161038 365201 112112 241363 -242090 -25386 19700 171907
15199 171907 -136659 286380 -10533 -38699 28127 319519 142826 -134231 191965 212421
15189 212421 279712 -13047 -13967 242276 178812 60121 306922 -193013 66409 132534 -74153
15177 -71496 230340 105728 53354 -125366 198102 87416 76264 16097 -56275 300492 34508
15165 185339 39368 313279 175973 171316 -141031 -203357 -62805 -13532 -101396 -11462 78677
15153 6734 38025 -99096 228900 13924 52005 212964 230137 41067 96565 115605 -89 -73831
15141 -73831 11310 288694 150665 152835 -132776 247602 131233 -113452 75855 88940 109898
15130 109898 -302344 193775 97021 188670 482697 407845 384592 -101727 176522 29395
15119 155244 -172293 260631 97333 215218 205899 19569 503311 116597 96789 -7847 5536
15107 157989 379195 158608 40351 247604 -153845 58311 224141 36804 277257 7079
15096 -219144 -166543 173472 -13031 -18141 205644 -45189 389682 67439 39958 -106521 160112
15084 91803 -49669 160213 104043 69668 -149853 186062 -91246 68106 94315 40292 279979
15073 279979 73130 117074 197619 43097 461116 -87857 157560 74637 18628 50135 -205688
15061 96120 107294 400104 586185 239587 320821 352278 101620 136168 133909 133450 52756
15049 337134 527818 136595 203174 682515 303454 247127 237785 -73726 539172 100785
15038 751688 471740 218992 384190 191925 -83663 167862 123133 312654 -7488 421771
15027 325462 614823 613690 568540 549797 392651 270349 2276 147031 513485 610586 243455
15015 132140 368690 168432 410365 154655 227755 376402 257234 307103 239487 580008
15005 580008 282921 319462 222391 329556 395168 135898 398193 364964 189018 203866
14995 203866 430105 254525 168022 438668 465888 474693 301853 430999 232378 347536
14985 347536 525734 149282 241889 512695 374331 873909 491944 1014539 439337 582545
14975 582545 491538 542310 343101 408060 20201 406273 457870 351543 704508 484806
14965 484806 485467 336734 314586 449370 545585 175203 600358 256119 319118 285454 444180
14954 444180 221815 404210 186079 427984 291526 561111 588043 493065 501363 410705
14944 410705 240968 472896 400984 497448 448428 413077 328564 822593 672812 400626
14934 400626 537274 969977 788302 538274 667506 872689 813821 880921 774203 833183
14924 833183 819553 1202145 943881 1202776 1425533 1117999 1482286 1312584 865045 818107
14914 818107 529395 503071 695487 373120 463218 615021 829685 289520 448854 563472
14904 563472 417135 260609 497788 429498 482897 463696 649115 172730 351859 476927
14894 476927 211851 274413 361956 487912 312211 748425 608309 640428 777464 233998
14883 429189 262371 655397 880079 497518 686305 726685 609644 158644 653344 241671
14872 523730 927603 452350 577207 983963 525443 343915 457959 314321 546969 389346
14862 389346 234467 400120 536768 197520 254212 437879 357636 434299 152028 308347
14852 308347 744717 200048 644133 752502 324596 491749 634823 245451 460674 896373
14842 896373 883901 1046424 1018465 725433 1040541 947016 673659 552448 750125 554731
14832 554731 654577 361861 591074 884102 298563 644036 313510 678000 492808 654751
14822 654751 435478 1003922 833606 696980 581481 663953 509773 295750 421261 310375
14812 310375 601572 342019 530233 369538 715981 997935 445061 905078 1024720 842590
14802 842590 801945 711340 785642 664841 707049 461233 728797 469082 399001 792604
14792 792604 570892 530103 627245 405310 542814 394135 724105 602340 454579 953523
14782 953523 522870 946011 569633 658206 589352 490015 718494 927128 481445 608999
14772 608999 464378 626636 910666 528246 671899 993121 396821 424243 821343 775140
14762 775140 442427 531998 697875 389236 649855 535665 639728 671941 537957 656068
14752 656068 601520 819055 889330 604920 752954 531744 880762 598558 673127 808587
14742 808587 899836 806221 661482 640174 585658 808304 529239 761980 774652 945545
14732 945545 994606 824672 706775 895930 1022258 1215230 1241402 1101675 1074372 1580698
14722 1580698 1345011 1023864 1024766 825280 675876 882021 1099207 870691 887316 1165727
14712 1165727 911374 461201 587321 885470 1036632 1086248 899344 979176 938926 820109
14702 820109 982837 1222566 1171883 1479458 1528174 1135081 1229276 1492299 1086977 884485
14692 884485 1108043 954781 1012316 667144 804646 825363 1291113 971504 896947 926076
14682 926076 930032 1091878 830207 753568 1042050 1146489 1108648 697879 1350374 731766
14672 731766 1005792 986299 757097 908075 1154070 1320621 1092716 1147665 1231875 897371
14662 897371 991831 874119 957191 1059677 1079939 1143114 703509 842389 989148 997127 1364460
14651 1364460 1144516 978997 1539129 1452805 1320075 1122973 1136493 891274 1232209 1296378
14641 1296378 1533323 987122 1126231 1650028 1480182 1159425 1351777 1379632 811789 1235711
14631 1235711 1173228 834331 1347112 1228272 1349228 1173230 1468209 1101747 1460940 1284807
14621 1284807 1533898 1134091 1207407 1548467 1574395 1518924 1645618 1134281 1250878 1354425
14611 1354425 1216798 1537722 1401350 1507333 1617219 1362922 1652494 1686930 1528856 1502508
14601 1502508 1331782 1383173 1503399 1628846 1553819 1722258 1215212 1321229 1478365 1514362
14591 1514362 1676768 1600406 1710943 2046729 1808267 1578768 1733419 1618921 1558056 1942520
14581 1942520 2036902 2150994 1813599 1871046 2133427 1966373 1974271 1981690 2186719 2395628
14571 2395628 1752359 1947527 2424464 2347006 2461120 2331810 2388965 2369745 2302632 2693468
14561 2693468 2406339 2648026 2913411 2701714 2796788 2904526 3280227 3710878 3778516 4148004
14551 4148004 5064481 6057196 8312079 12365339 20361769 34678685 38337894 21554012
14543 21554012 11553266 7929360 4272976 2314801 2017156 1715900 1941620 2383882
14535 2383882 1991629 1804127 1771517 2133304 2048982 2038684 2207093 1857998 2277909 1967766
14525 1967766 2220224 2339617 2527717 2180058 2631769 1897083 2641745 2067943 2397228
14516 2397228 2648288 2870837 2492984 2716745 2430121 2619283 2746006 2590488 3038402
14507 3038402 2426757 2923234 2799931 2943439 3201235 2922670 2918601 3260168 3179050 3293294
14497 3293294 3028581 3138422 3186346 3317685 3543679 3513034 3196814 3699289 3279862 3290988
14487 3290988 3399807 3199429 3837919 3701319 3230261 3709384 3659945 3714746 3586188 3766531
14477 3766531 3700989 3590151 3944975 3934328 3929434 4042711 3926005 4193872 3946667 4240788
14467 4240788 3865661 4283566 4622862 4470654 4576035 4362247 4467274 4692269 4676824 4730500
14457 4730500 4949610 4797348 4438564 4896786 4844235 5122959 5192935 5302856 5066848 5361714
14447 5361714 5261015 5462159 5384656 5463314 5577029 5326007 5617424 5587442 5913690 6331136
14437 6331136 5920101 5871808 5857804 6138745 6294823 6388078 6776818 6615092 6729180 6806781
14427 6806781 6850502 6856879 7124378 7359443 7425925 7564848 7698181 7765781 7613148 7972095
14417 7972095 8225171 8234259 8327104 8469437 8232307 8516443 8374350 8614052 8667909 8920282
14407 8920282 9156508 9350211 9220913 9505703 9842080 9705903 9830995 9964200 10328456
14398 10328456 10291756 10471615 10518210 10989838 11116937 10896744 11461154 11691912 11807752 11680362
14388 11680362 12186603 12334717 12436906 12913544 13067706 13516219 13705355 13808700 13821259
14379 13821259 14382560 14505166 14789256 14572957 14893597 15438175 16022823 16074288 16574855
14370 16574855 16979024 17261634 17711103 17893127 18173544 18800052 18744167 19211119 19854536
14361 19854536 20372283 20667083 21258639 21254620 22136736 22507615 23206528 23421590 24132042 24661705
14351 24661705 25304520 26117257 26856939 27456373 27901715 28895042 29394209 30067536 31170242
14342 31170242 32224947 32751122 33605264 34758715 35780682 36441537 37615370 38560965 40012993
14333 40012993 40878436 42359624 43466711 45083514 46335878 47779568 49304267 51103369
14325 51103369 52655290 54150174 56213611 57839363 59767392 61926082 64408342 66760471
14317 66760471 69197567 72005648 74640278 77730815 80442501 83628891 87282958 90651678
14309 90651678 94325748 98436139 102697567 107128793 112122696 116986259 122676535 127997212
14301 127997212 133572056 140336666 146871804 154183929 161783554 169716793 178210565 187381595
14293 187381595 196513669 206706193 217287148 228439587 239915131 251728971 264278774
14286 264278774 277438897 291079069 305103806 319355643 333715040 348621122 363029776
14279 363029776 377106784 391045653 404073672 416122295 426770165 435480403 440874620
14272 440874620 443950647 445842273 446890378 447455664 444868409 443947689 440773764 433645216
14264 433645216 422970441 410886020 397181865 382511283 367440506 351832380 336304041
14257 336304041 320568561 305502329 290651287 276235919 262484196 250341656 238546008
14250 238546008 226509721 214980617 204113095 193533094 184259316 175013027 167093182
14243 167093182 159052121 151184846 144073948 137347509 131148070 125245484 120255993 114662097
14235 114662097 109688756 104935373 100479179 96523040 92871726 89271308 85544793 82226923
14227 82226923 78774679 75730339 72807791 70799435 68176981 65342107 62936484 61039029
14219 61039029 59120564 56978849 54951591 53369256 51854263 50060446 48716756 47126472
14211 47126472 45581175 44466266 42765813 41648134 40780163 39588199 38666803 37213032
14203 37213032 36047954 35292405 34451762 33611630 32554321 31463891 31110431 30096986 29206745
14194 29206745 28389832 27754982 27461360 26486364 25989103 25584531 24562107 24217360 23482191
14185 23482191 23304052 22514563 22129494 21539130 21305609 20510535 20175734 19543517 19436168
14176 19436168 18813858 18624075 18194763 18112790 17696390 17103488 17085153 16711794 16218106 16123294
14166 16123294 15716876 15303107 15153512 14689055 14269181 14392416 13882752 13788074 13397653
14157 13397653 13118822 13032235 12383118 12868415 12113915 12140349 12206395 11799664 11726909 11244931
14147 11244931 11015896 10830604 11001230 10508241 10489371 10315244 10337379 10240647 9842370 9936611
14137 9936611 9445060 9440688 9340698 9167628 8975835 8899959 8756407 8598081 8503398 8017728
14127 8017728 8466615 8105390 8049401 7981813 7599670 7680044 7614556 7544431 7230753 7513565
14117 7513565 7342464 7506406 7393611 6510046 6840201 6656977 6952826 6567154 6459768
14108 6459768 6308549 6464871 6244283 6212151 6022468 6155525 5904174 5807711 6007155 5908558
14098 5908558 5717158 5584439 5708221 5275700 5349789 5513611 5207771 5084261 5398279 5111158
14088 5111158 4979833 5249729 5008640 5160179 4572437 5058746 4752547 4464085 4545365 4720607
14078 4720607 4430921 4642168 4603655 4333534 4733645 4058484 4312454 4052022 4153302 3922834
14068 3922834 3992381 4320518 3797234 4000757 3841209 3587714 3974080 3709469 3922473 3851033
14058 3851033 3819857 3843906 3323776 3656704 3888113 3343987 3616402 3344567 3426928 3264296
14048 3264296 3566198 3389485 3645912 3214154 3259762 3152054 3113742 3070647 3512138 2870796
14038 2870796 3503605 3334022 3358023 3404538 3087481 3142919 3145089 3420056 2772235 2862042
14028 2862042 2932025 2872537 2542318 2676500 2555812 2361331 2548323 2739537 2349337 2490045
14018 2490045 2446704 2247759 2405377 2541547 2297622 2259837 2508023 2451260 2366128 2188725
14008 2188725 2430644 2220967 1942041 1980809 2565676 2393640 2161850 2022224 2080484 1935760
13998 1935760 2450143 1972814 2140425 1827420 1788470 2245285 2230017 2498693 3023202 4211850
13988 4211850 6745150 12294977 24634198 39156750 30373263 16636901 8935090 6158605
13980 6158605 4476039 4234106 3527203 3078318 3260810 2991969 2874570 2803897 2532154
13971 2532154 2860698 2384503 2608183 2375569 2115809 2160464 1914645 2338387 2096277 2088904
13961 2088904 2031666 2004914 1833814 2090424 1916644 2005704 1599259 1803055 1801104 1735183
13951 1735183 1504857 1998756 1569834 1829256 1980338 1528252 1625784 1530399 1977977 1608824
13941 1608824 1676854 1673022 1585194 1635848 1749867 1402539 1768950 1583824 1628157 1601816 1492882
13930 1492882 1440387 1675807 1525509 1234169 1439433 1273299 1182863 1178122 1277760 1326710
13920 1326710 1559624 1524292 1453689 1282777 1728974 1542757 1509776 1803946 1364649 1297786
13910 1297786 1247238 1338427 1329375 1404820 1350273 1525336 1162825 1290828 1263444 1510595 1273397
13899 1273397 1316578 1298261 1218358 1046902 1267970 1339541 1366884 1026075 1364149 904223
13889 904223 1427022 1086488 1394400 1272702 1302829 1124746 1287844 1184880 1349011 1292621
13879 1292621 1245091 1415591 1065025 1195634 1331169 1245898 890428 936854 838335 1169005
13869 1169005 1069576 741011 1186097 935816 1081368 992579 840130 1218246 925249 1168553
13859 1168553 1355911 1041414 896069 817539 785303 891436 1254087 763618 923344 895485
13849 895485 906438 1069675 1008954 1004859 908226 794146 944725 878814 1028310 504954 456212
13838 456212 1102159 1095425 1006326 1023778 1140168 925255 824505 1259631 915042 996490
13828 996490 790813 765094 940434 827230 949911 825285 1263918 926449 700412 672529
13818 672529 645544 628950 892361 921399 855208 815440 1007553 1020801 578316 691470 748643
13807 748643 1070427 642660 896062 636565 570684 664340 678850 841871 683879 1145009
13797 1145009 456922 734181 784988 885417 360915 957238 727481 423936 827452 644339
13787 644339 999932 897783 966527 697231 926290 797167 709747 884638 626036 541766
13777 541766 773358 868136 616875 493214 459578 515892 634118 970056 662417 469435
13767 469435 400317 782005 592912 723407 614023 553478 725836 1044276 770455 402384
13757 402384 451982 645214 422612 683594 616380 850562 369907 464629 746287 602139
13747 602139 606862 361830 386852 478670 779023 656677 414078 413722 587425 579929 607296
13736 607296 293424 668441 621860 620653 609214 454116 666952 331888 721592 671005
13726 671005 499033 509956 741699 438409 868423 804737 966668 712688 405076 668933
13716 668933 705652 605043 532779 471944 713115 418710 490403 639361 526541 429969
13706 429969 731556 708368 273959 323619 682738 704530 315634 369066 231691 533940
13696 533940 156431 781150 392956 339534 825845 422113 92757 244740 179087 291139
13686 291139 459128 231430 392746 470071 420701 438422 722755 502107 529047 393989
13676 393989 223140 501726 377033 573870 264836 426920 470175 611896 409368 857667
13666 857667 137615 615679 588090 420582 570619 569614 514067 235386 363455 396443
13656 396443 405000 491405 162919 402345 345294 122815 473992 506296 614317 136510
13645 503654 548241 284629 465417 396368 578380 220727 354376 354079 383269 500534 177798
13633 336939 737751 278970 601323 574630 295046 120817 207010 737281 246764 117388
13622 346137 164676 298537 255089 167014 136334 492657 480072 251178 175300 343311
13612 343311 298626 734787 275419 296808 174314 75546 229012 422722 220778 225506
13602 225506 8872 296544 555379 303182 193401 415791 151783 164629 197834 557522
13592 557522 16910 268960 568250 342874 678121 204914 330241 73530 181033 309803
13582 309803 362060 265882 219294 390067 523213 -42186 133856 137009 -100032 542327 332973
13571 332973 283374 426846 276968 271873 169066 363877 524594 378679 235330 550284
13561 550284 148748 238484 90292 83548 299067 175402 169526 483976 581532 289902 309964
13550 309964 214547 212652 171189 227859 344170 299858 240567 544755 93271 126825 375513
13539 375513 201053 61581 328483 241244 462253 155806 237307 432582 394536 171131
13528 280854 265465 -50309 317387 341499 329783 261189 456428 179840 78276 109250 408689
13517 408689 209444 114262 160680 586133 90043 422079 224608 238740 -44253 492192
13506 -107016 466263 402960 247054 149680 3713 58913 290097 536618 69094 269212 171375
13495 171375 497774 222932 18298 191394 117031 255483 -131605 189658 411754 350626
13485 350626 442377 13770 380393 187520 154325 199189 297784 297613 409263 8824 289513
13474 289513 93806 146306 241174 251666 234648 -62574 149130 60155 324222 30533 406172
13463 406172 189414 249855 160980 232659 596954 145487 30659 125941 270410 -15479 67956
13451 82964 205189 421428 156358 264366 410246 200776 425377 277214 -25094 104150
13440 287368 314816 437046 396777 -157949 158581 200967 104943 168495 357247 236591
13430 236591 500754 404596 229541 258269 168457 97785 101224 -14660 82641 -124114 429358
13418 39108 293047 -104382 313886 93434 -67406 70801 230948 509719 38268 -19826 56243
13406 58164 132729 138304 331087 523853 -32250 219011 253392 61672 201953 201877 92881 126771
13394 126771 305574 581220 78869 63188 419460 -86786 173867 -50658 -17967 160641
13383 242004 191629 187470 406060 26650 580552 248072 201749 104061 227629 193872 38228
13371 257640 200473 251896 274046 178531 150207 158184 593348 308978 456002 88548 440523
13360 440523 69985 469821 88814 385161 193795 398894 58767 156392 62920 97030 58920
13349 58920 39666 168464 10249 168326 -34780 141952 13484 199164 290308 227294 203099
13338 203099 121042 529299 -21940 284601 348446 203355 307739 116528 267348 146599
13328 146599 76547 124873 53875 43681 45615 197847 20526 204399 -51930 70066 106123
13317 106123 446996 687257 172821 216041 324658 186125 -680 74557 464926 273379
13307 273379 -139355 -7377 280011 158793 310351 4432 304626 359044 -32638 213389 43598
13295 -160560 -24773 -196588 264288 276818 288815 -59500 98353 196651 -56012 -134496 320467
13283 301833 179270 169963 178885 344824 143606 -23057 -355463 23274 -22626 238663 100881
13271 280625 514888 257360 328603 135672 93570 352624 114807 -102755 401072 128652
13260 167394 128991 256439 192767 497789 29377 162038 226169 -32409 116487 113619 51254
13248 -45937 127225 38747 9512 -211620 -70051 -8973 180459 -178773 -80808 320420 149488
13236 86232 250977 16323 -25795 -3497 601672 446749 8480 303432 318023 -207446 209556
13224 131931 185327 146238 -42840 -77225 68133 -30159 -208761 112552 159599 257215 170475
13213 170475 347584 17588 172128 184383 152176 47123 -265795 -47239 331474 -146627
13202 200424 37529 60175 28282 77479 123905 -20558 -59964 19190 -369562 -24772 265863
13190 -107436 166400 185015 -363421 387337 72962 277819 -6163 -88793 215111 68187 -58852
13178 235517 76995 200027 263386 115155 -21400 143635 48645 111799 88860 -2246 91035
13166 118578 -160099 219439 1811 250593 130727 51128 186723 -323626 154447 -272918
13155 160399 -100443 -209919 -52938 88362 72420 28750 76958 317746 90674 -168061 -39990
13143 -28846 187657 206093 -61815 23698 -79225 -35921 -93475 129614 -290801 123260 234654
13132 234654 158751 13664 95975 4313 -190378 -128179 110017 66502 -10502 85794 -154906
13120 -45133 18619 128116 218687 221502 105410 -7690 -160021 96493 90173 166136 -100294
13108 -50011 343576 -23736 189429 -170135 70711 257172 202624 -38441 -8117 25087 372524
13097 372524 51177 73660 272308 -239070 246893 -63761 332258 24421 -60134 1761 -134246
13085 -83175 75176 27438 51050 106480 -78660 -196691 35970 -30430 -125560 -59278 315768
13073 149973 -193611 -306257 -206047 139138 -26417 10887 156559 110820 223640 186643
13063 186643 74122 211999 265532 -144210 224249 -128480 262753 55631 168702 358060
13053 358060 255630 85162 -139400 190187 186285 -128601 218015 203171 -197902 -162379
13043 -162379 -89464 198905 -262108 92422 -40074 -25855 -225012 318935 63909 -119022
13032 -241624 -14799 230109 83693 -78207 473506 30010 97037 144704 -320545 131777 181668
13021 181668 191263 -102724 102029 105836 343606 -43789 165469 201395 91827 128243 145884
13010 145884 208065 -2401 17338 -217223 212406 163222 211276 131651 278388 378213 138984
12998 -35928 450429 -7300 -235464 -188061 -18904 113865 223197 22195 -176774 1126 -96631
12986 -133604 5979 -171006 5910 -287154 343583 88779 76166 314696 4186 162871 95343
12975 95343 -15795 120774 -150831 -103910 2028 144544 68803 8504 101856 478273 -46645
12963 -41794 91268 -123303 -56940 186636 -320414 -14052 -39148 -42935 303087 -69291 140271
12951 51608 132077 8761 121356 -61483 64844 -49469 148625 150517 -44780 -212256 343179
12939 -52417 261331 325966 87226 271736 47927 86450 -106303 -100469 129152 137600 124479
12928 124479 25996 -82580 -139963 -279897 -20919 136941 140384 75209 185617 -33657 81295
12916 43909 -131122 -285199 47220 -117094 48773 29479 -206408 -117690 -230098 28404 -136221
12904 143075 179832 -114425 -378213 -4656 -42131 271630 122487 -25741 -167054 -597927
12894 -597927 82022 -24458 14421 -95423 271514 77701 -58948 -94083 38665 -64375 267257
12882 41946 149716 -100515 -49171 -21402 -286339 -348340 -35523 -71049 119228 -30110 308227
12870 76976 -60592 -81341 -72169 -386843 -146457 88120 -490248 262074 -85690 -186886 -46863
12858 19788 -86987 2679 90655 -216576 345679 -53854 59806 -214667 94629 -173206 26570
12846 -57302 9541 75433 75328 -150170 -207369 -163068 260107 -9956 -284192 -58202 -55927 -62544
12834 -62544 128981 -61024 32496 -17858 -150984 89736 243797 -97037 -208986 66122 42400
12823 42400 21188 235824 -225766 -43952 -198158 280480 -55277 47292 150115 -67110 -133018
12812 -133018 133503 49321 -73335 267802 2145 86848 -28419 125937 194026 -183833 -22799
12800 -72682 52232 -150514 -51941 151065 379651 253188 -125276 -173342 -250300 73734 -135495
12788 53993 22619 -9341 180229 153663 26672 -60191 31240 -184306 -171421 -98193 152330
12776 213527 -36712 -133845 124621 -63138 29744 -154159 -23804 24433 -142913 44256 126833
12765 126833 -33946 135742 118183 -107008 -115728 164655 -43172 64927 140200 74355 -229160
12753 53754 52296 -292711 -97534 363213 252873 13581 -158336 121786 -15003 -50362 -104035
12742 -104035 113828 175069 -22241 -225091 -42743 66793 77765 155745 -108660 477201 -456342
12730 -475861 268376 -269265 208418 258464 52702 69834 123643 12906 38161 218526 -162515
12718 -269662 -150932 91232 -153254 -42318 284915 236582 136209 16061 99024 14757 126156
12707 126156 -249156 192723 403480 -58618 250015 103833 8664 249279 137555 141489
12697 141489 112262 -344216 -176527 -72536 -151666 172183 104324 181842 -118739 42154 52423
12686 52423 -155949 105558 -36674 95952 419245 34315 -73266 303210 171459 139213 376054
12675 376054 -110904 214085 -124061 -47693 89760 50482 176792 123628 -48498 -51259 340520
12663 122344 367011 171127 185207 113075 -76450 195448 -196992 -120774 -28053 115622
12652 80916 146235 137171 62567 148112 -92066 6980 -42874 -155416 -230834 34722 -103432 -17275
12639 -102887 91852 -21856 118947 -122112 115490 28939 -33556 -199929 420614 -91960
12628 -130954 -157624 -25461 204527 -36936 76840 -39939 24411 -71817 -47366 -58006 44067
12616 -80127 -53269 -177992 60885 202499 13778 -272738 50179 332992 15555 102115 -169143
12604 92098 164465 -14910 -196802 -208237 -39957 -60208 147423 -225382 -52957 39980 40181
12593 40181 -415799 187651 -78164 76768 -128234 161619 54727 -11470 -126385 -1946 -268181
12582 -268181 -145765 -11021 -52532 25799 -277790 -307634 196687 -8902 -191979 -45568 328962
12570 -129243 128122 121136 48918 -95542 107783 -217615 -247014 -66246 -216079 55748 334317
12559 334317 -159286 -261768 -32425 10673 -65421 -211497 -36959 25441 90344 348305 10702
12547 280739 -98422 194139 -132320 22433 -103044 -69509 217590 90279 116920 62971 201245
12536 201245 402088 49395 200159 -182906 -31448 -3340 93995 -73795 50096 228839 10757
12524 97024 409732 -64576 241164 215694 -203590 27067 -102658 280079 210828 113930 146696
12513 146696 -108100 310284 360974 323647 566454 328036 378730 97314 -5077 185504 -126078
12501 150869 -256552 103841 -92645 281265 -217859 -5681 -70304 15355 5865 89145 213953
12490 213953 -12441 -53826 81724 27961 150622 -96202 136766 33023 122351 43499 136130
12479 136130 167651 444853 207278 336763 104854 63509 118600 -31158 85095 -232780
12468 -171577 94690 250961 -22815 120965 -278482 -216198 -194011 -86731 -295553 82355 -15199
12456 147741 -174274 107401 117202 100178 -187702 -93365 -12212 -411530 -17171 -147199 -141636
12445 -141636 -238357 -93877 -29046 -130562 22619 -95503 -162088 -167432 -10917 -93279 -44507
12433 98786 -208216 109290 -232163 262399 35685 -38213 157106 -87516 27627 173199
12423 173199 222481 140204 -240335 -6227 19982 101340 -26236 -129221 36004 -218338 -419147
12412 -419147 92744 74216 -7455 -153925 161300 10409 1245 73412 14614 -142952 -97535
12401 -97535 57584 -242842 -40024 127014 -310933 247802 -40755 90005 -20180 38869 265418
12390 265418 182919 230605 7105 306095 -381421 -26188 123296 97277 -88471 166965 -102276
12378 95528 197498 -432846 45926 73240 7580 108070 4579 59455 198281 151624 271504
12367 271504 182186 181862 -49955 103919 116027 -31384 245042 -49455 50768 179573 -225434
12355 -187083 141500 -266679 90431 -64092 109393 100560 224402 -254568 55672 278200
12345 278200 69173 230250 266676 -90796 -69175 -252305 -168663 188986 18609 99185 19703
12333 -51077 -88372 -93920 53485 323804 -84701 68156 75140 254406 -410571 -12764 63585
12321 -31132 150207 264239 -153304 378762 2420 17930 170759 -190883 131900 308552
12311 308552 257558 50178 73566 63051 -224558 51402 -90035 153819 123477 -64455 -101598
12300 -101598 495386 4958 2991 -31608 143772 124521 -65895 354986 -179326 -134449 260529
12288 243017 -73266 -100533 -197744 76598 -235059 -41128 -8438 -231555 -24181 443954 -283820
12276 135561 111500 -147187 -55668 -86742 -8776 232154 76953 110071 73825 37682 69365
12265 69365 -157655 -34071 221779 -83815 110969 -115628 -108756 159409 61803 -196141 -269366
12254 -269366 121277 445293 -36240 -49022 -294553 199555 65613 39857 -170069 270552
12243 56343 -239076 113206 35456 192082 -35385 -11789 108715 239687 77707 187989
12233 187989 199016 247106 82200 217997 80080 9513 281918 275730 83450 272472 97375
12221 285648 -14513 39331 280895 -256778 26759 478562 134356 -151374 96446 -42492
12210 216716 179472 305155 65130 272975 261966 -76385 101028 95041 74816 602039 368187
12199 368187 240296 108486 375553 437459 120832 285788 175517 -96229 81470 212095
12189 212095 269820 200113 27479 213548 258773 194682 -11906 -25398 413516 254407 98149
12177 -24755 341303 192346 -266776 -146577 224539 401326 440850 246116 311565 -25804
12166 62796 37735 191113 151627 310215 57866 115703 154114 90790 48301 146335 91950
12155 91950 -54508 336215 108029 396723 152232 -2018 -54774 238329 -185157 -376491
12145 -376491 -96411 -91196 -74011 -317161 29244 -60535 85558 333092 121086 164215 244377
12134 244377 387485 14115 -69984 33511 -418487 202038 38778 327510 -183864 47567
12123 -37108 -54142 261344 55764 82144 96818 241890 58437 140212 -38104 -85333 189539
12111 -295002 -41463 5303 -16137 -37200 171477 11280 251113 360144 27421 461311 71375
12099 92125 164507 53759 -6692 -162498 -342976 26036 30891 326216 264763 185638 259986
12088 259986 -43793 202865 -29983 20264 66497 -42987 -89570 157121 -149040 312787 77879
12076 -162448 10010 286496 -236235 190292 -107317 -36243 -27376 161582 -108865 11664
12065 63411 100347 -252109 -211675 -78416 -132285 178512 -53418 -146421 -96123 275912 63573
12053 458232 108647 266396 -184156 285145 -36287 -185467 -314556 -316118 20314 -145701
12042 -114607 -58915 124333 30987 -71153 -205530 60448 169593 111541 72567 185133 -29570
12030 -192524 -19066 75152 2272 -44315 327288 -212535 -110384 155821 -170197 -305933
12020 -305933 -129938 -369919 109392 -237339 -441297 110964 245526 59356 224477 170769
12010 170769 -34805 53183 121313 -264539 21870 17769 -169760 -34567 89846 31593 -391348
11998 -5771 -179594 88936 -17554 -221659 108815 53766 27978 71687 20728 177366 118802
11987 118802 -145492 144174 143432 -7911 133345 213342 112235 -154820 85726 -93283 209306
11975 -260892 -137136 140520 -106262 32348 -243395 10791 -104098 27499 17607 51754 -258574
11963 18502 88474 -12051 159316 68807 -21869 -34742 257811 -323077 -137299 32201 129475
11952 129475 -243924 -239001 -64991 -278709 90857 -117087 122044 -70764 156351 1157 -49097
11940 -114969 208245 -110398 179465 -95993 -377474 130495 316399 -39356 -31994 38359
11929 -3052 -200888 -98098 -59347 162913 242724 -69867 -129650 34574 206744 -288936 -174773
11918 -174773 67485 -39894 2304 144215 -43736 49819 225514 154970 172782 85071 -196539
11906 -158079 111403 -85644 -177237 -29479 -334197 -285944 -101628 68435 -118398 10357 -230637
11894 -137035 -268225 47537 94501 -207195 -57303 -75447 -235814 -363188 -153359 -224566
11884 -224566 5278 27449 -193882 61223 -401756 89356 74526 326125 15802 -2367 -28300
11873 -28300 -197773 -229093 218796 -60262 -316577 -61953 54394 -8546 -301010 50544 53470
11862 53470 -50529 -463688 86427 -146119 17965 -121728 24011 49310 -282181 -155271 2790
11850 188501 45472 -238103 96508 -115525 75602 -32895 89894 71370 180831 -398947 -32249
11838 -110730 -266798 101339 86383 -177817 5843 91728 -108228 -291577 3765 -473627 -86415
11826 159981 1138 -86312 -164997 5015 -107664 -114296 -367707 -70418 -3451 138377 -302602
11814 -218098 -8776 226836 -23273 120615 -248522 -150057 94607 110410 69700 -17634 -34755
11803 -34755 -159724 169258 12953 -34412 -445320 -186200 124484 19995 21235 -420215 81219
11791 -95935 2924 70318 -157380 -59613 -142858 -182920 -185248 -50614 -98942 74977 -124685 -231477
11779 -231477 -84400 -108030 -249950 151261 -66121 418636 21805 -109640 -196786 -41391 128964
11767 -133112 -180934 -196276 -108493 287427 185116 -21704 1050 12192 -221285 119250 44650
11755 227653 68441 88388 52553 122193 123405 12632 29363 -100025 12863 235641 -64494
11743 -129081 -57314 -14124 4621 -109624 58046 145446 -142520 -254467 -274910 121448 -37000
11731 -184569 99510 -60999 -27335 -91466 -169921 15829 59806 42079 53423 266239 321045
11720 321045 -50955 -90109 -141511 -65504 -19241 48789 135479 -172616 9448 -220477 274154
11708 -212229 -6012 -96517 298089 375823 -93595 252606 -119473 54389 97821 11716 -46363
11696 239830 3712 132756 176907 129726 -18061 127310 409687 454707 12307 -111416 104677
11684 -17586 217766 119194 181045 31833 53597 156796 18484 321673 124627 -113490 150843
11672 61296 -168398 39082 -94175 141183 54966 158585 90958 177778 1417 -208449 224311
11660 -141707 -169106 -34998 -26588 -119554 -1500 -52537 -310956 -37590 -320170 155100 37570
11648 56660 -280594 -211809 -86283 -133243 12629 73351 -11825 105639 -296286 375531 2486
11636 -60239 181423 -111496 -46490 -196139 -28679 -294248 197642 -358973 18826 5083 63763
11625 63763 -114241 -40755 -29972 4567 -296591 83786 -25363 -87298 27254 -77165 -17546
11613 -21863 -27167 -289802 -81467 -39904 114492 -286308 -106925 15183 -141923 195523 314785
11602 314785 149948 211119 109846 -178405 -19019 72635 117495 108063 4191 72740 34165
11590 -55561 179878 -12189 7141 206479 -32630 137053 -97609 -144866 -25935 345128 -296274
11578 -279794 40128 -109166 -104833 -393011 -140246 -129007 61960 240263 -23684 86421 -294340
11566 9346 -238715 96972 -33890 -112975 88352 49598 165175 279910 -205891 -85656 207978
11554 61823 -245156 129164 196305 112880 -283368 169433 -77727 -22755 -1067 -39172 198973
11542 -64306 -102072 -128291 130131 -2949 -71683 142713 -183183 65662 -75605 -81133 -146162
11531 -146162 -243220 -139526 -185077 -153702 13101 111188 102518 6706 311609 361014 111325
11519 -278993 -68626 97765 150054 319034 -50235 220647 291622 5268 32068 209183 92126
11507 224593 155582 43643 211512 238885 -41880 153071 104050 -229125 195493 -28749 -54485
11496 -54485 66359 392353 -59441 -1042 257478 225067 43788 94802 261895 119349 452696
11485 452696 116594 303848 95941 58226 352135 104343 3885 177766 358563 370797
11475 370797 180030 -30761 185372 19338 -42487 354289 59913 -68460 166699 -84430 353339
11463 290188 1978 66560 289575 349005 59709 -33747 191635 276060 144910 -162492 147053
11451 280681 -22369 -219373 49655 -52822 -59077 -32551 230052 422533 -100850 22945 199790
11440 199790 331794 5099 -189731 46030 176527 287429 24461 214175 -337862 13896
11429 308019 152300 248160 238541 215931 133092 373440 294742 -236342 169706 -27038 318244
11417 -74747 -39059 -343059 -260518 -34226 -36083 190459 -112508 44486 233708 110792 3320
11405 -123704 -13955 162721 153595 157882 39490 -61027 -156507 78745 -284006 -77999 -146498
11394 -146498 -148033 101920 237149 242784 137985 71395 60080 -202099 -96433 -22419 -23957
11383 -23957 -115277 -339816 -97620 36141 144049 127551 -134109 -244379 77529 -130640 -80854
11372 -80854 168644 213496 238402 -214816 -10887 126555 -59018 -148587 -339092 -1865 -12580
11361 -12580 85763 102749 124328 18918 73931 303274 138189 46830 38702 -93592 72736
11349 117467 -74372 17034 -104211 -38167 -55769 -201828 427263 63020 130676 79353 -54286
11337 173211 -78384 274961 96994 24726 -104739 271776 -79555 -113811 -48450 -33454 228532
11325 -81024 -129946 76461 88553 -103471 -188860 -52904 -127387 10486 -294946 -344911 57848
11313 -10062 -229010 -137315 324000 -365793 84343 2777 -115504 -7056 86644 51951 -153449
11301 -192745 -245811 -205739 -347396 -103544 -16246 100829 -228353 22169 105229 -68892 -603057
11290 -603057 -66146 -244177 76395 -351436 -228541 278400 -16357 68857 101682 -157860
11279 21904 -283844 -47497 -246493 -13305 -241013 -49374 -144454 132340 34482 -225977 -106517
11267 123437 -7841 -54604 -117639 -121935 46622 -197771 -266546 95876 57582 -144775 -174540
11256 -174540 -86402 41958 178646 -168367 115807 -203090 -221411 -30836 84066 -124552
11245 187057 89808 11128 -59786 -36348 296424 220395 -25074 256735 -56537 -151552 4312
11233 -97042 -116762 255620 -45083 87321 -406029 -45115 -114694 -120936 -239069 118190 -62318
11221 51553 -35124 1221 -290240 -124919 98403 18166 99063 -85851 -189526 -361627 -230554
11210 -230554 -130894 -106493 -393339 -172832 -174815 131292 -531476 -98543 30415 -323965 243041
11198 6065 82719 330366 -21386 -96232 -63268 -228799 82706 -149191 -254554 22252 -97529
11186 -109862 43644 68949 90274 15312 -132322 61671 -87406 291728 -236991 -104424 257045
11174 -188238 -167091 -94790 -292286 88079 -315978 218032 -67937 10682 -455997 -74000 94126
11162 -411528 -83895 -390008 -9440 303520 11294 15678 -286470 -171069 225284 -148690 -287926
11151 -287926 31547 193440 -92125 -310358 -80363 140527 13303 -120020 -257577 275524
11140 179476 -269295 269278 -42513 -14809 -26199 -17105 -60872 -90045 254729 52851 6084
11128 -13544 -103890 -13410 -1131 -204082 -21067 31389 125639 197998 -262745 2527 104021
11117 104021 4370 -133435 -184869 -31036 -106770 -169335 29284 394026 116572 96798 146562
11106 146562 -66823 -199527 207436 70673 387794 354911 154871 294817 66196 221025
11096 221025 454238 84450 133532 39500 127511 247276 87437 448252 249691 77817 -70843
11084 498617 241562 297249 473555 100026 354297 163432 79055 468027 161552 147437
11074 147437 -32786 302891 382995 318086 152813 194347 31065 176042 423494 442830 266747
11063 266747 146151 538138 266372 305466 591027 695174 415991 628275 617234 319484
11053 319484 620077 741092 703344 735316 475042 710807 709788 367360 810552 990337
11043 990337 1045239 801839 1022251 846516 1001591 984729 488075 678803 512612 554550
11033 554550 926551 1205082 627365 719671 905024 788023 879796 1008546 929393 1039935
11023 1039935 846204 742830 958343 796625 949063 1030568 887662 110616 677270 567118
11013 567118 598213 520290 397088 676331 469175 343880 629825 703953 666215 793301
11003 793301 902548 372706 355254 688636 651808 691747 653261 1023852 624700 617322 575829
10992 575829 423838 749539 769319 825206 896873 491382 729381 919168 691959 831365
10982 831365 853465 789301 945969 1087873 928837 1135583 1163001 1356009 1153938 1262396
10972 1262396 1459671 1701580 1423807 2011976 2056443 2273274 2428430 2841999 3084369 2976525
10962 2976525 3681573 4167368 3706792 3183021 2698467 2139346 1547347 1788155 1219981
10953 1219981 1478045 1435171 1343721 1482249 1576781 1413432 1264628 993206 907768 920164
10943 920164 698378 521481 525708 438484 543253 315231 -177182 20767 348625 222488
10933 222488 167237 159231 241346 149529 -157942 264287 12840 273936 -42200 168156 17773
10921 -5688 259778 -248928 -21462 150037 -32310 -93460 63243 -21521 -68404 -86720 -16235
10909 309690 -136347 82132 167877 -503410 5273 9333 -12343 -73269 -313380 59202 -419087
10897 32785 -122475 -47016 -144868 21474 -396356 -36629 104776 -118293 -215614 97869 -73572
10885 228337 -604764 342320 -4033 22046 -161030 231758 -75155 -5526 -34365 -287196 121292
10873 -52783 4486 -121089 -9553 -133472 -116629 121802 -234544 76423 -103377 26625 -3950
10861 57238 125046 -256949 72254 -29025 45421 -153228 -95152 -21895 -46725 -31128 134253
10849 198606 -165880 -47373 66501 -119596 -107861 224373 -77070 11033 -165565 87509 -20190
10837 -37823 409298 184188 -195170 51849 -254595 -221138 64153 -5375 79163 240045 394344
10826 394344 104365 -152391 -213926 202498 75409 -283908 55541 -233747 -68444 314414
10815 -117627 -52916 -172404 -69175 -375244 254678 -99829 -199226 -219886 -54517 -204350 -380202
10804 -380202 -61872 -100670 66485 -381595 -112916 534215 413645 462287 216018 -131639
10793 204364 127304 125305 186239 4651 -119453 -291882 -269120 15723 -1842 -22286 -174447
10782 -174447 -61427 -188308 -182288 176322 66421 -150397 35846 -119736 336162 98481 162
10770 515825 362809 12018 -111526 31571 191723 143820 -177498 -291562 104250 -306817
10759 59235 -177716 -103320 -182214 13862 241907 -71918 -119539 -34895 276842 -21765 1944
10747 62895 90118 287853 126334 -78970 -233280 128284 -83703 17207 -212286 -283905 156701
10735 5705 -13763 -198287 -77772 175297 -437375 28068 -119437 -31922 5157 39769 -130646
10723 88942 73873 -42756 -262863 -192797 -27294 -77304 153628 -314199 71010 -72836 200014
10711 121982 -62348 -184524 29303 -265254 13400 -5753 1368 -183303 -94446 -186401 -65616
10699 235191 120157 -449812 -126010 -245318 72073 -46516 -56899 -180199 169768 -158413
10688 -62299 51020 93922 -347684 -110064 -281169 -398156 28542 -93219 -24746 88697 38760
10676 -136351 -270573 -48228 99116 -192770 63437 -1293 233228 69343 -164315 -78400 -121770
10665 -121770 10868 131895 158137 24188 -372097 -155852 177909 126485 -378983 -63765
10654 -94978 90378 144223 -17409 -89202 -82312 65089 78409 -222614 -73808 -157065 21718 31130
10642 31130 231508 -50278 -154888 19721 -109524 -22647 274990 -182290 -161791 -27895 30129
10630 -78198 -35265 -232765 -187994 -22979 19781 -225160 -56571 -121216 33186 -111833 -115058
10619 -115058 15561 181488 -39128 -76148 -175588 -10958 -245540 -31707 -212311 -89080 170191
10607 -151157 -370513 -41409 -369635 -166798 -10331 -176447 -116764 -162146 -330833 -217686
10597 -217686 -281381 253205 -190902 20953 -161680 -448583 -45119 -204325 -114636 60523
10586 -237810 53249 -41309 42305 14003 -53161 123058 210356 -194320 -140556 -46099 8069
10574 50703 10224 -46908 -123138 157161 -20815 -136469 -56900 157459 91832 58701 -94640
10562 301088 -303945 -121235 -87249 -268925 172385 -205174 119014 -77078 -234401 -267482
10552 -267482 120596 28084 -269092 62525 -236384 -156183 158848 -135008 -378392 -45963
10541 84808 -82971 18277 29827 88902 -190639 -128768 -156652 -122811 -20126 -84101 -264418
10530 -264418 -66107 19434 165530 -128827 -228181 167981 57783 -107942 -515667 -198934
10519 -377013 147855 -73844 -127500 -83425 -84140 38093 -144601 -206003 60136 -108950 -72779
10508 -72779 -56641 -288505 -139707 257210 -40451 -200228 76079 -171355 -253448 -268561 -42110
10496 -81424 -269275 -36276 -264293 -150717 -71328 -77016 357217 -164376 -65028 -20402 357363
10484 251075 -127766 -369855 -205977 -153255 244744 48324 -11710 250195 129599 144228
10474 144228 133205 322613 141669 213725 257036 133781 359836 193871 113694 -129168
10463 105001 12646 130867 -63237 -332152 95274 -115381 -10473 -174532 -249028 -82526 -167478
10452 -167478 -12434 -131281 -151977 -9716 -84259 56485 -216866 -8172 103358 -281068 115783
10440 -53024 -347016 97003 -224802 92568 76031 -145840 -257930 -189186 -118816 -315681 69364
10428 79583 278477 -317387 69290 3419 68263 -14043 -210180 156685 263199 87458 511
10416 177711 -119685 -58490 -97727 -221939 269132 -162366 48666 -225922 -8383 -76591 -37011
10404 -150679 -3615 -126790 -37153 249076 -172664 34503 -113977 145483 -12292 -32249 -81503
10393 -81503 84463 -11655 6406 138670 38407 282474 38329 152694 14412 42898 -82067
10381 161496 72213 39132 -24113 45376 74475 121128 317167 114702 -69750 182112 159448
10370 159448 19565 185580 277073 247784 188925 246904 -35720 258002 234124 720901 215301
10358 482762 683950 378736 207398 142600 -71950 -96567 17104 -56071 458114 289201
10348 289201 391193 145311 253100 522511 623440 391186 440106 -69209 332842 -70419
10337 128391 15385 355367 626791 12287 256105 224927 105169 263433 362366 269061
10327 269061 36289 65488 199596 469651 227473 303134 27262 -140071 357037 171211
10316 442883 465974 42801 -7782 310137 -125299 -54544 106814 102951 35851 -231281 -118031
10305 -118031 163507 -478011 -131048 -20044 39350 -161371 178179 -310779 320362 -26204
10294 111962 -448373 -55523 192026 -17868 82476 63159 -155728 -185147 161403 -366951
10283 -205729 162816 -114762 -202591 -260994 123816 78012 -37746 -145489 4931 -56224 -165692
10272 -165692 -79515 -196994 66912 -138122 -117608 -167589 12297 -70458 108635 -108360 395145
10260 317068 -172972 -174031 -161771 -523608 -88365 40950 21202 26229 309742 197486 339726
10249 339726 65939 -147110 260636 252191 -38986 316305 329428 -460129 -382232 -62213 48480
10237 -379471 130093 -211591 27146 -8854 -77671 169579 120463 -50655 53593 -124049 -265154
10226 -265154 -279612 -52432 -134556 -13671 -112455 356469 142730 24622 -201348 -197084 -254904
10215 -254904 -111805 -100559 -88404 -182596 -12357 71886 -31273 -63011 247874 -297295 -179920
10204 -179920 -94519 37864 215672 -165249 -141241 -69872 -151201 123977 -34015 27709 -151919
10192 29962 -132638 -62719 -48134 -95473 -74478 121428 -182850 -40975 156710 -159197 -66791
10180 -80613 -202567 -32363 -229262 186698 -266751 -9406 -75660 -484402 4340 -447785 -83420
10168 -57727 -98851 48033 -252329 -350104 -60553 -111376 -187769 73770 -81080 -189496 71792
10156 -373805 -93702 -245188 -75398 -67100 -98852 -227183 -140118 -71512 -226705 23341 -32518
10144 25994 -145410 -330484 -433 -60840 -133220 -19666 347636 168197 -94178 -34871 -229295
10133 -229295 -159440 111134 -370145 215265 -56108 167850 -176093 109564 -2171 -131170
10123 -131170 -228696 -42515 -152766 -58154 -2660 42682 55382 21646 -557914 -59266 7845
10111 -456704 8278 -340584 90545 -203709 -276264 68332 39088 -323815 113030 -43534 73459
10099 -42682 -228712 -132845 -87930 -195624 -227778 -316497 -119346 -188732 -289134 -72400 19895
10087 33107 -207011 -41763 -412202 455219 -210636 49557 171015 -193946 5899 57647 -373915
10075 -90640 -177473 115187 -153823 -217870 188719 490937 -37181 -72023 116895 346531
10065 346531 -41762 48351 -48545 -84412 -358776 -306292 -133493 11305 3941 -61108 112628
10053 281748 128609 -374655 253903 -250126 -89716 39845 -96571 -20852 -39856 106128
10042 222867 -50011 54660 -60332 -243994 -307173 -165188 -74384 -310500 50978 7297 -252964
10030 -25851 -177028 104096 -440925 -31975 -247762 -438201 -211470 -75429 28947 -22263
10019 -183967 271727 -130469 274217 -114026 -62330 64958 -41936 -84384 -56011 -285498
10009 -285498 128870 36058 -231101 19144 25979 -148880 -169309 -176144 44199 -503 281518
9997 69597 -196058 -52001 -10815 185926 135789 -293828 30813 -51466 -186768 62657 34599
9986 34599 132020 197848 -59335 22494 -49593 -377664 -78370 -33901 72000 -72040 -184342
9975 -184342 67187 -118558 101611 71034 -149486 -94104 82654 -193338 -86240 228318 93592
9963 -67709 -193765 -566593 69472 39539 87181 161784 -75757 21589 -57085 -95568 16893
9951 51903 -40816 144476 64987 -245373 64949 68453 -4604 2533 -66176 122449 3202 -66418
9938 35650 -389215 -20841 -403811 -170259 245863 92547 -3168 -120042 36408 -247027 -89534
9926 -130766 -268226 -256254 27393 -51648 -25066 -65923 339863 -19650 -4112 -112740 24420
9914 41336 -22943 -4277 -300667 34121 -45172 -275829 -211119 -77822 246665 -206832 83344
9902 101248 -134353 -332151 27197 1877 -72274 -52946 33188 -48119 -67280 10956 -202687
9890 261468 -96915 -266366 -84343 -157591 -207119 -82820 -205260 -224132 -35350 -211540 -341530
9879 -341530 -339175 16200 -122699 73392 -159928 -202827 -170676 -132568 62768 -110656 42882
9867 -243024 92381 83480 -75524 54598 -285203 -97932 -241613 51974 301094 -68146 209191
9855 -204711 -42108 -29312 -208811 -132997 50127 -45556 27106 -198643 111800 -92403 -6906
9843 48698 -70920 178102 -259904 -18846 21174 68172 -134345 -41038 -29045 280878 76432
9831 -277092 -168504 -191637 41572 -198778 245033 -349039 323453 17413 -626826 -324901
9821 -324901 -214359 170886 176154 -27536 -267426 -14281 -9781 48821 -35974 -444153 -236289
9810 -236289 -51186 -86533 -322232 65783 -116695 103015 -278504 -182829 73405 -101030 298408
9798 54836 -70983 -102529 216924 -244840 164993 38127 -149590 -250325 -440340 -51077 -273568
9787 -273568 -258629 -470036 201723 94790 83540 9641 -175113 -1588 90552 -290566 10307
9775 -268220 -164914 -238476 82475 -56410 -59683 -126925 12073 314566 -359804 18536 -302141
9763 3678 -459586 -69869 -312939 104045 -61785 1888 20578 348491 108602 33601 284781
9752 284781 -408868 -108091 185611 -314539 -69115 -39345 -44559 193630 -198558 -137243 1272
9740 -53552 113606 -174039 166905 -180817 -80691 -134147 -64465 -166539 -374274 37764 96007
9729 96007 -157761 -83685 129562 -312525 196218 -204165 -158343 68321 160118 -16279 4980
9717 -87938 -314219 84821 146665 -41430 233759 -91027 -138235 -55167 -141348 -181502 -32354
9705 242212 -269060 99575 -113281 -234198 -72326 61375 -17894 70491 -79076 29697 73064
9694 73064 74643 -196733 -195412 -280733 -937 -84365 -141645 -177822 79382 47038 -120646 57899
9681 55330 12251 -1832 166699 13604 -257197 276615 88504 21403 -195421 44281 86946
9670 86946 -100290 -386808 -92399 -125501 -198857 61401 -240676 -120038 -141710 -14081 -74590
9659 -74590 1762 -223702 -369911 -465708 41945 -140898 138953 -187140 -7326 -50231 -297352
9648 -297352 -192875 -152684 -173942 114024 -101977 215955 -492345 -118916 -139355 -59755
9637 -28410 -116097 94165 -120225 -262968 -94930 -340893 14400 50008 94803 86684 -22737
9625 96656 92696 -207121 19902 217341 -235626 -178833 -242177 -32931 -444233 27651 29191
9614 29191 78402 -131972 43645 -290428 37285 -116735 93807 -467 68826 -7937 -165073 33225
9601 103089 -118298 311476 131984 -140413 152386 -132825 20262 -265829 240387 128561
9591 128561 -17506 150600 210904 -132192 -24998 -117177 75501 -113990 -8970 -274391 65064
9579 -238008 -179699 -56218 222043 49637 -217658 -25166 -43808 -49321 9958 -217607 -385927
9568 -385927 -3799 -334064 -395182 -37083 153847 128576 442095 93398 -160578 -456615 -345209
9557 -345209 -66792 -276108 -381756 -83681 51860 -79355 -282036 -136107 -260691 126442
9546 -68502 167195 -442136 -113327 69515 -170561 -302116 97109 -44925 -57049 -24009 180749
9534 -125639 -252530 -178840 -62058 -251127 31123 19791 -345894 -19716 291600 304736 -178182
9522 12150 -233916 -12223 -230291 -93541 -178598 9004 69584 -22087 225027 343544 -73933
9510 -116919 -220954 -23404 -61837 62894 421086 131688 -171515 67300 -290508 -84530 2056
9498 287905 -51591 -6181 -150529 -30378 -117623 -352995 -191253 -407466 -169254 -96134 105375
9486 -55132 151312 -32158 92600 21463 -252098 -271910 -194784 221117 106492 206635 74204
9474 -20460 -144056 -226014 -130904 -78615 -10663 71610 -9589 86014 -75838 50581 232877 -162503
9461 -35548 -468642 -155375 -328355 -140869 91661 -164236 -167095 115355 -425269 -88199 -23678
9449 117405 205055 -96476 -331711 -14463 73748 -250874 -263216 -276587 -244405 -222650 169975
9437 204824 -2227 16750 -162968 104373 74516 -108835 -136018 -180035 -209791 6859 133605
9426 133605 -105723 -6183 232459 -174530 82424 -403389 -145586 -222634 -187998 250303 173021
9415 173021 -449294 -152798 -129166 80143 -372349 103660 -49428 -24165 -114095 -159855 -169472
9404 -169472 -160407 -461745 40322 -207601 141431 -318871 -105732 -198430 85500 -299475 63390
9392 -299549 -2153 62367 157185 257317 -133405 3248 245230 6632 -5391 -233145 24309 -70492
9379 -19769 -109297 194323 -135149 -372354 58598 141889 21872 -171667 -129125 -20703 -21849
9368 -21849 202791 78330 -226500 -284209 -146700 162056 -42746 197832 125160 155537 168814
9357 168814 36000 -89862 7282 -116103 134895 -154680 172341 275688 -144583 -59708 208152
9345 -132749 51032 -1879 200656 -125297 -91276 -388844 60664 -23737 -515282 -21653 -212096
9334 -212096 98565 -204052 -237668 -25016 -66590 -65334 -26945 -53326 -66293 -390022 -328814
9323 -328814 2255 -186020 -170726 -192982 -7212 -180336 -492457 42342 -87287 168138 -349702
9311 -142591 42644 -114953 -167176 -24527 -10414 168075 -207158 -124717 -3067 103753 -109894
9299 -186317 -254913 -129250 15227 38227 -201653 -185722 70763 -131294 -44658 66775 -394942
9287 -139744 -55091 -57333 -140100 -152385 -201930 109661 -38430 167800 57882 -137094 -149489
9276 -149489 -92081 426521 -210319 -111700 -218395 -50788 -126931 -136244 -85556 44758 -18206
9264 -61363 -166645 -168469 -205897 -178715 62946 -184193 -67250 -628 -327800 -245611 -107919 -232324
9252 -232324 243591 100726 132167 -43933 -48781 25282 283977 -154844 -2184 2394 -187948
9240 -489138 258211 -201373 244208 8434 286223 223625 -79693 26473 -225772 -556329 -213327
9228 136624 -386010 -122033 -245507 94413 -47809 -119189 294700 -106519 -163356 276917
9217 -259420 28809 -178348 -249067 122939 -222698 257260 -29498 71951 -88902 -351023 -140347
9205 -45081 -149142 120491 -6595 -184902 52217 342888 28120 -61226 -579945 291652 24830
9193 -323849 -41601 154004 -382097 -199041 -57587 227110 19172 167061 -27255 -85369 -212730
9182 -212730 63059 -73894 -231246 -291283 -107320 -94123 -285602 -509025 -233614 -70341 183483
9170 -129403 234083 -54233 -117890 -79147 -74115 19505 -140748 31986 -35554 -116959 99083
9158 -9780 -26899 -413260 116272 -87793 -308322 -289423 -163633 -213249 119642 64262 113572
9147 113572 -141540 -19385 -70184 -23227 -41355 261846 80825 96696 -9082 -105342 -38927
9135 162020 64191 -63971 -57564 -36578 -151584 -311941 -112201 -118457 -294699 -259268 281170
9123 -81982 -382980 133738 -38472 -48938 15174 -173697 -247223 -312956 -93477 -141045 -178277
9112 -178277 169675 -40113 -2258 130239 -90025 222394 -325535 -294801 -116321 -240377 201264
9100 -390792 -279551 -150013 23342 -261725 -56472 75676 -480989 68916 81435 -13877 -13548
9089 -13548 205055 -251728 -171756 247184 583 86514 36142 29849 -151819 10547 -79368 251268
9076 -79305 200305 -48079 -46214 208478 11986 -162410 -78136 -163869 -218221 -16714 -49652
9065 -49652 178572 19470 -383797 283734 334042 -183741 -256469 -204375 -65445 -91625 -116605
9054 -116605 -379477 -225688 -125465 -100665 -312853 91077 -130926 -86617 -18075 97578 204985
9043 204985 -265859 82412 -170041 18418 128033 -153361 25319 -164220 -272353 -102349
9032 -171612 95920 -31827 -195887 -16832 -2042 -227759 -437200 -111637 -84539 122967 -231047
9020 -264064 36130 24485 265713 293187 217345 311540 -349890 -185708 -55856 25548 -211363
9008 -130167 350404 3908 -238759 -57914 2113 -413624 217332 -141104 -300701 16567 -46994
8996 5868 -72325 264116 -159482 -38925 -83479 164765 -10832 -7018 -150766 133088 -147740
8984 -369694 -349375 617 -308175 -189028 -180008 -215488 236706 74025 100538 -76541 -275193
8973 -275193 -69795 179535 -348816 7608 -194908 -18832 108546 10557 -145327 -658134 94140
8961 -209965 -99697 -294103 84651 -199003 -85623 220106 -84016 -75462 -358473 -98324 111136
8949 -105597 -148290 94296 85426 -151989 69292 -140926 198917 -365787 -148606 -269859 117495
8937 -85441 -131430 -50296 -115193 249125 30680 -291937 -437279 -18338 -20996 133076 -312087
8925 -41745 4234 -135212 -54653 -482279 333705 48911 42093 317384 578956 215071 -63329
8913 -152012 -76094 -10021 -76136 -82156 -475675 -57322 -77662 42496 9586 -134876 183866
8901 -147164 61812 170255 -56611 -177759 181414 -71128 582812 -75203 125012 -61782 -116573
8890 -116573 -55250 -217399 -62666 56117 194301 -94473 -207374 -179064 -138810 -220769 43711
8878 -304776 -42965 178597 249828 -65016 -99560 -63682 -364910 -156497 -24135 72115 213768
8867 213768 -101602 322009 -62352 160518 -113192 -92209 -216118 -349546 72238 -292044
8856 100829 91959 39934 105940 -441025 117821 -81951 241870 -182843 -173212 -80592 -75271
8845 -75271 -148500 -250552 -20427 218357 51026 -245982 -494997 200067 -84962 191771 130728
8834 130728 182722 172082 -45206 -29639 120377 69160 153015 41747 137415 -314563 22092
8822 -41118 235435 132054 -264334 -258997 -166501 64346 80175 124684 -284981 145525 -60790
8810 80380 319220 -91498 -250990 96897 -136475 -58017 -233668 -283122 -21012 331133 12968
8798 -107598 -64135 225247 24890 -237717 176315 36447 113637 -124309 133322 -126886
8787 75780 -154548 23088 -122376 -96234 -159943 -249581 116867 -59880 -220370 20813 -36195
8775 -45845 -66476 -305726 -350944 110287 -223858 273962 47641 -83835 215077 10984 145002
8764 145002 191723 60430 -176707 38849 -101358 -246321 -13158 -171322 -196942 -11115 -189958
8753 -189958 -8227 -67271 -114387 -348516 -48943 2853 138614 32279 75868 -53278 17625 -139438
8740 -47506 -44119 -244874 141183 -121218 -13624 -55727 -116259 -53382 -193556 -67834 -114209
8729 -114209 58299 -97606 -334888 -207976 -92984 -194120 -74406 -57007 -38154 -95789 -301230
8718 -301230 -212580 98308 -272117 38806 -392474 215131 3910 42427 53701 -154697 -112530
8707 -112530 -98819 -78275 -148430 -326087 184559 9793 6092 56503 78673 -286963 68579
8695 -254704 145155 -186730 149007 73322 254469 38917 145406 -199815 58536 -222211
8684 -107238 -284926 242188 -261909 -296935 227000 162916 -118773 335954 -151456 40305
8673 -122094 131240 -142505 158678 -33613 147232 -211865 -42609 230896 -687 -467404 -229579
8661 -23048 51446 41856 -165472 -359257 -66163 141920 49416 -16600 -159500 -116171 -263517
8650 -263517 -326174 -236711 -434142 -77804 21082 -202140 180228 40222 -110302 -69185 224295
8638 -115779 -76964 -402313 24534 -224906 68653 219452 -108784 61441 -95226 9162 -35470
8626 -104949 91695 -47743 -151876 15928 -282034 -42256 -204319 -164294 155862 -14368 195605
8614 189057 -143087 154623 49558 146593 -199358 -162482 -131396 38127 -443221 51709 -37934
8602 -138841 -379445 -2031 -151621 -72913 -205301 -466243 -225437 86215 -118407 -306929
8592 -306929 -16781 78954 -41083 -72388 93329 127093 54612 -55767 -250135 -88857 169295
8580 59914 -18115 -889 -15943 -7270 -304757 -40884 -523734 -145614 -19953 220703 -54072 -111909
8568 -111909 -232975 -61142 71655 -335312 -278 39004 -291851 27501 -179602 -325269 134084
8556 146038 -128753 -223570 -22238 89360 -112532 36915 134450 45390 -139248 57161 64298
8545 64298 -527324 148306 -96097 -39476 -5345 333448 1461 83360 119854 -184917 134968
8533 127161 16557 37417 -28797 -147816 -101296 -65040 111238 -30620 146838 -122602 242472
8521 -347634 12876 45783 -14571 49199 -296770 68785 -130425 165928 131062 -21734 275943
8509 -367765 -25555 -239882 4164 -213451 -40878 -163941 243299 20596 -58399 -150118 -231116
8498 -231116 -323098 -162362 -160359 41654 225192 86778 -67314 10372 51753 9663 -335874
8486 -273177 -219336 211708 -185876 -102651 61726 -218710 171252 -206107 -146431 69175 -29589
8474 -148375 72659 -264021 -250648 -41625 -9774 -5464 -84536 -232155 -71690 -350953 -101176
8462 70846 54085 -175155 -41729 -162153 76469 28227 27373 122970 -350097 -4894 13573 -190207
8449 -78098 -290120 411305 -76480 -130047 -29225 114499 -294843 -115834 -37487 -90889 -72779
8438 -72779 -372698 -53225 81543 -103353 -120338 -223482 -37407 103854 -6286 88291 -346954
8426 267449 -2487 348802 -43257 -57227 -20170 -65501 -167932 39394 35451 -76258 -221547
8415 -221547 150995 173053 -19267 -260 -206905 235617 -88836 -169284 38243 -139023 201741
8403 71885 -254096 -42099 -208918 -194240 -99535 15673 -176271 86320 -303818 48267 -24652
8391 -151998 -165589 -96932 43046 55429 -172626 124531 195278 9076 141803 -161420 336842
8379 -235600 -169266 -172421 -17242 338098 -172081 -97275 64916 169075 215360 21562 -67750
8367 -155808 164944 -134825 260601 -21117 -195693 11573 21679 266431 40038 -108509
8356 -109352 -170244 -136844 -37399 -196500 -86917 101150 -125126 70902 43108 274914 19947
8344 -263318 -59679 -42652 104639 397421 19325 -98628 -413717 -97846 -11903 -82286 -46461
8333 -46461 236346 -15166 36352 -61934 171273 -127310 -71298 64145 -225813 -192241 -29265
8321 -193610 42283 53075 -296785 -80152 -52799 -180912 -77411 74532 -117673 11297 269939
8310 269939 -9431 282499 65626 -72798 50659 -37888 -195990 -54461 223778 214606 19159
8298 -64645 180609 81823 89944 193298 -106258 17053 -79041 -395508 -110200 -97599 -66679
8287 -66679 227019 24538 -19909 -210944 -75727 -108937 -155135 -52689 28702 200017 17438
8275 57098 -115264 -185177 -12563 -185223 -92168 -64873 -155244 -47284 21628 -120135 61206
8263 -370232 55225 -281963 79102 -142317 -93548 -73614 -147546 565462 72210 -158879 -62641
8251 -70381 223213 36134 -149597 41151 -59695 -179057 -153407 -175355 -159823 -83421 -116129
8240 -116129 39383 133885 282882 -303144 -59989 -32959 -215305 -73465 -297791 88644 155664
8229 155664 121116 227580 -431896 -284502 -207951 -125745 176129 111870 55020 -160535 -121132
8218 -121132 2753 -128528 -57209 -57593 32735 -18367 314419 -145065 26838 2818 -153512 207755
8205 123245 -210863 341888 250085 -223415 71085 -396887 -236937 -73624 -10629 185252
8194 19386 154288 -405228 -12245 217623 -182527 -237524 -88063 -45138 -387457 -87369 110317
8182 -41248 140970 -12746 77872 120809 82463 -87041 -17157 -54056 -227268 -188796 -13429
8170 -469278 -153732 82406 -403586 -185419 6802 -317475 -137330 258540 -235225 124404
8159 51958 -170228 -8859 -281088 37386 191205 -178117 66068 -427497 -342238 99356 157721
8148 157721 -125297 203238 26023 -112838 -156249 -112461 -216981 -112104 76995 191761
8138 191761 -85096 -282556 157614 -200081 91161 -105165 -43315 -1701 358131 352742 57416
8126 -24273 101945 -159176 -325929 -498191 -44804 -163915 348712 220319 -54355 -212179
8116 -212179 -68828 45259 -123760 -53119 -276273 -90977 108950 -344709 -187113 -217845 167279
8104 222682 -459978 -295991 -25950 118200 -69741 175449 30086 -431109 -222441 164741
8093 -25393 -52545 35183 -119249 88287 365129 -37388 18492 -44941 -30439 -207633 -395112
8082 -395112 -142345 117864 -122552 -286810 -243753 -197572 -72886 -377125 -80044 -56356 -143034
8071 -143034 139440 -331259 -12214 -164774 -73428 304970 181139 -82538 65280 -78109 6723
8059 196966 -78906 -97234 -106812 59080 186288 85108 186643 25284 -176818 105755 -152184
8047 -33222 180304 -37110 26142 253695 194862 145051 109451 -307468 -63022 -263078 174168
8035 173546 24095 -28834 -233137 -116470 -123434 -258977 171488 129185 -28930 -94628 103606
8023 267415 -149649 121648 20283 -64270 208103 -86886 118287 97451 -20787 -40519 -197989
8012 -197989 -210941 -40250 -152237 74499 10427 -14165 914 -413739 -98099 -129012 -62856 138780
7999 149822 -259643 8905 46268 -18233 -61826 -87670 -31553 34896 -81753 47636 -32266 -130538
7987 -130538 221193 -227505 328656 192025 -86546 50681 -87280 -151296 115619 -121524
7976 -70735 -167691 -49934 -140883 -96106 -259571 27596 -186777 126615 -21726 -92422 8971
7964 87203 -152231 38003 9911 -253959 -62940 29647 -359318 218890 269448 -85417 145051
7952 67078 -231000 -276504 -24059 -19980 142290 77837 -174338 165025 -218795 21706 150851
7941 150851 32266 -87814 -30624 -5054 -68159 309714 -184152 -326520 86990 52014 115036
7930 115036 157148 214976 209857 -134476 -147765 -122904 -138343 42735 165464 222415 139321
7919 139321 93210 39852 37416 236062 117773 161727 60828 -78130 -33403 -97866 -84534
7908 -84534 -182480 -200326 -174947 -146058 -190809 58984 -29839 -94304 -167198 86850 -305830 -43679
7895 -394592 140113 328690 4191 172139 -164028 -251254 -32146 135166 -47987 -25290 13508
7883 25674 -154023 -313595 -269822 178300 42024 -213823 -159241 -94985 -119260 153955 -239706
7871 -89213 70232 73041 75780 -164573 -170521 -72174 -152663 -3789 96663 79549 224998 -10308
7858 -43915 -69867 -214924 -76709 -308078 76268 219999 -93398 152860 -17278 -434905 160928
7846 -153073 -365419 469421 -81042 -179926 -174115 -75512 79483 -3240 -114702 -60803 -153272
7835 -153272 -97437 67791 -395613 62998 -246679 -114675 -62762 -8802 -47471 -55965 192536
7823 -55796 -133189 489 44491 -68688 -86666 -263338 -52486 -172733 41883 50824 -80706 -146155
7811 -146155 170784 239313 -49887 -167041 -78932 370476 347460 -260223 256784 -6577 -110017
7800 -110017 -383547 16198 -62396 88388 -35247 102656 -40733 -156890 -90727 172899 -228311
7788 -115137 17787 -340722 91819 -145556 57079 -55003 96930 -348113 376401 -33473 58401
7776 6651 60134 -65608 64581 177032 -169779 76056 -313927 370988 -197273 -170398 -206472
7765 -206472 -248579 -422661 -191124 -120974 83711 -24776 -8598 166463 -37904 -71531 -230740
7754 -230740 -90249 52370 -228878 -57176 -137860 -292734 -267087 -109775 -211843 -133678 231715
7742 -223937 40891 52606 -17327 366572 43511 -36876 -14353 194242 -10156 -152523 -101915
7731 -101915 -538785 -133550 113539 407696 236135 -62597 -323177 -101693 36436 -341038
7720 225061 159956 -34201 -153341 -242228 -83413 564880 216803 -408422 119316 -457708
7709 152662 -62543 222369 96550 115976 -118682 -30981 177531 -275468 -205562 -416226 -148311
7697 -165976 -95022 171715 93223 10468 -233140 255805 -15125 31662 -298876 -33688 323486
7685 -68995 -84114 -194308 -82279 -141773 -420452 185669 70990 -109501 -334678 -136199 80759
7673 -243530 -27579 -158076 -9750 294035 -266364 -186629 64591 -145556 -276744 -227608 7319
7661 -97634 -126184 65804 201267 -226431 188176 -125250 -27281 -150204 142268 -449776
7650 -105403 -65833 97567 -79984 -119902 73426 30241 -214067 -118900 -109783 -243101 103460
7638 -2647 8612 14245 -120488 81474 358492 321023 103770 105201 162380 144050 60933 24562
7625 110061 -62297 -76118 -242467 -13192 -309188 -86487 -170073 -264106 -15783 -155625 -26062
7613 -129647 -219723 320815 30759 89192 378859 -194582 -230638 -216610 -234236 100472 37408
7601 -8554 239299 -89100 226843 661 16158 -187482 241986 -434125 99029 -199768 -19760
7589 226708 357539 -371208 99389 146334 -63109 49599 -232770 -16542 280571 132304 31615
7577 3909 117195 47603 -95404 -222590 196011 80856 81625 32447 -131556 44597 157990
7566 157990 -339903 -151507 259669 -111771 -168298 24077 -89130 85488 -297415 20487 293405
7555 293405 19984 -30349 -298192 374687 195128 -201805 -290677 -199342 103296 45124 30633
7544 30633 -20847 -215747 190510 70500 210246 -231565 47374 167408 31454 -275632 139084
7532 -84630 -101675 -47507 206163 -19420 12535 167916 -152903 -53619 -550862 37062 61888
7521 61888 -40031 122050 48865 -228501 38296 206799 -154311 102659 -113920 -344687
7511 -344687 -71328 -188861 -84541 -396274 201342 22934 -72037 -291651 -137223 133671
7500 -63610 163446 127414 114067 -83637 -78993 110872 -78550 45930 170029 -44800 -296790
7489 -296790 -306880 166041 102399 86172 109441 -133785 173874 -133849 118766 8630 5955
7478 5955 45965 -367722 224005 30611 92268 -11628 -240553 5720 -38205 -34720 43953 -49214
7465 -55620 -235114 -46911 303986 13477 4316 -221515 -81010 -100627 -183429 -223721 -206775
7454 -206775 -273564 -86965 83836 20021 -104190 -84400 18760 -128875 215688 -80637 10862
7442 40433 -334457 -55406 367060 35742 167810 92361 383319 57956 -84579 96694 -183132
7430 59397 -221602 70377 -94685 182812 336853 236260 105930 134378 16509 -63645 -198297
7419 -198297 -222379 -244944 134695 -37321 45084 -157194 24942 -111121 35769 -320743 234438
7407 -32959 163162 -315965 -98559 -46487 -470914 165105 -81692 -43563 -127981 144601 -164009
7395 -54110 -398387 -24308 -175875 -225442 109588 -115142 -16363 -153500 -87294 -188230 -217757
7384 -217757 -46630 246905 -76733 4908 -78142 -8016 61379 -107282 65032 195750 -157361
7372 -141431 -6276 244339 -71523 80793 30268 -62332 -212961 152402 -72482 110124 -232130
7360 66648 -62397 -188193 -52677 109493 -119649 22289 74232 74124 -259031 -159084 -282254
7349 -282254 -112699 19554 104994 -271510 214403 -11657 -325996 132741 -61802 49460 -78685
7337 -106105 -145674 66202 -138308 179981 2313 -31005 -174324 -128386 -223009 117048 -186643
7325 -114823 64237 -323812 -326974 3393 27415 162230 10575 -6209 -153358 132954 18118
7313 -126833 106914 -348226 -241318 53363 -137468 -4971 91908 -214120 -50906 25130 -158834
7301 59152 298136 -20888 91215 354528 121929 20269 68159 -4888 -4391 -131625 -64221 -35059
7289 -35059 -184090 94264 -140375 -58003 -72325 142000 -113853 191359 -18005 71257 149101
7278 149101 -49166 168137 -16501 -101535 -187512 179858 -203102 -263412 -83758 40061 -51232
7266 98152 -393176 -185604 -336113 -106555 -2337 21664 -95345 -54800 155418 -162908 -203224
7255 -203224 -75919 4123 55312 77398 106624 77689 -178689 -215947 23019 336680 -18084
7243 -5055 -72663 -152611 -111221 -95314 112612 -3164 275805 -203125 -29853 20001 36054 -42685
7230 141082 -180350 -201278 -230967 135023 -38158 -574672 -158830 -101814 198286 -238768
7219 115528 -265032 35704 383245 -215178 60819 240181 67837 -102723 144318 10077
7208 147791 -40897 101351 -210819 -42446 -214288 -35575 -255383 4003 -154001 -148910 71840
7196 65380 -39021 -419354 -181312 277318 168345 107832 22291 82156 318478 132878 -204790
7184 23841 136603 52691 -106885 38797 39406 -232551 80287 158995 -42853 -114294 -356539
7173 -356539 -320637 61357 -3040 -79190 89788 -93507 295643 195905 -190556 -1993 86736 -85400
7160 226763 -206198 129009 -114887 -149379 -77877 -86946 -396874 -159037 -178789 21100 221719
7149 221719 -174070 -45302 64860 -99180 47980 -124857 149811 -185418 -154703 -284844 -87702
7137 -156105 20358 -375751 255549 -216894 131722 -78032 108093 167490 -221417 4786 -322543
7125 -204132 89108 -343784 -250584 30144 -49496 89025 163382 -140963 -357383 207135 122775
7114 122775 29178 76976 46624 -147840 -206355 -248993 95889 -3609 123071 -51206 150901
7102 -104483 -238914 -277735 -232919 142169 -73092 359473 13407 53734 -126911 -64330 -155002
7091 -155002 127125 -99063 -213147 242912 -115558 -166780 140686 -76866 -43906 -100141 -231415
7080 -231415 24402 212352 54736 -334400 -74199 -169419 -15685 -130925 177826 -13680 -278255
7069 -278255 144234 183456 194300 117948 124269 -215371 161580 -24754 98298 137094 -61119
7057 6469 209618 -72091 105393 -55049 97357 146457 29077 176427 175387 -352360 2259 -75094
7044 125649 -21191 -160927 -153672 250377 146960 -90048 -59862 -111704 -254595 -119368 126224
7032 -151828 -247345 14733 -267655 -136768 -13291 -90608 -17428 -288703 55233 219180 -287568
7020 -180914 -25297 99780 43031 182179 -287778 154630 -111413 229468 -183583 127472
7009 102096 -41351 -15959 260123 -220619 64937 -222057 -119651 111997 172101 -212857
6998 -4798 -71632 24620 -102076 -30410 -154981 106198 -48678 -202948 -246307 -65767 -78602
6987 -78602 148264 -515823 -244205 52974 -65967 -272322 290636 282459 46189 79503 137039
6976 137039 7958 57892 174346 157563 -59830 -55418 9353 -40494 -56546 -22029 -387705 -86138
6963 279019 13302 119409 8495 12633 264264 -312809 -123619 130366 253220 110457 -161423
6951 107555 -50777 -109475 45689 -19477 167130 9414 47299 93947 -217426 -180487 -53977
6939 -182767 37833 -102595 106829 79321 230121 -251204 42143 143788 193086 -89851 -275147
6928 -275147 68464 -119080 48888 78913 -115705 149014 -222625 -112506 44079 -292703
6917 -332708 -177913 12571 233001 247877 209489 105496 -137499 -64148 -45455 -197234 101980
6905 192250 -224311 297469 52305 110334 -240228 89143 283852 289958 -437957 -221367 -263872
6894 -263872 79717 -114591 259702 60828 116270 -6753 -95241 -173914 237569 66196 -3405
6882 -345627 -82101 213972 -52979 84393 189750 -71593 -89539 -86928 212179 -66068 -190706
6871 -190706 107264 182226 63722 -17460 27459 -200124 30495 -306008 -4010 -13774 1086 -153723
6858 22664 -104876 1287 -60612 1545 -145390 -392213 15549 -268974 41181 -254409 41145
6846 -88600 114999 247821 85332 117622 246516 58533 107198 -224693 280789 383700 19679
6834 113824 -41922 -199306 142593 78021 89272 318828 -183279 -314533 17552 209034
6824 209034 -363917 79822 -102642 -119045 32735 -112986 5249 -48785 78960 -9128 -303147
6813 -303147 168819 -20668 -67631 -46444 74480 -284481 -349603 -64085 175942 -119116 -22740
6801 -67982 -19256 -2929 -194549 -142652 131824 198785 120774 -273654 -36430 -1701 -427149
6790 -427149 -60646 122114 -170796 -214697 217409 -10521 383795 -95937 109239 -74405 -68320
6779 -68320 -129236 93899 12487 -5075 -44623 -195167 -57636 133195 -379699 16719 110620
6768 110620 -249761 -319121 -60253 -7877 374220 -322346 168721 49761 -301564 -251673 -222358
6757 -222358 -134197 -204419 -188522 -119532 -118188 57958 -89816 29646 -111510 286668 7586 -112262
6744 119178 250595 124683 81359 -108111 241287 -246488 -104312 142158 314669 162499
6734 162499 -201638 66895 121168 -143842 -61139 -13437 -104196 -118951 111400 -27721 -197804
6723 -197804 25655 182434 -78676 -46276 210910 26422 -66298 -100161 62964 -169209 192810
6711 -71914 157126 275026 30961 -4801 -16841 35047 -96460 88835 47087 35491 6554 -33121
6698 160217 566294 80466 -16647 -229862 -87197 20080 136661 -285135 -157936 -223416 -338990
6687 -338990 -579750 333727 -152126 -120976 -259056 158023 -142830 -25009 61130 99443
6677 99443 -202531 -164457 39445 -11573 -2893 -172509 252610 -332179 138120 -207955 -182072
6666 -182072 241426 28363 62044 -149089 -74116 -69121 216824 -136927 -117920 -1410 -117446
6655 -117446 -239274 -148846 113206 51775 229081 231632 382224 -114174 324277 71237 -201737
6643 -72247 71683 -48545 289470 138774 -216764 160397 -81995 19877 110260 -112890 81313
6631 -34164 35715 93313 -9416 285251 -238325 -86351 -98065 -424129 -247952 -97998 -29310
6619 -123251 70515 41646 -188213 -52668 71185 -86140 -107236 -414555 -14685 7561 -37973
6607 -49925 361199 123010 329948 138919 -244065 -173149 -159174 103944 -268496 -272360 10924
6595 -99342 241729 -65666 -232301 276711 109848 155318 96022 209083 -61270 -22689 -212952
6584 -212952 -223071 84443 -118283 -43606 238784 -108935 -108515 -121838 -182133 -221692 -55918
6572 -37386 -152758 -257971 122200 -152370 26878 -278485 388827 -64924 -227040 -191023
6562 -191023 140361 69534 -194003 190023 159163 76751 -82950 12347 -144577 137019 -255504
6550 -478859 -92035 -90554 193181 -29419 -154029 -2869 -232373 34724 65716 -564249 92056
6538 -159730 138009 -79744 139884 -61267 112567 101808 145719 241756 -315371 125664 55039
6526 -132669 -15551 75270 29506 -192094 74897 -112736 67797 42755 -61764 -121076 51929
6514 -195213 199012 -160568 -103473 -132542 -40138 264284 -154421 309952 -158920 306954
6503 63437 -91841 14169 -387960 -150968 -201954 274209 163770 -147996 89524 -452088 160069
6491 -35671 -320363 -138406 22188 -151886 -258462 -81691 156433 -221026 328785 196698
6481 196698 -222495 181417 83644 -29115 -153051 60388 369863 -261412 62387 32820 -119279
6469 -26189 248873 168330 -107849 -108473 -364134 238460 -205550 -289344 24285 43838 -27912
6457 147580 171218 -101041 10780 -108191 -93072 -104531 147591 165578 169734 161547 -80255
6445 -6874 -10208 155337 23409 -4818 187848 88156 -432358 -214042 -71056 80579 -103379
6433 -142152 -258528 208239 -244417 -143392 -25974 147279 27525 -279769 -77024 -85321 111807
6421 152925 35965 130788 -24431 3881 219541 -408568 -108777 41051 4405 -109767 -181608
6410 -181608 -111235 -15356 149893 -15880 16849 -160515 -132634 -207342 -44918 -102997 -109860
6399 -109860 252177 218179 208987 -68073 -8152 244928 -146856 -134874 -100712 -52255 33281
6387 78959 -309015 -124928 277377 -89519 -21361 133295 176323 -198106 186386 -95812 -23484
6375 -226204 -404514 145841 3426 -72291 147994 61869 -320372 275097 -82082 -301552 185626
6363 138297 224118 123743 247113 -330131 410569 -397880 -110794 -281448 108859 63412
6353 63412 107456 -230959 16470 -293662 -62543 28741 169937 -16250 59656 -241698 -163626
6342 -163626 -94850 -63714 -72743 362926 259380 298974 -17226 165264 38172 -115871 -88099
6331 -88099 -164550 192116 34952 -57119 86899 221439 238209 -187251 328623 -12748 -271760
6320 -271760 -8507 -63198 100915 -167975 -25400 -135977 347700 -93271 154250 -222665 -205239
6309 -205239 227153 -125612 221196 -371540 292131 -212542 -157512 96404 136171 -331275
6298 249977 -118887 -493832 104899 237640 -77671 -292215 153219 -505 -166889 -70643 86090
6286 55722 48173 -165576 -93077 -128645 -57857 -194190 -128548 19237 200869 -84337 -147352
6275 -147352 230640 -183769 103593 -71145 -348300 90411 -18117 -143841 91174 -134950
6264 -24244 14487 -147020 136700 112469 329485 -92003 -128135 195202 -243260 -169213 77840
6252 -250180 -107443 89590 115488 -77727 -49487 79132 211086 -51471 -107447 277999 167887
6241 167887 -23848 -89632 -21343 -399383 -178680 -146957 49044 -324156 80880 40870 376337
6230 376337 148227 71428 -158673 -122968 82338 -96446 -149712 83813 29292 -350118 202512
6218 -162409 144253 4047 -281353 125573 180241 129183 -152680 -84935 317116 -58228 -72233
6207 -72233 107211 -46143 -268650 -239719 -40887 31957 41445 146440 273179 -318428 -49960
6195 -11477 -152889 118613 -216938 147901 38757 -98843 -96707 96798 155664 91619 616 68012
6183 68012 99200 -132677 -153933 -164302 -142860 -36976 40892 127336 69343 -71146 -378035
6172 -378035 -558389 -228426 -170391 -36396 32109 -63674 19991 12415 87555 150680 -175148
6160 56728 260663 -151680 264498 29517 268214 48988 -32167 -10570 -22955 52987 100476
6149 100476 122413 -289043 -68777 -32891 103865 -58133 38657 -167100 -169623 -31659 -55980
6138 -55980 54120 -20524 -134301 -41084 27812 -107947 -164690 -99396 -242435 -53758 -346837
6127 -346837 -10983 145098 -73024 68925 -49615 -44915 15586 32746 -15538 -102359 -81842 46110
6114 -190367 44760 101897 376983 -298264 41427 51169 119914 189561 -319241 154871 -147813
6102 158061 8103 148036 -269445 54612 -141571 333019 -41103 99293 -113534 -102894 -144898
6091 -144898 -210673 219821 84506 38373 83783 201975 -2888 25124 -3984 18894 314979
6080 314979 -496334 264832 215174 -125498 51277 -46005 120202 -165012 48900 74100 265502
6069 265502 -237345 8390 170836 175946 -169638 -152623 46901 -236687 375918 71942 335877
6058 335877 125674 44577 -125909 -203636 178415 389212 -67544 -344148 -28598 159923
6047 42964 -82460 182211 15003 -367255 -77811 134850 -187071 -153403 -112084 -4800 -449585
6036 -449585 94461 -355087 -40066 280384 -360162 76465 -73154 -79556 -55822 -124575 -142813
6025 -142813 -234734 96711 240259 -139179 -287701 141768 -134193 187426 -141242 -50508
6014 -58016 82690 32983 254272 149067 -204551 -161738 -173659 132671 118506 211796 32721
6002 -218411 2529 122142 35185 108687 -3936 21811 19728 16937 -26825 203456 -39283 -336373
5990 -336373 -385894 245529 14435 44310 -102584 -198835 138361 -59500 -2032 196195 15738
5978 30439 251351 -418644 146846 -89697 -264594 26983 -102667 -394393 -39523 -18444 -192447
5967 -192447 -103436 34797 -43333 26706 163460 -172491 232379 -56985 200655 121786 133014
5956 133014 83730 -474637 49967 -51233 -100645 139752 88923 347868 -89877 -220931 -131246
5945 -131246 49886 -5723 -418966 -219483 201333 -329726 93806 -308197 148311 -79063 -5578
5933 144969 -98274 -69764 -52088 140905 29746 67101 10506 -48799 -211654 -257796 -204452
5922 -204452 80650 -101238 -20981 21317 144406 -237243 -25089 182724 165318 -10642 225631
5910 -178594 184337 439302 -238097 -189643 -136873 -376468 46333 -169243 22760 250703
5900 250703 102115 178713 222110 -36726 -25090 -134318 28994 25688 -183763 66961 64186
5889 64186 -275581 -69449 -72865 79031 -120878 -170785 88743 121754 -55810 -78790 108886
5877 -278031 218544 -87964 47019 -117094 159771 -51702 25885 -142023 -129253 156335 98984
5866 98984 159767 -12789 -328804 79083 49448 -141681 -314065 81542 -56269 -157050 -121724
5855 -121724 213029 13099 148003 -21406 -69114 -195870 123211 219504 -135147 -389764
5845 -389764 19527 22242 -6926 33989 -206601 -25394 115333 132086 49393 316685 174484
5834 174484 155256 -91201 447899 205221 176178 -85686 290615 27449 -50981 55135 207807
5823 207807 383496 -301074 -75499 -95161 186446 -23915 -151080 75822 -100865 181850
5812 19697 314179 101080 90459 -206074 178240 -33284 60700 145045 366265 -35104 -92670
5801 -92670 -132254 117572 80143 -115842 259119 -314191 -150454 137371 -172577 -385988
5791 -385988 122271 -173596 -247661 59450 204555 298645 -114941 -73310 120551 46345 -95188
5779 34426 245509 -88247 103251 63622 36023 -4671 -181314 -83655 -52258 -135525 160514
5767 -201931 22627 63144 -78226 55761 -151032 -126872 7690 -214048 -98839 -25508 -376575
5756 -376575 -85553 -184096 150876 -16882 362900 -64474 -55743 -11822 521242 349649 -76177
5744 -32263 -195053 39365 -33291 -23509 58178 18134 -53515 5478 80493 -107347 -101649 196536
5731 -79453 -31710 -18212 109212 -72898 -111528 -3536 -23160 -97766 -303279 41675 -248902
5719 190453 -445835 -24087 -60579 113545 -68320 -336510 -147166 -21579 259394 189010 -264974
5707 -191023 -134689 -42768 96285 -214142 117866 16130 129349 70606 73952 73096 173227
5696 173227 124225 -190727 127209 -86507 -120725 -175298 -67904 -17097 -99310 -146589 -211428
5685 -211428 -28067 62728 69570 -117259 85247 -49007 -301041 480793 46257 -504907 29046
5673 -138713 150273 82769 69671 -14231 -75584 30463 52458 -277299 -81496 -29513 11733
5661 80312 1106 155044 -20276 -96437 -130234 13019 74855 271329 283169 -63285 -115720 -58932
5649 -58932 56359 40615 318220 -630690 -108860 137233 -142809 44345 46815 -74444 171373
5637 194693 -11860 -22999 324529 -258345 -75021 -40295 -191879 4376 162749 -417797 -66840
5625 120116 75492 -170986 27496 187016 -61858 -93603 -171564 131097 -151330 156410 -319653
5613 56179 -24499 -247557 114399 121141 -72885 -61807 263551 -11703 -90617 -59265 135724
5601 -11142 -356909 188305 126072 -18961 -22929 111476 10989 314967 -86536 46155 195127
5590 195127 262752 29636 99454 -126581 -22146 321285 -249413 101096 20852 112178 205177
5579 205177 -104568 291555 -75854 92716 -19544 -91759 122202 -14632 -14602 -23557 -97525 7238
5566 -267520 -195190 -133407 87797 -30275 -145836 20161 172171 -23221 233077 -46312 34211
5554 75387 -313021 -109097 -65128 -302427 125245 109657 -74086 277375 -227767 -174148 69972
5542 -19900 226498 134361 41114 169507 247525 446042 295036 -233138 -262443 -206657 -121668
5531 -121668 94953 -74357 -15976 -41973 -353067 83029 31705 122223 394265 -47379 -42941
5520 -42941 137356 381564 -28590 -110116 128867 130247 -146725 22663 -139465 -18950 73319
5508 -15072 33995 142582 176597 230936 -89481 -26829 -219527 -34486 170356 -24861 97200
5496 20877 -325111 -267004 331345 -262028 57009 -6021 -48123 -198210 -179081 123889 -132501
5484 43775 139693 145255 -264004 29696 -133896 290672 189280 456845 309783 -216187 -42841
5472 128063 -226590 -265828 -372425 -3428 116430 230595 -60898 22419 122706 -33359 82909
5460 247062 150520 318222 176161 -64394 -379740 -285876 299343 62816 122678 186704 156541
5449 156541 80381 43944 -55626 -80357 -642613 -39411 179311 238536 125195 -230820 48264
5437 -62139 137963 -40847 -22240 282537 95850 -5167 -55089 93577 -112325 228187 -66510
5425 98840 -129971 -134734 -95871 1654 183962 19602 -79704 78062 -298462 239412 -118860
5413 -103231 301 146143 163573 232087 -391500 -42969 -279440 27907 -106582 -147076 11332
5401 224442 47887 39109 -179176 229124 -246071 147432 2337 -65465 -493 -54648 153463
5389 -194952 120859 -111631 64340 -220112 266469 -256887 121687 -126391 -82825 100882
5378 -286671 64517 -155733 -162206 23941 316891 296912 90037 -21528 423614 -233758 -14040
5366 68696 -89305 -42454 -2733 -67430 -113557 -55987 136354 -90873 293695 303173 290907 -195534
5353 -73444 55881 138014 -29300 351310 -162242 143296 179566 -179519 -120595 55556 143177
5342 143177 40610 73322 -217055 -133944 48724 -210786 -158388 -43384 -83214 356618 272649
5331 272649 -272776 53346 40664 -47484 47860 -14631 46476 -234615 402904 163369 -28296
5319 -16882 21558 -198428 203311 163917 -332349 86684 -38322 -62977 -168800 -181911 -57083
5307 41398 246830 -149758 -144293 64860 -122744 200329 -126631 -57332 126158 -112590 -94839
5296 -94839 135066 -109688 -89085 147437 -51738 337962 -53324 330178 -179084 -147029 25270
5284 187260 36531 -230036 -262377 314792 -57121 -18076 237348 227720 -29189 121354 60781
5273 60781 131001 297501 179458 -184897 122585 -194056 -79367 -35556 167945 -137817
5262 30141 -165340 -232671 81379 383456 -62497 -49826 -92707 -185768 335031 26882 110502
5251 110502 -221086 75445 -117150 236486 56459 6346 -164905 107411 -31886 -69930 -20005
5239 -192103 -119602 279688 291492 300870 -338685 63856 12511 -141092 -40868 -87165 88265
5227 -399828 236815 110157 141076 222780 -92999 -56398 -39426 156187 91485 4373 1184
5215 -186767 -9282 -153018 139719 -168527 66867 12821 -49059 -49066 146792 15024 -30928 14042
5202 57026 83881 -74542 44 -109214 -95779 -186428 96622 -153549 -6772 81402 -83293 65916
5189 65983 -342816 -326860 -325470 23397 -170841 56296 -279737 -199610 -201966 46722 -141783
5177 -33437 117697 148407 -59575 98042 -30847 -51002 56366 -173175 -107072 -114149 174439
5165 -24847 161912 374175 109957 38500 593476 -5751 -36528 101382 21713 73601 213646
5154 213646 198822 165592 -320214 -593 -121141 -260509 174882 110554 81944 1865 -142146
5142 -199661 79663 103413 51805 -121314 151723 -180509 -170871 -223108 -286597 -269313 -156340
5131 -156340 -2432 91046 -111372 121953 -50962 72580 -132516 -190073 -179272 158257 190240
5120 190240 48830 235199 -446151 -187030 242784 40494 -73773 209881 -130068 259276
5109 22454 294296 194353 -154538 178070 61674 -148343 165035 -243017 272516 -126532
5098 -2461 56417 417080 138645 -227580 -315624 -198427 -194798 118042 -7527 97596 -240502
5086 -19732 -94133 14087 131980 89627 273447 -183871 96316 -101167 -21385 -199256 -21454
5074 126933 209434 117004 -101707 -207570 266461 162079 -276812 -240203 175372 102993
5064 102993 -36353 -163717 -163676 -220358 258313 65500 142655 -184473 64389 86495 -255037
5052 87245 2788 215500 110555 165054 128865 391547 -16874 134082 -87814 51802 42746
5041 42746 -153637 168266 18564 52191 -258 -104056 101301 -210791 -207712 41519 -90922
5029 274346 122095 20129 119700 -112629 177766 88823 45556 133617 8218 -32594 -345467
5018 -345467 152054 194144 -116964 29317 370582 10161 -114349 -18065 -130861 -120378 -146724
5007 -146724 43960 -142231 87370 58922 275066 132833 329101 -3192 31079 153722 -8354
4995 254061 -170715 35335 449006 -264876 10071 117816 -56491 -185984 -122951 103767
4984 -175629 50015 358984 -146511 30293 141292 -173561 -386627 -131927 -98465 -173654
4974 -173654 -24012 101924 121119 68048 -57857 -175831 465310 -105262 -77396 -54607 -199248
4963 -199248 -243092 -93931 -193622 -100069 94215 -134684 -110421 -247277 337845 91110 -52188
4951 -346995 735 164902 106925 -131054 -162365 178838 155303 49544 -41728 64666 -108157
4939 -109609 26819 -241044 -195493 -19783 -238518 -17694 -88626 126768 151911 237918 225434
4928 225434 -90623 132120 200522 -116321 298556 -31604 64906 -224593 11624 355319 -93134
4916 342567 130335 380852 110508 -101719 -122399 -307446 255671 -29732 -69265 169015
4905 -72698 186237 72493 31314 29323 -430 -137657 280169 -76929 -84881 -263520 249511 228981
4893 228981 -640662 63857 -107506 146381 117293 297630 -421529 48318 -64677 -216779
4883 -216779 206853 82179 223867 -35045 161013 54786 86514 -241627 246561 25338 -156713
4871 114765 -566344 233933 -126806 102548 9351 -7488 -23327 -175046 -22464 123637 -165131
4859 19251 157348 -101327 -171645 51328 88208 216398 -251303 -68287 2617 -46219 36535
4847 32779 164315 -121371 81375 -159074 -4335 -38885 -87647 -54614 -97296 120776 -250070
4835 306391 -136414 -42442 -69019 -212739 19248 -161671 196411 182759 72261 97372 39575
4823 -120650 220302 24245 -145770 3165 -33876 -6062 -78223 44713 -23823 -162842 -251346
4812 -251346 227616 103277 140936 383006 -160522 22494 -339401 -62943 -29606 79867 48647
4801 48647 96543 31930 8385 18538 130953 91440 17806 -50161 162603 -98484 -63707 -103345
4789 -103345 244630 -20230 300134 -295169 73394 -6497 -49491 431298 -126438 86923 254745
4778 254745 71471 127553 154080 -49198 131149 45379 30739 -139634 62659 543 343668
4767 343668 302770 -36283 276336 -504043 75383 44507 -62843 -107083 15018 -14908 68818
4755 120467 -1140 299413 92288 -305079 -85205 298 114200 -138031 104043 134012 129395
4744 129395 36549 12451 120371 32279 -50082 248085 -31984 -199015 -92992 20339 -228128
4732 52586 -32430 112754 110094 88892 -85505 169973 -143555 -7051 -109398 -33924 188452
4720 86281 118194 -293657 -64354 57595 41882 18501 383450 121645 -333578 97464 -39032
4708 -70710 122844 -207883 -34020 158079 -63177 269753 -142232 -368640 -46475 223368
4697 99412 -136575 -91009 -284407 -289334 163667 -228684 168433 103122 104749 184070 335466
4686 335466 -207900 102101 -206045 -242377 454492 -210815 -44976 56410 215710 -129987
4675 3751 -200980 143923 -52164 76189 79103 42984 205414 -319362 -227511 -62041 75448
4663 34239 120242 -19272 -4896 -108721 -647229 -18105 664 34844 -188929 -119277 -40121 -265972
4651 -265972 -297652 -83363 121391 178525 54526 -3420 46750 102945 -56869 -130273 130741
4639 207918 -123884 -261858 122478 -114772 124305 -94395 14534 72603 36029 -396857
4628 -66640 -183392 -47971 78739 25595 -568683 81992 -65836 183699 126952 -137273 -420056
4617 -420056 25558 45425 487816 -117498 90548 183003 -140041 168211 -105354 45800 48849
4606 48849 -81247 113185 -254005 201379 -279074 -42183 76249 -37323 176007 90204 -11521
4594 146780 52020 57290 -21687 -96292 -252433 149658 275254 -40871 -253833 45092 -97202
4582 -182295 26116 -9493 72258 -356382 -42872 -78067 -111932 14102 241735 7349 106046 -215614
4569 -49266 -123970 -165973 -142646 212555 -40408 -56338 -74875 45514 117438 222580 324701
4558 324701 80175 120846 -205454 181498 -116451 234984 -104555 -113431 167199 35900 -87604
4546 203980 20959 67753 -36725 247646 -249307 -41219 -81028 -110514 -185284 304388 -93500
4534 48958 131554 444933 -159576 -117857 -90580 65761 94555 75061 -90514 152118 -237858
4522 -14169 -25368 14613 -94388 124552 -34799 -83806 -58607 -209613 54224 276911 230885
4511 230885 -459755 81866 122232 -10202 32715 241342 236305 126376 -40825 -101817 -99808
4500 -99808 -199551 -41207 -205030 -337950 -146740 -314493 -34589 -161836 -100512 -106837 160987
$$ [...]
##END NTUPLES=NMR SPECTRUM
##END=
