##TITLE=NES1045_Brazil_9268490_HpCFHjx8nf
##JCAMPDX= 6.0         $$ Bruker NMR JCAMP-DX V2.0
##DATA TYPE= NMR SPECTRUM
##DATA CLASS= NTUPLES
##ORIGIN= BRUKER
##OWNER= Administrator
$$ 1.72 TOPSPIN		Version 2.1
$$ 2015-08-24 20:39:34.701 -0700  Administrator@X
$$ Compression mode = diff/dup
##.OBSERVE FREQUENCY= 400.02188249412
##.OBSERVE NUCLEUS= ^1H
##.ACQUISITION MODE= SIMULTANEOUS (DQD)
##.ACQUISITION SCHEME= undefined
##.AVERAGES= 64
##.DIGITISER RES= 22
##SPECTROMETER/DATA SYSTEM= spect
##.PULSE SEQUENCE= noesygpps1d.comp
##.SOLVENT NAME= COFFEE_meoh
##.SHIFT REFERENCE= INTERNAL, COFFEE_meoh, 1, 14.96387
##AUDIT TRAIL= $$ (NUMBER, WHEN, WHO, WHERE, PROCESS, VERSION, WHAT)
$$ ##TITLE= Audit trail, TOPSPIN		Version 2.1
$$ ##JCAMPDX= 5.01
$$ ##ORIGIN= Bruker BioSpin GmbH
$$ ##OWNER= Administrator
$$ $$ E:\/data/COFFEE/nmr/NES1045_Brazil_9268490_HpCFHjx8nf/22/pdata/1/auditp.txt
$$ ##AUDIT TRAIL=  $$ (NUMBER, WHEN, WHO, WHERE, PROCESS, VERSION, WHAT)
(   1,<2015-08-24 20:39:29.186 -0700>,<Administrator>,<X>,<go>,<TOPSPIN 2.1>,
      <created by zg
	started at 2015-08-24 20:27:59.467 -0700,
	POWCHK enabled, PULCHK disabled,
       configuration hash MD5:
       21 0F 79 D6 B3 7B B4 F6 88 20 88 DB 03 48 BD 9F
       data hash MD5: 64K
       B3 E0 10 F8 6B 1F AB E5 56 2E 8C B5 29 3D 6C C6>)
(   2,<2015-08-24 20:39:32.561 -0700>,<Administrator>,<X>,<proc1d>,<TOPSPIN 2.1>,
      <Start of raw data processing
       efp LB = 0.3 FT_mod = 6 PKNL = 1 PHC0 = 0 PHC1 = 0 SI = 128K 
       data hash MD5: 128K
       55 2D FD 47 72 11 91 93 55 49 4F A4 6B D5 3E 3C>)
(   3,<2015-08-24 20:39:33.467 -0700>,<Administrator>,<X>,<proc1d>,<TOPSPIN 2.1>,
      <pk PHC0 = -83.08411 PHC1 = 0 
       data hash MD5: 128K
       2E 2C 3E B6 58 6E 88 4D 75 C7 ED 38 AA 6A 32 B1>)
(   4,<2015-08-24 20:39:33.858 -0700>,<Administrator>,<X>,<proc1d>,<TOPSPIN 2.1>,
      <abs ABSG = 1 
       data hash MD5: 128K
       18 97 4A 55 A4 2E AD B6 B0 E5 0A DF EB 39 1F 22>)
(   5,<2015-08-24 20:39:33.951 -0700>,<Administrator>,<X>,<proc1d>,<TOPSPIN 2.1>,
      <abs ABSG = 2 
       data hash MD5: 128K
       D1 7A 52 77 10 46 0A 8B 48 A0 07 37 C6 9A 2D E3>)
(   6,<2015-08-24 20:39:34.045 -0700>,<Administrator>,<X>,<proc1d>,<TOPSPIN 2.1>,
      <abs ABSG = 3 
       data hash MD5: 128K
       48 B3 ED A1 21 B4 51 1E 96 D0 89 74 B1 3B 1D BA>)
(   7,<2015-08-24 20:39:34.139 -0700>,<Administrator>,<X>,<proc1d>,<TOPSPIN 2.1>,
      <abs ABSG = 4 
       data hash MD5: 128K
       7B 10 13 22 78 44 A0 61 3B 06 01 0D B1 FD 8D 05>)
(   8,<2015-08-24 20:39:34.233 -0700>,<Administrator>,<X>,<proc1d>,<TOPSPIN 2.1>,
      <abs ABSG = 5 
       data hash MD5: 128K
       CB F8 08 8A 8D 59 7B 04 EC DF 3B 1B C4 60 BB 24>)
$$ ##END=
$$ 
$$ $$ hash MD5
$$ $$ 04 48 97 92 57 30 C9 02 F9 3C 55 03 A0 49 D8 36
##$RELAX= 
##$RELAX= 
##$RELAX= 
##$RELAX= 
##$RELAX= 
##$RELAX= 
##$RELAX= 
##$RELAX= 
$$ Bruker specific parameters
$$ --------------------------
##$DU= <E:\>
##$EXPNO= 22
$$ [...]
##$TP07= 0
##$TPNAME0= <>
##$TPNAME1= <>
##$TPNAME2= <>
##$TPNAME3= <>
##$TPNAME4= <>
##$TPNAME5= <>
##$TPNAME6= <>
##$TPNAME7= <>
##$TPOAL= (0..7)
0.5 0.5 0.5 0.5 0.5 0.5 0.5 0.5
##$TPOFFS= (0..7)
0 0 0 0 0 0 0 0
##$TUNHIN= 0
##$TUNHOUT= 0
##$TUNXOUT= 0
##$USERA1= <user>
##$USERA2= <user>
##$USERA3= <user>
##$USERA4= <user>
##$USERA5= <user>
##$V9= 5
##$VALIST= <valist>
##$VCLIST= <CCCCCCCCCCCCCCC>
##$VD= 0
##$VDLIST= <DDDDDDDDDDDDDDD>
##$VPLIST= <PPPPPPPPPPPPPPP>
##$VTLIST= <TTTTTTTTTTTTTTT>
##$WBST= 2048
##$WBSW= 25
##$XGAIN= (0..3)
0 0 0 0
##$XL= 0
##$YL= 0
##$YMAX_a= 9000271
##$YMIN_a= -16750918
##$ZGOPTNS= <>
##$ZL1= 120
##$ZL2= 120
##$ZL3= 120
##$ZL4= 120
##$ABSF1= 14.96387
##$ABSF2= -5.594312
##$ABSG= 5
##$ABSL= 3
##$ALPHA= 0
##$AQORDER= 0
##$ASSFAC= 0
##$ASSFACI= 0
##$ASSFACX= 0
##$ASSWID= 0
##$AUNMP= <proc_prof1d_extract.lims>
##$AXLEFT= 0
##$AXNAME= <>
##$AXNUC= <1H>
##$AXRIGHT= 0
##$AXTYPE= 0
##$AXUNIT= <>
##$AZFE= 0.1
##$AZFW= 0.1
##$BCFW= 0
##$BC_mod= 0
##$BYTORDP= 0
##$COROFFS= 0
##$CY= 15
##$DATMOD= 1
##$DC= 0
##$DFILT= <>
##$DTYPP= 0
##$F1P= 0
##$F2P= 0
##$FCOR= 0.5
##$FTSIZE= 131072
##$FT_mod= 6
##$GAMMA= 0
##$GB= 0
##$INTBC= 1
##$INTSCL= 1
##$ISEN= 128
##$LB= 0.3
##$LEV0= 0
##$LPBIN= 0
##$MAXI= 10000
##$MC2= 0
##$MEAN= 0
##$ME_mod= 0
##$MI= 0
##$NCOEF= 0
##$NC_proc= -2
##$NLEV= 6
##$NOISF1= 0
##$NOISF2= 0
##$NSP= 0
##$NTH_PI= 0
##$NZP= 0
##$OFFSET= 14.96387
##$PC= 1
##$PHC0= -83.08411
##$PHC1= 0
##$PH_mod= 1
##$PKNL= yes
##$PPARMOD= 0
##$PPDIAG= 0
##$PPIPTYP= 0
##$PPMPNUM= 2147483647
##$PPRESOL= 1
##$PSCAL= 4
##$PSIGN= 0
##$PYNMP= <proc.py>
##$REVERSE= no
##$SF= 400.020008487286
##$SI= 131072
##$SIGF1= 0
##$SIGF2= 0
##$SINO= 400
##$SIOLD= 131072
##$SPECTYP= <>
##$SREGLST= <1H.CDCl3>
##$SSB= 0
##$STSI= 131072
##$STSR= 0
##$SW_p= 8223.68421052631
##$SYMM= 0
##$S_DEV= 0
##$TDeff= 65536
##$TDoff= 0
##$TI= <>
##$TILT= no
##$TM1= 0
##$TM2= 0
##$TOPLEV= 0
##$USERP1= <user>
##$USERP2= <user>
##$USERP3= <user>
##$USERP4= <user>
##$USERP5= <user>
##$WDW= 1
##$XDIM= 131072
##$YMAX_p= 432717674
##$YMIN_p= -14471
##$CURPLOT= <Network HP LaserJet P1505>
##$CURPRIN= <$Network HP LaserJet P1505>
##$DFORMAT= <normdp>
##$LAYOUT= <+/1D_H.xwp>
##$LFORMAT= <normlp>
##$PFORMAT= <normpl>
##$SURQMSG= 1
$$ End of Bruker specific parameters
$$ ---------------------------------
##NTUPLES= NMR SPECTRUM
##VAR_NAME=  FREQUENCY,     SPECTRUM/REAL,   SPECTRUM/IMAG
##SYMBOL=    X,             R,               I
##VAR_TYPE=  INDEPENDENT,   DEPENDENT,       DEPENDENT
##VAR_FORM=  AFFN,          ASDF,            ASDF
##VAR_DIM=   131072,        131072,          131072
##UNITS=     HZ,            ARBITRARY UNITS, ARBITRARY UNITS
##FACTOR=    0.0627417313425164, 1,          1
##FIRST=     8223.62146879497, -865,         -67120
##LAST=      0,             1244,            -67511
##MIN=       0,             -14471,          0
##MAX=       8223.62146879497, 432717674,    0
$$ Real data points
##PAGE= N=1
##DATA TABLE= (X++(R..R)), XYDATA
$$ [...]
63342B89324n465n278n017m551l693k784k468k771k949k496j739j167p14j52K60
63327B48340P9o27j347j729j673j134l28J38p8m31j95M12N47J16q5K35K67n89
63309B41918j641j848j283q58q60p01j22J41o38k010k712k053o38L14J68o33j197
63292B25347j136q71r78j369j347n30N42R43M08l99p27n13j41K26O89J106J057
63275B22307M83o7q7J92J54l53p98p25l42k38n94r69p91J3J005J708J941J759
63257B24598J279P58N61Q69J432J866K110K371K734L082L335L494L497L380L529
63242B58895M358N665O680O885O542O288O567P509Q972J0454J1414J1925J2696
63229C64850J4139J5730J6646J6749J6570J6503J6469J6292J6007J5732J5386
$$ y = [289324, 283859, 278581, 273564, 269013, 265320, 262536, 260068, 257297, 254348, 251852, 250113, 248946, 248232, 248080, 248340, 248419, 247792, 246445, 244716, 243043, 241909, 241581, 241719, 241641, 241210, 241015, 241427, 241974, 242090, 242005, 242240, 242507, 241918, 240277, 238429, 237146, 236288, 235428, 234727, 234605, 234746, 234108, 232098, 229386, 227333, 226695, 227009, 227177, 226544, 225347, 224211, 223340, 222362, 220993, 219646, 219116, 219658, 220601, 221009, 220610, 219883, 219370, 219229, 219455, 220144, 221250, 222307, 222790, 222723, 222636, 222828, 222982, 222629, 221831, 221106, 220764, 220526, 219932, 218963, 218172, 218185, 219190, 220898, 222839, 224598, 225877, 226635, 227196, 228065, 229497, 231363, 233473, 235844, 238578, 241660, 244995, 248489, 251986, 255366, 258895, 263253, 268918, 275598, 282483, 289025, 295313, 301880, 309389, 318361, 328815, 340229, 352154, 364850, 378989, 394719, 411365, 428114, 444684, 461187, 477656, 493948, 509955, 525687, 541073]
63218E41073J4794J3999J3459J3683J4562J5252J5115J4567J4416J4434J3388
63207F98742J0678P175L921P23l246p969j2499j6123j8774k0404k0784k0104j9133
63194E82203j8377j7538j6076j4064j2147j0677r195o936l825p16J549L112M742
63181D82055O663Q262R162R850J0959J2400J3663J4566J5213J5517J5350J4907
63169F28567J4511J4204J3927J3860J4113J4290J3857J2716J1054Q820N905K613
63157G68437n34l437o349r326j2198j5023j7999k0949k3296k4569k4654k3692
63145E86411k2076k0394j8959j7562j5976j4455j3261j2034j0311q419p141o596
63133D19227o150n428m728m273l775k985k218j968k334k923l126k521j371n99
$$ y = [541073, 555867, 569866, 583325, 597008, 611570, 626822, 641937, 656504, 670920, 685354, 698742, 709420, 716595, 720516, 721239, 717993, 710024, 697525, 681402, 662628, 642224, 621440, 601336, 582203, 563826, 546288, 530212, 516148, 504001, 493324, 484129, 477193, 473368, 472652, 474201, 477313, 482055, 488718, 496980, 506142, 515992, 526951, 539351, 553014, 567580, 582793, 598310, 613660, 628567, 643078, 657282, 671209, 685069, 699182, 713472, 727329, 740045, 751099, 759919, 765824, 768437, 767903, 764466, 758117, 748791, 736593, 721570, 703571, 682622, 659326, 634757, 610103, 586411, 564335, 543941, 524982, 507420, 491444, 476989, 463728, 451694, 441383, 432964, 425823, 419227, 413077, 407649, 402921, 398648, 394873, 391888, 389670, 387702, 385368, 382445, 379319, 376798, 375427, 374828]
63119C74828r06j900k578k486j951j318o33j18k23r20j530j481q92j97L94R43
63103C59032J557K293K981L212K832K345K411L000L527L736L877M042L996L798
63089D02639L852M182M210L608K863K647L009L448L486L003K287J884K039K330
63075D45487K212J844J837K255K555K575K793L351L682L528L607M625O170P288
63061D93809P813Q435R649J1225J2735J4130J5709J7719K0032K2204K3936K5428
63049F82824K7085K8903L0549L1996L3530L5002L5735L5494L5023L5073L5325
63038A046539L4785L3159L1342L0484L0906L1903L2438L2077L1249L0599L0064
63027A395545K8847K6243K2223J7169J1357M826k472j0479j8718k6278l2490l7641
$$ y = [374828, 373922, 372022, 369444, 366958, 365007, 363689, 363056, 362938, 362715, 361795, 360265, 358784, 357892, 357695, 358089, 359032, 360589, 362882, 365863, 369075, 371907, 374252, 376663, 379663, 383190, 386926, 390803, 394845, 398841, 402639, 406491, 410673, 414883, 418491, 421354, 424001, 427010, 430458, 433944, 436947, 439234, 441118, 443157, 445487, 447699, 449543, 451380, 453635, 456190, 458765, 461558, 464909, 468591, 472119, 475726, 480351, 486521, 493809, 501622, 510057, 519706, 530931, 543666, 557796, 573505, 591224, 611256, 633460, 657396, 682824, 709909, 738812, 769361, 801357, 834887, 869889, 905624, 941118, 976141, 1011214, 1046539, 1081324, 1114483, 1145825, 1176309, 1207215, 1239118, 1271556, 1303633, 1334882, 1365481, 1395545, 1424392, 1450635, 1472858, 1490027, 1501384, 1506210, 1503738, 1493259, 1474541, 1448263, 1415773, 1378132]
63015A378132m2487m6988n0020n0569m8759m5507m1704l7940l4443l0820k6282
63004I22613k0647j4805r822n808k050J980O177J0128J3501J6205J8517K0899
62992I56888K3367K5265K5997K5897K5923K6524K7206K7315K6863K6294K5672
62981A243211K4490K2403J9772J7127J4220J0126M450k058q388j4337k0372k6762
62969A283882l3375l9910m5709m9725n1462n1748n1810n1648n0220m7209m3654
62958G67412m0643l8228l5941l3523l0868k7930k5105k2975k1360j9422j7029
62947D54388j5125j4243j3538j2088j0347r406r321r162q402p397o554n783m837
62934C28185l731k782k473l038l971m299l703k930k682k670k301j828j969k653
$$ y = [1378132, 1335645, 1288657, 1238637, 1188068, 1139309, 1093802, 1052098, 1014158, 979715, 948895, 922613, 901966, 887161, 877339, 871531, 869481, 871461, 877638, 887766, 901267, 917472, 935989, 956888, 980255, 1005520, 1031517, 1057414, 1083337, 1109861, 1137067, 1164382, 1191245, 1217539, 1243211, 1267701, 1290104, 1309876, 1327003, 1341223, 1351349, 1355799, 1353741, 1345353, 1331016, 1310644, 1283882, 1250507, 1210597, 1164888, 1115163, 1063701, 1011953, 960143, 908495, 858275, 811066, 767412, 726769, 688541, 652600, 619077, 588209, 560279, 535174, 512199, 490839, 471417, 454388, 439263, 425020, 411482, 399394, 389047, 379641, 370320, 361158, 352756, 345359, 338805, 333022, 328185, 324454, 321672, 319199, 316161, 312190, 307891, 304188, 301258, 298576, 295906, 293605, 291777, 289808, 287155]
62920B87155k950k241q77L43Q04L11p71j607j556q72l93o53j518k534l251l383
62904B66007l055k787k916l155l002k421j735j154p32o26q97j241j338j319j424
62889B38205j438r83k75L6k42o20o90o00n74m37J08Q89J322J080N05K40M20N00
62871B37446R0l59j47N11O51%n38k54K91J68m83p11j39P37J399J715J591J006
62853B42974M08M27J024J467J325R44P89Q24Q13Q41J201J883K439K352J488L02
62837B61501m96n95l62l46n59n37l8N89Q24N90L23M77J039J580J800J852K046
62820B69688K401K749L105L510L662L246K655K733L664M666N050N002M985M945
62806C22061M617M173L990M117M404M896N641O455P323Q657J0644J2656J3891
$$ y = [287155, 284205, 281964, 281087, 281430, 282234, 282545, 281774, 280167, 278611, 277739, 277346, 276693, 275175, 272641, 269390, 266007, 262952, 260165, 257249, 254094, 251092, 248671, 246936, 245782, 245050, 244424, 243527, 242286, 240948, 239629, 238205, 236767, 235784, 235509, 235545, 235303, 234683, 233993, 233393, 232819, 232382, 232490, 233379, 234701, 235781, 236286, 236526, 236946, 237446, 237536, 237177, 237030, 237541, 238192, 238192, 237654, 237400, 237691, 237859, 237376, 236665, 236526, 237263, 238662, 240377, 241968, 242974, 243382, 243809, 244833, 246300, 247625, 248569, 249358, 250182, 250995, 251836, 253037, 254920, 257359, 259711, 261199, 261501, 261005, 260410, 260048, 259702, 259143, 258606, 258568, 259157, 259981, 260571, 260894, 261371, 262410, 263990, 265790, 267642, 269688, 272089, 274838, 277943, 281453, 285115, 288361, 291016, 293749, 297413, 302079, 307129, 312131, 317116, 322061, 326678, 330851, 334841, 338958, 343362, 348258, 353899, 360354, 367677, 376334, 386978, 399634, 413525]
62793D13525J4465J5264J6893J9228K1868K4501K6825K8645L0215L2112L4731
62782F78272L7974M1390M4487M7055M9360N1796N4235N5956N6407N5732N4296
62771A226960N2034M8496M3291L6302K7830J8615R351j0r878j9843k8623l5545
62759A368980m1304m6733n1522n4834n6518n6964n6300n4559n2222m9811m7270
62748H00943m4444m1749l9619l7665l5146l1988k8563k4960k1298j8329j6699
62737D60483j5841j4651j2938j1326r932q350o823o127o168n800m395k611j281
62724C54240m10L00P81R50J096J530K271L331M849O686Q369R637J0680J1746J2932
62709D28988J4441J6511J8995K1495K3920K6515K9324L2166L5119L8499M2251
$$ y = [413525, 427990, 443254, 460147, 479375, 501243, 525744, 552569, 581214, 611429, 643541, 678272, 716246, 757636, 802123, 849178, 898538, 950334, 1004569, 1060525, 1116932, 1172664, 1226960, 1278994, 1327490, 1370781, 1407083, 1434913, 1453528, 1462879, 1462869, 1452991, 1433148, 1404525, 1368980, 1327676, 1280943, 1229421, 1174587, 1118069, 1061105, 1004805, 950246, 898024, 848213, 800943, 756499, 714750, 675131, 637466, 602320, 570332, 541769, 516809, 495511, 477182, 460483, 444642, 429991, 417053, 405727, 395795, 387445, 380622, 374495, 368327, 362527, 358132, 355521, 354240, 353830, 354130, 354911, 355861, 356957, 358487, 360758, 364089, 368938, 375624, 383993, 393630, 404310, 416056, 428988, 443429, 459940, 478935, 500430, 524350, 550865, 580189, 612355, 647474, 685973, 728224]
62698G28224M5907M9145N1876N3865N4796N4662N3499N0862M6283M0136L3245
62687A262500K5669J6818O801l212j2324k0724k8841l6482m3168m8628n2516n4284
62675A011609n3970n2601n1363n0508m9393m7325m4174m0439l6843l3696l0608
62664E20689k7190k3851k1385j9847j8507j6876j5157j3614j2281j1354j1115
62653C29512j1209j0751r437p906o759n897n084m448m016l421k598k127k392k879
62639B50588k872k456k267k567k999l137k793j961q05L07R56R01J89p39j240j043
62623B28062n74l56k25L85J457K323K589K566K585K593K544K706L236L909M413
62608B58213M686M855N194O144P869R852J1386J2510J3876J5709J7550J9054K0465
$$ y = [728224, 774131, 823276, 875152, 929017, 983813, 1038475, 1091974, 1142836, 1189119, 1229255, 1262500, 1288169, 1304987, 1311788, 1308576, 1296252, 1275528, 1246687, 1210205, 1167037, 1118409, 1065893, 1011609, 957639, 905038, 853675, 803167, 753774, 706449, 662275, 621836, 584993, 551297, 520689, 493499, 469648, 448263, 428416, 409909, 393033, 377876, 364262, 351981, 340627, 329512, 318303, 307552, 298115, 290209, 283450, 277553, 272469, 268021, 264005, 260584, 257986, 255859, 253467, 250588, 247716, 245260, 242993, 240426, 237427, 234290, 231497, 229536, 228731, 229038, 229994, 230895, 231084, 230345, 229105, 228062, 227488, 227132, 226907, 227292, 228749, 231072, 233661, 236227, 238812, 241405, 243949, 246655, 249891, 253800, 258213, 262899, 267754, 272948, 279092, 286961, 296813, 308199, 320709, 334585, 350294, 367844, 386898, 407363]
62595D07363K2130K4086K6204K8261K9785L0366L0107K9294K7723K5043K1479
62584G01841J7546J3138P904K328k622o914j1383j6082j9924k2321k3960k5449
62572F14102k6359k6253k5686k5351k5000k3960k2162k0011j7905j6290j5646
62561C69479j5793j5781j4949j3500j1788r766p493n539m286l552l186l272l429
62548B57145k868j648q36q98r59l51K04j42q70r37l50J77M99R82J682K467L471
62531B56768M561N020M615M419N544P542R114R924J0703J1875J3173J4442J5876
62518C73576J7495J9157K0949K2992K5037K6778K8191K9110K9048K8065K7084
62507F47482K6507K5259K2104J7334J2068O615P44m941r468j3048j6763k0685
$$ y = [407363, 429493, 453579, 479783, 508044, 537829, 568195, 598302, 627596, 655319, 680362, 701841, 719387, 732525, 740429, 742757, 740135, 733221, 721838, 705756, 685832, 663511, 639551, 614102, 587743, 561490, 535804, 510453, 485453, 461493, 439331, 419320, 401415, 385125, 369479, 353686, 337905, 322956, 309456, 297668, 287902, 280409, 274870, 270584, 267032, 263846, 260574, 257145, 254277, 252629, 251793, 250895, 249936, 249585, 249789, 249647, 248777, 247840, 247490, 247667, 248166, 249148, 250830, 253297, 256768, 261329, 266349, 270964, 275383, 280927, 288469, 297583, 307507, 318210, 330085, 343258, 357700, 373576, 391071, 410228, 431177, 454169, 479206, 505984, 534175, 563285, 592333, 620398, 647482, 673989, 699248, 721352, 738686, 750754, 757369, 758113, 753172, 743704, 730656, 713893, 693208]
62495F93208k3688k5148k5558k5299k4116k2132k0176j8581j6649j3928j1142
62484D66791r319q585q353q187q007p834p749p905q286q700r020r268r426r417
62470C46735r213q722p810o686n956n904n966n450m492l806l743m086m477m525
62456B65899l857k669j831j822k012j666j132j165j554j555j247j279j510j196
62442B41404m76l30q54r08K04J744K714K990K856K372J799J865K992M718O329
62427B69419P526Q268Q588Q817R376J0095J0387J0317J0643J1481J1817J0948
62415C87682R572Q731Q285P264N363L261J566J80j261k768m009m726m989n072
62401D09079n059m723l971l223k954k962k546j388J51J580K711L584M503O058
$$ y = [693208, 669520, 644372, 618814, 593515, 569399, 547267, 527091, 508510, 491861, 477933, 466791, 457472, 448887, 440534, 432347, 424340, 416506, 408757, 400852, 392566, 383866, 374846, 365578, 356152, 346735, 337522, 328800, 320990, 314304, 308348, 302444, 296478, 291028, 286536, 282730, 278987, 274901, 270424, 265899, 262042, 259373, 257542, 255720, 253708, 252042, 250910, 249745, 248191, 246636, 245389, 244110, 242600, 241404, 240928, 240598, 239744, 238836, 239040, 240784, 243498, 246488, 249344, 251716, 253515, 255380, 258372, 263090, 269419, 276945, 285213, 293801, 302618, 311994, 322089, 332476, 342793, 353436, 364917, 376734, 387682, 397254, 405985, 414270, 421534, 426897, 430158, 431724, 431904, 430643, 427875, 423866, 419140, 414151, 409079, 404020, 399297, 395326, 392103, 389149, 386187, 383641, 382253, 382404, 383984, 386695, 390279, 394782, 400840]
62387D00840Q526J1260J3275J4476J5641J7192J8787K0331K2453K5573K9114L2190
62375F29658L4430L5776L6056L5347L4249L3206L1922K9830K6811K2974J8229
62364I68488J2699P192K537j398n386r584j3157j5273j5955j5871j5633j5571
62352H83088j5919j6814j8066j9092j9329j8808j8217j8204j8656j8828j8175
62341F82980j6904j5652j4798j4098j2965j1101q925p176o054n012l608k187j321
62328E63179r30n32j80m31j439k719l876m981o046o767p089p483q311r301r938
62313D93156j0119j0070r909r530q816p776o589n533m655l589k053n67j25q93
62299D12932j713j288L55K006K676K506K273K360K480K306K076K331L115L854
$$ y = [400840, 409366, 420626, 433901, 448377, 464018, 481210, 499997, 520328, 542781, 568354, 597468, 629658, 664088, 699864, 735920, 771267, 805516, 838722, 870644, 900474, 927285, 950259, 968488, 981187, 988379, 990916, 989518, 984132, 974548, 961391, 946118, 930163, 914292, 898659, 883088, 867169, 850355, 832289, 813197, 793868, 775060, 756843, 738639, 719983, 701155, 682980, 666076, 650424, 635626, 621528, 608563, 597462, 588537, 581361, 575307, 570295, 566687, 564500, 563179, 562249, 561717, 561537, 561106, 559667, 556948, 553072, 548091, 542045, 535278, 528189, 520706, 512395, 503094, 493156, 483037, 472967, 463058, 453528, 444712, 436936, 430347, 424814, 420159, 416570, 414517, 413950, 413825, 412932, 411219, 409931, 410286, 412292, 414968, 417474, 419747, 422107, 424587, 426893, 428969, 431300, 434415, 438269]
62285D38269M197M579N620P136Q273Q557Q448Q770R919J1631J3344J4712J5933
62272E59388J7501J9553K1634K3231K4254K4751K4570K3673K2397K0890J8594
62261H00436J4974J0535O526L653J713L31o17j384k426l888n495p010q393r433
62247G99522r785r455q874q367p898p291o434n293m109l335l046k635j633m83
62233G20884Q1J72M35R01J087J048J389K175K853L340M137N152N533N076M855
62218G59118N769P303Q326Q513Q432Q712R612J0972J2203J2757J2901J3498J4820
62205H92936J6199J7201J8299J9947K1675K2769K3291K3777K4341K4646K4412
62194A129493K3470K1626J8984J6090J3357J0731Q247O494O028O691P966R693
$$ y = [438269, 442466, 447045, 452665, 459801, 468074, 476631, 485079, 493849, 503768, 515399, 528743, 543455, 559388, 576889, 596442, 618076, 641307, 665561, 690312, 714882, 738555, 760952, 781842, 800436, 815410, 825945, 832471, 836124, 837837, 838168, 837551, 836167, 833741, 829853, 824358, 817348, 808955, 799522, 789737, 780282, 771408, 763041, 755143, 747852, 741418, 736125, 732016, 728681, 725635, 723000, 721367, 720884, 720965, 721137, 721572, 722473, 723560, 724608, 725997, 728172, 731025, 734365, 738502, 743654, 749187, 754263, 759118, 764887, 772190, 780516, 789029, 797461, 806173, 815785, 826757, 838960, 851717, 864618, 878116, 892936, 909135, 926336, 944635, 964582, 986257, 1009026, 1032317, 1056094, 1080435, 1105081, 1129493, 1152963, 1174589, 1193573, 1209663, 1223020, 1233751, 1241998, 1248492, 1254520, 1261211, 1269177, 1278870]
62182A278870J1955J4617J7383K0090K2542K4351K5281K5515K5259K4410K2903
62171A513176K1021J9088J7202J5552J4556J4214J3797J2685J1163R929R055Q024
62159A679462O578N015L741K840K120J326M30j46J43J280K571L429L945M508N216
62144A722458N884O317O329N800M920M129L662L461L557M065M712M959M728M496
62130A789477M493M448M312M402M620M345L624L516M584N850O105N647N735O810
62116A857968Q219R448J0666J2144J3946J5992J7751J8019J5853J1819P657M730
62104B004212L379L562N236P835J0161J1171J0532Q374M985J047k405m624n599
62091B057866n700n173m206l323l296m543o702q898j0469j1409j2084j2669j3023
$$ y = [1278870, 1290825, 1305442, 1322825, 1342915, 1365457, 1389808, 1415089, 1440604, 1465863, 1490273, 1513176, 1534197, 1553285, 1570487, 1586039, 1600595, 1614809, 1628606, 1641291, 1652454, 1662383, 1671438, 1679462, 1686040, 1691055, 1694796, 1697636, 1699756, 1701082, 1701512, 1701366, 1701509, 1702789, 1705360, 1708789, 1712734, 1717242, 1722458, 1728342, 1734659, 1740988, 1746788, 1751708, 1755837, 1759499, 1762960, 1766517, 1770582, 1775294, 1780253, 1784981, 1789477, 1793970, 1798418, 1802730, 1807132, 1811752, 1816097, 1819721, 1823237, 1827821, 1833671, 1839776, 1845423, 1851158, 1857968, 1866187, 1875635, 1886301, 1898445, 1912391, 1928383, 1946134, 1964153, 1980006, 1991825, 1999482, 2004212, 2007591, 2011153, 2016389, 2024224, 2034385, 2045556, 2056088, 2064462, 2069447, 2070494, 2068089, 2063465, 2057866, 2052166, 2046993, 2042787, 2039464, 2036168, 2031625, 2024923, 2016025, 2005556, 1994147, 1982063, 1969394, 1956371]
62078A956371j3021j2767j2438j2282j2678j3874j5609j7284j8562j9557k0445
62067A787854k1286k2147k2913k3066k2278k1140k0685k1010k1193k0717k0072
62056A551347j9578j8539j6169j2678q776m797j012J793K857K195J43l465q859
62043A464462j5440k1978k7518l1565l3718l3867l2594l0705k8571k6319k4387
62032A157800k3152k2314k1297k0122j9229j8614j7792j6629j5519j4710j3975
62021I54447j3001j1683j0074q377o866n599m319k947j792r72nJ486L013L736
62007H97047L443K461R30j168l534n812q173j0955j3859j6074j7178j7331j6781
61994G93016j5757j4648j3666j2476j0789r071p919o983n423l344j790j166o60
$$ y = [1956371, 1943350, 1930583, 1918145, 1905863, 1893185, 1879311, 1863702, 1846418, 1827856, 1808299, 1787854, 1766568, 1744421, 1721508, 1698442, 1676164, 1655024, 1634339, 1613329, 1592136, 1571419, 1551347, 1531769, 1513230, 1497061, 1484383, 1475607, 1470810, 1469798, 1471591, 1474448, 1476643, 1476786, 1473321, 1464462, 1449022, 1427044, 1399526, 1367961, 1334243, 1300376, 1267782, 1237077, 1208506, 1182187, 1157800, 1134648, 1112334, 1091037, 1070915, 1051686, 1033072, 1015280, 998651, 983132, 968422, 954447, 941446, 929763, 919689, 911312, 904446, 898847, 894528, 891581, 889789, 888817, 888812, 890298, 893311, 897047, 900490, 902951, 903881, 902713, 899179, 893367, 885194, 874239, 860380, 844306, 827128, 809797, 793016, 777259, 762611, 748945, 736469, 725680, 716609, 708690, 701707, 696284, 692940, 691150, 689984, 689324]
61981F89324M71J897L002L904N102O568P828Q639R155R613J0293J1586J3664J6054
61967G97100J7856J8585J8604J8686J9157J9671J9812J9702J9780K0206K0848
61956A010007K1852K3663K6307K9156L1687L4087L6864M0237M4176M8620N3332
61945A399988N7982O2717O8261P5041Q2743R1043J00144J10031J19761J28095
61935B295806J34245J37262J35426J27487J14470R9443Q5703P5997P2973P8798
61925C357610R3797J16340J44454J76879K12375K48863K83937L15695L42450L61784
61915E654184L70230L64041L40285K97557K36088J57739O6528l0835j25936k11217
61905G118664k81898l35614l71285l89227l91764l82544l65030l42141l16699
$$ y = [689324, 689795, 691692, 694694, 698598, 703700, 710268, 718096, 726735, 735890, 745503, 755796, 767382, 781046, 797100, 814956, 833541, 852145, 870831, 889988, 909659, 929471, 949173, 968953, 989159, 1010007, 1031859, 1055522, 1081829, 1110985, 1142672, 1176759, 1213623, 1253860, 1298036, 1346656, 1399988, 1457970, 1520687, 1588948, 1663989, 1746732, 1837775, 1937919, 2047950, 2167711, 2295806, 2430051, 2567313, 2702739, 2830226, 2944696, 3044139, 3129842, 3205839, 3278812, 3357610, 3451407, 3567747, 3712201, 3889080, 4101455, 4350318, 4634255, 4949950, 5292400, 5654184, 6024414, 6388455, 6728740, 7026297, 7262385, 7420124, 7486652, 7455817, 7329881, 7118664, 6836766, 6501152, 6129867, 5740640, 5348876, 4966332, 4601302, 4259161, 3942462]
61896C942462k91023k66008k41599k18332j97465j79511j63591j48670j34646
61887B101617j21798j09846r8169q6662p5859o6377n8375n1436m4891l8516l2746
61876A316942k7937k3653j9230j4844j1254q460n455j510K927O971J0423J3766
61864A238686J7422K1358K5251K8817L1974L4706L6725L7543L7132L6131L4955
61853A580700L3056K9693K5200K0696J6566J2183P341L154J047J221K631M221
61841A737709N793P706R947J1762J2374J1912J1213J0594R498P697O167O178Q001
61828A856551J1219J5863K2400L0893M0910N1825O2318O9883P1907O7294N6436
61817B357499M0227K0301o0j6891k7894l2974l2495k6408j5425j628J3069K8245
$$ y = [3942462, 3651439, 3385431, 3143832, 2925500, 2728035, 2548524, 2384933, 2236263, 2101617, 1979819, 1869973, 1771804, 1685142, 1609283, 1542906, 1484531, 1433095, 1388204, 1349688, 1316942, 1289005, 1265352, 1246122, 1231278, 1220024, 1211564, 1206109, 1204599, 1207526, 1214497, 1224920, 1238686, 1256108, 1277466, 1302717, 1331534, 1363508, 1398214, 1434939, 1472482, 1509614, 1545745, 1580700, 1613756, 1643449, 1668649, 1689345, 1705911, 1718094, 1725435, 1728589, 1729636, 1730857, 1733488, 1737709, 1743502, 1751208, 1761155, 1772917, 1785291, 1797203, 1808416, 1819010, 1828508, 1836205, 1842372, 1848550, 1856551, 1867770, 1883633, 1906033, 1936926, 1977836, 2029661, 2091979, 2161862, 2233769, 2301063, 2357499, 2397726, 2418027, 2417967, 2401076, 2373182, 2340208, 2307713, 2281305, 2265880, 2264252, 2277321, 2305566]
61805B305566M4234O0798P7312R3691J10452J28221J47624J69281J93466K20031
61795C550676K48891K80331L14752L52450L93667M38166M84672N31149N75609
61786G170363O15842O48078O66403O63798O33629N71003M74386L46843J95617
61777A1985962L0536j36851k93771m28470n33566o07199o51022o68111o62773
61768H034735o40535o06851n66067n21796m77139m33759l91749l51327l13954
61759C731558k80972k52024k25905k02320j81687j63641j47059j31453j17427
61750B029070j05592r5762q7302p9654p2492o5821n9933n4886n0179m5274m0364
61739A271811l6216l3326l1454k9861k7861k5300k2728k0772j9300j7540j5244
$$ y = [2305566, 2349800, 2410598, 2487910, 2581601, 2692053, 2820274, 2967898, 3137179, 3330645, 3550676, 3799567, 4079898, 4394650, 4747100, 5140767, 5578933, 6063605, 6594754, 7170363, 7786205, 8434283, 9100686, 9764484, 10398113, 10969116, 11443502, 11790345, 11985962, 12016498, 11879647, 11585876, 11157406, 10623840, 10016641, 9365619, 8697508, 8034735, 7394200, 6787349, 6221282, 5699486, 5222347, 4788588, 4396839, 4045512, 3731558, 3450586, 3198562, 2972657, 2770337, 2588650, 2425009, 2277950, 2146497, 2029070, 1923478, 1827716, 1740414, 1660760, 1588268, 1522447, 1462514, 1407628, 1357449, 1312175, 1271811, 1235595, 1202269, 1170815, 1140954, 1113093, 1087793, 1065065, 1044293, 1024993, 1007453, 992209]
61728I92209j3195j2198j1991j1571j0365q614o953n967n891o372o679o361n514
61715H80538m239k261O64M278Q079J1655J4566J6237J6303J4793J1744O997P05
61702I80059o322j3043j8708k2741k4634k4366k2651k0341j7762j4895j2018r725
61690G72853q395p880p760p825q285r417j0943j2088j2502j2771j3511j4305j4201
61677F32970j3011j1466j0269r684r805j0296j0070q369o088m941n186n441m838
61664E23506m031l658l237k295j390j107j027o13k49n05j090j427j592j928k295
61649D97062k489k792l394l927m177m581n230n232m014k516k107k751l290l076
61635D47486k385j585q76n37o64p79m46P6L72O04J087J570J693J636J611J207
$$ y = [992209, 979014, 966816, 954825, 943254, 932889, 924275, 917322, 911355, 905464, 899092, 892413, 886052, 880538, 876299, 874038, 874702, 878980, 887059, 898714, 913280, 929517, 945820, 960613, 972357, 979354, 980059, 973737, 960694, 941986, 919245, 894611, 870245, 847594, 827253, 809491, 794596, 782578, 772853, 764458, 756578, 748818, 740993, 732708, 723291, 712348, 700260, 687758, 674987, 661476, 647171, 632970, 619959, 608493, 598224, 588540, 578735, 568439, 558369, 550000, 543912, 538971, 533785, 528344, 523506, 519475, 515817, 512580, 510285, 508895, 507788, 506761, 506148, 505899, 505394, 504304, 502877, 501285, 499357, 497062, 494573, 491781, 488387, 484460, 480283, 475702, 470472, 465240, 461226, 458710, 456603, 453852, 450562, 447486, 445101, 443516, 442640, 442103, 441439, 440660, 440214, 440290, 440662, 441266, 442353, 443923, 445616, 447252, 448863, 450070]
61619D50070O9j305k215k692k991k793j936j217j354j678j045L33J311J667K158
61604D36382K922L202K760K218J931J648J517K204L739N253O164O731P209P470
61590D91350P738Q623J0037J0959J0859J0549J1131J2768J4957J7337J9651K1544
61578F47503K3016K4736K7340L0629L3850L6506L8485L9582L9261L6972L2627
61567A010507K6794K0370J3951P549J119m768r132j1356j1607j0567q994p344
61555A016522n542l264o44J619L118M314N733P000P308O564N420M247K758O49
61541A055802j938m575o782q177q822r239r670r596q496o786n317m158k632m86
61527I69128J785L811N806Q081J0673J3577J6753J9880K2723K5718K9650L4600
$$ y = [450070, 450139, 448834, 446619, 443927, 440936, 438143, 436207, 434990, 433636, 431958, 430913, 431246, 432557, 434224, 436382, 439304, 442506, 445266, 447484, 449415, 451063, 452580, 454784, 458523, 463776, 469940, 476671, 483880, 491350, 499088, 507711, 517748, 528707, 539566, 550115, 561246, 574014, 588971, 606308, 625959, 647503, 670519, 695255, 722595, 753224, 787074, 823580, 862065, 901647, 940908, 977880, 1010507, 1037301, 1057671, 1071622, 1079171, 1080290, 1075522, 1066390, 1055034, 1043427, 1032860, 1023866, 1016522, 1010980, 1007716, 1007072, 1008691, 1011809, 1016123, 1021856, 1028856, 1036164, 1042728, 1048148, 1052395, 1055153, 1055802, 1053864, 1049289, 1042507, 1034330, 1025508, 1016269, 1006599, 997003, 988507, 981721, 976404, 972246, 969614, 969128, 970913, 974724, 980530, 988611, 999284, 1012861, 1029614, 1049494, 1072217, 1097935, 1127585, 1162185]
61515A162185L9842M4954N0428N7000O4829P3487Q2416R1271J00246J10101J21436
61504A998195J33827J45949J56528J64771J70035J71609J69025J62183J51194
61495C423316J36456J18827R9331P8675N7380L6283J6438j288j6144k7153l3554
61484C888567l5577l4350l1212k7596k5358k6304l1163l9486n0617o4037p8705
61473C444162r2672j03858j10928j13390j11318j05238r6042q4738p2402o0168
61463B493408m8967l9235l0991k4055j7992j2233o700k023J259L553N736Q218
61451B329978J0922J3930J7482K1545K5945L0753L5980M1242M6351N1915N8479
61440B684522O5434P1518P6183P9384Q0216P6873O8249N4738L7525J8055j652
$$ y = [1162185, 1202027, 1246981, 1297409, 1354409, 1419238, 1492725, 1575141, 1666412, 1766658, 1876759, 1998195, 2132022, 2277971, 2434499, 2599270, 2769305, 2940914, 3109939, 3272122, 3423316, 3559772, 3678599, 3777930, 3856605, 3913985, 3950268, 3966706, 3965418, 3949274, 3922121, 3888567, 3852990, 3818640, 3787428, 3759832, 3734474, 3708170, 3677007, 3637521, 3586904, 3522867, 3444162, 3351490, 3247632, 3136704, 3023314, 2911996, 2806758, 2710716, 2625978, 2553576, 2493408, 2444441, 2405206, 2374215, 2350160, 2332168, 2319935, 2313235, 2311212, 2312471, 2316024, 2321760, 2329978, 2340900, 2354830, 2372312, 2393857, 2419802, 2450555, 2486535, 2527777, 2574128, 2626043, 2684522, 2749956, 2821474, 2897657, 2977041, 3057257, 3134130, 3202379, 3257117, 3294642, 3312697, 3311045]
61429C311045j9345l3683m4497n1776n5246n5142n2432m7812m1240l2822k3372
61418B853678j3588l442O931J6216K2483K4495K2041J5389N089p666k0804l1866
61406B888956l8993m1848m1595l9730l7049l3838l0592k7869k5611k3343k0933
61395B527555j8512j5683j1615o105J69O572J3231K0692K9404L9595N1070O3180
61383B699553P5458Q8252J02021J16216J29699J42153J53961J64559J71961J74272
61373D018105J70761J61148J44931J22145R4138O3010L0735q73l0107n5936p8317
61362D639740r7574j13889j27529j38823j47598j53218j55579j55463j53639j50215
61352C246213j45182j38882j31545j23053j13572j03810r4194q4517p4828o5892
$$ y = [3311045, 3291700, 3258017, 3213520, 3161744, 3106498, 3051356, 2998924, 2951112, 2909872, 2877050, 2853678, 2840090, 2836648, 2843579, 2859795, 2882278, 2906773, 2928814, 2944203, 2949292, 2941626, 2920822, 2888956, 2849963, 2808115, 2766520, 2726790, 2689741, 2655903, 2625311, 2597442, 2571831, 2548488, 2527555, 2509043, 2493360, 2481745, 2475640, 2475809, 2482381, 2495612, 2516304, 2545708, 2585303, 2636373, 2699553, 2775011, 2863263, 2965284, 3081500, 3211199, 3353352, 3507313, 3671872, 3843833, 4018105, 4188866, 4350014, 4494945, 4617090, 4711228, 4774238, 4804973, 4804100, 4773993, 4718057, 4639740, 4542166, 4428277, 4300748, 4161925, 4014327, 3861109, 3705530, 3550067, 3396428, 3246213, 3101031, 2962149, 2830604, 2707551, 2593979, 2490169, 2395975, 2311458, 2236630, 2170738]
61342B170738n8074n0434m1759l2116k2689j4352o972J05P490J5404K3431L0693
61330B021465L6550M0863M3400M3448M0344L4106K5356J5195N360k279p001r646
61318B287161j1321j2150j1722j0177q192o247m451k776r39J607N032Q737J1995
61305B246557J4675J6951J8685J9612J9756J9139J7422J4308J0065N168l02o374
61293B395662j2561j8001k2008k4163k4188k2201j8753j4323r164m117q98p70
61281B224515l245o894j1037j5715k0279k3257k3963k3302k2512k1747k0300j7723
61269B014541j4243j0451p043m513k671o54K150N217P409Q347Q927J0330J2961
61256B030307J6627K1362K7470L4823M2622N0153N7353O4392P1103P7238Q3028
$$ y = [2170738, 2112664, 2062230, 2020471, 1988355, 1965666, 1951314, 1944342, 1944447, 1951937, 1967341, 1990772, 2021465, 2058015, 2098878, 2142278, 2185726, 2226070, 2260176, 2285532, 2300727, 2306087, 2303808, 2296807, 2287161, 2275840, 2263690, 2251968, 2241791, 2233599, 2227352, 2222901, 2220125, 2219186, 2220793, 2225825, 2234562, 2246557, 2261232, 2278183, 2296868, 2316480, 2336236, 2355375, 2372797, 2387105, 2397170, 2402338, 2402036, 2395662, 2383101, 2365100, 2343092, 2318929, 2294741, 2272540, 2253787, 2239464, 2230300, 2226183, 2225285, 2224515, 2221270, 2214376, 2203339, 2187624, 2167345, 2144088, 2120125, 2096823, 2074311, 2052564, 2032264, 2014541, 2000298, 1989847, 1982804, 1978291, 1975620, 1974966, 1977116, 1982333, 1989742, 1998089, 2007016, 2017346, 2030307, 2046934, 2068296, 2095766, 2130589, 2173211, 2223364, 2280717, 2345109, 2416212, 2493450, 2576478]
61245B576478Q8998R5302J01460J06466J08707J06087R6872Q0442N6889K6430
61235C444131r821m8470q4286j12599j31218j40220j40799j34603j23372j08570
61225B410173r1367p2924n4134l5072j5434M127K1654L5079M3093M4606L8363
61214B328164K3944K951k1285m4904o4414p7510q3957q5416q3781p9890p4194
61203A739708o7892o2342n7702n3129m8341m3977m0324l6602l2097k7324k3404
61192A246574k0616j8213j5622j3191j1495j0386r194p731o494n774n060l737
61180A119061j952k03J664M422Q304J2443J5536J6714J5512J1527M470n377j6804
61167A185317k7742l6086m0885m2774m2883m1596l8845l5242l1975k9526k7318
$$ y = [2576478, 2665476, 2760778, 2862238, 2968704, 3077411, 3183498, 3280370, 3360812, 3417701, 3444131, 3434310, 3385840, 3301554, 3188955, 3057737, 2917517, 2776718, 2642115, 2518743, 2410173, 2318806, 2245882, 2191748, 2156676, 2141242, 2145369, 2167023, 2202102, 2245195, 2289801, 2328164, 2352108, 2355059, 2333774, 2288870, 2224456, 2146946, 2062989, 1977573, 1893792, 1813902, 1739708, 1671816, 1609474, 1551772, 1498643, 1450302, 1406325, 1366001, 1329399, 1297302, 1269978, 1246574, 1225958, 1207745, 1192123, 1178932, 1167437, 1157051, 1147857, 1140126, 1133632, 1127858, 1122798, 1119061, 1117109, 1116906, 1118570, 1122992, 1131296, 1143739, 1159275, 1175989, 1191501, 1203028, 1207498, 1202121, 1185317, 1157575, 1121489, 1080604, 1037830, 994947, 953351, 914506, 879264, 847289, 817763, 790445]
61156G90445k4928k2821k1453k0354j8724j6503j4312j2654j1616j1088j0703
61145F05289r815q049n804l855k516j490l87R49K530M279N980P496R088J1257
61131F14952J4098J6968J8914J9342J8066J4891R584K575m630j0342j3972j6099
61119F84347j7287j7458j6583j5268j4132j3062j1595r726p923o569n799n547
61107E43398n363m582l194k104k014k380k132j044K13J122J736K212K534K660
61093E31062K458J799J017Q61J567K457K920L194L640M022M262N062O760Q294
61079E79375Q506P884P757Q207Q222P573P058O931O468N353M265L846L951M032
61065F69428L626K535J226P51J477K388K507K472L581N816Q085R850J1262J2192
$$ y = [790445, 765517, 742696, 721243, 700889, 682165, 665662, 651350, 638696, 627080, 615992, 605289, 595474, 587425, 581621, 577766, 575250, 573760, 573373, 574322, 576852, 581131, 587111, 594607, 603695, 614952, 629050, 646018, 664932, 684274, 702340, 717231, 726815, 729390, 724760, 714418, 700446, 684347, 667060, 649602, 633019, 617751, 603619, 590557, 578962, 569236, 561313, 554744, 548945, 543398, 538035, 533453, 530259, 528155, 526141, 523761, 521629, 520585, 520798, 521920, 523656, 525868, 528402, 531062, 533520, 535319, 536336, 537197, 538764, 541221, 544141, 547335, 550975, 554997, 559259, 564321, 571081, 579375, 587881, 595765, 603522, 611729, 619951, 627524, 634582, 641513, 647981, 653334, 657599, 661445, 665396, 669428, 673054, 675589, 676815, 677566, 679043, 681431, 683938, 686410, 689991, 695807, 703892, 713742, 725004, 737196]
61051G37196J2549J3143J4777J6879J8388J9496K1022K2689K3751K4653K6213
61040I50756K7670K7621K6455K5785K5776K5344K4666K5079K6504K7405K7460
61029A240521K7935K9313L0927L3086L7105M2816M8437N3235N8094O3241O7742
61018A732452P1528P5622Q0321Q5589R2973J04381J19027J34488J50403J68008
61008B814792J86784K05588K26778K54978K92337L39634M01062M81456N79224
60999E782633O89553Q15292R67283J155460J391390J697321K087985K527319K919691
60990B0033927L165892L218256L059329K647007J942876J029107J59289l74416
60982C4881267m54453k09736J20340L60852M32607K68453k11867j004040j932641
$$ y = [737196, 749745, 762888, 777665, 794544, 812932, 832428, 853450, 876139, 899890, 924543, 950756, 978426, 1006047, 1032502, 1058287, 1084063, 1109407, 1134073, 1159152, 1185656, 1213061, 1240521, 1268456, 1297769, 1328696, 1361782, 1398887, 1441703, 1490140, 1543375, 1601469, 1664710, 1732452, 1803980, 1879602, 1959923, 2045512, 2138485, 2242866, 2361893, 2496381, 2646784, 2814792, 3001576, 3207164, 3433942, 3688920, 3981257, 4320891, 4721953, 5203409, 5782633, 6472186, 7287478, 8254761, 9410221, 10801611, 12498932, 14586917, 17114236, 20033927, 23199819, 26418075, 29477404, 32124411, 34067287, 35096394, 35255683, 34881267, 34426814, 34217078, 34337418, 34698270, 35130877, 35399330, 35187463, 34183423, 32250782]
60973C2250782k719434l160481l234365l053928k748638k401651k058665j747255
60965A1126365j476940j241755j035754q60763p17633n99991n01294m20843l58642
60956C912750l10160k70173k37079k10061j86205j63510j43100j25735j09541
60947B157186r3551p9990p0567o3795n8267n5352n6086n8248n9147n8716n7668
60936A445799n5172n0741m6051m2526l9175l4926l0928k8522k6943k5077k3573
60925A042165k3194k2992k2011k0927k0258j8868j6150j3727j3024j2928j1874
60914H46212j0476j0125j0538j0736j1040j2139j3487j4334j5051j5858j5661
60903G06767j3843j1686j0424r268p147m841l584k857j455M12J865L042M317M988
$$ y = [32250782, 29531348, 26370867, 23136502, 20082574, 17333936, 14932285, 12873620, 11126365, 9649425, 8407670, 7371916, 6511153, 5793520, 5193529, 4692235, 4271392, 3912750, 3602590, 3332417, 3095338, 2885277, 2699072, 2535562, 2392462, 2266727, 2157186, 2063635, 1983645, 1913078, 1849283, 1791016, 1735664, 1679578, 1621330, 1562183, 1503467, 1445799, 1390627, 1339886, 1293835, 1251309, 1212134, 1177208, 1146280, 1117758, 1090815, 1065738, 1042165, 1018971, 995979, 973968, 953041, 932783, 913915, 897765, 884038, 871014, 858086, 846212, 835736, 825611, 815073, 804337, 793297, 781158, 767671, 753337, 738286, 722428, 706767, 692924, 681238, 670814, 661546, 654399, 649558, 645974, 643117, 641662, 642074, 643939, 646981, 651298, 656286]
60889F56286M411L417L059K938K300J621J519J297J67j118j483j340j679k348
60875F69047k714l027l589l664k779j987k314k967k680j797j310r21K00J565K080
60860F43143J966K286L164L934M381M426L303N60k695m956o103o876p359p291
60846F31883p063p106p067o801p222q864j0583j1131j0963j1066j1039j0024q548
60833E14406p656p043n757m091l014k345j241O7O78P49J080J523J311O08K58L72
60817D89905N64J085K250L314L343K764K601K780K665K590L190L773L125J632
60803E25581Q47J192J681J689J495J193N59j09k95k33l64k70N26J213O43p98j778
60786E32772k138k800l843m370m202m127m441m716m995n784o815p206o920o679
$$ y = [656286, 660697, 664114, 667173, 670111, 672411, 674032, 675551, 676848, 677015, 675897, 674414, 673074, 671395, 669047, 666333, 663306, 659717, 656053, 653274, 651287, 648973, 646006, 643326, 641529, 640219, 639298, 639498, 641063, 643143, 645109, 647395, 650559, 654493, 658874, 663300, 666603, 667163, 664468, 659512, 653409, 646533, 639174, 631883, 624820, 617714, 610647, 603846, 596624, 587760, 577177, 566046, 555083, 544017, 532978, 522954, 514406, 506750, 499707, 493950, 489859, 486845, 484500, 483259, 483326, 484004, 484753, 485833, 487356, 488667, 489275, 489533, 489905, 490469, 491554, 493804, 497118, 500461, 503225, 505826, 508606, 511271, 513861, 517051, 520824, 523949, 525581, 526428, 527620, 529301, 530990, 532485, 533678, 534237, 534128, 533833, 533600, 533236, 532966, 533492, 534705, 535348, 534550, 532772, 530634, 527834, 523991, 519621, 515419, 511292, 506851, 502135, 497140, 491356, 484541, 477335, 470415, 463736]
60772D63736o507n656m102k732j949j311o81n19q97j265j374j383j139k97P96
60757D34720J399J524J824K361K395J483o5j699k887l029k015o68O6J64J61J92
60741D35926J61K73O25Q08O86P84J136O87j080l002l943m561n854p018o661n304
60725D03663m707n207n698n809o093o311n572m157l345l363l209k548k088k045
60711C43511j942j903k461k982k131l2J717K343K530K640K170J322J241K156K863
60696C51042K720K600L294M327M986N243N111M304L090K303K103J808J243J077
60682C95251J411J412P49K01L31P13R43J296J946K539K929L362L671L388K861
60667D23003L138M359N437N670N515N491N432N246N232N214M444K806J076l60
$$ y = [463736, 457229, 451573, 447471, 444739, 442790, 441479, 440798, 440279, 439382, 438117, 436743, 435360, 434221, 433924, 434720, 436119, 437643, 439467, 441828, 444223, 445706, 445641, 443942, 441055, 438026, 436011, 435343, 435409, 435573, 435734, 435926, 436087, 436360, 436985, 437793, 438479, 439263, 440399, 441086, 440006, 437004, 433061, 428500, 422646, 415628, 408967, 403663, 398956, 393749, 388051, 382242, 376149, 369838, 364266, 360109, 356764, 353401, 350192, 347644, 345556, 343511, 341569, 339666, 337205, 334223, 332092, 332060, 333777, 336120, 338650, 341290, 343460, 344782, 346023, 348179, 351042, 353762, 356362, 359656, 363983, 368969, 374212, 379323, 383627, 386717, 389020, 391123, 392931, 394174, 395251, 396662, 398074, 398823, 399024, 399355, 400068, 401011, 402307, 404253, 406792, 409721, 413083, 416754, 420142, 423003, 426141, 430500, 435937, 441607, 447122, 452613, 458045, 463291, 468523, 473737, 478181, 480987, 482063, 481703]
60653D81703j922l678m900n172m987m764m353l754l365l107k416j344o65n42k24
60638D36510O09J329J534J633J858J773J172M70j53r84j848k085j771j858k718
60623D35471l632m013m020l660k564j090l63o55q85k71O35J157J532K117K606
60608D22365K751K922L300L459L324L574M432N045M703L881L342K965K161Q47
60594D69071n79j680k141k048k207l400n181o246o103n454m833m018k995k379
60580D19807k418k645k762k912k905k385j831k060k549j787K48J685J451P85J104
60565D00826J957K240K051K076K130J673J002P55Q13O69L43R5j98o47q98p38n44
60548D13605n68m58k2L07L84R10K376M229N732O961Q307R746J1215J3021J5247
$$ y = [481703, 479781, 476103, 471203, 466031, 461044, 456280, 451927, 448173, 444808, 441701, 439285, 437941, 437276, 436734, 436510, 437119, 438448, 439982, 441615, 443473, 445246, 446418, 446888, 446735, 445751, 443903, 441818, 440047, 438189, 435471, 431839, 427826, 423806, 420146, 417582, 416492, 416129, 415474, 414589, 414318, 414953, 416110, 417642, 419759, 422365, 425116, 428038, 431338, 434797, 438121, 441695, 446127, 451172, 455875, 459756, 463098, 466063, 468224, 469071, 468492, 466812, 464671, 462623, 460416, 457016, 451835, 445589, 439486, 434032, 429199, 425181, 422186, 419807, 417389, 414744, 411982, 409070, 406165, 403780, 401949, 399889, 397340, 395553, 395801, 397486, 398937, 399722, 400826, 402783, 405023, 407074, 409150, 411280, 412953, 413955, 414710, 415523, 416192, 416535, 416630, 416432, 415785, 414887, 414149, 413605, 413037, 412579, 412557, 412864, 413248, 414158, 416534, 420763, 426495, 433456, 441763, 451509, 462724, 475745, 490992]
60533D90992J7447J9425K1631K4223K6567K8229K9537L0510L0045K7002K1522
60522G67130J4700P563Q28m990r827j3900j6984j8551j8770j8390j7476j5385
60510F55948j2397r979q804p755n720l185j126N23K362M406O574R410J3266J7379
60496F60902K0743K3270K5443K7413K9139L0577L1036K9264K5054K0070J6242
60485I39153J4056J3085J3373J5338J9086K4629L2220M1565N1334O0154O7653
60474A291646P4169Q0265Q7002R5583J05945J16521J25883J33371J37373J34462
60464B382220J21603R8403O6310K6999j6938o0843r9528j29938j51347j63680
60454B073261j67091j62823j53110j40152j25822j11752r8732q6360p4258o3132
$$ y = [490992, 508439, 527864, 549495, 573718, 600285, 628514, 658051, 688561, 718606, 745608, 767130, 781830, 789393, 790221, 785231, 775404, 761504, 744520, 725969, 707199, 688809, 671333, 655948, 643551, 633572, 624768, 617013, 611293, 608108, 606982, 607505, 609867, 614273, 620847, 630257, 643523, 660902, 681645, 704915, 730358, 757771, 786910, 817487, 848523, 877787, 902841, 922911, 939153, 953209, 966294, 979667, 995005, 1014091, 1038720, 1070940, 1112505, 1163839, 1223993, 1291646, 1365815, 1446080, 1533082, 1628665, 1734610, 1851131, 1977014, 2110385, 2247758, 2382220, 2503823, 2602226, 2668536, 2695535, 2678597, 2617754, 2518226, 2388288, 2236941, 2073261, 1906170, 1743347, 1590237, 1450085, 1324263, 1212511, 1113779, 1027419, 953161, 890029]
60444H90029n3857m6133l9018l2351k6639k2096j8632j6222j4422j2197r250o772
60432E92440n785n501m601l412l269m212m982n045n072n279m857l336j349M08
60418E36148K008L710N395O972Q714J0754J2702J4035J4711J5255J6357J8317
60406F65078K0795K3254K5578K7897K9850L0784L0763L0510L0065K8468K5196
60395I68238K0963J6508J1648O360J742j107k412l002l041k429j695j322q66J44
60381A009729R60N40p77j720j908k032k399k463j781m63J337L557N813P506Q356
60366A024255Q274O924L984k87n254j0421j5363j9518k2542k4516k5453k5148
60354H94935k3865k2552k1709k0731j9001j6995j5524j4508j3351j1986j0740
$$ y = [890029, 836172, 790039, 751021, 718670, 692031, 669935, 651303, 635081, 620659, 608462, 599212, 592440, 586655, 581154, 576553, 573141, 569872, 565660, 560678, 555633, 550561, 545282, 540425, 537089, 535740, 536148, 538156, 541866, 547261, 554233, 562947, 573701, 586403, 600438, 615149, 630404, 646761, 665078, 685873, 709127, 734705, 762602, 792452, 823236, 853999, 884509, 914574, 943042, 968238, 989201, 1005709, 1017357, 1023717, 1025459, 1024352, 1021940, 1018938, 1015897, 1013468, 1011773, 1010451, 1009585, 1009729, 1010689, 1011229, 1010452, 1008732, 1006824, 1004792, 1002393, 999930, 998149, 997686, 999023, 1002580, 1008393, 1015899, 1024255, 1032529, 1039453, 1043437, 1043150, 1037896, 1027475, 1012112, 992594, 970052, 945536, 920083, 894935, 871070, 848518, 826809, 806078, 787077, 770082, 754558, 740050, 726699, 714713, 703973]
60343G03973r513p880n803l703k078j343j507j793j249r5M56L8l25k8l8j369l527
60326F64216n380o581p183o846n609m525m493n087n476n672n935n845n079m214
60312E86291l753l219k168j171o90j25R19J469O99n14r93j117j800k596k551j988
60296E66693j747j441k91J070J496J412K057L232L720L658M364O036P458Q038
60282F05755Q394Q912R330R817J0918J2415J3577J4458J5607J6726J7108J7158
60270G60175J7928J9281K0061J9900J9361J8472J6830J4988J4098J4135J4027
60259I49256J3533J3375J3563J3299J2637J2594J3347J3981J4227J4955J6653
60248A101420J8863K1387K4593K8269L1499L4035L6539L9315M1997M4665M7917
$$ y = [703973, 694460, 686580, 680777, 677074, 674996, 673653, 672146, 670353, 669104, 669009, 669465, 669503, 669178, 669150, 669112, 667743, 664216, 658836, 652255, 645072, 638226, 632617, 628092, 623599, 618512, 613036, 607364, 601429, 595584, 590505, 586291, 582538, 579319, 577151, 575980, 575290, 575165, 576084, 577553, 578252, 577738, 576745, 575628, 573828, 571232, 568681, 566693, 564946, 563505, 563214, 564284, 565780, 567192, 569249, 572481, 576201, 579859, 584223, 590259, 597717, 605755, 614149, 623061, 632391, 642208, 653126, 665541, 679118, 693576, 709183, 725909, 743017, 760175, 778103, 797384, 817445, 837345, 856706, 875178, 892008, 906996, 921094, 935229, 949256, 962789, 976164, 989727, 1003026, 1015663, 1028257, 1041604, 1055585, 1069812, 1084767, 1101420, 1120283, 1141670, 1166263, 1194532, 1226031, 1260066, 1296605, 1335920, 1377917, 1422582, 1470499]
60237A470499N1721N5372N8660O1934O5070O7687P0252P3622P7518Q0875Q3406
60226B216616Q5359Q6023Q4397Q1209P8355P6101P2810O7680O1826N6178N0237
60215C016791M3534L6652L0066K3556J7326J2233Q300M554Q37j741k754l164l378
60202C182812k266J009N620J0493J5770K1953K8681L5347M1852M7972N2919N6309
60190C498471N8722O0737O2183O2695O2026N9539N4466M6929L7758K7192J5005
60179D045723J890j0922k3564l7337n2170o6141p8030q8476r7744j04301j06749
60168C382179j05621j02038r6100q7883p8622o9399n9743m8893l7429k6408j5743
60157B654300m814O057J5884K4127L0419L3896L4002L1484K7517K2278J5302O828
$$ y = [1470499, 1522220, 1577592, 1636252, 1698186, 1763256, 1830943, 1901195, 1974817, 2052335, 2133210, 2216616, 2301975, 2387998, 2472395, 2553604, 2631959, 2708060, 2780870, 2848550, 2910376, 2966554, 3016791, 3060325, 3096977, 3127043, 3150599, 3167925, 3180158, 3188458, 3193012, 3193849, 3192108, 3189354, 3186190, 3182812, 3180546, 3181555, 3187175, 3197668, 3213438, 3235391, 3264072, 3299419, 3341271, 3389243, 3442162, 3498471, 3557193, 3617930, 3680113, 3742808, 3804834, 3864373, 3918839, 3965768, 4003526, 4030718, 4045723, 4047613, 4036691, 4013127, 3975790, 3923620, 3857479, 3779449, 3690973, 3593229, 3488928, 3382179, 3276558, 3174520, 3078420, 2990537, 2911915, 2842516, 2782773, 2733880, 2696451, 2670043, 2654300, 2649486, 2655543, 2671427, 2695554, 2725973, 2759869, 2793871, 2825355, 2852872, 2875150, 2890452, 2897280]
60145B897280k137j0789j8750k5608l0955l4733l7044l7726l6405l2787k6851
60134B603495j9072j0415j522P984J8682L0103M1236N2105O3676P6247Q9194J02381
60122C054094J16383J31120J45655J59682J73666J87150J98456K06734K12779
60113D585719K17010K18088K14465K06065J93491J76861J56434J33287J08299
60104F209719Q1304N2092K1379j0027m1999p4183j05166j33421j58262j79160
60094E662276j94997k04868k08912k07725k01743j91619j78278j62101j43012
60085C969021j21844j00403p9576n8639l7064j5861L754K1723L8314N3065O5459
60074C737949P5457Q2415Q4631Q1070P2636O0942M6798L0774J4030k463j8715
$$ y = [2897280, 2895143, 2884354, 2865604, 2839996, 2809041, 2774308, 2737264, 2699538, 2663133, 2630346, 2603495, 2584423, 2574008, 2572486, 2580470, 2599152, 2629255, 2670491, 2722596, 2786272, 2862519, 2951713, 3054094, 3170477, 3301597, 3447252, 3606934, 3780600, 3967750, 4166206, 4372940, 4585719, 4802729, 5020817, 5235282, 5441347, 5634838, 5811699, 5968133, 6101420, 6209719, 6291023, 6343115, 6364494, 6354467, 6312468, 6238285, 6133119, 5999698, 5841436, 5662276, 5467279, 5262411, 5053499, 4845774, 4644031, 4452412, 4274134, 4112033, 3969021, 3847177, 3746774, 3667198, 3608559, 3571495, 3555634, 3559388, 3581111, 3619425, 3672490, 3737949, 3813406, 3895821, 3980452, 4061522, 4134158, 4195100, 4241898, 4272672, 4286702, 4284239, 4265524]
60063D265524l4720m9658o2910p4818q5570r4418j00894j05604j08814j09492
60053C438626j06911j02008r6001q8786p9923p0004n9592m7965l4477k0339p356
60042B725264M320J5602K6261L4947M1196M5955N0351N4995O0144O5396O9458
60031C193889P1169P0437O7465O1771N2926M1714K9389J6359K466j1982k6429
60020C569174m0672n4308o6243p5741q3229q9037r2138r1401q7418q1822p5265
60009B731900o7340n8074m8167l7983k7324j6113m429P784K0375L2754M4677N6690
59997B634750O9101Q1259R2592J03455J14016J23178J29668J33339J34192J31047
59987C746597J22654J09705R4344P8015O0833M2693K3740M013j6402l7016n7294
$$ y = [4265524, 4230804, 4181146, 4118236, 4043418, 3957848, 3863430, 3762536, 3656932, 3548118, 3438626, 3331715, 3229707, 3133706, 3044920, 2964997, 2894993, 2835401, 2787436, 2752959, 2732620, 2725264, 2729584, 2745186, 2771447, 2806394, 2847590, 2893545, 2943896, 2998891, 3059035, 3124431, 3193889, 3265058, 3335495, 3402960, 3464731, 3517657, 3559371, 3588760, 3605119, 3607585, 3595603, 3569174, 3528502, 3474194, 3407951, 3332210, 3248981, 3159944, 3067806, 2976405, 2888987, 2807165, 2731900, 2664560, 2606486, 2558319, 2520336, 2493012, 2476899, 2472470, 2480254, 2500629, 2533383, 2578060, 2634750, 2703851, 2785110, 2877702, 2981157, 3095173, 3218351, 3348019, 3481358, 3615550, 3746597, 3869251, 3978956, 4073300, 4151315, 4212148, 4254841, 4278581, 4282594, 4266192, 4229176, 4171882]
59976D171882p6809r4430j08227j17069j21485j22051j18060j09004r6373q2446
59966C125928o8026n2750l6936k1589p029P032K0424L2715M4018N4400O3124O9684
59954C230995P4951P9934Q4055Q6096Q6093Q4727Q1516P5522O7433N9108N1142
59943D061572M2596L3017K3045J2997K664p310j5274k0191k2078k0795j5731o952
59931D067560M604J8492L5167N4804P6644R9798J23781J48101J72082J95237K17038
59920E213308K36357K51798K62367K67004K63754K50481K26439J92414J49622
59911G313544R9510M4513j1968o6390j15446j56223j87037k07928k19586k22253
59901F270736k16513k04357j88149j68834j46318j21125r4391o6546l7390p382
$$ y = [4171882, 4095073, 4000643, 3892416, 3775347, 3653862, 3531811, 3413751, 3304747, 3208374, 3125928, 3057902, 3005152, 2968216, 2946627, 2939598, 2946630, 2967054, 2999769, 3043787, 3098187, 3161311, 3230995, 3305946, 3385880, 3469935, 3556031, 3642124, 3726851, 3808367, 3883889, 3951322, 4010430, 4061572, 4104168, 4137185, 4160230, 4173227, 4175891, 4168581, 4153307, 4133116, 4111038, 4090243, 4074512, 4067560, 4072164, 4090656, 4125823, 4180627, 4257271, 4357069, 4480850, 4628951, 4801033, 4996270, 5213308, 5449665, 5701463, 5963830, 6230834, 6494588, 6745069, 6971508, 7163922, 7313544, 7413054, 7457567, 7445599, 7379209, 7263763, 7107540, 6920503, 6712575, 6492989, 6270736, 6054223, 5849866, 5661717, 5492883, 5346565, 5225440, 5131049, 5064503, 5027113, 5019731]
59891E019731K2382N1199P8574J02992J22107J34188J38623J35479J25832J12307
59881F043414R7936Q4380P1855O0251M9000L6366K0372N00k2570m8392p6529j05226
59869F211357j31860j54686j72894j85230j90235j87993j80218j68380j52856
59860D687005j33968j12565q9342o4677l9270j3990J0824L4982N7553P7483R4721
59849D508756J09457J20486J25730J24233J16256J01697Q0196N3051K3391n995
59839E357258l3766n8795p9386r4385j03984j08922j09862j08022j05559j04674
59829D449903j06506j10750j15750j19199j19521j16510j10331j00735q8168p4676
59819C387757o2331n1380m1228l2577k6858k4031k2791k2582k3594k4919k4739
$$ y = [5019731, 5042113, 5093312, 5171886, 5274878, 5396985, 5531173, 5669796, 5805275, 5931107, 6043414, 6141350, 6225730, 6297585, 6357836, 6406836, 6443202, 6463574, 6464074, 6441504, 6393112, 6316583, 6211357, 6079497, 5924811, 5751917, 5566687, 5376452, 5188459, 5008241, 4839861, 4687005, 4553037, 4440472, 4351130, 4286453, 4247183, 4233193, 4244017, 4278999, 4336552, 4414035, 4508756, 4618213, 4738699, 4864429, 4988662, 5104918, 5206615, 5286811, 5339862, 5363253, 5357258, 5323492, 5264697, 5185311, 5090926, 4986942, 4878020, 4768158, 4660136, 4554577, 4449903, 4343397, 4232647, 4116897, 3997698, 3878177, 3761667, 3651336, 3550601, 3462433, 3387757, 3325426, 3274046, 3232818, 3200241, 3173383, 3149352, 3126561, 3103979, 3080385, 3055466, 3030727]
59808C030727k2424j8801j4144p640R93J1014K1993L4177M7419O1368P6817R5209
59796C316708J16682J40196J65540J93227K21902K47650K66141K73819K66888
59787E208753K41676J97344J37224O7229n504p2608j26153j62302j82354j89577
59777E113728j86412j75247j59612j42909j26884j12243r9455q8030p6461o4040
59767C882435n1790m0748l0531k0512j1053k502N898J4847K3732L1632L8764M5829
59755C886001N2649N8510O3414O8113P3367P9698Q7342R5952J05021J14932J26828
59744D811827J41082J56870J73614J91737K11415K31714K51661K71062K89362
59735F730344L04510L13923L16049L10434K97095K76690K50998K22684J94860
$$ y = [3030727, 3008303, 2989502, 2975358, 2967718, 2968711, 2979725, 3001718, 3035895, 3083314, 3144682, 3221499, 3316708, 3433390, 3573586, 3739126, 3932353, 4154255, 4401905, 4668046, 4941865, 5208753, 5450429, 5647773, 5784997, 5852226, 5846722, 5774114, 5647961, 5485659, 5303305, 5113728, 4927316, 4752069, 4592457, 4449548, 4322664, 4210421, 4110966, 4022936, 3946475, 3882435, 3830645, 3789897, 3759366, 3738854, 3727801, 3725299, 3731197, 3746044, 3769776, 3801408, 3840172, 3886001, 3938650, 3997160, 4060574, 4128687, 4202054, 4281752, 4369094, 4465046, 4570067, 4684999, 4811827, 4952909, 5109779, 5283393, 5475130, 5686545, 5918259, 6169920, 6440982, 6730344, 7034854, 7348777, 7664826, 7975260, 8272355, 8549045, 8800043, 9022727, 9217587]
59726I217587J70820J53330J43819J42703J50379J66828J90312K17733K46620
59717A0800131K75629L02875L25267L40078L46116L42869L29834L07318K76824
59708A3646941K39959J97878J52271J05783O0886J9347j6873m5343o4389p3549
59698A4222911p2457o0592l8545q149K9346P3930J24994J80320K37649K96016
59688A4985423L54645M11841M65856N15414N58177N89763O05452O01956N76645
59679A9665172N26360M48855L45248K20467Q1893o1806k01632l29588m39314n25810
59669A9729845n85976o20272o32879o29494o15890n98771n85876n83063n91174
59660A4286450o06261o22101o32342o32287o20758o00190n74114n44878n13909
$$ y = [9217587, 9388407, 9541737, 9685556, 9828259, 9978638, 10145466, 10335778, 10553511, 10800131, 11075760, 11378635, 11703902, 12043980, 12390096, 12732965, 13062799, 13370117, 13646941, 13886900, 14084778, 14237049, 14342832, 14403718, 14423065, 14406192, 14360849, 14296460, 14222911, 14150454, 14089862, 14051317, 14043168, 14072514, 14146444, 14271438, 14451758, 14689407, 14985423, 15340068, 15751909, 16217765, 16733179, 17291356, 17881119, 18486571, 19088527, 19665172, 20191532, 20640387, 20985635, 21206102, 21287995, 21226189, 21024557, 20694969, 20255655, 19729845, 19143869, 18523597, 17890718, 17261224, 16645334, 16046563, 15460687, 14877624, 14286450, 13680189, 13058088, 12425746, 11793459, 11172701, 10572511, 9998397, 9453519, 8939610]
59651H939610m82689m52315m22906l94478l67597l42423l18137k94206k71240
59642E593619k49692k28725k07522j86689j67220j48900j30964j13550r7281q2051
59632C981025o7505n4122m2747l3477k6065k0757j7769j6448j6020j6649j8683
59621C650783k1473k4064k6610k9969l4222l8627m2805m6902n0680n3283n4033
59610C228115n2947n0581m7676m4568m0742l5561k9499k3917j9331j4982j0561
59599B857750p003m777k604R57N563R843J3317J6359J8974K0873K2256K3382K3642
59586B998532K2196J9318J6261J3946J2541J2086J2767J4728J8047K2706K8294
59575C191422L4226M0472M7470N4979O1942O8049P4477Q2386R1407J00476J09415
$$ y = [8939610, 8456921, 8004606, 7581700, 7187222, 6819625, 6477202, 6159065, 5864859, 5593619, 5343927, 5115202, 4907680, 4720991, 4553771, 4404871, 4273907, 4160357, 4063076, 3981025, 3913520, 3859398, 3816651, 3783174, 3757109, 3736352, 3718583, 3702135, 3686115, 3669466, 3650783, 3629310, 3605246, 3578636, 3548667, 3514445, 3475818, 3433013, 3386111, 3335431, 3282148, 3228115, 3175168, 3124587, 3076911, 3032343, 2991601, 2956040, 2926541, 2902624, 2883293, 2868311, 2857750, 2850747, 2845970, 2843366, 2844323, 2849886, 2859729, 2873046, 2889405, 2908379, 2929252, 2951508, 2974890, 2998532, 3020728, 3040046, 3056307, 3070253, 3082794, 3094880, 3107647, 3122375, 3140422, 3163128, 3191422, 3225648, 3266120, 3313590, 3368569, 3430511, 3498560, 3573037, 3655423, 3746830, 3847306, 3956721]
59564C956721J18802J28644J38009J45832J51630J55628J58396J59986J59522
59555E273170J56166J50252J42599J33014J20736J06064Q9907P1774N0165K5188
59545F319035j230k8120n6017q3713j07039j22637j31058j34431j32889j25414
59535E396487j12603r6189p6618n3336k6789J673L1421O2315R3312J22807J49844
59524E492324J73541J91849K02293K03451J94612J74857J44191J04917O0282J2246
59514F954563l8115q8694j36572j79609k16238k44260k61832k69413k69176k62518
59504D988136k49783k32159k12002j91029j69609j48060j27255j07596q8607o9937
59494C392099n1883l4689j8116j958J3740K9060M4256N9351P4131Q8434J02053
$$ y = [3956721, 4075523, 4204167, 4342176, 4488008, 4639638, 4795266, 4953662, 5113648, 5273170, 5429336, 5579588, 5722187, 5855201, 5975937, 6082001, 6171908, 6243682, 6293847, 6319035, 6317805, 6289685, 6233668, 6149955, 6042916, 5920279, 5789221, 5654790, 5521901, 5396487, 5283884, 5187695, 5111077, 5057741, 5030952, 5032625, 5064046, 5126361, 5219673, 5342480, 5492324, 5665865, 5857714, 6060007, 6263458, 6458070, 6632927, 6777118, 6882035, 6942317, 6954563, 6916448, 6827754, 6691182, 6511573, 6295335, 6051075, 5789243, 5519830, 5250654, 4988136, 4738353, 4506194, 4294192, 4103163, 3933554, 3785494, 3658239, 3550643, 3462036, 3392099, 3340216, 3305527, 3287411, 3285453, 3299193, 3328253, 3372509, 3431860, 3505991, 3594425, 3696478]
59483C696478J14577J25713J35271J42423J45454J42854J34256J20001J00453
59474D857480P6251M8482J8067j4277m7109p8205j06009j30134j50086j64744
59464D309716j73870j78761j80465j78656j73237j65661j57385j48283j37980
59455B815418j27447j17789j08482r8475q8209p9008p1161o4047n7389n1058m4442
59444A907911l7326l0682k5243k0188j4532q838m178l81L180O133P992R660J2254
59431A805762J5252J7436J8936K0761K3043K5320K7674L0076L1433L0847K8901
59420B075441K6320K2592J7762J4262J4716J8814K4406L0607L7594M4375M9366
59409B376255N2457N4170N3580M9854M5300M3971M7331N3781O2110P2585Q4673
$$ y = [3696478, 3811055, 3936768, 4072039, 4214462, 4359916, 4502770, 4637026, 4757027, 4857480, 4933731, 4982213, 5000280, 4986003, 4938894, 4860689, 4754680, 4624546, 4474460, 4309716, 4135846, 3957085, 3776620, 3597964, 3424727, 3259066, 3101681, 2953398, 2815418, 2687971, 2570182, 2461700, 2363225, 2275016, 2196008, 2124847, 2060800, 2003411, 1952353, 1907911, 1870585, 1839903, 1814660, 1794472, 1779940, 1771102, 1766924, 1766543, 1769723, 1775856, 1783848, 1793508, 1805762, 1821014, 1838450, 1857386, 1878147, 1901190, 1926510, 1954184, 1984260, 2015693, 2046540, 2075441, 2101761, 2124353, 2142115, 2156377, 2171093, 2189907, 2214313, 2244920, 2282514, 2326889, 2376255, 2428712, 2482882, 2536462, 2586316, 2631616, 2675587, 2722918, 2776699, 2838809, 2911394, 2996067]
59398B996067R6764J08741J22365J38388J55413J72072J88187K03462K17134K29463
59388D628056K41660K54073K66321K79484K95842L15915L37666L58921L78474
59379G356412L94296M03108M02756L93446L76061L51181L20586K87817K56055
59370A0541718K26458J99065J73905J50708J28721J07229Q5090N9740K8113j1102
59360A1689645n7373j10128j68718k30628k91607l47966l97024m35537m60229
59351I190435m70606m69208m58420m38919m11891l80393l47358l13936k80825
59342E618879k49625k21735j97282j76144j58770j45138j34055j24240j15118
59333D096772j06153r6773q7528p9836p4002o8757o3335n8603n5495n3714n2646
$$ y = [2996067, 3092831, 3201572, 3323937, 3462325, 3617738, 3789810, 3977997, 4181459, 4398593, 4628056, 4869716, 5123789, 5390110, 5669594, 5965436, 6281351, 6619017, 6977938, 7356412, 7750708, 8153816, 8556572, 8950018, 9326079, 9677260, 9997846, 10285663, 10541718, 10768176, 10967241, 11141146, 11291854, 11420575, 11527804, 11612894, 11672634, 11700747, 11689645, 11632272, 11522144, 11353426, 11122798, 10831191, 10483225, 10086201, 9650664, 9190435, 8719829, 8250621, 7792201, 7353282, 6941391, 6560998, 6213640, 5899704, 5618879, 5369254, 5147519, 4950237, 4774093, 4615323, 4470185, 4336130, 4211890, 4096772, 3990619, 3893846, 3806318, 3726482, 3652480, 3583723, 3520388, 3461785, 3406290, 3352576, 3299930]
59322C299930n2308n2566n2641n1945n0559m8540m5765m2631l9676l6427l1940
59311B794932k6548k1469j6654j0839l889K830Q870J5369K2609K8967L3333L6787
59299B864298M0683M4739M8274N2005N7290O4507P3150Q2566R1747R9307J04332
59288C622898J06310J03843R4767P8323N6335L1640O363j8106m0771o1366p9977
59277C900259r5859j07742j15537j20359j22574j21326j16482j09532j01899r3722
59267B795227q4961p6328o8427o1150n4498m8832m3906l8925l3857k9364k5138
59256B229841j9935j3625p518k213L158Q945J4148J8385K2842K8325L3993L9120
59244B355466M4608N1582N9798O8559P8012Q8582J00294J13495J29123J47334
$$ y = [3299930, 3247622, 3195056, 3142415, 3090470, 3039911, 2991371, 2945606, 2902975, 2863299, 2826872, 2794932, 2768384, 2746915, 2730261, 2719422, 2715533, 2718363, 2727233, 2742602, 2765211, 2794178, 2827511, 2864298, 2904981, 2949720, 2997994, 3049999, 3107289, 3171796, 3244946, 3327512, 3419259, 3518566, 3622898, 3729208, 3833051, 3927818, 4006141, 4062476, 4094116, 4100479, 4082373, 4041602, 3980236, 3900259, 3804400, 3696658, 3581121, 3460762, 3338188, 3216862, 3100380, 2990848, 2888949, 2795227, 2710266, 2633938, 2565511, 2504361, 2449863, 2401031, 2357125, 2318200, 2284343, 2254979, 2229841, 2209906, 2196281, 2188763, 2186550, 2189708, 2198653, 2212801, 2231186, 2254028, 2282353, 2316346, 2355466, 2400074, 2451656, 2511454, 2580013, 2658025, 2746607, 2846901, 2960396, 3089519, 3236853]
59234C236853J66964J87061K07839K29491K51213K72080K91569L08545L20957
59225E472572L27285L27133L19802L03609K77234K40726J94646J39707P7857J2435
59215G693006n3361j17025j75606k25753k65483k94539l12628l19033l14502l01767
59205E313309k83454k61001k36068k11030j87258j64668j43641j25529j10560
59196C590100r7197q4522p3224o3385n3430m2390l1170k0302q587M455J6757K6032
59184C163137L2279L6328L7415L4025K6022J4511P73j3428k5763l4936m1346m5361
59172C183656m6352m4439m1408l8638l5652l1872k8026k4576k0552j5589j1388
59161B845164r458q920q319q038r125j0952j2000j1817j0442o977n33Q086J7202
$$ y = [3236853, 3403817, 3590878, 3798717, 4028208, 4279421, 4551501, 4843070, 5151615, 5472572, 5799857, 6126990, 6446792, 6750401, 7027635, 7268361, 7463007, 7602714, 7680571, 7693006, 7639645, 7522620, 7347014, 7121261, 6855778, 6561239, 6248611, 5929578, 5615076, 5313309, 5029855, 4768854, 4532786, 4321756, 4134498, 3969830, 3826189, 3700660, 3590100, 3492903, 3408381, 3335157, 3271772, 3218342, 3175952, 3144782, 3124480, 3115893, 3120348, 3137105, 3163137, 3195416, 3231744, 3269159, 3303184, 3329206, 3343717, 3344490, 3331062, 3305299, 3270363, 3229017, 3183656, 3137304, 3092865, 3051457, 3012819, 2977167, 2945295, 2917269, 2892693, 2872141, 2856552, 2845164, 2835706, 2826786, 2818467, 2810429, 2801304, 2790352, 2778352, 2766535, 2756093, 2749116, 2748583, 2756669, 2773871]
59148B773871K5913L3777L9857M3485M5137M5403M4074M1281L8252L5787L3165
59137C200002K9620K5511K0917J4684O216l296j2755k2737l3754m4510n3353n9898
59125C066647o3671o2943n6934m7747l8159k8728j8910r505j900M113R593J4444
59113B766300J7978K0597K3100K5185K6275K7010K8279K9747L0863L2246L4533
59102C062113L6999L9057M1938M6997N3378N9145O3851O8213P2172P4905P5884
59091C694652P4275O8328N7082M1727K3872L655j8688m0692n9237p3328q3562
59080C688084q9787r1281q8552q3230p6788p0647o6402o4405o3157o1426n9587
59069B872822n7597n3578m6489l8280l0984k3199j2112K314J7753L2842M7105
$$ y = [2773871, 2799784, 2833561, 2873418, 2916903, 2962040, 3007443, 3051517, 3092798, 3131050, 3166837, 3200002, 3229622, 3255133, 3276050, 3290734, 3296950, 3293654, 3280899, 3258162, 3224408, 3179898, 3126545, 3066647, 3002976, 2940033, 2883099, 2835352, 2797193, 2768465, 2749555, 2740050, 2738150, 2742263, 2751856, 2766300, 2784278, 2804875, 2827975, 2853160, 2879435, 2906445, 2934724, 2964471, 2995334, 3027580, 3062113, 3099112, 3138169, 3180107, 3227104, 3280482, 3339627, 3403478, 3471691, 3543863, 3618768, 3694652, 3768927, 3837255, 3894337, 3936064, 3959936, 3963591, 3944903, 3904211, 3844974, 3771646, 3688084, 3598297, 3507016, 3418464, 3335234, 3258446, 3187799, 3121397, 3056992, 2993835, 2932409, 2872822, 2815225, 2761647, 2715158, 2676878, 2645894, 2622695, 2610583, 2612897, 2630650, 2663492, 2710597]
59058B710597N8331O2910N8601M4949K1951q889m2583p2530r4586j07893j12689
59047B518169j09790j01544r0594p7659o2444m6175l1000j7361m470O778J3716
59036A997626J4876J1224M671k896r434j3673j6084j7464j7099j4160r938o445
59024A921204l369J198P390J3220J7519K1065K4786K8839L3456L8844M4225M8601
59012B196978N2300N6346O0661O4327O6968O8336O7208O2422N4289M3546L0022
59001B823403J4165j344j3632k2242k7810k9547k6644k0842j4903r375l689P46
58989B668286J689m22l422p345j4018k2890l0618l5047l6576l5436l0760k2845
58977B430596j3444l301Q043J9555K8571L3806L6055L5498L1032K2938J3656N074
$$ y = [2710597, 2768928, 2831838, 2890439, 2935388, 2957339, 2948450, 2905867, 2833337, 2738751, 2630858, 2518169, 2408379, 2306835, 2216241, 2138582, 2076138, 2029963, 1998963, 1981602, 1977132, 1983910, 1997626, 2012502, 2023726, 2028397, 2025501, 2016067, 2002394, 1986310, 1968846, 1951747, 1937587, 1927649, 1921204, 1917835, 1919033, 1926423, 1939643, 1957162, 1978227, 2003013, 2031852, 2065308, 2104152, 2148377, 2196978, 2249278, 2305624, 2366285, 2430612, 2497580, 2565916, 2633124, 2695546, 2749835, 2793381, 2823403, 2837568, 2836224, 2822592, 2800350, 2772540, 2742993, 2716349, 2695507, 2680604, 2671229, 2667540, 2668286, 2669975, 2669553, 2666131, 2658786, 2644768, 2621878, 2591260, 2556213, 2519637, 2484201, 2453441, 2430596, 2417152, 2413851, 2421894, 2441449, 2470020, 2503826, 2539881, 2575379, 2606411, 2629349, 2643005, 2648079]
58965B648079k770r702j4431j6331j6215j4651j1390o830k284J585M839O765O340
58952B573004M231K302J175L10M00L093Q291J4265K0617K8541L7705M5599N0645
58939B790178N3516N4628N2784M7270L9264L0345K1565J4589J1542J2880J7085
58928C145646K3096L1185M1094N1346O1149P1112Q1540R1853J02238J14021J27830
58917C942110J42991J59264J77390J97610K19193K41641K64608K86608L05586
58908E937001L20962L33337L42423L47362L49049L49899L51170L52472L53633
58899I037308L54454L52602L44342L27710L02769K68901K24637J70388J08624
58890A1491735M1106l1155j04788j74232k36157k91138l40053l81458m13528m36033
$$ y = [2648079, 2645309, 2635607, 2621176, 2604845, 2588630, 2573979, 2562589, 2555759, 2553475, 2555060, 2559899, 2566664, 2573004, 2577235, 2579537, 2580712, 2581022, 2581422, 2584515, 2592806, 2607071, 2627688, 2656229, 2693934, 2739533, 2790178, 2843694, 2898322, 2951106, 2998376, 3037640, 3067985, 3089550, 3104139, 3115681, 3128561, 3145646, 3168742, 3199927, 3241021, 3292367, 3353516, 3424628, 3506168, 3598021, 3700259, 3814280, 3942110, 4085101, 4244365, 4421755, 4619365, 4838558, 5080199, 5344807, 5631415, 5937001, 6257963, 6591300, 6933723, 7281085, 7630134, 7980033, 8331203, 8683675, 9037308, 9391762, 9744364, 10088706, 10416416, 10719185, 10988086, 11212723, 11383111, 11491735, 11532841, 11501686, 11396898, 11222666, 10986509, 10695371, 10355318, 9973860, 9560332, 9124299]
58880I124299m49208m53071m48914m39276m25319m06436l83227l58513l34332
58871E426003l10295k85942k62402k40545k19677j99387j80680j64144j48876
58862C414055j34326j21293j10033r9281q8230p7748o8598o0133n1671m3562l6182
58851B522998k9335k3248j8469j4506j0280o082l124j062J740N422Q522J0917
58839B443493J4227J8879K3518K7863L3308M0062M6592N2641N9858O8411P5958
58828B904810Q1149Q5302Q9322R1888R2243R2073R3037R4951R7903J03654J13217
58817C939549J25364J39071J55131J73895J93800K13791K34961K58096K81799
58808E715457L04574L26683L48254L67630L83054L93998L99339L96255L82456
$$ y = [9124299, 8675091, 8222020, 7773106, 7333830, 6908511, 6502075, 6118848, 5760335, 5426003, 5115708, 4829766, 4567364, 4326819, 4107142, 3907755, 3727075, 3562931, 3414055, 3279729, 3158436, 3048403, 2949122, 2860892, 2783144, 2714546, 2654413, 2602742, 2559180, 2522998, 2493663, 2470415, 2451946, 2437440, 2427160, 2421078, 2417954, 2416892, 2418632, 2424054, 2432576, 2443493, 2457720, 2476599, 2500117, 2527980, 2561288, 2601350, 2647942, 2700583, 2760441, 2828852, 2904810, 2985959, 3071261, 3160583, 3252471, 3344714, 3436787, 3529824, 3624775, 3722678, 3826332, 3939549, 4064913, 4203984, 4359115, 4533010, 4726810, 4940601, 5175562, 5433658, 5715457, 6020031, 6346714, 6694968, 7062598, 7445652, 7839650, 8238989, 8635244, 9017700]
58799I017700L57642L21556K72986K12241J42606O7865r547q6730j59136k23007
58789I914176k77101l20693l52035l70366l77329l74899l63943l46243l25602
58780F805965l05314k86665k71220k61941k59714k60788k59731k53545k41845
58771D405202k25303k05851j86417j68429j50968j33413j16874j01644q5704o7587
58761B963012m8646l0692j3275M895K3847M3367O4366Q7411J11419J35093J57782
58750C498579J77448J89650J89990J76209J47472J04422N1432l809n4784r8611
58740D377998j33551j57366j69993j74850j75238j71501j63413j52784j41622
58731B937680j30136j18523j08494j01081r5091q9475q5042q2114p9027p4715
$$ y = [9017700, 9375342, 9696898, 9969884, 10182125, 10324731, 10392596, 10383049, 10296319, 10137183, 9914176, 9637075, 9316382, 8964347, 8593981, 8216652, 7841753, 7477810, 7131567, 6805965, 6500651, 6213986, 5942766, 5680825, 5421111, 5160323, 4900592, 4647047, 4405202, 4179899, 3974048, 3787631, 3619202, 3468234, 3334821, 3217947, 3116303, 3030599, 2963012, 2914366, 2883674, 2870399, 2875294, 2899141, 2942508, 3006874, 3094285, 3205704, 3340797, 3498579, 3676027, 3865677, 4055667, 4231876, 4379348, 4483770, 4535202, 4531393, 4476609, 4377998, 4244447, 4087081, 3917088, 3742238, 3567000, 3395499, 3232086, 3079302, 2937680, 2807544, 2689021, 2580527, 2479446, 2384355, 2294880, 2209838, 2127724, 2048697, 1973982]
58721A973982p0249o6074o0362n2023m2670l3713k4249j3891m728J689O415R888
58709A624015R717M311m165j2995k2065l1087l6912l7140l3893l0704k7922k4316
58697A376844k0775j8895j7920j6360j4900j4596j4078j1520p575l441J921R654
58685A248359J8137K5382L2357M0877N0050N7922O4722P1311P6339P8139P7792
58674A841387P7160P5627P1978O7667O4761O2106N6619M6843L2265J1106j7491
58663B390028n0066q0656j04993j20802j26366j22237j12651j01894r0535p7800
58653A402028o5339n5312m6833l8015k9749k3862j9303j3910q409m872k742j76
58641A093506K125K280J173J152J849J131p17j423n28P10K276M872P451Q719J0071
$$ y = [1973982, 1903733, 1837659, 1777297, 1725274, 1682604, 1648891, 1624642, 1610751, 1606023, 1607712, 1614127, 1624015, 1633732, 1638043, 1633878, 1620883, 1598818, 1567731, 1530819, 1493679, 1459786, 1429082, 1401160, 1376844, 1356069, 1337174, 1319254, 1302894, 1287994, 1273398, 1259320, 1247800, 1240225, 1236784, 1238705, 1248359, 1266496, 1291878, 1324235, 1365112, 1415162, 1473084, 1537806, 1609117, 1685456, 1763595, 1841387, 1918547, 1994174, 2066152, 2133819, 2198580, 2260686, 2317305, 2364148, 2396413, 2407519, 2390028, 2339962, 2259306, 2154313, 2033511, 1907145, 1784908, 1672257, 1570363, 1479828, 1402028, 1336689, 1281377, 1234544, 1196529, 1166780, 1142918, 1123615, 1109705, 1101296, 1096424, 1093682, 1093506, 1095631, 1097911, 1099084, 1100236, 1102085, 1103216, 1102499, 1101076, 1100548, 1101258, 1103534, 1108406, 1115857, 1124576, 1134647]
58626A134647J3651J8477K1903K3941K6715L0661L4661L8982M4619N0703N5838
58615A494798O1047O8154P6389Q3858R1127R9903J09475J17941J25515J33013
58605B461220J38372J38525J33463J24741J11419R1618O6961M1321J6119r066
58595C314693l2432n0840o3966p3283p7762p5035o6221n5148m3056k8314j1060
58584B737576O243K2801L9921N7507P4215R1177J11667J36745J64603J93908K23978
58573C860341K51403K70046K74558K61191K26135J67259Q7909l728r8526j87066
58563E109522k58656l04997l25516l25942l12129k88262k59300k30233k02793
58554B601694j76702j53754j36884j25688j16784j08265j00204r1717q1632p1470
$$ y = [1134647, 1148298, 1166775, 1188678, 1212619, 1239334, 1269995, 1304656, 1343638, 1388257, 1438960, 1494798, 1555845, 1623999, 1700388, 1784246, 1875373, 1975276, 2084751, 2202692, 2328207, 2461220, 2599592, 2738117, 2871580, 2996321, 3107740, 3199358, 3266319, 3307640, 3323759, 3314693, 3282261, 3231421, 3167455, 3094172, 3016410, 2941375, 2875154, 2820006, 2776950, 2748636, 2737576, 2743819, 2766620, 2806541, 2864048, 2938263, 3029440, 3141107, 3277852, 3442455, 3636363, 3860341, 4111744, 4381790, 4656348, 4917539, 5143674, 5310933, 5398842, 5395114, 5296588, 5109522, 4850866, 4545869, 4220353, 3894411, 3582282, 3294020, 3034720, 2804487, 2601694, 2424992, 2271238, 2134354, 2008666, 1891882, 1783617, 1683413, 1591696, 1510064, 1438594]
58544A438594o3662n7395n0184m2676l7585l4697l1460k7784k5621k4381k1600
58533A021549j7745j5546j4800j2664q953o269m928k598R58L623N479Q806J3398
58520I70310J6681J8686K2128K7310L1798L5349M0208M6128N0146N1926N4324
58509A364994N8024O0534O1535O4342P0936P9934R0512J03844J19625J35208J49040
58498B358528J60924J68440J67377J56456J37823J12923Q2276M9033J7576j2102
58488C399254m3796p8285j11613j40362j63716j79956j86320j83438j75338j64224
58478A972206j49600j32683j16734j02510q8302p4739o4483n6906m8554l9335
58468A098360l2650k8963k5129k0850j9628k2019k3966k3362k2488k2442k0926
$$ y = [1438594, 1374932, 1317537, 1267353, 1224677, 1187092, 1152395, 1120935, 1093151, 1067530, 1043149, 1021549, 1003804, 988258, 973458, 960794, 951841, 945572, 940644, 938046, 939004, 942627, 948106, 956912, 970310, 986991, 1005677, 1027805, 1055115, 1086913, 1122262, 1162470, 1208598, 1258744, 1310670, 1364994, 1423018, 1483552, 1545087, 1609429, 1680365, 1760299, 1850811, 1954655, 2074280, 2209488, 2358528, 2519452, 2687892, 2855269, 3011725, 3149548, 3262471, 3344747, 3393780, 3411356, 3399254, 3355458, 3277173, 3165560, 3025198, 2861482, 2681526, 2495206, 2311768, 2136430, 1972206, 1822606, 1689923, 1573189, 1470679, 1382377, 1307638, 1243155, 1186249, 1137695, 1098360, 1065710, 1036747, 1011618, 990768, 971140, 949121, 925155, 901793, 879305, 856863, 835937]
58457H35937j7438j5002j4661j3613j0706q608q611q409o839n788n719m415j756
58444G14372o79j744j938l51K21j201k066j559k057l789l707j372k50j420j635
58429F90825M91K147K015K502M388N061M057M454O741P289N072L851N371O564
58415G50828N829N895P775Q096N337K852K788K749J189L87J299J238o69j457k24
58400G93912k03k463l642k401j877l210l116n80O92o44p88J902L650K549K223
58385G86004M751O700N979N866Q462J0581R947R059R224P431K900M7J049K097
58371H70097P63K36K390L811K759K952O177Q338P214O837R533J1086Q697O467
58357I47357P765R341Q129O921P991Q214N722M383O367P487N224L998O909R702
$$ y = [835937, 818499, 803497, 788836, 775223, 764517, 755909, 747298, 738889, 732050, 726262, 720543, 716128, 714372, 713693, 711949, 710011, 709660, 709881, 708680, 706614, 705055, 702998, 699209, 695502, 694130, 693880, 692460, 690825, 691316, 693463, 695478, 697980, 702368, 707429, 711486, 715940, 722681, 729970, 735042, 738893, 744264, 750828, 756657, 762552, 770327, 778423, 783760, 786612, 789400, 792149, 793338, 793725, 795024, 796262, 795593, 794136, 793912, 793709, 791246, 787604, 785203, 783326, 780116, 777000, 776420, 777112, 776468, 775680, 777582, 781232, 783781, 786004, 790755, 797455, 803434, 809300, 817762, 828343, 838290, 847349, 856573, 864004, 866904, 866951, 868000, 870097, 870860, 871096, 873486, 877297, 880056, 883008, 889185, 897523, 904737, 911574, 921107, 932193, 940890, 947357, 955122, 964463, 972592, 979513, 987504, 995718, 1001440, 1005823, 1012190, 1019677, 1024901, 1028899, 1035808, 1045510]
58343A045510Q791P903J0586J3483J3272J3168J6190J8963J8568J8568K1992K5256
58331A232250K5215K5180K7840K9449K7239K5159K5960K5240J9839J4270J2309
58320A489950J0193N037J687L908P017O715O986J1599J6147J6578J7249K2173
58308A615239K6624K6032K5050K8935L3941L5140L5821M0199M4838M6260M9022
58297B007101N7266O6362P1998P9166R2946J09091J23131J39838J63892J90205
58287C100996K13451K37802K66661K92074L04994L06565K98521K72822K23186
58278E517072J57535Q7045J2709o5023j33827j80946k08300k23419k24849k10059
58268D527938j87770j67793j47258j20642r4010p5193n9589m0208k1996j1473
$$ y = [1045510, 1054301, 1062204, 1072790, 1086273, 1099545, 1112713, 1128903, 1147866, 1166434, 1185002, 1206994, 1232250, 1257465, 1282645, 1310485, 1339934, 1367173, 1392332, 1418292, 1443532, 1463371, 1477641, 1489950, 1500143, 1505180, 1506867, 1510775, 1517792, 1524507, 1531493, 1543092, 1559239, 1575817, 1593066, 1615239, 1641863, 1667895, 1692945, 1721880, 1755821, 1790961, 1826782, 1866981, 1911819, 1958079, 2007101, 2064367, 2130729, 2202727, 2281893, 2374839, 2483930, 2607061, 2746899, 2910791, 3100996, 3314447, 3552249, 3818910, 4110984, 4415978, 4722543, 5021064, 5293886, 5517072, 5674607, 5761652, 5774361, 5709338, 5575511, 5394565, 5186265, 4962846, 4737997, 4527938, 4340168, 4172375, 4025117, 3904475, 3810465, 3735272, 3675683, 3635475, 3613479, 3602006]
58258C602006k499J2386K6915L3005L6902M7228N8128O1085O2212P0320P9315
58247D087003Q0645Q1425R1304J03240J06890J08934J19762J32449J36254J38339
58237E186245J49957J63948J68838J72176J85976K02609K10051K17019K36726
58228F893545K60094K72614K83154L07126L36241L55353L73753M07589M47311
58219I936780M76327N05518N53607O10552O58096P08591P83298Q71445R53741
58210A6057955J046163J174307J326230J481150J661769J903915K199966K532894
58202B9384349K939481L473832M138577M924853N882556P063657Q437746R971323
58194G6216374J1758053J3970199J6753362K0302833K4884530L0416833L5977841
$$ y = [3602006, 3599507, 3611893, 3638808, 3671813, 3708715, 3755943, 3814071, 3875156, 3937368, 4007688, 4087003, 4167648, 4249073, 4340377, 4443617, 4550507, 4659441, 4779203, 4911652, 5047906, 5186245, 5336202, 5500150, 5668988, 5841164, 6027140, 6229749, 6439800, 6656819, 6893545, 7153639, 7426253, 7709407, 8016533, 8352774, 8708127, 9081880, 9489469, 9936780, 10413107, 10918625, 11472232, 12082784, 12740880, 13449471, 14232769, 15104214, 16057955, 17104118, 18278425, 19604655, 21085805, 22747574, 24651489, 26851455, 29384349, 32323830, 35797662, 39936239, 44861092, 50743648, 57807305, 66245051, 76216374, 87974427, 101944626, 118697988, 139000821, 163885351, 194302184, 230280025]
58187B30280025M0046613M1354335L9222655L3052599K2191442P051023r782408
58180D03416284k4339086l3632244l7210182l6523053l3303243k8769606k3815450
58173A85823420j9184746j5292782j2205066r957277q729036q591779r214938
58166A02647796r962649j0278914r964003r154524q118768p064436o077781n180635
58158C6846086m393448l729848l171448k690297k283267j955785j689113j455740
58150A5477140j253311j092510r64391q50200p51509o79931o27079n74247n22915
58141H161047m86716m61085m28939l89977l57425l31280l00428k66536k41208
58132D897453k23231k01538j77053j59953j49097j35113j20104j14007j15001
$$ y = [230280025, 270326638, 311680973, 350903628, 383956227, 406147669, 413198692, 403416284, 379077198, 345444954, 308234772, 271711719, 238408476, 209638870, 185823420, 166638674, 151345892, 139140826, 129183549, 120454513, 111862734, 102647796, 92685147, 82406233, 72442230, 63287706, 55168938, 48104502, 42026721, 36846086, 32452638, 28722790, 25551342, 22861045, 20577778, 18621993, 16932880, 15477140, 14223829, 13131319, 12166928, 11316728, 10565219, 9885288, 9258209, 8683962, 8161047, 7674331, 7213246, 6784307, 6394330, 6036905, 5705625, 5405197, 5138661, 4897453, 4674222, 4472684, 4295631, 4135678, 3986581, 3851468, 3731364, 3617357, 3502356]
58123C502356j12899j08308j09267j12628j07783r5759q6398p9629o7278n0498
58113B571909l7771k8093j3130O323K2444L6349N5641P8155R3898J00960J03932
58102B990617R8849P5992L6795o774m8585q9820j26084j48348j56674j59258j58230
58091B308480j49370j34787j22244j12313r9206q3874p3509o8355o1681n2703
58081A350438m7268m5708m2119l5971l2770l2919l1077k6844k5150k5989k4389
58070I80234k0550j9382k0278j7896j2952j1461j3371j2607q521o702q126p996
58058H20392n767o020q782r160p199p998j1368j1530p929o213p375o136j612M85
58044G23788j657k897q56M34r49j346Q18K144J526K540O143Q412P826P697R392
$$ y = [3502356, 3389457, 3281149, 3171882, 3059254, 2951471, 2855712, 2769314, 2689685, 2622407, 2571909, 2534138, 2506045, 2492915, 2499238, 2521682, 2558031, 2613672, 2691827, 2785725, 2886685, 2990617, 3089466, 3165458, 3202253, 3195479, 3146894, 3057074, 2930990, 2782642, 2625968, 2466710, 2308480, 2159110, 2024323, 1902079, 1789766, 1690560, 1606686, 1533177, 1464822, 1403141, 1350438, 1303170, 1257462, 1215343, 1179372, 1146602, 1113683, 1082606, 1055762, 1030612, 1004623, 980234, 959684, 940302, 920024, 902128, 889176, 877715, 864344, 851737, 843216, 836514, 828388, 820392, 814625, 808605, 799823, 790663, 783464, 775466, 764098, 752568, 744639, 738426, 731051, 724915, 723303, 723788, 722131, 719234, 718378, 718812, 717863, 716517, 717335, 719479, 721005, 723545, 729688, 738100, 745926, 753623, 763015]
58029G63015J0111R181R702J2281J3938J4641J8010K4197K9022L1738L6542M4872
58017A017250N3178O0093O8834Q0568R2088J01945J12328J22872J28984J28260
58007A966400J22519J12051R4383P0634M6680K5860O438j2115k6660l6295m4532
57996B325363n3344o0676o5739p0795p5618p6008p0261o1671n2478m0764k5597
57985A672412r905M184J7774L0752L9690M2320L9571L1492J6164n368k7889m7541
57973A803656o4177p6891q2624q1175p6572p1317o3870n3572m3214l4529k5862
57962A129853j6389q191k176L496R071J1803J0889R258Q530O695K819n56j953
57949A163149l381n972p416o095l597r54L620J0888J8437K4554L0416L6409L9992
$$ y = [763015, 773126, 782307, 792009, 804290, 818228, 832869, 850879, 875076, 904098, 935836, 972378, 1017250, 1070428, 1130521, 1199355, 1279923, 1372011, 1473956, 1586284, 1709156, 1838140, 1966400, 2088919, 2200970, 2295353, 2365987, 2412667, 2438527, 2444965, 2432850, 2406190, 2369895, 2325363, 2272019, 2211343, 2145604, 2074809, 1999191, 1923183, 1852922, 1791251, 1738773, 1698009, 1672412, 1662507, 1666691, 1684465, 1715217, 1754907, 1797227, 1836798, 1868290, 1884454, 1879086, 1851197, 1803656, 1739479, 1662588, 1579964, 1498789, 1422217, 1350900, 1287030, 1233458, 1190244, 1155715, 1129853, 1113464, 1105273, 1103097, 1106593, 1115664, 1127467, 1138356, 1147614, 1156144, 1162839, 1165658, 1165102, 1163149, 1159768, 1153796, 1146380, 1140285, 1136688, 1135734, 1139354, 1150242, 1168679, 1193233, 1223649, 1260058, 1300050]
57936A300050L9368L5466K8490J6541j52j7578l2708m6141n8012o5505o7016o5006
57924A067797o2068n7536n0590m3161l7148l1740k6097k1568j8926j6324j2431
57913F90208q883p336o765n818n270o071p418q636j0613j3666j6311j7493j7728
57900E58200j6998j4238r934o392m403k531m70L28J70J562M900P496Q261R570
57886E35521J2825J5984J7399J8404K0088K1032K0316J9375J8896J7141J3378
57875G30359R551O626K766k713p202r012j0286j3212j6517j8293j9197k0247k0337
57862F12286j8649j6781j5979j4773j1780q281n783l534o64J842L395N423Q586
57849E35308J1079J1719J2003J3022J3227J1376Q853O884M430J057j319j940l253
$$ y = [1300050, 1339418, 1374884, 1403374, 1419915, 1419763, 1402185, 1369477, 1323336, 1265324, 1199819, 1132803, 1067797, 1005729, 948193, 897603, 854442, 817294, 785554, 759457, 737889, 718963, 702639, 690208, 681325, 673989, 667224, 661406, 656136, 650065, 642647, 634011, 623398, 609732, 593421, 575928, 558200, 541202, 526964, 517030, 510638, 506235, 503704, 503234, 503562, 503732, 505294, 510194, 517690, 525951, 535521, 548346, 564330, 581729, 600133, 620221, 641253, 661569, 680944, 699840, 716981, 730359, 739910, 746536, 749302, 746589, 739387, 730375, 720089, 706877, 690360, 672067, 652870, 632623, 612286, 593637, 576856, 560877, 546104, 534324, 526043, 520260, 516726, 516062, 517904, 521299, 526722, 535308, 546387, 558106, 570109, 583131, 596358, 607734, 616587, 623471, 627901, 628958, 627639, 625699, 622446]
57836F22446o743r869j0060q764q414q324o924n421n591o188n022k736j271l51
57822E36768J415L608N197P021J0247J4005J7273K1392K7775L4936M0613M5338
57810G65588N0995N7355O2939O7859P2865P6723P7263P4024O7558N7396M3087
57799A473652K5955P644j1523l0572m6168n5669o0403o3382o5239o5010o3207
57788A046078o1164n8548n4442m9751m5941m2477l8149l3749l0730k8292k4652
57777E78183k0264j7122j5577j4383j3148j2332j1508r954q229p151o145m572
57765D37798l397l351k921o18K136L114K963L919N992P462Q268R750J1662J2551
57751D95328J2658J3522J4802J4408J1747Q277M926J491j441k544k032j580j748
$$ y = [622446, 615703, 605834, 595774, 587010, 578596, 570272, 563348, 557927, 552336, 546148, 541126, 538390, 537119, 536768, 538183, 541791, 546988, 554009, 564256, 578261, 595534, 616926, 644701, 679637, 720250, 765588, 816583, 873938, 936877, 1004736, 1077601, 1154324, 1231587, 1305611, 1373169, 1430565, 1473652, 1499607, 1507251, 1495728, 1465156, 1418988, 1363319, 1302916, 1239534, 1174295, 1109285, 1046078, 984914, 926366, 871924, 822173, 776232, 733755, 695606, 661857, 631127, 602835, 578183, 557919, 540797, 525220, 510837, 497689, 485357, 473849, 463895, 455666, 448515, 442370, 437798, 434401, 431050, 428129, 427511, 429647, 432761, 435724, 439643, 445635, 453097, 461365, 471115, 482777, 495328, 507986, 521508, 536310, 550718, 562465, 570742, 575668, 577159, 575718, 573174, 571142, 569562, 567814]
57738E67814j478k85J033J971K773L356L384L369M051M986N367N805P410R586
57724F19142J0757J0980J1729J3259J4234J4046J3610J3677J3996J4366J5056
57713G64852J6093J7365J9304K2305K5766K8958L2361L6898M2328M7865N3677
57702A107772O0401O7744P5120Q2973R1927J01278J09840J17565J24600J29544
57692B068764J30412J26654J18541J05325Q6113O1941L5219P684j9313m3360o2019
57681B615961p4808q2366q4391q0547p2391o1936m8827l1394r744J4858M2894
57670B127309P5287J08928J36644J52242J52616J34630R4232L1980m2069j11614
57660B860185j62748j89873j95547j86530j69402j48301j25649j03723q4275o7218
$$ y = [567814, 566336, 566051, 567084, 569055, 571828, 575184, 578568, 581937, 585988, 590974, 596341, 602146, 609556, 619142, 629899, 640879, 652608, 665867, 680101, 694147, 707757, 721434, 735430, 749796, 764852, 780945, 798310, 817614, 839919, 865685, 894643, 927004, 963902, 1006230, 1054095, 1107772, 1168173, 1235917, 1311037, 1394010, 1485937, 1587215, 1697055, 1814620, 1939220, 2068764, 2199176, 2325830, 2444371, 2549696, 2635809, 2697750, 2732969, 2740653, 2721340, 2677980, 2615961, 2541153, 2458787, 2374396, 2293849, 2221458, 2159522, 2110695, 2079301, 2069557, 2084415, 2127309, 2202596, 2311524, 2448168, 2600410, 2753026, 2887656, 2981888, 3013868, 2971799, 2860185, 2697437, 2507564, 2312017, 2125487, 1956085, 1807784, 1682135, 1578412, 1494137, 1426919]
57650A426919n1351l6473k3495j2616k872O379J5031K3352L2084M1212M9983N8354
57638A526507O7101P6371Q5370R3589J01019J07041J10374J10205J06126R7121
57628B480824Q2134O1791L8200J2947j3321l9333o2846q2205r6974j06936j11904
57617B162377j12817j11496j08835j04411r8087r0769q3279p5726o8359o1862
57607A246736n6412n1421m6502m1789l7264l2777k8727k5729k3602k1649j9768
57596H61096j8172j6396j3886j1353j0048r830r418q381p371o465n045l362k451
57583G38918k330j964j158p56o66L57K465M078M194L678L540L564L502M041N423
57568G66886O458O091M874L972L659L779M733O885R606J1836J3225J4164J5190
$$ y = [1426919, 1375568, 1339095, 1315600, 1302984, 1300112, 1306491, 1321522, 1344874, 1376958, 1418170, 1468153, 1526507, 1593608, 1669979, 1755349, 1848938, 1949957, 2056998, 2167372, 2277577, 2383703, 2480824, 2562958, 2624749, 2662949, 2675896, 2662575, 2623242, 2560396, 2478191, 2381217, 2274281, 2162377, 2049560, 1938064, 1829229, 1724818, 1626731, 1535962, 1452683, 1376957, 1308598, 1246736, 1190324, 1138903, 1092401, 1050612, 1013348, 980571, 951844, 926115, 902513, 880864, 861096, 842924, 826528, 812642, 801289, 791241, 781411, 771993, 763612, 756241, 749776, 744731, 741369, 738918, 736588, 734624, 733466, 732710, 732044, 732401, 734866, 738944, 743138, 746816, 750356, 753920, 757422, 761463, 766886, 773344, 779435, 784309, 788281, 791940, 795719, 800452, 807337, 816943, 828779, 842004, 856168, 871358]
57555H71358J6837J9448K2744K6100K9390L3027L7061M1091M5171M9790N4931
57544A246948O0074O5325P1316P7796Q3496Q7711R0752R2316R0787Q4849P4793
57533B126163O1475M5069K5710M550j6660l6477n3721o7218p6359q1449q3165
57522A847918q2124p9179p5277p0666o4976n8404n1989m6421m1366l6383l1621
57511A209512k7238k2964j8773j5189j2480j0220q055o085m137j610J437L864
57499A088062M835M916N279O441Q323J0877J3971J7180K0255K3508K7315L1700
57487A262662L6575M1888M7305N2376N7272O2699O8810P4848Q0098Q4381Q7334
57476A956248Q7899Q5036P8396O8020N3988L6730J7130l858k5095m4793o0976
$$ y = [871358, 888195, 907643, 930387, 956487, 985877, 1018904, 1055965, 1097056, 1142227, 1192017, 1246948, 1307022, 1372347, 1443663, 1521459, 1604955, 1692666, 1783418, 1875734, 1966521, 2051370, 2126163, 2187638, 2232707, 2258417, 2262967, 2246307, 2209830, 2156109, 2088891, 2012532, 1931083, 1847918, 1765794, 1686615, 1611338, 1540672, 1475696, 1417292, 1365303, 1318882, 1277516, 1241133, 1209512, 1182274, 1159310, 1140537, 1125348, 1112868, 1102648, 1094593, 1088508, 1084371, 1082761, 1084198, 1088062, 1092897, 1097813, 1103092, 1109533, 1117856, 1128733, 1142704, 1159884, 1180139, 1203647, 1230962, 1262662, 1299237, 1341125, 1388430, 1440806, 1498078, 1560777, 1629587, 1704435, 1784533, 1868914, 1956248, 2044147, 2129183, 2207579, 2275599, 2329587, 2366317, 2383447, 2379589, 2354494, 2309701, 2248725]
57465B248725p2844q0945q5885q7705q6662q3615p9277p3831o7699o1764n6372
57454A412126n0986m5233l9598l4655l0385k6597k3263k0130j6788j3574j1402
57443A099515j0359r414p964o627n892n102l593j896q75m38M4P17J436K313L264
57428A055129L635L092K292J958J944J951K459L901N531O197N836N273M946M760
57414A108904M967N930P234P965P958P914Q251Q605Q630Q552Q713R116R624J0165
57400A222528J0664J1023J1270J1429J1309J0842J0502J0957J2147J3128J3031
57389A348830J1995J0985J0749J1129J1434J1369J1283J1510J1837J1955J2078
57378A475154J2586J3251J3475J3185J2826J2524J2048J1561J1607J2144J2496
$$ y = [2248725, 2175881, 2094936, 2009051, 1921346, 1834684, 1751069, 1671792, 1597961, 1530262, 1468498, 1412126, 1361140, 1315907, 1276309, 1241654, 1211269, 1184672, 1161409, 1141279, 1124491, 1110917, 1099515, 1089156, 1079742, 1071778, 1065151, 1059259, 1054157, 1050564, 1048668, 1047793, 1047355, 1047399, 1048116, 1049552, 1051865, 1055129, 1058764, 1061856, 1064148, 1066106, 1068050, 1070001, 1072460, 1076361, 1081892, 1088089, 1093925, 1099198, 1104144, 1108904, 1113871, 1119801, 1127035, 1135000, 1142958, 1150872, 1159123, 1167728, 1176358, 1184910, 1193623, 1202739, 1212363, 1222528, 1233192, 1244215, 1255485, 1266914, 1278223, 1289065, 1299567, 1310524, 1322671, 1335799, 1348830, 1360825, 1371810, 1382559, 1393688, 1405122, 1416491, 1427774, 1439284, 1451121, 1463076, 1475154, 1487740, 1500991, 1514466, 1527651, 1540477, 1553001, 1565049, 1576610, 1588217, 1600361, 1612857]
57367A612857J2526J2976J4213J5490J6032J6212J6928J8343J9888K1113K1987
57356A798565K2634K3226K3823K4005K3182K1572K0289J9985K0015J9555J8933
57345B035784J9046J9916K0656K0687K0289K0052K0409K1590K3467K5429K6850
57334B274175K7650K8095K8275K8219K8244K8718K9559L0410L1175L2014L2902
57323B599436L3605L4082L4611L5469L6636L7795L8547L8873L9318M0354M1592
57312C010318M2189M2091M2114M2655M3031M2684M2168M2165M2094M0637L7362
57301C469508L2992K8292K3552J9121J5596J3221J1644J0497R852J0019J1143
57290C655437J3070J5409J7760J9977K2120K4054K5442K6313K7204K8400K9484
$$ y = [1612857, 1625383, 1638359, 1652572, 1668062, 1684094, 1700306, 1717234, 1735577, 1755465, 1776578, 1798565, 1821199, 1844425, 1868248, 1892253, 1915435, 1937007, 1957296, 1977281, 1997296, 2016851, 2035784, 2054830, 2074746, 2095402, 2116089, 2136378, 2156430, 2176839, 2198429, 2221896, 2247325, 2274175, 2301825, 2329920, 2358195, 2386414, 2414658, 2443376, 2472935, 2503345, 2534520, 2566534, 2599436, 2633041, 2667123, 2701734, 2737203, 2773839, 2811634, 2850181, 2889054, 2928372, 2968726, 3010318, 3052507, 3094598, 3136712, 3179367, 3222398, 3265082, 3307250, 3349415, 3391509, 3432146, 3469508, 3502500, 3530792, 3554344, 3573465, 3589061, 3602282, 3613926, 3624423, 3634275, 3644294, 3655437, 3668507, 3683916, 3701676, 3721653, 3743773, 3767827, 3793269, 3819582, 3846786, 3875186, 3904670]
57279C904670L0024L0308L0873L1741L2654L3709L5059L6302L6916L7166L7828
57268D277250L9067M0280M1080M1658M2163M2423M2554M3144M4429M5805M6535
57257D746388M6647M6699M6932M7055M6800M6376M6225M6397M6332M5435M3818
57246E255104M2250M1224M0453L9471L8364L7529L6998L6508L6099L6019L6162
57235E676181L6166L6163L6832L8484M0556M2259M3403M4350M5418M6605M7726
57224F134143M8570M8998M8971M8429M7208M5241M2814M0377L8038L5562L2927
57213F611278L0541K8714K7189K5500K3635K1957K0608J9343J8120J7420J7711
57202F862016J8772J9929K0985K2401K4503K6948K9274L1524L3698L4975L4385
$$ y = [3904670, 3934694, 3965002, 3995875, 4027616, 4060270, 4093979, 4129038, 4165340, 4202256, 4239422, 4277250, 4316317, 4356597, 4397677, 4439335, 4481498, 4523921, 4566475, 4609619, 4654048, 4699853, 4746388, 4793035, 4839734, 4886666, 4933721, 4980521, 5026897, 5073122, 5119519, 5165851, 5211286, 5255104, 5297354, 5338578, 5379031, 5418502, 5456866, 5494395, 5531393, 5567901, 5604000, 5640019, 5676181, 5712347, 5748510, 5785342, 5823826, 5864382, 5906641, 5950044, 5994394, 6039812, 6086417, 6134143, 6182713, 6231711, 6280682, 6329111, 6376319, 6421560, 6464374, 6504751, 6542789, 6578351, 6611278, 6641819, 6670533, 6697722, 6723222, 6746857, 6768814, 6789422, 6808765, 6826885, 6844305, 6862016, 6880788, 6900717, 6921702, 6944103, 6968606, 6995554, 7024828, 7056352, 7090050, 7125025, 7159410]
57191G159410L2278L0264K9356K8896K7721K5778K3923K2636K1621K0468J9033
57180G441384J7291J5303J3261J1204Q779N711K319q76l830o773r583j1986j4246
57167G467958j6981k0198k3130k5195k6578k7674k8476k8763k8558k8033k7191
57156G187181k5881k4028k1804j9455j6901j3538q719k582L919R909J5040J8865
57144G102006K0451J9283J5954J1300N423j570q470j3860j7855k1740k5930k9423
57132G055569l1292l1367k9350k4565j7117q210J094J0464J9334K6552L1527L4726
57120G037365L6633L7327L7606L9377M4224N2588O4787Q1618J03265J28807J57522
57109G821119J89578K25027K63700L07011L58430M21489M98912N94417P13448
$$ y = [7159410, 7191688, 7221952, 7251308, 7280204, 7307925, 7333703, 7357626, 7380262, 7401883, 7422351, 7441384, 7458675, 7473978, 7487239, 7498443, 7507222, 7512933, 7515252, 7514376, 7510546, 7503773, 7494190, 7482204, 7467958, 7450977, 7430779, 7407649, 7382454, 7355876, 7328202, 7299726, 7270963, 7242405, 7214372, 7187181, 7161300, 7137272, 7115468, 7096013, 7079112, 7065574, 7056855, 7054273, 7058192, 7068101, 7083141, 7102006, 7122457, 7141740, 7157694, 7168994, 7174417, 7172847, 7164377, 7150517, 7132662, 7110922, 7084992, 7055569, 7024277, 6992910, 6963560, 6938995, 6921878, 6913668, 6914762, 6925226, 6944560, 6971112, 7002639, 7037365, 7073998, 7111325, 7148931, 7188308, 7232532, 7285120, 7349907, 7431525, 7534790, 7663597, 7821119, 8010697, 8235724, 8499424, 8806435, 9164865, 9586354, 10085266, 10679683, 11393131]
57100A1393131Q61182J042075J262636J532001J857684K242322K685163L182971
57092B6059165L727456M306140M909107N530320O157375O763112P310518P757436
57084G2520629Q047137Q103652P858312P288440O418466N279253L883767K257818
57076A21657474M85181j296992k951282m384273n549980o434382p047275p417162
57068H7061309p578522p559799p383283p071223o648024o139956n576683m990633
57060C4113186m410833l857642l344261k880213k470708k115038j808983j548245
57052A1677263j328178j142350r84226q49575p35613o38960n56201m85464m25750
57043D530946l75389l32479k95906k64755k37515k13036j91376j72708j56315
$$ y = [11393131, 12254313, 13296388, 14559024, 16091025, 17948709, 20191031, 22876194, 26059165, 29786621, 34092761, 39001868, 44532188, 50689563, 57452675, 64763193, 72520629, 80567766, 88671418, 96529730, 103818170, 110236636, 115515889, 119399656, 121657474, 122142655, 120845663, 117894381, 113510108, 107960128, 101525746, 94478471, 87061309, 79482787, 71922988, 64539705, 57468482, 50820458, 44680502, 39103819, 34113186, 29702353, 25844711, 22500450, 19620237, 17149529, 15034491, 13225508, 11677263, 10349085, 9206735, 8222509, 7372934, 6637321, 5998361, 5442160, 4956696, 4530946, 4155557, 3823078, 3527172, 3262417, 3024902, 2811866, 2620490, 2447782, 2291467]
57034B291467j41528j28537j17430j07467r8125q9683q2028p4208o5814n7425
57024A329222m8973l9318k8165j6608m934Q202K3796M2062O4598R3379J25392
57013A548653J51508J63682J60332J41397J01930L7468m4140j22129j76723k01550
57003A760428k02453j88656j67527j44352j22548j03192q5794o9812n5352m3043
56993E77699l3655k7139k1955j6208r645l639R32M644Q270J1613J4029J5054J4049
56980E34049J0120L096n861j4929k2487k7357k8916k7501k4312k0716j7653j5360
56968C42173j3287j0532o865l043K53L292O628J0256J4154J8896K4623K9938L2840
56955D49326L2266K7843J8915N619r372k1864k9275l1814l0824k7353k2449j7225
$$ y = [2291467, 2149939, 2021402, 1903972, 1796505, 1698380, 1608697, 1526669, 1452461, 1386647, 1329222, 1280249, 1240931, 1212766, 1196158, 1191224, 1199426, 1223222, 1265284, 1329882, 1423261, 1548653, 1700161, 1863843, 2024175, 2165572, 2267502, 2304970, 2260830, 2138701, 1961978, 1760428, 1557975, 1369319, 1201792, 1057440, 934892, 831700, 745906, 676094, 620742, 577699, 544044, 516905, 494950, 478742, 469097, 465458, 466390, 471034, 479304, 490917, 504946, 520000, 534049, 544169, 547265, 541404, 526475, 503988, 476631, 447715, 420214, 395902, 375186, 357533, 342173, 328886, 318354, 311489, 308446, 308699, 311991, 318619, 328875, 343029, 361925, 386548, 416486, 449326, 481592, 509435, 528350, 533969, 524597, 502733, 473458, 441644, 410820, 383467, 361018, 343793]
56943C43793j2079o765j549K689N779Q668J2189J6303K0808K5849L1285L6382
56931D83352M0514M3275M3489L8904K7703J0254j0573l0456m5233n2761n3880
56920D94588n1334m7460m3060l8208l3181k8381k3994k0182j7185j4950j2978
56909A63675j0798q455o485n483n548o002n850m817l601k895k554k094j481r04
56895I6708j77J001K518M160O140Q771J1986J5572J9423K3080K5512K5833K3818
56882B64345J9379J2463M059l618q906j1902j3302j3030j1099q645o687m599j286
56869B17172K814O463R671J3340J7412K1244K5526L1719L9406M6020M9570M9881
56857E30238M6620L8080K3269M338j4188k8281l6259l8621l6952l2818k7244k0924
$$ y = [343793, 331714, 324949, 323400, 326089, 331868, 340536, 352725, 369028, 389836, 415685, 446970, 483352, 523866, 567141, 610630, 649534, 677237, 687491, 676918, 646462, 601229, 548468, 494588, 443254, 395794, 352734, 314526, 281345, 252964, 228970, 208788, 191603, 176653, 163675, 152877, 144422, 137937, 132454, 126906, 120904, 115054, 110237, 106636, 103741, 101187, 99093, 97612, 96708, 96531, 97532, 100050, 104210, 110350, 119121, 131107, 146679, 166102, 189182, 214694, 240527, 264345, 283724, 296187, 300246, 296628, 287722, 275820, 262518, 249488, 238389, 229744, 223057, 218458, 217172, 219986, 226449, 236120, 249460, 266872, 288116, 313642, 345361, 384767, 430787, 480357, 530238, 576858, 614938, 638207, 642545, 628357, 600076, 563817, 525196, 488244, 455426, 428182, 407258]
56845D07258j4454q064j536N121J1378J7129K3325L1034M0436N1306O3518P5864
56833G02315Q5208Q8003Q2262O7253M2793J0968k2163m9100o5764p2794p2595
56822G96386o7077n8161m8138l8495k9483k1207j4008p624j241N443J2239J9644
56810E48278K8507L8419M7676N4876N9082N8266M9559L1941P932j7736m0244n5817
56798H10739o2757o2341n7748n1493m4420l6922k9777k3414j7607j2326p844l793
56786D00297Q48O447J2299J7660K2299K5927K7944K7618K3782J4905R65j4920
56774E66071k8327l7047m1681m3189m1746l7967l3322k8764k4400k0617j8061
56763B10950j6293j4114j1480r453q165o591m682l695l907l894k832j738j598
$$ y = [407258, 392804, 384740, 383204, 388325, 399703, 416832, 440157, 471191, 511627, 562933, 626451, 702315, 787523, 875526, 957788, 1025041, 1067834, 1078802, 1056639, 1007539, 941775, 868981, 796386, 729309, 671148, 623010, 584515, 555032, 533825, 519817, 512193, 510952, 516395, 528634, 548278, 576785, 615204, 662880, 717756, 776838, 835104, 884663, 916604, 924536, 906800, 866556, 810739, 747982, 685641, 627893, 576400, 531980, 495058, 465281, 441867, 424260, 411934, 404090, 400297, 401145, 407592, 419891, 437551, 459850, 485777, 513721, 541339, 565121, 580026, 580991, 566071, 537744, 500697, 459016, 415827, 374081, 336114, 302792, 274028, 249628, 229011, 210950, 194657, 180543, 169063, 159610, 151445, 144854, 140172, 136477, 132570, 128676, 125844, 124106, 122508]
56750A22508j885j823j657j703j559j084q60r88o91K17P85N09J48K68L86K35N08
56733A13314J530K526K962L317L837L931L547L785N270P173Q684J0117J1766J3062
56719A94821J3811J4906J6836J8666J9561K0040K0665K0632J8818J5446J1649
56708C85851Q228N575L974L137K249J128N58R02J418J477J492J974K698L404M312
56693D28377N371N905N671N272N092M717L799K499Q01j505m004o014p847j0345
56679D37789j3065j4589j4790j4929j5234j4448j2326j0397r441q317o355m821
56667B99077m685m802l894k702k599l401l985l933l348k137n95M42J005K280M581
56652B71304O476O919O715O770O492N202L696K983K780K559K708L404L624K746
$$ y = [122508, 120623, 118800, 117143, 115440, 113881, 112797, 111937, 110949, 110258, 110475, 111260, 111769, 111917, 112185, 112571, 112806, 113314, 114844, 117370, 120332, 123649, 127486, 131417, 134964, 138749, 144019, 151192, 159876, 169993, 181759, 194821, 208632, 223538, 240374, 259040, 278601, 298641, 319306, 339938, 358756, 374202, 385851, 394079, 399654, 403628, 406765, 409014, 410142, 410700, 411602, 413020, 414497, 415989, 417963, 420661, 424065, 428377, 433748, 439653, 445324, 450596, 455688, 460405, 464204, 466703, 467504, 465999, 461995, 455981, 448134, 437789, 424724, 410135, 395345, 380416, 365182, 350734, 338408, 328011, 318570, 310253, 303898, 299077, 294392, 289590, 285696, 282994, 280395, 276994, 273009, 269076, 265728, 263591, 262996, 263438, 264443, 266723, 271304, 277780, 284699, 291414, 298184, 304676, 309878, 313574, 316557, 319337, 321896, 324604, 328008, 331632, 334378]
56638C34378J740J432Q90r57l282m623n148n998p176p641o925n433l659k020q25
56623B84753L48K384N068O915P263P192P602P829P155O189N592M821L418K216
56609C58745J937J842J055P7k32j35k19j98L74J154J683J995J821N88j124j698
56593C67665r31o22j770l065l241l010l192k966j625l28k47n50k0P35M46p24j946
56576C44609l261m746n547n218m791n021n070m323l875m471m711l150o71J111
56562B90865K271L561M439M238L835M150M255K978J110J5o80j972l309l674l724
56547C08358m743o434p685q493r292r553q916q548r383j0204r465p902p280p710
56533A92750q142q357q461p616n413l451l402m536n050m757m429l780k299r52
$$ y = [334378, 336118, 337550, 338440, 337483, 334201, 329578, 324430, 318432, 311256, 303615, 296690, 291257, 287598, 285578, 284753, 285101, 287485, 292553, 299468, 306731, 313923, 321525, 329354, 336509, 342698, 348290, 353111, 356529, 358745, 360682, 362524, 363579, 363656, 363424, 363289, 363070, 362872, 363246, 364400, 366083, 368078, 369899, 370487, 369363, 367665, 366734, 366112, 364342, 361277, 358036, 355026, 351834, 348868, 347243, 346915, 346668, 346118, 346098, 346833, 347279, 346555, 344609, 341348, 336602, 331055, 325837, 321046, 316025, 310955, 306632, 302757, 298286, 293575, 290425, 289754, 290865, 293136, 296697, 301136, 305374, 309209, 313359, 317614, 320592, 321702, 321717, 321037, 319065, 315756, 312082, 308358, 303615, 297181, 289496, 281003, 271711, 262158, 253242, 244694, 235311, 225107, 215642, 207740, 200460, 192750, 184608, 176251, 167790, 160174, 154761, 151310, 147908, 143372, 138322, 133565, 129136, 125356, 123057, 122105]
56519A22105r32j603j747j685k202k613k018j252j431j819j267m59m98o47K07
56504A02139J242J198Q27J305J724Q27k07M22J824J919J042J027J689J453O54
56489A19085J052K544L371L179L091L234K886K606L388M295L638K032J505K103
56475A58009K162J471J370J951K008J439J158R32j38j395j473r17j322k360k382
56460A60513j565j646k745l215k498j645j125n54l02j012j802j316n0N66P44J508
56444A43856K180J361k75r47q33j364k162j650j57N41L09L83O54J68k53R52K927
56427A45690L449K628K385K713J902K14k11Q17J200J84p70r34j122j428j134q56
56411A54727j907l500l602k409j979k479k100o63l8p08j098o18l70n41m8R70J109
$$ y = [122105, 121173, 119570, 117823, 116138, 113936, 111323, 109305, 108053, 106622, 104803, 103536, 103077, 102579, 101932, 102139, 103381, 104579, 105406, 106711, 108435, 109262, 109055, 109477, 111301, 113220, 114262, 115289, 116978, 118431, 119085, 120137, 122681, 126052, 129231, 132322, 135556, 138442, 141048, 144436, 148731, 152369, 154401, 155906, 158009, 160171, 161642, 163012, 164963, 166971, 168410, 169568, 170500, 170362, 168967, 167494, 166577, 165255, 162895, 160513, 158948, 157302, 154557, 151342, 148844, 147199, 146074, 145520, 145218, 144206, 142404, 141088, 141038, 141604, 142348, 143856, 146036, 147397, 147122, 146175, 145342, 143978, 141816, 140166, 140009, 140550, 140859, 141242, 141896, 142064, 141811, 142763, 145690, 149139, 151767, 154152, 156865, 158767, 158981, 158770, 159587, 160787, 160971, 160201, 159267, 158145, 156717, 155583, 154727, 152820, 149320, 145718, 143309, 141330, 138851, 136751, 136088, 136050, 135342, 134244, 133626, 133256, 132715, 132667, 133637, 134746]
56394A34746L82K18O94N60r9L5Q54J024O30Q12J174M89m95k4J308J460O22O56
56376A45046J420J224M41Q68J938J440k00m41P42R16j39o0J494K174J338J015
56360A59216J855K151J547J763K903K857J242J70M08M51m3L93J640J768P99Q16
56344A79936J809J416n61j454l57N59K31J84R81J172P06J416L172L531K117J389
56328A96247K075K038O15j12N11M88o20n20J397K527J549M38N77O65j1nJ075J496
56310B10430P93P24J712K021J338J372K080J389m90p41J083K167J460J091J716
56295B28145J210o96j274J99R78p1o42J64R5j424j616N25K208J981K076L566M069
56278B39493K572J807L229M303L270K183K670L059K251K156L779M973M465M098
$$ y = [134746, 135128, 135346, 136040, 136600, 136501, 136536, 137390, 138414, 139044, 139856, 141030, 141519, 141024, 141000, 142308, 143768, 144390, 145046, 146466, 147690, 148131, 148999, 150937, 152377, 152177, 151736, 152478, 153394, 153255, 153195, 154689, 156863, 158201, 159216, 161071, 163222, 164769, 166532, 169435, 172292, 173534, 173704, 174112, 174563, 174520, 174913, 176553, 178321, 179120, 179936, 181745, 183161, 182600, 181146, 180789, 181348, 181579, 181763, 182744, 183916, 184622, 186038, 189210, 192741, 194858, 196247, 198322, 200360, 200975, 200863, 201374, 201862, 201242, 200722, 202119, 204646, 206195, 206633, 207210, 207875, 207864, 207859, 208934, 210430, 211223, 211947, 213659, 215680, 217018, 218390, 220470, 221859, 221369, 220628, 221711, 223878, 225338, 226429, 228145, 229355, 228659, 227385, 227584, 228562, 228491, 227849, 228013, 228108, 226684, 225068, 225593, 227801, 229782, 231858, 235424, 239493, 242065, 243872, 247101, 251404, 254674, 256857, 259527, 262586, 264837, 266993, 270772, 275745, 280210, 284308]
56264B84308M912N225M522M912O737P354O189O207Q305R338P823O540P074P072
56250C76518N444M880O512P408O244N940P736Q209N580L330M004M777L050J160
56236D50792J433J675k74k210j988j607k912l717k138k84O9Q59L017L262l20m256
56220D41401n287n276o460o758m251j661j730k481j495n47j592k415q24J029P95
56205D02448L40J745L139K603K022L030L482J939J127K945M716M389M532O972
56191D45429Q627P217N969P786R821Q797O895P311Q700Q990R903J2810J4866J4166
56177E77287J3908J6588J9126J8715J8176K0388K2786K2779K3223K6805L0400
56166H10181L0856L1180L5121M0842M5773N2391O3029P4395Q3633R4547J11437
$$ y = [284308, 289220, 294445, 298967, 303879, 310616, 317970, 324159, 330366, 338671, 348009, 355832, 362372, 369446, 376518, 381962, 386842, 393354, 400762, 407006, 412946, 420682, 428891, 434471, 437801, 441805, 446582, 449632, 450792, 452225, 453900, 453626, 451416, 449428, 447821, 444909, 441192, 439054, 438770, 438839, 439698, 442715, 445977, 445657, 441401, 436114, 430838, 424378, 417620, 413369, 411708, 409978, 407497, 406002, 405455, 403863, 401448, 400624, 401653, 402448, 402788, 404533, 407672, 410275, 412297, 415327, 418809, 420748, 421875, 424820, 429536, 433925, 438457, 445429, 454056, 461273, 467242, 475028, 484849, 493646, 500541, 507852, 516552, 525542, 535445, 548255, 563121, 577287, 591195, 607783, 626909, 645624, 663800, 684188, 706974, 729753, 752976, 779781, 810181, 841037, 872217, 907338, 948180, 993953, 1046344, 1109373, 1183768, 1267401, 1361948, 1473385]
56155A473385J32121J53723J79908K15214K57017K99821L42298L82961M13941
56146C850389M26714M20153L96962L57883L06689K55308K15334J87849J67658
56137F584939J51917J37295J14928P7936L0910j5394n4920q5837j05542j15233
56127F720999j25139j46612j81808k26836k79037l33393l77787m01415m04435
56118D244537l92332l66469l28118k85631k47772k14378j82033j53675j33644
56109A940485j18589j02958q8594p9613p2909o3364n3590m8603m5759l9740l2707
56098A194059k9590k8164k3776j8992j8378j8722j4775r620q833r555o124j405
56086A006125j292l125r28K799K209JK332O595O298L565M770Q238Q295O925R335
$$ y = [1473385, 1605506, 1759229, 1939137, 2154351, 2411368, 2711189, 3053487, 3436448, 3850389, 4277103, 4697256, 5094218, 5452101, 5758790, 6014098, 6229432, 6417281, 6584939, 6736856, 6874151, 6989079, 7067015, 7097925, 7082531, 7027611, 6941774, 6836232, 6720999, 6595860, 6449248, 6267440, 6040604, 5761567, 5428174, 5050387, 4648972, 4244537, 3852205, 3485736, 3157618, 2871987, 2624215, 2409837, 2227804, 2074129, 1940485, 1821896, 1718938, 1630344, 1550731, 1477822, 1414458, 1360868, 1312265, 1266506, 1226766, 1194059, 1164469, 1136305, 1112529, 1093537, 1075159, 1056437, 1041662, 1032042, 1023209, 1013654, 1007530, 1006125, 1004833, 1001708, 1000780, 1003579, 1005788, 1005789, 1008121, 1014716, 1021014, 1024579, 1029349, 1037587, 1045882, 1052807, 1062142]
56071A062142J2645J1228Q416J0435J3905J2090Q357J0092J4479J3972J0841J2297
56059A200899J6173J5597J2987J5041J8793J7241J3715J5837K0455J9753J6924
56048A383415J9994K5568K5042K1484K3626K8419K6913K2169K3578K8523K7904
56037A656635K4700K8344L5646L6640L4474L9644M9122N1583M8899N1672N7807
56026B115166N6911N1834N3934O0635N9987N3946N4612O0786O1245N7806O1729
56015B748591P0577P2534P0163P5596Q5843Q8003Q5014R0388J01385J04380J02627
56004C695101J10586J24773J29355J26867J33083J45336J47505J42880J49128
55995D904614J63780J68738J66188J74815J93048K02545K05737K21864K47907
$$ y = [1062142, 1074787, 1086015, 1094431, 1104866, 1118771, 1130861, 1139218, 1149310, 1163789, 1177761, 1188602, 1200899, 1217072, 1232669, 1245656, 1260697, 1279490, 1296731, 1310446, 1326283, 1346738, 1366491, 1383415, 1403409, 1428977, 1454019, 1475503, 1499129, 1527548, 1554461, 1576630, 1600208, 1628731, 1656635, 1681335, 1709679, 1745325, 1781965, 1816439, 1856083, 1905205, 1956788, 2005687, 2057359, 2115166, 2172077, 2223911, 2277845, 2338480, 2398467, 2452413, 2507025, 2567811, 2629056, 2686862, 2748591, 2819168, 2891702, 2961865, 3037461, 3123304, 3211307, 3296321, 3386709, 3488094, 3592474, 3695101, 3805687, 3930460, 4059815, 4186682, 4319765, 4465101, 4612606, 4755486, 4904614, 5068394, 5237132, 5403320, 5578135, 5771183, 5973728, 6179465, 6401329, 6649236]
55986F649236K63040K70022K91199L25127L49780L67051L99313M43645M76504
55977I834917N02336N48031O10765O63579P10951P83192Q77542R64405J050466
55968A6546184J171827J326213J481017J647632J873657K163209K486985K870676
55960C1567400L384493M046347M833234N782960O968877Q377906R950889J1752660
55952H6664766J3966964J6749679K0275286K4848973L0560340L6653235M1564617
55945B71283860M3816786M2578661L7174363K6711985J1152019p195514k4063069
55938D01459091l5726365m1117234m1571195l9085213l5148969l0709422k6392342
55931A51708351k2485277j8996114j5906315j3274527j1103962r292373p762112
$$ y = [6649236, 6912276, 7182298, 7473497, 7798624, 8148404, 8515455, 8914768, 9358413, 9834917, 10337253, 10885284, 11496049, 12159628, 12870579, 13653771, 14531313, 15495718, 16546184, 17718011, 19044224, 20525241, 22172873, 24046530, 26209739, 28696724, 31567400, 34951893, 38998240, 43831474, 49614434, 56583311, 64961217, 74912106, 86664766, 100631730, 117381409, 137656695, 162505668, 193066008, 229719243, 271283860, 315100646, 357679307, 394853670, 421565655, 432717674, 425522160, 401459091, 365732726, 324615492, 283044297, 243959084, 208810115, 178100693, 151708351, 129223074, 110226960, 94320645, 81046118, 69942156, 60649783, 52887671]
55924E2887671o512882n519004m693610l984804l406911k952285k562776k209744
55916B1045655j918873j694921j497126j307220j151251j036135r29457q18702
55908A0691970p29621o69830o11082n42639m88498m56862m23204l77891l42550
55899F049793l25125l04132k71210k46219k36768k23679j99530j82418j78953
55890C881759j70991j51427j37284j35396j29587j13500j02839j03613j00377
55881B736745q7266p9681q3854q4736p5191o8378p0250o7689n4925m4911m3872
55870A975992m0370k9856k4727l0087l4137l2265l6113m8935n6132n0642m4523
55859A548205m5066m2254l0478k0589j9233j7219r170m730r549j4436j3708j5672
$$ y = [52887671, 46374789, 40855785, 36162175, 32177371, 28770460, 25818175, 23255399, 21045655, 19126782, 17431861, 15934735, 14627515, 13476264, 12440129, 11510672, 10691970, 9962349, 9292519, 8681437, 8138798, 7650300, 7193438, 6770234, 6392343, 6049793, 5724668, 5420536, 5149326, 4903107, 4666339, 4442660, 4243130, 4060712, 3881759, 3710768, 3559341, 3422057, 3286661, 3157074, 3043574, 2940735, 2837122, 2736745, 2649479, 2569798, 2485944, 2401208, 2326017, 2257639, 2187389, 2119700, 2064775, 2019864, 1975992, 1935622, 1905766, 1881039, 1850952, 1816815, 1784550, 1748437, 1699502, 1643370, 1592728, 1548205, 1503139, 1460885, 1430407, 1409818, 1390585, 1373366, 1364196, 1359466, 1349917, 1335481, 1321773, 1306101]
55847A306101k4881l2227l2406l3550l9991m2957l7800l3323l4789l4423k7915
55836I31839k3670k6331k7420k1649j6735j7750j7374j0997o224p883q423k666
55824G44717K211P43p15K803N162J745j408j1k53o238j1254j0341r295j2576j4374
55809F90916j0332o371p205p496k834J707K205L957J0837J7374J9483K2383K9993
55796G64617L7019L9397M2095M8655N3311N1255M6559M2258L2948J5323l787j7855
55784A151795k9677m2507n1936n4534n5162n7818n8228n3052m7427m5765m3994
55773F11695l8435l3468l2757l1679k6190k0712j9522j8671j4161r923j0002j0720
55761C45455q199n881p227q531o339m393o102p625n568l937o364q870p499n620
$$ y = [1306101, 1281220, 1248993, 1216587, 1183037, 1143046, 1100089, 1062289, 1028966, 994177, 959754, 931839, 908169, 881838, 854418, 832769, 816034, 798284, 780910, 769913, 763689, 755806, 747383, 744717, 746928, 747671, 746956, 749759, 754921, 756666, 755258, 755247, 754994, 748756, 737502, 727161, 717866, 705290, 690916, 680584, 674213, 667008, 659512, 656678, 658385, 660590, 664547, 675384, 692758, 712241, 734624, 764617, 801636, 841033, 883128, 931783, 985094, 1036349, 1082908, 1125166, 1158114, 1173437, 1169650, 1151795, 1122118, 1079611, 1027675, 973141, 917979, 860161, 801933, 748881, 701454, 655689, 611695, 573260, 539792, 507035, 475356, 449166, 428454, 408932, 390261, 376100, 366177, 356175, 345455, 337256, 331375, 324148, 315617, 309278, 304885, 298783, 291158, 285590, 281653, 275289, 266419, 258920, 253300]
55747B53300o687p235m228j821l569n291l006n63k004l714j709M38j302l425j745
55732B07439N37o05j999K75K788J053k106k248j437l057m315j723J472J026n26
55717A96574Q18K801J897P04K826N557N062L891N939Q858Q754P628Q936J0433
55703B70678Q675N956N639N256J420l012l823l010m334n834l979j018r12j955
55689B69747n33J785J826J464L753O491O467O176R288J3453J4637J4686J7517
55676C66757K1577K3386K4873K9844L6542M0911M4001M8887N3336N2868M8246
55665G91228M2946L6019K4660J1272Q79o270j2920j8053j8721j6338j4604j3076
55653H07022q986l256J371N877J2417J8522J9945J7212J3381P702k435j5264k6555
$$ y = [253300, 246613, 239378, 235150, 233329, 229760, 224469, 221463, 220900, 218896, 215182, 213473, 213911, 212609, 209184, 207439, 207976, 207371, 205372, 205647, 208435, 209488, 207382, 205134, 203697, 200640, 196325, 194602, 196074, 197100, 196574, 197392, 200193, 202090, 202794, 205620, 211177, 216239, 220130, 226069, 234927, 243681, 251309, 260245, 270678, 279353, 285309, 290948, 296204, 297624, 294612, 290789, 287779, 283445, 277611, 273632, 272614, 271702, 269747, 269214, 270999, 272825, 274289, 278042, 284533, 291000, 297176, 306464, 319917, 334554, 349240, 366757, 388334, 411720, 436593, 466437, 502979, 543890, 587891, 636778, 690114, 742982, 791228, 834174, 870193, 894853, 906125, 907004, 900734, 887814, 869761, 851040, 834702, 820098, 807022, 798036, 794780, 796151, 802028, 814445, 832967, 852912, 870124, 883505, 891207, 888772, 873508, 846953]
55640H46953l5791m4790n2180n5065n4278n2562m9608m4116l8377l5319l3382
55629C51485k9601k5245k2983k1344j7699j3857j2857j2920j0641p452o752p351
55617A62783o032m042m537n965m733k219k443m631m804l096k859l974l536j942
55603A07970k042l342l117j981k560l949l347j697j846k781j711j22j392l984
55589G4099l583p49J77j233j489p1K68m57M70K597K689P84N1Q30O10m02M70K706
55571G7767K895P54n96k63k52p23J72J895K010Q56Q74J751J193k42j33Q43J27
55554H8928j376o37J685K254J241J767L842M586M065N059P329P901O919P450R559
55539A50572J0335R808J1062J4312J6605J7657K0227K4378K7126K8245L0797L5191
$$ y = [846953, 811162, 766372, 714192, 659127, 604849, 552287, 502679, 458563, 420186, 384867, 351485, 321884, 296639, 273656, 252312, 234613, 220756, 207899, 194979, 184338, 176886, 170134, 162783, 156751, 152709, 148172, 142207, 137474, 135255, 132812, 128181, 123377, 120281, 117422, 113448, 109912, 107970, 105928, 102586, 99469, 97488, 94928, 90979, 87632, 85935, 84089, 81308, 79597, 79475, 78083, 74099, 70516, 69767, 69944, 68711, 67222, 67151, 67419, 66962, 67432, 70029, 72718, 73502, 73553, 74383, 74993, 74591, 75061, 77767, 80662, 81416, 80820, 80557, 80305, 79582, 79754, 81649, 83659, 84515, 85389, 87140, 88333, 88091, 87958, 88801, 88928, 87552, 86915, 88600, 90854, 92095, 93862, 97704, 102290, 106355, 111414, 118743, 126644, 133563, 141013, 150572, 160907, 170715, 181777, 196089, 212694, 230351, 250578, 274956, 302082, 330327, 361124, 396315]
55527C96315L8319L9215M0146M1250L9567L4220K7394J9431Q293n327j7569k7033
55515F34221l5707m3504m7337m6718m5025m3813m0928l5691l0915k8121k5322
55504B11140k1306j7758j5648j3619j1297j0227j0358r535p458o211o146n306
55492G6271l577l169m241m411l273l042l985l751k056j424k324k183l26O72k13
55477C8968q04j93l43j838k359r94P5l81p44j15R8o18q54n36j360k980k740l12
55459B1970J367Q50q2l35j018k015j349Q07J634M48j39R39J428K32o12M9M86k23
55441B4437m64L50M19p30r37N51J501P43J02P21J102L84L1P08R35K06J9O46M29
55422C1153o78o13P77J158J39R9J461J584k25j080L58J535P22k43M7j4j339j937
$$ y = [396315, 434634, 473849, 513995, 555245, 594812, 629032, 656426, 675857, 684150, 678823, 661254, 634221, 598514, 555010, 507673, 460955, 415930, 372117, 331189, 295498, 264583, 236462, 211140, 189834, 172076, 156428, 142809, 131512, 121285, 110927, 101392, 93934, 87723, 81577, 76271, 72694, 69525, 65284, 60873, 57600, 54558, 50573, 46822, 44766, 43342, 41018, 38835, 38509, 39181, 38968, 38164, 37971, 37628, 35790, 33431, 32437, 32512, 32131, 31387, 31272, 31370, 30752, 29898, 29362, 28002, 25022, 22282, 21970, 23337, 24187, 24105, 23770, 22752, 20737, 19388, 20195, 21829, 22277, 22138, 23077, 24505, 24737, 24125, 24174, 24660, 24437, 23973, 24323, 24742, 24012, 23075, 23626, 25127, 25870, 25972, 26693, 27795, 28179, 28210, 28918, 29853, 30059, 30078, 30724, 31153, 30475, 29862, 30639, 31797, 31936, 32035, 33496, 35080, 34855, 33775, 34133, 35668, 36390, 36147, 36194, 36180, 34841, 32904]
55404C2904p84nr83j917j493j235k060k176p74j1j043j714n76M16k64q42J78J015
55386A8636Rj292j095m15n14l12J061J922Q87n65p54m11n09k06Q97J226O4q28
55368A7801l20J46m19o02L49P37k90q17K82J034n6j275r30k11m42m74O87J561
55350A6761R88M04R03R29o69k109j732q14q85j023k72J10p04j025K46J280N78
55333A2966k74K93Q47j49j324j040m51r89j496o67J73k96n65R52K671K387Q72
55316A3910N7k50r95j427p65k54r20j348k81Q38N12L3Q70J664P36o59n95J27j72
55297A1081p80k70M97L4q19m92L86M32P2J95N6q79j077M10J551M35j313j194M6
55278H371J34p64r91o79r71j309n31O38R23R46J727K340J676Q38J106J297k8j542
$$ y = [32904, 32120, 32115, 31132, 29215, 27722, 26487, 24427, 22251, 21477, 21466, 20423, 18709, 18133, 18549, 18285, 17443, 17621, 18636, 18645, 17353, 16258, 15843, 15329, 15017, 16078, 18000, 18887, 18322, 17568, 17157, 16648, 16442, 17339, 18565, 18629, 17801, 17481, 17627, 17208, 16606, 16955, 17692, 17402, 16585, 16867, 17901, 17845, 16570, 15640, 15429, 14987, 14513, 15200, 16761, 17749, 18153, 19056, 19985, 19316, 17207, 15475, 14661, 13776, 12753, 12481, 12591, 11887, 10862, 11108, 12388, 12966, 12692, 12985, 13832, 13683, 12359, 11319, 10868, 9879, 8383, 7716, 7889, 7593, 7028, 7980, 10651, 13038, 13910, 13967, 13717, 12722, 11295, 10530, 10276, 9356, 8008, 7727, 8565, 9077, 9110, 9980, 11644, 12380, 11721, 11126, 11253, 11081, 10301, 10031, 10528, 10562, 9743, 9251, 9637, 10069, 10141, 10336, 10392, 9513, 8436, 8846, 10397, 10832, 9519, 8325, 8371, 8505, 7741, 6750, 6071, 5100, 3791, 3260, 3898, 4821, 5767, 7494, 9834, 11510, 12348, 13454, 14751, 14723, 13181]
55260A3181j333k99l22p56L0J201R41NL61J491J369J72k76N2l15j306j567j150
55242A1479j173j404q31M2K6l70J47J118J153N04M07P63P24O66J266J651P68n03
55224A6433q45q63j627k214j305Q0J24o30m05N92P98J69j74k71p30q46K06J257
55206I749P86l39k90O11Q05L98N66J013O81L4Q9K39m43r46m8R84K62j285j411
55187A1455l41J4l31J64J244J232K09k70k01q75j974j887p28j59l94q1R47J413
55169I437R94N96M36O3m4P78J590J100Q6J98J031R04j01n16k94n71j154q90j38
55150A3505k25q30n03N97J116J180J977L018K606Q99j38K64J099J863K956M005
55134C3389M174L970M530N321M860L346K294J883J034l02j241j982l338m719m848
$$ y = [13181, 11848, 11549, 11227, 10471, 10501, 11702, 12643, 12648, 13009, 14500, 15869, 16041, 15765, 15817, 15502, 14196, 12629, 11479, 10306, 8902, 8071, 8113, 8139, 7769, 7916, 9034, 10187, 10691, 11098, 11861, 12585, 13251, 14517, 16168, 16936, 16433, 15588, 14725, 13098, 10884, 9579, 9659, 9783, 9153, 8748, 9340, 10138, 10307, 10133, 9862, 9132, 8286, 8492, 9749, 10535, 10196, 9906, 10517, 11322, 11720, 12286, 13299, 13980, 14014, 14103, 14342, 13899, 12953, 12905, 13889, 14151, 12866, 11455, 11114, 11128, 10797, 10961, 12205, 13437, 13646, 13376, 13175, 12300, 10326, 8439, 7711, 7552, 7158, 7077, 8024, 9437, 10431, 11027, 11463, 11526, 11482, 12260, 13850, 14950, 15036, 15234, 16265, 17169, 17068, 16552, 16258, 15687, 14533, 13643, 13505, 13280, 12450, 11947, 12544, 13660, 14840, 16817, 19835, 22441, 23340, 23202, 23466, 24565, 26428, 29384, 33389, 37563, 41533, 46063, 51384, 56244, 59590, 61884, 63767, 64801, 64499, 63258, 61276, 57938, 53219, 48371]
55119D8371m044l491k913j443m5l65j744k135j522j532k148j753l33L90K0j05
55103B5208L93M81Q2K05P22M74k95j95O47O55l57r21n50l11o04o49k76p5J29Q92
55083B5655J519Q69n27j245j232j171n02J350K770J909L4j68J068J285K54J11
55067C1979J213J564O53K95J147J657J113O83Q18N77O5O42K115K606J773J351
55051E0251J959K287J976K425L907M742M193L547L532L148J892P41J80m03r38
55036H3439n84K23J38m85PJ357J469L8r34o99q23j934k540k077k088l220l848
55019F7439k932j744j506j683j685j929k276j674k91K46m80j083j015j264j905
55004D6218j594l33J01o94r22J42R25O38O81J694K081J003J85J033K357K617K297
$$ y = [48371, 44327, 40836, 37923, 36480, 36435, 36070, 34326, 32191, 30669, 29137, 26989, 25236, 24903, 25293, 25313, 25208, 25601, 26082, 26164, 26369, 27091, 27565, 27270, 27075, 27722, 28377, 28020, 27099, 26549, 26238, 25634, 24985, 24709, 24634, 24763, 25655, 27174, 28043, 27516, 26271, 25039, 23868, 23366, 24716, 27486, 29395, 29429, 29261, 30329, 31614, 31868, 31979, 33192, 34756, 35409, 35704, 36851, 38508, 39621, 40304, 41122, 41699, 41764, 42406, 44521, 47127, 48900, 50251, 52210, 54497, 56473, 58898, 62805, 67547, 71740, 75287, 78819, 81967, 83859, 84600, 84780, 84377, 83439, 82855, 83078, 83216, 82731, 82738, 84095, 85564, 85602, 84668, 83969, 83146, 81212, 78672, 76595, 74507, 71287, 67439, 64507, 62763, 61257, 59574, 57889, 55960, 53684, 52010, 51719, 51965, 51485, 50402, 49387, 48123, 46218, 44624, 44291, 44392, 43698, 42776, 42918, 43843, 44481, 45162, 46856, 48937, 49940, 50125, 51158, 53515, 56132, 58429]
54987E8429K450K891L271M089N345O006N932O432P925R093R320R896J1804J4311
54973A57194J6659J9013K1023K1667K1315K1541K2070K0551J6204J1009O214N71
54961C55031o572j3249j7598k0137k1748k1914k0551j9187j8568j7392j4975j2794
54949A50346j1814j0706q504o640o308o140m531k318j018l42N99J418J695K378
54935I8115M103N769O470P198Q980J1078J2573J3997J5824J7102J7207J7004J6752
54922B52172J4803J0182M460p06n851j1595j6364j8457j8735j8973j8985j7560
54910A54391j4942j2452j0650r498r036q481o290k684l10p30k042j867p57n03
54896G4149q99p48m98j249k194j621J85J319J000J2r84j868k292k053j724j740
$$ y = [58429, 60879, 63770, 67041, 71130, 76475, 82481, 88413, 94845, 102770, 111863, 121183, 131079, 142883, 157194, 173853, 192866, 213889, 235556, 256871, 278412, 300482, 321033, 337237, 348246, 354460, 355031, 348459, 335210, 317612, 297475, 275727, 253813, 233262, 214075, 195507, 178115, 163140, 150346, 138532, 127826, 119322, 112682, 106374, 100234, 95703, 93385, 92367, 92025, 92624, 94042, 95737, 98115, 102218, 107987, 114457, 121655, 130635, 141713, 154286, 168283, 184107, 201209, 218416, 235420, 252172, 266975, 277157, 281617, 280911, 275060, 263465, 247101, 228644, 209909, 190936, 171951, 154391, 139449, 126997, 116347, 106849, 97813, 89332, 83042, 80358, 80048, 79318, 77276, 75409, 74652, 74149, 73250, 72502, 72004, 70755, 68561, 66940, 67125, 68444, 69444, 69456, 68472, 66604, 64312, 62259, 60535, 58795]
54880E8795j566q84n37j181k108k539k791l091k678j347m24p35j160o19L6k57
54864C6914p46k97N95R01Q74J065R24O6m16L35J226R47J35jJ71k36o44n6R65J184
54844D3906O34R3m02r76r80j39N69N58P69J752K247J390O99J810L739M523M238
54827F4430M211M496M421M594O027Q121R562J0538J2066J3928J5259J6435J8335
54814A92423K0379K1144K0361J8619J5720J1053N043j264p352j2725j6241j7437
54802B49723j7523j7597j7003j4986j2630j1366j0693r260p132n270l786k495
54790A19982k043k677l011j863j85O15J061K312L824M464M853O433R001J1337
54776A54103J3351J5642J7838J9330K0767K2835K4543K4649K3669K2422J9778
$$ y = [58795, 57229, 56345, 55808, 54627, 52519, 49980, 47189, 44098, 41420, 40073, 39649, 38914, 37754, 37135, 37171, 36914, 36168, 35871, 36466, 37367, 38241, 39306, 40230, 40296, 39880, 40215, 41441, 42388, 42523, 42522, 42693, 42457, 41813, 41757, 42722, 43906, 44540, 44633, 44231, 43255, 42275, 42136, 42705, 43263, 44032, 45784, 48031, 49421, 50120, 51930, 55669, 60192, 64430, 68641, 73137, 77558, 82152, 88179, 96300, 105862, 116400, 128466, 142394, 157653, 174088, 192423, 212802, 233946, 254307, 272926, 288646, 299699, 304742, 303478, 296126, 283401, 267160, 249723, 232200, 214603, 197600, 182614, 169984, 158618, 147925, 138665, 131533, 126263, 122477, 119982, 117939, 115262, 112251, 110388, 110203, 110818, 111879, 114191, 118015, 122479, 127332, 133765, 142766, 154103, 167454, 183096, 200934, 220264, 241031, 263866, 288409, 313058, 336727, 359149, 378927]
54765C78927J4284P006L36n168j0570j5891k0050k2775k4412k4620k3233k1565
54753B32269k0781j9935j7729j5030j3361j2110r898p497o593o646n917m728m643
54740H7401n159m424k779k299l006k857j490p19j096j062r3K92o04j406j163p09
54724E8827p74q62o80p16q59k90Q28J360J117J012J153P45l4o8O18P97K41L4N10
54705F2959Q43P67P67N45o22j926j656K9J168J006P52J043J017L83J52O30P26
54688F8583Mn52l91k21l33KQ61J212Q31Q73J866K783K818K556K657K936L257L958
54670I3700M847N195N152N721O994P985Q498R554J1451J3078J3725J4082J4878
54657B14860J5960J7224J9019K1001K1790K0385J6890J1667N057j905p846j2494
$$ y = [378927, 393211, 400217, 400553, 395385, 384815, 368924, 348874, 326099, 301687, 277067, 253834, 232269, 211488, 191553, 173824, 158794, 145433, 133323, 123425, 115928, 109335, 102689, 96772, 92044, 87401, 82242, 77818, 75039, 72740, 69734, 66877, 65387, 64668, 63572, 62510, 62417, 62709, 62105, 60699, 59536, 58827, 58053, 57191, 56511, 55795, 54936, 54646, 55474, 56834, 57951, 58963, 60116, 60861, 60827, 60759, 61377, 62174, 62415, 62449, 62959, 63802, 64569, 65336, 65881, 65259, 63333, 61677, 61706, 62874, 63880, 64632, 65675, 66692, 67075, 67227, 67857, 68583, 68587, 68035, 67644, 67423, 67090, 67092, 67953, 69165, 69996, 70869, 72735, 75518, 78336, 80892, 83549, 86485, 89742, 93700, 98547, 103742, 108894, 114615, 121609, 129594, 138092, 147646, 159097, 172175, 185900, 199982, 214860, 230820, 248044, 267063, 288064, 309854, 330239, 347129, 358796, 363853, 361948, 354102, 341608]
54645C41608j6541j9930k1667k1478k0268j8733j6852j4954j3772j3138j1997
54634A52278j0013p956o356n020m024l832m288m661m736m713m231k905j538j268
54620H6737j718j531o10j30m56p72p38p87q02j88P20J018R59J535K482K512J563
54603H9794Q48O63J31p93j059n44l67r51j514j707j936j952j077N2mj042j320
54586G7222m05K30k24q43r05q74r35m84M25R03Q67J064J309O88l71m14M54O40
54568G8347K0K70J776K745K206J414J360J291P62P91J803K492K100J788K594L847
54552A05606M772N843P377Q497Q703Q888R725J0607J0991J1266J1489J0890R357
54539B24011P684N768K513j813n219o790p757q991r633r198q661q393p315n437
$$ y = [341608, 325067, 305137, 283470, 261992, 241724, 222991, 206139, 191185, 177413, 164275, 152278, 142265, 134309, 127953, 122933, 118909, 115077, 110789, 106128, 101392, 96679, 92448, 89543, 88005, 86737, 85019, 83488, 82878, 82748, 82292, 81520, 80782, 79995, 79193, 79005, 79725, 80743, 81702, 83237, 85719, 88231, 89794, 90642, 91305, 91436, 90643, 89584, 89040, 88673, 87722, 86208, 84501, 82565, 80613, 79536, 79588, 79584, 78542, 77222, 76817, 77047, 76823, 75980, 75075, 74201, 73266, 72782, 73207, 74110, 74977, 76041, 77350, 78038, 77667, 77253, 77707, 78347, 78367, 78637, 80413, 83158, 85364, 86778, 88138, 89429, 90191, 90982, 92785, 95277, 97377, 99165, 101759, 105606, 110378, 116221, 123598, 132095, 140798, 149686, 159411, 170018, 181009, 192275, 203764, 214654, 224011, 231695, 237463, 239976, 238163, 232944, 226154, 218397, 209406, 199773, 190575, 181914, 173521, 166206, 160769]
54525A60769m752o061p219o371m783m506n150n140m474m045l544k196o06L3j40
54510A01815j58J60L86N41P30N92N0k60j31k34q04j122j005j321k179k329j272
54493I3459l33m88q67m92J20K84L60M84j74j617k244j240p3j34o24k92L80M10
54475H6919J35J82L7p22j217p90l54o56p52K35J304J175K96l53q91j414r38P28
54457H2924J738P94o07o20r0q12k181k225q73K80P03J009J050L27k88M78J934
54440H3541K224J112O9k12l96p97r45p79p14o38j64K80l0q04j197j166j163j057
54422G7164n45j10l35p77p64n91q23j095q60m69l70p1P22J026N8j176j294o29
54404F9061l07k49K35P08L26m45n69k45l12n25k11J49k33o39Q9J256J107l60j398
$$ y = [160769, 156017, 149956, 142737, 136366, 131583, 127077, 121927, 116787, 112313, 108268, 104724, 102528, 101922, 101955, 101815, 101657, 101817, 102203, 102744, 103474, 104066, 104116, 103856, 103725, 103491, 102687, 101565, 100560, 99239, 97060, 94731, 93459, 93126, 92638, 91771, 91279, 91399, 91683, 92043, 92527, 92353, 90736, 88492, 87252, 87179, 87045, 86421, 86129, 86509, 86919, 87054, 87236, 87273, 86551, 85334, 84544, 84190, 83534, 82782, 83017, 84321, 85496, 85792, 85439, 84548, 83134, 82196, 82924, 84662, 85456, 84849, 84229, 84139, 83327, 81146, 78921, 78048, 78328, 79031, 80040, 81090, 81417, 81129, 81607, 83541, 85765, 86877, 86946, 86734, 86338, 85541, 84596, 83817, 83103, 82465, 82301, 82581, 82551, 81747, 80550, 79384, 78221, 77164, 76619, 76509, 76174, 75397, 74633, 74042, 73219, 72124, 71264, 70795, 70425, 70354, 71076, 72102, 72160, 70984, 69690, 69061, 68754, 68505, 68740, 69448, 69774, 69329, 68760, 68515, 68203, 67678, 67467, 67616, 67383, 66744, 66833, 68089, 69196, 68836, 67438]
54385F7438j213q06r55j116o07M36J568K423K595K043J428J272J203P92N16R04
54369G7921J441J388Q91K88p58k267l041k233q75m61q35q82m80k24j22Ll32j253
54351F8169j614o71L93K51l71j15N42K73o09q14m18l44k69O50J635J216j91q78
54333F6835o04n15o73j12Q98J012K03k64j37l06p00l71L30K8j036j049L44J348
54315F5231Q17k76p95q58p30j30P38J098R94J198J486P37r06j796j231m00l26
54298F4851n06l03j35n69j365k058k428k141j064nO1n06n86k61m69r61l95J192
54280E2352K025J200j17o56n74l65J27Q69J181Q79O40P46O61K71K23N62L68o49
54262E9743j488j408r49p49m80L65J484K169K102J388M81P4L48M74k40r97n38
$$ y = [67438, 66225, 65419, 64464, 63348, 62741, 63177, 64745, 67168, 69763, 71806, 73234, 74506, 75709, 76501, 77017, 77921, 79362, 80750, 81641, 81929, 81171, 78904, 75863, 73630, 72755, 72294, 71459, 70577, 70097, 69873, 69751, 69754, 69422, 68169, 66555, 65884, 66277, 66528, 66157, 66042, 66584, 66857, 66248, 65434, 65016, 64672, 64403, 65053, 66688, 67904, 67713, 66835, 66231, 65716, 65043, 64931, 65829, 66841, 67044, 66780, 66643, 66337, 65637, 65266, 65596, 65624, 64588, 63539, 63883, 65231, 66048, 65772, 64977, 64119, 63389, 63259, 63997, 65095, 66089, 67287, 68773, 69510, 68604, 66808, 65577, 65177, 64851, 64345, 64042, 63907, 63338, 61973, 59915, 57487, 55346, 54282, 54277, 54338, 53832, 53246, 52985, 52516, 51555, 51160, 52352, 54377, 55577, 55460, 54804, 54230, 53865, 53992, 54861, 56042, 56921, 57561, 58307, 58968, 59239, 59462, 60024, 60392, 59743, 58255, 56847, 55898, 55149, 54669, 55034, 56518, 58687, 60789, 62177, 62658, 62732, 63080, 63554, 63314, 62317, 61779]
54245F1779Q16J566J285Q91P85L66m28p74m64k66m54m14rJ19j40j57Q3j27p51
54226F3706q91l62M1M9J11N3p91j862j713m02L46j12m22K45P84K66l58O3J003
54207E9754J367J199J108J019N93P1k55n46q08o83l63o20j407j597p82l5k66r59
54189E6790j309j400j475j175l99J79K07K56O18N79k42j034j076r06j224j577
54173D6812j137r9O99Q99O69J63l67m83j76L8o4p4K41N96R08J443J964J785J014
54154E4831O73J122J475J101N85N77P12M02k32q49j454j906j729j002n77q43j142
54137E1744r17n71n79o13j91N16J110J497J566J067K32j62K18Q04R02L52o37j598
54119E4740j801j071l72o31j235r20J03N67L57N33J073P10n80j078m0J064J009
$$ y = [61779, 62595, 64161, 65446, 66337, 67122, 67488, 67060, 66286, 65822, 65556, 65102, 64688, 64679, 64798, 64658, 64501, 64584, 64457, 63706, 62815, 62453, 62494, 62543, 62654, 62707, 61916, 60054, 58341, 57939, 58285, 58173, 57751, 57996, 58780, 59046, 58688, 58751, 59754, 61121, 62320, 63428, 64447, 65040, 65111, 64856, 64310, 63502, 62819, 62456, 61836, 60429, 58832, 58050, 58015, 57749, 56790, 55481, 54081, 52606, 51431, 51032, 51211, 51418, 51674, 52292, 52871, 52629, 51595, 50519, 49613, 48389, 46812, 45675, 45576, 46275, 47174, 47843, 48006, 47639, 47156, 46980, 47018, 46954, 46880, 47121, 47717, 48625, 50068, 52032, 53817, 54831, 55504, 56626, 58101, 59202, 59787, 60364, 61076, 61478, 61246, 60397, 58943, 57037, 55308, 54306, 53729, 52886, 51744, 50827, 50256, 49677, 49064, 48873, 49389, 50499, 51996, 53562, 54629, 54861, 54699, 54917, 55721, 56623, 56975, 56338, 54740, 52939, 51868, 51496, 50865, 49630, 48710, 48813, 49380, 49737, 50270, 51343, 52053, 51473, 50395, 50355, 51419, 52428]
54102E2428O02R06J405J255Q64Q46O97r3p88n47J19K84J14J87K41k55r39j062
54084E6264o06j6N30Q69N45m61j375j610j380r55k40N10O07N5k59k9R8l7K97J101
54064E3908J235M32R9J090K271K444K128K182K171J521R12J007J037K87k75M13
54048G2862J447J361O45Q54J888K205J498J121J844K823L136K988L046L497M023
54033A05238M140L631K995L133M119M932M941M818N228N517M804L613L179L672
54019A63960M193M184L736K884J639N22J72M69P22M34m82j846l050l323k686k089
54003A69439k221k823l508m305m965m834m021l611l976m065l205k334k407k777
53989A20387k446j821j779j982j573r02j022j946k683k654j996r76o4l6r42j665
$$ y = [52428, 53030, 53936, 55341, 56596, 57460, 58306, 59003, 58910, 58122, 57575, 57694, 57978, 58092, 58279, 58520, 58265, 57326, 56264, 55658, 55642, 56172, 57041, 57586, 57125, 55750, 54140, 52760, 51805, 51565, 52075, 52682, 52737, 52478, 52449, 52547, 52510, 52807, 53908, 55143, 55575, 55674, 56764, 59035, 61479, 63607, 65789, 67960, 69481, 70393, 71400, 72437, 72724, 72449, 72862, 74309, 75670, 76315, 77169, 79057, 81262, 82760, 83881, 85725, 88548, 91684, 94672, 97718, 101215, 105238, 109378, 113009, 116004, 119137, 123256, 128188, 133129, 137947, 143175, 148692, 153496, 157109, 160288, 163960, 168153, 172337, 176073, 178957, 180596, 181118, 181290, 181759, 182481, 182915, 182433, 180587, 177537, 174214, 171528, 169439, 167218, 164395, 160887, 156582, 151617, 146783, 142762, 139151, 135175, 131110, 127905, 125571, 123164, 120387, 117941, 116120, 114341, 112359, 110786, 109884, 108862, 106916, 104233, 101579, 99583, 98607, 98543, 98507, 97565, 95900]
53973I5900j376p63p55r36n16J5l16j129j182l20M88P61Q98J131J312J576K176
53956I6964K736K641J994J404J108R99J095J290J168Q01J070K444M076M968N280
53941A30038N675O195O738P724R251J0284R846Q274O404M298J871k43j549k582
53927B02224l712m145l333k281j927j422L18K320K857K248K216L088L671L669
53913B05791M037M978N518N297N141N583O244O747O991O548N162L680L179L286
53899B78182K758J482M42j20r22k049k734k866l202l924m326m158l977m024l948
53884B46614l834m328n520o675p155o829n768m480m030m839n695n219l884l205
53870A75153l433l562l294l294l633l651l336l221l024k076r96j145k320k870
$$ y = [95900, 94524, 93761, 93006, 92070, 91554, 91569, 91253, 90124, 88942, 88622, 89110, 89871, 90769, 91900, 93212, 94788, 96964, 99700, 102341, 104335, 105739, 106847, 107846, 108941, 110231, 111399, 112200, 113270, 115714, 119790, 124758, 130038, 135713, 141908, 148646, 156370, 165621, 175905, 185751, 194025, 200429, 204727, 206598, 206355, 204806, 202224, 198512, 194367, 191034, 188753, 186826, 185404, 185722, 188042, 190899, 193147, 195363, 198451, 202122, 205791, 209828, 214806, 220324, 225621, 230762, 236345, 242589, 249336, 256327, 262875, 268037, 271717, 274896, 278182, 280940, 282422, 282864, 282744, 281822, 279773, 277039, 274173, 270971, 267047, 262721, 258563, 254586, 250562, 246614, 242780, 238452, 232932, 226257, 219102, 212273, 206505, 202025, 197995, 193156, 187461, 182242, 178358, 175153, 171720, 168158, 164864, 161570, 157937, 154286, 150950, 147729, 144705, 142629, 141633, 140488, 138168, 135298]
53856A35298k344k082k790l451l335l222l715l985l247k183j776j827j658j384
53842I8299j520j960k191k027j552p89J51J003J702K280K441J813P26j9j72j26
53826I8059q7N2J40K1K15J269K548K788J912J138J155J372J167P54N30N17O92
53809A14242J035J183Q66O48J249K285K777K741L022L665L854L493L443L974M420
53794A52897M557M927N429N062L607K188J611J346P78K77L92R21J398J644J478
53779A88512P52q4l60l56r92k227k925k645k272k523l070l576m320n185n291m334
53763A49104l236k787k677k433k285k412k351j899j651j977k322k165j859j794
53749A17256j610r22j30J90J13%j12k46k13o3k39q35j311j303j114j098j155j145
$$ y = [135298, 132954, 130872, 128082, 124631, 121296, 118074, 114359, 110374, 107127, 104944, 103168, 101341, 99683, 98299, 96779, 94819, 92628, 90601, 89049, 88260, 88411, 89414, 91116, 93396, 95837, 97650, 98376, 98357, 98185, 98059, 97972, 98024, 98164, 98185, 98400, 99669, 102217, 105005, 106917, 108055, 109210, 110582, 111749, 112503, 113033, 113550, 114242, 115277, 116460, 117326, 117974, 119223, 121508, 124285, 127026, 130048, 133713, 137567, 141060, 144503, 148477, 152897, 157454, 162381, 167810, 172872, 176479, 178667, 180278, 181624, 182402, 182679, 183071, 183992, 185390, 187034, 188512, 189264, 189180, 188820, 188464, 187472, 185245, 182320, 179675, 177403, 174880, 171810, 168234, 163914, 158729, 153438, 149104, 145868, 143081, 140404, 137971, 135686, 133274, 130923, 129024, 127373, 125396, 123074, 120909, 119050, 117256, 115646, 114724, 114594, 114784, 114897, 114897, 114785, 114539, 114326, 114263, 114024, 113189, 111878, 110575, 109461, 108363, 107208, 106063]
53731A06063j248j600k067k527k830k605j726q34n68n25K0O29K46q82j284m64
53715H7798M40N23K34J60J22K3L85J237J675J202N50N07Q55J092J252J450J504
53698A01009J510J898K492K486J829J588K414L569M044L742L073K275J656J642
53684A35227K121K468K494K558K742K868L294M421N458N166L982L619M302M366
53670A85086L131K169K717L722L705K948K490K397K400K991M380N528N463M708
53656B33835M127L488K337J308J140J345J108O82O65P18L42N8N51J274J216M55
53640B54649k28o23r36r67n92m37j003j693j734j401j330j367j170j159j742k310
53624B35957k232k054k501k981k485j332o57n96l68K37P23R42J083R26K11n50
$$ y = [106063, 104815, 103215, 101148, 98621, 95791, 93186, 91460, 90626, 90058, 89533, 89553, 90182, 90428, 89546, 88262, 87798, 88238, 88761, 88995, 89155, 89277, 89300, 89685, 90922, 92597, 93799, 94349, 94856, 95711, 96803, 98055, 99505, 101009, 102519, 104417, 106909, 109395, 111224, 112812, 115226, 118795, 122839, 126581, 129654, 131929, 133585, 135227, 137348, 139816, 142310, 144868, 147610, 150478, 153772, 158193, 163651, 168817, 172799, 176418, 180720, 185086, 188217, 190386, 193103, 196825, 200530, 203478, 205968, 208365, 210765, 213756, 218136, 223664, 229127, 233835, 237962, 241450, 243787, 245095, 246235, 247580, 248688, 249370, 250035, 250753, 251095, 251153, 251704, 252978, 254194, 254649, 254421, 253798, 252862, 251895, 251303, 250866, 249863, 248170, 246436, 245035, 243705, 242338, 241168, 240009, 238267, 235957, 233725, 231671, 229170, 226189, 223704, 222372, 221715, 221119, 220751, 220988, 221711, 222653, 223736, 224662, 224873, 224323]
53608B24323o79l64j36K20J059J828J774J357J690K887M086M735M798M190L132
53593B54900K648L437M646N024M801N078N790N852N127M572M522M331L913M043
53579C18684M923N710N890N854N840N558N205N603O768P479O923N864N481N748
53565D01530N696M772L374K268J863J878J586O37m71j064j195j417j776j854j647
53550D14180j611j819j879j853k401l659m723m775m215m078m651n212n071m391
53536C63842l818l611l409k851k100j518j092n62K0L24K62N8k16o17r38r54r10
53519C41910j058q48M07K071K669K081J898K997M224M316L883M282N563O857P980
53504C89232R274J0339J0406R778R693J0825J2713J4520J5635J5841J5658J6148
$$ y = [224323, 223644, 223280, 223144, 223364, 224423, 226251, 228025, 229382, 231072, 233959, 238045, 242780, 247578, 251768, 254900, 257548, 260985, 265631, 270655, 275456, 280534, 286324, 292176, 297303, 301875, 306397, 310728, 314641, 318684, 323607, 329317, 335207, 341061, 346901, 352459, 357664, 363267, 370035, 377514, 384437, 390301, 395782, 401530, 407226, 411998, 415372, 417640, 419503, 421381, 422967, 423604, 423133, 422069, 420874, 419457, 417681, 415827, 414180, 412569, 410750, 408871, 407018, 404617, 400958, 396235, 391460, 387245, 383167, 378516, 373304, 368233, 363842, 360024, 356413, 353004, 350153, 348053, 346535, 345443, 344881, 344901, 345225, 345487, 345545, 345329, 344712, 343774, 342820, 341910, 340852, 340004, 340411, 342482, 345151, 347232, 349130, 352127, 356351, 360667, 364550, 368832, 374395, 381252, 389232, 398506, 408845, 419251, 429029, 438722, 449547, 462260, 476780, 492415, 508256, 523914, 540062]
53492E40062J7657J9277K0226K1149K3055K5631K7786K9320L0848L2334L3085
53481H20430L3026L2819L2712L2347L1719L1409L1801L2922L4904L7814M1069
53470A192972M4024M6927N0351N3792N5880N6038N4937N3194N0652M7084M2785
53459A748636L8164L3389K8776K4864K1967K0046J9142J9469K1110K3904K7473
53448B026940L1023L3499L4495L4635L4486L3536L0984K7144K3081J9133J4703
53437B343659R404L595k226p804j2890j7268k1009k4233k6855k9009l1389l4491
53425B149484l7852m0623m2546m3728m4037m3599m3404m4383m6180m7765m8907
53414A666460n0025n0810n0266m8093m5039m1772l8339l4789l1436k8363k5272
$$ y = [540062, 557719, 576996, 597222, 618371, 641426, 667057, 694843, 724163, 755011, 787345, 820430, 853456, 886275, 918987, 951334, 983053, 1014462, 1046263, 1079185, 1114089, 1151903, 1192972, 1236996, 1283923, 1334274, 1388066, 1443946, 1499984, 1554921, 1608115, 1658767, 1705851, 1748636, 1786800, 1820189, 1848965, 1873829, 1895796, 1915842, 1934984, 1954453, 1975563, 1999467, 2026940, 2057963, 2091462, 2125957, 2160592, 2195078, 2228614, 2259598, 2286742, 2309823, 2328956, 2343659, 2353063, 2356658, 2354432, 2346628, 2333738, 2316470, 2295461, 2271228, 2244373, 2215364, 2183975, 2149484, 2111632, 2071009, 2028463, 1984735, 1940698, 1897099, 1853695, 1809312, 1763132, 1715367, 1666460, 1616435, 1565625, 1515359, 1467266, 1422227, 1380455, 1342116, 1307327, 1275891, 1247528, 1222256]
53403A222256k1984j8481j4622j0355o078k116J856O233J0605J4226J7145K0024
53391A218709K3118K6107K8679L0601L1555L1658L1819L2747L4075L5232L6631
53380A560931L8922M1674M3976M6025M8875N2924N7713O2938O8431P3479P7433
53369B173321Q0778Q4306Q7579Q9568R0612R2194R4816R7591R9879J01754J02705
53358C195103J01608R8424R4532R0890Q7255Q3647Q1149Q0567Q1403Q2835Q4745
53347D162158Q7215Q9892R2450R4775R6217R5390R1098Q2809P0025N2295L0182
53336E044506N438k0027m4578o6249q3130r4885j02991j08941j13096j15547j16992
53325D183508j18095j18821j19050j19085j19143j19012j18701j18685j19105
$$ y = [1222256, 1200272, 1181791, 1167169, 1156814, 1150736, 1148620, 1150476, 1156709, 1167314, 1181540, 1198685, 1218709, 1241827, 1267934, 1296613, 1327214, 1358769, 1390427, 1422246, 1454993, 1489068, 1524300, 1560931, 1599853, 1641527, 1685503, 1731528, 1780403, 1833327, 1891040, 1953978, 2022409, 2095888, 2173321, 2254099, 2338405, 2425984, 2515552, 2606164, 2698358, 2793174, 2890765, 2990644, 3092398, 3195103, 3296711, 3395135, 3489667, 3580557, 3667812, 3751459, 3832608, 3913175, 3994578, 4077413, 4162158, 4249373, 4339265, 4431715, 4526490, 4622707, 4718097, 4809195, 4892004, 4962029, 5014324, 5044506, 5049944, 5029917, 4985339, 4919090, 4835960, 4741075, 4638084, 4529143, 4416047, 4300500, 4183508, 4065413, 3946592, 3827542, 3708457, 3589314, 3470302, 3351601, 3232916, 3113811]
53316C113811j19396j19152j18544j17636j15899j12903j08856j04120r8736r2699
53306B005870q6139p9051p1416o3594n6014m8529m0852l3547k7635k3286j9961
53295A455846j7663j6754j6491j5252j2676j0175q812p931o607n083l925k831
53283A331646j354R1Q98J333K077L308M941P155R876J2401J4249J5953J8227K0812
53269A441613K2855K4116K5169K6673K8928L1916L5321L8669M1686M4330M6388
53258A807664M7521M7885M8222M9131N0642N2603N5018N7710O0165O1827O2280
53247B400668O1082N7966N3132M6942L9469L0865K1843J2946L663o774j7885k8265
53235B675652l7320m5518n2999n9196o3973o7879p0930p2372p1915p0129o7354
$$ y = [3113811, 2994415, 2875263, 2756719, 2639083, 2523184, 2410281, 2301425, 2197305, 2098569, 2005870, 1919731, 1840680, 1769264, 1705670, 1649656, 1601127, 1560275, 1526728, 1499093, 1475807, 1455846, 1438183, 1421429, 1404938, 1389686, 1377010, 1366835, 1358023, 1350092, 1343485, 1338402, 1334477, 1331646, 1330292, 1330383, 1331281, 1332614, 1334691, 1337999, 1342940, 1350095, 1359971, 1372372, 1386621, 1402574, 1420801, 1441613, 1464468, 1488584, 1513753, 1540426, 1569354, 1601270, 1636591, 1675260, 1716946, 1761276, 1807664, 1855185, 1903070, 1951292, 2000423, 2051065, 2103668, 2158686, 2216396, 2276561, 2338388, 2400668, 2461750, 2519716, 2572848, 2619790, 2659259, 2690124, 2711967, 2724913, 2728576, 2721802, 2703917, 2675652, 2638332, 2592814, 2539815, 2480619, 2416646, 2348767, 2277837, 2205465, 2133550, 2063421, 1996067]
53224A996067o3405n8700n4458n1318m8884m7100m6875m8823n2368n6605o1049
53213A406482o5125o8002o9437o9768o8793o5781o0963n5696n0703m5439l9746
53202G47029l4614l0601k6924k2997j9540j7204j5421j3606j2246j1764j1471
53191E30641j0831j0556j1313j2351j2676j2558j2655j2583j1715j0547r950r813
53179C93093r635r682j0239j0543r810q663q157q016p385o644o862p709p665o356
53165B75727n124n064n730o089n807n169m539m141l937l640l183k966l193l295
53151B13850k627j452o64p81j615k557k818j937n71j45j126k251k202j293p30
53136A91081q79j181j308j378j383j241j161j334j616j971k632l326l196k135
$$ y = [1996067, 1932662, 1873962, 1819504, 1768186, 1719302, 1672202, 1625327, 1576504, 1524136, 1467531, 1406482, 1341357, 1273355, 1203918, 1134150, 1065357, 999576, 938613, 882917, 832214, 786775, 747029, 712415, 681814, 654890, 631893, 612353, 595149, 579728, 566122, 553876, 542112, 530641, 519810, 509254, 497941, 485590, 472914, 460356, 447701, 435118, 423403, 412856, 402906, 393093, 383458, 373776, 363537, 352994, 343184, 334521, 326364, 318348, 310963, 304319, 297457, 289748, 282083, 275727, 270603, 265539, 259809, 253720, 247913, 242744, 238205, 234064, 230127, 226487, 223304, 220338, 217145, 213850, 211223, 209771, 209107, 208326, 206711, 204154, 201336, 199399, 198828, 198683, 197557, 195306, 193104, 191811, 191081, 190202, 189021, 187713, 186335, 184952, 183711, 182550, 181216, 179600, 177629, 174997, 171671, 168475, 166340]
53122A66340j241j148r91q4N02m95k282k988k331j662j688j776j369o48K32J207
53106A49578J658R33m05j100r04n72l08M41J571K111J751J317J365J434J056N29
53090A60455J81k06p96j317j664k100k598k639k122j698j910k458k753k607k185
53075A33583j691j417j641k224k656k577k056j339o87m01n65q69j009j087j211
53060A12153j008j86P35R71N79L06M26N78O70J070J737J950J238P9o33m72K73
53043A20466R19Q92J84o74j232j531j765j841j677j451j194o21J59L02o14j674
53027A08648j668o87J79M13K78j54j103k219k731k557k351k341k099j530j160
53012H8918j194j149p98o08r47j491j800j839j588q25L27J178J269R81Q93R51
$$ y = [166340, 165099, 163951, 162960, 162876, 163378, 162883, 160601, 157613, 155282, 153620, 151932, 150156, 148787, 148139, 148371, 149578, 151236, 152169, 151764, 150664, 149760, 149188, 148880, 149321, 150892, 153003, 154754, 156071, 157436, 158870, 159926, 160455, 160636, 160430, 159634, 158317, 156653, 154553, 151955, 149316, 147194, 145496, 143586, 141128, 138375, 135768, 133583, 131892, 130475, 128834, 126610, 123954, 121377, 119321, 117982, 117295, 116894, 116329, 115460, 114451, 113364, 112153, 111145, 110959, 111694, 112665, 113244, 113550, 113976, 114554, 115224, 116294, 118031, 119981, 121219, 121298, 120665, 120193, 120466, 121385, 122277, 122461, 121787, 120555, 119024, 117259, 115418, 113741, 112290, 111096, 110475, 110634, 110936, 110322, 108648, 106980, 106293, 106472, 106885, 107163, 107009, 105906, 103687, 100956, 98399, 96048, 93707, 91608, 90078, 88918, 87724, 86575, 85777, 85169, 84222, 82731, 80931, 79092, 77504, 76679, 77006, 78184, 79453, 80434, 81327, 82278]
52996H2278O90R5l22k00J69J88l49j034j301j024n13LN68J120J375J215Q86N72
52978H4416K10j77l20j57O3L17Q99J682J959J442P63M88L15j39m25QP56J006P33
52959I3839N72P74J069J233J185Q07L10K81Q27J148P09J49K35O03N64M12P51J049
52941A06517L44r65j476q98l61m94n67J08J054J444J189P14L11P5k5j24k07Q2
52923A06721Q97J640J601R02J79l67q46r54k64Q49J519J505J200P71J51k71j4
52906A15219O08Q18N52L88M90N49N93Q46R59M42k19p8P60J252J025O65M29j0m71
52887A24817k42N48Q27J94m75m57j32r5k80m24m90l01L46J027J000M39K87O88
52869A27277O78j71r78q68j03O68J331J946K325K428K462K255J383J62m53k47
$$ y = [82278, 82968, 83063, 82741, 82541, 82710, 82898, 82549, 81515, 80214, 79190, 78677, 78680, 79248, 80368, 81743, 82958, 83844, 84416, 84626, 84449, 84129, 83972, 84035, 84352, 85251, 86933, 88892, 90334, 91097, 91585, 91900, 91761, 91336, 91344, 92100, 93106, 93839, 94411, 95185, 96254, 97487, 98672, 99479, 99789, 100070, 100897, 102045, 102754, 102903, 103138, 103741, 104305, 104717, 105468, 106517, 106861, 105896, 104420, 103522, 103161, 102667, 102100, 102208, 103262, 104706, 105895, 106609, 106920, 106995, 106970, 106846, 106639, 106721, 107618, 109258, 110859, 111761, 111940, 111573, 110727, 109773, 109509, 110358, 111877, 113382, 114582, 115353, 115504, 115233, 115219, 115827, 116645, 117197, 117585, 118075, 118624, 119217, 120063, 121022, 121464, 121245, 121167, 121927, 123179, 124204, 124869, 125298, 125288, 124817, 124575, 125123, 125950, 126144, 125669, 125212, 125080, 124985, 124705, 124281, 123791, 123490, 123836, 124863, 125863, 126302, 126589, 127277, 127955, 127784, 126806, 125938, 125835, 126503, 127834, 129780, 132105, 134533, 136995, 139250, 140633, 140795, 140342, 140095]
52853A40095m5k95n39o34j280k607l452k928j767j231j475j837k003k061j950
52838A15991j632j335j120p39l65o12j378j574o82K92K55m02o28l01J5K64P26
52821A06775J031M97o53j473j579j469j481j236m35M96Q23L71k76l84J56O52M03
52804A02218l91q14m10K73M20j52r69j435j205m16K79K46m58j168j390j127n47
52787I2954J38M97J90m57p68o39n99r00j222j293j171q42k33L06K47l72j015j424
52769H3397j638j421o34j5m47j385j357k03N60P7n79k39N33N25k43p58n95j82
52751G5396Q0J62J20O2J44K75J53k13m97p22j306k235k918k968k439j241N87K018
52733F4458J710l5j320j183p62j136j572r72J02L61j42l31Q1M28L86K76K46J78
$$ y = [140095, 140050, 139755, 139216, 138582, 137302, 134695, 131243, 128315, 126548, 125317, 123842, 122005, 120002, 117941, 115991, 114359, 113024, 111904, 111165, 110800, 110188, 108810, 107236, 106554, 106846, 107101, 106699, 106071, 105770, 105785, 106049, 106775, 107806, 108303, 107650, 106177, 104598, 103129, 101648, 100412, 99977, 100473, 101296, 101667, 101391, 101007, 101163, 101815, 102218, 101827, 101013, 100603, 100876, 101296, 101144, 100175, 98740, 97535, 97119, 97398, 97644, 97186, 96018, 94628, 93501, 92954, 93092, 93589, 93779, 93322, 92554, 91915, 91316, 90416, 89194, 87901, 86730, 85888, 85655, 85961, 86208, 85836, 84821, 83397, 81759, 80338, 79704, 79689, 79242, 77857, 76500, 76297, 76857, 76934, 76355, 76116, 76649, 77174, 76931, 76173, 75578, 75396, 75476, 75638, 75758, 75820, 75964, 76239, 76392, 76179, 75682, 74960, 73654, 71419, 68501, 65533, 63094, 61853, 62440, 64458, 66168, 66133, 64813, 63630, 62868, 61732, 60160, 59188, 59290, 59651, 59509, 59178, 59259, 59687, 60073, 60349, 60595, 60773]
52715F0773J84M20N81L17j20k83k61l61m73l96l51n34n73r5N79R44J080J272J316
52696F4019R03K30l62q95j325j173k53P67J253J435J704J709J044K04n5J43K04
52679F9552J14J73J98o4r5P49J988K451J772P11Q1J21P12J457J790J577J334J346
52661H5967J103L26k04K03Q84Q42L65L93P25M29k57q4J046J639Q02n57j230j262
52643I1130j293j350j100o55l39r7K47M99L21k21p27q58m96K24Q64R70N90K40
52625H7949K28L22K14J9rK7k51r34j599j758j381q79n35k10K46N99N55K90J58
52606H3051J7n24j198j169k42P07R17O61N72P05P77Q53J108J310J171R19R95J396
52588I2026J739J787J559J146P42O10P36P41L71k01p06j000q84k38N09O86L05
$$ y = [60773, 60957, 61377, 61958, 62275, 62155, 61872, 61611, 61250, 60777, 60381, 60030, 59496, 58923, 58828, 59407, 60351, 61431, 62703, 64019, 64922, 65152, 64790, 63895, 62570, 61397, 61144, 61911, 63164, 64599, 66303, 68012, 69056, 69260, 69205, 69348, 69552, 69666, 69839, 70037, 69973, 69878, 70627, 72615, 75066, 76838, 77549, 77630, 77751, 78463, 79920, 81710, 83287, 84621, 85967, 87070, 87396, 87192, 87395, 88279, 89121, 89486, 89879, 90604, 91033, 90776, 90692, 91738, 93377, 94179, 93622, 92392, 91130, 89837, 88487, 87387, 86732, 86393, 86296, 86543, 87042, 87363, 87142, 86415, 85557, 85061, 85285, 86149, 87119, 87709, 87949, 88177, 88499, 88713, 88732, 88723, 88750, 88499, 87565, 85966, 84208, 82827, 81948, 81413, 81203, 81449, 82048, 82603, 82893, 83051, 83068, 82544, 81346, 80177, 79935, 80642, 81559, 82220, 82792, 83497, 84274, 85127, 86235, 87545, 88716, 89635, 90630, 92026, 93765, 95552, 97111, 98257, 98999, 99609, 100345, 101086, 101457, 101256, 100550, 99550, 98666, 98428, 98937, 99623, 99928]
52571I9928M6J65K01L2L08J290K101J805N99n86j089p35K52J097J001K80J40Q93
52553A07728J426R54K71M19J125J506J396J077N17j60k93K66O31K82J7M62Q08
52536A18432K77k70K14R27L96j028j795j652j638j889j530o49m45j115j417p67
52520A06051j01j70m52l84l29o32q17m28J38L40L00L52M01J87k27n61n80j94L14
52501A03208L79j08m02J43J043J306Q26K81m9l83o49n31k52l23o35o59l90j55
52483A02650K22J082J971K074J528J154J104Q90N63N98P20K61l88q5J139J944
52467A17427J673J100Q48M96j88m98NO23O49M33O12J064J258J043N63j4l45j24
52449A26625K80R8o53r79k89Q27J535J759J896K101K226K021J248M3q47q19l34
$$ y = [99928, 99974, 100139, 100340, 100372, 100680, 101970, 104071, 105876, 106475, 105889, 104800, 104065, 104317, 105414, 106415, 106695, 106835, 107728, 109154, 110108, 110379, 110798, 111923, 113429, 114825, 115902, 116419, 116259, 115966, 116232, 116863, 117145, 117162, 117624, 118432, 118709, 118439, 118653, 119580, 119976, 118948, 117153, 115501, 113863, 111974, 110444, 109795, 109350, 108235, 106818, 106051, 105950, 105780, 105328, 104944, 104615, 103983, 103166, 102738, 102876, 103216, 103516, 103868, 104269, 104456, 104229, 103668, 103088, 102894, 103208, 103587, 103479, 103077, 103220, 104263, 105569, 106395, 106676, 106627, 106244, 105595, 105064, 104812, 104489, 103854, 103195, 102805, 102650, 102872, 103954, 105925, 107999, 109527, 110681, 111785, 112675, 113238, 113836, 114556, 114817, 114429, 114344, 115483, 117427, 119100, 120200, 121048, 121544, 121356, 120858, 120863, 121486, 122135, 122568, 123180, 124244, 125502, 126545, 127108, 127094, 126749, 126625, 126905, 127003, 126350, 125371, 125082, 125909, 127444, 129203, 131099, 133200, 135426, 137447, 138695, 138738, 137891, 137072, 136738]
52432A36738k77o11n48k3J97j36l52r5J88K29L47M84k6j254k162j956j041k26
52414A29476L00O73Q30Q02Q50R65P94M29N25J226J719J257J00r14j254r10k59
52397A36609J30K8j00K40P22P81O61R99J571J580J183J339K200K818K688K237
52381A55686J688P17m05p56k70L3k74m39o3J46j83l64n2on75q36j42O51N99J66
52361A55321K29O34Q02Q47R52N87m96j284p44N84J339J155O51K83J83O20J558
52344A63221K218K071J745K009K447K172J354R11R79Q77L64j18m00o91q10k22
52328A78127R62J810J634P41n8k98r0J97M02O75J091J288R14L23K07N26N52J30
52310A89133L4P48J695K167K269K459K859L466M330N097N176M772M898N868O650
$$ y = [136738, 136461, 135850, 135302, 135279, 135476, 135340, 134988, 134893, 135081, 135310, 135657, 136141, 136115, 134861, 132699, 130743, 129702, 129476, 129776, 130449, 131279, 132081, 132931, 133896, 134690, 135119, 135644, 136870, 138589, 139846, 139946, 139032, 137778, 136868, 136609, 136739, 136767, 136667, 136907, 137629, 138410, 139071, 140070, 141641, 143221, 144404, 145743, 147943, 150761, 153449, 155686, 157374, 158091, 157686, 156930, 156660, 156693, 156419, 155980, 155917, 156063, 155880, 155516, 155464, 155458, 154883, 154047, 153905, 154556, 155155, 155321, 155550, 156184, 156986, 157833, 158785, 159372, 158876, 157592, 156848, 157432, 158771, 159926, 160577, 160860, 161043, 161663, 163221, 165439, 167510, 169255, 171264, 173711, 175883, 177237, 178148, 179127, 180004, 180368, 180250, 179850, 179159, 178349, 178127, 179089, 180899, 182533, 183274, 183216, 182918, 182828, 183025, 183427, 184102, 185193, 186481, 187395, 187718, 187925, 188451, 189003, 189133, 189167, 189915, 191610, 193777, 196046, 198505, 201364, 204830, 209160, 214257, 219433, 224205, 229103, 234971, 241621]
52295B41621O422N799N753O157O369O449O817P332P665Q067Q785R256Q839Q005
52281C43336P805Q473R413J0277J1101J1609J1313J0405R776J0051J0966J1717
52269D66242J1672J0862R970R652R815R974J0156J0775J1534J1534J0725J0174
52257E93085J0405J0572R869Q769P975P190N885M473L698L494L379L356L518L437
52243F79105K812K185K105K203J929J578J734K255K665K909K954K407J487J474
52229G09802L103N259O369O394O193N851N104M720N712P552Q792R283J0135J1582
52215H05851J2464J2155J1479J1317J1480J1443J1176J0799J0211R413Q606P777
52203I34171O717N541M549L664K642J722J335J236O81n29j798k530k677k589k826
$$ y = [241621, 248043, 253842, 259595, 265752, 272121, 278570, 285387, 292719, 300384, 308451, 317236, 326492, 335331, 343336, 351141, 359614, 369027, 379304, 390405, 402014, 413327, 423732, 433508, 443559, 454525, 466242, 477914, 488776, 498746, 508398, 518213, 528187, 538343, 549118, 560652, 572186, 582911, 593085, 603490, 614062, 623931, 632700, 640675, 647865, 653750, 658223, 661921, 665415, 668794, 672150, 675668, 679105, 681917, 684102, 686207, 688410, 690339, 691917, 693651, 695906, 698571, 701480, 704434, 706841, 708328, 709802, 712905, 718164, 724533, 730927, 737120, 742971, 748075, 752795, 758507, 766059, 774851, 784134, 794269, 805851, 818315, 830470, 841949, 853266, 864746, 876189, 887365, 898164, 908375, 917788, 926394, 934171, 940888, 946429, 950978, 954642, 957284, 959006, 960341, 961577, 962258, 961729, 959931, 957401, 954724, 952135, 949309]
52188I49309l845n411o604o925o909p085p034o327n684o102p245p960p989p954
52174H56235p934p369o368n791n899n945n360m357l314k411j948k236k997l651
52160G90655m101m536m589l700k202j140r99j412k047k843l334k837j457j93J42
52145G55407m77j649k792l212k698k003k014k659l263l658m050m250m035l945
$$ y = [949309, 945464, 940053, 933449, 926524, 919615, 912530, 905496, 899169, 893485, 887383, 880138, 872178, 864189, 856235, 848301, 840932, 834564, 828773, 822874, 816929, 811569, 807212, 803898, 801487, 799539, 797303, 794306, 790655, 786554, 782018, 777429, 773729, 771527, 770387, 769388, 767976, 765929, 763086, 759752, 756915, 755458, 755265, 755407, 754930, 753281, 750489, 747277, 744579, 742576, 740562, 737903, 734640, 730982, 726932, 722682, 718647, 714702]
$$ [...]
##END NTUPLES=NMR SPECTRUM
##END=
