##TITLE=NES1046_SeabridgeLH_9268578_QvbKUYwuHT
##JCAMPDX= 6.0         $$ Bruker NMR JCAMP-DX V2.0
##DATA TYPE= NMR SPECTRUM
##DATA CLASS= NTUPLES
##ORIGIN= BRUKER
##OWNER= Administrator
$$ 1.72 TOPSPIN		Version 2.1
$$ 2015-07-12 00:22:51.597 -0700  Administrator@X
$$ Compression mode = diff/dup
##.OBSERVE FREQUENCY= 400.02188249412
##.OBSERVE NUCLEUS= ^1H
##.ACQUISITION MODE= SIMULTANEOUS (DQD)
##.ACQUISITION SCHEME= undefined
##.AVERAGES= 64
##.DIGITISER RES= 22
##SPECTROMETER/DATA SYSTEM= spect
##.PULSE SEQUENCE= noesygpps1d.comp
##.SOLVENT NAME= COFFEE_meoh
##.SHIFT REFERENCE= INTERNAL, COFFEE_meoh, 1, 14.96417
##AUDIT TRAIL= $$ (NUMBER, WHEN, WHO, WHERE, PROCESS, VERSION, WHAT)
$$ ##TITLE= Audit trail, TOPSPIN		Version 2.1
$$ ##JCAMPDX= 5.01
$$ ##ORIGIN= Bruker BioSpin GmbH
$$ ##OWNER= Administrator
$$ $$ E:\/data/COFFEE/nmr/NES1046_SeabridgeLH_9268578_QvbKUYwuHT/12/pdata/1/auditp.txt
$$ ##AUDIT TRAIL=  $$ (NUMBER, WHEN, WHO, WHERE, PROCESS, VERSION, WHAT)
(   1,<2015-07-12 00:22:46.285 -0700>,<Administrator>,<X>,<go>,<TOPSPIN 2.1>,
      <created by zg
	started at 2015-07-12 00:11:16.941 -0700,
	POWCHK enabled, PULCHK disabled,
       configuration hash MD5:
       21 0F 79 D6 B3 7B B4 F6 88 20 88 DB 03 48 BD 9F
       data hash MD5: 64K
       76 05 8F BB 0C 89 5C DF 6F 53 5F D7 E2 79 EA 64>)
(   2,<2015-07-12 00:22:49.738 -0700>,<Administrator>,<X>,<proc1d>,<TOPSPIN 2.1>,
      <Start of raw data processing
       efp LB = 0.3 FT_mod = 6 PKNL = 1 PHC0 = 0 PHC1 = 0 SI = 128K 
       data hash MD5: 128K
       5B 60 1B D6 24 EB 4A E2 CF E9 11 26 6E D7 98 C2>)
(   3,<2015-07-12 00:22:50.660 -0700>,<Administrator>,<X>,<proc1d>,<TOPSPIN 2.1>,
      <pk PHC0 = -84.47388 PHC1 = 0 
       data hash MD5: 128K
       79 67 54 04 F7 C4 D5 56 F6 87 E2 FD 90 1A 36 BE>)
(   4,<2015-07-12 00:22:51.066 -0700>,<Administrator>,<X>,<proc1d>,<TOPSPIN 2.1>,
      <abs ABSG = 1 
       data hash MD5: 128K
       45 8B 10 43 7F 45 45 86 56 E2 7B AE D9 51 6B 6D>)
(   5,<2015-07-12 00:22:51.160 -0700>,<Administrator>,<X>,<proc1d>,<TOPSPIN 2.1>,
      <abs ABSG = 2 
       data hash MD5: 128K
       86 6A B8 13 5C 11 14 C8 D9 42 32 AE 6A 3D 2C BF>)
(   6,<2015-07-12 00:22:51.253 -0700>,<Administrator>,<X>,<proc1d>,<TOPSPIN 2.1>,
      <abs ABSG = 3 
       data hash MD5: 128K
       BB AF 64 A8 00 C4 A9 EF BC 74 B9 D3 71 B3 E0 96>)
(   7,<2015-07-12 00:22:51.331 -0700>,<Administrator>,<X>,<proc1d>,<TOPSPIN 2.1>,
      <abs ABSG = 4 
       data hash MD5: 128K
       5C 5C D0 0C 1E 02 CB 03 64 23 6F DC 62 19 7C 23>)
(   8,<2015-07-12 00:22:51.425 -0700>,<Administrator>,<X>,<proc1d>,<TOPSPIN 2.1>,
      <abs ABSG = 5 
       data hash MD5: 128K
       E7 D0 10 95 26 74 0D 68 EB 25 57 CB FC EC E5 0F>)
$$ ##END=
$$ 
$$ $$ hash MD5
$$ $$ 73 68 9B D7 86 2C 8A 01 FC 25 8C 2C 93 0F 3D CF
##$RELAX= 
##$RELAX= 
##$RELAX= 
##$RELAX= 
##$RELAX= 
##$RELAX= 
##$RELAX= 
##$RELAX= 
$$ Bruker specific parameters
$$ --------------------------
##$DU= <E:\>
##$EXPNO= 12
$$ [...]
##$TP07= 0
##$TPNAME0= <>
##$TPNAME1= <>
##$TPNAME2= <>
##$TPNAME3= <>
##$TPNAME4= <>
##$TPNAME5= <>
##$TPNAME6= <>
##$TPNAME7= <>
##$TPOAL= (0..7)
0.5 0.5 0.5 0.5 0.5 0.5 0.5 0.5
##$TPOFFS= (0..7)
0 0 0 0 0 0 0 0
##$TUNHIN= 0
##$TUNHOUT= 0
##$TUNXOUT= 0
##$USERA1= <user>
##$USERA2= <user>
##$USERA3= <user>
##$USERA4= <user>
##$USERA5= <user>
##$V9= 5
##$VALIST= <valist>
##$VCLIST= <CCCCCCCCCCCCCCC>
##$VD= 0
##$VDLIST= <DDDDDDDDDDDDDDD>
##$VPLIST= <PPPPPPPPPPPPPPP>
##$VTLIST= <TTTTTTTTTTTTTTT>
##$WBST= 2048
##$WBSW= 25
##$XGAIN= (0..3)
0 0 0 0
##$XL= 0
##$YL= 0
##$YMAX_a= 8202582
##$YMIN_a= -15494890
##$ZGOPTNS= <>
##$ZL1= 120
##$ZL2= 120
##$ZL3= 120
##$ZL4= 120
##$ABSF1= 14.96417
##$ABSF2= -5.594011
##$ABSG= 5
##$ABSL= 3
##$ALPHA= 0
##$AQORDER= 0
##$ASSFAC= 0
##$ASSFACI= 0
##$ASSFACX= 0
##$ASSWID= 0
##$AUNMP= <proc_prof1d_extract.lims>
##$AXLEFT= 0
##$AXNAME= <>
##$AXNUC= <1H>
##$AXRIGHT= 0
##$AXTYPE= 0
##$AXUNIT= <>
##$AZFE= 0.1
##$AZFW= 0.1
##$BCFW= 0
##$BC_mod= 0
##$BYTORDP= 0
##$COROFFS= 0
##$CY= 15
##$DATMOD= 1
##$DC= 0
##$DFILT= <>
##$DTYPP= 0
##$F1P= 0
##$F2P= 0
##$FCOR= 0.5
##$FTSIZE= 131072
##$FT_mod= 6
##$GAMMA= 0
##$GB= 0
##$INTBC= 1
##$INTSCL= 1
##$ISEN= 128
##$LB= 0.3
##$LEV0= 0
##$LPBIN= 0
##$MAXI= 10000
##$MC2= 0
##$MEAN= 0
##$ME_mod= 0
##$MI= 0
##$NCOEF= 0
##$NC_proc= -2
##$NLEV= 6
##$NOISF1= 0
##$NOISF2= 0
##$NSP= 0
##$NTH_PI= 0
##$NZP= 0
##$OFFSET= 14.96417
##$PC= 1
##$PHC0= -84.47388
##$PHC1= 0
##$PH_mod= 1
##$PKNL= yes
##$PPARMOD= 0
##$PPDIAG= 0
##$PPIPTYP= 0
##$PPMPNUM= 2147483647
##$PPRESOL= 1
##$PSCAL= 4
##$PSIGN= 0
##$PYNMP= <proc.py>
##$REVERSE= no
##$SF= 400.020008370625
##$SI= 131072
##$SIGF1= 0
##$SIGF2= 0
##$SINO= 400
##$SIOLD= 131072
##$SPECTYP= <>
##$SREGLST= <1H.CDCl3>
##$SSB= 0
##$STSI= 131072
##$STSR= 0
##$SW_p= 8223.68421052631
##$SYMM= 0
##$S_DEV= 0
##$TDeff= 65536
##$TDoff= 0
##$TI= <>
##$TILT= no
##$TM1= 0
##$TM2= 0
##$TOPLEV= 0
##$USERP1= <user>
##$USERP2= <user>
##$USERP3= <user>
##$USERP4= <user>
##$USERP5= <user>
##$WDW= 1
##$XDIM= 131072
##$YMAX_p= 430343453
##$YMIN_p= -12452
##$CURPLOT= <Network HP LaserJet P1505>
##$CURPRIN= <$Network HP LaserJet P1505>
##$DFORMAT= <normdp>
##$LAYOUT= <+/1D_H.xwp>
##$LFORMAT= <normlp>
##$PFORMAT= <normpl>
##$SURQMSG= 1
$$ End of Bruker specific parameters
$$ ---------------------------------
##NTUPLES= NMR SPECTRUM
##VAR_NAME=  FREQUENCY,     SPECTRUM/REAL,   SPECTRUM/IMAG
##SYMBOL=    X,             R,               I
##VAR_TYPE=  INDEPENDENT,   DEPENDENT,       DEPENDENT
##VAR_FORM=  AFFN,          ASDF,            ASDF
##VAR_DIM=   131072,        131072,          131072
##UNITS=     HZ,            ARBITRARY UNITS, ARBITRARY UNITS
##FACTOR=    0.0627417313425164, 1,          1
##FIRST=     8223.62146879497, -2972,        -55714
##LAST=      0,             -1777,           -56957
##MIN=       0,             -12452,          0
##MAX=       8223.62146879497, 430343453,    0
$$ Real data points
##PAGE= N=1
##DATA TABLE= (X++(R..R)), XYDATA
$$ [...]
67458 168345 170082 172058 173598 174448 174839 174970 174764 174241 173792 173914 174878 176626 178715 180376 181020 180835 180578
67441 180578 180727 181183 181827 182871 184397 185999 187202 187976 188517 188803 188718 188420 188200 188054 187688 186922 185876
67424 185876 184797 183878 183173 182543 181809 181080 180804 181256 182196 183290 184673 186688 189118 191170 192336 192825
67408 192825 193001 192866 192525 192733 194287 196829 198932 199696 199752 200249 201243 201805 201614 201612 202754 204739 206469 207367
67390 207367 207683 207799 207896 208253 209212 210677 212102 213097 213685 213886 213538 212795 212336 212717 213760 214922 216028
67373 216028 217268 218654 219857 220590 220890 221000 221121 221295 221433 221479 221578 221990 222798 223860 225056 226383 227775
67356 227775 229103 230471 232175 234174 235970 237294 238567 240192 241662 242020 241181 240226 240206 241090 242185 243156
67340 243156 244193 245336 246111 246013 245172 244369 244408 245501 247207 248925 250412 251863 253555 255466 257257 258603
67324 258603 259466 260029 260434 260802 261418 262604 264195 265440 265772 265552 265710 266738 268400 270319 272282 273937
67308 273937 274804 274911 274984 275640 276696 277610 278273 279031 280134 281522 282929 283976 284414 284611 285446 287374 289849
67291 289849 292064 293915 295756 297635 299366 301087 302980 304639 305502 305878 306691 308148 309524 310436 311491
67276 311491 313260 315435 317519 319669 322215 324872 327162 329226 331560 334155 336565 338591 340297 341511
67262 341511 342009 342115 342472 343175 343823 344479 345817 347963 349884 350550 350370 350873 353040 356342 359362 361023
67246 361023 361251 360873 361055 362588 365467 369097 372869 376451 379597 382026 383611 384584 385299 385891 386358 386974
67230 386974 388305 390600 393338 395691 397414 399008 400934 402957 404538 405669 406929 408753 410995 413332
67216 413332 415697 418053 420048 421344 422233 423534 425834 429075 432898 436959 440826 443985 446342 448392
67202 448392 450545 452505 453773 454583 455775 457703 459814 461509 462931 464679 467086 470099 473490 476840
67188 476840 479581 481506 483153 485322 488224 491376 494225 496606 498670 500725 503124 506029 509229 512382
67174 512382 515312 517898 519885 521298 522904 525747 530068 535058 539763 543787 547053 549471 551248 553150
67160 553150 555923 559551 563398 566977 570284 573507 576692 579739 582523 585049 587571 590449 593702 596862
67146 596862 599492 601787 604369 607526 610928 614151 617237 620646 624751 629449 634162 638225 641431 644287
67132 644287 647629 651849 656529 660933 664798 668569 672840 677708 682860 688174 693880 699931 705571 709995
67118 709995 713381 716777 720809 725000 728619 731777 735222 739352 743993 749028 754632 760733 766722 772034
67104 772034 776731 781284 785959 790655 795234 799790 804607 809932 815715 821534 826893 831668 836120 840497
67090 840497 844871 849444 854669 860776 867319 873493 878831 883431 887705 892210 897545 903916 910744 917144
67076 917144 922890 928569 934619 940639 946016 950907 956154 962263 968920 975536 981978 988573 995633 1003153
67062 1003153 1010876 1018501 1025795 1032624 1038966 1044950 1050872 1057031 1063537 1070339 1077408 1084757 1092245 1099607
67048 1099607 1106799 1114091 1121667 1129354 1136987 1144798 1153078 1161618 1169901 1177776 1185482 1192989 1199811 1205683
67034 1205683 1211051 1216669 1222971 1230032 1237826 1246249 1255049 1263978 1272891 1281557 1289605 1296874 1303657 1310476
67020 1310476 1317736 1325743 1334764 1344755 1355175 1365310 1374781 1383673 1392332 1401169 1410452 1420114 1429902
67007 1429902 1439739 1449668 1459368 1468257 1476348 1484581 1493792 1503645 1513094 1521696 1529928 1538316 1546838 1555233
66993 1555233 1563435 1571552 1579775 1588389 1597618 1607403 1617519 1627832 1638203 1648273 1657698 1666498 1674898
66980 1674898 1682996 1690997 1699480 1708785 1718250 1726859 1734717 1743117 1752878 1763275 1773064 1781936 1790419 1798809
66966 1798809 1806905 1814671 1822570 1831140 1840514 1850337 1859974 1868864 1876930 1884655 1892667 1901286 1910431 1919798
66952 1919798 1929040 1937972 1946684 1955329 1963825 1971933 1979592 1986889 1993817 2000469 2007433 2015383 2024152 2032741
66938 2032741 2040495 2047721 2054930 2062095 2069119 2076392 2084195 2091931 2098670 2104262 2109316 2114282 2119203 2124132
66924 2124132 2129081 2133613 2137291 2140612 2144702 2149838 2154967 2159129 2162739 2166930 2172041 2177339 2182034 2185992
66910 2185992 2189474 2192691 2195767 2198831 2201948 2205054 2208041 2210751 2212867 2214025 2214216 2213951 2213856 2214119 2214545
66895 2214545 2215102 2216084 2217586 2219118 2220027 2220147 2219676 2218593 2216763 2214656 2213351 2213459 2214369 2214912 2214457 2213044
66879 2213044 2210763 2207659 2204152 2200942 2198308 2195785 2192742 2189049 2185088 2181326 2178026 2175185 2172524 2169518
66865 2169518 2165577 2160326 2153897 2147038 2140804 2135850 2131905 2127982 2123206 2117510 2111587 2106157 2101140 2095571
66851 2095571 2088539 2080240 2071881 2064417 2057678 2050893 2043727 2036386 2028959 2021200 2013042 2004924 1997398 1990570
66837 1990570 1984026 1977153 1969576 1961413 1953190 1945356 1937870 1930309 1922269 1913603 1904445 1895249 1886631 1878816
66823 1878816 1871298 1863340 1854818 1846239 1837947 1829663 1820927 1811623 1801907 1791879 1781616 1771356 1761450
66810 1761450 1752139 1743473 1735305 1727267 1718944 1710256 1701586 1693369 1685603 1677818 1669476 1660251 1650066 1639184
66796 1639184 1628360 1618626 1610560 1603697 1596848 1589140 1580595 1571682 1562602 1553377 1544389 1536245 1528959 1521757
66782 1521757 1513973 1505746 1497550 1489407 1480991 1472236 1463329 1454220 1444692 1434824 1424940 1415110 1405214 1395550
66768 1395550 1386757 1378967 1371495 1363731 1355917 1348683 1342099 1335534 1328306 1320127 1311093 1301605 1292258 1283481
66754 1283481 1275203 1267084 1259084 1251562 1244768 1238425 1231999 1225288 1218546 1212020 1205528 1198675 1191362 1183852
66740 1183852 1176293 1168541 1160655 1153276 1147016 1141555 1135834 1129247 1122239 1115484 1108923 1101981 1094506 1087035
66726 1087035 1080184 1074115 1068560 1063033 1056960 1049981 1042382 1035004 1028509 1022791 1017259 1011634 1006234 1001476
66712 1001476 997280 993088 988366 983024 977345 971618 965881 960020 954025 948042 942144 936263 930514 925429
66698 925429 921461 918223 914571 909642 903539 896856 889968 883150 876963 871794 867192 862358 857294 852737
66684 852737 848886 844998 840645 836549 833566 831358 828810 825378 821331 816937 812188 807309 802801 798773
66670 798773 794709 790079 784823 779165 773324 767497 761832 756367 751284 747124 744274 742247 739964 736952
66656 736952 733809 731277 729203 726688 722993 718022 712186 706119 700446 695522 691303 687510 683887 680359
66642 680359 677045 674146 671697 669366 666626 663142 659000 654599 650357 646445 642737 639096 635631 632428
66628 632428 629084 625020 620466 616611 614353 613293 612347 610912 608878 606031 602334 598542 595562 593228
66614 593228 590590 587442 584594 582384 579908 576274 571884 567864 564764 562334 560154 557915 555386 552580
66600 552580 549776 547205 544932 543151 541952 540584 537648 532678 527054 522757 520483 519474 518722 517688
66586 517688 516115 513950 511584 509609 508254 507267 506261 504811 502466 499148 495518 492467 490260 488460
66572 488460 486680 484995 483573 482236 480513 478069 475101 472365 470548 469483 468243 466253 464010 462362
66558 462362 461388 460412 458953 457195 455587 454391 453614 453033 452257 451009 449346 447460 445444 443413 441610
66543 441610 440076 438443 436376 433992 431526 428846 425779 422711 420337 418876 417936 417087 416166 415112 413944
66528 413944 412827 411789 410451 408484 406184 404132 402371 400483 398393 396490 394916 393340 391604 390034
66514 390034 388872 387854 386581 384919 382848 380324 377534 374884 372500 370065 367412 364981 363363 362587
66500 362587 362086 361227 359737 357814 356000 354828 354434 354538 354741 354671 353976 352577 350872 349288 347651 345487
66484 345487 343037 341322 340906 341093 340758 339570 337937 336145 334128 331941 329861 328000 326244 324650 323557
66469 323557 323138 323009 322436 320916 318610 316325 314917 314555 314594 314286 313492 312594 311895 311369 310889 310355 309557 308218
66451 308218 306321 304285 302632 301507 300596 299497 298131 296779 295771 295158 294708 294125 293218 291894 290190
66436 290190 288379 286945 286275 286317 286610 286720 286667 286852 287487 288161 288184 287339 286103 284972 283849 282259 280032
66419 280032 277523 275314 273980 273973 275281 277141 278434 278516 277488 275740 273593 271451 269838 269005 268694 268534
66403 268534 268532 269017 270165 271645 272644 272321 270516 268109 266379 265820 265755 265199 263832 261991 260095 258424 257221
66386 257221 256559 256120 255415 254293 253044 251994 251180 250417 249541 248498 247312 246031 244694 243398 242390 241976
66370 241976 242233 242833 243217 242969 242057 240823 239743 239094 238787 238612 238566 238721 238775 238083 236397 234314 232699 231702
66352 231702 230694 229189 227550 226543 226332 226245 225653 224836 224669 225406 226219 226168 225317 224474 224080 223905 223769 223814
66334 223814 223833 223060 221161 218997 217771 217663 217844 217686 217313 216986 216576 215825 214675 213132 211227 209374 208312
66317 208312 208335 208829 208974 208718 208621 208905 209162 209088 209021 209433 210141 210426 209811 208444 206733 204901 203045 201367
66299 201367 200141 199455 199119 198832 198394 197834 197391 197321 197635 198064 198299 198198 197773 197133 196541 196274 196259 196014 195251
66280 195251 194398 194182 194695 195230 195115 194364 193421 192606 192076 192003 192379 192705 192243 190700 188558 186663 185513 184943
66262 184943 184443 183797 183321 183404 183869 184070 183683 183128 182995 183264 183419 183229 183071 183363 183954 184286 184064 183577 183347
66243 183347 183557 183867 183778 183102 182039 180830 179482 177902 176223 174860 174125 173807 173250 171964 170164 168595
66227 168595 167797 167663 167765 167916 168220 168706 169193 169509 169589 169350 168669 167596 166445 165620 165441 166017 167038 167790
66209 167790 167779 167426 167708 168939 170275 170695 170130 169233 168422 167693 167188 167281 167985 168821 169423 169828 170001 169597 168602
66190 168602 167785 167903 168564 168493 166999 164755 162935 161988 161497 160868 159792 158295 156737 155750 155778 156672 157931
66173 157931 159258 160530 161370 161237 160056 158351 156685 155362 154721 155082 156102 156810 156707 156310 156098 155568
66157 155568 154161 152647 152444 153628 154721 154686 154170 154329 155212 155947 155940 155290 154376 153621 153406 153752 154201 154359
66139 154359 154352 154473 154653 154673 154580 154496 154266 153713 153082 152795 152934 153299 153816 154439 154826 154601 153857 152949 151933 150731
66119 150731 149803 149979 151418 153226 154417 154899 155237 155720 156030 155732 154781 153477 152078 150607 149094 147864
66103 147864 147360 147549 147844 147774 147574 147766 148387 149028 149503 149925 150063 149200 147000 144217 142129 141377 141582 141990
66085 141990 142177 142217 142425 143102 144312 145720 146669 146617 145623 144316 143356 142970 143048 143400 143681 143303 141915 140001
66067 140001 138516 137825 137437 136909 136469 136441 136617 136661 136633 136570 136063 134993 134307 135098 137032 138651 139251 139467 139771
66048 139771 139492 137937 135682 133958 133267 133280 133648 134132 134227 133527 132461 131968 132360 133000 133192 132928 132642 132690
66030 132690 133292 134587 136455 138438 139954 140542 139972 138475 136819 135806 135520 135356 134888 134366 134142 134040
66014 134040 133671 133138 132976 133442 134332 135485 137014 138822 140260 140654 140049 139135 138504 138317 138643 139680 141337
65997 141337 142865 143356 142682 141606 140855 140357 139675 138973 139084 140464 142447 143875 144327 144344 144436 144341 143501 141883
65979 141883 139850 137446 134459 131306 129225 129060 130171 131012 130694 129549 128300 127267 126481 126037 125892 125624
65963 125624 124835 123715 122889 122719 123045 123557 124113 124523 124351 123224 121348 119534 118575 118627 119212 119801 120342 121186
65945 121186 122543 124172 125607 126565 127023 127015 126583 125928 125408 125263 125421 125675 125942 126262 126601 126797 126739 126507 126339
65926 126339 126469 126929 127464 127698 127468 126919 126173 125068 123474 121744 120485 119788 119057 117799 116286 115152
65910 115152 114625 114533 114853 115701 116757 117273 116890 116102 115594 115430 115190 114691 114096 113445 112570 111597 111093 111402 112035
65891 112035 112102 111362 110575 110732 112071 113984 115679 116750 117190 117147 116779 116167 115224 113772 111849 109841 108164
65874 108164 106895 105885 105121 104728 104655 104594 104412 104403 104990 106228 107725 108985 109668 109588 108710 107343 106214 106038
65856 106038 106807 107667 107715 106936 106101 105803 105866 105782 105410 104987 104728 104694 104859 105056 104988 104575 104144 104031 104200 104537
65836 104537 105175 106098 106700 106403 105671 105733 107151 109215 110929 112051 112861 113426 113521 113089 112371 111637 110955 110189
65818 110189 109240 108383 108227 109042 110242 110959 111036 110969 110949 110641 109988 109500 109489 109711 110077 110980 112427 113481 113294
65799 113294 112307 111742 112139 112976 113528 113571 113359 113379 114024 115144 116035 116186 115827 115485 115290 115046 114687 114283 113857
65780 113857 113560 113703 114250 114685 114775 115040 115914 116887 117147 116683 116017 115163 113682 111645 109692 108144 106822
65763 106822 105780 105452 105883 106432 106464 105914 105069 104227 103610 103220 102742 101936 101064 100509 100192 99838 99595 99736 99922
65744 99922 99519 98597 97824 97351 96617 95432 94503 94537 95424 96545 97383 97597 97041 96043 95258 95021 95164 95490 95986
65725 95986 96551 97009 97439 97937 98028 96997 94969 93064 92255 92531 93291 93953 94103 93691 93272 93497 94295 95116
65707 95116 95933 97117 98270 98275 96907 95457 95243 96277 97819 99396 100650 101075 100705 100406 100761 101174 100770
65690 100770 99637 98534 97900 97826 98398 99281 99450 98177 95972 93895 92375 91415 91327 92239 93220 93014 91597
65673 91597 90085 89159 88517 87917 87820 88671 90208 91806 93072 93962 94660 95400 96075 96108 95086 93401 91825
65656 91825 90681 89913 89676 90079 90467 89814 87999 86017 84751 84206 84131 84688 86034 87704 88958 89535 89752
65639 89752 89994 90374 90727 90731 90080 88757 87152 85920 85622 86400 87927 89724 91568 93403 94958 95829 96099
65622 96099 96410 97104 97624 97171 95709 93968 92755 92551 93399 94614 94934 93602 91280 89398 88737 89097 90073
65605 90073 91428 92738 93427 93406 93202 93239 93315 92927 91832 90253 88771 88007 88159 88871 89740 90731 91845 92730
65587 92730 93093 93206 93443 93524 92880 91611 90398 89505 88589 87524 86672 86150 85481 84316 83030 82349 82763 84394
65569 84394 86912 89359 90552 90046 88508 86981 86065 85869 86310 87139 87921 88212 87736 86493 84935 83849
65553 83849 83679 83984 83942 83293 82355 81316 80089 78829 77899 77325 76931 77018 78121 79930 81298 81669 81710 82094
65535 82094 82466 82288 82024 82604 83986 85091 85091 84149 82910 81881 81420 81838 83186 85079 86907 88241 89007
65518 89007 89345 89342 88984 88386 87878 87659 87548 87359 87395 88132 89434 90517 90749 90154 89111 87997 87152 86753 86627
65499 86627 86594 87027 88518 90891 93121 94462 95136 95679 96212 96692 97332 98204 98841 98735 98046 97403 97215 97432
65481 97432 97740 97709 97025 95925 95194 95442 96575 98142 99867 101599 103123 104293 105076 105252 104546 103369 102865
65464 102865 103734 105366 106657 107324 107912 108876 110328 112411 115177 118112 120423 121909 123091 124435 125794
65449 125794 126645 126555 125474 123848 122365 121271 120086 118308 116208 114460 113182 111891 110357 108885 107740
65434 107740 106817 105995 105269 104378 102810 100469 97933 95825 94254 93133 92624 92843 93344 93374 92644 91576 90814
65417 90814 90722 91286 92203 92983 93220 92942 92582 92550 92920 93601 94608 95918 97213 98074 98434 98573 98616 98456 98290
65398 98290 98702 99841 100941 101301 101504 102883 105759 108964 111333 113038 115050 117851 121216 124945 129195
65383 129195 134104 139466 144908 150327 156169 163125 171250 179451 186319 191513 195758 199306 201116 200063
65369 200063 196420 191498 186186 180479 174268 167899 161913 156654 152141 148026 143787 139282 135033 131612
65355 131612 128956 126627 124538 122928 121742 120545 119052 117377 115799 114619 114094 114095 113914 112938 111477 110485
65339 110485 110399 110660 110410 109294 107601 106059 105438 105913 106774 107218 107435 108346 110164 111889 112569 112506 112793 113993
65321 113993 115678 117041 117506 116895 115464 113801 112387 111211 109917 108302 106474 104568 102555 100402 98278
65306 98278 96434 94876 93285 91367 89249 87368 85938 84725 83469 82337 81700 81515 81250 80490 79470
65291 79470 78861 79014 79446 79184 77774 75929 74932 75311 76428 77440 78232 79062 79761 79910 79602 79362 79316 79053
65273 79053 78442 78007 78236 78933 79496 79511 78844 77527 75899 74527 73649 72902 71954 71180 71276 72244 73273 73721
65255 73721 73829 74173 74702 74747 73953 72804 72062 71994 72411 73174 74240 75288 75870 76019 76251 76794 77285 77464 77634
65236 77634 77953 77821 76622 74798 73453 73023 73059 73294 74131 75891 78234 80607 82742 84488 85720 86750
65220 86750 88292 90552 92765 94034 94342 94316 94337 94360 94327 94157 93488 91997 89999 88227 86955 85772 84347
65203 84347 82942 81966 81354 80689 79715 78508 77313 76455 76233 76593 76941 76619 75658 74858 74913 75607 76068 75764
65185 75764 75044 74629 74769 75080 75123 74915 74786 74885 74982 74735 74056 73180 72484 72264 72616 73388 74270 75049 75809 76734
65165 76734 77649 77953 77245 75886 74650 73828 72999 71761 70436 69851 70532 72209 73990 75003 75029 74654 74643
65148 74643 75122 75569 75599 75489 75777 76638 77848 79064 79906 79996 79289 78225 77346 76871 76791 77092 77582 77792 77527
65129 77527 77320 77879 79126 80245 80689 80701 80753 80950 81214 81749 82972 85049 87623 90000 91665 92748 93964
65112 93964 95932 98588 101440 104259 107262 110628 114178 117655 121114 124886 129216 133926 138364 141783
65098 141783 143942 145327 146635 148085 149349 149999 149832 148875 147312 145387 143179 140564 137542 134412 131392
65083 131392 128271 124718 120793 116771 112677 108419 104299 100895 98375 96348 94415 92533 90763 88996
65069 88996 87073 84957 82812 81080 80326 80626 81260 81404 81068 80850 80901 80709 79959 78972 78083 77145 75911 74506
65051 74506 73220 72153 71317 70770 70429 70045 69537 69118 68959 69030 69341 69988 70849 71557 71953 72188 72311 72175 71913
65032 71913 72007 72662 73453 73866 73763 73115 71800 70043 68643 68299 68916 69863 70622 70919 70632 70018 69733 70099
65014 70099 70537 70155 68815 67290 66468 66684 67611 68465 68505 67740 67048 67229 68064 68652 68545 68105 67857 67944 68302
64995 68302 68908 69678 70405 71042 71872 73224 75002 76609 77367 77079 76191 75367 74917 74717 74614 74692 75033 75362
64977 75362 75080 73689 71281 68739 67266 67400 68474 69368 69660 69695 69694 69482 69204 69477 70413 71089 70606 69285
64959 69285 68226 67977 68193 68422 68615 68851 69078 69180 69030 68477 67556 66646 66148 66161 66664 67803 69603 71561
64941 71561 73000 73745 74142 74430 74499 74248 73783 73193 72386 71215 69681 68076 67048 67222 68429 69539 69509
64924 69509 68519 67615 67365 67388 67212 66961 66940 67066 67105 67165 67518 68057 68285 67914 67248 66880 67138 67902 68866 69777
64904 69777 70410 70524 70077 69427 69019 68869 68622 68141 67714 67558 67482 67277 67125 67337 67906 68580 69161 69439 69123
64885 69123 68175 67079 66391 66195 66296 66750 67729 68929 69615 69422 68792 68518 68964 69803 70361 70257 69729 69303
64867 69303 69118 68822 68178 67474 67109 67097 67239 67509 67963 68505 69020 69470 69547 68721 67112 65909 66271 67984 69785
64848 69785 70804 71045 70718 69956 69156 68767 68563 67875 66758 66136 66470 67023 66928 66435 66514 67614 69320 70964
64830 70964 72065 72374 71939 71102 70139 69030 67803 66868 66633 66928 67182 67132 66996 66938 66749 66195 65444 64898 64738
64811 64738 64796 64867 64989 65372 66195 67461 68884 69808 69484 67760 65422 63535 62472 61963 62010 63077 65150
64794 65150 67214 68217 68139 67648 67093 66409 65675 65038 64310 63350 62699 63032 63948 64237 63488 62639 62581 62974 63015
64775 63015 62749 62914 63819 64981 65817 66186 66248 66187 66160 66303 66657 67126 67537 67740 67713 67526 67143 66457 65622 65151
64755 65151 65380 66000 66519 66981 67760 68692 69031 68341 66961 65539 64608 64640 65842 67609 68764 68762 68221 67964
64737 67964 67994 67785 67192 66603 66449 66916 67908 69005 69722 70122 70847 72210 73581 74058 73500 72501 71588 70875
64719 70875 70318 69892 69566 69399 69576 70090 70549 70625 70499 70588 70927 71134 70899 70270 69548 69092 69091 69311 69282 68920 68708
64698 68708 69067 69804 70490 71058 71665 72234 72573 72794 73220 73956 74868 75814 76603 76913 76621 76080 75773 75855 76276
64679 76276 76986 77712 77947 77658 77602 78324 79258 79525 79275 79273 79479 79138 78301 77971 78396 78393 77075 75276 74449 74819
64659 74819 75502 75923 76137 76083 75521 74713 74335 74570 74915 75030 75219 75873 76908 77950 78806 79574 80509 81804
64641 81804 83224 84000 83543 82297 81495 81879 83022 84003 84397 84479 84875 86227 88677 91340 92645 91739 89346
64624 89346 86973 85496 84872 84777 84902 84796 84139 83242 82744 82770 82920 83075 83555 84326 84756 84519 84118 84071 84105 83721
64604 83721 83132 82995 83456 84058 84476 84778 85023 85095 84935 84546 83803 82643 81345 80285 79519 79028 79113 80021 81299
64585 81299 82169 82479 82654 82814 82744 82753 83601 85252 86587 86813 86426 86182 85866 84903 83632 83041 83417 84100 84504
64566 84504 84645 84643 84412 83997 83684 83577 83452 83187 82998 83093 83393 83678 83734 83352 82481 81500 80978 81043 81274 81323 81346
64545 81346 81569 81713 81210 80007 78799 78327 78542 78697 78252 77483 77015 76975 76952 76711 76436 76136 75320 73653 71635
64526 71635 70153 69529 69472 69780 70591 71875 73209 74198 74804 75135 75191 74950 74504 73954 73411 73096 73201 73523 73535
64507 73535 73028 72509 72736 73926 75536 76808 77474 77905 78586 79441 79853 79455 78677 78203 78040 77586 76614 75690
64489 75690 75429 75759 76225 76705 77389 78214 78666 78204 76717 74708 73135 72892 74084 75857 77203 77854 78164
64472 78164 78295 78024 77390 77012 77418 78351 79116 79428 79592 79860 80028 79754 79046 78257 77728 77523 77434 77202 76802
64453 76802 76489 76428 76339 75756 74740 74044 74362 75572 76911 77735 77956 77944 78281 79374 80939 82026 82024 81579 81956
64434 81956 83424 84834 85035 84139 83032 82169 81438 80865 80700 80849 80888 80787 81031 81790 82438 82321 81624 81131
64416 81131 81311 82048 83073 84109 84661 84267 83189 82410 82581 83363 84180 85195 86897 88889 89926 89395 88181
64399 88181 87708 88579 90502 92992 95614 97866 99530 101012 102853 104971 106867 108470 110178 112076 113736
64384 113736 114880 115706 116385 116786 116940 117325 118411 120252 122675 125428 128025 129969 131402 133043 135144
64369 135144 137068 138336 139596 141943 145598 149907 154473 159640 165848 173082 181106 189879 199607 210574
64355 210574 222997 236962 252535 269988 289712 311830 336170 362863 392665 426437 464541
64344 464541 506974 553844 605401 661875 723546 790441 861262 932627 999707 1057489 1101256
64333 1101256 1126634 1130474 1112185 1074011 1020023 955078 884207 811841 741044 673685 611265
64322 611265 555062 505439 461705 422998 388921 359132 332867 309276 287961 268936 252309
64311 252309 238189 226530 216724 207631 198461 189538 181876 175994 171367 167059 162677 158613 155392 152906
64297 152906 150393 147233 143681 140655 138793 137830 136873 135247 133102 131295 130598 130916 131363 131163 130351 129500
64281 129500 129028 128915 128854 128464 127589 126644 126342 126775 127112 126723 126249 126936 129040 131576 133575 134874 135608 135774
64263 135774 135694 136293 138367 141762 145580 148949 151415 152970 154060 155363 157276 159651 162086 164273 165988
64248 165988 167136 167996 169161 171040 173612 176737 180406 184512 188736 192974 197675 203525 210874 219555
64234 219555 229093 239011 249237 260358 273253 288339 305468 324644 346407 371284 399207 429871
64222 429871 463518 501100 543786 592471 647476 708397 774234 843732 915273 986192 1052411
64211 1052411 1109025 1151209 1174683 1176239 1154913 1112957 1055238 987343 914098 839363 766319
64200 766319 697431 634202 577214 526366 481063 440462 403914 371287 342768 318264 297132
64189 297132 278506 261810 246834 233475 221679 211561 203199 196225 189919 183932 178585 174209 170550
64176 170550 167196 164312 162419 161570 161235 160932 160485 159715 158434 156854 155530 154797 154660 155227 156693 158786
64160 158786 160826 162566 164456 166817 169264 171330 173184 175245 177453 179457 181375 183895 187573 192287
64146 192287 197347 202064 206300 210480 214930 219231 222600 224843 226418 227455 227362 225720 222977 219788 216152
64131 216152 211735 206677 201518 196565 191901 187789 184472 181708 179043 176537 174666 173502 172444 170892
64117 170892 168835 166707 164905 163509 162299 160965 159455 158039 157013 156527 156756 157851 159449 160698 161237
64102 161237 161828 163449 165925 168084 169139 169271 168907 168190 167415 167248 167998 169029 169441 169183 169124 170094 172129
64085 172129 174633 176915 178491 179179 179235 179440 180721 183313 186302 188240 188411 187399 186403 186188 186732 187578
64069 187578 188280 188675 188975 189603 190806 192482 194395 196422 198611 201223 204775 209665 215626 221842 227838
64054 227838 233949 240742 248350 256623 265496 274832 284258 293618 303293 313543 323778 333012 340877 347673
64040 347673 353530 358147 361340 363311 364276 364312 363663 362815 362212 362223 363367 366104 370353 375603 381562 388338
64024 388338 395973 404305 413419 423794 435765 449114 463363 478239 493786 510283 527975 546512
64012 546512 564683 581228 596072 610273 624701 639350 654157 669712 686591 704507 722941
64001 722941 742398 764216 789130 816692 846374 878615 914342 953824 996567 1042274 1091443
63990 1091443 1144870 1202942 1265748 1333732 1407906 1489476 1579585 1679559 1791194 1916719 2058759
63979 2058759 2220589 2406157 2619515 2864348 3144467 3464780 3831290 4249662 4723525
63970 4723525 5253821 5839274 6476953 7162286 7888891 8648989 9434372 10236684 11046019
63961 11046019 11848673 12626179 13356773 14018296 14590988 15059508 15413942 15649354 15764004
63952 15764004 15757460 15629652 15380832 15012245 14527990 13937648 13257525 12508897 11714444 10895330
63942 10895330 10069705 9251950 8452761 7680627 6943714 6250224 5607228 5019682 4490379
63933 4490379 4019898 3606202 3244968 2930920 2658936 2424067 2221324 2046056 1894329
63924 1894329 1762677 1647603 1545629 1453765 1369889 1292718 1221342 1154607 1091079 1029887 971371
63913 971371 916412 865209 817148 771702 728822 688478 650529 615152 582670 552792 524715
63902 524715 498211 473900 452120 432326 414056 397651 383384 370543 358204 346369 335536
63891 335536 325579 315980 306861 298782 291543 284138 276077 267974 260608 254085 248128 242586 237294 231903
63877 231903 226180 220198 214104 208103 202785 198896 196471 194603 192447 190068 187932 185944 183559 180634
63863 180634 177564 174634 171751 168856 166094 163400 160383 156901 153427 150490 148005 145540 143104 141204
63849 141204 140112 139488 138810 137884 136793 135669 134713 134130 133769 133082 131736 130116 128891 128254 127971 128012 128615
63832 128615 129686 130545 130514 129518 128057 126773 126089 125978 126043 126018 126215 127143 128661 129884 130043 129151 127720 126227
63814 126227 125001 124204 123607 122751 121581 120628 120274 120194 119896 119467 119234 118937 117861 115892 113905 112870 112841
63797 112841 112964 112360 110925 109452 108935 109609 110655 110964 110134 108550 106687 104772 103121 102244 102281 102575 102227
63780 102227 101102 100034 99950 100923 102135 102701 102456 102038 102348 103837 106110 108090 108756 107939 106467 105451
63764 105451 105469 106436 108083 110278 112970 116088 119578 123274 126752 129569 131790 134036 136922 140659 145274
63749 145274 150873 157423 164557 171943 179732 188380 198134 208877 220358 232233 243965 254985 265017
63736 265017 274016 281731 287544 290819 291301 289103 284460 277611 268892 258796 247890 236709 225768
63723 225768 215595 206519 198349 190534 182860 175812 169965 165177 160853 156919 153986 152353 151376 150165
63709 150165 148562 147122 146456 146932 148651 151262 153926 155993 157642 159564 162126 165219 168760 172892 177664
63694 177664 183015 189093 196198 204238 212658 221094 229822 239339 249660 260181 270033 278406 284714 288637
63680 288637 290043 288839 285030 278935 271158 262227 252382 241772 230752 219895 209781 200832 193250
63667 193250 187018 181973 177888 174478 171469 168844 166971 166256 166637 167617 168858 170536 173009 176303 180103
63652 180103 184136 188352 192751 197255 201838 206699 212168 218384 225108 231881 238395 244666 250868 257086
63638 257086 263264 269173 274293 277821 279073 277975 275056 270982 266273 261487 257347 254463 252966 252589
63624 252589 252947 253537 253637 252688 250881 249035 247583 245948 243210 239284 235011 231172 227801 224576 221409
63609 221409 218422 215679 213279 211492 210471 209977 209691 209643 210032 210819 211879 213395 215585 218129 220433 222547
63593 222547 225223 228852 232859 236445 239568 242804 246647 251362 257209 264257 272025 279764 287151 294400
63579 294400 301636 308459 314188 318320 320696 321394 320593 318469 315215 311257 307431 304826 304244 305704 308403
63564 308403 311286 313757 315917 318150 320693 323716 327503 332154 337257 342328 347574 353719 360967 368669
63550 368669 376276 384121 392808 402095 410765 417390 420956 420955 417330 410400 400711 388989 376127 362790
63536 362790 348942 334218 318985 304500 291671 280170 269310 259273 250746 243695 237333 231256
63524 231256 225831 221418 217907 215165 213270 212040 210915 209737 209225 210270 212852 215916 218232 219351
63510 219351 219930 221323 224657 230130 237083 244635 252230 259896 268279 278202 289799 302293 315001 328351
63496 328351 343243 359498 375549 389760 401404 410222 415763 417649 416092 411779 405457 397766 389059
63483 389059 379142 367665 355148 343116 332769 323828 315183 306374 297876 290148 283110 276671 271202
63470 271202 267218 264828 263672 263268 263282 263642 264499 266117 268760 272603 277555 283188 289122 295595 303340
63455 303340 312609 322613 332374 341945 352267 363788 375723 386856 396621 405080 412194 417607 421065
63442 421065 422629 422362 420101 415793 409991 403811 398305 393857 390243 387204 384806 383164 381931 380323
63428 380323 377720 374045 369454 363899 357200 349359 340538 330927 321089 312281 305711 301222 297321 292950
63414 292950 288714 285796 284152 282608 280542 278486 277016 276009 275347 275485 276766 278823 281241 284310 288447
63399 288447 293324 298332 303656 310078 317814 326297 335159 344732 355363 366721 378062 388807 398664
63386 398664 407361 414453 419331 421586 421533 420203 418505 416562 414149 411484 409087 407066 405194 403588 402672
63371 402672 402485 402655 403068 403807 404344 403587 401093 397546 393641 389159 383632 377366 371109 365010 358510 351113
63355 351113 342823 334035 325426 317820 311743 307065 303243 299772 296258 292438 288435 284736 281584 278650
63341 278650 275581 272518 269644 266602 262915 258799 255005 251962 249647 248133 247662 248088 248879 249801 251102
63326 251102 252833 254480 255548 256167 256772 257513 258279 259104 260144 261338 262377 262994 263097 262703 261938 261036 260073
63309 260073 258643 256126 252460 248462 245133 242666 240380 237643 234572 231694 229235 227021 224919 222953
63295 222953 221018 218929 216864 215390 214832 214912 215213 215649 216161 216273 215495 214103 213003 212677 212594 211844 210140
63278 210140 208056 206446 205765 205814 206006 205930 205702 205731 206157 206679 206904 206751 206450 206314 206546 207133 207861 208567 209409
63259 209409 210692 212357 213957 215324 216972 219490 222649 225574 227806 229772 232127 235062 238487 242476
63245 242476 247107 252049 256727 260846 264553 268252 272596 278389 286064 295315 305675 317272 330422
63232 330422 344567 358410 371336 384011 397346 411590 426841 443523 461495 479284 495246
63221 495246 509310 522732 536272 549534 562086 574240 586391 598425 610222 622135 634396
63210 634396 646381 656964 665351 671311 674794 675671 673762 668833 660599 648857 633660 615496 595458
63197 595458 574993 555112 535875 517044 499082 482965 469033 456746 445792 436778 430411 426507
63185 426507 424275 423301 423831 426263 430675 436687 443567 450651 457887 465760 474600 484241 494384 504885
63171 504885 515513 525883 535888 545780 555553 564698 572922 580626 588293 595745 602484 608339 613234
63158 613234 616623 617732 616223 612154 605525 596386 585262 572859 559364 544482 528238 511352 494757
63145 494757 479056 464449 450933 438505 427264 417276 408304 400049 392726 386952 382720 378982 374788
63132 374788 370470 367093 365050 363844 363039 362619 362477 362324 362196 362334 362413 361521 359213 356091 353099 350683
63116 350683 348896 347824 347507 347666 347819 347581 346788 345560 344388 343957 344727 346750 349762 353209 356310 358542
63100 358542 360153 361883 364195 367061 370409 374185 377940 380906 382781 384041 385281 386629 387978 389386
63086 389386 390913 392384 393581 394454 394972 395137 395345 396348 398478 401193 403731 405954 408245 410826 413612
63071 413612 416539 419656 422974 426647 431203 437237 444818 453437 462552 471985 481897 492670 504830 518800
63057 518800 534628 552038 570708 590452 611336 633796 658430 685355 713826 742847 772104
63046 772104 801969 832711 864156 896107 928449 960666 991816 1021510 1050499 1079733 1109009
63035 1109009 1137196 1163757 1189412 1215174 1241303 1267561 1293897 1320219 1345628 1368416 1386930
63024 1386930 1400119 1407251 1407568 1400424 1385532 1362904 1332834 1296203 1254668 1210233 1164530 1118507
63012 1118507 1072718 1027822 984813 944809 908553 876110 847176 821773 800548 784252 772979
63001 772979 765970 762195 761106 762881 767867 775756 785434 795756 806367 817592 829756 843006 857635
62988 857635 873903 891265 908274 923710 937584 950737 963721 976422 988502 999654 1009364 1016827
62976 1016827 1021195 1021734 1017774 1008828 994832 976108 953066 926144 896006 863574 829660 794669
62964 794669 758733 722142 685649 650356 617223 586613 558293 531821 506934 483705 462581
62953 462581 444214 428872 415886 403888 391806 379515 367603 356792 347614 340146 333799 327751
62941 327751 321873 316845 313046 309760 305942 301478 297143 293529 290545 287827 285109 282223 279254 276699
62927 276699 275052 274227 273764 273536 273757 274303 274555 274123 273297 272586 272136 271789 271445 271168 271046 271041 270881 270168 268764
62908 268764 266946 264992 262761 260029 257069 254419 252170 249985 247824 246015 244493 242613 240121 237799
62894 237799 236589 236360 236077 235117 233910 233134 232711 231968 230672 229510 229354 230258 231471 232361 232954 233536 234121
62877 234121 234553 234796 234880 234775 234592 234626 234953 235301 235612 236280 237416 238298 238228 237658 237713 238703 239825 240342 240319 240098
62857 240098 239735 239233 238824 238741 239087 240006 241567 243414 245002 246299 247769 249597 251468 253218 255081 257028
62841 257028 258552 259416 260149 261413 263321 265690 268442 271312 273618 274864 275343 275737 276338 277014 277691 278522
62825 278522 279776 281789 284759 288283 291465 293846 296020 298929 302793 307113 311518 316093 320911 325680
62811 325680 329912 333271 335727 337628 339579 342094 345331 349224 353772 359111 365430 372889 381567 391458
62797 391458 402641 415420 430079 446497 464249 483088 503129 524644 548032 573924 602865
62786 602865 634799 669313 706388 746412 789375 834661 881820 930915 981782 1033529 1085181
62775 1085181 1136264 1186246 1233842 1277371 1315432 1346767 1370018 1384315 1389826 1387020 1375639 1355163
62763 1355163 1326219 1290718 1250428 1206039 1157836 1106713 1054140 1001428 949360 898395 848953
62752 848953 801468 756267 713460 673039 635158 600247 568732 540658 515628 493010 472208
62741 472208 452905 435169 419251 405278 393251 383193 374980 368031 361557 355201 349142 343577 338529
62728 338529 334145 330599 327558 324415 321343 319491 319675 321416 323708 326231 329278 333050 337724 343796
62714 343796 351574 360563 370062 380207 391764 405092 420004 436498 454834 474931 496501 519889
62702 519889 545979 575031 606276 638948 673051 708719 745358 781922 817667 852113 884428
62691 884428 913319 937492 955924 967771 972397 969688 960137 944447 923079 896386 865221 831154
62679 831154 795783 759897 723631 687382 652057 618289 585935 554751 525171 497938 473239
62668 473239 450673 429899 410820 393303 377220 362749 350148 339269 329663 321080 313442 306384
62656 306384 299409 292521 286229 280739 275648 270667 266238 263119 261525 260899 260405 259493 258125 256579 254993
62641 254993 253115 250646 247774 245166 243375 242393 241807 241244 240638 240147 239824 239351 238270 236597 235049 234460
62625 234460 235068 236474 238089 239417 240133 240284 240404 241167 242894 245515 248908 253063 258028 263805 270224
62610 270224 276859 283341 289868 297139 305684 315604 327028 340235 354964 370319 385945 402783 421934
62597 421934 443184 465529 488847 513993 541210 569340 596875 623033 647565 670182 690434
62586 690434 707663 720774 728568 730560 727143 718885 706201 689788 670661 649411 626021 600834
62574 600834 575202 550568 527198 504307 481284 458349 436124 415034 395306 377208 361019
62563 361019 346699 333767 321743 310705 301159 293158 285929 278674 271452 264824 258904 253367 248241
62550 248241 243967 240659 237985 235921 234902 234975 235438 235729 236126 237141 238650 240116 241363 242663 244306
62535 244306 246534 249681 253905 258820 263786 268582 273537 279041 285241 292289 300552 310374 321637 333785
62521 333785 346386 359614 373973 389550 405859 422559 439968 458490 477767 496875 515230
62510 515230 532779 549341 564345 577322 588173 596758 602550 604939 603593 598523 590177 579524 567620
62497 567620 554861 541067 526368 511594 497505 484093 470935 457926 445321 433313 421911
62486 421911 411109 400890 391083 381356 371354 360918 350385 340601 332305 325493 319560 314001 308608
62473 308608 303136 297368 291589 286432 282104 278226 274589 271460 268878 266289 263306 260341 258024 256366
62459 256366 254994 253835 253078 252679 252406 252251 252362 252633 252724 252420 251758 250903 250096 249534 249099 248452 247626 247220
62441 247220 247735 248998 250625 252732 255723 259566 263800 268170 272723 277287 281406 284979 288599 292977
62427 292977 298306 304371 311038 318347 326195 334263 342346 350475 358531 365894 371884 376523 380471 384031
62413 384031 386631 387625 387226 386174 384748 382735 380287 378069 376449 375088 373586 372036 370781 370056 370134
62398 370134 371382 373898 377377 381551 386433 392002 398117 404974 413173 423067 434427 447025 461125
62385 461125 477023 494537 513375 533657 555611 578972 603166 627959 653566 680219 707841
62374 707841 735975 763764 790131 814183 835322 852884 866066 874452 878274 878005 874036 867044 858153
62361 858153 848282 837574 825850 813312 800293 786545 771288 753977 734766 714351 693609 673195
62349 673195 653285 633872 615417 598815 584435 571577 559321 547598 537111 528510 522050 517660
62337 517660 514842 512753 510907 509627 509398 510037 510937 511820 512686 513289 513280 512750 512071 511251 509952 508041 505581
62320 505581 502398 498274 493547 488921 484618 480242 475580 471011 467012 463740 461259 459742 459185 459186 459269 459269
62304 459269 459357 459825 460860 462340 463906 465431 467275 469866 473177 476934 481115 485874 491153 496886 503422
62289 503422 511093 519410 527411 534948 543003 552394 562837 573715 585243 598244 613045 629257 646610
62276 646610 665409 686012 708254 731624 755726 780282 804868 828902 851833 873065 891795
62265 891795 907336 919688 929462 937064 942349 945334 946795 947660 948073 947571 945919 943118 938875 933001
62251 933001 926383 920597 916287 912723 909310 906623 905400 905391 906021 907534 910522 914654 918834 922456 925765
62236 925765 929081 932393 935765 939576 944246 950041 957042 964965 973230 981605 990543 1000498 1011232 1022307
62222 1022307 1033880 1046318 1059305 1072065 1084479 1097321 1111425 1127088 1144222 1162519 1181551
62211 1181551 1201271 1222315 1245321 1270065 1295764 1322053 1349146 1377306 1406813 1438215 1471747
62200 1471747 1506491 1540806 1573539 1604145 1631820 1655483 1674784 1690335 1702841 1712723 1720679 1727699
62188 1727699 1734256 1740284 1746346 1754117 1765228 1780080 1798002 1818010 1839107 1860410 1881412 1901835
62176 1901835 1921167 1938802 1954676 1969136 1982081 1992937 2001675 2009077 2015680 2021146 2025028 2027427
62164 2027427 2028461 2027770 2025090 2020856 2015700 2009846 2003425 1996861 1990486 1984183 1977869 1971863 1966299 1960713
62150 1960713 1954768 1948929 1943810 1939259 1934726 1930202 1926110 1922525 1919172 1916066 1913455 1911186 1908776 1906115
62136 1906115 1903600 1901528 1899822 1898466 1897723 1897772 1898431 1899381 1900490 1901786 1903240 1904612 1905531 1905840 1905951 1906619
62120 1906619 1908168 1910155 1912059 1914176 1917496 1922797 1930081 1938836 1948405 1957864 1965738 1970240 1970141 1965601
62106 1965601 1958173 1949970 1942886 1938374 1937243 1938927 1941127 1940922 1936644 1928592 1918157 1906838 1896015
62093 1896015 1886744 1879168 1872525 1866074 1859612 1852746 1844190 1832426 1816924 1798331 1777632 1755573 1732784
62080 1732784 1709967 1687753 1666429 1645687 1624644 1602352 1578546 1553815 1528961 1504436 1480435
62069 1480435 1457115 1434402 1411862 1389095 1366121 1343173 1320290 1297304 1274066 1250588 1227177
62058 1227177 1204517 1183278 1163428 1144268 1125360 1107105 1090165 1074657 1060235 1046587 1033464
62047 1033464 1020471 1007266 993851 980339 966538 952131 937205 922358 908247 895145 882857
62036 882857 870984 859354 848161 837488 826856 815648 803964 792589 782095 772525 764010 757008
62024 757008 751650 747531 744499 743008 743239 744560 746471 749459 754249 760733 768399 777297 787706 799148
62010 799148 810631 821621 831863 840395 845761 847194 844711 838027 826503 810540 792092 773259
61998 773259 754936 737260 720642 705703 692675 681541 672508 665777 661093 658118 657068 658313 661274
61985 661274 664416 666722 668876 672534 678616 686676 695873 705949 717014 728855 741033 753536 766826
61972 766826 781185 796540 813024 831103 850779 871150 891264 911199 931866 953915 977310
61961 977310 1001858 1027617 1054673 1082970 1112618 1144244 1178842 1217184 1259290 1304510 1352339
61950 1352339 1403165 1457973 1517217 1580336 1646526 1715635 1788094 1864494 1945730 2033129 2127673
61939 2127673 2229187 2336886 2450843 2572454 2703416 2844757 2997106 3161710 3341062
61930 3341062 3538719 3758442 4003249 4275127 4575559 4905854 5266484 5656130 6071589
61921 6071589 6507983 6957974 7410207 7848846 8254880 8607893 8887397 9074528 9154949 9121894
61911 9121894 8977540 8732186 8402195 8007652 7569894 7109060 6642240 6182807 5740718
61902 5740718 5323004 4933975 4575505 4247769 3949869 3679745 3434033 3209010 3002183
61893 3002183 2812676 2639949 2482731 2339476 2209280 2091731 1986198 1891829 1807930 1733749
61883 1733749 1668067 1609676 1558175 1513763 1476258 1444804 1418482 1396731 1379218 1365823 1356720
61872 1356720 1351959 1351040 1353439 1359495 1370069 1385264 1404189 1426200 1451604 1480740 1513019 1547433
61860 1547433 1583495 1620958 1658791 1695138 1728384 1757872 1783533 1805205 1822588 1835695 1845067
61849 1845067 1851441 1855339 1857194 1857930 1859102 1862154 1867572 1874918 1883562 1892992 1902428 1910583 1916120 1918280
61835 1918280 1917064 1912981 1906773 1899268 1891446 1884643 1880417 1879929 1883517 1891122 1903104 1920332 1943455
61822 1943455 1972338 2006217 2044099 2085000 2128257 2173908 2222757 2276037 2335200 2401989 2478357
61811 2478357 2566123 2666752 2781392 2910948 3056233 3218432 3399551 3602186 3828890 4082115
61801 4082115 4364688 4679799 5030175 5417638 5843819 6311091 6822415 7380271 7985715
61792 7985715 8637903 9333540 10065989 10824379 11592901 12350060 13068085 13713469 14249729
61783 14249729 14642176 14863101 14895672 14736093 14394318 13893004 13264062 12543414 11766178
61774 11766178 10963837 10162880 9383833 8640897 7942804 7294335 6697400 6151720 5655736
61765 5655736 5207347 4803742 4440906 4114166 3819488 3553970 3315128 3100272 2906760
61756 2906760 2732360 2575080 2432917 2304008 2186779 2079829 1981919 1892212 1810252 1735541
61746 1735541 1667320 1604801 1547336 1494281 1445018 1399270 1357087 1318316 1282260 1248064 1215358
61735 1215358 1184483 1156121 1130653 1107742 1086614 1066918 1049094 1033631 1020116 1007473 995009
61724 995009 982717 970592 958253 945366 931944 918027 903532 888572 873598 859101 845553
61713 845553 833576 823487 814561 805477 795857 786696 778809 771510 763439 754159 744156 733650 722335
61700 722335 710243 698087 686633 676284 667357 660149 654509 649733 645100 640243 634969 629177 623159
61687 623159 617536 612500 607294 600812 592651 583373 573801 564351 555109 546327 538562 532280 527414 523371
61673 523371 519473 515356 510991 506475 501899 497446 493464 490383 488448 487578 487473 487794 488193 488304 487948 487344
61657 487344 486855 486343 485003 482091 477752 472969 468693 465108 461558 457009 450827 443463 436378 430978 427558
61642 427558 425359 423476 421445 419131 416575 414114 412307 411560 411888 413042 414682 416476 418269 420162 422236
61627 422236 424271 425950 427199 428037 428249 427623 426473 425393 424442 423014 420682 417751 414816 412171 409880
61612 409880 408062 406807 406034 405649 405690 406237 407377 409323 412224 415812 419512 423029 426499 429987 433282
61597 433282 436405 439929 444557 450612 458066 466713 476078 485540 494829 504162 513669 523018 531892 540606
61583 540606 549983 560880 573985 589685 607733 627320 647891 669754 693631 719801 747956 777564
61571 777564 807945 838097 866890 893454 917208 937631 954275 966992 976010 981933 985782 988784
61559 988784 991813 995173 999009 1003653 1009338 1015927 1023314 1031842 1041900 1053262 1065226 1077303 1089399
61546 1089399 1101364 1112705 1122760 1130935 1136874 1140613 1142486 1142641 1140831 1136881 1131173 1124374 1116949
61533 1116949 1109312 1102232 1096522 1092308 1089119 1086776 1085863 1087213 1091231 1097893 1107185 1119453 1135384 1155550
61519 1155550 1179880 1207773 1238983 1274197 1314497 1360533 1412669 1471636 1538352 1613184 1696108
61508 1696108 1787726 1889354 2001693 2124029 2255204 2394870 2543043 2698654 2859359 3022993
61498 3022993 3188722 3356401 3524958 3691533 3851899 4001340 4135131 4248734 4338289 4401389
61488 4401389 4437488 4447551 4433495 4398201 4345774 4281051 4208176 4129455 4045535 3956461 3862396
61477 3862396 3763579 3660164 3552511 3441690 3329689 3219176 3113063 3014073 2924363 2845261
61467 2845261 2777272 2720409 2674576 2639562 2614696 2598711 2590148 2587864 2591013 2598663 2609771 2623611
61455 2623611 2639878 2658161 2677563 2697178 2716862 2737249 2759097 2782936 2809279 2838681 2871399
61444 2871399 2907355 2946668 2989915 3037612 3089756 3146267 3207506 3273652 3343476 3414095 3481919
61433 3481919 3543415 3595064 3633523 3656564 3663839 3656538 3636535 3606037 3567615 3523992 3477629 3430612
61421 3430612 3384804 3341894 3303377 3270511 3244174 3224695 3212035 3206118 3206550 3211731 3218495 3223051
61409 3223051 3222381 3215022 3201146 3182251 3160457 3137708 3115622 3095911 3080150 3068708 3060419 3053817
61397 3053817 3048470 3044828 3043385 3044563 3048979 3057214 3069649 3087078 3111004 3142685 3182338 3230134
61385 3230134 3287507 3356502 3438122 3532424 3640072 3762552 3900686 4053959 4221403 4401908
61375 4401908 4593053 4790421 4988455 5181252 5362236 5524188 5660521 5766392 5838556 5875138
61365 5875138 5876163 5843689 5780750 5690495 5576514 5443043 5294019 5132238 4959936 4779723
61355 4779723 4594484 4406897 4219640 4035660 3857617 3687301 3526008 3375036 3235300
61346 3235300 3106876 2989594 2883847 2790212 2708535 2637997 2578065 2528866 2490641 2463177 2445849
61335 2445849 2438036 2439553 2450591 2470901 2498981 2532379 2568795 2606284 2642335 2673661 2697552 2713070
61323 2713070 2720687 2721426 2716903 2709497 2701508 2694169 2687779 2682412 2677991 2674161 2670721 2668007 2666472 2666383 2668390
61308 2668390 2673823 2683652 2697438 2713970 2732598 2753194 2775082 2796899 2817488 2836168 2852025 2863600
61296 2863600 2869552 2869285 2862801 2850215 2831577 2807197 2778363 2747721 2718386 2692232 2669234 2648506
61284 2648506 2629248 2610169 2588811 2562612 2530720 2494274 2455163 2415128 2375823 2338882 2305637
61273 2305637 2276992 2253492 2235172 2221578 2212286 2207130 2205617 2206582 2209034 2212983 2218807 2226090 2233737
61260 2233737 2241036 2248080 2255471 2264394 2276841 2294947 2319966 2352285 2392126 2439544 2493865 2553906
61248 2553906 2618931 2688970 2764354 2845496 2932976 3027083 3127000 3230600 3334710 3434928 3525224
61237 3525224 3598265 3646374 3662527 3641741 3583106 3490909 3373280 3239474 3098119 2956677
61227 2956677 2820905 2694516 2580057 2480093 2396876 2331092 2281913 2248262 2229106 2222231 2223475
61216 2223475 2227404 2228304 2220826 2200891 2166762 2119173 2060529 1994349 1924876 1855888 1789358 1725687
61204 1725687 1665172 1608478 1555744 1506316 1459743 1416337 1376489 1340250 1307927 1280270 1257530
61193 1257530 1238825 1222888 1209082 1197393 1187919 1180676 1175472 1171671 1168445 1165524 1163411 1162755 1163900
61180 1163900 1167026 1172142 1178836 1186607 1195650 1206590 1218996 1230552 1237904 1238012 1228684 1208808 1178903
61167 1178903 1141317 1099379 1056234 1014266 974940 938691 905125 873705 844296 817143 792518
61156 792518 770379 750119 730692 711386 692470 674790 658780 644260 631062 619355 609285
61145 609285 600753 593560 587431 582001 577267 574000 573138 574720 577930 582193 587754 595186 604917 617205
61131 617205 631993 648569 665779 682473 697162 707461 710897 706674 696160 681415 663813 644277
61119 644277 624139 605078 588306 574015 561548 550099 539451 530000 521959 514871 508268 502396
61107 502396 497725 494051 490805 488021 486221 485419 484947 484245 483229 482007 480935 480716 481631 482833 483293 483318
61091 483318 484130 486101 488525 491190 494886 500053 506073 512404 519368 527210 535204 542431 548841 554997
61077 554997 561223 567469 573571 579252 584144 588084 591162 593572 595863 599129 604177 610480 616685 622211
61063 622211 627616 633401 639368 645386 651937 659590 668596 679187 691660 705942 721709 739001 758163
61050 758163 779141 801499 825089 850124 876673 904736 934539 965988 998126 1029969 1061491
61039 1061491 1092810 1122940 1150662 1176257 1200948 1224935 1247560 1269190 1291325 1314911 1340258
61028 1340258 1368554 1401604 1439943 1482967 1531038 1585452 1646060 1710954 1779007 1850957 1927761
61017 1927761 2010140 2100406 2202715 2320687 2456451 2612236 2790702 2993442 3221883 3480749
61007 3480749 3778815 4126305 4534144 5015134 5581346 6239705 6995292 7861516 8863799
60998 8863799 10033977 11410036 13045917 15012001 17372151 20151624 23310004 26705546
60990 26705546 30049670 32913620 34861178 35670554 35480617 34725874 33909819 33400960 33367159
60981 33367159 33794184 34484472 35047615 34989794 33929213 31798944 28867533 25566230 22277696
60972 22277696 19234389 16536601 14207193 12226841 10554727 9148223 7973205 6999385
60964 6999385 6194346 5527165 4973741 4514607 4130585 3804067 3522373 3276911 3060640
60955 3060640 2868433 2698004 2547966 2415891 2299501 2198034 2110683 2035001 1968209 1908535
60945 1908535 1853752 1799946 1743558 1683758 1621550 1557733 1493174 1429839 1369751 1313411 1260396
60934 1260396 1210814 1165051 1122826 1083572 1047159 1013392 981548 951303 923348 898256 875503
60923 875503 854392 835131 818120 802891 788638 775226 762984 752056 742458 734046 725950 716922
60911 716922 706759 696528 686921 677412 667520 657817 648987 640959 633705 627874 623878 621209 619318 618208
60897 618208 617692 617244 617169 618601 621568 624477 626399 628400 631443 634512 636308 637529 639709 642687 644958
60882 644958 645896 646005 645498 644181 642379 640545 638235 634864 631175 628577 627170 625711 623409 620558 617510
60867 617510 614346 611634 610250 610135 610171 609669 609329 610517 614000 619340 625000 629175 631062 631318 630995 630376
60851 630376 629161 627164 624190 619805 614008 607609 601134 593899 585086 575287 565916 557453 549408 541812
60837 541812 535469 530651 526588 522531 518577 515300 513225 512689 513540 514944 516183 517590 519986 523260 526347
60822 526347 528696 530881 533497 536221 538404 540022 541591 543473 545552 547346 548292 548207 547665 547612 548452 549713
60806 549713 550675 551091 551149 550981 550526 549796 549000 548208 547001 544887 542138 539810 538478 537339 535173 531930
60790 531930 528569 525414 521677 516820 511517 506797 502952 499686 496628 493225 488814 483381 477789 472777
60776 472777 468253 463932 460006 456714 453909 451610 450354 450460 451508 453002 454867 456806 458017 458299 458692
60761 458692 460195 462551 465088 467938 471394 474808 477340 479251 481176 482532 482046 479757 477176 475323
60747 475323 473666 471208 467686 463541 459512 456389 454463 453027 450973 447905 444209 440239 436126 432148
60733 432148 428488 424720 420301 415455 410779 406136 400925 395413 390708 387197 383994 380260 376238 372492
60719 372492 368923 365179 361603 359073 358065 358215 358806 359459 360345 361777 363691 365768 368093 371245 375481
60704 375481 380253 384951 389632 394508 399174 403074 406441 409979 413759 417168 419820 421846 423363 424379
60690 424379 425223 426348 427685 428799 429671 430752 432221 433857 435618 437633 439530 440555 440620 440708 441869 444217
60674 444217 447075 449747 451909 453563 454895 456160 457634 459603 462163 464992 467684 470396 473625 477087
60660 477087 479607 480686 481482 483339 485858 487381 487039 485335 482993 480368 477982 476497 475917 475652 475580 476295
60644 476295 478100 480471 482705 484499 485798 486759 487919 489711 491709 493048 493699 494536 496031 497640 498750
60629 498750 499415 499811 499670 498724 497191 495429 493563 491759 490442 489864 489817 490030 490543 491530 493098 495410 498675
60612 498675 502882 507790 513179 518785 524100 528683 532647 536398 540033 543575 547550 552518 557978 562557
60598 562557 565456 566950 567244 565672 561589 555473 548618 542029 535948 530154 524367 518628 513403 509155
60584 509155 505779 502815 500170 498141 496711 495377 493765 491967 490166 488439 487047 486350 486249 486175 485803
60569 485803 485352 485101 485113 485520 486503 487751 488535 488604 488587 489204 490439 491716 492480 492373 491131 488631 484964 480482
60551 480482 475905 472118 469489 467574 465965 465148 465886 468014 470689 473742 477833 483255 489608 496910 506075
60536 506075 517814 531865 547714 565357 584884 606052 628891 654148 682460 713421 745837
60525 745837 778326 809143 835919 856400 869418 874876 873173 865061 851753 834622 814913 794018
60513 794018 773685 755415 739646 725799 713122 701441 691247 683277 677890 674827 673672 674509 677940
60500 677940 684527 694530 708036 724940 744865 767477 792694 820082 848153 874867 898799 919272
60488 919272 935652 947485 955416 961135 966302 972344 981374 996049 1017888 1046470 1080770 1120468
60476 1120468 1165457 1214992 1268321 1325750 1388438 1457650 1534907 1622489 1723020 1838641 1970903
60465 1970903 2120845 2288022 2469013 2656772 2841096 3009534 3148700 3246209 3292678 3283032
60455 3283032 3217087 3099625 2939664 2749004 2540713 2327677 2120785 1927256 1750537 1591787
60445 1591787 1451175 1328124 1221497 1130229 1053295 988700 933229 883906 839505 800299 766731
60434 766731 738583 714917 694436 676235 660436 647549 637047 627318 617405 607966 599912 592880
60422 592880 585857 578726 572406 567815 565417 565364 567338 570540 574577 580128 588057 598103 609062 620043
60408 620043 630986 642209 654115 667171 681614 697327 714411 733461 754553 776308 796721
60397 796721 814795 830711 844613 856096 864824 870828 874101 874636 873100 870916 869392 869043 869709 870903
60383 870903 872023 872739 873240 873789 874025 873224 871288 868990 867114 865770 864782 864372 865122 867456 871349 876442
60367 876442 882228 888106 893292 896778 897556 895102 889661 882078 873332 864056 854260 843578 832029 820459
60353 820459 809778 799857 789759 779165 768872 759571 750868 742014 733035 724453 716333 708422 701039
60340 701039 695065 690972 688404 686717 685473 684389 683283 682232 681465 680941 680193 678671 676159 672846 669103
60325 669103 665132 660872 656302 651753 647582 643638 639486 635256 631750 629541 628406 627806 627348 626545 624878
60310 624878 622585 620813 620318 620407 619740 617743 614674 610740 606069 601316 597433 594772 592994 591821 591340
60295 591340 591563 592359 593898 596609 600527 605074 609688 614323 619162 624075 628592 632344 635465 638622 642630
60280 642630 648027 655019 663659 673787 684893 696483 708644 721778 735615 749077 761415 773019
60268 773019 784733 796815 808892 820492 831179 840647 849198 857817 867335 877822 889179 901871
60256 901871 916444 932644 949615 966870 984632 1003465 1023958 1046526 1071066 1097108 1124651
60245 1124651 1154515 1187470 1223400 1261808 1302738 1346648 1393739 1443977 1497438 1554136 1613907
60234 1613907 1677075 1744819 1818144 1896788 1979767 2066650 2157567 2252280 2350022 2449972 2550956
60223 2550956 2650892 2747375 2838813 2924264 3002337 3071191 3129670 3177698 3215515 3243290 3261523
60212 3261523 3271066 3272596 3266726 3254670 3238085 3218199 3195831 3172407 3150225 3131471 3117613 3109870
60200 3109870 3109465 3117076 3132720 3156602 3189599 3232493 3285185 3347022 3417483 3496118 3582021 3673681
60188 3673681 3769163 3866156 3961966 4053726 4138695 4214485 4279254 4331721 4370803 4395208 4403480
60177 4403480 4394435 4367459 4322619 4260789 4183699 4093718 3993664 3886766 3776404 3665645 3557312
60166 3557312 3454559 3360732 3278240 3208105 3151017 3108255 3080937 3068994 3071687 3088697 3119723
60155 3119723 3163292 3216855 3277817 3343478 3410122 3473249 3528940 3574346 3607178 3625940 3630951
60144 3630951 3624065 3606909 3580048 3544103 3500853 3452859 3402771 3353385 3307634 3267925 3236003
60133 3236003 3213843 3204000 3208454 3227494 3260424 3307215 3369027 3447321 3542889 3655695 3785299
60122 3785299 3931370 4093970 4273317 4469200 4680642 4906076 5143700 5391581 5647445
60113 5647445 5908305 6170218 6428554 6678653 6916247 7137361 7338215 7515383 7665739
60104 7665739 7786178 7873906 7927216 7945474 7928038 7873887 7782850 7656623 7498062 7310159
60094 7310159 7096604 6862842 6615613 6361650 6107420 5859398 5623347 5403382 5202596
60085 5202596 5024229 4871111 4744161 4642751 4566621 4516355 4491891 4491777 4514276 4558144 4621827
60074 4621827 4702561 4796574 4899466 5006221 5111576 5210719 5299122 5371939 5424635 5454605 5461500
60063 5461500 5445858 5408209 5349627 5272090 5177803 5068711 4946868 4814646 4674526 4529411
60053 4529411 4383117 4239594 4101602 3971030 3850378 3742644 3649484 3570835 3506698 3457926
60043 3457926 3424631 3405262 3398287 3403787 3422462 3454069 3497887 3553870 3622052 3701200 3789042 3883409
60031 3883409 3982168 4082218 4179426 4269523 4348611 4413255 4460931 4490357 4500943 4492022 4463047
60020 4463047 4414276 4346961 4263133 4165480 4057081 3940980 3820347 3699069 3581413 3470649
60010 3470649 3368592 3276790 3197310 3131761 3080329 3042649 3019188 3010997 3018492 3041261 3078872
59999 3078872 3131229 3198324 3280230 3377266 3489720 3617429 3759683 3915051 4080888 4253254
59989 4253254 4427504 4598615 4761022 4909110 5038622 5147227 5233452 5295705 5332696 5343880
59979 5343880 5328712 5286120 5215627 5118767 4998974 4860679 4709184 4550748 4391738 4237757
59969 4237757 4093887 3964948 3854422 3763387 3691379 3638151 3603894 3588129 3589381 3605972 3636453
59958 3636453 3679452 3733897 3799434 3875920 3962406 4056965 4157268 4260607 4363575 4462592 4554981
59947 4554981 4639142 4713730 4777269 4828659 4867534 4893963 4908185 4910720 4902576 4885411 4861778 4835126
59935 4835126 4809200 4787561 4773788 4771773 4785237 4817038 4869206 4943349 5040537 5161025 5304714
59924 5304714 5471976 5663644 5880103 6120616 6383436 6666266 6966488 7280741 7603863
59915 7603863 7928012 8243151 8538573 8803722 9027774 9199683 9309967 9352886 9327242 9236071
59905 9236071 9086309 8888096 8653155 8393228 8119742 7843914 7575957 7323889 7093419
59896 7093419 6888750 6713042 6568376 6455919 6376207 6328871 6312013 6322018 6353933 6402191
59886 6402191 6461766 6529411 6603932 6685351 6774243 6871701 6978665 7094185 7214480 7333938
59876 7333938 7446397 7545027 7622116 7670492 7685250 7663630 7603931 7505909 7372292 7208851 7022715
59865 7022715 6821131 6611500 6401260 6196938 6003525 5824871 5664096 5523416 5404059
59856 5404059 5306620 5231138 5176510 5140014 5117722 5105567 5100151 5098556 5097400 5092376 5079301 5055772
59844 5055772 5021442 4976788 4922262 4858672 4787442 4709997 4627616 4542394 4457497 4375810 4298882
59833 4298882 4227627 4162955 4104676 4050614 3998101 3946115 3895143 3845758 3798712 3756001 3720130
59822 3720130 3691973 3670133 3652338 3636480 3620579 3603227 3584517 3565647 3547356 3529641 3513167
59811 3513167 3500006 3492646 3493137 3503530 3526288 3563747 3617631 3689333 3780080 3890747 4022266
59800 4022266 4176572 4356499 4564309 4800611 5064307 5352064 5656352 5963601 6254209
59791 6254209 6504554 6690587 6792990 6802531 6722663 6567691 6358045 6115402 5859206 5604878
59781 5604878 5363570 5142757 4946658 4776513 4631452 4509850 4410049 4330132 4267690 4220205
59771 4220205 4185584 4162397 4149964 4148232 4157234 4176603 4205744 4244201 4291480 4346721 4409156 4478817
59759 4478817 4556250 4641561 4734251 4833976 4940973 5055791 5179234 5312701 5458100 5617303
59749 5617303 5792022 5984081 6195280 6426965 6680199 6956209 7255934 7578968 7923443
59740 7923443 8286892 8666349 9057082 9451510 9839728 10211193 10556437 10868331 11142707
59731 11142707 11378489 11577978 11747469 11897022 12038453 12182969 12340474 12520093 12729771
59722 12729771 12974755 13256881 13575306 13927173 14307441 14708832 15122473 15538441 15945998
59713 15945998 16334374 16694036 17017284 17298018 17531869 17716913 17853812 17945233 17995765 18012490
59703 18012490 18004739 17982707 17956633 17937385 17936947 17967432 18039555 18162095 18342269 18585948 18897308
59692 18897308 19278357 19728786 20246318 20827149 21465452 22151768 22871747 23606512 24333730
59683 24333730 25027829 25660144 26200922 26622879 26903976 27028784 26989942 26790077 26442121
59674 26442121 25966878 25389202 24734639 24026689 23284281 22519723 21737594 20935097 20104915
59665 20104915 19240722 18342840 17420496 16489947 15570694 14681589 13837219 13045555 12308436
59656 12308436 11624208 10989840 10401390 9854380 9344815 8869641 8426137 8011725 7624712
59647 7624712 7264470 6930347 6621062 6335509 6073455 5834797 5618591 5423385 5248146
59638 5248146 5092366 4955547 4836936 4735459 4649472 4576814 4515380 4463521 4419880 4383238
59628 4383238 4352591 4326868 4304330 4282686 4260006 4235182 4207469 4176069 4140277 4099505 4052993
59617 4052993 4000024 3940654 3875800 3806628 3734496 3661445 3589882 3521428 3456697 3396350 3341515
59606 3341515 3292870 3250240 3213545 3183323 3159727 3141888 3128981 3121244 3119177 3122373 3130087 3142511
59594 3142511 3160418 3183583 3210351 3238808 3267812 3296863 3325529 3353201 3379178 3403006 3424965
59583 3424965 3446312 3468995 3495224 3527102 3566025 3612202 3665220 3725436 3794380 3873478 3962856
59572 3962856 4061937 4170815 4290444 4421570 4564067 4717391 4881205 5055268 5238742 5429715
59562 5429715 5625498 5823487 6021653 6218102 6410376 6595477 6770458 6932597 7079141
59553 7079141 7207465 7315584 7402140 7465616 7503647 7512975 7490166 7433349 7344493 7230104 7098890
59542 7098890 6958429 6814173 6670894 6533737 6407716 6297280 6206774 6140480 6101824 6093192
59532 6093192 6116770 6174780 6268511 6397713 6560977 6755743 6977341 7218595 7470480 7722462
59522 7722462 7962262 8176788 8354337 8485652 8563033 8580007 8532976 8422599 8253005 8030475
59512 8030475 7763432 7462511 7139298 6805016 6470481 6145932 5839519 5556191 5298703
59503 5298703 5069044 4868200 4695437 4549278 4429064 4334839 4266108 4221641 4200214 4200705 4221713
59492 4221713 4261911 4320571 4397075 4490244 4598874 4722521 4860833 5012196 5173707 5342114
59482 5342114 5513796 5683844 5846014 5993640 6120166 6219167 6284937 6313477 6302642 6251647
59472 6251647 6161252 6034436 5876130 5692025 5487854 5269526 5043044 4813866 4586488 4364505
59462 4364505 4150644 3946779 3754278 3574332 3407686 3254185 3113038 2983513 2865198
59453 2865198 2757817 2661195 2575236 2499578 2433306 2375277 2324690 2281244 2245006 2216189 2194687
59442 2194687 2179617 2169749 2164563 2164331 2168950 2177391 2188711 2202860 2219871 2238996 2259637 2282585
59430 2282585 2309237 2339711 2372826 2407927 2445543 2485587 2525593 2561686 2591634 2616857 2641505
59419 2641505 2669644 2703351 2743146 2789478 2843140 2904518 2973140 3047822 3126470 3205824 3282693
59408 3282693 3356226 3428505 3502668 3581051 3665280 3757013 3857709 3968245 4089413 4222404
59398 4222404 4368433 4528516 4703972 4896300 5106049 5332673 5576077 5837419 6117766
59389 6117766 6417083 6735576 7075133 7438331 7826711 8240865 8680852 9144481 9625309
59380 9625309 10113656 10599521 11073650 11526847 11950605 12339202 12690357 13004001 13281653
59371 13281653 13526826 13744101 13936594 14104590 14246394 14359076 14437718 14474771 14461049 14387379
59361 14387379 14245712 14030022 13737392 13368830 12929683 12430028 11884445 11310204 10724518
59352 10724518 10142687 9577444 9038485 8532151 8062143 7630753 7239094 6886399 6569960
59343 6569960 6286001 6030338 5798437 5585760 5388386 5203132 5027377 4859392 4698729
59334 4698729 4545656 4400249 4262398 4132314 4010112 3894960 3785378 3680381 3579678
59325 3579678 3482821 3389067 3298252 3211181 3128929 3052242 2981664 2917694 2860638 2810733 2768465
59314 2768465 2734397 2708674 2690970 2680832 2677816 2681605 2692435 2711148 2738303 2773547 2816333 2866965
59302 2866965 2926319 2994799 3072053 3157417 3250165 3349830 3456859 3572410 3696666 3827685
59292 3827685 3962387 4097632 4229062 4349732 4451889 4530689 4585339 4616811 4625719 4612456
59282 4612456 4577893 4523129 4449309 4358256 4252929 4137084 4014818 3890224 3766783 3647018
59272 3647018 3533057 3427101 3330570 3243253 3164270 3093640 3031971 2979024 2933862 2896274 2866670
59261 2866670 2844544 2828348 2817220 2811767 2812871 2820744 2835411 2857139 2885958 2921515 2963595 3012081
59249 3012081 3066465 3126399 3192730 3266956 3349587 3440211 3539288 3648574 3769435 3902056 4046915
59238 4046915 4205924 4381392 4574766 4786930 5018853 5271194 5543916 5836696 6148875
59229 6148875 6478383 6821196 7171991 7524296 7869338 8195578 8490120 8740369 8934513
59220 8934513 9061972 9114951 9089798 8986887 8809841 8565226 8262361 7912854 7530382 7130330
59210 7130330 6727958 6335704 5962168 5613372 5293821 5006012 4750097 4524956 4329159
59201 4329159 4160630 4016327 3893071 3788218 3699184 3623076 3557459 3500940 3452489 3410743
59191 3410743 3374481 3343265 3317084 3295730 3278825 3265802 3255392 3245495 3233820 3218226 3196384
59180 3196384 3166002 3125878 3076202 3017655 2951098 2878456 2802914 2727429 2653600 2582374 2515044
59169 2515044 2452844 2396283 2345679 2301911 2265896 2237630 2216232 2200576 2189421 2181399 2175561 2171807
59157 2171807 2170434 2171553 2175277 2182198 2193362 2209910 2232635 2261292 2294174 2328932 2364048 2399094
59145 2399094 2433585 2466403 2496576 2523997 2549140 2572698 2595475 2617597 2637474 2652403 2660653
59134 2660653 2662250 2657519 2646021 2627599 2603532 2575854 2546190 2515986 2487288 2462500 2443678 2432411
59122 2432411 2429732 2435503 2448343 2466690 2489597 2516279 2545646 2576759 2609197 2642644 2676884 2712755
59110 2712755 2752258 2796885 2846224 2898748 2953542 3010702 3070543 3133021 3197783 3264512 3333471
59099 3333471 3405708 3482175 3562676 3646377 3733123 3823028 3914500 4003929 4087719 4163345 4227872
59088 4227872 4276937 4306417 4314277 4299997 4263396 4205382 4129097 4038997 3939034 3832373 3721993
59077 3721993 3610278 3498448 3387472 3279326 3176525 3080852 2993403 2915423 2848099 2791808
59067 2791808 2746502 2712676 2691199 2682349 2685565 2699689 2722556 2750373 2777986 2799550 2808866 2800343
59055 2800343 2771236 2723170 2660934 2589788 2514005 2436958 2361299 2289005 2221900 2162018 2111066
59044 2111066 2069886 2038793 2017820 2005865 2000053 1996788 1993297 1987791 1978871 1965702 1948596 1928689
59032 1928689 1907219 1885527 1865172 1847208 1831623 1818166 1807486 1800835 1798946 1801707 1808645 1819146
59020 1819146 1832574 1848738 1868065 1890832 1916595 1944667 1974648 2006072 2038135 2070361 2103025
59009 2103025 2136408 2170119 2203628 2236734 2268874 2298507 2323752 2343144 2355491 2360071 2357835 2351564
58997 2351564 2343942 2336079 2328534 2322643 2319454 2318030 2316142 2312312 2306101 2296881 2283699 2266405 2245967
58984 2245967 2223713 2201099 2180069 2162858 2151347 2146894 2150225 2160765 2176553 2195512 2216455 2238408
58972 2238408 2259781 2279148 2296162 2310777 2322283 2330271 2336043 2341839 2348913 2357367 2367320 2378990
58960 2378990 2391760 2404322 2415725 2425479 2432915 2437468 2439500 2440032 2439905 2440023 2442054 2447900 2458639 2474769
58946 2474769 2497044 2526032 2561096 2600776 2643882 2689223 2734600 2777264 2815561 2849482 2879945
58935 2879945 2908402 2936933 2967832 3003145 3045047 3095925 3157122 3228201 3308455 3398583 3499859
58924 3499859 3612388 3735653 3870292 4017773 4178564 4352236 4539304 4741481 4959974
58915 4959974 5194921 5446674 5716106 6003132 6305973 6622303 6950336 7288721 7636543
58906 7636543 7993974 8362334 8743309 9138604 9549961 9978182 10421445 10874808 11331128
58897 11331128 11781840 12217085 12626060 12997492 13319566 13580112 13768007 13874606 13893743
58888 13893743 13821610 13658232 13408926 13083255 12692761 12250245 11769800 11265117 10747080
58879 10747080 10223795 9702385 9189350 8689623 8207121 7746250 7311219 6903687 6522717
58870 6522717 6167409 5838133 5534949 5256459 5000922 4767200 4554044 4359622 4182452
58861 4182452 4021796 3876598 3744987 3625350 3517102 3419926 3333063 3255663 3187135 3126804
58851 3126804 3073950 3028326 2989944 2958342 2932853 2913517 2900667 2893622 2890943 2892187 2898362 2910494
58839 2910494 2928803 2953457 2984953 3023331 3068038 3118992 3177006 3242914 3317117 3400130 3492578
58828 3492578 3594311 3704273 3821393 3944983 4074484 4209946 4352840 4505318 4668683
58819 4668683 4843651 5031966 5236337 5458593 5699288 5959427 6241248 6546835 6877058
58810 6877058 7232182 7612173 8015801 8440467 8883289 9341176 9809284 10280287 10745428
58801 10745428 11195039 11617589 11999627 12327857 12590982 12779708 12886620 12907291 12841122 12690792
58791 12690792 12461689 12162230 11803673 11398626 10959730 10499363 10029234 9559519 9098707
58782 9098707 8654046 8230903 7831376 7454371 7097146 6756039 6426327 6103849 5788073
58773 5788073 5482794 5193201 4922948 4673940 4447137 4242417 4058605 3894581 3749899
58764 3749899 3624021 3515827 3424369 3349264 3290018 3245995 3217522 3206039 3212601 3237021 3278861
58753 3278861 3338267 3415202 3508278 3614235 3727294 3838622 3937528 4014001 4060055 4069746 4040301
58742 4040301 3974244 3879115 3764095 3637260 3505638 3375597 3251662 3135669 3027879 2928156
58732 2928156 2835695 2748793 2665775 2585509 2506720 2427859 2348202 2268210 2188507 2109586 2032831
58721 2032831 1960572 1894534 1835240 1783238 1739541 1704278 1676094 1653406 1634952 1618659 1601485
58710 1601485 1581321 1557954 1531691 1502601 1471936 1442669 1417190 1395294 1375207 1355531 1335391
58699 1335391 1313976 1291218 1268089 1245416 1223242 1202029 1183294 1168176 1156466 1147948 1143594 1144483
58687 1144483 1150627 1161908 1179125 1203034 1233090 1268088 1307199 1349633 1394224 1440267 1487910
58676 1487910 1536938 1586068 1634112 1680895 1726346 1769899 1811538 1852090 1891155 1925364 1949220
58665 1949220 1956795 1942559 1902934 1839058 1757404 1666543 1573682 1484249 1402422 1330232 1267189
58654 1267189 1212268 1165540 1127016 1095369 1069201 1048484 1033426 1023081 1016531 1014229 1016574 1022116
58642 1022116 1028753 1035913 1043979 1052435 1060252 1067577 1075444 1084257 1093900 1104816 1117661 1132347 1148709
58629 1148709 1167604 1190066 1215847 1244060 1274833 1309156 1347520 1389838 1436346 1487570 1543867
58618 1543867 1605921 1675143 1752590 1838029 1930940 2031788 2141433 2259998 2387200 2522884
58608 2522884 2666139 2814536 2965158 3115441 3262056 3399965 3523859 3629710 3713945 3772448
58598 3772448 3802199 3803464 3779242 3733306 3670040 3595174 3514850 3434015 3356603 3286403 3226335
58587 3226335 3177307 3138888 3110632 3092011 3082155 3081023 3090109 3110990 3144104 3190132 3251356 3330084
58575 3330084 3426498 3539154 3666030 3802698 3939774 4063664 4159431 4212409 4209622 4143782
58565 4143782 4017231 3840951 3629640 3398170 3160738 2929744 2713922 2518100 2344587
58556 2344587 2193782 2063842 1951235 1852003 1762230 1678439 1598902 1524186 1455369 1392231 1333955
58545 1333955 1280467 1231779 1187035 1145778 1109202 1078483 1052510 1028931 1006892 987166 970090
58534 970090 954989 941291 928799 917208 906625 898068 892262 888537 886052 885234 886777 890222 895035
58521 895035 902165 912869 926808 942876 961111 982242 1006256 1033165 1064235 1100538 1141093 1184191
58509 1184191 1229777 1278676 1330472 1384412 1441755 1505014 1575315 1652494 1737220 1830707 1932322
58498 1932322 2039105 2147089 2251296 2345245 2422943 2481519 2520468 2539055 2536245 2512284 2467903
58487 2467903 2402542 2315890 2211095 2094347 1971467 1846898 1725323 1611378 1507347 1413219
58477 1413219 1329111 1255629 1191914 1135622 1085262 1040831 1002049 967786 937379 910869 887893
58466 887893 867801 850728 837029 825968 816436 808363 801779 795204 786900 777131 767255 757332 746733
58453 746733 736307 727534 720107 712804 706254 702328 701141 701096 701541 702829 704110 703791 702120 700815 700214
58438 700214 699210 697771 696854 696017 693861 690855 689023 688756 688604 688274 689049 691010 692592 693302 694366 696377
58422 696377 698783 701875 706750 713001 718926 724191 729804 735432 739372 741350 742628 743238 741912 738949
58408 738949 736295 734400 731854 728524 726163 725395 724832 723701 722666 721685 719848 717724 717023 717572 717527 716939
58392 716939 717978 721123 724365 726869 730219 735174 740422 745587 752365 761478 771300 780556 789616 798147
58378 798147 804459 808293 811538 815197 818414 821316 825703 831785 837274 841086 845071 850747 857116 863118
58364 863118 869592 877321 885525 893529 901667 909633 916321 922085 928508 935314 940311 943126 945980 949985
58350 949985 953828 957023 961194 966961 972838 978457 985745 995556 1006208 1016697 1028300 1041713 1055645
58337 1055645 1069591 1084929 1101952 1118863 1135098 1152624 1172650 1193973 1215657 1238208 1260989
58326 1260989 1281807 1300226 1318043 1335404 1349981 1361037 1370678 1379869 1387091 1392311 1398362 1406732
58314 1406732 1415786 1424791 1435952 1450741 1467917 1486707 1508170 1531926 1555596 1579119 1605690 1636883
58302 1636883 1670991 1707609 1749296 1796967 1848356 1903119 1964811 2035725 2114390 2200337 2296545
58291 2296545 2404989 2524714 2656667 2805270 2972382 3154539 3348544 3554133 3767647
58282 3767647 3978017 4172284 4340471 4472566 4557173 4588012 4567946 4503780 4402151 4273303
58272 4273303 4132460 3992326 3858256 3733710 3624659 3534637 3461189 3401790 3358254 3331280
58262 3331280 3316348 3309667 3312944 3327864 3351285 3380446 3417477 3464064 3517056 3573874 3636672 3706782
58250 3706782 3780974 3857823 3941446 4034083 4131440 4230401 4334621 4447225 4565026 4685642
58240 4685642 4813146 4950612 5094315 5241551 5396928 5564587 5741785 5926692 6124558
58231 6124558 6339247 6566920 6805369 7061095 7339582 7637432 7952120 8290356 8658413
58222 8658413 9053732 9474956 9930357 10427163 10962957 11537463 12162026 12847489 13594573
58213 13594573 14407226 15303216 16300132 17404648 18628724 20002933 21561242 23329231
58205 23329231 25343855 27670726 30388642 33577428 37339858 41814917 47145376 53445391
58197 53445391 60812451 69345115 79136556 90301030 103057994 117777750 134932521
58190 134932521 155059338 178798640 206841950 239622999 276865664 317178102 357680090
58183 357680090 393773959 419691689 430343453 423723461 402049809 370591915 335165603
58176 335165603 300202901 268225234 240119896 215517186 193288303 172309905 152118607
58169 152118607 132970724 115399636 99787807 86243374 74669014 64850739 56535133
58162 56535133 49493632 43538256 38499172 34219587 30572792 27460254 24792048 22486744
58154 22486744 20486018 18749266 17234501 15898992 14713543 13659584 12714951 11856372
58146 11856372 11071817 10356611 9700925 9093490 8533255 8024491 7563489 7141234 6755057
58137 6755057 6406182 6089417 5796457 5526314 5282231 5061315 4856951 4668004 4495741
58128 4495741 4334609 4175766 4017441 3863211 3712982 3564509 3421206 3289432 3169804
58119 3169804 3059066 2958327 2871535 2797820 2733101 2677536 2634118 2601845 2577554 2562767 2561644
58108 2561644 2573709 2595268 2626117 2667587 2714846 2757498 2786836 2796950 2780958 2733521 2656988
58097 2656988 2559467 2447458 2325234 2199453 2077845 1963598 1856221 1757047 1668769 1590684
58087 1590684 1519784 1455855 1400509 1352221 1307403 1265596 1228609 1195403 1162909 1131237 1103049
58076 1103049 1078255 1054208 1030738 1010169 992590 975673 959006 944171 930661 916079 900371
58065 900371 885829 872969 860371 848375 838897 831594 824096 816086 809439 804267 798404 790932 782823
58052 782823 774146 763928 752785 742499 733065 723132 713058 704526 697536 690834 684765 680565 677435
58039 677435 673633 669977 668906 670506 672847 675751 680704 687379 693860 700189 708097 717314 725722 733355
58025 733355 742711 754863 768657 784132 803379 827522 855964 889092 928556 974376 1024859 1079996
58013 1079996 1141923 1211305 1286037 1363996 1443986 1523024 1595546 1656565 1703602 1735116 1749811
58002 1749811 1748556 1734627 1711040 1679390 1641589 1600271 1556755 1510883 1463644 1417927 1376131
57991 1376131 1339266 1309023 1288364 1278927 1279565 1288167 1303056 1321996 1341827 1359978 1374692 1383137
57979 1383137 1381266 1366559 1339597 1302409 1256920 1205690 1152439 1100739 1052951 1010635 974750
57968 974750 945187 921460 903988 893483 889132 889036 892518 900313 912346 927052 943136 960257 977553
57955 977553 993119 1005469 1014197 1018993 1019417 1015879 1009476 1000754 989951 978305 967593 958472 950878
57942 950878 945859 945105 948696 955240 964102 975222 986475 993591 993444 985626 970315 946839 915354
57929 915354 878177 838312 797818 758182 720823 686510 655418 628167 605543 587030 571161
57918 571161 557626 547439 540722 536046 532423 530296 530039 531111 533175 536318 539572 540947 539711 537075
57904 537075 533990 529941 524702 519611 516106 514340 514035 515243 517460 519469 520959 522931 525722 528246
57890 528246 530223 533615 540477 550510 562007 574137 587079 600825 615166 630260 646085 661703
57878 661703 675836 687751 697120 703654 707316 708159 705603 698775 687961 674673 659856 643168 624539
57865 624539 605166 586145 567287 548264 530072 514378 502075 493202 487585 484844 484433 486341 491190
57852 491190 499128 509286 520724 533131 546138 558795 570247 580206 588348 594083 597334 598662 598129
57839 598129 594941 588683 580078 570065 559029 547340 535701 524474 513593 503534 495305 489040
57827 489040 483786 479260 476683 477219 480728 486859 496247 509718 527160 548059 572302 599790 630139
57814 630139 663538 700932 742513 786811 832011 877275 922103 965549 1007068 1047062 1085284
57803 1085284 1119364 1146006 1163205 1170473 1167799 1155647 1135586 1109845 1080304 1048397 1015263 981211
57791 981211 945617 908132 869512 830650 791634 752623 714820 679444 646298 614423 583701
57780 583701 554836 528267 504120 482747 464174 447306 430790 414564 399687 386890 376212
57769 376212 367782 361917 358378 356323 355106 354556 354654 355517 357496 360666 364428 368268 372679 378667 386586
57754 386586 396152 407329 420350 434829 449608 463609 476413 488007 498437 507674 515511 521737
57742 521737 526689 531390 536752 542866 549376 556150 563168 570167 576943 583809 591291 599664 609157 620286
57728 620286 633502 648763 665799 684409 704195 724524 745307 767297 791015 815800 840517
57717 840517 864904 889799 916570 946934 982670 1024627 1072259 1124939 1183461 1249551 1324231
57706 1324231 1407439 1499016 1599134 1707855 1825026 1950571 2084169 2224656 2370267 2519121
57696 2519121 2668448 2813215 2946396 3060977 3151414 3213438 3243725 3240628 3205117 3140675 3052364
57685 3052364 2945925 2827242 2702038 2575673 2452830 2337070 2230784 2135785 2053883 1986768
57675 1986768 1935595 1901082 1884083 1886001 1908721 1954093 2022978 2113917 2221590 2334992 2436351
57664 2436351 2503520 2517562 2471806 2375114 2246434 2105803 1968686 1845002 1739884 1654569
57654 1654569 1588003 1538730 1505620 1487558 1483516 1493022 1515918 1551632 1599205 1657915 1727304 1806689
57642 1806689 1895318 1992969 2099750 2215135 2337497 2464428 2592948 2719297 2838883 2946506
57632 2946506 3036549 3103512 3143117 3153119 3132989 3083357 3006308 2905753 2786671 2654020 2512799
57621 2512799 2368539 2226444 2089717 1959309 1835444 1718820 1610361 1510570 1419435 1336519
57611 1336519 1260980 1191932 1128929 1071815 1020171 973322 930833 892456 857655 825821 797062
57600 797062 772212 751661 734535 719235 704591 690418 677162 665156 654201 643889 634252 625712
57588 625712 618256 611264 604551 599036 595719 594373 594020 594333 595751 598343 601540 605010 608991 613600 618628
57573 618628 624192 630829 638604 646727 654395 661567 668718 676389 685245 696096 709486 725529 744233
57560 744233 765673 789880 817036 847854 883201 923250 967574 1016200 1069965 1129643 1195394
57549 1195394 1267318 1345878 1431275 1522900 1619873 1721662 1827656 1936273 2044767 2149611
57539 2149611 2246760 2331858 2400675 2449417 2474881 2475068 2450106 2402268 2334809 2251105 2155007 2051207
57527 2051207 1944298 1837528 1732853 1631990 1536864 1449058 1369237 1297174 1232150 1173450
57517 1173450 1120750 1074066 1033283 997953 967665 942296 921664 905202 892330 882869 876773 873598
57505 873598 872561 873021 874717 877816 883017 891340 903380 918937 937775 960472 987971 1020452 1057301
57492 1057301 1098272 1144128 1195973 1254428 1319621 1391485 1469668 1553541 1642602 1736604 1834800
57481 1834800 1935191 2034806 2130548 2219233 2296735 2357681 2396661 2410108 2397271 2359647 2299763
57470 2299763 2220494 2125248 2018249 1904118 1786961 1669935 1555633 1446446 1344169 1249471
57460 1249471 1162149 1081916 1008647 942021 881472 826713 777852 734777 696776 663064 633241
57449 633241 606867 583008 560795 540172 521500 504601 488847 474120 460864 449129 438274
57438 438274 427859 418113 409240 400929 392991 385797 379569 373819 368091 362744 358273 354302 350057 345582
57424 345582 341615 338392 335437 332593 330397 329193 328562 327948 327299 326756 326158 325271 324222 323377 322977 323056 323521
57407 323521 324141 324637 324933 325145 325352 325618 326315 327976 330615 333413 335384 336237 336463 336694 337138 337593 337908
57390 337908 338347 339404 341206 343309 345196 346717 347818 348171 347557 346455 345744 345848 346596 347818 349537 351645
57374 351645 353931 356520 359723 363351 366793 369940 373428 377721 382567 387684 393455 400407 408463 417145
57360 417145 426282 436079 446755 458436 471178 484795 498852 512960 526711 539245 549483 557250
57348 557250 563569 569363 574420 578370 582131 587331 594376 602041 609096 615543 621952 628393 634555 640484
57334 640484 646605 653198 660311 668215 677616 689208 703038 718392 734416 750884 768304 787315
57322 787315 808166 830756 854829 879911 905386 930905 956548 982384 1008160 1033728 1059352
57311 1059352 1085012 1109577 1131185 1148442 1160868 1168315 1170558 1167515 1159480 1147028 1130976 1112361
57299 1112361 1092052 1070480 1048179 1026409 1006688 989704 975169 962688 952161 943441 936426 931613
57287 931613 929704 930362 932191 934434 937930 943815 951902 961023 970427 980089 990058 1000413 1011707 1024568
57273 1024568 1038761 1053213 1067061 1080272 1093282 1106499 1120176 1134304 1148614 1163094 1178408
57262 1178408 1195327 1213760 1232837 1251948 1271143 1290383 1309124 1327007 1344502 1362397 1380838
57251 1380838 1399208 1416886 1433892 1450931 1468995 1488776 1510196 1532447 1554609 1576283 1597774
57240 1597774 1619868 1643357 1668463 1694582 1720781 1746680 1772699 1799352 1826523 1853664 1880615
57229 1880615 1908027 1936887 1967651 1999871 2032696 2065804 2099740 2135277 2172549 2211013 2250107
57218 2250107 2289569 2329054 2367829 2405200 2441194 2476570 2512010 2547357 2581649 2613936 2644002
57207 2644002 2672237 2699012 2724490 2749112 2773880 2799844 2827482 2856765 2887574 2919814 2953399
57196 2953399 2988521 3025679 3065033 3105872 3147237 3188925 3231425 3275018 3319522 3364819 3410920
57185 3410920 3457456 3503849 3550183 3597208 3645190 3693389 3741054 3788308 3835649 3883178 3930835
57174 3930835 3978827 4027140 4075042 4121818 4167777 4213830 4260216 4306262 4351299 4395076 4437257
57163 4437257 4477192 4514564 4549923 4584292 4618400 4652323 4685594 4717464 4747200 4774183 4797751
57152 4797751 4817180 4832122 4843049 4850990 4856811 4860875 4863302 4864281 4864147 4863525 4863585 4866107 4873091 4886072
57138 4886072 4905551 4931062 4962015 4998278 5039304 5082356 5122194 5153349 5172915 5181117 5179836 5171270
57126 5171270 5157667 5141140 5123111 5104293 5085485 5068064 5053442 5042354 5034863 5030759 5029661 5031064
57114 5031064 5034818 5041692 5053356 5071881 5099372 5137906 5189336 5254913 5335418 5432312 5549277
57103 5549277 5692986 5872552 6098469 6382042 6735473 7172186 7707177 8357176 9139894
57094 9139894 10072019 11167098 12434742 13880884 15507360 17310127 19276949 21384460
57086 21384460 23593727 25846470 28068446 30184372 32138646 33907736 35493987 36905010
57078 36905010 38134166 39154567 39925444 40400952 40536409 40296398 39667914 38670428 37351092
57069 37351092 35766067 33963329 31979939 29850961 27618198 25331980 23047443 20818441
57061 20818441 18691071 16699346 14865039 13200034 11707818 10384014 9218280 8197379
57053 8197379 7306917 6531443 5855290 5264567 4747942 4295522 3898041 3547567 3238023
57044 3238023 2964356 2721713 2505856 2313746 2143206 1992303 1859190 1741949 1638264
57035 1638264 1545758 1462897 1389122 1323887 1266115 1214895 1170126 1132118 1100913 1076240 1057842
57024 1057842 1045685 1040253 1042834 1055274 1079386 1116756 1168769 1236164 1318206 1411788 1509604 1597732
57012 1597732 1656459 1667528 1623920 1533607 1414063 1283478 1155554 1038594 936080 847990
57002 847990 773106 710712 660136 619643 586879 560160 538561 521184 507214 496412 488672 483137
56990 483137 478469 473967 469837 466499 464196 463266 464218 467454 473121 480898 489378 495874 497560 493096 483042
56975 483042 468946 452334 434373 415960 398013 381727 368268 357959 350084 343824 339165 336659
56963 336659 336713 339547 345454 354601 366799 381920 400263 421937 445918 470010 491433 507136 514181
56950 514181 510921 498255 479428 458471 438674 421834 408171 396951 387744 381146 378048 378436 381399
56937 381399 386221 392994 402189 414137 429035 447033 468105 491975 518025 544768 569065 586172
56925 586172 591234 581595 558329 525635 488467 450371 413316 378808 348291 322380 300586 282167
56913 282167 266804 254182 243575 234362 226457 219803 213899 208371 203517 199741 196806 194186 191856
56900 191856 190180 189348 189462 190721 192944 195280 197160 199273 202833 208060 214170 220788 228639 238801
56886 238801 251942 268274 287437 308004 327428 342780 351604 352642 346480 335590 323041 310859
56874 310859 299704 289910 282212 277412 275873 277530 282095 289145 298372 309922 324354 342344 364636
56861 364636 392093 425359 464335 507978 554077 598609 635618 658856 664490 652717 627235 593564
56849 593564 557359 523092 493359 469147 450707 438190 431753 431464 437202 448573 465146 487065
56837 487065 515305 551111 595373 648695 711509 783099 859935 934851 997882 1038538 1049039
56826 1049039 1027395 978364 911194 835787 760029 689168 626137 571966 526518 489420 460503
56815 460503 439632 426547 420932 422548 431447 448284 474153 509768 554849 608284 668093 730230
56803 730230 787442 830418 851292 846994 820174 777579 727330 676606 630514 591942 561753 539181
56791 539181 522804 511592 504954 501929 501146 501956 505028 511367 521292 534849 552511 574579 599980
56778 599980 626028 648838 663571 665343 651583 623893 587001 545852 504003 463958 427451 394987
56766 394987 366018 340051 317168 297464 280682 266580 255052 245659 237536 229988 222799 215934
56754 215934 209425 203628 199102 195989 193857 192224 190946 190064 189611 189551 189587 189082 187636 185732 184433 184347
56738 184347 185158 186127 186735 186916 186969 187249 187803 188479 189524 191717 195597 200940 207347 214832 223360 232401
56722 232401 241591 251431 262533 274518 286395 297669 308264 317657 325093 330541 334547 337256 338472
56709 338472 338616 338626 338857 338980 339104 340057 342228 344904 347125 348624 349743 350976 352808 355435 358418 360963
56693 360963 362581 363156 362584 360946 358842 356856 354760 351953 348500 344878 340791 335210 327748 319163 310390
56678 310390 301898 294120 287595 282381 278038 274383 271540 269144 266333 262832 259281 256205 253391 250531
56664 250531 247812 245554 243941 243298 243920 245436 247104 248970 251881 256044 260412 263910 266450 268273 269133
56649 269133 268817 267881 267215 267230 267909 269172 270753 272107 272876 273102 272714 271280 268616 265213 261734 258517
56633 258517 255824 254040 253181 252629 251834 251037 251001 252257 254798 258281 262273 266489 270891 275325 279206 281943
56617 281943 283669 285102 286761 288703 290819 292771 293855 293736 293241 293563 294677 295470 295514 295684 296685 298009
56601 298009 298848 299125 299036 298297 296601 294350 292262 290529 288797 286738 284345 281981 280352 280071 281017 282398
56585 282398 283456 283745 282815 280308 276508 272145 267519 262364 256644 250809 245136 239537 234199 229700 226249
56570 226249 223443 220974 218928 217228 215543 213975 213108 213087 213371 213666 214382 215837 217659 219322 220668 221612
56554 221612 221968 221819 221523 221133 220386 219328 218250 217021 215239 213086 211105 209073 206225 202813 200223
56539 200223 199006 197909 195530 192023 188471 185375 182551 179870 177352 174866 172312 169788 167345 165047
56525 165047 163418 163157 164141 165230 165250 163639 160281 155612 150945 147634 145709 144209 142857 142264 142480 142721
56509 142721 142845 143554 144706 144976 143953 143128 143854 145660 147535 149556 152032 154213 155224 155525 156193 157408
56493 157408 158742 160302 162459 164959 167352 169824 172679 175419 177265 178241 179031 180119 181712 183998 186795
56478 186795 189399 191351 192868 194159 194993 195375 195745 195992 195230 193279 191397 190695 190738 190526 189929 189125 187570
56461 187570 184765 181505 179216 178451 178840 179935 181190 181722 181103 180012 179304 178951 178634 178724 179709 181191 182382
56444 182382 183176 183883 184300 183932 182825 181511 180418 179837 179995 180709 181491 182402 184053 186405 188414 189481
56428 189481 190301 191754 193899 196611 200013 203545 205798 206207 205819 205528 204816 203244 201789 201298 200786 198810
56412 198810 195611 192393 189359 186047 182919 180985 180269 179995 179855 179833 179349 177930 176299 175594 175930 176771
56396 176771 178034 179665 180865 181034 180937 181632 182900 183916 184731 185708 186278 185822 185163 185577 186808 187643 187997
56379 187997 188788 190084 190956 190975 190431 189383 187940 187146 188003 189862 191265 192118 193481 195411 196744 197032
56363 197032 197048 197243 197236 197141 197964 200150 202805 204783 205830 206443 207308 208853 210753 212004 212114 211876 212288 213244
56345 213244 214088 214832 215805 216678 217008 217252 218159 219530 220602 221216 221644 221864 221994 222708 224152 225304 225631
56328 225631 226422 229004 232485 234914 235912 236450 236751 236366 235844 236321 237644 238701 239496 241053 243429 245550
56312 245550 247045 248556 250157 251129 251452 252066 253407 254933 256165 257058 257450 257310 257284 257809 258059 257107 255717
56295 255717 255526 256755 258208 259224 260124 261005 261663 262489 263988 265634 266671 267677 269741 272450 274384
56280 274384 275434 276942 279595 282771 285962 289396 293287 297696 302895 308711 314031 318268 322639 328523
56266 328523 335424 342240 349588 358759 369156 379203 389316 401527 416292 432033 447771 463873
56254 463873 480131 495392 509483 523511 537914 551946 565108 577316 587755 595519 601313 606480
56242 606480 610413 610980 607534 601423 593480 583219 570754 557372 543862 530110 516630 504619 494288
56229 494288 484898 476568 470337 466478 464474 464514 467119 471541 476470 481979 488718 495540 500266 502500 503376
56214 503376 502884 500067 495700 492030 489702 487484 485079 483595 483156 482751 482612 484050 486674 488503 489177
56199 489177 490385 492777 495170 497173 499862 503421 506821 510226 514984 520820 525859 529898 534792 541101
56185 541101 547366 553340 560806 570334 580245 589781 600427 613014 626353 639865 654885 672261 691191
56172 691191 711508 734486 760337 787407 814835 843683 874672 907428 942794 983243 1030121
56161 1030121 1083118 1143187 1213246 1295125 1388670 1494780 1616684 1757528 1919764 2107833
56151 2107833 2328365 2586335 2883218 3218767 3590312 3988279 4395139 4790430 5155494
56142 5155494 5474986 5739996 5953179 6127999 6280155 6419977 6551063 6670216 6766269 6823686
56132 6823686 6832224 6793421 6717991 6619694 6511097 6399031 6279476 6138135 5958047 5726557
56122 5726557 5437654 5094143 4710435 4309344 3912728 3535815 3189017 2879503 2608715
56113 2608715 2372693 2167630 1992421 1844817 1719524 1612288 1522021 1446958 1382719 1326427
56103 1326427 1278785 1239757 1205987 1174820 1147098 1123645 1102723 1083243 1066689 1053467 1041169
56092 1041169 1028720 1018398 1011479 1005884 1000382 996788 995643 994210 991509 990819 994206 998926 1002305 1005816
56078 1005816 1011199 1016845 1021367 1026530 1033431 1039954 1045154 1051809 1061414 1071121 1078943 1087410 1098628 1110376
56064 1110376 1120745 1131884 1145343 1158455 1169285 1180579 1194805 1209983 1224333 1240205 1259244
56053 1259244 1278546 1295902 1313974 1335044 1356740 1377331 1399856 1426201 1452500 1475537 1498445
56042 1498445 1524828 1552597 1579023 1606574 1638005 1670815 1702303 1734978 1771254 1808128 1843006
56031 1843006 1879371 1920455 1962816 2002545 2042364 2085999 2131131 2174849 2220550 2272150 2326770
56020 2326770 2380416 2435676 2496542 2560958 2625953 2694684 2770838 2851469 2933009 3018776 3112777
56009 3112777 3211895 3312113 3416398 3528154 3643100 3756170 3870142 3988740 4107885 4222984
55999 4222984 4338181 4458980 4582753 4706326 4835587 4977146 5127930 5283817 5450806
55990 5450806 5636228 5836729 6046901 6271911 6519327 6786655 7069836 7375549 7711766
55981 7711766 8075002 8460802 8877554 9335340 9831176 10360970 10935596 11568664 12259565
55972 12259565 13006577 13825210 14734752 15739289 16843123 18072853 19463191 21036014
55964 21036014 22818956 24871985 27272082 30090025 33412818 37372090 42115890 47764177
55956 47764177 54418144 62187545 71174724 81472246 93244225 106805049 122587054
55949 122587054 141085878 162910554 188805608 219409132 254799562 294064438 334892375
55942 334892375 373159586 403066167 418631801 416270222 396670532 364373167 325411368
55935 325411368 284949804 246320796 211257678 180426538 153831722 131148896 111976977
55928 111976977 95909730 82505234 71315535 61961141 54135602 47559749 41985276
55921 41985276 37231876 33173865 29694188 26683212 24067731 21801443 19830637 18097311
55913 18097311 16566569 15220712 14031875 12966088 12007486 11153249 10389720 9695942 9064879
55904 9064879 8498981 7989356 7519700 7086338 6694861 6340891 6012287 5706498 5428249
55895 5428249 5173483 4932104 4703462 4493617 4300416 4116099 3941336 3782218 3636392
55886 3636392 3496097 3361881 3239707 3127364 3017144 2909490 2811108 2721873 2636167 2554995
55876 2554995 2484466 2424084 2368333 2318102 2278802 2248258 2217479 2182414 2144779 2103044 2053522
55865 2053522 1999657 1949978 1907092 1867573 1831483 1802524 1779592 1757328 1734514 1713496 1692294
55854 1692294 1665786 1633955 1600819 1566204 1526571 1482857 1439398 1396056 1349345 1300327 1253550
55843 1253550 1209187 1164151 1119967 1081484 1048411 1015999 983677 955360 931630 909193 887901
55832 887901 870885 857714 844524 831012 820526 813332 806477 800152 797459 797826 797066 793894 790188
55819 790188 785125 775547 762010 748210 734564 718614 701460 687259 676406 665694 655292 649136
55807 649136 648161 649460 652500 659873 671470 684206 698245 717417 742656 770880 801093 835544
55795 835544 873620 910115 940685 963825 976730 974997 958106 930474 895989 855963 812810 770300
55783 770300 729068 686865 644309 605533 572144 541448 511791 484808 461222 439178 418167
55772 418167 400098 385120 370693 356116 343783 334650 326527 318046 310368 303807 296709 288749 281542
55759 281542 275056 267309 258485 251447 247257 244008 240920 239524 239978 240335 240586 243426 249808 257432 264631
55744 264631 271834 278260 281230 280212 277857 275749 272726 268506 265120 263345 261278 257877 254585 252207
55730 252207 249558 246445 244661 244777 245189 245367 246718 249239 250821 251109 252613 256769 262220 268191 276062
55715 276062 286150 296339 305477 315081 326209 337519 347771 357269 365533 370466 371171 368984 364740
55702 364740 357839 348799 339584 330460 319706 307368 296068 287033 278655 270143 263118 258306 254125
55689 254125 250090 248238 249553 252238 255230 260239 268523 278777 290115 304207 322455 343776 367036
55676 367036 392967 421919 452389 483555 516535 551171 584045 611595 632858 647613 654573 653523
55664 653523 646888 637147 624665 609778 594810 582304 573227 568432 569662 577431 589816 604710 621241
55651 621241 637887 651669 660666 665026 664165 655470 637426 611707 580686 545240 506497 467193
55639 467193 429447 393296 358981 328367 302459 279825 259224 241545 227464 215433 203850
55628 203850 193136 183966 175524 167185 159847 153963 148328 142378 137511 134534 132058 129021 126478 125148
55614 125148 123590 120714 117782 115916 113869 110306 106187 102871 99942 96937 95041 94892 94724 92954 90740
55599 90740 89798 89600 88929 88292 88497 88570 87468 86223 86100 86161 84921 82935 81544 80484 78924 77524 77354
55582 77354 78047 79017 81070 84854 89066 92230 94865 98069 101492 104718 108985 115330 122426 128429 133545
55567 133545 138639 142770 144462 144111 142904 140545 136316 131233 126885 123215 119547 116595 115235 114448 112817
55552 112817 111064 110855 112067 113511 115371 118601 122760 126778 131224 137553 145728 154584 163983 174625
55538 174625 186470 199275 213973 231516 251054 271142 292009 314792 339293 364375 389614
55527 389614 414528 436938 454231 465620 471314 470336 461310 444746 422478 395546 364724 332410
55515 332410 301583 273207 246618 221994 200380 181714 164967 149997 137356 126605 116754 107979
55503 107979 100988 95092 88879 82447 76970 72346 67403 62287 58552 56718 55566 54006 52043 49865
55489 49865 47554 45747 45109 45137 44698 43561 42200 40491 38047 35460 33774 33010 32497 32188 32324 32400 31971
55472 31971 31852 32946 34442 34865 34360 34241 34716 34832 34315 33738 33179 32359 31740 31891 32149 31482 30209 29258
55454 29258 28359 26798 25381 25578 27098 28307 28770 29370 30146 30166 29495 29219 29482 29406 29057 29559 31040 32348
55436 32348 33034 33900 35326 36752 37997 39465 40828 41163 40634 40421 40761 40663 39818 39184 39320 39642 39711 39848
55418 39848 40161 40294 40428 41188 42345 42847 42392 41725 41223 40476 39395 38489 37857 37129 36480 36462 36804 36613 35800
55399 35800 35068 34566 33880 33241 33305 33756 33568 32690 31995 31589 30718 29439 28778 28987 29161 28819 28382 27849 26553
55380 26553 24594 23096 22611 22588 22757 23622 25143 26232 26123 25167 23946 22686 21820 21961 22939 23851 24333
55363 24333 24721 24946 24469 23465 22828 22829 22950 23130 23839 24728 24691 23677 23093 23880 25351 26414 26843 26872 26544
55344 26544 25957 25327 24570 23616 23174 24098 25904 27058 26927 26338 25968 25364 23952 22019 20328 19472 19715
55327 19715 20595 20754 19180 16668 15098 15294 16567 18091 19492 20286 20176 19986 20890 22610 23632 23369
55311 23369 22807 22939 23855 25420 27426 28886 28626 26888 25151 24174 23497 22875 22740 23049 23118 22891 23023 23549
55293 23549 23819 23861 24297 24799 24250 22642 21158 20178 19003 17832 17996 19572 20695 20118 18766 17911 17480
55276 17480 17128 17347 18333 19140 19098 18797 18727 18222 16889 15819 16183 17554 18731 19341 19641 19638 19337 19127 19082
55257 19082 18647 17698 17031 17116 17336 17132 16924 17160 17502 17783 18733 20835 23318 25179 26371 27189 27353 26648
55239 26648 25679 25118 24862 24675 24910 25768 26584 26710 26508 26708 27329 27914 28251 28246 27681 26706 25966 25677 25213 24107
55219 24107 22827 22080 21992 22429 23349 24371 24737 24214 23352 22550 21674 20972 21326 23027 25177 26906 28332
55202 28332 29798 30948 31155 30157 27895 24610 21486 20126 20772 21907 22141 21546 20690 19564 18234 17537
55186 17537 18149 19610 20911 21428 20936 19588 18290 18080 18589 18217 16384 14476 13886 14302 14742 15128 15767
55169 15767 16257 15978 15042 13970 13073 12781 13671 15473 16924 17360 17561 18343 19305 19776 19995 20478 21122 21805
55151 21805 22975 24727 26177 26643 26694 27238 28449 30285 33030 36409 39254 41101 43186 46798 51521
55136 51521 56154 60460 64857 69275 73485 77779 82112 85280 86155 85123 83214 80504 76540 71675 66765
55121 66765 62043 57478 53721 51541 50661 50156 49608 49018 48155 46984 46157 46092 46049 45094 43447 41993 41013
55104 41013 40330 40040 40099 39816 38758 37594 37087 36917 36459 35955 35853 35746 35199 34917 35779 37332 38518 39292
55086 39292 40226 41116 41384 41335 41592 41773 41179 40382 40527 41389 41731 41463 41828 43344 45090 46230 47025 48035
55068 48035 49464 51459 54056 56714 58842 60743 63037 65264 66319 66318 66762 68498 70618 71814 71986 72117
55052 72117 73235 75862 79852 84513 89186 93768 98333 102457 105447 106999 107125 105804 103342 100716 98792
55037 98792 97415 95954 94363 93010 91851 90584 89249 87845 85809 82803 79575 77026 74812 71976
55023 71976 68625 65799 63873 62281 60757 59654 59055 58645 58486 58800 58938 57735 55182 52795 51949 52573
55007 52573 53631 54197 53893 52990 52250 52206 52649 53247 54349 56439 59084 61297 62774 63963 65153 66400
54991 66400 68149 70925 74470 78185 82328 87701 94156 100579 106583 113215 121527 131339 141859 152900
54977 152900 164998 178668 193830 209751 225464 240307 253788 264830 271802 273891 271934 267283
54965 267283 260423 251437 241077 230195 218547 205404 191219 177499 165096 153704 143080 133604
54953 133604 125457 118159 111276 104917 99365 94821 91521 89577 88748 88860 90177 92793 96008 99022 101946
54938 101946 105430 109760 115074 121987 131012 141754 153511 166090 178983 190422 198656 203752 206740
54925 206740 207310 203950 196224 185397 172716 158592 143673 129319 116555 105630 96788 90355 85845
54912 85845 82060 78316 74767 71557 68687 66541 65382 64453 62871 61235 60903 61745 62271 62090 62404 63701
54896 63701 64702 64316 63076 61872 60661 59295 58349 58142 57960 57093 55756 54332 52647 50715 49237 48589
54880 48589 48154 47306 46306 45635 45228 44896 44707 44423 43433 41740 40191 39224 38330 37221 36544 36778 37390 37803
54862 37803 38343 39478 40906 42109 43113 44060 44708 45000 45359 45917 46170 45978 46056 46809 47527 47477 47054 47102 47737
54843 47737 48585 49558 50645 51466 51761 51861 52148 52619 53461 55365 58615 62539 66523 70962 76506 83004
54827 83004 89916 97289 105612 115118 125848 137915 151048 164294 176751 188247 198717 207354 212974
54814 212974 214954 213420 208878 202057 193704 184185 173680 162926 153136 144885 137717 131138 125266 120130
54800 120130 115250 110436 106226 102955 100161 97466 95248 93826 92846 92262 93089 96180 100888 105884 110841
54785 110841 116403 122913 130148 138055 146914 156927 168245 181204 195927 211835 227950 243339
54773 243339 256987 267873 275698 281015 284168 284822 283154 280694 278971 277783 275767 272233 267514 261784
54759 261784 254603 245610 234925 222839 209714 196157 182755 169717 157151 145441 134903 125369
54747 125369 116641 109058 103067 98470 94592 90941 87285 83444 79535 76120 73583 71601 69702 67962
54733 67962 66700 65872 65299 65146 65543 66114 66423 66596 66919 67177 67026 66688 66620 66778 66848 66982 67640 68796 69926
54714 69926 70682 71049 70958 70243 68983 67530 66330 65925 66806 68916 71573 74148 76437 78129 78604 77814 76842
54697 76842 76807 77608 78399 78914 79554 80378 80908 80918 80873 81423 82826 84815 86819 88550 90555 93810 98475 103523
54679 103523 107959 111833 115591 119077 121962 124672 128032 132166 136459 140514 144534 148903 153890 159674
54665 159674 166296 173770 182470 192968 205163 218192 231668 246378 263135 281652 301336 322375
54653 322375 344851 367139 386465 400973 410247 413902 410917 400685 383925 362251 337503 311670
54641 311670 286709 263946 243827 226198 210516 195973 182088 169268 158385 149808 143183 137955
54629 137955 133629 129692 125884 122499 119925 117981 116213 114683 113809 113455 112820 111304 109060 106655 104626
54614 104626 103332 102763 102459 101974 101391 101016 100724 100023 98692 96926 95001 93208 91986 91556 91481 91067 90095
54597 90095 88801 87282 85492 83743 82619 82273 82235 81995 81450 80693 79730 78512 77045 75414 73794 72387
54581 72387 71324 70771 71081 72452 74374 75876 76482 76454 75992 74901 73372 72343 72454 73301 74360 75996
54565 75996 78752 82122 85005 87129 89187 91698 94494 97252 99854 102279 104737 107851 112185 117632
54551 117632 123686 130094 136841 143802 150991 158902 168052 178368 189447 201051 212796 223657 232456
54538 232456 238572 241806 241969 239199 234139 227122 217706 205774 192609 179919 168237 157183 146903
54525 146903 138110 130895 124576 118709 113402 108760 104850 102063 100594 99708 98427 96767 95447 94633 93957
54510 93957 93556 93891 94644 94956 94711 94467 94118 92920 90942 89202 88135 87215 86405 86587 87946 89187 89185 88402
54492 88402 87842 87468 86599 85231 83972 83071 82328 81787 81826 82560 83578 84222 83949 82614 80570 78386 76457
54475 76457 75088 74726 75598 77193 78663 79717 80589 81295 81611 81746 82182 82813 83064 82997 83348 84232 84758 84359
54457 84359 83612 83224 82992 82394 81567 81002 80765 80624 80585 80723 80818 80669 80528 80754 81213 81431 81221 80837 80606 80600
54437 80600 80613 80364 79786 79031 78068 76546 74491 72853 72688 73831 75096 75850 76628 77965 79379 79965 79542
54420 79542 78778 78464 78931 79983 81242 82689 84743 87480 90014 91357 91780 92588 94418 96480 97700 97933
54404 97933 97768 97688 97771 97825 97601 97142 96933 97262 97596 97182 96122 95082 94050 92333 89875 87562 85922 84495
54386 84495 82804 81068 79479 77750 75942 74901 75209 76336 77457 78409 79279 79759 79648 79384 79347 79182 78513
54369 78513 77819 77767 78159 78423 78808 80081 82163 84012 84965 85437 86040 86677 86888 86668 86522 86795 87263 87490
54351 87490 87477 87736 88574 89518 89766 89085 87879 86406 84467 81977 79319 76947 75096 74074 74273 75483
54335 75483 76636 76727 75792 74668 73921 73358 72490 71281 70398 70686 72197 73890 74565 74044 73068 72192 71315 70290
54317 70290 69321 68539 67715 66690 65679 64925 64403 64025 63794 63587 63103 62176 60917 59542 58357 57786 58014
54300 58014 58681 59283 59709 59943 59581 58361 56901 56053 55658 54827 53387 52071 51267 50674 50267 50509 51289 51725
54282 51725 51428 51006 50961 51109 51500 52808 55179 57671 59436 60561 61183 60837 59496 58311 58341 59301 60398
54265 60398 61628 63280 64901 65817 66213 66695 67224 67402 67385 67552 67608 67001 66018 65529 65790 66338 66899 67579 68206
54246 68206 68302 67795 67132 66665 66420 66419 66671 66878 66657 66094 65661 65582 65580 65312 64820 64531 64826 65435 65409 64083 62048
54225 62048 60584 60162 60233 60501 61383 62878 64085 64505 64898 66032 67421 68235 68720 69634 70790 71271 70840
54208 70840 70150 69690 69364 69021 68643 68046 67057 65895 64915 64111 63345 62748 62402 61968 61180 60370 59936 59617 58864
54189 58864 57653 56362 55158 54031 53094 52378 51686 51077 50964 51249 51033 49811 48266 47169 46213 44835
54173 44835 43488 43001 43210 43388 43619 44506 45718 46057 45011 43305 41936 41452 41993 43118 43777 43358 42677
54156 42677 42996 44283 45395 45818 46148 46872 47750 48486 49016 49053 48289 47204 46781 47240 47858 48112 48264 48756
54138 48756 49810 51594 53941 55955 56764 56666 56615 56661 55934 54185 52224 50690 49582 49219 50362 52871 55284
54121 55284 56451 56692 56823 56905 56607 56049 55533 54975 54213 53445 52907 52572 52539 53122 54136 54687 54173 52997 51795
54102 51795 50563 49129 47965 47789 48563 49532 50142 50444 50671 50864 50931 50829 50704 50937 51901 53547 55362 56846
54084 56846 57844 58372 58377 57789 56701 55431 54484 54335 55006 55975 56717 57161 57375 57140 56404 55906 56655 58773 61383
54065 61383 63634 65284 66261 66354 65548 64246 62970 62165 62234 63304 64978 66777 68765 71205 73718 75471
54049 75471 76284 76864 77800 78922 79875 80728 81817 83387 85559 88235 90951 93276 95363 97646 100045 102042
54033 102042 103568 105198 107413 110239 113619 117498 121495 125205 128865 133014 137413 141118 143779 146002
54019 146002 148162 149760 150408 150634 151060 151457 151256 150554 149984 149835 149830 149567 148820 147570 145986 144224 142083
54002 142083 139144 135320 131013 126689 122645 119172 116445 114186 111939 109712 107887 106429 104775 102577
53988 102577 100048 97510 95208 93546 92811 92572 92063 91225 90593 90071 88855 86881 85339 85139 85732 86078
53972 86078 86011 85953 85880 85422 84581 83682 82880 82211 81835 81718 81416 80640 79793 79569 80235 81594 83272 84766 85628
53953 85628 85981 86504 87593 88959 90305 91898 94087 96756 99674 102918 106481 109928 113017 116374 121007
53938 121007 127185 134126 140664 146087 150566 154822 159102 162528 163980 163550 162426 161338 160018 158393
53924 158393 157261 157270 158129 159461 161552 164542 167636 170068 172219 174919 178166 181463 184956 189222 194175
53909 194175 199170 204095 209477 215466 221423 226542 230339 232584 233348 233082 232266 231045 229540 228181 227183
53894 227183 226018 224016 221282 218383 215327 211567 206970 202106 197527 193288 189234 185255 181144 176630
53880 176630 171697 166636 161764 157252 153170 149491 146170 143345 141219 139636 138114 136466 134925 133423
53866 133423 131335 128381 125174 122305 119458 116165 112901 110556 109128 107862 106482 105388 104655 103702 102084
53851 102084 99946 97634 95537 94261 94138 94390 93592 91297 88645 86970 86383 86041 85357 84417 83475 82605
53835 82605 81865 81472 81638 82229 82726 82683 82312 82338 83122 84143 84653 84605 84567 84895 85448 86064 86837 87831 88893 89912
53815 89912 91054 92563 94393 96114 97268 97911 98732 100336 102433 104159 105326 106808 109412 112910 116628
53800 116628 120428 124427 128194 131125 133509 136436 140461 144938 148791 151455 153019 153990 155097 156870
53786 156870 159065 160757 161218 160598 159678 159129 159034 158940 158251 156666 154304 151492 148600 146026 143951 141951
53770 141951 139270 135791 132402 130018 128512 126982 124811 122007 118860 115869 113823 113177 113223 112485 110187
53755 110187 106969 103998 101720 99682 97338 94735 92429 90899 90143 89872 89913 90216 90532 90491 90076 89608 89129
53738 89129 88235 86760 85138 83774 82509 81167 80180 80178 81200 82767 84393 85583 85713 84601 83019 82049
53722 82049 82000 82367 82640 82654 82413 82169 82546 83964 85942 87478 88091 88067 87787 87371 86923 86665 86822 87654 89436
53703 89436 92008 94587 96456 97623 98386 98612 98156 97703 98371 100527 103600 106984 110370 113364 115600 117308
53687 117308 119030 120687 121744 122410 123760 126332 129385 132025 134377 137066 140062 142742 144858 146899
53673 146899 149536 153058 157275 161767 166261 170842 175664 180470 184648 187891 190592 193400 196552 199741
53659 199741 202552 204914 207114 209372 211463 212904 213497 213464 213115 212748 212898 214037 215774 216984 217198 217224
53643 217224 217826 218434 217982 216524 215041 213987 213030 212012 211160 210368 209285 208137 207458 207002 205940 204306
53627 204306 203095 202589 201756 199894 197851 196834 196815 196910 196680 196175 195219 193639 192021 191323 191703 192380 192746
53610 192746 193024 193644 194427 194787 194640 194773 196105 198663 201519 203826 205646 207542 209715 211969 214310 217006
53594 217006 220108 223399 226802 230413 234207 238165 242548 247482 252385 256555 260306 264693 270018 275385
53580 275385 279982 284033 288151 292489 296941 301555 306260 310757 315119 319945 325493 331180 336404 341331
53566 341331 346297 351003 354928 358157 361101 363632 365192 365633 365377 364835 364200 363736 363696 363834 363367 361635
53550 361635 358668 355070 351534 348462 345933 343866 342089 340148 337396 333646 329616 326238 323514 320593
53536 320593 317037 313375 310193 307315 304260 301027 297988 295413 293534 292659 292785 293363 293815 293992 293861 293226
53520 293226 292288 291970 293014 294979 296769 297990 299155 300663 302291 303859 305763 308541 312281 316748 321854
53505 321854 327736 334402 341511 348628 355716 363351 372295 382796 394426 406607 419112 431998 445369
53492 445369 459391 474294 490083 506394 522991 540327 559358 580683 604005 628472 653499
53481 653499 679270 706448 735329 765215 794671 822448 848339 873341 899079 926796 956640
53470 956640 988029 1020820 1055803 1093775 1134474 1176912 1220409 1264629 1308711 1351212 1391044
53459 1391044 1427874 1461464 1491316 1517272 1539878 1559870 1577730 1594066 1609883 1626115 1643305
53448 1643305 1662025 1683053 1706625 1731836 1757238 1781877 1805451 1827804 1848635 1867453 1883487
53437 1883487 1895787 1903697 1907018 1905652 1899490 1888895 1874846 1858192 1839067 1817316 1793179 1767118
53425 1767118 1739188 1708991 1676221 1641098 1604515 1567812 1532079 1497405 1463013 1428200 1392807
53414 1392807 1356715 1319496 1280941 1241581 1202423 1164543 1129080 1097034 1068652 1043463 1021253
53403 1021253 1002504 987537 975770 966384 959220 954609 952819 954205 959346 968255 979861 993050 1007974
53390 1007974 1025568 1046014 1068484 1092297 1117560 1144576 1173249 1203203 1234011 1265256 1296825
53379 1296825 1329145 1362827 1398128 1435179 1474536 1517059 1563350 1613746 1668587 1727853 1790593
53368 1790593 1855423 1921726 1989858 2060173 2132429 2206340 2282134 2360214 2440527 2522439 2604917
53357 2604917 2686704 2766617 2843968 2918617 2990600 3059880 3126513 3190884 3253697 3315807 3377963
53346 3377963 3440565 3503752 3567776 3633020 3699374 3765776 3830559 3891850 3947103 3992415 4023059
53335 4023059 4035070 4026387 3996897 3948134 3883137 3805972 3720746 3630721 3538061 3443922 3348680
53324 3348680 3252406 3155455 3058616 2962636 2867734 2773652 2680116 2587119 2494712 2402619 2310291
53313 2310291 2217553 2125136 2034403 1946587 1862471 1782532 1706884 1635173 1567161 1503605 1445968
53302 1445968 1394990 1350060 1310343 1275946 1247465 1224872 1207365 1193944 1183475 1174481 1165621 1156462
53290 1156462 1147415 1138997 1131443 1124878 1119368 1114910 1111659 1109952 1109732 1110210 1110610 1111119 1112685 1116083 1121519
53275 1121519 1128928 1138036 1148293 1159293 1171360 1185307 1201647 1220264 1240657 1262152 1284160 1306749
53263 1306749 1330816 1357226 1385962 1416605 1449333 1484713 1522542 1561665 1601010 1640178 1678979
53252 1678979 1717196 1755280 1794777 1837408 1883539 1931581 1978808 2022816 2062353 2096911 2125800
53241 2125800 2148136 2163757 2173445 2177699 2175736 2166214 2148530 2122856 2089463 2048907 2002617 1952282
53229 1952282 1898704 1842039 1783153 1723825 1665510 1608728 1553904 1501941 1453622 1409000 1367646
53218 1367646 1328838 1291288 1253345 1213892 1172596 1129043 1082337 1032030 979026 925084 871793
53207 871793 820353 771915 727512 687680 652441 621548 594562 570934 550292 532536 517523
53196 517523 504854 494070 484777 476449 468371 460036 451492 443164 435377 427993 420296 411347 400785
53183 400785 389315 378102 367674 357689 347688 337623 327662 317987 308998 301235 294816 289228 283840
53170 283840 278349 272571 266169 258944 251201 243567 236485 230005 223957 218220 212858 207982 203462 198954
53156 198954 194409 190390 187595 186136 185540 185268 184903 184047 182527 180648 178797 176853 174449 171795 169677
53141 169677 168559 168112 167724 167027 165892 164339 162626 161080 159754 158576 157743 157466 157321 156459 154606 152360
53125 152360 150364 148728 147432 146735 146717 146806 146180 144525 142255 140123 138703 138032 137679 137321 137110 137197 137196 136693
53107 136693 136151 136599 138344 140628 142712 144623 146607 148553 150318 152107 154080 155990 157571 158936 160271
53092 160271 161498 162463 163070 162941 161418 158308 154347 150510 147057 143529 139540 135323 131599 128981 127372
53077 127372 125937 123929 121449 119145 117323 115900 115030 115009 115435 115223 113807 111758 109951 108642 107663 106959
53061 106959 106502 106081 105496 104719 103739 102636 101818 101677 101961 102170 102550 103883 106147 108273 109531 110184 110462
53044 110462 109970 108719 107665 107442 107487 107232 107151 107557 107386 105572 103001 101527 101403 101226 100279 99345 99029 98815
53026 98815 98289 97996 98338 98600 97872 96250 94403 92554 90581 88657 87062 85643 84125 82801 82270 82554
53010 82554 82976 83010 82776 82601 82420 81885 80921 79896 79216 78873 78490 77744 76676 75588 74765 74350 74318 74476 74542
52991 74542 74403 74333 74826 76117 77843 79261 79962 80348 81178 82534 83577 83592 83021 83012 84099 85750 87141 87855
52973 87855 87883 87607 87892 89509 92136 94421 95394 95382 95301 95561 96070 96762 97655 98654 99797 101358 103369 105353
52955 105353 106967 108527 110438 112430 113933 114961 116002 117124 117828 117819 117519 117641 118514 119819 120807 120889 120181
52938 120181 119388 119003 118859 118603 118277 118104 118035 117899 117789 117898 118135 118255 118218 118060 117610 116663 115355 114071 113150
52919 113150 112840 113304 114371 115535 116478 117375 118427 119431 120075 120302 120108 119392 118350 117624 117636 118132 118771
52902 118771 119625 120621 121063 120459 119382 118796 118828 118963 119077 119362 119530 119080 118344 118307 119284 120560 121464 122042 122498
52883 122498 122786 122974 123387 124058 124620 124867 124889 124531 123441 121953 121232 122055 123893 125571 126485 126833 126962 126978
52865 126978 126917 127050 127981 130258 133682 137158 139651 141158 142269 142901 142260 140125 137379 134980 133024 131238
52849 131238 129763 128858 128294 127571 126542 125355 124023 122498 120994 119851 119171 118922 119296 120550 122525 124640
52833 124640 126374 127538 128089 128016 127491 126913 126605 126541 126516 126497 126607 126715 126324 125128 123541 122310 121611 120927
52815 120927 119882 118691 117562 116239 114561 113023 112156 111687 110982 110101 109641 109646 109476 108854 108241 107923 107420
52798 107420 106238 104711 103606 103234 103311 103417 103241 102619 101667 100734 99950 98974 97474 95696 94302 93654 93458
52781 93458 93087 92140 90695 89069 87426 85700 83980 82726 82345 82717 83353 83939 84369 84402 83792 82829 82309
52764 82309 82721 83761 84788 85478 85911 86257 86589 86848 86860 86496 85828 85004 84044 82967 81999 81348 80815 80008
52746 80008 78924 77911 77015 75803 74014 71989 70287 69103 68249 67387 66215 64713 63375 62868 63233 63691
52730 63691 63423 62355 61050 60047 59539 59420 59452 59423 59245 58858 58142 57183 56519 56727 57686 58628 59020 59024 58995 58966
52710 58966 58835 58688 58662 58760 59095 59997 61565 63338 64712 65536 66055 66485 66949 67642 68679 69867 70916 71806
52692 71806 72672 73387 73620 73409 73344 73921 74911 75642 75887 76165 77040 78390 79696 80882 82386 84340 86180
52675 86180 87389 88175 88983 89647 89679 89190 88913 89242 89854 90471 91413 93100 95331 97445 99007 100120 101192
52658 101192 102592 104441 106629 109110 112116 115816 119674 122436 122978 121145 117705 113599 109338 105019
52644 105019 100786 97110 94451 92697 91238 89710 88386 87615 87235 86903 86693 86891 87374 87730 87894 88189
52628 88189 88736 89208 89197 88429 86782 84511 82378 81060 80488 80197 80193 80912 82321 83690 84362 84325 84000 83939 84651
52609 84651 86125 87507 87865 87320 86831 86820 86795 86447 86284 86795 87673 88329 88671 88940 89196 89406 89699 90212 90986
52590 90986 92206 94112 96489 98664 100241 101426 102447 103182 103593 103922 104161 103867 102953 102148 102191 102948 103703
52573 103703 104007 103852 103356 102621 101678 100434 98961 97870 97860 98794 99833 100564 101259 101883 101880 101385 101589 103160
52555 103160 105138 106234 106514 106845 107363 107531 107244 106793 106098 105032 104280 104716 105994 106825 106738 106520 106715 106705
52537 106705 105715 103976 102278 100897 99444 97524 95203 93004 91642 91494 92193 92905 93136 93077 93177 93610
52521 93610 94222 94815 95352 95933 96558 96991 97073 97116 97559 98104 97735 95994 93780 92380 92037 91993 91659 91123 90685
52502 90685 90490 90591 90932 91362 91999 93338 95452 97420 98193 97849 97328 97037 96498 95427 94346 93897 94137
52485 94137 94795 95727 96828 97880 98710 99277 99540 99558 99684 100209 100718 100346 98858 97115 96238 96601 97763 99036
52467 99036 99950 100498 101200 102714 105142 107805 109780 110596 110472 110096 110144 110752 111463 111831 111970 112237 112598 112726
52449 112726 112645 112778 113303 113864 114092 114053 114087 114462 115259 116346 117363 117992 118325 118766 119591 120747 121996 122948
52431 122948 123117 122354 121184 120371 120195 120508 121335 122827 124578 125630 125415 124307 123018 121906 121058 120618
52415 120618 120576 120518 119971 118977 118154 118211 119485 121709 124124 125981 127044 127567 127789 127718 127372 126890 126284 125389
52397 125389 124257 123347 123122 123544 124132 124392 124115 123452 122841 122760 123387 124423 125308 125619 125348 124894 124710 124863
52379 124863 125005 124840 124437 123962 123397 122834 122753 123522 124686 125279 124908 124189 123971 124490 125364 126029 126073 125508 124962
52360 124962 125300 126760 128626 129978 130609 130999 131538 132069 132272 132191 132196 132437 132597 132323 131811 131701 132421 133904
52342 133904 135957 138517 141390 144126 146447 148444 150077 150880 150642 150035 149938 150289 150254 149467 148483 147879 147547
52325 147547 147101 146551 146293 146702 147849 149318 150257 150046 149105 148666 149498 151172 152831 154286 155982 158077
52309 158077 160050 161337 162040 162849 164344 166561 169241 172301 175819 179595 183104 186092 188984 192416 196531
52294 196531 200997 205572 210336 215401 220683 225992 231208 236405 241900 248001 254568 261064 267214 273341
52280 273341 279835 286617 293510 300794 308928 317897 327289 336872 346670 356584 366378 375928 385143 393858
52266 393858 402192 410721 419858 429311 438675 448176 458149 468155 477483 486325 495492 505013 514046 522285
52252 522285 530429 538865 546846 553503 558943 563737 567933 571206 573623 575669 577661 579498 580859 581456
52238 581456 581330 580993 580980 581211 581169 580765 580478 580564 580711 580713 580939 581872 583655 586342 590102 594856 600212 606018
52220 606018 612499 619583 626662 633434 640416 648237 656826 665741 674833 684133 693501 702841 712335 721972
52206 721972 731178 739341 746405 752558 757724 761840 765322 768657 771716 773912 774930 774863 773802 771732 768782
52191 768782 765241 761378 757440 753550 749362 744065 737180 729172 721014 713307 706113 699300 692635 685684
52177 685684 678079 669885 661414 652825 644196 635852 628276 621670 615797 610228 604633 598982 593536 588522
52163 588522 583791 579107 574720 571187 568478 565853 562911 560231 558530 557648 556889 555933 554846 553522 551798
52148 551798 549971 548606 547900 547710 547996 548639 548938 547965 545566 542523 539621 536967 534312 531550 528662 525534
52132 525534 522170 518879 515958 513263 510305 506754 502756 498704 494797 490929 486934 482761 478352 473587
52118 473587 468591 463878 459819 456111 452223 448263 444849 442068 439228 435916 432755 430718 430077 430371 431036
52103 431036 431649 431917 431874 431937 432448 433295 434163 434929 435652 436556 438224 441382 446147 451855 457934 464523 471873
52086 471873 479611 487175 494638 502628 511595 521530 532185 543205 554345 565827 578159 591258 604271
52073 604271 616711 629266 642872 657417 672019 686212 700040 713313 725679 737369 749034
52062 749034 760764 771936 782076 791211 799300 805984 811177 815363 819063 822280 824608 825627 825184 823539
52048 823539 821138 817982 813479 807343 800323 793444 786694 779213 770739 762099 754130 746837 739816 732882
52034 732882 725994 719101 712418 706381 701014 695787 690440 685654 682486 681318 681599 682428 683181 683800 684776
52019 684776 686771 690045 694303 699133 704403 710147 716306 722800 729739 737267 745159 752712 759188 764412
52005 764412 768936 773488 778203 782421 785324 786691 787041 787079 786942 785884 782808 777303 770115 762329 754147
51990 754147 744901 734145 722088 708787 693641 676147 656753 636473 615978 595358 574407 552822
51978 552822 530581 508468 487731 468795 450887 433404 416956 402255 388618 374641 360071
51967 360071 345919 332816 320337 308088 296528 286331 277608 270042 263306 257150 251479 246496 242430
51954 242430 239107 236159 233555 231472 229808 228341 227219 226683 226431 225935 225225 224669 224115 223096 221881 221338
51938 221338 221547 221479 220367 218598 216885 215288 213562 211789 210057 207928 204806 200649 195961 191312 187080
51923 187080 183409 180165 177104 174147 171285 168317 165063 161802 158961 156365 153397 149972 146790 144470
51909 144470 142926 141710 140416 138637 136194 133620 131798 130883 130103 128874 127520 126668 126540 127082 128156
51894 128156 129252 129629 129183 128636 128465 128096 126668 124167 121424 119331 118415 118738 119788 120757 121255 121539 121904
51877 121904 122260 122509 122825 123230 123347 122889 122052 121261 120885 121318 122741 124654 126311 127797 129968 133021 136048
51860 136048 138484 141049 144539 148502 152032 155278 159184 164191 170171 177359 186369 197332 209831 223676
51846 223676 239069 256003 274075 292781 311260 327789 340189 346988 347849 342972 332649 317545
51834 317545 298984 278728 258522 239680 222800 207888 194907 183994 175059 167585 161171 155827
51822 155827 151399 147224 142943 139180 136687 135086 133277 130904 128597 126812 125230 123485 121764 120388
51808 120388 119267 118059 116533 114714 113020 112266 113049 114912 116477 116602 115321 113616 112508 112335 112593
51793 112593 112431 111480 110186 109181 108545 107946 107249 106541 105713 104597 103523 103236 104066 105539 106899 107710 107919
51776 107919 107724 107502 107595 107957 108192 108009 107504 106967 106569 106267 105906 105363 104636 103735 102589 101285 100388 100561
51758 100561 101645 102567 102492 101685 100883 100270 99639 99154 99177 99480 99376 98707 98082 98035 98476 99033 99475 99673 99587 99420
51738 99420 99491 99916 100701 101969 103656 105140 105861 106267 107447 109704 112137 113807 114645 114974 114838 114311 113904
51721 113904 114079 114664 115168 115389 115300 114685 113373 111642 109914 108164 106092 103784 101731 100199 98988 97922
51705 97922 97148 96759 96424 95704 94617 93685 93366 93595 93930 94046 94053 94389 95477 97453 100121 103179 106526 110248
51687 110248 114124 117227 118383 117203 114492 111498 108918 106763 104844 103067 101380 99781 98390 97295
51673 97295 96418 95690 95276 95375 95877 96486 97128 98008 99198 100366 100965 100659 99609 98424 97644 97230 96779 96258
51655 96258 96116 96439 96518 95752 94613 94062 94207 94246 93686 92954 92676 92975 93672 94631 95655 96475 97140 98098 99654
51636 99654 101657 103948 106723 110146 113855 117221 119989 122419 124928 127780 131011 134400 137532 140072
51622 140072 142019 143635 145171 146688 148035 148928 149092 148460 147307 146196 145685 145855 146071 145427 143632 141293
51606 141293 139230 137691 136450 135364 134513 133925 133462 132852 131572 129032 125295 121450 118695 117107 115777
51591 115777 114052 112107 110299 108686 107327 106496 106271 106280 106087 105496 104368 102617 100644 99309 99117 99686
51575 99686 100296 100641 100791 100762 100486 100055 99721 99782 100574 102250 104340 105879 106300 106009 105837 106182 106993 108195
51557 108195 109668 110982 111739 112269 113472 115812 118687 120979 122030 122027 121630 121429 121686 122332 123094 123687 124070
51540 124070 124558 125555 127057 128547 129552 130186 130947 132048 133264 134388 135526 136849 138258 139429 140057
51525 140057 140113 140079 140833 142904 145759 148244 149782 150822 151975 153223 154224 154889 155232 155042 154268 153557 153780
51508 153780 154969 156203 156696 156640 156756 157327 158010 158429 158563 158428 157685 155910 153209 150274 147688 145342 142721
51491 142721 139632 136404 133455 130900 128560 126138 123425 120554 117985 116030 114446 112834 111326 110449
51477 110449 110300 110308 109980 109436 108966 108488 107801 107052 106521 106044 105105 103500 101669 100270 99588 99361 98998 97947
51459 97947 95990 93408 90955 89556 89716 91003 92311 92866 92826 92654 92158 90730 88466 86418 85519 85716
51443 85716 86384 87121 87854 88614 89634 91350 93835 96376 97971 98186 97374 96237 95419 95243 95491 95630 95531
51426 95531 95755 96804 98327 99499 100027 100291 100553 100579 100201 99822 100063 101087 102459 103604 104241 104436 104380 104161
51408 104161 103807 103455 103328 103484 103720 103795 103566 102880 101549 99669 97755 96298 95310 94555 94135 94427 95399 96294
51390 96294 96263 95189 93711 92446 91432 90479 89794 89851 90537 90944 90382 89276 88542 88265 87679 86443 85126
51373 85126 84244 83562 82784 82266 82395 82784 82792 82470 82228 81825 80554 78459 76519 75451 74978 74532 74031 73626
51355 73626 73199 72584 71993 71818 72175 72908 73830 74661 74902 74217 72939 71969 72090 73388 75266 76896 77756 77900
51337 77900 77731 77504 77084 76253 75067 73766 72458 71156 70118 69841 70517 71653 72545 73137 74163 76190
51321 76190 78714 80491 80813 80206 79754 79978 80539 80855 80694 80239 79836 79782 80150 80645 80734 80051 78740 77368
51303 77368 76431 75937 75498 74807 73933 73058 72146 71090 70130 69792 70291 71238 72105 72732 73165 73290 72987 72536 72449
51284 72449 72846 73274 73321 73196 73589 75024 77421 80201 82749 84822 86592 88294 89878 91069 91704 91890
51268 91890 91863 91791 91763 91790 91736 91413 90903 90657 91004 91580 91597 90864 90262 90822 92405 93731 93816 93058 92674 93409 95088
51247 95088 97123 98992 100296 100836 100786 100602 100715 101377 102562 103784 104243 103744 103285 104125 106155 107855 108116
51230 108116 107551 107590 108752 110328 111508 112232 112978 114087 115354 116162 116101 115575 115501 116200 116822 116247 114370 112176
51212 112176 110656 110014 109860 109792 109649 109434 109127 108569 107593 106359 105392 105099 105322 105513 105281 104606 103651 102525
51194 102525 101235 99806 98451 97572 97352 97404 97163 96650 96456 96905 97753 98933 100910 103726 106236 107110 106470
51177 106470 105809 106314 107857 109597 110923 111625 111734 111558 111506 111627 111479 110606 108939 106742 104468 102647 101547
51160 101547 100792 99684 98073 96643 96161 96696 97723 98710 99420 99859 100189 100567 100946 101132 101129 101240 101685 102318
51142 102318 102913 103523 104347 105319 106092 106428 106450 106421 106355 105980 105090 103909 102966 102592 102650 102786 102793 102595 102094 101374
51122 101374 100958 101458 102868 104455 105496 105889 106007 106192 106619 107407 108561 109869 111119 112268 113242 113639
51106 113639 113076 111908 111237 111881 113459 114801 115162 114751 114107 113402 112606 111975 111963 112738 114019 115295 116050
51089 116050 115963 115261 114678 114711 115042 115155 115340 116386 118254 119800 120174 119907 120128 121140 122272 122875 122910 122732
51071 122732 122752 123269 124307 125635 127060 128626 130421 132438 134720 137302 139868 141920 143503 145321 147740
51056 147740 150226 152154 153617 154896 155683 155672 155460 155943 157008 157766 157955 158116 158315 157793 156239 154495 153411
51039 153411 152690 151522 149872 148468 147742 147357 146783 146004 145557 145988 147215 148482 149103 149252 149689 150737 151949
51022 151949 152873 153753 155186 157423 160224 163220 166165 169052 172131 175701 179758 183972 188073 192106 196306
51007 196306 200838 205694 210613 215215 219512 224278 230536 238619 247932 257644 267354 277149 287442 298819
50993 298819 311709 326176 342262 360412 381094 404141 429076 456113 486108 519294 554718
50982 554718 591321 628973 667984 708102 748624 789294 830444 872192 913808 953824 990581
50971 990581 1022795 1049923 1072128 1089837 1103327 1112605 1117469 1117699 1113453 1105495 1094792 1081966 1067422
50958 1067422 1051960 1036740 1022618 1009863 998520 988490 979244 970069 960777 951564 941975 930746
50946 930746 917086 901481 884732 866766 846914 824863 800704 774508 746542 717615 688553
50935 688553 659610 631014 603639 578263 554372 530766 507487 486165 468112 452861 439086
50924 439086 426260 414703 404412 394828 385812 378145 372605 368908 365998 363240 360879 359273 358185
50911 358185 357168 356295 355984 356245 356658 357115 358009 359487 361063 362308 363475 365034 366869 368432 369532 370666
50895 370666 372611 375884 380418 385514 390356 394834 399680 405643 412795 420885 429980 440302 451789 464388
50881 464388 478651 495467 515151 537239 561240 587267 615892 647698 683074 722259 765567
50870 765567 813685 867654 928257 995484 1068738 1147456 1231348 1320188 1413661 1511217 1611690
50859 1611690 1713152 1813505 1911138 2004669 2092108 2170731 2237908 2291819 2331457 2356462 2367201
50848 2367201 2364786 2350823 2327217 2296196 2260341 2222378 2184920 2150177 2119700 2094368 2074676
50837 2074676 2060771 2051949 2046309 2041341 2034869 2025203 2010571 1988981 1958883 1919755 1871960 1816278
50825 1816278 1753635 1685002 1611364 1533915 1454323 1374591 1296483 1221145 1149347 1082001 1020337
50814 1020337 965500 917877 876766 840832 809116 781621 758948 741577 729585 722732 720435 721843
50802 721843 726356 734012 745061 759176 775417 792980 811616 831234 851436 871537 890702 907855
50790 907855 921749 931423 936676 938034 936372 932508 926819 919034 908527 894997 878840 860836 841646
50777 841646 821731 801537 781414 761330 740951 720189 699629 680314 663175 648768 637377
50766 637377 629045 623434 620015 618636 619748 623873 631033 640993 653838 669949 689570 712871 740375
50753 740375 772788 810248 852226 898311 948704 1003843 1063987 1129271 1199610 1274233 1351756
50742 1351756 1430930 1510774 1589637 1664708 1732982 1792371 1841482 1878921 1903537 1915097 1914265 1902225
50730 1902225 1880912 1853098 1821407 1787285 1751429 1714877 1678921 1644323 1611538 1581587 1555594
50719 1555594 1533258 1512633 1491743 1469700 1446018 1419713 1389651 1355262 1316406 1273027 1225469
50708 1225469 1174870 1122772 1070458 1018920 969167 922244 879050 840293 806395 777270 752423
50697 752423 731522 714657 701929 693051 687656 685808 687971 694542 705473 720291 738462 759940
50685 759940 785403 815710 851035 890690 933801 979819 1028297 1078383 1128699 1177562 1223297
50674 1223297 1264598 1300709 1331215 1355746 1374109 1386525 1393347 1394607 1390277 1380958 1367771 1351384
50662 1351384 1331580 1307981 1280781 1250579 1217915 1183441 1148382 1114501 1083504 1056433 1033448
50651 1033448 1014161 998380 986513 979105 976125 977026 981338 988634 998006 1008268 1018884 1030135 1042114
50638 1042114 1054063 1065092 1075160 1085050 1095721 1107961 1122282 1138713 1156907 1176687 1198335
50627 1198335 1222195 1248244 1276066 1304675 1332215 1356443 1375964 1390560 1399987 1403073 1398555 1386295
50615 1386295 1367050 1341525 1310533 1275768 1239425 1202888 1166462 1130459 1095804 1063294 1032824
50604 1032824 1003704 975400 947622 919986 891983 863336 834299 805584 777926 751538 726017
50593 726017 700976 676775 654387 634488 616852 600652 585286 570869 558124 547789 539998 534168
50581 534168 529502 525514 522067 519151 516935 515906 516667 519529 524463 531373 540240 551057 563930 579275
50567 579275 597681 619401 644081 671084 700009 730856 763729 798423 834273 870364 905792
50556 905792 939701 971267 999982 1026023 1050128 1072964 1094756 1115616 1135916 1156084 1176177
50545 1176177 1195909 1215079 1233770 1252267 1270929 1290108 1310076 1331155 1354010 1379552 1408283
50534 1408283 1439857 1473486 1508566 1544533 1580304 1614406 1645772 1674021 1698757 1718881 1732883
50523 1732883 1739651 1738855 1730732 1715855 1695034 1669151 1638857 1604492 1566382 1525255 1482404 1439536
50511 1439536 1398408 1360429 1326380 1296476 1270727 1249123 1231309 1216145 1201957 1187411 1172068
50500 1172068 1156089 1139755 1123494 1108063 1094296 1082751 1073848 1068132 1065901 1066715 1069747 1074532 1080793
50487 1080793 1087452 1092392 1093423 1089100 1078530 1061094 1036836 1006777 972424 935160 896272 857101
50475 857101 818672 781422 745692 712214 681658 653955 628530 605168 584219 565985 550238
50464 550238 536363 523759 512176 501890 493448 487002 482027 477941 474741 472732 471758 471155 470406 469573
50450 469573 469129 469662 471661 475316 480529 487289 495861 506339 518243 531021 544788 560103 577123
50437 577123 595517 615296 637162 661729 688789 717715 748452 781823 818778 859421 902737
50426 902737 947335 992432 1038028 1084191 1130460 1176121 1220743 1264121 1305949 1345873 1383567
50415 1383567 1418235 1448222 1471767 1488216 1498017 1501496 1498203 1487575 1469660 1444921 1413830 1377032
50403 1377032 1335595 1290682 1243099 1193390 1142114 1089855 1037222 985166 935034 887968 844374
50392 844374 804259 767863 735556 707254 682393 660555 641766 626117 613533 604045 597861 594778
50380 594778 593840 594116 595758 599836 607022 616779 627931 639529 650919 661431 670594 678375 684604 688293
50366 688293 688159 683880 676249 666015 653292 638373 622343 606296 590435 574585 559212 545209
50354 545209 532845 521644 511289 502053 494288 487977 482858 478517 474356 469994 465780 462452 460168
50341 460168 458252 456110 453970 452560 452414 453668 456149 459427 462929 466186 468785 470234 470373 470074 471001
50326 471001 474321 479903 486966 495099 504321 514559 525600 537358 549741 562432 575229 588537
50314 588537 603033 618803 635202 651607 667934 684284 700469 716149 731144 745227 757690
50303 757690 767510 774193 778413 781604 784840 787960 789668 788398 783126 773541 759766 742131 721248
50290 721248 698128 674032 650075 626915 604743 583538 563395 544762 528388 514905 504272
50279 504272 495690 488233 481600 476199 472466 470270 468971 467915 466809 465734 464862 464134 463237 461951 460435
50264 460435 459025 457901 457144 456968 457436 458019 457880 456819 455560 454931 455109 455889 457229 459193 461620 464277
50248 464277 467168 470457 474273 478804 484313 490766 497688 504653 511585 518404 524870 531223 538427 547145
50234 547145 556858 566677 576659 587388 598478 608572 617004 624577 632380 640545 648630 656590 664880
50221 664880 673908 683723 693988 704092 713718 723444 734411 747162 761187 775738 790636 806125
50209 806125 822540 840408 860383 882583 906381 931355 958070 987500 1019914 1054847 1092041
50198 1092041 1131968 1175573 1223933 1278149 1339167 1407669 1484386 1570578 1668012 1778453 1903344
50187 1903344 2043913 2201366 2376874 2571244 2784286 3014039 3256223 3504239 3749716
50178 3749716 3983539 4197209 4384111 4540378 4665424 4762133 4835994 4892794 4936079 4966150
50168 4966150 4980578 4974786 4942321 4876055 4770604 4624355 4439719 4222332 3980308 3723323
50158 3723323 3461103 3201984 2952340 2716658 2497782 2297441 2116870 1956663 1815856
50149 1815856 1691767 1581423 1483092 1396188 1320067 1253452 1194845 1143006 1097032 1056329 1020431
50138 1020431 988651 960079 934130 910833 890314 872331 856685 843659 833452 825365 818141 811116
50126 811116 804533 798865 794276 790746 788156 786166 784467 783303 783477 785725 790205 796500 803809 811383
50112 811383 819176 828025 838710 850936 863714 876706 890660 906348 923650 941921 960897 980992
50100 980992 1002869 1026880 1052698 1079478 1106654 1134658 1164546 1196870 1231239 1267036 1304192
50089 1304192 1343111 1384240 1427919 1474287 1523151 1574380 1628748 1688153 1754604 1829219 1912451
50078 1912451 2005060 2108433 2224254 2354410 2501301 2667816 2856747 3070467 3311243 3581574
50068 3581574 3883946 4220089 4590058 4991154 5416873 5856617 6296859 6723363 7123484
50059 7123484 7487969 7812267 8097093 8347480 8570017 8769354 8945733 9094470 9207032
50050 9207032 9272793 9280911 9222270 9091366 8887970 8617847 8291731 7922672 7523265 7104354
50040 7104354 6675247 6244177 5818415 5404427 5008141 4634582 4286904 3966126 3672184
50031 3672184 3405098 3164867 2950675 2760729 2592797 2444529 2313407 2196904 2092885
50022 2092885 1999675 1915822 1840051 1771392 1709046 1652153 1599940 1551937 1507677 1466229 1426440
50011 1426440 1387666 1349955 1313483 1278236 1244291 1211979 1181531 1152823 1125692 1100254 1076754
50000 1076754 1055287 1035884 1018700 1003921 991562 981420 973137 966259 960318 954936 949860 944958
49988 944958 940287 936037 932217 928519 924805 921604 919725 919291 919560 919806 919986 920346 920849 921468 922819 925970
49972 925970 931485 938917 947299 956022 965302 976071 989546 1006669 1027754 1052589 1080967 1113110
49960 1113110 1149640 1191251 1238625 1292753 1355181 1427655 1511456 1607282 1715920 1838929 1978481
49949 1978481 2136704 2315276 2515353 2737299 2980135 3241086 3515354 3795922 4073569
49940 4073569 4337699 4578068 4786753 4959629 5096892 5202496 5282554 5343295 5389171 5421401
49930 5421401 5437015 5428957 5387667 5303679 5170292 4985573 4753282 4482207 4184060 3871221
49920 3871221 3555474 3247314 2954924 2683359 2435046 2211105 2011740 1835649 1680220
49911 1680220 1542973 1422420 1317243 1225357 1144458 1073080 1010419 955414 906712 863440 825261
49900 825261 791606 761438 733990 709199 687226 667856 650557 634752 619828 605270 591077
49889 591077 577820 565954 555231 545001 534923 525118 515796 507091 499131 491886 484944 477791 470470
49876 470470 463617 457706 452530 447633 442915 438440 433875 428691 422961 417551 413263 410096 407525 405143
49862 405143 402733 399957 396550 392896 389995 388584 388339 388136 387043 385045 382820 380960 379499 378183 377036
49847 377036 376377 376254 376154 375504 374345 373270 372764 372746 372745 372362 371624 371019 371107 371877 372481 371826 369517 366211 363093
49828 363093 361105 360505 360910 361753 362799 364233 366216 368502 370634 372355 373598 374332 374678 375007 375518 375777
49812 375777 375129 373602 372000 370984 370371 369475 367822 365403 362555 359753 357319 355160 352943 350568 348206
49797 348206 345861 343255 340327 337516 335299 333703 332512 331751 331653 332233 333168 334025 334458 334262 333431 332169
49781 332169 330725 329251 327857 326645 325646 324780 323988 323308 322890 323019 324033 325920 327966 329152 329060 328133
49765 328133 326970 325718 324384 323367 323209 323914 324844 325314 325174 324819 324798 325305 326006 326413 326522 326881 327871 329164
49747 329164 330058 330236 330012 329911 330270 331063 331935 332443 332475 332377 332474 332565 332156 331225 330530 330959 332583 334468 335571
49728 335571 335772 335834 336277 336627 336103 334833 333929 334387 336342 339306 342546 345130 346298 346199 345841 346038 346711
49711 346711 347363 347717 347630 347074 346646 347459 349848 352677 354642 355856 357370 359473 361412 362660 363469 364101
49695 364101 364392 364314 364297 364730 365732 367536 370422 374074 377667 380877 384193 387924 391563 394534 396952 399182
49679 399182 401185 402858 404534 406478 408227 409090 409092 408871 408872 409239 410307 412474 415525 418696 421510 424135
49663 424135 426853 429708 432748 436078 439458 442301 444424 446447 449152 452686 456717 461041 465639 470281
49649 470281 474552 478303 481760 485103 488286 491393 494838 498905 503245 507144 510340 513295 516575 520161
49635 520161 523625 526856 530361 534721 539904 545264 550190 554651 558997 563272 566897 569212 570376 571517
49621 571517 573813 577491 581865 586237 590522 594945 599523 604101 608746 613774 619347 625323 631571 638210
49607 638210 645353 652749 659973 667023 674464 682853 692126 701703 711100 720283 729555 739321 749859 761053
49593 761053 772367 783361 794293 805804 817970 830069 841589 853017 865165 877989 890660
49582 890660 902771 914936 928086 942528 957813 973213 988155 1002449 1016285 1029970 1043656
49571 1043656 1057445 1071539 1085935 1100094 1113388 1125913 1138380 1151135 1163823 1176174 1188485
49560 1188485 1200920 1212835 1223424 1232747 1241625 1250630 1259638 1268210 1276029 1283062 1289690 1296512 1303634
49547 1303634 1310344 1315942 1320723 1325592 1330852 1336011 1340730 1345253 1349781 1354163 1358497 1363316 1368728 1373972
49533 1373972 1378457 1382766 1387961 1394128 1400379 1406213 1412153 1418867 1426220 1433515 1440336 1446824 1453292 1459798
49519 1459798 1466079 1471804 1476907 1481528 1485558 1488370 1489306 1488404 1486307 1483416 1479474 1474126 1467559 1460306
49505 1460306 1452644 1444490 1435764 1426544 1416848 1406581 1395792 1384805 1373921 1363082 1351948 1340370
49493 1340370 1328676 1317387 1306620 1295853 1284446 1272411 1260494 1249420 1239203 1229287 1219217
49482 1219217 1208921 1198429 1187672 1176716 1165946 1155763 1146175 1136935 1128026 1119738 1112171 1104958
49470 1104958 1097711 1090508 1083686 1077237 1070840 1064568 1059143 1055192 1052472 1050076 1047283 1043947 1040228 1036389
49456 1036389 1032930 1030507 1029449 1029513 1030336 1032020 1035064 1039557 1044473 1047783 1047546 1043228 1036073 1028069 1020502
49441 1020502 1013552 1007076 1001366 996938 993932 992029 990826 990081 989634 989347 989118 988923 988859 989212 990339 992391
49425 992391 995233 998657 1002490 1006428 1010020 1013046 1015801 1018893 1022855 1028021 1034487 1041908 1049570 1057024
49411 1057024 1064577 1072849 1081906 1091141 1099994 1108505 1117045 1125720 1134132 1141734 1148401 1154688 1161351 1168523
49397 1168523 1175517 1181555 1186473 1190563 1194103 1197397 1201004 1205386 1210329 1215084 1219079 1222282 1225068 1228124
49383 1228124 1232268 1237812 1244158 1250462 1256634 1263235 1270542 1278380 1286794 1296116 1306227 1316479 1326693
49370 1326693 1337574 1349790 1363186 1377220 1391686 1406628 1422008 1437838 1454115 1470306 1485491
49359 1485491 1499530 1513549 1528646 1544617 1560644 1576758 1593817 1612306 1632033 1652859 1674855
49348 1674855 1697650 1720289 1741869 1761851 1779864 1795928 1810933 1826173 1842196 1858675 1875472
49337 1875472 1893075 1911692 1930666 1949346 1968008 1987263 2006843 2025627 2042819 2058629 2073779
49326 2073779 2088710 2103369 2117429 2130521 2142382 2153015 2162738 2171973 2180879 2189184 2196449 2202537
49314 2202537 2207707 2212294 2216512 2220609 2224880 2229255 2233120 2235912 2237746 2239155 2240381 2241340 2242119 2242978 2243836
49299 2243836 2244337 2244562 2245205 2246756 2248863 2250810 2252390 2254038 2256290 2259362 2263119 2267213 2271199 2274674 2277376
49284 2277376 2279259 2280549 2281592 2282481 2282942 2282764 2282116 2281042 2278813 2274341 2267271 2258199 2247746 2235934
49270 2235934 2222616 2207950 2192109 2174948 2156299 2136271 2114918 2092023 2067671 2042780 2018581
49259 2018581 1995622 1973583 1951948 1930486 1909196 1888158 1867578 1847853 1829573 1813369 1799517
49248 1799517 1787494 1776235 1765035 1754001 1743480 1733352 1723117 1712275 1700298 1686558 1670826
49237 1670826 1653595 1635377 1615859 1594381 1571212 1547702 1525079 1503663 1483485 1465002 1448745
49226 1448745 1434588 1421823 1409823 1398303 1387132 1376296 1366114 1357165 1349790 1343757 1338509 1333665
49214 1333665 1329251 1325434 1322169 1319221 1316481 1314114 1312264 1310720 1309013 1306796 1304066 1301109 1298300 1295783
49200 1295783 1293130 1289476 1284327 1278227 1272336 1267290 1262752 1258077 1253070 1247918 1242724 1237493 1232461 1228092
49186 1228092 1224634 1221837 1219156 1216217 1213112 1210295 1208162 1206701 1205594 1204687 1204234 1204599 1205840 1207681 1209814
49171 1209814 1212134 1214823 1218375 1223394 1230147 1238296 1247329 1257255 1268612 1281706 1296097 1311052 1326384
49158 1326384 1342632 1360539 1380514 1402537 1426230 1450856 1475316 1498298 1518568 1535378 1548817
49147 1548817 1559743 1569150 1577526 1584948 1591715 1598595 1606335 1615059 1624237 1633112 1641081 1647983 1654164 1660157
49133 1660157 1666099 1671589 1676173 1679748 1682317 1683657 1683591 1682401 1680570 1678228 1675265 1671857 1668329 1664427
49119 1664427 1659273 1652386 1644360 1636187 1628229 1620209 1612010 1603978 1596461 1589431 1582704 1576286 1570373 1565168
49105 1565168 1560846 1557643 1555802 1555385 1556149 1557770 1560262 1564093 1569712 1576956 1585087 1593470 1602002 1610835
49091 1610835 1619939 1629150 1638538 1648429 1659021 1670091 1681114 1691626 1701511 1710948 1720033 1728411 1735461
49078 1735461 1740961 1745371 1749282 1752656 1754912 1755744 1755550 1754890 1753720 1751365 1747263 1741575 1735065 1728421 1721730
49063 1721730 1714536 1706305 1696778 1685982 1674098 1661439 1648408 1635214 1621558 1606777 1590509 1573226
49051 1573226 1555960 1539444 1523584 1507769 1491516 1474797 1457958 1441576 1426333 1412780 1401066
49040 1401066 1390880 1381571 1372296 1362469 1352420 1343449 1336690 1331933 1328068 1324718 1322765 1323040 1325182 1328307
49026 1328307 1332159 1336939 1342461 1348305 1354597 1361800 1369782 1377862 1385829 1394209 1403429 1413398 1424043 1435466
49012 1435466 1447315 1458761 1469548 1480469 1492357 1505147 1518377 1532040 1546305 1560843 1575137
49001 1575137 1589298 1603990 1619640 1636219 1653672 1672143 1691752 1712493 1734241 1756518 1778414
48990 1778414 1799192 1818959 1838468 1858301 1878493 1898857 1919345 1940151 1961745 1984783 2009726
48979 2009726 2036546 2064884 2094367 2124690 2155624 2187177 2219451 2252131 2284393 2315555 2345467
48968 2345467 2373885 2399959 2422897 2442901 2460840 2477270 2492458 2507206 2522680 2539143 2555446
48957 2555446 2570135 2582635 2593069 2601349 2606827 2608722 2606689 2601127 2593054 2583593 2573479 2563114 2552975
48944 2552975 2543680 2535675 2529125 2524081 2520473 2517883 2515666 2513452 2511409 2509955 2509374 2509669 2510646 2512154 2514358
48929 2514358 2517605 2521809 2526199 2530056 2533612 2537817 2543308 2549988 2557534 2565864 2575083 2585382 2597116
48916 2597116 2610671 2626260 2644158 2664990 2689249 2716522 2745716 2776200 2808219 2842172 2878045
48905 2878045 2915762 2955439 2996921 3039612 3083215 3128294 3175664 3225564 3277820 3332494 3389821
48894 3389821 3449669 3511613 3575568 3641964 3711230 3783318 3857834 3934420 4013017 4093772 4176659
48883 4176659 4261134 4346323 4431673 4517292 4603448 4689831 4775485 4859454 4941335 5021197 5099016
48872 5099016 5174284 5246287 5314805 5380395 5443869 5505608 5565525 5623405 5678938 5731589 5780833
48861 5780833 5826416 5867873 5903912 5932905 5954169 5968238 5975780 5976813 5971175 5959132 5941066 5917039
48849 5917039 5887217 5852466 5814006 5772511 5727803 5679265 5626321 5568753 5506800 5440900 5371290
48838 5371290 5298152 5222202 5144698 5066648 4988437 4910413 4833224 4757133 4681514 4605723 4530221
48827 4530221 4456287 4384881 4316366 4251182 4190158 4134080 4083318 4037764 3996801 3959502 3925394
48816 3925394 3894933 3868833 3847029 3828771 3813558 3801454 3792522 3786585 3783587 3783690 3786875 3792905 3801793
48803 3801793 3813908 3829436 3848130 3869678 3893942 3920638 3949196 3979154 4010494 4043420 4078065
48792 4078065 4114527 4152974 4193505 4235981 4280099 4325544 4372131 4419922 4469136 4519806 4571636
48781 4571636 4624410 4678354 4733880 4791151 4850211 4911329 4974763 5040354 5107764 5176932 5247783
48770 5247783 5319708 5392036 5464909 5538887 5613640 5687781 5760155 5830446 5898316 5962953 6023943
48759 6023943 6081663 6136017 6185596 6229046 6266814 6300564 6331206 6358402 6381780 6401537 6417817
48748 6417817 6430542 6440147 6447682 6453778 6458194 6460681 6461531 6460614 6456418 6446738 6430163 6406287 6374579
48735 6374579 6333727 6282338 6220066 6147895 6067503 5980435 5887812 5790664 5690419 5588897 5487758
48724 5487758 5388050 5290346 5195050 5102391 5012224 4924126 4837761 4753072 4670147 4589025 4509746
48713 4509746 4432616 4358411 4288113 4222132 4159732 4099559 4040977 3984755 3932168 3883623 3838417
48702 3838417 3795677 3755169 3717268 3682598 3651767 3625020 3601903 3581521 3563272 3547121 3533123
48691 3533123 3521142 3511262 3503959 3499351 3496628 3494880 3494295 3495876 3499929 3505548 3511763 3518546 3526249 3534677
48677 3534677 3543328 3552321 3562381 3573869 3586319 3598983 3611465 3623675 3635548 3647095 3658574 3670230
48665 3670230 3681815 3692460 3701226 3707874 3713120 3718090 3723530 3729526 3735813 3742103 3748151 3753860 3759514
48652 3759514 3765704 3772817 3780811 3789696 3799992 3812379 3826923 3842903 3859285 3875111 3889614 3902410
48640 3902410 3913672 3923813 3932880 3940375 3945607 3948013 3947258 3943295 3936191 3925520 3910061 3888721 3861814
48627 3861814 3830808 3796637 3758905 3717215 3672693 3627505 3583108 3539631 3496844 3454980 3414400
48616 3414400 3375022 3336506 3298826 3262325 3227220 3193194 3159577 3125980 3092758 3060735 3030463
48605 3030463 3001995 2975451 2951362 2929966 2910420 2891341 2872260 2854043 2837752 2823545 2810922
$$ [...]
##END NTUPLES=NMR SPECTRUM
##END=
