##TITLE=NES1048_10961_9270454_ZMJJLuvnOD
##JCAMPDX= 6.0         $$ Bruker NMR JCAMP-DX V2.0
##DATA TYPE= NMR SPECTRUM
##DATA CLASS= NTUPLES
##ORIGIN= BRUKER
##OWNER= Administrator
$$ 1.72 TOPSPIN		Version 2.1
$$ 2015-07-11 18:16:02.644 -0700  Administrator@X
$$ Compression mode = diff/dup
##.OBSERVE FREQUENCY= 400.02188249412
##.OBSERVE NUCLEUS= ^1H
##.ACQUISITION MODE= SIMULTANEOUS (DQD)
##.ACQUISITION SCHEME= undefined
##.AVERAGES= 64
##.DIGITISER RES= 22
##SPECTROMETER/DATA SYSTEM= spect
##.PULSE SEQUENCE= noesygpps1d.comp
##.SOLVENT NAME= COFFEE_meoh
##.SHIFT REFERENCE= INTERNAL, COFFEE_meoh, 1, 14.96349
##AUDIT TRAIL= $$ (NUMBER, WHEN, WHO, WHERE, PROCESS, VERSION, WHAT)
$$ ##TITLE= Audit trail, TOPSPIN		Version 2.1
$$ ##JCAMPDX= 5.01
$$ ##ORIGIN= Bruker BioSpin GmbH
$$ ##OWNER= Administrator
$$ $$ E:\/data/COFFEE/nmr/NES1048_10961_9270454_ZMJJLuvnOD/12/pdata/1/auditp.txt
$$ ##AUDIT TRAIL=  $$ (NUMBER, WHEN, WHO, WHERE, PROCESS, VERSION, WHAT)
(   1,<2015-07-11 18:15:57.144 -0700>,<Administrator>,<X>,<go>,<TOPSPIN 2.1>,
      <created by zg
	started at 2015-07-11 18:04:27.394 -0700,
	POWCHK enabled, PULCHK disabled,
       configuration hash MD5:
       21 0F 79 D6 B3 7B B4 F6 88 20 88 DB 03 48 BD 9F
       data hash MD5: 64K
       98 33 20 B4 6B 6B BF E4 A9 DC 69 29 78 93 26 62>)
(   2,<2015-07-11 18:16:00.519 -0700>,<Administrator>,<X>,<proc1d>,<TOPSPIN 2.1>,
      <Start of raw data processing
       efp LB = 0.3 FT_mod = 6 PKNL = 1 PHC0 = 0 PHC1 = 0 SI = 128K 
       data hash MD5: 128K
       18 9D EF CA B6 80 8E 5F FC 87 49 6B 10 43 CC C4>)
(   3,<2015-07-11 18:16:01.425 -0700>,<Administrator>,<X>,<proc1d>,<TOPSPIN 2.1>,
      <pk PHC0 = -84.11133 PHC1 = 0 
       data hash MD5: 128K
       27 13 E2 14 32 7F 61 0F 44 0F D0 F6 D1 01 A9 32>)
(   4,<2015-07-11 18:16:01.816 -0700>,<Administrator>,<X>,<proc1d>,<TOPSPIN 2.1>,
      <abs ABSG = 1 
       data hash MD5: 128K
       49 E8 BD 40 A1 3C D4 DF FC 49 88 39 0A A1 7E 71>)
(   5,<2015-07-11 18:16:01.894 -0700>,<Administrator>,<X>,<proc1d>,<TOPSPIN 2.1>,
      <abs ABSG = 2 
       data hash MD5: 128K
       DB 10 30 19 8F B5 FD 95 0F 73 EF 7C FB A6 1B 65>)
(   6,<2015-07-11 18:16:01.988 -0700>,<Administrator>,<X>,<proc1d>,<TOPSPIN 2.1>,
      <abs ABSG = 3 
       data hash MD5: 128K
       25 BB 78 86 A6 CD A3 A2 FB 91 79 2D 78 7B BE 3E>)
(   7,<2015-07-11 18:16:02.081 -0700>,<Administrator>,<X>,<proc1d>,<TOPSPIN 2.1>,
      <abs ABSG = 4 
       data hash MD5: 128K
       3F B2 CF C2 E1 B6 99 73 BF 64 B9 B8 5A B8 C3 67>)
(   8,<2015-07-11 18:16:02.222 -0700>,<Administrator>,<X>,<proc1d>,<TOPSPIN 2.1>,
      <abs ABSG = 5 
       data hash MD5: 128K
       B8 E8 57 F0 93 59 74 C2 11 FE 87 B0 F7 D9 58 D2>)
$$ ##END=
$$ 
$$ $$ hash MD5
$$ $$ 87 73 31 E3 D9 42 ED 04 2E 72 1A 8B BD EA 49 79
##$RELAX= 
##$RELAX= 
##$RELAX= 
##$RELAX= 
##$RELAX= 
##$RELAX= 
##$RELAX= 
##$RELAX= 
$$ Bruker specific parameters
$$ --------------------------
##$DU= <E:\>
##$EXPNO= 12
$$ [...]
##$TP07= 0
##$TPNAME0= <>
##$TPNAME1= <>
##$TPNAME2= <>
##$TPNAME3= <>
##$TPNAME4= <>
##$TPNAME5= <>
##$TPNAME6= <>
##$TPNAME7= <>
##$TPOAL= (0..7)
0.5 0.5 0.5 0.5 0.5 0.5 0.5 0.5
##$TPOFFS= (0..7)
0 0 0 0 0 0 0 0
##$TUNHIN= 0
##$TUNHOUT= 0
##$TUNXOUT= 0
##$USERA1= <user>
##$USERA2= <user>
##$USERA3= <user>
##$USERA4= <user>
##$USERA5= <user>
##$V9= 5
##$VALIST= <valist>
##$VCLIST= <CCCCCCCCCCCCCCC>
##$VD= 0
##$VDLIST= <DDDDDDDDDDDDDDD>
##$VPLIST= <PPPPPPPPPPPPPPP>
##$VTLIST= <TTTTTTTTTTTTTTT>
##$WBST= 2048
##$WBSW= 25
##$XGAIN= (0..3)
0 0 0 0
##$XL= 0
##$YL= 0
##$YMAX_a= 7098117
##$YMIN_a= -15021142
##$ZGOPTNS= <>
##$ZL1= 120
##$ZL2= 120
##$ZL3= 120
##$ZL4= 120
##$ABSF1= 14.96349
##$ABSF2= -5.594692
##$ABSG= 5
##$ABSL= 3
##$ALPHA= 0
##$AQORDER= 0
##$ASSFAC= 0
##$ASSFACI= 0
##$ASSFACX= 0
##$ASSWID= 0
##$AUNMP= <proc_prof1d_extract.lims>
##$AXLEFT= 0
##$AXNAME= <>
##$AXNUC= <1H>
##$AXRIGHT= 0
##$AXTYPE= 0
##$AXUNIT= <>
##$AZFE= 0.1
##$AZFW= 0.1
##$BCFW= 0
##$BC_mod= 0
##$BYTORDP= 0
##$COROFFS= 0
##$CY= 15
##$DATMOD= 1
##$DC= 0
##$DFILT= <>
##$DTYPP= 0
##$F1P= 0
##$F2P= 0
##$FCOR= 0.5
##$FTSIZE= 131072
##$FT_mod= 6
##$GAMMA= 0
##$GB= 0
##$INTBC= 1
##$INTSCL= 1
##$ISEN= 128
##$LB= 0.3
##$LEV0= 0
##$LPBIN= 0
##$MAXI= 10000
##$MC2= 0
##$MEAN= 0
##$ME_mod= 0
##$MI= 0
##$NCOEF= 0
##$NC_proc= -2
##$NLEV= 6
##$NOISF1= 0
##$NOISF2= 0
##$NSP= 0
##$NTH_PI= 0
##$NZP= 0
##$OFFSET= 14.96349
##$PC= 1
##$PHC0= -84.11133
##$PHC1= 0
##$PH_mod= 1
##$PKNL= yes
##$PPARMOD= 0
##$PPDIAG= 0
##$PPIPTYP= 0
##$PPMPNUM= 2147483647
##$PPRESOL= 1
##$PSCAL= 4
##$PSIGN= 0
##$PYNMP= <proc.py>
##$REVERSE= no
##$SF= 400.020008639729
##$SI= 131072
##$SIGF1= 0
##$SIGF2= 0
##$SINO= 400
##$SIOLD= 131072
##$SPECTYP= <>
##$SREGLST= <1H.CDCl3>
##$SSB= 0
##$STSI= 131072
##$STSR= 0
##$SW_p= 8223.68421052631
##$SYMM= 0
##$S_DEV= 0
##$TDeff= 65536
##$TDoff= 0
##$TI= <>
##$TILT= no
##$TM1= 0
##$TM2= 0
##$TOPLEV= 0
##$USERP1= <user>
##$USERP2= <user>
##$USERP3= <user>
##$USERP4= <user>
##$USERP5= <user>
##$WDW= 1
##$XDIM= 131072
##$YMAX_p= 413407739
##$YMIN_p= -11157
##$CURPLOT= <Network HP LaserJet P1505>
##$CURPRIN= <$Network HP LaserJet P1505>
##$DFORMAT= <normdp>
##$LAYOUT= <+/1D_H.xwp>
##$LFORMAT= <normlp>
##$PFORMAT= <normpl>
##$SURQMSG= 1
$$ End of Bruker specific parameters
$$ ---------------------------------
##NTUPLES= NMR SPECTRUM
##VAR_NAME=  FREQUENCY,     SPECTRUM/REAL,   SPECTRUM/IMAG
##SYMBOL=    X,             R,               I
##VAR_TYPE=  INDEPENDENT,   DEPENDENT,       DEPENDENT
##VAR_FORM=  AFFN,          ASDF,            ASDF
##VAR_DIM=   131072,        131072,          131072
##UNITS=     HZ,            ARBITRARY UNITS, ARBITRARY UNITS
##FACTOR=    0.0627417313425164, 1,          1
##FIRST=     8223.62146879497, 876,          -46799
##LAST=      0,             1871,            -47474
##MIN=       0,             -11157,          0
##MAX=       8223.62146879497, 413407739,    0
$$ Real data points
##PAGE= N=1
##DATA TABLE= (X++(R..R)), XYDATA
$$ [...]
61007A256107N7024O2987O6773O9379P1560P2532P3173P6849Q4993R5336J06457
60996B093170J20233J37342J54521J69349J84070K01834K23757K53088K96992
60987C834356L59176M35495N22172O23177P44065Q86268J056572J274254J555990
60978A1291525J901533K309117K784651L283377L625685L532583K833886J672071
60970C3234428M62533l86751p21019o24522k38465L23132Q82685J136730Q04713
60961C4873464j25098j334907k392849l031918l240600l150219k894402k562510
60953A6140961k215420j892546j606575j354086j134084r49183p95517o64202
60945E529348n51903m61259l91807l37982k95379k62363k35836k11617j89211
$$ plain form
61007 1256107 1313131 1376118 1442891 1512270 1583830 1656362 1729535 1806384 1891377 1986713 2093170
60996 2093170 2213403 2350745 2505266 2674615 2858685 3060519 3284276 3537364 3834356
60987 3834356 4193532 4629027 5151199 5774376 6518441 7404709 8461281 9735535 11291525
60978 11291525 13193058 15502175 18286826 21570203 25195888 28728471 31562357 33234428
60970 33234428 33696961 33310210 32589191 31964669 31726204 32049336 32932021 34068751 34873464
60961 34873464 34748366 33413459 31020610 27988692 24748092 21597873 18703471 16140961
60953 16140961 13925541 12032995 10426420 9072334 7938250 6989067 6193550 5529348
60945 5529348 4977445 4516186 4124379 3786397 3491018 3228655 2992819 2781202 2591991
60936B591991j70973j56423j42181j27377j14162j02760r0923p9001p0742o7843
60926A469606o7626o7284o6559o5144o1390n5356m9799m6319m3293l9175l5072
60915H72589l2295k9965k6931k3884k1802k0145j8219j6605j5722j4633j2764
60904F39624j1153j0597j0133q843p576p390p598p024n972n453n359m916m105
60891E43505l327k361r33L76Q30O96O89R01J053J261J743K276K554K543K105J023
60875E54934j82m65K99J007R64P06P18O11K29L04J180K066K387K648L068K732
60859E73206J248%K96J400J809J606J940K901L566L689L849M144M216M341N159
60844F13370O258O299M659K092m00k429l811m133l090r75J273K469J945J75j647
$$ plain form
60936 2591991 2421018 2264595 2122414 1995037 1880875 1778115 1687192 1608191 1537449 1469606
60926 1469606 1401980 1334696 1268137 1202993 1141603 1086247 1036448 990129 946836 907661 872589
60915 872589 840294 810329 783398 759514 737712 717567 699348 682743 667021 652388 639624
60904 639624 628471 617874 607741 598898 591322 583932 576334 569310 563338 557885 552526 547610 543505
60891 543505 540178 537817 536884 537260 538090 538786 539475 540376 541429 542690 544433 546709 549263 551806 553911 554934
60875 554934 554752 554287 554586 555593 556557 557263 557981 558592 558821 559125 560305 562371 564758 567406 570474 573206
60859 573206 574454 574454 574750 576150 577959 579565 581505 584406 587972 591661 595510 599654 603870 608211 613370
60844 613370 619628 625927 630586 632678 632278 629849 626038 621905 618815 617840 619113 621582 623527 623702 622055
60829F22055k862l675m211m073l176k150j291r8J615L033L586L946M851N790N943
60814F29283N588N424N181M147K613J476P70j62j262j784j662j688k238k764k735
60799F40187k326k034k173k729l250l093k211j430j430j872k024j827j716j849
60785F10223k190k803l460l463k606j678j278q31L43J628J910J248O78P43J253
60770E99717K081L124L808L647L050K691K477K012J522J329J024K60l05p3J29
60755F26493p32j922j834n74P6p97k363l691m699n314n249m891n044n531n295
60740E78633m092k825k043j467j120j514k451l012l100l613m741n462n200m724
60726E33269m745m952m970n169n815o391o396o035n611n082m554m343m310l996
$$ plain form
60829 622055 619193 615518 611307 607234 604058 601908 600617 600519 602134 605167 608753 612699 617550 623340 629283
60814 629283 634871 640295 645476 649623 652236 653712 654482 654320 653058 651274 649612 647924 645686 642922 640187
60799 640187 637861 635827 633654 630925 627675 624582 622371 620941 619511 617639 615615 613788 612072 610223
60785 610223 608033 605230 601770 598307 595701 594023 592745 591914 592257 593885 595795 597043 597721 598464 599717
60770 599717 601798 604922 608730 612377 615427 618118 620595 622607 624129 625458 626482 626742 626437 626364 626493
60755 626493 625761 623839 622005 621431 621507 620710 618347 614656 609957 604643 599394 594503 589459 583928 578633
60740 578633 574541 571716 569673 568206 567086 565572 563121 560109 557009 553396 548655 543193 537993 533269
60726 533269 528524 523572 518602 513433 507618 501227 494831 488796 483185 478103 473549 469206 464896 460900
60712D60900l617l846m453m420l678l428m169m772m174k815j657q24pO68R88J131
60696D21827J287J457J966L237M727N181M328L348L171L490L809M324N097N614
60682D72863N803O399P561Q315Q099P743Q097Q861R522J0316J1393J2142J2240
60669E89354J2310J2659J2543J1686J1197J1806J2379J1471R335P123N109L135
60657G10107J773J503J445M59j151k459l708n632p652q496q328q510r453j0263
60643F49635j0510j0707j0915j0420r080p750p004o557o162n987n853n183m050
60630E49457l343l457l622l005j783o94j34J8L8K12P15J453K247L112M167N284
60614E50665O174O769P269P893Q686R412R603R116Q682R293J0805J1925J1859
$$ plain form
60712 460900 457283 453437 448984 444564 440886 437458 433289 428517 424343 421528 419871 419047 419040 419708 420696 421827
60696 421827 423114 424571 426537 429774 434501 439682 444010 447358 450529 454019 457828 462152 467249 472863
60682 472863 478666 485065 492626 500941 509040 516783 524880 533741 543263 553579 564972 577114 589354
60669 589354 601664 614323 626866 638552 649749 661555 673934 685405 694740 701863 706972 710107
60657 710107 711880 713383 714828 715287 714136 711677 707969 702337 694685 686189 677861 669351 659898 649635
60643 649635 639125 628418 617503 607083 598003 590253 583249 576692 570530 564543 558690 553507 549457
60630 549457 546114 542657 539035 536030 534247 533553 533419 533437 533475 533687 534402 535855 538102 541214 545381 550665
60614 550665 556839 563608 570877 578770 587456 596868 606471 615587 624269 633562 644367 656292 668151
60601F68151J1182J0572R618P675N060K542K06k277m774o939q759j0110j0442
60588F71705r744r087r190r221q165o699o286o873p092o465n904o041o427o604
60574E67907o687o680o324n850n831o168o066n255m283l528k860k344k376k882
60560E00773l211l082k783k381j565m41L57N55M73K78k14p82p40O9R19J176J017
60543D90418J006J446K319L340M055M366M868O097P663Q869R933J1640J3850J5531
60529E85401J6392J7487J9784K3107K6852L0867L5071L8861M1424M2211M0787
60518I18244L6786L0405K2491J3836M801m135j1955j7666k0995k2388k2547k2102
60506I04775k1407k0451j9152j7628j5992j4035j1543q724n902k953N16M548Q860
$$ plain form
60601 668151 679333 689905 699523 707198 712258 714800 715006 712729 707955 701016 692257 682147 671705
60588 671705 661961 652874 643684 634463 626298 619599 613313 606440 599348 592883 586979 580938 574511 567907
60574 567907 561220 554540 548216 542366 536535 530367 524301 519046 514763 511235 508375 506031 503655 500773
60560 500773 497562 494480 491697 489316 487751 487310 487667 488222 488695 488973 488759 487977 487237 487306 488225 489401 490418
60543 490418 491424 492870 495189 498529 502584 506950 511818 517915 525578 534447 544380 556020 569870 585401
60529 585401 601793 619280 639064 662171 689023 719890 754961 793822 835246 877457 918244
60518 918244 955030 985435 1007926 1021762 1026563 1022428 1010473 992807 971812 949424 926877 904775
60506 904775 883368 862917 843765 826137 810145 796110 784567 775843 769941 766988 767504 772052 780912
60493G80912J3267J7612K1577K5035K8199L0837L1721K9719K5176J9394J3057
60482A036506O039j331p819j2256j4220j3842j1592q260m409J18N630J1776J7944
60469A004284K4108L0480L6806M2982M9992N9016O9838Q1392R3791J08559J26796
60458A728044J48216J71967J97152K22260K45027K62798K71901K67104K43654
60449C758123K00713J41855P2204l373p9089j47596k02249k39690k59827k64577
60439B976494k57315k42329k23269k02228j80520j59563j40423j23332j08208
60430A339307r5015q3284p2201o1740n2860m6042m0510l5406l0795k6909k3340
60419G71205j9796j6775j4695j3146j1660j0502r865r157p977p022p076p605p459
$$ plain form
60493 780912 794179 811791 833368 858403 886602 917439 949160 978879 1004055 1023449 1036506
60482 1036506 1042545 1041214 1033395 1021139 1006919 993077 981485 973225 968816 968934 974564 986340 1004284
60469 1004284 1028392 1058872 1095678 1138660 1188652 1247668 1317506 1398898 1492689 1601248 1728044
60458 1728044 1876260 2048227 2245379 2467639 2712666 2975464 3247365 3514469 3758123
60449 3758123 3958836 4100691 4172895 4169522 4090433 3942837 3740588 3500898 3241071 2976494
60439 2976494 2719179 2476850 2253581 2051353 1870833 1711270 1570847 1447515 1339307
60430 1339307 1244292 1161008 1088807 1027067 974207 928165 887655 852249 821454 794545 771205
60419 771205 751409 734634 719939 706793 695133 684631 674766 665609 657632 650610 643534 635929 628470
60406F28470o463n389m648l943l014j980j034l98l68q26r96k60R80J824K005J965
60390F05925J975J834J427J156J608K849M061M034K375J60j126j182r62j219j775
60375F21140k236k518k452j746p21k06l29k73L80R52Q80O82J084J952K841L835
60359F23265N034N808N556M788M635N400O311O506N851M918M458M713N115M993
60345F97351M545M391M221K919L95j796k329j663j066r23q09n14l9Q33K127L265
60329G10908L794M043M353M307L430K145J146L29p81j947k534k589k719l101l388
60314G17396l472l569l634l408l015k943l367l873l825k854j171L75R59P21N65
60299F84885Q56R30K92m80p05p08j201j950j999j012L00J001P28k04j089j424
$$ plain form
60406 628470 622007 616618 611970 608027 605013 603033 601999 601601 601233 600407 599411 599151 600131 601955 603960 605925
60390 605925 607900 609734 611161 612317 613925 616774 620835 624869 627244 627404 626278 625096 624134 622915 621140
60375 621140 618904 616386 613934 612188 611467 611261 610932 610659 611039 611991 612871 613553 614637 616589 619430 623265
60359 623265 628299 634107 639663 644451 649086 654486 660797 667303 673154 678072 682530 687243 692358 697351
60345 697351 701896 706287 710508 713427 713822 712026 709697 708034 706968 706045 705236 704722 704683 705516 707643 710908
60329 710908 714702 718745 723098 727405 730835 732980 734126 734455 733674 731727 729193 726604 723885 720784 717396
60314 717396 713924 710355 706721 703313 700298 697355 693988 690115 686290 683436 682265 682640 683599 684320 684885
60299 684885 685741 686671 686963 686483 685778 685070 683869 681919 679920 678908 679208 680209 680937 680733 679644 678220
60283F78220j429j739k392k632j978q51J05P77J220J317J199J415K160K920L339
60268F81651L770M526N257N616N860O259O630O989P835R166J0102J0210J0384
60255G74255J1573J3378J4890J6195J8007K0351K2648K4778K7141K9976L3294
60244A006486L7168M1472M5813N0159N4960O0187O5109O9673P5024Q1791Q8814
60233A676656R4693R9646J04548J08929J11303J11019J08460J03855R7106Q8477
60223B704692P8387O6855N4039M0748K7508J3806n49j4191k5645l5209m3721n0254
60211B816466n2965n1918m9051m5360m0015l2493k3649j4210l797P809J9878L1899
60199B562594M4398N7799P1427Q4264R5929J06320J15004J21485J25520J26709
$$ plain form
60283 678220 676791 675052 672660 670028 668050 667199 667304 668081 669301 670618 671817 673232 675392 678312 681651
60268 681651 685421 689947 695204 700820 706680 712939 719569 726558 734393 743559 753661 763871 774255
60255 774255 785828 799206 814096 830291 848298 868649 891297 916075 943216 973192 1006486
60244 1006486 1043654 1085126 1130939 1181098 1236058 1296245 1361354 1431027 1506051 1587842 1676656
60233 1676656 1771349 1870995 1975543 2084472 2195775 2306794 2415254 2519109 2616215 2704692
60223 2704692 2783079 2849934 2903973 2944721 2972229 2986035 2985486 2971295 2945650 2910441 2866720 2816466
60211 2816466 2763501 2711583 2662532 2617172 2577157 2544664 2521015 2506805 2503008 2510817 2530695 2562594
60199 2562594 2606992 2664791 2736218 2820482 2916411 3022731 3137735 3259220 3384740 3511449
60189C511449J24246J17550J06872R3124P7351O0264M2019K2596K656j6510l4325
60178D107292n1488o8322q3195r3744r9281j00871r9384r4813q7338p7641o6000
60167C185215n2264l6984k1471o409Q594K3848L8764N2407O4087P3164P9030Q1457
60155C489438Q0424P5763O7555N6771M4807L2539K0375Q709k477j3785k5106l4685
60143C800328m0706m3326m3784m2029l6876k8272j7547n370Q857K5294M3052O1543
60131C681164Q1034J01405J21948J42773J64905J88481K12282K35557K58795K81987
60121E470331L03604L22155L37417L49216L56152L56524L49661L35601L14394
60112H495055K86550K53250K15335J72870J26335P7324K7365k3018p3342j22190
$$ plain form
60189 3511449 3635695 3753245 3860117 3953241 4030592 4090856 4132875 4155471 4158127 4141617 4107292
60178 4107292 4055804 3987482 3904287 3810543 3711262 3610391 3511007 3416194 3328856 3251215 3185215
60167 3185215 3132951 3095967 3074496 3068087 3076681 3100529 3139293 3191700 3255787 3328951 3407981 3489438
60155 3489438 3569862 3645625 3713180 3769951 3814758 3847297 3867672 3876381 3873904 3860119 3835013 3800328
60143 3800328 3759622 3716296 3672512 3630483 3593607 3565335 3547788 3542418 3551275 3576569 3619621 3681164
60131 3681164 3762198 3863603 3985551 4128324 4293229 4481710 4693992 4929549 5188344 5470331
60121 5470331 5773935 6096090 6433507 6782723 7138875 7495399 7845060 8180661 8495055
60112 8495055 8781605 9034855 9250190 9423060 9549395 9626719 9654084 9631066 9557724 9435534
60102I435534j67950k09634k46116k75485k96207l08340l12778l09880k99719
60093G009425k83178k61904k37360k10446j81778j51770j20864q9963o0211l2028
60083E379923n026K0763M4223O4195Q0377R2667J00291J02291R8531Q9723P6854
60072F144812O0935M2813K2882J461k0315m0694n8701p4769q9739j03914j17267
60061E767504j29548j39826j46801j50194j50974j49772j45944j38842j29095
60052D486508j17858j05515r1916p7252o1864m5774k9122j2525L726K0309L7877
60041D006594N5890P3103Q8807J02876J14958J24328J30265J32013J28731J20126
60031E077691J06930R0168P0283M7417K2322l661k9380n4212p7725r9372j18467
$$ plain form
60102 9435534 9267584 9057950 8811834 8536349 8240142 7931802 7619024 7309144 7009425
60093 7009425 6726247 6464343 6226983 6016537 5834759 5682989 5562125 5472162 5411951 5379923
60083 5379923 5374897 5395660 5439883 5504078 5584455 5677122 5777413 5879704 5978235 6067958 6144812
60072 6144812 6205747 6248560 6271442 6272903 6252588 6211894 6153193 6078424 5988685 5884771 5767504
60061 5767504 5637956 5498130 5351329 5201135 5050161 4900389 4754445 4615603 4486508
60052 4486508 4368650 4263135 4171219 4093967 4032103 3986329 3957207 3944682 3948408 3968717 4006594
60041 4006594 4062484 4135587 4224394 4327270 4442228 4566556 4696821 4828834 4957565 5077691
60031 5077691 5184621 5274789 5345072 5392489 5414811 5411150 5381770 5327558 5249833 5150461 5031994
60020E031994j34223j45922j53176j55919j54265j48616j39731j28187j14001
60011C757954r7425p9884o3093m7289l1182j3961L821K1519L9498N8310P7656
60000C625924R6848J15590J33751J50879J66425J79752J89553J93979J91889J83426
59990E228016J69091J49170J24551R7214O9020M0445J1137j8751m8275p6340j02009
59979E643269j24470j42985j56673j64482j65985j62167j54534j43509j28686
59970D299778j10658r1245p1626n1625l1205j1247P957K7423M7598O6915Q3374
59959D165439R6633J07394J15643J20733J22556J21381J17022J09248R8677Q6298
59949E261024P2534N7574M2193K7349J3434P69r698j7030k1187k2433k0200j3434
$$ plain form
60020 5031994 4897771 4751849 4598673 4442754 4288489 4139873 4000142 3871955 3757954
60011 3757954 3660529 3580645 3517552 3470263 3439081 3425120 3428941 3450460 3489958 3548268 3625924
60000 3625924 3722772 3838362 3972113 4122992 4289417 4469169 4658722 4852701 5044590 5228016
59990 5228016 5397107 5546277 5670828 5768042 5837062 5877507 5888644 5869893 5821618 5745278 5643269
59979 5643269 5518799 5375814 5219141 5054659 4888674 4726507 4571973 4428464 4299778
59970 4299778 4189120 4097875 4026249 3974624 3943419 3932172 3940129 3967552 4015150 4082065 4165439
59959 4165439 4262072 4369466 4485109 4605842 4728398 4849779 4966801 5076049 5174726 5261024
59949 5261024 5333558 5391132 5433325 5460674 5474108 5474877 5465179 5448149 5426962 5404529 5384329 5370895
59937E370895j771J4336L4312N7636Q3693J12045J42541J74715K07618K40538
59927F436558K73286L05179L34555L59726L79406L91621L93249L81710L56244
59918I611534L16860K63382J96866J21036M0823l9896j17850j88785k48364k94611
59908I660995l27943l48906l57430l54345l42091l23453l00374k74160k45782
59899F786511k15799j84666j53237j22305r1896o1744l2162l573K4442N2550Q0097
59888F078218J05313J27096J45550J60576J70974J75277J72581J62185J43218
59879G440988J15448Q0249M0341j513m3447q4265j22492j56029j83208k04081
59869F881991k19973k31734k39170k42325k42222k39732k34585k26219k14815
$$ plain form
59937 5370895 5369124 5383460 5417772 5475408 5559101 5671146 5813687 5988402 6196020 6436558
59927 6436558 6709844 7015023 7349578 7709304 8088710 8480331 8873580 9255290 9611534
59918 9611534 9928394 10191776 10388642 10509678 10550501 10510605 10392755 10203970 9955606 9660995
59908 9660995 9333052 8984146 8626716 8272371 7930280 7606827 7306453 7032293 6786511
59899 6786511 6570712 6386046 6232809 6110504 6018608 5956864 5924702 5921129 5945571 5998121 6078218
59888 6078218 6183531 6310627 6456177 6616753 6787727 6963004 7135585 7297770 7440988
59879 7440988 7556436 7636685 7677026 7675513 7632066 7547801 7425309 7269280 7086072 6881991
59869 6881991 6662018 6430284 6191114 5948789 5706567 5466835 5232250 5006031 4791216
59860D791216k00889j84775j67408j50638j35572j21317j06485r1389p7571o5817
59850C489355n6027m8630m4521m3615m4741m7100n0681n5109n9176o1806o2725
59839B915224o2067o0053n7122n3568m9056m3108l6047k8749k1468j3725n326
59828B484935L266J1751K0510K9943L9517M7700N2899N4913N5474N6844N9510
59817B917262O1973O2928O2541O0922N6567M7724L4801K0266O537m981j3282j7631
59805C295627j8147j5647j0788l833N105J6210K9915M6017O3471Q1793J01992
59794C591715J25198J51095J78789K08554K41346K77037L14079L50044L80724
59785E818581L98866L95521L63399K99261K05103Q9611l2008j42625k29939k89450
$$ plain form
59860 4791216 4590327 4405552 4238144 4087506 3951934 3830617 3724132 3632743 3555172 3489355
59850 3489355 3433328 3384698 3340177 3296562 3251821 3204721 3154040 3098931 3039755 2977949 2915224
59839 2915224 2853157 2793104 2735982 2682414 2633358 2590250 2554203 2525454 2503986 2490261 2484935
59828 2484935 2488201 2499952 2520462 2550405 2589922 2637622 2690521 2745434 2800908 2857752 2917262
59817 2917262 2979235 3042163 3104704 3165626 3222193 3269917 3304718 3324984 3331521 3326540 3313258 3295627
59805 3295627 3277480 3261833 3251045 3247212 3252317 3268527 3298442 3344459 3407930 3489723 3591715
59794 3591715 3716913 3868008 4046797 4255351 4496697 4773734 5087813 5437857 5818581
59785 5818581 6217447 6612968 6976367 7275628 7480731 7570342 7538334 7395709 7165770 6876320
59775F876320l22385l32665l25624l06989k81361k51802k20748j90286j61499
59766D482961j34639j10131q8463o9236n1534l5235k0840p948M779J7898L0698
59755D018310M2678N4383O6474P9044R2142J06045J20739J35979J52021J69450
59745E037265J88289K08278K29911K54047K80467L08089L36723L67319M00141
59736G610529M33939M67186M98887N27583N50720N65611N70310N63298N43457
59727A2331520N11090M68485M19302L68083L20265K81238K54519K41178K40979
59718A5436659K53155K75978L06675L42240L79691M15495M45696M67008M77227
59709A8799824M74675M58258M28156L85693L32518K70760K03848J35964P0684
$$ plain form
59775 6876320 6553935 6221270 5895646 5588657 5307296 5055494 4834746 4644460 4482961
59766 4482961 4348322 4238191 4149728 4080492 4028958 3993723 3972883 3964935 3969714 3987612 4018310
59755 4018310 4060988 4115371 4181845 4260889 4353031 4459076 4579815 4715794 4867815 5037265
59745 5037265 5225554 5433832 5663743 5917790 6198257 6506346 6843069 7210388 7610529
59736 7610529 8044468 8511654 9010541 9538124 10088844 10654455 11224765 11788063 12331520
59727 12331520 12842610 13311095 13730397 14098480 14418745 14699983 14954502 15195680 15436659
59718 15436659 15689814 15965792 16272467 16614707 16994398 17409893 17855589 18322597 18799824
59709 18799824 19274499 19732757 20160913 20546606 20879124 21149884 21353732 21489696 21560380
59700B1560380J1001l9686p8170j03129j14783j12752r5781o3924j9410L5239
59690B0978985R8673J69835K47037L28618M13330M99320N83762O64050P38146
59681B4721756Q02949Q53176Q82574Q85372Q56361P91083O87329N46449L73225
59672C1400274J75654l4800k44313m39620o10179p48194q48448r09327r33397
59663B6807650r26542q97309q57282q20256p98953q01321q28400q73672r24281
59654A9079634r65518r86982r85594r63638r25513q76346q21335p64317p07215
59645A1083176o51376n98472n49470n03958m61421m22223l86518l53376l22035
59636F834327k93027k66929k42900k19633j97046j75922j56544j38697j22363
$$ plain form
59700 21560380 21571381 21531695 21453525 21350396 21235613 21122861 21027080 20963156 20943746 20978985
59690 20978985 21077658 21247493 21494530 21823148 22236478 22735798 23319560 23983610 24721756
59681 24721756 25524705 26377881 27260455 28145827 29002188 29793271 30480600 31027049 31400274
59672 31400274 31575928 31541128 31296815 30857195 30247016 29498822 28650374 27741047 26807650
59663 26807650 25881108 24983799 24126517 23306261 22507308 21705987 20877587 20003915 19079634
59654 19079634 18114116 17127134 16141540 15177902 14252389 13376043 12554708 11790391 11083176
59645 11083176 10431800 9833328 9283858 8779900 8318479 7896256 7509738 7156362 6834327
59636 6834327 6541300 6274371 6031471 5811838 5614792 5438870 5282326 5143629 5021266
59627E021266j07427r3302p9881o8179n9021n1746m5346m0199l7424l7061l8316
59616D363364m1276m6835n4750o3123p0268p6076q1127q5237q7610q7937q6744
59605C582381q4587q1311p6407p0003o3155n6824n0772m3962l5993k7581j9706
59594B972080j2780o640q48N073J1032J6100J9438K1421K3036K4273K4154K2464
59582C118803K0451J9405J9497K0281K1507K3072K5075K8279L3709M1327M9891
59571C421297N8387O6886P5818Q5369R5832J07556J20159J32704J45032J57985
59561D467025J71941J86200K00054K13265K25064K33922K39037K40986K40277
59552F417771K36263K28251K16661K02357J85653J66712J46295J25445J04841
$$ plain form
59627 5021266 4913839 4820537 4740656 4672477 4613456 4561710 4516364 4476165 4438741 4401680 4363364
59616 4363364 4322088 4275253 4220503 4157380 4087112 4011036 3929909 3844672 3757062 3669125 3582381
59605 3582381 3497794 3416483 3340076 3270073 3206918 3150094 3099322 3055360 3019367 2991786 2972080
59594 2972080 2959300 2952660 2951812 2956885 2967917 2984017 3003455 3024876 3047912 3072185 3096339 3118803
59582 3118803 3139254 3158659 3178156 3198437 3219944 3243016 3268091 3296370 3330079 3371406 3421297
59571 3421297 3479684 3546570 3622388 3707757 3803589 3911145 4031304 4164008 4309040 4467025
59561 4467025 4638966 4825166 5025220 5238485 5463549 5697471 5936508 6177494 6417771
59552 6417771 6654034 6882285 7098946 7301303 7486956 7653668 7799963 7925408 8030249
59543H030249Q4350O2401L6284M912k8290n6998p7225q9553r5885r6313r0280
59532G683652p8547o2012l9992j1661K1744N7844R5359J33754J71368K05439K33463
59521H410411K53021K61032K54868K34130K00233J54606R8526L4237l5031j05979
59511I760054j75249k39035k93859l37548l68782l86462l90671l83695l68854
59502F815899l48495l23844k96198k67095k37697k08878j81455j55528j30258
59493D666451j05181q1047n8432l6517j4473O919K6584M5378O5251Q6474J07303
59482D708710J26370J43887J60405J75618J88584J98162K03073K02435J96243
59473F303487J84699J67285J43206J12503P6093L5172q510n2330r3802j31724
$$ plain form
59543 8030249 8114599 8177000 8213284 8218196 8189906 8132908 8055683 7966130 7870245 7773932 7683652
59532 7683652 7605105 7543093 7503101 7491440 7513184 7571028 7666387 7800141 7971509 8176948 8410411
59521 8410411 8663432 8924464 9179332 9413462 9613695 9768301 9866827 9901064 9866033 9760054
59511 9760054 9584805 9345770 9051911 8714363 8345581 7959119 7568448 7184753 6815899
59502 6815899 6467404 6143560 5847362 5580267 5342570 5133692 4952237 4796709 4666451
59493 4666451 4561270 4480223 4421791 4385274 4370801 4377720 4404304 4449682 4514933 4601407 4708710
59482 4708710 4835080 4978967 5139372 5314990 5503574 5701736 5904809 6107244 6303487
59473 6303487 6488186 6655471 6798677 6911180 6987273 7022445 7013935 6961605 6867803 6736079
59463F736079j65534j94092k16195k31869k42041k47129k47060k42464k34742
59454D714953k24931k13383k00519j87045j73495j60190j47461j35322j23273
59445C149334j11118r9565q9233p9646p0063o0774n2589m5395l8366l1292k4719
59434B446574j8957j3882r484n746k146J756N416P815Q895R721J1276J3616J6265
59421B471119J9091K2619K7306L1996L3605K9851K2562J6777J5938J9297K4545
59410B734706L0968L8822M7619N6985O7539P8697Q6954Q9021Q6227Q3492Q4381
59399C485411Q9253R7666J09686J24455J40040J55756J72964J92786K14588K37450
59389E020055K61855K88947L19109L52000L87302M24879M64500N05489N46088
$$ plain form
59463 6736079 6570545 6376453 6160258 5928389 5686348 5439219 5192159 4949695 4714953
59454 4714953 4490022 4276639 4076120 3889075 3715580 3555390 3407929 3272607 3149334
59445 3149334 3038216 2938651 2849418 2769772 2699709 2638935 2586346 2540951 2502585 2471293 2446574
59434 2446574 2427617 2413735 2404251 2398505 2396359 2398115 2403531 2411346 2420241 2429962 2441238 2454854 2471119
59421 2471119 2490210 2512829 2540135 2572131 2605736 2635587 2658149 2674926 2690864 2710161 2734706
59410 2734706 2765674 2804496 2852115 2909100 2976639 3055336 3142290 3231311 3317538 3401030 3485411
59399 3485411 3574664 3672330 3782016 3906471 4046511 4202267 4375231 4568017 4782605 5020055
59389 5020055 5281910 5570857 5889966 6241966 6629268 7054147 7518647 8024136 8570224
59380H570224N83232O13680O35227O46345O45256O30570O02842N64551N18699
59371A4010626M68252M16429L66253L19588K77203K39388K05465J73196J39773
59362A6616173J03249O2191J4589m1427j05932j77309k53488l31735m07687m76303
59352A5002321n34048n79224o10658o27683o31415o24544o09419n87253n59024
59343I639053n26110m90005m52406m15327l80058l46289l13366k81953k53295
59334F180244k27361k03220j80963j61563j45086j30620j17952j07608r9322r2120
59324D714429q6049q2158q0466p9566p8583p7972p7975p7795p6885p5755p4857
59313C846368p3734p1871o9466o6876o4032o0661n6489n1267m5267l9496l4518
$$ plain form
59380 8570224 9153456 9767136 10402363 11048708 11693964 12324534 12927376 13491927 14010626
59371 14010626 14478878 14895307 15261560 15581148 15858351 16097739 16303204 16476400 16616173
59362 16616173 16719422 16781613 16796202 16754775 16648843 16471534 16218046 15886311 15478624 15002321
59352 15002321 14468273 13889049 13278391 12650708 12019293 11394749 10785330 10198077 9639053
59343 9639053 9112943 8622938 8170532 7755205 7375147 7028858 6715492 6433539 6180244
59334 6180244 5952883 5749663 5568700 5407137 5262051 5131431 5013479 4905871 4806549 4714429
59324 4714429 4628380 4546222 4465756 4386190 4307607 4229635 4151660 4073865 3996980 3921225 3846368
59313 3846368 3772634 3700763 3631297 3564421 3500389 3439728 3383239 3331972 3286705 3247209 3212691
59302C212691k9437k3111j5908q973k176N646J4621K3701L2530M1808N1621O1099
59290C364112P0018P9217Q9022R8426J06245J11894J14917J14934J12173J06883
59280D367841R8260Q5265O8561N0282L1783J2797p422k9512n4078q0372j04814
59269D438591j22895j33016j36985j36714j32501j24854j15701j06663r7680q8251
59259C243331p8629o9070n9217m9049l9268l0118k1015j1824l283M346J1826J9712
59247B917742K7730L5774M4247N3116O1946P1198Q2069R4755J08236J22126J37325
59236C756264J54433J73157J93610K16639K42330K69737K98525L29222L61359
59227E995276L92957M22330M48583M69600M81380M80376M65127M34888L88598
$$ plain form
59302 3212691 3183254 3160143 3144235 3135262 3133086 3138732 3153353 3177054 3209584 3251392 3303013 3364112
59290 3364112 3434130 3513347 3602369 3700795 3807040 3918934 4033851 4148785 4260958 4367841
59280 4367841 4466101 4551366 4619927 4670209 4701992 4714789 4707367 4677855 4623777 4543405 4438591
59269 4438591 4315696 4182680 4045695 3908981 3776480 3651626 3535925 3429262 3331582 3243331
59259 3243331 3164702 3095632 3036415 2987366 2948098 2917980 2896965 2885141 2881858 2886204 2898030 2917742
59247 2917742 2945472 2981246 3025493 3078609 3140555 3211753 3293822 3388577 3496813 3618939 3756264
59236 3756264 3910697 4083854 4277464 4494103 4736433 5006170 5304695 5633917 5995276
59227 5995276 6388233 6810563 7259146 7728746 8210126 8690502 9155629 9590517 9979115
59218I979115L26318K50370J64020P0314k7049j23196k13506k94540l63046m15659
59208I353141m50753m69382m73690m65636m47795m23669l96069l66308l35582
59199E524257l05617k77189k49714k23224j99168j78247j59191j40877j24068
59190C666962j09728r7180q5325p4394o5026n6771m8955m1899l5954l0368k4428
59179B996934j8763j4305j0919q088o009m825l914l031l127m861p451j0060j3231
59166B888350j7594k2409k6714l0903l5710m0591m4614m8063n1600n4634n6018
59155B459500n5909n5452n5092n4483n3649n2919n2028n0394m8098m5655m3062
59144A892759l9958l6443l3037k9971k7117k4316k1459j8584j6084j4164j2018
$$ plain form
59218 9979115 10305433 10555803 10719823 10790137 10763088 10639892 10426386 10131846 9768800 9353141
59208 9353141 8902388 8433006 7959316 7493680 7045885 6622216 6226147 5859839 5524257
59199 5524257 5218640 4941451 4691737 4468513 4269345 4091098 3931907 3791030 3666962
59190 3666962 3557234 3460054 3374729 3300335 3235309 3178538 3129583 3087684 3051730 3021362 2996934
59179 2996934 2978171 2963866 2952947 2944859 2938850 2934025 2930111 2927080 2923953 2919092 2911641 2901581 2888350
59166 2888350 2870756 2848347 2821633 2790730 2755020 2714429 2669815 2621752 2570152 2515518 2459500
59155 2459500 2403591 2348139 2293047 2238564 2184915 2131996 2079968 2029574 1981476 1935821 1892759
59144 1892759 1852801 1816358 1783321 1753350 1726233 1701917 1680458 1661874 1645790 1631626 1619608
59133A619608q489l699J016N022Q989J3308J7422K1205K5576L0856L5970M0127
59121A806911M4042M8524N3113N7060O0549O3896O6589O8055O8583O8751O8863
59110B474936O9485P1418P4660P8626Q3724R1109J00402J09402J16800J23366
59100C393928J29585J34032J35150J32762J26664J15594R8925P7712N2866K4199
59090D421417p343l8637o7261r3486j17651j37635j51231j59285j64113j66187
59080C318588j64684j60059j53629j45559j35640j25226j16133j08241j00147
59071B109270r1617q3502p5984o8819o2587n7858n3730m8991m4044l9999l6710
59060A445429l3459l0619k8727k6765k3462j9574j6789j5049j3078j0993j0152
$$ plain form
59133 1619608 1611119 1607420 1608436 1613458 1622447 1635755 1653177 1674382 1699958 1730814 1766784 1806911
59121 1806911 1850953 1899477 1952590 2009650 2070199 2134095 2200684 2268739 2337322 2406073 2474936
59110 2474936 2544421 2615839 2690499 2769125 2852849 2943958 3044360 3153762 3270562 3393928
59100 3393928 3523513 3657545 3792695 3925457 4052121 4167715 4266640 4344352 4397218 4421417
59090 4421417 4414074 4375437 4308176 4214690 4097039 3959404 3808173 3648888 3484775 3318588
59080 3318588 3153904 2993845 2840216 2694657 2559017 2433791 2317658 2209417 2109270
59071 2109270 2017653 1934151 1858167 1789348 1726761 1668903 1615173 1566182 1522138 1482139 1445429
59060 1445429 1411970 1381351 1352624 1325859 1302397 1282823 1266034 1250985 1237907 1226914 1216762
59049A216762j0689j1306j1304j1032j0477r240p682o495n328l323o40K040M918
59036A136204Q375J1522J3138J3496J3589J3222J1669R503P761N900K782p80k712
59023A243669k672k236k138j433M18K630M516O205P722Q771R508J0170J0065Q314
59009A303509N368K396n10m027p775j0452j1656j2150j2480j2645j2869j3287
58997A213422j3298j2499j1654j1380j0654q316n347l666l329k811j551j82J275
58984A130010L220M801M776L900M301O443Q768J0410J2057J3948J5167J5431J5732
58971A248964J6690J7844J8896K0085K1195K1628K1730K2400K3399K3567K2843
58960A479241K2375K2488K2261K1346K0656K0917K1914K3359K5155K6773K7771
$$ plain form
59049 1216762 1206073 1194767 1183463 1172431 1161954 1152714 1145032 1138537 1133209 1129886 1129246 1131286 1136204
59036 1136204 1144579 1156101 1169239 1182735 1196324 1209546 1221215 1230718 1238479 1244379 1247161 1246381 1243669
59023 1243669 1240997 1238761 1236623 1235190 1235608 1238238 1242754 1248959 1256681 1265452 1274960 1285130 1295195 1303509
59009 1303509 1308877 1311273 1310763 1306736 1298961 1288509 1276853 1264703 1252223 1239578 1226709 1213422
58997 1213422 1200124 1187625 1175971 1164591 1153937 1145621 1140274 1136608 1133279 1130468 1128917 1128735 1130010
58984 1130010 1133230 1138031 1142807 1146707 1151008 1157451 1166219 1176629 1188686 1202634 1217801 1233232 1248964
58971 1248964 1265654 1283498 1302394 1322479 1343674 1365302 1387032 1409432 1432831 1456398 1479241
58960 1479241 1501616 1524104 1546365 1567711 1588367 1609284 1631198 1654557 1679712 1706485 1734256
58949A734256K8886L1237L4456L7191L9251M1663M4650M7317M9433N1889N5159
58938B195388N8863O2940O7826P3292P8643Q4093R0606R8336J06590J15214J24550
58927C156341J34168J43335J52723J64075J78005J93563K09827K26630K43893
58918D802560K61806K81432L03609L27450L51521L76088M02450M30381M58187
58909G995484M85032N11135N35648N56305N71220N79214N78388N66401N42322
58900A2921149N06349M57676L94719L17881K30294J35626L6852o2554j58208k46263
58890A4533521l24226l90381m43874m85241n15462n34599n42643n41153n32377
58881A0223565n17439m97280m74496m51855m29355m05328l80064l55773l33079
$$ plain form
58949 1734256 1763142 1794379 1828835 1866026 1905277 1946940 1991590 2038907 2088340 2140229 2195388
58938 2195388 2254251 2317191 2385017 2458309 2536952 2621045 2711651 2809987 2916577 3031791 3156341
58927 3156341 3290509 3433844 3586567 3750642 3928647 4122210 4332037 4558667 4802560
58918 4802560 5064366 5345798 5649407 5976857 6328378 6704466 7106916 7537297 7995484
58909 7995484 8480516 8991651 9527299 10083604 10654824 11234038 11812426 12378827 12921149
58900 12921149 13427498 13885174 14279893 14597774 14828068 14963694 15000546 14937992 14779784 14533521
58890 14533521 14209295 13818914 13375040 12889799 12374337 11839738 11297095 10755942 10223565
58881 10223565 9706126 9208846 8734350 8282495 7853140 7447812 7067748 6711975 6378896
58872F378896l10498k87598k66019k46775k29013k11997j96071j81128j66343
58863D283454j51898j38895j27328j16157j05497r6363q8128p8910o8741n9794
58853C251743n2881m6438l9472l2845k6896k0541j3649p763l329J276O913J2320
58841C028438J6754K1581K7799L4180L9402M4221N0051N7005O4520P2492Q0755
58830C537198Q8889R7325J07243J18794J30930J43382J57059J72155J87806K04063
58820D944844K22141K42348K63773K86428L11362L38283L65465L92615M21291
58811G788550M51712M81648N09184N33996N55024N69520N75430N72268N58559
58802A2595891N31078M87892M29835L57914K72179J74549P0215l5459j39250k37982
$$ plain form
58872 6378896 6068398 5780800 5514781 5268006 5038993 4826996 4630925 4449797 4283454
58863 4283454 4131556 3992661 3865333 3749176 3643679 3547316 3459188 3380278 3311537 3251743
58853 3251743 3198862 3152424 3112952 3080107 3053211 3032670 3019021 3011258 3007929 3009205 3016118 3028438
58841 3028438 3045192 3066773 3094572 3128752 3168154 3212375 3262426 3319431 3383951 3456443 3537198
58830 3537198 3626087 3723412 3830655 3949449 4080379 4223761 4380820 4552975 4740781 4944844
58820 4944844 5166985 5409333 5673106 5959534 6270896 6609179 6974644 7367259 7788550
58811 7788550 8240262 8721910 9231094 9765090 10320114 10889634 11465064 12037332 12595891
58802 12595891 13126969 13614861 14044696 14402610 14674789 14849338 14919553 14884094 14744844 14506862
58792A4506862l26968m02514m63999n11813n45394n64939n72838n71542n61739
58783I985116n44136n21047m94591m65232m33704m02604l74461l49885l28791
58774F070665l11396k96704k82166k66491k50808k35827k20210k03318j87103
58765C816642j73280j60855j48401j36654j26690j17612j08210r9181r1513q4335
58755B569911p6533o9007o3170n8577n3990m9429m5435m1536l7304l3608l1232
58744B010090k9561k8035k7379k7987k8720k8833k9304l0747l1835l1442l0535
58733A685712l0187k9561k7811k6201k6304k7643k9018l0596l2792l4609l5031
58722A355959l4764l4809l4692l3721l2493l1563l0205k8026k6146k5139k3654
$$ plain form
58792 14506862 14179894 13777380 13313381 12801568 12256174 11691235 11118397 10546855 9985116
58783 9985116 9440980 8919933 8425342 7960110 7526406 7123802 6749341 6399456 6070665
58774 6070665 5759269 5462565 5180399 4913908 4663100 4427273 4207063 4003745 3816642
58765 3816642 3643362 3482507 3334106 3197452 3070762 2953150 2844940 2745759 2654246 2569911
58755 2569911 2493378 2424371 2361201 2302624 2248634 2199205 2153770 2112234 2074930 2041322 2010090
58744 2010090 1980529 1952494 1925115 1897128 1868408 1839575 1810271 1779524 1747689 1716247 1685712
58733 1685712 1655525 1625964 1598153 1571952 1545648 1518005 1488987 1458391 1425599 1390990 1355959
58722 1355959 1321195 1286386 1251694 1217973 1185480 1153917 1123712 1095686 1069540 1044401 1020747
58711A020747k0809j8036j6689j5755j3915j1986j1165j0659r282p742p123o720
58699H70866n529m364m270m355l383k093j778k047k095k688m660o849p725p640
58685H11390p475o575m218j611j23J054L197N465O317O132O107N912M803L838
58671H34213M562O538Q409J0289J2951J5686J7007J6416J3760Q236J28p883j3274
58658I27038j6209j7825j7759j5560j2825j1339j0490q778o504m716k984o32J409
58645H02826K292L335N867Q601R654R719J0613J2137J3110J4105J6362J9182K1152
58632I48955K2829K5611K9060L1980L4933L9014M3361M6607M9711N4605O1061
58621A387727O7512P3936Q1317Q9304R7071J05407J15344J25709J34718J42907
$$ plain form
58711 1020747 999938 981902 965213 949458 935543 923557 912392 901733 892451 884709 877586 870866
58699 870866 865337 860973 856703 852348 848965 846872 845094 843047 840952 838264 833604 826755 819030 811390
58685 811390 803915 797340 793122 791511 791388 792442 795639 801104 807421 813553 819660 825572 830375 834213
58671 834213 838775 845313 853722 864011 876962 892648 909655 926071 939831 948067 948195 940312 927038
58658 927038 910829 893004 875245 859685 846860 835521 825031 816253 809749 805033 802049 801417 802826
58645 802826 805118 808453 814320 822921 832575 842294 852907 865044 878154 892259 908621 927803 948955
58632 948955 971784 997395 1026455 1058435 1093368 1132382 1175743 1222350 1272061 1326666 1387727
58621 1387727 1455239 1529175 1610492 1699796 1796867 1902274 2017618 2143327 2278045 2420952
58611B420952J51815J60692J67124J69961J69124J63556J51952J34618J12474
58602C802268Q5358N3535J9445j4335m7199p8364j04734j23904j37289j47160
58592C307621j52541j51563j46007j39536j32639j23337j11880j00854r1177q1762
58582B076325p2635o5004n8618n2357m6952m4021m2827m1128l8593l6402l4277
58571A543511l1052k7499k5447k4632k3530k2590k3560k6218k8840l1163l3871
58560A245109l5957l5734l3803l2028l0301k7346k3733k0949j8594j5659j3527
58549I57478j4189j6430j7291j6525j6123j6359j5830j4689j4305j4321j3341
58538G88075j1798j0941j0099q180o633p276q607q021o380o286p249o903n769
$$ plain form
58611 2420952 2572767 2733459 2900583 3070544 3239668 3403224 3555176 3689794 3802268
58602 3802268 3887626 3941161 3960606 3946271 3899072 3820708 3715974 3592070 3454781 3307621
58592 3307621 3155080 3003517 2857510 2717974 2585335 2461998 2350118 2249264 2158087 2076325
58582 2076325 2003690 1938686 1880068 1827711 1780759 1736738 1693911 1652783 1614190 1577788 1543511
58571 1543511 1512459 1484960 1459513 1434881 1411351 1388761 1365201 1338983 1310143 1278980 1245109
58560 1245109 1209152 1173418 1139615 1107587 1077286 1049940 1026207 1005258 986664 971005 957478
58549 957478 943289 926859 909568 893043 876920 860561 844731 830042 815737 801416 788075
58538 788075 776277 765336 755237 747057 740424 733148 724541 716520 710140 703854 696605 689702 683933
58525F83933o214p585p169n277m632n293m985l973m662o499o288l741j903j809
58511F13903j366N8N77o6K54J959L036K948L398M716N368N332O164P519P505O499
58495F67804O713Q023Q259P371P125O908M436N15j532j339j815l891n573o403
58481F96601q031j0057j0056q262p545q294p933n951m707m781m285l225l539m391
58467F05544k506K038N415O221O900Q264P850N104K976K792K295K75j385j719
58453F50064k260l404l527k748l244m885n069l629l196l942l007n6J706J098N99
58438F14500J240R88o25j229k45P1p15m82O69R9j977k170PJ258P21J297L564M376
58420F21347L013K802M844O033N158N117P062Q140P140O631P417O658L560J255
$$ plain form
58525 683933 677719 670134 662965 657688 653056 647763 642778 638805 634143 627644 621356 617615 615712 613903
58511 613903 612537 612595 613172 613106 613360 615319 618355 621303 624701 629417 634785 640117 646281 653800 661305 667804
58495 667804 674517 682540 690799 698170 705295 712203 716639 717154 715622 714283 712468 708577 703004 696601
58481 696601 688570 678513 668457 660195 652650 644356 636423 630472 625765 620984 616699 613474 609935 605544
58467 605544 603038 605076 610491 616712 623612 631876 639726 644830 647806 650598 652893 653168 651783 650064
58453 650064 647804 644400 640873 638125 634881 629996 624927 621298 618102 614160 611153 611097 612803 613901 614500
58438 614500 615740 616728 616103 614874 614629 614700 613985 613503 614172 614271 612294 610124 610131 611389 612110 613407 616971 621347
58420 621347 624360 627162 632006 638039 643197 648314 655376 663516 670656 677287 684704 691362 694922 696177
58406F96177R61K0k271k870j084l45j722j791O89K221J177O74K255K988J488O48
58390F99215J644J528m75p67J710K930J104r4J240J693l87j154J582M111L705
58375G17585L271N165O787O341O678R332J1006R949R490J1259J1507Q298N705
58362H22373O545P570O307N863Q279R896Q293P112Q885R684O282K190J184J081
58348I11544p06j673L22K161J337P85K826M450L606L710O884R327Q554Q388J1416
58333I72931J3661J2232J1101J3389J5277J3688J2564J5074J7028J4853J2712
58322A124510J4604J6643J4596J1895J2544J3103R626N856O480Q561P642O028
58310A252088P297Q842P627O988J0086J3001J2023J1116J4331J7712J6822J5306
$$ plain form
58406 696177 697138 697158 694887 692017 690933 690588 688866 687075 687764 689985 691162 691836 694091 697079 698567 699215
58390 699215 700859 702387 701912 701145 702855 705785 706889 706795 708035 709728 709341 708187 709769 713880 717585
58375 717585 720856 726021 732808 739149 745827 755159 766165 776114 785604 796863 808370 816668 822373
58362 822373 828918 836488 842795 848658 856937 866833 875126 882238 891123 900807 907089 909279 910463 911544
58348 911544 910838 909165 909487 911648 912985 913770 916596 921046 924652 928362 935246 944573 953127 961515 972931
58333 972931 986592 998824 1009925 1023314 1038591 1052279 1064843 1079917 1096945 1111798 1124510
58322 1124510 1139114 1155757 1170353 1182248 1194792 1207895 1217521 1223377 1229857 1238418 1246060 1252088
58310 1252088 1259385 1268227 1275854 1282842 1292928 1305929 1317952 1329068 1343399 1361111 1377933 1393239
58298A393239J7589K0133J8633J6926J9848K4018K4606K4429K7475L0346K9220
58287A646462K8256L1891L5917L5529L4850L8810M3172M2556M0861M3370M6047
58276B067721M3260L8604L7344L5739K9021K2378K2527K5736K5597K5189K9940
58265B403056L5991L7541L8288M3688M9600N0462N0725N6040O1594O1607O1451
58254B950043O7404P3740P3496P2512P8522Q6139Q7508Q7957R5494J04706J07297
58243C884818J08624J17145J27422J30957J33554J44210J57082J62988J68062
58234E134862J81777J97512K05074K11314K27321K46632K58157K68943K91052
58225G222644L17649L36312L54058L84004M19477M47718M76752N20907N72544
$$ plain form
58298 1393239 1410828 1430961 1449594 1466520 1486368 1510386 1534992 1559421 1586896 1617242 1646462
58287 1646462 1674718 1706609 1742526 1778055 1812905 1851715 1894887 1937443 1978304 2021674 2067721
58276 2067721 2110981 2149585 2186929 2222668 2251689 2274067 2296594 2322330 2347927 2373116 2403056
58265 2403056 2439047 2476588 2514876 2558564 2608164 2658626 2709351 2765391 2826985 2888592 2950043
58254 2950043 3017447 3091187 3164683 3237195 3315717 3401856 3489364 3577321 3672815 3777521 3884818
58243 3884818 3993442 4110587 4238009 4368966 4502520 4646730 4803812 4966800 5134862
58234 5134862 5316639 5514151 5719225 5930539 6157860 6404492 6662649 6931592 7222644
58225 7222644 7540293 7876605 8230663 8614667 9034144 9481862 9958614 10479521 11052065
58216A1052065O17236O63810P28910Q05626Q79729R62478J073046J203675J339008
58207A9325583J494092J694218J934531K202501K522745K934128L442574M046755
58199C9597127M787246N711672O813725Q072394R531288J1273658J3352162J5824090
58191A14963362J8810674K2405354K6543181L1028770L5497146L8973534L9480405
58184C27702426L4700167K3723452Q322151p740586k0876159k9362966l3393056
58177C03075429l4074044l2579242k9859617k6615363k3287430k0100155j7162596
58170A19396982j4534351j2228820j0215599q449414o894150n518422m275331
58163E7280895l100313j944167p94260L70644J608147K863945L742806L591498
$$ plain form
58216 11052065 11669301 12333111 13062021 13867647 14747376 15709854 16782900 17986575 19325583
58207 19325583 20819675 22513893 24448424 26650925 29173670 32107798 35550372 39597127
58199 39597127 44384373 50096045 56909770 64982164 74513452 85787110 99139272 114963362
58191 114963362 133774036 156179390 182722571 213751341 249248487 288222021 327702426
58184 327702426 362402593 386126045 394448196 386707610 365831451 336468485 303075429
58177 303075429 269001385 236422143 206562526 179947163 156659733 136559578 119396982
58170 119396982 104862631 92633811 82418212 73968798 67074648 61556226 57280895
58163 57280895 54180582 52236415 51442155 51812799 53420946 56284891 60027697 63619195
58155F3619195K036781n28489l129969m935716n746257n833135n511135m966753
58147C5004522m335282l732665l200446k720881k295214j948501j673261j433704
58139A3664568j220548j049376r13095p85671o67016n78817n20123m67801m16725
58130G045396l81425l61394l40193l15956l00105k88900k67320k38036k17157
58121D334910k04299j85171j60457j44210j36048j22282j03208r3319r5055r6637
58111B994224r5256r8937j05860j04544r4969q8395q6195p9115o7156o0255n9220
58100B054322n5202m8100m6773n0943n1074m6421m5570m8979m8329m3391m2388
58089A527152m5235m3235l6123l2998l5330l5035l0449k8629l0536k9205k4223
$$ plain form
58155 63619195 65655976 65127487 61997518 57061802 51315545 45482410 39971275 35004522
58147 35004522 30669240 26936575 23736129 21015248 18720034 16771533 15098272 13664568
58139 13664568 12444020 11394644 10481549 9695878 9028862 8450045 7929922 7462121 7045396
58130 7045396 6663971 6302577 5962384 5646428 5346323 5057423 4790103 4552067 4334910
58121 4334910 4130611 3945440 3784983 3640773 3504725 3382443 3279235 3185916 3090861 2994224
58111 2994224 2898968 2800031 2694171 2589627 2494658 2406263 2320068 2240953 2173797 2113542 2054322
58100 2054322 1999120 1951020 1904247 1853304 1802230 1755809 1710239 1661260 1612931 1569540 1527152
58089 1527152 1481917 1438682 1402559 1369561 1334231 1299196 1268747 1240118 1209582 1180377 1156154
58078A156154k3153k6804k7393k3109k0683k1750k0337j5752j4582j7694j8193
58067I26704j4461j2739j4622j4249j0220q346j0141j0125o890n778q224r300
58055H01609p920q877j2591j3368j0064q311j0025j0597q463p633q828p864m653
58042F82415m213o925p380m538l414m959m205m33O92k418m267k304p56j812k048
58027F33435l42o01l685n042l221k569m748n691l622k227l166l230j432j260l345
58012E89254l582j016%j983k836q25K93j258k227j388k117n198o506m728m123
57997E51760o569q126o590n420o867q094p439p808j0475j1954j0441r068r555
57984D43354q850n345k328j834j115J531L234K185J098J846K176Q24K70J344Q72
$$ plain form
58078 1156154 1133001 1106197 1078804 1055695 1035012 1013262 992925 977173 962591 944897 926704
58067 926704 912243 899504 884882 870633 860413 852067 841926 831801 824911 819133 810909 801609
58055 801609 793689 784812 772221 758853 748789 740478 730453 719856 711393 703760 694932 687068 682415
58042 682415 678202 671277 663897 659359 655945 650986 646781 646348 647040 644622 640355 638051 637295 635483 633435
58027 633435 633093 632492 628807 623765 620544 617975 613227 607536 603914 601687 598521 595291 593859 592599 589254
58012 589254 585672 584656 584656 582673 579837 579012 579305 578047 575820 574432 572315 567117 560611 555883 551760
57997 551760 545191 537065 530475 525055 518188 510094 502655 494847 484372 472418 461977 452909 443354
57984 443354 434504 429159 426831 424997 423882 425413 428647 430832 431930 433776 435952 436776 437046 438390 439262
57969D39262k156l844k065k61j168k328j421o29j887k886j580M8K93J076L631
57954D24085N449M976M780O652Q100P119N976O828P899P346O662O889N764K034
57940E10559j522k761l798o647r256r403q661r068r484q587q007r142j0278r941
57926D04004r820j1346j2727j2274j1359j1279j0565q164n904n117m147j827O4
57913B99539K70M85J902K986L127M502P786J0127J0183J0910J4230J7136J6632
57900C99815J4512J3430J1997P920K762n26k151l853n337n780o364p963q770p342
57886D02350n477n202n432m564l585l624l182q82J610K489K942M485N890N845
57872C93663N845P328Q596P808O471O652P259O392M940M496L965J636j379l044
$$ plain form
57969 439262 437106 433262 431197 430936 429768 427440 426019 425390 423503 420617 419037 419085 419378 420454 424085
57954 424085 429534 434510 439290 445942 454042 461161 467137 473965 481864 489210 495872 502761 508525 510559
57940 510559 509037 506276 502478 495831 486575 477172 468511 459443 449959 441372 433365 424223 413945 404004
57926 404004 394184 382838 370111 357837 346478 335199 324634 316470 310566 305449 301302 299475 299539
57913 299539 299809 300294 302196 305182 308309 312811 320597 330724 340907 351817 366047 383183 399815
57900 399815 414327 427757 439754 447674 450436 449910 447759 443906 438569 432789 426425 418462 409692 402350
57886 402350 396873 391671 386239 381675 378090 374466 371284 370402 372012 374501 377443 381928 387818 393663
57872 393663 399508 406836 415432 423240 429711 436363 443622 450014 454954 459450 463415 465051 463672 460628
57858D60628l790n006o123o142o087p046p734o790n425n123m881l447k090k215
57844C88729k511j401r3k04n83M01J570J077j16j47L39k94j592k496l923o750
57828C72006r076q793p192o888p772q029p559p345o950n676m714n201n734m599
57814B76478k844k243k033o53R69J138P83J903L996N216N745O992Q711R939J1467
57799C25564J4252J6684J6497J4198J1738R179N778K913K469L347K939J202O2
57786D26822l62j651l868n608o775q378j0069j0619j0426j0904j1839j1831j0785
57773C23707r623q346o670n575n824n966m438k461k148k858k387p60K05L28R31
57758B68115J847J765J131J755L626M899M928M830N137N286N320N864O540O467
$$ plain form
57858 460628 456838 451832 445709 439567 433480 426434 418700 411910 406485 401362 396481 393034 390944 388729
57844 388729 386218 384817 384724 384520 383937 384338 385908 386985 386869 386722 387061 386767 385175 382679 378756 372006
57828 372006 362930 354137 346945 340057 332285 324256 316697 309352 302402 296726 292012 286811 281077 276478
57814 276478 273634 271391 269358 268705 269674 270812 271595 273498 277494 282710 288455 295447 304158 314097 325564
57799 325564 339816 356500 372997 387195 398933 408112 413890 416803 419272 422619 425558 426760 426822
57786 426822 426460 424809 420941 415333 408558 400180 390111 379492 369066 358162 346323 334492 323707
57773 323707 314084 305738 299068 293493 287669 281703 277265 274804 272656 269798 267411 266651 266856 267184 268115
57758 268115 269962 271727 272858 274613 278239 283138 288066 292896 298033 303319 308639 314503 321043 327510
57744C27510N912N702N653N374N647O985P969P218N823N505N712N120M586N644
57730D10360P335P707P438Q611J0719J1384J0528J0377J1613J2826J3721J5479
57718E38098J7869J9142J9198J9875K1771K3531K4618K6109K8381L0602L2818
57707H02012L6221M0972M6082N1491N8020O5250P1919P8442Q6531R6296J06230
57696A539466J16160J27460J40085J51934J61674J69708J75841J78311J75640
57687B936279J67363J52602J30210J00890O7347L1963l811l7826o7307r0924j08858
57676C277928j20722j25531j23827j17572j07684r3709p6022n6114l4590j1641
57666B410516R636K2497K0560J949k9697o6264r7685j16673j22491j19197j10458
$$ plain form
57744 327510 333422 339124 344777 350151 355798 362783 370752 377970 383793 389298 395010 400130 404716 410360
57730 410360 417695 425402 432840 441451 452170 463554 474082 484459 496072 508898 522619 538098
57718 538098 555967 575109 594307 614182 635953 659484 684102 710211 738592 769194 802012
57707 802012 838233 879205 925287 976778 1034798 1100048 1171967 1250409 1336940 1433236 1539466
57696 1539466 1655626 1783086 1923171 2075105 2236779 2406487 2582328 2760639 2936279
57687 2936279 3103642 3256244 3386454 3487344 3554691 3586654 3582843 3545017 3477710 3386786 3277928
57676 3277928 3157206 3031675 2907848 2790276 2682592 2588883 2512861 2456747 2422157 2410516
57666 2410516 2420152 2442649 2463209 2465158 2435461 2369197 2271512 2154839 2032348 1913151 1802693
57655A802693r7784q2891o8502n6008m4722l4038k4383j5587o627K484J0623J7813
57643A403071K5501L4118M2503N0281N8670O8264P8105Q7675R7829J08985J20164
57632B175166J30516J39968J47698J51801J51160J45977J35908J19469R6122O7460
57622C461245L5641K217l1096o2089q9255j12083j29959j42214j49342j52597
57612B630468j52317j48297j41710j34568j27233j18535j08607r9278r1308q3594
57602A425021p5716o8899o3637n8628n3105m8150m4564m1361l7562l3771l0796
57591H68832k8191k5395k2905k1299k0223j9118j7943j6527j4487j2193j0654
57580F59897j0044r586q974q502p720n784l302j908j691j005P84K371K940L344
$$ plain form
57655 1802693 1704909 1622018 1553516 1497508 1452786 1418748 1394365 1378778 1372151 1374635 1385258 1403071
57643 1403071 1428572 1462690 1505193 1555474 1614144 1682408 1760513 1848188 1946017 2055002 2175166
57632 2175166 2305682 2445650 2593348 2745149 2896309 3042286 3178194 3297663 3393785 3461245
57622 3461245 3496886 3499103 3468007 3405918 3316663 3204580 3074621 2932407 2783065 2630468
57612 2630468 2478151 2329854 2188144 2053576 1926343 1807808 1699201 1599923 1508615 1425021
57602 1425021 1349305 1280406 1216769 1158141 1105036 1056886 1012322 970961 933399 899628 868832
57591 868832 840641 815246 792341 771042 750819 731701 713758 697231 682744 670551 659897
57580 659897 649853 640267 631293 622791 615071 609287 605985 604077 602386 601381 602165 604536 607476 610820
57566F10820M233M995N407O413Q297R986J1046J2509J4787J6668J7492J8552K1087
57553G62292K4433K7379K9953L2797L6022L9648M4053M9200N4580O0421O7511
57542A228289P5508Q3021Q9793R6956J04587J11080J15600J19068J21707J21650
57532B267259J17026J07569R3218P3349M8704K2059m374l0398n5441p6978r3075
57521B468918j04584j12929j17425j16933j12677j07222j01582r5244q8201q1096
57511A431025p4005o6694n9639n3467m7890m2314l6871l1932k7318k2868j8934
57500I49093j5514j1878p846m318j753P24L892P373J0776J4469J8388K1681K4527
57487A009614K8670L4857M1424M6822N1881N8097O5171P2053P9040Q6876R4870
$$ plain form
57566 610820 615053 620048 625455 631868 640165 650151 661197 673706 688493 705161 722653 741205 762292
57553 762292 786725 814104 844057 876854 912876 952524 996577 1045777 1100357 1160778 1228289
57542 1228289 1303797 1386818 1476611 1573567 1678154 1789234 1904834 2023902 2145609 2267259
57532 2267259 2384285 2491854 2585072 2658421 2707125 2729184 2724810 2694412 2638971 2561993 2468918
57521 2468918 2364334 2251405 2133980 2017047 1904370 1797148 1695566 1600322 1512121 1431025
57511 1431025 1357020 1290326 1230687 1177220 1129330 1087016 1050145 1018213 990895 968027 949093
57500 949093 933579 921701 913855 909537 907784 908508 912400 919773 930549 945018 963406 985087 1009614
57487 1009614 1038284 1073141 1114565 1161387 1213268 1271365 1336536 1408589 1487629 1574505 1669375
57476A669375J01676J07049J11180J13155J11524J05621R5036P8994N7795L3725
57466B585130Q918j6559m2865o7836q8373j03499j14180j20952j23710j23162
57456A792912j20439j15656j08642j00622r3355q6958q0346p3406o7017o1283
57446H85188n5559m9984m5309m1376l7447l3819l1341k9508k6888k3475k0842
57435D89640j9650j8703j6956j4974j3784j3417j3267j3004j2534j1703j0425
57424C31223q813p103n749n297n734o281o329o154o110n810m832l640k923k552
57410B53896k059j646j704j895j703j395j473j668j473j165j257j449j211q89
57396B32909j017j137n43K93L85n9m6L81K10o76j188p70j31K3r9j6L32Q93J686
$$ plain form
57476 1669375 1771051 1878100 1989280 2102435 2213959 2319580 2414616 2493610 2551405 2585130
57466 2585130 2594048 2577489 2534624 2466788 2378415 2274916 2160736 2039784 1916074 1792912
57456 1792912 1672473 1556817 1448175 1347553 1254198 1167240 1086894 1013488 946471 885188
57446 885188 829629 779645 734336 692960 655513 621694 590353 560845 533957 510482 489640
57435 489640 469990 451287 434331 419357 405573 392156 378889 365885 353351 341648 331223
57424 331223 322410 315307 309558 304261 298527 292246 285917 279763 273653 267843 263011 259371 256448 253896
57410 253896 251837 250191 248487 246592 244889 243494 242021 240353 238880 237715 236458 235009 233798 232909
57396 232909 231892 230755 230212 230505 230890 230831 230785 231166 231376 230700 229512 228742 228611 228634 228535 228519 228851 229744 231430
57377B31430K499K947K990K863K611K272K250K914L916M540M543M147L587L233
57363B76742L682M991O168O251N513M884M566M074L255K392J501L65q87j936k741
57348C18820l338l484l116k709k628k577k239j848j510p45N88J677J946J968K360
57333C03165K619K199J821K415L513M107M409N307O607P311P374P644Q338Q938
57319C75767R433J0316J1381J1887J1858J2130J3086J4371J5735J7122J8187J8770
57307E40043J9566K1272K3341K4643K4992K4915K4358K2982K1338K0315J9453
57296G87218J7262J3199Q121K823k603q072j3327j8443k3404k7303k9183k9404
57284F76884k9040k8236k6552k4532k3319k2731k1431j9105j6904j5452j3970
$$ plain form
57377 231430 233929 236876 239866 242729 245340 247612 249862 252776 256692 261232 265775 269922 273509 276742
57363 276742 280424 285415 291583 297834 303347 308231 312797 316871 320126 322518 324019 324384 323497 321561 318820
57348 318820 315482 311998 308882 306173 303545 300968 298729 296881 295371 294626 295214 296891 298837 300805 303165
57333 303165 305784 307983 309804 312219 315732 319839 324248 329555 336162 343473 350847 358491 366829 375767
57319 375767 385200 395516 406897 418784 430642 442772 455858 470229 485964 503086 521273 540043
57307 540043 559609 580881 604222 628865 653857 678772 703130 726112 747450 767765 787218
57296 787218 804480 817679 825800 828623 826020 817948 804621 786178 762774 735471 706288 676884
57284 676884 647844 619608 593056 568524 545205 522474 501043 481938 465034 449582 435612
57273D35612j1839r605p934o693n590m693m019l386k844k407j471M55K555L476
57259C81617L242L150L777M435M615M612M546M182L891M463N667O339O106N707
57245D46349N529N226N021N789P399Q440Q177P455P196P281P469Q031Q898R438
57231E47698R610J0216J1433J2331J2411J2381J2841J3410J3743J4200J4909J5326
57219G00509J5391J5863J6883J7442J7028J6590J7043J7994J8793J9694K1049
57208H94279K2302K2778K2678K2504K2347K2406K3239K4760K5914K6111K6063
57197A155381K6499K7095K7486K8193K9599L0888L1145L0732L0586L0785L0859
57186A479248L0862L1176L1754L2402L3376L4955L6844L8610M0151M1339M1896
$$ plain form
57273 435612 423773 414168 406234 399541 393951 389258 385239 381853 379009 376602 375131 375586 378141 381617
57259 381617 384859 388009 391786 396221 400836 405448 409994 414176 418067 422530 428197 434536 440642 446349
57245 446349 451878 457104 462125 467914 475313 483753 491930 499385 506581 513862 521331 529362 538260 547698
57231 547698 557308 567524 578957 591288 603699 616080 628921 642331 656074 670274 685183 700509
57219 700509 715900 731763 748646 766088 783116 799706 816749 834743 853536 873230 894279
57208 894279 916581 939359 962037 984541 1006888 1029294 1052533 1077293 1103207 1129318 1155381
57197 1155381 1181880 1208975 1236461 1264654 1294253 1325141 1356286 1387018 1417604 1448389 1479248
57186 1479248 1510110 1541286 1573040 1605442 1638818 1673773 1710617 1749227 1789378 1830717 1872613
57175A872613M2170M3260M5653M8517N0843N2473N3348N2852N0744M7968M5556
57164B405997M3457M1211L9072L7541L6524L5748L5304L4959L3821L1628K9583
57153B804845K8782K8600K7842K6785K6732K7894K9071K9349K8972K8483K7986
57142C115341K7370K6655K5914K5214K4541K3578K1968J9969J8290J7026J5472
57131C361338J3380J1538J0548R925R047Q237Q143Q832J0234J2828J6995K2345
57119C503390K8328L4847M1678M8081N3825N9774O6739P4493Q2684R1816J02607
57108D188262J15283J30367J49203J72791K01165K34881K76042L26878L88589
57099F183461M62844N53441O65003Q00896R63257J153427J370437J610003J866561
$$ plain form
57175 1872613 1914783 1958043 2003696 2052213 2103056 2155529 2208877 2261729 2312473 2360441 2405997
57164 2405997 2449454 2490665 2529737 2567278 2603802 2639550 2674854 2709813 2743634 2775262 2804845
57153 2804845 2833627 2862227 2890069 2916854 2943586 2971480 3000551 3029900 3058872 3087355 3115341
57142 3115341 3142711 3169366 3195280 3220494 3245035 3268613 3290581 3310550 3328840 3345866 3361338
57131 3361338 3374718 3386256 3396804 3406729 3415776 3424013 3432156 3440988 3451222 3464050 3481045 3503390
57119 3503390 3531718 3566565 3608243 3656324 3710149 3769923 3836662 3911155 3993839 4085655 4188262
57108 4188262 4303545 4433912 4583115 4755906 4957071 5191952 5467994 5794872 6183461
57099 6183461 6646305 7199746 7864749 8665645 9628902 10782329 12152766 13762769 15629330
57090A5629330K135187K409786K680341K933580L155057L328792L436419L458916
57082C9167408L377588L172068K823112K327332J713053J037346L62381k67814
57074E3712474q32820j327809j755322k120499k426602k671889k851250k960665
57066C6765618k999799k972341k886247k753181k585813k395030k189883j978881
57058A6004443j769918j569249j381431j209715j055692r19240p99700o96721
57050F602777o09491n36035m74214m22693l80088l44015l12054k83207k57460
57041B983520k34313k12717j92229j73343j56722j42475j30101j18807j08110
57032A514703r8180q9323q1180p3123o5298n8393n2425m6770m1453l7140l3725
$$ plain form
57090 15629330 17764517 20174303 22854644 25788224 28943281 32272073 35708492 39167408
57082 39167408 42544996 45717064 48540176 50867508 52580561 53617907 53980288 53712474
57074 53712474 52879654 51551845 49796523 47676024 45249422 42577533 39726283 36765618
57066 36765618 33765819 30793478 27907231 25154050 22568237 20173207 17983324 16004443
57058 16004443 14234525 12665276 11283845 10074130 9018438 8099198 7299498 6602777
57050 6602777 5993286 5457251 4983037 4560344 4180256 3836241 3524187 3240980 2983520
57041 2983520 2749207 2536490 2344261 2170918 2014196 1871721 1741620 1622813 1514703
57032 1514703 1416523 1327200 1246020 1172897 1107599 1049206 996781 950011 908558 871418 837693
57021H37693l0271k6620k3591k1241j8528j5172j2019r005m643J571Q271J4769
57009G01214K2420L2286M3882N7588P5650R9107J27198J61912K06947K54615K76995
56998B059814K41713J42602J0966j07226j83450k16638k20053k06526j84485j59460
56988A177257j34497j10585q8424o9134n2987l9141k7266j8434j3738j2931j4738
56977E95382j7785k0898k3252k4629k5210k4980k3769k1752j9428j7052j4591
56966C62036j2112r723p274m572j774J023M329Q703J3716J8135K1035K1929J9931
56953D35382J4034M713n531j3921j9309k1987k2404k0858j8082j5167j2731j0581
56941B93558q327n876l308o23K223N277Q649J2446J6579K0840K5017K8618L0295
$$ plain form
57021 837693 807422 780802 757211 735970 717442 702270 690251 681246 676603 678174 686445 701214
57009 701214 723634 755920 799802 857390 933040 1032147 1159345 1321257 1528204 1782819 2059814
56998 2059814 2301527 2444129 2455095 2347869 2164419 1947781 1727728 1521202 1336717 1177257
56988 1177257 1042760 932175 843751 774617 721630 682489 655223 636789 623051 610120 595382
56977 595382 577597 556699 533447 508818 483608 458628 434859 413107 393679 376627 362036
56966 362036 349924 340201 332927 328355 326581 327604 331933 340636 354352 372487 393522 415451 435382
56953 435382 449416 454129 448598 434677 415368 393381 370977 350119 332037 316870 304139 293558
56941 293558 285231 279355 276047 275424 277647 282924 291573 304019 320598 341438 366455 395073 425368
56928D25368K8145K1073R960k691j4235k2970k8256l0267k9811k7995k5632k3006
56916B79683k0237j7680j5716j4342j3190j1889j0270q373o463m947m037l526
56904A49013l056k503j902j169j93Q35J579K059K636L484M395N237O242P618R185
56889A83460J0662J2114J3794J5648J7198J7739J6506J2916P166O04m923q337
56877B94547r840j0262j0143r546q408o764m711k409r5K090M322O961J0197J3933
56863B69872J8104K2931K8678L5111M1124M4734M3605L6121K2724O315r005k0174
56851E40140k6443k8849k8760k7001k3938j9909j5397j0792o049p16N443J1921
56839C69650J7927K3478K9636L7435M6786N6605O5424P1199P0855O1315M1888
$$ plain form
56928 425368 453513 474586 484546 481855 467620 444650 416394 386127 356316 328321 302689 279683
56916 279683 259446 241766 226050 211708 198518 186629 176359 167986 161523 156576 152539 149013
56904 149013 145957 143454 141552 140383 140190 141025 142604 144663 147299 150783 155178 160415 166657 174275 183460
56889 183460 194122 206236 220030 235678 252876 270615 287121 300037 307203 307807 302884 294547
56877 294547 284707 274445 264302 254756 246348 239584 234873 232464 232369 234459 238781 245742 255939 269872
56863 269872 287976 310907 339585 374696 415820 460554 504159 540280 563004 569319 560314 540140
56851 540140 513697 484848 456088 429087 405149 385240 369843 359051 353002 352286 357729 369650
56839 369650 387577 411055 440691 478126 524912 581517 646941 718140 788995 850310 892198
56828H92198J5781j1078l3076m7396n4370n5990n4104m9781m3851l7282l0723
56817D90328k4124j7371j0995n583o35N146J2301K0071K7668L5210M2688M8344
56805F23048M8904M1738K6838P056j3265l0228m1782m7770m9076m6910m2659l7584
56793D38310l2231k6468k0368j4647r854n634j323L100P228J1122J5329K0068
56781C84632K4894K8899L0682K8401K0922R313l429j4455k2531k7561k9651k9225
56769D00891k7363k5179k2962k0472j7838j5576j3834j2243j0588r056p777o618
56757B11385n619n094n037m872m192l340k854k642k281j878j951k427k559k050
56743A64589j562j698k049j902j451j496k165k707k612k225k056k057j889j461
$$ plain form
56828 892198 907979 896901 863825 816429 762059 706069 651965 602184 558333 521051 490328
56817 490328 466204 448833 437838 432255 431620 436766 449067 469138 496806 532016 574704 623048
56805 623048 671952 713690 740528 747584 734319 704091 662309 614539 565463 518553 475894 438310
56793 438310 406079 379611 359243 344596 334742 329108 327785 330885 338113 349235 364564 384632
56781 384632 409526 438425 469107 497508 518430 527743 524314 509859 487328 459767 430116 400891
56769 400891 373528 348349 325387 304915 287077 271501 257667 245424 234836 225780 218003 211385
56757 211385 205766 200672 195635 190763 186571 183231 180377 177735 175454 173576 171625 169198 166639 164589
56743 164589 163027 161329 159280 157378 155927 154431 152266 149559 146947 144722 142666 140609 138720 137259
56729A37259q42o0O71Q43J61r85j837j952j366l63O98J392J392O46n90j779k286
56712A31002j811q36k21k78m91l24O3J82r8m59n66k79K90P31O07J4m39l98j14
56693A26575J54O15J391K009J998J604J334J139P13K89L63P64Q27M58K43M24N23
56676A41423J84l59q70j484k105k025p77R84J973J558K21j136j978k269k192j920
56660A29228j588j312j065o42L5N46K87n98j071m09P46J172N80k23o39q52j063
56643A23132r66l94J69K35Rj2K29M34N12N41M41J06k46k79o8k4l09o39o74l19
56623A21878L39J093J551J412R04O97J085J512J245M00j68p3L4n32j352j374m16
56606A28235N56P40M30L34N59P36P48P65Q11Q21R14J197J420J319J106J118J203
$$ plain form
56729 137259 136417 136357 137028 137871 138032 137047 135210 133258 131892 131529 132227 133619 135011 135657 135067 133288 131002
56712 131002 129191 128355 128134 127856 127365 127041 127104 127286 127188 126729 126163 125884 126174 126905 127512 127526 127087 126689 126575
56693 126575 126729 127344 128735 130744 132742 134346 135680 136819 137532 137821 138184 138948 139775 140233 140476 140900 141423
56676 141423 141607 141248 140378 138894 136789 134764 133987 134971 136944 138502 138723 137587 135609 133340 131148 129228
56660 129228 127640 126328 125263 124621 124656 125202 125489 124891 123820 123411 124157 125329 125909 125686 125047 124195 123132
56643 123132 122166 121772 121941 122176 122185 122173 122402 122836 123348 123889 124330 124436 124190 123911 123843 123819 123510 122871 122197 121878
56623 121878 122217 123310 124861 126273 127177 127874 128959 130471 131716 132116 131948 131875 131909 131377 130025 128651 128235
56606 128235 128791 129531 129961 130295 130854 131590 132338 133103 133914 134735 135649 136846 138266 139585 140691 141809 143012
56589A43012R81N80M99P93J030J060J212J602J855J771J647J708J724J508J398
56574A62380J753K367K779K992L413M123M650M537L982L668M067N041O119O959
56560B18830P388P223O474N691N590O166O584O203N332M645M238L634K402M60
56546B90860j895l855m507l835k985k995l645m151m487n188o228o960p078o827
56532B26224o360n666n070m988n190n052m489l936l427k660j893j851k469k716
56518A70457j996r54m81o14q85j131j398j497j156m87O5J36k49o68o39j65K67
56501A58605L98N41Q84R71M93L9L09J014J436J660K177K645K340J599J474J966
56485A78551K066J615J618K369K851K501K185K627L257L386L417L868M232L923
$$ plain form
56589 143012 143993 144573 145072 145865 146895 147955 149167 150769 152624 154395 156042 157750 159474 160982 162380
56574 162380 164133 166500 169279 172271 175684 179807 184457 188994 192976 196644 200711 205752 211871 218830
56560 218830 226218 233441 239915 245606 251196 257362 263946 270149 275481 280126 284364 287998 290400 290860
56546 290860 288965 285110 280603 276768 273783 270788 267143 262992 258505 253317 247089 240129 233051 226224
56532 226224 219864 214198 209128 204140 198950 193898 189409 185473 182046 179386 177493 175642 173173 170457
56518 170457 168461 167507 167026 166412 165527 164396 162998 161501 160345 159858 159923 160059 159810 159142 158503 158338 158605
56501 158605 159003 159544 160428 161399 161892 161931 162240 163254 164690 166350 168527 171172 173512 175111 176585 178551
56485 178551 180617 182232 183850 186219 189070 191571 193756 196383 199640 203026 206443 210311 214543 218466
56471B18466L496L826M611M781M059L200K911L162L440L132J945K83j005j512
56457B54795j570j614j712j841j938j652p23K29J91p97j507j149k08N78J088J304
56441B43474R41J12n28p44j044j588j778j385j132j521k036k015j551r95n07m07
56425B27296j051j919j982j336j206j869k045j098k68p10j651j751j043l25L02
56410B09344R19Q64l60j961k851l002k791j962m34Q06R70P77J211J774J409M06
56394B05119o8K39O95J081J522J648J128N79P09J018O40n5k2P18J227J188J024
56377B18390Q53N14L60Q10J403J369Q27M18K06j7Q0P71J402J274Q93J142J786
56360B32481K035K028K403K885K723K117J829J802J549J453K190L204L295K543
$$ plain form
56471 218466 221962 225788 230399 235180 239239 242439 245350 248512 251952 255084 257029 257312 256307 254795
56457 254795 253225 251611 249899 248058 246120 244468 243745 243974 244165 243368 241861 240712 240504 241082 242170 243474
56441 243474 244415 244527 243999 243255 242211 240623 238845 237460 236328 234807 232771 230756 229205 228210 227703 227296
56425 227296 226245 224326 222344 221008 219802 217933 215888 214790 214522 213812 212161 210410 209367 209042 209344
56410 209344 210263 211127 210767 208806 205955 202953 200162 198200 197766 198572 199542 200319 201530 203304 204713 205119
56394 205119 205051 205290 205985 207066 208588 210236 211364 211943 212652 213670 214310 214255 214233 214951 216178 217366 218390
56377 218390 219243 219757 220117 220927 222330 223699 224526 224944 225150 225133 225213 225984 227386 228660 229553 230695 232481
56360 232481 234516 236544 238947 241832 244555 246672 248501 250303 251852 253305 255495 258699 261994 264537
56346B64537K142K480K797K736K848L502M433N364O076O120N497N177N825O481
56332C26015N854M444L780L927L511K124R67Q40J011N48m25j260j667j772j897
56317C46000k357k951k932k010r16k91K24R61J230N39j24L76J468J795J364J197
56301C43573J440J474J401J814K426K513K372K777L402L375L039L468M623N470
56287C83167N719N923O274O736P860R851J1489J1711J1639J3066J5601J7426J8395
56274E24857K0042K2791K5514K7821L0541L3852L7071M0431M4895N0046N4247
56263I12108N7178O0144O3624O6484O7957O8464O8169O6579O3829O0631N6681
56252A611848N1025M4083L7490L1743K5988K0170J5389J1818Q372M743J711r13
$$ plain form
56346 264537 266679 269159 271956 274692 277540 281042 285475 290839 296915 303035 308532 313709 319534 326015
56332 326015 331869 336313 340093 344020 347531 349655 350622 351462 352473 353021 352596 351336 349669 347897 346000
56317 346000 343643 340692 337760 335750 334834 334543 334767 335728 336958 337497 337373 337749 339217 341012 342376 343573
56301 343573 345013 346487 347888 349702 352128 354641 357013 359790 363192 366567 369606 373074 377697 383167
56287 383167 388886 394809 401083 407819 415679 425530 437019 448730 460369 473435 489036 506462 524857
56274 524857 544899 567690 593204 621025 651566 685418 722489 762920 807815 857861 912108
56263 912108 969286 1029430 1093054 1159538 1227495 1295959 1364128 1430707 1494536 1555167 1611848
56252 1611848 1662873 1706956 1744446 1776189 1802177 1822347 1837736 1849554 1857926 1862669 1864380 1863467
56240A863467m635j0048j6094k1955k7900l3941l9469m4569m9928n5133n8887
56229A500908o1000o2341o2710o0898n7065n2980m9578m6282m2922m0160l7673
56218I27299l4226l0043k6996k5832k5185k3825k1980k0031j7878j6065j5557
56207F69681j5976j5844j4813j3792j2837j1062q696p068o297n197l516k116r50
56194E51517Q60K938M123M883O656Q897R658R042R047R882R730Q415P906Q580
56180F52134Q390O569M870M307L800K997L195M505N207M953N464P106Q067P888
56166G29452Q422J0131J0931J0077R707J1016J2319J2492J2965J4601J5818J5764
56154H73695J6150J8178K0717K3308K7760L4818M2374M9049N6632O7060P9930
$$ plain form
56240 1863467 1858832 1848784 1832690 1810735 1782835 1748894 1709425 1664856 1614928 1559795 1500908
56229 1500908 1439908 1377567 1314857 1253959 1196894 1143914 1094336 1048054 1005132 964972 927299
56218 927299 893073 863030 836034 810202 785017 761192 739212 719181 701303 685238 669681
56207 669681 653705 637861 623048 609256 596419 585357 576661 569593 563296 558099 554583 552467 551517
56194 551517 552377 555315 559438 564321 570977 579874 589532 598574 607621 617503 627233 635648 643554 652134
56180 652134 660524 667093 671963 676270 680070 683067 686262 690767 695974 700927 706391 713497 721564 729452
56166 729452 737874 748005 758936 769013 778720 789736 802055 814547 827512 842113 857931 873695
56154 873695 889845 908023 928740 952048 979808 1014626 1057000 1106049 1162681 1229741 1309671
56143A309671R4855J13184J35267J58680J80864K00531K14819K18563K08960J88521
56133C023915J61990J33450J07860R1068Q4896Q4529Q2897P5445N9895L5810P191
56122C948946j8070l4429m2538m5972m8083n3756o9244r6282j29106j60005j84949
56111C066512k01912k08198k03175j90576j74641j56464j36566j17702j02084
56102A575194q8714p6203o5315n6379m7593l8503l1607k7967k4845k0312j6333
56091A081423j4472j2617r182o375n908n435k775P4P93Q18K056L319L481M337
56077A039537O775Q137O949O122P849R607R122Q712J0584J2396J1890J1449J3381
56064A162510J5173J4254J3067J4416J6102J5266J3872J4789J6532J6972J7903
$$ plain form
56143 1309671 1404526 1517710 1652977 1811657 1992521 2193052 2407871 2626434 2835394 3023915
56133 3023915 3185905 3319355 3427215 3518283 3603179 3687708 3770605 3846050 3905945 3941755 3948946
56122 3948946 3930876 3896447 3853909 3807937 3759854 3706098 3636854 3540572 3411466 3251461 3066512
56111 3066512 2864600 2656402 2453227 2262651 2088010 1931546 1794980 1677278 1575194
56102 1575194 1486480 1410277 1344962 1288583 1240990 1202487 1170880 1142913 1118068 1097756 1081423
56091 1081423 1066951 1054334 1045152 1038777 1032869 1027434 1024659 1024733 1025526 1026344 1028400 1031719 1035200 1039537
56077 1039537 1046312 1054449 1061398 1067520 1075369 1084976 1094098 1102810 1113394 1125790 1137680 1149129 1162510
56064 1162510 1177683 1191937 1205004 1219420 1235522 1250788 1264660 1279449 1295981 1312953 1330856
56053A330856K0896K3021K2026K1164K3456K5946K5257K4074K5955K8619K8633
56042A599903K8151L0406L3058L2727L1673L3301L5430L4752L3493L4794L6201
56031A963889L4662L3248L5645L8883L8928L8567M1921M6226M7165M7374N1254
56020B417762N6207N7647N7944O1580O6285O7825O8737P3220P8321P9412P9433
56009C164373Q3338Q8657R1133R4123J02313J11817J16880J20570J28212J36491
55999D237907J40283J43819J53171J64153J70063J74748J85167J97810K05968
55990E773089K13529K27483K43931K56150K68959K89934L14161L33866L54740
55981H275842L85830M21930M54111M88405N34727N86981O34968O86129P53335
$$ plain form
56053 1330856 1351752 1374773 1396799 1417963 1441419 1467365 1492622 1516696 1542651 1571270 1599903
56042 1599903 1628054 1658460 1691518 1724245 1755918 1789219 1824649 1859401 1892894 1927688 1963889
56031 1963889 1998551 2031799 2067444 2106327 2145255 2183822 2225743 2271969 2319134 2366508 2417762
56020 2417762 2473969 2531616 2589560 2651140 2717425 2785250 2853987 2927207 3005528 3084940 3164373
56009 3164373 3247711 3336368 3427501 3521624 3623937 3735754 3852634 3973204 4101416 4237907
55999 4237907 4378190 4522009 4675180 4839333 5009396 5184144 5369311 5567121 5773089
55990 5773089 5986618 6214101 6458032 6714182 6983141 7273075 7587236 7921102 8275842
55981 8275842 8661672 9083602 9537713 10026118 10560845 11147826 11782794 12468923 13222258
55972A3222258Q31585R10577R99480J113643J248229J392642J559195J768013
55964B3045622K016941K299335K638104L067268L595894M229333N006700N970286
55956E1869483P116949Q433715R964632J1789337J3965580J6561379J9701622
55949A39402697K3479473K7837194L2583698L7325327M1009194M1545301L6511422
55942C79694306K4962251Q751182q178675k2054690l1055273l5362251l6117151
55935B80639699l4548162l1679208k8274603k4800586k1485324j8455468j5790507
55928A05605841j3493953j1513936r813619q380443p180334o158856n286230m557219
55920C9221251l950775l430415k980768k606326k296930k028103j791985j596049
$$ plain form
55972 13222258 14053843 14964420 15963900 17077543 18325772 19718414 21277609 23045622
55964 23045622 25062563 27361898 30000002 33067270 36663164 40892497 45899197 51869483
55956 51869483 58986432 67420147 77384779 89174116 103139696 119701075 139402697
55949 139402697 162882170 190719364 223303062 260628389 301637583 343182884 379694306
55942 379694306 404656557 413407739 405229064 383174374 352119101 316756850 280639699
55935 280639699 246091537 214412329 186137726 161337140 139851816 121396348 105605841
55928 105605841 92111888 80597952 70784333 62403890 55223556 49064700 43778470 39221251
55920 39221251 35270476 31840061 28859293 26252967 23956037 21927934 20135949 18539900
55912A8539900j433943j286996j151954j039182r45682q56280p69669o97988o41655
55903I716551n88138n34752m90344m54955m18970l82150l53468l32248l08308
55894E853218k80717k58465k42751k25845k07256j94215j86101j74521j59073
55885C924274j47707j41290j32736j21490j14285j11173j04993r5320q9411q8598
55875B777271q6719q2478q0718q0880p6824o8900o4111o3385o0363n3662m8800
55864B010431m6818m2262l3909k6924k2828j7374r806m851m412o172j0783k1005
55852A763287l3361m0136m0485m0621m2763m3078m0945m0550m2336m2072l9476
55841A317464l8902m0506l9553l5537l3231l3536l2007k7767k5299k5819k5206
$$ plain form
55912 18539900 17105957 15818961 14667007 13627825 12682143 11825863 11056194 10358206 9716551
55903 9716551 9128413 8593661 8103317 7648362 7229392 6847242 6493774 6161526 5853218
55894 5853218 5572501 5314036 5071285 4845440 4638184 4443969 4257868 4083347 3924274
55885 3924274 3776567 3635277 3502541 3381051 3266766 3155593 3050600 2955280 2865869 2777271
55875 2777271 2690552 2608074 2527356 2446476 2369652 2300752 2236641 2173256 2112893 2059231 2010431
55864 2010431 1963613 1921351 1887442 1860518 1837690 1820316 1810510 1805659 1801247 1795075 1784292 1763287
55852 1763287 1729926 1689790 1649305 1608684 1565921 1522843 1481898 1441348 1399012 1356940 1317464
55841 1317464 1278562 1238056 1198503 1162966 1129735 1096199 1064192 1036425 1011126 985307 960101
55830I60101k2075j9955j9774j8106j4441j2539j2951j1858q810q052j0443j1651
55818G89446j0107r331j0476j0063p197n821p462q577p438o948q395q919p507
55805F81205p118q633q822o531m860n122m650k637k187m344n933n491n618p366
55791F01893q014o521n475n541l734L88K466k11n144r633j4054j8073j9087j6943
55777D92317j5178j5250j4513j1905j0287j0872j0774q666p505q851r639p648
55765C61229n242m707m484l114k415l485l848j829J72j03j057o83j64j142k776
55750C26352m168o357r440j1111j0456r871j0843j1332r649p471o531n745m095
55737B19283l071l732m331l333j907j289n76P91J362M90j36L36K84j102k073j666
$$ plain form
55830 960101 938026 918071 898297 880191 865750 853211 840260 828402 819592 811540 801097 789446
55818 789446 779339 770008 759532 749469 742272 736451 728989 720412 712974 706026 697631 688712 681205
55805 681205 674087 665454 656632 650101 645241 640119 635469 632832 630645 626301 620368 614877 609259 601893
55791 601893 593879 587358 581883 576342 572608 572996 575462 575251 570107 560474 546420 528347 509260 492317
55777 492317 477139 461889 447376 435471 425184 414312 403538 394872 387367 378516 368877 361229
55765 361229 355987 351280 346796 343682 341267 337782 333934 332105 332277 332174 331117 330434 330270 329128 326352
55750 326352 322184 315827 306387 295276 284820 274949 264106 252774 243125 235654 229123 223378 219283
55737 219283 216212 212480 208149 204816 202909 201620 201044 201835 203197 203687 203551 203887 204171 203069 200996 199330
55721A99330j508k429k675j382m92j082j207M07J877J688J450K717M154M289M189
55706B09326M974N539N055M939O017O469M910K904K134J722M78p29j000j298k244
55691B49196k622j978k124m006n716n633m975n239n710n450n171n215m263j967
55677A89127k83k86l79M88O97r37k750l035k649k681k253o42J043K268M387P564
55661A89679R365Q588P513P899P827N158J330j134k377l660m483m099l705m456
55647B13445n218m785m202m655n222n073n485p223q281o860m459l401l399l125
55633A42057k933l440l551k520j939l032m057l152j597j469k027j479m59o51j581
55618A08170j704j296j506j831j252n60j072k212k688k680k683j850J60J399K81
$$ plain form
55721 199330 197822 195393 192718 191336 190844 189762 188555 188962 190839 192527 193977 196694 200848 205137 209326
55706 209326 214300 219839 224894 229833 235850 242319 247229 250133 252267 253989 254467 253738 252738 251440 249196
55691 249196 246574 244596 242472 238466 232750 227117 222142 216903 211193 205743 200572 195357 191094 189127
55677 189127 188844 188558 188179 188667 189364 188427 185677 182642 179993 177312 175059 174417 175460 177728 182115 189679
55661 189679 199044 207632 215145 223044 230871 236029 237359 236225 233848 230188 225705 221606 217901 213445
55647 213445 208227 203442 199240 194585 189363 184290 178805 171582 163301 156441 151982 148581 145182 142057
55633 142057 139124 135684 132133 129613 127674 124642 120585 117433 115836 114367 112340 110861 110402 109751 108170
55618 108170 106466 105170 103664 101833 100581 100021 98949 96737 94049 91369 88686 86836 86996 88395 88676
55603H8676j639j975j062o41p12l48j37r56j653p80O62Q04N2l1K71k94j173r73
55585G8091k57p02k069k626j988j274r43n54k15l06m89m29o23j139p91Q29K119
55568F6634J882J342J896K624K086Q95L05n5q79j366r29q87k028k511q20J118
55552F9307P83p55p13Q87J830J658J724K177K043J618J880K276J711Q83J070J594
55536H9973J241R73K241L735L076R11m6N97Q53K23J96R63Q32p45k356l114l444
55519I6109l412k587j675j925l021l545l282k959k375j117m77k004m542n429m309
55504E3450l122k647j838n49p5p26j304j290j303j350q02p3j86p81o67j29m48
55487C6160j353j424p41p56j535j629o80J74N16R31J135K26j160j310k31L39j61
$$ plain form
55603 88676 87037 85062 84000 83359 82647 82299 82162 81206 79553 78773 79435 80239 80291 80260 80531 80237 79064 78091
55585 78091 77834 77132 75063 72437 70449 69175 68232 67678 67463 67157 66668 66239 65616 64477 63686 64515 66634
55568 66634 68516 69858 71754 74378 76464 77359 77664 77609 76730 75364 74435 73548 71520 69009 68189 69307
55552 69307 70090 69335 68622 69509 71339 72997 74721 76898 78941 80559 82439 84715 86426 87309 88379 89973
55536 89973 91214 92187 94428 98163 101239 102150 102104 102701 103554 103777 103973 104936 105768 105023 102667 99553 96109
55519 96109 92697 90110 88435 86510 83489 79944 76662 73703 71328 70211 69734 67730 63188 57759 53450
55504 53450 50328 47681 45843 45294 45219 44493 43189 41899 40596 39246 38444 38371 38185 37404 36737 36608 36160
55487 36160 34807 33383 32642 31886 30351 28722 28042 28216 28732 29663 30798 31024 29864 28554 28323 28662 28501
55470B8501m75N7O77R48J212J116j15j813k363j644r68o85m7P08N33j72J02J211
55452B6783J439M81o1M77R05N25O2j71q02j585j325r2N77K37J43Q05J066K59p08
55433B9015j015r10n06N43J729J900J145P08Q27N02l51o07k0L81K75L77N81l3
55415C4541j036q36N43J187M36j36M44J007O15J66N47J001N95l35j212k115k826
55398C2586k497j122M3K27p0l95r12j262n82P66J226L45o24q50q64q95l00P33
55380B5553R08k9p08m64l22q38r77j83L51k79j148j123n37l0O86J711K021J028
55362B5620j81l62J93N63P15R90J070N53j28l29j06J07J78J24j31m83q08j381
55344B6204k308k763j884k83O39P66J079J613J390M44N4N54P45k3q92j140j137
$$ plain form
55470 28501 28026 28083 28760 29708 30920 32036 31921 30108 27745 26101 25133 24448 24401 25109 25642 25470 25572 26783
55452 26783 28222 28703 28642 29119 30024 30549 30611 30440 29638 28053 26728 26636 27213 27450 27593 28398 29464 29723 29015
55433 29015 28000 27090 26584 27127 28856 30756 31901 32609 33436 33938 33587 32980 32960 33341 33616 33993 34574 34541
55415 34541 33505 32669 33212 34399 34835 34699 35143 36150 36765 36931 37478 38479 39074 38739 37527 35412 32586
55398 32586 30089 28967 29010 29237 29167 28772 27860 26598 26016 26782 28008 28353 27729 26879 26015 25120 24820 25553
55380 25553 26461 26432 25724 25260 24938 24100 23123 22940 23291 23012 21864 20741 20204 20174 20860 22571 24592 25620
55362 25620 25439 25077 25270 25833 26548 27538 28608 29161 29033 28704 28598 28705 28883 29007 28876 28393 27585 26204
55344 26204 23896 21133 19249 18966 19605 20371 21450 23063 24453 24897 24951 25505 26250 26227 25335 24195 23058
55327B3058j190r03k82P0J98P35J332Q67m74j176q46p02j108p36R90K564K536
55310B4933J368K11o46j275j443j252j195j098l69N24M79j69N1J104J262N5q97
55293B1643o70l63p16p96j17J68n58j088n66N0rN8P16Q96J80P4J403K469J619
55274B4393j08q12n25l16j27M61P38R8m27J95R96N42n91q01j00J52n05j352j934
55255A9977k262k019r77K67R89J284J434J137L05l06j28L83P35J137J496R77m53
55238B3976j402j031l03k04k15K49M43k04o91j01O23K45o70r18o97p63o97K27
55220A7867J325J478R78P77O79K1o79m74K55M23M9j18j64n87r55n29K43L96J22
55201B1107L08Q12O97j07p36p40l46K29P33O18j91p70l92L59O77Q04J174J237
$$ plain form
55327 23058 21868 20965 20683 20753 20951 21686 23018 23885 23411 22235 21389 20687 19579 18843 19833 22397 24933
55310 24933 26301 26512 25866 24591 23148 21896 20701 19603 19234 19758 20237 20068 20119 21223 22485 22540 21643
55293 21643 20973 20610 19894 19098 18981 19149 18591 17503 16937 16987 16978 17036 17752 18648 18828 18902 20305 22774 24393
55274 24393 24285 23473 22948 22632 22505 22966 23704 23802 23375 23570 24566 25108 24517 23716 23616 23768 23263 21911 19977
55255 19977 17715 15696 14719 14986 15975 17259 18693 19830 20135 19829 19701 20084 20819 21956 23452 24429 23976
55238 23976 22574 21543 21240 21036 20821 21070 21513 21309 20618 20517 21140 21385 20715 19797 19100 18337 17640 17867
55220 17867 19192 20670 21648 22425 23104 23125 22446 21972 22227 22650 22699 22581 22417 21830 20875 20346 20589 20985 21107
55201 21107 21415 22227 22924 22817 22081 21341 20995 21224 21957 22575 22384 21614 21222 21581 22258 23062 24236 25473
55183B5473L89o84r19m69j76j85k22m50q79p70J35P19R4p79n29M81R37O32K85
55164B3083K3l78m68J66P96O05J18K36O05M51J66M65Q06L28l77k60K16nl64M42
55144B6654J918K228J140L86R61J939K179J638P47o1j06R77K352K876K670K604
55128E1102K591J914R19O80J120J096L79j29k25p74j978k810k638k109j948k002
55112D5188j869j529j036m22j07m98j151j148l74L42L83p0n69p95n36O0M98O73
55094C7040J074J655J400p2j366j067J74P20M47N00J074J212P06M46P27P67J75
55077D5612l67k78J40L16M7n99j273j371p54j49o3Q2R34J896K001J476J256J386
55059E0292J226P67M46J18n53r89m75M74Q71R81J772K977L415K982K689K775K405
$$ plain form
55183 25473 25862 25178 24259 23790 23614 23429 23207 22757 21878 21108 21243 21962 22056 21277 20748 21229 22166 22798 23083
55164 23083 23106 22728 22260 22426 23222 23827 23945 24181 24786 25237 25403 25868 26674 27002 26625 26365 26581 26576 26212 26654
55144 26654 28572 30800 31940 32326 33287 35226 37405 39043 39790 39729 39623 40600 42952 45828 48498 51102
55128 51102 53693 55607 56526 57206 58326 59422 59801 59672 59447 58673 56695 53885 51247 49138 47190 45188
55112 45188 43319 41790 40754 40332 40225 39727 38576 37428 37054 37396 37779 37709 37140 36345 35809 35869 36367 37040
55094 37040 38114 39769 41169 41097 39731 38664 38838 39558 40005 40505 41579 42791 43497 43943 44670 45437 45612
55077 45612 45245 44967 45107 45423 45470 44871 43598 42227 41473 41324 41261 41343 42277 44173 46174 47650 48906 50292
55059 50292 51518 52285 52731 52849 52296 51307 50832 51306 52177 53158 54930 57907 61322 64304 66993 69768 72173
55042G2173J290J49n79j031j031k91N06L41m70o66q5J51l55p43n39l39m66l67
55024F7648J88N38K76j95n48r83j458j477r59n00n00p82j090j241r36j75L24k6
55006E8104o92q28o28q14j265j347j216j430j660j172l07n3l93m64j21P6J47N05
54988D6442P74L64j33K95J165J147M21M77J644K629K664K344K124J788J608K304
54972F8057L575M277M311M719N780O701P357Q545J0260J1481J1957J2420J2759
54959A72199J1824R439O723M071O89l328o535q398j0009j1884j2842j2156j0866
54946A28927r999r096p578o088n331m910m332l893l744l319k493k017k101j834
54932F2192p37M39J160J872K706K909K393K329L331M526N231N989P037P434O880
$$ plain form
55042 72173 73463 73612 73033 72002 70971 70680 71186 71527 71057 70391 70306 70457 70102 69359 68820 68481 68015 67648
55024 67648 67836 68374 68650 68455 67907 66924 65466 63989 63030 62530 62030 61248 60158 58917 57981 57806 58130 58104
55006 58104 57412 56584 55956 55142 53877 52530 51314 49884 48224 47052 46745 46692 46299 45835 45714 45790 45937 46442
54988 46442 47216 47580 47447 47742 48907 50054 50475 50952 52596 55225 57889 60233 62357 64145 65753 68057
54972 68057 71632 75909 80220 84939 90719 97420 104777 113322 123582 135063 147020 159440 172199
54959 172199 184023 193462 200185 204256 204945 201617 195082 186684 176675 164791 151949 139793 128927
54946 128927 118928 109832 102254 96166 90835 85925 81593 77700 73956 70637 68144 66127 64026 62192
54932 62192 61455 61894 63054 64926 67632 70541 72934 75263 78594 83120 88351 94340 101377 108811 115691
54917A15691O752P937R014Q076N231J973r06l400n262o290o957p666q037p757
54903A08399p363p311p163o459n515m591l329j797r24j055j218q04o70j515k359
54888E6326j932o17L04M66L35R6j89o8N37P35j00j250j710j585j475j301p74k83
54870D7515k64l61j61n5m84j012j082r95j228j541j514j320j144o99n5Kp11j102
54852C3789m00N39N85Rl04l23m18k62N11J320J470J318J420J342N30l08r9Q21
54834D1540J152M99l05n00K5J074K129K322J368J96j14L92R47J245J442J582J740
54817E6734K213K944L366L372L629M395N043N414O383Q243R755R946R597R663
54803A40697R436P772N105K608K49k626n497p201p783q118q178p257n678m626
$$ plain form
54917 115691 122443 130380 139394 147470 152701 154674 153768 150368 145106 138816 131859 124193 116156 108399
54903 108399 101036 93725 86562 80103 74588 69997 66668 64871 63947 62892 61674 60870 60200 58685 56326
54888 56326 54394 53777 54081 54547 54882 54978 54789 54721 55258 55993 55893 54643 52933 51348 49873 48572 47798 47515
54870 47515 47251 46890 46729 46674 46190 45178 44096 43101 41873 40332 38818 37498 36354 35655 35600 35602 34891 33789
54852 33789 33389 33928 34513 34522 34218 33895 33477 33215 33726 35046 36516 37834 39254 40596 41126 40818 40719 41540
54834 41540 42692 43191 42886 42386 42411 43485 45614 47936 49304 49500 49386 49778 50725 51970 53412 54994 56734
54817 56734 58947 61891 65257 68629 72258 76653 81696 87110 93493 101736 111491 121437 131034 140697
54803 140697 150133 157905 163010 165618 165867 163241 157744 150543 142760 134642 126464 119207 113529 108903
54789A08903m421m335m005l693l318k521j545r34n25J26O08K36n47o06K27J170
54773H4820J883K648L400L853M396N585O964P697Q182R528J1517J2564J1952J0688
54759A85677R801R015P539N192K266q85l720n702o874p728q481r005r387r802
54745A57906r965r404q275p204o463n865n346m992m700m383m203m091l488k242
54731G7285j188j079j497j712j860k251k202r43P44J293N58j38m7K10Rm24o55
54714F6103n86k42J92J68n27j119p64J23N37M87P51J317J350P09J58J4j94o42
54696F7835q94p67n32k26K30L69k54r61o51M67J141R82P18O12J86k96K29J708
54678F9896K585K041J198J329K059K351K186K194K342J998R55l09j116r54J77
$$ plain form
54789 108903 104482 100147 96142 92449 89131 86610 85065 84131 83606 83732 84340 84576 84029 83423 83650 84820
54773 84820 86703 89351 92751 96604 101000 106585 113549 121246 129428 138956 150473 163037 174989 185677
54759 185677 195478 204493 212032 217224 219490 218605 214885 209183 202309 194581 186100 177095 167708 157906
54745 157906 147941 138537 130262 123058 116595 110730 105384 100392 95692 91309 87106 83015 79527 77285
54731 77285 76097 75018 73521 71809 69949 67698 65496 64553 65297 66590 67148 67010 66963 67173 67182 66758 66103
54714 66103 65517 65275 65467 65635 65108 63989 63225 63348 63885 64372 65123 66440 67790 68499 68657 68671 68477 67835
54696 67835 66941 66174 65642 65416 65646 66015 65761 64800 64149 64616 65757 66739 67457 68069 68255 67959 68188 69896
54678 69896 72481 74522 75720 77049 79108 81459 83645 85839 88181 90179 91134 90825 89709 88755 88932
54663H8932J519K154K027J850J951J985J984K582L843M821M934M955N929P669
54649A37135R109R647R499R165R050R367R800R526P864M831Q94l403p306r923
54635B05255j0951j1112j1356j1757j1535j0144q013o135n072m531l980l405l148
54622A04116l133k809k044j435j409j588j524j430j631j831j655j382j417j493
54608G9335j231j011j345j816j672j204j308j915j994j188l26j08l02m80o00o51
54592F2184m64j71j66m37n61m01j75R8M96O48J17o29o14K29R11Q06L40L0k32o31
54572F1378q69o40j59J22n4o63j326j373n44M45O69J76k04j21P4K11N67J131J461
54553F0281J413J304J260J071P65O88R74J529K345L247L589L045K434K750L648
$$ plain form
54663 88932 90451 92605 94632 96482 98433 100418 102402 104984 108827 113648 118582 123537 129466 137135
54649 137135 146244 155891 165390 174555 183605 192972 202772 212298 220162 224993 225887 222484 215178 205255
54635 205255 194304 183192 171836 160079 148544 138400 130387 124252 119180 114649 110669 107264 104116
54622 104116 100983 98174 96130 94695 93286 91698 90174 88744 87113 85282 83627 82245 80828 79335
54608 79335 78104 77093 75748 73932 72260 71056 69748 67833 65839 64651 64325 64217 63915 63435 62835 62184
54592 62184 61720 61549 61383 60946 60385 59984 59809 59907 60403 61051 61168 60539 59925 60154 61065 61871 62211 62241 62009 61378
54572 61378 60509 59869 59710 59832 59778 59115 57789 56416 55872 56317 56986 57162 56958 56837 56911 57122 57689 58820 60281
54553 60281 61694 62998 64258 65329 66094 66782 67756 69285 71630 74877 78466 81511 83945 86695 90343
54538I0343M041L952M441N641O349N878M932M122K880O96j696l201l782m204m850
54523A15542n515n915n884n316m325l283k498k072j984k002j651p70N0K01q7k16
54507G4275l06q79j670j851j366r98r90p49n6N06O05O58R14R95P11N09O64P76
54489G1748M51j27o14r00r38p35n43n20k92M53J142R32lp49j054j389j744j597
54471F3521j039p20o34j74N34O75K40J14N20O95M31M09P15M84m29q92k56O55R83
54452F5832R42Q64M15m09q49o72p62j546k060j474m63o9j98j56J38L91N78O27
54434F1129K57k66j76M77O17p5m72J22P50M47j52p1K76L4l66Q8J232J980J919
54415F7750J476R60N01N35J326K304K758K763K691K373J572P71N73Q07R76J076
$$ plain form
54538 90343 94384 98336 102777 108418 114767 120645 125577 129699 132579 133275 131579 128378 124596 120392 115542
54523 115542 110027 104112 98228 92912 88587 85304 82806 80734 78750 76748 75097 74327 74377 74578 74491 74275
54507 74275 73969 73090 71420 69569 68203 67205 66215 65466 65410 65916 66521 67179 68093 69088 69799 70308 70972 71748
54489 71748 72199 72072 71458 70558 69620 68885 68342 67822 67530 67983 69125 70057 70054 69305 68251 66862 65118 63521
54471 63521 62482 61762 61128 60954 61488 62163 62403 62517 63037 63732 64163 64572 65287 65771 65342 64450 64194 64849 65832
54452 65832 66774 67638 68053 67644 66795 66123 65361 63815 61755 60281 59818 59749 59551 59395 59533 59924 60502 61129
54434 61129 61386 61120 60944 61421 62038 61963 61491 61613 62363 62810 62658 62587 62863 62897 62531 62619 63851 65831 67750
54415 67750 69226 70186 70687 71222 72548 74852 77610 80373 83064 85437 87009 87780 88353 89160 90136 91212
54399I1212J185Q73j23j172j531j325j102r76r64j419k310k746k141j188q01p85
54383G4687n16j64k29m42k81l2k72p48q05n45n39p51p28n01l92k89N8M43O81J133
54363F9768J937K239J273l00j051m89P59J947K533K108R66K73P21J516J595J155
54347H6950R56Q27J99m93m00J73J44o03j220j416j675k023j943j449j146j131
54331G5750r50o77r11j654k185k130j751j224n29j3j15n05m18J58N04K80j90o68
54313F2772j156j440j339j239j486j530p12M48Q11L33J8K51M67M52O19Q44L16
54296E8429j042k168k287j770j252q07m28m10p36p92j93O74J197J187Q23M02L00
54279E1127O22Q98O46J46K8K42J67l45p70p77n23k05P7O4k85l58K96J047R96M96
$$ plain form
54399 91212 92397 93270 93147 91975 90444 89119 88017 87041 86077 84658 82348 79602 77461 76273 75472 74687
54383 74687 74171 74007 73778 73336 73055 73023 72751 72003 71198 70653 70114 69363 68635 68134 67742 67453 67511 67954 68635 69768
54363 69768 71705 73944 75217 74917 73866 73377 74136 76083 78616 80724 81690 81963 82684 84200 85795 86950
54347 86950 87906 88733 88932 88439 88039 88212 88356 87753 86533 85117 83442 81419 79476 78027 76881 75750
54331 75750 74800 74123 73212 71558 69373 67243 65492 64268 63739 63726 63611 63106 62688 62846 63350 63630 63440 62772
54313 62772 61616 60176 58837 57598 56112 54582 53870 54318 55129 55462 55480 55731 56198 56650 57269 58113 58429
54296 58429 57387 55219 52932 51162 49910 49103 48675 48265 47529 46737 46544 47218 48415 49602 50425 50827 51127
54279 51127 51749 52647 53293 53439 53467 53709 53876 53531 52761 51984 51461 51256 51333 51397 51112 50754 51050 52097 53093 53589
54259E3589O34J387J577Q41K34N71J320J638J465J038L53m08p18m84k60l07k63
54242F2207o5k79j024j424q37J44N68M12L06M80O18M60L6m51o74m45q0q9l35j23
54222E9405O97J347J200N98J37k61r58j699j743p89O57J730J857J136K61p5J61
54205F3661M66M27J6o45j341j647j327p95o80q88p43m0O62Q92P21K13p73j933
54187E6246k386j716o17NJ07K66O59R06P30L58K03L81N95M57Mk74j22L6k70p17
54167E4851n37K93Q65N11l79r60r14n78m13n50p09m59K80J042J300J054O63K56
54149E5616k71q42j185j260j238j109o92o5M01L94j20r15j510j397o07K03N23
54132D5926N25N00K84k29n30j43N18P29N36M70N09K31k33l52j30k8r3RJ96J14
$$ plain form
54259 53589 54223 55610 57187 58028 58262 58833 60153 61791 63256 64294 64647 64239 63521 63037 62777 62470 62207
54242 62207 62142 61863 60839 59415 58578 58722 59290 59702 60008 60488 61106 61566 61602 61151 60477 60032 59952 59863 59528 59405
54222 59405 60102 61449 62649 63247 63384 63123 62165 60466 58723 57934 58591 60321 62178 63314 63575 63500 63661
54205 63661 64127 64554 64570 63925 62584 60937 59610 58815 58135 57247 56504 56464 57126 58018 58739 58952 58179 56246
54187 56246 53860 52144 51527 51532 51639 51905 52564 53470 54200 54558 54761 55142 55737 56194 56198 55924 55802 55838 55568 54851
54167 54851 54314 54607 55472 55983 55604 54644 53730 53152 52739 52189 51480 51021 51301 52343 53643 54697 55360 55616
54149 55616 55345 54503 53318 52058 50820 49711 49019 48954 49355 49749 49629 48714 47204 45807 45200 45403 45926
54132 45926 46451 46951 47235 47006 46476 46333 46851 47580 48116 48586 49095 49326 49093 48741 48611 48583 48490 48499 48695 48809
54112D8809m4J69N13L58r3m4M97O15K1m80k79K01L47J96%k29m50m69l15j56J43
54091D9310P33J164Q76K33N2K30o6q37j111n51O9K54M22P37N90j54o20k57L42
54072E1416N77P53J091R54n2j083j111l44K85M52M83N55O13O73O70L97j2o1L38
54053E6594O77P42Q89J117Q60J77Q8J002J855J657R93R71J434J405P69L99R16
54036G2545K165L625M605M439L268K302K495L414M068M355M798N287N166M329
54022A26861L372K708K309K217K548K955K826K041J091M77L59N66O37O3j093k105
54006A47832k512k665k956l059k597k018k024k462k670k552k496k462k071j562
53992A13726j658k359k726k154j189p31r16j187j094p53o08r45j521j753j315
$$ plain form
54112 48809 48765 48934 49447 49805 49712 49668 50165 50780 50801 50321 50042 50243 50590 50786 50786 50557 50107 49638 49323 49167 49310
54091 49310 50043 51207 52083 52316 52368 52598 52532 51695 50584 50033 50102 50356 50778 51515 52105 51951 51331 51074 51416
54072 51416 51993 52746 53837 54791 54739 53656 52545 52201 52486 52938 53421 53976 54589 55262 55932 56329 56317 56256 56594
54053 56594 57271 58013 58902 60019 60879 61056 61144 62146 64001 65658 66651 67622 69056 70461 71230 71629 72545
54036 72545 74710 78335 82940 87379 90647 92949 95444 98858 102926 107281 112079 117366 122532 126861
54022 126861 130233 132941 135250 137467 140015 142970 145796 147837 148928 149405 149764 150330 150967 151030 149937 147832
54006 147832 145320 142655 139699 136640 134043 132025 130001 127539 124869 122317 119821 117359 115288 113726
53992 113726 112068 109709 106983 104829 103640 102909 101993 100806 99712 98959 98351 97406 95885 94132 92817
53977I2817n02K20P31J199J596J664J261M93m16j218j708j892j978k063j956j418
53961H6830m42P01J565J709J151N68O13J039J011L68j16J11O33Q10O14L36O8o0
53943I7509L20J289K334L040L613M338M984N253N267N174M733L843K922K256J513
53928A48388N30l2L59J079J144O35L76M85L69NR8Q25J409J325J096J491K476L426
53910A65484L940M031L899L874M338N269N990N696M291K454Q98k14j019j413j193
53895B06325o09l35o85j244j568j794k249k850l412m131n050n510m967m093m022
53880A63806m624m701l956l464l869m319l829k687j826j624j934k583l175l192
53866A18023k789k759l138k870j574n64j049k238k443j487o73p21j097j273j448
$$ plain form
53977 92817 92315 92535 93266 94465 96061 97725 98986 99479 99063 97845 96137 94245 92267 90204 88248 86830
53961 86830 86388 87089 88654 90363 91514 92082 92695 93734 94745 95113 94997 95108 95741 96551 97165 97501 97569 97509
53943 97509 97829 99118 101452 104492 108105 112443 117427 122680 127947 133121 137854 141697 144619 146875 148388
53928 148388 148918 148886 149245 150324 151468 152103 152479 152964 153333 153338 153436 154261 155670 156995 158091 159582 162058 165484
53910 165484 169424 173455 177354 181228 185566 190835 196825 202521 206812 209266 210164 209950 208931 207518 206325
53895 206325 205716 205381 204696 203452 201884 200090 197841 194991 191579 187448 182398 176888 171921 167828 163806
53880 163806 159182 154481 150525 147061 143192 138873 135044 132357 130531 128907 126973 124390 121215 118023
53866 118023 115234 112475 109337 106467 104893 104329 103280 101042 98599 97112 96439 95718 94621 93348 91900
53851I1900j829k148k153j896j413o89J5K98J28k30o38j038j126o15K27P63P02
53834H0258L30J31M00J053J538J254K57o65q62m15K58Q42J001M99j77m1J042J883
53816H8586J435J28q28q94l21N27J263J378Q33L80O86J525K278K664K574J911
53800A04125J234J627L218M606M669M049L885L953L349K301J836K050K082J540
53786A44524P66n5q83j153l94O73R06M24K60M98J75r38j883k109k215k626k801
53769A33169k258j490j225j488j888k217k370k253k012j985k141k097j700j187
53755A06858o72p3M20L67l29j263j968k200j863j200p69q73j113r95o23l87l02
53738I3015k73n15j076j361q69p7J76k40r35j709k324k196j287o16q52j066j39
$$ plain form
53851 91900 90071 87923 85770 83874 82461 81772 81787 82085 82213 81983 81345 80307 79181 78566 78793 79556 80258
53834 80258 80588 80719 81119 82172 83710 84964 85221 84556 83694 83279 83537 84379 85380 85879 85702 85661 86703 88586
53816 88586 90021 90149 89321 88427 88106 88633 89896 91274 92107 92487 93173 94698 96976 99640 102214 104125
53800 104125 105359 106986 110204 114810 119479 123528 127413 131366 134715 137016 138852 140902 142984 144524
53786 144524 145290 145235 144352 143199 142805 143478 144384 144808 145068 145566 145741 144803 142920 140811 138596 135970 133169
53769 133169 130911 129421 128196 126708 124820 122603 120233 117980 115968 113983 111842 109745 108045 106858
53755 106858 106186 106113 106533 106900 106571 105308 103340 101140 99277 98077 97308 96435 95322 94327 93704 93317 93015
53738 93015 92742 92227 91151 89790 88921 88844 89020 88780 87845 86136 83812 81616 80329 79713 78861 77795 77656
53721G7656J269J686J114O94M74m94j956k404j500o77p69p82J47J189J267Q08
53705G7722R36J744K356K203J468O72L12N66J130J627K152K897L460L348K916
53690A05509K841K830K059P54K3J19K39K01P87K007K673K273J894K360K856K328
53674A31753J225P26J088J699K200K585K702K388J827J304R54R27J281J590J282
53659A55531N20n3l70r13j525j429o76k99p14j108q79m71k89lM97O09J39j92j0
53640A48365J22q4k3M95O40N6l04J66N76R3n59m22K7j35n95n10j13j77n12l77
53620A46729J12K87J53J97L65L62M53Q73J019L68l07P1J202J901J912J927K122
53603A59746K049J753J695J740J468J342K240L812M622M120L248K917L004L165
$$ plain form
53721 77656 78925 80611 81725 82419 82893 82399 80443 78039 76539 75862 75093 74311 74458 75647 76914 77722
53705 77722 78658 80402 82758 84961 86429 87101 87413 87979 89109 90736 92888 95785 99245 102593 105509
53690 105509 108350 111180 113239 113993 114016 114135 114374 114575 115362 117369 120042 122315 124209 126569 129425 131753
53674 131753 132978 133704 134792 136491 138691 141276 143978 146366 148193 149497 150451 151378 152659 154249 155531
53659 155531 156051 155998 155628 154715 153190 151761 151085 150786 150072 148964 148085 147614 147325 147322 147819 148428 148567 148375 148365
53640 148365 148487 148403 148380 148875 149515 149571 149267 149433 150009 150102 149543 149121 149148 149013 148418 147908 147795 147618 147106 146729
53620 146729 146841 147128 147281 147478 147843 148205 148658 149531 150550 150918 150611 150682 151884 153785 155697 157624 159746
53603 159746 161795 163548 165243 166983 168451 169793 172033 175845 180467 184587 187835 190752 193756 196921
53589A96921L476L852L763L077K499K629L195L583L616L420K960K210J490J327
53575B38018J939K917L426K883J638P42P51J088R42M17K68P32J196J063L73l93
53559B58000q62j084j521k480l531l781k975j854j111n79J30P07N21m72j692k551
53543B34865k641j827o02N8k45q52j086j137j337j246l89O30Q16K50o5L36R43
53526B26471J210J152R76Q48R81J413J823J969K035K140K008J667J881L095M459
53511B54128M879M612M736N437N950O075O522P665Q963R861J0436J0918J1326
53498C51508J1720J2200J2603J2775J3058J3883J4989J5766J6219J6903J7956
53487E09580J8997J9897K0799K1516K1641K1292K0910K0481J9771J9231J9612
$$ plain form
53589 196921 200397 204249 208012 211089 213588 216217 219412 222995 226611 230031 232991 235201 236691 238018
53575 238018 239957 242874 246300 249183 250821 251563 252314 253402 254344 254761 255029 255761 256957 258020 258393 258000
53559 258000 257138 256054 254533 252053 248522 244741 241766 239912 238801 238222 238352 239059 239580 239108 237416 234865
53543 234865 232224 230397 229795 229853 229608 228756 227670 226533 225196 223950 223561 224191 225007 225257 225192 225528 226471
53526 226471 227681 228833 229809 230657 231638 233051 234874 236843 238878 241018 243026 244693 246574 249669 254128
53511 254128 259007 263619 268355 273792 279742 285817 292339 300004 308967 318828 329264 340182 351508
53498 351508 363228 375428 388031 400806 413864 427747 442736 458502 474721 491624 509580
53487 509580 528577 548474 569273 590789 612430 633722 654632 675113 694884 714115 733727
53476G33727K0743K1700K2260K3040K4095K4656K4583K4857K5979K7011K6901
53465I99552K5946K4978K3928K2163J9875J8119J7471J7412J7111J6403J5732
53454A218690J5431J5216J4583J3591J3013J3310J3759J3056J0809P899N359L343
53442A358059J337j047l659n918p343q145r143j0766j2426j3397j3951j4921j6420
53429A242260j7846j9067k0555k2199k3047k2663k1889k1680k1863k1669k0938
53418A008844k0144j9529j8838j7896j6919j6205j5737j5118j3848j1766r270
53407H33574o964n143l715k460j072Q14L234N614P286Q256R066J0063J1195J2467
53393H82215J4024J5768J7326J8516J9476K0334K1112K1908K2836K3863K5034
$$ plain form
53476 733727 754470 776170 798430 821470 845565 870221 894804 919661 945640 972651 999552
53465 999552 1025498 1050476 1074404 1096567 1116442 1134561 1152032 1169444 1186555 1202958 1218690
53454 1218690 1234121 1249337 1263920 1277511 1290524 1303834 1317593 1330649 1341458 1349357 1354716 1358059
53442 1358059 1359396 1358349 1354690 1348772 1341429 1333284 1324141 1313375 1300949 1287552 1273601 1258680 1242260
53429 1242260 1224414 1205347 1184792 1162593 1139546 1116883 1094994 1073314 1051451 1029782 1008844
53418 1008844 988700 969171 950333 932437 915518 899313 883576 868458 854610 842844 833574
53407 833574 826610 821467 817752 815292 814220 815034 818268 823882 831168 839424 848490 858553 869748 882215
53393 882215 896239 912007 929333 947849 967325 987659 1008771 1030679 1053515 1077378 1102412
53382A102412K6642K8778L0928L2615L4101L5950L8109M0098M1864M3714M5550
53371A500761M7049M8413N0087N1755N2584N2477N2192N2170N2182N2181N2433
53360B064284N2511N1329M8627M5454M2638L9793L6394L2977L0394K8574K6829
53349B499804K4887K2866K0615J7820J4498J0893P003K666k124p370j3345k0367
53337B577846k8403l6928m4896n0969n4430n5990n7007n7824n7677n6423n5214
53326B022085n4876n4594n3156n0762m8698m7685m7475m7704m8134m8237m7497
53315A473267m6094m4639m3216m1374l8982l6400l3815l1021k7964k4954k2262
53304A082546j9894j7810j5990j4328j2877j2122j2433j3197j3098j1512r185
$$ plain form
53382 1102412 1129054 1157832 1188760 1221375 1255476 1291426 1329535 1369633 1411497 1455211 1500761
53371 1500761 1547810 1596223 1646310 1698065 1750649 1803126 1855318 1907488 1959670 2011851 2064284
53360 2064284 2116795 2168124 2216751 2262205 2304843 2344636 2381030 2414007 2444401 2472975 2499804
53349 2499804 2524691 2547557 2568172 2585992 2600490 2611383 2618386 2621052 2618928 2611558 2598213 2577846
53337 2577846 2549443 2512515 2467619 2416650 2362220 2306230 2249223 2191399 2133722 2077299 2022085
53326 2022085 1967209 1912615 1859459 1808697 1759999 1712314 1664839 1617135 1569001 1520764 1473267
53315 1473267 1427173 1382534 1339318 1297944 1258962 1222562 1188747 1157726 1129762 1104808 1082546
53304 1082546 1062652 1044842 1028852 1014524 1001647 989525 977092 963895 950797 939285 930100
53293I30100p303o226n477m632l812l298k986k449j446j85J001K120L444N001
53279I03852O426P345P807Q257R266J1264J4209J7320J9562K0587K1057K1746
53267A068698K2608K3061K2945K2729K2761K2775K2356K1644K1169K1028K0573
53256A312347J9182J7171J5540J4797J4368J3505J2239J1012R648P425M155N37
53244A451926k709n593q448j1273j3842j6165j8563k1356k4576k7751l0020l0851
53232A240779l0772l0942l1853l2837l3048l2392l1226k9666k7767k5960k4718
53221I09598k3903k3052k2216k1990k2673k3805k4753k5330k5632k5551k4768
53210F45925k3168k1009j8673j6415j4344j2522j0926r481q260p503p219o960
$$ plain form
53293 930100 922797 916571 911094 906462 902650 899352 896366 893917 892471 892286 893287 895407 898851 903852
53279 903852 910278 917623 925430 933687 942953 954217 968426 985746 1005308 1025895 1046952 1068698
53267 1068698 1091306 1114367 1137312 1160041 1182802 1205577 1227933 1249577 1270746 1291774 1312347
53256 1312347 1331529 1348700 1364240 1379037 1393405 1406910 1419149 1430161 1439809 1447234 1451389 1451926
53244 1451926 1449217 1443624 1435176 1423903 1410061 1393896 1375333 1353977 1329401 1301650 1271630 1240779
53232 1240779 1210007 1179065 1147212 1114375 1081327 1048935 1017709 988043 960276 934316 909598
53221 909598 885695 862643 840427 818437 795764 771959 747206 721876 696244 670693 645925
53210 645925 622757 601748 583075 566660 552316 539794 528868 519387 511127 503624 496405 489445
53198D89445o343n717n777o511p188p482p877q592q869q136p189p225q042q317
53184C86180p549o602o247o191n911n486n194m994m922n323o195o900p010o923
53170C00733p100p223o726n780n089m926m951m841m515l902l020k331k435l215
53156B34679l655k929j481p34j538l128l912l166j642m76o5k60j009k174l092
53141B05418l130k530k064j918j675j277j179j451j527j158q08q85j193j458j740
53126A81425k034k005j573j185j179j295j182q97o30l92k47m08q53j251j431j487
53110A63376j349q29k40j91n51m47M12J223J357J254J491J741J428P07K7o92j643
53093A67074k330k137j412j208k013l338m306m251l046j452p42j436k667l323
$$ plain form
53198 489445 483102 477385 471608 465097 457909 450427 442550 433958 425089 416953 409764 402539 394497 386180
53184 386180 378631 372029 365782 359591 353680 348194 343000 338006 333084 327761 321566 314666 307656 300733
53170 300733 293633 286410 279684 273904 268815 263889 258938 254097 249582 245680 242660 240329 237894 234679
53156 234679 231024 228095 226614 225880 224342 221214 217302 214136 212494 212018 211953 211693 210684 208510 205418
53141 205418 202288 199758 197694 195776 194101 192824 191645 190194 188667 187509 186701 185816 184623 183165 181425
53126 181425 179391 177386 175813 174628 173449 172154 170972 170075 169445 169053 168806 168398 167545 166294 164863 163376
53110 163376 162027 161198 160958 160767 160216 159769 160181 161404 162761 164015 165506 167247 168675 169382 169409 168717 167074
53093 167074 164744 162607 161195 159987 157974 154636 150330 146079 143033 141581 140839 139403 136736 133413
53079A33413l344l299l247k819k145j790j883k101k330k645k747k237j367q28
53065A00631p68p27n29m47m65j26O20J196J252J170J274J154L10r33j713j720
53049A00179j397j140q17l05rl50r66j035m38P1L3q4J02L2p77j519j087M3L51
53030I0887l53o37J84R28N75j51k04Nm00j060j074p55j061j741j605n87K7m50
53012H2528j166j176o64l13k83l53l96l02O0M87M90p8p84j218j377j344r92k29
52994G2890P54J625K127K088J508O10l19j086j452j154k67O65J218J454J474J061
52978H3196K50k29K18J092J342P22qr8N93J790K937L301K587J472Q81Q82R50J042
52960A02920J641K677L313L016K228J682J568J644J665J526J285J172J355J692
$$ plain form
53079 133413 130069 126770 123523 120704 118559 116769 114886 112785 110455 107810 105063 102826 101459 100631
53065 100631 99863 99136 98607 98160 97695 97569 98189 99385 100637 101807 103081 104235 104545 103612 101899 100179
53049 100179 98782 97642 96825 96520 96511 96161 95195 94160 93722 93793 93826 93742 93844 93876 93099 91580 90493 90536 90887
53030 90887 90534 89897 90081 91009 91584 91433 91229 91234 90834 89774 88700 87945 86884 85143 83538 82951 82978 82528
53012 82528 81362 80186 79522 79209 78926 78573 78177 77875 77935 78422 78912 78834 78050 76832 75455 74111 73119 72890
52994 72890 73644 75269 77396 79484 80992 81602 81283 80197 78745 77591 77324 77989 79207 80661 82135 83196
52978 83196 83446 83217 83435 84527 85869 86591 86583 86485 87078 88868 91805 95106 97693 99165 100046 100928 101878 102920
52960 102920 104561 107238 110551 113567 115795 117477 119045 120689 122354 123880 125165 126337 127692 129384
52946A29384J889J814J424O42l46j015j118j076j277j366q89k02l4l27l71L5M26
52929A27593N65O60P01L79j40k29K52O14K57n71j122q84M8J006J235P41M20R20
52911A32445J665J661R12K62J12J66K62N09O59L76P7N57J640K223J755P98k1n98
52893A45460p77k20P74J282R93O21P24J030J210J414J624J392P14L29N91Q30M17
52876A58408l26p97r71j011o90J18R43J332J392J332J054O07M13N34M12q7j49
52859A62514Q28K217L022L156L141L076K731K164J517N44q70k105k439k008j475
52844A76013j164j105j455k073k118j000N21J109N36k82p41j064j320j006N0J097
52828A65998J287O08l41j113j613j776j491q51l35m87j315k102k111j481j017
$$ plain form
52946 129384 131273 133087 134511 135153 134807 133792 132674 131598 130321 128955 128066 127864 127830 127503 127132 127167 127593
52929 127593 128158 128818 129519 129898 129758 129529 129781 130395 130652 130081 128959 128075 128123 129129 130364 131105 131525 132445
52911 132445 134110 135771 136683 136945 137057 137223 137485 137994 138653 139029 139106 139663 141303 143526 145281 146079 146058 145460
52893 145460 144683 144463 145237 146519 147512 148133 148857 149887 151097 152511 154135 155527 156241 156570 157161 157991 158408
52876 158408 158082 157285 156314 155303 154613 154731 155674 157006 158398 159730 160784 161391 161804 162338 162750 162663 162514
52859 162514 163342 165559 168581 171737 174878 177954 180685 182849 184366 184910 184040 181935 179496 177488 176013
52844 176013 174849 173744 172289 170216 168098 167098 167619 168728 169264 168982 168241 167177 165857 164851 164901 165998
52828 165998 167285 167893 167552 166439 164826 163050 161559 160708 160373 159886 158571 156469 154358 152877 151860
52813A51860j101j291j183j067j266j468j276j007j233j848k236k171j896j459
52799A31358p09J17M30O8n43j059j527j945k019j590r42m72k65j90j63k15l40
52782A19994l85j44L52O43K53o02j134r93p72j124j829k215k137j886j502q72
52766A05647m07p34j659k174j722q86n15p60j254j755k119k042j361m47M5j78
52750H7679q44j416j443q39l1K94j47q94j281j158q40n39k01J48L32L48L21J06
52732G9595o53j706k075j248j09P8o06r00k81K91j02r46j232r89r89j320j308
52715F5500p06j2M19P03P90L40n10j003p18n9N01R53J294J172N20o7j12O6q6n02
52695F8483o97m87QP20J493J892J705J442J752K429K619J975J128Q18Q96N31o78
$$ plain form
52813 151860 150759 149468 148285 147218 145952 144484 143208 142201 140968 139120 136884 134713 132817 131358
52799 131358 130649 130766 131196 131264 130721 129662 128135 126190 124171 122581 121639 121167 120902 120712 120549 120334 119994
52782 119994 119609 119465 119817 120460 120713 120111 118977 117984 117212 116088 114259 112044 109907 108021 106519 105647
52766 105647 105240 104506 102847 100673 98951 98065 97550 96790 95536 93781 91662 89620 88259 87812 87857 87679
52750 87679 86835 85419 83976 83137 83106 83400 83253 82359 81078 79920 79080 78541 78340 78488 78820 79168 79489 79595
52732 79595 78942 77236 75161 73913 73804 73882 73276 72376 72095 72386 72284 71338 70106 69117 68128 66808 65500
52715 65500 64794 64782 65201 65904 66694 67034 66524 65521 64803 64744 65245 66198 67492 68664 69184 69117 69005 69071 68985 68483
52695 68483 67786 67299 67307 68027 69520 71412 73117 74559 76311 78740 81359 83334 84462 85280 86176 86707 86029
52678H6029j995k232j115K43N68j38p73o57k19j89o27j053j014l26P47J487J276
52661H0012L84l52o77j065j557j415l40P73R73M26j81o71j036p33O37K399L567
52644H1144M168M812N186M151J494j408l012l047k321j696j503j495j238p54o55
52629H3826j244j780j349k99J12m93j032n34N58J174J056P74P08P31P23Q43J174
52612H4948J515J639J614J685J921K041J673Q25Nk46R4N07N00P8l00k28J97N24
52594I8992N48O31J098J561J334M75j48k8M09O39Q30J277J626J375P62M90P20
52577A12591J041J224J332J192M87m97r77o56j38q4m21o61o61o94r04r92n94J73
52559A10761O76N24K16N90J642K400K176J382P03J36o03j186j047l22L09O16Q74
$$ plain form
52678 86029 84034 81802 80687 80930 81498 81360 80587 79930 79711 79522 78895 77842 76828 76502 77249 78736 80012
52661 80012 80396 80044 79367 78302 76745 75330 74990 75763 76736 77162 76981 76310 75274 74541 75178 77577 81144
52644 81144 85312 90124 95310 99461 100955 99547 96535 93488 91167 89471 87968 86473 85235 84481 83826
52629 83826 82582 80802 79453 79154 79266 78773 77741 77207 77765 78939 79995 80769 81477 82208 82931 83774 84948
52612 84948 86463 88102 89716 91401 93322 95363 97036 97861 97866 97620 97714 98221 98721 98799 98499 98271 98468 98992
52594 98992 99540 100171 101269 102830 104164 104639 104491 104463 104872 105511 106341 107618 109244 110619 111381 111871 112591
52577 112591 113632 114856 116188 117380 117867 117370 116393 115737 115599 115515 115094 114433 113772 113078 112174 111182 110588 110761
52559 110761 111437 111961 112177 112767 114409 116809 118985 120367 121070 121206 120603 119417 118370 118048 118357 118973 119847
52542A19847J111J061Q35Q20Q99N29k75q20q17q06j182j436r32N6N89K00o27r69
52524A18083l00J017J982J892J033K59J3J05L42P37J050P54j90j044j140o80l16
52507A23597k47j19L00P39P37J84n32q79p29m83n78r09j035q21o02p31j251k007
52489A14634k745l016k394r47O43J627J689R62j42j039j205n67L82J013J050O59
52473A10604J61l14q35j341j465r25n6L75M6o25j125j314j153n26K17K04p93j661
52455I9474j248RN83j02j137j517j199n73K16J041J563J627J436J097M40m63j075
52438A00172j023n39q9J31J73J61L33Q56J469J660J314Q29N58M79M37L44O6l31
52420A07000l68L03J142J272Q00P94J642K383K133J325Q55P48M97K33N26J234
$$ plain form
52542 119847 120958 122019 122854 123674 124573 125102 124827 124007 123190 122384 121202 119766 118834 118890 119479 119679 119052 118083
52524 118083 117783 118800 120782 122674 123707 123966 123979 124084 124426 125163 126213 126967 126777 125733 124593 123913 123597
52507 123597 123350 123231 123531 124270 125007 125191 124659 123780 123051 122568 121990 121081 120046 119225 118623 117892 116641 114634
52489 114634 111889 108873 106479 105532 106175 107802 109491 110453 110311 109272 108067 107500 107882 108895 109945 110604
52473 110604 110765 110451 109616 108275 106810 105885 105829 106204 106250 105625 104500 103186 102033 101507 101724 101928 101135 99474
52455 99474 98226 98235 98818 98716 97579 96062 94863 94290 94506 95547 97110 98737 100173 101270 101710 101247 100172
52438 100172 99149 98610 98521 98652 98825 98986 99319 100175 101644 103304 104618 105447 106005 106484 106921 107265 107331 107000
52420 107000 106632 106935 108077 109349 110149 110943 112585 114968 117101 118426 119281 120029 120526 120759 121285 122519
52404A22519J513J048N03M31M46n8q04q69L5J029J125M77J09N18J110J224J053
52387A31409J096J183Q14J81M4N35Q83M83l82j091j365j159m55N15J243J482J449
52370A36865J338J012M27o5j38J18L59L57%o04j046r42m38M1N22J303K104K160
52352A43373J422P88Q33J055R33R10J612K647L048K594J944J657J685J726J562
52337A67789J177Q12P78R71R42O23N26Q58J061P18L22N20J059J282J199J180J016
52320A82833K16q41j111l22O75J153J311J549J717J564J362J498J842J960J834
52305A97240J902K471L373M177M552M458M104L828L835L997L963L633L485M126
52291B49144N386O249O069N547N867P020P750P315O457O249O746P292P609P892
$$ plain form
52404 122519 124032 125080 125583 126014 126460 126402 125598 124729 124764 125793 126918 127395 127504 128022 129132 130356 131409
52387 131409 132505 133688 134502 134683 134727 135262 136145 136628 136246 135155 133790 132631 132176 132691 133934 135416 136865
52370 136865 138203 139215 139642 139577 139439 139557 139916 140273 140273 139669 138623 137681 137243 137284 137806 139109 141213 143373
52352 143373 144795 145583 146416 147471 148404 149314 150926 153573 156621 159215 161159 162816 164501 166227 167789
52337 167789 168966 169778 170556 171527 172469 173092 173618 174476 175537 176255 176577 177097 178156 179438 180637 181817 182833
52320 182833 183049 182208 181097 180775 181450 182603 183914 185463 187180 188744 190106 191604 193446 195406 197240
52305 197240 199142 201613 204986 209163 213715 218173 222277 226105 229940 233937 237900 241533 245018 249144
52291 249144 254530 260779 266848 272395 278262 285282 293032 300347 306804 313053 319799 327091 334700 342592
52277C42592Q213Q481Q752R076R391R879J0988J2499J3156J2067J0092Q906Q940
52264D73032R194R020Q987R727J0865J1523J1333J0540R571Q755Q111P289O070
52251E94017M942M631M932M760L563K087J356J480J866K066J888J177Q1p10n84
52236F27552K32R63J187J089R33Q22R68J671K858M001M664N033N607O593P616
52221F71789Q150Q086P859Q001Q630R455J0229J0954J1575J1775J1330J0533R842
52208G98208R155P853N713L493K176J879J871J615J248R73N05m67j678k628l320
52193H26596m150n151n974o556p221p927q108p624p253p698q556q860q393p746
52179G25379p278o755o083n683n854o245o385o359o519o815o792o221n427m888
$$ plain form
52277 342592 350805 359286 368038 377114 386505 396384 407372 419871 433027 445094 455186 464092 473032
52264 473032 482226 491246 500233 509960 520825 532348 543681 554221 563792 572547 580658 587947 594017
52251 594017 598959 603590 608522 613282 616845 618932 620288 621768 623634 625700 627588 628765 628846 628136 627552
52236 627552 627784 628747 629934 631023 631956 632778 633746 635417 638275 642276 646940 651973 657580 664173 671789
52221 671789 679939 688025 695884 703885 712515 721970 732199 743153 754728 766503 777833 788366 798208
52208 798208 807363 815216 820929 824422 826598 828477 830348 831963 833211 834184 834689 834222 832544 829916 826596
52193 826596 822446 817295 811321 804765 797544 789617 781509 773885 766632 758934 750378 741518 733125 725379
52179 725379 718101 711346 705263 699580 693726 687481 681096 674737 668218 661403 654611 648390 642963 638075
52165F38075m732m730m637m453m345m414m489m222l429k356j526j285j499j792
52151E90166j929j929j846j687j585j749k112k300k149j983k090k202j937j571
52137E63097j764k529l145l226l270l804m519m709m298l848l739l794l661l266
52123E13525k839k651k754k908k816k529k393k573k844k927k774k439k011j769
52109D77298j988k386k182j069J62M75k33j134j426r34Q5J238K225L070M023N055
52093D82279N713N770N723O198P084P768Q090Q553R567J0934J2139J2801J2885
52080E95504J2752J2974J3727J4498J4727J4639J4956J5832J6589J6663J6261
52069G59122J5881J5558J4941J3947J2919J2186J1659J0997J0096R274Q827Q536
$$ plain form
52165 638075 633343 628613 623976 619523 615178 610764 606275 602053 598624 596268 594742 593457 591958 590166
52151 590166 588237 586308 584462 582775 581190 579441 577329 575029 572880 570897 568807 566605 564668 563097
52137 563097 561333 558804 555659 552433 549163 545359 540840 536131 531833 527985 524246 520452 516791 513525
52123 513525 510686 508035 505281 502373 499557 497028 494635 492062 489218 486291 483517 481078 479067 477298
52109 477298 475310 472924 470742 469673 469835 470310 470077 468943 467517 466583 466668 467906 470131 473201 477224 482279
52093 482279 487992 493762 499485 505683 512767 520535 528625 537178 546745 557679 569818 582619 595504
52080 595504 608256 621230 634957 649455 664182 678821 693777 709609 726198 742861 759122
52069 759122 775003 790561 805502 819449 832368 844554 856213 867210 877306 886580 895407 903943
52057I03943P759O119L865J541m91k006k838l114l358m047n137o243p077p541
52043H81375p629p506p482p647p801p931q378r172r579q892p398o055n329m954
52029G75622m603m191l537k386q79M93J514K376L131L485L356L204L551M382N249
52014G90767N749N825N764N884O168O189N595M490L265K193J413R65N65l55j968
51999H42509l725n081o233p590q950r921j0771j2026j3403j4176j4551j5566j7480
51986G03036j9267k0203k0825k1771k2561k2409k1626k1243k1484k1498k0600
51975D69549j9049j7578j6612j6156j6034j5958j5557j4609j3326j2335j2107
51964C00228j2314j1985j0581q758p594p244o880n935m773l961l532l262l176
$$ plain form
52057 903943 911702 917821 921686 923227 922736 920730 917892 914778 911420 907373 902236 895993 888916 881375
52043 881375 873746 866240 858758 851111 843310 835379 827001 817829 808250 799358 791960 785905 780576 775622
52029 775622 771019 766828 763291 760905 760026 760519 762033 764409 767540 771025 774381 777585 781136 785518 790767
52014 790767 796516 802341 808105 813989 820157 826346 831941 836431 839696 841889 843302 844267 844832 844477 842509
51999 842509 838784 833703 827470 819880 810930 801009 790238 778212 764809 750633 736082 720516 703036
51986 703036 683769 663566 642741 620970 598409 576000 554374 533131 511647 490149 469549
51975 469549 450500 432922 416310 400154 384120 368162 352605 337996 324670 312335 300228
51964 300228 287914 275929 265348 256590 248996 241752 234872 228937 224164 220203 216671 213409 210233
51951B10233l321l401l060k355j654j254j270j610j881j649j022n99o58q56r59
51936A84684j367k417l588m016l595k988k674k469k032j439j151j569k543l264
51922A49572k923j758j071j779l165l639k640j234p40j343k203k545k287j811
51908A20434j462j262j023o72m16m74p94j089j187j076p59k72J48J54l09q64j062
51891A08015q48n81o71j213j903k310k248j838j255n01L33Q34N95q7k90M50J445
51874I7927J611Q48J31J92O99R82J066J322J601J403Q19M59L86o0j032j624j068
51857A05662O5O32L54j61m87o48n17J43R67J148N37r9j21K36M38M22M33M95M34
51838A09933K00j28m64o66o23n03o36j003j157q66m95n48j021j422j297o02K81
$$ plain form
51951 210233 206912 203511 200451 198096 196442 195188 193918 192308 190427 188778 187756 187157 186499 185643 184684
51936 184684 183317 180900 177312 173296 169701 166713 164039 161570 159538 158099 156948 155379 152836 149572
51922 149572 146649 144891 143820 142041 138876 135237 132597 131363 130623 129280 127077 124532 122245 120434
51908 120434 118972 117710 116687 116015 115599 115125 114331 113242 112055 110979 110220 109948 110096 110250 109941 109077 108015
51891 108015 107167 106586 105915 104702 102799 100489 98241 96403 95148 94647 94980 95814 96409 96322 96032 96482 97927
51874 97927 99538 100386 100517 100709 101408 102390 103456 104778 106379 107782 108601 109060 109446 109386 108354 106730 105662
51857 105662 105727 106359 106713 106552 106065 105417 104900 105043 106010 107158 107695 107596 107475 107711 108149 108571 109004 109499 109933
51838 109933 110133 110005 109541 108875 108252 107749 107113 106110 104953 104087 103592 103044 102023 100601 99304 98702 98983
51821I8983P93O66K42Q6L18N54N43M70N86Q71J221J587J846J780J426J049P16
51804A13737K34k95l50L46J428K451L450M547N389N503N063M741M789M647L674
51789A59354J960K23j005j808k504k985k853k169j701k016k647k644j824j001
51775A36380q93j369j840j869j272p4J238J913J647R08K85j88q16j569j993j651
51759A28837n60P84J774K226K426K555K298J473O75O62J208J362Q95O05R75J449
51743A49644J442J249J323J434J193Q93R57J062O22j48m69j98Kk96p01o07N5Q14
51725A58271J073N39m64j138r66k18M36O61N47K18k41o20p19o19n17m32l05k53
51707A55253m17o18m96J6N58O72K18m63p65m59j2J04L14J403L035L674K512O93
$$ plain form
51821 98983 99776 100442 100684 100770 101088 101642 102185 102655 103241 104112 105333 106920 108766 110546 111972 113021 113737
51804 113737 113971 113676 113326 113672 115100 117551 121001 125548 130937 136440 141503 146244 151033 155680 159354
51789 159354 161314 161537 160532 158724 156220 153235 150382 148213 146512 144496 141849 139205 137381 136380
51775 136380 135487 134118 132278 130409 129137 129063 130301 132214 133861 134769 135054 134866 134050 132481 130488 128837
51759 128837 128277 129061 130835 133061 135487 138042 140340 141813 142488 143150 144358 145720 146615 147220 148195 149644
51743 149644 151086 152335 153658 155092 156285 157178 158135 159197 159819 159671 159202 159004 159006 158710 158009 157402 157457 158271
51725 158271 159344 159883 159419 158281 157315 157097 157533 158194 158741 158959 158718 158098 157379 156760 156243 155811 155506 155253
51707 155253 154836 154218 153722 153738 154296 154968 155186 154723 153958 153499 153487 153591 153905 155308 158343 162017 164529 165222
51689A65222q8L96J131J603K339L833N822P547Q021O213J942l243o952q069p516
51674A78201o799o406n960n345n001n114n102m176k393q08l38p02r40q45j128
51659A27144j958k309j418q5L25k97r49j112j133j178r34m72m12r72j583j701
51643A10956j355p62o9L39P7n27o63k04N3l34p46m43L73R70R71M31m54j261j440
51624A05912r45l84j66l2K63L44j06o77p71m03J17P88J552J806J161L28L75J247
51606A10409J917J864J504J174P64M40O92J283J174N3q82n86L05M55j51l59K76
51589A20332R60J087J040J176J040K05p54q88m1J134K042K448K247J569R28P04
51573A35229N98Q6o68r66n36K25Q94J291J147K33j029j710j458q83p11r92j376
$$ plain form
51689 165222 165134 165530 166661 168264 170603 174436 180258 187805 195826 202039 203981 200738 193786 185717 178201
51674 178201 171402 164996 159036 153691 148690 143576 138474 134298 131905 131097 130759 130057 129117 128272 127144
51659 127144 125186 122877 121459 121374 121699 121402 120453 119341 118208 117030 116096 115624 115212 114240 112657 110956
51643 110956 109601 108839 108770 109109 109186 108659 107996 107792 107845 107511 106765 106322 106695 107665 108636 109067 108613 107352 105912
51624 105912 104967 104583 104417 104385 104648 104992 104886 104209 103438 103035 103152 103940 105492 107298 108459 108787 109162 110409
51606 110409 112326 114190 115694 116868 117632 118072 118764 120047 121221 121274 120392 119806 120111 120566 120415 120056 120332
51589 120332 121292 122379 123419 124595 125635 125840 125086 124198 124157 125291 127333 129781 132028 133597 134525 135229
51573 135229 135827 135913 135245 134279 133743 133968 134862 136153 137300 137533 136504 134794 133336 132453 131742 130750 129374
51556A29374j593j433q05j51k15r88j480r36J42O92L58m20j132j447j068o8Q94
51539A19724J118N75k99j073j329o38P90J892J869J186P43N17j07r10r53j13N61
51522A23553L03m42r12j019r84o74O7Q65J187J022P24M59J45j44j74J21N14P09
51504A25320N84K49j9J1L18O64Q57R34J106J598K395L109L240K740K202K253K912
51487A50473L598L723L105K114J506J838K782L424L349L005K805K480J859J478
51473A87539J713J825R00o81j701j812j700j647j174k40L15J5n54p02m95k47N7
51456A81411L21P7p23j294r94k42J43nl47p92j440k024k132j830j545j460j408
51439A65716j305j194r93o16k93m18j068j885k481k762k906l140l503l734l507
$$ plain form
51556 129374 127781 126348 125543 125392 125177 124189 122709 121773 121915 122607 122965 122545 121413 119966 118898 118830 119724
51539 119724 120842 121417 121118 120045 118716 118078 118868 120760 122629 123815 124558 125075 124968 124058 123105 122992 123553
51522 123553 123856 123414 122502 121483 120499 119825 119892 120757 121944 122966 123690 124149 124294 124150 123976 124097 124611 125320
51504 125320 125904 126153 126134 126145 126463 127127 127984 128918 130024 131622 134017 137126 140366 143106 145308 147561 150473
51487 150473 154071 157794 160899 163013 164519 166357 169139 172563 175912 178917 181722 184202 186061 187539
51473 187539 189252 191077 191977 191296 189595 187783 186083 184436 183262 183022 183337 183352 182798 182096 181601 181354 181411
51456 181411 181732 181809 181086 179792 178798 178556 178699 178694 178347 177555 176115 174091 171959 170129 168584 167124 165716
51439 165716 164411 163217 162224 161608 161315 160897 159829 157944 155463 152701 149795 146655 143152 139418 135911
51424A35911k798j904j088m53j24j80l86l24k5q0q83j986k508k033r44K0L69J50
51406A20734k57o12r60j231j072l80K52J48n35j080j265j463j725j548q07j21
51390A08078M1NK03M32K45k73o54o01j61L50L80m43j632k126j542o29j42J16N89
51371A02236R79P53J49p1K38M90L18J4n9Q0K52M44P58J182J484J249K96q55j272
51352A08665o97L2J2n80r15p72p87j419k304k755k531j898j224o77k78j4R1O0
51334I2009l1k05o29j253j587j185l39K48M33O30Q29L82p98j672j312j90N38N35
51316H6403L63L12P3n35j210j644j707j213j03J076J480R50K17n0P6K03K56L05
51298H5252J69l19q34p98j97K32j20r09j215o92Q5M99O07O82N09j75q96q92k99
$$ plain form
51424 135911 133113 131209 130121 129668 129544 129364 128978 128654 128629 128549 127666 125680 123172 121139 120195 120215 120584 120734
51406 120734 120477 119865 118905 117674 116602 116222 116474 116622 116087 115007 113742 112279 110554 109006 108199 108078
51390 108078 108119 108124 108327 108759 109004 108731 108077 107476 107315 107665 108045 107602 105970 103844 102302 101673 101531 101647 102236
51371 102236 103215 103968 104117 104046 104284 104774 105092 105106 105047 105127 105379 105823 106581 107763 109247 110496 110792 109937 108665
51352 108665 107968 108000 108012 107432 106517 105745 104958 103539 101235 98480 95949 94051 92827 92150 91872 91858 91949 92009
51334 92009 91978 91773 91144 89891 88304 87119 86780 87028 87461 88091 88920 89302 88504 86832 85520 85330 85868 86403
51316 86403 86766 87078 87151 86616 85406 83762 82055 80842 80739 81815 83295 84245 84462 84412 84488 84691 84947 85252
51298 85252 85421 85102 84268 83470 83273 83505 83385 82476 81261 80569 80654 81153 81760 82442 82951 82776 81880 80988 80689
51279H0689k8l56m74K08J120J353P97k9p06r44n07L14O08p1r82j128n39K8K53
51260G9606L89N44N60M47L28J31r5J15R93J864J912J330R27Q14M32k13l23M80
51242I0241J546K080J932J383P65M76P34J060O61m47j242q94L59J671K418K342
51226A05085J508M03k70k74O6M88J067J663J770J200M38j4k11l60l06J41P53J114
51208A14261J054N91k05j003j280r51n54m76l97M7N30N48K87L34O30N22j50p04
51190A13084n68m2K35R0k34o93j479k462l022k644j582o97n97j007j147o99j58
51173I6378j62o35r16o05l9K14k7m76p48o03m4O01P68J57q62j546j508r72l48
51154H8627J30L42J94j00p8M00Q53Q13M82L78M80L04k41o23m36M8K80K5n65j175
$$ plain form
51279 80689 80661 80305 79831 80039 81159 82512 83309 83280 82574 81630 81123 81437 82045 81974 80992 79864 79325 79353 79606
51260 79606 79995 80539 81099 81546 81874 82005 81910 82025 83018 84882 86794 88124 89051 89865 90297 90084 89761 90241
51242 90241 91787 93867 95799 97182 97947 98423 99157 100217 100878 100431 99189 98295 98654 100325 102743 105085
51226 105085 106593 106996 106726 106452 106518 107006 108073 109736 111506 112706 113144 113130 112919 112559 112253 112394 113147 114261
51208 114261 115315 115906 115701 114698 113418 112467 111913 111437 111040 111087 111617 112165 112452 112786 113416 113938 113788 113084
51190 113084 112516 112474 112709 112799 112565 111872 110393 107931 104909 102265 100683 99986 99389 98382 97235 96536 96378
51173 96378 96216 95581 94665 94060 94021 94235 94208 93732 92984 92381 92337 92938 93706 93863 93001 91455 89947 88975 88627
51154 88627 88757 89099 89293 89193 89115 89515 90368 91181 91663 92041 92521 92825 92584 91961 91525 91573 91853 91878 91313 90138
51134I0138j436j194p55o17p94p25n0Q78J431J378R73N64L97N09P35R20J156J549
51116I5057J821J610J115R21J154J326J192J087J232J335J190J037J008P74K14
51101A12073k51l59m08m60J28J606K926K800J332j88q23o24q0K71n7j012j776
51084A15098j679j068o27k46N28J293J115J3r45j114r40r49r61o01M0O18Q84P17
51066A11176K55L1L91Q77P64J58j63j3J0l31m25J49Q76R78L38n90j282j313o08
51047A11278K37M24pj87L17Q88R03O71Q70J515K087K327K339K148J642R30L84
51030A28766L05O97J343J981K450K654K419J597M77k31j31L95Q14J198J775K142
51014A48651J723Q93P10J539K692L532M104M483M436M026L822M078M354M308M221
$$ plain form
51134 90138 88702 87508 86753 86136 85342 84617 84567 85445 86876 88254 89227 89791 90188 90697 91432 92352 93508 95057
51116 95057 96878 98488 99603 100524 101678 103004 104196 105283 106515 107850 109040 110077 111085 111859 112073
51101 112073 111822 111463 111055 110595 110723 112329 115255 118055 119387 119199 118376 117752 117672 117943 117886 116874 115098
51084 115098 113419 112351 111724 111478 112006 113299 114414 114427 113482 112368 111428 110479 109518 108917 108957 109575 110459 111176
51066 111176 111431 111462 111853 112730 113494 113652 113489 113476 113486 113155 112730 112879 113755 114733 115071 114481 113199 111886 111278
51047 111278 111515 111939 111932 111745 112062 112950 113853 114524 115394 116909 118996 121323 123662 125810 127452 128382 128766
51030 128766 129071 129768 131111 133092 135542 138196 140615 142212 142689 142458 142327 142722 143536 144734 146509 148651
51014 148651 150374 151267 151977 153516 156208 159740 163844 168327 172763 176789 180611 184689 189043 193351 197572
50999A97572M380M596M717N066N883O878P690Q403R225J0080J0821J1467J2029
50986B98807J2605J3765J6102J9209K1820K3384K4722K6692K9040L1205L3513
50975E50864L6679M0559M4243M7117M9202N0663N1615N2171N2155N0949M8098
50964A074315M3889L8993L3809K8449K3029J7574J1972O426J545k420n948r387
50952A262246j2193j3629j3814j3382j2484j0856q711o851n943o170p409r296
50940A141508j1358j3562j6522k0505k4563k7387k8942l0499l3010l6095l8731
50929H60334m0288m0693m0091l8760l7037l5134l3076l0841k8450k5968k3563
50918D86433k1482j9675j7643j5002j2117r819q492p757p024o079n028l986k938
$$ plain form
50999 197572 201952 206548 211265 216331 222214 229092 236782 245185 254410 264490 275311 286778 298807
50986 298807 311412 325177 341279 360488 382308 405692 430414 457106 486146 517351 550864
50975 550864 587543 628102 672345 719462 768664 819327 870942 923113 975268 1026217 1074315
50964 1074315 1118204 1157197 1191006 1219455 1242484 1260058 1272030 1278456 1280001 1277581 1271633 1262246
50952 1262246 1250053 1236424 1222610 1209228 1196744 1185888 1177177 1170326 1164383 1158213 1150804 1141508
50940 1141508 1130150 1116588 1100066 1079561 1054998 1027611 998669 968170 935160 899065 860334
50929 860334 820046 779353 739262 700502 663465 628331 595255 564414 535964 509996 486433
50918 486433 464951 445276 427633 412631 400514 390695 382203 374446 367422 361343 356315 352329 349391
50905C49391j840p75mK52O5k37l78l07k4M68J082J756K546L365L688L076K083
50888C64207J960L223N048O345O941P292P672Q098Q648R282R694R850J0340J1677
50874D70277J3566J5353J6937J8718K0948K3616K6788L0508L4507L8516M2758
50863G52492M7762N3710O0304O7158P4089Q1195Q8730R6604J03904J09443J13128
50852A648519J16091J18992J20680J19236J13849J04991R3241P8893O2608M5599
50842B622699K8978J3397o93j2954k3245l1406l7030l9844m0031l7852l3262k6524
50830B382233j8871j1941o715l503k649m553r112j5870k4526l4717m5411n5338
50818B149027o4012p1812p9035q5474r0744r4376r5709r4334r0688q5654p9678
$$ plain form
50905 349391 347551 346776 346772 347024 347089 346852 346474 346167 346143 346611 347693 349449 351995 355360 359048 362124 364207
50888 364207 366167 369390 374438 380783 387724 395016 402688 410786 419434 428716 438410 448260 458600 470277
50874 470277 483843 499196 516133 534851 555799 579415 606203 636711 671218 709734 752492
50863 752492 800254 853964 914268 981426 1055515 1136710 1225440 1322044 1425948 1535391 1648519
50852 1648519 1764610 1883602 2004282 2123518 2237367 2342358 2435599 2514492 2577100 2622699
50842 2622699 2651677 2665074 2664381 2651427 2628182 2596776 2559746 2519902 2479871 2442019 2408757 2382233
50830 2382233 2363362 2351421 2344706 2341203 2338554 2334001 2324889 2309019 2284493 2249776 2204365 2149027
50818 2149027 2085015 2013203 1934168 1848694 1757950 1663574 1567865 1473531 1382843 1297189 1217511
50807A217511p2825o5528n8524n2084m5985m0114l4480k8694k2343j5865j0257
50796G70812n760j650K534O349R329J1692J3796J5493J6475J6768J6433J5187
50784H87458J2763R360N554J884j363m233p071j0101j3042j5378j6981j8110j8972
50771H11768j9674k0408k1209k1618k1144j9871j8202j6229j3982j1951j0527
50760F16953r171p074m460k202k36K427N978R436J2335J5450J9208K2698K5176
50747G06518K7604L1497L6938M2716M8016N2949N7784O2685O8016P3966P9759
50736A288448Q3990Q5883Q5665Q3618P9374P2389O2737N1129L8302K4578J0066
50725A966179m768j8766l0504l9059m4319m6694m6766m5038m1629l6309k9281
$$ plain form
50807 1217511 1144686 1079158 1020634 968550 922565 882451 847971 819277 796934 781069 770812
50796 770812 765052 763402 765936 772285 781614 793306 807102 822595 839070 855838 872271 887458
50784 887458 900221 909581 915135 917019 915656 911423 904352 894251 881209 865831 848850 830740 811768
50771 811768 792094 771686 750477 728859 707715 687844 669642 653413 639431 627480 616953
50760 616953 607782 600708 596248 594046 593810 596237 602215 611651 623986 639436 658644 681342 706518
50747 706518 734122 765619 802557 845273 893289 946238 1004022 1066707 1134723 1208689 1288448
50736 1288448 1372438 1458321 1543986 1627604 1706978 1779367 1842104 1893233 1931535 1956113 1966179
50725 1966179 1961411 1942645 1912141 1873082 1828763 1782069 1735303 1690265 1648636 1612327 1583046
50714A583046k1790j5386j0590o878m012k597l136n440r353j5205k2891l1115
50702A434653l8375m4272m9166n2938n4889n4796n3171n0448m6532m1384l5629
50691I13053l0217k5646k1643j7609j3248q770m449k33M082Q517J3100J8131K3637
50678H58705K8767L2454L4740L6653L8581L9709L9407L8256L6997L5307L2384
50667A251960K8264K3693J9149J4776J0916P751M747J286k290n124p211r334j1672
50654A326911j3462j4242j4514j4694j4246j2487r719o867m296j562J740N387
50642A227949Q854J1849J4321J6157J7105J7005J6099J4946J3932J2851J1094
50631A382162Q356N108K348Q64O83J318K442M199O753R764J2557J4719J6223J6931
$$ plain form
50714 1583046 1561256 1545870 1535280 1528402 1524390 1521793 1518657 1513217 1503864 1488659 1465768 1434653
50702 1434653 1396278 1352006 1302840 1249902 1195013 1140217 1087046 1036598 990066 948682 913053
50691 913053 882836 857190 835547 817938 804690 795920 791471 791238 795320 803837 816937 835068 858705
50678 858705 887472 919926 954666 991319 1029900 1069609 1109016 1147272 1184269 1219576 1251960
50667 1251960 1280224 1303917 1323066 1337842 1348758 1356509 1361256 1362542 1360252 1355128 1347917 1338583 1326911
50654 1326911 1313449 1299207 1284693 1269999 1255753 1243266 1233547 1226680 1222384 1220822 1222562 1227949
50642 1227949 1236803 1248652 1262973 1279130 1296235 1313240 1329339 1344285 1358217 1371068 1382162
50631 1382162 1390518 1395626 1397974 1398838 1399521 1400839 1403281 1407480 1414233 1423997 1436554 1451273 1467496 1484427
50617A484427J6350J4051J0057M813r61o310j0430j3262j5473j7575j9361k0435
50605A425891k0950k1462k2283k3397k4868k6966k9816l3166l6471l9104m0621
50594A106787m1048m0796m0209l9276l7899l6156l4164l1888k9312k6591k3834
50583G25614k0957j7938j5002j2379r976p624n357l232j052J375L823N785O998
50570F50078P635Q107Q859J0161J1903J3630J4982J5952J6720J7504J8716K0844
50558H15091K3880K7119K9863L2076L4063L5811L7044L7652L7664L6979L5580
50547A182822L3874L2392L1403L1106L1873L3735L5806L7037L7460L8020L9131
50536A564659M0171M0688M1315M2943M5479M8074N0277N2338N4420N6081N6740
$$ plain form
50617 1484427 1500777 1514828 1524885 1529698 1528737 1522427 1511997 1498735 1483262 1465687 1446326 1425891
50605 1425891 1404941 1383479 1361196 1337799 1312931 1285965 1256149 1222983 1186512 1147408 1106787
50594 1106787 1065739 1024943 984734 945458 907559 871403 837239 805351 776039 749448 725614
50583 725614 704657 686719 671717 659338 649362 641738 636381 633149 632097 633472 637295 643080 650078
50570 650078 657713 665820 674679 684840 696743 710373 725355 741307 758027 775531 794247 815091
50558 815091 838971 866090 895953 928029 962092 997903 1034947 1072599 1110263 1147242 1182822
50547 1182822 1216696 1249088 1280491 1311597 1343470 1377205 1413011 1450048 1487508 1525528 1564659
50536 1564659 1604830 1645518 1686833 1729776 1775255 1823329 1873606 1925944 1980364 2036445 2093185
50525B093185N6250N4765N2210M8257M2711L5702K7485J8290Q470j410j1003k0508
50513B404404l0241l9809m8136n4501n9222o2958o5647o6477o4853o1008n5624
50502A795928m9274m2403l5597k9515k4459k0139j6013j1827p777m105o90K823
50490A556952O559J0194J3071J4343J3175R170K706n374j4479k4405l4780m4716
50478A502416n3181n9507o3443o5020o4552o2579n9684n6379n3089m9913m6454
50467H68615m2289l7672l3405k9886k6724k3425k0046j6914j4172j1799r833q199
50455E94251o664n151l801k585j245J98J337K070K913M233N696O950Q385J0556
50441F17143J3121J5033J5790J5977J6585J8151K0529K3157K5553K7658K9653
$$ plain form
50525 2093185 2149435 2204200 2256410 2304667 2347378 2383080 2410565 2428855 2437325 2435915 2424912 2404404
50513 2404404 2374163 2334354 2286218 2231717 2172495 2109537 2043890 1977413 1912560 1851552 1795928
50502 1795928 1746654 1704251 1668654 1639139 1614680 1594541 1578528 1566701 1558924 1554819 1554129 1556952
50490 1556952 1563511 1573705 1586776 1601119 1614294 1623464 1626170 1620796 1606317 1581912 1547132 1502416
50478 1502416 1449235 1389728 1326285 1261265 1196713 1134134 1074450 1018071 964982 915069 868615
50467 868615 826326 788654 755249 725363 698639 675214 655168 638254 624082 612283 602450 594251
50455 594251 587587 582436 578635 576050 574805 575003 576340 578410 581323 585556 591252 598202 606587 617143
50441 617143 630264 645297 661087 677064 693649 711800 732329 755486 781039 808697 838350
50430H38350L1466L2851L4110L6099L9113M2249M4393M5452M6084M6638M7060
50419A283865M7567M8610N0205N1828N2989N3376N2599N0412M7212M3682L9886
50408A822231L5177K9169K2353J5538Q988K267n202j3522k2130l0287l7729m4640
50396A782213n0955n6185o0063o2895o4857o5523o4575o2522o0100n7349n3877
50385A123312m9707m5142m0059l4168k7837k1942j6931j2526q256l848O97M921
50373H68514Q045R886J1122J2120J2010R813N945J517l295q878j4528j8871k1888
50360H71512k4891k8104k9931k9357k7542k6059k4814k2875k0419j8537j7595
50349F01388j6911j5825j4189j2103r858p947o558n323l991k888k161j233K65
$$ plain form
50430 838350 869816 902667 936777 972876 1011989 1054238 1098631 1144083 1190167 1236805 1283865
50419 1283865 1331432 1380042 1430247 1482075 1535064 1588440 1641039 1691451 1738663 1782345 1822231
50408 1822231 1857408 1886577 1908930 1924468 1933456 1935723 1930521 1916999 1894869 1864582 1826853 1782213
50396 1782213 1731258 1675073 1615010 1552115 1487258 1421735 1357160 1294638 1234538 1177189 1123312
50385 1123312 1073605 1028463 988404 954236 926399 904457 887526 875000 866744 862896 863593 868514
50373 868514 876559 886445 897567 909687 921697 931510 937455 938972 935677 926799 912271 893400 871512
50360 871512 846621 818517 788586 759229 731687 705628 680814 657939 637520 618983 601388
50349 601388 584477 568652 554463 542360 532502 524555 517997 512674 508683 505795 503634 502401 502666
50336E02666J529J548P04M30J370K790L834M522N257O099O797P154P081O650O266
50321E64697O486P511R044J0621J1868J2516J2546J2367J2546J3242J4060J4514
50309G02018J4473J4199J4081J4325J4692J4684J4097J3332J2904J2748J2257
50298H53810J0997R137P152N318L541J559p87l446o271r189j2181j5074j7482
50285H27084j9001j9499j9251j8790j8472j8080j7032j5257j3545j2706j2563
50274F42888j2348j1895j1738j1976j1863j0946r889r639j0109j0317r547p959
50262E14662o229n027m728n143n594n454m648l500k376j569j293j440j558j310
50248D64793p27J08J314K823M095M665M699M700M816M948N221N867O614O720N788
$$ plain form
50336 502666 504195 505743 506447 506877 508247 511037 514871 519393 524650 530749 537546 544700 551781 558431 564697
50321 564697 571183 578694 587738 598359 610227 622743 635289 647656 660202 673444 687504 702018
50309 702018 716491 730690 744771 759096 773788 788472 802569 815901 828805 841553 853810
50298 853810 864807 873944 881096 886414 889955 891514 890727 887281 881010 871821 859640 844566 827084
50285 827084 808083 788584 769333 750543 732071 713991 696959 681702 668157 655451 642888
50274 642888 630540 618645 606907 594931 583068 572122 562233 552594 542485 532168 522621 514662
50262 514662 508433 503406 498678 493535 487941 482487 477839 474339 471963 470394 469101 467661 466103 464793
50248 464793 464066 464174 465488 468311 472406 477071 481770 486470 491286 496234 501455 507322 513936 520656 526444
50233E26444M215K821K157K193K446K407J938J291O82J9q67j900k765l125k900
50218E35056k419k313k896l642l716l009k151j471o51L64R58Q47Q49J830L481
50203E21117M851N663O245O520O155N540N647O664P596P469O319M778L331K140
50189F00035J171J93r64k060k715l039l541m391n264n886o218o168n684n226n303
50174E44940n552n018l635k419j940j557p41j31l69o96j5J193J356J42j002q81
50158E23675J8O55J005J731K934M037M671M939M919M577M130L982M145M180L819
50143E73417L263K758K249J718J468J750K296K675K960L596M690N885P000Q297
50129F24022R923J1581J3149J5193J8296K2144K5839K9179L3068L8417M5077N2092
$$ plain form
50233 526444 530659 533480 535637 537830 540276 542683 544621 545912 546594 546613 545746 543846 541081 537956 535056
50218 535056 532637 530324 527428 523786 520070 517061 514910 513439 512788 513152 514110 514957 515806 517636 521117
50203 521117 525968 531631 537876 544396 550551 556091 561738 568402 575998 583467 589786 594564 597895 600035
50189 600035 601206 601399 600435 598375 595660 592621 589080 584689 579425 573539 567321 561153 555469 550243 544940
50174 544940 539388 534370 530735 528316 526376 524819 524078 523947 523578 522882 522867 524060 525416 525558 524556 523675
50158 523675 523693 524348 525353 527084 530018 534055 538726 543665 548584 553161 557291 561273 565418 569598 573417
50143 573417 576680 579438 581687 583405 584873 586623 588919 591594 594554 598150 602840 608725 615725 624022
50129 624022 633945 645526 658675 673868 692164 714308 740147 769326 802394 840811 885888 937980
50117I37980N8646O4358O8790P1225P1086O8393O3661N7397M9914M1671L3668
50106A586789K7215K3124K1189K0493K0075J9098J6555J1363L059p790k0092l2886
50094A688192m5308n6186o4332o9349p1731p1923o9757o5167n9111n3085m7732
50083A014511m2501l6874l1328k6688k3091k0044j7271j4820j2594j0464q793
50072G70043q185q515q854q581q025p654p234o261m769l223j920r49m88n62p49
50057F94074o30l21j56j9L98R76J348J608K128K793L192L489M289N518O369O638
50041G31694P192Q648J0306J1119J0994J0551J0096R621R364R479R471Q795P852
50028H55182P518P823P977P680P464P571P480O944O650P353Q894J0579J2034J3204
$$ plain form
50117 937980 996626 1060984 1129774 1200999 1272085 1340478 1404139 1461536 1511450 1553121 1586789
50106 1586789 1614004 1637128 1658317 1678810 1698885 1717983 1734538 1745901 1748960 1741170 1721078 1688192
50094 1688192 1642884 1586698 1522366 1453017 1381286 1309363 1239606 1174439 1115328 1062243 1014511
50083 1014511 972010 935136 903808 877120 854029 833985 816714 801894 789300 778836 770043
50072 770043 761858 753343 744489 735908 727883 720229 712995 706734 701965 698742 696822 695873 695385 694823 694074
50057 694074 693444 693123 692967 692948 693346 694322 695670 697278 699406 702199 705391 708880 713169 718687 725056 731694
50041 731694 738886 747534 757840 768959 779953 790504 800600 810221 819585 829064 838535 847330 855182
50028 855182 862700 870523 878500 886180 893644 901215 908695 915639 922289 929642 938536 949115 961149 974353
50014I74353J4099J5099J7071K0481K4726K8960L3329L8754M5648N3595O2107
50003A328222P1089Q0470R0069R9793J09372J17673J22908J23793J20235J12847
49993B376471J02529R0749P9622P0982O5361O2007N9667N7111N3285M7254L8077
49982C103115K4796P025j4240l6730n8109p6921r2446j04328j12771j18650j22774
49971B397967j25158j25334j23230j19373j14358j08475j01772r4283q6304p8501
49961A321179p1472o5096n8670n1976m5777m0867l7087l3700l0369k7249k4414
49950H34502k1822j9561j7654j5846j4133j3137j3372j4302j4815j4444j3586
49939F61830j2736j2173j2076j2241j1869j0464q800q021p982p457o020m564l843
$$ plain form
50014 974353 988452 1003551 1020622 1041103 1065829 1094789 1128118 1166872 1212520 1266115 1328222
50003 1328222 1399311 1479781 1569850 1669643 1779015 1896688 2019596 2143389 2263624 2376471
49993 2376471 2479000 2569749 2649371 2720353 2785714 2847721 2907388 2964499 3017784 3065038 3103115
49982 3103115 3127911 3134936 3120696 3083966 3025857 2948936 2856490 2752162 2639391 2520741 2397967
49971 2397967 2272809 2147475 2024245 1904872 1790514 1682039 1580267 1485984 1399680 1321179
49961 1321179 1249707 1184611 1125941 1073965 1028188 987321 950234 916534 886165 858916 834502
49950 834502 812680 793119 775465 759619 745486 732349 718977 704675 689860 675416 661830
49939 661830 649094 636921 624845 612604 600735 590271 581471 573450 565468 558011 551991 547427 543584
49926E43584l540l190k911k838k728k599k854l346l251k389j744j963k309j954
49912E05968j363j429j916j874j165m22P4N13P64N88M86J359L236N155O394P082
49896E23450P620Q262R278J0792J2323J3289J4044J5715J8806K2658K6546L0607
49884G13390L5244M0260M5196N0173N5826O2451O9561P6157Q1058Q3096Q1420
49873A393832P5972O7637N7799M7681L8165L0075K4330K1391K0695K0922K0833
49862A819332J9453J5540P667m705k0504l7690n4338o8888q0031q7012r0039q9964
49850A328821q7596q3502p8098p1652o4439n7150n0680m5219m0078l4855l0196
49839F85356k6733k3942k0895j7794j5674j4720j3954j2671j1256j0237r401q292
$$ plain form
49926 543584 540044 536854 533943 531105 528377 525778 522924 519578 516327 513938 512194 510231 507922 505968
49912 505968 504605 503176 501260 499386 498221 497799 497873 498386 499150 499738 500224 501583 504819 509974 516368 523450
49896 523450 531070 539332 548610 559402 571725 585014 599058 614773 633579 656237 682783 713390
49884 713390 748634 788894 834090 884263 940089 1002540 1072101 1148258 1229316 1312412 1393832
49873 1393832 1469804 1537441 1595240 1642921 1681086 1711161 1735491 1756882 1777577 1798499 1819332
49862 1819332 1838785 1854325 1861992 1857287 1836783 1799093 1744755 1675867 1595836 1508824 1418785 1328821
49850 1328821 1241225 1157723 1079625 1007973 943534 886384 835704 790485 750407 715552 685356
49839 685356 658623 634681 613786 595992 580318 565598 551644 538973 527717 517480 508079 499787
49827D99787o987n852m971m259l909m212m978n466n025l794k582j953j603r59
49813D43237k49k67j033j495r53r1O9m92j184j812k295k064q60K84J13j141k276
49796D27491k963l715m176l179q72Q61O90o02j554j851j972k063k051k150k388
49781C99506k282j608q71m37M3P10Q39qr18p38K87R67Q34L80m5n21q55o06R3N37
49761C95307L98N0j51k77m23m07o4M74R61J181R30J48q88j703j994j765j229p55
49743C89793o66q70r31o32k14J46O73J478K108K132J863J890K099J744N61p69
49727D00405j430j391j298j618k056j990j424j201j922k848k608r77P38J346J056
49712C82782P15N12Q6n77j066j071m56P93K179K811K456J972J976J818P82l91
$$ plain form
49827 499787 492800 486948 481977 477718 473809 469597 464619 459153 454128 450334 447752 445799 444196 443237
49813 443237 442988 442721 441688 440193 439240 439149 439218 438726 437542 435730 433435 431371 430511 430795 430908 429767 427491
49796 427491 424528 420813 416637 413458 412586 413447 414137 413535 411981 410130 408158 406095 404044 401894 399506
49781 399506 397224 395616 394745 394308 394351 395061 395900 395892 394974 394236 394523 395490 396324 396704 396659 396138 395283 394677 394770 395307
49761 395307 395705 395755 395604 395327 394904 394497 394433 394907 395868 397049 397979 398127 397239 395536 393542 391777 390548 389793
49743 389793 389127 388257 387326 386694 386480 386626 387299 388777 390885 393017 394880 396770 398869 400613 401174 400405
49727 400405 398975 397584 396286 394668 392612 390622 389198 387997 386075 383227 380619 379642 380380 381726 382782
49712 382782 383497 384009 384095 383518 382452 381381 380925 381718 383897 386708 389164 391136 393112 394930 395712 395321
49696C95321m15M72Q66M94O14J769K730K340J248Q46J319J777J785J771K157K800
49680D17894L272L216K583J822J635K204K914L200L311L746M344M476M047L681
49666D62345L875M463M986N233N250N112M862M595M440M460M546M462M065L541
49652E26235L239L288L549L897M265M382L930L150K884L628M866N704N881N697
49638E84595N251M439L604L463M128M825M898M548M287M080L556K781K277K361
49624F39093K901L611M170M181L558K969L270M362N193N141M793M910N268N154
49610F98574M657M590N272O174O778P141P396P456P474P937Q940R851J0184J0292
49596H02716J0793J1667J2402J2763J2886J2895J2931J3302J4038J4520J4209
$$ plain form
49696 395321 394906 395378 396244 396738 397352 399121 401851 404191 405439 406285 407604 409381 411166 412937 415094 417894
49680 417894 421166 424382 426965 428787 430422 432626 435540 438740 442051 445797 450141 454617 458664 462345
49666 462345 466220 470683 475669 480902 486152 491264 496126 500721 505161 509621 514167 518629 522694 526235
49652 526235 529474 532762 536311 540208 544473 548855 552785 555935 558819 562447 567313 573017 578898 584595
49638 584595 589846 594285 597889 601352 605480 610305 615203 619751 624038 628118 631674 634455 636732 639093
49624 639093 641994 645605 649775 653956 657514 660483 663753 668115 673308 678449 683242 688152 693420 698574
49610 698574 703231 707821 713093 719267 726045 733186 740582 748038 755512 763449 772389 782240 792424 802716
49596 802716 813509 825176 837578 850341 863227 876122 889053 902355 916393 930913 945122
49585I45122J3612J3794J4934J6052J6301J5961J5841J6345J7411J8778J9919
49574A124070K0173J9541J9038J9648K1063K1990K1759K1110K1249K2488K4067
49563A356196K5035K5122K4869K5019K5777K6619K6902K6613K6343K6481K6750
49552A641726K6644K6135K5658K5513K5584K5581K5301K4611K3404K1754J9935
49541A911846J8216J6740J5647J5037J4649J3832J2112R791P751O676O548O764
49529B055609O608N747M493L558L351L598L893M294N073O030O622O765P000P688
49515B130329Q554R116R246R020Q484P807P341P136O834O289N961O265O752O545
49501B235679N410L962K793J865Q75j78j050j746k628m013n727p281q479r733
$$ plain form
49585 945122 958734 972528 987462 1003514 1019815 1035776 1051617 1067962 1085373 1104151 1124070
49574 1124070 1144243 1163784 1182822 1202470 1223533 1245523 1267282 1288392 1309641 1332129 1356196
49563 1356196 1381231 1406353 1431222 1456241 1482018 1508637 1535539 1562152 1588495 1614976 1641726
49552 1641726 1668370 1694505 1720163 1745676 1771260 1796841 1822142 1846753 1870157 1891911 1911846
49541 1911846 1930062 1946802 1962449 1977486 1992135 2005967 2018079 2027870 2035621 2042297 2048845 2055609
49529 2055609 2062217 2067964 2072457 2076015 2079366 2082964 2086857 2091151 2096224 2102254 2108876 2115641 2122641 2130329
49515 2130329 2138883 2147999 2157245 2166265 2174749 2182556 2189897 2197033 2203867 2210156 2216117 2222382 2229134 2235679
49501 2235679 2241089 2245051 2247844 2249709 2250584 2250406 2249356 2247610 2244982 2240969 2235242 2227961 2219482 2209749
49487B209749j1478j3455j5031j6102j7245j8757k0182k1070k1629k2162k2361
49476B010277k1875k1286k1647k3023k4234k4273k3372k2414k1725k0976j9972
$$ plain form
49487 2209749 2198271 2184816 2169785 2153683 2136438 2117681 2097499 2076429 2054800 2032638 2010277
49476 2010277 1988402 1967116 1945469 1922446 1898212 1873939 1850567 1828153 1806428 1785452 1765480
$$ [...]
##END NTUPLES=NMR SPECTRUM
##END=
