##TITLE=NES1051_Conilon_9270716_MiSnGA3gQ1
##JCAMPDX= 6.0         $$ Bruker NMR JCAMP-DX V2.0
##DATA TYPE= NMR SPECTRUM
##DATA CLASS= NTUPLES
##ORIGIN= BRUKER
##OWNER= Administrator
$$ 1.72 TOPSPIN		Version 2.1
$$ 2015-07-11 22:57:10.706 -0700  Administrator@X
$$ Compression mode = diff/dup
##.OBSERVE FREQUENCY= 400.02188249412
##.OBSERVE NUCLEUS= ^1H
##.ACQUISITION MODE= SIMULTANEOUS (DQD)
##.ACQUISITION SCHEME= undefined
##.AVERAGES= 8
##.DIGITISER RES= 22
##SPECTROMETER/DATA SYSTEM= spect
##.PULSE SEQUENCE= zg30
##.SOLVENT NAME= COFFEE_meoh
##.SHIFT REFERENCE= INTERNAL, COFFEE_meoh, 1, 14.98509
##AUDIT TRAIL= $$ (NUMBER, WHEN, WHO, WHERE, PROCESS, VERSION, WHAT)
$$ ##TITLE= Audit trail, TOPSPIN		Version 2.1
$$ ##JCAMPDX= 5.01
$$ ##ORIGIN= Bruker BioSpin GmbH
$$ ##OWNER= Administrator
$$ $$ E:\/data/COFFEE/nmr/NES1051_Conilon_9270716_MiSnGA3gQ1/10/pdata/1/auditp.txt
$$ ##AUDIT TRAIL=  $$ (NUMBER, WHEN, WHO, WHERE, PROCESS, VERSION, WHAT)
(   1,<2015-07-11 22:57:03.378 -0700>,<Administrator>,<X>,<go>,<TOPSPIN 2.1>,
      <created by zg
	started at 2015-07-11 22:55:57.113 -0700,
	POWCHK enabled, PULCHK disabled,
       configuration hash MD5:
       21 0F 79 D6 B3 7B B4 F6 88 20 88 DB 03 48 BD 9F
       data hash MD5: 64K
       7A 20 36 F2 34 E3 26 A0 DB B4 D3 67 74 6B 8D 6E>)
(   2,<2015-07-11 22:57:06.488 -0700>,<Administrator>,<X>,<proc1d>,<TOPSPIN 2.1>,
      <Start of raw data processing
       efp LB = 0 FT_mod = 6 PKNL = 1 PHC0 = 0 PHC1 = 0 SI = 32K 
       data hash MD5: 32K
       2E 7F BB 5A 43 09 E5 AC FF 79 85 71 A7 7E 5C 6C>)
(   3,<2015-07-11 22:57:06.769 -0700>,<Administrator>,<X>,<proc1d>,<TOPSPIN 2.1>,
      <pk PHC0 = 91.30737 PHC1 = 0 
       data hash MD5: 32K
       C6 D0 08 D3 5D B1 0C F6 B8 A5 2A E6 B3 55 CD 60>)
(   4,<2015-07-11 22:57:06.894 -0700>,<Administrator>,<X>,<proc1d>,<TOPSPIN 2.1>,
      <abs ABSG = 1 
       data hash MD5: 32K
       2D 62 D1 FA DD 86 5F 76 38 96 73 C0 D6 3D 56 E1>)
(   5,<2015-07-11 22:57:06.956 -0700>,<Administrator>,<X>,<proc1d>,<TOPSPIN 2.1>,
      <abs ABSG = 2 
       data hash MD5: 32K
       9B C0 7F A4 28 C8 59 F7 9F B9 5E 6B F1 76 99 3A>)
(   6,<2015-07-11 22:57:07.035 -0700>,<Administrator>,<X>,<proc1d>,<TOPSPIN 2.1>,
      <abs ABSG = 3 
       data hash MD5: 32K
       F6 27 47 99 E1 69 4E C2 F3 FE 0C FF 2B D0 11 8C>)
(   7,<2015-07-11 22:57:07.081 -0700>,<Administrator>,<X>,<proc1d>,<TOPSPIN 2.1>,
      <abs ABSG = 4 
       data hash MD5: 32K
       ED D7 59 C9 2B 2C B8 9E D6 86 1D AF F3 EB 44 0D>)
(   8,<2015-07-11 22:57:07.144 -0700>,<Administrator>,<X>,<proc1d>,<TOPSPIN 2.1>,
      <abs ABSG = 5 
       data hash MD5: 32K
       28 C9 A0 0E 23 83 87 1C A3 63 15 EE 5E 4C E6 83>)
$$ ##END=
$$ 
$$ $$ hash MD5
$$ $$ 26 C4 71 9C E4 31 51 3C 7A B1 93 C4 4B 90 0E AD
##$RELAX= 
##$RELAX= 
##$RELAX= 
##$RELAX= 
##$RELAX= 
##$RELAX= 
##$RELAX= 
$$ Bruker specific parameters
$$ --------------------------
##$DU= <E:\>
##$EXPNO= 10
##$NAME= <NES1051_Conilon_9270716_MiSnGA3gQ1>
$$ [...]
150 150 150 150 150 150 150 150
##$TP07= 0
##$TPNAME0= <>
##$TPNAME1= <>
##$TPNAME2= <>
##$TPNAME3= <>
##$TPNAME4= <>
##$TPNAME5= <>
##$TPNAME6= <>
##$TPNAME7= <>
##$TPOAL= (0..7)
0.5 0.5 0.5 0.5 0.5 0.5 0.5 0.5
##$TPOFFS= (0..7)
0 0 0 0 0 0 0 0
##$TUNHIN= 0
##$TUNHOUT= 0
##$TUNXOUT= 0
##$USERA1= <user>
##$USERA2= <user>
##$USERA3= <user>
##$USERA4= <user>
##$USERA5= <user>
##$V9= 5
##$VALIST= <valist>
##$VCLIST= <CCCCCCCCCCCCCCC>
##$VD= 0
##$VDLIST= <DDDDDDDDDDDDDDD>
##$VPLIST= <PPPPPPPPPPPPPPP>
##$VTLIST= <TTTTTTTTTTTTTTT>
##$WBST= 2048
##$WBSW= 25
##$XGAIN= (0..3)
0 0 0 0
##$XL= 0
##$YL= 0
##$YMAX_a= 587889
##$YMIN_a= -487850
##$ZGOPTNS= <>
##$ZL1= 120
##$ZL2= 120
##$ZL3= 120
##$ZL4= 120
##$ABSF1= 14.98509
##$ABSF2= -5.573092
##$ABSG= 5
##$ABSL= 3
##$ALPHA= 0
##$AQORDER= 0
##$ASSFAC= 0
##$ASSFACI= 0
##$ASSFACX= 0
##$ASSWID= 0
##$AUNMP= <proc_prof1d_extract_pilot.lims>
##$AXLEFT= 0
##$AXNAME= <>
##$AXNUC= <1H>
##$AXRIGHT= 0
##$AXTYPE= 0
##$AXUNIT= <>
##$AZFE= 0.1
##$AZFW= 0.1
##$BCFW= 0
##$BC_mod= 0
##$BYTORDP= 0
##$COROFFS= 0
##$CY= 15
##$DATMOD= 1
##$DC= 0
##$DFILT= <>
##$DTYPP= 0
##$F1P= 0
##$F2P= 0
##$FCOR= 0.5
##$FTSIZE= 32768
##$FT_mod= 6
##$GAMMA= 0
##$GB= 0
##$INTBC= 1
##$INTSCL= 1
##$ISEN= 128
##$LB= 0
##$LEV0= 0
##$LPBIN= 0
##$MAXI= 10000
##$MC2= 0
##$MEAN= 0
##$ME_mod= 0
##$MI= 0
##$NCOEF= 0
##$NC_proc= -8
##$NLEV= 6
##$NOISF1= 0
##$NOISF2= 0
##$NSP= 0
##$NTH_PI= 0
##$NZP= 0
##$OFFSET= 14.98509
##$PC= 1
##$PHC0= 91.30737
##$PHC1= 0
##$PH_mod= 1
##$PKNL= yes
##$PPARMOD= 0
##$PPDIAG= 0
##$PPIPTYP= 0
##$PPMPNUM= 2147483647
##$PPRESOL= 1
##$PSCAL= 4
##$PSIGN= 0
##$PYNMP= <proc.py>
##$REVERSE= no
##$SF= 400.02
##$SI= 32768
##$SIGF1= 0
##$SIGF2= 0
##$SINO= 400
##$SIOLD= 32768
##$SPECTYP= <>
##$SREGLST= <1H.CDCl3>
##$SSB= 0
##$STSI= 32768
##$STSR= 0
##$SW_p= 8223.68421052631
##$SYMM= 0
##$S_DEV= 0
##$TDeff= 65536
##$TDoff= 0
##$TI= <>
##$TILT= no
##$TM1= 0
##$TM2= 0
##$TOPLEV= 0
##$USERP1= <user>
##$USERP2= <user>
##$USERP3= <user>
##$USERP4= <user>
##$USERP5= <user>
##$WDW= 1
##$XDIM= 32768
##$YMAX_p= 417511973
##$YMIN_p= -848768
##$CURPLOT= <Network HP LaserJet P1505>
##$CURPRIN= <$Network HP LaserJet P1505>
##$DFORMAT= <normdp>
##$LAYOUT= <+/1D_H.xwp>
##$LFORMAT= <normlp>
##$PFORMAT= <normpl>
##$SURQMSG= 1
$$ End of Bruker specific parameters
$$ ---------------------------------
##NTUPLES= NMR SPECTRUM
##VAR_NAME=  FREQUENCY,     SPECTRUM/REAL,   SPECTRUM/IMAG
##SYMBOL=    X,             R,               I
##VAR_TYPE=  INDEPENDENT,   DEPENDENT,       DEPENDENT
##VAR_FORM=  AFFN,          ASDF,            ASDF
##VAR_DIM=   32768,         32768,           32768
##UNITS=     HZ,            ARBITRARY UNITS, ARBITRARY UNITS
##FACTOR=    0.250966925370066, 1,           1
##FIRST=     8223.43324360094, -85985,       -30103
##LAST=      0,             -110473,         -61377
##MIN=       0,             -848768,         0
##MAX=       8223.43324360094, 417511973,    0
$$ Real data points
##PAGE= N=1
##DATA TABLE= (X++(R..R)), XYDATA
$$ [...]
23789 -74569 -40702 147713 187572 -231096 -113423 -443054 -396571 -239902 81764 -239618
23778 -331173 54622 -222622 15455 66403 232197 -136374 226825 133275 -121242 97111
23767 -119170 119140 -182468 138123 -3480 -163310 168328 166952 -234671 207112 50603
23756 237885 148141 145012 -1961 176988 102389 216303 -51002 -42809 -75981 -294320 -48992
23744 73281 -187043 183404 -106501 155382 18654 -331300 -251192 -89634 -135750 -201648 -107309
23733 -107309 65257 -83298 229478 -54683 -101904 250891 -19308 -23508 317775 64764 -335048
23721 68879 -211044 166823 364859 -257736 93406 105634 188302 129801 -255412 -182867 -216088
23710 -216088 -104643 49266 340656 84745 12108 -231073 -178533 1629 -348189 -227787 131341
23698 -158700 -20673 182850 -224059 336659 85588 97295 -64454 -219024 -421642 78567
23687 -139766 48741 -95101 -125516 -224113 -80595 -93467 -290992 -171914 -167387 83747 -59565
23675 -41368 -106367 398327 -216829 -33406 -50736 -17663 -210376 -49637 4588 -67644 26864
23663 -53363 -71430 293331 133585 -44053 -267843 288293 -60132 -61983 -35005 43871 -291342
23651 165977 -34167 -109216 220129 177394 -107907 -112107 -49594 -141590 107564 -60731 -77952
23640 -77952 -95678 -268752 -120088 -297185 16244 203534 83288 -385644 29612 114646 -42729
23628 -198445 -170005 38353 -63841 -80721 180294 -189688 -198313 137214 -107665 -52228 289819
23616 -285777 -51533 241378 209766 1744 -99692 66925 -102680 123171 5851 -106569 89952
23604 248150 -138726 142849 -116499 -263842 -56376 -214377 -210614 -115918 228129 146372
23594 146372 -101204 313556 -237422 -140752 -242904 -53996 -12321 -131079 110743 -36061
23583 -111390 60748 204654 8286 -72161 20243 -55276 186967 -55367 185729 -140059 116590
23571 -20308 144947 4625 -296642 56372 278852 -156195 225257 97289 106727 -173096 -286062
23560 -286062 61372 82020 164140 -289324 97268 -129535 -44892 -126730 47832 172927 42767
23548 -211745 133248 -304171 79463 -139298 186253 -93345 -137522 -368004 -290382 -34599
23537 298615 -352433 -161144 98665 176559 25911 -30158 -412777 -243676 -62319 34662 184819
23526 184819 147144 6647 154189 -104317 -149460 15471 -39227 177000 -5356 -3290 -214899
23515 -214899 -198189 -95699 -87115 148813 -124807 -444 -224941 -38751 -35155 -225474 86911
23503 74332 418625 -107911 -37623 -166968 -106543 60107 221277 298624 -236182 177285
23492 87219 188066 259120 -20460 -186440 -366272 267204 -130844 -54784 94205 214184
23482 214184 21562 181272 -124773 -53539 7178 211435 215834 -95823 -306916 194882 -57262
23470 174099 115911 -327649 -253029 -67856 39833 138870 -33148 52069 351595 -390893 -283646
23459 -283646 -34656 100101 41630 -187152 -121949 56960 353447 63035 98781 165992 49303
23447 -91483 85732 375794 465954 -40339 -368441 175828 -405775 -249364 -248628 382156 -92965
23435 -48594 25979 -289021 84952 109674 167866 33994 -111139 231679 -193467 -220975 5947
23423 -69793 63072 -50059 -238657 383072 -252093 -239567 -239330 -32631 62160 145912 -35024
23411 -192957 13040 153693 -20404 250589 35644 297747 241467 -204909 -89758 -137202 -220553
23400 -220553 -123316 -49728 328074 -54425 -87256 15921 -281970 -96524 216265 272965 -84353
23388 58655 57788 -122368 4088 19133 205727 -65805 226416 -133241 -176282 -73000 209970
23376 -200443 87868 -161024 -110855 138275 58361 -30060 -25053 -132964 -95111 -84101 -174077
23365 -174077 -146729 58459 -8896 -99957 -14553 -364820 -296136 174157 53201 -205168 -20046
23353 -21607 -119207 205427 86610 -192927 -348952 -64292 195587 117761 -9633 48715 28236
23342 28236 -207355 243152 73824 188216 111365 -206779 -61826 -170721 -108385 -249879
23332 -249879 328615 85062 -40357 3934 -176393 -231191 -206736 152883 142009 -92887 91889
23320 -289240 29775 -145358 347179 -28552 -57806 77051 39737 37775 -176469 -120030 -5655
23308 -102935 -67429 -295176 54429 142498 -6429 -288197 -127311 -144003 -108796 -226566 186586
23296 176253 -56748 268810 -117461 -130956 -40696 -359989 -180715 -1680 -86862 -221023 163900
23284 122337 -169654 -255302 -253730 140106 96058 -148731 -88885 -402270 251308 -70342 -204875
23273 -204875 112311 -352707 -119269 -122646 -102166 -30697 -143590 62375 332943 89002 -207560
23261 -147816 -125455 104604 -92457 -137500 -76358 212709 -30223 -103991 125011 62009 -90027
23249 -152066 -148929 122763 36534 110325 -121542 180757 -91442 -163588 -322449 183989 28736
23237 21638 -133305 -121951 640 135455 33747 -222458 -335086 71860 -134410 -107153 15281
23225 136396 -66973 -76657 -197914 42250 -187825 -126172 51846 16509 113120 -147810 -327909
23214 -327909 -384787 -322158 40043 -160715 437869 -76186 -16228 134119 189685 208015 -96150
23202 -77396 159327 11081 14741 130644 356559 39278 -118428 321464 178874 -118209
23191 482029 -66459 -172253 48088 -340553 37968 55438 -160826 -270469 -264396 39574 -64243
23179 64881 70867 65916 9049 -358096 37763 -89636 88811 -321963 -123848 284989 -243667
23167 -270009 -340986 -158846 -374525 102636 -137202 7099 -40429 -239153 -76547 156576
23156 55733 -53509 200971 166401 34247 133363 84948 -181991 -9438 -110291 -12635 50595
23144 195610 55290 87346 74979 44901 119891 10564 -77741 -174240 174746 11089 -37922
23132 -96767 -169378 -152007 -157215 420563 210074 -11148 -2672 325033 -251076 150375 -110867
23120 93889 18373 -241684 -158816 211448 22243 272828 150870 -239182 130523 -48838
23109 -7452 -45316 -260954 -243039 -57679 223493 -165674 -189898 -147769 91280 -197603 2053
23097 167454 -58862 -157795 -55052 -104768 316795 31641 -42607 -57714 -160828 169759 251893
23086 251893 225092 -268310 -40609 13218 -82245 -259677 -308398 -88654 -30045 157977 -52089
23074 -76441 24612 299689 -106098 -6725 21068 88527 111084 -31371 -241173 64068 294336
23063 294336 -480472 34889 -187016 -238069 116202 -171390 527468 -167584 -141898 -185899
23053 -185899 -91634 307946 -99332 -74652 -26094 25763 296795 333051 -55149 181032 178906
23042 178906 159126 -12848 -243539 188347 -217969 -235867 65909 -54835 22287 259528 -163292
23030 -235058 312478 452743 372075 -339087 3024 155265 36007 -75417 181959 -143200
23019 144119 -11088 -33893 -107896 56132 -128301 55996 68174 170122 237057 -65900 116878
23007 -413232 -75503 -327616 -157631 63986 155770 -217260 60899 -127360 -124338 37007 -147810
22995 -116023 -23038 -133396 -146983 -396155 -10629 -329793 -34597 -150096 -166637 -31620 920
22983 -210665 -188776 -707 -112923 1484 73650 -135424 18563 10722 51448 119229 -65818 260296
22970 245048 -147024 44719 -100282 15298 -148633 -46556 -518502 -214788 -63687 96386
22959 -170461 -6042 -42339 -190386 -146036 188767 -119723 -45697 80813 -56961 143739 29848
22947 8216 -209063 -294450 -164199 59047 395313 -249076 173924 251955 -104219 379566
22936 -75410 -121498 -7358 129241 -328197 278827 -93546 -110318 -179858 104941 -233864 36081
22924 -202308 -249215 -38832 -106614 59698 -48209 167944 -105271 -19053 -305920 -212105 -98928
22912 189520 -200713 -111479 -105379 315664 -2077 126154 -60789 -260616 -36304 175553 189868
22901 189868 157558 -142971 -170134 115754 183549 -381167 -116342 376066 68574 -209955
22890 -24854 37739 -62195 -121516 -118322 -213425 -371817 -161832 -59530 -45534 196411 253619
22879 253619 173731 240198 -309627 -155747 66545 -94914 54945 -46803 -44118 -189382 -97698
22868 -97698 -109865 185020 -75805 115344 -185247 111238 -219692 186636 -365089 260734
22857 -123112 -108661 187637 143455 274254 39997 -300372 131239 -31809 -27450 99090 -327909
22845 113777 -392370 216345 -195987 -26014 -84123 118606 342468 -172368 -167428 6401 202076
22834 202076 -317482 71081 -141403 -119798 264506 -80103 -4520 196223 57999 -62274 166527
22822 -108414 -110569 -196415 228259 -135990 227227 -48631 119348 -27714 -170745 -45922 -168865
22811 -168865 -100739 -133892 205852 -201684 166441 -36242 -8342 29898 -38162 381220 -164402
22799 -144115 -93124 -326605 215609 178159 -40228 -15331 283303 -69478 45031 71124 258635
22788 258635 -58359 143160 -43374 -210157 397304 -243539 89533 -166072 -297252 65887
22777 -329228 -188763 197885 361255 -101175 -310840 -36391 -110008 152217 180563 121570
22767 121570 -341757 -377336 -150782 196417 -273405 -178065 216824 56933 -94332 -12237
22756 164947 174396 -250011 207892 -116668 -223283 -222827 220541 -106831 77448 -27004 -533377
22745 -533377 -122899 -234203 73764 60955 258267 83172 -54068 28331 -23251 -117880 218985
22733 -118495 95528 -187966 -95386 -118275 26195 162807 -53693 316539 -34281 109068 243581
22722 243581 -171840 -114314 35156 -47917 -34479 -165585 72552 246027 16070 122456 -107057
22710 -165071 -58737 -275660 175811 -22976 91265 -22378 136449 -90925 594 178278 -26811
22698 -277 -22758 -119667 -260393 -212288 -112719 -61364 -81906 -63445 -160579 -135257 -29279 277503
22685 154132 87040 -154512 -107468 13718 -264606 -98467 -189899 5224 -190355 -201195 -2850
22673 -114132 35148 31196 -176704 -195390 -130976 370524 -104404 -347526 -22111 116246 -16496
22661 231024 55965 218289 29288 -187158 113215 -116683 74948 41670 304245 13958
22650 -84454 -6122 -424690 83287 -848768 32462 -157981 -130636 -199840 27995 100748 -239561
22638 32786 20814 253031 -48197 -304812 35475 -87891 -28773 78596 268391 -90874 121611
22626 172023 -6815 -282806 -129701 -130942 127771 167405 -66187 -18948 -100154 256193 229933
22615 229933 -133504 -23590 3952 86192 -120459 -123570 517499 49351 133205 -262401 -113323
22603 136104 -83363 56927 -410095 243509 123182 48907 -170323 221955 -93214 -167456
22593 -167456 -246538 138054 83279 -76161 -352850 147945 -175549 -62709 -253761 224976
22582 90233 198810 201001 48979 -61383 -392853 90124 116056 -176189 -124432 76429 -139713
22570 -207234 -52322 -64856 -57254 -230091 -214263 -340692 19938 218881 -258864 -186557 -192345
22559 -192345 110188 -50776 153322 75583 -108059 25162 30135 -620114 -126361 -263001
22549 -263001 60824 201637 -12010 -75827 -880 20112 -57792 -203935 186975 -38694 144695
22537 -17881 -198400 84078 -153791 -180498 -364859 -21111 -96955 65265 153251 -144924 112193
22525 -262494 42911 -72374 -117305 130085 101459 -139366 233743 41187 193988 -21332 -263571
22514 -263571 186020 402169 -106115 81035 -140752 -172232 -191648 -147235 74076 -209576
22503 345203 127677 -344663 -127708 82510 343442 55275 -156233 -188583 -66535 -108699
22493 -108699 262333 -96832 -220986 -43689 380134 174654 -81077 329777 -149358 137779
22482 -62489 -261298 -142649 320083 -236874 -190256 286309 -344694 -104357 -125045 28702
22471 217822 -73495 -76284 -86237 -9458 -35266 -80471 -169 126258 19664 -118520 -4525 164926
22458 88671 -155149 -171795 -50342 131205 -114716 -95942 -108461 43994 163068 122508 21950
22446 -231070 -371334 73578 -77567 -187415 -49163 99444 139764 76891 11695 88061 -31271
22434 -52852 60058 -156306 -155191 -24567 -30228 -76379 -136536 -199263 -107952 49540 39046 -84368
22421 -96668 107235 -227682 -28162 -160089 153207 -279671 127835 -169995 -85954 -20725
22410 -365823 -240545 -42852 -58228 75532 127110 304561 33359 -232389 -230092 -172376 119028
22398 -168356 -347798 55581 111866 -358619 62482 -94220 -45027 -256209 -77015 -112201 -421916
22387 -421916 -179314 -138258 -1122 26424 -23321 -101407 95169 -436868 -156852 -72326 -424031
22376 -424031 -312417 81674 -116943 367269 -106473 -201810 37114 -201981 -60748 -260613
22366 -260613 129909 -152887 168012 -81531 -12888 -82659 -261033 -296312 -209832 120350
22355 56894 -67459 -160466 -37716 39616 91394 -107725 -126963 -154120 -30029 215591 305350
22344 305350 -87654 -12810 -31413 -166017 -9568 -69627 -351318 20868 10372 -163134 124863
22332 -78847 -200144 13265 266538 508 -23055 -30559 32582 -32132 -346410 -283426 -77199 -221125
22320 -221125 100527 -141262 -51643 -24223 -42506 33614 195430 75674 176019 55340 96274
22309 96274 52971 -160991 -52360 -21816 -11206 24895 116210 -397687 64287 231523 -158325
22297 -59927 -68379 -37767 -111615 -35412 -99034 -57809 86354 -9995 123543 24987 -180611 -31991
22284 179590 -14122 -203142 -548240 -156717 187793 18224 -91530 283463 144125 83154
22274 83154 -52658 -180329 -279026 169633 -128978 208308 -323180 3476 -11341 164355 -67426
22262 -11361 108843 348582 -181897 251426 106818 -198083 132754 52835 49307 272014
22252 272014 -160356 -263887 -314112 56304 -224640 -193153 191382 -28888 172641 -258514
22241 -83389 176492 36882 -192754 59195 -356322 166754 221609 -29754 183355 -17123 58594
22229 -2320 140918 216454 -79161 -287281 -632 -7995 -158709 48893 -171964 -564008 29692
22217 -406579 -140863 44641 -107013 -99525 -101184 -79542 -17315 172749 216904 61548 137708
22206 137708 -104467 413765 188110 -3856 -299235 254888 -111389 -3774 -31232 -262079
22196 -262079 391000 37627 87685 -47233 -26776 117566 -135960 61666 11778 -273710 -241884
22185 -241884 21628 -382626 89787 -158228 -229418 -9780 -394189 -10656 -213569 -317772 -202615
22174 -202615 -118612 44937 120946 -247171 -42530 -405428 94993 -216893 157958 25018 -172621
22162 42443 166102 -82417 65422 -142061 27937 -71586 -27857 -222470 -78887 -31975 211727
22150 -160178 70109 194483 -57906 99735 109364 -138400 500218 2856 -166893 -35962 -169811
22139 -169811 -342162 -281208 -202478 -139259 188366 207790 149934 -378747 106062 -55737 -192670
22128 -192670 362570 206263 27632 -353705 32596 -126903 -11507 -217767 -168721 -182503
22118 -182503 -227129 -129793 26269 -34206 46745 -42740 -240450 -119837 -201388 -34067 -270637
22107 -270637 241672 -60012 89381 -300894 -52449 217602 -83548 -19023 28064 -186229 -168131
22096 -168131 16565 -45779 -242722 -199307 36253 -207707 26272 111445 -168497 214448 -210675
22084 -158270 130736 -115784 33226 -166612 227202 33393 -415758 -181922 -65578 -225791
22074 -225791 -175122 14336 15168 -118833 -153823 -222978 -131543 -89701 13015 -242427 75771
22062 -247983 118049 104033 154822 -202738 -23400 181228 75274 -171913 -82996 90806 -107330
22050 -40469 373299 -363034 11045 -170861 -6311 -234927 -19395 -146629 5023 -256827 135963
22038 -256353 -161854 -67532 -395380 208537 -106268 -36100 148370 -2854 293848 180923
22028 180923 147349 -123327 116752 248465 -139214 63410 204538 42604 -131822 -39828
22017 -288296 -105119 107785 -279377 -159780 -137746 -145452 36688 68338 14317 48120 -270588
22005 -104111 -218966 -449726 -137915 124237 -56482 -19184 76105 84104 -87968 -320311 15203
21993 -58520 -141666 -111385 -98140 -146036 44131 -228809 -23652 -178748 -244082 -184389 -29603
21981 140196 -30984 119551 -120889 -188358 -217581 -16633 -163101 -52344 132091 -210171
21970 -328370 5785 432247 84503 188527 -70852 -29968 127902 -33685 -61554 -165408 46664
21958 74045 -209408 -127515 -123454 217967 -29620 -29148 31906 -84190 -144818 49423 -237880 30594
21945 35587 -211293 -87647 35330 62637 54716 118745 145072 -211565 -103160 163402 -120803
21933 -191418 86034 51246 300515 -36732 -655 88334 -281392 -352411 73956 45697 21026
21921 -15845 71600 26023 -63906 -42290 26826 -30105 -192205 235032 -54112 35968 83631
21910 83631 -499700 -228585 -120637 219566 21156 8726 -383285 -288005 50143 -4687 129291
21898 -3365 8068 26598 -124233 265383 -278855 -201218 149347 -269913 -67759 14008 51717
21887 51717 -107721 -311284 49263 102513 -46130 63111 133337 48138 53569 107480 234278
21876 234278 -229909 -87610 -158779 -78764 -18192 -45097 -181620 -133114 272832 -278964 -331504
21865 -331504 183507 -272790 -8149 -3627 8892 22907 -124823 -57259 34746 -172916 -23064
21853 -44598 217862 -114646 -206500 -74583 -214652 57114 -49515 -178361 135978 -78008 -151258
21842 -151258 188843 -85847 278913 116705 -169841 69165 -274541 -109262 160348 135414
21832 135414 -151230 259687 -317812 -229506 -159585 -423901 -88464 -181082 -48953 50138 -2832
21820 5913 -282373 -98657 -338752 199067 -161194 -58372 -33549 -387622 28083 -131068 94790
21808 -161928 -12343 -95119 -23984 87907 7991 -143538 -223300 -266201 15195 217782 -17506
21796 -29336 134813 182299 -42140 -99315 8614 54627 -213749 134709 12956 -133892 -47116
21784 -215162 -103088 -229461 -201376 -84314 -72437 37763 -146353 -232665 114025 -150575
21773 -176807 85191 -127632 62808 -100439 76860 -154520 -151891 -55026 213605 223977 -42737
21761 37363 -54719 85099 -108376 -326227 -96199 -15029 336173 -114675 -35050 -91807 -258764
21750 -258764 -86685 -161332 171189 76128 251210 97931 -162763 -217805 -43349 292166 -150415
21738 -51547 113579 269641 25771 -310573 -369350 -446378 -218664 -90779 215218 -164843
21727 119939 131615 194500 8935 -172616 7267 -381637 12838 -134823 -132220 -157458 -53001
21715 -11252 174447 60813 -43490 -178834 -367748 92374 56499 -192518 -138471 -298922 -52988
21703 57732 -42499 48763 -308137 -62509 -408433 -126274 216648 -57621 -250230 -227260 -231478
21692 -231478 -25003 46487 -197539 -240347 -173554 223034 75157 -104731 71376 292312 -8411
21680 -206029 95666 25838 61794 -46465 -65548 86643 -177567 248082 -269570 -252246 116591
21668 -169911 44766 35968 -335403 -98727 154422 -15613 130604 -41521 -289513 -38332 -153382
21657 -153382 -231617 102605 69682 -112468 -159211 73918 -101391 197378 4241 30907 -71515
21645 95295 -231419 -177288 -147221 -101157 211956 70919 -78913 154605 -2010 315706 97589
21633 -10908 257629 -353269 -354726 225057 -241306 -181216 79385 -222464 110602 -23083 -249429
21622 -249429 -317105 -62261 137114 128411 -273980 -6348 -59078 -20969 -208640 -361447 -140841
21610 -175155 233495 198037 -164529 -90916 -279077 -49805 92080 -186492 -212718 -206324 -244223
21599 -244223 -28119 -135561 -266142 216893 15814 -3209 243252 -22871 -34725 22354 -84
21587 -114096 -39961 -192083 26374 -97411 170463 383144 -121387 118690 -11783 140698
21576 -262267 188039 -68784 112203 161913 -387099 85837 -288868 192720 -144169 -68872
21565 -175350 117791 206184 -195727 59860 -151345 -89527 -406077 -13213 51394 71363 -71534
21553 161410 -186866 45655 -33876 -195415 52067 -56610 251018 -174213 -31783 5096 -50810
21541 189061 -68267 -57431 -180782 -150076 17354 92956 175310 191155 -189148 87054 157334
21530 157334 69672 155914 -9370 7676 19042 -148738 231045 40427 -25047 -286824 -152859
21519 -152859 -47846 9735 95416 73352 -399769 -38841 -84854 -39414 46396 16088 39549
21508 39549 53802 57876 -432648 96599 -281437 134659 -100643 28499 -8427 321511 -77689
21496 85940 -169652 -188748 -426237 -82992 -323226 -191678 373080 -91278 -94938 -217201 -302208
21485 -302208 -37607 -13970 -60136 1429 -99735 195810 236046 17007 -270769 76843 100284
21474 100284 -125013 307586 -179242 -48863 97275 -30493 -2145 -404912 101401 89715 -35314
21462 -7639 -125 -78930 207978 115344 231217 -198376 4464 10983 3662 45480 -119390 -277927
21450 -277927 -303039 -184396 -48769 -154423 -187220 -19542 -150760 170149 -105218 -60118
21440 -60118 49559 323519 234107 426509 177411 695574 392933 578878 658614 212423
21429 459320 345614 121104 -117794 172547 -20996 -19958 18300 217507 -77196 -71026 38007
21417 -109098 -240347 -33945 32835 -9112 -246538 67195 154753 -319067 235908 227670 82934
21405 -109284 -136458 -509515 -293117 -256256 13975 28799 -281497 97330 150212 3789 -153329
21393 -64947 287139 154471 -140449 -199371 -23180 -209095 -41487 117213 -274806 -8778 -176936
21382 -176936 145309 180645 66306 13630 -155551 75098 -207109 131727 -45095 63572 -40473
21370 -194696 -163813 -76470 -28266 69719 175715 47194 44889 -80836 -162055 -312319 -97372
21358 147357 35683 109742 -109331 205323 -130038 141259 131381 110749 215288 41727 -34811
21346 -87968 220771 -29567 114597 44111 50488 -10675 -267860 -103190 -103574 42951 -79614
21334 115710 262981 -252555 67582 129665 89936 -27773 -93302 -450260 -137866 115991
21323 -19451 -289026 -304419 -294074 -178088 102929 229741 -354075 -202961 -291267 39315
21312 -114092 153450 -74122 -14298 -167640 -69585 -46511 129429 -41390 -78669 -117395 244307
21300 -78516 -59980 -41209 -25985 37276 -129037 -242638 -278212 -24865 -214243 428018 -184166
21288 -248280 119812 60850 -114386 -73065 62826 70903 -79531 369009 -322848 59700 -18402
21276 421224 -129190 -359869 110118 230837 -26842 -91761 30045 -190456 -134554 -24905
21265 -155082 -71465 -30848 -249998 16047 225726 -305796 -74687 -18075 -169150 -114133 35670
21253 -55766 239721 -207965 -27475 -34547 -294679 165855 -36360 -272445 98883 -212691 284747
21241 15559 -437078 -37320 -89632 -197955 130819 116042 227263 -197202 -348558 -167557
21230 38425 -214094 -129345 107591 -389319 -153338 28194 -59833 -2682 -211595 -133667 68518
21218 -19540 -31470 -12458 -86882 105655 -156451 -323770 67234 114017 115223 -170831 41387
21206 395712 -488118 -212144 -334289 359615 119334 59491 -312891 -46838 -74429 46912
21195 -335405 -214093 69184 -157289 -177708 -282072 246024 131514 -280988 114463 -257245
21184 -242713 106464 71772 -202474 -69112 50933 -334819 396623 53985 38311 42821 125653
21173 125653 -219298 2174 -255224 75015 -137891 -438472 345164 -75166 15894 111680 210598
21162 210598 21184 -231361 89665 129903 109585 37727 125327 -221375 5605 119331 -136590
21150 -166107 113287 292846 -245608 63132 -63093 -75811 -37037 -66794 96420 49936 152813
21139 152813 171773 196419 -136502 -15791 -81224 -66849 86836 -132000 68299 111453 -238884
21127 89726 84248 -89037 -438275 140033 -108917 -217655 -104284 -236144 -156470 199020
21116 274790 10186 -37960 197309 -256561 -17159 231709 -121249 -258369 92504 -125727
21105 -8868 -98670 -313960 -2531 -9937 -301725 -129868 -43518 -328315 -108242 82435 157519
21094 157519 27532 -250267 75923 -373578 -151278 122090 -222419 11644 -56474 -227071
21084 -227071 -65000 258039 -107811 27255 43437 159761 -117992 40439 -106347 162926
21073 69117 -54906 -29610 -21009 -448889 -149592 5209 8979 250418 31079 -1505 45793 -228741
21060 -524675 156423 -29491 111283 182093 -118766 295565 117811 -124233 -3615 268998
21049 -320808 -104977 -281094 -35687 -68693 -173034 -90914 -169486 -202518 31339 -73078 -34860
21037 119169 42042 -44687 17647 369783 -65984 78904 -54741 193869 -131601 -63844 -19686
21025 139599 -202923 77526 -183139 253657 -226266 -21944 1980 -166470 -111582 -50222 340286
21013 78960 -430685 381768 -31603 -102090 37435 37824 94897 38561 339805 229064 151707
21002 151707 142767 -64601 359388 468191 294610 -31789 -72028 294786 164776 307264
20992 307264 -122053 -67394 -160515 -299188 105114 108214 -285535 -10850 -145198 -243806 343174
20980 -41468 267543 -109114 48136 -315722 316097 -9558 208013 -331126 58344 354846
20970 354846 -189212 -153145 297338 34750 33961 3089 -204038 -170267 153404 271450 -215303
20958 -123219 -120613 138429 -96322 417145 42477 -184326 -43288 -146700 -368182 181043
20947 -306205 -93935 86177 54966 151173 5066 145345 46483 138922 -154665 -68720 -280494
20936 -280494 16754 43211 209939 272797 317029 359883 -133738 231032 -192187 5321 45938
20925 45938 -144252 -89306 -14626 -429661 -220627 -248768 -49465 -327327 -272550 -35405 222836
20913 -187610 -108040 57647 129777 76881 -63045 -43571 -47068 -59504 -32738 -258918 -161696
20902 -161696 17435 -301913 -274960 -98403 36572 35842 96903 72365 -222181 45655 -226160
20890 -150449 47012 -323764 -172293 -203791 222504 -107066 -61515 42140 -140566 -24393
20879 89538 -96723 26532 91146 -46601 251035 329576 -230121 80353 -117620 -248850 -72563
20867 -589043 -41851 -155591 -170517 -28382 25132 -2995 -105460 58525 -157776 -468860 152529
20855 145144 106440 -137106 -38361 -99813 108809 -106188 -269706 -158811 -173044 120500
20844 21267 -163712 94042 -37982 -43726 49751 16337 -21859 -1047 24973 -35595 -72996 129381
20831 -22887 -139612 -39777 -231879 -124030 -252939 -76699 156759 -233130 -320782 -427446
20821 -427446 86933 -209428 291014 10830 -212163 112532 -290000 130098 -185428 -259321
20811 -259321 -76548 -550377 121022 -203168 336443 -261991 -23328 80072 752 -305409 -374036
20800 -374036 -36340 172842 246842 -121385 257385 -381418 -113426 130320 -27940 86170
20789 -126340 153046 54236 -196047 -83915 -300916 170206 176288 115843 -87966 -52578 30048
20777 109486 -129373 85026 -21866 -58807 -431775 -106960 -143827 83520 29094 243630 75342
20765 64544 -76954 229289 -54981 151514 69598 41094 38827 82433 15215 39801 117064
20754 117064 -152698 123024 -196177 -74165 -110616 -50761 -337592 35918 -158493 85573
20743 -99294 -25606 22666 -45732 34105 469488 -117776 -252073 -21084 -213545 124154 -195334
20731 61313 163984 -8752 -164355 -197770 -397359 164804 -10479 -91388 -64070 271198 389301
20720 389301 189671 -90287 10252 -161900 -231660 56261 218052 -212561 -161550 -126441 -31478
20708 66770 -167123 9338 9163 -87245 -79255 360 128289 59311 -216383 37274 100890 133877
20696 133877 -79127 -35365 185426 31308 -242533 -70771 -112191 -60942 -178213 83550 -4901
20684 -307800 -86905 3405 -247810 28766 -52294 -112194 -2910 134682 88783 -162177 -74427
20672 -460983 -195489 -33000 62282 97451 71058 173840 -180912 -197717 -340947 38239 105787
20661 105787 -136015 53515 -163455 218082 -228458 66622 -18667 -47553 51190 -72031 34916
20649 102399 -80737 -69510 -204176 63043 -209874 -371710 -308598 3693 -101147 -233397 -78584
20637 -24140 -56666 43732 -8460 202133 -89516 -178151 156806 35961 -6285 -258289 -247588
20626 -247588 -321156 -7598 160082 101308 -68578 -163626 -220685 -136118 -173411 110313 -212549
20614 -60143 16473 23008 215173 -66705 -127544 -188988 57321 -157305 24533 -33131 -6645 -185250
20602 -185250 9362 59052 37045 99236 -117205 -157638 -203766 -104070 150547 -233897 -177659
20591 -177659 -157654 46489 -54381 -56029 20960 -23135 -184871 57650 18991 -186134 -56511
20579 210452 -31414 40032 -32655 -87232 -321933 -262251 -202798 11815 -181245 -398629 -146553
20567 -7730 -87910 -144295 -14084 -8925 -52766 -278531 35773 -485632 249789 -180032 -302568
20556 -302568 124352 -229208 -230828 716 200666 71728 -230072 -69880 -18911 531 -45934 -26837
20544 -26837 33439 -38560 -169512 -65710 -267775 13275 159128 53244 81681 -134225 -74748
20533 -74748 114867 -52175 100295 -324506 -16748 -424691 -61689 -12278 -173196 169775
20522 -379386 -31670 220064 -253540 -65865 188524 149451 -199703 111608 -117796 143899
20511 43870 224027 -363524 -194071 -124736 -374614 -116350 -64194 76404 -127936 -108653
20501 -108653 -6445 -1652 -175974 -13713 36981 83391 27596 277678 95479 188373 63782
20489 108778 -210918 318699 -356446 -159621 -112275 123311 -75546 105947 -67981 -37093
20479 -37093 878 -275951 -353349 -116191 70470 -155108 113882 -258399 -163981 -419252 145882
20467 -110236 314266 -74153 -256060 103021 206120 -125955 48274 -127744 40366 -153266
20456 -16092 -422076 -99067 173712 -231889 168434 -232870 12367 -59586 -253395 13884
20445 -109189 25399 33544 3421 179711 88707 -203264 -269859 -174875 314668 257874 163596
20434 163596 -124348 -27413 -222871 12566 -55155 101274 2286 117789 -128235 -9391 79673
20422 -295418 -272480 194030 -205470 237191 -75885 -214234 216239 114311 -167367 53594
20411 108523 -191765 -225395 -146247 -55398 -72761 -257082 -148360 -197888 -114227 129096 138331
20400 138331 267415 151016 172541 -240529 -54276 55694 -41874 -106947 -61528 -96813 261974
20388 177099 77893 -544245 -102848 -233032 -150604 -284558 20808 -103691 -29039 43409
20377 -138461 30445 -53617 -196807 -150354 207491 240914 -299604 196997 -678 83619 119782
20366 119782 10569 145401 -146462 84419 -23511 -319145 -112080 -361716 -236193 71284
20355 71269 -81521 -17219 -59038 -144271 -97063 -67577 -217828 183971 138433 50106 44791
20344 44791 153678 -219852 -68818 -29273 52305 -73833 -15741 326444 -259897 232650 75767
20332 -97368 -298707 -38200 -246558 278829 142344 -229871 -313859 -246026 106118 -37667
20321 228615 -3764 -113812 -101915 -265940 209668 -132366 -37019 35051 165678 -146208
20310 194959 323272 -197409 184577 -119603 -88365 69770 321402 147995 19333 190153
20300 190153 -62693 -123612 -127266 -392156 139144 50252 288953 68040 -414044 -233236 360243
20288 -64077 -86844 -174972 -285418 -229023 -154235 -147609 -33623 -74554 204573 -144978 12955
20276 116703 -109836 188527 -162835 127869 -135893 -201460 -30440 -323274 -147738 -161614
20266 -161614 -126045 64757 83108 152431 47731 -358298 -274491 -117926 -159376 -41372 -153493
20255 -153493 268735 -98918 -297618 -157216 -89529 -154105 132696 -196291 -61268 381776
20244 -236760 -127705 -148652 -512538 -106100 -313138 -132129 -141292 -38131 -44957 -50826 -843
20232 -263122 121147 -95306 158136 -37652 -194048 -134871 -172859 -305026 -337894 -70257 -156539
20221 -156539 -283416 62243 -82854 169875 -145331 247010 55179 189809 -137237 -30072
20210 -172154 -393870 -466113 -141928 -102977 183560 23530 -155590 -381294 40678 57184
20200 57184 -58555 -61199 -27732 93486 179184 93038 -116567 -12227 -140066 -126097 94426
20188 209082 -94870 -47864 221845 -197070 154574 206556 48138 -294881 46274 -4733 -72411
20177 -72411 -88231 109683 250741 91731 77047 434473 -36542 57890 37630 29025 -55633
20165 85921 -116517 91546 185336 -52743 -152053 34057 -3321 59033 -28417 105146 -73308
20153 1965 -280 136286 -7420 -9390 45371 -136729 434334 4794 287779 384504 132441 231592
20141 231592 433996 389622 -203918 380538 140838 48611 240004 411429 125180 -22219
20130 -43318 -261875 -59170 -44707 -47190 -172837 91752 356340 -60952 -211942 -280587 266015
20118 -157233 -30242 179478 -168148 -25348 -185135 402261 73588 -36693 -124230 -132056 -65497
20106 -116577 3535 10447 -95011 -214052 352483 -261945 923 -84061 -7151 204676 142597 -94633
20093 -328583 161131 -146887 -148672 -99247 170179 -156031 83057 -27840 43661 -206640 -347901
20082 -347901 270153 109211 -233246 -51610 -308341 -94685 -1050 235222 77730 -235557
20071 111828 27899 -77240 -2602 -306322 -197109 -119385 -133934 233293 -78337 312074 -109359
20059 -34878 -152323 172049 -359274 98077 -14331 -169719 -177432 220491 -154169 -281686
20049 -281686 -285659 98556 133265 -200389 -48577 187036 76846 207186 95247 -60706 19015
20037 -341174 -59085 -89162 -309281 -209239 -7285 -68668 -84236 -164539 -125696 89079 248130
20026 248130 -8233 -42937 -11357 -296597 -49216 -129961 178880 288735 -149357 124884 -98913
20014 -155771 55986 229025 -133752 16412 -25764 182405 15018 173695 -209853 429108
20003 -177670 -25768 58992 -85127 -24054 -265820 -318783 -30603 -84508 -191566 181366 142899
19992 142899 123002 274723 61164 -964 58053 212957 167706 60098 -89561 287783 -86867
19980 65474 138928 130393 144365 130994 247129 100436 51848 242443 -84928 18710 -48662
19968 -15555 182456 138122 -126766 -27448 61184 -39729 -16002 158087 242047 -76350 -88788
19957 -88788 111238 -50192 27982 110429 -135178 43247 260581 14758 48686 -187847 346693
19945 203180 231080 -22579 -430921 55627 200430 -143636 -322227 -98121 130081 -250828
19934 18082 -160750 225632 -142994 -64620 -1490 175617 138281 -264268 -252412 69184 85409
19923 85409 60519 -42325 -81104 -226590 -177844 114732 352346 10550 14189 -291309 126995
19911 -107683 90649 -150447 29184 -185324 191545 68388 -147164 -220177 -223479 -184569 27547
19899 -3736 -96471 -337464 45078 -465805 22426 -141365 -162418 -211613 172819 -133692 192864
19887 -147037 15472 -402093 73195 267890 -156838 -283103 -42725 40110 -141103 -381275
19877 -381275 -226164 -419870 -229142 62671 -195178 -362861 -99051 -93486 -496294 -134498
19866 132002 -404810 941 249146 -91599 250424 -6877 -77814 192121 -39975 -523985 -71519
19854 -107676 -156222 -239656 16385 -303755 -116756 -4693 -120013 -384830 39847 -244664 51442
19842 -123964 -100573 -403782 72919 -55268 -15326 73177 -13476 -558534 -80214 56942 52377
19831 52377 -131463 -39902 -118929 -90202 -353084 166569 -30807 43518 -100024 -195156 265281
19819 -390641 270519 75286 -208834 -2337 -188411 25280 -160916 -183483 -4958 -276562 -150365
19808 -150365 -55666 -137905 -123197 -185631 -112575 -91748 62664 -38443 -390343 -213148 336244
19796 -129812 118173 -185719 128742 49345 -164803 129120 -79921 -171151 -175617 48968 -231612
19784 -68536 -126490 -183142 90478 -199311 -34484 -163883 80966 -251895 -1904 41714 -130871
19772 91158 -134981 -272684 -231831 -81909 343824 343637 -91839 177505 133193 -151372 -74209
19760 -70615 -69203 -81259 -82018 34743 -33303 -46467 -86970 33191 -126976 -178643 -42628 25357
19747 -101736 -260067 28875 238765 95893 52415 -295187 -156870 -11440 93654 120257 493747
19736 493747 -372869 284096 -70141 -88457 -37552 223099 -65451 -205943 394757 190477
19725 246431 152331 -141034 42678 38506 -317472 -10852 82470 -205004 29840 39316 123701
19714 123701 -244980 -13890 101736 72102 253341 -115951 370427 21224 214426 -143063
19703 80633 21971 -8778 -224122 -67591 86315 130878 62881 627510 1343 170405 12644
19691 -19060 199686 148662 -88732 174070 25069 229647 146306 -131202 -139229 48320 -74868
19679 190957 79345 -112624 -254336 -92135 -288991 -30907 -176819 -318341 -54001 -148928
19669 -148928 -158187 85282 -193482 -117459 -259035 -124503 -227032 49124 270596 -117343
19658 -3562 -118029 -191722 -294403 -4101 -23813 126794 -160578 -78173 17187 -161026 -210795
19647 -210795 47945 -118449 26370 210204 175282 -158569 -352629 -55422 221229 36022
19636 47911 139416 151099 -174382 -206951 -71398 -206988 -291949 -493578 222394 -63663 -150287
19625 -150287 264007 55893 -71392 -304848 -115084 196314 21084 -191567 -329651 -13670
19614 -243474 -195318 -136701 75791 247968 -254623 107859 -187245 -133007 -10377 -40695 46138
19602 169671 213899 -132074 10881 147649 173584 -58738 -413341 87520 164373 -206139 231022
19590 -80596 -142042 -214121 -273758 -98144 -95124 228830 -109386 -313872 -108987 -198779 -90877
19578 -44154 154937 85093 103818 64088 53044 -5878 115918 -79867 -136137 131817 -91310
19566 -41880 -176802 91557 73463 29664 -60664 -202115 15462 -422661 141588 -174899 -106486
19555 -106486 205765 -62210 54507 -145772 286029 110282 -96645 136088 43610 31180
19545 31180 38663 -238937 -171380 41787 -67055 38098 70233 -53578 99592 -125506 54440
19533 299391 -68779 48515 -19798 29809 -86014 4756 99233 -43721 -94256 -96181 -168857 143742
19520 -405423 75910 -170537 -35277 -25076 -81335 -37969 -213023 -99719 -68634 166860 -213819
19508 86781 -160964 -312253 -196935 -256766 -131975 25708 -401969 -32652 208862 -126940
19497 -25816 234437 -253274 103894 -15736 -421268 -56250 211911 -147061 -278503 -50806
19486 -156780 63301 -16183 -70558 -487237 93502 -175551 28139 -45396 85542 -148939 -156078
19475 -156078 -203860 -264468 -219981 -183259 -70501 -323874 -119946 -247047 28990 -122346 -91554
19464 -91554 19758 154870 120316 13204 -146443 -397945 -222804 -70373 15743 -103001 -68217
19453 -68217 -121949 -235970 -55558 4505 -183674 -132797 -180472 -234528 -100880 -184910 -264638
19442 -264638 157258 8600 80075 -56785 -253457 -236876 49548 -23796 -466981 64101 -19070
19430 -3235 -4037 -295205 -406804 47573 -169568 97819 83718 104328 89245 -91065 -207731
19419 -207731 225300 -87740 -149345 -340102 -232948 -3384 231170 -106759 167613 -17722
19408 -83365 79773 -26593 -20420 -158043 -8587 -126327 -14134 2892 -131609 -109569 53214 -96292
19395 6673 -365555 -279176 192375 -114451 -150513 -124812 -365676 -12707 -14369 -52352 -85936
19384 -85936 -271831 97178 -85745 -95627 58646 213790 -1091 157480 205775 221906 -142311
19372 -147523 -174683 82297 79970 -321580 -11516 -99122 -113884 116313 76579 -17798 -12184
19361 -12184 -121195 -304450 316013 -317320 185536 -63383 -340637 386002 -227509 87857
19350 -467587 -205856 -23416 226209 -14447 -102363 -137415 -208159 100180 48663 -1713 -44455
19339 -44455 -92151 -26549 228003 95116 69822 -277433 45762 77794 -117801 -57205 -293975
19328 -293975 -219921 -83291 -245318 75462 36296 -303844 -124189 -49811 -112515 -98892 -304194
19317 -304194 -202072 -114 -375599 -91293 71880 23310 -316832 -11590 645 84728 198596
19306 198596 33715 145108 59300 20312 -131449 62100 -406453 -128167 -318326 -76568
19295 -143660 -384152 22319 213059 51638 5257 -181603 123187 -129985 15671 284656
19285 284656 -182965 166497 194475 -277790 66768 -209164 -272134 107192 93162 -277368
19274 -190063 -66777 21468 -73828 55351 65535 98906 -46485 -85576 76404 5118 -270175
19262 90056 -33601 73091 305194 119103 -132601 46628 -136009 -100539 -230369 -52845 -246695
19251 -246695 -273817 -307871 75712 -134129 -69600 -167890 -152537 -6523 -25780 -17255 -15175 91076
19238 143237 253136 -174813 -101923 52626 -260207 296929 49953 52358 434263 -48629 -200313
19227 -200313 165586 -216158 -104093 -87466 -182241 169037 146186 -69937 168513 200091
19217 200091 -94905 -245558 -321356 55563 30879 112366 -187090 -99852 -71349 -252586 -138295
19206 -138295 187361 -8363 -375539 -85873 -234458 -395 176975 111885 -244081 -103976 -204225
19195 -204225 51406 -132975 4336 229446 -60372 48301 -18367 292731 -89577 39982 -278954
19183 -194208 130073 -11199 47693 -280675 -61453 -178019 -187612 2264 82658 6045 -62640
19171 -185561 65496 -20540 41973 108521 112992 106694 -127359 -64650 164843 -171599 49731
19159 -255664 40917 -237320 -341637 -194796 -75037 -132101 -111869 -89834 73241 152081 300020
19148 300020 -192997 18388 1731 -61763 -50103 -64518 -6172 31435 104853 69466 1379 -64591
19135 -38560 -158746 -184067 52081 -149596 -175116 -440470 -219048 80051 -120693 -49063 -17297
19123 -91436 -66122 -47301 50412 -189010 199628 1799 12494 33573 -109755 35760 20056
19112 20056 -208974 67817 -144357 89763 15409 -232919 134665 -213065 126957 92178
19102 92178 -114916 -81832 12463 -423711 161001 -88500 -32850 -89959 -145802 -273140 102784
19090 -147136 -163637 -275880 -198369 -32432 172420 -88009 12082 35216 -137910 61557 41458
19079 41458 -339875 -34840 136952 257035 -44454 142134 -85694 103560 147325 -43952 -221456
19068 -221456 -148252 -20358 216454 -257006 -235449 -98245 -32529 -42072 -221695 36266 88255
19057 88255 -237069 -164534 -52813 13736 -15277 -244705 36931 -80350 -177189 -56010 -347998
19046 -347998 37559 -24374 -59006 -274067 -311359 -214684 -273101 -308202 -132407 120521 -284483
19034 -92833 -118930 52560 -126623 60925 -106491 224702 124499 -24661 113602 28423 72960
19023 72960 -130805 -188765 -182893 108118 -216208 129145 52964 -168905 -235048 31205 208421
19012 208421 230553 74633 90175 -200884 -104765 117398 73772 55974 33072 -67849 -318
19000 86447 -132047 51656 -251477 -20169 -64326 -273706 80892 408227 -124528 -225433
18990 -225433 -95119 -288456 -288130 88780 -325161 -82055 -253524 -111627 34149 -299426 -75340
18978 21416 -440971 -40733 131452 -11457 -130071 340714 -68097 141226 18308 -304358
18967 -124897 474404 -29553 57602 375977 -52157 -48064 -19797 -55249 57649 -111662 41448
18955 1478 175836 114282 -357499 -52734 44324 -123861 -36875 -123058 234009 -4027 237901
18943 -23462 40757 -104679 176934 -179621 203599 9208 -248733 45983 -110465 -183285 -86815
18931 21984 -12883 197202 -61148 87577 -47898 -205845 99417 384417 108361 -44286 49464
18919 430338 187786 47429 -27313 213085 -95193 147778 -21836 -34644 120121 -142765
18908 -175305 79951 202056 10641 -97604 -231247 28385 100854 213814 258966 75681 -76113
18896 174567 10232 -296497 -42732 -77047 463641 -256370 -164758 -161873 -191896 -104893 -117826
18885 -117826 -131574 -30306 -205440 247499 -315799 184851 32683 -213851 -83527 -116860
18875 -116860 60781 196153 -202557 35636 33395 -119377 211995 -150596 134392 -186540
18864 -189808 167702 3892 -117645 -27557 -298653 -20409 128258 -167362 -49241 16896 -194951
18852 29754 112529 -5469 -54793 -180955 -5686 -299432 -249476 -78844 -163028 -115357 -146155 -110303
18840 -110303 -24606 -152049 -180075 423568 -84635 -126549 -38801 140210 -411175 15825 -205180
18828 439119 -204636 -85089 -272257 119553 -232254 -211861 -210580 105738 -180760 -11838
18817 -273122 159186 -29991 -290890 124448 -419592 -92330 72399 -130821 -568546 126864
18806 60836 42337 -20916 85699 -86644 -33789 -30670 -200447 -248675 -210856 239659 -458 -201294
18794 -201294 103042 160391 40237 -183026 -41147 249636 -43881 -27816 -221581 -164079 -77906
18782 152739 -64957 -37738 -116021 -135331 -116250 199032 160304 182590 -15974 -314613 -384139
18771 -384139 -184511 -30259 154135 112976 40574 87333 -74137 -394183 116356 -99960 -66947
18760 -66947 -45304 8697 82216 485 135662 -278490 206472 108019 -83106 114221 -235973
18748 219320 -240520 -4736 -27776 -54728 240450 -25845 35745 209622 106987 78807 -14416
18736 -92719 11697 -142777 146034 -220421 -338664 -197693 -708 -32431 -49586 -117177 -157358
18725 -157358 203754 -144988 -263153 -79153 -159694 -233519 -102445 133908 -137222 165227
18714 9809 171607 203095 268649 -132915 -24628 -167071 -36377 159575 -321689 -138965 -71779
18703 -71779 -248764 -266771 238198 -164883 -368120 -27760 173308 -109325 -27726 -57953
18693 -57953 -98405 -53166 44940 -473281 -408347 48610 -288684 -137360 11774 156947 153179
18682 153179 -452718 -106891 195307 -124496 -140704 -218105 -331122 -245883 -121554 53533
18671 -279756 177177 -124426 -105177 36532 135265 11896 1211 -203449 140534 -64548 -144391
18660 -144391 231728 -10489 7158 -133872 -165173 21213 -168288 -122363 133038 6245 -348270
18648 -68277 -334330 -241346 -68622 46356 30018 -98050 71815 274147 112710 22593 -304736
18636 -45267 83296 11385 -455659 -52254 -18634 269720 -119550 43675 -208865 83235 -163534
18624 -132954 -92231 -423373 -281218 -178008 -145015 -198788 167263 -180190 -151904 -133212
18614 -133212 -28487 -126865 -77575 -112646 8844 -203835 -158046 172854 115861 -9815 302222
18602 -153243 -23532 96255 182424 -179917 287400 -142044 -2571 17618 -92691 -35774 -216790
18591 -216790 -149030 -84603 -139368 -139548 -377015 -168466 209767 34934 76727 106624 171539
18580 171539 15788 240785 -163482 25550 64319 -326245 -67128 -162528 79582 -65621 83713
18568 -205939 -152275 -97391 25939 -106657 -132399 -173991 175964 73922 -123288 -49924 -142040
18557 -142040 31112 -203954 187685 129997 56901 -402837 -155259 -111436 83102 -65801 -132140
18546 -132140 360918 -340715 -274887 224962 -184241 139740 -16096 -199073 125358 -73131
18535 -285944 117004 -97109 -112935 5839 15865 205372 7615 -173413 -82030 -54670 -296349
18524 -296349 -123537 -65210 -211689 36516 -160833 -197735 -91291 52886 14073 -106337 24457
18512 -320195 -192160 -108191 -121260 -46114 -59932 -132771 -182728 96906 242035 -395827 -123236
18500 2754 -46688 -174891 28140 -146373 -70844 86274 115651 -164274 -63537 92959 -257219
18488 33891 73308 -281715 77084 -33335 133990 -246105 301618 172632 -60850 31438 -53885
18476 -79489 156819 109364 -9717 123190 -12418 -87111 -23388 -164697 44470 -270150 191185
18464 -69360 168051 128296 -98598 -12475 211865 -90100 -18638 7592 -47020 -48658 -28725 45016
18451 242921 -123183 -87057 -240367 -51491 -35796 135577 4214 118828 263057 -47897 16135
18439 -54219 -129582 245475 -95325 -404458 88743 -113253 -40722 -127318 -229986 149563 -60438
18427 -236694 -10725 -115848 -161642 -95644 -72513 -155391 -50624 116753 52761 -262601 33632
18415 -132189 181546 -192635 48224 118872 -28773 -297756 117876 23945 -90001 -51686 1866
18403 55187 185880 -234583 20067 79153 113510 138069 -98173 -130741 -228455 -52991 -231184
18392 -231184 -15805 136048 140052 -94770 132327 -105477 -119383 -170664 -181493 233260 88381
18380 133213 -76756 -103036 13816 -123840 -76552 294141 -244527 -60372 -43411 -204175 -131105
18369 -131105 66512 250103 -106813 130481 -442034 29715 18129 -85832 -313613 -109928
18358 68886 155218 81775 -98827 8930 -11235 -68578 -259885 155349 118842 44349 -25133
18346 -20867 -104339 107422 -138037 -9309 115295 258886 149810 -253577 36533 -5174 32852
18334 -216118 75323 -360239 -111643 171914 66664 -165442 -195961 -7208 -200176 -252142 -168049
18323 -168049 -134136 21598 -68250 206101 -205139 -248760 153937 -106496 -256498 -99218
18312 -15135 12700 10503 -225976 14719 36148 138378 -95029 -266281 259960 -40256 -146292
18301 -146292 -45869 8266 -5386 -58142 18691 61156 16152 63182 151091 165525 -179750 5133
18288 -61387 78422 -63987 78154 -74966 -72344 -95756 -81105 -119076 49318 -379350 254012
18276 31957 44690 49422 -21049 119792 41750 -345287 -50342 -61584 -57631 -153372 -245886 16284
18263 13952 -256399 -100123 90472 -94412 -315233 259881 296905 -243431 -365430 -241152
18253 -241152 -123735 -155290 74469 33806 150318 31949 39787 192772 -184760 111835 187562
18242 187562 127614 131168 40862 7894 -44519 -25647 -208423 -269382 -77837 -35965 407189
18230 -204502 150435 1190 -43107 185202 -156005 401436 141683 16967 255934 -98437
18219 -39857 -50813 357761 -410190 207291 -505892 -87126 2729 -368102 -145826 -353329
18209 -353329 -36085 -10706 296468 -210910 -32456 -7511 -112953 9281 -293968 -8053 -36287
18198 -36287 57290 -379040 -42941 6424 105536 -199159 -291078 72862 116255 190634 -118370
18186 -244205 -145732 74775 75347 -197523 -26390 21238 31377 -27617 -159337 55714 150847
18175 150847 239593 -502479 -34827 335423 395145 -185113 -81204 -81631 -257274 -29584 -160447
18164 -160447 64360 -51692 -150840 -217126 131585 -66170 51296 51269 215992 577884 295493
18153 295493 -227779 -151421 112807 285752 48886 113593 -121899 100545 -112084 83594
18142 58436 -174585 -144109 -138227 -197030 -68072 -48617 117489 109638 -112831 -27803 -55829
18131 -55829 -92921 20399 -79752 -66819 194344 39648 -795 -97764 -164932 263917 -26369 -32063
18119 -32063 -139931 89367 145831 -298494 -300524 -146765 105110 26251 307204 61836 15522
18107 -129439 -221294 -226854 -8192 -73826 117914 173280 374410 314311 182156 -70320 -276285
18096 -276285 -23007 48218 152715 -124588 225530 61115 38637 -43717 -23111 158452 305317
18085 305317 24395 -256170 -52738 -76247 7680 -234915 138625 -25287 -35345 273329 58759
18073 224852 -159702 12101 -240170 -407425 219265 5313 374026 -167020 32326 -62147
18062 51807 -377636 182404 147447 -22520 95168 -195872 95273 149464 -151336 34755 -45211
18050 -372960 90319 -162925 -125808 -62798 -316267 -441704 -53361 235205 63156 146835 -262052
18038 -188259 191791 -195711 126423 -2943 278 18624 190191 203421 -114454 260397 -97004
18026 -225833 -140676 71932 -96922 37403 220482 -51996 -197156 38960 94813 -44687 -8245
18014 75738 -33577 9315 -43687 17791 265463 88868 138760 17023 -341905 266459 218643
18003 218643 211747 -219002 364600 197879 657044 99160 -78606 -334909 -16096 56021 74965
17992 74965 -47479 464815 233859 -285477 -5898 124611 -120529 426309 60710 -162049
17981 72241 -173982 30750 -203209 -191050 -295717 202672 96786 203572 382893 -52501
17970 -117648 -2996 -167292 5132 -116838 31681 353356 -84983 -262791 -219509 -249757 15885
17958 -414469 -139764 196946 139492 -95498 -28769 29513 54292 -133648 -95527 119418 -65010
17946 -125874 -74966 67700 85320 166469 155775 218862 -547461 -95635 -162687 340169 -257283
17934 15838 556 -29281 -250846 -88949 -4908 -38465 45514 -205174 -197616 215862 -110741 8042
17921 117076 -140263 85353 -42581 181024 195228 479987 -293532 -69553 -164088 -34551 219474
17909 4340 44594 9895 -152305 136872 166699 35728 434309 -99121 -211773 -194024 -238167
17898 -238167 -32200 -123058 -133245 -106826 114340 100220 -37617 -8796 -61217 195242 -135227
17886 202049 139518 249101 375993 -56695 58806 415675 230543 357092 106749 65442
17876 65442 144361 48044 -88520 -335104 -27580 -117045 -87997 106397 147108 142284 -98759
17864 -453369 -331361 -46063 28753 19943 -221356 -228941 -12049 -94521 224160 86935 221492
17853 221492 222320 128210 77954 33282 -21831 -8332 -7386 276842 -147361 -70235 318438 157404
17840 -75661 64400 131810 -75921 142882 32151 152691 -65641 267038 -5302 -4514 59235 -127302
17827 82840 -169294 -159612 -93748 -122734 -171949 44064 232017 344572 -30324 147239 104717
17816 104717 -12522 -87466 -302976 330014 181554 -96825 115449 133669 -141655 158303
17805 182013 92828 2723 333982 -25571 21504 -20208 14682 228845 46988 8451 21553
17794 21553 94233 245458 -126610 127882 180315 55501 67136 -128634 -137309 258790 -4763
17782 -33261 44827 16482 -37265 129020 -6806 86307 -35246 218551 243315 166857 197321
17771 197321 -302824 -25603 83046 127782 -203421 -3175 -221728 205651 -26096 35886 -24581
17759 303353 -149811 122800 -130724 -25944 53746 -6298 469913 158271 -58482 -143324 -40277
17747 77174 -111031 -167840 32425 156640 -69183 223131 -17058 -66308 -315428 105738 25429
17735 16263 218270 183349 -63978 -62392 202161 114820 213478 -103026 -258065 -136561 -72419
17724 -72419 88624 -180138 -65471 110941 147591 -109861 378092 82542 -174500 -10726 -16394
17713 -16394 299455 68755 196539 210945 -205566 89781 -102982 -204286 -135674 -85553 144676
17701 -385607 134254 100224 165766 -73153 73788 153789 -260698 -207547 -17110 490787 267413
17690 267413 -66633 -72437 -114420 -29884 61968 318394 -135552 32409 -346290 310440 -18543
17678 128676 84172 -12231 -13694 10918 27830 31584 114198 -53265 583143 -321808 -125832
17666 75321 106665 236207 8644 -101420 313947 131029 -111726 112959 256678 -81605
17655 84993 -317002 380286 32526 151769 37910 43780 172574 107026 -129683 247169 -27481
17643 -86389 -15598 200575 170718 50691 213127 -312769 -14878 -6881 11068 222707 32231
17631 500336 223697 107733 289441 113508 251718 64969 48999 18718 142213 80121
17621 80121 51229 -171274 -283841 9655 39279 5895 129618 138595 136457 -226271 396049
17609 -164961 -212795 -83503 -160881 32926 70268 307544 272940 62074 161363 110312 31661
17597 134448 208174 71586 60208 -214717 190001 56593 83303 27971 350971 168293 -347350
17585 115382 79228 -184504 26341 169084 192016 169486 -43345 121986 -85687 31364 112491
17574 112491 76869 146193 79695 174493 137405 305697 389145 86757 278110 162502 97972
17563 97972 -277822 365881 103609 99526 119548 231813 252096 173724 4229 12643 -65917
17551 307707 -67269 -182152 -61065 -66542 61786 292688 -112205 387112 216684 199576 277499
17540 277499 -56711 -17604 228205 363520 323851 353085 346468 -2845 135942 143215 208567
17529 208567 180712 167173 702165 121682 -77126 152649 199817 389153 338456 553345
17519 553345 313853 402239 215704 15042 62402 276248 394188 347430 289041 244418 516908
17508 516908 387013 476128 404778 456018 283501 366250 114238 253040 352917 166835
17497 344158 499751 403677 236064 186279 240288 73233 475052 212648 446059 181231
17486 12151 65917 291545 -3464 478622 311241 323779 -16471 262125 365294 276247 20814
17474 -29926 17499 194498 146684 -11420 188918 520478 231921 106764 -158746 419253
17463 261632 251038 291769 522794 245143 274615 -42024 -49979 581286 147267 249703 -88147
17451 18903 201621 55730 242141 214180 309552 248362 188480 340513 217910 453432 150422
17439 309242 96885 135382 247505 277861 185037 727916 74732 304437 -240571 -11099 491559
17427 -10339 337710 101343 365823 428657 151517 333987 88264 397824 593360 237827
17416 294575 163900 311237 120201 221259 369971 99107 127480 244942 178199 179413
17406 179413 360005 375810 94122 117986 21509 50712 -231993 36439 442627 21391 183023
17395 183023 -34997 324937 -99775 252350 25920 -8932 282799 -93588 143636 266542 339140
17384 339140 -1666 84948 30477 390637 203462 121056 281584 245993 110107 129228 40625
17372 -137790 251930 107426 448941 174256 183810 -335 305743 224704 140273 -38749 274389
17360 -42380 392672 343434 184624 267627 301389 450507 -72504 -8795 388448 336973 63640
17348 383954 397710 -238634 120197 611194 -230203 276410 -18367 338301 39424 115922
17338 115922 -46734 28508 -149880 22804 407912 232382 69016 111963 234786 196622 204838
17327 204838 448810 340374 199136 106418 279382 451221 189779 268506 439683 170752
17316 653014 408519 112928 205004 261173 196789 364166 617459 126966 586809 486465
17306 486465 656960 434385 314382 388124 112013 -23523 -14450 -35132 159324 430116
17296 430116 158203 441777 -42929 -30229 -55854 252406 240984 525277 273418 43162
17285 -9184 288749 145215 292645 315989 159951 321197 100559 -169743 26668 -92283
17274 174952 323395 680971 192264 66339 208593 122166 409486 487441 282270 363850
17264 363850 37288 530299 143958 488296 489820 592712 530130 163835 426569 221722
17254 221722 119684 338319 317516 494552 221623 459488 271622 116883 62565 344175
17244 344175 481677 146513 160221 532966 343447 79278 368933 308842 395791 155083
17233 561800 546566 429279 55543 499199 373818 4147 -31977 -78674 164897 256748 396291
17222 396291 370590 417014 548107 241484 278534 262182 318646 119733 313261 232266 309737
17211 309737 585537 351225 420163 471019 511437 456244 507752 454412 136715 443487 366870
17200 366870 346702 456882 380690 680685 750898 472893 733995 427120 636773 466647
17190 466647 487852 415140 481299 86542 605692 583401 755184 380923 418160 614898 507928
17179 507928 153633 73757 420722 555709 807905 393396 508979 385452 614303 519152
17169 519152 471925 751069 324887 99121 452250 351438 566652 359680 671150 337017
17159 337017 496941 601540 389626 667054 557301 380713 467910 677641 180253 269048
17149 269048 414915 332928 689295 480304 700410 648029 522917 526268 574369 389584
17139 389584 242117 638108 502521 749706 265373 540073 245811 373791 845479 182036
17128 612558 289659 502592 707259 621305 682797 997064 621814 463748 362512 578028
17118 578028 529446 672309 757733 482568 557029 588366 587645 493341 882728 714909 992112
17107 992112 885268 664764 877675 505927 545214 786765 604976 662349 508460 744480
17097 744480 690148 538014 558982 380217 628855 237312 1032217 977339 487786 719302
17087 719302 746021 753900 519836 619110 762322 974477 654819 1021820 505325 1247878
17077 1247878 986819 1082693 982800 946155 716815 861168 969286 900403 531263 1099633
17067 1099633 782572 637220 1029075 911333 810610 461597 1195620 727237 1136068
17058 1136068 754434 844061 1049665 1243018 746642 632454 1103075 1051187 868109 717656
17048 717656 922508 1303732 1193023 1117580 1124891 896967 987699 801890 844773 841553 491231
17037 491231 849548 1108038 1065349 770808 919080 1178093 1211168 1184246 1056665 1102502
17027 1102502 1128213 1079653 1181944 1160819 1106310 1069464 1431439 933377 1092273 1038513
17017 1038513 1047531 1010681 1024312 876068 1244957 1275071 1069991 1221257 1304414 1079590
17007 1079590 1418981 1271233 1098838 1167553 1315149 1164521 1106325 1345259 1338457 1560372
16997 1560372 1444855 1311465 1512765 1558781 1683760 1700004 1879543 1689331 1418298 1512449
16987 1512449 1886195 1673001 1502367 1666574 1161410 1709248 1476179 1818287 1549996
16978 1549996 1634208 1609207 1443975 1575680 1706874 1528699 1690765 1844200 1450593 1756796
16968 1756796 1942813 1971809 2113762 1774398 1774674 2052069 1768479 2179582 2149153 1488662
16958 1488662 1920856 1970942 1658011 2162123 2280801 2237793 1837934 1888702 1943968 2009690
16948 2009690 2204592 2102613 2128448 2579683 2140597 2312991 2726974 2694474 2264221 2284330
16938 2284330 2400309 2649306 2612315 2663535 2591088 2472133 2883573 2619735 2565082 2906624
16928 2906624 2637607 2649068 2577170 2628021 2737526 2969773 2869002 3018621 2801743 2909246
16918 2909246 3203809 2830034 2977889 2938502 3416802 3099882 3166101 3133010 3299985 3215631
16908 3215631 3025532 3406536 3253860 3329926 3826387 3406582 3810276 3652005 3710155 3946093
16898 3946093 4011242 3809895 3777166 3863127 3812044 4194607 4215853 3882035 4119510 3919897
16888 3919897 4446110 4624978 4391972 4562581 4174997 4384065 4460458 4707429 4798652 4797264
16878 4797264 5010472 4807245 5081784 4663035 4979251 5197418 5417630 5242396 5758779
16869 5758779 5376304 5595086 5460395 5546103 5819141 5665159 6126813 6007776 6003171 6433094
16859 6433094 6505844 6404906 6503068 6630565 6703037 6525038 7252224 7056397 7055360 7473080
16849 7473080 7493799 7594369 7548007 7714590 7665434 8189498 7811642 8316179 8274980 8410755
16839 8410755 8570665 8969225 9252968 9414682 9113338 9569077 9739513 9828152 10088519 10062315
16829 10062315 10127776 10485716 10880142 10690319 11159127 11484720 11412133 11667254 11773542 12239667
16819 12239667 12474842 12843740 13108959 13224217 13528293 13750054 13895647 14329662 14694357
16810 14694357 14853749 15368414 15533456 15834980 16205905 16213492 17051849 17239150 17627861 17746750
16800 17746750 18249863 18746970 19338451 19618262 20196303 20209383 21334596 21328938 22105930 22289691
16790 22289691 22736379 23573549 24215277 24428832 25073250 25834963 26650443 27046063 27882018
16781 27882018 28136311 28899996 29789676 30642361 31467415 32393881 33071781 33792371 34395933
16772 34395933 34994613 36507207 37517380 38093237 38941332 40011066 41277014 41939410 43314795
16763 43314795 44536247 45211669 46472946 47422402 48706235 49920241 50970810 52384398
16755 52384398 53578017 54690214 56060504 57201177 57916457 59289641 60721445 61694502
16747 61694502 63400780 64327547 65486143 66745269 67585784 68601866 69746151 70338193
16739 70338193 71522936 72483023 73222227 73849331 74599712 75023712 75379478 76176926 76257571
16730 76257571 77031672 76813253 77304113 77188158 76888783 76855625 76286975 75993582 75839730
16721 75839730 75337251 74987337 74231837 73535579 72934907 71643969 71339271 70086070 69461207
16712 69461207 68330511 67310887 66057774 65336411 63979032 62901820 61805205 60671908
16704 60671908 59534182 58465147 57006758 56360821 54758997 53829143 52594130 51518678
16696 51518678 50500609 49377289 48255206 47397164 46413583 45011921 43887468 43356919
16688 43356919 42195285 41317019 40430373 39564562 38429715 37959489 36785112 36028242 35133339
16679 35133339 34275849 33699014 33026193 32079391 31592771 30826390 30189893 29634962 28967196
16670 28967196 28088248 27662709 26891640 26722071 26026593 25422317 24728509 24287383 23811851
16661 23811851 23138225 23134330 22318970 22113067 21438281 21147862 20852073 20383466 20065172 19825386
16651 19825386 19399692 18877403 18494674 18353025 17716571 17406075 17282391 16916221 16387921
16642 16387921 16264314 16121863 15840392 15550276 15247304 15195475 14578675 14377468 14327647 14133467
16632 14133467 13866508 13822282 13172662 13116480 13163646 12582881 12690076 12329093 11938679 11926830
16622 11926830 11581361 11443611 11280625 11376810 10992859 11036179 11039886 10850349 10093309 10422253
16612 10422253 10511960 10066662 9959829 9599487 9538103 9406103 9066960 9235617 8996677 8833869
16602 8833869 9039395 8847898 8806072 8772916 8766613 8501371 8295785 7953769 8066523 7859069
16592 7859069 8072780 7917038 7864223 7574914 7567051 7418923 7413588 7148785 6762034 7359340
16582 7359340 6701167 6840006 6874822 6856222 6916921 6862589 6441884 6646102 6130220 6477468
16572 6477468 5986555 6036285 5904086 5983469 6043364 6001790 5912560 5736464 5664425 5691652 5516436
16561 5516436 5421323 5733727 5517389 5344553 5635522 5079091 5376625 5295255 5106055 5378610
16551 5378610 5169661 4918651 4884567 4788546 4976057 4896534 4965642 4703852 4753898 4756434 4395110
16540 4395110 4457710 4596391 4184618 4512114 4180450 4256598 4450590 4323171 4278226 4294825
16530 4294825 4189607 4095036 3958330 4076884 3794839 4054180 3925189 3832864 4134106 3498124
16520 3498124 3738339 4081339 3886308 3724193 3679694 3814757 3823712 3825185 3731431 3630022
16510 3630022 3461888 3842466 3629273 3788467 3543810 3351040 3217916 3188325 3320286 3279404
16500 3279404 3341302 3501204 3492197 3144305 2910766 3363728 3187218 3109501 3201586 3237329
16490 3237329 2971917 2923339 3075182 3143383 3066517 3009315 2768644 2811811 3276789 3002039
16480 3002039 3274771 3000884 2770335 2934542 2959681 2592729 2680367 2815725 2904605 2776196
16470 2776196 2743136 3022440 2796510 2693925 2874310 2562180 2616993 2657376 2512138 2556879
16460 2556879 2724392 2456562 2858099 2434278 2193880 2439301 2567606 2696517 2414096
16451 2414096 2353795 2487494 2193421 2345539 2210146 2170950 2338422 2164843 2251739 2355860
16441 2355860 2484826 2223059 2301596 2096002 2653632 2296491 1951070 2201367 2346119 2151145
16431 2151145 2135836 2050788 2228927 2270947 2008792 2091445 2197436 2156433 1888600 2089956
16421 2089956 1994218 1858577 1943305 2035359 1982555 1923248 1975983 1815265 1674242 2090322
16411 2090322 1803777 1838390 1935822 1890499 1631463 2100346 2175014 1574915 1816326 1570126
16401 1570126 1740419 1831127 1614026 1681740 1380520 1520901 1476539 1973135 1788760 1971509
16391 1971509 1679394 1934142 1756096 1518762 1575701 1723094 1732477 1686351 1858905 1661594
16381 1661594 1650188 1534213 1840595 1425616 1871575 1601812 1565300 1309789 1729118 1693979
16371 1693979 1453049 1765175 1534182 1455182 1310945 1666253 1468865 1580847 1818638 1462282
16361 1462282 1537444 1689210 1620123 1688419 1597329 1314388 1821299 1333060 1491695 1181019
16351 1181019 1301759 1514851 1338644 1622165 1182436 1382129 1504111 1510885 1061125 1476730
16341 1476730 1561666 1596195 1181911 1243819 1125693 1520990 1275403 1241068 1118531 1482855
16331 1482855 1173684 1301301 1464247 1352168 928548 1301762 1136725 1430311 1029317
16322 1029317 1494408 1364130 1016320 1273126 1301018 882057 1308801 1119277 1358731 1079201
16312 1079201 1264677 1097213 1028035 1306634 1172515 981829 1336685 1096506 1185753 1254362
16302 1254362 853829 1365287 1078732 1491914 824142 1068375 993809 1089827 1233765 1029583
16292 1029583 1174690 769041 852450 761961 1270034 1329943 1121718 1272712 1084620 933883
16282 933883 1019449 1272543 778232 1016581 1031348 1251662 1046566 1042960 981480 1217854
16272 1217854 926918 955371 1227740 585082 1192135 980498 1069347 1126793 981711 1147695
16262 1147695 1218917 668049 950739 910231 420970 619776 294304 775135 969723 912722
16252 912722 416721 1040638 643965 942572 883252 853821 773656 950557 905532 557389
16242 557389 890694 791358 693301 496756 887831 789130 914009 946436 756865 482607
16232 482607 643908 826560 605254 645975 1299343 459572 932338 614842 989765 1039195
16222 1039195 720138 353963 786059 596813 776585 816369 793634 869877 1000603 637579
16212 637579 868617 923541 450877 391556 430019 835994 668032 870797 697067 572673
16202 572673 529983 489836 622006 928143 532765 520019 700862 657491 665168 414030 726253
16191 726253 284997 664945 533739 482966 615658 404938 405485 687437 632283 376828
16181 376828 683301 446074 619124 701226 554595 955504 667862 1001343 646569 702431
16171 702431 480618 290617 477683 786440 561548 621622 445763 718004 360073 701835
16161 701835 314974 483322 480469 709302 471404 474825 255550 527603 757782 666076
16151 666076 435533 559378 685022 375958 457036 624627 684045 332833 498077 259523
16141 259523 879144 613227 285450 454944 275032 457062 314243 415660 659187 453063
16131 453063 272420 469754 491462 404143 409853 -94441 531775 510856 374946 498818 335946
16120 335946 444640 413133 595852 640697 327389 -23270 405199 194609 214492 353036
16110 353036 617632 514915 218048 158519 602468 421366 586680 428851 332401 187144
16100 187144 112706 334305 512681 -3826 587738 601553 188997 571074 400283 339677
16090 339677 333854 346884 107886 40399 394834 325051 387278 254078 422506 220890 125534
16079 125534 406016 150750 299256 353812 171652 381574 497620 444429 398814 270697
16069 270697 645428 202359 239773 138266 336405 29804 93240 661601 118959 557720
16059 557720 202312 264627 300142 169492 1073 287728 429570 182338 420174 346182
16049 346182 254203 -12484 144138 295357 -42872 688838 264876 337717 105587 455851
16039 455851 526463 296516 503756 211854 337546 167707 280840 212054 209931 307376
16029 307376 390707 563065 520988 97668 375619 307407 390273 -101685 36738 298614 237438
16018 237438 360176 399764 295566 407073 214874 82392 390542 230591 -20091 376215
16007 -6268 365184 85857 281244 154752 597321 549956 609416 272721 371650 -30197 750859
15995 280941 164622 166734 -169885 241610 365605 160222 607371 454550 249566 482322
15985 482322 679996 861057 481629 664869 442224 338352 431088 -180079 188444 184556
15975 184556 119405 226311 267734 305515 29495 -193191 272210 42742 165205 95439 46227
15963 17655 -126077 353909 434146 -78266 68178 195647 101352 70583 551216 68316 -71788
15951 166446 45158 -29748 -1962 65594 105735 49212 -163003 130132 121685 420665 -85749
15939 285317 12311 -54832 165444 326519 135277 249846 -63394 51830 38810 202618
15929 202618 79942 107724 229574 -42355 172888 322250 183905 111128 264779 309326
15919 309326 88514 -88712 -67150 386939 -82304 17838 -332329 16144 170514 -41616 255298
15907 -118247 127667 142383 144865 -1385 117730 166290 -98619 306758 -97825 53264 241097
15896 241097 181552 192931 200532 330978 -112264 5439 108725 25765 155880 359394 224734
15885 224734 -203771 187498 -40280 3250 -21865 322580 15578 14814 73573 8412 210439
15874 210439 -35060 82509 77936 -66741 118401 -76931 95129 85840 -82232 24468 255719
15863 255719 -10962 -69025 378287 -49689 -183113 69074 -170330 -71256 216222 1735 -28266
15851 164171 -131093 98879 -115948 -76863 -110671 253634 26883 224445 -60611 131320
15840 -73654 168149 176646 58094 -59685 -72258 -99035 19500 27653 45331 7558 126805 157679
15828 157679 -77295 6445 180245 232718 -162615 138774 28163 -75507 30454 -160337 -285358
15817 -285358 -83402 -260715 -13827 30931 195360 117574 -28701 191260 -9902 91456 -118144
15805 120746 25336 -125667 -73705 411126 -180698 280793 143337 -32288 81341 214186
15795 214186 -241038 146176 5827 -139417 104797 201772 250408 -3803 120852 -156515 88912
15783 -214001 -46318 124522 -24000 114458 47904 165657 199305 109259 219658 -178544
15772 -73179 21570 15815 176128 32885 -152296 26316 79188 -60523 134496 -87671 84126
15760 300137 -235324 179496 69529 -126279 131880 -293657 113807 235356 325586 -162389
15749 86259 88966 -138518 -104166 60301 -45960 185753 115593 223596 145230 190259 56033
15737 -135305 14107 -307021 -57708 31535 -38390 110408 103371 325774 -238834 190924 197046
15726 197046 82588 -208046 -320874 -111866 -306283 -89188 -191798 36547 294475 161872
15716 161872 324779 51122 129368 120515 14994 -124651 -187925 482941 -68614 97680 -396369
15704 19890 -128908 -176426 -218165 -177609 -417252 77165 -13070 193289 99874 -35635 -74639
15693 -74639 -45069 -222831 -73071 126959 118081 -196295 -85355 154568 142489 -32976 84236
15681 168018 -60448 288789 44576 -89749 -13079 -259433 -33423 -147227 -395093 -76345 83077
15669 -248105 41122 -275663 -178696 -104619 -161941 -50076 36384 83257 16580 -199244 -97867
15657 155615 89584 54229 -93932 -115156 1524 -156976 -42690 95188 28167 -105486 274245
15645 274616 395071 61432 -90617 -11863 154463 -227929 157590 5901 -92003 84098 170234
15634 170234 -160486 24710 -130358 -21128 2225 91185 -23149 99383 -1836 -221761 446956
15622 -147339 67173 -40524 -28041 -122985 323373 -12374 318961 -120023 -17889 -68711 -17794
15610 -44474 44258 37652 275346 183815 69118 -41481 205140 203827 -188339 -77003 341437
15598 -26350 258288 138125 -136946 21790 -117050 74850 164970 -141058 -281113 -295196
15588 -295196 298137 341066 -9605 -297665 24233 -43874 114883 10769 -39666 -190664 103486
15576 196407 197108 204796 113654 132564 -67778 65282 -11231 -244457 169185 20447 130477
15565 130477 219337 194561 -117766 -201887 91712 -23073 -74993 -210491 -105612 -258828 -75991
15553 393927 -20624 148099 -74959 -37346 -235013 4352 229274 17708 -39344 -3220 -34868
15542 -34868 -38565 -2947 191250 177788 243543 -75978 -13540 357245 -91323 284851 79602
15530 36207 -102123 94422 283282 -225016 242136 -311374 141021 -110637 266011 241694
15520 241694 457005 263923 -114076 181922 -88269 83117 199464 -11613 -408167 91505
15509 -138848 -110602 -201083 45095 229914 -77557 -50706 250408 90114 18631 -240786 -4283
15497 294949 133546 169740 177837 7993 2170 -511930 -245342 -59829 -96960 15940 -274303
15485 -134894 212432 -195981 64118 -42406 -40024 29210 391768 20795 210133 101958 -403010
15473 32997 199336 -37741 268960 139680 61045 -102447 -123862 211117 53929 -30233 47225
15461 -120063 -120168 142463 -255466 258887 2167 384215 -96271 165691 -330086 -276813 85092
15449 -367104 -45652 128426 34306 136316 -72140 249485 34459 155147 -5466 -68650 -122236
15438 -122236 -104066 120601 -171360 -30250 -317034 -89739 -137050 64984 -105841 142053
15427 106502 -106146 -117430 168662 -185857 242915 -172350 -108376 234337 10496 56987
15417 56987 -148824 -100161 -286249 1329 192074 62145 108598 -77703 -100909 -48091 -141862
15406 -141862 87865 38275 -4377 -82265 302334 104163 88036 -75186 23838 23359 -54416 -267407
15394 -267407 -170383 197034 -78417 -47966 -360861 196196 61072 -46937 -23752 73177 -11599
15382 67552 -518723 -32284 400992 153302 -296910 53783 43575 -71853 -17854 182281 222845
15371 222845 68834 -156237 383202 166083 228699 443875 128361 369098 -344323 -184619
15361 -184619 134401 191761 40034 119192 35588 134711 -126409 47002 -215992 172361 133469
15350 133469 -141904 80950 92518 65945 14253 78699 -91863 41391 162608 -34155 -75692
15339 -75692 327434 46186 155753 -133394 86218 147610 74407 167022 -26757 -187640 27827
15327 -9878 52837 162577 -193779 -177573 -114408 -47306 -30707 243301 71938 -232698 216086
15315 349797 113625 164851 -70129 -44828 -581 -20584 178550 321290 -239532 229485 231325
15304 231325 307845 -58277 243272 136577 -227602 -12399 230311 364261 45129 64079
15294 64079 181344 76795 -108968 -64970 25093 -15373 127019 163820 122968 -175060 89325
15282 72656 -335311 93545 -168301 348409 -9271 86304 -37324 109470 -240633 322197 194091
15271 194091 127087 266037 -52286 185791 -129771 96224 273721 185203 338778 23684
15260 208088 75974 -63046 -195674 171364 -62090 226018 -86730 -37859 -73679 -206473 -32887
15248 130298 -111043 45854 447721 411052 595924 545247 2145113 3016437 2492882 3087379
15238 3087379 2395706 1132873 644244 293839 147427 -141412 247637 325462 -10784 143553
15227 -35909 -83308 60455 237719 -60402 -177761 43115 -51908 205755 -92881 -138761 -47332
15215 68656 51354 142518 -112802 -42225 80865 -537207 26665 96196 -76478 55733 141471
15204 141471 -44727 31503 -67294 -260211 -326317 232941 443512 47645 -36292 -169122 13910
15192 -239740 -101649 259051 120850 158663 -126834 143482 216351 -72056 354861 81747
15181 -148789 -18595 -343993 58055 -111069 -329826 44488 -215592 -113994 263404 -247664
15170 -341925 60684 -247656 -127995 197469 -72598 81035 157854 -205004 -34698 -25888 171930
15158 20225 209762 157472 518708 355182 117574 271352 131436 -35405 63968 110846
15148 110846 226916 -54418 -165364 36994 210489 227979 84059 9873 63770 142068 202508
15137 202508 203276 344419 27753 186092 -204651 240865 -160608 87242 273104 382195
15127 382195 123766 -17295 -183613 246302 -155130 92308 381091 61249 2882 63028 12950
15115 -241052 402285 419518 408745 521834 436702 108424 210041 421002 -64476 141088
15104 517 -61429 94137 60663 228306 -80592 218063 208916 126098 -48232 -54337 29612 6026
15091 -27337 254884 -286254 -227497 253752 148833 585365 368537 -73283 -201286 63082
15080 103283 75911 246324 62729 210908 33058 -75381 497889 133259 -168483 263156
15069 160867 110816 290256 349296 539405 200913 -17661 -195969 -97879 34085 210103
15059 210103 201974 88550 188510 177573 53987 265287 188307 152823 130002 30724 248463
15048 248463 391407 151552 491426 91237 -71128 -61738 -44024 -201295 -85935 528498 157518
15036 468186 330464 -239041 5908 129486 512292 382732 20468 279799 174510 116221
15026 116221 83112 255505 82720 261960 393527 212461 466114 552645 428663 376797
15016 376797 141555 242986 398489 228995 198943 -227256 33177 311173 140569 426562
15006 426562 270211 472594 198483 145221 93051 -192370 -160296 -52183 303370 285334
14996 285334 371394 297003 482698 147095 479939 361889 200634 572402 290045 27989
14985 -289490 393159 83323 290162 356775 484840 275536 798667 356625 161910 -22896
14974 324188 295107 116640 254082 343834 518308 10293 42923 431738 546904 502473
14964 502473 44672 -30769 160305 372034 409553 241302 195012 438374 444258 191928 423674
14953 423674 45994 431178 200194 264909 153823 352020 268366 472571 510161 232558
14942 381807 395816 32392 294142 363401 407363 397809 262029 309567 140817 326277 562516
14931 562516 632228 336194 496225 506900 722983 402494 400200 464393 565141 659454 591783
14920 591783 703482 721000 366106 521783 769654 606550 619210 420955 437542 340353
14910 340353 240388 334301 -10468 302533 182748 108630 421928 508903 789391 101377
14899 465017 86301 203103 99398 511243 474440 291631 151520 141761 169029 99674 469090
14888 469090 359414 349685 311126 37190 418954 160760 661026 544752 462037 434700 358481
14877 358481 457447 524567 487095 563516 365556 287857 394643 148045 349443 451098
14867 451098 260353 331265 387029 371571 488792 366893 -337 477488 127256 382740 203908
14856 203908 331356 311722 423247 170189 347601 616574 366432 191030 246583 493253
14846 493253 433849 258987 461023 623142 527462 517287 628450 611446 554530 568661 577502
14835 577502 569409 408278 437956 822147 436136 466008 320383 455883 506785 912305
14825 912305 253785 278741 287043 562112 383801 306681 367938 399159 173392 469272 337654
14814 337654 607130 263936 554161 140634 498723 302032 439896 765315 464211 266937
14804 266937 157194 499894 642818 449786 183358 567720 426871 545428 344442 492368
14794 492368 356867 384193 912562 401199 140292 560980 357479 531320 427081 517456
14784 517456 734722 493761 324604 435802 331294 527531 162555 668343 299092 715781
14774 715781 712003 637700 682996 532316 864955 378634 885774 94095 785604 494600
14764 494600 645084 455966 282447 804960 269513 557847 452384 560889 612569 700952
14754 700952 454335 554712 569753 724634 639641 514211 832725 517087 678708 667021
14744 667021 848478 525987 587270 754319 747826 762516 484325 652135 696305 657369 598001
14733 598001 670036 517517 481413 848783 693278 696399 756184 511588 718352 816396 464270
14722 464270 737329 505540 922671 856475 970261 498663 546619 802338 413149 529709
14712 529709 554779 763478 589380 720644 762087 479332 450742 905668 915689 906090 657293
14701 657293 1198197 591869 911500 760304 1150194 577212 1042074 657393 813882 1017815
14691 1017815 984051 801832 655412 984961 717430 724139 514653 516553 856889 989661
14681 989661 1002100 826374 668059 992240 860395 832909 928743 850924 1068408 476144
14670 901439 934636 713255 764818 1018704 924478 941421 917263 765129 813028 929735 972174
14659 972174 960254 789430 842042 523764 922628 977847 1104402 1045785 750182 1028722
14649 1028722 1176787 991274 976600 1128553 745766 1130814 1228488 1018496 1110003 1179066
14639 1179066 1095276 1070417 951836 1028774 892359 987985 1067307 1074849 1187435 1102858 1205629
14628 1205629 1000806 1178111 892882 1176089 1351433 1223813 1260310 1307196 1378009 1751366
14618 1751366 1006140 1539662 1292749 1334068 1082336 1395627 1086099 1271349 1478677 1168259
14608 1168259 1119289 1378406 925175 1290573 1326564 1443462 1668721 1536929 1309948 1206766
14598 1206766 1203639 1340790 1488229 1271582 1440038 1520367 1361254 1589460 1687582 1431620
14588 1431620 1719278 1554893 1625191 1693513 1544163 1729145 1541882 1735150 1566967 1697694
14578 1697694 1647839 1763107 1556888 2080644 1838998 1957667 2093900 1943704 2143065 2244471
14568 2244471 1858633 1881848 2211201 2066352 2321045 1944301 2343971 2430093 2348640 2252377
14558 2252377 2345592 2715508 2863529 2589522 2977117 3057113 3749936 4193907 5324964 7408146
14548 7408146 11778463 20002981 33610138 34238532 17583266 8549459 4616900 3154331
14540 3154331 2524001 3067446 3800988 5614932 7025694 3902529 2351892 2120723 2076147
14531 2076147 2079991 2134060 1923148 1821939 1903313 2031590 1971129 1950670 1718367 2120980
14521 2120980 2310807 2208141 2394974 1916078 1979746 2261284 2219092 2334118 2448665 2737913
14511 2737913 2290949 2267197 2241229 2530968 2291444 2495773 2587054 2287566 2666442 2757382
14501 2757382 2651809 2696446 3026944 3145049 2571912 2967197 3079888 2804331 2943032 2917592
14491 2917592 3353931 3275686 3229843 2908752 3322261 3217787 3126616 3279889 3481997 3210122
14481 3210122 3041214 3266961 3515544 3329426 3386005 3319717 3419439 3549180 3764809 3494995
14471 3494995 3606602 3756120 3705778 3862965 3587785 3637770 4113330 3922699 4392277 4256599
14461 4256599 4212825 4624219 4190559 4506492 4130229 4482349 4568413 4634393 4656420 4794017
14451 4794017 4604647 4962741 5010519 4713900 5091837 5080725 4924015 4656049 4986073 5268795
14441 5268795 5057022 5237769 5521863 5660832 5520614 5584167 5554248 5849616 5557028 5454029
14431 5454029 6183884 6139513 6243759 6120948 6491761 6589427 6639383 6438481 6391655 6730652
14421 6730652 6695319 6994075 7329577 7141901 7433850 7409149 7656648 7626034 7594906 7737687
14411 7737687 7999483 8156738 8049615 8321975 8316241 8304909 8611008 8923704 8825476 9318660
14401 9318660 8972133 9271241 9198935 9586604 10048780 10082123 10193036 10260245 10762791 10461468
14391 10461468 10861120 11036742 10944049 11136428 11289707 11864780 11994411 12077045 12383027 12666839
14381 12666839 13152669 13214194 13531828 13688896 13762250 14277165 13668928 14624298 14860857 15258654
14371 15258654 15254365 15832721 16287861 16490657 16677720 17241217 17592882 17499253 18477435 18520107
14361 18520107 18796248 19164594 19671767 20203629 20506941 21368290 21525213 22101438 22700744
14352 22700744 23199720 23525166 24061050 24585710 25208309 25798067 26922335 27462343 27908876
14343 27908876 28801090 29516031 30470513 31130513 32273415 33039816 33779192 34839244 35711155
14334 35711155 36860790 37752062 39223524 40263966 41603697 43219481 44158009 45644648
14326 45644648 47249506 48898700 50449268 52025218 53939783 55803640 58166927 59795983
14318 59795983 62125808 64465936 67074673 69377610 72176180 75289914 78204851 81439669
14310 81439669 84521631 88458010 92422876 96145197 100492232 104879994 109359441 114698376
14302 114698376 120038359 125887330 131788530 138133716 145274212 152322123 160151456 168439503
14294 168439503 176791962 185679451 195145804 205144079 215423695 226588744 237986936
14287 237986936 249561143 262386547 275530617 288666472 302041342 316094816 329919663
14280 329919663 343292772 356777068 369969884 382338474 393749331 403789871 411928518
14273 411928518 415654175 415746493 415991442 417393092 417511973 411127377 408422742 405399493
14265 405399493 398711039 389601325 378500492 366340617 353243517 339655956 325406121
14258 325406121 310985158 296547453 282579867 268946616 255810517 243130806 230510560
14251 230510560 218957625 207801732 197277105 187213462 179360875 172429854 163810523
14244 163810523 155541893 148118542 140921467 134112389 128048224 122216634 117020386 111637487
14236 111637487 106698174 102274981 97874660 93958685 90252118 86790940 83236851 80165731
14228 80165731 76854872 73843456 71238436 68360124 66030645 63682448 61105191 59380256
14220 59380256 57299954 55472071 53527714 51635245 50263092 48337151 47215245 45671352
14212 45671352 44338054 42834900 41884050 40291517 39273976 38473495 37379259 36236637
14204 36236637 35259767 33973057 32987033 32449423 31761979 30809607 30037405 28735080 28248019
14195 28248019 27461061 27043220 26489670 25536171 25059793 24430851 23809953 23279303 22695739
14186 22695739 22006580 22025952 20958602 20551673 20182395 19963006 19445079 19090200 18285031
14177 18285031 18306146 18250039 17359651 17108379 16650774 16321985 16219392 15849794 15525730 15253872
14167 15253872 15068756 14418540 14248828 14117579 13839917 13602294 13200742 13136480 12871564
14158 12871564 12856592 12444611 12250406 12202233 11948946 11811794 11539767 11319744 11148899 10901246
14148 10901246 10866625 10336839 10104456 10250402 9979885 9786652 9901991 9733008 9439434
14139 9439434 9010813 9363101 9122015 8882307 8670073 8653355 8749418 8289071 7887989 8083513
14129 8083513 7849603 7867129 8094781 7685987 7816060 7225766 7478442 7373519 7164766 6689486
14119 6689486 6993183 6943814 6812755 6930120 6696304 6852699 6065891 6420815 6499947 6470840
14109 6470840 6442500 5916393 6111572 6229860 5880742 5895919 5574311 5651599 5468376 5624148
14099 5624148 5325662 5328858 5076366 5574425 5292056 5137125 5039319 4957243 5161805 5109742
14089 5109742 4877293 4851494 4861682 4812720 4755452 4452660 4688696 4408335 4508670 4563266
14079 4563266 4625623 4537257 4339562 4189754 4177710 4248387 3823055 4065313 3801827 4215985
14069 4215985 3993859 3822567 3838639 3969417 3832330 3656562 3744465 4016355 3544605 3845131
14059 3845131 3670191 3665795 3705333 3917941 3423544 3586488 3150030 3379660 3144016 3273979
14049 3273979 3143567 2864377 3331194 3067035 3436017 3074955 2871275 2816166 3033055 3467847
14039 3467847 2913566 2764267 2926551 2842092 2880574 2567864 2571269 3146013 2915387 3117523
14029 3117523 3142861 2925594 3107316 2699829 2805442 2667689 2402170 2639478 2487534 2640685
14019 2640685 2404940 1945181 2439072 2580666 2300231 2455271 2078546 2250207 2462371
14010 2462371 2331087 1983521 1714612 1934717 2169777 2281924 1914360 2095330 2337964
14001 2337964 1910743 2026697 1945509 1811294 2046837 2107426 1885370 2103359 2043110 2039172
13991 2039172 2173244 2502338 3281903 6496155 12438734 24668669 37906215 25665866
13983 25665866 14759947 8975435 6308291 4595604 4150818 3414397 3288749 3004919
13975 3004919 2558917 2641578 2490565 2481327 2320393 2308783 2615417 2307200 2423100 2059081
13965 2059081 2191734 2114601 1813271 1756928 1946701 1772392 2203431 2143138 2072439 1855362
13955 1855362 1742236 1742286 1573259 1653587 1856454 2143374 1634836 1426514 1616341 1574476
13945 1574476 1672126 1471834 1758701 1692126 1549715 1865624 1669345 1715978 1722452 1643490
13935 1643490 1705085 1762212 1526954 1952296 1255764 1554132 1629068 1792451 1381408 1810691
13925 1810691 1397658 1393844 1334743 1083870 1312767 1571119 1373105 1555857 1391667 1343799
13915 1343799 1528722 1556979 1274454 1461995 1264197 1409964 1228760 1337422 1179021 1218370
13905 1218370 1346805 1252334 1438310 1381998 855005 1229651 1172009 1166015 1303830 1312065 1157004
13894 1157004 768774 1048528 912387 1291690 1024033 1158536 975086 1225556 1036972
13885 1036972 1008034 984302 1414170 1113237 1126007 1141078 1177574 1195906 1166939 1534733 984614
13874 984614 1190285 919323 1259784 1241822 1089116 1192205 1067492 931914 903826 1322617
13864 1322617 981097 1017518 707646 1223624 1278858 1116825 938680 834841 1136864 1097104
13854 1097104 963658 1024111 782917 1126147 978569 880724 1132720 574012 923915 751077
13844 751077 1190858 1008197 784414 735959 960957 947714 600138 1152160 1053133 853048
13834 853048 607664 730398 1180997 845101 772540 790107 525039 736805 1126871 787319
13824 787319 788231 914687 811542 782942 790735 489820 1050843 866471 948144 1017612 870326
13813 870326 850736 687961 1038218 955123 657624 629604 604727 777179 1117484 721437
13803 721437 821421 1034189 602325 873897 1248934 836580 822850 789142 882465 88975
13792 859108 665190 780004 690831 887213 654657 630896 285615 832543 289374 840255
13782 840255 672704 336571 332220 726329 943382 622098 279483 753299 616044 907632
13772 907632 550682 840254 725207 920631 577967 795656 467754 578086 833168 467538
13762 467538 705098 844266 833104 686070 282194 604575 677083 972264 303255 489843
13752 489843 538533 852245 559718 460733 741603 818256 517762 535215 471630 578798
13742 578798 299489 933248 638393 674312 781723 986719 562998 793443 433206 627876
13732 627876 307599 573366 522658 833275 388346 675610 480727 643239 449774 550622
13722 550622 261282 525088 612026 720939 250283 332643 560229 694828 525482 456312
13712 456312 251103 625049 730764 502856 662190 397106 444647 563759 508260 616052
13702 616052 807363 542082 353379 378184 574088 435953 714398 259014 438025 662240
13692 662240 269055 151713 657829 870149 438544 508862 285444 608081 229314 309708
13682 309708 394702 664796 405578 497006 455794 645844 557063 493571 617697 267273
13671 476754 487645 107670 393659 351629 180165 94230 561034 432688 375339 380243 379651
13660 379651 584765 522164 396802 103009 578273 386507 627764 530702 316814 455570
13650 455570 273702 440818 201478 358350 191111 404284 320694 541792 514717 715793
13640 715793 276643 409670 646181 122250 382252 388841 382525 118995 514983 400493
13630 400493 550713 619596 570740 529505 462165 369463 637737 333341 657401 625430 585703
13619 585703 55446 276962 418860 519238 473249 291308 564146 547708 72031 202066
13609 202066 238835 725095 471549 542224 460909 377589 177870 333293 109943 348564
13599 348564 111778 179405 410235 488463 -53199 561396 199524 384102 214130 506689
13589 506689 296893 268017 423219 326889 496679 195825 383603 205043 -136811 126578
13578 476813 211701 228638 202421 356578 372711 557017 523290 298215 220482 414914
13568 414914 354878 293469 250479 170160 251553 281436 373167 146341 28716 308703 416408
13557 416408 518899 205533 448460 213537 421177 197311 252275 409602 403286 111252
13546 342692 289253 77148 268603 20370 489761 340703 281083 516352 498302 -23125 96540
13534 411444 807 434031 241436 -14057 328173 250497 524252 239246 204617 485033 40998
13522 396339 211460 391679 371332 433782 72681 146604 520635 227254 326251 246367 445452
13511 445452 203008 4945 385958 499025 -140841 163230 449774 354696 247575 195496
13501 195496 540939 390717 195063 485361 187488 326816 61473 25767 289720 21141
13490 25992 231874 332438 391597 -132 149233 277745 339729 389869 293354 202845 155289
13479 155289 162537 373846 309088 3057 385038 142213 223663 -38475 340351 25108 360772
13468 360772 92938 163580 99051 281714 -36742 420062 252069 171942 374695 588817
13458 588817 344060 392386 26221 287039 51514 353455 4230 103193 211309 271816 449970
13447 449970 248799 472565 356241 400756 34122 215411 -153176 327133 45109 354312
13437 354312 206402 -81503 202095 116209 472128 -25520 294732 126484 115934 343891
13427 343891 175641 225274 318802 367688 228934 2077 205038 370569 171375 -10292 170769
13415 534729 126153 276001 545579 358236 171057 -161774 -24802 132362 -140136 61355
13404 249317 251592 472155 155416 540386 78025 450841 278647 558724 235314 202660
13394 202660 -82560 73648 101452 251056 41858 -44623 225807 -145725 63751 213684 92675
13382 100165 107618 96624 -21768 109615 -157352 169210 344016 -234622 163541 37437
13371 295040 -54810 39113 104950 39690 72891 57678 106866 251936 58577 254444 359201
13360 359201 329320 265577 15501 295668 173999 184947 171605 258511 258328 232675 257014
13349 257014 -62413 305920 135365 -54826 -39611 -14881 175117 225520 -18505 320812 -87517
13337 431389 428875 383515 258496 343990 300593 169419 382505 68121 176417 388562 75670
13325 -55949 166878 213460 77745 323393 417096 308837 45459 404454 183920 305111
13315 305111 16180 321282 29864 167245 207637 197926 264762 310124 65486 237477 55520
13303 318103 113553 -24721 328145 247503 246908 78826 162858 -111403 178607 66401 -13739
13291 338217 25160 422638 117521 284765 250868 114762 232824 226744 -191253 161514
13280 -31400 92896 487575 241813 156784 298978 206152 121940 -36051 -187193 239081 159225
13269 159225 271414 223099 28909 155489 18925 130028 176987 107318 36518 158911 163837
13258 163837 341653 -80697 288609 -42937 145954 97098 111586 214478 83766 259042
13248 259042 -123623 124815 264525 251046 416210 191298 -88771 16296 -96745 200989
13237 127901 11989 379544 102246 -291165 340109 84246 279013 63667 35315 322909
13227 322909 -157686 95059 255210 96910 162707 185969 -137535 -193233 60629 156329 151841
13216 151841 -187723 161444 93248 180654 3459 127101 -326467 -71885 9814 253659 176238
13205 176238 258661 214855 121704 4480 -57730 58830 107020 115368 434300 -254856 236956
13193 117952 129233 308970 84573 -84137 -17243 -81455 18521 50959 82824 184475 94133
13182 94133 172929 44164 -562 103988 -396941 25669 116299 269835 -123374 205720 100676
13170 217905 -170724 646457 -75719 233011 196664 231209 -78166 204931 -152878 22164
13159 42274 176607 -263694 46749 310922 378676 -52647 -103171 312015 -73707 -277215 -81683
13147 42348 29994 161493 -213969 326998 200922 322587 85738 280616 258834 -39438
13136 -377794 -10688 272032 144739 -78364 67563 13000 395922 307655 -16325 61203 -23608
13124 -342 1312 48189 149250 -121007 219571 267367 91756 235559 317476 219161 17287
13112 -230944 -131080 -21920 -45238 236017 52728 -29089 181419 72128 23191 107366 -259798
13100 506333 250776 -6834 35314 104632 -263927 236964 113034 -23786 103157 -92177 -135919
13089 -135919 157685 135445 -72344 85989 13282 195011 148569 121236 62661 161996 -261992
13077 -72973 127881 -210217 207266 123704 162606 215041 277598 -110072 323682 191063
13067 191063 352615 28808 275535 46671 -80885 -115199 221770 -120282 63436 109863 147505
13056 147505 118287 -87877 192424 430341 60900 -64939 379521 30033 225997 -61484 -33489
13045 -33489 96973 176261 16661 -28960 -173098 111273 168744 155954 30917 -4193 89688
13033 82608 -271263 -266171 -84652 56811 214874 282240 128962 168120 4117 189780 -184842
13021 243920 75476 260312 208065 46996 -48447 -137084 -38215 22664 -44238 -216974 124393
13009 6198 127180 -69903 49088 142693 -14595 107714 -242501 66581 -3792 -5376 -107749
12998 -107749 231473 139802 111516 101760 19801 -172868 270501 103748 131291 -91551 -138913
12987 -138913 -154829 -37313 -23728 292026 10838 -9351 -267452 169630 -49146 47134 -88458
12975 -68370 116810 239370 41882 -16872 93704 -367131 172179 181040 -113698 -152220 133955
12963 -134959 200314 -26851 429082 -69617 186217 -40493 -307075 179790 -224495 290192
12952 198947 152062 15977 -88643 -208609 202044 -205123 60337 324266 -51873 -87362 228786
12940 -81694 178053 112804 112473 -2116 140338 205182 -54132 144486 208947 144886 174953 74381
12927 -184069 -207627 -51185 126812 -293065 108781 237211 -5533 39254 226811 -183175
12916 35019 -136861 -96508 176808 -12841 -25439 223309 26219 -267514 -174128 84959 -480978
12904 -133002 13927 45841 -7003 90395 103524 -299881 97765 183273 -227177 -78417 -357080
12893 -357080 -289671 75958 315598 -114309 -204232 13483 183885 103779 -142423 198847
12882 160567 91612 5663 133145 342803 -106537 188517 -41467 175608 -67441 3169 -172004
12870 -27553 78110 -141983 13507 6405 39217 -205012 65302 1764 -143922 225628 54710
12858 -98470 29596 41774 163064 178761 -30664 -52835 28925 -179083 181506 -47681 -64279
12847 -64279 169369 -171885 -165707 -42365 77765 -115485 107949 73264 -558 35974 62815
12836 62815 -21987 -324913 237673 115327 -100346 32395 -92169 -114830 218992 -110482
12825 362213 -198801 -66891 7305 -70730 82608 114693 -36824 -17522 -258609 -172646 28544
12813 -358497 56543 -137518 477912 71844 190396 -205962 157578 130044 -46715 -147218
12803 -147218 85352 -122020 74442 -63520 197805 -35657 196958 230746 287244 344836 64989
12791 22095 -91494 -52182 -44645 325721 112873 8789 -101680 -128979 360875 199782 136537
12780 136537 262854 124246 30946 159716 -68944 201664 -342661 -13255 125217 59853
12769 -117218 134895 -128833 46570 157757 -46771 89531 -88121 189834 -34773 -107140 25772
12757 -136504 -130405 30142 102143 276168 167257 53210 -59619 -25649 -210626 151105 157274
12746 157274 32525 245216 83820 -14255 -7359 -227153 -178095 -227173 305340 207950 -45649
12734 46932 20805 416258 -250622 -28265 -346452 -16395 -132510 -41299 263601 15398 -138536
12722 -113052 186264 215952 -779 -154668 -39363 -11221 -35559 -132278 -174546 271415 91595
12710 -7374 131484 56459 23210 283574 440987 61948 -32017 109372 83891 -13231 -100683
12699 -100683 4238 -5031 57299 74429 547055 -159133 -442625 -84723 31514 85072 149856
12688 149856 91522 -27704 -31639 175692 -73065 -87737 -253818 -12737 265774 -5720 -347612
12677 -347612 -55391 119101 127066 -18720 -79352 87964 -444590 1905 83562 350590 -367875
12665 115692 140603 135081 197117 24252 -148670 -122796 305333 -50832 -136757 354955 -285070
12653 41526 129538 195874 302271 -156821 -60823 12300 -88720 -8061 -11500 -423794 233900
12641 -109217 318491 -193384 -252819 295080 -48412 -64035 74863 -174924 244730 -139804
12630 82078 13693 -136370 -23983 17531 -185610 273728 45083 130300 274696 202054 -639
12618 102682 -179066 -511412 181979 -88463 75683 15733 -245883 180968 173482 -7636 -153589
12607 -153589 -36552 70330 147693 163734 373345 15022 226161 268826 -32473 27862 -260091
12595 -45248 -159099 195826 -77564 95542 63184 -81316 73878 72825 -108945 215181 -179143
12583 203699 40034 448705 -2272 -456565 62668 -229301 242448 -264626 193745 -78002
12572 42110 193589 -200619 42557 -229479 -26761 244244 -248925 95952 -77356 -10028 138913
12560 -226055 192007 212475 -321380 -143559 154027 -96361 -117068 173485 -216759 -60307
12549 148191 93581 -68071 -109634 -92442 161102 18946 -133657 -106223 -88465 47774 197556
12538 197556 -26017 -42304 -152489 145775 99145 -104471 -46986 21284 31878 -77224 171616
12526 67602 84184 116620 -244592 28663 153397 -19509 -31100 49864 281419 -42721 -90736
12515 -90736 53214 267739 -102609 279681 285777 266020 200278 115393 -14969 209148 -28548
12503 11108 177993 -441591 277542 -99590 -113304 -4628 146978 109533 -94895 -199926 -66486
12491 -24174 -53764 -202180 52548 397360 -112295 -18071 99588 269464 366861 361545 -31433
12479 34178 541322 -31731 -150870 80234 -176405 205589 -5267 65279 -63709 -245784 -213726
12468 -213726 86873 -275934 -8215 82991 -208825 -188946 -287364 -151912 -368493 186535 21407
12456 70465 83330 -44920 -44288 27920 -218085 -92614 -343083 2883 50649 43139 171183 288430
12444 288430 -315978 -129224 217660 201855 -233733 -117673 -196675 -105040 -29634 19131
12433 134659 51562 -17009 -313262 -113429 -290709 -197032 226000 81222 63396 95604 38951
12421 28133 38774 -166671 -196497 215487 -191456 113881 -117728 59776 -140862 65513
12410 -37653 -37082 -91776 -126629 233021 228372 -239631 -161114 -33133 91543 218058 -130872
12398 -241724 153355 -80946 -75469 118507 195731 -29230 276057 -55742 245414 68554 19355
12386 262646 -59484 168771 -123493 -100596 -27157 159534 79580 -153057 254689 217158
12376 217158 541894 -173836 6814 211195 95812 -64558 -104193 91299 -139313 45579 -19648
12364 31206 388588 -337684 2498 353932 309730 280617 -111496 -98147 -100216 71533 -173051
12352 29963 69740 5270 -96634 83007 146659 70956 130164 -166768 -44074 -301383 -91323
12340 14913 144205 -71544 -159004 37607 487305 235713 60125 49377 57595 147335 51539
12328 150467 153251 247817 222917 -59816 68316 270139 79330 -129032 104336 34907 110432
12317 110432 -121182 281249 -58527 152879 116312 405950 246860 71436 -80036 85541
12306 -86243 -18650 439916 77931 -136892 -17354 -146842 -162582 174052 -108139 -110402 327575
12294 115928 360102 88504 132329 51788 205447 -83362 194106 -251863 329944 119095
12283 273837 73316 -5075 39312 293573 -14017 119840 2933 -27974 94124 76416 17221
12271 -33662 -64282 246752 43726 -38179 -384485 -75774 -21597 -392623 -194826 23662 -23538
12259 189920 80722 -69972 -11794 412763 -19744 65490 116030 318586 -56286 -14798 543279
12247 -329902 -426436 -10160 -47372 115927 189826 -82387 29552 68088 173410 -55284 259950
12235 -114076 283402 45172 65234 -134759 -149779 131102 1939 -4640 -77311 -29740 32260
12223 70642 -18487 -77636 299762 49713 206715 90616 8265 -9021 -111582 75433 218419
12212 218419 116384 416084 -67459 231053 -54256 339589 78295 16633 -32908 127750
12201 94111 12259 25707 179254 14402 314595 -68947 -122846 144115 126872 290507 61265
12189 102520 -91052 -9359 138257 303419 104030 421609 360978 121294 146411 17424 -36349
12177 210949 309127 126930 433620 108618 -193016 317843 -139127 -117152 94660 247557
12167 247557 155567 85199 137146 124505 58100 221274 -104423 172227 -8615 22464 -60091
12155 378471 -160191 232964 43491 371865 50106 1279 28307 36700 -57909 -422054 137
12143 -41262 228330 285278 136126 -219799 46158 245231 26064 75551 215404 -44844 225782
12131 -69416 466425 220856 172178 216865 214448 140769 249526 -42080 217781 264163 -136032
12119 41975 -60540 216466 47349 244136 -12449 69882 234094 6199 100981 -3352 30359
12107 42521 13453 268804 23007 -250001 124692 -90003 158073 168358 126480 100493 -65519
12095 -81607 274638 108619 -68284 -214189 -83289 102359 -80743 -415313 -49277 155746
12084 66322 -60012 158338 59661 10522 23637 220241 308712 79773 -126088 -322006 184271
12072 60174 149899 53217 -40293 -27185 -73798 -84491 -95471 -110820 11116 58705 137763 64075
12059 -5149 -32163 280159 -158910 231996 224623 64221 -38478 17498 -187882 128670 235254
12048 235254 -91308 130892 -92254 -76342 -207612 -142325 45261 -154773 211024 68451 75635
12037 75635 233721 -131643 -24311 243421 15344 117869 -28793 -105380 134608 -123847
12026 -131591 -27112 61931 -10617 -291273 132529 245391 -119404 22878 124949 -36054
12015 -38256 -242709 -27269 -210139 4597 192721 276769 -78995 111657 -66244 -287349 -201038
12004 -201038 -104656 -53887 46508 -274337 -318390 -105480 218834 127561 -123121 -196168 25216
11992 161972 -387749 77231 -112336 13307 225803 -123306 -160882 245056 157316 -190500
11981 -170440 -68737 -5409 -48265 -221339 3845 -42508 -197758 -414618 21019 -33213 -172084
11970 -172084 127327 -27781 -97533 -25214 155752 -64053 -101717 -110788 118415 -225252 270240
11958 -16216 -5909 -172727 136349 285849 145693 -222164 -123079 -65576 -269386 -121714
11947 99231 -295378 -81545 -23315 181623 76572 604 261205 -159494 -548829 -113432 -376734
11936 -376734 -51632 -282057 -155043 -151192 258988 -69957 226016 157888 -253319 -173743 -26030
11924 -34579 392299 -179279 271098 -133264 -38387 130017 -161055 -142642 -71615 65813
11913 301480 209800 161359 12752 -105976 74069 -92580 -322769 -226230 -103711 73007 108936
11902 108936 -29230 -149121 -10262 -171931 -119899 -240311 -116181 -92335 3475 20966 59641
11891 59641 -88309 -37635 -185069 -55717 32218 140545 217192 87189 167149 74108 35577
11879 -161059 -99937 -279649 -79239 -39607 160736 180327 190429 264541 16262 -188203 -84206
11867 -211627 14946 -340022 30059 62913 -115972 155186 -123024 -78585 -114201 -40042 -236682
11856 -236682 161814 100471 26571 -152047 -157077 -242742 -35351 212133 -95322 180222 -98300
11844 -149484 -332280 -263550 48794 -45951 -155251 110425 423 239862 -176523 51731 206890
11833 206890 -182920 -199820 -98229 -147155 -237817 163470 -357506 130887 -70058 -198793
11823 -198793 3702 -74884 -345474 211446 -174291 -326205 -57580 69342 98131 246381 -49684
11811 252170 -118450 128328 -176904 -76401 -174015 207018 90223 38472 181883 155099
11801 155099 -169199 -386518 -245143 173856 -55999 -398584 114434 -412097 -32521 65062
11790 -571 -266094 77162 100305 198121 274957 -176617 155877 69507 145253 -194908 -98690
11779 -98690 -136508 1953 217626 -280557 -146977 115183 -304644 -180971 17900 -204745
11768 307379 296975 4750 -6126 -87620 301741 15629 93010 -48013 210640 -78969 -159524
11757 -159524 135176 150254 -151097 -628419 -210863 -37864 -149411 115484 -195228 -468118
11747 -468118 96029 -92555 34770 -159152 4553 -119300 104370 305310 153321 316638
11737 316638 63476 180408 -169436 -123412 -8200 -127582 56731 -277609 62272 108699 -79170
11725 -17737 31770 32880 17843 -333206 -85482 -6441 -464038 -192752 -238882 158661 -18420
11713 -49600 -100168 -52417 -114474 -161171 -175575 -65114 104472 -99901 -295691 -175685 -3717
11701 213813 -332464 -13443 -242073 -329900 -120417 340330 -37794 6678 79107 306875 11281
11689 -126621 -276531 159425 -37065 101181 -172415 -42952 -104815 117926 -89883 -144283
11679 -144283 -117372 -108255 30014 -156508 -109679 -39601 -387940 196087 37096 -100403 169230
11667 89492 5342 -30228 -69804 -67671 -217129 117273 -264960 -107528 -311940 82790 -111375
11655 300909 66190 -442255 29326 98130 -143325 -195058 -310858 -293849 -39464 -113618 318252
11643 224188 -40563 109679 216678 -80166 9900 -17498 -121917 23675 29781 4602 -179377
11631 -135748 -95478 -20845 111597 -133559 -62223 6918 -136106 166938 -89603 -61242 45593
11619 175770 8863 85633 343266 47671 176804 -300870 80455 -243912 16064 148870 387829
11608 387829 -233719 -162947 65645 106415 244017 -87111 -240724 34529 -215941 -60014 -116766
11597 -116766 261075 237698 -179513 106461 -315092 131371 94009 340847 89579 -326051
11586 -245703 94534 -69369 68336 27493 -342689 79236 321880 -75932 -19601 -203796 -66482
11574 -67668 -126553 134509 -29660 -121434 71145 -7553 13986 44029 73787 -74110 95880 -17150
11561 9725 170079 -138136 -287365 379803 -113616 176680 -13455 165379 3431 -135190
11550 -379065 -216212 -55227 -5219 -86003 -59411 -9940 -303328 128459 87848 11689 86891
11539 86891 -232907 -379789 12199 244592 -220759 -232352 -103166 -323810 85987 -141223
11528 222921 -234993 -343832 -8472 -161351 -31432 94848 -136890 72338 -130381 -6594 590
11516 -9049 5901 -195030 38677 -26829 -127466 -227848 215172 -123336 12233 40934 -54632
11504 -302659 89095 108883 -283183 157452 -67879 38637 -82774 -14601 43193 359322 -140497
11492 -131570 -21791 181264 -172305 -260924 114683 171698 83476 33462 124686 -9701 -230660
11481 -230660 -87347 165931 -284097 55002 -153068 4062 153925 466823 244786 244740 -65437
11469 276241 -291566 84859 166619 -13222 -20106 20120 91047 5961 82884 -20463 158413
11457 15268 -5042 105915 280721 274297 91404 132740 -115977 82150 -6983 151811 96856
11446 96856 204243 304038 151240 84343 -106248 28427 205515 131011 -57014 59275 47426
11435 47426 171787 -142504 -134078 491990 -10493 -155990 1205 227387 479541 211805 60016
11423 24594 -175052 70345 143719 131324 68274 93571 -2008 -38560 -285242 -367004 -198291
11412 -198291 -296938 -224744 123420 -52893 -121473 -128342 113165 -270288 110277 71171 -107058
11400 -138865 10403 246525 44764 97889 -117541 56312 201583 173563 249040 71802 -123854
11388 -57193 -136221 -448587 150314 -65117 315792 66492 53826 -312089 -65159 70817 214124
11377 214124 -194203 77314 278316 -114375 90558 -23955 -211873 -42752 -452237 34560
11366 -126061 -52699 -108838 -142501 -198478 -8479 30852 -99749 -139975 31831 -190028 -551908
11355 -551908 -170273 69734 -127779 -391706 -187889 -352952 -8608 -39355 -157147 -94281
11345 -94281 -283754 -304170 57873 -123998 -60934 -239862 -19363 -342258 -108115 54022 -485257
11333 191951 -167722 138042 46061 -19953 -171232 76805 -132060 -4893 -175628 286520
11322 281402 100459 -358630 -62468 67107 43119 -179291 -170706 -491631 -38413 -180776 -144171
11311 -144171 -360792 -363075 28083 115142 -122498 73056 121562 -172650 -486242 36553 -134844
11299 -74787 -18885 -232449 -18728 295377 78968 82139 -157619 -66848 -230475 270499 118301
11287 -53064 46713 -34040 -129232 -194732 -81632 -122312 -13063 -164382 52440 82633 186709
11276 186709 -18781 76532 37376 -133418 78376 -74195 65865 -152426 179384 123799 273563
11265 273563 127862 -97896 69796 -211654 -142810 -35740 -125818 -83662 -282308 166230 159342
11254 159342 -279135 155323 -32888 -59131 210175 149250 -143894 -94078 227169 -24960
11243 -98511 -211836 38833 -79137 114204 -233410 -143653 -152877 91521 -57819 -47105 -128929
11232 -128929 57499 218796 -206010 -186583 -116597 2715 -150540 -17047 -359028 -144708 358730
11220 -126223 136815 257565 29182 186389 205142 274674 -476365 -350105 -60843 -218641
11210 -218641 -7431 -29151 -190950 134978 -76986 40782 33559 -263309 140177 151962 -32183
11198 133192 61873 -8854 -350231 -95630 62789 200510 -315246 375123 -223450 191727
11187 -73038 -561039 -263816 269057 75893 190246 -191176 70993 34834 -337425 78230
11176 292097 -43717 186411 -23176 -242771 -176243 -62921 -164319 -221112 -188870 -34592 -92443
11165 -92443 -139629 87414 -244946 188741 81612 -363230 110516 -55509 -110943 -222143 -22247
11153 -32125 -263456 -194283 -9280 -224098 -140006 -136397 -59224 118575 171937 -17833 -124540
11142 -124540 75123 -179418 65439 -107051 -39441 70421 -3925 49139 -200928 -76002 -78265
11131 -78265 346640 240946 31971 181070 -202751 -65908 -91658 -2563 -119578 -201556 84471
11119 100953 -73274 -16735 220382 126709 -316879 320399 -73169 144692 230964 -118017
11108 -102496 -159976 -95595 -249296 265496 110335 229489 -374510 -121317 -17681 -270388
11098 -270388 -66676 -10668 289629 -21758 229792 235369 168079 -75267 215800 20439 -111474
11086 -40359 -64468 -174880 350334 5005 -63440 85947 389980 126354 17095 -52288 61725
11074 210693 108398 199817 335569 -68865 50441 -115016 307915 105593 266377 113886
11063 -92483 476541 92692 456047 129360 386809 165714 176703 -87347 91775 465158
11053 465158 320820 192558 304960 405500 620839 419272 273532 576713 328083 731866
11043 731866 354718 243819 495128 289260 624984 286065 376024 104668 791183 467427
11033 467427 300571 511861 552945 201710 272651 545954 443013 606938 474039 235319
11022 460475 579064 668358 514754 612212 431423 292613 490282 609586 450417 120625
11011 236493 454915 456353 478537 390025 336290 195465 419159 377285 157390 280219 484786
11000 484786 298282 37978 515985 405740 610919 122851 207696 271864 184010 173391
10990 173391 375758 386462 251422 405970 194463 153435 139781 275005 653393 318764
10979 804683 524048 557239 540749 528490 694836 402640 850550 877517 686813 724467
10969 724467 1171616 967004 1583365 1350777 1402368 1623469 1783365 1399256 1837834 1847078
10959 1847078 1550797 1015795 929651 1175081 887122 589273 742242 575252 543891 767128
10949 767128 627328 818234 716398 283630 727609 382585 185564 411770 -75344 -179739
10939 -179739 79684 -141256 118299 168266 132706 -198555 107045 55729 122550 204060 -28631
10927 -171427 -341049 202034 96966 105431 26323 -59323 -103361 -51453 -165817 -28999 50040
10915 97483 -56866 164355 -219810 239784 -153389 -65760 -23215 200158 -167222 -90703
10905 -90703 173127 147167 80968 -284279 72215 157095 -362790 123473 12650 -114324 -111007
10894 -111007 3391 32289 384997 -28361 -188330 -203469 123003 11038 -122345 197454 -80522
10882 -153215 -81774 -192019 169755 -160972 -231012 -105400 206183 120386 267346 -373727
10871 -398524 -7771 6569 -274768 73928 -60980 94951 141275 -148221 11532 59219 53627 42778
10859 42778 -37647 -17821 -117128 20463 -75237 72039 169284 29851 -7326 -171797 33129 -144050
10846 -405393 47651 -351528 15962 -57455 -65662 9110 -472005 -25351 38569 -216234 149304
10834 -99966 -51529 108616 -267270 -187469 -6920 23343 1352 136253 355813 -305773 142494
10822 33235 -258907 -211056 1105 -485126 -64375 91826 -75497 198204 -142431 27187 256508
10811 256508 96156 126769 -10814 -281569 113422 -49259 63319 -223610 -28806 3702 93472
10800 93472 159955 109306 278881 -10529 -369970 -54590 -39866 30037 -122622 -3603 -22197
10789 -22197 163921 -149879 174565 -114498 91066 67802 -80170 -126101 38544 181363 -51057
10777 210878 204739 125895 68759 -52579 -159181 173510 102777 416563 -4669 -332617 260634
10765 2242 -176668 94745 -205555 -189816 332686 -163473 -250118 -106333 -61409 -265161 -122567
10753 221355 -68029 -83270 -191270 -190432 -340897 -70491 192522 -43037 25512 -238039 -126147
10742 -126147 20716 -256933 -232733 -422998 333662 -61182 123335 -258519 206255 12631
10731 -204383 194919 -105022 -114655 15493 -254250 104534 -424426 50653 -411354 -138705
10720 160230 39532 -116027 -284034 -271366 73555 26455 -170929 -13921 65678 -25490 53173
10708 36383 -317011 -317250 56994 242194 16122 -288867 -293366 196195 -71766 25398 -250642
10696 -45699 -307466 28590 -115960 -334522 -372932 -224721 -55712 -3994 48403 -12448 -416277
10685 -416277 -124782 -88291 198152 -55256 -138018 -380117 95464 66937 -288719 -213636 -214500
10674 -214500 53819 -325674 -189451 -44524 16401 3803 -236740 -304119 -407 4953 -382969
10662 -30036 63740 246216 45525 201589 -131384 272154 195408 -110854 -375074 -205711
10652 -205711 71753 184115 15558 221010 -128279 -75592 -139028 98586 64592 -121059 -159340
10641 -159340 4381 15054 -111981 -39286 -15733 -145167 -112053 197748 -365488 188971 -22057
10629 -226218 196913 -43247 135095 199498 -316306 138782 10488 -102059 28044 72110
10619 72110 495982 -263150 244199 -68358 -20483 203832 110993 151423 24420 -460612 242085
10607 286108 52433 -77867 -200492 -270177 -86563 -198972 51473 -187426 -59546 -223768 -214686
10596 -214686 -282962 -88443 -96769 -331452 137915 235340 -215895 201086 -73511 -172563 158210
10584 -149019 -164010 -39170 -247763 -75067 -15824 55796 -244747 51649 298148 -89755 -111258
10573 -111258 -123347 -11508 128563 193097 8732 24417 -522138 -93393 -27005 12405 -379770
10561 26786 -248971 -1060 32036 8164 226608 -3279 47446 36403 -68407 -118962 -164413 -127132
10549 -127132 83432 -170965 33754 221122 125276 228079 104271 259107 62365 -51886
10538 -182161 -39715 -295775 -725 27918 149920 34313 217905 -342959 -173643 -200250 320985
10526 -40415 82551 270517 -239848 82450 -74607 6251 229662 -20338 -127846 128370 -185295
10514 42488 98871 -175425 124070 44251 -304930 50246 -40714 -162984 -189116 -78280 -383302
10503 -383302 262463 -120722 -189198 -108716 -103866 -25132 -25658 52649 -112499 -102251 -89792
10492 -89792 168840 -132256 -316523 -169056 -159745 -96130 -200721 -73604 5136 406990 -112939
10480 -110899 -179096 -296888 -82011 120470 21512 193905 92785 -123495 113453 -246794
10469 -148915 42179 -61701 -269218 -199043 271156 -89447 -268954 -166203 88193 78066 235659
10458 235659 -112344 -222086 35977 -106834 37324 -160139 161765 -157200 -460862 392805
10447 -53142 -207443 -274493 51774 -15224 -291991 -248890 134452 -71099 12734 -164366 35775
10435 -57445 67225 111184 -98907 -191051 -212794 101482 54168 -30522 179729 -27279 -8660
10423 52183 191286 -278740 -6174 136167 -20140 104519 305402 -288523 61552 253667
10413 253667 -97907 102425 -203733 -60912 -163133 -73774 -69135 -278423 -17317 140808 258657
10402 258657 -16940 -300434 -387333 -47254 10465 -360546 -77816 31745 52205 -160641 317246
10390 235802 -146898 -41126 118377 116661 -14433 -15317 73305 115666 -141906 -146828 -191997 -224516
10378 -224516 -209478 25924 -94138 185127 -64615 69562 10412 209961 35651 -33506 79714
10366 213495 -65551 111142 159386 82199 127763 261528 416436 376657 125297 -165119
10355 21556 98489 6816 -3049 -76212 -14728 327364 171799 -2726 12681 177288 -47514 721417
10342 270530 226026 2934 -15835 132500 238803 160294 323837 237116 -64912 -125034 -15155
10330 -103670 350934 228297 107280 -118218 -24853 -127919 -149129 133384 103045 -313611
10319 57612 291587 206980 146766 -85852 147466 -5848 -91043 69148 65185 254923 -112360
10307 43067 -353415 104232 -225666 -54807 260337 192336 -12006 27725 -50461 -112942 -207523
10296 -207523 -177290 -71145 -163870 171325 -70695 -214822 120647 -27877 -136834 -182394 1143
10284 208926 217873 -70710 173062 179115 -167738 45050 4133 204094 39482 37328 53239 -197469
10271 -62945 238540 -298146 -128599 260075 195931 -69984 22795 -131016 347292 -138468
10260 89961 -237695 3813 106166 41149 -352411 89100 -196467 -215729 171282 -234162 95739
10248 32261 119353 38571 -25475 119599 167740 36558 134322 117322 144694 -338412 -301710
10237 -301710 253738 -1364 -161004 106842 335246 32566 -124748 -25066 190243 -281458
10226 288283 73808 210009 -349918 -172421 139600 -103046 -162137 -287437 3908 154060
10216 154060 -145491 -116563 -13199 -61723 -150481 -84998 -280298 -84598 29591 89258 -290443
10204 22713 23975 109705 42977 -327877 127841 44693 -103432 -178 26024 163300 -46224
10192 132525 10171 5303 -108436 -193624 58095 -136179 235436 -44227 254716 53040 19323
10180 -395404 -393540 281229 -188314 71258 -169343 -76915 229776 6523 147727 -19657 288538
10168 118652 -9026 -37621 57600 176206 1965 -233537 180356 156324 -154452 18126 -54719
10156 91685 120295 -61871 205418 -423951 -272501 -322461 -82169 -332678 -180628 -101105 -249919
10145 -249919 -184232 -389372 272675 -47136 130167 -95633 75033 -239152 100240 -188547
10134 461495 133940 107956 -262599 192287 -34588 -15308 -98416 78491 35801 -294057 -1779
10122 -327975 -24781 -206494 -246368 178595 -260950 156722 99496 -349810 -105100 -482051
10112 -482051 -38103 225633 -287327 228082 -95251 -266093 -357359 93080 85240 -34791 226753
10100 -336304 324720 175228 -119655 6710 -90845 -102120 -428532 -88568 -247109 -138375
10090 -138375 68631 10347 -40602 3374 104611 -444630 11997 98880 22235 6301 -31902
10078 -8390 20492 -66109 285626 76458 -153498 -458959 161306 -27833 -79560 -90371 177246
10066 -6561 -174671 261131 144088 61445 80399 -167930 -68533 -203369 -217375 -132951 -113867
10055 -113867 -95637 -65533 107912 -19647 -16446 224797 77622 8016 -108110 -225127 161037
10043 -338669 -215265 381689 181892 -265453 17128 117146 -14714 182030 -197671 -154043
10033 -154043 -76029 -69956 -4170 -221906 -64474 -56588 -354363 65740 -227394 163760 256701
10022 256701 -94162 -538925 -365200 150664 -100415 -272709 -411316 59734 126385 -156966
10011 -47785 -257341 -125974 -44263 -212108 -17263 -169311 104910 17693 -210948 186076
10000 3682 31441 199306 41522 158908 -199948 230988 -23265 11960 -265724 -243160 106719
9988 213297 -130658 -133836 -103447 229182 -34785 -152839 92667 -75966 -21936 -44788 62664
9976 100666 -182899 -117345 121325 89596 -20798 -361012 -86079 -87165 -379875 -92541 -463813
9965 -463813 -361905 -43170 -22041 -84900 65476 -305687 -305328 -240238 -169369 -43128 -81659 123734
9952 210040 -266329 -318259 -274405 308005 105272 -43099 -310350 -70637 209427 210032 -96339
9940 -199290 -47622 -43274 -25096 -106889 390302 -167751 -200240 -113374 -22060 -143420 -187984
9929 -187984 -90080 -26449 -36660 214488 -186399 -106256 202430 34988 -19610 -188707 90734
9917 115531 -276399 -91003 179851 -5545 90851 -52116 11538 49235 137228 49328 -7514 288306
9904 -10631 -15197 -81311 -228330 -131632 91916 -50229 -26531 38792 -143679 -59975 7882 -46723
9891 -47452 -40419 433528 -189227 -114623 183958 46590 42868 -128828 -244229 -259287 -20349
9879 49748 -113976 -174741 -249900 33896 -172504 -545833 21693 104838 191801 228544 -59414
9867 -180585 -120580 -180822 -45008 -192237 -207125 210198 117822 -31910 72029 193731 -52729
9855 318785 108059 4845 158803 -212267 -72646 -302801 -178100 142323 -148239 9491 -90568
9843 -100500 -124077 -299477 -275821 51440 -276777 -4554 36282 -230997 239501 55611 -72404
9831 -38345 -195333 -393127 3483 168071 -24029 -174487 79023 -101802 -29750 -83523 168903
9819 24435 -312873 178133 30753 86973 95755 -94016 100897 -140960 62513 -213474 168784
9807 159937 -65128 -76490 -339070 -289118 -46334 -96445 -65363 -114903 32134 123296 234025
9796 234025 -141016 -112919 -248939 88098 -368792 37777 -71812 163211 -218769 -51341 139937
9784 70799 47373 59524 -6058 79377 8246 -12817 119633 120063 -190803 113581 -175575 47663
9771 -8560 282415 -268623 117961 -252362 -94478 -56006 182479 -164049 72452 254060 -42610
9759 -269870 -234683 -186291 -236609 -307008 -155611 -125981 -348533 -275342 33877 179947 57005
9747 -40233 42949 77158 -106524 14433 7886 -214727 -215243 134632 -44836 -218091 -190601 -9402
9734 -88640 21567 -404258 -446994 -334759 18735 200622 -243840 -155919 13634 -78291 -13206
9722 -348924 -191945 -130198 -292588 53702 159500 -256341 127883 -271162 -5091 2823 -234280
9710 -75675 -147734 -30533 15462 95247 -199647 -91774 959 -392622 -189781 -47190 -208321
9699 -208321 -401423 -104913 -304305 153222 -83770 -29180 -210647 -61102 -263793 -96067
9688 -173790 -102283 -24496 -186119 -66737 -308695 42555 -160924 165271 -73293 -312165 -302248
9677 -302248 32936 -118615 98209 281134 -293712 92638 5624 -85455 -90778 -188414 197044
9665 -302982 -295022 -460089 -93149 -287505 -28801 -77331 -72632 108266 267902 -38095 161222
9653 -199101 -211968 -58453 -71134 -224929 -166993 -55566 68984 -42057 -175751 130038 -96374
9641 -56762 192603 464061 -83306 -208455 -78634 71188 -51004 -118034 -27642 16446 -294600
9629 173175 155296 -258852 71915 -86943 -249601 -197816 262933 169894 -112832 -43157 -195386
9618 -195386 18129 -296870 -181645 -43949 -93495 -172120 -78307 -56945 -331209 188296 -95975
9606 -229912 -243335 -95543 -174713 204833 -130373 59743 398726 179090 229460 -14721 81893
9594 -268032 -121958 -58210 379346 -195462 101580 -191457 -207314 -5236 -81984 -150341 -109048
9583 -109048 -115744 -23624 214439 143769 -200381 -118842 -276817 -318261 -101218 -6292 398988
9571 -143848 -147970 -112476 -138428 165491 -51252 -19136 -63694 47953 64250 26726 53504 -62375
9558 86342 247943 30164 -57482 167109 287515 -222089 55303 143823 7251 -61036 7873
9546 93628 -232528 277471 -102972 -174799 -88482 -31909 31537 100787 -112918 199437 -213379
9534 137429 -136760 35154 -279121 -213118 -18920 -296470 -91834 -225642 -125067 -255248
9524 -255248 -432825 205617 91485 -139194 -67761 20772 323254 100429 -1934 -97005 17106
9512 -12199 -101590 -300077 44734 244143 -507449 -120057 -209739 29900 -228455 -116819 -10231
9500 28966 -133402 29673 -85023 69726 32999 -377680 -119262 344503 45138 -23682 194741
9488 -4181 -310142 -154121 9710 19030 93377 85955 -82784 226999 -202048 -29896 -47165 -3039
9475 -69460 99727 -80960 112381 -480134 -222948 63062 -343842 79173 -15850 -96936 -97809
9464 -97809 321761 -227355 -231187 5366 38461 213817 46200 140989 143239 -413415 -255388
9453 -255388 152064 75305 -24113 54572 -144186 -144272 -257942 -58295 141337 -91972 -161657
9442 -161657 202480 -3397 150095 -74623 14817 127631 62115 -29018 -196965 -59715 -225633
9431 -225633 -83021 309103 -90259 -20856 -186736 86887 147367 -267620 -116124 -53237 56449
9419 -197629 -255191 -374733 76459 -239902 3402 -406629 128635 -52009 76387 135629 -102833
9407 -22628 -311337 162386 -227478 -17091 -131814 -205823 -183901 -212131 -134942 -256544 -79466
9395 -23720 -74351 -275507 -36145 323372 94522 -332055 102288 41986 -68801 -260621 10685
9383 69163 -219220 -96921 -101434 182035 -95801 -137167 73579 -195159 178518 -32056 19849
9371 223130 -164748 -103228 -99586 -105161 -221990 -598 -242067 -16974 -118110 -511336 85281
9359 -108231 67738 7208 -50491 238122 -360831 -128997 35934 84266 158611 208600 -102357
9347 -98507 -183430 83478 -130067 -304848 -20249 -141717 -253431 -47385 -299989 179886 -101970
9335 1845 -4331 61005 -244769 -282376 -194756 91129 -1204 -295484 -173470 -137203 -65905 -113512
9323 -113512 103625 243881 -296160 -53099 -238805 -10930 -30450 210953 -13490 38571 33775
9312 33775 -153501 87383 -227994 -243498 -249088 -22013 -107594 -54150 57351 -162044 -438881
9301 -438881 -105542 81167 -179279 242337 168 -11927 264 -63366 -63908 345766 -13667 -378833
9289 -378833 54925 344693 -187872 75856 -172029 48179 -223707 -11698 -166988 114141
9278 -80514 -29468 -269818 63189 48455 -97665 147015 39523 476177 35786 -117136 -92239
9267 -92239 70880 98609 115126 -161007 15126 -181836 108233 -39902 -264373 176689 -1426
9255 -268636 27072 -282484 48010 -235350 -231634 145592 -364152 301 -84260 -226929 146815
9243 -75940 -10543 -62981 -556740 146157 -117707 113831 -409426 107268 -355569 -101342
9232 56557 152526 69273 85411 -394260 -35348 12091 182870 233029 -154724 -22903 72608
9220 184391 -114700 -275646 -30456 68916 -166401 -16937 -55326 -61889 -182114 -30765 -88386
9209 -88386 -188501 -60548 126284 -209922 81882 -149832 -114295 -24765 46163 -11780 -259643
9198 -259643 -31506 26043 -72841 -247867 -220141 -234167 -86023 -373044 -404831 24683 -94292
9186 156712 -130966 -251508 169160 66415 221706 156273 -121541 -228532 -28108 -50596
9176 -50596 96033 -131015 -68988 -585938 -150275 -93601 91182 -40743 -75534 -125967 238302
9164 75832 51809 -89611 -159064 -90755 -112638 -85005 -202526 -280063 -36625 -42132 100874 -32733
9151 58854 -50508 256739 -333047 155063 -12545 -22885 -62370 -203046 7117 -188715 -4259
9139 -29354 154634 -250712 -104851 106474 210519 -159069 79254 201239 2262 -51270 -164045
9128 -164045 -12780 35731 -31164 -471270 -18045 66972 -199974 -36824 12453 22851 -7160
9116 -305755 -194983 -392362 -100601 -39212 -38086 -78507 39293 172867 178911 -54920 30940
9104 -227795 -115683 154795 -115972 -287303 6464 -88697 -67909 147540 -381076 -204914
9094 -204914 -73165 75317 -80165 -165189 67033 80664 -88476 23786 233038 -291353 -96951
9082 -239331 -198101 -39795 76550 67751 -158268 -88246 -236609 12982 205654 24354 88032
9071 88032 182619 273849 -50618 -68218 -188724 -159908 -222663 -116877 5068 6635 1444 -15967
9058 215006 -19814 -221948 233584 253024 -343459 103691 292979 -265507 81983 -176533
9047 -77364 -342383 -194795 64087 -2086 -51270 131364 186166 -7007 -315204 54235 43972
9036 43972 -142085 -165981 -61437 92019 -115532 -45433 -53597 73650 -15868 113669 -19729
9024 -18014 -58761 -26311 -183957 33240 -129360 -94184 -49582 59495 352708 -91289 -62302
9013 -62302 -42805 -12696 -212572 320 -144542 -136765 38350 -57222 -28517 82070 -364300 174898
9000 -349726 -261527 -118530 18003 25621 192358 -74926 -73351 -15551 87775 -110939 -18786
8988 79351 95967 9905 -56193 -212526 4718 -113461 -347419 129012 170087 -198716 194207
8976 -97718 -80194 -106960 161491 90525 -67682 48814 -313980 -92380 -153332 24007 -31776
8964 -124641 77196 -61615 -68296 45741 51594 218837 35162 -235918 -233852 -44657 -146120 116940
8951 -20552 299352 -462242 -100145 283566 7819 -17701 -167461 -20756 -174708 316161 -144770
8939 146992 -197437 78243 -287200 -193595 321125 -142600 -66821 247726 8223 -150929 -417348
8928 -417348 -69110 -414487 19146 -54046 -711439 17392 -9605 -18593 -121088 -58426 161125
8916 581346 284016 -43998 -2754 141080 -316387 51074 23516 -231511 -37679 61334 152478
8905 152478 250207 -40987 -140094 120115 -266515 -23314 -56605 -5995 62442 -263872 -268373
8894 -268373 125198 235813 2191 -195476 83389 88531 -168701 -33169 40197 -235857 53690
8882 -152423 -159356 -46098 -36968 369065 171452 -202800 -212274 156894 -217268 99403 392497
8871 392497 119367 -69880 -139987 -27620 -216469 368688 51440 78159 -177985 48984 11693
8859 -220522 -38417 -48164 -142047 -36983 10539 109041 95649 9936 -407411 247522 -219229
8847 -273813 -121486 63669 -135676 -178300 -44506 -71720 -130218 -279210 167843 -137627 -192567
8836 -192567 116725 -508535 -132461 101848 -200863 -366754 -251522 -188403 -115167 81945
8825 4133 -167750 -174415 -60991 -314084 68291 -4893 68503 309145 -133726 116191 156447
8814 156447 -227530 227656 -91189 -189212 -32724 -31856 -29542 92136 63029 -76098 -143433 211877
8801 19220 -101401 -284521 6682 57289 122179 -105040 -14228 -122141 333451 30099 -122268
8789 -214006 -325737 -20139 -177886 8398 23466 45759 -26476 139693 57674 10941 -68686
8777 -119495 -263434 -39072 81253 -152371 15228 -192955 -324446 46981 78392 -140407 159906
8765 34673 -196132 102613 -69893 -553531 -119830 -58870 -56213 -29801 44045 -117084 124397
8753 -191656 155570 -39444 -66135 -74798 38940 53013 -245650 -117577 -417007 -359318 -266090
8742 -266090 16773 -340343 280114 -131250 -290837 -102529 -153955 -191819 60797 -21719 147723
8730 73622 -206275 91653 50734 -52594 52536 -55812 -172518 -237873 -272485 -380803 -310270
8719 -310270 87901 129431 273542 -137204 -221844 -279066 31893 -211629 -207631 -87194 -320439
8708 -320439 -47651 321621 175512 198462 -53085 -26008 66351 -12893 -289293 -46604 -43883
8697 -43883 -449587 42120 -18406 104955 22373 -73858 -233274 -352432 53424 201364 11704
8685 71524 -56433 -248154 37380 -199219 -14930 268249 63241 155115 -4722 -98628 -328484
8674 -328484 -112146 29416 -194164 222354 379532 60961 -290414 -1827 97044 -104761 -23305
8662 17087 -41582 -111372 -45223 149034 -65614 284998 -148487 -64048 23622 -143560 57344
8650 74598 170176 -46935 -355941 -22697 -97667 -4055 129948 200710 508137 -202682 159832
8638 -216881 -195848 -27117 -111126 73565 121394 -78869 -177257 -273000 116968 177215 -77385
8626 -241827 -238131 87370 -21433 -262390 215911 -165674 -365816 22200 -204578 39874 -48621
8614 -204586 208655 6046 -30115 164840 -302978 -77489 -14760 -83330 -25637 -892 3253 52646
8602 52646 279064 -386134 121768 -52890 239363 136809 299850 -79800 -172057 177732
8591 -178645 51490 118189 93657 67155 76362 -490556 -327167 -184506 1766 -126680 -211504
8580 -211504 342041 -47111 16594 204779 -192873 -157196 75827 62833 -56241 -213454 88350
8568 -21002 -176267 -93005 -119308 -239130 -117603 -204791 174280 120086 -266410 89742 217941
8557 217941 175596 -83774 -131664 -17191 -101613 -67310 297553 -255629 -172653 -256275 -48125
8545 153108 -131215 -82640 157002 -1864 -57465 -220860 -98986 -24214 -291185 173094 -86599
8533 50064 -162164 182645 -8707 59070 -56936 -93662 273564 -12281 -69145 -109328 -61821
8522 -61821 35931 53770 -117213 89964 120704 -153166 -27796 -412000 161027 22237 -47259
8510 -305835 -24213 217383 -156732 -400863 -297549 -252186 97597 -163029 -208298 -138438 -308048
8499 -308048 27767 -179735 -106029 -524539 151968 151302 215960 -110998 -90150 153436 -231191
8487 183132 -33001 -381632 115493 -145036 180237 132760 -368719 -118235 -91268 -402974
8477 -402974 -151113 -150407 268619 -142840 -79757 -43849 613564 -103668 -239605 105215 -341248
8465 -25855 -195955 -233092 -95422 56713 91926 -127298 57203 2488 -14244 34931 -172279
8453 265606 -148898 -165047 121980 -59 -169253 -104316 -173188 -15506 -218744 -247732 69392
8441 92610 121860 -83816 26709 130204 181172 -314892 -120535 90689 -48256 127878 -36824
8429 102436 -21201 34450 298005 78587 304625 -112594 95548 -180147 -303681 -1277 105851
8417 340826 21305 91770 251641 -296084 -98293 217109 276115 -15674 -72477 -58810 44684
8405 61518 131564 -130016 -302181 -173483 -105615 -48426 100999 -12566 -190068 -11641 -15739
8394 -15739 -119086 -125718 -42581 132840 106537 -285520 -72416 -285324 -102246 83223 36400
8382 -314854 149997 -240507 -16594 16706 -44053 -39725 119955 1251 -129579 -38533 20820
8370 35978 29185 138095 -203574 72688 -285792 106596 -123233 -135829 257074 43507 -113717
8358 199286 97006 25584 -296256 183690 -71443 -104249 -111299 -21888 -417812 -142859 134875
8346 82662 -357570 -34736 -229549 -337331 36314 -357234 -102701 29522 293902 62183 -142870
8334 -57290 -65394 34981 -166534 150142 -137794 -26088 -19256 166251 -139070 -299133 66818
8322 -112850 25076 1798 199860 36518 -281815 59444 -38285 -107564 130027 21678 216025
8311 216025 -171496 48463 -180587 216722 -76200 -288212 27551 107844 -246426 49777 14629
8299 -76741 -172423 219583 -1906 87404 27589 -238989 -241258 2862 -163771 -113081 -232172 204453
8286 149949 -91497 -96687 -106234 215210 -107091 -291248 67885 100353 -202251 -482628 -477265
8275 -477265 183345 -437795 34693 -86040 164662 -271482 -418490 19457 -66212 44116 -95433
8263 -142886 -187239 -114124 10601 -84262 -13097 59377 51193 1251 137937 -20987 54636 -23002
8250 106871 -186405 -217891 21550 -80488 -119523 273677 -67590 -92770 78969 57605 -96353
8238 96047 -114949 -239695 -18094 -159663 -101888 -303549 28655 -32591 -104839 149095 159594
8227 159594 -188912 -1081 -28499 71774 -228343 101548 -335664 -184659 -243066 63922 23636
8215 -210826 -197369 -335170 -291600 -50360 233981 -94617 -38780 -171148 206702 45880 118471
8204 118471 20714 -141967 -192667 -173802 83805 -189847 302011 -87736 82349 38090 181079
8193 181079 121388 -55794 33150 -295550 -156822 125512 81520 52980 7312 35578 33382
8182 33382 -368605 -108201 202163 10149 -113712 -190900 -16911 -211791 -203301 -117276 -88665
8171 -88665 -369191 67522 47794 -360248 -141888 -216062 18632 -18911 -7568 273743 -107082
8159 -33296 48775 39737 202958 121029 208340 -219508 -21394 246014 273328 30882 -73325
8147 -41119 -192182 -413173 170832 183379 -8540 31426 -149732 186980 -181031 -85549 -60161
8136 -60161 -62003 49614 -160810 -340150 -281623 63822 -62145 -214574 -138614 213287 168222
8125 168222 -48731 169389 -51049 66888 -137070 -292870 4037 22759 269104 -166231 8057
8113 51773 156467 -416381 139530 93364 -72351 96728 -410180 -305280 -210689 -216543 226513
8101 -154981 18999 237278 -21743 -187315 -144199 34259 -112063 121357 3128 4203 88130
8090 88130 -299540 -40694 219359 -59986 194058 -12318 -327005 391929 -22074 48876 73289
8079 73289 -209132 139621 -74108 -91684 118251 -42263 -304138 211683 -44048 323606 -94501
8067 23188 -180252 -113266 -218155 63700 -31349 -489589 -310489 -148535 -14229 -200262 190167
8055 172593 -212533 -11441 68999 -130105 -128399 -340462 -54440 -291946 146353 244369 -139888
8043 138667 63796 -284422 16199 -147829 268186 40338 -161390 433968 -258012 -7086 -180249
8032 -180249 -57078 -237007 310576 101979 -188609 296249 203186 5938 159295 72268 89995
8021 89995 -550631 92176 157390 -124543 142739 266398 91552 82452 22911 56415 5502
8009 12836 -368496 -25004 -63348 -44039 -241018 59591 -310257 -154525 -43323 21102 142032
7998 142032 8480 102224 -116995 -182927 169140 -112896 62573 54527 186414 206180 -27369
7986 -192306 129152 -181376 -211431 -192661 170290 -301760 -223881 22034 -150880 -181210 -90866
7975 -90866 100519 -165708 38607 135981 295430 34178 -219595 -97372 150337 115128 124164
7964 124164 155265 -51386 220033 149103 -118588 -85364 190111 -128959 -243248 -88986 -181575
7953 -181575 -123905 148638 -73960 -145415 -114954 -443504 -178853 211839 -160276 43070 109490
7942 109490 20201 -325725 -215407 106996 -215161 26577 167357 -119368 -68241 -33162
7931 81302 27101 218821 -77535 -113477 -136853 -241238 -51987 215249 -353020 -78355 -76131
7920 -76131 40403 -288589 -284594 -416522 41772 148166 38376 -172597 -73763 -234792 39970
7908 211081 -33555 -59265 286486 -149017 -2256 213740 303816 16593 19088 46157 -80152
7896 67265 -272263 225243 143587 -260644 -171369 -52519 -121313 113399 -178657 -258059 190137
7884 -45897 -217274 206146 92344 -138597 -182433 180416 -29505 56454 -264814 -46970 -134899
7873 -134899 167723 58253 -111052 -230990 -129597 -278524 85352 -45824 -130821 109126
7862 -44656 -131575 -421812 -175124 -149236 -172057 -181828 -78240 108894 -250388 203102 -78440
7850 -220195 -13078 -60296 -324673 166968 320036 -110010 -103871 58457 -114668 3981 -54711
7838 -346990 130142 139483 369767 -184153 -214908 -82315 -278913 5927 87986 23173 82752
7827 82752 272741 290550 11978 143702 -358658 -18181 -65069 75231 302749 256265 85256
7815 35939 -165031 -174144 213438 260473 212541 -217083 91952 -209412 58191 -91839 -8892
7803 -208591 -1777 -339442 -143321 -223568 175048 -145319 -160862 -314385 118711 -175849
7792 76820 43735 -85989 -244820 -211135 -13160 -321205 -205586 -160845 -10303 -156356 191984
7780 258487 57710 15508 141306 -230742 175660 226897 -380443 166597 23175 -112197
7769 -325245 -296789 -235203 91098 332442 745 -230609 -68353 109040 243866 13450 28167
7758 28167 18251 206330 22340 -342484 99747 -2693 1866 -95513 -97343 -32580 -78784 -158108
7746 -158108 223143 50785 -555182 -219619 17781 -159285 -143235 24758 80492 -60650 261283
7734 286575 -38379 179642 -327570 -195416 78106 -143678 188089 109231 95994 -303833
7723 -385725 -58428 116360 -365691 23654 109920 -103803 94530 -124158 -308425 -149986
7712 -129335 74801 46470 357308 -35046 187731 28921 246284 22949 60342 149187 -203747
7700 -37861 116284 -183757 -129361 -127222 -80621 109230 -44442 -181988 -147653 26683 -6171
7688 -122309 124097 36215 41172 -66125 -48707 -12751 -123277 -212093 15452 273101 102533
7676 -186775 -94187 97538 207996 82141 -6115 -22863 164435 -29758 167766 127151 -183827
7664 -88221 -185191 248899 115391 -192276 -55013 -282766 -11907 29946 -172777 -18208 140469
7652 8633 -116203 49947 -77801 152409 265508 84628 -233850 -75868 -158556 13846 144241
7641 144241 139024 260879 -191027 22451 17996 373491 -302961 57368 119153 120932 -130192
7629 94285 -129498 47080 238168 -60445 277054 154094 -53825 -6459 199744 -74034 392193
7617 -27919 -75788 54540 -29623 -344918 -24877 67110 -107746 -439909 21419 -368999 -90462
7605 15290 -114166 -116753 -197515 -129352 -71224 -207188 -47 -172550 46554 52745 6258 -153441
7592 -149721 -200899 236715 100352 22505 -150033 -262413 122653 -6765 69616 10140 -3944
7580 -191429 71816 -85243 140997 4515 -24220 -3470 -237475 543405 -151831 117070 143416
7569 143416 -153584 165534 -124790 -620750 -169129 212206 -62252 136621 31304 -7911
7558 21599 119255 -140670 -60969 -15442 108044 -61259 -147068 231693 -8062 -332611 136199
7546 104709 125042 -227544 -301180 -413379 64229 259363 81912 187050 43982 -161689 -32848
7534 -105781 -80000 62856 59458 243433 -376617 114025 -424755 -91320 121797 -260692 -232629
7523 -232629 -52781 -85814 378143 -223507 7074 88451 -81394 43298 -85303 -125818 36693
7511 227467 -74104 13358 -44710 -250101 -226156 -48410 82890 -141899 86373 -2761 -197287
7500 -197287 -44590 -104881 -234509 -119931 -84632 106819 289377 -81150 111055 -93772 17557
7488 148653 -208354 187193 106182 -94287 -217156 -157010 -78207 301214 -136533 -100942 -166209
7477 -166209 -140714 -57715 -159644 -140395 -162795 127032 -129686 -156788 -333012 -1746 232268
7465 46745 14144 5062 2904 463451 40836 -22922 46065 22230 -355275 191636 -85747 146874
7452 -55398 159086 176271 51318 -28527 -40374 -48290 -99857 -233764 -162911 -230980 -44943 20494
7439 -334904 -317977 -5887 214529 128687 -369325 211106 -78539 -325192 -100133 168335 200783
7428 200783 10655 -53931 123029 205503 -199592 -98457 -352247 -28917 -198539 67594 -33542
7416 75595 -58911 84350 58752 -379285 -128916 285010 -180937 -25284 57837 312874 243078
7405 243078 81887 -93065 -219631 -208655 -253831 -260347 -63254 -83936 230271 -66403 -300015
7394 -300015 -690 58438 -125768 -34058 199421 -79000 -128515 -122881 -160472 -40468 89914 -271809
7381 -108123 5893 68488 163406 -44222 -189212 58274 141337 -73688 -31405 198490 -152287
7369 -129861 -26026 105703 -91059 -196436 590739 268083 146692 21471 144467 261404
7359 261404 243998 34834 58403 40875 15307 183775 -86679 -66041 185382 6296 -85490
7347 -547270 71452 102298 -402563 136193 -262020 104012 -47228 -174838 44802 6448 -323310
7335 -56006 -197591 -260226 -119724 116021 -49667 -257230 102171 6326 -172339 112852 182040
7324 182040 -403883 105895 61245 17933 -99342 147628 -192974 -72122 -144661 78132 -125995
7312 -295912 -115695 -201577 -150896 159828 -324300 -47880 64691 -343028 -85129 187555 205603
7301 205603 -48518 208525 -86429 166612 232859 161969 26856 -109363 -47168 26527 -136588
7289 344790 -36958 -117668 -58007 -380004 -297353 -317638 103523 100671 -56175 -37816 -14531
7277 61253 9922 21195 -111480 -400141 -225661 1121 111508 99804 -323 20038 -312692 -339341
7265 -339341 155664 66303 281485 217949 102130 -40000 -101645 -139053 -102905 -482550 -36580
7253 -243591 222917 55355 -85709 -128629 31735 -74481 -61342 57739 -56850 -254596 136546
7241 -238275 -139585 241183 -156302 -118218 -187680 -261736 -185111 -370003 -58575 26212 56652
7230 56652 -1202 36354 -92872 117901 22202 -126969 88842 -208764 -74743 -79713 224421
7218 -129967 -100415 -72016 269505 82059 -202686 178513 74893 150479 -23472 -122622 -96470
7207 -96470 18392 -45740 36025 165090 41706 -224026 77052 -231196 -181569 215089 292622
7196 292622 50219 -85866 -21622 -83602 -221693 199633 -72413 171658 -531 85727 305540
7185 305540 58655 50390 -143363 216549 217421 -6934 -27245 -103517 112638 142338 132431 -46260
7172 48220 124429 13736 -334580 -120460 42653 209679 -77392 -286577 127997 -167462 -278303
7161 -278303 -156505 41242 -229898 201619 -40913 293983 -34702 -41513 44178 -64919 177026
7149 -185367 120185 -341355 73579 -115631 203945 156088 -240045 -564631 60924 -253403
7138 55070 -130289 -77256 127788 -105285 213879 -150995 -155198 279961 -199117 -142763 120131
7126 1053 11113 48404 475549 168534 28628 -253608 -7813 9750 -126296 -276506 -232957
7115 -232957 172388 -114602 282572 205887 -17730 114759 33506 119423 30833 -253251 -256073
7104 -256073 -49915 -294775 187817 141884 75793 163574 -213193 29006 -181482 221913 81088
7092 144250 -187496 28710 140721 -448901 156419 -58296 -99573 -208753 -56832 -54042 -319179
7081 -319179 -30478 -191527 -222583 231859 -38221 -96459 -86899 150201 80332 -331408 28584
7069 132762 -215538 297080 79116 264456 73844 209974 -220296 80683 -125839 166034
7058 -38407 -265097 -201167 293596 -112969 -259237 -206933 -119953 -127729 -357893 -47072 -51112
7047 -51112 44997 80028 -227900 95315 -33078 -477776 -162011 12990 -6193 91622 -424594
7035 -8357 -42252 -67812 87917 70707 -475904 -126295 -147540 -71125 -11673 -203453 -60366
7023 -268905 -192570 -156058 206171 -97750 186704 82388 164620 372674 233864 -94571 88077
7011 -63865 23372 -95948 19193 134367 46156 21793 -117861 -78267 -260174 -368726 78304
6999 -170831 -68304 12611 105057 -101499 221431 227826 -215521 -34199 14279 283697 -213834
6987 -65395 -111416 -167575 162535 100512 130491 58669 -104800 -152325 -174473 -138974 -128633
6976 -128633 -131 62996 -83364 158540 117516 -25230 -83240 75435 -8501 -41626 236907 -359207
6963 -137444 72850 -8411 -235622 78981 63537 -15641 -48395 50846 -46469 169895 118794
6952 118794 -372282 -146364 -43264 -118351 -17516 30221 32428 23015 13867 82513 -183125 -206754
6940 -206754 18046 123710 93268 -139554 159223 91982 -38660 -127444 -53052 466433 24828
6928 106979 -85924 -94653 -1572 -3760 -248907 -21682 -232450 120925 -63935 25667 -55760 -144362
6916 -144362 305560 -211437 -262463 -70182 -159204 81713 -111088 -38989 175276 -86207 160044
6904 182179 27924 -214030 -53811 74460 87573 91456 91171 -206955 192185 -310234 32968
6892 98805 -80137 160450 95901 141637 211270 222363 116392 35173 -12196 -115637 191969
6880 -84956 197193 -66900 -163185 -74846 4004 40591 7119 -249883 -22862 -19282 -104635 30168
6867 -141136 -33108 -230301 57430 -124047 -251689 77793 9612 -205574 37241 25860 -219332
6855 -198385 -273602 349970 -173957 102691 -118994 180095 41494 -104711 -96183 135514
6844 -147877 -212550 -56065 48684 -125232 -26766 221158 75979 -4553 4529 70658 -17142 -242257
6832 -242257 -83648 -120020 -46524 258372 -151409 -95502 365961 247215 -78639 286355 -278346
6820 -69269 -39640 -25586 14892 66583 160550 -76968 308260 131920 -271774 -74160 -82522
6809 -82522 216988 -730 -119632 177275 -145243 -53190 -205876 115713 -69822 39269 28690
6798 28690 -218104 340473 -186988 -98445 -225343 99259 -67722 131480 173306 125876 -117788
6786 -142782 135781 -326778 97005 -80531 8558 -29313 83495 125502 175040 90286 56929
6775 56929 -200073 -51774 -181320 -208324 -123606 -292547 30206 -52068 -54333 74637 37965
6764 37965 244893 -231105 -16066 100095 -418821 109987 277554 -271681 153777 -294321
6753 -167054 122853 111132 106535 -270380 -190440 174527 40506 -77484 -57280 247400 283702
6742 283702 -239319 -26722 208895 110034 208301 -121566 -3766 -42729 -80690 28968 13572
6730 113291 -69196 -135932 59703 123932 -265805 -98281 23874 -291447 34879 -91359 -135384
6719 -135384 -31575 -159119 20912 -158431 54269 15230 -35867 -36229 -83134 -74537 -437974 -105435
6706 -164516 213314 -138796 -35930 32619 288188 123445 94644 -76194 51735 126193 241420
6695 241420 239325 92073 -234450 -55001 -132626 -191917 -11842 -53141 80002 62168 -167613
6683 12403 144093 -145371 372912 125839 -106452 -46356 17383 -278616 28941 -36856 79184
6671 198896 51497 172103 -613651 -16636 -215863 -24099 -22686 143964 -114392 -173846 -347402
6660 -347402 160900 -42421 262600 132234 -57311 29610 -449354 147250 6879 26323 -76591
6648 -195272 -167883 -106365 -372757 13103 -140635 107898 360220 -41354 38567 -103631 -102162
6637 -102162 73192 212716 -5183 50272 -266623 208142 -90953 -61836 -41710 142647 -159891
6625 49434 -191887 286548 106812 162690 -96757 185769 349393 146408 -100399 189939
6614 137577 -102106 27694 336750 -16313 -290313 -144482 43855 57738 42304 -274625 364063
6602 56336 45250 25969 -264367 -42326 57999 297086 38918 137941 -62184 -40614 -36450 241942
6589 -7379 -180264 331122 -282242 -194801 -5425 -276765 -117663 -277523 -113949 -3786 -60695
6578 -60695 71154 -50165 45260 -95008 -108137 -242606 -115282 71595 -230175 106225 71017
6567 71017 -114377 -90741 67163 181091 -18497 83888 -217928 -104073 23454 -65359 -220064
6556 -220064 -316574 -102084 43920 -181007 127089 233522 199043 59599 69651 245987 59697
6544 -201717 110250 239566 14451 1490 -97384 31360 38108 -17550 -316851 -261374 -78536
6532 295644 -131172 218823 -10396 231130 305360 -180845 -186438 -178620 45179 442008 243553
6521 243553 -189997 7404 -153930 -94793 -64243 224833 105781 -164315 57133 -130514 -131384
6510 -131384 129424 -60358 -291347 36847 -129264 6837 186562 81536 -371135 -2296 281560
6498 35627 18462 176497 312080 -410976 -261112 63620 -133720 -151973 -63218 -208085 205683
6486 -303411 -139287 -65035 59350 -107560 -45145 44863 -174064 125053 191736 -75326 -137338
6475 -137338 -370582 51125 84464 55565 18400 100883 -18926 54639 261271 -109280 320412
6463 -316922 205023 -24985 -2460 137817 -19823 157068 120239 -156157 157900 -177258 -13582
6451 -2181 246658 -89743 -266842 39473 74672 266194 -118514 -95414 342760 -105530 216881
6439 -178332 89286 277888 -73950 48886 -283404 16227 -55525 124055 -84503 -39404 81800
6427 259824 -59837 141771 -33421 -260079 196971 82677 -110263 -53229 211706 -195050
6416 37152 29719 172357 127576 370793 -79393 -172041 -4432 -159098 40233 194016 -7987 -116691
6404 -116691 -1506 -115971 -89276 -31435 -128078 282844 -58218 17563 -213323 192042 65149
6392 -102808 -4413 139122 137739 -147827 -104593 231932 163032 -45852 -103776 -281486 387201
6380 33335 72419 30795 -71842 147251 210413 -114973 -344624 129528 73326 40367 42123
6369 42123 -139955 228500 4695 -74928 -7615 -145299 428703 294706 22585 185350 -218084
6357 386574 129604 -113234 -211542 -79381 -74464 29583 92193 70754 281810 101391 -163697
6345 -106784 -203987 -1102 -108513 -213291 206646 129990 7801 285378 -81707 -103145 -32255
6333 -82999 315603 -275273 -153428 -428205 -134289 -56564 45149 -159362 85279 -241087
6322 -176774 143686 -211395 -96191 61823 -274389 -193186 -147575 189382 120743 218473 222529
6311 222529 -95315 -232072 31078 215015 217098 92144 129504 -265512 205 41420 -74292 -154023
6299 -154023 230884 2529 -147013 -80614 30809 152457 38262 52094 3949 89777 77167
6288 77167 -160351 14251 28692 -169254 89068 148089 -150958 5795 -28966 -217125 -246364
6277 -246364 52521 -111309 -119020 40440 41004 56612 19444 296514 60935 28957 212537 122086
6265 122086 102611 51267 134913 -261056 -80285 -202493 -70242 196129 -239554 90984 -124954
6253 31034 36337 199835 76065 -208799 -29202 -58106 104425 207226 -63947 148911 117087
6242 117087 -317595 -136254 221014 -192268 -83844 227799 121641 -217849 22864 73684
6232 73684 6332 -31345 161012 45824 192481 -80055 -72619 -171431 54437 -144381 267467
6220 -7801 140248 -135372 266546 -154625 -125996 -62453 13306 -455476 -13011 -309596 -153471
6208 238013 -66900 -26958 -103240 -61352 227906 -77500 -10161 -291249 269988 9138 137671
6197 137671 -83426 213206 -329933 51280 -69842 44507 16882 45006 -28921 95598 -142630
6185 -24077 -224256 -68601 -457 13803 -51729 96477 85719 -422870 -20232 177970 45912 -71847
6172 112555 82560 96974 -184993 88896 295831 -95356 -46925 279233 -208889 -37687 -142200
6161 -142200 -6654 167473 36252 -317246 -21996 -134081 71309 -35091 -24756 -116721 -398110
6150 -398110 65838 -216592 6981 27570 102723 91160 25089 -216354 81373 244824 -266919
6138 365719 -214475 45879 100702 200802 400525 33127 191827 -45764 -107564 -133303 -185506
6127 -185506 26188 317179 -81201 -131872 -100215 121215 5796 97929 -3092 220692 101844
6115 171274 -865 -128608 -139861 183681 155172 -30762 -223006 158131 -94515 -212502 257971
6103 -503461 -96104 -66007 370698 93431 391992 89718 -168968 122142 -134934 70469 -199005
6091 -63729 -86427 -121457 87012 103029 -158087 -42604 -39357 120966 100434 -56379 103489
6079 202758 -40087 95875 8330 156243 373120 -92981 -296440 153981 -377991 -10199 181689
6067 -70199 46124 50892 -20767 83973 71573 -256683 26740 65821 -37988 366945 298159 -82580
6054 82043 152069 -217961 -155685 -106776 38115 38594 114350 106900 -80253 -100608 -215290 -149524
6042 -149524 -114173 -195796 -94830 -11062 199218 -103385 5394 -150069 48254 -433344 -111522
6030 302711 -10237 -32087 12647 -149389 -86076 -280318 87219 -58488 19823 158691 -304164
6018 -134024 534 139249 -251434 169896 24669 -182863 79026 -48430 171344 225995 -177045
6006 15487 -19742 -129664 -101020 247926 -97362 21836 258740 -132068 -169361 52990 -56795
5994 -74540 154955 174956 -19116 14871 -30720 207392 -175083 -158055 142726 14362 -310683
5982 271617 107070 126118 -82646 155827 28518 -34714 369556 -268489 -26173 114042 38862
5970 -240304 -443682 -5875 -19715 145782 -35090 382080 83963 10815 211112 105864 -107492
5958 -128865 -102465 134385 -146079 354068 -205954 -257893 196248 -43238 97128 -53739 -18559
5946 115887 -253266 43428 -115886 -249591 -96387 -58346 -181932 -156639 26714 -42032 94544
5934 -89095 41408 286719 205994 -111831 -42226 -277664 -59609 -357836 -195147 -55258 66061
5922 11073 -41070 42537 -149378 -8462 425672 -70260 -76108 -164033 -36408 -216515 46781 263568
5910 263568 157803 -179211 -140794 96697 91062 207066 197092 -337181 -50301 42860 -185345
5898 25076 83559 -15585 9549 132140 -206547 278971 69840 61978 -89621 283246 116593
5886 -60585 -361105 223020 7624 348857 -173776 262274 -178391 148514 -91824 119093
5875 461314 -359257 12395 32847 291024 -225119 126107 158518 262366 -70117 320489
5864 -41275 194406 125329 102194 -78906 96050 127759 -18307 152621 -6877 -82399 -113909 -61122
5852 -61122 -36004 250324 -72400 112602 36026 105576 250393 -107979 -236192 -84453 -8423
5840 -60681 64891 -139439 59734 63097 -426855 109426 -53245 266888 161014 -41815 121624
5828 296393 40894 95423 145485 -59480 96378 23173 -64451 72951 -150273 -137695 216876
5816 33271 58248 101061 -193177 -262970 12073 379509 -53269 -211626 -10005 60300 201762
5805 201762 -57049 65278 142349 -273595 68187 -108 21546 -33493 214685 -191040 -45145
5793 -140602 -43695 -116363 -15599 93762 408607 415134 42631 216614 -212843 234373 322131
5782 322131 77737 170072 215502 21222 141652 17977 372245 -196052 85308 5535 -19380
5770 52614 336087 -82447 -132620 -224139 -172803 -106390 -266932 232630 292167 711 180968
5759 180968 -115280 -233175 -229269 -101371 -86327 261071 -307442 -275425 112646 -85300 105932
5747 -55043 109378 194794 122505 54529 14886 -4664 40752 154411 -18519 59097 -75350 -44078
5735 -44078 -185519 -243963 37412 -198272 -91425 -204873 -130730 219687 -250380 4384 23897
5724 23897 187095 -166859 -145898 -150887 -78548 131516 -73608 -208992 15803 -63023 170874
5712 -20418 133551 18871 11224 1920 -249134 -99506 -195671 11448 1202 37745 -98693 201627
5699 268316 10812 407229 -111143 -110829 80636 68404 -193096 34977 32318 -129106 -59415
5687 -93016 -60458 -291406 228574 -241102 -2186 -228746 -92375 -71163 106580 -181482 359096
5675 -143028 176563 187931 -180362 -121047 -30713 -122676 -35324 -80698 56524 -260966 -257671
5664 -257671 54300 -200395 50548 -43714 221823 145588 -106090 -177659 108230 -14023 -29243
5653 -29243 -11592 -11279 -57278 50180 204779 -263245 -83219 -17119 55033 -112207 76022 17032
5640 -145695 71338 -38359 53059 -5894 404414 70760 -193035 51852 -4324 -186699 9907 168816
5628 168816 -43786 118589 201875 47752 205932 -137370 -324482 362684 37895 61069 -123428
5616 -60507 -95614 -131085 -108392 -199546 -91435 460672 100719 -218527 142519 -119228 -45814
5604 140658 -19580 41637 81266 159053 211160 35563 5514 -146276 -93795 -63069 -5187 243046
5591 -50815 124972 86327 -58346 -90122 110415 -182394 335536 7332 137064 133888 218119
5580 218119 71729 -144742 -84553 37651 -88950 -85181 82414 -18421 -8361 -176279 -123564 -107005
5568 -107005 65943 208715 -66476 55090 372464 180923 23913 367564 -177077 263396
5557 -191222 -6999 -45054 51827 293051 208278 42737 -328 -52768 -185067 -332386 372079
5545 256126 -291289 28327 -275386 23395 31662 -72616 17539 -9896 -160718 82973 94986
5534 94986 -110378 37968 -349917 14677 -140427 -72402 159086 75313 -25209 181674 -355665
5522 148308 68343 -141954 -119138 -90001 67714 56832 216064 -57484 19899 149344 -152132
5510 -154174 185932 -195386 408477 -89146 -190626 68987 105362 103272 99646 -81234 160795
5498 273904 -19921 -220924 30625 -316291 178733 -25148 68366 -759 -205253 -296520 60572
5486 -37375 152244 -292843 138834 166942 175826 93126 -223819 -193665 -31690 199361 69557
5474 -78706 -230078 -81711 -164627 71797 480744 108480 86694 50253 -54962 -159288 -131069
5463 -131069 254461 -235697 176406 -303183 -108263 -105778 84245 124395 -111487 77883 -64087
5451 91494 234811 -157513 -173869 204070 65057 157356 109525 -96332 246927 13455 13956
5440 13956 228658 212 124106 6939 -404010 84343 -45208 166647 -285652 79520 -9669 -141059
5428 -141059 -214553 -162760 -118774 -205982 136514 -113253 65157 -36464 438348 101463 -376803
5416 36179 -50348 -82950 25340 16972 -313824 120837 -130947 49409 -226918 19968 66163
5405 66163 221287 335094 -144551 163162 297793 -88803 167028 -41282 -29560 340947
5394 45905 476 144961 -22249 41618 -185763 116565 58355 -113335 -240869 -165568 115202
5382 139264 -59354 -32254 -87148 62647 204598 -173739 266505 184107 207605 224010 -48309
5370 -265288 -122432 -23498 -3839 82626 59807 144786 233144 267573 -132287 188756 68350
5358 -93123 -109800 -83202 148355 -149476 -5138 429534 131934 -317779 67140 39974 231735
5347 231735 -127062 -219586 -25853 253990 -197574 13839 22711 114731 33088 -7469 119141
5335 -163204 -121786 171797 114606 -40937 -135708 87164 182715 233149 21000 181897 49163
5323 -133077 203573 74134 13543 -203695 54729 66688 -327331 -13528 317048 3771 54185
5312 54185 -30897 -185912 -109361 3996 -34257 160016 -32095 221020 134371 -50818 68859
5300 42606 208206 128558 55331 -40357 99154 -143626 -93380 217345 -55486 -152495 728 -125084
5287 44791 69610 -36794 57544 302175 20810 -10019 -211189 60006 -14746 -123211 -48320
5275 -75623 -95652 40054 -102830 20049 -34742 237696 -160953 67276 292225 1242 118895
5264 118895 -16984 120186 257842 92154 71770 119724 174644 -63604 155977 -172469 -336018
5253 -336018 -235248 192219 -188272 63579 -60969 269688 128463 -43992 -199698 -160771
5243 -160771 231501 -255104 62998 98251 -46922 110165 -399293 11113 316524 29708 190819
5232 190819 -67292 61596 -9930 87172 -67536 -78728 -149514 -59735 -253509 -239257 -169530 147045
5219 -91767 250089 -228943 -17771 -318117 150669 122309 -80588 -117317 -271670 99076 67357
5208 67357 -102432 141722 9632 105685 -422562 -54802 131622 176030 -81308 -260346 -90581
5196 -69483 205871 -70702 -94544 -30302 130006 -323945 -138018 -304513 -26883 -36309 23120
5184 211132 -121278 -61825 47711 -81003 -28804 4884 220762 30041 -63090 242376 -279823
5172 22011 -346610 -162130 -216317 23565 -77015 -68349 110275 343851 -76393 -70499 197727
5160 -117235 4119 -123111 383109 -47273 188386 254405 279280 427488 104671 99647 -24616
5148 -96990 -64733 -242150 182148 10447 210962 -159915 154855 152494 -130998 61524 215101
5137 215101 116011 -256993 246757 56583 101847 8458 163615 74021 -390904 91491 162953
5126 162953 -175907 -205587 -140027 -146283 -115253 137756 -174378 -173108 -55883 -249896 147570
5114 -83488 116385 -56661 153311 157658 -351481 13831 -195578 81844 128248 30084 -118180
5102 -79826 255369 -4115 -105707 -335569 76767 47079 -191712 -156844 326470 -321789 -217196
5091 -217196 -12969 18516 13783 75685 -169871 -116290 221144 31435 21205 -30439 -14376
5079 120955 -108818 158605 123366 -178116 133752 88117 296408 -44109 409124 243772
5069 243772 196893 262954 195828 170081 -148638 -191165 473046 44326 -87447 -19802 -30718
5058 -30718 -97561 -162581 -84417 125451 30200 68990 161638 -187002 13403 -150310 -189511
5047 -189511 232573 140195 -75291 -27535 104289 -25872 -188247 76074 238681 28541 59639
5036 59639 85557 226349 57260 -56491 34182 -306111 -220043 -32091 44658 -144715 -61873
5024 -13446 -410487 -22774 89595 47473 155273 -76798 -56156 108905 68069 207333 64783
5012 -200896 32570 294444 223001 -13818 -132964 71036 205655 18056 -7473 24059 -248137
5000 62639 66410 -8524 243991 -254077 -206917 194592 -215693 -314855 -16057 174411 35219
4988 14726 -185436 -57902 121294 -184684 -287545 -60395 -112704 110364 42668 -131 -84479
4977 -84479 -12930 189615 137745 -223553 42664 191592 -171641 12355 -233580 -83656 405215
4965 171944 64859 7796 278049 140160 145022 161607 3146 62098 -81635 43870 301620 -59303
4952 -215818 154559 -75880 -13156 82088 -256888 -26032 -315878 19524 162406 54729 -164776
4940 229810 -388711 -16572 -83821 375890 201369 -50209 -38779 97405 -260155 -218038 47797
4928 -149355 268607 -25319 -62474 -59958 -244201 -71919 173851 148970 -45876 333272 -16044
4916 324432 -266557 -12667 25917 -18446 -353034 -227307 185302 -95811 -78304 71714 -31698
4904 50829 9406 54318 -241251 119004 22515 66982 -143080 -114570 209755 192606 397208
4893 397208 -93889 53761 241336 -24034 112484 -233863 7704 -20680 -51835 110210 50730
4881 7508 179415 -126192 -173425 66595 53749 -319374 179552 -211310 115623 -102141 101045
4869 -11907 -11506 34715 37702 450462 74369 174994 277410 -172166 -44929 -189790 39205
4857 234797 -146171 202521 -10688 209674 293035 927 -265971 222895 -125708 -185173 8600
4845 -9206 168785 -84634 64001 276536 -106330 24718 -251525 106474 -102313 -95246 253283
4833 15302 95577 160868 144764 -86306 181193 -149409 177022 -29162 253293 -76385 132923
4821 -30216 330311 67776 -77265 -319135 -133642 -158839 193936 74371 -74626 185580 9596
4809 325378 261586 120361 498040 470761 -8654 -107424 -257690 66185 18718 69734 220190
4798 220190 156759 39491 -183447 -60322 -74203 38515 -84849 41715 120296 -118618 8229
4786 319441 60426 185101 -249678 21013 182304 -108624 78463 -60851 -199625 86338 64829
4775 64829 41599 577377 253694 -237797 -362651 -250556 61336 41110 -171715 165745
4764 -127930 69600 101912 -163628 14940 290007 1337 -47045 -77098 103466 49579 195377
4753 195377 165477 -68135 -88816 -97133 -595976 -49799 10252 -88719 73264 -283965 -59888
4741 -14317 -47549 220775 130420 -291745 -69613 166812 127343 -103177 181707 58878 -35966
4729 58983 58094 -121107 -80963 -109655 220493 338956 27706 -135344 -257274 -126801 47450
4717 -89283 107629 -91128 -396577 -401587 131334 -112726 -69180 185221 80876 9404 -93647
4705 149993 -18612 29694 -14913 -87144 54346 243845 -69893 -123541 -57764 -62157 -459111
4694 -459111 -214591 241976 55740 152406 -216142 291877 -135022 149592 425803 145446
4683 -62423 9050 -127156 334096 -20253 133059 210932 57647 -25838 -89408 -8898 44751 17820
4670 -227503 50567 210380 294161 -178227 291536 -2337 -172738 8601 48657 -133784 345736
4658 206430 126800 -65478 -88775 193273 20005 -275643 -33665 170638 -63389 111646 -125909
4646 25562 -120849 183675 -162793 225663 -63462 -200611 -77723 -44020 94868 -71922 150285
4634 -36843 95410 153305 -329583 94370 111717 61172 352967 80127 -93348 -45540 239635
4622 239074 -121314 126219 87982 -10227 -34535 128539 21560 -221102 14536 16941 73900
4611 73900 -79576 9415 168022 54208 -45832 -262998 358529 -114050 127019 20121 275522
4600 275522 -50599 -31285 152144 -113768 -287632 170078 -103920 281374 7859 51141 119371
4589 119371 323252 160314 139568 168514 -60053 23956 6212 -274499 -1512 324586 178209
4578 178209 229649 46587 -199320 314260 -311376 58274 -195921 100951 -267421 23698
4567 -328494 77421 103331 -81087 254731 38484 321455 592745 51309 -76057 178131 112638
4556 112638 13935 -347470 -293701 38518 -11863 -29669 56035 -198185 -61153 -220231 -218477
4545 -218477 -79306 89314 64486 -118832 109873 146186 -32130 182031 -123724 91115 -364574
4533 -21844 -166993 104892 -100088 249042 186310 -88710 -252542 79589 -59414 -150636 -23342
4521 -9858 -89289 113591 -87363 211634 -204221 16036 -117033 -127502 -60150 44184 38757
4510 38757 139375 44712 57873 427929 -294649 111857 41365 -70018 39816 364920 79552
4498 28384 338308 -50247 -32020 288412 186357 -36078 271587 -217079 282905 -134769
4487 188717 -202047 -118875 141735 -138509 -177880 31670 -279826 46306 -240124 111732
4476 -181535 51611 57711 130887 35410 59235 -257581 132449 -106037 -230132 -54920 -8623
4464 7656 -130811 112902 330232 -188450 166036 -184905 -188195 1862 132590 -8785 192727
$$ [...]
##END NTUPLES=NMR SPECTRUM
##END=
