##TITLE=NES1051_Conilon_9270716_MiSnGA3gQ1
##JCAMPDX= 6.0         $$ Bruker NMR JCAMP-DX V2.0
##DATA TYPE= NMR SPECTRUM
##DATA CLASS= NTUPLES
##ORIGIN= BRUKER
##OWNER= Administrator
$$ 1.72 TOPSPIN		Version 2.1
$$ 2015-07-11 23:10:14.238 -0700  Administrator@X
$$ Compression mode = diff/dup
##.OBSERVE FREQUENCY= 400.02188249412
##.OBSERVE NUCLEUS= ^1H
##.ACQUISITION MODE= SIMULTANEOUS (DQD)
##.ACQUISITION SCHEME= undefined
##.AVERAGES= 64
##.DIGITISER RES= 22
##SPECTROMETER/DATA SYSTEM= spect
##.PULSE SEQUENCE= noesygpps1d.comp
##.SOLVENT NAME= COFFEE_meoh
##.SHIFT REFERENCE= INTERNAL, COFFEE_meoh, 1, 14.96387
##AUDIT TRAIL= $$ (NUMBER, WHEN, WHO, WHERE, PROCESS, VERSION, WHAT)
$$ ##TITLE= Audit trail, TOPSPIN		Version 2.1
$$ ##JCAMPDX= 5.01
$$ ##ORIGIN= Bruker BioSpin GmbH
$$ ##OWNER= Administrator
$$ $$ E:\/data/COFFEE/nmr/NES1051_Conilon_9270716_MiSnGA3gQ1/12/pdata/1/auditp.txt
$$ ##AUDIT TRAIL=  $$ (NUMBER, WHEN, WHO, WHERE, PROCESS, VERSION, WHAT)
(   1,<2015-07-11 23:10:08.956 -0700>,<Administrator>,<X>,<go>,<TOPSPIN 2.1>,
      <created by zg
	started at 2015-07-11 22:58:39.175 -0700,
	POWCHK enabled, PULCHK disabled,
       configuration hash MD5:
       21 0F 79 D6 B3 7B B4 F6 88 20 88 DB 03 48 BD 9F
       data hash MD5: 64K
       CA 5D 49 4E 8E 43 57 B7 5E E6 A7 FF CA CC 8A 6D>)
(   2,<2015-07-11 23:10:12.128 -0700>,<Administrator>,<X>,<proc1d>,<TOPSPIN 2.1>,
      <Start of raw data processing
       efp LB = 0.3 FT_mod = 6 PKNL = 1 PHC0 = 0 PHC1 = 0 SI = 128K 
       data hash MD5: 128K
       F5 5E 46 D7 C3 D6 05 33 B9 53 95 26 45 95 37 9E>)
(   3,<2015-07-11 23:10:13.019 -0700>,<Administrator>,<X>,<proc1d>,<TOPSPIN 2.1>,
      <pk PHC0 = -85.75378 PHC1 = 0 
       data hash MD5: 128K
       BC D8 9A 37 57 D4 1D 80 B7 6D 7D 5B EF D9 8E 06>)
(   4,<2015-07-11 23:10:13.410 -0700>,<Administrator>,<X>,<proc1d>,<TOPSPIN 2.1>,
      <abs ABSG = 1 
       data hash MD5: 128K
       B7 12 50 21 14 A1 58 60 C7 ED 13 57 DF 57 A4 12>)
(   5,<2015-07-11 23:10:13.503 -0700>,<Administrator>,<X>,<proc1d>,<TOPSPIN 2.1>,
      <abs ABSG = 2 
       data hash MD5: 128K
       78 F5 D3 B7 45 31 34 C5 1F 9A 99 31 51 31 D6 0E>)
(   6,<2015-07-11 23:10:13.597 -0700>,<Administrator>,<X>,<proc1d>,<TOPSPIN 2.1>,
      <abs ABSG = 3 
       data hash MD5: 128K
       20 5B E1 8D 43 1E B4 28 2A 0B C9 EC D8 D6 EF A1>)
(   7,<2015-07-11 23:10:13.691 -0700>,<Administrator>,<X>,<proc1d>,<TOPSPIN 2.1>,
      <abs ABSG = 4 
       data hash MD5: 128K
       9D DA DF F5 14 6B 49 FC C4 46 03 54 38 F8 80 2B>)
(   8,<2015-07-11 23:10:13.769 -0700>,<Administrator>,<X>,<proc1d>,<TOPSPIN 2.1>,
      <abs ABSG = 5 
       data hash MD5: 128K
       FF 66 1F 46 51 79 73 55 13 FC 03 02 9D FE 1C 4B>)
$$ ##END=
$$ 
$$ $$ hash MD5
$$ $$ CE 64 3E 0A 9D 1D A3 73 A0 74 D7 95 01 CB 32 D9
##$RELAX= 
##$RELAX= 
##$RELAX= 
##$RELAX= 
##$RELAX= 
##$RELAX= 
##$RELAX= 
##$RELAX= 
$$ Bruker specific parameters
$$ --------------------------
##$DU= <E:\>
##$EXPNO= 12
$$ [...]
##$TP07= 0
##$TPNAME0= <>
##$TPNAME1= <>
##$TPNAME2= <>
##$TPNAME3= <>
##$TPNAME4= <>
##$TPNAME5= <>
##$TPNAME6= <>
##$TPNAME7= <>
##$TPOAL= (0..7)
0.5 0.5 0.5 0.5 0.5 0.5 0.5 0.5
##$TPOFFS= (0..7)
0 0 0 0 0 0 0 0
##$TUNHIN= 0
##$TUNHOUT= 0
##$TUNXOUT= 0
##$USERA1= <user>
##$USERA2= <user>
##$USERA3= <user>
##$USERA4= <user>
##$USERA5= <user>
##$V9= 5
##$VALIST= <valist>
##$VCLIST= <CCCCCCCCCCCCCCC>
##$VD= 0
##$VDLIST= <DDDDDDDDDDDDDDD>
##$VPLIST= <PPPPPPPPPPPPPPP>
##$VTLIST= <TTTTTTTTTTTTTTT>
##$WBST= 2048
##$WBSW= 25
##$XGAIN= (0..3)
0 0 0 0
##$XL= 0
##$YL= 0
##$YMAX_a= 5596700
##$YMIN_a= -11748669
##$ZGOPTNS= <>
##$ZL1= 120
##$ZL2= 120
##$ZL3= 120
##$ZL4= 120
##$ABSF1= 14.96387
##$ABSF2= -5.594312
##$ABSG= 5
##$ABSL= 3
##$ALPHA= 0
##$AQORDER= 0
##$ASSFAC= 0
##$ASSFACI= 0
##$ASSFACX= 0
##$ASSWID= 0
##$AUNMP= <proc_prof1d_extract.lims>
##$AXLEFT= 0
##$AXNAME= <>
##$AXNUC= <1H>
##$AXRIGHT= 0
##$AXTYPE= 0
##$AXUNIT= <>
##$AZFE= 0.1
##$AZFW= 0.1
##$BCFW= 0
##$BC_mod= 0
##$BYTORDP= 0
##$COROFFS= 0
##$CY= 15
##$DATMOD= 1
##$DC= 0
##$DFILT= <>
##$DTYPP= 0
##$F1P= 0
##$F2P= 0
##$FCOR= 0.5
##$FTSIZE= 131072
##$FT_mod= 6
##$GAMMA= 0
##$GB= 0
##$INTBC= 1
##$INTSCL= 1
##$ISEN= 128
##$LB= 0.3
##$LEV0= 0
##$LPBIN= 0
##$MAXI= 10000
##$MC2= 0
##$MEAN= 0
##$ME_mod= 0
##$MI= 0
##$NCOEF= 0
##$NC_proc= -2
##$NLEV= 6
##$NOISF1= 0
##$NOISF2= 0
##$NSP= 0
##$NTH_PI= 0
##$NZP= 0
##$OFFSET= 14.96387
##$PC= 1
##$PHC0= -85.75378
##$PHC1= 0
##$PH_mod= 1
##$PKNL= yes
##$PPARMOD= 0
##$PPDIAG= 0
##$PPIPTYP= 0
##$PPMPNUM= 2147483647
##$PPRESOL= 1
##$PSCAL= 4
##$PSIGN= 0
##$PYNMP= <proc.py>
##$REVERSE= no
##$SF= 400.020008490227
##$SI= 131072
##$SIGF1= 0
##$SIGF2= 0
##$SINO= 400
##$SIOLD= 131072
##$SPECTYP= <>
##$SREGLST= <1H.CDCl3>
##$SSB= 0
##$STSI= 131072
##$STSR= 0
##$SW_p= 8223.68421052631
##$SYMM= 0
##$S_DEV= 0
##$TDeff= 65536
##$TDoff= 0
##$TI= <>
##$TILT= no
##$TM1= 0
##$TM2= 0
##$TOPLEV= 0
##$USERP1= <user>
##$USERP2= <user>
##$USERP3= <user>
##$USERP4= <user>
##$USERP5= <user>
##$WDW= 1
##$XDIM= 131072
##$YMAX_p= 378650534
##$YMIN_p= -12989
##$CURPLOT= <Network HP LaserJet P1505>
##$CURPRIN= <$Network HP LaserJet P1505>
##$DFORMAT= <normdp>
##$LAYOUT= <+/1D_H.xwp>
##$LFORMAT= <normlp>
##$PFORMAT= <normpl>
##$SURQMSG= 1
$$ End of Bruker specific parameters
$$ ---------------------------------
##NTUPLES= NMR SPECTRUM
##VAR_NAME=  FREQUENCY,     SPECTRUM/REAL,   SPECTRUM/IMAG
##SYMBOL=    X,             R,               I
##VAR_TYPE=  INDEPENDENT,   DEPENDENT,       DEPENDENT
##VAR_FORM=  AFFN,          ASDF,            ASDF
##VAR_DIM=   131072,        131072,          131072
##UNITS=     HZ,            ARBITRARY UNITS, ARBITRARY UNITS
##FACTOR=    0.0627417313425164, 1,          1
##FIRST=     8223.62146879497, 4549,         -35568
##LAST=      0,             6164,            -34896
##MIN=       0,             -12989,          0
##MAX=       8223.62146879497, 378650534,    0
$$ Real data points
##PAGE= N=1
##DATA TABLE= (X++(R..R)), XYDATA
$$ [...]
61160I07506J080l967r169j3989j8372k2092k4636k5770k5741k4980k3890k2834
61148F93146k1928k0914j9546j7973j6410j4774j3048j1658j0816r890q183o124
61136E21882m773m221l531k305j272r30o73J73J346K317L212M295N158N313N132
61121E31123N412O276P192P760P763O773M642K141K83j025k770n236p379q010
61107E54945p009n275l921l580l835l414j609N08J159K19n18K09J562K094J813
61092E33348J701J966J959J523J219J248J218J077J283J802J807Q43l44p55l50
61077E49545J24K69L47O97J310K039K835L637M189M184L626K921K468K144J461
61062E81796L54n06m99J48P30R93J198J408J414J394J880K930L982M802N967P876
$$ y = [907506, 908586, 904619, 895450, 881461, 863089, 840997, 816361, 790591, 764850, 739870, 715980, 693146, 671218, 650304, 630758, 612785, 596375, 581601, 568553, 556895, 546079, 536189, 528006, 521882, 517109, 512888, 509357, 507052, 505780, 504850, 504177, 504350, 505696, 508013, 511225, 515520, 520678, 525991, 531123, 536535, 542811, 550003, 557763, 565526, 572299, 576941, 579082, 579365, 578340, 575570, 570334, 562955, 554945, 547936, 542661, 538740, 535160, 531325, 527911, 526302, 526810, 527969, 528188, 527670, 527879, 529441, 531535, 533348, 535049, 537015, 538974, 540497, 541716, 542964, 544182, 545259, 546542, 548344, 550151, 550994, 550650, 549895, 549545, 549669, 549938, 550285, 550982, 552292, 554331, 557166, 560803, 564992, 569176, 572802, 575723, 578191, 580335, 581796, 582150, 581644, 581145, 581293, 582023, 583016, 584214, 585622, 587036, 588430, 590310, 593240, 597222, 602024, 607991, 615867]
61046F15867R920J1160J1511J1715J2400J3608J5009J6134J6615J6588J6692J7262
61034G84481J7798J7672J7084J6791J7014J7191J6797J5938J5088J4618J4636
61023I65108J5027J5567J6152J6913J7898J8878J9675K0571K2086K4498K7698
61012A180071L1397L5275L9232M3596M8833N4911O1380O8138P5542Q3557R1517
61001A813449R9076J06501J13584J19288J23410J27751J34597J44792J58224J75253
60991C115925J96204K20111K45495K72100L00987L34200L76091M33645N12583
60982F007341O13515P34526Q77066J046171J245653J477503J746566K061509K431714
60973A8241564K869542L390624L984472M556040M901885M789759M113742K996141
$$ y = [615867, 625787, 636947, 648458, 660173, 672573, 686181, 701190, 717324, 733939, 750527, 767219, 784481, 802279, 819951, 837035, 853826, 870840, 888031, 904828, 920766, 935854, 950472, 965108, 980135, 995702, 1011854, 1028767, 1046665, 1065543, 1085218, 1105789, 1127875, 1152373, 1180071, 1211468, 1246743, 1285975, 1329571, 1378404, 1433315, 1494695, 1562833, 1638375, 1721932, 1813449, 1912525, 2019026, 2132610, 2251898, 2375308, 2503059, 2637656, 2782448, 2940672, 3115925, 3312129, 3532240, 3777735, 4049835, 4350822, 4685022, 5061113, 5494758, 6007341, 6620856, 7355382, 8232448, 9278619, 10524272, 12001775, 13748341, 15809850, 18241564, 21111106, 24501730, 28486202, 33042242, 37944127, 42733886, 46847628, 49843769]
60965D9843769J736086O49178o1750l27754j81286K45133P01644Q73133N25756
60956E4003909l53204j546615k738514l673235m233761m426383m327314m036611
60948B8668272l647579l228581k819576k440698k101190j802337j539486j307432
60940I781393j104578r31465p87179o68788n72803m95462m32397l79689l35112
60931D073920k97473k65232k36575k10509j86933j65869j47213j31238j18736
60922B314142j10389j05819j03229j00302r5892r0688q5801q1161p5953p0123
60912A394785o4343n8761n3075m7852m4320m2481m0686l7704l4130l1155k8986
60901I11292k7209k5727k4451k2817k0536j8383j7245j6726j5476j2898r935q140
$$ y = [49843769, 51579855, 52229033, 52167283, 51839529, 51658243, 51903376, 52605020, 53478153, 54003909, 53650705, 52104090, 49365576, 45692341, 41458580, 37032197, 32704883, 28668272, 25020693, 21792112, 18972536, 16531838, 14430648, 12628311, 11088825, 9781393, 8676815, 7745350, 6958171, 6289383, 5716580, 5221118, 4788721, 4409032, 4073920, 3776447, 3511215, 3274640, 3064131, 2877198, 2711329, 2564116, 2432878, 2314142, 2203753, 2097934, 1994705, 1894403, 1798511, 1707823, 1622022, 1540861, 1464908, 1394785, 1330442, 1271681, 1218606, 1170754, 1126434, 1083953, 1043267, 1005563, 971433, 940278, 911292, 884083, 858356, 833905, 811088, 790552, 772169, 754924, 738198, 722722, 709824, 699889, 691749]
60889F91749q194r232r569q402o758o328p369q486q530p798p150o869o881p172
60875E83011p379o771n341m174m062m366m038l131k460k257k132j984k009k036
60861E30871j652j005p40j148j856k351k310j624o47k75j189k969m395m652l979
60846E00079l191k868k959k956k502j908j765k109k410k495k831l597m128l779
60832D60581k860k196k162k633l454m445n314n983o680p284p195o236n138m552
60818C94449m226l766l472l624l575k645j367p94q68o59K4M19K14m1k5j39n89
60801C69316q81o18p7L17N18O02M92J91j59m63n82j41R23J811J573L64p77j327
60783C71082j614j811j646j345j755k963l799l342k179j469j400j415j399j707
$$ y = [691749, 683555, 674323, 664754, 656352, 649594, 643266, 635897, 627411, 618881, 611083, 603933, 597064, 590183, 583011, 575632, 568861, 563520, 559346, 555284, 550918, 546880, 543749, 541289, 539032, 536900, 534916, 532907, 530871, 529219, 528214, 527474, 526326, 524470, 522119, 519809, 518185, 517538, 517263, 516074, 513105, 508710, 504058, 500079, 496888, 494020, 491061, 488105, 485603, 483695, 481930, 479821, 477411, 474916, 472085, 468488, 464360, 460581, 457721, 455525, 453363, 450730, 447276, 442831, 437517, 431534, 424854, 417570, 410375, 404139, 399001, 394449, 390223, 386457, 382985, 379361, 375786, 373141, 371774, 370980, 370112, 369453, 369477, 369896, 370110, 370069, 370044, 369905, 369316, 368435, 367817, 367740, 368057, 368575, 369177, 369669, 369860, 369701, 369238, 368656, 368515, 369438, 371249, 372822, 373186, 372409, 371082, 369468, 367657, 366011, 364666, 362911, 359948, 356149, 352807, 350628, 349159, 347759, 346344, 344945, 343238]
60769C43238k225k291j562m34M58P26K89n70j166q70J97J166J222L43p48j323
60753C36450j277j120j293j659j794j657j690k231l082l722l690k858j541l93
60739C08443J62L63O83J062J064P05N23O14L81m47j146r45k05K0o71j664k217
60722C06725k151j680j138r00j168j695j968j830j608j607j745j792j693j485
60708B84265j125o35k02L2J74L93O59Q80J128J484J774J779J719K043K719L152
60692C00239L104L114L591L905L161J636O17P60J429J827J971K104K019J546J162
60677C32185J325J655J528J153J277K005K727L148L545M053M374M390M352M275
60663C71992L834L068K547K578K739K582K242K104K186K169J663K58k126m663
$$ y = [343238, 341013, 338722, 337160, 336726, 337184, 337910, 338199, 337629, 336463, 335593, 335790, 336956, 338178, 338521, 337773, 336450, 335173, 334053, 332760, 331101, 329307, 327650, 325960, 323729, 320647, 316925, 313235, 310377, 308836, 308443, 308605, 308968, 309651, 310713, 311777, 312482, 313005, 313619, 314000, 313553, 312407, 311462, 311257, 311277, 310606, 308942, 306725, 304574, 302894, 301756, 300856, 299688, 297993, 296025, 294195, 292587, 290980, 289235, 287443, 285750, 284265, 283140, 282505, 282303, 282335, 282509, 282902, 283561, 284441, 285569, 287053, 288827, 290606, 292325, 294368, 297087, 300239, 303343, 306457, 310048, 313953, 317114, 318750, 319367, 320127, 321556, 323383, 325354, 327458, 329477, 331023, 332185, 333510, 335165, 336693, 337846, 339123, 341128, 343855, 347003, 350548, 354601, 358975, 363365, 367717, 371992, 375826, 378894, 381441, 384019, 386758, 389340, 391582, 393686, 395872, 398041, 399704, 399962, 397836, 393173]
60649C93173n986n628m629m242m460m410l815l207k822k142q08O16J192O82k19
60634C53295o12j23Q91J735J901J413O48k4m65o96p97q97j110j381j496j309r60
60617C50013p89r78j277j153k50J307L027M426N308N717N816N743N643N794O629
60602C94976Q383J0670J2590J3546J3816J4094J4534J4552J3521J1445Q814O016
60590E36957L100L4k960n469p277q628r917j1132j1806j1551j0482r035p640o648
60576D37546o256o189n772m670l410k759k732k630k032j288q79p20k83P18K005
60561D00649L047L561L710L775L785L628L402L274L020K220J174J022K385M359
60547D43011N483N486N393O013P117Q157R086J0227J1776J3753J6121J8802K1735
$$ y = [393173, 387187, 381559, 376930, 372688, 368228, 363818, 360003, 356796, 353974, 351832, 351024, 351640, 352832, 353514, 353295, 352683, 352560, 353451, 355186, 357087, 358500, 359148, 359124, 358659, 357963, 357166, 356269, 355159, 353778, 352282, 350973, 350013, 349224, 348246, 346969, 345816, 345566, 346873, 349900, 354326, 359634, 365351, 371167, 376910, 382553, 388347, 394976, 403359, 414029, 426619, 440165, 453981, 468075, 482609, 497161, 510682, 522127, 530941, 536957, 540057, 540091, 537131, 531662, 524385, 515757, 505840, 494708, 482902, 471351, 460869, 451834, 444194, 437546, 431290, 425101, 419329, 414659, 411249, 408490, 405758, 403128, 401096, 399808, 398929, 398209, 397926, 398644, 400649, 403696, 407257, 410967, 414742, 418527, 422155, 425557, 428831, 431851, 434071, 435245, 436267, 438652, 443011, 448494, 453980, 459373, 465386, 472503, 480660, 489746, 499973, 511749, 525502, 541623, 560425, 582160]
60534E82160K5017K8757L2933L7642M3302N0167N7765O5370P2904Q0800Q8868
60523A165685R5860J00228J00847R6984Q8218P4768N7555L7848J7166k516j9151
60512A813492l1591l9957m5084m7952m9485n0240n0066m8535m5751m2193l7871
60501A324767l2427k6189k0205j4880r371k780M781J2838K1558L1398M2134N2841
60489A384465O2564P0592P6374P9489P9394P5040O5501N1564L6148K2609J2908
60478B016648P659P074J0985J8448K8262L9776N2661O6359Q0561R5993J13976
60467B538402J35353J60457J89661K22917K58799K94748L28125L55892L73222
60458D857576L73660L51594L04678K34294J44922M3537o1318j61113k48548l17906
$$ y = [582160, 607177, 635934, 668867, 706509, 749811, 799978, 857743, 923113, 996017, 1076817, 1165685, 1261545, 1361773, 1462620, 1559604, 1647822, 1722590, 1780145, 1817993, 1835159, 1832643, 1813492, 1781901, 1741944, 1696860, 1648908, 1599423, 1549183, 1499117, 1450582, 1404831, 1362638, 1324767, 1292340, 1266151, 1245946, 1231066, 1221695, 1218915, 1223696, 1236534, 1258092, 1289490, 1331624, 1384465, 1447029, 1517621, 1593995, 1673484, 1752878, 1827918, 1893419, 1944983, 1981131, 2003740, 2016648, 2024307, 2031381, 2042366, 2060814, 2089076, 2128852, 2181513, 2247872, 2328433, 2424426, 2538402, 2673755, 2834212, 3023873, 3246790, 3505589, 3800337, 4128462, 4484354, 4857576, 5231236, 5582830, 5887508, 6121802, 6266724, 6310261, 6248943, 6087830, 5839282, 5521376]
60448E521376l65432l90411l95596l85969l66625l41542l13459k84143k54709
60439B423490k26128j99484j75610j54501j35435j17775j01604q7509p5867o6441
60429A083136n8636n2007m6383m1568l7207l3091k9402k6395k3909k1462j8804
60418F94272j6121j3683j1535r624q014o810n932n111m081k737j191K22J113J389
60404F12157J458J898K791L514L541L273L622M611N019L842J646j68j126j890
60390F44188k888l691l948m029m252m289l883l466l442l341k555j494j159j690
60376F00061k191k025j589j616k232k934l119k517j428o58q86j953l121l979m820
60361E64993o060p637r190j0484j1386j1613j0922r561q295p786p884p761o852
$$ y = [5521376, 5155944, 4765533, 4369937, 3983968, 3617343, 3275801, 2962342, 2678199, 2423490, 2197362, 1997878, 1822268, 1667767, 1532332, 1414557, 1312953, 1225444, 1149577, 1083136, 1024500, 972493, 926110, 884542, 847335, 814244, 784842, 758447, 734538, 713076, 694272, 678151, 664468, 652933, 643309, 635295, 628485, 622553, 617442, 613361, 610624, 609433, 609655, 610768, 612157, 613615, 615513, 618304, 621818, 625359, 628632, 632254, 636865, 641884, 645726, 647372, 647204, 646078, 644188, 641300, 637609, 633661, 629632, 625380, 621091, 617208, 613742, 610300, 606959, 604404, 602910, 601751, 600061, 597870, 595845, 594256, 592640, 590408, 587474, 584355, 581838, 580410, 579752, 578866, 576913, 573792, 569813, 564993, 558933, 551296, 542106, 531622, 520236, 508623, 497701, 488140, 479845, 472059, 464175, 456414, 449562]
60348D49562n537m653m476m482m184l748l571l562l232k332j134j36K79Q3l90
60333D08487o21k86N85J700K644L005K719K207J913J725J259O00K15J37l2k72
60317D25985n2N62O21l77j655k238k186k073j901j418j039j412k339k905k633
60302D04940j790q01l2R9m14p82k54P67J276J062P98P61N11r4m20O6J074J879
60284D08646J989J423P78R97K409M094M840M662M664N452O536P404Q208R158J0013
60269D81273J0565J1031J1610J2107J2191J1621J0286Q574P537P863Q754Q767
60257F02179P724O812O691O768O625O814P624Q357Q711R697J2057J4730J6127
60244G20916J6306J6644J7782J9232K0713K2552K4663K6318K7294K8373L0285
$$ y = [449562, 444025, 439372, 434896, 430414, 426230, 422482, 418911, 415349, 412117, 409785, 408651, 408515, 408794, 408877, 408487, 407866, 407580, 408165, 409865, 412509, 415514, 418233, 420440, 422353, 424078, 425337, 425937, 426152, 426289, 426257, 425985, 425933, 426495, 427116, 426739, 425084, 422846, 420660, 418587, 416686, 415268, 414229, 412817, 410478, 407573, 404940, 403150, 402349, 402317, 402416, 402002, 401220, 400966, 401733, 403009, 404071, 404869, 405630, 406141, 406047, 405627, 405693, 406767, 408646, 410635, 412058, 412836, 413833, 416242, 420336, 425176, 429838, 434502, 439954, 446490, 453894, 462102, 471260, 481273, 491838, 502869, 514479, 526586, 538777, 550398, 560684, 569258, 576795, 584658, 593412, 602179, 609903, 616715, 623406, 630174, 636799, 643613, 651237, 659594, 668305, 678002, 690059, 704789, 720916, 737222, 753866, 771648, 790880, 811593, 834145, 858808, 885126, 912420, 940793, 971078]
60233I71078L2757L4987L6586L7716L8645L9411L9786L9465L8418L7009L5585
60222A381443L4068L2189K9990K7792K5726K3573K1057J8063J4700J1255Q076
60211A627932N294K775M69j478l012m260n150n291m458k893q41J805N065Q527
60197A624484J1847J5214J8784K2131K4841K7242K9717L1634L1861L0378K8375
60186A896508K6549K4176K0263J4955R216L620j911p424j2614j7277k1676k6308
60174A908077l1331l6347m0579m3304m4143m3091m0528l7180l3768l0428k6615
60163A500763k1823j6362j1099o523k440J416M823P343Q948J0092J1152J1878
60151A498168J1523R656O836M317K855K021Q30j000k778l641l289j854O07M260
$$ y = [971078, 1003835, 1038822, 1075408, 1113124, 1151769, 1191180, 1230966, 1270431, 1308849, 1345858, 1381443, 1415511, 1447700, 1477690, 1505482, 1531208, 1554781, 1575838, 1593901, 1608601, 1619856, 1627932, 1633226, 1636001, 1636470, 1634992, 1631980, 1627720, 1622570, 1617279, 1612821, 1609928, 1609087, 1610892, 1615957, 1624484, 1636331, 1651545, 1670329, 1692460, 1717301, 1744543, 1774260, 1805894, 1837755, 1868133, 1896508, 1923057, 1947233, 1967496, 1982451, 1991667, 1995287, 1993376, 1985952, 1973338, 1956061, 1934385, 1908077, 1876746, 1840399, 1799820, 1756516, 1712373, 1669282, 1628754, 1591574, 1557806, 1527378, 1500763, 1478940, 1462578, 1451479, 1444956, 1442516, 1443932, 1448755, 1456098, 1465046, 1475138, 1486290, 1498168, 1509691, 1519347, 1526183, 1530500, 1533355, 1535376, 1536206, 1535206, 1532428, 1528787, 1525498, 1523644, 1524251, 1528511]
60137A528511R236J5346K2098K8924L5522M1920M8122N3791N8340O1348O2753
60126A965911O2772O1871O0812O0449O1341O3502O6560P0013P3348P5975P7262
60115B699816P6723P4350P0608O5963O0341N3310M4795L5431K5949J6459O570
60104C230315l932j4748k5389l5531m5126n4321o3299p1922p9472q4934q7753
60093B663888q8291q7418q5648q2720p8069p1617o3952n5700m6897l7249k6847
60082A939480j6333o304L179J2380K1390K9937L7524M3713M8441N2127N5163N7306
60070B278003N7866N6638N4167N0873M6352L9984L1970K3234J4406N344m363j4803
60058B639671k5635l6200m5704n3628o0052o5279o9078p0668o9606o6388o1918
$$ y = [1528511, 1537747, 1553093, 1575191, 1604115, 1639637, 1681557, 1729679, 1783470, 1841810, 1903158, 1965911, 2028683, 2090554, 2151366, 2211815, 2273156, 2336658, 2403218, 2473231, 2546579, 2622554, 2699816, 2776539, 2850889, 2921497, 2987460, 3047801, 3101111, 3145906, 3181337, 3207286, 3223745, 3230315, 3226383, 3211635, 3186246, 3150715, 3105589, 3051268, 2987969, 2916047, 2836575, 2751641, 2663888, 2575597, 2488179, 2402531, 2319811, 2241742, 2170125, 2106173, 2050473, 2003576, 1966327, 1939480, 1923147, 1916843, 1920022, 1932402, 1953792, 1983729, 2021253, 2064966, 2113407, 2165534, 2220697, 2278003, 2335869, 2392507, 2446674, 2497547, 2543899, 2583883, 2615853, 2639087, 2653493, 2658837, 2654474, 2639671, 2614036, 2577836, 2532132, 2478504, 2418452, 2353173, 2284095, 2213427, 2143821, 2077433, 2015515]
60047B015515n6682n0682m3990l6902k9584k1929j3992o243P93P000J2467J7064
60035A792835K0584K3205K5310K6773K6913K5440K2868J9713J5784J0819N384
60024B015628L51m318r396j5094k0700k5538k9561l2772l4894l5935l6319l6131
60012A735321l4850l2290k9193k6339k3688k0777j7486j3815r509m526N66N313
60000A528727J0027J5145K0422K5526L0825L6702M2434M6877M9950N2388N4056
59989A913079N3783N1030M6689M1842L6699L1098K5113J8599J0938J952p453j6125
59977B207244k3639k9977l4846l8033l9967m1094m0985l8926l5237l1117k6970
59966A826453k1808j4782o741M21N838J0370J5184K0157K4134K6369K7196K7225
$$ y = [2015515, 1958833, 1908151, 1864161, 1827259, 1797675, 1775746, 1761754, 1755511, 1756304, 1763304, 1775771, 1792835, 1813419, 1836624, 1861934, 1888707, 1915620, 1941060, 1963928, 1983641, 1999425, 2010244, 2015628, 2015979, 2011661, 2002265, 1987171, 1966471, 1940933, 1911372, 1878600, 1843706, 1807771, 1771452, 1735321, 1700471, 1668181, 1638988, 1612649, 1588961, 1568184, 1550698, 1536883, 1527374, 1522848, 1523414, 1528727, 1538754, 1553899, 1574321, 1599847, 1630672, 1667374, 1709808, 1756685, 1806635, 1859023, 1913079, 1966862, 2017892, 2064581, 2106423, 2143122, 2174220, 2199333, 2217932, 2228870, 2230822, 2223369, 2207244, 2183605, 2153628, 2118782, 2080749, 2040782, 1999688, 1958703, 1919777, 1884540, 1853423, 1826453, 1804645, 1789863, 1783122, 1783543, 1789381, 1799751, 1814935, 1835092, 1859226, 1885595, 1912791, 1940016]
59954A940016K6562K5162K3498K2280K1550K0587J8765J6148J3176J0138P158
59943B145040M404K070K26j183k360l598m940n817n203k363K660R246J6669K4437
59929B179288L2462M1053N0485O0501P0361P9459Q7649R4955J01283J06439J10057
59918C013992J11320J09108J02753R2437P8640O1585M1646K0095j207k0972l8959
59907C570438n5128o8734p8652q4436q6625q5965q2764p7250p0142o2280n3711
59896B764751m3720l1956j9087o023P048K0397L3816M6531N7906O7677P5443Q0553
59884C053336Q2493Q0981P5655O6340N3947M0453K7555J5596M080p269j8484k9851
59872C444832m1671n3464o4047p2540p8866q3241q5651q6075q4768q1897p7124
$$ y = [1940016, 1966578, 1991740, 2015238, 2037518, 2059068, 2079655, 2098420, 2114568, 2127744, 2137882, 2145040, 2149444, 2151514, 2151740, 2150557, 2148197, 2144599, 2139659, 2133842, 2128639, 2126276, 2128936, 2138182, 2154851, 2179288, 2211750, 2252803, 2303288, 2363789, 2434150, 2513609, 2601258, 2696213, 2797496, 2903935, 3013992, 3125312, 3234420, 3337173, 3429610, 3508250, 3569835, 3611481, 3631576, 3630369, 3609397, 3570438, 3515310, 3446576, 3367924, 3283488, 3196863, 3110898, 3028134, 2950884, 2880742, 2818462, 2764751, 2721031, 2689075, 2669988, 2663965, 2671013, 2691410, 2725226, 2771757, 2829663, 2897340, 2972783, 3053336, 3135829, 3216810, 3292465, 3358805, 3412752, 3453205, 3480760, 3496356, 3500436, 3493167, 3474683, 3444832, 3403161, 3349697, 3285650, 3213110, 3134244, 3051003, 2965352, 2879277, 2794509, 2712612, 2635488]
59861B635488p0036o0978n1043m1050l0883k0094q883K033J2453K2943L3687M3695
59849B467332N1761N7900O2989O6901O7866O4054N5232M2478K6974R805p434k2944
59837B942914l5733m5751n2969n7149n8735n9287o0321o2027o3578o4343o4235
59826B318786o3144o0732n6861n1659m5109l7162k8572k1095j6382j4787j5455
59815A907828j7278j9380k0951k1273k0118j7911j5511j3887j3811j5418j7984
59804A714306k0339k1535k0934j7933j2133l938N500J5203K5032L5365M6371N7850
59792A802815O9470Q0885R1554J00464J05932J05786R8209Q2757O0675L4310O443
59781B639300k0065m2727o0041p1667p8023p9918p8524p5052p0215o4270n7573
$$ y = [2635488, 2565452, 2504474, 2453431, 2412381, 2381498, 2361404, 2352521, 2354554, 2367007, 2389950, 2423637, 2467332, 2519093, 2576993, 2639982, 2706883, 2774749, 2838803, 2894035, 2936513, 2963487, 2973292, 2965858, 2942914, 2907181, 2861430, 2808461, 2751312, 2692577, 2633290, 2572969, 2510942, 2447364, 2383021, 2318786, 2255642, 2194910, 2138049, 2086390, 2041281, 2004119, 1975547, 1954452, 1938070, 1923283, 1907828, 1890550, 1871170, 1850219, 1828946, 1808828, 1790917, 1775406, 1761519, 1747708, 1732290, 1714306, 1693967, 1672432, 1651498, 1633565, 1621432, 1617494, 1622994, 1638197, 1663229, 1698594, 1744965, 1802815, 1872285, 1953170, 2044724, 2145188, 2251120, 2356906, 2455115, 2537872, 2598547, 2632857, 2639300, 2619235, 2576508, 2516467, 2444800, 2366777, 2286859, 2208335, 2133283, 2063068, 1998798, 1941225]
59770A941225n0690m3859l6997l0469k5100k1037j7234j2714p770l264P35M732
59758A697558Q680J2020J4750J7501K0514K3426K6140K9150L2697L6383L9935
59747A958754M3807M8601N4369O0828O7824P5277Q2931R0660R8767J07608J16909
59736B806335J25767J33291J39109J43168J45138J44174J39571J31623J21628
59727D029804J10879J00042Q9718Q1096P5376P2803P2914P5591Q1188Q9472R9067
59716D977950J08190J15593J20774J23711J24447J22605J17364J08344R6468Q3349
59706F098795O9815N5711M1182K7377J5553O126r65n477o868m789Q08R760K1615
59693F328643L5754N1806O9736Q9347J10045J31191J52287J72593J90982K06431
$$ y = [1941225, 1890535, 1846676, 1809679, 1779210, 1754110, 1733073, 1715839, 1703125, 1695355, 1692091, 1692826, 1697558, 1706238, 1718258, 1733008, 1750509, 1771023, 1794449, 1820589, 1849739, 1882436, 1918819, 1958754, 2002561, 2051162, 2105531, 2166359, 2234183, 2309460, 2392391, 2483051, 2581818, 2689426, 2806335, 2932102, 3065393, 3204502, 3347670, 3492808, 3636982, 3776553, 3908176, 4029804, 4140683, 4240725, 4330443, 4411539, 4486915, 4559718, 4632632, 4708223, 4789411, 4878883, 4977950, 5086140, 5201733, 5322507, 5446218, 5570665, 5693270, 5810634, 5918978, 6015446, 6098795, 6168610, 6224321, 6265503, 6292880, 6308433, 6314559, 6313594, 6308117, 6301249, 6296460, 6297268, 6307028, 6328643, 6364397, 6416203, 6485939, 6575286, 6685331, 6816522, 6968809, 7141402, 7332384, 7538815]
59683G538815K18360K26228K28999K25158K13143J91866J61346J22924P8527K9799
59673I235165k1549p2703j20033j60737j93619k18190k34037k41663k43141k41255
59663G488238k38433k36803k38250k43413k51045k59054k65781k69861k69823
59654E215775k65012k56570k46323k35032k22547k09313j96423j84203j72041
59645C228311j59822j48388j38159j28306j17934j07353r7465q8417p9600p0717
59635B092150o2192n4485m7505m0825l4322k8410k3601j9911j6953j4604j3223
59624A736119j2863j2773j2265j1766j2252j3801j5513j6937j8541k0415k1542
59613A567451k1110j9929j9540k0284k1047k0880k0009j9087j8183j6909j5151
$$ y = [7538815, 7757175, 7983403, 8212402, 8437560, 8650703, 8842569, 9003915, 9126839, 9205366, 9235165, 9213616, 9140913, 9020880, 8860143, 8666524, 8448334, 8214297, 7972634, 7729493, 7488238, 7249805, 7013002, 6774752, 6531339, 6280294, 6021240, 5755459, 5485598, 5215775, 4950763, 4694193, 4447870, 4212838, 3990291, 3780978, 3584555, 3400352, 3228311, 3068489, 2920101, 2781942, 2653636, 2535702, 2428349, 2330884, 2242467, 2162867, 2092150, 2029958, 1975473, 1927968, 1887143, 1852821, 1824411, 1800810, 1780899, 1763946, 1749342, 1736119, 1723256, 1710483, 1698218, 1686452, 1674200, 1660399, 1644886, 1627949, 1609408, 1588993, 1567451, 1546341, 1526412, 1506872, 1486588, 1465541, 1444661, 1424652, 1405565, 1387382, 1370473, 1355322]
59602A355322j3241j1630j0647j0478j0950j1414j1064r534p181m781l045k203
59590A249154j851j236R3J825L256M159M970O046P179Q196R563J1798J4468J6500
59576A334120J7587J8596K0381K2856K5555K8397L1293L3604L4893L5943L8055
59565A641280M1355M4610M6969M9127N2357N6835O1390O4713O6462O7388O8574
59554B261060P0440P2220P2589P0928O7864O4391O0629N5632M8197L7575K3669
59543B905194P196j0114k5859l8149m6703n2664n7217o0481o1823o0936n8213
59532B440231n4031m8189m0439l1222k1444j1506j021J0408K2521L4617M6133
59521B346058N6737O6104P3829P9480Q2466Q1988P7437O8789N6502M1126K3310
$$ y = [1355322, 1342081, 1330451, 1319804, 1309326, 1298376, 1286962, 1275898, 1266364, 1259183, 1254402, 1251357, 1249154, 1247303, 1246067, 1246160, 1247985, 1251241, 1255400, 1260370, 1266416, 1273595, 1281791, 1291354, 1303152, 1317620, 1334120, 1351707, 1370303, 1390684, 1413540, 1439095, 1467492, 1498785, 1532389, 1567282, 1603225, 1641280, 1682635, 1727245, 1774214, 1823341, 1875698, 1932533, 1993923, 2058636, 2125098, 2192486, 2261060, 2331500, 2403720, 2476309, 2547237, 2615101, 2679492, 2740121, 2795753, 2843950, 2881525, 2905194, 2912390, 2902276, 2876417, 2838268, 2791565, 2738901, 2681684, 2621203, 2559380, 2498444, 2440231, 2386200, 2338011, 2297572, 2266350, 2244906, 2233400, 2232379, 2242787, 2265308, 2299925, 2346058, 2402795, 2468899, 2542728, 2622208, 2704674, 2786662, 2864099, 2932888, 2989390, 3030516, 3053826]
59510C053826M015j5713l5248n4165p1421q5278r4625r9989j02731j03402j01489
59499B293780r6770r0075q2483p4401o5830n7064m8560m0422l2518k4875j7487
59488A663295r976k020O035J3547K0407K6926L3010L8185M2456M6402N0142N2880
59476A981289N3737N2491M9204M3770L6311K7450J7689P001m489j5861k6182l5514
59464B186896m4423n2707n9417o4102o7212o9165o9777o8934o7191o5152o2711
59453A496105n9385n5178n0659m6254m2010l8048l4792l2396l0229k7360k3566
59442A056228j9583j6279j3804j1681r467p064m518j881P27L158N434P684R874
59429I98828J1816J3489J5180J7257J9855K2704K5007K5636K3857K0040J5499
$$ y = [3053826, 3057841, 3042128, 3006880, 2952715, 2881294, 2796016, 2701391, 2601402, 2498671, 2395269, 2293780, 2197010, 2106935, 2024452, 1950051, 1884221, 1827157, 1778597, 1738175, 1705657, 1680782, 1663295, 1653319, 1651299, 1657334, 1670881, 1691288, 1718214, 1751224, 1789409, 1831865, 1878267, 1928409, 1981289, 2035026, 2087517, 2136721, 2180491, 2216802, 2244252, 2261941, 2268942, 2264453, 2248592, 2222410, 2186896, 2142473, 2089766, 2030349, 1966247, 1899035, 1829870, 1760093, 1691159, 1623968, 1558816, 1496105, 1436720, 1381542, 1330883, 1284629, 1242619, 1204571, 1169779, 1137383, 1107154, 1079794, 1056228, 1036645, 1020366, 1006562, 994881, 985414, 978350, 973832, 971951, 972678, 975836, 981270, 988954, 998828, 1010644, 1024133, 1039313, 1056570, 1076425, 1099129, 1124136, 1149772, 1173629, 1193669, 1209168]
59418A209168J1659R509R600J1948J5886K0474K5297L0407L5270L8340L8199L4969
59406A490726L0302K6179K3897K3921K6093K9807L4252L8800M3363M8356N4078
59395A869774O0072O5371O9614P3572P8055Q2671Q6319Q8732R0758R3197R6256
59384B754391J00266J05948J13511J22275J31655J41843J52958J64165J74250
59375C961262J82502J88457J91344J90464J85821J77857J66909J53463J38478
59366E536557J22930J07321R2038P7637O4194N0899L6905K2050O186j1500l1583
59355F073634n3359p5685r8346j21454j43786j63094j78084j88935j95730j97647
59345D657514j94275j86786j77130j66605j55657j44497j33295j22079j10957
$$ y = [1209168, 1220827, 1230336, 1239936, 1251884, 1267770, 1288244, 1313541, 1343948, 1379218, 1417558, 1455757, 1490726, 1521028, 1547207, 1571104, 1595025, 1621118, 1650925, 1685177, 1723977, 1767340, 1815696, 1869774, 1929846, 1995217, 2064831, 2138403, 2216458, 2299129, 2385448, 2474180, 2564938, 2658135, 2754391, 2854657, 2960605, 3074116, 3196391, 3328046, 3469889, 3622847, 3787012, 3961262, 4143764, 4332221, 4523565, 4714029, 4899850, 5077707, 5244616, 5398079, 5536557, 5659487, 5766808, 5858846, 5936483, 6000677, 6051576, 6088481, 6110531, 6116717, 6105217, 6073634, 6020275, 5944590, 5846244, 5724790, 5581004, 5417910, 5239826, 5050891, 4855161, 4657514, 4463239, 4276453, 4099323, 3932718, 3777061, 3632564, 3499269, 3377190, 3266233]
59336C266233j00429r1175q3525p7112p1015o4400n7198n0096m3721l8172l3513
59325B555877l0120k8059k6590k5087k4039k4370k5981k7836k9320l0655l1981
59314B251839l3025l3770l4532l5141l4868l3548l2026l1041l0290k8987k6912
59303A897699k4413k1792j9064j6156j3084j0024p245m755k111J067M605Q146
59291A792873J1796J5744J9439K1914K2996K3526K4175K4628K4070K1959J8280
59280B021400J3599Q917M861R81l526q403j2284j4110j3846j1928q785n090j495
59267A970291J900M847N566J398q393k1305l3609m2873m8202m9354m6912m2538
59255A690816l7820l3031k7749k2183j6987j2121p012j716K983O704R888J3053
$$ y = [3266233, 3165804, 3074629, 2991104, 2913992, 2842977, 2778577, 2721379, 2671283, 2627562, 2589390, 2555877, 2525757, 2497698, 2471108, 2446021, 2421982, 2397612, 2371631, 2343795, 2314475, 2283820, 2251839, 2218814, 2185044, 2150512, 2115371, 2080503, 2046955, 2014929, 1983888, 1953598, 1924611, 1897699, 1873286, 1851494, 1832430, 1816274, 1803190, 1793166, 1785921, 1781166, 1779055, 1780122, 1784727, 1792873, 1804669, 1820413, 1839852, 1861766, 1884762, 1908288, 1932463, 1957091, 1981161, 2003120, 2021400, 2034999, 2043916, 2048777, 2049758, 2046232, 2037829, 2025545, 2011435, 1997589, 1985661, 1976876, 1971786, 1970291, 1972191, 1977038, 1982604, 1984002, 1975609, 1954304, 1920695, 1877822, 1829620, 1780266, 1733354, 1690816, 1652996, 1619965, 1592216, 1570033, 1553046, 1540925, 1533913, 1532197, 1535180, 1541884, 1551772, 1564825]
59243A564825J6261J9483K2894K6596L0465L4442L8696M3386M8474N3819N9354
59232A958695O5142P1469P8788Q7303R6599J05820J14364J22276J29904J37126
59222B967486J43030J46531J47289J45674J41680J34354J22722J06867Q7516O4926
59212D208075L9121J1111j7029m3534o7652q8798j05991j18475j26281j29727
59202C560820j29000j24663j17900j09778j00669r0823q0922p1542o2614n3842
59192B619067m5314l7251k9614k2428j6131j1185p699n744n562p059r601j2691
59180B408788j6373k0533k4305k6678k7361k6625k4875k2711k0867j9453j7769
59169B161238j5378j2868j1043r974r456r805j1304j3337j4988j6286j7942k0185
$$ y = [1564825, 1581086, 1600569, 1623463, 1650059, 1680524, 1714966, 1753662, 1797048, 1845522, 1899341, 1958695, 2023837, 2095306, 2174094, 2261397, 2357996, 2463816, 2578180, 2700456, 2830360, 2967486, 3110516, 3257047, 3404336, 3550010, 3691690, 3826044, 3948766, 4055633, 4143149, 4208075, 4247196, 4258307, 4241278, 4197744, 4130092, 4041294, 3935303, 3816828, 3690547, 3560820, 3431820, 3307157, 3189257, 3079479, 2978810, 2887987, 2807065, 2735523, 2672909, 2619067, 2573753, 2536502, 2506888, 2484460, 2468329, 2457144, 2449445, 2443701, 2438139, 2431080, 2421479, 2408788, 2392415, 2371882, 2347577, 2320899, 2293538, 2266913, 2242038, 2219327, 2198460, 2179007, 2161238, 2145860, 2132992, 2121949, 2111975, 2102519, 2092714, 2081410, 2068073, 2053085, 2036799, 2018857, 1998672]
59157A998672k2545k4677k6539k7868k8304k8016k7514k6839k5560k3532k1074
59146A716204j8377j5353j2095q985o330m329l234l019l023k521j669j322j900
59133A634047k965l904m525m824m723m177l298k216j010L21J989M331P309J0296
59119A626651J2694J4569J6302J7808J8583J8378J7421J6043J4382J2347R624
59108A794802O007J980j387l524m947o308p323p341o519n621m797l509j665M5
59094A749893J067J679K382L071L050J594j530n864j0535j4919j9041k3209k7499
59081A660139l1761l5715l8739m0057l9623l8287l6665l4449l1547k9111k8252
59070A275933k8170k6962k4249k1637k0378j9732j8271j5702j2750r950p341m784
$$ y = [1998672, 1976127, 1951450, 1924911, 1897043, 1868739, 1840723, 1813209, 1786370, 1760810, 1737278, 1716204, 1697827, 1682474, 1670379, 1661394, 1655064, 1650735, 1647501, 1644482, 1641459, 1638938, 1637269, 1635947, 1634047, 1631082, 1627178, 1622653, 1617829, 1613106, 1608929, 1605631, 1603415, 1602405, 1602726, 1604715, 1609046, 1616355, 1626651, 1639345, 1653914, 1670216, 1688024, 1706607, 1724985, 1742406, 1758449, 1772831, 1785178, 1794802, 1800809, 1802789, 1801402, 1797878, 1792931, 1786623, 1779300, 1771959, 1765440, 1759819, 1755022, 1751513, 1749848, 1749893, 1750960, 1752639, 1755021, 1758092, 1761142, 1762736, 1761206, 1755342, 1744807, 1729888, 1710847, 1687638, 1660139, 1628378, 1592663, 1553924, 1513867, 1474244, 1435957, 1399292, 1364843, 1333296, 1304185, 1275933, 1247763, 1220801, 1196552, 1174915, 1154537, 1134805, 1116534, 1100832, 1088082, 1078132, 1070791, 1066007]
59058A066007j989J405N168Q174R235Q128N433J670k936p883j2089j4479j4852
59045A050992j3998j2856j1549r438o153k302J076L441M960O041O984P803Q044
59032A033045P140N251L482K778K974L406M086N594Q092J1194J4665J8490K2369
59019A142566K5803K8717L1385L3856L5960L7686L8948L9188L7975L5749L3068
59008A520901K9288K3093J4395M700m533j2938k0438k6501l0693l3141l3982l3055
58996A397096l0598k7486k4305k0870j7114j3753j1446r839q173o414n235n143
58984A216720o064p575r105j0128j0457j0219r448p975n869l460q91J959M894
58971A142382P361R192J0870J2745J4457J5458J5623J5087J3953J2422J0778R024
$$ y = [1066007, 1064018, 1065423, 1070591, 1078765, 1088000, 1096128, 1101561, 1103231, 1100295, 1092412, 1080323, 1065844, 1050992, 1036994, 1024138, 1012589, 1003151, 996998, 994696, 995772, 999213, 1004173, 1010214, 1017198, 1025001, 1033045, 1040185, 1045436, 1048918, 1051696, 1054670, 1058076, 1062162, 1067756, 1075848, 1087042, 1101707, 1120197, 1142566, 1168369, 1197086, 1228471, 1262327, 1298287, 1335973, 1374921, 1414109, 1452084, 1487833, 1520901, 1550189, 1573282, 1587677, 1592377, 1587844, 1574906, 1554468, 1527967, 1497274, 1464133, 1430151, 1397096, 1366498, 1339012, 1314707, 1293837, 1276723, 1262970, 1251524, 1241685, 1233512, 1227098, 1221863, 1216720, 1210656, 1203081, 1193976, 1183848, 1173391, 1163172, 1153724, 1145749, 1139880, 1136420, 1135529, 1137488, 1142382, 1149743, 1158935, 1169805, 1182550, 1197007, 1212465, 1228088, 1243175, 1257128, 1269550, 1280328, 1289352]
58959A289352P003N056L882L463K876J679P30R95K152L125L624M370O064Q700
58945A343071J1825J4927J7729K0493K3764K7607L1254L3798L4720L3585K9937
58934A622710K4215J8183J3649J0984R556R142J0075J2243J5033J8295K2486K7627
58922A814198L2870L7476M1774M6773N3182O1018O9867P9268Q8997R9085J09504
58911B534012J19909J29886J39274J47847J54854J59377J61205J60962J59315
58902C866641J56405J52225J47026J41214J35021J28512J21562J13659J03916
58893E066181R1468P5688N6047L2218M710k4809n4197q1769j06408j27174j43388
58882D788567j55239j63764j69956j74079j76000j75857j74129j71142j66891
$$ y = [1289352, 1296355, 1301411, 1305293, 1308756, 1311632, 1313311, 1314041, 1315036, 1317188, 1320313, 1323937, 1328307, 1334371, 1343071, 1354896, 1369823, 1387552, 1408045, 1431809, 1459416, 1490670, 1524468, 1559188, 1592773, 1622710, 1646925, 1665108, 1678757, 1689741, 1699297, 1708439, 1718514, 1730757, 1745790, 1764085, 1786571, 1814198, 1847068, 1884544, 1926318, 1973091, 2026273, 2087291, 2157158, 2236426, 2325423, 2424508, 2534012, 2653921, 2783807, 2923081, 3070928, 3225782, 3385159, 3546364, 3707326, 3866641, 4023046, 4175271, 4322297, 4463511, 4598532, 4727044, 4848606, 4962265, 5066181, 5157649, 5233337, 5289384, 5321602, 5326312, 5301503, 5247306, 5165537, 5059129, 4931955, 4788567, 4633328, 4469564, 4299608, 4125529, 3949529, 3773672, 3599543, 3428401, 3261510]
58873C261510j61316j54578j47005j38905j30450j21673j12682j03899r5894q8760
58863B006348q1941p4943o8018o1788n6349n1268m6378m1941l8004l4146l0043
58852A421529k5818k1588j7278j3111r711p387n704m113k480o65J789N000Q192
58839A328655J0446J1787J3041J4924J7588K0681K3473K5328K6594K8534L1833
58828A552884L5663L8765M0924M2594M3734M4047M4063M4915M7070N0168N4042
58817B038869N8990O5048P1728P8647Q5796R3300J01458J10680J20711J30232
58807B955459J38042J44389J50068J54618J56479J54755J49595J40892J27963
58798D272260J10839R0717O8824M5698K1809k141k5651m8108o7929q3158r3270
$$ y = [3261510, 3100194, 2945616, 2798611, 2659706, 2529256, 2407583, 2294901, 2191002, 2095108, 2006348, 1924407, 1849464, 1781446, 1719658, 1663309, 1612041, 1565663, 1523722, 1485718, 1451572, 1421529, 1395711, 1374123, 1356845, 1343734, 1334023, 1326636, 1320932, 1316819, 1314339, 1313674, 1315463, 1320463, 1328655, 1339101, 1350888, 1363929, 1378853, 1396441, 1417122, 1440595, 1465923, 1492517, 1521051, 1552884, 1588547, 1627312, 1668236, 1710830, 1754564, 1798611, 1842674, 1887589, 1934659, 1984827, 2038869, 2097859, 2162907, 2234635, 2313282, 2399078, 2492378, 2593836, 2704516, 2825227, 2955459, 3093501, 3237890, 3387958, 3542576, 3699055, 3853810, 4003405, 4144297, 4272260, 4383099, 4473816, 4542640, 4588338, 4610147, 4608006, 4582355, 4534247, 4466318, 4383160, 4289890]
58787D289890r9239j01664j00106r4637q6629p7398o7415n7813n1619n2323o1562
58776C439485p8317r9395j20101j35933j44846j47638j45741j39592j29708j17888
58766B180326j06121r4963q3978p3040o2335n1779m1417l1759k2885j3968m662
58755A593419L953J0866J6846K3273K9909L5243L8636M0669M1451M0131L6347
58744A910743L0969K5038J8824J2199N161k253r961j7543k4447l0549l5956m0318
58732A841907m2897m3455m2665m1507m0718m0681m1416m2539m3594m4402m4897
58721A373136m4812m3832m1898l9110l5497l1190k6489k1570j6401j1281o994
58710A054062m125k652k539m202p784j2417j6850k0492k3359k5325k6050k5472
$$ y = [4289890, 4190651, 4088987, 3988881, 3894244, 3807615, 3730217, 3662802, 3604989, 3553370, 3501047, 3439485, 3361168, 3261773, 3141672, 3005739, 2860893, 2713255, 2567514, 2427922, 2298214, 2180326, 2074205, 1979242, 1895264, 1822224, 1759889, 1708110, 1666693, 1634934, 1612049, 1598081, 1593419, 1597372, 1608238, 1625084, 1648357, 1678266, 1713509, 1752145, 1792814, 1834265, 1874396, 1910743, 1941712, 1966750, 1985574, 1997773, 2002934, 2000681, 1990720, 1973177, 1948730, 1918181, 1882225, 1841907, 1799010, 1755555, 1712890, 1671383, 1630665, 1589984, 1548568, 1506029, 1462435, 1418033, 1373136, 1328324, 1284492, 1242594, 1203484, 1167987, 1136797, 1110308, 1088738, 1072337, 1061056, 1054062, 1049937, 1047285, 1044746, 1040544, 1032760, 1020343, 1003493, 983001, 959642, 934317, 908267, 882795]
58698H82795k3833k1350j8240j4882j1534q116m427l70M097Q747J2758J5262J6426
58685H37333J7223J7974J8134J7824J8351K0434K3046K4980K6614K9074L2535
58674A083522L6623M1697M8335N6002O3491P0180P5394P6804P0917N5627L1707
58663A710299K291k8040n4325p3176q4251q9196q9407q5715p9603p3002o6596
58652I89279n9659n1815m3792l6250k9136k2669j7736j4682j2591j0409q122o284
58640F76134n006m039l314k870k503j894j004j23L79M16M30J123K703M715O800
58625F71947R166J1843J4098J5361J6250J7800K0034K2270K4493K7270L0473L3312
58613I14317L5688L8372M1629M4795M7497N0217N3136N5288N5536N3764N0658
$$ y = [882795, 858962, 837612, 819372, 804490, 792956, 784840, 780413, 780043, 784140, 792887, 805645, 820907, 837333, 854556, 872530, 890664, 908488, 926839, 947273, 970319, 995299, 1021913, 1050987, 1083522, 1120145, 1161842, 1210177, 1266179, 1329670, 1399850, 1475244, 1552048, 1622965, 1678592, 1710299, 1712590, 1684550, 1630225, 1557049, 1472798, 1383602, 1294195, 1208480, 1128877, 1055875, 989279, 929620, 877805, 834013, 797763, 768627, 745958, 728222, 713540, 700949, 690540, 682418, 676134, 671128, 667089, 663775, 660905, 658402, 656508, 655504, 655381, 655760, 656176, 656606, 657729, 660432, 665147, 671947, 681113, 692956, 707054, 722415, 738665, 756465, 776499, 798769, 823262, 850532, 881005, 914317, 950005, 988377, 1030006, 1074801, 1122298, 1172515, 1225651, 1280939, 1336475, 1390239, 1440897]
58602A440897M6727M1963L5983K8352J9074R124j8p541j3739j9224k4073k7815
58590A529710k9898l0030k8368k5397k1428j6391j0361l965K164P942J3416J8222
58578A405616K2153K5790K9764L3706L6770L8759L9765L8938L4863K7192J6959
58567A750275N204p668k1052l3678m4254n1947n6119n6478n3665m8965m3268l6929
58555A301456l0698k6008k4175k5751l0437l6876m2799m6425m7752m7763m6647
58544H96125m3922l9975l6037l2457k8435k3892k0169j8245j7313j5975j3960
58533F05745j1936j0332r104q193p551o945o118m904l169j050P92J865K712M315
58519E46127O564Q332R209J0107J1716J3406J4278J4498J4843J5487J5926J5759
$$ y = [1440897, 1487624, 1529587, 1565570, 1593922, 1612996, 1622120, 1622102, 1614561, 1600822, 1581598, 1557525, 1529710, 1499812, 1469782, 1441414, 1416017, 1394589, 1378198, 1367837, 1363872, 1366036, 1373978, 1387394, 1405616, 1427769, 1453559, 1483323, 1517029, 1553799, 1592558, 1632323, 1671261, 1706124, 1733316, 1750275, 1755479, 1747811, 1726759, 1693081, 1648827, 1596880, 1540761, 1484283, 1430618, 1381653, 1338385, 1301456, 1270758, 1244750, 1220575, 1194824, 1164387, 1127511, 1084712, 1038287, 990535, 942772, 896125, 852203, 812228, 776191, 743734, 715299, 691407, 671238, 652993, 635680, 619705, 605745, 593809, 583477, 574373, 566180, 558629, 551684, 545566, 540662, 537493, 536443, 537235, 539100, 541812, 546127, 552691, 561023, 570232, 580339, 592055, 605461, 619739, 634237, 649080, 664567, 680493, 696252]
58507F96252J5040J4129J3567J3812J4810J6107J7508J9248K1422K3646K5391
58496H90932K6255K5900K4183K1373J7830J3550Q493L117k038p113j2504j7823
58484I92155k2111k5113k7450k9499l0844l0967k9773k7430k4438k1778k0224
58473G02528j9413j8337j6724j5132j3810j2425j0900r597q565p393n884m148
58461E60200k174j16J277J483J200J460J977J615L18q28j340j715k018j655p56
58446E58928l09o07q60p19q17j389j739j462j039p89n23n06j362k578k618j103
58430E40508M77Q80O34P37J203J592J946K338K601L005M168N769O555O161N714
58415E84288N974O215N681M866M563M680M805M968N158N151N339O609Q825J0718
$$ y = [696252, 711292, 725421, 738988, 752800, 767610, 783717, 801225, 820473, 841895, 865541, 890932, 917187, 943087, 967270, 988643, 1006473, 1020023, 1028516, 1031633, 1029595, 1022482, 1009978, 992155, 970044, 944931, 917481, 887982, 857138, 826171, 796398, 768968, 744530, 722752, 702528, 683115, 664778, 648054, 632922, 619112, 606687, 595787, 586190, 577625, 570232, 564348, 560200, 558026, 557910, 559187, 560670, 561870, 563330, 565307, 566922, 567240, 566412, 565072, 563357, 561339, 559684, 558928, 558619, 558012, 557152, 556433, 555616, 554227, 552488, 551026, 549987, 549198, 548675, 548169, 546807, 544229, 541611, 540508, 540985, 541865, 542499, 543236, 544439, 546031, 547977, 550315, 552916, 555921, 560089, 565858, 572413, 578574, 584288, 590262, 596477, 602158, 607024, 611587, 616267, 621072, 626040, 631198, 636349, 641688, 648297, 657122, 667840]
58401F67840J1829J3246J5658J7993J8790J7657J4589R338K504l885q121j0246
58389G67192j1019j0513q673o193l889j962n42Nj03K8O35J034J089J602K636L039
58373G34366K376J799K085K374J834J129J115J526J993K984M504N399N097M694
58359G73275N114N608N368N131N704O300N913N199N389O273O752O517N952N293
58345H53788M963N741P450Q651Q708Q881J0211J1731J2154J1942J2295J3223J4130
58332I83868J5153J6456J7368J7502J7687J8463J8946J8379J7474J6883J5814
58321A173993J3696J1669J0851J0437R267P894P434P647P863Q512R980J1284J1567
58308A302094J1704J2742J4088J4868J5679J7183J8495J8868J9481K1586K4268
$$ y = [667840, 679669, 692915, 708573, 726566, 745356, 763013, 777602, 786940, 789444, 785559, 777438, 767192, 756173, 745660, 736987, 730794, 726905, 724943, 724401, 724406, 724303, 724331, 724966, 726000, 727089, 728691, 731327, 734366, 736742, 738541, 740626, 743000, 744834, 745963, 747078, 748604, 750597, 753581, 758085, 763484, 768581, 773275, 778389, 783997, 789365, 794496, 800200, 806500, 812413, 817612, 823001, 829274, 836026, 842543, 848495, 853788, 858751, 864492, 871942, 880593, 889301, 898182, 908393, 920124, 932278, 944220, 956515, 969738, 983868, 999021, 1015477, 1032845, 1050347, 1068034, 1086497, 1105443, 1123822, 1141296, 1158179, 1173993, 1187689, 1199358, 1210209, 1220646, 1229913, 1237807, 1245241, 1252888, 1260751, 1269263, 1279243, 1290527, 1302094, 1313798, 1326540, 1340628, 1355496, 1371175, 1388358, 1406853, 1425721, 1445202, 1466788, 1491056]
58297A491056K6076K7440K9367L1319L2527L4051L7193M1181M4760M8676N4186
58286A897832O0386O5523O9731P3919P7127P7636P5708P2620O7825N9800M9064
58275B647171L7868K7378J7384Q329J510k416l553k057J339N225R199J4300K0553
58262B782230K6114L0285L4964M1240M7163N1125N4701N9480O3987O6758O9699
58251C327746P4898Q0654Q4407Q7253R1758R7570J02983J08639J15691J22619
58241D294218J27935J33803J42641J52528J60426J67667J77358J88564J98369
58232E743509K07690K19698K34105K48414K63326K81565L02606L23847L45711
58223H170471L70544L98055M26911M59080M97405N40843N87392O39346P00156
$$ y = [1491056, 1517132, 1544572, 1573939, 1605258, 1637785, 1671836, 1709029, 1750210, 1794970, 1843646, 1897832, 1958218, 2023741, 2093472, 2167391, 2244518, 2322154, 2397862, 2470482, 2538307, 2598107, 2647171, 2685039, 2712417, 2729801, 2738130, 2739640, 2737224, 2733671, 2731614, 2732953, 2738178, 2747377, 2761677, 2782230, 2808344, 2838629, 2873593, 2914833, 2961996, 3013121, 3067822, 3127302, 3191289, 3258047, 3327746, 3402644, 3483298, 3567705, 3654958, 3746716, 3844286, 3947269, 4055908, 4171599, 4294218, 4422153, 4555956, 4698597, 4851125, 5011551, 5179218, 5356576, 5545140, 5743509, 5951199, 6170897, 6405002, 6653416, 6916742, 7198307, 7500913, 7824760, 8170471, 8541015, 8939070, 9365981, 9825061, 10322466, 10863309, 11450701, 12090047, 12790203]
58214A2790203P69039Q44621R30835J032907J151105J285572J443695J635344
58206B1883321J865365K139308K472541K885251L393645M014454M769871N675438
58198D9099194O731269P940978R333319J0949685J2817897J4954869J7383567
58191A29210778K0125327K3182536K6521566K9965263L2939331L4295083L2589632
58184C28829516K6860241J7357022N603755o277365j6440880k3835440k8235468
58177C03861381k9996103k9756135k8196803k5895151k3273998k0612209j8072417
58170A28058565j5731470j3613089j1714224j0019529q509649p166188n970636
58163E5333780m902823l945404l085393k304838j575500q70168j72534N31134
$$ y = [12790203, 13559242, 14403863, 15334698, 16367605, 17518710, 18804282, 20247977, 21883321, 23748686, 25887994, 28360535, 31245786, 34639431, 38653885, 43423756, 49099194, 55830463, 63771441, 73104760, 84054445, 96872342, 111827211, 129210778, 149336105, 172518641, 199040207, 229005470, 261944801, 296239884, 328829516, 355689757, 373046779, 378650534, 372373169, 355932289, 332096849, 303861381, 273865278, 244109143, 215912340, 190017189, 166743191, 146130982, 128058565, 112327095, 98714006, 86999782, 76980253, 68470604, 61304416, 55333780, 50430957, 46485553, 43400160, 41095322, 39519822, 38649654, 38477120, 39008254]
58155C9008254J259604K029192K857697L781304M810081N790417O320656N911851
58147G1769056M338014J857394r19283l378626n159858o179749o531907o391545
58139D9403496n950129n364849m737159m126244l567267l074005k641567k260612
58131A7681664j927145j638036j386787j168909r85082q35190p14525o18118n43408
58122G864464m86741m42530m07560l81142l59934l37858l12361k85793k59588
58113D590957k32185k03777j77773j55702j35046j13952r4304p8851o8811o5066
58103C265490o7946p4876q1757q7399r3298r8963j01521j00490r8732r7650r5357
58092B267501r0724q5442q0702p5386o8999o3257n9178n5487n1307m7842m5972
$$ y = [39008254, 40267858, 42297050, 45154747, 48936051, 53746132, 59536549, 65857205, 71769056, 76107070, 77964464, 77045181, 73666555, 68506697, 62326948, 55795041, 49403496, 43453367, 38088518, 33351359, 29225115, 25657848, 22583843, 19942276, 17681664, 15754519, 14116483, 12729696, 11560787, 10575705, 9740515, 9025990, 8407872, 7864464, 7377723, 6935193, 6527633, 6146491, 5786557, 5448699, 5136338, 4850545, 4590957, 4358772, 4154995, 3977222, 3821520, 3686474, 3572522, 3478218, 3399367, 3330556, 3265490, 3197544, 3122668, 3040911, 2953512, 2860214, 2761251, 2659730, 2559240, 2460508, 2362858, 2267501, 2176777, 2091335, 2010633, 1935247, 1866248, 1802991, 1743813, 1688326, 1637019, 1589177, 1543205]
58081A543205m4670m2922m1031l9116l6598l3949l2572l2144l0525k7176k4234
58070A158268k3224k3030k2150k0756j9448j7971j6350j5377j5095j4400j3037
58059I57430j2226j2562j2990j2697j2324j2512j2827j2883j3024j3188j2501
58048H17696j0771r025q004p353o721o389o339o037n466n209n276n139m914n159
58034G25894n463m832l537k968l489m121m450n069n859n641m068k164n57J211
58020F74887L188M596N446O970R684J2532J4687J6754J9446K2389K5009K7377
58008H42965K9475L0676L0647K9854K8572K6465K3552K0586J7975J5237J1892
57997A107896Q041L756j019n796r784j3020j6170j8961k0103j9014j6460j3131
$$ y = [1543205, 1498535, 1455613, 1414582, 1375466, 1338868, 1304919, 1272347, 1240203, 1209678, 1182502, 1158268, 1135044, 1112014, 1089864, 1069108, 1049660, 1031689, 1015339, 999962, 984867, 970467, 957430, 945204, 932642, 919652, 906955, 894631, 882119, 869292, 856409, 843385, 830197, 817696, 806925, 797900, 789896, 782543, 775822, 769433, 763094, 757057, 751591, 746382, 741106, 735967, 731053, 725894, 720431, 715599, 712062, 709094, 705605, 701484, 697034, 691965, 686106, 680465, 676397, 674233, 673676, 674887, 678075, 682671, 688117, 695087, 704771, 717303, 731990, 748744, 768190, 790579, 815588, 842965, 872440, 903116, 933763, 963617, 992189, 1018654, 1042206, 1062792, 1080767, 1096004, 1107896, 1115937, 1119693, 1118674, 1112878, 1103094, 1090074, 1073904, 1054943, 1034840, 1015826, 999366, 986235]
57985I86235q891l864J002N186R369J4248J9345K3511K5915K6092K3693J8599
57973A140440J0905Q19j0788k2018l0988l7266m1454m3714m3788m2177l9950l7290
57961H02731l3565k8863k4202k0086j6137j2279r015o305l404j14K921N430P911
57948F65023J0737J3786J7032K0359K2931K4082K4682K6143K8113K8789K7499
57937I09176K5261K2556J8496J2658N858j542j0276k0179k9289l6008m0748m4348
57925H11615m6271m5643m3027l9839l6753l3646l0427k6992k3033j8694j4826
57914D52464j1990r855p991o462n187l647j790l44L11O77J093J193Q48O60Q76
57899D10856Q53K32l66m65o31j507k900m401n954p198p354o526o040o647p360
$$ y = [986235, 977344, 973480, 974482, 979668, 989037, 1003285, 1022630, 1046141, 1072056, 1098148, 1121841, 1140440, 1151345, 1152164, 1141376, 1119358, 1088370, 1051104, 1009650, 965936, 922148, 879971, 840021, 802731, 769166, 740303, 716101, 696015, 679878, 667599, 658584, 652279, 648875, 648761, 651682, 657112, 665023, 675760, 689546, 706578, 726937, 749868, 773950, 798632, 824775, 852888, 881677, 909176, 934437, 956993, 975489, 988147, 994005, 992463, 982187, 962008, 932719, 896711, 855963, 811615, 765344, 719701, 676674, 636835, 600082, 566436, 536009, 509017, 485984, 467290, 452464, 440474, 430619, 422628, 416166, 410979, 407332, 405542, 405198, 405509, 406186, 407279, 408472, 409320, 409980, 410856, 411709, 411941, 411575, 411110, 410479, 408972, 406072, 401671, 395717, 388519, 381165, 374639, 368599, 361952, 354592]
57884C54592o994n849m877m108l016j724o86K24J336K335K775L029L869N350O867
57869C53123P925Q368Q182P621P135O676N648L897K106Q25k47j568l019m375n722
57854C96575o908p399p153o912p091p178o718n995n231m080k603j597j262n60
57840C25888J228L244M385M825N218N339M761M088M100M201L170J036r39k009
57826C68535k525l040l745m656n516n709n023m159l744l300j949L06K817N342
57812C33634P928J0255J2083J3989J6666J9815K2675K5208K7818L0194L1649L2266
57800E84180L2565L2192L0153K6322K1567J6332J0331L871j789n972r509j3485
57788G26758j7666k0804k2116k1936k1155k0511k0338k0627k1146k1493k1299
$$ y = [354592, 347598, 341749, 336872, 332764, 329748, 328024, 327338, 327562, 328898, 331233, 334008, 337037, 340906, 346256, 353123, 361048, 369416, 377598, 385219, 392354, 399030, 404678, 408575, 410681, 411506, 411259, 409691, 406672, 402297, 396575, 389667, 382268, 375115, 368203, 361112, 353934, 347216, 341221, 335990, 331910, 329307, 327710, 326448, 325888, 327116, 330360, 334745, 339570, 344788, 350127, 354888, 358976, 363076, 367277, 370447, 371483, 370544, 368535, 366010, 362970, 359225, 354569, 349053, 343344, 338321, 334162, 330418, 327118, 325169, 325475, 328292, 333634, 341562, 351817, 363900, 377889, 394555, 414370, 437045, 462253, 490071, 520265, 551914, 584180, 616745, 648937, 679090, 705412, 726979, 743311, 753642, 757513, 755724, 749752, 740243, 726758, 709092, 688288, 666172, 644236, 623081, 602570, 582232, 561605, 540459, 518966, 497667]
57777D97667k0566j9798j9490j9448j8982j7847j6501j5346j4289j3175j2064
57766C10161j0763q920o833n488n197n027m145k934k054j193K51J935L095L836
57752B66724M776N758O006N479M994M966M891M226L059J778O21l23j033j501j570
57737C08851j114n12m27p55n42N48J472J335Q54J261K365K987K924L146M126N207
57721C31726N789O062O416O906P497Q128Q492Q373Q216Q613R440J0203J1099J2807
57707D49767J5301J7725J9536K0898K1928K2373K2182K1716K1282K1154K1964
57696F75826K4309K7876L1707L5299L8822M2314M5410M7842M9472M9870M8674
57685A117421M6218M2958L8481L2201K4971J8822J4920J2905J2428J4058J8323
$$ y = [497667, 477101, 457303, 437813, 418365, 399383, 381536, 365035, 349689, 335400, 322225, 310161, 299398, 290478, 283645, 278157, 272960, 267933, 263788, 260854, 258800, 257607, 257858, 259793, 262888, 266724, 271500, 277258, 283264, 288743, 293737, 298703, 303594, 307820, 310879, 312657, 313278, 312955, 311922, 310421, 308851, 307737, 307225, 306798, 306043, 305501, 306049, 307521, 308856, 309710, 310971, 313336, 316323, 319247, 322393, 326519, 331726, 337515, 343577, 349993, 356899, 364396, 372524, 381016, 389389, 397605, 406218, 415658, 425861, 436960, 449767, 465068, 482793, 502329, 523227, 545155, 567528, 589710, 611426, 632708, 653862, 675826, 700135, 728011, 759718, 795017, 833839, 876153, 921563, 969405, 1018877, 1068747, 1117421, 1163639, 1206597, 1245078, 1277279, 1302250, 1321072, 1335992, 1348897, 1361325, 1375383, 1393706]
57674A393706K5074L4491M7547O4666Q4894J07293J32023J58277J80895J90168
57664B419034J76171J34519O9500p194q1221j40964j80605k00034k02848j94080
57654A792278j78402j59346j39525j20878j04213q9025p4675o1582n0532m1140
57644G72960l2140k3227j5456r526m750j84M332Q694J3173J7801K1892K5001K7708
57631H06278L0813L4176L7024L8858L9481L8557L5835L1484K5732J8473R839P25
57619A147275p789j5374k2326k8781l4467l8977m1918m3077m2696m1409l9662
57608G90799l7560l5343l3422l1674k9440k6674k4355k3134k2226k0488j8058
57597D88425j5978j4559j3166j1492j0072r351r051q767q548q550q561q174p199
$$ y = [1393706, 1418780, 1453271, 1500818, 1565484, 1650378, 1757671, 1889694, 2047971, 2228866, 2419034, 2595205, 2729724, 2799224, 2792030, 2710809, 2569845, 2389240, 2189206, 1986358, 1792278, 1613876, 1454530, 1315005, 1194127, 1089914, 1000889, 926214, 864632, 814100, 772960, 740820, 717593, 702137, 692611, 687861, 687677, 692009, 700703, 713876, 731677, 753569, 778570, 806278, 837091, 871267, 908291, 947149, 986630, 1025187, 1061022, 1092506, 1118238, 1136711, 1146550, 1147275, 1139486, 1124112, 1101786, 1073005, 1038538, 999561, 957643, 914566, 871870, 830461, 790799, 753239, 717896, 684474, 652800, 623360, 596686, 572331, 549197, 526971, 506483, 488425, 472447, 457888, 444722, 433230, 423158, 413807, 404756, 395989, 387441, 378891, 370330, 362156, 354957]
57584C54957n832m595m097m453m988m824l920l065k848k964k767k137j467j058
57570C05942q65p94r31j277j500j245o45j84R7Q13K313L855M337L781L372L917
57554C20986M872N281N070M885N137N806O941Q678J0843J3027J5118J7253J9311
57541D43208K0941K2279K4035K6620K9460L1608L2833L3673L4415L4461L2981
57530G66514K9940K6037K1694J6596J0440L646l075r509j5756k1399k5575k7963
57518G71590k9126k9638k9452k8428k7005k5804k4808k3473k1513j9247j7126
57507D95970j5306j3678j2192j0986j0246r842r241p955o075m187k740j753j109
57494C90660p20l00N27J644K320K090J554J881L603O160Q590J0471J2132J4105
$$ y = [354957, 349125, 344530, 340433, 335980, 330992, 326168, 322248, 319183, 316335, 313371, 310604, 308467, 307000, 305942, 305077, 304283, 303352, 302075, 300575, 299330, 298685, 298501, 298598, 299411, 301724, 305579, 309916, 313697, 317069, 320986, 325858, 331139, 336209, 341094, 346231, 352037, 358978, 367656, 378499, 391526, 406644, 423897, 443208, 464149, 486428, 510463, 537083, 566543, 598151, 630984, 664657, 699072, 733533, 766514, 796454, 822491, 844185, 860781, 871221, 874867, 871792, 862283, 846527, 825128, 799553, 771590, 742464, 712826, 683374, 654946, 627941, 602137, 577329, 553856, 532343, 513096, 495970, 480664, 466986, 454794, 443808, 433562, 423720, 414479, 406524, 400449, 396262, 393522, 391769, 390660, 389940, 389640, 390167, 391811, 394131, 396221, 397775, 399656, 403259, 409419, 418009, 428480, 440612, 454717]
57480D54717J6420J8578K0245K1823K3905K6285K8026K8626K8573K8431K7822
57469G23451K5803K1994J6887J1209N360o24o887j3430j9739k4911k8432l0694
57457F79987l2371l3432l3201l1451k8993k7026k6032k5522k4686k3151k1105
57446C73017j8858j6595j4553j3113j2364j1744j0570q912p526o861o576o162
57434B39183n628n278n238n420n646n564m790l452k280j869k092k459k720k806
57420A83941k566k040j654j729j961j819j304q78p62p73p20o06m46k59j29m0K41
57403A66496P67J152J075R09J328K342L194L347L029K748K589K259J595P97J97
57388A93824n3J9M05J219K363L285L425K951K602K676K700K284J828J915K493
$$ y = [454717, 471137, 489715, 509960, 531783, 555688, 581973, 609999, 638625, 667198, 695629, 723451, 749254, 771248, 788135, 799344, 804704, 804080, 797193, 783763, 764024, 739113, 710681, 679987, 647616, 614184, 580983, 549532, 520539, 493513, 467481, 441959, 417273, 394122, 373017, 354159, 337564, 323011, 309898, 297534, 285790, 275220, 266308, 258782, 251921, 245345, 239183, 233555, 228277, 223039, 217619, 211973, 206409, 201619, 198167, 195887, 194018, 191926, 189467, 186747, 183941, 181375, 179335, 177681, 175952, 173991, 172172, 170868, 169990, 169228, 168455, 167735, 167129, 166683, 166424, 166295, 166255, 166496, 167263, 168415, 169490, 170399, 171727, 174069, 177263, 180610, 183639, 186387, 188976, 191235, 192830, 193627, 193824, 193771, 193790, 194195, 195414, 197777, 201062, 204487, 207438, 210040, 212716, 215416, 217700, 219528, 221443, 223936]
57373B23936L122L607L882L691L031K490K480K426J552J93n23k18M35Q42R99P93
57357B52738p2j246j782j456j184j638k282k358k037j873j751j163j40Q07J409
57342B35972J664J510J138J226K139L167L357K930K995L908M793M845M326L976
57328B77946M125M717N599O377O469N757M923M683N026N500N916O355O709O808
57314C56910O847P264Q162R211J0111J0765J1036J0767J0210J0025J0576J1406
57302D73290J1709J1170J0133R016P846O413M663K829J133m39j964l215l668l096
57288E25820k046j421j541j843j626q42P3Q68J674K544L161L131K495J861J981
57273E34289L022M225M487L520K198J623K003K772L553M423N328N874N936N986
$$ y = [223936, 227058, 230665, 234547, 238238, 241269, 243759, 246239, 248665, 250217, 250410, 249887, 249669, 250104, 250946, 251945, 252738, 252666, 251420, 249638, 248182, 246998, 245360, 243078, 240720, 238683, 236810, 235059, 233896, 233756, 234563, 235972, 237636, 239146, 240284, 241510, 243649, 246816, 250173, 253103, 256098, 260006, 264799, 269644, 273970, 277946, 282071, 286788, 292387, 298764, 305233, 310990, 315913, 320596, 325622, 331122, 337038, 343393, 350102, 356910, 363757, 371021, 379183, 388394, 398505, 409270, 420306, 431073, 441283, 451308, 461884, 473290, 484999, 496169, 506302, 515318, 523164, 529577, 534240, 537069, 538202, 537763, 535799, 532584, 528916, 525820, 523774, 522353, 520812, 518969, 517343, 516501, 516574, 517442, 519116, 521660, 524821, 527952, 530447, 532308, 534289, 537311, 541536, 546023, 549543, 551741, 553364, 555367, 558139, 561692, 566115, 571443, 577317, 583253, 589239]
57259E89239O489P320Q053Q507Q690Q575Q330Q504R397J0426J0713J0285J0069
57246G04597J0589J1213J1118J0511J0346J1033J1974J2441J2379J2174J1993
57235H30368J1795J1777J2406J3831J5552J6838J7399J7559J7907J8777J9995
57224A004204K1015K1491K1673K2058K2631K2867K2725K3059K4540K6511K7767
57213A260541K8239K9065L0800L2557L3398L3740L4612L6053L7190L7682L8098
57202A631975L8819L9351L9122L8366L7807L7790L8080L8384L8696L9216M0109
57191B057715M1402M2950M4492M5750M6552M6934M7229M7921M9308N1279N3548
57180B575080N6120N9313O3244O7191O9538O8685O4435N8585N3770N1359N0588
$$ y = [589239, 595728, 603048, 611101, 619608, 628298, 636873, 645203, 653707, 663104, 673530, 684243, 694528, 704597, 715186, 726399, 737517, 748028, 758374, 769407, 781381, 793822, 806201, 818375, 830368, 842163, 853940, 866346, 880177, 895729, 912567, 929966, 947525, 965432, 984209, 1004204, 1025219, 1046710, 1068383, 1090441, 1113072, 1135939, 1158664, 1181723, 1206263, 1232774, 1260541, 1288780, 1317845, 1348645, 1381202, 1414600, 1448340, 1482952, 1519005, 1556195, 1593877, 1631975, 1670794, 1710145, 1749267, 1787633, 1825440, 1863230, 1901310, 1939694, 1978390, 2017606, 2057715, 2099117, 2142067, 2186559, 2232309, 2278861, 2325795, 2373024, 2420945, 2470253, 2521532, 2575080, 2631200, 2690513, 2753757, 2820948, 2890486, 2959171, 3023606, 3082191, 3135961, 3187320, 3237908]
57169C237908M9727M7788M4871M1446L7932L4810L2456L0714K9039K7202K5509
57158C639402K4222K3178K2123K1081K0134J9171J8096J7125J6595J6532J6630
57147C854289J6565J6164J5360J4213J2919J1688J0459Q903O794M331J933l40
57135C973278k924o070r267j1690j3218j4492j5841j6695j6428j5285j3971j2664
57123C824733j1022r017p018n188l327j385N27K665N569R372J3781J8847K5126
57110C863663L2778M1263N0282O0499P2832Q7666J05358J27146J54857J89883
57100D786227K33092K85597L49066M25107N14580O17221P31538Q55042R84926
57091I782396J118470J252566J383282J506223J617101J711412J783620J826842
$$ y = [3237908, 3287635, 3335423, 3380294, 3421740, 3459672, 3494482, 3526938, 3557652, 3586691, 3613893, 3639402, 3663624, 3686802, 3708925, 3730006, 3750140, 3769311, 3787407, 3804532, 3821127, 3837659, 3854289, 3870854, 3887018, 3902378, 3916591, 3929510, 3941198, 3951657, 3960560, 3967354, 3971685, 3973618, 3973278, 3970354, 3964284, 3955017, 3943327, 3930109, 3915617, 3899776, 3883081, 3866653, 3851368, 3837397, 3824733, 3813711, 3804694, 3797676, 3792488, 3789161, 3787776, 3788303, 3790968, 3796537, 3805909, 3819690, 3838537, 3863663, 3896441, 3937704, 3987986, 4048485, 4121317, 4208983, 4314341, 4441487, 4596344, 4786227, 5019319, 5304916, 5653982, 6079089, 6593669, 7210890, 7942428, 8797470, 9782396, 10900866, 12153432, 13536714, 15042937, 16660038, 18371450, 20155070, 21981912]
57083B1981912J832596J790434J689419J523178J295620J021382P19711M07335
57075C2261587R6235k04141m84757p37412r56408j139836j289797j411088j508141
57066B4626242j582153j631089j652431j645608j611887j553098j471522j371011
57058A2107443j257480j137861j018478r03987p97274o99890o12546n35400m68182
57049D676345m10379l61420l20512k86287k56972k31294k08987j90072j73800
57040B236622j58841j44585j31642j20746j11519j02764r3799q4983p6980o9922
57030A140841o3437n7215n1295m5943m1404l7703l4577l1609k8524k5267k1881
57019G01986j8429j5091j2158r752p676n639l542j389R73L769O940J0166J3346
$$ y = [21981912, 23814508, 25604942, 27294361, 28817539, 30113159, 31134541, 31854252, 32261587, 32357822, 32153681, 31668924, 30931512, 29975104, 28835268, 27545471, 26134383, 24626242, 23044089, 21413000, 19760569, 18114961, 16503074, 14949976, 13478454, 12107443, 10849963, 9712102, 8693624, 7789637, 6992363, 6292473, 5679927, 5144527, 4676345, 4265966, 3904546, 3584034, 3297747, 3040775, 2809481, 2600494, 2410422, 2236622, 2077781, 1933196, 1801554, 1680808, 1569289, 1466525, 1372726, 1287743, 1210763, 1140841, 1077404, 1020189, 968894, 922951, 881547, 843844, 809267, 777658, 749134, 723867, 701986, 683557, 668466, 656308, 646556, 638880, 633241, 629699, 628310, 629283, 633052, 639992, 650158, 663504]
57006F63504J6879K1341K7157L4711M4535N6987P1820Q8529J07223J28794J54121
56995A415601J83358K15888K49725K79528K95137K83922K37198J56542N5009m8014
56985C323894j34781j95145k27752k37368k31169k16206j98180j80610j64500
56976A538183j49181j33946j18935j04561r0796p7469o4980n4180m5576l9019
56966F59540l4055l0189k6838k3425j9722j5848j1917p924l994n47J945L143K760
56953D92929N90l174p780j2201j5629j7724j8540j8276j7092j5096j2547r852
56941C45608p244m578j613J543M551P272R851J2421J4994J7529J9770K1032K0527
56928D61663J7967J3505P240o85r345j7041k2428k5303k6122k5259k3235k1037
$$ y = [663504, 680383, 701724, 728881, 763592, 808127, 865114, 936934, 1025463, 1132686, 1261480, 1415601, 1598959, 1814847, 2064572, 2344100, 2639237, 2923159, 3160357, 3316899, 3371908, 3323894, 3189113, 2993968, 2766216, 2528848, 2297679, 2081473, 1883293, 1702683, 1538183, 1389002, 1255056, 1136121, 1031560, 940764, 863295, 798315, 744135, 698559, 659540, 625485, 595296, 568458, 545033, 525311, 509463, 497546, 489622, 485628, 485081, 487026, 490169, 492929, 493519, 490345, 482565, 470364, 454735, 437011, 418471, 400195, 383103, 368007, 355460, 345608, 338364, 333786, 332173, 333716, 338267, 345539, 355390, 367811, 382805, 400334, 420104, 441136, 461663, 479630, 493135, 500375, 499690, 490345, 473304, 450876, 425573, 399451, 374192, 350957, 329920]
56916C29920j9469j8267j6513j3914j1186r197q223q015q069p703o452m682l390
56903A94840l112l298l029k044p69L68J255J940K573L477M845O354P421P968Q647
56888B27436J0103J2157J3920J4555J3811J1844Q879N167J151k560n499p548q767
56875B94649r054q203o301l891j573M84K472M515O623Q983J1941J5521J9322K3090
56861C58578K6999L0919L3689L3702L0298K4088J5933O347l786j2611j8274k0434
56849E05448k0245j8949j6910j4030j0411o345j986K626P507J2802J8704K5151
56837D83362L1798L8472M5250N1771N6610N7717N3545M3734K9079J1349o898k2859
56825H72930l4520m1355m4157m4106m1961l8060l2950k7628k2841j8262j2889
$$ y = [329920, 310451, 292184, 275671, 261757, 250571, 241374, 233151, 225136, 217067, 209364, 202912, 198230, 194840, 191728, 188430, 185401, 183357, 182588, 182956, 184211, 186151, 188724, 192201, 197046, 203400, 210821, 218789, 227436, 237539, 249696, 263616, 278171, 291982, 303826, 312705, 317872, 319023, 316463, 310964, 303416, 294649, 285595, 277392, 271091, 267200, 265627, 266111, 268583, 273098, 279721, 288704, 300645, 316166, 335488, 358578, 385577, 416496, 450185, 483887, 514185, 538273, 554206, 560553, 556767, 544156, 525882, 505448, 485203, 466254, 449344, 435314, 424903, 418558, 416572, 419198, 426705, 439507, 458211, 483362, 515160, 553632, 598882, 650653, 707263, 764980, 818525, 862259, 891338, 902687, 895789, 872930, 838410, 797055, 752898, 708792, 666831, 628771, 595821, 568193, 545352, 527090, 514201]
56814E14201o422K86O399J2294J8900K6165L2793L7456L9454L8078L2238K1583
56802G73425P691o535j8776k8213l4864l8717l9836l8814l6542l3589l0026k5830
56790D49374k1181j6421j1865p668l741K44M590R225J3617J7035J8804J8386J5404
56777D85803R771J871p275j6046k2710k6357k7430k7149k6322k5008k3210k1365
56765B74573j9774j8045j5627j2767j0370q942q151p460o723o041n391m637l669
56752A46976k477j260n31p05j493k096k073j725j427j072n04k3m3m30o25l26K43
56735A30409N86L15n26j272j084J06J375J868J730J580J485J173Q98J281K307
56720A42231L299L967M662N430N642N008M291M384N185N893O078N888N512N005
$$ y = [514201, 507779, 508065, 514464, 526758, 545658, 571823, 604616, 642072, 681526, 719604, 751842, 773425, 781116, 774581, 755805, 727592, 692728, 654011, 614175, 575361, 538819, 505230, 475204, 449374, 428193, 411772, 399907, 392239, 388498, 388742, 393332, 402557, 416174, 433209, 452013, 470399, 485803, 495574, 497445, 490170, 474124, 451414, 425057, 397627, 370478, 344156, 319148, 295938, 274573, 254799, 236754, 221127, 208360, 197990, 189048, 180897, 173437, 166714, 160673, 155282, 150645, 146976, 144499, 143239, 142708, 142003, 140510, 138414, 136341, 134616, 133189, 132117, 131613, 131590, 131547, 131117, 130492, 130166, 130409, 130995, 131310, 130784, 129512, 128428, 128534, 129909, 131777, 133507, 135087, 136572, 137745, 138643, 139924, 142231, 145530, 149497, 154159, 159589, 165231, 170239, 174530, 178914, 184099, 189992, 196070, 201958, 207470, 212475]
56706B12475M509M150L806L338K886K572K138J368O77O91J319J844J953K125K742
56691B48593L409L471K796J778P86N8k19p4Q9j39p45j459k240l246m351n077n160
56674B38270m857m623m655m850m981m751l933k743j872j845k390k766k664k413
56660A88927k266j980j327o03k54k43k14j24j81k77l8N67J117J398J643J981K090
56643A90216J758J329J185J130P89K79l6k22n95j039j136r70j095j535j593r24
56627A87541k51l81j004j153o19j92l96o58j18J152K207K457K341K613L333L852
56611B00724L692K989K045R44r6m42L05J524K076J639J014R44J222J217P73J79
56595B20749l35o38n44j59p9o42j221q57M41J732K375K475K101J013m54j135l73
$$ y = [212475, 216984, 221134, 224940, 228278, 231164, 233736, 235874, 237242, 237919, 238610, 239929, 241773, 243726, 245851, 248593, 252002, 255473, 258269, 260047, 260833, 260891, 260672, 260598, 260687, 260548, 259803, 258344, 256104, 252858, 248507, 243430, 238270, 233413, 228790, 224135, 219285, 214304, 209553, 205620, 202877, 201005, 199160, 196770, 194004, 191340, 188927, 186661, 184681, 183354, 182751, 182497, 182254, 182040, 181916, 181735, 181458, 181420, 181987, 183104, 184502, 186145, 188126, 190216, 191974, 193303, 194488, 195618, 196407, 196686, 196650, 196428, 195833, 194794, 193658, 192688, 191593, 190058, 188465, 187541, 187290, 186909, 185905, 184752, 184133, 183941, 183545, 182887, 182769, 183921, 186128, 188585, 190926, 193539, 196872, 200724, 204416, 207405, 209450, 210394, 210298, 209856, 210161, 211685, 213761, 215400, 216414, 217358, 218580, 219797, 220570, 220749, 220414, 219776, 219232, 219073, 218994, 218352, 217131, 216274, 216715, 218447, 220822, 223297, 225398, 226411, 225957, 224822, 224449]
56578B24449Q90J261P36N23J175J812J460L87l75l03L21J066J776K450L059L582
56562B44269L975M139M036L842L803M018M431M906N250N241M854M293L681K907
56548C03645J951J081N28J42k49m48l31m83j627l397m477m226l477l273l476l316
56532B78567k779k565k884l175l083k899k834k519j683q03o22j282k278l121l735
56517B42305m272m839n370n682n639n285m757m163l707l722m252m690m315l209
56503A78403k229j911j905j669j200p69l83K5K37K3m05o24n14k22J51N08N93L25
56485A68434J52N85J485K165K200J791J410J389J799K392K753K797K951L522M014
56470A99839L592K211Q37M18R61J697J858J254L01m64r64j549k258k515j955j148
$$ y = [224449, 225339, 226600, 227336, 227859, 229034, 230846, 232306, 232693, 232318, 232015, 232336, 233402, 235178, 237628, 240687, 244269, 248244, 252383, 256419, 260261, 264064, 268082, 272513, 277419, 282669, 287910, 292764, 297057, 300738, 303645, 305596, 306677, 307205, 307347, 307098, 306650, 306319, 305836, 304209, 300812, 296335, 292109, 288632, 285359, 281883, 278567, 275788, 273223, 270339, 267164, 264081, 261182, 258348, 255829, 254146, 253343, 252721, 251439, 249161, 246040, 242305, 238033, 233194, 227824, 222142, 216503, 211218, 206461, 202298, 198591, 194869, 190617, 185927, 181612, 178403, 176174, 174263, 172358, 170689, 169489, 168720, 168337, 168362, 168599, 168622, 168217, 167593, 167079, 166857, 167008, 167516, 168109, 168434, 168586, 169171, 170656, 172821, 175021, 176812, 178222, 179611, 181410, 183802, 186555, 189352, 192303, 195825, 199839, 203431, 205642, 206479, 206897, 207858, 209555, 211413, 212667, 212968, 212504, 211540, 209991, 207733, 205218, 203263, 202115]
56454B02115r32j154r18M0R62J182Q84N21K04j0J63P23J086Q84O57J158K211K884
56436B12660K716K278K334K927L479L577L386L253L215L062K786K633K657K564
56422B53527K246K084K330K534K103J210N42K87N1l12n21o39j221k442l694m406
56406B53679m631m613m328l854l646m000m672n249n441m861l197j056J59k47j339
56391B02704j787j389q59n48k62N2K17K82L54K23l14r12j057q08o07n33l81k14
56373A94161k25j77K82Q30P15j87j157j558j378q53j02P24J393J859K219K401
56357A98947K237J892J743J881K008J890J590J302J294J791K578K931K424J586
56343B26094J275J602K061K455K930L225K801J852J373J913K859L229K741J848
$$ y = [202115, 201183, 200029, 199111, 199151, 200113, 201295, 202179, 202700, 202904, 202894, 203057, 203780, 204866, 205750, 206407, 207565, 209776, 212660, 215376, 217654, 219988, 222915, 226394, 229971, 233357, 236610, 239825, 242887, 245673, 248306, 250963, 253527, 255773, 257857, 260187, 262721, 264824, 266034, 266576, 266863, 266914, 266602, 266081, 265442, 264221, 261779, 258085, 253679, 249048, 244435, 240107, 236253, 232607, 228607, 223935, 218686, 213245, 208384, 205187, 204131, 204290, 204043, 202704, 200917, 199528, 198669, 198121, 197859, 197911, 198128, 198410, 198764, 198987, 198673, 197761, 196704, 195896, 195289, 194756, 194375, 194161, 193936, 193759, 194041, 194871, 195586, 195399, 194242, 192684, 191306, 190453, 190351, 191075, 192468, 194327, 196546, 198947, 201184, 203076, 204819, 206700, 208708, 210598, 212188, 213490, 214784, 216575, 219153, 222084, 224508, 226094, 227369, 228971, 231032, 233487, 236417, 239642, 242443, 244295, 245668, 247581, 250440, 253669, 256410, 258258]
56329B58258J196J128J400J266L45p13q84j20O48Q20P39Q86J234J680K318K996
56313B73197L252L066K999L300L543L559L913M825N374M618L080K168K429L183
56299C22506L770M288M901N227M781L682K557J869J548J267R42Q90J338J953K150
56284C63669J933J957K579L253L310K996L253M584O536Q332R575J0366J1051J2003
56270D45397J3423J5211J7118J8959K0681K2235K3631K5073K6824K8874L0831
56259F88257L2327L3438L4517L5569L5965L5076L3203L1528L0878L0703K9754
56248A051215K7649K5275K3428K1599J8607J4324J0095P132N015K257j741o039
56236A198816r599j2658j6078j9929k3558k6871l0458l4278l7268l8614l8697
$$ y = [258258, 259454, 260582, 261982, 263248, 263593, 262880, 261996, 261876, 262524, 263344, 264083, 264969, 266203, 267883, 270201, 273197, 276449, 279515, 282514, 285814, 289357, 292916, 296829, 301654, 307028, 311646, 314726, 316894, 319323, 322506, 326276, 330564, 335465, 340692, 345473, 349155, 351712, 353581, 355129, 356396, 357338, 358228, 359566, 361519, 363669, 365602, 367559, 370138, 373391, 376701, 379697, 382950, 387534, 394070, 402402, 411977, 422343, 433394, 445397, 458820, 474031, 491149, 510108, 530789, 553024, 576655, 601728, 628552, 657426, 688257, 720584, 754022, 788539, 824108, 860073, 895149, 928352, 959880, 990758, 1021461, 1051215, 1078864, 1104139, 1127567, 1149166, 1167773, 1182097, 1192192, 1199324, 1204339, 1206596, 1204855, 1198816, 1189217, 1176559, 1160481, 1140552, 1116994, 1090123, 1059665, 1025387, 988119, 949505, 910808]
56225I10808l8236l7328l5893l4318l2831l0860k7834k4255k1085j8510j6122
56214E93536j3957j2440j1522j0751j0009r383q536p090n425m157l119j811n90
56201D94746k28m40k15M35M57l07o33J86J294J748J825K162K623K892L256L960
56185E13761M493M365L959L867L985L889L570L193K684K184K268L049L693L488
56171E62448K925K963L694M409M661M630M730N349O654Q217R213R414R536J0266
56157F49109J1493J2921J4770J7276K0131K3063K6422L0555L5168M0053M5903
56146I26864N3604O3082P3736Q5632R9525J15733J33612J51963J69378J84237
56136B057366J94827J99395J96185J84205J64782J42007J20886J04734R4069Q7095
$$ y = [910808, 872572, 835244, 799351, 765033, 732202, 701342, 673508, 649253, 628168, 609658, 593536, 579579, 567139, 555617, 544866, 534857, 525474, 516938, 509848, 504423, 500266, 497147, 495336, 494746, 494518, 494078, 493863, 494298, 494755, 494448, 493815, 494001, 495295, 497043, 498868, 501030, 503653, 506545, 509801, 513761, 518254, 522619, 526578, 530445, 534430, 538319, 541889, 545082, 547766, 549950, 552218, 555267, 558960, 562448, 565373, 568336, 572030, 576439, 581100, 585730, 590460, 595809, 602463, 610680, 619893, 629307, 638843, 649109, 660602, 673523, 688293, 705569, 725700, 748763, 775185, 805740, 840908, 880961, 926864, 980468, 1043550, 1117286, 1202918, 1302443, 1418176, 1551788, 1703751, 1873129, 2057366, 2252193, 2451588, 2647773, 2831978, 2996760, 3138767, 3259653, 3364387, 3458456, 3545551]
56126C545551Q0716P1813N8690M1641K2302L002j3458k4832l1367l6346m3944
56115C673768n6721p5150r8308j23864j48117j67396j79599j84255j81794j73562
56105B285002j61737j48167j33512j18217j03595r0963q0151p0026o0227n1369
56095A267038m3769l7065l1011k5780k1400j7721j4877j3030j1662r906p592n335
56083A027890l581k157q17L60J291K125L028L956M747N284N706O408P628R037
56069A070905J0073J0692J1231J1690J1839J1973J2645J3532J3700J3195J3246
56058A204721J4413J5777J6498J7004J7893J8811J9287J9675K0358K0953K1190
56047A406580K1651K2782K4034K4844K5570K6669K7837K8774K9800L1023L1993
$$ y = [3545551, 3626267, 3698080, 3756770, 3798411, 3820713, 3823715, 3810257, 3785425, 3754058, 3717712, 3673768, 3617047, 3541897, 3443589, 3319725, 3171608, 3004212, 2824613, 2640358, 2458564, 2285002, 2123265, 1975098, 1841586, 1723369, 1619774, 1528811, 1448660, 1378634, 1318407, 1267038, 1223269, 1186204, 1155193, 1129413, 1108013, 1090292, 1075415, 1062385, 1050723, 1040817, 1033225, 1027890, 1024309, 1022152, 1021335, 1021695, 1022986, 1025111, 1028139, 1032095, 1036842, 1042126, 1047832, 1054240, 1061868, 1070905, 1080978, 1091670, 1102901, 1114591, 1126430, 1138403, 1151048, 1164580, 1178280, 1191475, 1204721, 1219134, 1234911, 1251409, 1268413, 1286306, 1305117, 1324404, 1344079, 1364437, 1385390, 1406580, 1428231, 1451013, 1475047, 1499891, 1525461, 1552130, 1579967, 1608741, 1638541, 1669564, 1701557]
56036A701557L2794L4225L6160L7251L7165L7448L9065M0766M1309M1561M2773
56025B122074M4402M5418M6377M8245N0513N2343N4364N7438O0810O3367O5535
56014B710886O8176P0886P3273P6480Q1394Q6758R1130R5214J00143J05078J09048
56003C668466J13474J20087J27763J34378J40407J47735J56062J63661J70613
55994D942646J78235J86278J93772K01711K11883K23984K36777K50915K67633
55985F893834K86115L05321L26881L52688L81394M11017M43238M81098N24320
55976A0405906N71193O23154O82931P50165Q23911R07533J006030J120795J252549
55967A8144167J407034J591987J811743K071984K387223K776799L257177L845426
$$ y = [1701557, 1734351, 1768576, 1804736, 1841987, 1879152, 1916600, 1955665, 1996431, 2037740, 2079301, 2122074, 2166476, 2211894, 2258271, 2306516, 2357029, 2409372, 2463736, 2521174, 2581984, 2645351, 2710886, 2779062, 2849948, 2923221, 2999701, 3081095, 3167853, 3258983, 3354197, 3454340, 3559418, 3668466, 3781940, 3902027, 4029790, 4164168, 4304575, 4452310, 4608372, 4772033, 4942646, 5120881, 5307159, 5500931, 5702642, 5914525, 6138509, 6375286, 6626201, 6893834, 7179949, 7485270, 7812151, 8164839, 8546233, 8957250, 9400488, 9881586, 10405906, 10977099, 11600253, 12283184, 13033349, 13857260, 14764793, 15770823, 16891618, 18144167, 19551201, 21143188, 22954931, 25026915, 27414138, 30190937, 33448114, 37293540]
55959C7293540M563776N429381O445208P615391Q966223J0537943J2360373J4451988
55951A07663823J6835448J9533740K2556915K5892346K9414024L2632060L4463805
55944B88992161L3423189K8360031J9283019P572809m617571j5292181k3235932
55937C34485525k8110799l0220296l0200889k8762551k6517325k3912614k1243383
55930A45517668j8685950j6325264j4186004j2267970j0565775r069382p764158
55923E6653165o636876n675919m864561m180659l604332l120692k715089k371921
55915B3483116k079526j831267j620750j440075j283269j147377j029381r25552
55907A2125919q33996p54398o84966o22658n66356n16722m72998m32934l95814
$$ y = [37293540, 41857316, 47286697, 53731905, 61347296, 70313519, 80851462, 93211835, 107663823, 124499271, 144033011, 166589926, 192482272, 221896296, 254528356, 288992161, 322415350, 350775381, 370058400, 377631209, 373013638, 357721457, 334485525, 306374726, 276154430, 245953541, 217190990, 190673665, 166761051, 145517668, 126831718, 110506454, 96320450, 84052480, 73486705, 64417323, 56653165, 50016289, 44340370, 39475809, 35295150, 31690818, 28570126, 25855037, 23483116, 21403590, 19572323, 17951573, 16511498, 15228229, 14080852, 13051471, 12125919, 11291923, 10537525, 9852559, 9229901, 8663545, 8146823, 7673825, 7240891, 6845077]
55898F845077l62693l33620l07235k83038k61516k42180k23798k06339j90597
55889D434061j76265j62490j49635j38344j27649j16279j05095r5854q8254q0543
55879C193653p2399o4865n8199n2277m8434m8382n1651n6413o2123o8992p5542
55868B534376p9518q0872q1316q1116p8914p4452o9043o3328n6932n0272m4338
55857A774275l8684l1859k3916j6346r555k545M841J1405J6204J8558J6631Q430
55845A727439n355k1402l6723m9820n9277o3836o4235o2672o0070n5835n0420
55834A197794m5688m2194l8485l3795k9331k6060k3223k0098j7308j5366j3520
55823H92726j1166q958p558o521n374m544m399m436m253m323n091o247p382q542
$$ y = [6845077, 6482384, 6148764, 5841529, 5558491, 5296975, 5054795, 4830997, 4624658, 4434061, 4257796, 4095306, 3945671, 3807327, 3679678, 3563399, 3458304, 3362450, 3274196, 3193653, 3121254, 3056389, 2998190, 2945913, 2897479, 2849097, 2797446, 2741033, 2678910, 2609918, 2534376, 2454858, 2373986, 2292670, 2211554, 2132640, 2058188, 1989145, 1925817, 1868885, 1818613, 1774275, 1735591, 1703732, 1679816, 1663470, 1653915, 1651370, 1656211, 1667616, 1683820, 1702378, 1719009, 1727439, 1722084, 1700682, 1663959, 1614139, 1554862, 1491026, 1426791, 1364119, 1304049, 1248214, 1197794, 1152106, 1109912, 1071427, 1037632, 1008301, 982241, 959018, 938920, 921612, 906246, 892726, 881560, 872602, 865044, 858523, 853149, 848605, 844206, 839770, 835517, 831194, 826103, 819856, 812474, 803932]
55809H03932r686j0566j1383j2555j3581j3370j1930j0445r382p886n489l038
55797F84621j235L65K279M244O114Q435J1252J3344J3422J1315P511K507k834
55784G61340p430j1167j5026j9353k2976k4725k4957k4802k4760k4720k4609k4156
55772E12659k2800k0539j8368j7116j6392j5288j3565j1622r803q391p719p711
55760C43345p662o980n827m753m095m037m685n722o433o394n808m965l917k812
55746B69255k017j611j298r56p77p75p82r86j723k630k852k319j943k237k574
55731B43775k307j817j853k410k867k837k448k082k069k402k649k456k083j942
55717B11553j772r78K75J123J270J331J852K786M029N605P104P923Q160Q449Q699
$$ y = [803932, 794246, 783680, 772297, 759742, 746161, 732791, 720861, 710416, 701034, 693148, 687659, 684621, 683386, 683751, 686030, 690274, 696388, 704823, 716075, 729419, 742841, 754156, 761667, 764174, 761340, 753910, 742743, 727717, 708364, 685388, 660663, 635706, 610904, 586144, 561424, 536815, 512659, 489859, 469320, 450952, 433836, 417444, 402156, 388591, 376969, 367166, 358775, 351056, 343345, 335683, 328703, 322876, 318123, 314028, 309991, 305306, 299584, 293151, 286757, 280949, 275984, 272067, 269255, 267238, 265627, 264329, 263373, 262596, 261821, 261039, 260053, 258330, 255700, 252848, 250529, 248586, 246349, 243775, 241468, 239651, 237798, 235388, 232521, 229684, 227236, 225154, 223085, 220683, 218034, 215578, 213495, 211553, 209781, 208803, 209078, 210201, 211471, 212802, 214654, 217440, 221469, 227074, 234178, 242101, 250261, 258710, 267409]
55702B67409Q103O620N287M569L556J428j235l352m793o157p665q946r437q696
55688B46691o832m929m292m845n080l919j868J16J895L712N354O524P362Q002
55674B47891Q312Q575R643J1704J3717J4807J5437J6311J6981J6559J5247J3950
55662D09134J2744J0841P888M424J084j856m228n948p207q132q383p571n942m135
55648C92713k454q49N67J480J722J262M0j889m210o679r342j2193j4857j6917
55634C28394j8222j8652j8066j6724j5238j3829j2173j0256q722p946p433o716
55622A74417o154o172o331n917m973m008l126k227j634j731k224k489k387k113
55608A22931j556n77L71O84N15M60N75M47R5lK43M04L10K46L55M71O33J143J894
$$ y = [267409, 275512, 282132, 287419, 291988, 295544, 296972, 295737, 292385, 287592, 281435, 273770, 264824, 255387, 246691, 239859, 234930, 230638, 225793, 220713, 216794, 214926, 215042, 216937, 220649, 226003, 232527, 239889, 247891, 256203, 264778, 274421, 286125, 299842, 314649, 330086, 346397, 363378, 379937, 395184, 409134, 421878, 432719, 440607, 445031, 446115, 444259, 440031, 434083, 426876, 418744, 410361, 402790, 396848, 392713, 390259, 389410, 389977, 391457, 393179, 394441, 394481, 392592, 388382, 381703, 372361, 360168, 345311, 328394, 310172, 291520, 273454, 256730, 241492, 227663, 215490, 205234, 196512, 188566, 181133, 174417, 168263, 162091, 155760, 149843, 144870, 140862, 137736, 135509, 133875, 132144, 129920, 127431, 125044, 122931, 121375, 120798, 121169, 121853, 122368, 122828, 123403, 123850, 123945, 123942, 124185, 124589, 124899, 125145, 125500, 125971, 126604, 127747, 129641]
55589A29641K190J513K08q50j033l79O09J462K096K635K960K867K656L090M456
55574A54121O074P143P689Q285R230J0362J1285J1380R960P026L502K67k701n720
55560B37903q417j0045j0525j0559j0777j1223j1556j1293j0162q608p599p443
55548A19696p241o088m313k880j984j099n3Q65J583K126K126J377P99J666L841
55533A10421N754O385O298O535P329Q283R080R570R745R930J0509J1272J1569
55520B22680J1223J0588R552P310L580p06m423p492j0491j3427j5490j5966j5001
55507A81937j3541j2612j2425j2155j0890q840p108o287n852n193m500m124l749
55494G4661k877j861j635k421l280l167k025p33j28k57n55o13o35j050j750k119
$$ y = [129641, 131831, 133344, 133552, 132702, 131669, 131290, 131899, 133361, 135457, 138092, 141052, 143919, 146575, 149665, 154121, 160195, 167338, 175027, 183312, 192542, 202904, 214189, 225569, 235529, 242555, 246057, 246324, 243623, 237903, 229486, 219441, 208916, 198357, 187580, 176357, 164801, 153508, 143346, 134738, 127139, 119696, 112455, 106367, 102054, 99174, 97190, 96091, 96038, 96903, 98486, 100612, 102738, 104115, 104914, 106580, 110421, 116175, 122560, 128858, 135393, 142722, 151005, 160085, 169655, 179400, 189330, 199839, 211111, 222680, 233903, 244491, 254043, 261353, 264933, 264227, 259804, 252312, 241821, 228394, 212904, 196938, 181937, 168396, 155784, 143359, 131204, 120314, 111474, 104366, 98079, 92227, 87034, 82534, 78410, 74661, 71784, 69923, 68288, 65867, 62587, 59420, 57395, 56662, 56534, 56277, 55722, 55109, 54474, 53424, 51674, 49555]
55478D9555j823j257r93j029r34n29j46k11p22j205j158n14K55O02L93o2m34o28
55460C9160p28r07j320j866k069j544n65J40K60J80L22O11Q28J047J365J454R43
55443C7311J00l67k22J6j67n57n72q5M28N76N40P91J387J790J481O47L7J16N41
55424D3791O60L83J88K77K47j53l41L93J756K632K487J944J757J814J618J187
55408F0640Q41M84j85r55j294j210j220j465j502j202j111j606k232k262j595
55393D4126p03p2M2m32j276k016k308k158j703j041m36l08p46j281j378r59l19
55376B7032K26M95M56K57N8j62m09m02N0N27M26r2k91k2Q8k39m33p1M30N42L68
55355B8834J99L3l0L53R65Q92j67j210j259o68k70l3M28P24K78m12l48L80P24
$$ y = [49555, 47732, 46475, 45482, 44453, 43519, 42990, 42844, 42633, 41911, 40706, 39548, 39034, 39289, 39891, 40284, 40222, 39788, 39160, 38432, 37525, 36205, 34339, 32270, 30726, 30161, 30301, 30561, 30741, 31063, 31674, 32502, 33549, 34914, 36368, 37311, 37411, 37044, 36822, 36838, 36671, 36114, 35542, 35457, 35885, 36461, 37001, 37792, 39179, 40969, 42450, 43097, 43134, 43250, 43791, 44451, 44834, 45022, 45299, 45546, 45393, 45052, 45445, 47201, 49833, 52320, 54264, 56021, 57835, 59453, 60640, 61481, 61965, 61780, 60825, 59531, 58321, 57101, 55636, 54134, 52932, 51821, 50215, 47983, 45721, 44126, 43423, 43351, 43393, 42961, 41685, 39669, 37361, 35203, 33500, 32459, 32023, 31715, 30969, 29688, 28310, 27351, 27032, 27258, 27753, 28209, 28466, 28524, 28362, 27953, 27551, 27601, 28128, 28554, 28462, 28171, 28149, 28237, 27998, 27565, 27494, 27924, 28466, 28834, 29033, 29066, 29036, 29389, 30354, 31246, 31079, 29869, 28610, 27942, 27672, 27639, 28067, 28791, 29069, 28657, 28309, 28689, 29413]
55336B9413K70l46n74m79j83K51L90j44q63r13l10J91L65N96Q20N84K00N82J633
55317C1483K086J389N51N51R36P46k9p12r97j019q67o80p48j085j278j165j065
55300B8097j051o28L40J072Q62M8n38p00p76q83q33n40n5N37R32P48J75q7J16
55281B6836L4p23j336r12J69R29J265J713K129J758N89m48p36n84m31k72q8j06
55263B9786l05l40j77k45o07o77j30M80M86J9l70n02n20l48J03M67L10j12j23
55244B7195K70K86m62j311j380o23L92J198J504R46m34j704j831j011m21n68o07
55227B1439K56J437J779J176N78O16R37R84P42M96L23R8k41n96p42m80K7K21k40
55208B8810q94r17j96M93M80n0m64m52j28L65R31J322J185M96k43m09M3M26P7
$$ y = [29413, 29683, 29337, 28763, 28284, 28101, 28352, 28742, 28598, 27735, 26822, 26512, 26703, 27068, 27664, 28484, 29068, 29268, 29850, 31483, 33569, 34958, 35509, 36060, 36996, 37742, 37713, 37001, 36004, 34985, 34118, 33438, 32690, 31605, 30327, 29162, 28097, 27046, 26418, 26758, 27830, 28692, 28740, 28202, 27502, 26726, 25843, 25010, 24470, 24415, 24952, 25884, 26632, 26807, 26720, 26836, 26870, 26147, 24811, 23899, 24068, 24997, 26262, 27975, 30104, 31862, 32451, 32003, 31267, 30683, 30252, 29980, 29892, 29786, 29481, 29141, 28964, 28719, 28112, 27435, 27305, 27785, 28271, 28290, 27920, 27418, 26898, 26550, 26653, 27120, 27430, 27318, 27195, 27465, 27751, 27289, 25978, 24598, 23975, 24367, 25565, 27069, 28015, 27581, 25877, 24046, 23035, 22614, 22046, 21439, 21695, 23132, 24911, 26087, 26665, 27281, 28218, 29202, 29944, 30440, 30763, 30861, 30620, 30024, 29282, 28802, 28829, 29050, 28810, 27916, 26999, 26803, 27296, 27776, 27726, 27262, 26810, 26682, 27047, 27978, 29300, 30485, 30981, 30738, 30329, 30372, 30798, 30875]
55189C0875q22j413j227o70k77nL56N72L48L5K28P44P74L1q55j279j306j196q33
55170B4080k2J031J842K023J397O6j384k099j684n81L54N44np46r68m45K55M26
55152B4084K02L32R79J370Q75p7n95m17M1M63R23J455J753J495P70J30J25P72
55134C4680J535J930K047K264K642K873K734K276J595Q49M35P05J389J702J162
55119F0818J04p18q09k81K47R9q27j889k414k463k505k583k264j348j26J017J791
55102D5849J907J297M79N4r4n61j393j912j677r78l01J23J43k97q50j024q31n96
55084C9338k62M49J158J160O18N12J068J299N18o43j241j180p97j64N28O61K3
55067D3045o59p42o02q42j215j073l91L96J095J613J572Q62J19QL33N66P40J133
$$ y = [30875, 30053, 28640, 27413, 26743, 26466, 26461, 26817, 27389, 27737, 27772, 28000, 28744, 29518, 29549, 28694, 27415, 26109, 24913, 24080, 24058, 25089, 26931, 28954, 30351, 30417, 29033, 26934, 25250, 24669, 25023, 25567, 25562, 24816, 23848, 23403, 23658, 24084, 24286, 24618, 25597, 26967, 27842, 27765, 27170, 26753, 26794, 27257, 28180, 29635, 31388, 32883, 33653, 33783, 33908, 34680, 36215, 38145, 40192, 42456, 45098, 47971, 50705, 52981, 54576, 55425, 55860, 56565, 57954, 59656, 60818, 60922, 60204, 59395, 59114, 59361, 59460, 58633, 56744, 54330, 51867, 49362, 46779, 44515, 43167, 43041, 44058, 45849, 47756, 49053, 49532, 49586, 49492, 48931, 47538, 45626, 43949, 42971, 42670, 42793, 42936, 42639, 41789, 40765, 39934, 39338, 39076, 39525, 40683, 41843, 42461, 42973, 44041, 45340, 45858, 45215, 43974, 42794, 41997, 41833, 42361, 43022, 43045, 42386, 41644, 41042, 40200, 38985, 37912, 37521, 37917, 39012, 40625, 42197, 43059, 43178, 43186, 43519, 44085, 44825, 45958]
55049D5958J516J542J477J724J952J637J139J331K245L018L197L196L412L623
55035G6967L467K926K160J285L93m99j429k161k118j127N6M71M4n41q67j086j397
55018G6544j753k073k226k045j673j702k384k972k524j140J53O31L98q1l94k56
55002E6503K35N48M17L89R95J745J690Q95M30Q60J555J673J152M22k28p37j018
54985F7526r10j98J227L042M511N144N205N199N249N330N770O881Q379R811J1374
54970A43540J3576J6328J8995K1168K2727K3298K2432K0194J6917J2608P342J957
54958C41082k579o349j0045j3510j5810j6839j7645j8805j9516j8811j6834j4468
54946A69871j2334j0663r473q449p099n371l736k519j607q72k40P13K430M477
$$ y = [45958, 47474, 49016, 50493, 52217, 54169, 55806, 56945, 58276, 60521, 63539, 66736, 69932, 73344, 76967, 80434, 83360, 85520, 86805, 87198, 86699, 85270, 83109, 80991, 79864, 79920, 80391, 80435, 79894, 79027, 77941, 76544, 74791, 72718, 70492, 68447, 66774, 65072, 62688, 59716, 57192, 56052, 56205, 56836, 57234, 57153, 56759, 56503, 56738, 57286, 57703, 58092, 59087, 60832, 62522, 63417, 63847, 64707, 66262, 67935, 69087, 69509, 69281, 68544, 67526, 66616, 66418, 67645, 70687, 75198, 80342, 85547, 90746, 95995, 101325, 107095, 113976, 122355, 132166, 143540, 157116, 173444, 192439, 213607, 236334, 259632, 282064, 302258, 319175, 331783, 339125, 341082, 338503, 332154, 322109, 308599, 292789, 275950, 258305, 239500, 219984, 201173, 184339, 169871, 157537, 146874, 137401, 128952, 121853, 116482, 112746, 110227, 108620, 107748, 107508, 108221, 110651, 115128]
54932A15128N742N851N691O201P421Q994J0920J3253J5701J7855J9381J9742J8387
54919B70267J5503J1883P824K871k929q477j2787j5944j8268j9449j9237j8317
54907A92940j7495j6543j4789j2440j0359q791p273n755m803m577m416l766k883
54894G9050k252j766r61J46R54J048P91P99R82O07n63j677j833j328j180j651
54878G1166k078k144k297k700k732k046j305j216j470j361r38p72r66j086q63
54863D7192l97J83P14R12P96R03J487J803R20q18j913j426l3Q68P02Q4j12K61
54845E2126N51J77o45j199j157q59o65m87j46K49N27P53R41Q62N24M86J175K155
54827E5368K661K730L149M191N118N247N110N935Q061J0392J1712J2228J3182
$$ y = [115128, 120870, 126721, 132412, 138613, 146034, 155028, 165948, 179201, 194902, 212757, 232138, 251880, 270267, 285770, 297653, 305477, 308348, 305419, 296942, 284155, 268211, 249943, 230494, 211257, 192940, 175445, 158902, 144113, 131673, 121314, 112523, 105250, 99495, 94692, 90115, 85699, 81933, 79050, 76798, 75032, 74071, 74217, 75171, 76219, 77010, 77809, 78791, 79398, 78835, 77158, 75325, 73997, 72817, 71166, 69088, 66944, 64647, 61947, 59215, 57169, 55864, 54648, 53178, 51817, 50879, 50107, 49141, 48055, 47192, 46795, 46978, 47692, 48604, 49400, 50303, 51790, 53593, 54513, 53695, 51782, 50356, 50323, 51191, 51893, 51977, 51865, 52126, 52677, 52854, 52209, 51010, 49853, 48994, 48329, 47842, 47696, 47945, 48472, 49225, 50166, 51028, 51552, 52038, 53213, 55368, 58029, 60759, 63908, 68099, 73217, 78464, 83574, 89509, 97570, 107962, 119674, 131902, 145084]
54814A45084J5090J7035J8009J8273J8715J9291J8915J6715J2697P325J307m185
54802C04271q119j0672j2938j5223j6510j5969j4242j2619j1611j0838r834q439
54790A57257o863n756n678o124n767m106k193j137o14L67J891L289M371N586P136
54775A41659Q839J0657J2708J4909J7155J9602K2118K3854K4192K3751K3522K3196
54763C66162K1326J7235J1861O514J556l399q544j3481j7489k0034k1269k1901
54751C18537k2364k2355k1534k0235j8956j7519j5554j3466j2070j1303j0221
54740A32960q379o417n110m500m152l708k950j862p67l2L52M92J06j015k127k038
54724I0853o81O24P82J68r9M48J351J888J669Q79J43m4R8L2k57l29j75l52j008
$$ y = [145084, 160174, 177209, 195218, 213491, 232206, 251497, 270412, 287127, 299824, 307149, 308456, 304271, 296152, 285480, 272542, 257319, 240809, 224840, 210598, 197979, 186368, 175530, 165696, 157257, 150394, 144638, 138960, 132836, 127069, 122963, 120770, 119633, 119019, 119386, 121277, 124566, 128937, 134523, 141659, 150498, 161155, 173863, 188772, 205927, 225529, 247647, 271501, 295693, 319444, 342966, 366162, 387488, 404723, 416584, 423098, 424654, 421255, 412711, 399230, 381741, 361707, 340438, 318537, 296173, 273818, 252284, 232049, 213093, 195574, 180020, 166554, 154484, 143181, 132960, 124581, 118164, 113054, 108554, 104402, 100694, 97744, 95882, 95115, 95083, 95435, 95927, 96033, 95018, 92891, 90853, 90172, 90796, 91578, 91746, 91647, 92095, 93446, 95334, 97003, 97882, 98025, 97981, 98079, 98111, 97854, 97525, 97350, 96998, 95990]
54705I5990j463j131l05L00L82N5n23j174j622j714j553j275r72q83j199j645
54689H1268j689j194m45N00J704K544K017K92r26l10J470K742K877K505K202J957
54673I7514J733J641J576J379J418K206L458M235M221M174M851O111P426Q675
54659A50618R970J1127J1928J2708J4067J6019J7922J9321K0440K1646K2694K2823
54647C51283K1399J8251J3504P452O48o175j2421j7725k1692k3786k3797k2341
54635B84600k0592j9370j8586j7532j5704j3310j1083r524q364o927n026l238
54623A35344k144j655j370j300j727k486k881k419j346l35J33M9j36R9P66J174
54607A19766P18k55p97o19l68m96m83L26J524J941J091k59j073j156j055j137
$$ y = [95990, 94527, 93396, 93091, 93391, 93773, 93828, 93305, 92131, 90509, 88795, 87242, 85967, 84995, 84112, 82913, 81268, 79579, 78385, 77940, 78440, 80144, 82688, 84705, 84997, 84071, 83761, 85231, 87973, 90850, 93355, 95557, 97514, 99247, 100888, 102464, 103843, 105261, 107467, 110925, 115160, 119381, 123555, 128406, 134517, 141943, 150618, 160588, 171715, 183643, 196351, 210418, 226437, 244359, 263680, 284120, 305766, 328460, 351283, 372682, 390933, 404437, 411889, 412537, 406362, 393941, 376216, 354524, 330738, 306941, 284600, 264008, 244638, 226052, 208520, 192816, 179506, 168423, 158899, 150535, 143608, 138582, 135344, 133200, 131545, 130175, 128875, 127148, 124662, 121781, 119362, 118016, 117681, 117814, 117863, 117727, 117826, 118592, 119766, 120484, 120229, 119432, 118813, 118445, 117949, 117466, 117792, 119316, 121257, 122348, 122089, 121016, 119860, 118805, 117668]
54591A17668j216j057q19p37p02n03l87q37j728k264j988j384j097j027p91o21
54575A00510j049j897k379k184j740j293n54N28J311J253O14k0m32o57o11k96
54559I1104l7rJ96J007K182L076L486L754M058M103L697L233L434M647O501Q202
54543A42634R156R419R573J0166J1243J2303J2637J1863J0228Q311O298L799N36
54530B58166l028o157q619j0533j1700j1767j1029j0260r713q957p875o974o420
54517A45134n660m445l431l106k826j794m14K74J47K5L58P71R45J056J234J300
54501A29568J238J264J285Q79K7o59p07l07J16M12N42L81n3n03q15j061j184r72
54483A29451n96o62j387k138k271k016k060k479k765k682k519k405k054j352p15
$$ y = [117668, 116452, 115395, 114576, 113839, 113137, 112634, 112247, 111410, 109682, 107418, 105430, 104046, 102949, 101922, 101131, 100510, 99461, 97564, 95185, 93001, 91261, 89968, 89414, 89942, 91253, 92506, 93120, 93100, 92668, 92011, 91400, 91104, 91067, 91058, 91254, 92261, 94443, 97519, 101005, 104759, 108817, 112920, 116617, 119850, 123284, 127931, 134432, 142634, 151790, 161209, 170782, 180948, 192191, 204494, 217131, 228994, 239222, 247533, 253831, 257630, 258166, 255138, 248981, 240362, 229829, 218129, 206362, 195333, 185073, 175360, 166403, 158528, 151554, 145134, 139474, 135029, 131598, 128492, 125666, 123872, 123458, 123732, 123879, 123904, 124262, 125033, 125978, 127034, 128268, 129568, 130806, 132070, 133355, 134234, 134261, 133602, 132895, 132588, 132704, 133116, 133658, 134039, 133986, 133483, 132668, 131607, 130423, 129451, 128855, 128193, 126806, 124668, 122397, 120381, 118321, 115842, 113077, 110395, 107876, 105471, 103417, 102065, 101350]
54468A01350n49o90o98m66k29j40j83l62o72r24q93o79n83o47n75k74q1k92o48
54449I1765o90m17k70m81p55p27m17j10K9O2O5K8p0j83k10j46j52m20q76j157
54429H4868r47l55K43O25Q03P72M58m7m41m65j21M26R98J364J358J091R02R75
54411I2507J090R41N95M31O49R18O62k11j011r39j02N10K82j94qP14J059P26L48
54392I8967K97O5p35j455j218j82P00R11P33M86J14l70o45m72n0K18J62o8k20
54373I7238k13k20m52q11r38o86l12q2J01L00K28l05q64p77m3O65Q37N77K06o6
54353I4383p6K78P44R11P44N88M58o7j029j696j465p70n16q94j349j602j938k447
54335H4257k632k202j605j407j449j202p16n99j055j582j795j978k445k767k243
$$ y = [101350, 100801, 100111, 99413, 98947, 98718, 98578, 98395, 98033, 97361, 96437, 95544, 94865, 94282, 93635, 93060, 92786, 92705, 92413, 91765, 91075, 90658, 90388, 89907, 89152, 88425, 88008, 87898, 87927, 87989, 88054, 88082, 88012, 87829, 87619, 87473, 87321, 86901, 86025, 84868, 83921, 83566, 83809, 84434, 85237, 86009, 86467, 86420, 85979, 85514, 85393, 85819, 86817, 88181, 89539, 90630, 91532, 92507, 93597, 94538, 95133, 95564, 96213, 97131, 97793, 97582, 96571, 95632, 95530, 96040, 96322, 96128, 96120, 96834, 97893, 98619, 98967, 99264, 99329, 98594, 97139, 95921, 95739, 96439, 97350, 98083, 98569, 98683, 98313, 97668, 97196, 97146, 97364, 97526, 97458, 97238, 97025, 96805, 96353, 95542, 94604, 93918, 93606, 93524, 93625, 93925, 94153, 93848, 92984, 92207, 92164, 92829, 93666, 94243, 94449, 94383, 94307, 94585, 95329, 96240, 96984, 97572, 98030, 97963, 96934, 95238, 93773, 93003, 92487, 91593, 90244, 88642, 86704, 84257, 81625, 79423, 77818, 76411, 74962, 73760, 73044, 72445, 71390, 69808, 68013, 66035, 63590, 60823, 58580]
54320E8580r57J14J81m96r94p27qL18k77j379j942j390k78L30R7l11j90M08R15
54301E1994R40M66l06j050j432j390j197j088r66o71l20j69k20k09J7K94L29L7
54283D5059k73j26N76J223J070J86m68j57O98J103P79M25O45J056P52m77j742
54266E0329j966j067nL56P7k76n43q69j007m65N27R79M55k23j39M14M86k0k79
54247D6764J24N97M63j31n70n84m40n09q24j012o52J40O60M14j64k74O7L4p45
54228D3358j508j339l16P49J321J411J052K28p03j020m29M86Q51M06l26o51l19
54211D3251L78Q71P67J80l52m38l19n15j013j188p22j74l02j072j756j883j544
54194C4169r01k4P40Q70M39K26P30J465J567Q23k58j083j389j201p64l68p5J07
$$ y = [58580, 57623, 57737, 57918, 57422, 56428, 55701, 55693, 56011, 55734, 54355, 52413, 51023, 50745, 51075, 51172, 50861, 50671, 51079, 51994, 52934, 53400, 53094, 52044, 50612, 49222, 48025, 46937, 45971, 45300, 44980, 44811, 44591, 44382, 44399, 44693, 45022, 45059, 44786, 44660, 45236, 46459, 47529, 47715, 47247, 47090, 47788, 48891, 49670, 50095, 50740, 51796, 52548, 52071, 50329, 48363, 47296, 47291, 47647, 47724, 47448, 46905, 46036, 45029, 44564, 45091, 46070, 46525, 46302, 46163, 46577, 47063, 47043, 46764, 46888, 47485, 47948, 47817, 47247, 46663, 46223, 45714, 44890, 43878, 43226, 43366, 44026, 44440, 44276, 44002, 44069, 44103, 43358, 41850, 40511, 40195, 40944, 42265, 43676, 44728, 44956, 44253, 43233, 42804, 43290, 44141, 44547, 44221, 43570, 43251, 43629, 44500, 45267, 45447, 45095, 44657, 44338, 43823, 42810, 41622, 40900, 40726, 40424, 39352, 37596, 35713, 34169, 33268, 33244, 33984, 34854, 35293, 35519, 36249, 37714, 39281, 40104, 39846, 38763, 37374, 36173, 35409, 35041, 34966, 35073]
54176C5073j04r47j781j396L88K089K258J158M0o67j326j730j101M48J686J840
54160C5928J451J263J154O91J1m56o59p30n58j02K60J94l3O2N10R64J242J381
54142D2573J343J071O68L09O1j8J54M14L94J02O7N64J078R52L70P2K76L81j56
54123E0675j100j671j353l67N41P95N75M55N37L92n5j98K22L67o10k131k731j947
54105D2396p95k30p3K33O07O53M21K39J03k33o88q94o64j32M66Q65Q20L91O3K23
54085D3771O68R33R03P11L10l68r07p60j59M0m09o67m1R32J204O06j39n52p59
54066D5317q50o10p9K62J90J32N04J022J131Q01N10N17O02M60M5m41o48k80N54
54047D9139J215J171O97N97J162J787J808J343J064J317J847K283K561K792L006
$$ y = [35073, 34969, 34022, 32241, 30845, 31233, 33322, 35580, 36738, 36778, 36111, 34785, 33055, 31954, 32402, 34088, 35928, 37379, 38642, 39796, 40487, 40498, 40042, 39383, 38653, 38095, 37993, 38253, 38447, 38414, 38476, 38986, 39950, 41192, 42573, 43916, 44987, 45655, 45964, 46025, 46007, 46161, 46575, 46969, 47071, 47138, 47702, 48780, 49732, 50102, 50174, 50450, 50831, 50675, 49575, 47904, 46551, 46184, 46725, 47520, 48095, 48550, 49087, 49479, 49424, 49226, 49448, 49815, 49205, 47074, 44343, 42396, 41601, 41371, 41298, 41531, 42138, 42791, 43212, 43451, 43554, 43321, 42633, 41739, 41075, 40943, 41409, 42274, 43094, 43485, 43548, 43771, 44439, 45372, 46275, 46986, 47296, 46928, 46021, 45261, 45102, 45142, 44733, 44066, 44025, 44957, 46161, 46767, 46628, 46076, 45317, 44467, 43857, 43778, 44040, 44230, 44362, 44866, 45888, 47019, 47820, 48330, 48847, 49449, 49909, 49954, 49513, 48865, 48585, 49139, 50354, 51525, 52222, 52819, 53981, 55768, 57576, 58919, 59983, 61300, 63147, 65430, 67991, 70783, 73789]
54032G3789L177L357L519L438K929K272K095K668L468L658K968J936J343J565
54018A12182K429L420L972L796L053K189J498R75M93M7k15q0L97O42r4j757l180
54001A29767l323k568k162k432k515j967j535j842k247j877j104r27j378j590
53987A02300j252r65j121j405j532j654j776j530q87m14n05q43j004j023j096
53972H5293j142j139j415k191l015l113k216q57J18K27k64o04m06j74o13j493
53956F6996j708p00P55J497J319R02P44O56L00j97l06K76J134J418P39l28q66
53939G2631n90J02Q53J596K143K199J897J786K107K566K994L518L922L548K313
53924A03585J206J166J948K729L287L913M443M346L650L088L137L514L761L855
$$ y = [73789, 76966, 80323, 83842, 87280, 90209, 92481, 94576, 97244, 100712, 104370, 107338, 109274, 110617, 112182, 114611, 118031, 122003, 125799, 128852, 131041, 132539, 133514, 134007, 134054, 133839, 133759, 134156, 134798, 134704, 132947, 129767, 126444, 123876, 121714, 119282, 116767, 114800, 113265, 111423, 109176, 107299, 106195, 105268, 103890, 102300, 101048, 100083, 98962, 97557, 96025, 94371, 92595, 91065, 90178, 89764, 89259, 88416, 87412, 86389, 85293, 84151, 83012, 81597, 79406, 76391, 73278, 71062, 70205, 70323, 70550, 70286, 69682, 69276, 69102, 68489, 66996, 65288, 64588, 65343, 66840, 68159, 69061, 69805, 70461, 70761, 70564, 70258, 70534, 71668, 73086, 73825, 73497, 72631, 72041, 72143, 72996, 74592, 76735, 78934, 80831, 82617, 84724, 87290, 90284, 93802, 97724, 101272, 103585, 104791, 105957, 107905, 110634, 113921, 117834, 122277, 126623, 130273, 133361, 136498, 140012, 143773, 147628]
53910A47628M049M424M803M952M770M449M392M831N479N672M932L434K049J768
53896B07632K709L674L210J287n97j270j269j754k658k830j844p09n37j242j982
53881B01820k432l003l971m882n056m489l902l794l794l208k100j281j260j708
53867A56940k086k247k246k073j914k077k394k281j766j699k371k797k126j123
53853A27740j071j817k192k010k255l220l902l669l155k990k658j475R5R17M96
53838I8834p61k158l038k914j886o45K43P54R29N50k80q69p31k45K2J16L05L88
53820H8614J13j62M7N58Q70J045J398J658J292N62L11O81R37P01M21M56M93L52
53802A00347N15J279K062K155J774J667K059K541K775K744K480K121K021K351
$$ y = [147628, 151677, 156101, 160904, 165856, 170626, 175075, 179467, 184298, 189777, 195449, 200381, 203815, 205864, 207632, 210341, 214015, 217225, 218512, 217915, 216645, 215376, 213622, 210964, 208134, 206290, 205581, 205044, 203802, 201820, 199388, 196385, 192414, 187532, 182476, 177987, 174085, 170291, 166497, 163289, 161189, 159908, 158648, 156940, 154854, 152607, 150361, 148288, 146374, 144297, 141903, 139622, 137856, 136157, 133786, 130989, 128863, 127740, 126669, 124852, 122660, 120650, 118395, 115175, 111273, 107604, 104449, 101459, 98801, 97326, 97421, 98338, 98834, 98073, 95915, 92877, 89963, 88077, 87432, 87675, 88429, 89358, 89908, 89628, 88759, 88028, 87783, 87805, 87921, 88226, 88614, 88727, 88565, 88612, 89170, 90040, 91085, 92483, 94141, 95433, 95995, 96306, 96987, 97924, 98625, 99046, 99502, 99995, 100347, 100862, 102141, 104203, 106358, 108132, 109799, 111858, 114399, 117174, 119918, 122398, 124519, 126540, 128891]
53788A28891K729K738K621K888L311L121K230J443J257J116M03n12q19m91l05
53773A50621p03j353j785j967k092k177k178k131k115k179k445k938l277k847
53759A20434j591l85k60j290k450k725k081j312r83q69n17j08l23j336k409k804
53743I8991k721k822l077k759j626m39J1j53l01k30k51n27q09q45o33k87N8J98
53725H1778n7o50j243j520j448j222r86o27K1P39R34L41m93q27o86o65q38n89
53707G1962K33Q70P38L51M69R08R38M49p7m51q27j044p92k80J3K39Q70J574J407
53688G7550L53l77j7P99J257J570K159K487J815O13Q2M87R67J045J262K118L214
53671I7384L773L460K393R56j42k24M62P54k0r83p79O44J943K097J473J023J067
$$ y = [128891, 131620, 134358, 136979, 139867, 143178, 146299, 148529, 149972, 151229, 152345, 152748, 152236, 151417, 150926, 150621, 149918, 148565, 146780, 144813, 142721, 140544, 138366, 136235, 134120, 131941, 129496, 126558, 123281, 120434, 118843, 118458, 118198, 116908, 114458, 111733, 109652, 108340, 107357, 106488, 105971, 105863, 105540, 104204, 101795, 98991, 96270, 93448, 90371, 87612, 85986, 85547, 85558, 85405, 85104, 84874, 84623, 84096, 83287, 82442, 81809, 81522, 81580, 81778, 81721, 81071, 79828, 78308, 76860, 75638, 74652, 74025, 74046, 74785, 75719, 76060, 75567, 74740, 74054, 73389, 72551, 71962, 72195, 73065, 73803, 74154, 74623, 75531, 76469, 76918, 76841, 76390, 75563, 74519, 73727, 73447, 73460, 73699, 74569, 76143, 77550, 77903, 77526, 77509, 78308, 79565, 81135, 83294, 85781, 87596, 88209, 88291, 88778, 89745, 90790, 92052, 94170, 97384, 101157, 104617, 107010, 107966, 107824, 107600, 108062, 108816, 108796, 107813, 107034, 107678, 109621, 111718, 113191, 114214, 115281]
53654A15281J219J063M77m42j286j375m11R54J596J105J18n32n35K7R95J952K246
53637A22452J609O21N9J9L1j50l63n32q13j158j258j064r53j184j476j472j233
53620A13135j092j144j185j024o14mO43J050J029O97L27Q9L2J70M40O20N00J37
53602A13806j56j35J36M15O02Q55J404K209K873K941K377J632J236J292J402J165
53586A34054P35P39J542K624L002K311J234P11R54J483J870K074K144K005J630
53571A59112J198R19Q85J070J356J527J368Q44J37m31m77J26Q93R83J92o04m82
53554A68616K30L39n40j408j247l47J81k20j142j915k224k096j701j264r57q05
53538A53500p70p79o91l15K36M57n5j029j687j487o05L20P97P96O14M82L56J48
$$ y = [115281, 116500, 117563, 118040, 117598, 116312, 114937, 114526, 115480, 117076, 118181, 118299, 117767, 117232, 117259, 118254, 120206, 122452, 124061, 124682, 124741, 124760, 124791, 124641, 124278, 123746, 122933, 121775, 120517, 119453, 118500, 117316, 115840, 114368, 113135, 112043, 110899, 109714, 108690, 108076, 108072, 108715, 109765, 110794, 111491, 111818, 111907, 111939, 112109, 112549, 113169, 113669, 113806, 113650, 113515, 113651, 114066, 114668, 115523, 116927, 119136, 122009, 124950, 127327, 128959, 130195, 131487, 132889, 134054, 134789, 135528, 137070, 139694, 142696, 145007, 146241, 146952, 147906, 149389, 151259, 153333, 155477, 157482, 159112, 160310, 161229, 162114, 163184, 164540, 166067, 167435, 168279, 168416, 167985, 167508, 167634, 168527, 169510, 169702, 169098, 168616, 168846, 169185, 168645, 167237, 165990, 165643, 165824, 165604, 164462, 162547, 160323, 158227, 156526, 155262, 154305, 153500, 152730, 151951, 151260, 150945, 151181, 151638, 151583, 150554, 148867, 147380, 146775, 147095, 147892, 148688, 149302, 149784, 150140, 150288]
53520A50288K2L10J077J951K484K586K452K216J886J641J908K926M282N101M951
53505A86081M388M340N001N621N513M934M763N559P162Q936J0098J0109R219Q461
53491B80185Q737R947J1351J2505J3410J4001J4171J4253J4737J5466J5770J5531
53479D40064J5425J5845J6221J5928J5326J5351J6350J7768J8835J9238J9216
53468F25567J9268J9669K0155K0253J9952J9701J9595J9094J7802J6089J4641
53457H31786J3648J2834J1987J1093J0191R444R109R187R301R227R198R334R195
53444I65534Q291O815N353M060K648J041n79k221m074n992p496q450r317j0551
53430I45062j2048j3398j4416j5269j6180j7145j7945j8386j8500j8461j8267
$$ y = [150288, 150310, 150620, 151697, 153648, 156132, 158718, 161170, 163386, 165272, 166913, 168821, 171747, 176029, 181130, 186081, 190469, 194809, 199810, 205431, 210944, 215878, 220641, 226200, 233362, 242298, 252396, 262505, 271724, 280185, 288922, 298869, 310220, 322725, 336135, 350136, 364307, 378560, 393297, 408763, 424533, 440064, 455489, 471334, 487555, 503483, 518809, 534160, 550510, 568278, 587113, 606351, 625567, 644835, 664504, 684659, 704912, 724864, 744565, 764160, 783254, 801056, 817145, 831786, 845434, 858268, 870255, 881348, 891539, 900983, 910092, 919279, 928580, 937807, 947005, 956339, 965534, 973825, 980640, 985993, 990053, 992701, 993742, 993163, 990942, 986868, 980876, 973380, 964930, 955613, 945062, 933014, 919616, 905200, 889931, 873751, 856606, 838661, 820275, 801775, 783314, 765047]
53419G65047j7739j6876j6076j5812j6174j6853j7435j7570j7028j5760j3945
53408E83779j1935j0208r131q521p595n778l538j910j137m17R49K839M852O858
53394E39107Q618R743J0496J1849J4010J5768J6146J6043J7005J8937K0377K0782
53382G18881K1103K2047K3127K3919K4931K6648K8640L0341L1934L3766L5524
53371A020861L6774L7757L8906L9949M0361M0420M1020M2383M3661M4011M3510
53360A469613M2769M2032M0985L9382L7474L5793L4578L3542L2244L0540K8660
53349A867612K6881K5315K3921K2576K1128J9528J7868J6090J3813J0600O334
53338B071666J101n129j2281j9732k6577l2427l7532m1967m5189m6730m7043m7226
$$ y = [765047, 747308, 730432, 714356, 698544, 682370, 665517, 648082, 630512, 613484, 597724, 583779, 571844, 561636, 552505, 543984, 536389, 530611, 527073, 525163, 524026, 523609, 524558, 527397, 532249, 539107, 547725, 557468, 567964, 579813, 593823, 609591, 625737, 641780, 658785, 677722, 698099, 718881, 739984, 762031, 785158, 809077, 834008, 860656, 889296, 919637, 951571, 985337, 1020861, 1057635, 1095392, 1134298, 1174247, 1214608, 1255028, 1296048, 1338431, 1382092, 1426103, 1469613, 1512382, 1554414, 1595399, 1634781, 1672255, 1708048, 1742626, 1776168, 1808412, 1838952, 1867612, 1894493, 1919808, 1943729, 1966305, 1987433, 2006961, 2024829, 2040919, 2054732, 2065332, 2071666, 2072767, 2067638, 2055357, 2035625, 2009048, 1976621, 1939089, 1897122, 1851933, 1805203, 1758160, 1710934]
53326A710934m7992m9149n0072n0370n0050m9251m8102m6849m5959m5718m5761
53315A181661m5313m4107m2760m1964m1545m0765l9341l7655l5987l4129l1839
53304G46256k9249k6630k4069k1518j8927j6208j3352j0666q588p211o268n531
53292E58039m923m175k893j120N36J576K097K444K737L025L534M461N691O982
53278E78011Q266R535J0601J1304J1884J2826J4290J5751J6489J6372J6124J6533
53266G37986J7495J8214J8421J8845J9999K1139K1190K0378J9878J9953J9554
53255I53052J8119J6598J6063J6124J5621J4379J3272J2874J2795J2342J1095
53244A112334Q921N981K833Lk649n727r393j3083j6117j8307j9880k1208k2689
$$ y = [1710934, 1662942, 1613793, 1563721, 1513351, 1463301, 1414050, 1365948, 1319099, 1273140, 1227422, 1181661, 1136348, 1092241, 1049481, 1007517, 965972, 925207, 885866, 848211, 812224, 778095, 746256, 717007, 690377, 666308, 644790, 625863, 609655, 596303, 585637, 577049, 569838, 563570, 558039, 553116, 548941, 546048, 544928, 545464, 547040, 549137, 551581, 554318, 557343, 560877, 565338, 571029, 578011, 586277, 595812, 606413, 617717, 629601, 642427, 656717, 672468, 688957, 705329, 721453, 737986, 755481, 773695, 792116, 810961, 830960, 852099, 873289, 893667, 913545, 933498, 953052, 971171, 987769, 1003832, 1019956, 1035577, 1049956, 1063228, 1076102, 1088897, 1101239, 1112334, 1121255, 1127236, 1130069, 1130072, 1127423, 1121696, 1112303, 1099220, 1083103, 1064796, 1044916, 1023708, 1001019]
53231A001019k4535k6501k8059k8941k9343k9522k9433k8921k8033k6934k5672
53220F95125k4254k2920k2122k2062k2444k2812k3156k3820k4782k5312k4720
53209D36721k3266k1897k1138k0639j9837j8603j7035j5118j2893j0736r071p956
53197B38532p173o593o219o017n877n668n267m695m270m306m571m415l640k883
53183A66938k751l022l028k634k307k408k802l162l213k798k000j207p42m96l07
53168A34061m47j270k370k728j917p13j64m17q52j128j479j972k032j166J09N77
53152A16092k09j247j195M3J264J426O58k50q17j017q83m78j54l77j189k090k491
53135A07086k204j442n46K44P57Q43M68j00m07l11k11n28j103j392j211q03l31
$$ y = [1001019, 976484, 949983, 921924, 892983, 863640, 834118, 804685, 775764, 747731, 720797, 695125, 670871, 647951, 625829, 603767, 581323, 558511, 535355, 511535, 486753, 461441, 436721, 413455, 391558, 370420, 349781, 329944, 311341, 294306, 279188, 266295, 255559, 246488, 238532, 231359, 224766, 218547, 212530, 206653, 200985, 195718, 191023, 186753, 182447, 177876, 173461, 169821, 166938, 164187, 161165, 158137, 155503, 153196, 150788, 147986, 144824, 141611, 138813, 136813, 135606, 134864, 134368, 134061, 133614, 132344, 129974, 127246, 125329, 124616, 124452, 124035, 123183, 122055, 120576, 118604, 116572, 115406, 115515, 116092, 115883, 114636, 113441, 113484, 114748, 116174, 116832, 116582, 115765, 114748, 113865, 113387, 113233, 112856, 111667, 109577, 107086, 104882, 103440, 102894, 103138, 103895, 104738, 105206, 105106, 104699, 104388, 104177, 103649, 102546, 101154, 99943, 99140, 98809]
53118I8809K19N82L01o03j509j958k011j688p68N24J371J424J356J697J786Q19
53102A00351n74q67L24J803K459K428K311K095J439M78j84j34M67J066J180Q35
53086A15477N46O17N88j08j164j654j337j009j213j412r71l68n94j609k291j970
53070A01528j253j008j155j041o15n93j360k334k655k205j571j218j079q96o22
53055H1923l92l43n18p57p57m32j49k71n71n48k23j15m21p80j003j357j819j821
53037F9646j124l74j56j18K41N58J67o17q76m94k89o43r81p71k86k8k3o2j43l07
53017F3320l50o6M02O52L85l17r70j082p82p64j333j844j557q02n37r82j379j127
52999E0867m47J84N68O18K71k40n23n38n12l73O1M27J54n20o34J32J034J403J362
$$ y = [98809, 99028, 99610, 99911, 99308, 97799, 95841, 93830, 92142, 91374, 91898, 93269, 94693, 96049, 97746, 99532, 100351, 99777, 98910, 99234, 101037, 103496, 105924, 108235, 110330, 111769, 112247, 112063, 111929, 112396, 113462, 114642, 115477, 116023, 116640, 117228, 117120, 115956, 114302, 112965, 111956, 110743, 109331, 108360, 107992, 107398, 105789, 103498, 101528, 100275, 99267, 98112, 97071, 96456, 95863, 94503, 92169, 89514, 87309, 85738, 84520, 83441, 82545, 81923, 81531, 81188, 80670, 79913, 79156, 78724, 78575, 78304, 77733, 77185, 76962, 76847, 76426, 75646, 74643, 73286, 71467, 69646, 68522, 68148, 67992, 67874, 68115, 68673, 68840, 68223, 67347, 66853, 66564, 65921, 64940, 64169, 63883, 63855, 63832, 63770, 63627, 63320, 62970, 62904, 63306, 63958, 64343, 64026, 63056, 61974, 61192, 60428, 59095, 57251, 55694, 54892, 54355, 53373, 51994, 50867, 50420, 50604, 51172, 51790, 52061, 51821, 51298, 50760, 50248, 49875, 49936, 50363, 50517, 49997, 49363, 49495, 50529, 51932, 53294]
52980E3294J102M32m73p66m3R29J274J113R68P80L32OK08N45L91k0m9J21k21r97
52960E8926j305q04j86p1k42k85k95n26q18p83k90M55J160J551J444Q38m5q62
52942E7862j192p63J98J027J335J417J639J696J018k55j247j392r50m45p7J55
52926F0026J56j23n12p69q63r39j110j301j268q56k59J20J87K58M92N57J54m26
52908E3524p00o97p76r33q15l68N5K14J48j48o76j054p85m9L20o8n87m56J70M34
52888D6753j39j112j719j653j237r10p12l82J58O60R70J274J670J814J347N03
52872D7285j43l61l16r3K90N63M61K90N88J263J654J536J391J544J713J743K054
52855F1462K899L713L713K861J661L80j022k401l306l435k908k125j482j152j041
$$ y = [53294, 54396, 54828, 54355, 53589, 53546, 54475, 55749, 56862, 57830, 58610, 58942, 58948, 59156, 59701, 60092, 60072, 60023, 60144, 59923, 58926, 57621, 56817, 56631, 56560, 56318, 56033, 55738, 55212, 54394, 53611, 53321, 53776, 54936, 56487, 57931, 58769, 58724, 57862, 56670, 55907, 56105, 57132, 58467, 59884, 61523, 63219, 64237, 63982, 62735, 61343, 60393, 59948, 59871, 60026, 60182, 60059, 59547, 58778, 57915, 56976, 55866, 54565, 53297, 52441, 52182, 52302, 52489, 52747, 53239, 53796, 53950, 53524, 52824, 52127, 51351, 50418, 49603, 49235, 49290, 49504, 49652, 49504, 48828, 47774, 46989, 46940, 47260, 47192, 46605, 46149, 46319, 46753, 46614, 45502, 43783, 42130, 40893, 39983, 39271, 38889, 39047, 39707, 40677, 41951, 43621, 45435, 46782, 47285, 47142, 46781, 46465, 46372, 46662, 47225, 47686, 47976, 48564, 49827, 51481, 53017, 54408, 55952, 57665, 59408, 61462, 64361, 68074, 71787, 74648, 76309, 76689, 75667, 73266, 69960, 66525, 63617, 61492, 60010, 58858, 57817]
52840E7817j060j391k144k785k472j218r1O0l61l85K21Q69J035P13J93j57m4L53
52822D9153M27m7m35j12N65P91M85J84Nl95q36o37K20Q41P19M24N43O94K87l45
52802E2531m04R6L33j96j134j872k132j883j251n88l58o77j161j313q64R9J156
52785D0382J733J549R42N16M45L66k8n36p13l80K31P01P38L74m0j58J8J70N5k51
52765D6114m34k25L49Q59P32j49j157j442p66L99J433J947J733Q85P5J59J167
52748E1679K119K172J632J360J602J917K038K081J927J165j02j046j108q39j241
52733F5356k456l559l653k740j510o08k83n32j177j789j881j369p79o68q70o89
52717D0793R1Q03Q21M57M37P00M89l62r78o47J50M10q0o64q22o90n48l87o3L84
$$ y = [57817, 56757, 55366, 53222, 50437, 47965, 46747, 46656, 46716, 46355, 45970, 46191, 47060, 48095, 48808, 49001, 48844, 48800, 49153, 49580, 49533, 49098, 48986, 49551, 50342, 50827, 51011, 51016, 50621, 49785, 49148, 49368, 50209, 50928, 51352, 51895, 52589, 52876, 52531, 52127, 52223, 52556, 52360, 51226, 49354, 47222, 45339, 44088, 43500, 43142, 42465, 41304, 39991, 39127, 39226, 40382, 42115, 43664, 44606, 45122, 45567, 45933, 45905, 45369, 44656, 44276, 44507, 45208, 45946, 46320, 46280, 46122, 46140, 46310, 46365, 46114, 45680, 45455, 45804, 46663, 47395, 47246, 46089, 44647, 43881, 44280, 45713, 47660, 49393, 50278, 50353, 50512, 51679, 53798, 55970, 57602, 58962, 60564, 62481, 64519, 66600, 68527, 69692, 69590, 68544, 67436, 66597, 65356, 62900, 59341, 55688, 52948, 51438, 50830, 50547, 50015, 48838, 47049, 45168, 43799, 43020, 42352, 41482, 40793, 40884, 41687, 42508, 42965, 43402, 44102, 44591, 44229, 43251, 42604, 42754, 43164, 43084, 42420, 41598, 40908, 40360, 39973, 39910, 40294]
52697D0294P02N99k8q87j352j064l78J1q8k02J17P42J221J327J194J086J170J415
52679D5879J577J356P17K3k21K11J058J725J788J399J121J259J435J088K63l56
52663F0322k66K48M36j23j125j824j671q24m0O3l49n42j09O75J345J843K297K523
52645F2879K105J042m8n65o23q87j673k458k501j780j030q72j172j439j456j264
52629D8258p85K1P93R91N66L4k12k73l71m79n11n65p23q32p37n41m24l61k16L4
52609D3667L52P27J007Q71K53l45k83M40J098R87Q5r75j475j165l79K79M13K4
52591D5581n79r64p55K8Q21J005O55M10N55O41K90j76l27m17q55j240p30O38J775
52572D6356J838J082J83n72j072j059n59k13n06r49o71L38J235J509J491J585
$$ y = [40294, 40996, 41595, 41567, 40680, 39328, 38264, 37886, 37897, 37809, 37607, 37724, 38466, 39687, 41014, 42208, 43294, 44464, 45879, 47456, 48812, 49529, 49552, 49331, 49542, 50600, 52325, 54113, 55512, 56633, 57892, 59327, 60415, 60678, 60322, 60056, 60304, 60740, 60617, 59492, 57668, 55997, 55173, 55133, 55196, 54847, 54305, 54196, 54871, 56216, 58059, 60356, 62879, 64984, 66026, 65978, 65413, 64790, 63903, 62230, 59772, 57271, 55491, 54461, 53589, 52417, 50978, 49522, 48258, 47473, 47494, 48287, 49278, 49844, 49878, 49666, 49393, 49022, 48543, 48032, 47467, 46744, 45912, 45175, 44634, 44210, 43849, 43633, 43667, 44019, 44746, 45753, 46624, 46877, 46532, 46249, 46689, 47787, 48774, 48859, 47884, 46409, 45244, 44865, 45144, 45557, 45581, 45002, 44038, 43283, 43311, 44132, 45137, 45792, 46202, 46757, 47398, 47688, 47512, 47185, 46768, 45913, 44673, 43943, 44581, 46356, 48194, 49276, 49459, 48887, 47815, 46756, 46197, 45984, 45478, 44529, 43858, 44196, 45431, 46940, 48431, 50016]
52556E0016J614J343J069J206J553J452O99j14k63L18J020J173O48j60p32p82
52540F0060k77O84J780K393K018Q68j24k21L83R37J067R68Q35N81K55K57Q40J629
52522G4933J927J408L02r17j787j995j566r22n01l90n25r81j699k086j494j85
52506F3522P54O94J34k13m48j002j543j218L4J169J285O64J77J18Q0k40o22p56
52488F2589o67n93o22o45n76m45l42l59o04j074j499j418o10N30J244J122M91
52471E6522l6j91p3K59Q42J442J523Q22k20q45p66l38oJ47K61L16J69j07j33K87
52451E9875P97Q14K80k45l20j88k98n06k78L99Q89Q49P04Q97J092P41J15J4N29
52432F6160Q02K73m70m79K71R12Q03J47m63p46q01p66o08k63J58L53J34l39p56
$$ y = [50016, 51630, 52973, 54042, 55248, 56801, 58253, 58952, 58838, 58575, 58893, 59913, 61086, 61734, 61574, 60842, 60060, 59783, 60467, 62247, 64640, 66658, 67526, 67402, 67181, 67564, 68501, 69568, 70536, 71371, 71952, 72207, 72464, 73304, 74933, 76860, 78268, 78570, 77653, 75866, 73871, 72305, 71383, 70882, 70492, 69967, 68986, 67287, 65201, 63707, 63522, 64276, 64970, 65104, 64891, 64443, 63441, 61898, 60680, 60714, 61883, 63168, 63832, 64009, 64127, 64207, 63967, 63345, 62589, 61922, 61329, 60707, 60062, 59486, 59041, 58699, 58340, 57736, 56662, 55163, 53745, 53135, 53665, 54909, 56031, 56522, 56486, 56295, 56222, 56481, 57323, 58765, 60288, 61110, 60890, 60045, 59279, 58941, 58935, 59082, 59343, 59659, 59828, 59721, 59588, 59875, 60672, 61486, 61766, 61521, 61201, 61013, 60715, 60209, 59931, 60330, 61219, 62068, 62772, 63669, 64761, 65502, 65617, 65631, 66160, 66962, 67235, 66765, 66286, 66557, 67469, 68272, 68419, 67956, 67210, 66409, 65643, 65035, 64772, 64930, 65283, 65417, 65078, 64322]
52413F4322j046j342j503j072N3J187J492R37K70Q3L19N99O49L21l41r22r17l83
52395F2706P0J17J91P39J456J650J182M73j84p79j106q22p2M69N06N61J069J546
52377F9772J228K91j63N11J722K430K346J969J652J145J40r85j414q04K51Q21
52361H0912N64j16o67q87q02m26J54O83R76J103J141R31M11J2K94J127J702J504
52343H8616Q82M56L80N61J159K206K937K326M52j286j668r28j51J49K90N54P79
52326I7714P92P25O72N49M47O92J236J420P13m26r42m03N53R89O19j17o67q14
52308A03752o50l51k2L17P03J152J567J753J603J281J116J245J483J659J923K435
52292A20966K956L055K789K716L070L379L117K444J978K052K571L293L896L955
$$ y = [64322, 63276, 61934, 60431, 59359, 59412, 60599, 62091, 63028, 63298, 63381, 63700, 64299, 64948, 65269, 64928, 64006, 63089, 62706, 62776, 62893, 63084, 63823, 65279, 66929, 68111, 68584, 68400, 67621, 66515, 65693, 65621, 66090, 66596, 67157, 68226, 69772, 71000, 71291, 71128, 71639, 73361, 75791, 78137, 80106, 81758, 82903, 83043, 82058, 80644, 79840, 80091, 80912, 81476, 81360, 80693, 79806, 79004, 78578, 78732, 79415, 80391, 81494, 82635, 83566, 83977, 83989, 84283, 85410, 87112, 88616, 89498, 89954, 90334, 90895, 92054, 94260, 97197, 99523, 99975, 98689, 97021, 96093, 95942, 96091, 96381, 96935, 97714, 98506, 99231, 99903, 100452, 100899, 101591, 102827, 104247, 104960, 104534, 103592, 103189, 103742, 104731, 105350, 105233, 104566, 103752, 103102, 102751, 102729, 103046, 103749, 104901, 106468, 108221, 109824, 111105, 112221, 113466, 114949, 116608, 118531, 120966, 123922, 126977, 129766, 132482, 135552, 138931, 142048, 144492, 146470, 148522, 151093, 154386, 158282, 162237]
52278A62237L322K478K057K065J990J645J406J531J780J844J782J741J613J226
52264A88717O25j3n45p85n61l9K87K29J95N69J058J134R08R82J459J647J117N15
52246A97499R24K438L882M054L010J874J509J716J799J588J586K160K952L282
52232B30273K982K584K708L356L921L897L452L145L198L292L219L278L762M301
52218B77368M204L345K282J543J167R79Q79P77O92R23J789K994L750L663L090
52203C09445K514K039J737J847K346K773K913L145L711M084L717K990K776L229
52189C49266L765M013M204M545M857M908M611L932K975K170J935K155K408K642
52175C98386L110L697L809L110J918Q74M77Q31J419J310J77j027j052K7R17Q14
$$ y = [162237, 165559, 168037, 170094, 172159, 174149, 175794, 177200, 178731, 180511, 182355, 184137, 185878, 187491, 188717, 189342, 189329, 188784, 187999, 187438, 187399, 187686, 187915, 188110, 188679, 189737, 190871, 191779, 192761, 194220, 195867, 196984, 197499, 198423, 200861, 204743, 208797, 211807, 213681, 215190, 216906, 218705, 220293, 221879, 224039, 226991, 230273, 233255, 235839, 238547, 241903, 245824, 249721, 253173, 256318, 259516, 262808, 266027, 269305, 273067, 277368, 281572, 284917, 287199, 288742, 289909, 290888, 291767, 292544, 293236, 294159, 295948, 298942, 302692, 306355, 309445, 311959, 313998, 315735, 317582, 319928, 322701, 325614, 328759, 332470, 336554, 340271, 343261, 346037, 349266, 353031, 357044, 361248, 365793, 370650, 375558, 380169, 384101, 387076, 389246, 391181, 393336, 395744, 398386, 401496, 405193, 409002, 412112, 414030, 414904, 415381, 416212, 417631, 418941, 419118, 418091, 417039, 417066, 417983, 418797]
52159D18797J36n18j134j692j774j374j270j873k397j957r51n19j013j829k402
52144C98230k638k545k202j972k070k041j409o07n14j145j628j497j162j037r99
52129C74764j012j424k228k803k783k642k874l135k809k037j543j670k117k493
52115C43194k616k413j976j652j663j712j400r01p38r59j066q33o93r95j373j154
52099C21050k18R01J606J718J445J114R18Q04O69O48J058J895K692L005K911K730
52083C44946K490K025J513J415J811K228K287K190K278K470K404K009J548J246
52069C72860J172J363J732J929J675J197R71J070J154J101J207J574J759J373
52055C92137P45O11J248K159K603K236J383P88J008J871K644K735K130J151J76
$$ y = [418797, 418933, 418415, 417281, 415589, 413815, 412441, 411171, 409298, 406901, 404944, 403993, 403474, 402461, 400632, 398230, 395592, 393047, 390845, 388873, 386803, 384762, 383353, 382746, 382232, 381087, 379459, 377962, 376800, 375763, 374764, 373752, 372328, 370100, 367297, 364514, 361872, 358998, 355863, 353054, 351017, 349474, 347804, 345687, 343194, 340578, 338165, 336189, 334537, 332874, 331162, 329762, 328861, 328123, 327164, 326098, 325265, 324572, 323577, 322204, 321050, 320832, 321733, 323339, 325057, 326502, 327616, 328534, 329338, 330007, 330655, 331713, 333608, 336300, 339305, 342216, 344946, 347436, 349461, 350974, 352389, 354200, 356428, 358715, 360905, 363183, 365653, 368057, 370066, 371614, 372860, 374032, 375395, 377127, 379056, 380731, 381928, 382899, 383969, 385123, 386224, 387431, 389005, 390764, 392137, 392882, 393493, 394741, 396900, 399503, 401739, 403122, 403910, 404918, 406789, 409433, 412168, 414298, 415449, 415625]
52040D15625l25J6R58J615J398P02L11M20O14O07M27N7n37j111j397j648k328
52023D15404l294l843l718l387l221l050k794k906l600m190l816k607j542j348
52009C72088j953k916l821m268l979l080k068j358j030r88j113j265j328j277
51995C41644j103p42k31J51J70m4j46k4J45K26K24Kq25k494m698o724p962q320
51977C09249q161p916p752p656p679p892q121q084p864p866q140q109p372o371
51963B00266n811n644n355m972n065n609n758n061m217m022m165l784k888k388
51949A35527k744l316l281k621j950j773k211l035l639l219j520N57J598J042
51935A09415l08j252j417j298j332j412j246q78o14o76j057j523j678j263n99
$$ y = [415625, 415300, 415316, 416274, 417889, 419287, 419989, 420300, 420720, 421334, 421941, 422368, 422425, 421888, 420777, 419380, 417732, 415404, 412110, 408267, 404549, 401162, 397941, 394891, 392097, 389191, 385591, 381401, 377585, 374978, 373436, 372088, 370135, 367219, 363398, 359130, 355151, 352071, 350003, 348645, 347615, 346627, 345514, 344249, 342921, 341644, 340541, 339799, 339568, 339719, 339889, 339845, 339699, 339675, 339820, 340046, 340270, 340272, 339447, 336953, 332255, 325531, 317569, 309249, 301088, 293172, 285420, 277764, 270085, 262193, 254072, 245988, 238124, 230258, 222118, 214009, 206637, 200266, 194455, 188811, 183456, 178484, 173419, 167810, 162052, 156991, 152774, 148752, 144587, 140803, 137915, 135527, 132783, 129467, 126186, 123565, 121615, 119842, 117631, 114596, 110957, 107738, 106218, 106775, 108373, 109415, 109107, 107855, 106438, 105140, 103808, 102396, 101150, 100272, 99658, 98982, 97925, 96402, 94724, 93461, 92862]
51920I2862l95q66j299r48r2L84K92L47R02J281Q17n2l50O5M47L08k7j03N0J52
51900I3775J73K88O03J107J664J968J704R03ko24r06r05o16j50J68J43P8M44J243
51881A01058J875J699O88m72r26m11M68Q91P19M97N58N70K67J63Q91K112K797
51864A13444K607K269K358K442J992J464J786K940L947M315M724N980P846R403
51850A67517J0321J1204J2772J5123J7963K1228K5171K9880L4921L9634M3754
51839D29488M7532N1074N3583N3374M8736L8878K4310O723j1371k7301l9084m6100
51827F29842m9080m9499m8601m6700m3339l8347l2722k8058k4966k2569j9820
51816B26141j6936j4934j4052j3323j1789r511p255n650m917m866m853m124k689
$$ y = [92862, 92467, 91601, 90302, 89354, 89262, 89646, 89938, 90285, 91187, 92468, 93285, 93233, 92883, 92948, 93395, 93703, 93676, 93573, 93623, 93775, 93948, 94236, 94839, 95946, 97610, 99578, 101282, 102185, 102183, 101559, 100653, 99748, 99132, 98982, 99150, 99293, 99371, 99815, 101058, 102933, 104632, 105320, 104848, 103922, 103511, 103979, 104870, 105589, 106086, 106644, 107214, 107481, 107644, 108535, 110647, 113444, 116051, 118320, 120678, 123120, 125112, 126576, 128362, 131302, 135249, 139564, 144288, 150268, 158114, 167517, 177838, 189042, 201814, 216937, 234900, 256128, 281299, 311179, 346100, 385734, 429488, 477020, 528094, 581677, 635051, 683787, 722665, 746975, 753698, 742327, 715026, 675942, 629842, 580762, 531263, 482662, 435962, 392623, 354276, 321554, 293496, 268530, 245961, 226141, 209205, 194271, 180219, 166896, 155107, 145596, 138341, 132691, 127774, 122908, 118055, 113931, 111242]
51803A11242j544j556k336k724k265j581j306j270j089r45j220j672j670j190
51789H8874r46j254j369n13P98J178J61j145j520j104q62j069j042l73M24O67
51773H0905L38r4k94j50K99P00N24k83j044j130p44n08n58m68l9M32O21N20K56
51754G9283j3p5J17J76k59q56q69k59J11l14r34q50j68J72k06o70n79j78o7k37
51734G3325j53L49P46O63M67O70J083J117P72O80J011J072M22k61j04N90O95j14
51716H3030r55j001m61jJ22pm32j235k214k955l112k560j531o45l80m64k56K43
51698F5186L26k31p06n23j40j91l07L77J820K984L075K299J444J240J958L076
51682H1687L494K630J181K32j26n80j208j330p69k79l90o48m87p2J67K77M39M24
$$ y = [111242, 109698, 108142, 105806, 103082, 100817, 99236, 97930, 96660, 95571, 94626, 93406, 91734, 90064, 88874, 87928, 86674, 85305, 84792, 85590, 86768, 86929, 85784, 84264, 83160, 82298, 81229, 80187, 79814, 80238, 80905, 81243, 81149, 80855, 80705, 81004, 81704, 82228, 81945, 80901, 79771, 79027, 78519, 77961, 77493, 77454, 77886, 78507, 79027, 79283, 79270, 79195, 79312, 79488, 79229, 78373, 77504, 77245, 77356, 77042, 76108, 75258, 75090, 75262, 75056, 74386, 73807, 73629, 73562, 73325, 73172, 73521, 74267, 74930, 75397, 76067, 77150, 78267, 79039, 79719, 80730, 81802, 82224, 81963, 81859, 82449, 83144, 83030, 82075, 81074, 80613, 80612, 80734, 80727, 80295, 79060, 76846, 73891, 70779, 68219, 66688, 66043, 65663, 65199, 64943, 65186, 65512, 65281, 64575, 64052, 63912, 63721, 63414, 63791, 65611, 68595, 71670, 73969, 75413, 76653, 78611, 81687, 85181, 87811, 88992, 89224, 89098, 88518, 87310, 85980, 85211, 84932, 84542, 83894, 83407, 83335, 83502, 83779, 84218, 84642]
51664H4642ln13o43n08m69l77K17J187J700J080m79k048k682k104j020m41n54
51647G6985n72N3P38O73J54J65Q50J281Q90K62J67N22P85Q61J102J637K230K625
51629I1408K688K378J873J566J603J640J362J100J432K237K688K256J363P58N76
51614A16928L37k50q28q04o2Q15J073N48j58l54p9k3n93j388j814j942k257k761
51596A06388k805k084j198r34j330j860k216k340j957q00N63R60j2j351j878j623
51580H5523j361j282r02k33n2p31j508j460p12j17o2j59m0J84L10M52P89J207
51562G9846J457J441J198P30R6m26n18j47M13Q28Q74M45l32j009j095n44K26Q93
51544H4376J567K358K926K806K093J358Q65L36l38o57j86O56J062R38J005J674
$$ y = [84642, 84639, 84126, 83483, 82975, 82506, 82129, 82346, 83533, 85233, 86313, 85834, 83786, 81104, 79000, 77980, 77539, 76985, 76413, 76466, 77204, 77877, 78031, 78196, 79046, 80327, 81217, 81479, 81646, 82168, 82953, 83814, 84916, 86553, 88783, 91408, 94096, 96474, 98347, 99913, 101516, 103156, 104518, 105618, 107050, 109287, 111975, 114231, 115594, 116352, 116928, 117265, 117015, 116187, 115383, 115321, 116136, 117209, 117757, 117599, 117245, 117166, 117143, 116550, 115162, 113348, 111406, 109149, 106388, 103583, 101499, 100301, 99367, 98037, 96177, 93961, 91621, 89664, 88864, 89427, 90387, 90375, 89024, 87146, 85523, 84162, 82880, 81978, 81745, 81693, 80962, 79454, 77994, 77282, 77165, 77103, 76944, 76904, 77088, 77398, 77850, 78639, 79846, 81303, 82744, 83942, 84672, 84768, 84342, 83824, 83677, 84090, 84918, 85792, 86237, 85905, 84896, 83801, 83257, 83483, 84376, 85943, 88301, 91227, 94033, 96126, 97484, 98349, 98685, 98347, 97690, 97504, 98160, 99222, 100160, 101165, 102839]
51528A02839K417K478J866J174P64M65Q1k89m60m48m40o32j093j555j453m72Q46
51511A06088J482J077L78K76O96Q29K60o05j170j258r98n38p6J27k0l67q34j473
51493A03874k090k161j499p56p93j663k646l205l496l758l771l166k080j080n69
51478G1141m49m00l02k79m17m82p6P98J484J260J92r28j511j708j835j731j081
51461F3676q2O36P63N45K83L8r9J36P34J178R21P8o93r15o95l86j32Q0J55k0k33
51440F5968j8P00J298J110L87J87J171K805L979M106L350K093P49r6m1M81M88
51423H8717l10j056q55N3P14O86K83k23q40j328j103q6Q85R36J89m74m55Q4O87
51404H6504J052J018N36k04q44j167j237j109o61J52R94J299O74q05k541l639
$$ y = [102839, 105256, 107734, 109600, 110774, 111538, 112003, 112084, 111795, 111335, 110887, 110447, 109815, 108722, 107167, 105714, 105242, 106088, 107570, 108647, 109025, 109301, 109997, 110826, 111086, 110481, 109311, 108053, 107055, 106517, 106441, 106568, 106548, 106181, 105347, 103874, 101784, 99623, 98124, 97368, 96575, 94912, 92266, 89061, 85565, 81807, 78036, 74870, 72790, 71710, 71141, 70692, 70292, 69990, 69711, 69294, 68812, 68736, 69534, 71018, 72278, 72470, 71542, 70031, 68323, 66488, 64757, 63676, 63594, 64230, 64993, 65538, 65821, 65859, 65760, 65896, 66630, 67808, 68729, 68807, 68114, 67199, 66504, 66118, 65986, 66066, 66221, 66201, 65968, 65950, 66650, 67948, 69058, 69445, 69632, 70803, 73608, 77587, 81693, 85043, 87136, 87885, 87789, 87748, 88229, 88717, 88407, 87351, 86496, 86549, 87263, 87949, 88232, 88009, 87169, 85841, 84738, 84652, 85537, 86473, 86662, 86188, 85733, 85817, 86504, 87556, 88574, 89110, 88906, 88062, 86895, 85658, 84549, 83888, 84040, 85034, 86333, 87007, 86202, 83661, 80022]
51388H0022l441k155q40m17p01o74K12J293J480N57o38j270j305j201j128r20
51372F8874n59l49n00q45j049q94l06O20J481J769J449J106J182J315Q15k66j079
51355G2764j041n53m22q75j416j427p33L09J080J185P99M22K57P4l07o98r22j114
51337F7382j357j356q58j90R4J1J13O71J275J407J098Q41J028J545J836J376K51
51320G5167q02j126q52n73n25m17j30m3n30j435k183k285j571l21P49R70M32n5
51302F4470J03O40R09P25L51q5o70j240j316p11N3K30l35j042j220p84j23M70
51284F0425R41J117O51l71j109p82L45J227J291R53Q94J255J762K115K086J592
51268G4392R80Q20J150J252N80m46r94q76o00n15m74k52J12M85P36O31j4r64j598
$$ y = [80022, 76581, 74426, 73586, 73169, 72468, 71794, 72006, 73299, 74779, 75336, 74698, 73428, 72123, 70922, 69794, 68874, 68315, 67966, 67466, 66621, 65572, 64678, 64372, 64992, 66473, 68242, 69691, 70797, 71979, 73294, 74109, 73843, 72764, 71723, 71170, 70748, 69873, 68457, 67030, 66297, 66606, 67686, 68871, 69670, 70092, 70349, 70423, 70116, 69418, 68496, 67382, 66025, 64669, 63811, 63621, 63715, 63726, 63839, 64510, 65785, 67192, 68290, 69131, 70159, 71704, 73540, 74916, 75167, 74365, 73239, 72387, 71814, 71289, 70872, 70742, 70699, 70169, 68734, 66551, 64266, 62695, 62374, 63123, 64093, 64525, 64470, 64573, 65213, 66122, 66847, 67198, 67113, 66443, 65203, 63887, 63176, 63229, 63459, 63124, 62082, 60862, 60078, 59955, 60425, 61366, 62483, 63134, 62763, 61654, 60872, 61217, 62444, 63735, 64688, 65582, 66837, 68599, 70714, 72800, 74392, 75372, 76192, 77342, 78594, 79174, 78728, 77734, 76858, 76258, 75743, 75269, 75017, 75129, 75614, 76350, 76981, 76967, 76003, 74405]
51249G4405j494q57k88k28o03r61r21n53k58k55l46l02k29l28m56k43M18J242
51231F7743J815J849J280L81k51j12P41J710K138J700N46p71j641j877j745j424
51215G2082p65J98Q65P27J25j45Q9K81J62J93P67J526J770J285M53k45n97o44
51197G8127n52m50l54k69l60p75j300j455j021k90K95N91O64N47K00l44r18j238
51179G1098j005j30J019J799J840J419J149J359J792J900J426O59Q4j61l38o61
51163H3249j027j271j393j431j326j127r97q68m36K18M50Nk65N92K163L000K453
51146H1989J355O94M18Mm53l97K50R03J039O92K14j35k80k52r5J05K06J11n8o5
51126H6245J13K29J71J52L02L51Q1k85n11q23j365j619j102m05n17j211j194q2
$$ y = [74405, 72911, 72054, 71766, 71538, 70935, 69974, 69053, 68500, 68242, 67987, 67641, 67339, 67110, 66782, 66326, 66083, 66501, 67743, 69558, 71407, 72687, 73068, 72817, 72705, 73446, 75156, 77294, 78994, 79540, 78769, 77128, 75251, 73506, 72082, 71317, 71515, 72380, 73107, 73232, 73087, 73176, 73457, 73619, 73812, 74579, 76105, 77875, 79160, 79613, 79368, 78771, 78127, 77575, 77125, 76771, 76502, 76142, 75367, 74067, 72612, 71591, 71301, 71596, 72187, 72851, 73398, 73598, 73254, 72336, 71098, 70093, 69963, 70982, 72781, 74621, 76040, 77189, 78548, 80340, 82240, 83666, 84325, 84409, 84248, 83910, 83249, 82222, 80951, 79558, 78127, 76801, 75674, 74677, 73809, 73373, 73591, 74041, 74046, 73781, 74373, 76536, 79536, 81989, 83344, 84038, 84456, 84460, 84007, 83610, 83860, 84763, 85802, 86494, 86708, 86573, 86293, 86041, 85946, 86051, 86257, 86368, 86310, 86245, 86358, 86587, 86758, 86910, 87212, 87563, 87644, 87359, 86848, 86025, 84660, 83041, 81939, 81534, 81017, 79806, 78612, 78530]
51108G8530R36Q04j9n27n95o75p28l86K41O74P50O09K56k31m52j17M38P12P07
51089H0927O42M13n6l17Q4P52Q95M25O4L46J085J756J902J319L15l73l72j78l78
51070H9251p20o08j90j18l86l31K89R87J380J532J423Q99K53N8K84L71K73N58
51052I5205J227J490J059P24J016J206N11n27p69j45M04L58O1j82n00q23o78R8
51034I9735R25J160P68J16n60j186j525j288n72N6J32j36j21M24J013J086P34
51017A00761M90N41O00N00M47N26M77J75p2J8K35K42R7J09L21M95M82L72M31R77
50997A08224K106L338L831L292K327J676J338R30N91R00J937K977L344L121K877
50982A42809K946L184L254L007K624K442K585K868L162L668M566N553O100O159
$$ y = [78530, 79466, 80270, 80251, 79724, 79129, 78454, 77726, 77340, 77581, 78255, 79005, 79614, 79870, 79639, 79187, 79070, 79508, 80220, 80927, 81569, 81982, 81926, 81609, 81693, 82445, 83340, 83765, 83829, 84175, 85260, 87016, 88918, 90237, 90552, 90179, 89807, 89629, 89251, 88531, 87923, 87733, 87615, 87229, 86898, 87187, 88174, 89554, 91086, 92509, 93408, 93661, 93719, 94003, 94374, 94647, 95205, 96432, 97922, 98981, 99705, 100721, 101927, 102438, 101911, 101142, 100997, 101401, 101759, 101820, 101638, 101138, 100315, 99637, 99735, 100660, 101820, 102588, 102704, 102144, 100958, 99433, 98145, 97573, 97629, 97761, 97625, 97504, 97928, 98941, 100027, 100761, 101251, 101792, 102392, 102892, 103339, 103865, 104342, 104517, 104445, 104463, 104698, 104940, 105037, 105146, 105467, 105962, 106444, 106816, 107247, 108224, 110330, 113668, 117499, 120791, 123118, 124794, 126132, 127062, 127653, 128553, 130490, 133467, 136811, 139932, 142809, 145755, 148939, 152193, 155200, 157824, 160266, 162851, 165719, 168881, 172549, 177115, 182668, 188768, 194927]
50968A94927O222O660P389Q305R602J1413J3408J5100J6354J7408J8500J9724
50956C45012K1081K2389K3258K3435K3154K2769K2231K1174J9548J7610J5315
50945E76976J2252Q504M943K154m92l961q052j1647j4360j6895j9528k1303k1435
50932D87156k0660k0267k0339j9984j8984j8024j7312j6133j4165j2179j0964
50921B98145j0257r393q329p416o603n599m511l700l154k539j808j220r57j051
50907B31608j558k297k635k088j044l60k80k76K0L24K58p0l09k89j12k9l40j043
50889B19480j572j310m71M3j49l53J63J059J395R04K44K8K30N86J100J794K416
50872B25587K636K514K439K623K886K992K991L169L694M488N398O359P334Q164
$$ y = [194927, 201149, 207809, 215198, 223503, 233105, 244518, 257926, 273026, 289380, 306788, 325288, 345012, 366093, 388482, 411740, 435175, 458329, 481098, 503329, 524503, 544051, 561661, 576976, 589228, 597732, 602675, 604829, 604337, 600376, 592324, 580677, 566317, 549422, 529894, 508591, 487156, 466496, 446229, 425890, 405906, 386922, 368898, 351586, 335453, 321288, 309109, 298145, 287888, 278495, 270166, 262750, 256147, 250548, 246037, 242337, 239183, 236644, 234836, 233616, 232659, 231608, 230050, 227753, 225118, 223030, 221986, 221626, 221346, 221070, 221090, 221414, 221672, 221602, 221293, 221004, 220892, 220863, 220523, 219480, 217908, 216598, 216127, 216170, 216021, 215668, 215831, 216890, 218285, 219189, 219433, 219461, 219691, 220277, 221377, 223171, 225587, 228223, 230737, 233176, 235799, 238685, 241677, 244668, 247837, 251531, 256019, 261417, 267776, 275110, 283274]
50858B83274Q647Q762Q852R457J0972J3315J5922J8192K0065K2100K4889K8411
50846D72858L2055L5340L8482M2201M6874N1936N6214N8976O0578O1881O3039
50835A020434O3205O1492N7917N2995M6856L9261L0475K1385J2576L785n369j4451
50823A390561k2515k9159l4819m0075m4997m9275n2566n4519n4734n3081n0032
50812I04789m6498m3183m0171l7063l3433k9175k4559k0059j6076j2705r747p041
50800E85079m673k724q39J544M366O686P699P858Q376R545J0170R069O635M319
50786F53110K840J691L34r75j913k898m572o780q760j0195j1443j2734j3776j4393
50772E69536j4972j5841j6550j6324j5095j3614j2455j1368r834p993o592o021
$$ y = [283274, 291921, 300683, 309535, 318992, 329964, 343279, 359201, 377393, 397458, 419558, 444447, 472858, 504913, 540253, 578735, 620936, 667810, 719746, 775960, 834936, 895514, 957395, 1020434, 1083639, 1145131, 1203048, 1256043, 1302899, 1342160, 1372635, 1394020, 1406596, 1410381, 1405012, 1390561, 1368046, 1338887, 1304068, 1263993, 1218996, 1169721, 1117155, 1062636, 1007902, 954821, 904789, 858291, 815108, 774937, 737874, 704441, 675266, 650707, 630648, 614572, 601867, 592120, 585079, 580406, 577682, 576843, 578387, 582753, 589439, 597138, 604996, 613372, 622917, 633087, 642156, 648791, 653110, 655950, 657641, 657975, 657000, 655087, 652189, 647617, 640837, 632077, 621882, 610439, 597705, 583929, 569536, 554564, 538723, 522173, 505849, 490754, 477140, 464685, 453317, 443483, 435490, 428898, 422877]
50760D22877n755m970l514j921n18J010K951M879O149O886P925R706J1823J3787
50746D71315J5707J7836J9923K1542K2707K3732K4640K5270K5793K6566K7497
50735G22528K8021K7825K7125K6159K4869K3151K1080J8718J6063J3391J1277
50724I60207J0058R496R206R200R753J0804J1735J1803J0784R188P711O365M386
50711A080696J221k711o652j0564j4772j8797k1499k2621k3249k4249k5079k4819
50699H86905k3692k2722k2271k1796k0868j9575j8010j6056j3812j1584r353o732
50687F80434l540n0L419O712R645J2099J4344J6861J9750K2636K5158K7092K8044
50674H62604K7607K5969K3836K1570J8979J6152J3826J2391J1087Q837N647K559
$$ y = [422877, 417122, 412152, 408638, 406717, 406199, 407209, 410160, 415039, 421188, 428074, 435999, 445705, 457528, 471315, 487022, 504858, 524781, 546323, 569030, 592762, 617402, 642672, 668465, 695031, 722528, 750549, 778374, 805499, 831658, 856527, 879678, 900758, 919476, 935539, 948930, 960207, 970265, 979761, 988967, 998167, 1007920, 1018724, 1030459, 1042262, 1053046, 1062234, 1069945, 1076310, 1080696, 1081917, 1079206, 1072554, 1061990, 1047218, 1028421, 1006922, 984301, 961052, 936803, 911724, 886905, 863213, 840491, 818220, 796424, 775556, 755981, 737971, 721915, 708103, 696519, 687166, 680434, 676894, 676844, 680263, 686975, 696620, 708719, 723063, 739924, 759674, 782310, 807468, 834560, 862604, 890211, 916180, 940016, 961586, 980565, 996717, 1010543, 1022934, 1034021, 1042858, 1048505, 1051064]
50662A051064K85j547l702o300q672j0039j0120r257q025o754n359l581j308J362
50648I78047M216O971R323J1100J2393J3400J4135J4291J3532J2000J0426R501
50636A109335R057Q305O994N943O008O860P453P535P935R234J0973J2507J3942
50623A222081J5576J6842J6540J4106J0109N457N11m916j0882j6767k1435k4070
50611A223152k4952k5193k5577k5911k5703k5074k4607k4574k4834k5416k6559
50600I44752k8071k9132k9026k7893k6504k5479k4811k4018k2596k0412j7798
50589F69012j5322j3403j2129j1296j0554r609q462p392o641o119n511m627l547
50576E54400k505j718j201p22l0Q29J635K494L841N800P922R869J1937J4408J6789
$$ y = [1051064, 1051349, 1049802, 1046100, 1039800, 1031128, 1021089, 1010969, 1001712, 993687, 986933, 981574, 977993, 976685, 978047, 982263, 989234, 998557, 1009657, 1022050, 1035450, 1049585, 1063876, 1077408, 1089408, 1099834, 1109335, 1118392, 1126697, 1133691, 1139634, 1145642, 1152502, 1159955, 1167490, 1175425, 1184659, 1195632, 1208139, 1222081, 1237657, 1254499, 1271039, 1285145, 1295254, 1300711, 1301222, 1296306, 1285424, 1268657, 1247222, 1223152, 1198200, 1173007, 1147430, 1121519, 1095816, 1070742, 1046135, 1021561, 996727, 971311, 944752, 916681, 887549, 858523, 830630, 804126, 778647, 753836, 729818, 707222, 686810, 669012, 653690, 640287, 628158, 616862, 606308, 596699, 588237, 580845, 574204, 568085, 562574, 557947, 554400, 551895, 550177, 548976, 548254, 548224, 549053, 550688, 553182, 557023, 562823, 570745, 580614, 592551, 606959, 623748]
50561F23748J8410J9543K1099K3216K4974K5689K5640K5274K4531K3472K2739
50550H78335K2716K2861K2674K2768K4022K5991K7291K7449K7397K8000K9129
50539A158633L0469L2238L4547L6875L8902M1176M4234M7394M9372M9741M9057
50528A612638M7703M5440M2156L8105L3172K6640J8282R086M37p253j4564k1971
50516A829871k9238l5797m1292m5581m8513m9868m9531m7620m4567m0940l7104
50505A359820l3062k8743k4428k0687j7828j5508j3073j0175o984l794o61K454
50493A187331N255P135P722P175N837L708N00l930r413j5581k1877k7565l2118
50480A114179l5634l8522m0747m1772m1341l9925l8195l6417l4544l2619l0721
$$ y = [623748, 642158, 661701, 682800, 706016, 730990, 756679, 782319, 807593, 832124, 855596, 878335, 901051, 923912, 946586, 969354, 993376, 1019367, 1046658, 1074107, 1101504, 1129504, 1158633, 1189102, 1221340, 1255887, 1292762, 1331664, 1372840, 1417074, 1464468, 1513840, 1563581, 1612638, 1660341, 1705781, 1747937, 1786042, 1819214, 1845854, 1864136, 1873222, 1873659, 1866406, 1851842, 1829871, 1800633, 1764836, 1723544, 1677963, 1629450, 1579582, 1530051, 1482431, 1437864, 1396924, 1359820, 1326758, 1298015, 1273587, 1252900, 1235072, 1219564, 1206491, 1196316, 1189332, 1185538, 1184877, 1187331, 1192586, 1199721, 1207443, 1214618, 1220455, 1224163, 1224663, 1220733, 1211320, 1195739, 1173862, 1146297, 1114179, 1078545, 1040023, 999276, 957504, 916163, 876238, 838043, 801626, 767082, 734463, 703742]
50469G03742k8800k6850k5039k3384k1618j9594j7561j5685j3660j1236q867p205
50457D84243o147m939l251j459O2J349K404K996L165L423M111M973N724O651Q233
50442E11538J0376J2428J3858J4655J5182J5888J7101J8885K1002K3060K4639
50431F98612K5502K5970K6889K8798L1094L2571L2936L3165L4079L5189L5540
50420A040345L5144L4859L5088L5304L4891L3678L1689K8868K5370K1579J7535
50409A374350J2720O735J9o453j2134j7372k2830k8586l3914l8030m0928m3258
50397A150319m5337m6663m6608m5313m3493m1485l8950l5527l1478k7493k4061
50386G23911k1062j7922j4241j0287o739l857j216J467L708N007N813P030Q650
$$ y = [703742, 674942, 648092, 623053, 599669, 578051, 558457, 540896, 525211, 511551, 500315, 491448, 484243, 478096, 473157, 469906, 468447, 468509, 469858, 472262, 475258, 478423, 481846, 485957, 490930, 496654, 503305, 511538, 521914, 534342, 548200, 562855, 578037, 593925, 611026, 629911, 650913, 673973, 698612, 724114, 750084, 776973, 805771, 836865, 869436, 902372, 935537, 969616, 1004805, 1040345, 1075489, 1110348, 1145436, 1180740, 1215631, 1249309, 1280998, 1309866, 1335236, 1356815, 1374350, 1387070, 1393805, 1393824, 1387371, 1375237, 1357865, 1335035, 1306449, 1272535, 1234505, 1193577, 1150319, 1104982, 1058319, 1011711, 966398, 922905, 881420, 842470, 806943, 775465, 747972, 723911, 702849, 684927, 670686, 660399, 653660, 649803, 648587, 650054, 653762, 658769, 664582, 671612, 680262]
50373F80262R644R312P941N919L054p30m678p885j0277j2358j4279j5803j6939
50360F33183j7950j8811j9182j8949j8283j7237j5750j4056j2568j1373j0227
50349D58797r135q385p879p008n508l974l168l050k888k150r86N1N38M85L08M45
50333D06493R17J357J567J758K133K531K774L129M040N514P090Q403R476J0497
50319D67679J1542J2571J3471J4072J4360J4571J4859J4962J4523J3705J3119
50308F19434J2993J2740J1547R188O117K996L23j713l248m603n996p426q860j0382
50294F33110j2060j3789j5355j6549j7231j7455j7495j7559j7382j6562j5244
50283D56429j4046j3091j1638r194o541m970m658m499l591k288j528j576j809
$$ y = [680262, 689906, 699218, 707159, 713078, 716132, 715402, 710724, 702839, 692562, 680204, 665925, 650122, 633183, 615233, 596422, 577240, 558291, 540008, 522771, 507021, 492965, 480397, 469024, 458797, 449662, 441277, 433398, 426390, 420882, 416908, 413740, 410690, 407802, 405652, 404666, 404717, 405255, 405740, 406048, 406493, 407410, 408767, 410334, 412092, 414225, 416756, 419530, 422659, 426699, 432213, 439303, 447706, 457182, 467679, 479221, 491792, 505263, 519335, 533695, 548266, 563125, 578087, 592610, 606315, 619434, 632427, 645167, 656714, 665902, 672019, 675015, 675338, 673625, 670377, 665774, 659778, 652352, 643492, 633110, 621050, 607261, 591906, 575357, 558126, 540671, 523176, 505617, 488235, 471673, 456429, 442383, 429292, 417654, 408460, 401919, 396949, 392291, 387792, 384201, 381913, 380385, 378809, 377000]
50270C77000j476m21Q31J633J814J765J799J676J007L0n71n39l04k36j84N7K56
50253C84137J04k66m77m16k32p4m0k24m79l95J90Q67J157J101J044J104J257J725
50235C90083K673L656L944L478K968K973L389M018N059O627Q208R049Q956Q274
50221D63355P283N999M579L494L113L369L896M348M502M287L890L741M114M766
50207E24736N193N270N453O126O987P421P451P858R148J0732J1537J1299J0785
50194F29996J0799J1441J2460J3791J5459J7231J8926K0858K3584K7189L1221
50183H32955L5424M0154M5846N2394N9303O6196P2790P8461Q2291Q3648Q2471
50172A531933P8898P2985O5004N5825M6622L8195L0758K4231J8332J2389N453
$$ y = [377000, 375524, 375103, 375934, 377567, 379381, 381146, 382945, 384621, 385628, 385658, 385087, 384548, 384244, 384008, 383824, 383881, 384137, 384241, 383975, 383498, 383082, 382850, 382776, 382736, 382512, 382033, 381638, 381828, 382695, 383852, 384953, 385997, 387101, 388358, 390083, 392756, 396412, 400356, 403834, 406802, 409775, 413164, 417182, 422241, 428868, 437076, 446125, 455081, 463355, 470638, 476637, 481216, 484710, 487823, 491192, 495088, 499436, 503938, 508225, 512115, 515856, 519970, 524736, 529929, 535199, 540652, 546778, 553765, 561186, 568637, 576495, 585643, 596375, 607912, 619211, 629996, 640795, 652236, 664696, 678487, 693946, 711177, 730103, 750961, 774545, 801734, 832955, 868379, 908533, 954379, 1006773, 1066076, 1132272, 1205062, 1283523, 1365814, 1449462, 1531933, 1610831, 1683816, 1748820, 1804645, 1851267, 1889462, 1920220, 1944451, 1962783, 1975172, 1980625]
50161A980625l102j3234k4584l6871m9645o1858p2156p9709q4512q6778q6529
50150A381647q3957p9862p5241p0416o4955n8614n1984m6048m1281l7448l4054
50139G37787l0670k7015k3191j9810j7503j6112j4856j3349j2010j1174j0397
50128E41700r142p722o844o454n824m765l891l518l079k051r11n26r84j574j617
50113D82798r21L93J896K872K885K423K462L281M131M226L713L345L525M024M564
50098E25617N240O227P278P874P857P683P847Q233Q337Q086P976Q369R013R514
50084F35151R934J0590J1532J2544J3540J4609J5753J6971J8526K0727K3505K6484
50072H29866K9579L3203L7764M3204M9250N5917O3605P2682Q3034R4086J05276
$$ y = [1980625, 1977523, 1964289, 1939705, 1902834, 1853189, 1791331, 1719175, 1639466, 1554954, 1468176, 1381647, 1297690, 1217828, 1142587, 1072171, 1007216, 948602, 896618, 850570, 809289, 771841, 737787, 707117, 680102, 656911, 637101, 619598, 603486, 588630, 575281, 563271, 552097, 541700, 532558, 524836, 517992, 511538, 505714, 500949, 497058, 493540, 490461, 488410, 487499, 486973, 485989, 484415, 482798, 481877, 482270, 484166, 487038, 489923, 492346, 494808, 498089, 502220, 506446, 510159, 513504, 517029, 521053, 525617, 530857, 537084, 544362, 552236, 560093, 567776, 575623, 583856, 592193, 600279, 608255, 616624, 625637, 635151, 645085, 655675, 667207, 679751, 693291, 707900, 723653, 740624, 759150, 779877, 803382, 829866, 859445, 892648, 930412, 973616, 1022866, 1078783, 1142388, 1215070, 1298104, 1392190, 1497466]
50061A497466J16462J27643J38177J46470J50756J50184J45113J36626J25994
50052B734891J14526J03371R3242Q4211P5707O6605N5553M1599K4540M661j7574
50041C381332m1207o4449q5342j02915j17387j29074j37548j42107j42796j40548
50031B277959j36468j31172j24809j17457j09344j00735r1728q2348p2871o3891
50021A247136n5946m9165m3376l8450l4309l0759k7573k4742k2456k0781j9568
50010H80011j8581j7623j6608j5622j4848j4369j4183j4415j5108j5745j5493
49999G07416j4297j3168j2825j2585j1336r309p833p516p638p460p096o760o057
49986E83536m670l088k007j433q76j44N31Q94Q74O31O15J232K176K564J981J039
$$ y = [1497466, 1613928, 1741571, 1879748, 2026218, 2176974, 2327158, 2472271, 2608897, 2734891, 2849417, 2952788, 3046030, 3130241, 3205948, 3272553, 3328106, 3369705, 3394245, 3398906, 3381332, 3340125, 3275676, 3190334, 3087419, 2970032, 2840958, 2703410, 2561303, 2418507, 2277959, 2141491, 2010319, 1885510, 1768053, 1658709, 1557974, 1466246, 1383898, 1311027, 1247136, 1191190, 1142025, 1098649, 1060199, 1025890, 995131, 967558, 942816, 920360, 899579, 880011, 861430, 843807, 827199, 811577, 796729, 782360, 768177, 753762, 738654, 722909, 707416, 693119, 679951, 667126, 654541, 643205, 633896, 626063, 618547, 610909, 603449, 596353, 589593, 583536, 578866, 575778, 573771, 572338, 571462, 571318, 571849, 572743, 573617, 574248, 574863, 576095, 578271, 580835, 582816, 583855]
49970E83855M72K21j76p03r35o80l1Q73J753K139J965J841K329L233M162N328
49954F05646P156R425J1672J4212J7848K2564K7406L1837L6408M1793M7930N4447
49942I28344O1348O8748P6364Q3677R0249R5367R7723R6090R0379Q1760P1686
49931A841735O1074N0449M0489L2025K5332J9547J3135M993n070j6899l0504m5631
49919A990675o1154p5475q7443r6464j01968j03505j01500r7235r1801q5512p8491
49908A010127p1231o4185n7309n0495m4092l8570l3959l0029k6749k4082k1514
49897E47912j8466j5131j2334j0435q928p328o021n727o375o972o622n421m150
49884D34002l425l306l520l759l696l155k401k100k566l261l293k464j504j186
$$ y = [583855, 584327, 584548, 584372, 583669, 582734, 582054, 582023, 582896, 584649, 586788, 588753, 590594, 592923, 596156, 600318, 605646, 612802, 622227, 633899, 648111, 665959, 688523, 715929, 747766, 784174, 825967, 873897, 928344, 989692, 1058440, 1134804, 1218481, 1308730, 1404097, 1501820, 1597910, 1688289, 1770049, 1841735, 1902809, 1953258, 1993747, 2025772, 2051104, 2070651, 2083786, 2088779, 2083709, 2066810, 2036306, 1990675, 1929521, 1854046, 1766603, 1670139, 1568171, 1464666, 1363166, 1265931, 1174130, 1088618, 1010127, 938896, 874711, 817402, 766907, 722815, 684245, 650286, 620257, 593508, 569426, 547912, 529446, 514315, 501981, 491546, 482618, 475290, 469269, 463542, 457167, 450195, 443573, 438152, 434002, 430577, 427271, 423751, 419992, 416296, 413141, 410740, 408640, 406074, 402813, 399520, 397056, 395552, 394366]
49870C94366j534k011k267k328k284k086j741j444j362j356j053k92N47P93J61
49855C76109q69j475j270n82j2J64J01J34M77R95J237Q72J39l07j79O8j42p12
49837C74748j049r30p46p16m07O00J864K428J992J214P81O76O71R97J956L146
49821C87225L735L498L031K849K811K633K436K449K501K303J846J279O12j49p96
49806D18263j233j688k297k753k770k552k358j987j267p00p93j057n97L35N18
49791C97064l60j096q00k52o35j687k145j670j163j319j693j507o68K78Q06P18
49775C83871J30o57j339j723j757j477j030n98j66L98R06Q78K06n81r85j100j083
49758C73893o02N06J485J442P36N71J206J562R32L1j21M62J148J648J830J234
$$ y = [394366, 392832, 390821, 388554, 386226, 383942, 381856, 380115, 378671, 377309, 375953, 374900, 374608, 375155, 375948, 376109, 375240, 373765, 372495, 371913, 371901, 372065, 372166, 372300, 372777, 373772, 375009, 375881, 376020, 375713, 375534, 375602, 375460, 374748, 373699, 372769, 372023, 371307, 370900, 371500, 373364, 375792, 377784, 378998, 379779, 380455, 381126, 382123, 384079, 387225, 390960, 394458, 397489, 400338, 403149, 405782, 408218, 410667, 413168, 415471, 417317, 418596, 419208, 419059, 418263, 417030, 415342, 413045, 410292, 407522, 404970, 402612, 400625, 399358, 398658, 397865, 396808, 396211, 396546, 397064, 396704, 395608, 394808, 394556, 393921, 392234, 390089, 388419, 387256, 385937, 384244, 382737, 382069, 382347, 383153, 383871, 384001, 383344, 382005, 380282, 378525, 377048, 376018, 375420, 375254, 375652, 376558, 377436, 377642, 377061, 376076, 374976, 373893, 373291, 373797, 375282, 376724, 377460, 378031, 379237, 380799, 381731, 381762, 381641, 382103, 383251, 384899, 386729, 387963]
49742C87963k07j436j366n08m33j535k465k093j059p00j186j569j301q35p80j121
49726C69369j393j225n69K54O45J52j049k217k682k263j129L98J813K459K024
49711C64587R68K15L14R60J409J268P75L40O8j53k69o9M16Q79J164J435J762J860
49693C77929J530J106J038J246J342J394J861K742L317L073K341J814J710J880
49679D04323K263K830L315L461L414L427L381L031K601K562K899L091K945K834
49665D46377K978L100K981K897L010K931K364J777J808K195K119J491J149J538
49651D78715J969J656R26P35J318J925J936J543J272J285J444J632J723J509J016
49636E00604P27J104K009K890L405L561L316K598J743J418J830K401K518K279
$$ y = [387963, 387756, 386320, 384954, 384446, 384013, 382478, 380013, 377920, 376861, 376161, 374975, 373406, 372105, 371270, 370490, 369369, 367976, 366751, 366182, 366436, 367081, 367233, 366184, 363967, 361285, 359022, 357893, 358291, 360104, 362563, 364587, 365555, 365770, 366084, 367044, 368453, 369721, 370496, 370836, 370904, 370751, 370482, 370413, 370829, 371708, 372872, 374307, 376069, 377929, 379459, 380565, 381603, 382849, 384191, 385585, 387446, 390188, 393505, 396578, 398919, 400733, 402443, 404323, 406586, 409416, 412731, 416192, 419606, 423033, 426414, 429445, 432046, 434608, 437507, 440598, 443543, 446377, 449355, 452455, 455436, 458333, 461343, 464274, 466638, 468415, 470223, 472418, 474537, 476028, 477177, 478715, 480684, 482340, 483266, 484001, 485319, 487244, 489180, 490723, 491995, 493280, 494724, 496356, 498079, 499588, 500604, 501331, 502435, 504444, 507334, 510739, 514300, 517616, 520214, 521957, 523375, 525205, 527606, 530124, 532403]
49622E32403K196K486L009L685M470M978M733L875L247L567M751O124P136P659
49608E94319P899Q126Q422Q609Q537Q411Q617R208R880J0488J1234J2126J2657
49595G18533J2426J1868J1915J2879J4042J4525J4243J3902J4172J5085J6114
49584H69704J6703J6682J6318J6095J6372J7047J7558J7310J6332J5410J5391
49573A050922J6296J7343J7882J8026J8232J8543J8562J8083J7345J6584J5682
49562A243500J4393J2827J1446J0633J0331J0012R051P288N354M231M224M510
49550A347800L995K549J120N73Q29J233J395J312J020O31N68J181K075K389J958
49535A370628J694K440L792M605M500M283M836O065P164P651P823Q269R208J0316
$$ y = [532403, 534599, 537085, 540094, 543779, 548249, 553227, 557960, 561835, 565082, 568649, 573400, 579524, 586660, 594319, 602218, 610344, 618766, 627375, 635912, 644323, 652940, 662148, 672028, 682516, 693750, 705876, 718533, 730959, 742827, 754742, 767621, 781663, 796188, 810431, 824333, 838505, 853590, 869704, 886407, 903089, 919407, 935502, 951874, 968921, 986479, 1003789, 1020121, 1035531, 1050922, 1067218, 1084561, 1102443, 1120469, 1138701, 1157244, 1175806, 1193889, 1211234, 1227818, 1243500, 1257893, 1270720, 1282166, 1292799, 1303130, 1313142, 1322193, 1329481, 1334835, 1339066, 1343290, 1347800, 1351795, 1354344, 1355464, 1356037, 1356866, 1358099, 1359494, 1360806, 1361826, 1362457, 1363025, 1364206, 1366281, 1368670, 1370628, 1372322, 1374762, 1378554, 1383159, 1387659, 1391942, 1396778, 1402843, 1410007, 1417658, 1425481, 1433750, 1442958, 1453274]
49521A453274J1084J1236J0843J0172R474Q866Q272P462O251M688K983J317j80
49508A545742j396k443l814n870q208r904j0641j1136j2156j3547j4598j5081
49496A436948j5415j5952j6628j7218j7540j7400j6754j5967j5519j5466j5437
49485A257652j5229j5002j4874j4672j4227j3631j3060j2582j2178j1777j1200
49474A109220j0246q957p676o865o804p306p701p392o636o327o746p039o437n468
49460A007620n186n466n153l825k359j539j057l91K62N09N78R15J421J746J999
49445I90074K577L417L977L758K606O64j593l433m332m262l471k309j340j109
49431I85224j484j629j042j68M11Q48J577K394K734K602K579K958L413L546L315
$$ y = [1453274, 1464358, 1475594, 1486437, 1496609, 1506083, 1514949, 1523221, 1530683, 1536934, 1541622, 1544605, 1545922, 1545742, 1544346, 1541903, 1538089, 1532219, 1524011, 1514107, 1503466, 1492330, 1480174, 1466627, 1452029, 1436948, 1421533, 1405581, 1388953, 1371735, 1354195, 1336795, 1320041, 1304074, 1288555, 1273089, 1257652, 1242423, 1227421, 1212547, 1197875, 1183648, 1170017, 1156957, 1144375, 1132197, 1120420, 1109220, 1098974, 1090017, 1082341, 1075476, 1068672, 1061366, 1053665, 1046273, 1039637, 1033310, 1026564, 1019525, 1013088, 1007620, 1002434, 996968, 991815, 987990, 985631, 984092, 983035, 982644, 982906, 983415, 983993, 984908, 986329, 988075, 990074, 992651, 996068, 1000045, 1003803, 1006409, 1007073, 1005480, 1002047, 997715, 993453, 989982, 987673, 986333, 985224, 983740, 982111, 981069, 980901, 981312, 982160, 983737, 986131, 988865, 991467, 994046, 997004, 1000417, 1003963, 1007278]
$$ [...]
##END NTUPLES=NMR SPECTRUM
##END=
