##TITLE=NES1051_Conilon_9270716_MiSnGA3gQ1
##JCAMPDX= 6.0         $$ Bruker NMR JCAMP-DX V2.0
##DATA TYPE= NMR SPECTRUM
##DATA CLASS= NTUPLES
##ORIGIN= BRUKER
##OWNER= Administrator
$$ 1.72 TOPSPIN		Version 2.1
$$ 2015-07-18 18:59:54.744 -0700  Administrator@X
$$ Compression mode = diff/dup
##.OBSERVE FREQUENCY= 400.02188249412
##.OBSERVE NUCLEUS= ^1H
##.ACQUISITION MODE= SIMULTANEOUS (DQD)
##.ACQUISITION SCHEME= undefined
##.AVERAGES= 8
##.DIGITISER RES= 22
##SPECTROMETER/DATA SYSTEM= spect
##.PULSE SEQUENCE= zg30
##.SOLVENT NAME= COFFEE_meoh
##.SHIFT REFERENCE= INTERNAL, COFFEE_meoh, 1, 14.98509
##AUDIT TRAIL= $$ (NUMBER, WHEN, WHO, WHERE, PROCESS, VERSION, WHAT)
$$ ##TITLE= Audit trail, TOPSPIN		Version 2.1
$$ ##JCAMPDX= 5.01
$$ ##ORIGIN= Bruker BioSpin GmbH
$$ ##OWNER= Administrator
$$ $$ E:\/data/COFFEE/nmr/NES1051_Conilon_9270716_MiSnGA3gQ1/20/pdata/1/auditp.txt
$$ ##AUDIT TRAIL=  $$ (NUMBER, WHEN, WHO, WHERE, PROCESS, VERSION, WHAT)
(   1,<2015-07-18 18:59:47.260 -0700>,<Administrator>,<X>,<go>,<TOPSPIN 2.1>,
      <created by zg
	started at 2015-07-18 18:58:41.072 -0700,
	POWCHK enabled, PULCHK disabled,
       configuration hash MD5:
       21 0F 79 D6 B3 7B B4 F6 88 20 88 DB 03 48 BD 9F
       data hash MD5: 64K
       F8 AD FB E1 66 1B FD 88 0C 1E CC A3 76 E2 D2 4A>)
(   2,<2015-07-18 18:59:50.588 -0700>,<Administrator>,<X>,<proc1d>,<TOPSPIN 2.1>,
      <Start of raw data processing
       efp LB = 0 FT_mod = 6 PKNL = 1 PHC0 = 0 PHC1 = 0 SI = 32K 
       data hash MD5: 32K
       81 11 F5 3D E3 DF D4 0E C5 64 6E 2C 7B E6 8E 05>)
(   3,<2015-07-18 18:59:50.900 -0700>,<Administrator>,<X>,<proc1d>,<TOPSPIN 2.1>,
      <pk PHC0 = 87.47314 PHC1 = 0 
       data hash MD5: 32K
       A6 B4 1B F1 C0 42 FC 23 21 93 7F 5A 2F 0E F0 39>)
(   4,<2015-07-18 18:59:51.010 -0700>,<Administrator>,<X>,<proc1d>,<TOPSPIN 2.1>,
      <abs ABSG = 1 
       data hash MD5: 32K
       BF 94 46 8D 76 E8 AA 3C 8C 76 24 65 8D 7B AA AF>)
(   5,<2015-07-18 18:59:51.072 -0700>,<Administrator>,<X>,<proc1d>,<TOPSPIN 2.1>,
      <abs ABSG = 2 
       data hash MD5: 32K
       51 86 98 2B E7 D7 D9 1B DF 05 7B 33 44 E4 C7 06>)
(   6,<2015-07-18 18:59:51.135 -0700>,<Administrator>,<X>,<proc1d>,<TOPSPIN 2.1>,
      <abs ABSG = 3 
       data hash MD5: 32K
       11 D2 B2 66 C9 C7 7E A4 4D 21 21 31 B4 02 F1 97>)
(   7,<2015-07-18 18:59:51.197 -0700>,<Administrator>,<X>,<proc1d>,<TOPSPIN 2.1>,
      <abs ABSG = 4 
       data hash MD5: 32K
       90 B7 01 1B 15 D6 9E 62 42 A8 9B 80 ED 86 4E 64>)
(   8,<2015-07-18 18:59:51.260 -0700>,<Administrator>,<X>,<proc1d>,<TOPSPIN 2.1>,
      <abs ABSG = 5 
       data hash MD5: 32K
       0C 8B 33 DE 11 1F E4 B5 78 D3 11 FE CB 32 85 06>)
$$ ##END=
$$ 
$$ $$ hash MD5
$$ $$ 97 30 7C 0E 2C 0E 13 6C 47 E9 94 FE 16 B2 42 89
##$RELAX= 
##$RELAX= 
##$RELAX= 
##$RELAX= 
##$RELAX= 
##$RELAX= 
##$RELAX= 
$$ Bruker specific parameters
$$ --------------------------
##$DU= <E:\>
##$EXPNO= 20
##$NAME= <NES1051_Conilon_9270716_MiSnGA3gQ1>
$$ [...]
150 150 150 150 150 150 150 150
##$TP07= 0
##$TPNAME0= <>
##$TPNAME1= <>
##$TPNAME2= <>
##$TPNAME3= <>
##$TPNAME4= <>
##$TPNAME5= <>
##$TPNAME6= <>
##$TPNAME7= <>
##$TPOAL= (0..7)
0.5 0.5 0.5 0.5 0.5 0.5 0.5 0.5
##$TPOFFS= (0..7)
0 0 0 0 0 0 0 0
##$TUNHIN= 0
##$TUNHOUT= 0
##$TUNXOUT= 0
##$USERA1= <user>
##$USERA2= <user>
##$USERA3= <user>
##$USERA4= <user>
##$USERA5= <user>
##$V9= 5
##$VALIST= <valist>
##$VCLIST= <CCCCCCCCCCCCCCC>
##$VD= 0
##$VDLIST= <DDDDDDDDDDDDDDD>
##$VPLIST= <PPPPPPPPPPPPPPP>
##$VTLIST= <TTTTTTTTTTTTTTT>
##$WBST= 2048
##$WBSW= 25
##$XGAIN= (0..3)
0 0 0 0
##$XL= 0
##$YL= 0
##$YMAX_a= 599080
##$YMIN_a= -508179
##$ZGOPTNS= <>
##$ZL1= 120
##$ZL2= 120
##$ZL3= 120
##$ZL4= 120
##$ABSF1= 14.98509
##$ABSF2= -5.573092
##$ABSG= 5
##$ABSL= 3
##$ALPHA= 0
##$AQORDER= 0
##$ASSFAC= 0
##$ASSFACI= 0
##$ASSFACX= 0
##$ASSWID= 0
##$AUNMP= <proc_prof1d_extract_pilot.lims>
##$AXLEFT= 0
##$AXNAME= <>
##$AXNUC= <1H>
##$AXRIGHT= 0
##$AXTYPE= 0
##$AXUNIT= <>
##$AZFE= 0.1
##$AZFW= 0.1
##$BCFW= 0
##$BC_mod= 0
##$BYTORDP= 0
##$COROFFS= 0
##$CY= 15
##$DATMOD= 1
##$DC= 0
##$DFILT= <>
##$DTYPP= 0
##$F1P= 0
##$F2P= 0
##$FCOR= 0.5
##$FTSIZE= 32768
##$FT_mod= 6
##$GAMMA= 0
##$GB= 0
##$INTBC= 1
##$INTSCL= 1
##$ISEN= 128
##$LB= 0
##$LEV0= 0
##$LPBIN= 0
##$MAXI= 10000
##$MC2= 0
##$MEAN= 0
##$ME_mod= 0
##$MI= 0
##$NCOEF= 0
##$NC_proc= -8
##$NLEV= 6
##$NOISF1= 0
##$NOISF2= 0
##$NSP= 0
##$NTH_PI= 0
##$NZP= 0
##$OFFSET= 14.98509
##$PC= 1
##$PHC0= 87.47314
##$PHC1= 0
##$PH_mod= 1
##$PKNL= yes
##$PPARMOD= 0
##$PPDIAG= 0
##$PPIPTYP= 0
##$PPMPNUM= 2147483647
##$PPRESOL= 1
##$PSCAL= 4
##$PSIGN= 0
##$PYNMP= <proc.py>
##$REVERSE= no
##$SF= 400.02
##$SI= 32768
##$SIGF1= 0
##$SIGF2= 0
##$SINO= 400
##$SIOLD= 32768
##$SPECTYP= <>
##$SREGLST= <1H.CDCl3>
##$SSB= 0
##$STSI= 32768
##$STSR= 0
##$SW_p= 8223.68421052631
##$SYMM= 0
##$S_DEV= 0
##$TDeff= 65536
##$TDoff= 0
##$TI= <>
##$TILT= no
##$TM1= 0
##$TM2= 0
##$TOPLEV= 0
##$USERP1= <user>
##$USERP2= <user>
##$USERP3= <user>
##$USERP4= <user>
##$USERP5= <user>
##$WDW= 1
##$XDIM= 32768
##$YMAX_p= 439268305
##$YMIN_p= -681223
##$CURPLOT= <Network HP LaserJet P1505>
##$CURPRIN= <$Network HP LaserJet P1505>
##$DFORMAT= <normdp>
##$LAYOUT= <+/1D_H.xwp>
##$LFORMAT= <normlp>
##$PFORMAT= <normpl>
##$SURQMSG= 1
$$ End of Bruker specific parameters
$$ ---------------------------------
##NTUPLES= NMR SPECTRUM
##VAR_NAME=  FREQUENCY,     SPECTRUM/REAL,   SPECTRUM/IMAG
##SYMBOL=    X,             R,               I
##VAR_TYPE=  INDEPENDENT,   DEPENDENT,       DEPENDENT
##VAR_FORM=  AFFN,          ASDF,            ASDF
##VAR_DIM=   32768,         32768,           32768
##UNITS=     HZ,            ARBITRARY UNITS, ARBITRARY UNITS
##FACTOR=    0.250966925370066, 1,           1
##FIRST=     8223.43324360094, -137410,      -92844
##LAST=      0,             -121749,         -33969
##MIN=       0,             -681223,         0
##MAX=       8223.43324360094, 439268305,    0
$$ Real data points
##PAGE= N=1
##DATA TABLE= (X++(R..R)), XYDATA
$$ [...]
19504a46341B34646b1590D999b25574F2516a72084o1595e9781j37065L5932B58936
$$ -146341 234646 -21590 4999 -225574 62516 -172084 -233679 -59781 -196846 -160914 258936
19492a01742j67886j34462c7164P141k70615E2604c59999c3799j26113B61713
$$ -101742 -269628 -404090 -37164 -30023 -300638 52604 -359999 -33799 -159912 261713
19481e9524m9314A28785a98382O4470M0701d0139F8492b50684O1751H0074K82893
$$ -59524 -108838 128785 -198382 -133912 -93211 -40139 68492 -250684 -188933 80074 362967
19470C62967C8339b44140D8211b25021J6064g7951A49614a97418O2823G1498f3506
$$ 362967 38339 -244140 48211 -225021 -208957 -77951 149614 -197418 -134595 71498 -63506
19458g9566l94903A23171a84963b4509k89371B12954c15051A70447a06405M1464
$$ -79566 -474469 123171 -184963 -24509 -313880 212954 -315051 170447 -106405 -64941
19448f4941j05314k3105l29304K47990C7927A0148h2040A59532b24688A50445
$$ -64941 -170255 -193360 -522664 -274674 37927 10148 -82040 159532 -224688 150445
19437a59375A59024b64819G1754g8638n3081G6619a27911m7277j63185J02869
$$ -159375 159024 -264819 71754 -78638 -131719 76619 -127911 -175188 -338373 -235504
19427b35504j89137c3231C6197M5407L449f7321p7534j01406p6511A23023N864
$$ -235504 -424641 -33231 36197 81604 85053 -67321 -144855 -246261 -322772 123023 128887
19416A28887R3606A7640K85793B8577P1934a88138F5238O2657K06187b22206C12814
$$ 128887 222493 17640 303433 28577 100511 -188138 65238 127895 334082 -222206 312814
19404I3133a8035C20969d10629A832J5927a04319l76476F6054a13049f953B78291
$$ 93133 -18035 320969 -410629 1832 17759 -104319 -480795 66054 -113049 -6953 278291
19392G5522a16109A87883c7010l6603A78682k6535P0409c24185K9193g6298k23746
$$ 75522 -116109 187883 -37010 -73613 178682 152147 222556 -324185 -294992 -76298 -300044
19381c00044E9402i6482B20225E2609b83325H4293K1565K04663A328L3352a04301
$$ -300044 59402 -96482 220225 52609 -283325 84293 105858 310521 1328 34680 -104301
19369b40285c9800B71355b75783L7221j06900L7712k5456b2095F4665j1362d6033
$$ -240285 -39800 271355 -275783 -238562 -345462 -307750 -333206 -22095 64665 53303 -46033
19357E4461e9820B82875b35201G4390b01792Q8514d7907A27309f9391j74769D5224
$$ 54461 -59820 282875 -235201 74390 -201792 -113278 -47907 127309 -69391 -244160 45224
19345F1106b1357C5275M2726a14629j12169A81377a04620C9472M1810d3934j6860
$$ 61106 -21357 35275 78001 -114629 -226798 181377 -104620 39472 81282 -43934 -60794
19334f0794p5604b038k01285K9805j40250a28550F5858c6202H2720b24724b8229
$$ -60794 -136398 -2038 -203323 -173518 -313768 -128550 65858 -36202 82720 -224724 -28229
19322h594r0830k55129M7451P7498n0278b6882j77641P2899A46158c8243j26457
$$ -8594 -99424 -354553 -307102 -229604 -279882 -26882 -204523 -131624 146158 -38243 -164700
19311a64700k38603i5613p9894P1894G9194J72743a21330o2288l024m1624A90687
$$ -164700 -403303 -95613 -175507 -103613 79194 251937 -121330 -183618 -186642 -228266 190687
19299G9478b28784A15578P7512a78479I7875I753b7664A7572n068L9954P9429
$$ 79478 -228784 115578 193090 -178479 97875 9753 -27664 17572 12504 52458 131887
19288A31887a01468o781K061A41939a62692O1461c1564l15258i8268j92857A77159
$$ 131887 -101468 -108249 -106188 141939 -162692 -101231 -31564 -346822 -98268 -291125 177159
19276A39397d26827A43873b656k88261i092r7323F8730a31055J3530A54536b15778
$$ 139397 -426827 143873 -2656 -290917 -9092 -106415 68730 -131055 -117525 154536 -215778
19264A18922D082b48487J02413p4172A20503C8170h4931j7838M8708j09516A38557
$$ 118922 4082 -248487 -146074 -220246 120503 38170 -84931 -102769 -54061 -163577 138557
19252c86903C1938K37408G0815B376f1402b9922J483a1111A36974o6975b87486
$$ -386903 31938 269346 70815 2376 -61402 -29922 -28439 -11111 136974 69999 -287486
19240a55654A38992a5704A4445a51990p8911F77P2032c48742e9647a4272G3831
$$ -155654 138992 -15704 14445 -151990 -230901 677 72709 -348742 -59647 -14272 73831
19228d9195k36162f7838l09333i9011j14052B08928a79639k52557a21547c9016
$$ -49195 -285357 -67838 -377171 -99011 -213063 208928 -179639 -432196 -121547 -39016
19217c35413c7856k7563K7826a729E2721O8817A2794c965k51724R8197l03765
$$ -335413 -37856 -65419 -37593 -1729 52721 121538 12794 -3965 -255689 -157492 -461257
19206d61257F3605a27664j33411Q0997j33595A60071b9625J319a2438e971j84978
$$ -461257 63605 -127664 -261075 -180078 -313673 160071 -29625 -28306 -12438 -5971 -190949
19195a90949j24924B62453D1043a24915E0139c48494a07919J7697H887Q4387d9397
$$ -190949 -315873 262453 41043 -124915 50139 -348494 -107919 -90222 8887 93274 -49397
19183b69451G0248J8192J36484d7615A82113a46910e1053i924A10352O321b19780
$$ -269451 70248 88440 224924 -47615 182113 -146910 -51053 -9924 110352 116673 -219780
19171i0298L4931l77919I3063l7703c03164A6244a36413B1393b95306a11710j75807
$$ -90298 -55367 -433286 93063 55360 -303164 16244 -136413 21393 -295306 -111710 -287517
19160b87517a5853c7A14686J76261f2814j20032j55133A5517K39675d8494j64148
$$ -287517 -15853 -37 114686 290947 -62814 -182846 -337979 15517 255192 -48494 -212642
19149b12642r3742E1877K0213e1524A90570b09814e3379K2648p5274c2569I3877
$$ -212642 -306384 51877 72090 -51524 190570 -209814 -53379 -30731 -106005 -32569 93877
19137d2494A2504J73050n2797E9514C000e299A1845a40620O9634p094l28249a08840
$$ -42494 12504 185554 132757 59514 3000 -5299 11845 -140620 -70986 -78080 -406329 -108840
19124D21402a77047A76376p5269e71501B2529d3491F2625c03892E3626a15232
$$ 421402 -177047 176376 101107 -571501 22529 -43491 62625 -303892 53626 -115232
19113c22786J11008j949C7232b20540h422j4291q7273B7597f2401n8831G1087
$$ -322786 -211778 -213727 37232 -220540 -8422 -22713 -109986 27597 -62401 -121232 71087
19101b70993j6579h4965J7849j32532A85891b9541D4465J35554j7773a902k19773
$$ -270993 -287572 -84965 -67116 -199648 185891 -29541 44465 180019 162246 -1902 -221675
19090b21675l1437C07150a50703A09957a66016j97680a45523k0890I9763J36340
$$ -221675 -253112 307150 -150703 109957 -166016 -363696 -145523 -166413 99763 236103
19080B36103D7715d6290A07048f2860J1852f900m5798H5478a0532j72176C5969
$$ 236103 47715 -46290 107048 -62860 -51008 -6900 -52698 85478 -10532 -182708 35969
19068A04097J78596A15009A8661a57219M1905j02175G5650b92663A00365d04215
$$ 104097 282693 115009 18661 -157219 -115314 -217489 75650 -292663 100365 -404215
19057a75958E4734J12280g4331J7698A04089c41124i8304D3488J24133m2956a04735
$$ -175958 54734 167014 -74331 -56633 104089 -341124 -98304 43488 167621 124665 -104735
19045a17998N2381b9829C0328Q2612b02623g5328j77127A76985C7575a03539c0355
$$ -117998 -65617 -29829 30328 112940 -202623 -75328 -252455 176985 37575 -103539 -30355
19033b32497P5587a2288I2605B6927i8319R61A16286a34783c9019j01476e5600
$$ -232497 -156910 -12288 92605 26927 -98319 -97358 116286 -134783 -39019 -140495 -55600
19021b69360B16159H525b457D3418b18714B2528M0470j6075b3335j85707d1006
$$ -269360 216159 8525 -2457 43418 -218714 22528 62998 46923 -23335 -209042 -41006
19009B09797d30695A01803a63833j28P8475J8501d828l065B26313H4494b34366
$$ 209797 -430695 101803 -163833 -163961 -85486 -66985 -4828 -7893 226313 84494 -234366
18997d3331A33415a12682j46042Q7668F6181J71590G3302b11190a4658j41342
$$ -43331 133415 -112682 -258724 -171056 66181 237771 73302 -211190 -14658 -156000
18987a56000A26988g9066A50543n3979k7164e5852q7906A37903b18359d0740j92294
$$ -156000 126988 -79066 150543 96564 69400 -55852 -143758 137903 -218359 -40740 -233034
18976b33034a07028k95597J83431B60509f145j61095O0581A47641a7935p7273
$$ -233034 -107028 -402625 -219194 260509 -6145 -167240 -106659 147641 -17935 -95208
18966i5208I0711b18074D5946E960K22859A173b38479J12293N571A37340b09239
$$ -95208 90711 -218074 45946 5960 228819 1173 -238479 -126186 -120615 137340 -209239
18954i4021n289A59843b46031A85693B9223h0111B3217g1559j0156j8750B49627
$$ -94021 -99310 159843 -246031 185693 29223 -80111 23217 -71559 -81715 -100465 249627
18942C03083A3215f0692E4178i3836d287I6327b96959J26448N1567A32810B0943
$$ 303083 13215 -60692 54178 -93836 -4287 96327 -296959 -170511 -118944 132810 20943
18930b9469Q182B74440p6804c1436B84417c7106k7764B7603L08477j16172I5206
$$ -29469 -21287 274440 197636 -31436 284417 -37106 -64870 27603 336080 219908 95206
18918B16243j3216f6016b1221k35567R2049d0841k63148E742b2864E1650a17940
$$ 216243 203027 -66016 -21221 -256788 -164739 -40841 -303989 5742 -22864 51650 -117940
18906E3412J49848G647J84354J7812G1034Q7046L3042m4983n8322J05422d9441
$$ 53412 203260 7647 192001 209813 71034 158080 191122 146139 87817 193239 -49441
18894A1223a87116F5447d922j50717A23850b83841D8062c775q3213m8068C7480
$$ 11223 -187116 65447 -4922 -155639 123850 -283841 48062 -3775 -86988 -135056 37480
18882D691K92933b07775P1673K706N9874A20746h8069I36M87106a72893A64553
$$ 4691 297624 -207775 -136102 -133396 -73522 120746 -88069 936 488042 -172893 164553
18870G592a98895B2249a49631E9141a9695r6876B3789d2847j38758f1197k86460
$$ 7592 -198895 22249 -149631 59141 -19695 -116571 23789 -42847 -181605 -61197 -347657
18859c47657e435l13745i715A26746b65402J29586o3780a9807k79993I3722b25365
$$ -347657 -5435 -319180 -9715 126746 -265402 -135816 -199596 -19807 -299800 93722 -225365
18847G7379c4516k19199C00235b16050e0940j35664I5622r397b1840j78526B35139
$$ 77379 -34516 -253715 300235 -216050 -50940 -186604 95622 86225 -21840 -200366 235139
18835B7049J17305a07409J2336j6387a8335j79I6358g5512E0501J67695b23128
$$ 27049 144354 -107409 -95073 -111460 -18335 -18514 96358 -75512 50501 218196 -223128
18823e7858B738a92618a0094j77439I2518c19025a03073I7089L1544c1879p0405
$$ -57858 2738 -192618 -10094 -187533 92518 -319025 -103073 97089 128633 -31879 -102284
18812a02284A9246b77624B75077f2809j06752h0405c506A58716c7002k59604a6996
$$ -102284 19246 -277624 275077 -62809 -169561 -80405 -3506 158716 -37002 -296606 -16996
18800a12001A12893C274a38405m583r7804j21792A67494c0007a2700j81428b3046
$$ -112001 112893 3274 -138405 -142988 -240792 -362584 167494 -30007 -12700 -194128 -23046
18788i0789p5800l29528G589P8861c34604d9132l0714A58715f0407j9765F8166
$$ -90789 -166589 -496117 7589 86450 -334604 -49132 -79846 158715 -60407 -80172 68166
18776c10689o8774J68180A86259B7972a50545Q885c3482j49422P3425j01178a02970
$$ -310689 -379463 -211283 186259 27972 -150545 -141660 -33482 -182904 -109479 -210657 -102970
18764A36783E4208E392M5623a55975a8050A15248a80670H3969h990j83612Q8674
$$ 136783 54208 5392 51015 -155975 -18050 115248 -180670 83969 -8990 -192602 -103928
18753a03928F2533g114j71228A33532a20163j28760I3075K46619a2099k97423
$$ -103928 62533 -7114 -178342 133532 -120163 -248923 93075 339694 -12099 -309522
18743c09522A70392b46758I1973f4837k2946j6416E8003J08555C8041a32719E5330
$$ -309522 170392 -246758 91973 -64837 -87783 -104199 58003 166558 38041 -132719 55330
18731h7563c6609C5937c46890a16037g137B37839a20665k46932D3872P2986A0551
$$ -87563 -36609 35937 -346890 -116037 -7137 237839 -120665 -367597 43872 116858 10551
18719B06843b16713A25835b40183k22705B24798a95850c0218r0759B06721a54401
$$ 206843 -216713 125835 -240183 -462888 224798 -195850 -30218 -120977 206721 -154401
18708G5299J38143a90755l8554B1205b4403D6989f2326B1688a42631a6671l3616
$$ 75299 213442 -190755 -229309 21205 -24403 46989 -62326 21688 -142631 -16671 -50287
18697e0287j31319F7641b66323j051A3035N8544a66866L8158c8431A1242K58174
$$ -50287 -181606 67641 -266323 -267374 13035 71579 -166866 -128708 -38431 11242 269416
18686B69416b05430P1852a7840j30702m5807Q8377n3704H3668d2431j66702M6179
$$ 269416 -205430 -133578 -17840 -148542 -194349 -105972 -159676 83668 -42431 -209133 -162954
18675a62954H4577a65191f5771A38503a83133j19264M0532I7521a46088k07841
$$ -162954 84577 -165191 -65771 138503 -183133 -302397 -261865 97521 -146088 -353929
18665c53929C1184p324N2955M6155h8138H1377g3755R977A3897a02845k57620
$$ -353929 31184 23860 76815 122970 -88138 81377 -73755 -63778 13897 -102845 -360465
18654c60465r1474a51688E6407e6271k34927L5854C7925a95996M233j58343e1546
$$ -360465 -451939 -151688 56407 -56271 -291198 -255344 37925 -195996 -191763 -350106 -51546
18642a57668A02879P7721c88886A66918g1934j03151C4622K01643a03332n7739
$$ -157668 102879 180600 -388886 166918 -71934 -175085 34622 236265 -103332 -161071
18632a61071A01633e0956J3067r106j88306b2387G9250j4926c49984B7946a85990
$$ -161071 101633 -50956 -37889 -46995 -235301 -22387 79250 64324 -349984 27946 -185990
18620a28891l54569B06477D9535e8856A91938M0048d99699a94270j6612B36786
$$ -128891 -483460 206477 49535 -58856 191938 231986 -499699 -194270 -210882 236786
18609b76407j40808a52495A86951e5698C10345a74139P2456b1560j18747A47390
$$ -276407 -417215 -152495 186951 -55698 310345 -174139 -101683 -21560 -140307 147390
18598A62103o7125j8054d2387r5170K0212A35267o6762J1994h902H1425c11185
$$ 162103 94978 76924 -42387 -137557 -117345 135267 68505 80499 -8902 81425 -311185
18586a78642B6525J62197G2210a35000A9610Q1280a71755p1457J09063C0930d1176
$$ -178642 26525 188722 72210 -135000 19610 100890 -171755 -243212 -134149 30930 -41176
18574a9244j5256A25822E1454a21934C94317i3732I3849n329B8006b38573J8263
$$ -19244 -34500 125822 51454 -121934 394317 -93732 93849 88520 28006 -238573 -220310
18563b20310i984D8093Q5735F3977a04122D6321a67718C6314K2780A5882J58868
$$ -220310 -9984 48093 133828 63977 -104122 46321 -167718 36314 59094 15882 174750
18552A74750p6849c89041f5380j45735A12390b34659B46930g7607B36238b3692
$$ 174750 97901 -389041 -65380 -211115 112390 -234659 246930 -77607 236238 -23692
18541a49788A43848k4548c49354A6519c05938a34816C350N2224d11782A02110
$$ -149788 143848 119300 -349354 16519 -305938 -134816 3350 55574 -411782 102110
18530c20828d7303b0068H3501a56731g7671k593Q59l6069C4997P3301b50225f1757
$$ -320828 -47303 -20068 83501 -156731 -77671 -80264 -79405 -115474 34997 108298 -250225 -61757
18517a28208j38317B16820b53907C08679A04186a49958f6533j14266i0314B19240
$$ -128208 -266525 216820 -253907 308679 104186 -149958 -66533 -180799 -90314 219240
18506A27149b17187K1252D5667b5641A65150b18009d900n6436C0724h4697k2614
$$ 127149 -217187 -195935 45667 -25641 165150 -218009 -4900 -61336 30724 -84697 -107311
18495a07311A28447J85573b19292D8269R6463h1696l2649j95776b7712B25206
$$ -107311 128447 314020 -219292 48269 144732 -81696 -114345 -310121 -27712 225206
18484b47387A96699B5216Q3645a82985D6880c3017K56J5657j5868j41962Q1464
$$ -247387 196699 25216 108861 -182985 46880 -33017 -32761 -17104 -32972 -174934 -93470
18473i3470K0102D6277J23589a33269o0553F1858d23010a15348A60890B2347h5502
$$ -93470 -73368 46277 169866 -133269 -193822 61858 -423010 -115348 160890 22347 -85502
18461i2027j39527R989e6657j08846A9927d9946j55820f7764j04995B6641g926
$$ -92027 -231554 -221565 -56657 -165503 19927 -49946 -205766 -67764 -172759 26641 -7926
18449B26357g0662l08214C6388i177G0527a11252J7675K9379k61621J25337K8254
$$ 226357 -70662 -378876 36388 -9177 70527 -111252 -93577 -64198 -325819 -200482 -172228
18438a72228b6321k1977C41516c8186k9380A93150q6344a62921j84247g0940C68926
$$ -172228 -26321 -48298 341516 -38186 -67566 193150 106806 -162921 -347168 -70940 368926
18426C20310c1110A0798m685a55611e0581A85540b7364j42715A87723b45413i306
$$ 320310 -31110 10798 6113 -155611 -50581 185540 -27364 -170079 187723 -245413 -9306
18414B36211A1554J89924G0697M9690c65689D9595g2021i205k29332e5792A70308
$$ 236211 11554 201478 70697 120387 -365689 49595 -72021 -9205 -238537 -55792 170308
18402B30193E4927A8348M17183H5840h0163m87930R8685a71288M6722b2499E7568
$$ 230193 54927 18348 435531 85840 -80163 -568093 -469408 -171288 -124566 -22499 57568
18390C43253B7968R5376L53200i7567j08527k6249J0544m8443g0232A86125I0367
$$ 343253 27968 123344 476544 -97567 -206094 -232343 -221799 -270242 -70232 186125 90367
18378c1233j29859A38519m0811a299G8270a13525C2290j0134J27551a01372J3974
$$ -31233 -161092 138519 97708 -1299 78270 -113525 32290 22156 149707 -101372 -87398
18367h7398A05614J8525P7323f7493j46754a06394q8616J3228Q3617A11078k7054
$$ -87398 105614 124139 201462 -67493 -214247 -106394 -195010 -181782 -98165 111078 84024
18356H4024l0809j5544F665a23080j20108a06414m3418a4301q0098B48742a6170
$$ 84024 53215 37671 6665 -123080 -243188 -106414 -149832 -14301 -94399 248742 -16170
18344a96056f4223A9236e2124n0683B68030a5262I7374D7726a85971f1341k28007
$$ -196056 -64223 19236 -52124 -102807 268030 -15262 97374 47726 -185971 -61341 -289348
18333b89348G0811a54085e8577H7239B9242h7294j34799a00694j18671O4104P5600
$$ -289348 70811 -154085 -58577 87239 29242 -87294 -222093 -100694 -219365 -155261 -79661
18322g9661o8690J6059N7714P109A59158f8840a2576l0462j32838g2558A10798
$$ -79661 -148351 -132292 -74578 -67469 159158 -68840 -12576 -43038 -175876 -72558 110798
18310a84909P91L5875j9536B6904d01358J38869E6633Q9988A9552c4038A43080
$$ -184909 -184118 -148243 -167779 26904 -401358 -262489 56633 146621 19552 -34038 143080
18298B09212g6749j7525H8032a60128B29036E7046b35227f7462k856k2106G8457
$$ 209212 -76749 -94274 88032 -160128 229036 57046 -235227 -67462 -70318 -92424 78457
18286F279a46685j66619B53221I8775j7319A8766J55473d1616J2803j28075A61377
$$ 6279 -146685 -313304 253221 98775 81456 18766 174239 -41616 -28813 -156888 161377
18274b31928A30783a84592g4434b2664B3762e3266B05699I9088i6639h203F42798
$$ -231928 130783 -184592 -74434 -22664 23762 -53266 205699 99088 -96639 -8203 642798
18262i6563A3356d0649A80667m5743a70073A0857a5644j73024B13861b3530k0187
$$ -96563 13356 -40649 180667 134924 -170073 10857 -15644 -188668 213861 -23530 -43717
18251d3717B62802Q2787b75929a8969l3498j8004D0904d31481J92974A21028i6291
$$ -43717 262802 345589 -275929 -18969 -52467 -70471 40904 -431481 -238507 121028 -96291
18239I8633b65787J09307C8272c6326k30170Q8783H3987J4851R0636a99661B6118
$$ 98633 -265787 -156480 38272 -36326 -266496 -177713 83987 98838 189474 -199661 26118
18227A41301F3497R0755G655P9321h9501A66942f6004r4464B82342d30657I0321
$$ 141301 63497 154252 7655 86976 -89501 166942 -66004 -160468 282342 -430657 90321
18215B92587j00061r0674J81510a10217E4733i2852j16122k31212B44366d43620
$$ 292587 192526 101852 283362 -110217 54733 -92852 -208974 -440186 244366 -443620
18204B12214a11193A90345l4932I964J0276J655g2131j75468C1455a20644C5119
$$ 212214 -111193 190345 155413 9964 20240 21895 -72131 -247599 31455 -120644 35119
18192a01022B75211A12504C6260a64075A54639a97B00555o2848i9246A96003i6791
$$ -101022 275211 112504 36260 -164075 154639 -197 200555 137707 -99246 196003 -96791
18180E1441N8893b772D9907a12222A31059J01588g4029j53986A9780a69492b3488
$$ 51441 110334 -2772 49907 -112222 131059 232647 -74029 -228015 19780 -169492 -23488
18168a47059p2641A65157b5850J586j62068C4814c73651a18353j19588C4938M3918
$$ -147059 -219700 165157 -25850 -24264 -186332 34814 -373651 -118353 -237941 34938 78856
18157G8856l8578g3666E281a44055O1590j59823b3186F8561e8272k28695A00623
$$ 78856 40278 -73666 5281 -144055 -82465 -242288 -23186 68561 -58272 -286967 100623
18145B57875I819J37579b2589k37808A78940g5607a8252B4311i7279p6062G0328
$$ 257875 9819 147398 -22589 -260397 178940 -75607 -18252 24311 -97279 -173341 70328
18133A74357A1991P5912c06673R5176A79881a55647A75147a4326A13358J23852
$$ 174357 11991 87903 -306673 -211497 179881 -155647 175147 -14326 113358 237210
18123B37210J65894c7554k8411A22638a90099e4470A92428f3612F124J37261o7748
$$ 237210 403104 -37554 -65965 122638 -190099 -54470 192428 -63612 6124 143385 75637
18112G5637R0784C8231b25915B53637i9957b2579H9912P2488a72500m3706B4133
$$ 75637 166421 38231 -225915 253637 -99957 -22579 89912 162400 -172500 -216206 24133
18100A26185b3418C6867P2691b4087G7435L829a15092D36487j40925C6223j7891
$$ 126185 -23418 36867 109558 -24087 77435 81264 -115092 436487 295562 36223 18332
18089A8332b06646a9716p2594L6454B1285a17064a6627A93439q1424c44454a63351
$$ 18332 -206646 -19716 -92310 -55856 21285 -117064 -16627 193439 112015 -344454 -163351
18077a7988e832D54403H6633a57498e0441G5463b40281c7136I8528a09494c9344
$$ -17988 -5832 454403 86633 -157498 -50441 75463 -240281 -37136 98528 -109494 -39344
18065A17414b09904a03608A36766A2056e8349C19847j57897k4367a53337L5175
$$ 117414 -209904 -103608 136766 12056 -58349 319847 161950 137583 -153337 -118162
18055a18162c7660J3120R52A36788K4800b75500a5937n3198m5230F2621K9482
$$ -118162 -37660 -24540 -23588 136788 161588 -275500 -15937 -69135 -114365 62621 92103
18044I2103d1571G5380b58284i281F7783L0185k9682a07447j58029B9268A4018
$$ 92103 -41571 75380 -258284 -9281 67783 97968 68286 -107447 -265476 29268 14018
18032i8463A08788e9754E8038a51036B45986b3699k41041B62239m1298b10055
$$ -98463 108788 -59754 58038 -151036 245986 -23699 -264740 262239 220941 -210055
18021B5546L8998Q4084D3264a71568O849A35930b38166J13035A5225f2073I9252
$$ 25546 64544 148628 43264 -171568 -164719 135930 -238166 -125131 15225 -62073 99252
18009c53115A63018b69154d2511C0387J39994h877j57186f7804B89227C2900c83520
$$ -353115 163018 -269154 -42511 30387 170381 -8877 -166063 -67804 289227 32900 -383520
17997B54325m4988b23441B12416G3394K4637N4328G5596b9522C0045c09764J17788
$$ 254325 209337 -223441 212416 73394 98031 152359 75596 -29522 30045 -309764 -191976
17986a91976a3800q1994K7928C5183g0127g453p4342C2778b89995C7489K59494
$$ -191976 -13800 -95794 -67866 35183 -70127 -7453 -81795 32778 -289995 37489 296983
17975B96983a60174m7114j8670b5327q5743A13337A8334N0564a04883A02580b01129
$$ 296983 -160174 -207288 -225958 -25327 -111070 113337 18334 68898 -104883 102580 -201129
17963i1310G1733a28521A2376K0789g1443E2132J05420c35160A26992o0362R678
$$ -91310 71733 -128521 12376 33165 -71443 52132 157552 -335160 126992 66630 76308
17952G6308P0289F5630c995k6770B7518b57476I4386b05926r7613C03821I2461
$$ 76308 146597 65630 -3995 -30765 27518 -257476 94386 -205926 -303539 303821 92461
17940a52976B152h5316F3402L4510a60523C2095a11447e2032B18869b02467A65628
$$ -152976 2152 -85316 63402 97912 -160523 32095 -111447 -52032 218869 -202467 165628
17928a5844j54334E42113k32691a14353A99807i4432C00024a922A75127c2569
$$ -15844 -170178 542113 309422 -114353 199807 -94432 300024 -1922 175127 -32569
17917d9041L110j90195F3385a52588g2988k00853B10687a68871N498A79881e4682
$$ -49041 -45931 -236126 63385 -152588 -72988 -273841 210687 -168871 -163373 179881 -54682
17905a17790j76718A62927D5472b25541h473l7247a7451A44795I670J22519M3508
$$ -117790 -294508 162927 45472 -225541 -8473 -45720 -17451 144795 9670 132189 175697
17894A75697n86b40235C8605J19617L09703j3301d2087A81654O2955k7402b20604
$$ 175697 175111 -240235 38605 158222 467925 454624 -42087 181654 244609 217207 -220604
17882I8218L9681Q3594G8517c8103k49722B94424I2707J18765a49766k0999O6408
$$ 98218 137899 221493 78517 -38103 -287825 294424 92707 211472 -149766 -170765 -104357
17871a04357B36708c1579j7045I5875f1208j73383A04418l6627J26516b05965
$$ -104357 236708 -31579 -48624 95875 -61208 -234591 104418 67791 194307 -205965
17860D9383P6862e1133j56497B58260a89126G7790b7054A89600f5457j71937d8852
$$ 49383 126245 -51133 -207630 258260 -189126 77790 -27054 189600 -65457 -237394 -48852
17848a32823A82478F4961c2305p7673r9050m5296f3951A70413q2721p391c01426
$$ -132823 182478 64961 -32305 -109978 -209028 -254324 -63951 170413 87692 80301 -301426
17836F1686j389A3037J80399K7029a05292A50599A0822a45466M504C16714I6332
$$ 61686 60297 13037 193436 220465 -105292 150599 10822 -145466 -140962 316714 96332
17824a46630P2340B15825J27484j63542E6665R9349e2031b0040A10250b99131
$$ -146630 -74290 215825 343309 179767 56665 156014 -52031 -20040 110250 -299131
17813F9838a08187J8662j24866f7716a8505C7941K43487a00896j06498P2571A20837
$$ 69838 -108187 -89525 -214391 -67716 -18505 37941 281428 -100896 -207394 -134823 120837
17801A29117l1327K31103a40076B13087b61327J14998A31686b67640i9984A5477
$$ 129117 97790 328893 -140076 213087 -261327 -146329 131686 -267640 -99984 15477
17790F729h9734b6766B91233M0984K1480a14922b4421j38461j1668A66454a92754
$$ 6729 -89734 -26766 291233 332217 353697 -114922 -24421 -162882 -174550 166454 -192754
17778B23592b05897B60409D675J76416h7865E4892K52000j39991L3513a51058
$$ 223592 -205897 260409 4675 181091 -87865 54892 306892 166901 200414 -151058
17767d2404A2904M3674f0523A90733R3048h2485H9965j3888A956i3206A30106
$$ -42404 12904 56578 -60523 190733 283781 -82485 89965 76077 1956 -93206 130106
17755I025J0979Q4779f0754A7671h9468r0577g1077b4315B3637Q8094K28257j54396
$$ 9025 20004 104783 -60754 17671 -89468 -180045 -71077 -24315 23637 111731 339988 185592
17743A85592b5663A50136p2557L25333j36648d7585A67026E229a41516J8855A46832
$$ 185592 -25663 150136 77579 402912 266264 -47585 167026 5229 -141516 -122661 146832
17731A2978P2450a65096P395L5484B69132I2170Q830N034k118c20784G9384a62716
$$ 12978 85428 -165096 -157701 -122217 269132 92170 101000 106034 103916 -320784 79384 -162716
17718F7871e9095A87937J52493h9963j8322j11634a5490A45321o7701L375K55656
$$ 67871 -59095 187937 340430 -89963 -108285 -219919 -15490 145321 77620 80995 336651
17707C36651a13214A6286J79928n4816C5457L16547A24730c7207B01932M8731
$$ 336651 -113214 16286 196214 141398 35457 352004 124730 -37207 201932 250663
17697B50663b4962k84725B5687J91508K14150I8297m0020L8913a25462A56322
$$ 250663 -24962 -309687 25687 217195 431345 98297 58277 97190 -125462 156322
17686b53573A28246a70262B17059b12003e473A3695l983i0991G5296I004M3J77634
$$ -253573 128246 -170262 217059 -212003 -5473 13695 9712 -90991 75296 9004 9047 186681
17674A86681o5315j558A992a0772B74973a40478a4612A9657L2940j5789a50868
$$ 186681 121366 119808 1992 -10772 274973 -140478 -14612 19657 52597 36808 -150868
17662C4341a42223A30347F2974a77911g8184m3422c4590C2060n038a06610j10428
$$ 34341 -142223 130347 62974 -177911 -78184 -121606 -34590 32060 27022 -106610 -217038
17651b17038a7055E4863L974L43761b3252C67544p5404P0007A877J58350J44536
$$ -217038 -17055 54863 58837 402598 -23252 367544 292140 362147 1877 160227 304763
17640C04763A13726E2800J21795a34665B0954a497A26461K36712M1140B2258a46450
$$ 304763 113726 52800 174595 -134665 20954 -1497 126461 363173 404313 22258 -146450
17628A18223J51613C4557L0492e0548j07079G3007b49867F3699R2934J39050A31514
$$ 118223 269836 34557 65049 -50548 -157627 73007 -249867 63699 156633 295683 131514
17616a77517j38259C92030b9229r8360D6945L7868a07863D38L87894H9144a20748
$$ -177517 -315776 392030 -29229 -127589 46945 84813 -107863 438 388332 89144 -120748
17604A23027C1802K7643k8829K69824p09D2705K83252f2704j01285B11977d2187
$$ 123027 31802 59445 30616 300440 299731 42705 325957 -62704 -163989 211977 -42187
17592a69960I3389B1520J81694J46525J0617G3786L7730h7845n9311C14176M3597
$$ -169960 93389 21520 203214 349739 360356 73786 111516 -87845 -147156 314176 357773
17581C57773c82663h8965F3203b24658h6759B99649B410K89319j20917a11151
$$ 357773 -382663 -88965 63203 -224658 -86759 299649 2410 291729 170812 -111151
17570B06835I1978d315B48380k4635a20408E15615A69574a320j35492B03440m1916
$$ 206835 91978 -4315 248380 223745 -120408 515615 169574 -1320 -136812 203440 161524
17559A61524J15892a03751B54264F5492C1438b01778a2282k02163B6718J06581
$$ 161524 277416 -103751 254264 65492 31438 -201778 -12282 -214445 26718 133299
17549A33299J29803a42342B26825F35J67920p1081K76976H909N5120n994Q8177
$$ 133299 263102 -142342 226825 635 168555 97474 374450 8909 64029 58035 146212
17538A46212K76P3020M7130i9930C68514q5070A19179b06455C6165K05409J19374
$$ 146212 146488 219508 266638 -99930 368514 283444 119179 -206455 36165 241574 360948
17527C60948B0504J85092P5831o7161R7057R9231K31504A86323J02234A33682
$$ 360948 20504 205596 281427 214266 311323 410554 642058 186323 288557 133682
17516F9187a07958B00034J16197A29016c5956C54937L3801R2842B37912K29365
$$ 69187 -107958 200034 316231 129016 -35956 354937 388738 481580 237912 467277
17506D67277A66911L66963j48549I4091Q6750F2539J45657h0941D48894j56349
$$ 467277 166911 533874 385325 94091 180841 62539 208196 -80941 448894 292545
17496B92545G9456J33424K56395A14374a8796A49807J85152A58557O2942A09742
$$ 292545 79456 212880 469275 114374 -18796 149807 334959 158557 221499 109742
17485A69297K56945A8842j418N0209J52769J57362j37236D9338L87567a43247
$$ 169297 426242 18842 17424 67633 220402 377764 240528 49338 436905 -143247
17474A09761a512A71338o2479J01390O7172O5755o5663j7570P4681n4187N7666
$$ 109761 -1512 171338 108859 210249 277421 343176 277513 259943 334624 280437 338103
17463C38103j5509J84919F7431P710M31592B11717J9662L2770d6236B42992h4817
$$ 338103 322594 507513 67431 75141 506733 211717 231379 264149 -46236 242992 -84817
17451F3905J25315J96542j08640K98058k19593n4249K04472l4470B09802J28039
$$ 63905 189220 385762 277122 575180 355587 301338 505810 471340 209802 337841
17441C37841p2809A23975Q864L37945B16408B1527J88541J69726J52283A31603
$$ 337841 265032 123975 132839 470784 216408 21527 210068 379794 532077 131603
17430B43881O3909J39728q5230I0074L8102J17521c1869D02560j01208M8120j26942
$$ 243881 307790 447518 362288 90074 128176 245697 -31869 402560 301352 349472 222530
17419B22530J77299q3663p6662L47753B35709L74507l2379k43531H8648L02740
$$ 222530 399829 316166 239504 587257 235709 610216 577837 334306 88648 391388
17409C91388A5984M11130r8086J08800q8295q7507b8484A77365b04383B56888
$$ 391388 15984 427114 329028 437828 349533 262026 -28484 177365 -204383 256888
17398A91345f1610G6702N2449h3431A28218J36257H9461p118d3482B40716P7448
$$ 191345 -61610 76702 129151 -83431 128218 264475 89461 82343 -43482 240716 318164
17387C18164H6014K30490h0066B45342C7245J71679Q6271J40815j32335a22527
$$ 318164 86014 316504 -80066 245342 37245 208924 295195 436010 303675 -122527
17376I4743J14375L04262A56392b9730B48350O831J68788j38970J37843A23473
$$ 94743 209118 513380 156392 -29730 248350 255181 423969 284999 422842 123473
17365A35106L89066j98177K32120B35046A11357P6884k1378M63921k37993C3850
$$ 135106 524172 325995 558115 235046 111357 188241 166863 630784 392791 33850
17354B68530O0854L1863C7054L9970C5578L00510l8415j8299M8946r534j50533
$$ 268530 329384 361247 37054 77024 35578 336088 297673 279374 328320 318786 168253
17343A68253B4753L60782j34310P4400A36388k5747M6370j5581J3452J57748J26556
$$ 168253 24753 385535 251225 325625 136388 110641 157011 141430 154882 312630 439186
17332D39186A24648k220K09152J37854l6011k7542j25913j1411A11702L31397
$$ 439186 124648 122428 331580 469434 433423 405881 279968 268557 111702 443099
17322D43099E7893P3734L01115H4921L2800J33613l5223C2991J34613J33820K3453
$$ 443099 57893 131627 432742 84921 117721 251334 216111 32991 167604 301424 324877
17311C24877R603A45497L62462j34208g4748B21792K4497f0851A75871K13917
$$ 324877 334480 145497 507959 373751 -74748 221792 246289 -60851 175871 389788
17301C89788n9401c036D01667d7591D065K62J76640a61284C8979J0707J2829L84908
$$ 389788 330387 -3036 401667 -47591 4065 4327 180967 -161284 38979 49686 62515 447423
17289D47423A63538P6510M06512j63600j82585l5303K23555a28609C1235L45391
$$ 447423 163538 240048 646560 482960 300375 265072 488627 -128609 31235 376626
17279C76626A4410K01692p2670R7415K72643B35237J87401j55558R0379q4891
$$ 376626 14410 216102 143432 240847 513490 235237 422638 267080 357459 272568
17269B72568p2022a45054F14642K57922C98707O7737B11508K9416K92024j34044
$$ 272568 200546 -145054 614642 872564 398707 466444 211508 240924 532948 398904
17259C98904A92324L1704K23950L831k16906R9684A06195K26458J0402J29621
$$ 398904 192324 224028 447978 451809 234903 334587 106195 332653 343055 472676
17249D72676B05845L4657K70330k5502j74323J33223A29260d1830E48115k10648
$$ 472676 205845 240502 510832 485330 311007 444230 129260 -41830 548115 337467
17239C37467N0733j9344P3562j62786j5686M77l5251K02850j35237K4783q0079
$$ 337467 388200 368856 442418 279632 263946 264423 229172 432022 296785 321568 241489
17228B41489P8329J70881n4893j29691p8738K40665B12113K33513j5672k8792
$$ 241489 319818 490699 435806 306115 227377 468042 212113 445626 429954 401162
17218D01162K71763C07024J52083j18578j61287K56663A31925L67734B48894J71354
$$ 401162 672925 307024 459107 340529 179242 435905 131925 499659 248894 420248
17208D20248r2126j729R3443J11346B01282K70000j50670M54197l86495A81904
$$ 420248 328122 326393 419836 531182 201282 471282 320612 774809 388314 181904
17197D87317k38984j2130L16078L6451j07945L6170j39006l175J11170j85920
$$ 487317 248333 236203 552281 588732 480787 516957 377951 374776 485946 300026
17187C00026L56916A62010O29792C24419J09860B13366L32509A93786J02058O20145
$$ 300026 656942 162010 791802 324419 434279 213366 545875 193786 295844 915989
17177I15989l09716I5411J76783M29488o5731A16125L66149j30315L75964j13371
$$ 915989 606273 95411 272194 701682 635951 116125 482274 351959 727923 614552
17167F14552Q331L0541n3996j07801J07902j02194K1679K25386k83331N1305j03970
$$ 614552 622883 653424 599428 491627 599529 497335 519014 744400 461069 512374 408404
17156D08404M2312J30434A75554L16813J41919B42763L14228l7918K26490j21408
$$ 408404 450716 581150 175554 492367 634286 242763 556991 519073 745563 624155
17146F24155p3989J47018l00735j95308M26389K15475I5863O37037j65340R4756
$$ 624155 550166 697184 396449 201141 627530 843005 95863 732900 567560 662316
17136F62316J06615r8852O9177l49947J25696K45434B05683N07332p5222l07876
$$ 662316 768931 670079 739256 389309 515005 760439 205683 713015 637793 329917
17126C29917J11971L03824l30595L9953M3156J23707O5844j89783K86372k87756
$$ 329917 441888 745712 415117 455070 498226 621933 687777 497994 784366 496610
17116D96610q6555o7654L48596k21902M93225l60112J04983P6790J67720N0188
$$ 496610 410055 342401 690997 469095 962320 602208 707191 783981 951701 1001889
17106A001889m61259j77719L37266J47035J92978j96224m3329j66005J55771l57937
$$ 1001889 540630 362911 700177 847212 1040190 843966 800637 634632 790403 432466
17096D32466K35460n1128L06037j28249k69183j55959O65175p5093L1217j44731
$$ 432466 667926 616798 922835 794586 525403 369444 1034619 959526 990743 846012
17086H46012P4157k21230K34233J08290o1741l220m11085L57520k09578K10505
$$ 846012 920169 698939 933172 1041462 979721 976501 565416 922936 713358 923863
17076I23863l68084L88504P4031k40104k6978M43806l42029q3235L86038M5181
$$ 923863 555779 944283 1018314 778210 751232 1195038 853009 769774 1155812 1200993
17066A200993D69083K26966l9058N26161j32830q8266J47607k22600o1752J09885
$$ 1200993 469083 696049 656991 1183152 1050322 962056 1109663 887063 825311 935196
17056I35196p9372J11442N518J57135l26633j19974O903N57885l02097J64772
$$ 935196 855824 967266 972784 1129919 803286 683312 690215 1248100 946003 1110775
17046A110775K02286m15769j90410M55579j03852j14377j34590J10780R4940O5933
$$ 1110775 1313061 897292 706882 1162461 1058609 944232 809642 920422 1015362 1081295
17036A081295j68993J32254L58729n29702N07259m13665K45610m2747L09307m88058
$$ 1081295 912302 1044556 1403285 873583 1380842 967177 1212787 1170040 1479347 991289
17026I91289J4715Q5056L07428l11262M26449m39000L0934J12659m8552l9124
$$ 991289 1006004 1091060 1398488 1087226 1513675 1074675 1105609 1218268 1169716 1130592
17016A130592J40142j78753L44287J22045l35760j1160K07024l3503J65347j30819
$$ 1130592 1270734 1091981 1436268 1558313 1222553 1211393 1418417 1384914 1550261 1419442
17006A419442j24895K06252K1719j09784L768M8162l34130L62423K213j0362J48073
$$ 1419442 1294547 1500799 1522518 1412734 1416502 1464664 1130534 1492957 1495170 1484808 1632881
16995A632881J76363q7154j56800J40735j4766p3586p2685m4802j25431R7299
$$ 1632881 1809244 1722090 1565290 1706025 1691259 1617673 1544988 1500186 1374755 1472054
16985A472054K6751J48083p7514J6417K41399J62971k02755j68472J88820l60476
$$ 1472054 1498805 1646888 1569374 1585791 1827190 1990161 1787406 1618934 1807754 1447278
16975A447278M36158j94603K53636J53817l83938K9554l0726Q8913K7999R0905
$$ 1447278 1883436 1688833 1942469 2096286 1712348 1741902 1711176 1800089 1828088 1918993
16965A918993k09372M73951m05725L63444M6575k68015J56953J22562r8389j57051
$$ 1918993 1709621 2183572 1777847 2141291 2187866 1919851 2076804 2199366 2100977 1943926
16955A943926L03657J09681k75591J32244M9138N4116K1648L09900j17262l97521
$$ 1943926 2247583 2357264 2081673 2213917 2263055 2317171 2338819 2648719 2531457 2133936
16945B133936M21236j13338k28290J16441Q946q9306L3334L02980O3556J40860
$$ 2133936 2555172 2441834 2213544 2329985 2338931 2249625 2282959 2585939 2649495 2790355
16935B790355q7468K46547j88738j61267J82877q853J31131k70148j42447L83282
$$ 2790355 2702887 2949434 2760696 2599429 2782306 2773453 2904584 2634436 2491989 2875271
16925B875271l5720N4876J03556J69910l85046M37464J07760n61440P3953M76412
$$ 2875271 2839551 2894427 2997983 3167893 2782847 3220311 3328071 2766631 2840584 3316996
16915C316996l66047J61748K33981n3443R875J19676j10870P7755K71439j84485
$$ 3316996 2950949 3112697 3346678 3293235 3303110 3422786 3311916 3389671 3661110 3476625
16905C476625J67711K65415k74859J62637l88258K92868K39225o5030L49819k40381
$$ 3476625 3644336 3909751 3634892 3797529 3409271 3702139 3941364 3876334 4226153 3985772
16895C985772R680K33987j58989K5231Q1634J46163J07699j52658K74676P4525
$$ 3985772 3995452 4229439 4070450 4095681 4177315 4323478 4431177 4278519 4553195 4627720
16885D627720p1263J90019k55418L68518l7666J76203O8047J33938M9084j36682
$$ 4627720 4556457 4746476 4491058 4859576 4821910 4998113 5066160 5200098 5249182 5112500
16875E112500q2417N10032n97966N21538L652M58555k28153n3379o3369L07717
$$ 5112500 5030083 5540115 4942149 5463687 5467339 5925894 5697741 5644362 5580993 5888710
16865E888710l1775J9476M42435J65343j7208m4565L16100K08612k8003L2316
$$ 5888710 5856935 5876411 6318846 6484189 6466981 6422416 6738516 6947128 6919125 6951441
16855F951441K76197j10762J7582K91929j89924K55842J43075M06481J4278m6077
$$ 6951441 7227638 7116876 7134458 7426387 7236463 7492305 7635380 8041861 8056139 8010062
16845H010062K52288P352n390N23400k02026J95100J33572K58949K04901m299
$$ 8010062 8262350 8269702 8264312 8787712 8585686 8780786 8914358 9173307 9378208 9373909
16835I373909N16694R2653m6017L58504M03163k96969O94230P2364K67614j76160
$$ 9373909 9890603 9983256 9937239 10295743 10698906 10401937 11096167 11168531 11436145 11259985
16825A1259985J74906O51150k22803P34176l20005O04189m8708N50499J5322N15864
$$ 11259985 11434891 12086041 11863238 12597414 12277409 12881598 12832890 13383389 13398711 13914575
16815A3914575M83307M3158N15355R5038K24777L87434k26845Q24420K27161M27782
$$ 13914575 14397882 14441040 14956395 15051433 15276210 15663644 15436799 16261219 16488380 16916162
16805A6916162L56447L89130P19213K94719L09072L83485K74794N57791M28818
$$ 16916162 17272609 17661739 18380952 18675671 18984743 19368228 19643022 20200813 20629631
16796B0629631N09969N36685L43285J118073m4141Q84577M4489J076878Q4302
$$ 20629631 21139600 21676285 22019570 23137643 23093502 23978079 24022568 25099446 25183748
16787B5183748P29894Q73322O95650M67581O04606J043420O02741R21996P68368
$$ 25183748 25913642 26786964 27482614 27950195 28554801 29598221 30200962 31122958 31891326
16778C1891326O47866Q14759R04503L73995J155688J121664P72574J220233R48338
$$ 31891326 32539192 33353951 34258454 34632449 35788137 36909801 37682375 38902608 39850946
16769C9850946Q93973J037299P76947J417297N04795J549841J118605J080406
$$ 39850946 40744919 41782218 42559165 43976462 44481257 46031098 47149703 48230109
16761D8230109J377435J045203J355261J298445J240655J120403R29162J504359
$$ 48230109 49607544 50652747 52008008 53306453 54547108 55667511 56596673 58101032
16753E8101032J634173J188570J308858J265384J163151J326505J624997J050774
$$ 58101032 59735205 60923775 62232633 63498017 64661168 65987673 67612670 68663444
16745F8663444R03293J042769J039835J305529R14547J105441Q88170Q70188Q55433
$$ 68663444 69566737 70609506 71649341 72954870 73869417 74974858 75863028 76733216 77588649
16736G7588649N39237O17733N16120P92704K88660L66060K18597K04176j06487
$$ 77588649 78127886 78745619 79261739 80054443 80343103 80709163 80927760 81131936 81025449
16727H1025449k5188J6439m03663m54942k51057n17735m84730p57027p48857o64235
$$ 81025449 81000261 81016700 80613037 80158095 79907038 79389303 78904573 78147546 77398689 76734454
16717G6734454r51824j020744j070322j067724r97780p25880j387258r96127j034414
$$ 76734454 75782630 74761886 73691564 72623840 71626060 70900180 69512922 68516795 67482381
16708F7482381j532057j165958j498160r24937j356976j076074j226918j599235
$$ 67482381 65950324 64784366 63286206 62361269 61004293 59928219 58701301 57102066
16700E7102066j095014p82162j327489j552021q47441j091655r85692j293662
$$ 57102066 56007052 55224890 53897401 52345380 51497939 50406284 49420592 48126930
16692D8126930j313742o98999j539879o30100j061722j010424j045510o53621
$$ 48126930 46813188 46114189 44574310 43944210 42882488 41872064 40826554 40172933
16684D0172933j340570n36698q11261q90887q47031q61542j126802n9939j200402
$$ 40172933 38832363 38295665 37484404 36593517 35746486 34884944 33758142 33698203 32497801
16675C2497801o33241o13944r31445n16369m68948o95156r78391m88584m23364
$$ 32497801 31864560 31250616 30319171 29802802 29333854 28638698 27660307 27171723 26748359
16666B6748359p52087n95697n19999j20994o37127n46069l26133n19743r89840
$$ 26748359 25996272 25400575 24880576 24759582 24122455 23576386 23250253 22730510 21740670
16657B1740670K86758p50722o78261n1437m77001l56761l21607k15322o49852
$$ 21740670 22027428 21276706 20598445 20547008 20070007 19713246 19391639 19176317 18526465
16648A8526465j50597k59498l67720n70146j63557p35627J90280k60323k12398
$$ 18526465 18375868 18116370 17748650 17178504 17014947 16279320 16469600 16209277 15996879
16639A5996879n84076L8301k49990m59534j65237l20777n05284K12339o38994
$$ 15996879 15412803 15451104 15201114 14741580 14576343 14255566 13750282 13962621 13323627
16630A3323627N70607o17523l98892j30471q0463k77588J79867o19223J46379
$$ 13323627 13894234 13276711 12877819 12747348 12666885 12389297 12569164 11949941 12096320
16621A2096320k26699n55354J70798j26433n6940m88956J89129j52921l04748
$$ 12096320 11869621 11314267 11485065 11358632 11301692 10812736 11001865 10848944 10544196
16612A0544196l68460o376j51625r8317k71633K36745j78423l70441j8220k51234
$$ 10544196 10175736 10169360 10017735 9919418 9647785 9884530 9706107 9335666 9317446 9066212
16602I066212k78347j46658L35078m15287J35156l41697p3217Q8501j28952m52168
$$ 9066212 8787865 8641207 8976285 8560998 8696154 8354457 8281240 8369741 8240789 7788621
16592G788621r4805L36212n58459K15721j54444j26569j73425n2187k7457m13876
$$ 7788621 7693816 8030028 7471569 7687290 7532846 7406277 7232852 7180665 7153208 6739332
16582F739332M49458j60056l9783o4324k30431l15985N08638l31347j24380j58148
$$ 6739332 7188790 7028734 6988951 6924627 6694196 6378211 6886849 6555502 6431122 6272974
16572F272974m4341k51461k1182L32476k22250q3392k62161J30214J44075m48463
$$ 6272974 6228633 5977172 5955990 6288466 6066216 5982824 5720663 5850877 5994952 5546489
16562E546489l3420Q5023p4945J58391j99855n65k40829J28427l16663K84413
$$ 5546489 5513069 5598092 5523147 5681538 5481683 5481118 5240289 5368716 5052053 5336466
16552E336466l45517p4164L42088m74069M85087k83818k04856j68835n7998J18530
$$ 5336466 4990949 4916785 5258873 4784804 5269891 4986073 4781217 4612382 4554384 4672914
16542D672914J25274j66505J96638k63760k29296J62166J00902q2867p6944o6252
$$ 4672914 4798188 4631683 4828321 4564561 4335265 4497431 4598333 4515466 4438522 4372270
16532D372270N851k0887o0j64650o5568j36926n685o9414K16790K28492l22421
$$ 4372270 4378121 4357234 4357174 4192524 4126956 3990030 3984345 3914931 4131721 4360213 4037792
16521D037792k08225L8735M0964K0255P429j70223L6646R8611l62567J05141j71454
$$ 4037792 3829567 3868302 3909266 3929521 3936950 3766727 3803373 3901984 3539417 3644558 3473104
16510C473104l14336M23008r4154K66681k08622J1794j23426o2550p2082l9242
$$ 3473104 3158768 3581776 3487622 3754303 3545681 3557475 3434049 3371499 3299417 3260175
16500C260175K93683k15152L817l01393J80144M6975P885j84033j2459J41848
$$ 3260175 3553858 3338706 3342523 3041130 3221274 3268249 3276134 3092101 3079642 3221490
16490C221490k32625J70324N0074r4378l3979k01804J97613o9039l01683K01591
$$ 3221490 2988865 3159189 3209263 3114885 3080906 2879102 3076715 3007676 2705993 2907584
16480B907584K36187k24778O9102q5194q6983j94384K84170j58325j71882L69490
$$ 2907584 3143771 2918993 2988095 2902901 2815918 2621534 2905704 2747379 2575497 2944987
16470B944987j58847j88920J82016m35470L42561k57465J13704j89829K23712
$$ 2944987 2786140 2597220 2779236 2343766 2686327 2428862 2542566 2352737 2576449
16461B576449J91375k06631M00890l21809k32166L46171n34088J66795n1656L77736
$$ 2576449 2767824 2561193 2962083 2640274 2408108 2754279 2220191 2386986 2335330 2713066
16451B713066n16090P2865j47888L87558j60523p7259J68136N1699j45708O2646
$$ 2713066 2196976 2269841 2121953 2509511 2348988 2271729 2439865 2491564 2345856 2408502
16441B408502k32717K23681n2640j81767m8559J31517J25742l14618L10624j74795
$$ 2408502 2175785 2399466 2346826 2165059 2116500 2248017 2373759 2059141 2369765 2194970
16431B194970m0519q6277K831J39301k62056R315j84565J91528K66480l12983
$$ 2194970 2154451 2068174 2071005 2210306 1948250 1957565 1773000 1964528 2231008 1918025
16421A918025K00599k38257L4348J02631j72196k22096K52768J37060J0940j36111
$$ 1918025 2118624 1880367 1914715 2017346 1845150 1623054 1875822 2012882 2023822 1887711
16411A887711l87419M23026j28965R2959r9430J67066q1475j72387M6050R8745
$$ 1887711 1500292 1923318 1794353 1887312 1787882 1954948 1873473 1701086 1747136 1845881
16401A845881j75772L27844l95124j15411K50768J63703j06652l56349j3154L61189
$$ 1845881 1670109 1997953 1602829 1487418 1738186 1901889 1795237 1438888 1425734 1786923
16391A786923j16002l3140l37191J02622K77004J08305m04147L90706j10776r2044
$$ 1786923 1670921 1637781 1300590 1403212 1680216 1788521 1384374 1775080 1664304 1572260
16381A572260j5089M56512m19250J2496k2085J46285J61580l73759J94113k68376
$$ 1572260 1557171 2013683 1594433 1606929 1584844 1731129 1892709 1518950 1713063 1444687
16371A444687L79723Q0058l32472q5772J88002K15517m45285k10784L32000P022
$$ 1444687 1824410 1904468 1571996 1486224 1674226 1889743 1444458 1233674 1565674 1572696
16361A572696P2328k76331J41468k50185J65981k4492k8149k06828O54171k73755
$$ 1572696 1645024 1368693 1510161 1259976 1425957 1401465 1373316 1166488 1820659 1546904
16351A546904m44217L91276l17909L69221j26188J4944j43209J11974K64923l46420
$$ 1546904 1102687 1493963 1176054 1545275 1419087 1434031 1290822 1402796 1667719 1321299
16341A321299j89255R0242K4131J45938k02055M5325l4864j93186L73783J20392
$$ 1321299 1132044 1222286 1246417 1392355 1190300 1235625 1200761 1007575 1381358 1501750
16331A501750n44403M13523m52112M06520J0895j74059J32920k38402L25699m13951
$$ 1501750 957347 1370870 918758 1325278 1336173 1162114 1295034 1056632 1382331 968380
16321I68380M7530J17950J27532k04159M47648k84369L1150k34168J52741j73496
$$ 968380 1015910 1133860 1261392 1057233 1504881 1220512 1251662 1017494 1170235 996739
16311I96739L08906m46094N46854m25797L2360K74027o0629j18007k7229J15597
$$ 996739 1305645 859551 1406405 980608 1012968 1286995 1226366 1108359 1081130 1196727
16301A196727j34947k14060j2378J03610p2797J21803N7269M90413j96392m74124
$$ 1196727 1061780 847720 835342 938952 866155 987958 1045227 1535640 1339248 865124
16291H65124L79840N7527k19781J69391j6799m25181L18797l81194j12077J98192
$$ 865124 1244964 1302491 1082710 1252101 1235302 810121 1128918 747724 635647 833839
16281H33839J50299k18449J89000K13476m56882K39464J88715N8392j50425L4646
$$ 833839 984138 765689 954689 1168165 711283 950747 1139462 1197854 1047429 1082075
16271A082075E02467K54134K33417l05465L29160r4171n7653l7943j44326L25977
$$ 1082075 502467 756601 990018 684553 1013713 919542 861889 823946 679620 1005597
16261A005597n2094l46381N84505n10022K71512k974o1971j10761O4352J06916
$$ 1005597 953503 607122 1191627 681605 953117 950143 888172 777411 841763 948679
16251I48679p8966M0160o2264O1513J26434l51727m0204O6798M0976l948j77258
$$ 948679 869713 909873 847609 909122 1035556 683829 643625 710423 751399 747451 570193
16240E70193R9522L80773m19004K94335o0187K60085l09371k96261L99269l6344
$$ 570193 669715 1050488 631484 925819 865632 1125717 816346 520085 919354 883010
16230H83010p6224L27228k57757l00903J76500L70968j70799j30186l1723B81121
$$ 883010 806786 1134014 876257 575354 751854 1122822 952023 821837 790114 281121
16219G53865k96350P4967R6714p2102J82214k37317K64910j78005J4521K72492
$$ 753865 457515 532482 629196 557094 739308 501991 766901 588896 603417 875909
16209H75909q1162j42589Q9653l41437K73144P8109l3341j55783J00211k0046
$$ 875909 794747 652158 741811 400374 673518 751627 718286 562503 662714 642668
16199F42668J5883m517K61063C50079K21973m5658L16855j77882q3440j18308
$$ 642668 658551 654034 915097 350079 572052 526394 843249 665367 581927 463619
16189D63619k0753N01466k23430j94547O7144J4520L2264K19569l28805O4502
$$ 463619 442866 944332 720902 526355 593499 608019 640283 859852 531047 595549
16179E95549k1100J30397n088l05305L05620k98818j4034L68197N6889j92564
$$ 595549 574449 704846 699758 394453 700073 401255 387221 755418 812307 619743
16169F19743l3207j32681J83531P3073l3497n6067J7674j28001j77007K16658
$$ 619743 586536 453855 637386 710459 676962 620895 638569 510568 333561 550219
16159E50219p4872n3026n914M7540k02051J86732J89258B85607N80886j05071
$$ 550219 475347 422321 416407 463947 261896 448628 637886 285607 866493 761422
16149G61422k16728Q9062k95653A65083M43097k11503A82767L47819J01661j00606
$$ 761422 544694 633756 338103 165083 608180 396677 182767 530586 632247 531641
16139E31641k28882J32346K51549l12346O8829j31328J14200j04033l6620O481
$$ 531641 302759 435105 686654 374308 443137 311809 426009 321976 285356 291837
16129B91837R9453J88671B39210L07991j14005r4030J54641j80488L77431r5857
$$ 291837 391290 579961 239210 547201 433196 339166 493807 313319 690750 594893
16119E94893k87615j28931K95807Q6032k27952J85434L1675k11496J25238A81447
$$ 594893 307278 178347 474154 560186 332234 517668 549343 337847 463085 181447
16108E60832H8965N8710M05602A66949K47314j21682Q2258M8400O1154P5872k41321
$$ 560832 88965 147675 553277 166949 414263 292581 374839 423239 484393 560265 318944
16097C18944J05821B00147L1777Q4482J06936j8380J00164A56901D2791L80973
$$ 318944 424765 200147 231924 316406 423342 404962 505126 156901 42791 423764
16087D23764L9088j40432A18413J23060Q8510K51252j42811k11247A07275L53068
$$ 423764 462852 322420 118413 241473 329983 581235 438424 227177 107275 460343
16077D60343j96803j27664M10189l8713B33037K63H7342M30013F0420K20767J530
$$ 460343 263540 135876 546065 507352 233037 233300 87342 517355 60420 281187 282717
16066B82717n8990O7514L0812R2292m6368J54966o3004B19126K05832B11822J9442
$$ 282717 223727 291241 322053 414345 367977 522943 459939 219126 424958 211822 231264
16055B31264A0635M09482j14199m6676R3119K6523K11639G6970l199r577L9360
$$ 231264 10635 420117 305918 259242 352361 378884 590523 76970 73771 64194 103554
16044A03554J2047K11857D4401L09468P7945j14642E7680J83626Q7279E9579a46750
$$ 103554 115601 327458 44401 353869 431814 317172 57680 241306 328585 59579 -146750
16032A78888j4510J79330j37137J45782P1209A74210L27215l4550A69512G1274
$$ 178888 164378 343708 206571 352353 423562 174210 501425 466875 169512 71274
16021D96625b75498g6943I4022M054J16856P8018K9905J09431A77942a07836D39462
$$ 496625 -275498 -76943 94022 98076 214932 292950 322855 432286 177942 -107836 439462
16009D74261j41132Q108J29p312i6484C29739A49676M44404B34742K76651A74143
$$ 474261 333129 341237 341366 334054 -96484 329739 149676 594080 234742 511393 174143
15997A52624J78813g2827A22982K16509G5486K04973r0864J73o6642L46133H4526
$$ 152624 331437 -72827 122982 339491 75486 280459 189595 189768 123126 469259 84526
15985G71603k79222M0660k43222J9481J49900h3227C34551Q1771r0592j17680
$$ 771603 492381 533041 289819 309300 459200 -83227 334551 416322 325730 208050
15975B08050J23192j07807k9447L32519k61830J6582A03346C4157J27950e9620
$$ 208050 331242 223435 193988 526507 264677 281259 103346 34157 162107 -59620
15964E2474J24391H5954M43796B57624d47215C52808A67366e7142B08718A00450
$$ 52474 176865 85954 529750 257624 -447215 352808 167366 -57142 208718 100450
15953B93102a20339C35618o1004a02104A79060G6548Q4341E3066c0345H3871b5336
$$ 293102 -120339 335618 274614 -102104 179060 76548 160889 53066 -30345 83871 -25336
15941f0950B1883K25903a43009C47899J18639p0938d4833G5963J14184n965c9276
$$ -60950 21883 247786 -143009 347899 466538 395600 -44833 75963 190147 184182 -39276
15929A0618J99133J76217j84061c6083p5792M4028A29913K21331j75413j7661
$$ 10618 209751 385968 201907 -36083 -111875 -67847 129913 351244 175831 158170
15919A58170J85469e4482I0289a74205B80465a04134C60619H2874J43444A00426
$$ 158170 343639 -54482 90289 -174205 280465 -104134 360619 82874 226318 100426
15908H7918L35461M9491j77956j16136D9425a06080H7238a49415D5377Q8538O1235
$$ 87918 423379 472870 294914 178778 49425 -106080 87238 -149415 45377 133915 195150
15897A95150a67439A19225K20525A18793f5364B5805k744Q3975d1198j819j6643
$$ 195150 -167439 119225 339750 118793 -65364 25805 23061 107036 -41198 -43017 -59660
15886e9660j24119A26009D2525b239B9822K26507b3770A79429l4614N7683r5288
$$ -59660 -183779 126009 42525 -2239 29822 256329 -23770 179429 144815 202498 107210
15875A07210J18789Q771j11647a09969A57471K937R0064C36J28927K06106a0505
$$ 107210 225999 234770 123123 -109969 157471 160408 250472 336 129263 335369 -10505
15863A39334A1081a50046M8046A21553n5160a89003F1820L96054G7747b3583B0238
$$ 139334 11081 -150046 -102000 121553 66393 -189003 61820 457874 77747 -23583 20238
15851b24827A64284a03878B00480L90582B5087a22100A32364l8411b23308r772
$$ -224827 164284 -103878 200480 591062 25087 -122100 132364 93953 -223308 -233080
15841b33080c1031B59180j18368J33494c42870B6961a15445E2982c39051d4100
$$ -233080 -31031 259180 140812 274306 -342870 26961 -115445 52982 -339051 -44100
15830b17829b5425A00160R9300d062A60490R6651A8995b3143A27724l5879k0142
$$ -217829 -25425 100160 199460 -4062 160490 257141 18995 -23143 127724 91845 71703
15819G1703c8671A96494f0862F1028Q2274g1820c1035I3128J4589a86132B44585
$$ 71703 -38671 196494 -60862 61028 143302 -71820 -31035 93128 107717 -186132 244585
15807F5489R7907B6147R0263J35782a77164A65962a11837j23265B95701A25674
$$ 65489 163396 26147 116410 252192 -177164 165962 -111837 -235102 295701 125674
15796B88520j26756J35385A13611b15245A58891a2260A35949h4474j19618D689
$$ 288520 161764 297149 113611 -215245 158891 -12260 135949 -84474 -204092 4689
15785B42129j2106b99624F6953K9754P4770a31740A0555J21016j6864C5479J08892
$$ 242129 230023 -299624 66953 96707 171477 -131740 10555 131571 114707 35479 144371
15774A44371B3057R4230J1862B2388K8847B5586M2397d6032j84855A97893E7612
$$ 144371 23057 117287 129149 22388 51235 25586 67983 -46032 -230887 197893 57612
15762A20145h3090B9712J41010a48294A8249L4220K49914H4491b534k0272j2329
$$ 120145 -83090 29712 170722 -148294 18249 52469 302383 84491 -2534 -22806 -35135
15751c5135j29340j18721D2902Q4956f1138D154M2322a4805l65393A13024l3557
$$ -35135 -164475 -283196 42902 127858 -61138 4154 46476 -14805 -380198 113024 79467
15740G9467c8718B46480a41770n7039j28970i6094k64442A11616a80904j4946
$$ 79467 -38718 246480 -141770 -198809 -327779 -96094 -360536 111616 -180904 -195850
15730a95850L9441j11599a13543B7387a55373g1831A85752a0562B01255b20398
$$ -195850 -156409 -268008 -113543 27387 -155373 -71831 185752 -10562 201255 -220398
15719B13080E8793K35950c646A46023J29024a47164f659I8608O4739a95716a8666
$$ 213080 58793 294743 -3646 146023 275047 -147164 -6659 98608 163347 -195716 -18666
15707f3044G3728c20840J45383A52225n3212l3804d0712j08295F528b01003A90237
$$ -63044 73728 -320840 -175457 152225 99013 65209 -40712 -149007 6528 -201003 190237
15695C6202a24372A24079i5061K7716J5290A00742A3653a12499A31028D0758a36567
$$ 36202 -124372 124079 -95061 -67345 -52055 100742 13653 -112499 131028 40758 -136567
15683c7270o0449A19909d3051m1359j31517B21475b19068f0845A11215K35803
$$ -37270 -97719 119909 -43051 -84410 -215927 221475 -219068 -60845 111215 347018
15673C47018a05254C02390E0463a154A55483e0580q4395c9869I0877C0180g2071
$$ 347018 -105254 302390 50463 -1154 155483 -50580 -134975 -39869 90877 30180 -72071
15661A26615A1997h2729E4716f7919n5448A35413a12332d6853j11462B54911b70928
$$ 126615 11997 -82729 54716 -67919 -123367 135413 -112332 -46853 -158315 254911 -270928
15649g5198F5654a04428A43884a83410B88468D1265a01101M501B7034O4596a72122
$$ -75198 65654 -104428 143884 -183410 288468 41265 -101101 -96600 27034 91630 -172122
15637C0515b2111k56221o9665a55890J9652A181e2292b0982j77205j15988b8530
$$ 30515 -22111 -278332 -347997 -155890 -136238 1181 -52292 -20982 -198187 -314175 -28530
15625a1515k16883C17253b49814I1499B3189a51253A64393m4794i1161n4716J6776
$$ -11515 -228398 317253 -249814 91499 23189 -151253 164393 119599 -91161 -145877 -129101
15614a29101n3744B37270I4317J20582c3924H6737c68874A39042N0770G265c45456
$$ -129101 -182845 237270 94317 214899 -33924 86737 -368874 139042 189812 7265 -345456
15602B90888j12265j0749M0219q2512R863e7649K0532A23156b12712C1536g9396
$$ 290888 178623 167874 208093 125581 135444 -57649 -37117 123156 -212712 31536 -79396
15590B59542m9762a56647L690O4793G3497A1299a46172j57108H1109M4710a80842
$$ 259542 209780 -156647 -152957 -88164 73497 11299 -146172 -303280 81109 125819 -180842
15578F0893d9219A32696g8553D4477a5728C67666j3463b27171L7827G4931O6749
$$ 60893 -49219 132696 -78553 44477 -15728 367666 354203 -227171 -189344 74931 141680
15567A41680a21435C8113a39878C9438a1462n5059C02945A44268g3387k06962
$$ 141680 -121435 38113 -139878 39438 -11462 -66521 302945 144268 -73387 -280349
15557b80349A94108q9197N9807J4278p6501a2676E302J19985a54215A10376J79284
$$ -280349 194108 104911 164718 178996 102495 -12676 5302 125287 -154215 110376 289660
15546B89660m3263A22324f5377B62386G7384A7183K72K50528k1227m6763l318
$$ 289660 246397 122324 -65377 262386 77384 17183 17455 267983 246756 199993 196675
15535A96675d4835A81033b69648C68461a08312C3695K65278l7572A3708R2903
$$ 196675 -44835 181033 -269648 368461 -108312 33695 298973 261401 13708 106611
15525A06611r309a80736B51689A04257J97179J19954e4815I9238k3476O0372a30716
$$ 106611 97302 -180736 251689 104257 301436 421390 -54815 99238 75762 136134 -130716
15513c5092k2509k00772J06233B48210m9444A0264b91158e8910r3777A15275E48
$$ -35092 -57601 -258373 -152140 248210 198766 10264 -291158 -58910 -152687 115275 548
15501a74913B36586a55206A2564g1101A54002J21399b45847C55203b13217B16051
$$ -174913 236586 -155206 12564 -71101 154002 275401 -245847 355203 -213217 216051
15490a61420B46027b33913B4990a9038p3053B056L8542J91777c81679a56930H4491
$$ -161420 246027 -233913 24990 -19038 -92091 2056 40598 232375 -381679 -156930 84491
15478H9005J57600a60539C5956d8650n3609m7152A97830r6036i5273G8771K15179
$$ 89005 246605 -160539 35956 -48650 -102259 -149411 197830 101794 -95273 78771 293950
15467B93950c1891l95233A30628a27317J2722E0133c35257D20812A27754B7020
$$ 293950 -31891 -427124 130628 -127317 -114595 50133 -335257 420812 127754 27020
15456a29349A04435A0268a28262B64520c08802B4986g1002c1168J1752H5281b63949
$$ -129349 104435 10268 -128262 264520 -308802 24986 -71002 -31168 -19416 85281 -263949
15444C67978A66714J80717r4249E5342J0365a00111L8439D0063b21345C50940
$$ 367978 166714 347431 253182 55342 65707 -100111 -61672 40063 -221345 350940
15433B68716b13082E0595L9731A595a95113D7541L5694j9559a85449b3723F6847
$$ 268716 -213082 50595 90326 1595 -195113 47541 83235 63676 -185449 -23723 66847
15421b43184G7675g9195a8557A70427E4989b0091o6714A80317a2186n0546j84552
$$ -243184 77675 -79195 -18557 170427 54989 -20091 -86805 180317 -12186 -62732 -247284
15410b47284a151k563r0067O238l8741A21106B6324a04525j02470A93006b41987
$$ -247284 -1151 -3714 -93781 -87543 -126284 121106 26324 -104525 -206995 193006 -241987
15398A1028P0659c29290C1733a79954P791B65198h2805Q432E7805c2414j06383
$$ 11028 81687 -329290 31733 -179954 -172163 265198 -82805 -74373 57805 -32414 -138797
15387a38797M8183L5148o0898d9764C86973G9829b9842o3701l01858f4403C0177
$$ -138797 -90614 -55466 -116364 -49764 386973 79829 -29842 -93543 -395401 -64403 30177
15375a47682H4957M2563P4148q649G1193A542K9442P8023i2354A6478J10130c576
$$ -147682 84957 127520 201668 193019 71193 1542 30984 109007 -92354 16478 126608 -3576
15362e599B4493e2730I2028c6355k8665O582B01419a0899j1111A06699a34739
$$ -5599 24493 -52730 92028 -36355 -65020 -58438 201419 -10899 -22010 106699 -134739
15350B90809I4735a64161N1826j26111H6032O9221K13050o8544J63752b85597
$$ 290809 94735 -164161 -112335 -238446 86032 155253 368303 299759 463511 -285597
15339G8405g517E5389M0652J78317o0328a81600B15379L680k4011q0776R395a54065
$$ 78405 -7517 55389 96041 274358 214030 -181600 215379 219059 195048 114272 123667 -154065
15326A16797k4214a96416B3735o49i0679G8907J48167N705E7529J36756K5096
$$ 116797 92583 -196416 23735 23086 -90679 78907 227074 232779 57529 194285 219381
15315B19381B3381K23004l5834c11989B51967a39510G42973A0967J69988o6550
$$ 219381 23381 246385 210551 -311989 251967 -139510 742973 10967 180955 114405
15305A14405c1596A49819a37996A82246o1988a77441D5682a06829A59516E641
$$ 114405 -31596 149819 -137996 182246 120258 -177441 45682 -106829 159516 5641
15294a12161H2650b00275C45841E8363B5061L4302a9834E9135A0367f3627A95323
$$ -112161 82650 -200275 345841 58363 25061 59363 -19834 59135 10367 -63627 195323
15282b24422A09223m1030a05194g052I7437L3584b69405F1263L97458A6339e9401
$$ -224422 109223 68193 -105194 -7052 97437 131021 -269405 61263 458721 16339 -59401
15270C99531A84444M777C2412a5953p2130A64391B9523N375g3051B99434D012
$$ 399531 184444 189221 32412 -15953 -88083 164391 29523 34898 -73051 299434 4012
15258A50107H320c2124j76042J5806A90106E4809K8483K469P5811K84445d3349
$$ 150107 8320 -32124 -208166 -192360 190106 54809 83292 85761 161572 446017 -43349
15246F38751A61707J03144N83338O2581J747152N18527n29470N14182q84192A117663
$$ 638751 161707 264851 848189 910770 2657922 3176449 2646979 3161161 2276969 1117663
15235D52028D2911J04809P2570J08309j05936F9402J12831C7870J14235B8759
$$ 452028 42911 147720 220290 328599 222663 69402 182233 37870 152105 28759
15224a9318B03201a08079e3519j52332l057A712A47J24386a4343k48673d5230
$$ -19318 203201 -108079 -53519 -205851 -208908 1712 147 124533 -14343 -263016 -45230
15212B01385D87h6771g679k0735j01866d5121m8856J6507B6658J64942C7653P79
$$ 201385 487 -86771 -7679 -28414 -130280 -45121 -93977 -77470 26658 191600 37653 38432
15200C8432K2903J4071D140J27426c30435A4848a19969J1768A02398J52769b31262
$$ 38432 61335 75406 4140 131566 -330435 14848 -119969 -108201 102398 255167 -231262
15188f8126o7333A13866j0234f4578a0485j60253e41B62952b6779k7535K5942
$$ -68126 -135459 113866 103632 -64578 -10485 -170738 -541 262952 -26779 -54314 -28372
15177b8372C1710A0756i1712k615a3085B8609O6960j0502J20547k9118L11602
$$ -28372 31710 10756 -91712 -94327 -13085 28609 95569 85067 205614 176496 488098
15166D88098i7673B92274A2616a14430A64002Q1861n6666h3679I5189M63276B46375
$$ 488098 -97673 292274 12616 -114430 164002 245863 189197 -83679 95189 558465 246375
15154a48351d420F5810L2024J10716l2733e8677B4883L65510C1863K88036A06477
$$ -148351 -4420 65810 97834 208550 175817 -58677 24883 390393 31863 319899 106477
15142i0285C05324j49791L03026a17987A68346R593J86261a7486A4185a68001
$$ -90285 305324 155533 458559 -117987 168346 177939 364200 -17486 14185 -168001
15131g8105D3707K02869j16278e5635J7952C09824j02209F9900Q8040b0674k32120
$$ -78105 43707 246576 130298 -55635 -37683 309824 207615 69900 157940 -20674 -252794
15120b52794B28742I5359K8332J92717m4804r4782J63484j7048J40225A21704
$$ -252794 228742 95359 123691 316408 271604 176822 340306 323258 463483 121704
15109B11530a29432A6928O5041J65152l7674a02363G0876N8988m4388J47525g1523
$$ 211530 -129432 16928 81969 247121 209447 -102363 70876 129864 85476 233001 -71523
15097B25177k1291K3373l7945a59878G5358d6607A59996a48210A49666R1613J58119
$$ 225177 203886 227259 189314 -159878 75358 -46607 159996 -148210 149666 241279 399398
15086C99398A86724o3644P0803a42909A36667a37860J4921I086b5074A09514k8417
$$ 399398 186724 123080 193883 -142909 136667 -137860 -122939 9086 -25074 109514 81097
15075H1097K2982J02384a12156L2496B07991C0146J78439M6306J49133o1704J02213
$$ 81097 104079 206463 -112156 -79660 207991 30146 208585 254891 404024 342320 444533
15064D44533A13761J50983b2908C65945J03364B30144B5006J40175L90586k19371
$$ 444533 113761 264744 -22908 365945 469309 230144 25006 165181 555767 336396
15054C36396b52632C62666j72555K04292A73133J50880l6126a82351A09524R5174
$$ 336396 -252632 362666 190111 394403 173133 324013 287887 -182351 109524 204698
15044B04698J28421r2843J31153o3211J75893j33934A024N01415C5057K83793
$$ 204698 333119 240276 371429 308218 484111 350177 1024 502439 35057 318850
15034C18850j22A38100J8948a76051E21081A44307J07985J49642A18049K28198
$$ 318850 318728 138100 157048 -176051 521081 144307 252292 401934 118049 346247
15024C46247K19122g308F8292J36562J03174h1122C36191A53582K14878j45055
$$ 346247 565369 -7308 68292 204854 308028 -81122 336191 153582 368460 223405
15014B23405L32382A89865M9694K9152E8576K82759I4827J89953n0395r4032d9211
$$ 223405 555787 189865 239559 268711 58576 341335 94827 284780 234385 140353 -49211
15002C55241j1801A9784R8827J89399Q0024O3546A18727M2946e0201E14655b1459
$$ 355241 343440 19784 118611 308010 388034 451580 118727 161673 -50201 514655 -21459
14990C91654R2658j63671D8734L91488G0540J21179K42822n9022n9602E8369K56700
$$ 391654 484312 320641 48734 440222 70540 191719 434541 375519 315917 58369 315069
14979C15069Q3016m6521p491A2630M23134j67843J33129N1743K39223k35609k8975
$$ 315069 398085 351564 344073 12630 435764 267921 401050 452793 692016 456407 427432
14968D27432j53576J88390A51264J33851l0392O2043K45782A4284M11286A65366
$$ 427432 273856 462246 151264 285115 254723 316766 562548 14284 425570 165366
14957D24471J90730A5894J11421L97334j13664A70466J86096m2202M7694P1118
$$ 424471 615201 15894 127315 524649 410985 170466 356562 314360 362054 433172
14947D33172E7360K01579Q0181N6319j66651M4128J14644k4426J12573q8120H0441
$$ 433172 57360 258939 339120 395439 228788 272916 387560 363134 475707 387587 80441
14935A6143L86278m8569A67731J56113J2820K3709m2559L07617k99852O6957M0888
$$ 16143 402421 353852 167731 323844 336664 360373 317814 625431 325579 392536 433424
14924D33424K58155C16629L75386j14192R3485j4290k61588L40845K5585C48345
$$ 433424 691579 316629 692015 577823 671308 657018 395430 736275 761860 348345
14913D29790M5819m6384A16429L59322j95494N20427B55309O25K65742k18307
$$ 429790 475609 429225 116429 475751 280257 800684 255309 255934 521676 303369
14903C03369K06271j03240j54528L65795A25534J33574f51A84966K15041a90492
$$ 303369 509640 406400 251872 617667 125534 259108 -651 184966 400007 -190492
14892E29475A27014M41577H8605M61283j05698K17412j53871N830J04234Q9637
$$ 529475 127014 568591 88605 549888 444190 661602 507731 513561 617795 707432
14882G07432C11975K59683B70373q1463K4016o0641K78009A85213r0221J69776
$$ 707432 311975 571658 270373 188910 212926 152285 430294 185213 94992 264768
14872B64768L8565K45779k14604D3027K51109N26436l89441j06632O929J71419
$$ 264768 303333 549112 334508 43027 294136 820572 431131 324499 331428 502847
14862E02847k47747J87785e2460Q418B84487A06960L48413m8806O0311n2324J13640
$$ 502847 255100 442885 -52460 -44042 284487 106960 455373 406567 466878 414554 528194
14851E28194N405j53777L3818j41260K95373J06801q3402B90892J04400J40569
$$ 528194 533599 379822 413640 272380 567753 674554 591152 290892 395292 535861
14841E35861K61042o8279l17414j06014N91464l59215j19531K6107N22421l76243
$$ 535861 796903 728624 411210 305196 896660 537445 417914 444021 966442 590199
14831E90199M725N4787k57970n5572P2835K43508k88110K18990L8301A46136K99928
$$ 590199 594924 649711 391741 336169 409004 652512 364402 583392 621693 146136 446064
14820D46064O6359q7940J96633G3436L56536Q2579k9455P1334J5490k49502L3882
$$ 446064 512423 424483 621116 73436 429972 512551 483096 554430 569920 320418 354300
14809C54300I9355M52222L6862p5634n4182m9574K76178k03875j12717r6526J18519
$$ 354300 99355 551577 588439 512805 458623 409049 685227 481352 368635 272109 390628
14798C90628K24629J72283l37792j23691J6191L57710j06313J0813p0104k3243
$$ 390628 615257 787540 449748 326057 342248 699958 593645 604458 534354 511111
14788E11111K98403J07618l06520B53237K41356J38664j69304K1306K95945C59431
$$ 511111 809514 917132 610612 253237 494593 633257 463953 485259 781204 359431
14777C97604J5517j27024K18263O0472l8817k03081K26241K47888j89835B89218
$$ 397604 413121 286097 504360 564832 526015 322934 549175 797063 607228 289218
14766E67207B37770K08900P5406B54324K64539O8413L0263J55638K42721C84892
$$ 567207 237770 446670 522076 254324 518863 587276 617539 773177 1015898 384892
14755F16499j20424L9336J3198K78857C89881M16905k47364p5032J24198J16861
$$ 616499 496075 535411 548609 827466 389881 806786 559422 484390 608588 725449
14745G25449J96600l68527J16005J56586B92167L36252j03279k1628K54934l5894
$$ 725449 922049 553522 669527 826113 292167 628419 525140 503512 758446 722552
14735G22552O707M07922m47272j8402J4178n8354R329O5851J5520J68458j81265
$$ 722552 729259 1137181 689909 671507 685685 627331 636660 702511 718031 886489 705224
14724G05224J41017L14621k64825N9662j25795j65226L19823j05908j52742O4000
$$ 705224 846241 1160862 896037 955699 829904 664678 984501 878593 725851 789851
14714G89851M6805k8799k55670J37975L22167D18033M42652j16986j02485K95397
$$ 789851 836656 807857 552187 690162 1012329 418033 860685 743699 641214 936611
14704I36611m7142l29875N60190k68097J46881K9169L7970j24319j57917q665
$$ 936611 889469 559594 1119784 851687 998568 1027737 1065707 941388 783471 774806
14694G74806N0411M7046D23247N40294k63976L8109J24298J96407l33858L66737
$$ 774806 825217 872263 423247 963541 699565 737674 861972 1058379 724521 1091258
14684A091258L9502j81991m8878M4890q8329J0601r1949K57610j22462j75131
$$ 1091258 1130760 948769 899891 944781 856452 867053 775104 1032714 910252 735121
14674G35121L0255J28217K3733O7775j80844K40987J02463p3577L78603l86832
$$ 735121 765376 893593 917326 985101 804257 1045244 1147707 1074130 1452733 1065901
14664A065901r4980m3729o5525J2112J47481j69562K67541L7547J22729m9612
$$ 1065901 970921 927192 861667 873779 1021260 851698 1119239 1156786 1279515 1229903
14654A229903k42167j09848J78222p0143J1803j7369K84684k5811k12342j26886
$$ 1229903 987736 877888 1056110 985967 997770 980401 1265085 1239274 1026932 900046
14644I00046P0543m1492K11654O3708R3111k57886L12912n03697K95078L4784
$$ 900046 970589 929097 1140751 1204459 1297570 1039684 1352596 848899 1143977 1178761
14634A178761N355J69999k53451J09589k17088K21792J18507j81248K17830k31553
$$ 1178761 1184116 1354115 1100664 1210253 993165 1214957 1333464 1152216 1370046 1138493
14624A138493K06110p7786J68549J47882n77527J71811L70316m67840N1534J29253
$$ 1138493 1344603 1266817 1435366 1583248 1005721 1177532 1547848 1080008 1131542 1260795
14614A260795r4287j41462K58455j31476K59560k05050K9790J45084k16403J56933
$$ 1260795 1166508 1025046 1283501 1152025 1411585 1206535 1236325 1381409 1165006 1321939
14604A321939j6756K45153m6932q1450k10671L18196j43019L82731k34104P4835
$$ 1321939 1305183 1550336 1503404 1421954 1211283 1529479 1386460 1769191 1535087 1609922
14594A609922k61788l6315Q044j76303K95757J48648m9578M34272l35321J52705
$$ 1609922 1348134 1311819 1319863 1143560 1439317 1587965 1538387 1972659 1637338 1790043
14584A790043j84356L14945m09602P0531K58667j19400N3521r4017m4845R26267
$$ 1790043 1605687 1920632 1511030 1581561 1840228 1720828 1774349 1680332 1635487 2561754
14574B561754r08428M18641L7131j66888L48162k49552k05397J96768K33007j29377
$$ 2561754 1653326 2071967 2109098 1942210 2290372 2040820 1835423 2032191 2265198 2135821
14564B135821M30324k34812R1306J5867j8064J42818J97698K56155q9773J6774
$$ 2135821 2566145 2331333 2422639 2438506 2420442 2563260 2760958 3017113 2927340 2944114
14554B944114O91958J41179M27029P06763J547961K723204M606771O952942J1774527
$$ 2944114 3636072 3777251 4204280 4911043 6459004 9182208 13788979 20741921 32516448
14545C2516448j642171j2431336H571064l744483j342425r4631k80395Q39464
$$ 32516448 30874277 18442941 8571064 4826581 3484156 3389525 3109130 3948594
14537C948594J444037J806983k613803j430607r65825l2310J9071J16957q2021
$$ 3948594 5392631 7199614 4585811 3155204 2189379 2157069 2176140 2293097 2211076
14528B211076j32126j49562Q9838K88029k62832K7841K79386o22313K98495L03992
$$ 2211076 2078950 1929388 2019226 2307255 2044423 2072264 2351650 1729337 2027832 2331824
14518B331824L8468j20617L65355j43784J75219l20446J67974o5248r9734K73745
$$ 2331824 2370292 2249675 2615030 2471246 2646465 2326019 2493993 2428745 2329011 2602756
14508B602756J32087J9250R895l36950Q9803J98903J29674M3618n9894K57181
$$ 2602756 2734843 2754093 2763988 2427038 2516841 2715744 2845418 2889036 2829142 3086323
14498C086323J06450k48819l47690L15265L06477K18585m71199j44012L22847
$$ 3086323 3192773 2943954 2596264 2911529 3218006 3436591 2965392 2821380 3144227
14489C144227j84571L63706n8308J0621J31763M4535J32912l24990J92640j30217
$$ 3144227 2959656 3323362 3265054 3275675 3407438 3451973 3584885 3259895 3452535 3322318
14479C322318N56870l59408J92861P7027K2811k60641K12897O0242M7724k80339
$$ 3322318 3879188 3519780 3712641 3789668 3812479 3551838 3764735 3824977 3872701 3592362
14469C592362J15037N80505l26868p4567Q5664K06926J13490k0089K09593j46627
$$ 3592362 3707399 4287904 3961036 3886469 3972133 4179059 4292549 4272460 4482053 4335426
14459D335426J12502j80873K52716k75364J61585M09749k83j75441r8491M08022
$$ 4335426 4447928 4267055 4519771 4244407 4405992 4815741 4815458 4640017 4541526 4949548
14449D949548n2149K8755Q8186j28990N35897J20292j31290Q2166j70403j0455
$$ 4949548 4897399 4926154 5014340 4885350 5421247 5541539 5410249 5492415 5322012 5311557
14439E311557K81639k0191J7485r9579N74777J25666l28767M07514k39690j04051
$$ 5311557 5593196 5573005 5590490 5490911 6065688 6191354 5862587 6270101 6030411 5926360
14429E926360M99406p0702K89687o2423J9688K83065l22347M55648R1643J91229
$$ 5926360 6425766 6355064 6644751 6582328 6602016 6885081 6562734 7018382 7110025 7301254
14419G301254m2686p3834R5053K83802K60783J18945l12987L70499K27528n8608
$$ 7301254 7258568 7184734 7279787 7563589 7824372 7943317 7630330 8000829 8228357 8169749
14409H169749O020O58226k69831R27L08705L79686k69399L39360q3476J35339
$$ 8169749 8175769 8833995 8564164 8565091 8873796 9253482 8984083 9323443 9239967 9375306
14399I375306M22516L15012J14691L9157J3147K77158K10553K77031p7009N61082
$$ 9375306 9797822 10112834 10227525 10266682 10279829 10556987 10767540 11044571 10967562 11528644
14389A1528644k59567M07220M16505K34066j20737L60115K38803L54623N7643
$$ 11528644 11269077 11676297 12092802 12326868 12206131 12566246 12805049 13159672 13217315
14380A3217315M13380J25587J03280N13567L40214R8656P02359j44386N90893
$$ 13217315 13630695 13756282 13859562 14373129 14713343 14811999 15514358 15369972 15960865
14371A5960865J69933N96457J2770O58959L50884L76631K6023N89231M07125M14758
$$ 15960865 16130798 16727255 16740025 17398984 17749868 18126499 18152522 18741753 19148878 19563636
14361A9563636K21609L34327P00089O36052L7143O34365P70957J67628P26253
$$ 19563636 19785245 20119572 20819661 21455713 21492856 22127221 22898178 23065806 23792059
14352B3792059O96129Q93267M04347M46454N78124Q14646P62075Q05145O13513
$$ 23792059 24488188 25381455 25785802 26232256 26810380 27625026 28387101 29192246 29805759
14343B9805759J065531R36292P38487P53548Q99114J036887R86885R70290J703249
$$ 29805759 30871290 31807582 32546069 33299617 34198731 35235618 36222503 37192793 38896042
14334C8896042O81034J385422J538257J079012J279710J410363J377951J856018
$$ 38896042 39577076 40962498 42500755 43579767 44859477 46269840 47647791 49503809
14326D9503809J421849J850343K151886J875187J813722K126260K066696K292174
$$ 49503809 50925658 52776001 54927887 56803074 58616796 60743056 62809752 65101926
14318F5101926K768485K200141K491570L167645K980301K925304L583441L578456
$$ 65101926 67870411 70070552 72562122 75729767 78710068 81635372 85218813 88797269
14310H8797269L679194M324400L886991M515032M519805N438890N159154N740404
$$ 88797269 92476463 96800863 100687854 105202886 109722691 115161581 120320735 126061139
14302A26061139N865345O264156P145068O758596P927529Q211765Q329668R054571
$$ 126061139 131926484 138190640 145335708 152094304 160021833 168233598 176563266 185617837
14294A85617837R761921J0184391J0960844J0986540J1558230J2034100J2996177
$$ 185617837 195379758 205564149 216524993 227511533 239069763 251103863 264100040
14287B64100040J3046728J3609179J3862674J4522063J4699244J4405233J4599596
$$ 264100040 277146768 290755947 304618621 319140684 333839928 348245161 362844757
14280C62844757J4235810J3502640J3102362J1599537J0115517Q027832N155210
$$ 362844757 377080567 390583207 403685569 415285106 425400623 433428455 438583665
14273D38583665O84640k133648j019023P24167k803168q117149l308132p176141
$$ 438583665 439268305 437134657 436115634 436839801 434036633 425919484 422611352 415435211
14265D15435211j0623966j1961885j2926708j3892528j4937670j4841412j5062191
$$ 415435211 404811245 392849360 379922652 366030124 351092454 336251042 321188851
14258C21188851j5063897j4734460j4402399j3981251j3047548j2730694j2294788
$$ 321188851 306124954 291390494 276988095 263006844 249959296 237228602 224933814
14251B24933814j1366543j0906511j0499123r800645q140466o908599p953452
$$ 224933814 213567271 202660760 192161637 182360992 174220526 167311927 159358475
14244A59358475q018933p394159o854753o440889o061401n747740m867789n111213
$$ 159358475 151339542 143945383 137090630 130649741 124588340 118840600 113972811 108861598
14236A08861598m718268m767202m015910m133886l473437l372276l454204l047990
$$ 108861598 104143330 99376128 95360218 91226332 87752895 84380619 80926415 77878425
14228G7878425k841160l003540k886059k344944k335502k196744k440111k108148
$$ 77878425 75037265 72033725 69147666 66802722 64467220 62270476 59830365 57722217
14220E7722217j896079j898484j766029j703821j681100j466388j378417j173367
$$ 57722217 55826138 53927654 52161625 50457804 48776704 47310316 45931899 44758532
14212D4758532j589964j383732j342675j350528o75083q05139r01641j521942
$$ 44758532 43168568 41784836 40442161 39091633 38416550 37611411 36709770 35187828
14204C5187828q28215q48465r06383p75193o96601p98182j002498p96679q57986
$$ 35187828 34359613 33511148 32604765 31829572 31132971 30334789 29332291 28535612 27677626
14195B7677626k86955q01715o02006m99699o60383p66238o05594k91089p26415
$$ 27677626 27390671 26588956 25986950 25487251 24826868 24060630 23455036 23163947 22437532
14186B2437532n16243n13856l08122q50816O5582o47137n94150k99360m62889
$$ 22437532 21921289 21407433 21099311 20248495 20314077 19666940 19072790 18773430 18310541
14177A8310541n8213n85931l74035n21968R164m90571l69717k14358m72898j13656
$$ 18310541 18252328 17666397 17292362 16770394 16779558 16288987 15919270 15704912 15232014 15118358
14167A5118358j02682k48419p09063K47148p02645M0884l18429K38120r39569
$$ 15118358 15015676 14767257 14058194 14305342 13602697 13643581 13325152 13563272 12623703
14158A2623703Q5400l14613O9162p13346M33042n09881m24476j30074q4564j23302
$$ 12623703 12709103 12394490 12463652 11750306 12183348 11673467 11248991 11118917 11034353 10911051
14148A0911051j77342k18236O6544m59550N0909J74453q36102L95509l80935P4132
$$ 10911051 10733709 10515473 10582017 10122467 10173376 10347829 9511727 9907236 9526301 9600433
14138I600433m26150j04168j90693J90744m89394J17955l4604j93951n23612l1102
$$ 9600433 9174283 9070115 8879422 9070166 8580772 8698727 8664123 8470172 7946560 7915458
14128G915458J41847l46497J62245k05343k11076k28660k9979q2839k30998J73776
$$ 7915458 8057305 7710808 7873053 7667710 7456634 7227974 7197995 7115156 6884158 7057934
14118G057934k75738R5828j96048j14395P1633j76119J57283j76623k62525n8220
$$ 7057934 6782196 6878024 6681976 6567581 6639214 6463095 6620378 6443755 6181230 6123010
14108F123010J67037k96708m9510m6476j6307r9999J42950J7567k43513k25837
$$ 6123010 6290047 5993339 5943829 5897353 5881046 5781047 5923997 5941564 5698051 5472214
14098E472214J18580j61543j44501j6034q1767l5160j717J53041m12609j92804
$$ 5472214 5590794 5429251 5284750 5268716 5186949 5151789 5150072 5303113 4890504 4697700
14088D697700J12239N7340J20899l53745q803J80308l82754o6665J03791j39873
$$ 4697700 4809939 4867279 4988178 4634433 4625630 4805938 4423184 4356519 4460310 4320437
14078D320437j06714K59827m08475J87038j26774k5345J58723j12471j62526p320
$$ 4320437 4213723 4473550 4065075 4252113 4125339 4099994 4258717 4146246 3983720 3976400
14068C976400L66433n02671r9151r0115N913K29501k12690R516M4418J51145k81549
$$ 3976400 4342833 3840162 3741011 3650896 3656809 3886310 3673620 3683136 3727554 3878699 3597150
14057C597150k85775J07643k84501j3982L72053l09939K04584o8549j30910n245
$$ 3597150 3311375 3419018 3134517 3120535 3492588 3182649 3387233 3318684 3187774 3182529
14047C182529N9679p7942J47151l23427n9388J46722j38764q8396L38204l93270
$$ 3182529 3242208 3164266 3311417 2987990 2928602 3075324 2936560 2848164 3186368 2793098
14037B793098J47699j5683k28410J92162J53263R913k11300J53714k55286k55813
$$ 2793098 2940797 2925114 2696704 2888866 3042129 3052042 2840742 2994456 2739170 2483357
14027B483357K66576k64379N26598o79754L24592P6360k32927j30437J83767l51826
$$ 2483357 2749933 2485554 3012152 2332398 2656990 2733350 2500423 2369986 2553753 2201927
14017B201927J24774Q7652J64937l40068N3782j67310J48511J44958l17973m7297
$$ 2201927 2326701 2414353 2579290 2239222 2293004 2125694 2274205 2419163 2101190 2053893
14007B053893K34243j35677k0214j21440J86274O0962o0427l6085k67218K07733
$$ 2053893 2288136 2152459 2132245 2010805 2197079 2258041 2197614 2161529 1894311 2102044
13997B102044j40297R8676J93405j65787j28555M07090N26356J78813J811028
$$ 2102044 1961747 2060423 2253828 2088041 1959486 2366576 2892932 3071745 4882773
13988D882773L379409O028238J0634784R339732r773158r885480o034323k417214
$$ 4882773 8262182 14290420 24925204 34264936 24491778 14606298 8571975 6154761
13980F154761j573695n95219n48097k30239J55042l64997k52364l03226k39904
$$ 6154761 4581066 3985847 3437750 3207511 3362553 2997556 2745192 2441966 2202062
13971B202062m1071O9321J04538j83023o7928L99186m03108P8007l21837K86196
$$ 2202062 2160991 2230312 2334850 2151827 2083899 2483085 2079977 2157984 1836147 2122343
13961B122343K273L1293m35528K43359k20152n2414K19394k1544k73517K24139
$$ 2122343 2124616 2155909 1720381 1963740 1743588 1691174 1910568 1889024 1615507 1839646
13951A839646O9845Q0696j78783k13815J99003Q888n1003P7045l38377J01264
$$ 1839646 1909491 1990187 1811404 1597589 1796592 1805480 1754477 1831522 1493145 1594409
13941A594409k90902L73452o0177K9615q2075j17164L11077j05900K7850p4349
$$ 1594409 1303507 1676959 1616782 1646397 1564322 1447158 1758235 1652335 1680185 1605836
13931A605836j02102l4025J12394j79932R8189K89015k93282j07105K36659j45022
$$ 1605836 1503734 1469709 1582103 1402171 1500360 1789375 1496093 1388988 1625647 1480625
13921A480625l7109j67586M38959n41768K15766P4559j14890j42478O4643M3484
$$ 1480625 1443516 1275930 1714889 1173121 1388887 1463446 1348556 1206078 1270721 1314205
13911A314205m0409J76103N2313k76230k0974J52939k25534k99000L70297j04882
$$ 1314205 1273796 1449899 1502212 1225982 1205008 1357947 1132413 833413 1203710 1098828
13901A098828m2851J54215J3040O5959R7661k10795K3015Q8769l83021M4798M70273
$$ 1098828 1055977 1210192 1223232 1289191 1386852 1176057 1199072 1287841 904820 949618 1419891
13890A419891j85562J30757l86649l9282K07552k41673J58019m4566L68810k42105
$$ 1419891 1234329 1365086 978437 939155 1146707 905034 1063053 1018487 1387297 1145192
13880A145192j43106J73164r0121j49062l035k34560O09561n49876K25482j25629
$$ 1145192 1002086 1175250 1085129 936067 933032 698472 1308033 758157 983639 858010
13870H58010L62573J75962n26521K48702j67858Q3599p5021N8512J08416k16081
$$ 858010 1220583 1396545 870024 1118726 950868 1034467 959446 1017958 1126374 910293
13860I10293m9993r5293L8270k8943M49614l33771n2264M64015m36934J58187
$$ 910293 860300 765007 803277 774334 1223948 890177 837913 1301928 864994 1023181
13850A023181l00483M19767l07581J48439m12216J42721J10501n9114L04128k17426
$$ 1023181 722698 1142465 834884 983323 571107 713828 824329 765215 1069343 851917
13840H51917L87692m59129J67753j09513q9714K58281j54359m535k2922j61629
$$ 851917 1239609 780480 948233 838720 749006 1007287 852928 848393 825471 663842
13830F63842K74179k46070M3731o5742P9308M7964K71014E20223J59044k478J38250
$$ 663842 938021 691951 735682 669940 749248 797212 1068226 520223 679267 676789 815039
13819H15039k16903K20621j43399J29654J73958k84683N8445k09913L63988m7457
$$ 815039 598136 818757 675358 805012 978970 694287 752732 542819 906807 859350
13809H59350K4305l21412L25168p1895k85479L61252l60056J10726P432r3586
$$ 859350 883655 562243 887411 815516 530037 891289 531233 641959 649391 555805
13799E55805M02732j5227o2795n2561k42966m8311m7504K57473J18627k44158
$$ 555805 958537 943310 880515 827954 584988 536677 489173 746646 865273 621115
13789F21115j3277K21941J0743C46984M40926r9741k69179L52682j01579J16170
$$ 621115 607838 829779 840522 346984 787910 688169 418990 771672 670093 786263
13779G86263k49761K03202j51362J33699J95686m50398J85456K7204J17141j33594
$$ 786263 536502 739704 588342 722041 917727 467329 652785 679989 797130 663536
13769F63536k48333K33314j50870J18792J91619k28226K21813l09767K8129P73
$$ 663536 415203 648517 497647 616439 808058 579832 801645 491878 520007 520780
13759E20780J98475j12441J82042J14453D35541j2052J17218j17594O6670M37114
$$ 520780 719255 606814 788856 903309 435541 423489 540707 423113 489783 926897
13749I26897l75394J40089j487j64556K85169p9612J31363k48480j04544L9307
$$ 926897 551503 691592 690105 525549 810718 731106 862469 613989 509445 548752
13739E48752J7702J89141J95451C47514N4499L36700k07653k17232K16201k3695
$$ 548752 566454 755595 951046 347514 402013 738713 531060 313828 530029 506334
13729E06334J60932k7614B89981K17255K27588q5546k50302o537J09610J24761
$$ 506334 667266 639652 289981 507236 734824 649278 398976 392439 502049 626810
13719F26810Q1231j74397l4829k08049J40899j12950K1595L31063k01755j8649
$$ 626810 708041 533644 498815 290766 431665 318715 340310 671373 469618 450969
13709D50969j50010j8310K71661j46716J64870q7844p1012K0550J68390J34889
$$ 450969 300959 282649 554310 407594 572464 484620 413608 434158 602548 737437
13699G37437j67300q0336M043B21595K14181L47858k49142K36066B76603J17704
$$ 737437 570137 489801 493844 221595 435776 783634 534492 770558 276603 394307
13689C94307J67776p7562K64849C50711J08191O5180j23552N3409Q8953k48923
$$ 394307 562083 484521 749370 350711 458902 524082 400530 453939 542892 293969
13679B93969L38768j38123O682B02251K49071j35327K0027e1360F33411o0608
$$ 293969 632737 494614 501296 202251 451322 315995 336022 -51360 633411 572803
13669E72803k15766L65946C54597J64492B58088p4482K27703J53339j92604j61466
$$ 572803 357037 722983 354597 519089 258088 183606 411309 564648 372044 210578
13659B10578L66568j08134A16527L41679k24465K93093k3946J80866k16564j57787
$$ 210578 577146 469012 116527 458206 233741 526834 502888 683754 467190 309403
13649C09403J28504j55975j40164L52539j21635A55627J26072L98J59050l6374
$$ 309403 437907 281932 141768 494307 372672 155627 281699 282097 441147 404773
13639D04773c6731B20362J0783K51900P8637B75681J37379J21362A54966m5524
$$ 404773 -36731 220362 231145 483045 561682 275681 413060 534422 154966 109442
13629A09442K79380P9821m9390B203K45568M59685q0845B59250J81002A80799
$$ 109442 388822 468643 419253 2203 247771 707456 626611 259250 440252 180799
13618E55523j08477n3393j10166K64447M1660k94215J60309r9655A60595L54360
$$ 555523 447046 393653 283487 547934 589594 295379 455688 356033 160595 514955
13608E14955j1559p3101J03791j09592J82544o1000B52030D5509J42023K30794
$$ 514955 503396 430295 534086 424494 607038 546038 252030 45509 187532 418326
13598D18326L9669k05452c3157C55170K69555A78733K22484j84750K18402A06673
$$ 418326 457995 252543 -33157 355170 624725 178733 401217 216467 434869 106673
13587g0925A26081M3098J9859d7479D50927n8769q6493C2093Q5582n6339J53546
$$ -70925 126081 169179 189038 -47479 450927 392158 305665 32093 117675 61336 214882
13576B14882K49643j11860l1436P5772C8751L18611j1640P8463A49531K25391
$$ 214882 464525 352665 321229 397001 38751 357362 345722 424185 149531 374922
13566C74922j00106K34483j53090j6523M4253A40343L84898k02951O4523K71730
$$ 374922 274816 509299 356209 339686 383939 140343 525241 322290 386813 658543
13556F58543a315r2174D41547r6694q6235q2500m9489K05637F4839M61035r4162
$$ 658543 -1315 -93489 441547 344853 258618 176118 126629 332266 64839 525874 431712
13545D31712p0476J43737K2481J19435B36763K1170J70605L02532B61323l5491
$$ 431712 361236 504973 527454 646889 236763 257933 428538 731070 261323 225832
13535B25832J35120K6869j87403I9895l6029M5654J48606J72730a137B64086D6192
$$ 225832 360952 387821 200418 99895 63866 109520 258126 430856 -1137 264086 46192
13523C40881c4755C43793q6345K79695j03059j19946j38638D9571L69681j85347
$$ 340881 -34755 343793 257448 537143 434084 314138 175500 49571 419252 233905
13513B33905j02790L6585l8461L61077A53690J4492b9037A30175N10584k01648
$$ 233905 131115 167700 129239 490316 153690 168182 -29037 130175 640759 439111
13503D39111a31727E74027B48709A09773i525A49406K49493E7557L53526j82128
$$ 439111 -131727 574027 248709 109773 -9525 149406 398899 57557 411083 228955
13493B28955r4052J9739K33583j07876A35112P5272H4150M1600k7732O2235E0385
$$ 228955 134903 154642 388225 280349 135112 210384 84150 125750 98018 160253 50385
13481E5924J86278K73060A33660J58183k2369L8968k5438j04206K86981A48344
$$ 55924 242202 515262 133660 291843 269474 308442 283004 178798 465779 148344
13470B50092J42239j80426l628R923q0404j5551J79278H5422k8308o172h407m0877
$$ 250092 392331 211905 208277 218200 137796 122245 301523 85422 57114 50942 -8407 -49284
13458d9284A85756J57961K310C2509a48511A33013K38025G3002P5050J23577Q4719
$$ -49284 185756 343717 346027 32509 -148511 133013 371038 73002 148052 271629 356348
13447C56348q3685N5726m5073p607A36625N9442P5534A00438a54089A18271L28735
$$ 356348 272663 328389 283316 275709 136625 196067 271601 100438 -154089 118271 447006
13436D47006R3044A81178P7935e9053B02143g309A65593J50888j08015b22435
$$ 447006 540050 181178 259113 -59053 202143 -7309 165593 316481 208466 -222435
13425G2283K86799D6917a7369A22258L82396b51890B78253q2145J9434M1978K92237
$$ 72283 359082 46917 -17369 122258 504654 -251890 278253 196108 215542 257520 549757
13414E49757B06795k3815l9121c9991D38603j55349N0588j4539j19081m1334J66545
$$ 549757 206795 182980 143859 -39991 438603 283254 333842 319303 200222 158888 325433
13403C25433E9289K18135O6999A71841J74542i5922B72682n3730R2895j37618
$$ 325433 59289 277424 344423 171841 346383 -95922 272682 218952 311847 174229
13393A74229K31471A28460a52610A39157J48884j22555m6815n3964L5048J96844
$$ 174229 405700 128460 -152610 139157 288041 165486 118671 64707 99755 296599
13383B96599A3328L68091a65891A74721C2713J59258N4926l6240L3465o3437k7974
$$ 296599 13328 381419 -165891 174721 32713 191971 246897 210657 244122 180685 152711
13372A52711j4814K3954A8897K59348j23865K62887J2354j66772N0026o3738A00491
$$ 152711 137897 161851 18897 278245 154380 417267 429621 262849 312875 249137 100491
13360A87360J7909J04430a60322A98366K15991A94632Q8026g4824D27453A02216
$$ 187360 205269 309699 -160322 198366 414357 194632 282658 -74824 427453 102216
13349A61965j2649a51268B68098p3567r5986M78431O1659a18663A55141K44953
$$ 161965 149316 -151268 268098 194531 98545 576976 638635 -118663 155141 400094
13339D00094c3674C08416q028B5395L98048m2710K3148o4792J36978D8177K59592
$$ 400094 -33674 308416 300388 25395 423443 380733 403881 339089 476067 48177 307769
13328C07769N094n695A9275J53448G3332J66755o1622J45037H521K21225J61765
$$ 307769 312863 307168 19275 172723 73332 240087 178465 323502 8521 229746 391511
13317C91511b326I8826L9385C0621J43386N9822a13926G9152h6569D1508K65108
$$ 391511 -2326 98826 138211 30621 174007 233829 -113926 79152 -86569 41508 306616
13306C06616A33116k7731J31699J16430A35755c58809A99669N2076k2411p1013
$$ 306616 133116 105385 237084 353514 135755 -358809 199669 251745 229334 158321
13296A58321b16976H2572K18007E7424J58793R9442H7054a36619e424k21240I0928
$$ 158321 -216976 82572 300579 57424 216217 315659 87054 -136619 -5424 -226664 90928
13284A60372l5895J91445K5115j4802A43245o0041e5600j32903G7082Q4591J64194
$$ 160372 124477 315922 341037 326235 143245 83204 -55600 -188503 77082 161673 325867
13273C25867c16183A53044n6987j1413K20903a30684B33868a21934J3978C36610
$$ 325867 -316183 153044 96057 84644 305547 -130684 233868 -121934 -107956 336610
13262A79592n1880A8703b08191A44391M9513L13941B29299I6231K13060D1539
$$ 179592 127712 18703 -208191 144391 193904 507845 229299 96231 309291 41539
13251B94331H8574M5329b5557j79315A83740a23848j70498B55372b1492B84005
$$ 294331 88574 133903 -25557 -204872 183740 -123848 -294346 255372 -21492 284005
13240b36265C28662A5616h4864H0421R5850P2695J69084R5394k10772a12011I7615
$$ -236265 328662 15616 -84864 80421 176271 248966 418050 513444 302672 -112011 97615
13228B02216O5375p0853i2837j06431B05978n1224C3874e2340E7455J01764E4733
$$ 202216 267591 196738 -92837 -199268 205978 154754 33874 -52340 57455 159219 54733
13216a03596k9124L0854A06104g9135l6061c1117A7189i2099M3148C0376e4020
$$ -103596 -132720 -101866 106104 -79135 -115196 -31117 17189 -92099 -48951 30376 -54020
13204H4738f8328A70462B7653M31276b3105m9427B04586a39805b1461A61687f3738
$$ 84738 -68328 170462 27653 458929 -23105 -72532 204586 -139805 -21461 161687 -63738
13192a42943D6683p045j6319M3676J65839l7409E1161b64236N4852I6812l2560
$$ -142943 46683 39638 23319 66995 232834 195425 51161 -264236 -209384 96812 64252
13181F4252M5891K26271E7958i8767B21212A4197e4756D0553b26415A08772i8545
$$ 64252 110143 336414 57958 -98767 221212 14197 -54756 40553 -226415 108772 -98545
13169G7152b40099B43768h247m5136h732B33423m0294e554n5111C00540b22910
$$ 77152 -240099 243768 -8247 -53383 -8732 233423 193129 -5554 -60665 300540 -222910
13157B18850L9480k5093n2516B6307J02850a12044B32774a53428A88757K1416
$$ 218850 258330 233237 180721 26307 129157 -112044 232774 -153428 188757 210173
13147B10173a68066B04459j1834m2271k7260P6675J09047a47210e7371A01708
$$ 210173 -168066 204459 192625 150354 123094 199769 308816 -147210 -57371 101708
13136A83156F2190E426h3397k01432a8991A77321K28361D5051L06665A33388b38446
$$ 183156 62190 5426 -83397 -284829 -18991 177321 405682 45051 351716 133388 -238446
13124c9284B4466M245a26444A10579J45190a63601A01223A4488c09126A69376
$$ -39284 24466 28711 -126444 110579 255769 -163601 101223 14488 -309126 169376
13113D5322b8060A52187A7170d0466o350j41634J8704A97422q4560l2992a56863
$$ 45322 -28060 152187 17170 -40466 -46816 -188450 -169746 197422 112862 79870 -156863
13101C7998a53426G1722M35797a25298q9606G0425J2206L2739J4725c4295G0191
$$ 37998 -153426 71722 507519 -125298 -214904 70425 82631 115370 130095 -34295 70191
13089B70898c9389A85107a37200H2918f939q9838A97239H5735e2124B5783g697
$$ 270898 -39389 185107 -137200 82918 -6939 -96777 197239 85735 -52124 25783 -7697
13077i5311q6226A04474a51982c279A4595c09327A41950C7038K6862J81738b20646
$$ -95311 -181537 104474 -151982 -3279 14595 -309327 141950 37038 63900 245638 -220646
13065A53420b35309A18949j2971a62364P5256B47051f9493I5314a22732D5161
$$ 153420 -235309 118949 105978 -162364 -87108 247051 -69493 95314 -122732 45161
13054b1475j09053E9669f522j45842n2647e8993o2067G0155a83517I685f069B71572
$$ -21475 -130528 59669 -6522 -152364 -205011 -58993 -121060 70155 -183517 9685 -6069 271572
13041A75816h0692A48010J6945N6421F2017J24496o1035a97246B86497i3072C13019
$$ 175816 -80692 148010 164955 221376 62017 186513 125478 -197246 286497 -93072 313019
13029B67049J3728h0010r7825g5136j08696h3161C50535G71J50855J22972j8876
$$ 267049 280777 -80010 -177835 -75136 -183832 -83161 350535 771 151626 274598 255722
13018B55722a63293f0394j23640B66495b08298i4771M2399A53369A9919d7273
$$ 255722 -163293 -60394 -184034 266495 -208298 -94771 -52372 153369 19919 -47273
13007f8418A13531j2599K27444A28476a46025A65497D7382L60020b80994f0487
$$ -68418 113531 100932 328376 128476 -146025 165497 47382 407402 -280994 -60487
12996D08669A63378i3736B48439b6257A35484q981e7219K763D7573d688A22748
$$ 408669 163378 -93736 248439 -26257 135484 126503 -57219 -54456 47573 -4688 122748
12984c42414Q8944A17241r924N119a08161c0486B31439A10766k4737B7702J72451
$$ -342414 -253470 117241 107317 112436 -108161 -30486 231439 110766 86029 27702 200153
12973B00153b35863A30017M1332c57096a02558B04739C1838A1570K67014b76400
$$ 200153 -235863 130017 171349 -357096 -102558 204739 31838 11570 278584 -276400
12962B1479a04987c0718F7092J65626C86R273i6601C8268M742J25647F608e4543
$$ 21479 -104987 -30718 67092 232718 386 9659 -96601 38268 43010 168657 6608 -54543
12949A45180m0004i2817A1948i0296H507Q7920k7186a56676m8101F9043M5855
$$ 145180 105176 -92817 11948 -90296 8507 96427 69241 -156676 -204777 69043 114898
12938A14898E4907O0645b1050r4151H484b09055A21888a30494I2450C5137K75385
$$ 114898 54907 115552 -21050 -115201 8484 -209055 121888 -130494 92450 35137 310522
12927C10522c5466l1748A33448N422e031p7815D3139K35272N9955l2396g2442
$$ 310522 -35466 -67214 133448 138870 -5031 -82846 43139 278411 338366 305970 -72442
12915b7066j52470E9644P1909J24471F4978r977J87619b29164D5160a41937L4529
$$ -27066 -179536 59644 131553 256024 64978 55001 242620 -229164 45160 -141937 -107408
12904a07408F086g9881A23479C7473c82658A81610a00748l4240j93927a62143
$$ -107408 6086 -79881 123479 37473 -382658 181610 -100748 -134988 -328915 -162143
12893A07411b95006d5459I5871J7241a60195A50079J76876h8951B37090a10974
$$ 107411 -295006 -45459 95871 113112 -160195 150079 326955 -88951 237090 -110974
12882C4898J87686b61669A32397g163d94r0390m7171I1137K07086j1845d9677
$$ 34898 222584 -261669 132397 -7163 -494 -90884 -138055 91137 298223 286378 -49677
12870C29181F9169a57658N4183E613a48351k3376c3843F3193a60142e3948C53729
$$ 329181 69169 -157658 -103475 5613 -148351 -171727 -33843 63193 -160142 -53948 353729
12858g8690A92828F6430R0433a95307I9862h5172G687K14638C150K82058A21005
$$ -78690 192828 66430 156863 -195307 99862 -85172 7687 222325 3150 285208 121005
12846F3115h9752D2533c29319J61229c8468j41188c7897F1368K64870j50970n1045
$$ 63115 -89752 42533 -329319 -168090 -38468 -179656 -37897 61368 326238 175268 124223
12835A24223a13767j6339c6765p581D0186I015J59089C4899n59a60001B71697
$$ 124223 -113767 -130106 -36765 -44346 40186 9015 168104 34899 34340 -160001 271697
12823I8269m7172a56452C4047a36416e2624A23848N9268g9194A8549K44440G6429
$$ 98269 51097 -156452 34047 -136416 -52624 123848 183116 -79194 18549 262989 76429
12811B02977a49096B04781G4850e3207B4457i6857j19630C0485P368J17864a6817
$$ 202977 -149096 204781 74850 -53207 24457 -96857 -216487 30485 37853 155717 -16817
12799b04076d874j25259A11282l6511a06005G8159c2404A06793a24291r4043E8100
$$ -204076 -4874 -130133 111282 74771 -106005 78159 -32404 106793 -124291 -218334 58100
12787a50406P4624A85164a38306c9819B23225E6391N1267a97969C64879A820b82340
$$ -150406 -75782 185164 -138306 -39819 223225 56391 107658 -197969 364879 1820 -282340
12775A18886a61186B11105a42248a8462l3732l90011b0283k97540G644Q8871B0533
$$ 118886 -161186 211105 -142248 -18462 -52194 -442205 -20283 -317823 7644 96515 20533
12763E598a30852p2633G372J07745a19888L5601c8367A29300k153k0314l7918
$$ 5598 -130852 -203485 7372 115117 -119888 -84287 -38367 129300 127147 106833 68915
12752F8915h6338j04299A51592k9425H07K85140a17929j01984d3208d798E4620
$$ 68915 -86338 -190637 151592 122167 807 285947 -117929 -219913 -43208 -4798 54620
12740B169i8840r8698A68001o4964a49976A8851N0333a10050A80390E2398O8702
$$ 2169 -98840 -197538 168001 103037 -149976 18851 69184 -110050 180390 52398 121100
12729A21100g15H3003r743a3746I409a43404O1953B60313c6610E53370b22377
$$ 121100 -715 83003 73260 -13746 9409 -143404 -81451 260313 -36610 553370 -222377
12717e5385A8168b9373B9051m842d4882C60K246J38502L0074P129a03833e0952
$$ -55385 18168 -29373 29051 24209 -44882 360 2606 141108 171182 178311 -103833 -50952
12704c5135A18086k1353h3782k070H4521J0283b28530O4673H7930K71789A07811
$$ -35135 118086 96733 -83782 -85852 84521 94804 -228530 -163857 87930 359719 107811
12692A18926b11854L3387A01980b56510a24578B43027a19355B70711H3814J7624
$$ 118926 -211854 -178467 101980 -256510 -124578 243027 -119355 270711 83814 101438
12682A01438e4565G8770l1318a4529n5575r9387C80890A20344q205a57018B53769
$$ 101438 -54565 78770 47452 -14529 -70104 -169491 380890 120344 112139 -157018 253769
12670c01604A87254f645A38414B5075M09160A95066g727G0962B9347J24201h4961
$$ -301604 187254 -6645 138414 25075 434235 195066 -7727 70962 29347 153548 -84961
12658F0255j2628a22825N9503f522A18462J3979k810b32721g1158E0541c27602
$$ 60255 47627 -122825 -63322 -6522 118462 132441 129631 -232721 -71158 50541 -327602
12646I6980j2745i8981A12082d22493C630N6627a10302A18437J88070a17592L1547
$$ 96980 84235 -98981 112082 -422493 3630 60257 -110302 118437 306507 -117592 -86045
12635h6045C0259p621F738a59666A28407a28072B14559a18211E2520Q4449a44595
$$ -86045 30259 22638 6738 -159666 128407 -128072 214559 -118211 52520 136969 -144595
12623B1839c3146p6515d73E2362O1177e4060B10992a15131A12236M0738D6915
$$ 21839 -33146 -109661 -473 52362 113539 -54060 210992 -115131 112236 152974 46915
12611c6618j17052D2573P9661P6289a44442B7872c6764q6054A23782k4115b44855
$$ -36618 -153670 42573 122234 198523 -144442 27872 -36764 -122818 123782 99667 -244855
12599B86250b61783A89666a10583I236b59140A99351J49523A50226i5273d490
$$ 286250 -261783 189666 -110583 9236 -259140 199351 348874 150226 -95273 -4490
12588a77104A62363a00991B41592m2398b72818A9329K29499m4894b19362F9597
$$ -177104 162363 -100991 241592 199194 -272818 19329 248828 203934 -219362 69597
12577f5618B46749A17282g5439j9222A18526e457l40949I8045j6530J08314b04079
$$ -65618 246749 117282 -75439 -94661 118526 -5457 -346406 98045 81515 189829 -204079
12565b9449q2953A35637b33195C5481J2298K7787a93390L3185G5954c95722i7766
$$ -29449 -112402 135637 -233195 35481 47779 75566 -193390 -160205 75954 -395722 -97766
12553h7203A24700f9134m72088A19024n2196i7736A67887J34861d9482B09224
$$ -87203 124700 -69134 -541222 119024 66828 -97736 167887 302748 -49482 209224
12542A01914k2339a8404B31110a14401J4818k8507b3237A33127g6441j7296c2259
$$ 101914 79575 -18404 231110 -114401 -99583 -128090 -23237 133127 -76441 -93737 -32259
12530A65598o2507f584k67828E0437J25280E4121K1700J90577a53381A81332d9008
$$ 165598 103091 -6584 -274412 50437 175717 54121 75821 266398 -153381 181332 -49008
12518C3187Q6909m7392k6001J29882b11066a4020B33976j2109k834a18406A25624
$$ 33187 120096 72704 46703 176585 -211066 -14020 233976 221867 219033 -118406 125624
12506c6923C55549A10565b25159e2071H2793A7398a79871f9170l18419D52431
$$ -36923 355549 110565 -225159 -52071 82793 17398 -179871 -69170 -387589 452431
12495c09143J12170J6229h1565C48476a85781H4725c2309B52210l9493b03507
$$ -309143 -196973 -180744 -81565 348476 -185781 84725 -32309 252210 212717 -203507
12484A91590p3824E2652J87567b98482B31198L766o0002p1081m6320a76738A41317
$$ 191590 117766 52652 240219 -298482 231198 234964 174962 103881 57561 -176738 141317
12472B8443M3447k78P0668O1627d8262B84075n7351a90680I2133J9060A3720M6099
$$ 28443 71890 71612 142280 203907 -48262 284075 226724 -190680 92133 111193 13720 59819
12460E9819J0086g1926A55161a42365a0255H8626m2524M1889a11469b0404k32743
$$ 59819 69905 -71926 155161 -142365 -10255 88626 46102 87991 -111469 -20404 -253147
12449b53147Q9002e1279J933B0538a23136D93377A71214o2532D314K38491m6004
$$ -253147 -164145 -51279 -49346 20538 -123136 493377 171214 108682 4314 242805 196801
12438A96801D5546a27655A6833i5058K6108D0157J22857f951o8707o8571B03629
$$ 196801 45546 -127655 16833 -95058 -68950 40157 163014 -6951 -75658 -144229 203629
12426f7328c2298A56343a17312d3753C8108J16536a14479K2676m1781B76525A1141
$$ -67328 -32298 156343 -117312 -43753 38108 154644 -114479 -91803 -133584 276525 11141
12414d26440A44018i9379L4268E1702J61877E3000e2654A57630a187k55724D7552
$$ -426440 144018 -99379 -65111 51702 213579 53000 -52654 157630 -1187 -256911 47552
12402a00645H3881L60516A38716a16379E5727B2849c7085k78813i0529c7581j37607
$$ -100645 83881 444397 138716 -116379 55727 22849 -37085 -315898 -90529 -37581 -175188
12391a75188D3333M2362j1707j4743a7838A45722a51033B6190a20099j23607A50862
$$ -175188 43333 85695 73988 59245 -17838 145722 -151033 26190 -120099 -243706 150862
12379A24521b57904F7083g5904E2136b9423B32057i5079H9987j4167e2648A29897
$$ 124521 -257904 67083 -75904 52136 -29423 232057 -95079 89987 75820 -52648 129897
12367a36117C5652J97009j7239I164h8903A60529e78060A28931M8243b31208c0778
$$ -136117 35652 232661 215422 9164 -88903 160529 -578060 128931 177174 -231208 -30778
12355A53814c05631B66170b23176C7610K2322e6270C47933a53444C28130j04163
$$ 153814 -305631 266170 -223176 37610 59932 -56270 347933 -153444 328130 223967
12345B23967A02846c0099k37735A03041a79186B22175e2422l45010E2578b9142
$$ 223967 102846 -30099 -267834 103041 -179186 222175 -52422 -397432 52578 -29142
12334e4220A99977b53306A33400K48822A86118b30960B43958A8439a67865C51900
$$ -54220 199977 -253306 133400 382222 186118 -230960 243958 18439 -167865 351900
12323h9357B95885H8015a85433e4100L217a7958D8321f4946j69545b5107l0715
$$ -89357 295885 88015 -185433 -54100 -50883 -17958 48321 -64946 -234491 -25107 -55822
12312e5822j25596L3690j6358I7244b30721A59360R4474G9764J1505c0684k613
$$ -55822 -181418 -147728 -164086 97244 -230721 159360 253834 79764 91269 -30684 -33297
12301c3297k56721f6590J0419B67273m0998G0081J0814i647M443o7987j65134
$$ -33297 -290018 -66590 -56171 267273 226275 70081 80895 -9647 -5204 -73191 -238325
12290b38325D6989c52790F1339A3923c0119j09549B4835h0855A05547c4234D6269
$$ -238325 46989 -352790 61339 13923 -30119 -139668 24835 -80855 105547 -34234 46269
12278H2183J06620C6531P5641J35321Q8999c56722A78053K52027a5131A31981
$$ 82183 188803 36531 112172 247493 336492 -356722 178053 430080 -15131 131981
12267F702J25154c68864A16356b85180b5117A92570b03907D29281a40511B89735
$$ 6702 131856 -368864 116356 -285180 -25117 192570 -203907 429281 -140511 289735
12256h9371r3937m1500C00909C9151M7548j661O5885i3581c8346A55350p2344
$$ -89371 -183308 -224808 300909 39151 86699 85038 150923 -93581 -38346 155350 83006
12245H3006b88234H2453a04069A36811J84959a36389A06531b3413o4145C36920
$$ 83006 -288234 82453 -104069 136811 321770 -136389 106531 -23413 -87558 336920
12234G057K09376I6894h783A20349c1395B45505m3247E1655J44636N8277n1151
$$ 7057 216433 96894 -8783 120349 -31395 245505 202258 51655 196291 254568 203417
12223B03417f416B63473c3673E26855B26852q025r022C2049J89255D3202L44803
$$ 203417 -6416 263473 -33673 526855 226852 218827 209805 32049 221304 43202 388005
12212C88005E1084O8064J30762k0360b25944E8129a7273B06527L55586A1211b29048
$$ 388005 51084 119148 249910 229550 -225944 58129 -17273 206527 562113 11211 -229048
12200B16059P434J2529A10171n1027Q2529F8171J61537b11696A09705O4158a21482
$$ 216059 223493 236022 110171 59144 141673 68171 229708 -211696 109705 173863 -121482
12188C27598a1823A29738j6420b9388H0659K04766j35561J10462o331M6654J36559
$$ 327598 -11823 129738 113318 -29388 80659 285425 149864 260326 253995 300649 437208
12177D37208j97065J04696G8293h7521I6498K50559j57234e1525a5010j07764
$$ 437208 240143 344839 78293 -87521 96498 347057 189823 -51525 -15010 -122774
12167a22774B12696a45057A41740L18823a00788B83970q6111c304B294L39462
$$ -122774 212696 -145057 141740 460563 -100788 283970 197859 -3304 2294 341756
12157C41756A18041a10740A18055c9092E6945K70282B2989K64441a11932A23059
$$ 341756 118041 -110740 118055 -39092 56945 327227 22989 287430 -111932 123059
12146d9521B74438F8151J06939P7702a08870E8103b81492H7917a37045C8245J64850
$$ -49521 274438 68151 175090 252792 -108870 58103 -281492 87917 -137045 38245 203095
12135B03095J16734k1897L0789p0369B2394L77645c18689C3043M53822b5485A02803
$$ 203095 319829 297932 328721 258352 22394 400039 -318689 33043 486865 -25485 102803
12123c8859A14267J32365J1669A3991L92606I7547f5150A87869O6035a79209N6790
$$ -38859 114267 246632 258301 13991 406597 97547 -65150 187869 253904 -179209 -122419
12112a22419j65357A73896a1018C6548O6243N3426J67282l3138h8374o3347f0228
$$ -122419 -287776 173896 -11018 36548 102791 156217 323499 290361 -88374 -151721 -60228
12100h9436J8368b9706A47539P3760j02852C9474b19303I057M07640G828a64665
$$ -89436 -71068 -29706 147539 221299 118447 39474 -219303 9057 416697 7828 -164665
12088A79035c9335j25289A7525d7367I072a95093h8363A75216b00778j5613R6557
$$ 179035 -39335 -164624 17525 -47367 9072 -195093 -88363 175216 -200778 -216391 -119834
12077a19834r7727l2363M7829b8779j67284A31770b08897j7312E3677N7775N1631
$$ -119834 -217561 -249924 -202095 -28779 -196063 131770 -208897 -226209 53677 111452 163083
12066A63083J50168e4445A63945b82075H5053b1941k19666A16112e6470k38025
$$ 163083 313251 -54445 163945 -282075 85053 -21941 -241607 116112 -56470 -294495
12056b94495A87017J8689J00131Q6547G2079A553Q902b21648B61825p005j5847
$$ -294495 187017 205706 305837 392384 72079 1553 10455 -221648 261825 254820 238973
12045B38973F0320J29513a11858d2382A63986b5843A92357h9232k67754A08290
$$ 238973 60320 189833 -111858 -42382 163986 -25843 192357 -89232 -356986 108290
12034a12185j61822B41193j15378M9400F6728a66747j19148A79573a25009J7710
$$ -112185 -274007 241193 125815 175215 66728 -166747 -285895 179573 -125009 -107299
12024a07299j40888A48037a45365j20715A42148j3958f9731a946j96746J1383
$$ -107299 -248187 148037 -145365 -266080 142148 128190 -69731 -1946 -198692 -187309
12014a87309f223k17702C4221N9124a87101I9570a7922l356o2355q680A50832
$$ -187309 -6223 -223925 34221 93345 -187101 99570 -17922 -21278 -83633 -92313 150832
12002h2965J5567m16972D0192b22511b6097k245J4117B281K337a56507A08803
$$ -82965 -67398 -484370 40192 -222511 -26097 -28342 -14225 2281 4618 -156507 108803
11990c62057f2082B04002m1205a1554k56095J08285N8688j58073P8775G2359f0220
$$ -362057 -62082 204002 162797 -11554 -267649 -159364 -100676 -258749 -179974 72359 -60220
11978b66499A46006E022P0184a19985K0633j17465a12n8896l3732o5924K2460
$$ -266499 146006 5022 75206 -119985 -99352 -216817 -112 -59008 -92740 -158664 -136204
11967a36204E6188N9432a84285C13098b84568D6801J5178b43388B70849M0179
$$ -136204 56188 115620 -184285 313098 -284568 46801 61979 -243388 270849 311028
11957C11028d18252A847g3840B01001C0483c1635A5564a84920A63255d57776A56110
$$ 311028 -418252 1847 -73840 201001 30483 -31635 15564 -184920 163255 -457776 156110
11945d2810A74185l6984a03856r4655M4895F7812a48224A15232R368k454j9939
$$ -42810 174185 137201 -103856 -198511 -153616 67812 -148224 115232 124600 122146 102207
11934A02207a19310l8878P6453I2820d12657E7817h6455D4652R753d7962D9513
$$ 102207 -119310 -158188 -81735 92820 -412657 57817 -86455 44652 54405 -47962 49513
11922b8505k26602j2484L3739L4028j3630f0006D40981f6804j01292f548A75308
$$ -28505 -255107 -267591 -233852 -199824 -213454 -60006 440981 -66804 -168096 -6548 175308
11910B2833i3207H4666j4711i9295O388j94712E8020J42652d112B34172j13177
$$ 22833 -93207 84666 69955 -99295 -92907 -287619 58020 200672 -4112 234172 120995
11899A20995a8105j00178A36202a0700k27606A97067b22971r2160a47617A17739
$$ 120995 -18105 -118283 136202 -10700 -238306 197067 -222971 -315131 -147617 117739
11888b19873A45670L6125g3350j28009a2814k38554a09689G9405h098j41994j47409
$$ -219873 145670 181795 -73350 -201359 -12814 -251368 -109689 79405 -8098 -150092 -297501
11877b97501b2749A23790k6166i1853C4326a54119A77235a29318r2389k84744
$$ -297501 -22749 123790 97624 -91853 34326 -154119 177235 -129318 -221707 -506451
11867e06451d4258g949j22474M8498D2843K03402a55715a8516j02303c9947j66039
$$ -506451 -44258 -7949 -130423 -81925 42843 246245 -155715 -18516 -120819 -39947 -205986
11856b05986A31976i7175F5989C1896J33111d5514l39484C029N802J91976L9906
$$ -205986 131976 -97175 65989 31896 165007 -45514 -384998 3029 8831 200807 240713
11845B40713G0103b0249A70157d05932C6939j4899b83704g0724A68802F5572a13496
$$ 240713 70103 -20249 170157 -405932 36939 22040 -283704 -70724 168802 65572 -113496
11833F2791k8940Q9801c2213j7612k3281p4724d6259B01031b33653e5951C620
$$ 62791 33851 123652 -32213 -49825 -73106 -147830 -46259 201031 -233653 -55951 3620
11821B06231F1461a62299A74581B2722L6483b23787e9928o3583i397k6775A39535
$$ 206231 61461 -162299 174581 22722 59205 -223787 -59928 -123511 -9397 -36172 139535
11809a4327A33064a5362E4384B6276g5058R342l9675p1566L5595P627A77211c3664
$$ -14327 133064 -15362 54384 26276 -75058 -65716 -105391 -176957 -141362 -133735 177211 -33664
11796a79449E9590K2016f6262j9077B93782G8506K02018b19662k04775A99562
$$ -179449 59590 81606 -66262 -85339 293782 78506 280524 -219662 -424437 199562
11785B8069J04759f641j82214j57696j4171C6485O157N368a45948E6727A2535
$$ 28069 132828 -6641 -188855 -346551 -360722 36485 42642 48010 -145948 56727 12535
11773C28275H8061O5227l869a54142L7891e3729n133C5677a10165A82854E444
$$ 328275 88061 153288 149419 -154142 -116251 -53729 -58862 35677 -110165 182854 5444
11761a60687n1890J02669k30451A42782i4583p4434N9111A1998b03855B91851
$$ -160687 -212577 -109908 -340359 142782 -94583 -169017 -109906 11998 -203855 291851
11750d85180J92013B97281A669c03217g3877A4084h5581I9453d8196L922l9431
$$ -485180 -293167 297281 1669 -303217 -73877 14084 -85581 99453 -48196 -44274 -83705
11739h3705B8524a94412r2018H1678b62362A01018f6057b3797j17623A07485C0730
$$ -83705 28524 -194412 -286430 81678 -262362 101018 -66057 -23797 -141420 107485 30730
11727A20067a4222k12477c2245E8544b0583E5272k6084K12506l5475f318j56981
$$ 120067 -14222 -226699 -32245 58544 -20583 55272 29188 241694 206219 -6318 -163299
11716a63299A85902o9029b36659I6261c6728j60646j3099F0110c16240k06078
$$ -163299 185902 116873 -236659 96261 -36728 -197374 -210473 60110 -316240 -522318
11706e22318b52813f4171O03K9722A79553B3869J30403D9497a05567C94571a26107
$$ -522318 -252813 -64171 -63568 -33846 179553 23869 154272 49497 -105567 394571 -126107
11694E9357J2089L1178O1783c22917J58161e2608k9527K8565A37336d3962r1746
$$ 59357 71446 102624 164407 -322917 -164756 -52608 -82135 -53570 137336 -43962 -135708
11683a35708L144K3533A49835c3868j98592B95682g9737D3407e9148C1029a3743
$$ -135708 -132564 -109031 149835 -33868 -232460 295682 -79737 43407 -59148 31029 -13743
11671A59333C6652h2512N276b1140A35577l7222D3845c0727F1270B2125a07447
$$ 159333 36652 -82512 -77236 -21140 135577 98355 43845 -30727 61270 22125 -107447
11659A71217n2431f0090j58337G983a87746F2299a40757N1818B4084J47785Q661
$$ 171217 118786 -60090 -218427 7983 -187746 62299 -140757 -88939 24084 171869 180530
11648A80530C91a0958j79853m5520J06396A50958a52351c9580B36437G2808b67161
$$ 180530 391 -10958 -190811 -236331 -129935 150958 -152351 -39580 236437 72808 -267161
11636c35694a08744G2607d35755R7730i6410I2221k4630a18351A02385J25849
$$ -335694 -108744 72607 -435755 -338025 -96410 92221 67591 -118351 102385 228234
11626B28234d5618o0001n5290H1777i3657A02356i4121K6271C41121C1856c73831
$$ 228234 -45618 -105619 -160909 81777 -93657 102356 -94121 -67850 341121 31856 -373831
11614C84624a70603O8134E540J01001g5517j14432P8376L6855j4729j2675A3412
$$ 384624 -170603 -102469 5540 106541 -75517 -189949 -111573 -74718 -89447 -102122 13412
11602D1561e434j66896Q5780D4501b46399e5666j36258N0866a6698A51266m152
$$ 41561 -5434 -172330 -86550 44501 -246399 -55666 -191924 -141058 -16698 151266 147114
11591A47114a43936L8571D3218P1633D239c68k62152k8748A42369b04302l4626
$$ 147114 -143936 -105365 43218 114851 4239 -368 -262520 -291268 142369 -204302 -238928
11580b38928A46448P1215j02870e845A51611b20515B43754c7006G6269a79812
$$ -238928 146448 217663 114793 -5845 151611 -220515 243754 -37006 76269 -179812
11569A64453F0819j9577a12959B1529c18572J06052A33259L0367D0727c05065
$$ 164453 60819 41242 -112959 21529 -318572 -212520 133259 163626 40727 -305065
11558a77106A61911a61699j6993L4691B37110E8499J32929a25920k0905j36502
$$ -177106 161911 -161699 -178692 -144001 237110 58499 191428 -125920 -146825 -283327
11548b83327A74909D9305a85492N6673H465b88387A38596h1939J8035C10289d8609
$$ -283327 174909 49305 -185492 -128819 8465 -288387 138596 -81939 -63904 310289 -48609
11536B79963b13898C7349c0893H6140l8341L75224a6269E2802A775d4905j76798
$$ 279963 -213898 37349 -30893 86140 47799 423023 -16269 52802 1775 -44905 -221703
11525b21703n688J1305B56644G5149b7527r2671m0119h442A37118N6161d5192
$$ -221703 -227391 -216086 256644 75149 -27527 -120198 -160317 -8442 137118 193279 -45192
11513B39271a07427j15138C05580A34865a52616B53785A3956c7690B16350A4736
$$ 239271 -107427 -222565 305580 134865 -152616 253785 13956 -37690 216350 14736
11502E2881M8293J29277a03822B01948C3774Q3136a83341A90110a74542F3923
$$ 52881 101174 230451 -103822 201948 33774 116910 -183341 190110 -174542 63923
11491A74800B6192O5389f1083A69515F4215K19448A6878L6810b56391f2802B40636
$$ 174800 26192 91581 -61083 169515 64215 283663 16878 53688 -256391 -62802 240636
11479e1923C4088K15700b46639c7003C11291A53470f4169F6396c42547e7420k7257
$$ -51923 34088 249788 -246639 -37003 311291 153470 -64169 66396 -342547 -57420 -84677
11468h4677D2508J06196C9406J84986A5664L4127L111J65297j7173g5143D7490
$$ -84677 42508 148704 39406 224392 15664 49791 52902 218199 201026 -75143 47490
11456B9086b80374C13148e097A35527o3756A7667A480K56068c6966D7992K46230
$$ 29086 -280374 313148 -5097 135527 71771 17667 1480 257548 -36966 47992 294222
11445B94222h5471j0131j46851N5004B16505F1519O9123i2595M3389J8550j41198
$$ 294222 -85471 -95602 -242453 -187449 216505 61519 130642 -92595 -49206 -30656 -171854
11434a71854A81123f0764j01412A51231d3269k56167E348J09464N0788P6502n9502
$$ -171854 181123 -60764 -162176 151231 -43269 -299436 5348 114812 165600 242102 182600
11423A82600f128q4521f251A33340Q5795A957J83165j3422m5232J64429A43150
$$ 182600 -6128 -90649 -6251 133340 219135 1957 185122 171700 126468 290897 143150
11411B05896b3930A9192R973K68362a62426f0711a0149j00169E2514K6336b12367
$$ 205896 -23930 19192 29165 297527 -162426 -60711 -10149 -110318 52514 78850 -212367
11399d4839j54023g4349j8207A89060f0387q3136k12534A09081e5465A25854h1854
$$ -44839 -198862 -74349 -92556 189060 -60387 -143523 -356057 109081 -55465 125854 -81854
11387c0982g807k1838b894k61901a5758E2007a42411q9486h7073B16953P7145
$$ -30982 -7807 -29645 -2894 -264795 -15758 52007 -142411 -231897 -87073 216953 294098
11376B94098g6344D02598e4618B26147D9621a75108H9883i2354I6630b33817G9933
$$ 294098 -76344 402598 -54618 226147 49621 -175108 89883 -92354 96630 -233817 79933
11364A88850a27978B3344L24312b12702B06238j2463c49237b5189l40073j5635
$$ 188850 -127978 23344 347656 -212702 206238 193775 -349237 -25189 -365262 -380897
11354c80897e7850B61068d7614l787I2209i7574b0007n8340A30972c14944D5440
$$ -380897 -57850 261068 -47614 -51401 92209 -97574 -20007 -78347 130972 -314944 45440
11342a52874E1124e9083K3645A62910a19535a1872j08383n50924c02652j48375
$$ -152874 51124 -59083 -35438 162910 -119535 -11872 -120255 -671179 -302652 -451027
11332d51027H3167j5889J87815a55821L9667b0129j19446A4902H77b7687b256
$$ -451027 83167 67278 255093 -155821 -116154 -20129 -139575 14902 877 -27687 -2256
11320a91770A64601G224b91508h7972A92078a17633J470j14252i5644B82854a47686
$$ -191770 164601 7224 -291508 -87972 192078 -117633 -116163 -230415 -95644 282854 -147686
11308a94130b6989B00331b07064B83464b10685A04078J3371J27483l9681L3865
$$ -194130 -26989 200331 -207064 283464 -210685 104078 117449 244932 205251 239116
11298B39116D0981a33695B49787j06236g2000G5618g6699o2586l90043D8926b00148
$$ 239116 40981 -133695 249787 143551 -72000 75618 -76699 -139285 -529328 48926 -200148
11286d80360F2162m771K1525a12642A44761r201d24065d8995D4618L6722J13710
$$ -480360 62162 57391 78916 -112642 144761 135560 -424065 -48995 44618 81340 195050
11275A95050a86760e398D9436d14272J90913A03602c0781J0379q1005E0933n620
$$ 195050 -186760 -5398 49436 -414272 -223359 103602 -30781 -20402 -101407 50933 45313
11264D5313g172A39750F4737O5561j6987j2116K5432M0402a65346A1541O0584
$$ 45313 -7172 139750 64737 130298 113311 101195 126627 167029 -165346 11541 72125
11253G2125b00670M0095C144a5274H6395a9414j51386A18395c44988i5680B66932
$$ 72125 -200670 -160575 3144 -15274 86395 -19414 -170800 118395 -344988 -95680 266932
11241B4948a36765a1141j38524M8864A01344K4995f2232l47929E4431c73935h8371
$$ 24948 -136765 -11141 -149665 -100801 101344 126339 -62232 -410161 54431 -373935 -88371
11229B42341D8277b40757O7547k9453M5885l9155l1853a4558q4837A7405f0347
$$ 242341 48277 -240757 -173210 -202663 -156778 -195933 -227786 -14558 -99395 17405 -60347
11217a78611f8570L3583D5341a32932b0589G3671B1642J12906h4891j89927B24495
$$ -178611 -68570 -34987 45341 -132932 -20589 73671 21642 134548 -84891 -274818 224495
11205C38612b29999k18407l0720A18680J7286a8247l1565j03209P4495A72744
$$ 338612 -229999 -448406 -479126 118680 135966 -18247 -49812 -153021 -78526 172744
11194a61321P2216B7255f306A56021c08018e6971B471a36555c513H8940J62159
$$ -161321 -89105 27255 -6306 156021 -308018 -56971 2471 -136555 -3513 88940 251099
11183B51099A1818b44976j6729O0633A54450b12838f2849j30643A55165a68604
$$ 251099 11818 -244976 -261705 -201072 154450 -212838 -62849 -193492 155165 -168604
11172a64795k15567B51643a77682D20040i5750I8348b44699B08098g9962H253
$$ -164795 -380362 251643 -177682 420040 -95750 98348 -244699 208098 -79962 8253
11161a06727N054A12762a25263e1409B36794M3434B4305J7049a47636f0262a5445
$$ -106727 -101673 112762 -125263 -51409 236794 280228 24305 41354 -147636 -60262 -15445
11149a74944b3512C3693g0865A06930c5135J3331N716A13317e9829A9985K82202
$$ -174944 -23512 33693 -70865 106930 -35135 -21804 -16088 113317 -59829 19985 302187
11138C02187c461A96065a83970n012C7324d0565j92375e0646G6723h0719B55796
$$ 302187 -3461 196065 -183970 -188982 37324 -40565 -232940 -50646 76723 -80719 255796
11126i0162A82624H4796e1406D7519a61706K1947j241N128A92356A9851L22968
$$ -90162 182624 84796 -51406 47519 -161706 -139759 -141000 -135872 192356 19851 342819
11115C42819a82110A48315b28357f0892k71775F3828K02555b2844B60265b18609
$$ 342819 -182110 148315 -228357 -60892 -332667 63828 266383 -22844 260265 -218609
11104e3407l9779b5375j5047H8359a1589D9829k3237F979a48399j23197h7684
$$ -53407 -93186 -25375 -40422 88359 -11589 49829 26592 6979 -148399 -271596 -87684
11092C9030M1235K1278L8031b19970H0870d6497a4022f225k9322A84100c3357
$$ 39030 80265 101543 139574 -219970 80870 -46497 -14022 -6225 -35547 184100 -33357
11080a61085L9530A13832K26405D9067M4592c1303A7018K92123B4496b2098B87982
$$ -161085 -121555 113832 340237 49067 93659 -31303 17018 309141 24496 -22098 287982
11068H9814o690L5567k4264g5654B23295F3392h3209B50892J18540L2609L03482
$$ 89814 83124 118691 94427 -75654 223295 63392 -83209 250892 369432 402041 705523
11057G05523l20357P9911I8598J23898M46860A71913K67179C6670L13204D9462
$$ 705523 385166 465077 98598 222496 669356 171913 439092 36670 349874 49462
11046C47041j24565M55137j39286j39892J16821j73856n5386J49082j44876J58699
$$ 347041 222476 677613 538327 398435 515256 341400 286014 435096 290220 448919
11036D48919J945N1262Q9985j2176B73458M42508k21057J21207j73570A16448
$$ 448919 450864 502126 592111 579935 273458 715966 494909 616116 442546 116448
11025C34782A65958K45514P6904M2905p6114l6749A19888M98052B89483K39964
$$ 334782 165958 411472 488376 531281 455167 418418 119888 617940 289483 529447
11015E29447J94111C59127R1419j65533o9718l8022J77527L8894r6514J99788
$$ 529447 723558 359127 450546 285013 215295 177273 354800 393694 297180 496968
11005D96968j42155P351G0361C0116M64392j50839K01215A43736E7240N45858
$$ 496968 354813 362164 70361 30116 494508 343669 544884 143736 57240 603098
10995F03098A75061m9526M77508j17637k16184M01651A61479K03959j18578M3880
$$ 603098 175061 125535 603043 485406 269222 670873 161479 365438 246860 290740
10985B90740J80074o0509j20745J32473J85148P9127l01930M9244J9583K11484
$$ 290740 470814 410305 289560 422033 607181 686308 384378 433622 453205 664689
10975F64689K78025j74049j60638K63937j14044R9500K66513R4003J97973K02756
$$ 664689 942714 768665 608027 871964 757920 857420 1123933 1217936 1415909 1618665
10965A618665r0458q2573N32508j16750l4783J03313m50455k93111J7956k38082
$$ 1618665 1528207 1445634 1978142 1861392 1826609 1929922 1479467 1186356 1204312 966230
10955I66230j21819j81964R4439q5121o1963K4769m5567K4604j84349J6R1559
$$ 966230 844411 662447 756886 671765 609802 634571 589004 613608 429259 429275 520834
10944E20834k29272O9182A75266k6960a43365B07940J64506L3555j55424j7081
$$ 520834 291562 360744 175266 148306 -143365 207940 372446 406001 250577 233496
10934B33496a24098m8654a411j11188M8181A79303E9940E840J32188a56937e598
$$ 233496 -124098 -172752 -1411 -112599 -64418 179303 59940 5840 138028 -156937 -5598
10922f2208F5491J08961a06246D6438b2624A31977E1870e4780q5629e6975j5732
$$ -62208 65491 174452 -106246 46438 -22624 131977 51870 -54780 -140409 -56975 -72707
10911g2707l18124J18062R4460A5007J40437a94326j46383A91196a37004j53165
$$ -72707 -390831 -272769 -178309 15007 155444 -194326 -340709 191196 -137004 -290169
10901b90169O7230d0657Q302D5403b62806i7817B38765a13188C0303M6760J08068
$$ -290169 -222939 -40657 -32355 45403 -262806 -97817 238765 -113188 30303 77063 185131
10890A85131a45037M5831E4444i974B14620A02345b83926B73699I0403a52200
$$ 185131 -145037 -99206 54444 -9974 214620 102345 -283926 273699 90403 -152200
10879d6398m19859B9065L0834a07487k0934o4153E5481J36518C3953a38121E5136
$$ -46398 -466257 29065 59899 -107487 -128421 -192574 55481 191999 33953 -138121 55136
10867A45652k9220i6243J726j91063J20377B21833c49958a39974l0246j79720
$$ 145652 116432 -96243 -94517 -285580 -165203 221833 -349958 -139974 -170220 -349940
10857c49940C4173c52486a08859A6081a03379l18738a31218B86401h7627I7345
$$ -349940 34173 -352486 -108859 16081 -103379 -422117 -131218 286401 -87627 97345
10846i5885g265B71673b5206A73970a67239O6991j2161H1045J5959P6335g3480
$$ -95885 -7265 271673 -25206 173970 -167239 -100248 -112409 81045 97004 173339 -73480
10834h3322m41009A35120H225a1159A19440K39045c7379B05641J17978G2086d800
$$ -83322 -524331 135120 8225 -11159 119440 358485 -37379 205641 323619 72086 -4800
10822F7327c06908B2325a94250C58210c03818A01436a0406l39568A5304e9155
$$ 67327 -306908 22325 -194250 358210 -303818 101436 -10406 -349974 15304 -59155
10811a33127I396L6551J11593a923j37184A1096J5442K9943c48424e5235j9160
$$ -133127 9396 45947 157540 -1923 -139107 11096 26538 56481 -348424 -55235 -74395
10800g4395A70539e6897A10524j1729O5877d40322f8576B0403b8890B66730F7868
$$ -74395 170539 -56897 110524 98795 164672 -440322 -68576 20403 -28890 266730 67868
10788B34511a64183g9727j10337B80950F0206c41106A60749E5595J36673g5961
$$ 234511 -164183 -79727 -190064 280950 60206 -341106 160749 55595 192268 -75961
10777a18983A52855e9865j96422n7266E197e2166K1154B47268A2318b53568R0236
$$ -118983 152855 -59865 -256287 -313553 5197 -52166 -31012 247268 12318 -253568 -163332
10766a63332f9351H845c48562J13757E4772J36624i9800B1047e7363m48232H9265
$$ -163332 -69351 8845 -348562 -234805 54772 191396 -99800 21047 -57363 -505595 89265
10754a8269A92605e0553j80060H8313c93323A57226E6328b90201k57069K55941
$$ -18269 192605 -50553 -230613 88313 -393323 157226 56328 -290201 -547270 -291329
10744b91329A01732a85827l7131g2701L392m465A33090b97566A45545a35010F3959
$$ -291329 101732 -185827 -222958 -72701 -69309 -73774 133090 -297566 145545 -135010 63959
10732b89522R7838C3717c4673j37329A15824b26298B8158a39535A09108a33174
$$ -289522 -191684 33717 -34673 -172002 115824 -226298 28158 -139535 109108 -133174
10721A18613B9454d03459P1875a06838j89968a4455A51821O3207E1748K668P5712
$$ 118613 29454 -403459 -331584 -106838 -296806 -14455 151821 215028 51748 54416 130128
10710A30128e1137J4883j8986A35193c61905b3901j64258h9028l14229a01945
$$ 130128 -51137 -36254 -55240 135193 -361905 -23901 -188159 -89028 -403257 -101945
10699b33921Q8016J1451d7688B31378b3159j50170N4740F37805e815D7707a87638
$$ -233921 -145905 -134454 -47688 231378 -23159 -173329 -118589 637805 -5815 47707 -187638
10687d30434F4285h417j74654H4633c06097J2017i6904O119L9056k13761Q6548
$$ -430434 64285 -8417 -183071 84633 -306097 -294080 -96904 -90785 -51729 -265490 -178942
10676a78942j76702R9728a7913C216K22064a07805F4291A4280i4382j18808N1699
$$ -178942 -355644 -255916 -17913 3216 225280 -107805 64291 14280 -94382 -213190 -161491
10665a61491j4519g3818l5741I2759J60954f1290D2949N7771a43463G0897O2020
$$ -161491 -176010 -73818 -109559 92759 253713 -61290 42949 100720 -143463 70897 132917
10654A32917O9674a6813B53704d25327D5351b14480J03798j62879f176j1792k67671
$$ 132917 202591 -16813 253704 -425327 45351 -214480 -110682 -273561 -6176 -17968 -285639
10643b85639e0145A18708k4201h8307j13184b3708F736c1538j9936k06082a18509
$$ -285639 -50145 118708 94507 -88307 -201491 -23708 6736 -31538 -51474 -257556 -118509
10631i6588A43410b10182M2594G5033J2396a14400d0200j06579k26612d2339l0745
$$ -96588 143410 -210182 -167588 75033 87429 -114400 -40200 -146779 -373391 -42339 -73084
10620g3084c3279j33525j02965g1591r1013n6797l2640J11317c9909A24639E2949
$$ -73084 -33279 -166804 -269769 -71591 -162604 -219401 -252041 -140724 -39909 124639 52949
10608B94923a47157C68797d88481b17161M4853e0330A09985a25484F9210a34372
$$ 294923 -147157 368797 -488481 -217161 -172308 -50330 109985 -125484 69210 -134372
10597a93638E1829f5697a7692k05722I5322D6538g4793p7406B00710e1666j77226
$$ -193638 51829 -65697 -17692 -223414 95322 46538 -74793 -152199 200710 -51666 -228892
10586b28892a10896j29316A37441b63340J13779j75096G391a59596j68174h7741
$$ -228892 -110896 -240212 137441 -263340 -149561 -324657 7391 -159596 -327770 -87741
10575c6265k3216B26491A8803L056a4794j8889n1871q0204q8110A03946h9924
$$ -36265 -59481 226491 18803 21859 -14794 -33683 -85554 -165758 -253868 103946 -89924
10563A61262a23119e4584B286J08435d15597I2863j0246N6327e3859F3522k3320
$$ 161262 -123119 -54584 2286 110721 -415597 92863 82617 138944 -53859 63522 40202
10552D0202b1625B8820f2548F1133c2516B03634a30696B55067a46724E8768J30584
$$ 40202 -21625 28820 -62548 61133 -32516 203634 -130696 255067 -146724 58768 189352
10541A89352B5120J47907a44716a2567D147M3996J64643c17455R5437k51307b00598
$$ 189352 25120 173027 -144716 -12567 4147 48143 212786 -317455 -222018 -473325 -200598
10529g940A95931a96340K5324j72649B94156o0012a69118k25057m8139R2845b8653
$$ -7940 195931 -196340 -171016 -343665 294156 234144 -169118 -394175 -442314 -349469 -28653
10517a16005A05425g068A10205e7970k969B9047K1442j2331K61024b34889A12156
$$ -116005 105425 -7068 110205 -57970 -60939 29047 50489 38158 299182 -234889 112156
10505b25305J4412j30145a13098N4995E0766b45621r4099A31121k5315R0213e8325
$$ -225305 -210893 -341038 -113098 -58103 50766 -245621 -339720 131121 105806 196019 -58325
10493h0540A0785a61492A34627c81382D7590a02275l3078j13873J2844D4790A1279
$$ -80540 10785 -161492 134627 -381382 47590 -102275 -135353 -249226 -236382 44790 11279
10481b58617J0932H018P8087a87367d7082o4450j17734A78651F6194k4044b05322
$$ -258617 -247685 8018 86105 -187367 -47082 -111532 -229266 178651 66194 42150 -205322
10469B29069d7739l2190B06156G4643a34438D9016h3202E2926P5735Q0468a67885
$$ 229069 -47739 -79929 206156 74643 -134438 49016 -83202 52926 128661 209129 -167885
10457c68110a55994e0987B77852e2092o0782A68932n3559a91118A8330d0424C0522
$$ -368110 -155994 -50987 277852 -52092 -112874 168932 115373 -191118 18330 -40424 30522
10445b27628i8041k86940A13386A7660J08826k2999b1710m1865I149J22135a97456
$$ -227628 -98041 -384981 113386 17660 126486 103487 -21710 -63575 9149 131284 -197456
10433f2341b8726C90129F8981e109A76365a3015I7053N9153h8720B0268a8055
$$ -62341 -28726 390129 68981 -5109 176365 -13015 97053 156206 -88720 20268 -18055
10421A94992e8040p3081N2923J8641j26168j5799b557A97628I3718j7272c64272
$$ 194992 -58040 -131121 -78198 -59557 -185725 -201524 -2557 197628 93718 76446 -364272
10409A03093m5805a13801d3266E1171b42861A6502h9189m7568q4802A79312a77258
$$ 103093 57288 -113801 -43266 51171 -242861 16502 -89189 -136757 -221559 179312 -177258
10397A64512F6420b53032A7400a58785P5644A36240b68794a4859p5308B91918
$$ 164512 66420 -253032 17400 -158785 -83141 136240 -268794 -14859 -90167 291918
10386h7708n2724o9760E9928J28126m8773d0201j46624g7789E64009f8830A19109
$$ -87708 -140432 -210192 59928 188054 139281 -40201 -186825 -77789 564009 -68830 119109
10374i6213C06393I9140M6414K8596a9406A45142o2240L5519f4899C0089L34015
$$ -96213 306393 99140 145554 174150 -19406 145142 82902 118421 -64899 30089 364104
10363C64104j58068O2458L10680E4247J30777L87985a06116A86048n7163b32325
$$ 364104 206036 268494 579174 54247 185024 573009 -106116 186048 128885 -232325
10352A09904B1500a01065B48674I4575K61022P5273A83124M47292r6951j83439
$$ 109904 21500 -101065 248674 94575 355597 430870 183124 630416 533465 350026
10342C50026D15J27421A3687a3727A46791O7161j3269J40605f594C44194f0705
$$ 350026 415 127836 13687 -13727 146791 213952 200683 341288 -6594 344194 -60705
10330B04357f2283C5839K71217G907f8846B18233F4143j5218L04124c0041B82219
$$ 204357 -62283 35839 307056 7907 -68846 218233 64143 48925 353049 -30041 282219
10318A07549o099J7564c5840A27205M8901a01517p6853j5648j3830B36184a45689
$$ 107549 101450 119014 -35840 127205 176106 -101517 -178370 -194018 -207848 236184 -145689
10306a66361H3639Q7468c20245f8191J0602C9415e8286H4227a2507A38134k8262
$$ -166361 83639 171107 -320245 -68191 -57589 39415 -58286 84227 -12507 138134 109872
10295A09872K1880A2301M1448L0559g4928l81793A0533a40436f2226q9116j62605
$$ 109872 131752 12301 53749 84308 -74928 -456721 10533 -140436 -62226 -151342 -313947
10284c13947M525K0514a42610M0480a132j4470j00672N1851j16383g347l79386
$$ -313947 -309422 -288908 -142610 -102130 -1132 -15602 -116274 -64423 -180806 -7347 -386733
10273c86733c4343j3931B8480a32421A27139g231p8528A87892k4552e0814j4821
$$ -386733 -34343 -48274 28480 -132421 127139 -7231 -85759 187892 163340 -50814 -65635
10262f5635B58425a59562O9195B64520F9779H581b88690e7425A55151c7720E0334
$$ -65635 258425 -159562 -90367 264520 69779 8581 -288690 -57425 155151 -37720 50334
10250C5721O283N4279K6791K45272B1439Q2606C1959a77633n7066R7381B31110
$$ 35721 42004 96283 123074 368346 21439 104045 31959 -177633 -234699 -137318 231110
10238B28315c51902a61513m1997j08708A94698e1018A8154i0618o6237l0482C557
$$ 228315 -351902 -161513 -203510 -312218 194698 -51018 18154 -90618 -156855 -187337 3557
10226C14519e8130K7506o6683A2626J15086A3317c64448C1732b53234B66885a0680
$$ 314519 -58130 -30624 -97307 12626 127712 13317 -364448 31732 -253234 266885 -10680
10214a71516a8985G0207B822b35529D3878Q8248Q1636r2629a51095q31B9521Q440
$$ -171516 -18985 70207 2822 -235529 43878 132126 213762 121133 -151095 -151926 29521 37961
10202C7961i1650H3679j5232J7004a90262L5114B72667c02247e2417l29207c4879
$$ 37961 -91650 83679 68447 85451 -190262 -155148 272667 -302247 -52417 -381624 -34879
10190I6874b8526j12484r0519B12824o4938o2473A1718i64A26704a9505E2979
$$ 96874 -28526 -141010 -231529 212824 147886 85413 11718 -964 126704 -19505 52979
10178d2415J8400r7594a6013l07855B1345J89741B5386d57527A01402a07246k8582
$$ -42415 -24015 -121609 -16013 -323868 21345 211086 25386 -457527 101402 -107246 -135828
10167a35828I864c67520a30692B4910b05376a01813p1106r0072E2809A2706b6616
$$ -135828 9864 -367520 -130692 24910 -205376 -101813 -172919 -262991 52809 12706 -26616
10155c1448A10511c30465d446A35798b43516Q4913E7819a3567I8326f0133B59487
$$ -31448 110511 -330465 -4446 135798 -243516 -158603 57819 -13567 98326 -60133 259487
10143b6405q0957n8716N6134j69276R7728j09094B18907b0977j19443f4550J5372
$$ -26405 -107362 -166078 -109944 -279220 -181492 -290586 218907 -20977 -140420 -64550 -49178
10132d9178J4155m6629k56732f3575A17175m7320a62997n884j62371B06376a16765
$$ -49178 -35023 -81652 -338384 -63575 117175 69855 -162997 -168881 -331252 206376 -116765
10120c05434a39803O6239m174B22456C8746e0087n16439g8241j45175B59771I4114
$$ -305434 -139803 -73564 -77738 222456 38746 -50087 -566526 -78241 -223416 259771 94114
10108d37D5551a04836A1608J4805a1967B05923E8411J27921l2991F1179d2014
$$ -437 45551 -104836 11608 26413 -11967 205923 58411 186332 153341 61179 -42014
10096C7156a45220H2932a7825r8207E1138R4278l4365J54349o3491e1429A270
$$ 37156 -145220 82932 -17825 -116032 51138 145416 111051 265400 201909 -51429 1270
10084d8676a1195A19147a84899Q2306l44345a67623K0436o8736j40122A95976
$$ -48676 -11195 119147 -184899 -102593 -446938 -167623 -147187 -215923 -356045 195976
10073G1379M84363A80641e3304D1174h2572n9441h415k9820E0286c21732B8700
$$ 71379 555742 180641 -53304 41174 -82572 -142013 -8415 -38235 50286 -321732 28700
10061b1579B18118a93418A04922a22925J2578k20503D5454b0381j79055P7369
$$ -21579 218118 -193418 104922 -122925 -110347 -330850 45454 -20381 -199436 -122067
10051a22067A80588k3791a27844K489A4590F66d0611I5054a48256q967A90915
$$ -122067 180588 156797 -127844 -125355 14590 666 -40611 95054 -148256 -157223 190915
10039c92975A37410n15b58599J24115A24342F408a42903q1085B00331i6904A99455
$$ -392975 137410 136895 -258599 -134484 124342 6408 -142903 -223988 200331 -96904 199455
10027A6361P8836m4927i4121d2584p8565A09467d4770k28007n2988C92589A66509
$$ 16361 95197 50270 -94121 -42584 -121149 109467 -44770 -272777 -325765 392589 166509
10015b4228D2550e849j13368k06337H6646A9468N0367J21813l9829b7946j66441
$$ -24228 42550 -5849 -119217 -325554 86646 19468 69835 191648 151819 -27946 -194387
10004a94387c3702q1580K4774a1436G7027B3020K27167a82740j11088B3266K5027
$$ -194387 -33702 -115282 -90508 -11436 77027 23020 250187 -182740 -293828 23266 48293
9993D8293L76002b23929n0648m231B96734b36084f1224r2997A73257a58840b3304
$$ 48293 424295 -223929 -274577 -278808 296734 -236084 -61224 -154221 173257 -158840 -23304
9981d0309q7114E4012a79372O2253N871l05840a35498M0404E6968K2301f7275
$$ -40309 -127423 54012 -179372 -117119 -111248 -417088 -135498 -95094 56968 79269 -67275
9969A66392a34911m3452G0935a4857k4983q200j35617p6592J22663l5846q7446
$$ 166392 -134911 -178363 70935 -14857 -39840 -48040 -183657 -260249 -137586 -173432 -260878
9958b60878C2457g8676o3059I2824a37972f5007j79844L3144h2030B96674a00382
$$ -260878 32457 -78676 -141735 92824 -137972 -65007 -244851 -211707 -82030 296674 -100382
9946b33554j15529j94350a35814A97521O6637A24749m7097a55730r3169O4455
$$ -233554 -349083 -543433 -135814 197521 264158 124749 77652 -155730 -248899 -184444
9936a84444a7466h510r6530p731l4490A04578b5341l51200a51426A76151O7902
$$ -184444 -17466 -8510 -105040 -112771 -147261 104578 -25341 -376541 -151426 176151 244053
9925B44053c2226A51884a70378C563a50397F3629i8872b939D3398O4149a78933
$$ 244053 -32226 151884 -170378 3563 -150397 63629 -98872 -2939 43398 107547 -178933
9913e5640A62036a18454A0883J03532a25174j50j27177A05819j7928R912h9881
$$ -55640 162036 -118454 10883 114415 -125174 -125324 -252501 105819 87891 97803 -89881
9901a46344o6310h6252H5062g40r1824L1315A31353i0810l7932A97228g3592l5939
$$ -146344 -212654 -86252 85062 -740 -92564 -61249 131353 -90810 -128742 197228 -73592 -109531
9889a09531K8070A35108a96704i1830k827j09386H0300k9256e5956k83784a4605
$$ -109531 -81461 135108 -196704 -91830 -94657 -204043 80300 51044 -55956 -339740 -14605
9877e5257l02364J53458q398q0534G4465Q2154f2442B50878I8219b43151a18364
$$ -55257 -357621 -204163 -212561 -293095 74465 156619 -62442 250878 98219 -243151 -118364
9865B7118M8776a4846A29135b81289B5634f3109j91164J25919d7232j92243B58290
$$ 27118 75894 -14846 129135 -281289 25634 -63109 -254273 -128354 -47232 -239475 258290
9853C2182i5700L7195C7200H52a79892m4302b4062H9017g28A70376b86956J32518
$$ 32182 -95700 -58505 37200 852 -179892 -224194 -24062 89017 -728 170376 -286956 -154438
9841a54438l3979j87437B4835d5969C165N9089J39869b82846K2734c9004G3633
$$ -154438 -188417 -375854 24835 -45969 3165 62254 202123 -282846 -260112 -39004 73633
9829c64132d3005k9257F2J0436M0092b59844I5334j8952J58010a72363m17521
$$ -364132 -43005 -72262 62 10498 50590 -259844 95334 76382 234392 -172363 -589884
9818e89884B00511a50088i634A0815a55683P1585l43915B67786E710d0810q4108
$$ -589884 200511 -150088 -9634 10815 -155683 -84098 -428013 267786 5710 -40810 -124918
9807a24918C38838f1218A68913m6531c3336l08542a64661m4127N6477q7971h1317
$$ -124918 338838 -61218 168913 122382 -33336 -341878 -164661 -208788 -152311 -240282 -81317
9795G5431R7439c79l7064l22133h4267K7525k82399C8290N9530l9887Q1995P1169
$$ 75431 172870 -379 -37443 -359576 -84267 -56742 -339141 38290 97820 57933 139928 211097
9783B11097E1550i9017l5657B38336c1190a0115j92244l0413b7270C6135b27891
$$ 211097 51550 -99017 -134674 238336 -31190 -10115 -202359 -232772 -27270 36135 -227891
9771B7224J66184e05922K40100Q5146B8196L42997A09099b18429H1763a5384r8959
$$ 27224 193408 -505922 -265822 -180676 28196 371193 109099 -218429 81763 -15384 -114343
9760a14343H8220c5754n2004o1109B80664j21054L567l4822a17613e6137I4532
$$ -114343 88220 -35754 -87758 -148867 280664 159610 163177 128355 -117613 -56137 94532
9748B1773g9230p3319b2130n3261j67184P9666b8851h275k50521N7338B87255
$$ 21773 -79230 -152549 -22130 -75391 -242575 -162909 -28851 -8275 -258796 -201458 287255
9736b02134i6054p4321l5082G4064A3864J64695G6683M6449B8109b98968A85657
$$ -202134 -96054 -170375 -205457 74064 13864 178559 76683 123132 28109 -298968 185657
9724A01810B0914a1930m48858b28944B0802h8104D4009a55186j55606M9718H5673
$$ 101810 20914 -11930 -460788 -228944 20802 -88104 44009 -155186 -310792 -261074 85673
9712a00972H1602P1156p5035b83482J40823o6472A12720a35493B79130b47321
$$ -100972 81602 152758 77723 -283482 -142659 -209131 112720 -135493 279130 -247321
9701A05777k8883K2218f4839K7424q5443j03243J10708j93550I8125J6224R494
$$ 105777 76894 99112 -64839 -37415 -122858 -226101 -115393 -308943 98125 114349 123843
9690A23843b58499F7030a14367e0273j25711j63674a62284B48498b12408A03003
$$ 123843 -258499 67030 -114367 -50273 -175984 -339658 -162284 248498 -212408 103003
9679a97337P5797F9392b51547C2603a00989E7942f7658j09935e5623k06235K7007
$$ -197337 -121540 69392 -251547 32603 -100989 57942 -67658 -177593 -55623 -261858 -234851
9668b34851K8838F864a69497g7331G3482J69509q2160a31279a2156k64381O6020
$$ -234851 -206013 6864 -169497 -77331 73482 242991 160831 -131279 -12156 -276537 -210517
9657b10517b9512j04831f1432l53596j71743a50613b2021B59335b09382j32256
$$ -210517 -29512 -134343 -61432 -415028 -586771 -150613 -22021 259335 -209382 -341638
9647c41638A01884D6185a45933M3730k9584b6605k61835b0438l9921k4918D4751
$$ -341638 101884 46185 -145933 -102203 -131787 -26605 -288440 -20438 -60359 -85277 44751
9635g1434C2547b53158A47810J80530a51130B2385N6199a06588l6191j55142L6823
$$ -71434 32547 -253158 147810 328340 -151130 22385 78584 -106588 -142779 -297921 -261098
9624b61098J13057m2586A04318a45320j1142C0814M4981J43118I5611b8638j0910
$$ -261098 -148041 -190627 104318 -145320 -156462 30814 75795 218913 95611 -28638 -39548
9613c9548j15719l5596C7754L60464a50914L7222J24I8461B6209J5212J9172A5588
$$ -39548 -155267 -190863 37754 398218 -150914 -113692 -113568 98461 26209 41421 60593 15588
9600a55630k5520I4553L0497a9111j49358G8313b048G7805a23365C8712M6221
$$ -155630 -181150 94553 125050 -19111 -168469 78313 -2048 77805 -123365 38712 84933
9589H4933J02473j893a83732A35569d7657l60094c9085A53916A7035a68879A78518
$$ 84933 187406 185513 -183732 135569 -47657 -407751 -39085 153916 17035 -168879 178518
9577h1951r4498g4015K5134A34611i8146B50446G6371a65644H5512f723E3530
$$ -81951 -176449 -74015 -48881 134611 -98146 250446 76371 -165644 85512 -6723 53530
9565C8151J02723e2845k11938k26808i8827E438K39516f13641f9125c2824A66648
$$ 38151 140874 -52845 -264783 -491591 -98827 5438 244954 -613641 -69125 -32824 166648
9553a52144H0666a05983j0578A29550E5701c78499a83051A58132a80354H4460
$$ -152144 80666 -105983 -116561 129550 55701 -378499 -183051 158132 -180354 84460
9542d1380A16881a76468B98782n4774p0395G0947c52689c1224D4951a33135q2402
$$ -41380 116881 -176468 298782 244008 173613 70947 -352689 -31224 44951 -133135 -215537
9531b15537f1074q0002j40611A13360N8603g8281j94297E4523b49510r0334D9092
$$ -215537 -61074 -141076 -281687 113360 171963 -78281 -272578 54523 -249510 -339844 49092
9519B71895n8793a12423F7442a0298p8623k23449a28940b0131I6295D655e3843
$$ 271895 213102 -112423 67442 -10298 -88921 -312370 -128940 -20131 96295 4655 -53843
9507b16156k5380a10638c07A09186D6223b69669m842J13772C709J88962l6169
$$ -216156 -241536 -110638 -307 109186 46223 -269669 -274511 -160739 3709 192671 156502
9496A56502c04744J26809B30377d62426A57478a37791n3409L6887n99g3861j88916
$$ 156502 -304744 -177935 230377 -462426 157478 -137791 -191200 -154313 -154912 -73861 -262777
9485b62777f8815G2255c13993A81519a19322A08362a22316N7265D1132g8452A67688
$$ -262777 -68815 72255 -313993 181519 -119322 108362 -122316 -65051 41132 -78452 167688
9473a04049D18958g191j4171B04358i9525A68239b13151P0634q4172A7146O4858
$$ -104049 418958 -7191 -21362 204358 -99525 168239 -213151 -142517 -226689 17146 82004
9462H2004a26600k68978J88023A52769d6194D0330K5221J80355a80451D3596g1221
$$ 82004 -126600 -395578 -207555 152769 -46194 40330 65551 245906 -180451 43596 -71221
9450b26127o240H6737a38831a7955A46662b42302I8059F116K57908a74455g127
$$ -226127 -232367 86737 -138831 -17955 146662 -242302 98059 6116 264024 -174455 -7127
9438c61537F5696N1272a7362l78847C4738b07687K590M0244r6971A88186J5510
$$ -361537 65696 116968 -17362 -396209 34738 -207687 -205097 -164853 -261824 188186 203696
9427B03696c47538a20450D3146J46685d42464H183a79763J3649L6190K9681B2838
$$ 203696 -347538 -120450 43146 189831 -442464 8183 -179763 -166114 -129924 -100243 22838
9415B32142f3830l2205M6459j14229e245l0765j56545F195M02226b7993D3892
$$ 232142 -63830 -96035 -49576 -163805 -5245 -36010 -192555 6195 408421 -27993 43892
9403d85152a6012m6388a2774E2257a16932M5048B17109b23781F1653b35259D8568
$$ -485152 -16012 -62400 -12774 52257 -116932 -71884 217109 -223781 61653 -235259 48568
9391A00358b27420a02769n518A17025J95579h4617o3799b3749A09354N2127b00626
$$ 100358 -227420 -102769 -108287 117025 312604 -84617 -148416 -23749 109354 161481 -200626
9379C5260i1426r8420A51795a27973l6022A26941Q1632a9804k24814O5816b538
$$ 35260 -91426 -189846 151795 -127973 -163995 126941 208573 -19804 -244618 -178802 -2538
9367a95285o6158b7414F9260b17092I1325a01962B47166b11503a0277l0780k66519
$$ -195285 -261443 -27414 69260 -217092 91325 -101962 247166 -211503 -10277 -41057 -307576
9356c07576a05993A02702N1656b1310j54964b4649k82054J36635C50778C0934
$$ -307576 -105993 102702 154358 -21310 -176274 -24649 -306703 -170068 350778 30934
9345G9767a48838m600I5602J43720D1423P1427a31677A59763b2934A76560a49656
$$ 79767 -148838 -153438 95602 239322 41423 112850 -131677 159763 -22934 176560 -149656
9333A89149h5551j82755A45591c3635n0734j46154o6752B48024a74794j2481m1832
$$ 189149 -85551 -268306 145591 -33635 -84369 -230523 -297275 248024 -174794 -187275 -229107
9322b29107i1011d0041p3309A33677M9143F3248e3427J3574A99605a14147N6225
$$ -229107 -91011 -40041 -113350 133677 182820 63248 -53427 -39853 199605 -114147 -57922
9311e7922G9213a78975q2400J2643i2001A8908N569f3691n20724D0812a9443j17081
$$ -57922 79213 -178975 -261375 -248732 -92001 18908 24477 -63691 -584415 40812 -19443 -136524
9299a36524N0438A21230m9183B120J24721j0906a40289A37552l4983f4646b2918
$$ -136524 -86086 121230 72047 2120 126841 115935 -140289 137552 102569 -64646 -22918
9287g2324B04299j9940a71787C9132N9805K91529a80219f9707A22458C783a73078
$$ -72324 204299 184359 -171787 39132 98937 390466 -180219 -69707 122458 3783 -173078
9275g4998C67374a09047N2301j37022P9237F1122d543q7293j23283B02763c81055
$$ -74998 367374 -109047 -56746 -193768 -114531 61122 -4543 -91836 -215119 202763 -381055
9263a6419j85681M797O1352n3819N7607B26466K8188j0353a14817M580O677E7678
$$ -16419 -202100 -197303 -135951 -189770 -132163 226466 254654 244301 -114817 -110237 -103560 57678
9250b47648F2571d8416A11538e40759h399E4684e16748b12465J05956j56166A11283
$$ -247648 62571 -48416 111538 -540759 -8399 54684 -516748 -212465 -106509 -262675 111283
9238a15243A69523A1403B225P5977e0934k7820B5904i0603I4730R850b66772A90086
$$ -115243 169523 11403 2225 78202 -50934 -78754 25904 -90603 94730 104580 -266772 190086
9225A9885K72999b49173C06965b74773K4807A4611J1000J22120a04096E9229h5006
$$ 19885 292884 -249173 306965 -274773 -249966 14611 25611 147731 -104096 59229 -85006
9213a49587o9483h557A5898N8735a87269M0771I0356a02804r6784A40639O7655
$$ -149587 -219070 -8557 15898 74633 -187269 -146498 90356 -102804 -199588 140639 208294
9202B08294a37008A81106k4100o9880a20606k7320j4413d6748m9812B69325d19968
$$ 208294 -137008 181106 157006 87126 -120606 -147926 -162339 -46748 -96560 269325 -419968
9190A73522c45324A05837a47622d4742A25234k5525h991j01731l50677A26646
$$ 173522 -345324 105837 -147622 -44742 125234 99709 -8991 -110722 -461399 126646
9179b11494K9317R491A37727b43928A94531M1270D274b22589h2807A95821H3808
$$ -211494 -182177 -172686 137727 -243928 194531 235801 4274 -222589 -82807 195821 83808
9167a67019d0659G2754J08524h4682F0504b68694C485a6043j66240L4823O9151
$$ -167019 -40659 72754 181278 -84682 60504 -268694 3485 -16043 -182283 -147460 -78309
9156g8309n85785e079j26825n0554C0717a13967o6661L9582b6504l3368D3164
$$ -78309 -664094 -5079 -131904 -182458 30717 -113967 -180628 -141046 -26504 -59872 43164
9144h0371B2436a13475J3510r7523c5841B45112d4298A56114C2279P0423c1643
$$ -80371 22436 -113475 -99965 -197488 -35841 245112 -44298 156114 32279 102702 -31643
9132a7908q2616B00477A6218J63436h4756k87072C2899d19317g8041e724C5964
$$ -17908 -100524 200477 16218 179654 -84756 -371828 32899 -419317 -78041 -5724 35964
9120A02781d55774a87805e9191A86239a08299k9102O5061H7780L3512d619A22036
$$ 102781 -455774 -187805 -59191 186239 -108299 -137401 -72340 87780 121292 -4619 122036
9108b04819M9941k40629e7477B34239k0905G9232a5009j64308b0624l46636d4223
$$ -204819 -154878 -395507 -57477 234239 213334 79232 -15009 -179317 -20624 -367260 -44223
9096b18469Q0781c0036j49380E6941K47a98595H187L31603h330o309B5837Q0996
$$ -218469 -137688 -30036 -179416 56941 57188 -198595 8187 339790 -8330 -14639 25837 106833
9084A06833b77163C40607a04198A1919M7135a16812j14660j23191b561B53473
$$ 106833 -277163 340607 -104198 11919 59054 -116812 -231472 -354663 -2561 253473
9073C7128a51683B50160a29488e2838r639M709B95014d8346j92801O4427A11354
$$ 37128 -151683 250160 -129488 -52838 -62477 -57768 295014 -48346 -241147 -176720 111354
9061b81189D62e2290B25876b36432o6553h4243l2169n5327e579j34783d3237j17660
$$ -281189 462 -52290 225876 -236432 -302985 -84243 -116412 -171739 -5579 -140362 -43237 -160897
9049a60897l9685i6650m9523P542G4354b04586A08026d6782C92021A06864n0979
$$ -160897 -200582 -96650 -146173 -138631 74354 -204586 108026 -46782 392021 106864 55885
9038E5885A6222J38448J09924a07369R14k2823m278B97009I3922d0573J8649E455
$$ 55885 16222 154670 264594 -107369 -106455 -129278 -133556 297009 93922 -40573 -21924 5455
9025a15233D0420a37129f0468k46545B52246a12596m3563j07573A25149b33219
$$ -115233 40420 -137129 -60468 -307013 252246 -112596 -156159 -263732 125149 -233219
9014b40821G6882R38a71830j23636F2710b1833D3793O9349B7738c4484j49750
$$ -240821 76882 77820 -171830 -295466 62710 -21833 43793 113142 27738 -34484 -184234
9003a84234A57846a18455d0428D7193a6692D7335R448a87781h4113j79317J06214
$$ -184234 157846 -118455 -40428 47193 -16692 47335 56783 -187781 -84113 -263430 -157216
8992a57216p7281j91113C60380b80172a11431d8778o7457j78325G0937J25812
$$ -157216 -234497 -425610 360380 -280172 -111431 -48778 -116235 -294560 70937 196749
8982A96749a17704j21166K3084a1864j66351e9904A00131J9672e6999D0215b0392
$$ 196749 -117704 -238870 -215786 -11864 -178215 -59904 100131 119803 -56999 40215 -20392
8970I9076b2640j47588P1716A6092b92234g6758K5633B37629e1826A31844E6106
$$ 99076 -22640 -170228 -98512 16092 -292234 -76758 -51125 237629 -51826 131844 56106
8958D1799J2572e2869q8269H8650c84925g7927j80248a10448a1552A18906f4302
$$ 41799 54371 -52869 -141138 88650 -384925 -77927 -258175 -110448 -11552 118906 -64302
8946a86350l1257c9279F137K05046I3098a23989C35251e8555a4129q9056n0062
$$ -186350 -217607 -39279 6137 211183 93098 -123989 335251 -58555 -14129 -103185 -153247
8935a53247r799a9133A07624c5200A89642o1624a01497o8080C1653a66953a8707
$$ -153247 -163046 -19133 107624 -35200 189642 128018 -101497 -169577 31653 -166953 -18707
8923a8052k3960j85234F1714f7249B38066C7112K44163A0820M0632a16367A17223
$$ -18052 -42012 -227246 61714 -67249 238066 37112 281275 10820 51452 -116367 117223
8911e8085B7624c64619D4884g6281D8196Q6655A7586a10046e4672k06709C21524
$$ -58085 27624 -364619 44884 -76281 48196 134851 17586 -110046 -54672 -261381 321524
8899a1653A22518l3559c7012q6118j25098Q2679P8029n9822A2085a55402B95312
$$ -11653 122518 88959 -37012 -123130 -248228 -165549 -87520 -147342 12085 -155402 295312
8887a95528d4866j60997J8006E1893d6653n402j74187M0008B00428B363a49136
$$ -195528 -44866 -205863 -187857 51893 -46653 -52055 -226242 -186234 200428 2363 -149136
8875b9025j5741i183A76891c06587L5956a15735r4293M3664A96901a06898B46261
$$ -29025 -44766 -9183 176891 -306587 -270631 -115735 -210028 -166364 196901 -106898 246261
8863A49112d4436j87097A49086b58168o0463J14303i4442c5294j55292k8141C649
$$ 149112 -44436 -231533 149086 -258168 -318631 -204328 -94442 -35294 -190586 -218727 3649
8851a58285a1909C93321q5956a48111j62600J12585j43279a02233b4833k94210
$$ -158285 -11909 393321 307365 -148111 -310711 -198126 -341405 -102233 -24833 -319043
8841c19043a6354j06847F6048H354h9610J6058A16779L312M6828b24801H6340
$$ -319043 -16354 -123201 66048 8354 -89610 -73552 116779 120091 166919 -224801 86340
$$ [...]
##END NTUPLES=NMR SPECTRUM
##END=
