##TITLE=NES1051_Conilon_9270716_MiSnGA3gQ1
##JCAMPDX= 6.0         $$ Bruker NMR JCAMP-DX V2.0
##DATA TYPE= NMR SPECTRUM
##DATA CLASS= NTUPLES
##ORIGIN= BRUKER
##OWNER= Administrator
$$ 1.72 TOPSPIN		Version 2.1
$$ 2015-07-18 19:12:59.416 -0700  Administrator@X
$$ Compression mode = diff/dup
##.OBSERVE FREQUENCY= 400.02188249412
##.OBSERVE NUCLEUS= ^1H
##.ACQUISITION MODE= SIMULTANEOUS (DQD)
##.ACQUISITION SCHEME= undefined
##.AVERAGES= 64
##.DIGITISER RES= 22
##SPECTROMETER/DATA SYSTEM= spect
##.PULSE SEQUENCE= noesygpps1d.comp
##.SOLVENT NAME= COFFEE_meoh
##.SHIFT REFERENCE= INTERNAL, COFFEE_meoh, 1, 14.96369
##AUDIT TRAIL= $$ (NUMBER, WHEN, WHO, WHERE, PROCESS, VERSION, WHAT)
$$ ##TITLE= Audit trail, TOPSPIN		Version 2.1
$$ ##JCAMPDX= 5.01
$$ ##ORIGIN= Bruker BioSpin GmbH
$$ ##OWNER= Administrator
$$ $$ E:\/data/COFFEE/nmr/NES1051_Conilon_9270716_MiSnGA3gQ1/22/pdata/1/auditp.txt
$$ ##AUDIT TRAIL=  $$ (NUMBER, WHEN, WHO, WHERE, PROCESS, VERSION, WHAT)
(   1,<2015-07-18 19:12:53.885 -0700>,<Administrator>,<X>,<go>,<TOPSPIN 2.1>,
      <created by zg
	started at 2015-07-18 19:01:23.900 -0700,
	POWCHK enabled, PULCHK disabled,
       configuration hash MD5:
       21 0F 79 D6 B3 7B B4 F6 88 20 88 DB 03 48 BD 9F
       data hash MD5: 64K
       CB DC BD 61 A7 7B 63 EE 74 BC 87 78 54 E8 B6 50>)
(   2,<2015-07-18 19:12:57.260 -0700>,<Administrator>,<X>,<proc1d>,<TOPSPIN 2.1>,
      <Start of raw data processing
       efp LB = 0.3 FT_mod = 6 PKNL = 1 PHC0 = 0 PHC1 = 0 SI = 128K 
       data hash MD5: 128K
       C4 67 DC 3F 68 DB 5E 61 53 80 C3 F7 76 0C 02 4B>)
(   3,<2015-07-18 19:12:58.150 -0700>,<Administrator>,<X>,<proc1d>,<TOPSPIN 2.1>,
      <pk PHC0 = -89.97253 PHC1 = 0 
       data hash MD5: 128K
       B0 59 D4 B7 AA 25 38 87 A7 A3 83 4C CB 8C 0B 12>)
(   4,<2015-07-18 19:12:58.557 -0700>,<Administrator>,<X>,<proc1d>,<TOPSPIN 2.1>,
      <abs ABSG = 1 
       data hash MD5: 128K
       5C CE 0E 9B 7B 3B BD 95 9C E2 46 61 8F 46 E8 7C>)
(   5,<2015-07-18 19:12:58.666 -0700>,<Administrator>,<X>,<proc1d>,<TOPSPIN 2.1>,
      <abs ABSG = 2 
       data hash MD5: 128K
       8D E1 9C E9 27 16 C7 F3 A4 81 70 22 6C 66 8D C0>)
(   6,<2015-07-18 19:12:58.744 -0700>,<Administrator>,<X>,<proc1d>,<TOPSPIN 2.1>,
      <abs ABSG = 3 
       data hash MD5: 128K
       C5 8F A2 9F 07 7D 7B F5 0D A8 7F E3 6F CA E5 85>)
(   7,<2015-07-18 19:12:58.838 -0700>,<Administrator>,<X>,<proc1d>,<TOPSPIN 2.1>,
      <abs ABSG = 4 
       data hash MD5: 128K
       F4 FC 1D F9 5B A7 CA CA 10 5C 0C 7D B0 29 B5 33>)
(   8,<2015-07-18 19:12:58.979 -0700>,<Administrator>,<X>,<proc1d>,<TOPSPIN 2.1>,
      <abs ABSG = 5 
       data hash MD5: 128K
       48 48 09 15 39 51 D2 AB 93 14 3A EF F7 18 4B DF>)
$$ ##END=
$$ 
$$ $$ hash MD5
$$ $$ 11 FD 18 C9 0E A3 63 65 66 86 68 62 53 E5 54 B9
##$RELAX= 
##$RELAX= 
##$RELAX= 
##$RELAX= 
##$RELAX= 
##$RELAX= 
##$RELAX= 
##$RELAX= 
$$ Bruker specific parameters
$$ --------------------------
##$DU= <E:\>
##$EXPNO= 22
$$ [...]
##$TP07= 0
##$TPNAME0= <>
##$TPNAME1= <>
##$TPNAME2= <>
##$TPNAME3= <>
##$TPNAME4= <>
##$TPNAME5= <>
##$TPNAME6= <>
##$TPNAME7= <>
##$TPOAL= (0..7)
0.5 0.5 0.5 0.5 0.5 0.5 0.5 0.5
##$TPOFFS= (0..7)
0 0 0 0 0 0 0 0
##$TUNHIN= 0
##$TUNHOUT= 0
##$TUNXOUT= 0
##$USERA1= <user>
##$USERA2= <user>
##$USERA3= <user>
##$USERA4= <user>
##$USERA5= <user>
##$V9= 5
##$VALIST= <valist>
##$VCLIST= <CCCCCCCCCCCCCCC>
##$VD= 0
##$VDLIST= <DDDDDDDDDDDDDDD>
##$VPLIST= <PPPPPPPPPPPPPPP>
##$VTLIST= <TTTTTTTTTTTTTTT>
##$WBST= 2048
##$WBSW= 25
##$XGAIN= (0..3)
0 0 0 0
##$XL= 0
##$YL= 0
##$YMAX_a= 5606396
##$YMIN_a= -11369862
##$ZGOPTNS= <>
##$ZL1= 120
##$ZL2= 120
##$ZL3= 120
##$ZL4= 120
##$ABSF1= 14.96369
##$ABSF2= -5.594492
##$ABSG= 5
##$ABSL= 3
##$ALPHA= 0
##$AQORDER= 0
##$ASSFAC= 0
##$ASSFACI= 0
##$ASSFACX= 0
##$ASSWID= 0
##$AUNMP= <proc_prof1d_extract.lims>
##$AXLEFT= 0
##$AXNAME= <>
##$AXNUC= <1H>
##$AXRIGHT= 0
##$AXTYPE= 0
##$AXUNIT= <>
##$AZFE= 0.1
##$AZFW= 0.1
##$BCFW= 0
##$BC_mod= 0
##$BYTORDP= 0
##$COROFFS= 0
##$CY= 15
##$DATMOD= 1
##$DC= 0
##$DFILT= <>
##$DTYPP= 0
##$F1P= 0
##$F2P= 0
##$FCOR= 0.5
##$FTSIZE= 131072
##$FT_mod= 6
##$GAMMA= 0
##$GB= 0
##$INTBC= 1
##$INTSCL= 1
##$ISEN= 128
##$LB= 0.3
##$LEV0= 0
##$LPBIN= 0
##$MAXI= 10000
##$MC2= 0
##$MEAN= 0
##$ME_mod= 0
##$MI= 0
##$NCOEF= 0
##$NC_proc= -2
##$NLEV= 6
##$NOISF1= 0
##$NOISF2= 0
##$NSP= 0
##$NTH_PI= 0
##$NZP= 0
##$OFFSET= 14.96369
##$PC= 1
##$PHC0= -89.97253
##$PHC1= 0
##$PH_mod= 1
##$PKNL= yes
##$PPARMOD= 0
##$PPDIAG= 0
##$PPIPTYP= 0
##$PPMPNUM= 2147483647
##$PPRESOL= 1
##$PSCAL= 4
##$PSIGN= 0
##$PYNMP= <proc.py>
##$REVERSE= no
##$SF= 400.020008561792
##$SI= 131072
##$SIGF1= 0
##$SIGF2= 0
##$SINO= 400
##$SIOLD= 131072
##$SPECTYP= <>
##$SREGLST= <1H.CDCl3>
##$SSB= 0
##$STSI= 131072
##$STSR= 0
##$SW_p= 8223.68421052631
##$SYMM= 0
##$S_DEV= 0
##$TDeff= 65536
##$TDoff= 0
##$TI= <>
##$TILT= no
##$TM1= 0
##$TM2= 0
##$TOPLEV= 0
##$USERP1= <user>
##$USERP2= <user>
##$USERP3= <user>
##$USERP4= <user>
##$USERP5= <user>
##$WDW= 1
##$XDIM= 131072
##$YMAX_p= 342133126
##$YMIN_p= -11972
##$CURPLOT= <Network HP LaserJet P1505>
##$CURPRIN= <$Network HP LaserJet P1505>
##$DFORMAT= <normdp>
##$LAYOUT= <+/1D_H.xwp>
##$LFORMAT= <normlp>
##$PFORMAT= <normpl>
##$SURQMSG= 1
$$ End of Bruker specific parameters
$$ ---------------------------------
##NTUPLES= NMR SPECTRUM
##VAR_NAME=  FREQUENCY,     SPECTRUM/REAL,   SPECTRUM/IMAG
##SYMBOL=    X,             R,               I
##VAR_TYPE=  INDEPENDENT,   DEPENDENT,       DEPENDENT
##VAR_FORM=  AFFN,          ASDF,            ASDF
##VAR_DIM=   131072,        131072,          131072
##UNITS=     HZ,            ARBITRARY UNITS, ARBITRARY UNITS
##FACTOR=    0.0627417313425164, 1,          1
##FIRST=     8223.62146879497, 642,          -34380
##LAST=      0,             664,             -34783
##MIN=       0,             -11972,          0
##MAX=       8223.62146879497, 342133126,    0
$$ Real data points
##PAGE= N=1
##DATA TABLE= (X++(R..R)), XYDATA
$$ [...]
64784 62185 62033 61203 59829 58375 57399 57015 56625 55621 54387 54107 55319 57182 58493 58969 59042 58830 58065
64767 58065 56959 56410 57085 58701 60438 61768 62657 63200 63416 63343 63075 62690 62309 62242 62790 63759 64419 64257
64749 64257 63691 63637 64364 65189 65390 64981 64321 63468 62376 61399 61007 61133 61259 61023 60280 58821 56674 54557
64731 54557 53321 52943 52810 52980 54233 56591 58788 59775 59947 60170 60286 59543 58136 57302 57863 59347 60623
64714 60623 60926 60261 59267 58663 58550 58329 57621 56910 56853 57286 57622 57935 58805 60145 61097 61289 61388 62034 62902
64695 62902 63286 63113 62841 62685 62427 61898 61275 60911 61008 61408 61724 61839 62151 63011 64064 64674 64910 65413 66181
64676 66181 66275 65144 63551 62604 62404 62353 62337 62790 63750 64629 65005 65037 64980 64833 64630 64705 65368 66527 67707 68361
64656 68361 68190 67396 66579 66214 66261 66457 66805 67501 68538 69664 70671 71426 71764 71662 71384 71116 70664 69969
64638 69969 69692 70684 72862 75194 76873 77916 78611 79037 79341 79815 80349 80363 79603 78529 77645 76985 76599 76827
64620 76827 77556 77826 76946 75541 74763 74776 74863 74686 74513 74346 73830 73103 72801 72991 72988 72554 72403 73020 73775 73830
64600 73830 73328 72969 72880 72659 72214 71787 71288 70361 69165 68462 68750 69767 70902 71773 72277 72495 72614 72671 72341
64581 72341 71342 70066 69323 69341 69457 69061 68442 68329 68866 69467 69594 69283 68937 68882 69197 69737 70212 70291 69726 68433
64561 68433 66613 64875 64042 64528 65834 66883 66970 66331 65703 65504 65568 65582 65502 65488 65591 65723 65809 65826 65690 65278
64541 65278 64618 63899 63239 62609 62053 61794 61947 62293 62533 62703 63089 63763 64422 64706 64513 63946 63116 62087 60969
64522 60969 60021 59685 60380 62089 64177 65869 66922 67668 68368 68768 68435 67397 66288 65796 65979 66110 65332
64505 65332 63589 61840 61162 61696 62664 63359 63727 63959 63928 63416 62691 62484 63267 64713 65926 66211 65557 64454
64487 64454 63398 62707 62700 63592 65030 66099 66181 65632 65224 65114 64846 64183 63362 62565 61827 61556 62398 64269 66101
64468 66101 66953 66881 66412 65782 65159 64981 65385 65696 65205 64186 63465 63268 63204 63179 63523 64283 65172 66270 67959
64449 67959 69999 71393 71530 70901 70389 70276 70262 70019 69427 68528 67555 66788 66264 65805 65350 65013 64862 65035 65935
64430 65935 67743 69790 71044 71359 71544 72065 72459 72328 72040 71915 71578 70938 71076 73041 76050 78010 77881
64413 77881 76690 76113 76871 78709 81094 83470 85377 86879 88601 90968 93628 95949 97811 99548 101317
64398 101317 102989 104693 106950 109993 113159 115325 115954 115502 114794 114291 114090 114244 114629 114661 113670 111696 109513
64381 109513 107763 106476 105562 105249 105644 106260 106460 106162 105683 105112 104336 103553 103233 103533 104157 104844 105641 106674
64363 106674 107987 109668 111850 114492 117406 120470 123593 126499 128931 131099 133600 136785 140511 144533
64349 144533 148881 153778 159526 166575 175363 185872 197615 210213 223801 238731 255202 273411
64337 273411 293823 316927 342814 371211 401871 434593 468759 502909 534832 562114 582824
64326 582824 595920 601122 598430 587938 570191 546598 519185 489757 459333 428424 397751 368449
64314 368449 341453 316895 294363 273696 255192 238975 224517 211067 198399 186866 176861
64303 176861 168400 161195 154836 149000 143637 138967 135109 131827 128712 125535 122334 119406 117367 116846
64289 116846 117713 118855 119137 118446 117443 116557 115763 115136 114917 114988 114909 114561 114196 113793 112991 111796 110686 109781
64271 109781 108587 106884 105228 104098 103204 102187 101449 101579 102343 103035 103564 104412 105657 106824 107687 108465
64255 108465 109141 109371 109359 110062 111965 114139 115159 114780 114124 114282 115302 116656 118086 119539 120685 121206
64239 121206 121589 123002 125964 129551 132402 134278 136084 138494 141271 144044 147074 150855 155461 160747
64225 160747 166848 174005 182085 190702 199704 209261 219678 231460 245319 261703 280454 301334 324703
64212 324703 351177 380677 412332 445366 479556 514628 549553 582573 611601 634514 649538
64201 649538 655801 653515 643514 626710 604032 576684 546216 514315 482470 451662 422312 394579
64189 394579 368655 344671 322475 301813 282741 265582 250347 236454 223202 210464 198770
64178 198770 188697 180219 172620 165099 157472 150225 143846 138276 133150 128365 124191 120853 118250 116091
64164 116091 114097 112120 110261 108860 108215 108248 108554 108675 108270 107230 105886 104884 104515 104258 103348 101732
64148 101732 100114 99079 98613 98521 98828 99526 100263 100614 100567 100528 100846 101397 101647 101243 100578 100501 101214 101730 100926
64129 100926 99013 97413 97161 97983 99019 99799 100204 100079 99402 98553 97983 97755 97702 97801 98072 98322 98346 98249 98286
64110 98286 98510 98896 99634 100995 102923 105004 106825 108241 109416 110792 112820 115476 118108 119975 120858
64095 120858 121029 120893 120912 121670 123528 126187 128833 130745 131642 131544 130605 129089 127313 125587 124210 123391 123001
64078 123001 122641 122175 122003 122546 123606 124578 125199 125741 126524 127555 128644 129553 130045 130075 129913 129860 129894 129896 130091
64059 130091 130865 132210 133833 135800 138494 141779 144822 147096 149102 151633 154723 157801 160625 163498
64045 163498 166658 170005 173526 177492 182078 187019 191768 195792 198686 200295 200828 200614 199685 197889 195508
64030 195508 193389 192217 191927 192103 192656 193700 194944 195782 196027 196105 196419 196972 197817 199458 202399 206525 211249
64013 211249 216124 221040 226003 231047 236220 241358 246074 250327 254826 260361 266824 273384 279649 286075
63999 286075 293155 300819 308846 317323 326359 335848 345950 357351 370513 384952 399734 414482 429493
63986 429493 445208 462161 481260 503309 528091 554418 581310 608865 637933 669314 703293
63975 703293 739621 777887 818289 862178 911490 967509 1030383 1099958 1176805 1262473 1359181
63964 1359181 1469423 1595523 1739337 1902654 2087976 2298544 2537299 2805978 3105217
63955 3105217 3434895 3793844 4179499 4588393 5017049 5462020 5918991 6381952 6843037
63946 6843037 7292741 7720337 8114704 8465586 8764718 9006317 9186783 9303818 9355473 9339847
63936 9339847 9255672 9103263 8885119 8606132 8273608 7896957 7486698 7053063 6605031 6150240
63926 6150240 5695456 5247091 4811445 4394548 4001524 3635805 3298832 2990656 2710948
63917 2710948 2459452 2235447 2036992 1861099 1704898 1566538 1444870 1338456 1245146 1162508
63907 1162508 1088387 1021108 959583 903323 852046 805047 761170 719549 680172 643478 609557
63896 609557 577989 548397 520849 495585 472456 450813 430016 410015 391312 374297 358750
63885 358750 344159 330317 317368 305353 294103 283545 273790 264874 256693 249230 242463 236009 229360
63872 229360 222638 216617 211739 207585 203644 200104 197385 195315 193391 191558 190041 188551 186372 183282
63858 183282 179843 176643 173808 171321 169287 167585 165762 163567 161310 159440 157967 156542 154844 152751
63844 152751 150367 148099 146456 145534 144807 143541 141368 138465 135477 133288 132428 132456 132222 131025 129287 127827
63828 127827 126732 125383 123438 121311 119618 118487 117586 116622 115655 115002 114942 115452 116168 116648 116724 116571 116443
63811 116443 116355 116128 115748 115510 115609 115626 114797 112977 111121 110427 111113 112317 113085 113045 112265 110987 109711 109053
63793 109053 109207 109714 109928 109473 108242 106360 104329 102770 101739 100681 99282 97948 97121 96648 96257 96149
63777 96149 96460 96572 95775 94403 93509 93467 93742 94038 94728 95875 96725 96707 96303 96383 97133 98156 99212 100280
63759 100280 101199 101851 102457 103172 103576 103185 102453 102620 104411 107301 110267 112918 115652 118944 122764 126728
63743 126728 130670 134928 139945 145634 151417 156981 162647 168783 175175 181360 187273 193031 198266 202285
63729 202285 204872 206380 206970 206340 204383 201533 198186 194244 189505 184057 177976 171213 164233 158229 153971
63714 153971 150743 147144 142767 138411 134744 131632 128897 126857 125661 124724 123418 121990 121241 121552 122640
63699 122640 124073 125522 126635 127262 127880 129359 132079 135509 138848 141870 145029 148880 153657 159330 165844
63684 165844 173039 180354 186862 191916 195720 198973 201887 203889 204369 203352 201149 197772 193210 188050
63670 188050 183217 179074 175226 171233 167061 162818 158574 154587 151272 148718 146595 144719 143333 142679
63656 142679 142749 143608 145419 147847 150009 151536 153157 155641 158643 161384 164094 167780 172600 177477 181588
63641 181588 185383 189750 194847 200287 205939 211983 218518 225574 233204 241085 248296 253995 258182 261380
63627 261380 263771 265114 265377 264947 264220 263476 263147 263700 265067 266564 267604 268232 268789 269287 269297 268306 266068
63610 266068 262790 259134 255856 253267 251124 249084 247071 245084 242959 240559 238074 235767 233515 230926
63596 230926 228030 225531 224153 223853 223931 223900 224067 225137 227360 230221 232948 235240 237478 240286 243919 248064
63580 248064 252221 256316 260799 266012 271587 276806 281598 286708 292539 298203 302293 304575 306289 308620
63566 308620 311350 313339 313940 313499 312737 312171 312075 312470 313049 313487 314006 315278 317562 320206 322290 323558 324421
63549 324421 325245 326023 326713 327447 328194 328561 328235 327433 326599 325668 323930 320726 316032 310241 303574 295982 287565
63532 287565 278800 270216 261992 254000 246164 238612 231518 224902 218655 212687 207070 202104 198154 195274
63518 195274 193003 190774 188583 187028 186499 186544 186309 185537 184823 184891 185887 187439 189099 190591 191907 193345
63502 193345 195340 198044 201225 204667 208446 212684 217300 222287 227988 234645 241801 248557 254444 259613
63488 259613 264192 267893 270408 271754 272043 271249 269415 266729 263153 258349 252283 245677 239448 233912 228850
63473 228850 224116 219780 215799 212065 208748 206223 204644 203978 204414 206213 209047 211961 214253 216067 217943
63458 217943 220158 222833 226284 230778 236056 241590 247317 253765 261361 269907 278902 288136 297736 307761
63444 307761 317968 328006 337646 346762 355187 362700 369096 374150 377556 379132 379180 378498 377885 377722 378079
63429 378079 378961 380205 381256 381483 380758 379410 377567 374908 371231 366886 362307 357345 351511 344838 338119
63414 338119 332161 327024 322146 317124 312240 308266 305799 304764 304534 304513 304519 304647 304980 305641 306970 309346
63398 309346 312762 316780 320933 324987 328840 332508 336380 341210 347497 354953 362848 370819 379066 387830
63384 387830 397052 406580 416285 425746 434181 441087 446716 451519 455230 457028 456666 454999 453200 451842
63370 451842 450957 450548 450602 450746 450390 449251 447513 445476 443268 440780 437622 433194 427139 419814 412037 404281
63354 404281 396358 388003 379529 371723 365158 359713 354727 349615 344382 339547 335498 332072 328856 325746
63340 325746 322939 320512 318371 316515 314928 313192 310696 307432 304126 301344 298826 296049 293087 290474
63326 290474 288398 286461 284203 281525 278642 275934 273763 272122 270471 268222 265474 263005 261438 260582
63312 260582 259689 258253 256474 254989 254190 253751 252897 251174 248836 246481 244492 243033 242307 242410 242948 243135
63296 243135 242448 241032 239455 238198 237402 236960 236765 236864 237217 237228 235897 232915 229445 227178 226461 225918 224192
63279 224192 221550 219298 218024 217147 216009 214639 213266 211776 210090 208697 208217 208595 209173 209528 209808 210185
63263 210185 210433 210301 209999 210023 210588 211412 212006 212055 211700 211527 212068 213134 213903 213914 213731 214233 215400 216300 216198
63244 216198 215245 214100 213377 213505 214541 215881 216612 216442 215976 215910 216372 217245 218593 220370 222162 223697 225183
63227 225183 226712 227776 228048 228290 229593 231873 233998 235503 237285 240219 243852 247058 249555 252137 255589
63212 255589 259926 264671 269410 273907 278008 281684 285148 288706 292385 295846 298802 301490 304543 308328
63198 308328 312649 317144 321691 326271 330771 335259 340242 346270 353340 360902 368362 375407 382094 388918
63184 388918 396498 404831 413145 420894 428566 436971 446120 455532 465371 476300 488156 499733 510135
63171 510135 519594 528755 537991 547735 558577 570383 581990 592414 601870 611079 620112 628592 636539
63158 636539 644144 650936 655935 658631 659294 658446 656439 653378 648971 642650 634335 624922 615549 606576 597771
63143 597771 589213 581303 574005 566820 559611 552818 546786 541429 536674 532634 529147 525691 522008 518469
63129 518469 515557 513343 511580 509935 507983 505390 502368 499660 497837 496820 496205 495745 495391 495166 495148 495319
63113 495319 495319 494703 493574 492577 492122 492022 492091 492618 493848 495447 496985 498651 500981 504045 507433 510978 514949
63096 514949 519468 524156 528540 532525 536382 540495 545174 550397 555652 560266 564018 567283 570502 573672
63082 573672 576440 578456 579534 579658 579010 577859 576268 574033 571030 567533 563942 560314 556340 551766 546626
63067 546626 541069 535240 529441 524198 519953 516689 513976 511303 508335 504991 501534 498556 496624 495829
63053 495829 495757 495923 496136 496395 496671 496929 497276 497879 498714 499528 500108 500558 501241 502436 504062 505781 507355 508784
63035 508784 510074 511013 511392 511361 511372 511728 512404 513296 514389 515562 516448 516695 516272 515409 514368 513312 512242
63018 512242 510928 509084 506787 504562 502939 502050 501778 502095 503018 504489 506522 509316 512915 516939 521039
63003 521039 525587 531513 539409 548990 559499 570359 581483 593236 606159 620502 635947 651926
62991 651926 668166 684727 701583 718507 735366 752155 768709 784728 800224 815530 830703
62980 830703 845262 858715 870952 881795 890519 896282 898856 898472 895032 888008 877197 863059 846087
62967 846087 826178 803020 776942 749038 720429 691624 662621 633400 604221 575681 548647
62956 548647 523993 502105 482586 464592 447505 431157 415529 400577 386447 373498 361832
62945 361832 350999 340472 330290 320908 312518 304956 298194 292459 287634 282969 277765 272135 266726
62932 266726 261794 257010 252205 247882 244616 242155 239527 236126 232387 229220 227031 225556 224439 223548
62918 223548 222759 221888 220958 220208 219743 219504 219708 220729 222213 222805 221421 218564 215851 214359 213886 213657 213093
62901 213093 211912 210239 208816 208562 209593 211019 211911 212150 212203 212527 213357 214630 215850 216456 216629 217323 219095
62884 219095 221222 222455 222365 221521 220551 219578 218584 217767 217373 217397 217603 217670 217291 216230 214412 211960 209245 206861
62866 206861 205291 204459 203753 202675 201303 200050 199148 198529 197987 197224 195973 194322 192778 191745 191096 190505
62850 190505 190017 189947 190274 190559 190467 190170 190156 190789 192009 193321 194182 194580 195122 196319 197967 199499 200811 202290
62832 202290 204085 205815 207105 207998 208671 209118 209350 209658 210339 211305 212234 213049 214010 215300 216731 217901 218529
62815 218529 218565 218071 217120 215887 214685 213701 212628 210773 207807 204346 201511 199804 198648 197184 195342
62800 195342 193850 193201 192962 192245 190698 188731 186881 185312 183997 183047 182518 182072 181222 179887 178480 177430
62784 177430 176891 176936 177719 179319 181590 184241 186920 189258 191108 192785 194746 196976 198986 200478 201655
62769 201655 202729 203611 204310 205174 206283 206972 206512 205090 203575 202390 201081 199043 196212 192954 189703
62754 189703 186894 184954 184072 183982 184062 183610 182196 179971 177653 176042 175429 175474 175602 175464 175123 174943 175254 176008
62736 176008 176825 177399 177716 177887 178009 178301 179042 180226 181616 183288 185656 188619 191245 192872 194143 196229
62720 196229 199265 202318 204840 207313 210363 213979 217911 222251 227255 233013 239596 247187 255858 265503
62706 265503 276181 288158 301526 316172 332286 350418 370791 392932 416255 440634 466170
62695 466170 492830 520598 549542 579302 608876 637263 663987 688612 710180 727763 741255
62684 741255 750958 756563 757265 752970 744708 733501 719308 701462 679880 655440 629240 601896 573748
62671 573748 545508 518317 492921 469044 445915 423397 402204 382904 365194 348470 332761
62660 332761 318658 306502 296088 287033 278983 271447 263977 256655 250012 244216 238631 232498 225927
62647 225927 219883 215212 211877 209239 206853 204761 203017 201250 198932 195981 192870 190164 188175 187006
62633 187006 186530 186140 184947 182586 179741 177549 176550 176441 176713 177172 177765 178229 178205 177655 176999 176712 176787 176782 176509
62614 176509 176489 177348 178869 180097 180536 180713 181266 181997 182355 182490 183088 184290 185517 186395 187190 188087 188720 188828
62596 188828 188913 189708 191245 192907 194236 195250 196063 196674 197226 198082 199445 201105 202629 203652 203940 203494
62580 203494 202809 202728 203695 205218 206388 206941 207418 208190 208770 208459 207413 206523 206225 205945 204958 203376 201961
62563 201961 201186 200908 200847 200930 201000 200558 199117 196818 194488 192956 192290 191752 190555 188652 186742 185562 185322
62546 185322 185751 186423 186917 186953 186620 186322 186285 186260 185961 185633 185876 186953 188622 190638 193025 195776 198653 201534
62528 201534 204701 208515 212952 217621 222148 226378 230412 234717 240088 247111 255617 264862 274424 284734
62514 284734 296589 310242 325186 340751 356691 373101 389925 406719 422824 437570 450307
62503 450307 460491 467969 473112 476425 477967 477225 473687 467487 459391 450117 439786 428111 415079
62490 415079 401223 387205 373302 359535 346116 333470 321832 311131 301378 292873 285849 280154
62478 280154 275491 271705 268585 265621 262379 259121 256624 255298 254731 254218 253529 252986 253011 253751 255055 256597
62462 256597 258051 259287 260448 261770 263303 264821 266038 266878 267449 267789 267809 267556 267328 267266 266998 266085 264794
62445 264794 263878 263500 262968 261898 261043 261295 262288 262875 262857 263307 265045 267722 270783 274471 279189 284453 289386
62428 289386 293971 299039 305044 311620 318456 325947 334657 344572 355186 366039 376927 387812 398753
62415 398753 409730 420383 430127 438692 446281 453012 458496 462326 464694 466108 466639 465983 464204 461860
62401 461860 459316 456541 453865 452305 452527 453834 454876 455314 456218 458776 463193 468964 475641 483054 491230
62386 491230 500546 511688 525130 540866 558950 579893 604050 630884 659480 689700 722134 756750
62374 756750 792233 827035 860652 893478 925711 956876 986202 1012873 1035769 1053517 1065279
62363 1065279 1071424 1073083 1070958 1064789 1054118 1039356 1021675 1001875 979763 954890 927632 899235
62351 899235 870969 843595 817465 792674 769099 746726 726096 708020 692669 679255 666876
62340 666876 655436 645505 637523 631466 627142 624445 623262 623345 624355 625980 628032 630479 633323 636360
62326 636360 639212 641614 643587 645203 646329 646674 645914 643702 639806 634469 628490 622602 616806 610540 603470
62311 603470 595918 588528 581749 575694 570276 565358 560827 556592 552570 548732 545283 542676 541357 541450 542747
62296 542747 544924 547737 551093 555044 559628 564679 569942 575404 581343 587931 595051 602691 611235 621074
62282 621074 632147 644217 657388 671918 687659 704222 721689 740622 761225 783027 805594
62271 805594 829081 853626 878570 902750 925458 946702 966584 984840 1001090 1015234 1027397
62260 1027397 1037568 1045501 1051006 1054211 1055401 1054552 1051320 1045667 1038358 1030485 1022561 1014477 1006310 998638
62246 998638 991868 985815 980341 975992 973430 972480 972264 972206 972390 972973 973746 974409 974880 975201 975442 975807 976535
62229 976535 977521 978322 978640 978646 978806 979620 981538 984755 988953 993476 997901 1002218 1006517 1010891 1015742 1021639
62213 1021639 1028641 1036245 1044319 1053636 1064947 1077896 1091458 1105270 1119954 1136243 1154433 1174666
62201 1174666 1197006 1220923 1245283 1269238 1292825 1316364 1339536 1361421 1381241 1398741 1414040
62190 1414040 1427570 1440234 1453264 1467643 1483634 1500925 1519212 1538646 1559649 1582317 1606147
62179 1606147 1630485 1655145 1680268 1705628 1730444 1753989 1776106 1796969 1816671 1835359 1853400
62168 1853400 1870949 1887418 1901827 1913672 1923185 1930850 1937093 1942491 1947712 1952916 1957560 1961131 1963895
62155 1963895 1966651 1969969 1974009 1978852 1984459 1990280 1995444 1999613 2003334 2007233 2011163 2014536 2017331 2020275
62141 2020275 2023976 2028251 2032493 2036416 2040209 2044096 2047960 2051398 2054029 2055815 2057117 2058298 2059244 2059502
62127 2059502 2058963 2058122 2057487 2056967 2056144 2054946 2053642 2052284 2050573 2048268 2045376 2041927 2037966 2033840 2030113
62112 2030113 2026987 2024086 2020981 2017673 2014450 2011576 2009323 2007999 2007716 2008375 2010097 2013423 2018808 2026120
62098 2026120 2034947 2045208 2057176 2071115 2087283 2106163 2128207 2153191 2179915 2206424 2230340
62087 2230340 2249356 2262117 2268936 2271430 2271361 2269917 2267828 2265413 2262018 2255705 2244118 2225984 2201838
62074 2201838 2173323 2141950 2108510 2073450 2037424 2001229 1965318 1929778 1894868 1861238 1829319
62063 1829319 1798694 1768391 1737738 1706763 1675908 1645659 1616438 1588563 1562239 1537650 1514951
62052 1514951 1494008 1474341 1455516 1437453 1420051 1402762 1384952 1366609 1348240 1330098 1311882
62041 1311882 1293232 1274126 1254769 1235477 1216685 1198671 1181172 1163671 1146047 1128529 1111041
62030 1111041 1093209 1075154 1057678 1041366 1026033 1011359 997445 984291 971303 957979 944722
62019 944722 932356 921111 910727 901292 893159 886151 879624 873474 868322 864422 860910 856582 851027
62006 851027 844626 837712 830064 821057 810008 796555 781013 764337 747468 730668 713657 696358
61994 696358 679331 663375 648845 635498 622967 611179 600241 590079 580463 571378 563107 555881
61982 555881 549640 544299 539926 536449 533416 530393 527498 525190 523652 522779 522689 523760 526015 528844 531617
61967 531617 534308 537340 540959 545005 549192 553500 558390 564606 572534 581712 591285 601100 612042 625027
61953 625027 639994 656193 673245 691436 711072 732046 754094 777058 800748 824929 849720
61942 849720 875765 903669 933345 964129 995476 1027376 1060113 1093752 1127833 1161434 1193680
61931 1193680 1224494 1254912 1286563 1320784 1358324 1399829 1446364 1499284 1559741 1628342 1705157
61920 1705157 1789884 1882064 1981251 2086907 2197961 2312443 2427605 2540422 2647873 2746668
61910 2746668 2832836 2901885 2949757 2973906 2973526 2948907 2900935 2831429 2743638 2641768 2529947
61899 2529947 2411887 2291277 2171512 2054506 1940357 1828894 1721289 1619514 1524514 1435758
61889 1435758 1352686 1275722 1205551 1142074 1084655 1032954 986984 946481 910747 879064 851015
61878 851015 826422 805209 787302 772454 760225 750234 742380 736756 733543 733054 735579 740944 748413
61865 748413 757256 767315 778875 792201 807421 824509 843000 861890 880189 897510 913776 928536
61853 928536 941014 950836 958310 963937 967991 970610 971977 972304 971949 971591 971970 973333 975379 977801 980547
61838 980547 983445 985924 987333 987384 986126 983730 980415 976282 970982 963926 955211 946220 938848 934145 931910
61823 931910 931525 932685 935159 938246 940911 942465 942901 942571 941741 940639 939871 940566 943900 950439 960029 972381
61807 972381 987724 1006847 1030559 1059217 1092758 1131117 1174498 1223350 1278209 1339665 1408377
61796 1408377 1485027 1570214 1664512 1768612 1883351 2009537 2147718 2298061 2460319 2633904
61786 2633904 2818042 3011728 3213291 3419808 3626891 3828847 4018766 4188615 4329987
61777 4329987 4435536 4500126 4521004 4497567 4431449 4326551 4188361 4022976 3836759 3636453
61767 3636453 3428781 3219490 3012917 2812454 2621044 2441001 2273558 2118811 1976075
61758 1976075 1844424 1723255 1612511 1512216 1421753 1339888 1265567 1198334 1137790 1083049
61748 1083049 1033067 987298 945632 907783 873129 841083 811336 783769 758422 735509 715101
61737 715101 696746 679723 663774 649228 636279 624497 613321 602755 593149 584458 576225 568339
61725 568339 561343 555692 550994 546401 541603 536933 532452 527421 521122 513961 507281 502016 497924 494242
61711 494242 490684 487452 484585 481861 479281 477076 475051 472361 468382 463518 458732 454397 450107 445565
61697 445565 441132 437302 434114 431396 429255 427890 427067 426179 424753 422601 419538 415344 410035 403939 397496
61682 397496 391188 385551 380874 376831 372766 368377 363810 359113 354121 348997 344315 340299 336436 332257
61668 332257 328124 324797 322467 320725 319273 318160 317441 317079 317145 317642 318157 318206 317917 317877 318195 318271 317750 317191
61650 317191 317399 318339 319143 319086 318249 317236 316459 315775 314737 313235 311849 311404 312103 313307 314272 314921 315658
61633 315658 316619 317460 317956 318511 319782 321855 324013 325496 326392 327545 329515 331810 333341 333490 332550 331189
61617 331189 329775 328300 326712 325096 323557 322087 320639 319292 318262 317688 317447 317292 317123 316987 316856 316688
61601 316688 316759 317591 319290 321264 322914 324411 326455 329388 332972 336967 341454 346478 351701 356597 360868
61586 360868 364600 368192 372161 376874 382454 388965 396487 404848 413645 422924 433583 446526 461509
61573 461509 477376 493415 509759 526307 542031 555813 567418 577078 584426 588564 589153 586957 583206
61560 583206 578700 573574 567668 561030 554193 548091 543660 541363 540921 541440 542030 542539 543579 545663 548464
61545 548464 551208 553544 555601 557278 558101 557843 556747 555001 552539 549577 546774 544488 542346 539956 537653
61530 537653 536096 535452 535442 535961 537187 539247 542230 546439 552295 560021 569616 580932 593600 607216
61516 607216 622011 639091 659598 683738 710914 740618 772880 808133 847050 890276 937826
61505 937826 988901 1042775 1099661 1160104 1223577 1288261 1352257 1414527 1474637 1532155 1586553
61494 1586553 1637311 1683893 1725853 1762999 1795130 1821636 1841848 1855961 1865290 1871418 1875367 1877636
61482 1877636 1878601 1878489 1877049 1873394 1866143 1853776 1835220 1810206 1778960 1741622 1698348 1650018 1598457
61469 1598457 1545774 1493668 1443409 1396034 1352274 1312524 1277109 1246375 1220353 1198570 1180482
61458 1180482 1165966 1155216 1148194 1144444 1143423 1144933 1149211 1156529 1166653 1178863 1192740 1208766
61446 1208766 1227757 1249766 1274058 1300278 1329066 1361040 1395466 1430237 1462917 1491498 1514538
61435 1514538 1531279 1541824 1546896 1547327 1543907 1537563 1529268 1519662 1509032 1497780 1486686 1476637 1468345
61422 1468345 1462484 1459836 1460919 1465401 1472088 1479510 1486370 1491311 1492546 1488204 1477263 1460094 1438023
61409 1438023 1412570 1385223 1357563 1331038 1306448 1283910 1263401 1245089 1229067 1215035 1202522
61398 1202522 1191300 1181535 1173653 1168130 1165162 1164355 1164968 1166667 1169895 1175388 1183625 1194959 1209951 1229036
61384 1229036 1251974 1278183 1307653 1341132 1379269 1421965 1468709 1519068 1572558 1628369 1685673
61373 1685673 1743946 1802527 1859951 1914155 1963400 2006640 2043007 2071456 2091161 2101879 2103584
61362 2103584 2096021 2078997 2052994 2019065 1978179 1931030 1878605 1822570 1764810 1706696 1648872
61351 1648872 1591631 1535318 1480497 1427860 1378033 1331351 1287832 1247391 1210044 1175961 1145386
61340 1145386 1118550 1095505 1075945 1059244 1044819 1032474 1022444 1015160 1010995 1010082 1012211 1016895
61328 1016895 1023607 1032009 1041988 1053447 1066082 1079414 1093216 1107919 1124350 1142693 1161684 1179070
61316 1179070 1193002 1202946 1209370 1212870 1213744 1212242 1208996 1205131 1201796 1199507 1198065 1197341 1197894 1200344
61302 1200344 1204253 1208277 1211638 1214867 1218677 1222652 1225675 1227372 1228474 1229814 1231595 1233718 1236278 1239447
61288 1239447 1243172 1247230 1251401 1255460 1259201 1262630 1266025 1269658 1273504 1277320 1280984 1284722 1289014 1294209
61274 1294209 1300177 1306331 1311948 1316332 1318742 1318555 1315779 1311190 1305700 1299741 1293528 1287709 1283312 1281082
61260 1281082 1281203 1283686 1288670 1296300 1306693 1320104 1336803 1356659 1379155 1403978 1431343 1461545
61248 1461545 1494465 1529809 1567671 1608554 1652806 1699990 1748501 1795421 1836856 1868986 1889231
61237 1889231 1896666 1891511 1874581 1847296 1811847 1770841 1726596 1680950 1635705 1592834 1553912 1519577
61225 1519577 1489905 1465193 1445980 1432342 1423631 1418900 1417008 1416033 1413174 1405873 1393107 1375468 1354290
61212 1354290 1331000 1307017 1283631 1261709 1241535 1222818 1204889 1187219 1170007 1153927 1139068
61201 1139068 1124543 1109606 1094766 1081223 1069414 1058700 1048337 1038019 1027553 1016743 1005788
61190 1005788 995191 985069 975102 965250 955865 946842 937369 927026 916528 906834 897941 889258 880746
61177 880746 872951 866069 859809 854263 850097 847564 845989 844722 844181 845401 848777 853783 859782 866437
61163 866437 873117 878452 880891 879531 874159 864775 851459 834640 815187 794192 772739 751631 731034
61150 731034 710574 690152 670503 652524 636272 621183 607182 594787 584015 574059 564462 555945
61138 555945 549432 544694 540568 536259 531912 528136 525496 524345 524693 526189 528401 530998 533612 535988
61124 535988 538458 541769 546085 550702 555171 560087 566088 572492 577714 580762 581626 580506 577532 573182
61110 573182 568270 563415 558934 555053 551739 548589 545467 542985 541676 541082 540427 539903 540333 541791 543559
61095 543559 545400 547805 550890 554022 556752 559224 561497 563345 564953 566917 569280 571342 572688 573595
61081 573595 574229 574331 574082 574410 575942 578337 581016 583812 586559 588844 590710 592861 595633 598407 600576
61066 600576 602487 604801 607474 609907 611748 613032 613951 614966 616785 619774 623602 627734 631959 636339
61052 636339 641076 646597 653291 661024 669427 678648 689113 700513 711934 723202 735147 748224 761883
61039 761883 775825 790851 807647 825549 843379 860939 878860 897377 916035 934350 952183
61028 952183 969600 986794 1003965 1021115 1038248 1055763 1074198 1093604 1113811 1135186 1158310
61017 1158310 1183037 1208946 1236741 1267894 1302791 1340627 1381497 1427048 1478427 1535070 1596327
61006 1596327 1662899 1735799 1815358 1902276 1998191 2103868 2217823 2337932 2463603 2595665
60996 2595665 2735549 2885749 3049799 3230567 3429655 3649408 3893926 4166925 4470327
60987 4470327 4806656 5181784 5604603 6086499 6642979 7293692 8058944 8958266 10013415
60978 10013415 11248226 12682113 14329294 16212533 18378067 20893534 23831456 27245488
60970 27245488 31122893 35303531 39424714 42994316 45606050 47151505 47848837 48072188
60962 48072188 48150851 48294052 48614921 49120154 49634896 49789625 49174287 47573250 45077306
60953 45077306 41981857 38588689 35090307 31588356 28160732 24890795 21855555 19111153
60945 19111153 16689535 14597137 12815228 11309072 10040975 8975614 8078456 7316662
60937 7316662 6663490 6099192 5607709 5175042 4790600 4447258 4139352 3861922 3611489
60928 3611489 3385754 3182489 2999700 2835935 2688751 2553592 2425908 2303868 2187664
60919 2187664 2077136 1971845 1872474 1779901 1693287 1611055 1533349 1461506 1395470 1333781 1275991
60908 1275991 1223025 1175084 1131113 1090461 1053173 1018536 985276 953641 925435 901327 879690
60897 879690 858723 838277 818953 800812 783821 768379 754569 741720 729363 717847 707437
60886 707437 697529 687278 676364 664796 652673 640453 628860 618189 608236 598974 590624 582980
60874 582980 575445 567934 561050 555241 550372 546153 542266 538123 533329 528380 524142 520716 517664 515141
60860 515141 513634 512647 510940 508326 505952 504455 503041 500882 498281 495842 493479 490895 488159 485225
60846 485225 481783 478212 475797 475208 475490 475263 474223 472712 470502 466958 462033 456333 450487 445031 440514
60831 440514 437003 433746 429914 425480 420916 416373 411723 407086 402632 397997 392561 386349 380239 375219
60817 375219 371652 369230 367328 365455 363494 361550 359618 357660 355990 355126 355059 355023 354247 352773 351343 350682
60801 350682 350970 351700 351956 351188 349817 348827 348664 348896 349003 349013 349141 349293 349235 348970 348643 348324 348031 347663 346805
60782 346805 345012 342514 340199 338585 337143 334945 331725 328041 324685 322173 320559 319400 318056 316318
60768 316318 314674 313753 313603 313629 313219 312368 311681 311690 312140 312176 311426 310537 310313 310689 311041 311165 311239 311041 310068 308458
60748 308458 306975 305954 304984 303748 302431 301146 299736 298429 297846 298039 298231 297926 297594 297848 298666 299808
60732 299808 301267 302763 303512 303149 302291 301566 300673 299044 296841 294488 291763 288241 284349 281065 278698
60717 278698 276746 274844 273144 271778 270617 269634 268999 268708 268493 268106 267474 266721 266331 266953 268636 270559
60701 270559 271990 273220 275032 277589 280510 283740 287473 291254 294078 295620 296709 298260 300301 302305
60687 302305 304036 305688 307515 309657 312081 314461 316269 317304 318018 319082 320610 321976 322506 322301 322248
60672 322248 323139 324946 327145 329616 332739 336613 340663 344284 347415 350198 352521 354370 356176 358264
60658 358264 360210 361370 361865 362313 362660 361997 359740 356447 353181 350484 348208 345980 343519 340749 337899
60643 337899 335407 333550 332272 331422 331009 331052 331338 331510 331389 331179 331353 332306 334012 336002 337720 338905 339582
60626 339582 339738 339142 337542 335030 332211 329931 328676 328155 327646 326814 326079 326108 327104 328748 330708 332993
60610 332993 335844 339383 343416 347609 351914 356771 362780 370239 379152 389512 401214 413753 426440
60597 426440 438942 451191 462727 472705 480785 487481 493201 497341 498823 497295 493408 488110 482045
60584 482045 475448 468277 460470 452278 444164 436299 428479 420791 413916 408414 404066 400329 397001 393986
60570 393986 390842 387320 384122 382346 382211 382955 383999 385571 388061 391310 394787 398094 401155 404155 407339
60555 407339 410632 413576 415935 418166 420851 423889 426866 430108 434615 440849 448276 456324 465135 474999
60541 474999 485724 497057 509373 523447 539768 558509 579945 604484 632386 663817 699207
60530 699207 739279 784686 835807 892823 955924 1025419 1101555 1183918 1270719 1358658 1443598
60519 1443598 1521436 1588633 1642401 1680825 1702975 1709032 1700505 1680138 1651065 1615644 1575204 1530924
60507 1530924 1484709 1438934 1395604 1355940 1320555 1289639 1263054 1240711 1223024 1210821 1204734
60496 1204734 1204872 1211254 1224399 1245304 1274848 1313398 1360889 1416880 1480211 1548666 1619244 1688822
60484 1688822 1754425 1813087 1862123 1900101 1927618 1947108 1962031 1976217 1993273 2015833 2045209
60473 2045209 2082119 2127783 2184016 2252363 2333854 2430001 2543705 2678622 2837696 3022572
60463 3022572 3234261 3473618 3740377 4031228 4338325 4649079 4947164 5214339 5432662
60454 5432662 5586540 5664211 5658919 5570167 5404456 5174217 4894928 4582302 4251068 3914690
60444 3914690 3584588 3269154 2973914 2702574 2457327 2238214 2043320 1870393 1718064
60435 1718064 1585259 1470016 1369571 1281395 1203650 1134896 1073921 1019884 972131 929802 891844
60424 891844 857413 826037 797409 771265 747452 726031 707278 691500 678606 667873 658468 650213
60412 650213 643468 638254 634128 631055 629614 629880 630789 631259 631427 632102 633476 635191 637234 639845 642689
60397 642689 645029 646677 648020 649168 649747 649446 647996 644767 639390 632899 627301 623672 621339 619156 616805
60382 616805 614557 612543 610769 609272 607834 606036 603953 602194 600856 599025 595901 591960 588375 585548
60368 585548 582733 578997 574093 568496 562917 557733 552631 546825 539727 531342 522058 512322 502585 493218
60354 493218 484420 476385 469490 463838 458678 452899 446238 439444 433112 427017 420910 415289 410849 407628
60340 407628 405193 403291 401859 400802 400189 400295 401033 401746 402073 402570 403891 405707 407170 408184 409415 411090
60324 411090 412503 412888 412293 411470 411247 411978 413153 413536 412180 409439 406669 404872 403933 403171 402178 400920
60308 400920 399378 397422 395015 392348 389830 387909 386818 386497 386833 387852 389557 391605 393375 394363 394466
60293 394466 393976 393446 393457 394257 395590 396950 398061 399069 400364 402201 404438 406685 408889 411700 415939
60278 415939 421658 428059 434446 440887 447791 455279 463284 471934 481421 491633 502245 513002 523681
60265 523681 534008 543900 553562 563134 572468 581540 590632 599776 608369 615901 622755 629743 637130 644738
60251 644738 652763 661658 671310 681190 691497 703389 717739 734283 752290 771504 792070 814021
60239 814021 837305 862035 888281 915903 944913 975731 1008690 1043466 1079297 1115586 1152026
60228 1152026 1188408 1224656 1260797 1296444 1330501 1361922 1390722 1417698 1443097 1466125 1486022
60217 1486022 1503070 1518098 1531352 1542464 1551398 1558780 1565092 1570053 1573185 1574702 1575427 1575974 1576466 1577020
60203 1577020 1578057 1580013 1583155 1587947 1595256 1605754 1619249 1635047 1652997 1673749 1697764 1724357
60191 1724357 1751998 1779439 1806193 1831908 1855645 1876142 1892654 1905199 1913913 1918494 1918439 1913513
60179 1913513 1903628 1888465 1867690 1841587 1811159 1777548 1741641 1704245 1666249 1628527 1592041
60168 1592041 1558052 1527715 1501224 1477889 1457414 1440644 1428522 1420772 1416289 1414596 1416139 1421127
60156 1421127 1428762 1437836 1447523 1457316 1466660 1475019 1482054 1487424 1490636 1491392 1490028 1487439 1484620 1482286
60142 1482286 1480758 1480140 1480811 1483878 1490923 1503230 1521458 1546047 1577443 1615566 1659441 1707809 1759960
60129 1759960 1815431 1873080 1931128 1988377 2044940 2101588 2158845 2217068 2276939 2339217 2403999
60118 2403999 2470675 2538564 2607092 2675263 2741386 2803541 2860050 2909420 2950322 2982017 3004533
60107 3004533 3018049 3022270 3016757 3001642 2977572 2945044 2904237 2855514 2799680 2737657 2670231 2598283
60095 2598283 2523088 2446318 2369855 2295466 2224384 2157202 2094426 2037033 1986235 1942878 1907466
60084 1907466 1880604 1862801 1853841 1852966 1859823 1874615 1897123 1926151 1960226 1998369 2039876 2083911
60072 2083911 2129712 2176653 2223616 2268748 2310474 2348449 2383005 2413817 2439606 2458882 2470473
60061 2470473 2473549 2467738 2453211 2430305 2399214 2360444 2315274 2265277 2211566 2155119 2097630 2041311
60049 2041311 1987776 1937644 1891351 1849742 1813718 1783800 1760350 1743821 1734549 1732365 1736527 1745853
60037 1745853 1759004 1774904 1792930 1812527 1832803 1852773 1871784 1889239 1904065 1915039 1921654
60026 1921654 1924138 1922579 1916532 1905607 1889939 1869959 1846149 1819219 1790043 1759235 1727191 1694695
60014 1694695 1663006 1633056 1605005 1578880 1555229 1534746 1517594 1503581 1492822 1485793 1482856 1484084
60002 1484084 1489505 1499212 1513244 1531646 1554671 1582696 1615806 1653476 1694664 1738181 1783026 1828427
59990 1828427 1873503 1916914 1956977 1992227 2021878 2045827 2064325 2077520 2085123 2086471 2081105 2069251
59978 2069251 2051623 2028888 2001585 1970514 1936901 1902135 1867594 1834708 1804883 1779163 1758097
59967 1758097 1741884 1730478 1723696 1721554 1724520 1733077 1746990 1765208 1786420 1809450 1833326 1857512
59955 1857512 1881998 1906655 1930519 1952301 1971648 1989166 2005014 2018294 2028251 2035380 2040738 2044753
59943 2044753 2047351 2048792 2049508 2049391 2048086 2046042 2044580 2044890 2047634 2053664 2064435 2081250 2104528 2134237
59929 2134237 2170843 2215326 2268305 2329528 2398345 2474314 2557020 2645376 2737517 2831510 2925772
59918 2925772 3018477 3106860 3187586 3257697 3314724 3356129 3379576 3384181 3370968 3341799 3298427
59907 3298427 3242932 3178389 3108276 3035425 2962050 2890443 2822887 2760979 2705725 2658271 2619932
59896 2619932 2591483 2573068 2564919 2567632 2581577 2606578 2642374 2688888 2745627 2811135 2883209 2959248
59884 2959248 3036017 3109432 3175273 3230394 3273298 3303726 3321888 3327953 3321993 3304308 3275715 3237345
59872 3237345 3190161 3134864 3072351 3004012 2931445 2856115 2779479 2703223 2629197 2559192 2494905
59861 2494905 2437777 2388544 2347201 2313829 2289497 2275888 2273939 2283107 2302059 2329744 2365619 2409209
59849 2409209 2459809 2516467 2577765 2641356 2703825 2761111 2809238 2844981 2866306 2872489 2863910 2841810
59837 2841810 2808219 2765781 2717158 2664345 2608563 2550654 2491259 2430621 2368711 2305884 2243266
59826 2243266 2182278 2124041 2069555 2020245 1977841 1943552 1917419 1898195 1883510 1870338 1856044
59815 1856044 1839468 1821041 1801915 1783169 1765659 1749957 1735961 1722746 1709088 1694189 1677980
59804 1677980 1661037 1644396 1629334 1617140 1609146 1606846 1611665 1624502 1645791 1676084 1716175 1766404
59792 1766404 1826178 1894512 1970670 2053740 2141435 2229438 2311778 2381845 2433774 2463917 2471592
59781 2471592 2458459 2427349 2381747 2325814 2263821 2199077 2133622 2069117 2007604 1951041 1900411
59770 1900411 1855681 1816598 1783213 1755642 1733640 1716583 1703808 1694895 1689705 1688193 1690225 1695552
59758 1695552 1703954 1715365 1729775 1747030 1766796 1788770 1812964 1839802 1869983 1904224 1942984
59747 1942984 1986293 2033906 2085812 2142700 2205777 2275967 2353359 2437559 2528423 2626200 2730999
59736 2730999 2842463 2959955 3082694 3209407 3337996 3465800 3590165 3708723 3819452
59727 3819452 3920960 4012961 4096445 4173364 4246123 4317215 4389049 4463867 4543609 4629639 4722468
59716 4722468 4821728 4926382 5034869 5145189 5255204 5363037 5467043 5565255 5655146 5734309
59706 5734309 5801413 5856303 5899330 5930950 5952103 5964638 5971078 5974078 5976270 5980475 5989685 6006648
59694 6006648 6033560 6072205 6124181 6190864 6273328 6372523 6489386 6624299 6776280 6942965
59684 6942965 7121493 7309041 7502231 7696285 7885125 8062110 8220357 8352747 8452536 8514416
59674 8514416 8535014 8512710 8447745 8342782 8202826 8034121 7843140 7636471 7420764 7201780
59664 7201780 6983128 6765832 6548820 6329758 6106088 5876289 5640686 5401185 5160382
59655 5160382 4920991 4685695 4456920 4236463 4025422 3824466 3634011 3454169 3284775
59646 3284775 3125657 2976886 2838697 2711085 2593499 2485133 2385607 2295097 2213538 2140005
59636 2140005 2073315 2013139 1959878 1913478 1873021 1837604 1806930 1780724 1758265 1738902 1722360
59625 1722360 1707906 1693853 1678771 1662793 1646918 1631305 1615209 1598376 1581381 1564366 1546488
59614 1546488 1527139 1506987 1487139 1467778 1448266 1428346 1408634 1389984 1372800 1357076 1342698
59603 1342698 1329449 1316817 1304109 1291034 1278178 1266641 1257018 1248896 1241510 1234671 1228728 1223922
59591 1223922 1220292 1218097 1217729 1219042 1221259 1223749 1226584 1230210 1234933 1240956 1248520 1257768 1268676 1281296
59577 1281296 1295863 1312478 1330981 1351289 1373569 1397869 1423896 1451455 1480821 1512364 1546040
59566 1546040 1581643 1619409 1659920 1703479 1749959 1799290 1851633 1906945 1964692 2024292 2085656
59555 2085656 2148976 2214009 2279751 2344896 2408429 2469714 2528167 2583012 2633113 2676554 2710305
59544 2710305 2730927 2736401 2727438 2706758 2677057 2639942 2596652 2549043 2499371 2449446 2400562 2354072
59532 2354072 2311485 2273874 2241723 2215705 2197335 2188439 2189968 2201568 2222373 2252010 2290691 2338439
59520 2338439 2394363 2456562 2522537 2589571 2654763 2714878 2766396 2806050 2831547 2841791 2836365
59509 2836365 2814956 2777504 2724884 2659167 2583134 2499617 2411265 2320555 2229770 2140972 2056077
59498 2056077 1976783 1904350 1839507 1782534 1733304 1691294 1655997 1627497 1606364 1592788 1586116
59487 1586116 1585477 1590615 1601809 1619213 1642542 1671239 1704595 1741855 1782465 1826012 1871574 1917346
59475 1917346 1961332 2002293 2039574 2072077 2097889 2115086 2122573 2120135 2108016 2086632 2056458 2018103
59463 2018103 1972541 1921153 1865354 1806307 1745216 1683603 1622828 1563462 1505614 1449800 1397019
59452 1397019 1347939 1302552 1260633 1222044 1186457 1153409 1122894 1095508 1071751 1051530 1034484
59441 1034484 1020387 1008960 999714 992353 987056 984137 983687 985762 990491 997666 1006574 1016674 1028256
59428 1028256 1042056 1058437 1077318 1098683 1122539 1148142 1173619 1196714 1216101 1232106 1246260
59417 1246260 1260146 1274656 1290289 1307875 1328646 1353599 1382972 1416100 1451257 1485753 1517104
59406 1517104 1544723 1570284 1596139 1623685 1653352 1685513 1720781 1759749 1803021 1851386 1905412
59395 1905412 1964952 2029481 2098858 2173303 2252606 2335779 2421668 2509730 2600182 2693612 2790478
59384 2790478 2890918 2995128 3103960 3218899 3341245 3471532 3609782 3755831 3908911
59375 3908911 4067155 4227938 4388471 4545739 4696402 4837654 4968182 5087654 5195385
59366 5195385 5290295 5372204 5442194 5501242 5549168 5585340 5609622 5621890 5621015 5605078 5572428 5522002
59354 5522002 5452866 5364345 5256830 5131979 4992049 4839533 4677677 4510793 4343490 4179463
59344 4179463 4021086 3869925 3727386 3594796 3472940 3361511 3259146 3164260 3075965 2994127
59334 2994127 2918694 2849345 2785876 2728416 2676871 2630365 2587678 2548058 2511236 2476728 2443669
59323 2443669 2411379 2379583 2347872 2315432 2281694 2246930 2211757 2176206 2139708 2101990 2063643
59312 2063643 2025806 1989460 1954986 1922148 1890565 1860397 1832486 1807560 1785418 1765275 1746858
59301 1746858 1730757 1717632 1707471 1699792 1694272 1691027 1690571 1693611 1700553 1710990 1723933 1738764 1755711
59288 1755711 1775188 1796933 1820032 1843538 1866683 1888693 1908804 1926406 1940872 1951358 1957181
59277 1957181 1958457 1956058 1950851 1943294 1933896 1923727 1914123 1906039 1900017 1896752 1897205 1901566 1907858 1911803
59263 1911803 1908609 1895465 1872683 1842738 1808479 1772181 1735702 1700699 1668316 1638953 1612815
59252 1612815 1590702 1573884 1563026 1557494 1556086 1558327 1564667 1575431 1590112 1607984 1629025 1653729
59240 1653729 1682235 1714230 1749745 1789540 1834402 1884427 1939242 1998812 2063790 2135182 2213791
59229 2213791 2299823 2392851 2492187 2597405 2708423 2825007 2946245 3070561 3196125 3321079
59219 3321079 3443343 3560180 3668016 3762827 3841000 3899955 3938072 3954270 3947922 3919167 3869170
59208 3869170 3800164 3715403 3618838 3514339 3405056 3293673 3183143 3076699 2976919 2885090
59198 2885090 2801598 2726710 2660812 2604135 2556445 2516936 2484444 2457996 2437191 2421819 2411143
59187 2411143 2403854 2398645 2394331 2389360 2381918 2370980 2356856 2340282 2321348 2299827 2276227 2251861
59175 2251861 2227901 2204839 2182836 2162042 2142351 2123249 2104197 2085062 2066035 2047262 2028684
59164 2028684 2010077 1991078 1971147 1949678 1926334 1901352 1875456 1849404 1823595 1798096 1772807
59153 1772807 1747537 1722208 1697375 1674359 1654424 1637797 1623830 1612063 1602665 1595789 1591079 1587968
59141 1587968 1585981 1584531 1582952 1581175 1579908 1579744 1580318 1580746 1580546 1579752 1578451 1576766 1575111 1573937 1573288
59126 1573288 1572986 1573152 1574156 1576168 1579271 1584017 1591405 1602102 1615858 1631643 1648136 1664123 1678828
59113 1678828 1692032 1703793 1714016 1722386 1728635 1732682 1734553 1734324 1732189 1728505 1723812 1718786 1714015
59100 1714015 1709713 1705839 1702493 1699930 1698108 1696622 1695299 1694494 1694469 1694627 1693625 1690026 1682747 1671314 1656061
59085 1656061 1637762 1616654 1592094 1563577 1531755 1498018 1463373 1428317 1393569 1360083 1328293
59074 1328293 1297953 1268942 1241719 1216754 1193918 1172697 1152754 1134077 1116789 1101025 1086897
59063 1086897 1074485 1063915 1055491 1049638 1046690 1046707 1049398 1054124 1060046 1066272 1071795 1075372 1075843 1072752
59049 1072752 1066441 1057547 1046724 1034913 1023285 1012610 1003006 994599 988017 983915 982477 983720 987811
59036 987811 994536 1002865 1011536 1019764 1026966 1032425 1035977 1038657 1041850 1046072 1051281 1058064 1067532 1080189
59022 1080189 1095831 1114554 1136956 1163178 1192556 1224414 1258455 1294184 1330667 1367085 1402874
59011 1402874 1437038 1467982 1494335 1515408 1530535 1538566 1538468 1530102 1514219 1492112 1465498 1436297
58999 1436297 1406111 1376049 1347038 1319953 1295381 1273670 1255258 1240472 1228979 1219931 1212715 1207006
58987 1207006 1202055 1196693 1190375 1183609 1176999 1170405 1163405 1156078 1148872 1142113 1136133 1131619 1129373 1129776
58973 1129776 1132674 1137632 1144208 1152228 1161912 1173492 1186614 1200377 1213910 1226645 1238142 1248203
58961 1248203 1257120 1265208 1272077 1276975 1279962 1282076 1284111 1285994 1287616 1289593 1292719 1297199 1302882 1309866
58947 1309866 1318503 1329254 1342701 1359225 1378396 1399401 1422366 1448458 1478074 1509527 1540162
58936 1540162 1568214 1593000 1614001 1630829 1643999 1654919 1665089 1675714 1687864 1702416 1719872
58925 1719872 1740655 1765433 1794829 1829073 1868382 1913325 1964379 2021481 2084642 2154754 2233121
58914 2233121 2320348 2416329 2521153 2635285 2758698 2890361 3028637 3171685 3317423 3463625
58904 3463625 3608383 3750290 3888227 4021254 4148680 4269858 4383751 4488893 4583843 4667495
58894 4667495 4738875 4796657 4838734 4862229 4864312 4843387 4799513 4733800 4647895 4544219 4426000
58883 4426000 4296253 4156996 4009987 3857886 3703820 3549753 3396082 3243117 3092366
58874 3092366 2946057 2805860 2672469 2546096 2426820 2314493 2208769 2109513 2017111 1932168
58864 1932168 1854805 1784350 1719817 1660626 1606667 1557819 1513708 1473995 1438551 1407195 1379478
58853 1379478 1354913 1333245 1314486 1298877 1286792 1278334 1273003 1270110 1269536 1271563 1275875 1281398 1287419
58840 1287419 1294386 1303246 1314435 1327912 1343625 1361468 1381149 1402677 1426679 1453752 1483762 1516181
58828 1516181 1550809 1587635 1626347 1666571 1708411 1752179 1797690 1844389 1892201 1941893 1994624
58817 1994624 2051482 2113324 2180762 2254326 2334810 2423183 2519934 2624772 2737133 2856579 2982396
58806 2982396 3113224 3247384 3383031 3517595 3647746 3770495 3883769 3985305 4071742 4139815
58796 4139815 4187934 4215633 4222034 4206297 4169530 4115012 4046321 3966274 3877716 3784072 3688530
58785 3688530 3593514 3501334 3414534 3334991 3263061 3197645 3136181 3074229 3006108 2927164 2835801
58774 2835801 2733557 2623873 2510801 2397840 2287131 2179858 2077574 1982543 1896556 1820035
58764 1820035 1752719 1694663 1646055 1606627 1575881 1553593 1539607 1533418 1534420 1542300 1556761 1577140
58752 1577140 1602690 1632894 1667014 1703622 1741058 1778098 1813629 1845948 1873126 1894083 1908780
58741 1908780 1917312 1919281 1914099 1901444 1881318 1854202 1821429 1784992 1746623 1707115 1666715 1625860
58729 1625860 1585142 1544618 1503640 1461600 1418736 1375991 1334182 1293494 1253803 1215262 1178428
58718 1178428 1144001 1112650 1085068 1061939 1043702 1030298 1021122 1015176 1011297 1008316 1004911 999414
58706 999414 990142 976292 958473 938154 916556 894208 871408 848809 827407 808187 791834 778720
58694 778720 769059 763052 760847 762369 767316 775300 785855 798198 811296 824375 837281 850255 863663
58681 863663 878110 894483 913385 934621 957610 982246 1009064 1038706 1071633 1108375 1149593
58670 1149593 1195642 1246063 1299143 1351390 1397312 1430357 1445011 1438745 1412580 1370135 1315979
58659 1315979 1254279 1188404 1121274 1055600 993582 936575 885339 840393 801862 769116 741052
58648 741052 716863 696415 679842 666923 656898 648845 642264 637275 634060 632108 630356 628162 625856
58635 625856 624110 623079 622437 622030 622237 623805 627443 633284 640641 648676 657441 667824 680353 694677
58621 694677 710545 728563 749385 772744 797949 824927 854089 885590 919401 955734 994653
58610 994653 1035629 1078260 1122986 1170131 1218458 1265721 1310584 1352964 1392438 1427347 1455863
58599 1455863 1477186 1491327 1498367 1498271 1491100 1477279 1457986 1435186 1410787 1385867 1361182 1338118
58587 1338118 1318346 1302723 1291387 1284860 1284012 1288895 1298558 1312263 1330033 1351842 1377247 1406114
58575 1406114 1438667 1474229 1510658 1545611 1577710 1605933 1628390 1642344 1645234 1635589 1613545 1580933
58563 1580933 1540457 1494416 1444451 1392391 1340618 1291321 1245961 1205499 1170203 1138765 1108443
58552 1108443 1076773 1042861 1006808 968760 929163 889303 850676 813997 779285 746671 716587
58541 716587 689410 665317 644300 626020 609946 595896 584129 574569 566316 558362 550551 543490
58529 543490 537654 532933 528942 525571 523230 522537 523638 526024 529282 533751 539938 547584 556096 565754
58515 565754 577496 591326 605926 620232 634564 649671 665423 681063 696236 711115 725932
58504 725932 740936 756564 773208 791030 810232 831104 853493 876580 899417 921348 941700
58493 941700 959550 974061 984743 991223 993134 990363 982919 970468 952564 929526 902669 873540
58481 873540 843423 813453 784440 756450 729320 703729 680948 661351 643944 627656 612291
58470 612291 598088 585323 574629 566640 560839 555730 550664 546537 544104 542600 540828 538767 537216
58457 537216 536466 536108 535602 534379 531940 528505 525097 522462 520428 518702 517494 516826 516052 514724 513211
58442 513211 511843 510241 508190 506380 505456 505038 504450 503690 502917 501746 500027 498698 498876 500505 502665 504741
58426 504741 506565 507993 509180 510856 513543 516962 520776 525309 530840 536788 542295 547031 550847 553441
58412 553441 555130 557152 560336 564157 567873 571786 576492 581857 587759 594977 604160 614672 625711 637838
58398 637838 652072 667928 683482 696753 705942 709232 706123 698669 689949 681425 672978 665000 658875
58385 658875 655527 654910 656954 661691 668371 675649 682829 690042 697191 703679 709138 713580 716917 719141
58371 719141 720789 722446 724058 725471 727128 729349 731455 732742 733872 736164 739841 744093 748498 753173
58357 753173 757896 762348 767033 772721 779133 785312 791175 797574 804932 812812 820739 828499 835846 842849
58343 842849 850223 858416 866828 874901 883461 893767 905669 917900 929825 941714 953798 966346
58331 966346 980279 996354 1013962 1031843 1049587 1067351 1084734 1101272 1117436 1133604 1148612
58320 1148612 1160869 1170529 1179107 1187427 1195499 1203854 1213201 1223067 1232434 1241449 1250983 1261008 1271180
58307 1271180 1282533 1296597 1313072 1330269 1347677 1366226 1386255 1407176 1429070 1452731 1478167
58296 1478167 1504878 1533557 1565651 1601333 1639722 1680923 1725943 1774708 1826222 1880671 1939401
58285 1939401 2002769 2069862 2140223 2213810 2289261 2364123 2436734 2506006 2569696 2625153 2671767
58274 2671767 2710578 2741643 2764004 2778173 2786360 2790264 2790870 2790226 2791065 2794692 2801510 2813346 2832746
58261 2832746 2860021 2893499 2932527 2977709 3028470 3083262 3142060 3206019 3274934 3347885 3425960
58250 3425960 3511042 3602171 3696533 3794079 3897655 4008591 4125722 4248898 4379703 4518334
58240 4518334 4663390 4815204 4975878 5145794 5323701 5510388 5708439 5918212 6138086
58231 6138086 6368883 6613929 6874629 7150386 7443194 7757825 8097159 8461808 8854520
58222 8854520 9280249 9741912 10241052 10782712 11374453 12020831 12724625 13493340 14338725
58213 14338725 15270574 16297964 17436592 18708401 20135137 21740696 23559877 25637469
58205 25637469 28020646 30762579 33933504 37618987 41909325 46902609 52717764 59493646
58197 59493646 67377987 76528459 87115473 99304030 113242865 129104177 147135398
58190 147135398 167630807 190797824 216544245 244158866 271916129 296938527 315785531
58183 315785531 325729768 325901049 317407157 302423884 283113344 261132595 237725389
58176 237725389 213936029 190675092 168688125 148521337 130494340 114696693 101042883
58169 101042883 89357102 79425607 71017627 63914843 57940164 52951901 48823238 45447922
58161 45447922 42756379 40705236 39257885 38389426 38092988 38358070 39159405 40496089 42431192
58152 42431192 45067407 48488632 52711963 57592817 62652141 67011510 69672081 70031847
58144 70031847 68192739 64772481 60444873 55648374 50613285 45509799 40514486 35792409
58136 35792409 31473453 27641429 24323191 21491833 19093270 17070940 15369651 13934233
58128 13934233 12717271 11683782 10803631 10045435 9381861 8794753 8270861 7796877 7361411
58119 7361411 6957331 6579569 6224236 5891221 5583477 5301956 5044306 4808996 4596843
58110 4596843 4407775 4239905 4092462 3965761 3857115 3759922 3667642 3575966 3481207 3380254
58100 3380254 3273038 3162136 3049190 2934139 2818102 2704140 2594691 2490614 2392825 2302302
58090 2302302 2218465 2140051 2067559 2002194 1942592 1885475 1829678 1776694 1727058 1679126 1632003
58079 1632003 1586884 1544683 1504720 1466551 1430860 1397700 1365842 1334610 1304683 1276536 1249804
58068 1249804 1224554 1201339 1179582 1157752 1135629 1114688 1095733 1077901 1060462 1043812 1027957
58057 1027957 1011702 994271 976467 959488 943689 929054 915758 903611 891948 880550 869861
58046 869861 860050 850793 842182 834814 828674 822909 816970 811109 805574 800173 794812 789549 784054 777814
58032 777814 771000 764329 758065 751990 746188 740939 735945 730725 725790 722385 721030 721313 723095 726849
58018 726849 732680 740042 748691 759106 771808 786989 804875 825661 849015 874260 901004 928899
58006 928899 956944 983812 1008759 1031587 1051954 1069524 1084447 1096841 1106038 1111245 1112601 1110646
57994 1110646 1105128 1095489 1082320 1067195 1051262 1035052 1019503 1005991 995405 988208 985152 986764
57982 986764 992365 1000996 1013159 1030151 1051536 1074606 1096534 1115666 1130434 1138549 1138062 1128411 1109994
57969 1109994 1083645 1050880 1013762 974137 933542 893816 856745 823020 792509 765650 743464
57958 743464 726085 712507 702104 695245 692043 691657 693297 697008 703012 711313 722224 736190 752600
57945 752600 769878 787306 805715 825785 846668 867005 886378 904912 922116 936813 947670
57934 947670 953271 952334 944481 930299 910275 884339 852816 817108 778924 739555 700267 662587
57922 662587 627543 595211 565511 538795 515237 494427 476185 461052 449352 440401 433219 427421
57910 427421 422852 419110 416131 414507 414439 414925 414812 414130 413535 412855 411132 407934 403768 399261 394574 389671
57894 389671 384583 379295 373591 367119 359634 351461 343710 337500 332839 328719 324510 320614 317587 315416
57880 315416 314105 314140 315731 318180 320701 323421 326954 331467 336795 343038 350269 357880 364862 370615 375107
57865 375107 378515 381091 383052 384155 383679 381197 377016 371562 364917 357398 349887 342923 335987 328453
57851 328453 320806 314160 308869 304437 300572 297547 295607 294780 295214 297127 300404 304687 309731 315260 320693
57836 320693 325539 329887 333974 337516 339981 341331 341918 341770 340589 338340 335318 331759 327858 324057 320814
57821 320814 318175 316000 314417 313638 313611 314365 316488 320661 326925 334949 344792 356771 370836 386771
57807 386771 404857 425591 448836 473946 500630 528930 558441 588429 618668 649108 678391
57796 678391 703621 722231 733586 738473 737736 731956 721839 708132 691273 671635 650003 627354
57784 627354 604207 580563 556472 532336 508503 484886 461294 438143 416465 396951 379213
57773 379213 362394 346451 332274 320469 310641 302111 294707 288370 282612 277035 271953 267825 264408
57760 264408 261288 258921 258266 259427 261497 263763 266320 269451 273176 277512 282489 287718 292565 296818
57746 296818 300495 303009 303462 302055 300313 299408 298917 297745 295650 293266 291207 289789 289285 289802 291055
57731 291055 292718 294891 297834 301448 305317 309112 312700 316134 319816 324403 330167 336650 343222 349793
57717 349793 356680 364045 371887 380481 390367 401809 414441 427535 440634 454059 468841 485905
57705 485905 505117 525280 545168 564437 583493 602795 622461 642357 662422 683112 705570
57694 705570 731123 760367 792977 828422 866414 906456 947454 988304 1028672 1068680 1107756
57683 1107756 1144162 1175905 1202161 1223940 1243465 1262919 1283841 1307614 1336089 1371269 1414702
57672 1414702 1467917 1533540 1615321 1716690 1839148 1980650 2132815 2278369 2393430 2456332
57662 2456332 2457214 2400466 2299058 2167160 2016729 1857696 1698415 1545224 1402193 1271700
57652 1271700 1155167 1053394 966554 894076 834603 786214 746946 715291 690369 671735 659052
57641 659052 651821 649363 650990 656185 664654 676339 691365 709841 731637 756389 783683 813045
57629 813045 843780 875064 906209 936583 965201 990662 1011563 1026681 1034812 1035075 1027706 1014065
57617 1014065 995380 971855 943426 910927 875888 839529 802662 766323 731557 698498 666508
57606 666508 635445 606146 579426 555328 533639 514384 497245 481190 465496 450776 438159
57595 438159 427623 417949 408261 398771 389849 381167 372266 363384 355114 347541 340320 333376 326949 320994
57581 320994 315197 309750 305468 302816 301257 299979 298845 298084 297365 295993 294022 292417 291788 291554 290875
57566 290875 289985 289979 291401 293609 295608 297100 298551 300555 303328 306639 310071 313326 316396 319468 322806
57551 322806 326850 332233 339343 347854 357026 366673 377550 390525 405626 422217 440012 459448 481016
57538 481016 504660 530079 557207 585910 615416 644549 672547 699170 723909 745582 762984
57527 762984 775551 783065 785116 781306 771782 757178 738279 716197 692549 668779 645253 621561
57515 621561 597695 574361 552172 531250 511788 494284 478810 464703 451415 439239 428711
57504 428711 419702 411683 404594 398801 394258 390260 386180 382161 378990 377370 377256 377870 378533 379481 381631
57489 381631 385469 390511 395980 401585 407501 414086 421944 431775 443765 457493 472794 490191 510027
57476 510027 531724 554519 578409 603531 628983 653245 675581 696059 714094 727952 736028 738016
57464 738016 734534 726254 713658 697109 676754 652732 625800 597454 569135 541444 514199 487080
57452 487080 460254 434608 411335 390959 372880 356163 340590 326478 313748 301924 290977
57441 290977 281362 273037 265200 257311 249752 243148 237570 232724 228406 224453 220703 217318 214687 212699
57427 212699 210564 207667 204232 200878 197959 195627 194043 193180 192752 192609 192745 192754 191952 190453 189416 189680
57411 189680 190732 191638 192391 193498 194773 195517 195743 196212 197235 198235 198690 198914 199686 201553 204613 208497
57395 208497 212486 216015 219139 222233 225315 228084 230542 233039 235623 237855 239438 240653 242016 243801
57381 243801 246070 248856 252127 255710 259377 262917 266216 269439 272995 277051 281178 284823 288092 291622
57367 291622 295700 299812 303208 305601 307294 308870 310834 313256 315721 317787 319466 320985 322192 322669
57353 322669 322458 322189 322361 322872 323417 323995 324777 325762 326803 327729 328324 328435 328331 328706 330104 332521 335734
57336 335734 339755 344681 350272 356060 361839 367826 374273 381081 387894 394521 401207 408415 416240 424152
57322 424152 431547 438503 445708 453536 461508 468915 475796 482955 491047 499945 509122 518425 528286 539164
57308 539164 550989 563216 575343 587194 598718 609760 620182 630103 639822 649489 658935 667736
57296 667736 675371 681437 685940 689344 692140 694447 696183 697463 698537 699442 700074 700673 701833 703843 706324
57281 706324 708766 711208 714155 717949 722488 727513 732862 738409 743993 749608 755578 762426 770432 779337
57267 779337 788468 797191 805271 812977 820921 829699 839434 849587 859398 868649 877856 887669 898220 909198
57253 909198 920360 931753 943563 955972 969009 982358 995394 1007705 1019536 1031550 1044241
57242 1044241 1057802 1072388 1088059 1104471 1120936 1136954 1152518 1167934 1183613 1200009 1217463
57231 1217463 1235979 1255332 1275377 1296051 1317131 1338396 1360079 1382738 1406559 1431107 1455936
57220 1455936 1481082 1506681 1532404 1557671 1582296 1606660 1631266 1656377 1682044 1708299 1735296
57209 1735296 1763315 1792530 1822600 1852664 1881957 1910534 1939264 1969012 1999872 2031225 2062469
57198 2062469 2093651 2125354 2158030 2191526 2225276 2258892 2292523 2326691 2361756 2397417 2432702
57187 2432702 2466629 2499062 2530842 2563078 2596461 2631295 2667798 2706143 2746515 2789458 2835909
57176 2835909 2886367 2940144 2995729 3051699 3106828 3159664 3208910 3254541 3297983 3340888 3384008
57165 3384008 3427277 3470284 3512270 3552111 3588900 3622459 3653023 3680558 3704613 3724704 3740639
57154 3740639 3752642 3761371 3767645 3771955 3774369 3775040 3774621 3774052 3774068 3774966 3776624 3778562 3780195 3781196 3781538
57139 3781538 3781158 3779830 3777443 3774118 3769879 3764414 3757304 3748344 3737588 3725286 3711810 3697342 3681631
57126 3681631 3664378 3645929 3627278 3609470 3593541 3581058 3573998 3573690 3580333 3593776 3614097 3640877
57114 3640877 3672393 3706345 3741399 3777942 3818003 3865223 3924754 4002414 4103613 4233082 4395310
57103 4395310 4595098 4838302 5133004 5490164 5922962 6445672 7073239 7821124 8704089
57094 8704089 9733722 10914978 12241742 13692759 15232348 16819834 18425261 20042258
57086 20042258 21688546 23391903 25169323 27013079 28893351 30774006 32626991 34433563
57078 34433563 36174712 37822334 39337702 40673948 41777496 42588951 43046841 43095292 42694277
57069 42694277 41830392 40524831 38833959 36840720 34640671 32328677 29989470 27692098
57061 27692098 25487820 23411092 21482315 19710617 18096311 16633604 15313357 14125059
57053 14125059 13057764 12100465 11242286 10472601 9781290 9159075 8597517 8088706 7625197
57044 7625197 7200369 6808557 6444771 6104651 5784861 5483104 5197390 4925563 4665760
57035 4665760 4417018 4179093 3951942 3735675 3530715 3337528 3156256 2986911 2829761
57026 2829761 2685209 2553298 2433587 2325430 2228273 2141786 2065894 2000557 1945408 1899721
57016 1899721 1862764 1833949 1812676 1798455 1791337 1791754 1799727 1814592 1835775 1863482 1898519 1941870
57004 1941870 1994631 2057842 2132203 2218552 2318761 2435282 2569570 2722057 2894526 3092025
56994 3092025 3322468 3595283 3918226 4287900 4676136 5027172 5277993 5390919 5370476 5250507
56984 5250507 5067219 4843507 4591526 4321311 4044214 3771585 3513214 3276358 3064662
56975 3064662 2878078 2714583 2572036 2448550 2342057 2250256 2170859 2101659 2040640 1986237
56965 1986237 1937359 1893251 1853600 1818547 1788065 1761414 1737722 1716959 1699547 1684872 1670804
56954 1670804 1654884 1635501 1611960 1584274 1553336 1520704 1487738 1455197 1423869 1394949 1369351
56943 1369351 1347087 1327852 1311936 1300044 1292426 1288628 1288042 1290438 1296038 1305350 1318822 1336412 1357316
56930 1357316 1379879 1401434 1418483 1427859 1428312 1420825 1407294 1389229 1367715 1343845 1318564 1292466
56918 1292466 1266207 1240908 1217718 1197120 1178939 1162680 1147612 1132973 1118557 1104813 1092042
56907 1092042 1079958 1068425 1058084 1049497 1042064 1034482 1026053 1016939 1007511 998259 990038 983469 978136
56894 978136 973216 968813 965828 964605 964752 966399 970466 977247 985555 993709 1000547 1005104 1006284 1003655
56880 1003655 997995 990378 981157 970343 958390 946019 933801 922568 913678 908036 905228 904451 906014
56867 906014 911066 920035 932308 947545 966423 989727 1017294 1048037 1080292 1111563 1138375 1157164
56855 1157164 1165707 1163833 1153057 1135703 1114179 1090596 1066663 1043747 1023000 1005504 992284 984097
56843 984097 981249 983858 992301 1007142 1028556 1056147 1089549 1128982 1174874 1226842 1282765 1338317
56831 1338317 1387327 1423360 1441999 1442186 1425733 1395977 1356785 1311924 1264446 1216598 1170463 1128289
56819 1128289 1091781 1061522 1037595 1020500 1010777 1008032 1011136 1019455 1033286 1053059 1078727 1109877
56807 1109877 1145404 1182416 1215954 1240573 1252426 1250078 1234039 1206249 1169860 1128652 1085921
56796 1085921 1043737 1003262 965608 932081 903447 879379 859121 842674 830859 824132 821907 823369
56784 823369 828452 837548 850479 866079 882304 896355 905190 906852 901308 889549 872175 849501
56772 849501 822718 793888 764664 735805 708056 682560 659929 639633 620881 603662 588477
56761 588477 575461 564251 554366 545283 536457 527786 519880 513400 508210 503534 498847 494279 490164 486540
56747 486540 483148 479775 476532 473844 472093 471182 470493 469325 467351 464725 461947 459626 458120 457249 456459
56732 456459 455295 453713 452016 450662 449929 449561 448937 447945 447499 448631 451203 454073 456544 458980 461959
56717 461959 465568 469792 474818 480388 485507 489464 492764 496404 500557 504569 507999 510953 513535 515602
56703 515602 517085 518002 518152 517313 515776 514255 513170 512482 512230 512685 513799 514982 515763 516328 517128 518190
56687 518190 519097 519462 519179 518376 517415 516791 516701 516626 515610 513048 509139 504501 499487 494007 487935 481484 475064
56670 475064 468943 463229 458085 453677 449888 446406 443241 440863 439479 438370 436407 433253 429663 426507
56656 426507 423863 421317 418859 417030 416315 416731 418050 420048 422356 424366 425622 426268 426872 427762 428675 429079
56640 429079 428715 427769 426622 425492 424326 423005 421587 420200 418677 416568 413763 410886 408645 406858 404599
56625 404599 401485 398359 396469 396186 396865 397680 398297 398872 399731 401034 402593 404035 405231 406370 407516 408327
56609 408327 408459 407995 407240 406294 405133 403980 403286 403407 404361 405730 406730 406794 406253 406055 406549 407065 407038 406871
56591 406871 407078 407216 406556 405398 404716 404708 404723 404534 404645 405298 406152 407127 408473 409790 410085 409276 408660 409257 410531
56572 410531 411403 411640 411560 411148 410451 410198 411013 412398 413543 414777 417192 420917 424883 428351 431689 435307
56556 435307 438730 441259 442988 444612 446486 448284 449449 449662 448948 447552 445688 443400 440704 437780 434844
56541 434844 431819 428388 424449 420377 416719 413675 410927 407995 404746 401578 398991 396987 395013 392500
56527 392500 389360 385939 382728 380125 378173 376325 373725 369918 365156 359903 354347 348611 343101 338124
56513 338124 333325 327954 321786 315492 309969 305533 301855 298481 295248 292260 289632 287381 285528 284159
56499 284159 283267 282675 282193 281808 281546 281293 280981 280842 281134 281648 281799 281246 280156 278919 277933 277607 278090 278946
56481 278946 279598 280220 281675 284378 287680 290602 292705 293947 294239 293698 293031 293118 294221 295878 297440 298476
56465 298476 298855 298749 298430 297925 297031 295721 294266 292842 291409 290154 289569 289787 290226 290317 290244 290517 291100 291458
56447 291458 291325 290976 290833 291145 291957 293046 293965 294426 294671 295278 296652 298781 301331 303859 306167 308545
56431 308545 311450 314795 317866 320038 321332 322164 322966 324183 326129 328550 330690 332130 333217 334363 335377
56416 335377 335847 335797 335531 335101 334331 333144 331492 329203 326207 322661 318589 313700 307856 301456 295053 288956
56400 288956 283402 278722 274966 271722 268577 265457 262347 259213 256426 254573 253485 252151 250138 248351
56386 248351 247701 247681 247164 246094 245398 245489 245777 245642 245100 244478 244022 243846 243820 243614 243185 242984 243286 243689 243730 243610
56366 243610 243751 244024 244052 243958 244215 245046 246516 248786 251687 254450 256513 258158 259708 260704 260771 260723 261739
56349 261739 263738 265628 266915 268002 269107 269991 270688 271474 272127 272262 272354 273320 275034 276364 276890 277538 279192
56332 279192 281652 284292 286836 289083 290707 291826 293120 294935 296782 298063 298825 299544 300591 302111 304015
56317 304015 306049 308199 310890 314287 317618 319992 321773 324306 328219 332834 337310 341467 345273 348410
56303 348410 350804 353008 355714 359305 363928 369435 375137 380220 384487 388252 391565 394277 396720 399474
56289 399474 402348 404495 405645 406470 407555 408908 410627 413173 416622 420459 424490 429312 435568 443338
56275 443338 452524 463099 474701 486712 499203 513258 529973 549472 571092 594120 618242 643709
56263 643709 671114 700615 731494 762988 795183 828343 861733 894166 925597 956969 988410
56252 988410 1018760 1047062 1073354 1097728 1119774 1139384 1157010 1172594 1185228 1194402 1200664 1204522
56240 1204522 1205646 1203633 1198611 1190367 1177844 1160377 1138835 1114765 1088833 1060706 1029960 996590
56228 996590 961034 924251 887514 851821 817654 785286 754790 725765 697757 671058 646461
56217 646461 624224 604033 585896 570110 556334 543785 532508 523312 516206 510039 504121 499034
56205 499034 495370 492725 490542 488911 487927 487171 486446 486262 487017 488474 490440 493081 496149 498794 500661
56190 500661 502382 504637 507578 511391 516303 521654 526163 529590 532998 536932 540606 543473 546180 549193
56176 549193 551798 553489 555202 558102 562129 566647 571591 576998 582362 587474 593185 600408 609054 618666
56162 618666 629260 640798 652751 665046 678629 694339 712082 731836 754510 780953 811117
56151 811117 845133 884418 930846 985584 1049483 1123816 1209992 1309396 1424032 1556137 1706308
56140 1706308 1872754 2052594 2242256 2435829 2624814 2801195 2960329 3100680 3222695
56131 3222695 3329135 3424548 3512125 3591323 3659130 3712358 3747997 3763719 3760454 3743421 3718549
56120 3718549 3688087 3650524 3603084 3542387 3464074 3364655 3244184 3106113 2955089 2795996
56110 2795996 2634026 2473718 2318040 2169419 2030814 1904507 1790638 1688262 1597132 1517228
56100 1517228 1447539 1386732 1334224 1289319 1250352 1216064 1186754 1162611 1142061 1123431 1107080
56089 1107080 1094066 1083733 1074557 1066516 1060602 1056705 1053875 1052125 1052170 1053892 1056699 1060704 1065915 1071037
56075 1071037 1074871 1078297 1083200 1090005 1097875 1106485 1115987 1126010 1136312 1147667 1160517 1173700 1186057
56062 1186057 1198224 1211273 1224870 1238607 1253714 1271336 1290371 1309170 1328167 1348563 1369758
56051 1369758 1390555 1411744 1434866 1459460 1484073 1509027 1535526 1563041 1590249 1617761 1647280
56040 1647280 1678956 1712133 1747671 1786754 1828440 1871259 1916129 1964591 2015113 2064344 2111209
56029 2111209 2156598 2200076 2240528 2279457 2319981 2362786 2406386 2451001 2498795 2550545 2605401
56018 2605401 2663720 2726881 2794470 2864776 2937757 3014639 3095262 3178945 3267092 3361613 3461652
56007 3461652 3565364 3673824 3789541 3912293 4040431 4175053 4318446 4469538 4625537
55998 4625537 4787207 4957687 5136974 5322641 5515353 5718437 5932513 6155892 6389936
55989 6389936 6638686 6903446 7183149 7479862 7798552 8141790 8510116 8907054 9338163
55980 9338163 9805994 10311973 10862232 11465223 12124995 12843926 13630886 14499302 15458925
55971 15458925 16518111 17693080 19006331 20477915 22128908 23993170 26116234 28545057
55963 28545057 31331645 34546844 38279382 42623587 47682466 53582441 60471333 68503490
55955 68503490 77839569 88651321 101103769 115343677 131545061 149972691 170959956
55948 170959956 194772860 221399162 250233926 279655017 306793904 328022625 340232352
55941 340232352 342133126 334578209 319736472 299922260 276961346 252219729 226841390
55934 226841390 201841961 178067953 156146002 136456991 119134395 104110085 91198503
55927 91198503 80164943 70755713 62720012 55837171 49925959 44831186 40415750 36567955
55919 36567955 33202407 30247549 27639630 25328622 23278037 21454586 19825046 18363575
55911 18363575 17052519 15873608 14806137 13835169 12953392 12152771 11421317 10749582 10133164
55902 10133164 9566831 9042537 8555122 8104008 7687448 7300512 6940220 6607248 6300910
55893 6300910 6017253 5753434 5509400 5284070 5074366 4878978 4698808 4532885 4378176
55884 4378176 4234087 4102746 3984039 3874687 3772990 3680151 3596020 3517699 3443196 3372333
55874 3372333 3303061 3231059 3154239 3074033 2991332 2904955 2815108 2724556 2635075 2546145 2458221
55863 2458221 2373816 2294186 2218200 2145626 2078397 2017725 1963163 1915595 1877906 1851446 1834707
55852 1834707 1826391 1826671 1834392 1846148 1859260 1872513 1882649 1883369 1869868 1842170 1802853 1754044
55840 1754044 1698047 1638273 1577615 1517526 1459659 1406377 1358580 1315078 1275058 1239217 1207737
55829 1207737 1179416 1153722 1131506 1112758 1095896 1080145 1066421 1054893 1043951 1032613 1021771
55818 1021771 1012021 1002481 992800 984051 976439 968287 958517 948030 937426 925607 912078 898524 886415
55805 886415 874893 862629 850200 839065 829673 821981 816368 812643 809561 806728 805701 808018 813429
55792 813429 821057 830678 841427 850752 856344 858137 857100 853058 844988 832509 815898 795498 772153
55779 772153 747389 722176 696306 669747 643564 618663 594679 570994 547909 526004 505341
55768 505341 486039 468644 453198 438935 425552 413722 403747 394903 386773 379989 374909 370702 366470
55755 366470 362121 357462 351836 345501 340072 336644 334600 333014 331956 331529 330967 329707 328245 327028 325676
55740 325676 324116 323139 322838 321844 319167 315587 312143 308627 304800 301706 300262 299573 298141 295880 293568
55725 293568 291173 288164 284788 281690 278783 275702 272857 270899 269676 268680 267965 267779 267982 268744 271006
55710 271006 275212 280412 285584 291069 297600 304810 311895 318929 326200 332873 337691 340502 341903 341828 339729
55695 339729 335755 330616 324637 318007 311526 305983 301128 296269 291504 287367 283713 280076 276797 274704
55681 274704 273938 274134 275467 278433 282800 287867 293630 300669 308945 317706 326677 336582 348381 362533
55667 362533 378870 396633 414703 432222 448750 463499 475043 482415 486002 486700 484707 479936 473010
55654 473010 464924 456074 446575 437279 429594 424349 421471 420551 421029 422062 422852 422995 422077 419274 413874
55639 413874 405809 395215 382021 366547 349938 333258 316654 300015 283852 268776 254671 241237
55627 241237 228751 217513 207145 197372 188936 182645 177976 173702 169557 166180 163705 161537 159391
55614 159391 157478 155780 154032 152359 151045 149802 148147 146381 145309 145120 145347 145728 146236 146443 145867 144882
55598 144882 144382 144576 145027 145735 147170 149142 150690 151337 151628 152223 153207 154489 156107 157869 159360 160603
55582 160603 162218 164721 168174 172637 178407 185560 193690 202379 211701 222143 234146 247687 262154
55569 262154 276726 290914 304351 315890 323617 326310 324451 319317 311555 301275 288953 275311
55557 275311 260608 244947 229131 214370 201158 189132 178017 168093 159755 153135 148106 144189
55545 144189 140680 137277 134322 132094 130378 129194 129246 130843 133055 134861 136625 139335 142961 146837 151342
55530 151342 157731 166286 175894 185618 195523 205772 216111 226587 237693 249300 260259 269446 276485
55517 276485 281167 282998 281733 277685 271124 261941 250238 236747 222371 207732 193312 179566 166815
55504 166815 155358 145583 137422 129916 122094 114213 107370 101956 97383 93249 89783 86915 83963 80623
55490 80623 77453 75010 73213 71849 70924 70156 68892 66976 65084 63756 62663 61199 59266 57101 54872
55475 54872 52828 51372 50584 50043 49366 48601 47945 47512 47458 47852 48368 48675 49095 50123 51237 51124 49418 47374
55457 47374 46327 46275 46462 46630 46996 47567 48150 48716 49213 49376 49161 48998 49146 49153 48450 47191 46012 45188 44479
55438 44479 43653 42794 42165 42048 42597 43726 45234 47064 49173 51213 52758 53836 54733 55299 55109 54435 54247
55421 54247 54992 56079 57029 58309 60444 62932 64869 66180 67430 68705 69490 69560 69247 68761 67889 66531
55405 66531 65063 63956 63278 62727 61961 60844 59520 58210 56866 55144 52918 50709 49295 48808 48462 47336
55389 47336 45358 43393 42292 41945 41460 40291 38930 38312 38684 39331 39320 38321 36778 35507 35079 35430 36164
55372 36164 37197 38720 40407 41326 41126 40770 41309 42329 42519 41515 40172 39116 38118 37090 36547 36654
55356 36654 36740 36388 36201 36807 37741 38081 37724 37352 37465 38108 39266 40813 42158 42602 42149 41567 41499 41775 41662
55337 41662 40611 38722 36598 34823 33601 32881 32642 32881 33486 34363 35584 37084 38419 39216 39768 40696
55321 40696 42039 43160 43521 43084 42023 40622 39457 39035 39166 39240 39186 39474 40080 40250 39576 38642 38231 38353
55303 38353 38438 37992 36899 35508 34589 34668 35304 35594 35397 35258 35125 34229 32571 31337 31210 31325 30713 29847
55285 29847 29756 30388 30977 31427 32153 32922 33057 32651 32484 32769 32976 32945 33192 33861 34297 34004 33416 33288 33823 34717
55265 34717 35746 36910 38191 39402 40181 40094 38932 37021 35150 34079 33977 34225 33869 32597 31259 31044
55249 31044 32063 33200 33547 33434 33679 34362 34866 34774 34158 33205 32114 31233 30799 30609 30313 29901 29574 29347
55231 29347 29147 29127 29451 29875 29935 29515 28954 28693 29025 30011 31351 32549 33423 34255 35267 36270 37071 37833
55213 37833 38690 39411 39823 40134 40417 40211 39150 37687 36615 36237 36471 37313 38487 39059 38307 36823 35944
55196 35944 36132 36679 36984 37233 37651 37890 37557 36865 36347 36242 36375 36382 35938 34999 33928 33204 32969 33024 33133 33104
55176 33104 32770 32184 31694 31402 30759 29197 27103 25742 26112 28133 30806 32863 33480 32838 31969 31728 32014
55159 32014 32265 32333 32412 32445 32275 32167 32494 33044 33259 33103 33007 33023 32819 32470 32517 33074 33612 33783 33825 33954 34065
55138 34065 34272 35081 36641 38420 39944 41335 42745 43884 44558 45270 46721 48969 51502 53923 56207
55123 56207 58401 60375 61898 62856 63514 64429 65750 66675 66118 64046 61556 59463 57437 54920 52345 50773
55107 50773 50580 51032 51104 50334 49029 47945 47723 48326 49046 49199 48717 47924 47053 46246 45775 45845 46275 46692 46937
55088 46937 47023 46800 46070 45043 44309 44227 44638 45288 46223 47475 48612 48990 48510 47779 47396 47337 47273 47195 47381 47843
55068 47843 48247 48412 48458 48433 48227 47974 48035 48401 48631 48765 49641 51768 54309 55915 56280 56148 56039 55804 55429
55049 55429 55391 56001 57068 58466 60420 62981 65731 68290 70630 72674 74142 75179 76579 78843 81295
55034 81295 82677 82568 81829 81642 82362 83332 83694 83307 82828 82882 83355 83702 83722 83547 83039 81778 79783 77657
55016 77657 75769 73760 71214 68475 66393 65419 65203 64971 64133 62736 61469 61070 61659 62786 64072 65436
55000 65436 66683 67334 67098 66188 65007 63847 62972 62608 62649 62807 63195 64317 66219 68186 69720 71369 74121
54983 74121 78210 82992 87803 92459 97095 101912 107091 112629 118370 124455 131589 140552 151572 164459
54969 164459 179174 195881 214460 234238 254204 273272 290443 304964 316351 324182 328018 327676
54957 327676 323344 315293 303726 289158 272646 255287 237711 220401 204251 190270 178768 169269
54945 169269 161168 154029 147277 140260 132978 126407 121719 119250 118387 118331 118774 119919 122068 125331 129642
54930 129642 134936 141255 148748 157717 168636 181875 197264 214028 231215 248066 263820 277398
54918 277398 287584 293508 294815 291469 283708 272222 258146 242709 226875 211308 196498 182751
54906 182751 170081 158264 147173 137051 128301 120968 114588 108727 103484 99247 96121 93884 92393
54893 92393 91570 91031 90267 89343 88883 89082 89186 88390 86876 85458 84393 83144 81230 78824 76383 74129
54877 74129 72087 70324 68860 67464 65752 63551 61162 59234 58314 58363 58741 58710 57998 56948 56223 56386 57587
54860 57587 59469 61443 63090 64299 65064 65368 65358 65352 65502 65562 65146 64090 62518 60765 59394 59005 59643 60497
54842 60497 60516 59397 57824 56743 56560 56935 57226 57119 56951 57408 58844 61020 63563 66428 69685 73084
54826 73084 76232 79183 82479 86558 91446 97143 103988 112308 121867 132030 142606 154273 167900
54813 167900 183514 200167 216901 233470 249864 265344 278445 287943 293440 294930 292337 285862
54801 285862 276456 265453 253749 241552 228846 215813 202844 190486 179454 170418 163572 158417
54789 158417 154114 150124 146531 143741 141846 140450 139248 138630 139363 141680 145067 149033 153747 159728 167337
54774 167337 176907 189001 204020 221635 241040 261673 283315 305492 327289 347911 367051 384427
54762 384427 399122 409694 414938 414431 408436 397481 382158 363241 341792 318995 295930 273530
54750 273530 252620 233702 216725 201270 187089 174236 162669 152040 142100 133100 125524 119522
54738 119522 114748 110694 107077 104040 102035 101295 101308 101068 100045 98670 97706 97444 97771 98654 100006 101265
54722 101265 101658 101031 100053 99486 99468 99550 99188 98200 96946 96104 96048 96400 96398 95745 94921 94621 95068 95888 96437 96209
54702 96209 95130 93617 92322 91668 91553 91428 90697 89262 87775 87142 87562 88231 88285 87863 87878 88794 90089 91069
54684 91069 91754 92617 93724 94591 94925 95121 95847 97337 99321 101537 103978 106597 109079 111194 113213 115712
54668 115712 119005 123014 127651 133008 139202 146316 154513 163818 173742 183538 193142 203546 215962 230772
54654 230772 247495 265484 284335 303752 323262 341991 358561 371417 379486 382438 380237 372771
54642 372771 360221 343607 324612 304862 285449 266902 249333 232665 216880 202090 188416
54631 188416 176086 165595 157298 150776 145112 140001 136005 133394 131456 129467 127701 126684 125972 124634
54617 124634 122717 121235 120704 120571 120238 119837 119745 119980 120426 121138 122094 123037 123814 124540 125278 125863 126174 126263 126162
54598 126162 125848 125405 124900 124150 123094 122273 122378 123250 123975 124029 123697 123153 121902 119520 116381 113211 110364
54581 110364 107940 106094 104776 103600 102451 101848 102201 103006 103356 102990 102337 101731 101177 100749 100655 100856 101067
54564 101067 101198 101419 101754 102035 102338 103125 104765 107138 109829 112541 115198 117748 120039 121916 123564 125790
54548 125790 129763 136121 144277 152808 160744 168386 176826 186699 197505 208144 217922 226831 234834 241193
54534 241193 244834 245373 243473 240099 235603 229698 222160 213355 204127 195250 187015 179298 172027 165453
54520 165453 159879 155214 151026 147002 143175 139756 136954 134975 133900 133442 133017 132199 131017 129834 129104
54505 129104 129254 130503 132597 134862 136633 137626 137919 137741 137416 137370 138028 139589 141768 143763 144691 144291 143125
54488 143125 141915 140834 139556 137771 135379 132436 129259 126397 124136 122264 120706 120007 120559 121586 121717
54473 121717 120496 118551 116324 113617 110600 108242 107169 106852 106473 105981 105718 105572 105170 104451 103434 101873
54457 101873 99820 98151 97772 98430 99021 98928 98518 98367 98588 98875 98778 97958 96587 95415 95058 95338 95731 96143
54439 96143 96710 97014 96290 94513 92656 91643 91480 91589 91627 91701 92031 92653 93337 93728 93632 93168 92590 92054 91658
54420 91658 91513 91611 91758 91825 91894 91980 91884 91580 91505 92146 93528 95336 97309 99209 100708 101656 102194 102316 101739
54401 101739 100594 99753 99880 100556 101006 101255 101764 102313 102287 101908 102075 102882 103339 102802 101777 100975 100443 100024
54383 100024 99837 99809 99444 98617 97980 98070 98549 98832 98917 99031 99001 98608 98130 97940 97856 97483 96875 96343 95942 95658
54363 95658 95731 96177 96372 95819 95040 94939 95440 95627 95169 94783 95107 95854 96350 96339 95966 95510 95334 95654 96067 95762
54343 95762 94522 93054 92047 91349 90521 89766 89629 89919 89640 88143 85882 83811 82371 81353 80431 79402
54327 79402 77981 75819 72923 69851 67246 65286 63776 62625 61987 61915 62111 62118 61610 60538 59223 58332 58431
54310 58431 59361 60240 60272 59446 58346 57504 57138 57283 57806 58359 58587 58366 57734 56734 55568 54704 54458 54538 54425
54291 54425 54194 54473 55449 56361 56302 55271 54115 53587 53755 54224 54609 54711 54558 54429 54720 55564 56606 57247
54273 57247 57152 56492 55712 55090 54582 54008 53346 52851 52881 53511 54230 54169 52862 50800 49090 48500 48954 49866 50674
54254 50674 51023 50838 50445 50403 50944 51717 52241 52370 52107 51306 50042 49045 49147 50256 51370 51691 51317 50708
54236 50708 50040 49416 49283 50069 51502 52710 53072 52750 52309 51988 51495 50520 49256 48230 47591 46912 45940 45235
54218 45235 45577 46876 48260 49261 50285 51665 52836 52927 51782 50018 48404 47551 47771 48711 49405 49225
54202 49225 48550 48009 47401 46083 44200 42719 42218 42395 42903 43824 45073 46010 46086 45370 44121 42356 40262
54185 40262 38507 37638 37536 37869 38639 39823 40917 41481 41792 42299 42699 42324 41281 40442 40233 40258 40253 40648 41838
54166 41838 43499 45092 46576 48138 49566 50409 50587 50418 50136 49760 49373 49169 49199 49341 49580 50075 50826 51500
54148 51500 51685 51274 50517 49798 49395 49364 49470 49260 48374 46964 45696 45169 45331 45634 45761 45903 46257 46651 46937
54129 46937 47388 48243 49067 49139 48490 47961 48107 48543 48621 48308 48026 47979 48048 48131 48240 48381 48679 49432 50655 51714
54109 51714 51898 51372 51130 51841 53096 54022 54346 54550 55084 55772 56099 55872 55392 55003 54658 54098 53339 52749 52595
54090 52595 52670 52538 52030 51367 50855 50583 50426 50201 49796 49235 48679 48369 48480 48937 49340 49218 48530 47865 47933 48845
54070 48845 50013 50809 51148 51398 51965 53018 54393 55612 56150 55839 54912 53670 52344 51303 51046 51745 53017
54053 53017 54369 55578 56502 56889 56765 56675 57019 57338 56882 55835 55357 56253 58114 60000 61486 62659 63580
54036 63580 64302 65317 67429 70964 75345 79580 83088 86026 88995 92564 96941 101867 106720 110829 113897
54021 113897 116214 118408 120924 123717 126406 128608 130146 131058 131526 131761 131907 132093 132518 133288 134126 134449
54005 134449 133861 132411 130375 128042 125870 124434 123796 123191 121831 119964 118601 118152 117795 116408 113748
53990 113748 110528 107635 105564 104327 103573 102859 101989 101069 100161 99098 97812 96655 96094 96130 96243 95905 94934
53973 94934 93398 91446 89365 87629 86689 86691 87377 88209 88560 87924 86158 83593 80875 78601 77025 76157 76033
53956 76033 76761 78235 79964 81355 82170 82560 82712 82650 82404 82154 82024 81893 81571 81162 81056 81518 82417 83401
53938 83401 84249 85038 86016 87407 89258 91341 93248 94754 96115 97835 100031 102198 103760 104759 105793
53923 105793 107365 109559 112302 115559 119123 122528 125473 128226 131368 135165 139339 143396 147048 150414
53909 150414 153981 158331 163700 169700 175511 180418 184233 187322 190328 193719 197478 201188 204428 206998
53895 206998 208846 209966 210467 210565 210404 209994 209386 208732 208041 207059 205513 203339 200647 197657 194750 192272
53879 192272 190110 187713 184721 181342 177930 174504 170920 167235 163594 160110 157116 155147 154152 153054
53865 153054 150757 147449 144350 142273 140969 139761 138119 135594 131961 127724 123911 121077 118876 116778
53851 116778 114745 112957 111352 109743 108079 106291 104241 102037 100087 98543 97034 95225 93364 91928
53837 91928 91038 90539 90450 90874 91578 92060 92091 91962 92095 92501 92659 92033 90813 90013 90510 91988 93214 93464 93243
53818 93243 93445 94242 95148 95824 96388 97125 98285 100053 102337 104578 106079 106563 106303 105807 105510 105662 106320
53801 106320 107401 108799 110348 111783 112975 114208 115930 118161 120507 122824 125421 128440 131495 134212
53787 134212 136700 139147 141398 143344 145264 147255 148748 149265 149375 150115 151525 152573 152575 151978 151471 150987
53771 150987 149968 148152 145699 142874 140039 137718 136177 134960 133178 130410 127202 124555 122957 121975
53757 121975 120801 119078 117064 115048 112969 110786 108886 107700 107044 106328 105434 104925 105198 105777 105786 104929 103656
53740 103656 102438 101182 99439 97034 94259 91553 89189 87380 86446 86512 87072 87263 86748 86084 85988 86467 86978
53723 86978 87231 87430 87747 87966 87811 87395 87170 87466 88093 88391 87751 86198 84372 82837 81571 80281 79035
53706 79035 78311 78488 79547 81124 82618 83377 83175 82523 82205 82506 83147 83894 84797 85770 86416 86535 86528 87019 88239
53687 88239 89899 91506 92625 93069 93041 93021 93358 94046 94922 95925 97053 98275 99638 101302 103256 105143
53671 105143 106582 107585 108428 109222 109887 110526 111528 113106 114949 116526 117668 118648 119715 120770 121603 122247
53655 122247 122970 123953 125154 126472 127844 129141 130082 130342 129778 128572 127180 126050 125314 124812 124504 124646
53639 124646 125359 126197 126544 126370 126185 126249 126294 126111 125901 125756 125313 124316 123184 122567 122587 122934 123425 123940 124035 123265
53619 123265 121882 120653 119880 119084 117798 116273 115196 114993 115534 116225 116330 115554 114479 114175 115202 117173
53603 117173 119324 121240 122886 124291 125509 126734 128166 129759 131264 132517 133656 135052 136985 139293
53589 139293 141388 142831 143840 145049 146750 148625 150265 151637 152874 153858 154389 154702 155488 157174 159339
53574 159339 161109 162179 163206 165002 167534 170085 172315 174587 177138 179470 180961 181694 182169 182447 182137
53559 182137 181099 179632 178015 176345 174808 173639 172738 171794 170843 170348 170579 171254 171838 171839 170875 168957 166805
53542 166805 165410 165034 164972 164424 163314 162185 161723 162432 164234 166156 166903 166073 164488 163141 162274 161739 161658
53525 161658 162212 163138 163999 164769 165676 166639 167372 167986 169025 170802 172975 174912 176361 177756 179902 183267
53509 183267 187569 192174 196823 201681 206701 211546 216318 221800 228504 235923 243245 250489 258340 267029
53495 267029 276057 285005 294087 303745 314139 325207 336922 349297 362329 376038 390398 405212
53483 405212 420167 435079 449995 465167 480956 497618 514951 532350 549454 566632 584535
53472 584535 603279 622344 641214 659800 678298 696981 716165 735998 756145 775879 794613
53461 794613 812249 828985 844894 859718 872986 884415 894326 903641 913321 923828 935122 946892
53449 946892 958609 969619 979589 988712 997130 1004347 1009699 1013335 1016111 1018316 1019070 1017308 1013020 1007099
53435 1007099 1000247 992495 983679 973849 963027 950909 937202 922213 906730 891154 875010 857622
53423 857622 839179 820677 802793 785304 767817 750525 733702 716845 699132 680716 662850
53412 662850 646546 631686 617712 604641 592937 582805 574139 566949 561370 557302 554504 553075 553491
53399 553491 556050 560508 566288 572924 580320 588827 599061 611366 625330 640058 655078 670817 688036
53386 688036 706954 727130 748075 769711 792232 815785 840447 866378 893809 922865 953431
53375 953431 985238 1018110 1052150 1087672 1124845 1163388 1202706 1242328 1282152 1322328 1363082
53364 1363082 1404687 1447330 1490794 1534418 1577575 1620085 1661964 1702832 1741818 1778108 1811448
53353 1811448 1842243 1871327 1899553 1927260 1954056 1979299 2002775 2024691 2045027 2063253 2078833
53342 2078833 2091690 2101905 2108956 2111459 2107686 2096486 2077874 2052805 2022366 1987294 1948299 1906458
53330 1906458 1862854 1817890 1771436 1723577 1674810 1625488 1575650 1525510 1475608 1426314 1377643
53319 1377643 1329741 1282983 1237335 1192175 1147121 1102509 1058698 1015509 972942 931855 893156
53308 893156 856710 821877 788919 758972 732593 709129 687707 668217 651121 636721 624813
53297 624813 614714 605624 597306 590389 585584 582690 580892 579867 579914 581014 582635 584668 587761 592273
53283 592273 597579 602942 608559 615161 622955 631568 640794 650813 661792 673729 686703 700937 716578
53270 716578 733558 751506 769649 787095 803562 819651 836164 853346 871077 889452 908654
53259 908654 928369 947841 966573 984621 1002211 1019422 1036290 1052839 1068879 1084069 1098324
53248 1098324 1111872 1124727 1136241 1145375 1151345 1153992 1153642 1150712 1145354 1137369 1126499 1112778 1096504
53235 1096504 1077883 1056899 1033587 1008326 981784 954593 927077 899135 870435 840891 811134
53224 811134 782329 755371 730267 706404 683217 660368 637366 613534 588600 563096 537829
53213 537829 513022 488253 463216 438232 413929 390720 368787 348356 329682 312848 297802
53202 297802 284523 272975 262936 254072 246149 238977 232196 225404 218619 212400 207318 203381 200013
53189 200013 196501 192357 187440 181960 176490 171870 168841 167479 166917 165846 163557 160435 157276 154331
53175 154331 151329 148305 145867 144429 143610 142712 141556 140509 139809 139247 138535 137662 136775 135890 134927 133931 133128
53158 133128 132672 132392 131866 130808 129353 127852 126377 124610 122333 119882 117954 116943 116603 116361 115818 114931
53142 114931 113872 112854 112016 111316 110522 109425 108094 106859 106044 105764 106024 106813 107958 108972 109259 108528
53126 108528 106940 104912 102877 101184 100038 99497 99554 100131 100859 101122 100658 99992 99821 100043 99983 99650 100037 101779
53108 101779 104133 105886 106864 107827 109132 110263 110707 110604 110431 110531 111092 112091 113119 113663 113746 113938 114611
53091 114611 115521 116278 116861 117420 117900 118097 117942 117547 117084 116657 116122 115065 113220 110907 108740 106920 105193
53074 105193 103469 101961 100636 99082 97217 95607 94728 94327 93890 93400 93143 93046 92701 91936 90949 89935 88938
53057 88938 88050 87457 87217 87181 87147 86998 86762 86565 86344 85632 83983 81776 80132 79698 79842 79494 78465 77460
53039 77460 76977 76818 76686 76598 76558 76259 75465 74420 73651 73429 73575 73674 73391 72686 71858 71298 71129 71054 70607 69559
53019 69559 68100 66635 65373 64228 63211 62738 63226 64400 65344 65354 64432 62936 61193 59666 58955 59176
53003 59176 59647 59667 59346 59255 59515 59768 59813 59649 59046 57766 56258 55402 55404 55564 55394 55303 55775 56474 56764 56746 57109
52982 57109 57999 58669 58356 57149 55855 55250 55568 56486 57455 58134 58560 58863 58880 58290 57151 56055 55608 55820
52964 55820 56213 56476 56791 57472 58456 59340 59840 60005 59966 59645 58908 57928 57220 57248 57996 58972 59619 59697 59328 58776
52944 58776 58326 58320 59011 60203 61217 61531 61412 61660 62689 64159 65486 66380 66740 66408 65352 63887 62467
52927 62467 61291 60296 59314 58121 56535 54784 53578 53454 54107 54714 54890 55002 55481 56116 56157 55021 52819
52910 52819 50316 48430 47640 47817 48548 49498 50404 50988 51164 51212 51451 51749 51628 50875 49817 48924 48360 47984
52892 47984 47579 47016 46341 45820 45727 45996 46194 45974 45460 45077 45053 45288 45688 46421 47611 48924 49801 50164 50547
52873 50547 51300 52028 52261 52362 53141 54620 55960 56730 57494 58729 59887 60214 59992 60271 61654 63990 67028
52856 67028 70543 73883 76135 76868 76193 74186 70916 67131 64121 62517 61711 60767 59464 58149 57032
52841 57032 56065 55235 54567 53959 53289 52565 51850 51190 50741 50754 51256 51949 52546 53086 53794 54834 56181 57565
52823 57565 58525 58813 58719 58676 58597 58055 57151 56566 56549 56493 55887 55140 54917 55150 55350 55518 55982 56480 56249 55116
52803 55116 53829 53062 52636 52043 51222 50467 49871 49393 49270 49865 51008 51871 51749 50836 50052 50147 51084 52233
52785 52233 52965 53051 52633 51982 51293 50654 50194 50125 50492 50930 50966 50599 50265 50095 49676 48816 48103 48096 48345 47935 46893
52764 46893 46223 46412 46805 46780 46787 47567 48925 49999 50492 50935 51803 52895 53658 53834 53754 54180 55696 58056 60384
52745 60384 62234 64061 66263 68267 69251 69516 70271 72025 73945 75043 75245 74929 74001 72037 69042 65558
52729 65558 62124 58998 56334 54274 52849 51999 51629 51500 51147 50241 49053 48322 48518 49370 50233 50763 51058
52712 51058 51204 51020 50396 49692 49447 49706 49965 49927 50014 50827 52227 53288 53213 52097 50776 50086 50243 50735 50776
52693 50776 50047 49071 48723 49308 50262 50797 50671 50226 49850 49627 49482 49472 49821 50626 51596 52201 52184 51892 51958 52641
52673 52641 53609 54416 55033 55751 56631 57217 56968 55911 54775 54362 54771 55356 55465 55076 54632 54389 54143 53602
52655 53602 52808 52146 52065 52781 54072 55340 56105 56553 57341 58692 59927 60236 59738 59299 59283 59075 58082 56670
52637 56670 55587 54806 53642 51890 50136 48820 47731 46698 46065 45946 45671 44749 43919 44272 45559 46386
52621 46386 46191 45993 46775 48099 48946 49199 49424 49681 49502 48884 48493 48811 49677 50746 51815 52605 52768 52324
52603 52324 51693 51122 50449 49593 48902 48799 49313 50134 50819 50819 49725 47871 46438 46528 48113 50108 51431 51817
52585 51817 51680 51447 51163 50648 49951 49529 49809 50599 51150 50931 50158 49412 48954 48651 48477 48703 49492 50530 51229
52566 51229 51290 50970 50871 51458 52716 54218 55530 56522 57295 57879 58186 58280 58496 59119 60054 61014 61971 63158 64520
52547 64520 65453 65377 64491 63695 63712 64519 65650 66834 68192 69995 72329 74908 77078 78256 78517 78639 79333
52530 79333 80533 81587 82021 81898 81499 80958 80215 79184 77928 76772 76108 75916 75637 74874 74045 73899 74391
52513 74391 74540 73600 71918 70375 69371 68804 68682 69150 69961 70451 70168 69222 67943 66553 65335 64758 65103
52496 65103 66029 66806 66975 66677 66412 66543 66967 67169 66655 65470 64193 63330 62806 62233 61566 61212 61449 62001
52478 62001 62297 61988 61092 59861 58734 58254 58723 59851 60948 61578 61908 62326 62829 62967 62466 61748 61677 62702
52460 62702 64345 65647 66054 65777 65374 65238 65510 66196 67179 68229 69142 69804 70093 70013 69985 70564 71568 71929
52442 71929 70927 69340 68661 69236 69926 69777 69294 69561 70675 71672 71810 71338 70991 71210 71962 72983 73961 74632
52424 74632 74928 75058 75369 76013 76738 77137 77159 77143 77197 76861 75809 74561 73863 73459 72342 70418 69059 69435
52406 69435 71010 72321 72726 72583 72192 71552 71058 71434 72734 74140 75013 75533 76022 76239 75838 75113 74780 75080
52388 75080 75485 75350 74685 74229 74720 76108 77598 78557 79155 79934 80934 81702 82027 82189 82426 82574 82432 82150
52370 82150 82102 82572 83610 84993 86257 87031 87337 87403 87232 86698 86021 85722 86057 86815 87678 88399 88662 88304 87797
52351 87797 87953 88952 90101 90816 91376 92405 93975 95557 96536 96522 95553 94275 93550 93519 93430 92726 91873 91686
52333 91686 92234 92977 93670 94507 95597 96865 98334 99907 101016 101102 100483 100135 100517 101156 101517 101794 102573 104064
52315 104064 105877 107290 107686 107022 105966 105288 105066 104850 104584 104888 106249 108374 110561 112365 113636 114303
52299 114303 114478 114600 115146 116329 118224 120875 124079 127325 130281 133083 135886 138445 140573 142700 145445
52284 145445 148715 151779 154210 156223 158063 159681 161200 163133 165710 168391 170496 172021 173441 174918
52270 174918 176201 177158 177910 178510 178945 179570 180993 183316 185838 187798 189157 190407 191761 192805 192848 191543
52254 191543 189328 187426 187087 188526 190718 192490 193676 194928 196676 198751 200972 203491 206320 208957
52240 208957 210940 212543 214578 217488 220927 224279 227375 230554 234107 237842 241218 243801 245572 246922
52226 246922 248479 250778 253819 256958 259536 261657 264056 267084 270219 272844 275118 277574 280099 281888
52212 281888 282458 282270 282281 283213 285293 288293 291679 294967 298092 301221 304302 307106 309640 312118 314522
52197 314522 316679 318871 321806 325725 329963 333707 336836 339761 342768 345903 349203 352659 356045 359050
52183 359050 361517 363512 365393 367863 371524 376138 380676 384339 387148 389368 390957 392061 393516 396089
52169 396089 399415 402302 404015 404721 404787 404244 403004 401191 399165 397476 396660 396688 396736 395967 394491 393118 392266
52152 392266 391619 390828 389938 388963 387610 385711 383611 381826 380533 379505 378358 376755 374610 372228 370135
52137 370135 368729 368103 367989 367679 366364 363956 361358 359393 357707 355372 352384 349696 347777 346028 343944
52122 343944 341948 340585 339625 338583 337506 336532 335192 333030 330621 329082 328514 327737 325710 322670 319633
52107 319633 317288 315696 314701 314217 314178 314490 315082 315909 316877 317793 318442 318781 319013 319316 319468 318992 317873 316959
52089 316959 317370 319470 322569 325641 328224 330587 333142 335840 338237 340147 341980 344205 346681 348833
52075 348833 350484 352012 353678 355284 356713 358294 360186 361840 362641 362920 363728 365587 367901 369733 370826
52060 370826 371735 373144 375129 377069 378299 378951 379939 381894 384361 386354 387561 388544 389845 391399 392939
52045 392939 394479 396149 397855 399386 400681 401780 402642 403161 403252 402862 402079 401345 401312 402231 403571 404441 404353
52028 404353 403468 402183 400670 398795 396321 393148 389406 385369 381333 377629 374660 372687 371447 370157
52014 370157 368111 365240 361960 358613 355245 351932 349013 346802 345189 343711 342010 340091 338191 336565
52000 336565 335398 334725 334305 333723 332732 331411 329934 328391 326994 326198 326223 326609 326670 326362 326209 326256 325662 323571
51982 323571 319920 315040 308948 301641 293790 286416 279863 273591 266997 259929 252388 244364 236229 228809
51968 228809 222644 217407 212313 206890 201111 195070 188902 182939 177594 173020 169010 165226 161439 157616
51954 157616 153876 150306 146807 143238 139656 136235 132941 129583 126290 123572 121687 120246 118745 117194
51940 117194 115891 114844 113886 113113 112601 111806 109972 107311 105079 104146 104059 103995 104089 105012 106538 107444 106971 105613
51922 105613 104156 102661 100933 99483 99255 100459 102332 104043 105377 106389 106937 106825 106099 104937 103458
51907 103458 101868 100549 99762 99358 99005 98590 98283 98313 98761 99392 99662 99254 98746 99280 101228 103589 105134
51890 105134 105723 105965 105991 105486 104792 104984 106527 108627 110215 110988 111142 110776 110133 109896 110613 111996 113262
51873 113262 113979 114229 114260 114428 115231 116888 119044 121247 123502 125961 128397 130573 132963 136462 141436 147504
51857 147504 154143 161000 167799 174630 182344 191944 203477 216152 229718 245061 263242 284575 309017
51844 309017 336870 368636 404509 444310 487513 532820 577799 619084 652725 674661 681937 674317
51832 674317 654484 626196 592358 554816 515077 474430 433821 394386 357824 325446 297078
51821 297078 271638 248703 228683 211609 196726 183574 172530 163833 156720 150117 143745 137996
51809 137996 133062 128741 124913 121656 118870 116202 113425 110626 107949 105373 102829 100441 98519 97324
51795 97324 96840 96783 96811 96708 96355 95666 94654 93521 92536 91866 91572 91634 91841 91824 91404 90811 90317 89826 89152 88559
51775 88559 88538 88989 89129 88430 87322 86718 87001 87662 87782 86801 85012 83367 82614 82635 82863 83237 84184 85564
51757 85564 86296 85521 83709 82168 81666 82006 82679 83367 83827 83863 83547 83127 82585 81593 80052 78489 77678 77950
51739 77950 78943 79995 80649 80813 80508 79751 78832 78489 79330 81012 82428 82920 82898 83004 83110 82694 81855 81270
51721 81270 81191 81151 80821 80572 80847 81426 81699 81448 80969 80565 80246 79880 79378 78632 77551 76302 75372 75153 75420
51702 75420 75467 74941 74398 74740 76113 77750 78965 79915 81052 82199 82666 82215 81430 81077 81434 82345 83581
51685 83581 84948 86252 87382 88341 89127 89628 89679 89188 88270 87370 87108 87736 88796 89574 89901 90185 90663 90947
51667 90947 90477 89206 87663 86552 86331 86933 87703 87830 87065 85918 85063 84740 84832 85248 85909 86500 86616 86122
51649 86122 85186 83970 82562 81201 80334 80309 81166 82705 84579 86262 87254 87530 87653 88183 89109 90104 91204
51632 91204 92875 95278 97885 100040 101712 103362 105264 107231 108905 110034 110547 110684 110975 111742 112697 113408
51616 113408 114065 115201 116635 117443 117262 116937 117359 118249 118701 118437 117757 116618 114761 112679 111525 111777 112642
51599 112642 113034 112546 111273 109331 106996 104852 103320 102237 101150 99785 98035 95831 93346 91065 89350
51584 89350 88047 86718 85131 83431 82074 81633 82308 83439 83966 83673 83577 84652 86468 87615 87372 86475
51568 86475 86165 86831 87694 87653 86386 84663 83593 83594 84240 85056 86050 87267 88220 88236 87263 86061 85537 86053 87198
51549 87198 88133 88328 88166 88610 90106 92041 93490 94202 94577 95001 95668 96808 98591 100758 102776 104340
51533 104340 105486 106272 106757 107267 108244 109714 111146 111946 111916 111358 110934 111296 112500 113808 114466 114638 115173
51516 115173 116445 117823 118435 117970 116618 114675 112627 111275 111240 112263 113326 113591 113103 112490 112068 111440
51500 111440 110077 108144 106456 105515 104936 104045 102748 101400 100045 98275 95811 92774 89426 86142 83675
51485 83675 82728 82991 83116 82126 80421 78946 77737 75984 73466 71218 70518 71544 73329 74796 75570 75845
51469 75845 75823 75487 74897 74437 74528 75103 75582 75491 74963 74522 74488 74753 75004 74990 74649 74179 73942 74136 74512 74585 74178
51448 74178 73677 73678 74408 75484 76184 76044 75283 74727 75240 77146 80106 83420 86395 88621 90187 91686 93759
51431 93759 96434 98991 100649 101371 101811 102491 103168 103169 102261 100962 99940 99269 98419 96950 95025 93162 91634
51414 91634 90358 89328 88878 89264 90102 90585 90345 89929 90191 91316 92591 93091 92388 90629 88235 85716 83648
51397 83648 82491 82252 82358 82055 81073 79852 79033 78791 78861 79113 79705 80523 80885 80201 78728 77277 76268 75468
51379 75468 74579 73622 72741 72079 71937 72527 73411 73685 73044 72309 72569 74035 75999 77579 78215 77789 76703 75727
51361 75727 75416 75709 76213 76635 76752 76405 75854 75728 76194 76476 75789 74459 73527 73439 73762 74095 74538 75226 76047
51342 76047 76954 77965 78734 78693 77831 76825 76166 75672 75064 74466 74068 73798 73706 74159 75251 76394 76979 77086
51324 77086 77146 77210 77090 76857 76668 76289 75467 74657 74643 75358 75762 75225 74454 74593 75808 77267 78290 78896 79173
51305 79173 78737 77230 75077 73249 72297 71945 71659 71277 70921 70651 70496 70620 71111 71702 72002 71964 71798 71529
51287 71529 71013 70442 70403 71234 72539 73469 73357 72077 70138 68497 68013 68817 70389 72247 74288 76375 78015
51270 78015 78789 78858 78776 78904 79255 79724 80187 80467 80434 80097 79464 78440 77066 75696 74728 74230 74050 74173 74712
51251 74712 75590 76494 77195 77772 78452 79313 80170 80739 80980 81234 81883 82823 83518 83610 83295 83009 83007 83410 84291 85429
51231 85429 86284 86616 86934 87834 89012 89518 89016 88230 87903 87830 87317 86279 85318 84842 84662 84546 84665 85102 85309
51212 85309 84653 83476 83007 83932 85438 86119 85589 84710 84279 84075 83377 81992 80462 79490 79386 79879 80293 80083
51194 80083 79365 78706 78296 77698 76618 75517 75002 74916 74632 74161 74319 75626 77537 79045 79737 79955 80211 80794
51176 80794 81838 83376 85218 86963 88243 88914 88980 88549 87970 87813 88421 89397 89859 89354 88290 87236 86156
51159 86156 84834 83863 84402 86674 89288 90590 90258 89069 87501 85388 82950 81259 81203 82420 83737 84457
51143 84457 84787 85127 85410 85323 84841 84315 84091 84243 84667 85254 85895 86429 86717 86773 86738 86706 86651 86556 86561 86915 87709 88641
51121 88641 89125 88801 87966 87309 87172 87252 87171 87082 87449 88410 89650 90766 91443 91378 90486 89183 88097 87453 87002
51102 87002 86514 85949 85195 84128 82962 82065 81378 80542 79734 79719 80814 82318 83327 83619 83413 82853 82196 82039
51084 82039 82759 84005 85202 86237 87244 88131 88860 89786 91138 92466 93214 93503 93741 93780 93266 92562 92505 93327
51066 93327 94508 95553 96156 95914 94886 94363 95892 99269 102514 104201 104794 105310 105764 105748 105625 106097 107100
51049 107100 108044 108794 109555 110053 109819 109232 109308 110243 110935 110353 108860 107700 107500 107702 107439 106555 105615 105096
51031 105096 104804 104165 102929 101399 100085 99328 99248 99750 100488 101088 101548 102266 103499 104996 106293 107223 107983
51014 107983 108821 109705 110235 109924 108804 107673 107408 108040 108922 109827 111264 113475 115734 117162 117860 118628 119884
50997 119884 121457 123246 125358 127565 129356 130722 132372 134841 137842 140840 143912 147524 151616 155425
50983 155425 158342 160553 162691 165070 167536 169900 172207 174544 176917 179446 182458 186156 190388 194942
50969 194942 199985 205913 212893 220815 229670 239630 250739 262867 276033 290486 306341 323465 341794
50956 341794 361451 382314 403744 424997 445642 465451 484112 501311 516897 530757 542593
50945 542593 552016 558682 562341 562996 561080 557088 550847 541557 528913 513809 497578 480879 463727
50932 463727 446262 428877 411809 395182 379408 364988 351926 339810 328480 318124 308769 300207
50920 300207 292516 286043 280680 275708 270654 265870 262005 259254 257417 256269 255495 254574 253172 251502 249965
50905 249965 248611 247252 245891 244664 243515 242307 241176 240378 239852 239329 238837 238649 238675 238349 237384 236247
50889 236247 235636 235726 236186 236658 236923 236770 236154 235444 235176 235484 236096 236918 238250 240237 242393 244042 245109
50872 245109 246204 247983 250608 253811 257233 260606 263844 267108 270769 275233 280781 287471 295129 303477
50858 303477 312459 322436 333883 346878 361048 376108 392351 410549 431457 455435 482464 512387
50846 512387 545178 580960 619746 661252 705107 751152 799219 848560 897867 946090 993049
50835 993049 1039004 1083695 1125988 1164336 1197387 1224348 1245150 1260251 1269942 1273707 1270574 1260203
50823 1260203 1243359 1221134 1193939 1161628 1124502 1083775 1041010 997398 953787 911071 870170
50812 870170 831697 795955 763322 734312 709146 687481 668793 652929 640166 630820 624952 622308
50800 622308 622388 624607 628605 634332 641750 650526 660198 670489 681208 691866 701677 710030 716743 721826
50786 721826 725198 726804 726862 725757 723615 720033 714385 706514 697067 686894 676105 663981 649942 634280
50772 634280 617793 601134 584885 569812 556347 543980 531842 519858 508697 498581 488919 479399
50760 479399 470841 464526 461086 460267 461400 463754 466895 471059 476921 484767 494277 505310 518401 534076
50746 534076 552159 572210 594178 618087 643492 669873 697287 725942 755203 783656 810131
50735 810131 834110 855230 872994 887065 897412 904168 907864 909793 911487 913600 915737 917495 919234
50722 919234 921590 924782 928781 933832 940373 948519 957889 967763 977221 985257 991115 994524 995452 993672
50708 993672 988755 980532 969368 955933 940825 924530 907601 890540 873457 856127 838601 821455
50696 821455 805163 789553 774418 760445 748794 739788 732915 728241 726793 728960 733507 739151 746453
50683 746453 757099 771691 789433 809756 832944 858931 886583 914649 942625 970274 997028
50672 997028 1022318 1045875 1067246 1085601 1100521 1112485 1122109 1129275 1133509 1134828 1133698 1130494 1125558
50659 1125558 1119521 1112946 1105693 1097163 1087302 1077037 1067666 1060047 1054424 1050818 1049396 1050463 1054136 1060174
50645 1060174 1068150 1077593 1087794 1097798 1107106 1116259 1126126 1136642 1146871 1156392 1165814 1175593 1185119
50632 1185119 1193609 1201302 1209085 1217352 1225998 1235248 1245577 1256726 1267449 1276435 1283018 1286847 1287315
50619 1287315 1283627 1275321 1262636 1246493 1228098 1208391 1187785 1166426 1144502 1122247 1099889 1077753
50607 1077753 1056143 1034913 1013503 991646 969659 947656 924890 900483 874587 848254 822371
50596 822371 797282 773312 750871 730045 710672 692960 677366 663754 651385 639964 630063 622136
50584 622136 615708 610036 605073 601210 598375 596021 593850 592002 590557 589318 588153 587238 586967 587907 590825
50569 590825 596318 604254 613884 624731 637184 651965 669118 687870 707543 728347 750947 775420
50557 775420 800957 826720 852592 878782 904985 930361 954329 976970 998676 1019880 1041256
50546 1041256 1063733 1087900 1113570 1140121 1167122 1194492 1222326 1250903 1280722 1312250 1345660
50535 1345660 1380909 1417891 1456326 1495752 1535907 1576923 1618679 1659965 1698659 1732845 1761573
50524 1761573 1784568 1801583 1812207 1816081 1813059 1803215 1786763 1763963 1735134 1700909 1662469 1621381
50512 1621381 1579112 1536773 1495269 1455509 1418330 1384197 1352970 1324090 1297276 1273147 1252840
50501 1252840 1236736 1223849 1212917 1203831 1197433 1194040 1192944 1193487 1195756 1199731 1204374 1208218 1210385
50488 1210385 1210328 1206868 1198427 1184312 1165186 1142066 1115394 1085242 1051960 1016308 979216 941665
50476 941665 904532 868280 832901 798357 765018 733593 704668 678321 654060 631198 609470
50465 609470 589309 571416 556088 543162 532411 523678 516657 510968 506447 503054 500527 498589 497495
50452 497495 497876 499838 502701 505835 509316 513539 518688 524978 532932 542956 554859 568156 582580
50439 582580 598023 614409 632034 651563 673132 695804 718556 741559 765809 791704 818725
50428 818725 846431 874994 904591 934955 965741 996868 1028293 1059858 1091461 1122972 1153972
50417 1153972 1184023 1213181 1241613 1268634 1292744 1312827 1328730 1340441 1347409 1349115 1345674 1337376
50405 1337376 1324076 1305657 1282694 1256061 1226124 1192856 1156527 1117766 1077144 1035307 993438
50394 993438 952942 914541 878065 843211 810179 779588 752236 729002 710489 696445 685796
50383 685796 677476 671168 667166 665711 666585 669231 673152 678224 684619 692252 700303 707436 712478 714804
50369 714804 714151 710444 703876 694850 683625 670224 654940 638695 622484 606494 590098 572866
50357 572866 555333 538593 523395 509799 497525 486294 475894 466245 457489 449810 443173 437517
50345 437517 433134 430374 428841 427368 425196 422811 421224 420672 420600 420687 421221 422392 423818 425058 426220 427829
50329 427829 430323 433866 438452 444021 450519 457912 466077 474818 484135 494304 505416 517103 529115
50316 529115 541904 555985 570865 585359 599061 612662 626569 639948 651577 660959 668121 672883
50304 672883 675027 674771 672542 668589 663345 657749 652434 646767 639298 629172 616659 602465 587118
50291 587118 570980 554315 537247 520016 503237 487567 473141 459682 447089 435550 425201
50280 425201 416152 408780 403482 400020 397544 395374 393412 391789 390519 389651 389348 389561 389877 389893 389628 389346
50264 389346 389098 388618 387741 386830 386583 387216 387999 388022 387376 387049 387494 387994 387810 387283 387120 387180 386884 386480 386844
50245 386844 388082 389375 390333 391516 393346 395427 397421 399779 402961 406556 409864 412873 416032 419450
50231 419450 423001 426897 431408 436217 440824 445591 451648 459461 468056 475993 482732 488738 494586 500409
50217 500409 506126 511724 517185 522390 527343 532348 537723 543372 548851 553878 558610 563425 568769 575354
50203 575354 584063 595183 607834 620600 632813 645032 658257 672955 688866 705481 722678 741039
50191 741039 761541 784763 810513 838460 868972 902922 940907 983267 1030889 1085239 1147141
50180 1147141 1215899 1289943 1367937 1448844 1531143 1612521 1690293 1761930 1825433 1879771 1925181
50169 1925181 1962812 1993834 2018701 2037026 2047941 2050505 2043882 2027234 1999612 1960254 1909121 1847124
50157 1847124 1775900 1697523 1614370 1528922 1443397 1359594 1279032 1202970 1132145 1066687 1006485
50146 1006485 951604 902224 858283 819296 784570 753615 726386 702978 682960 665179 648527
50135 648527 632787 618416 605596 593967 583351 574137 566597 560205 554060 547880 542216 537733 534527
50122 534527 532167 530178 528415 526966 525780 524589 523353 522589 522893 524195 525901 527794 530326 533766 537577
50107 537577 541029 544175 547724 552026 556652 561113 565684 571262 578437 586888 595787 604648 613516 622336
50093 622336 630648 638245 645830 654457 664431 675277 686733 699103 712591 726995 742312 759044
50081 759044 777502 797433 818702 841880 867607 895898 926666 960588 998755 1041717 1089647
50070 1089647 1143383 1204570 1274565 1353770 1442319 1540947 1650754 1772156 1904222 2044819
50060 2044819 2191130 2339966 2487758 2630690 2765396 2889891 3003746 3107298 3200850 3284591
50050 3284591 3358673 3422666 3474838 3512265 3531712 3530492 3507020 3461250 3394721 3309778 3208598
50039 3208598 3093058 2965408 2828689 2686294 2541334 2396523 2254432 2117531 1987842
50030 1987842 1866603 1754366 1651405 1557886 1473517 1397394 1328599 1266874 1212265 1164153 1121265
50019 1121265 1082765 1048700 1019026 992870 969211 947726 928331 910338 892831 875595 859008
50008 859008 843217 828081 813632 799753 785567 770104 753673 737750 723338 710188 697800
49997 697800 686247 675632 665558 655740 646565 638494 631421 625204 620230 616710 613842 610536 606797
49984 606797 603637 601677 600638 600264 600897 602736 605125 607121 608497 609756 611324 613095 614708 615936 616781
49969 616781 617431 618173 619198 620470 621890 623576 625883 629144 633511 638991 645516 652989 661591 672066
49955 672066 685403 702015 721467 743358 768261 797428 831678 871068 915706 966299 1023597
49944 1023597 1087730 1158509 1236048 1320448 1410770 1504659 1599026 1690892 1777668 1857197 1927980
49933 1927980 1989361 2041322 2084085 2117969 2143478 2161228 2171398 2173077 2164204 2142380 2105947 2054527
49921 2054527 1988958 1911111 1823712 1729771 1631860 1532025 1432425 1335611 1243807 1158170 1079109
49910 1079109 1007138 942857 886065 835417 789404 747559 710397 678197 650136 624931 602159
49899 602159 582437 566109 552242 539367 526969 515622 505792 497199 489437 482430 475995 469667 463391
49886 463391 457803 453326 449547 445987 442848 440312 437655 433993 429637 425788 423076 421213 419819 418650
49872 418650 417088 414515 411383 408948 407585 406202 403714 400315 396870 393840 391356 389692 388895 388362 387507
49857 387507 386611 386470 387314 388579 389557 389905 389609 388958 388463 388459 388756 388914 388750 388402 388057 387898 388159 388928 389892
49838 389892 390531 390559 390041 389182 388182 387251 386607 386422 386825 387813 389169 390616 392116 393843 395806 397751 399543
49821 399543 401339 403278 405231 407058 408867 410791 412748 414628 416483 418251 419462 419604 418746 417555 416640
49806 416640 416040 415328 414124 412458 410735 409361 408418 407713 406971 405802 403704 400542 397078 394564 393572 393499
49790 393499 393365 392765 391849 390751 389452 388028 386670 385458 384321 383169 381940 380612 379244 377940 376755
49775 376755 375806 375464 376063 377346 378540 379165 379452 379836 380385 380960 381559 382163 382507 382348 381785 381062 380312 379718
49757 379718 379597 379974 380374 380440 380499 381075 382046 382809 383167 383580 384514 385894 387222 387915 387588 386308 384668 383382
49739 383382 382798 382842 383198 383287 382390 380250 377504 375147 373605 372615 371867 371371 371213 371352 371659 371889 371679 370845
49721 370845 369623 368363 367142 366003 365273 365152 365148 364618 363842 363877 365133 366729 367601 367753 368024 368989 370508
49704 370508 372159 373720 375225 376817 378542 380263 381828 383315 384894 386488 387833 388926 390110 391665
49690 391665 393586 395833 398434 401219 403835 406207 408620 411116 413222 414689 416185 418686 422233 425763
49676 425763 428292 429938 431653 434209 437611 441335 444904 448158 451096 453651 455812 457889 460434 463663
49662 463663 467077 469841 471588 472773 474207 476295 478772 481149 483297 485445 487633 489557 491138 492994
49648 492994 495846 499530 503094 505960 508442 510875 512812 513663 513758 514120 515190 516436 517340 518228 519848 522503
49632 522503 525963 529926 534171 538337 541957 544775 546859 548434 549898 551939 555232 559752 564617 568938
49618 568938 572788 577084 582483 588626 594593 599991 605411 611790 619425 627710 635803 643480 651275 659866
49604 659866 669501 679997 691038 702265 713254 723695 733667 743643 754202 765741 778330 791658
49592 791658 805245 818905 832904 847467 862304 876936 891373 906038 921063 936130 951127
49581 951127 966396 982136 998048 1013976 1030427 1047945 1066220 1084339 1101746 1118530 1134878
49570 1134878 1150776 1166229 1181301 1195862 1209620 1222518 1234793 1246648 1258193 1269690 1281365
49559 1281365 1292831 1303114 1311565 1318514 1324778 1330720 1336076 1340563 1344280 1347460 1350047 1351821 1352917
49546 1352917 1353974 1355535 1357373 1358732 1359366 1359956 1361286 1363293 1365337 1367209 1369436 1372621 1376912 1382120
49532 1382120 1387974 1394214 1400835 1408256 1416865 1426274 1435423 1443580 1450898 1457864 1464704 1471576 1478853 1486722
49518 1486722 1494749 1502302 1509217 1515598 1521051 1524671 1525976 1525500 1524244 1522665 1520294 1516192 1509662 1500649
49504 1500649 1489677 1477468 1464627 1451582 1438604 1425709 1412567 1398719 1384025 1368868 1353830
49493 1353830 1339181 1324737 1310237 1295722 1281404 1267210 1252687 1237510 1222016 1207020 1193182
49482 1193182 1180584 1168819 1157323 1145701 1134008 1122747 1112430 1103111 1094510 1086480 1079116 1072321
49470 1072321 1065592 1058440 1050885 1043461 1036777 1031131 1026391 1022114 1017878 1013597 1009487 1005703 1002150 998718
49456 998718 995546 992950 991047 989586 988191 986807 985895 986115 987787 990763 994755 999542 1004735 1009607 1013484
49441 1013484 1016106 1017374 1016987 1014776 1011308 1007642 1004421 1001611 999139 997241 995972 994859 993433 991903
49427 991903 991028 991479 993450 996613 1000233 1003590 1006534 1009513 1012916 1016637 1020476 1024635 1029501 1035106 1041122
49412 1041122 1047291 1053576 1059999 1066569 1073374 1080585 1088354 1096755 1105639 1114543 1122946 1130741 1138223 1145523
49398 1145523 1152424 1158913 1165467 1172387 1179124 1184728 1188823 1191789 1194193 1196513 1199292 1202999 1207614 1212630
49384 1212630 1217534 1222164 1226717 1231698 1237708 1244858 1252530 1260049 1267507 1275456 1283924 1292334 1300407 1308560
49370 1308560 1317276 1326645 1336785 1348134 1360951 1374926 1389658 1405131 1421369 1437959 1454464 1471082
49358 1471082 1488435 1506886 1526489 1547454 1570055 1594064 1618784 1643792 1669282 1695535 1722377
49347 1722377 1749393 1776391 1803497 1830964 1859037 1887855 1917307 1947120 1977083 2006990 2036320
49336 2036320 2064348 2090844 2116412 2141825 2167189 2192003 2215803 2238382 2259477 2278788 2296360
49325 2296360 2312580 2327600 2341114 2352832 2362896 2371629 2379120 2385322 2390358 2394540 2398204 2401688 2405261
49312 2405261 2408817 2411862 2413993 2415238 2415717 2415330 2414207 2413166 2413096 2413981 2415096 2416230 2418078 2421300 2425780
49297 2425780 2431088 2437104 2443806 2450925 2458326 2466354 2475196 2484146 2492173 2499166 2506038 2513495 2521259 2528647
49283 2528647 2535396 2541585 2547121 2551646 2554788 2556146 2555219 2551696 2545797 2538065 2528781 2517797 2504884 2489950
49269 2489950 2472866 2453409 2431626 2408051 2383269 2357413 2330381 2302463 2274318 2246191 2217571
49258 2217571 2187948 2157630 2127439 2097777 2068421 2039212 2010465 1982566 1955526 1929183 1903589
49247 1903589 1878887 1854996 1831727 1809229 1788062 1768693 1750969 1734151 1717507 1700858 1684547
49236 1684547 1668903 1653845 1639048 1624271 1609394 1594329 1579131 1564136 1549722 1535988 1522906
49225 1522906 1510664 1499421 1488786 1478051 1467074 1456481 1446794 1437819 1429161 1420883 1413174 1405702
49213 1405702 1397864 1389581 1381389 1373774 1366792 1360340 1354418 1348950 1343576 1337774 1331243 1324241 1317583 1312061
49199 1312061 1307665 1303517 1298741 1293266 1287593 1282054 1276645 1271469 1266905 1263231 1260274 1257428 1253907 1249128
49185 1249128 1243134 1236663 1230634 1225561 1221478 1218189 1215387 1212689 1209818 1206673 1203101 1198900 1194269 1189973
49171 1189973 1186672 1184336 1182628 1181484 1180780 1179816 1177895 1175368 1173396 1172661 1172978 1174155 1176425 1179797 1183815
49156 1183815 1188381 1194079 1201113 1208532 1215189 1221177 1227651 1235482 1244603 1254460 1264476 1274100 1282936 1290970
49142 1290970 1298449 1305657 1313081 1321486 1331221 1341492 1350906 1358860 1365999 1373208 1380616 1387762 1394311 1400300
49128 1400300 1405941 1411421 1416762 1421687 1425802 1429040 1431768 1434292 1436479 1437992 1438660 1438450 1437359 1435654
49114 1435654 1433991 1432850 1431915 1430387 1427850 1424497 1420566 1416106 1411382 1406927 1402878 1398700 1394033 1389441
49100 1389441 1385803 1383125 1380555 1377460 1373970 1370506 1367412 1365141 1364110 1364080 1364291 1364558 1365625 1367862 1370268
49085 1370268 1371646 1372454 1374426 1378302 1382890 1386740 1389865 1393192 1396917 1400204 1402361 1403620 1404725 1406201
49071 1406201 1408072 1409879 1410885 1410628 1409480 1408432 1408124 1408284 1408252 1407769 1406988 1405862 1403977 1401105 1397610 1394057
49055 1394057 1390546 1386647 1381904 1376226 1369848 1363095 1356195 1349123 1341590 1333336 1324507 1315631 1307215 1299502
49041 1299502 1292544 1286218 1280128 1273832 1267352 1261226 1255920 1251396 1247409 1243908 1240911 1238310 1236133 1234720
49027 1234720 1234311 1234679 1235655 1237775 1241866 1247979 1255221 1262640 1269886 1277017 1284206 1291817 1300351 1310148 1321348
49012 1321348 1334128 1348488 1363796 1379028 1393785 1408608 1424127 1440310 1456901 1474045 1491988
49001 1491988 1510427 1528706 1546610 1564509 1582749 1601248 1619668 1637722 1655268 1672357 1689267
48990 1689267 1706402 1724121 1742632 1761809 1781036 1799550 1817228 1834875 1853390 1872750 1892113
48979 1892113 1910837 1929062 1947196 1965149 1982287 1998109 2012859 2027370 2042196 2056942 2070568
48968 2070568 2082346 2092310 2100797 2107988 2114045 2119320 2124034 2128003 2131023 2133316 2135230 2136683 2137291 2136907
48954 2136907 2135628 2133444 2130390 2126918 2123608 2120484 2117221 2114039 2111763 2110781 2110574 2110617 2111214 2113067 2116433
48939 2116433 2121150 2127057 2133895 2141159 2148669 2157011 2166753 2177389 2187804 2197762 2208216 2219930 2232507
48926 2232507 2245075 2257394 2269870 2282914 2296703 2311262 2326343 2341490 2356593 2372126 2388502
48915 2388502 2405498 2422784 2440639 2459505 2479040 2498391 2517431 2536988 2557694 2579310 2601422
48904 2601422 2624086 2647312 2670567 2693395 2716202 2739842 2764633 2790335 2816879 2844546 2873493
48893 2873493 2903569 2934647 2966742 2999825 3033897 3069215 3106047 3144154 3182852 3221626 3260428
48882 3260428 3299392 3338636 3378270 3418216 3457917 3496634 3534107 3570591 3606120 3640106 3671823
48871 3671823 3701046 3728112 3753615 3778021 3801197 3822168 3839761 3853630 3864387 3872609 3878111 3880436
48859 3880436 3879622 3876063 3869835 3860622 3848270 3833106 3815665 3796327 3775235 3752463 3728107 3702204
48847 3702204 3674608 3645121 3613869 3581316 3547722 3512806 3476291 3438598 3400566 3362681 3325156
48836 3325156 3288636 3253998 3221238 3189285 3157296 3125607 3095043 3065915 3038125 3011718 2986789
48825 2986789 2963242 2941231 2921501 2904766 2891018 2879960 2871725 2866550 2864013 2863296 2864070 2866538 2870741
48812 2870741 2876506 2883972 2893441 2904671 2917014 2930372 2945378 2962413 2980993 3000410 3020484 3041388
48800 3041388 3063149 3085693 3109120 3133548 3158811 3184527 3210340 3235989 3261253 3286033 3310359
48789 3310359 3334267 3357754 3380916 3403957 3427030 3450195 3473535 3497212 3521407 3546390 3572538
48778 3572538 3600087 3628923 3658888 3690226 3723385 3758325 3794358 3830823 3867718 3905596 3944961
48767 3944961 3985793 4027484 4069189 4110407 4151207 4191763 4231796 4270650 4307862 4343368 4377231
48756 4377231 4409396 4439599 4467294 4491843 4513116 4531764 4548463 4563073 4575001 4584255 4591480 4596906
48744 4596906 4599948 4600012 4597072 4591182 4581977 4569060 4552414 4532159 4508303 4481076 4451002 4418258 4382494
48731 4382494 4343788 4303305 4262334 4220967 4178452 4134668 4090499 4046700 4003148 3959459 3915748
48720 3915748 3872356 3829176 3785688 3741603 3697209 3653138 3609984 3568131 3527775 3488975 3451644
48709 3451644 3415510 3380216 3345566 3311671 3278821 3247223 3216932 3187924 3160166 3133648 3108427
48698 3108427 3084609 3062251 3041326 3021833 3003893 2987690 2973368 2961021 2950733 2942499 2936069 2930877
48686 2930877 2926271 2922054 2918839 2917527 2918213 2919848 2921339 2922690 2924603 2927193 2929855 2932339 2935022 2937760
48672 2937760 2939356 2938923 2937239 2935963 2935816 2936267 2936733 2937202 2937638 2937659 2937071 2936121 2934890 2933000 2930332 2927599
48656 2927599 2925633 2924335 2922783 2920352 2917328 2914420 2912016 2910075 2908427 2906870 2905018 2902311 2898359 2893205
48642 2893205 2887132 2880237 2872372 2863464 2853646 2842964 2831159 2817974 2803484 2787920 2771294 2753441
48630 2753441 2734328 2714030 2692484 2669730 2646384 2623433 2601289 2579393 2557037 2534421 2512580
48619 2512580 2492395 2473894 2456415 2439193 2421857 2404673 2388347 2373385 2359622 2346587 2334339
48608 2334339 2323608 2314907 2307797 2301358 2295300 2290238 2286815 2284882 2283721 2282837 2282240 2282034 2282077 2282164 2282416 2283404
48592 2283404 2285902 2290418 2296813 2304384 2312439 2320831 2329852 2339773 2350671 2362546 2375150 2387651 2399023
48579 2399023 2409071 2418741 2429032 2439913 2450646 2460885 2470891 2480856 2490763 2501018 2512496 2525525
48567 2525525 2539264 2552580 2565339 2578429 2592645 2607952 2623836 2639985 2656543 2673866 2692101
48556 2692101 2710942 2729859 2748668 2767660 2786918 2805716 2823123 2839256 2855465 2872983 2891620
48545 2891620 2910047 2927138 2942771 2957444 2971443 2984414 2995593 3004502 3011543 3017796 3024027 3029913
48533 3029913 3034411 3036819 3037284 3036385 3034568 3032009 3028691 3024388 3018779 3011747 3003514 2994403 2984610 2974220
48519 2974220 2963276 2951704 2939264 2925721 2911076 2895635 2879863 2864039 2847930 2830966 2812970
48508 2812970 2794561 2776524 2758895 2741161 2723192 2705301 2687326 2668515 2648723 2628978 2610235
48497 2610235 2592174 2573951 2555652 2538092 2521477 2505260 2489246 2473873 2459247 2444857 2430551
48486 2430551 2417004 2404763 2393474 2382545 2372000 2362159 2352962 2344167 2335866 2328227 2321007 2313923 2307345
48473 2307345 2301991 2297868 2294041 2289668 2284951 2280854 2277953 2275725 2273009 2269223 2264972 2261327 2258621 2256254
48459 2256254 2253607 2250611 2247290 2243275 2238204 2232240 2225769 2218787 2210918 2201904 2191770 2180675 2168926
48446 2168926 2156933 2144896 2132661 2120044 2106986 2093134 2077800 2060862 2043403 2026782 2011184
48435 2011184 1995628 1979365 1962640 1946143 1930261 1914974 1899950 1884556 1868252 1851140 1833789
48424 1833789 1816440 1798810 1780751 1762532 1744306 1725847 1707174 1688983 1672014 1656289 1641332
48413 1641332 1626882 1612935 1599327 1585827 1572621 1560330 1549494 1540367 1533120 1527762 1523633 1519466
48401 1519466 1514359 1508602 1503133 1498213 1493037 1486905 1480422 1475070 1471536 1468962 1466037 1462539 1459416 1457594
48387 1457594 1457174 1457747 1458929 1460337 1461442 1461905 1461992 1462327 1463141 1463966 1464185 1463772 1463394 1463726 1464722 1465601 1465600 1464685
48369 1464685 1463556 1462968 1463145 1463807 1464665 1465842 1467761 1470618 1473993 1477046 1479144 1480221 1480636 1480864 1481321 1482222
48353 1482222 1483417 1484568 1485692 1487376 1490217 1494103 1498248 1501884 1504794 1507241 1509567 1511805 1513546 1514280
48339 1514280 1513913 1512853 1511422 1509448 1506581 1502738 1497924 1491956 1484837 1477223 1469969 1463186 1456195 1448453
48325 1448453 1440016 1431035 1421297 1410572 1399074 1387260 1375373 1363355 1351028 1338227 1324954 1311520
48313 1311520 1298338 1285521 1272888 1260445 1248549 1237467 1226996 1216653 1206068 1195142 1184154
48302 1184154 1173828 1165017 1158036 1152417 1147362 1142257 1136788 1130988 1125339 1120473 1116539 1113139 1110022 1107506
48288 1107506 1105952 1105215 1104895 1104802 1104881 1105030 1105426 1106678 1109159 1112374 1115482 1118273 1121087 1123920 1126266 1127909
48272 1127909 1129297 1130930 1132842 1134870 1137001 1139121 1140856 1142022 1143011 1144355 1146047 1147677 1149222 1151325
48258 1151325 1154582 1158791 1163114 1166984 1170725 1175234 1181162 1188461 1196620 1205175 1214018 1223372 1233559 1244645
48244 1244645 1256294 1268173 1280575 1294406 1310392 1328562 1348806 1371761 1398746 1430904 1468792
48233 1468792 1512900 1564257 1624441 1695235 1778449 1876149 1991103 2126302 2281541 2447298
48223 2447298 2601205 2713708 2762106 2742382 2668481 2560569 2433831 2296217 2152577 2007998
48213 2007998 1867777 1736513 1617825 1513804 1424208 1347071 1280625 1224115 1176601 1135996
48203 1135996 1100088 1067926 1039487 1014421 991884 971301 952452 934953 918392 902940 889098
48192 889098 876795 865403 854696 845071 836629 828742 820810 812901 805303 797980 790848 784113 777977
48179 777977 772436 767686 764195 761834 759426 755824 751189 746619 742694 739013 735019 730630 726012 721317
48165 721317 716777 712674 708977 705291 701227 696668 691677 686481 681454 676863 672574 668357 664393 661071
48151 661071 658285 655422 652231 649277 647251 646112 645236 644215 643159 642329 641779 641444 641328 641449 641682 641858
48135 641858 642111 642936 644706 647162 649672 652044 654732 658008 661224 663353 664069 663878 663279 662254 660680
48120 660680 658768 656888 655209 653714 652371 651178 650142 649279 648490 647539 646445 645877 646693 648927 651617
48105 651617 653833 655553 657273 659198 661243 663555 666426 669692 672713 675123 677207 679322 681216 682277
48091 682277 682332 681890 681506 681127 680283 678755 676741 674271 670811 665810 659572 653198 647512 642268 636580 629939
48075 629939 622555 614834 606906 598706 590277 581773 573276 564847 556674 548962 541606 534259 526878 519984
48061 519984 514029 508671 503098 497089 491266 486088 481126 475780 470326 465564 461578 457551 452957 448387
48047 448387 444829 442503 440751 438883 436835 435088 434178 434246 434927 435628 435871 435397 434219 432830 432153 432785
48031 432785 434289 435659 436516 437285 438168 438673 438557 438548 439487 441166 442711 443849 445082 446780 448835 451206
48015 451206 454044 457147 460007 462662 465867 470039 474547 478551 482115 485934 490276 494821 499360 503966
48001 503966 508407 512066 514745 517138 520132 523883 527842 531467 534534 536904 538445 539265 539607 539395 538193
47986 538193 535855 532919 529948 526628 522020 515734 508447 501022 493522 485441 476642 467647 458981 450602
47972 450602 442024 432796 422897 412901 403735 395904 388860 381438 373089 364448 356586 349988 344432 339457
47958 339457 334548 329166 323194 317352 312658 309300 306345 302737 298302 293688 289645 286598 284604 283327
47944 283327 282137 280561 278624 276588 274476 272142 269704 267572 266003 264911 264221 264051 264360 264661 264362
47929 264362 263280 261680 259952 258452 257497 257230 257459 257819 258125 258486 259081 259962 261051 262218 263406 264737
47913 264737 266372 268151 269597 270530 271517 273280 275674 277728 278834 279507 280710 282799 285435 288251 291175
47898 291175 294259 297646 301638 306405 311587 316557 321123 325609 330227 334827 339429 344531 350385 356317
47884 356317 361283 365099 368582 372440 376446 380002 383136 386453 390199 393806 396564 398442 399956 401367
47870 401367 402422 403035 403863 405778 408720 411432 412540 411759 409950 408141 406674 405144 402918 399715 395895
47855 395895 392188 388994 385958 382403 378108 373492 369059 364917 360847 356577 351874 346682 341306 336270
47841 336270 331758 327454 323065 318832 315262 312509 310250 308074 305784 303481 301567 300447 299908 299011 296999
47826 296999 294235 291859 290595 290316 290665 291462 292426 293116 293509 294193 295665 297794 300257 303080 306298 309446
47810 309446 311996 314128 316588 319817 323625 327659 331791 336025 340420 345126 350154 355112 359514 363450
47796 363450 367569 372286 377314 382173 386874 391905 397725 404485 412111 420442 429264 438297 447176 455578
47782 455578 463487 471303 479496 488128 496859 505371 513606 521578 529199 536285 542492 547186 549656 549584 547189
47767 547189 542925 537300 530945 524421 517678 510028 500923 490647 480087 470018 460790 452374 444341
47754 444341 435972 426809 417087 407357 397738 387930 377974 368571 360426 353586 347633 342333 337726 333648
47740 333648 329546 324973 320057 315252 310693 306102 301370 296880 292974 289333 285292 280800 276648 273630
47726 273630 271772 270553 269566 268641 267593 266252 264711 263240 261986 261010 260539 260839 261767 262838 263847 265068
47710 265068 266638 268066 268736 268719 268736 269343 270450 271638 272589 273133 273278 273372 273882 274690 274929 273974 272394 271363
47692 271363 271206 271199 270904 270915 271809 273019 273493 273205 273184 274140 275771 277597 279768 282799 287014 292595 299686
47675 299686 308090 317152 326334 335728 345733 356437 367527 378537 388933 398269 406553 414168 421058
47662 421058 426389 429494 430822 431306 430945 428763 424231 418046 411268 404296 397088 389890 383168 376888 370324
47647 370324 362737 354204 345760 338634 333181 328572 323716 318465 313592 309637 306203 302577 298616 294696
47633 294696 291054 287607 284237 280864 277288 273398 269537 266268 263627 260890 257330 253030 248756 245115
47619 245115 242035 239097 236170 233608 231788 230540 229141 226901 223776 220397 217522 215463 214028 212935
47605 212935 212213 212117 212662 213373 213616 213192 212472 211994 212076 212818 214215 216118 218216 220232 222068 223605 224479
47588 224479 224324 223257 221964 221263 221670 223322 225973 228944 231364 232773 233471 234133 235130 236353 237569 238674
47572 238674 239612 240341 241027 242094 243915 246517 249700 253343 257494 262196 267374 272865 278477 284014 289318
47557 289318 294251 298583 301940 303977 304602 304005 302519 300465 297996 294945 290975 285983 280286 274242 267869
47542 267869 261025 253837 246616 239431 232215 225332 219549 215204 211714 208193 204355 200573 197306 194750
47528 194750 192813 191118 189178 186899 184802 183431 182663 182026 181552 181756 182673 183458 183233 181971 180248 178497
47512 178497 176926 175893 175743 176176 176275 175461 174205 173555 174115 175667 177656 179703 181615 183198 184302 184932
47496 184932 185131 184872 184232 183589 183363 183603 184076 184764 185901 187388 188570 188884 188492 187965 187571 187209 186879 186767
47478 186767 186877 186999 187103 187359 187734 187948 187951 188133 188867 190164 191931 194175 196702 198921 200403 201409 202571
47461 202571 204120 205868 207797 210201 213161 216318 219323 222247 225323 228568 231884 235334 239030 242902
47447 242902 246886 251276 256494 262429 268283 273314 277492 281207 284505 286982 288381 288924 288912 288294 286885
47432 286885 284824 282571 280446 278346 275946 273131 270257 268025 266855 266305 265329 263336 260836 258746 257256
47417 257256 255773 253928 252115 250919 250406 250189 249888 249309 248472 247747 247733 248725 250379 252096 253557 254746
47401 254746 255696 256548 257704 259531 261904 264320 266430 268293 270171 272381 275242 278795 282503 285614 287950
47386 287950 290075 292496 294961 296740 297379 296913 295500 293206 290195 286875 283694 280829 278131 275321 272193
47371 272193 268726 265153 261981 259765 258594 257742 256130 253351 250115 247469 245734 244501 243525 243111 243482
47356 243482 244234 244728 244844 245092 246119 248295 251537 255290 258847 261997 265183 268739 272158 274598 276019
47341 276019 277292 279166 281581 284108 286452 288253 288901 288081 286248 284174 282204 280344 278749 277563 276340
47326 276340 274226 270861 266725 262525 258591 254959 251644 248602 245724 242965 240281 237345 233775 229755
47312 229755 226115 223553 222067 221264 220792 220238 219138 217577 216371 216150 216491 216506 215981 215324 214623 213570 212280
47295 212280 211375 211049 210763 210163 209651 209683 210072 210432 210813 211299 211434 210713 209391 208127 207000 205542 203715
47278 203715 202078 200858 199496 197467 195058 192876 190939 188739 186085 183412 181254 179752 178778 178222 177907
47263 177907 177430 176419 175029 173911 173489 173449 173235 172986 173523 175225 177299 178542 178613 178123 177634 177170 176770
47246 176770 176881 177803 179172 180490 181941 184136 187063 189800 191474 192273 193243 195224 198083 200874 202636
47231 202636 203139 203001 203041 203518 204067 204357 204543 204936 205497 205989 206508 207450 208857 210144 210656 210326 209551 208609
47213 208609 207501 206323 205510 205493 206200 207037 207434 207421 207660 208847 211093 213921 216821 219656 222585 225847
47197 225847 229747 234554 240163 245923 251098 255481 259489 263750 268731 274487 280430 285531 289215 292057
47183 292057 295176 298902 302482 305146 306909 308089 308611 308287 307434 306660 306132 305446 304177 302217 299645 296672
47167 296672 293711 291195 289211 287462 285561 283251 280498 277606 275047 272882 270498 267401 264124 261848
47153 261848 261045 261029 261013 261111 261990 263863 266236 268491 270480 272604 275476 279337 283701 287737 291114 294231
47137 294231 297514 300817 303749 306259 308534 310520 311947 312749 313108 313102 312644 311728 310490 308988 307148 304866
47121 304866 302056 298739 295352 292697 291153 289968 287855 284389 280378 276850 274131 272104 270724 269858
47107 269858 268964 267526 265610 263623 261663 259538 257305 255276 253490 251595 249405 247187 245251 243569
47093 243569 242003 240616 239513 238514 237288 235792 234436 233793 234151 235287 236581 237427 237560 237035 236027 234900
47077 234900 234337 234884 236150 236746 235467 232486 229209 227003 226245 226389 226565 226064 224611 222464 220144 217987
47061 217987 215948 213836 211600 209357 207254 205364 203629 201846 199801 197518 195310 193513 192160 191029
47047 191029 190000 189316 189339 190010 190674 190670 190079 189661 189940 190589 190914 190737 190486 190502 190649 190660 190569 190639 191053 191818 192762
47026 192762 193572 193972 194024 194153 194728 195705 196775 197792 198926 200419 202197 203773 204618 204750 204875 205711 207247
47009 207247 208889 210284 211578 212782 213403 213112 212381 211918 211564 210353 207792 204619 202015 200409 199406
46994 199406 198657 198311 198541 198991 199031 198490 197871 197803 198425 199412 200445 201441 202358 203014 203249 203197 203230 203561 203904 203626
46974 203626 202410 200819 199933 200287 201345 202275 202954 203803 204784 205260 205039 204983 206110 208402 210904 212757 213794
46957 213794 214333 214834 215621 216582 217229 217368 217522 218279 219376 219935 219561 218681 217821 217171 217005 217821 219605 221420
46939 221420 222269 222132 221759 221641 221637 221431 220897 220001 218843 217852 217557 218016 218712 219150 219289 219315 219248 219039 218851 218939
46919 218939 219265 219455 219178 218509 217891 217792 218334 219187 219895 220349 220883 221804 222929 223701 223720 223019 221910 220718
46901 220718 219598 218430 216912 215022 213308 212385 212082 211492 210089 208423 207390 207137 207186 207379 208058 209243
46885 209243 210306 210688 210524 210296 210222 210346 210861 211885 213040 213726 213795 213642 213631 213768 214048 214808 216451 218856
46867 218856 221302 223070 224078 224841 225824 227006 228144 229242 230520 231987 233407 234746 236292 238178 240016
46852 240016 241236 241635 241517 241439 241921 243162 244908 246701 248298 249628 250466 250669 250792 251846 254071 256558
46836 256558 258513 260288 262470 264555 265519 265518 266004 267999 271107 274409 277531 280454 283039 285313 287790
46821 287790 290982 294792 298755 302543 305966 308798 311034 313156 315712 318731 321798 324636 327380 330373
46807 330373 333817 337495 340781 343173 344927 346869 349425 352191 354636 356808 359014 361284 363697 366823
46793 366823 371071 375668 379058 380587 381293 382763 385606 389299 393169 397002 400809 404457 407725 410649
46779 410649 413651 417218 421448 425958 430332 434524 438688 442662 445975 448456 450600 453052 455930 458918
46765 458918 461937 465337 469315 473495 477363 480906 484499 488264 491874 495003 497630 499843 501723 503532
46751 503532 505652 508072 510264 511918 513512 515775 518746 521870 524950 528482 533022 538635 545074 552042
46737 552042 559107 565717 571648 577265 583194 589817 597118 604771 612326 619503 626380 633176 639941 646740
46723 646740 653983 661954 669977 676637 681170 684249 687083 690192 693431 696734 700143 703253 705286 705989
46709 705989 706152 707013 709204 712326 715473 718130 720494 722895 725171 726940 728382 730197 732641 735083 736819
46694 736819 737983 739335 741410 744145 747045 749424 750680 750610 749289 746567 742081 736047 729492 723262 717102
46679 717102 710220 702455 694363 686375 678437 670359 662001 653163 643785 634212 624929 616095 607673 599734
46665 599734 592175 584360 575667 566292 556915 547743 538500 529309 520753 512905 505077 496884 488904 481904
46651 481904 475878 470286 464785 459256 453427 447026 440251 433684 427722 422308 417182 412203 407429 402989
46637 402989 398873 394874 390838 386935 383575 381053 379402 378499 378053 377602 376742 375425 373851 372211 370701
46622 370701 369523 368496 366953 364563 362067 360493 359721 358661 356969 355643 355524 356058 356255 356179 356596 357566
46606 357566 358348 358622 358937 359820 361226 363148 366137 370593 375880 380690 384320 387237 390344 394026 398070
46591 398070 402266 406725 411603 416799 422045 427051 431485 435058 437814 440155 442368 444363 446059 447710
46577 447710 449539 451379 453165 455435 458723 462616 466099 468770 470998 472932 474180 474650 474903 475350 475811
46562 475811 476182 476755 477443 477438 476262 474563 473253 472413 471658 471016 470631 470069 468807 467133 465751 464744 463708
46545 463708 462749 462417 462687 462856 462576 462231 462218 462485 462929 463549 464101 464289 464456 465380 467161 469010 470441 471961
46527 471961 474169 476797 479251 481609 484472 488066 492091 496347 501051 506499 512659 519120 525370 531293
46513 531293 537432 544475 552430 560656 568797 577217 586273 595685 605015 614388 624250 634705 645568 656788
46499 656788 668355 680011 691553 703207 715185 727051 738122 748411 758473 768334 777314 785057
46487 785057 792018 798533 804052 807815 809942 811275 812346 813011 813019 812534 812024 811974 812625 813786 814921 815736 816586
46470 816586 818019 819974 821795 823041 823872 824549 824976 824988 824665 824024 822637 819922 815640 809767 802173 793017
46454 793017 783339 774534 766872 759025 749496 738211 726320 714673 703113 691302 679622 668875
46442 668875 659389 650815 642798 635477 629237 624197 620140 616880 614456 612971 612383 612543 613302 614492 615968
46427 615968 617789 620265 623598 627559 631679 635672 639452 642793 645345 647043 648208 649094 649617 649656 649275
46412 649275 648360 646342 642743 637934 632951 628510 624475 620369 616087 611966 608336 605173 602143 598886
46398 598886 595285 591531 587984 584999 582829 581472 580546 579485 578118 576952 576720 577659 579396 581419 583471
46383 583471 585586 587994 590979 594596 598515 602370 606201 610247 614380 618096 621210 624161 627421 630871
46369 630871 634021 636557 638413 639527 639947 640052 640253 640402 639816 638017 635179 631743 627876 623611 619377
46354 619377 616009 614044 613200 612681 611952 610999 609947 608703 607183 605657 604617 604321 604728 605918 608344 612435
46338 612435 618090 624734 631817 639133 646745 654829 663651 673440 684085 695083 705999 716978 728630
46325 728630 741348 754942 769052 783666 798969 814672 829828 843468 855312 865718 875055 883232
46313 883232 889868 894712 897787 899076 898234 894852 889116 881940 874132 865526 855306 843254 830305 817759
46299 817759 806291 795979 786917 779319 773063 767570 762255 756998 752169 748365 746067 745385 746078 747881
46285 747881 750800 754989 760437 766843 773737 780767 788085 796463 806661 818498 830920 843228 855859
46272 855859 869523 883992 898358 912226 925928 939605 952778 964996 976271 986635 995822 1003701
46260 1003701 1010521 1016321 1020472 1022241 1021611 1019201 1015602 1011042 1005568 999196 991981 984138 975976 967540
46246 967540 958456 948314 937120 925207 912914 900497 888197 876224 864825 854402 845336 837548
46234 837548 830533 823987 818056 812724 807451 801868 796582 792656 790326 788679 786648 783972 781131 778736
46220 778736 777093 776174 775825 776049 777012 778678 780658 782602 784528 786490 788107 788932 789226 789889 791478 793604
46204 793604 795393 796269 796252 795847 795777 796472 797617 798398 798354 797775 797201 796835 796623 796574 796720 796950 797214 797698 798556
46185 798556 799525 800123 800199 800108 800346 801200 802634 804321 805811 806932 808030 809601 811696 813971 816350 819272
46169 819272 823094 827554 832114 836621 841246 845905 850252 854301 858650 863844 869756 875846 881830 887817
46155 887817 893966 900297 906824 913605 920674 928060 935750 943429 950489 956634 962401 968664 975681 983029
46141 983029 990382 997773 1005098 1012146 1019380 1027913 1038068 1048535 1057684 1065366 1072614 1079864 1086520 1092380
46127 1092380 1098428 1105652 1113706 1121460 1128536 1135637 1143407 1151514 1158988 1165151 1170048 1174170 1178049 1182072
46113 1182072 1186467 1191212 1195949 1200236 1204065 1208048 1212824 1218269 1223463 1227505 1230255 1232387 1234908 1238597
46099 1238597 1243547 1249107 1254409 1259116 1263593 1268323 1273283 1277987 1282059 1285660 1289379 1293671 1298373 1302901
46085 1302901 1306997 1311077 1315552 1320000 1323457 1325592 1327157 1329140 1331842 1335059 1338735 1343048 1348004 1353346
46071 1353346 1358852 1364426 1369910 1375085 1379916 1384609 1389387 1394348 1399520 1404901 1410347 1415610 1420582 1425459
46057 1425459 1430545 1435893 1441246 1446373 1451412 1456813 1462947 1469833 1477228 1484851 1492448 1499863 1507205 1514848
46043 1514848 1523054 1531641 1540192 1548539 1556874 1565413 1574156 1582929 1591471 1599586 1607430 1615503 1623951 1631977
46029 1631977 1638461 1643226 1647221 1651331 1655588 1659735 1663967 1668595 1673439 1678171 1683032 1688631 1695069 1701685
46015 1701685 1707638 1712440 1716044 1718949 1722153 1726553 1732173 1738229 1743988 1749333 1754542 1759841 1765240 1770599
46001 1770599 1775857 1781369 1787865 1795710 1804332 1812761 1820688 1828531 1836575 1844676 1852929 1861966 1872172 1883066
45987 1883066 1893917 1904711 1916083 1928482 1941731 1955303 1968687 1981595 1994095 2006538 2019138
45976 2019138 2031692 2043837 2055437 2066472 2076700 2085700 2093202 2099172 2103618 2106589 2108324 2109186 2109486
45963 2109486 2109532 2109736 2110409 2111426 2112397 2113167 2113924 2114770 2115498 2115880 2115980 2115980 2115873 2115508 2114873 2114130 2113358 2112386 2110941
45944 2110941 2108911 2106408 2103572 2100409 2096900 2093211 2089629 2086201 2082563 2078291 2073366 2068203 2063278 2058818
45930 2058818 2054760 2050890 2047095 2043630 2041019 2039465 2038444 2037217 2035745 2034776 2034887 2035775 2036675 2037196 2037463
45915 2037463 2037631 2037751 2038018 2038752 2039902 2040883 2041122 2040666 2040039 2039669 2039688 2040232 2041621 2044099 2047547 2051571 2055707
45898 2055707 2059488 2062534 2064874 2067094 2069820 2073028 2076126 2078826 2081544 2084779 2088424 2092107 2095940 2100378
45884 2100378 2105312 2109884 2113454 2116398 2119608 2123517 2128000 2133042 2138970 2145876 2153260 2160507 2167574 2174987
45870 2174987 2183249 2192417 2202219 2212368 2222690 2233087 2243530 2254105 2265003 2276382 2288191 2300099
45858 2300099 2311594 2322216 2331772 2340428 2348537 2356306 2363545 2369816 2374902 2379105 2382968 2386665 2389735
45845 2389735 2391498 2391741 2390879 2389488 2387786 2385707 2383338 2381027 2378924 2376616 2373507 2369525 2365264 2361338
45831 2361338 2357746 2354016 2349763 2344943 2339573 2333459 2326335 2318207 2309408 2300223 2290475 2279567 2266993
$$ [...]
##END NTUPLES=NMR SPECTRUM
##END=
