##TITLE=NES1052_944593_9270656_77ro0bMBqx
##JCAMPDX= 6.0         $$ Bruker NMR JCAMP-DX V2.0
##DATA TYPE= NMR SPECTRUM
##DATA CLASS= NTUPLES
##ORIGIN= BRUKER
##OWNER= Administrator
$$ 1.72 TOPSPIN		Version 2.1
$$ 2015-07-11 21:57:42.519 -0700  Administrator@X
$$ Compression mode = diff/dup
##.OBSERVE FREQUENCY= 400.02188249412
##.OBSERVE NUCLEUS= ^1H
##.ACQUISITION MODE= SIMULTANEOUS (DQD)
##.ACQUISITION SCHEME= undefined
##.AVERAGES= 64
##.DIGITISER RES= 22
##SPECTROMETER/DATA SYSTEM= spect
##.PULSE SEQUENCE= noesygpps1d.comp
##.SOLVENT NAME= COFFEE_meoh
##.SHIFT REFERENCE= INTERNAL, COFFEE_meoh, 1, 14.963
##AUDIT TRAIL= $$ (NUMBER, WHEN, WHO, WHERE, PROCESS, VERSION, WHAT)
$$ ##TITLE= Audit trail, TOPSPIN		Version 2.1
$$ ##JCAMPDX= 5.01
$$ ##ORIGIN= Bruker BioSpin GmbH
$$ ##OWNER= Administrator
$$ $$ E:\/data/COFFEE/nmr/NES1052_944593_9270656_77ro0bMBqx/12/pdata/1/auditp.txt
$$ ##AUDIT TRAIL=  $$ (NUMBER, WHEN, WHO, WHERE, PROCESS, VERSION, WHAT)
(   1,<2015-07-11 21:57:37.222 -0700>,<Administrator>,<X>,<go>,<TOPSPIN 2.1>,
      <created by zg
	started at 2015-07-11 21:46:07.613 -0700,
	POWCHK enabled, PULCHK disabled,
       configuration hash MD5:
       21 0F 79 D6 B3 7B B4 F6 88 20 88 DB 03 48 BD 9F
       data hash MD5: 64K
       9E 96 4B 5B C7 47 80 2F 09 3B AD A9 D8 1A 9E FA>)
(   2,<2015-07-11 21:57:40.394 -0700>,<Administrator>,<X>,<proc1d>,<TOPSPIN 2.1>,
      <Start of raw data processing
       efp LB = 0.3 FT_mod = 6 PKNL = 1 PHC0 = 0 PHC1 = 0 SI = 128K 
       data hash MD5: 128K
       C3 84 7C 34 E5 29 3B E1 85 F1 A5 2C 5A F2 7A 32>)
(   3,<2015-07-11 21:57:41.285 -0700>,<Administrator>,<X>,<proc1d>,<TOPSPIN 2.1>,
      <pk PHC0 = -85.95154 PHC1 = 0 
       data hash MD5: 128K
       1D CE 80 3E A2 01 68 69 F6 E1 20 F9 90 5F 0F 50>)
(   4,<2015-07-11 21:57:41.675 -0700>,<Administrator>,<X>,<proc1d>,<TOPSPIN 2.1>,
      <abs ABSG = 1 
       data hash MD5: 128K
       71 7B F4 B4 4F 55 D1 B6 2A 80 A7 80 1E 5D 3C F2>)
(   5,<2015-07-11 21:57:41.785 -0700>,<Administrator>,<X>,<proc1d>,<TOPSPIN 2.1>,
      <abs ABSG = 2 
       data hash MD5: 128K
       FF E0 2C 4A 9F 1C 9F FF C0 CE DB E4 9D 9B C0 3A>)
(   6,<2015-07-11 21:57:41.878 -0700>,<Administrator>,<X>,<proc1d>,<TOPSPIN 2.1>,
      <abs ABSG = 3 
       data hash MD5: 128K
       B0 4B EC 4F 9C 63 22 DC C1 3D C3 65 68 24 27 B4>)
(   7,<2015-07-11 21:57:41.972 -0700>,<Administrator>,<X>,<proc1d>,<TOPSPIN 2.1>,
      <abs ABSG = 4 
       data hash MD5: 128K
       CD 0D E8 3A 64 7A 67 F7 DE 1C E6 9F 2F 08 99 92>)
(   8,<2015-07-11 21:57:42.144 -0700>,<Administrator>,<X>,<proc1d>,<TOPSPIN 2.1>,
      <abs ABSG = 5 
       data hash MD5: 128K
       8E 43 DB 51 FD 6D BC D1 59 25 AD D9 D9 14 8A 08>)
$$ ##END=
$$ 
$$ $$ hash MD5
$$ $$ 21 EA 1E 76 D7 1E 63 0B 80 08 37 44 BB 12 07 95
##$RELAX= 
##$RELAX= 
##$RELAX= 
##$RELAX= 
##$RELAX= 
##$RELAX= 
##$RELAX= 
##$RELAX= 
$$ Bruker specific parameters
$$ --------------------------
##$DU= <E:\>
##$EXPNO= 12
$$ [...]
150 150 150 150 150 150 150 150
##$TP07= 0
##$TPNAME0= <>
##$TPNAME1= <>
##$TPNAME2= <>
##$TPNAME3= <>
##$TPNAME4= <>
##$TPNAME5= <>
##$TPNAME6= <>
##$TPNAME7= <>
##$TPOAL= (0..7)
0.5 0.5 0.5 0.5 0.5 0.5 0.5 0.5
##$TPOFFS= (0..7)
0 0 0 0 0 0 0 0
##$TUNHIN= 0
##$TUNHOUT= 0
##$TUNXOUT= 0
##$USERA1= <user>
##$USERA2= <user>
##$USERA3= <user>
##$USERA4= <user>
##$USERA5= <user>
##$V9= 5
##$VALIST= <valist>
##$VCLIST= <CCCCCCCCCCCCCCC>
##$VD= 0
##$VDLIST= <DDDDDDDDDDDDDDD>
##$VPLIST= <PPPPPPPPPPPPPPP>
##$VTLIST= <TTTTTTTTTTTTTTT>
##$WBST= 2048
##$WBSW= 25
##$XGAIN= (0..3)
0 0 0 0
##$XL= 0
##$YL= 0
##$YMAX_a= 7806548
##$YMIN_a= -16890795
##$ZGOPTNS= <>
##$ZL1= 120
##$ZL2= 120
##$ZL3= 120
##$ZL4= 120
##$ABSF1= 14.963
##$ABSF2= -5.595181
##$ABSG= 5
##$ABSL= 3
##$ALPHA= 0
##$AQORDER= 0
##$ASSFAC= 0
##$ASSFACI= 0
##$ASSFACX= 0
##$ASSWID= 0
##$AUNMP= <proc_prof1d_extract.lims>
##$AXLEFT= 0
##$AXNAME= <>
##$AXNUC= <1H>
##$AXRIGHT= 0
##$AXTYPE= 0
##$AXUNIT= <>
##$AZFE= 0.1
##$AZFW= 0.1
##$BCFW= 0
##$BC_mod= 0
##$BYTORDP= 0
##$COROFFS= 0
##$CY= 15
##$DATMOD= 1
##$DC= 0
##$DFILT= <>
##$DTYPP= 0
##$F1P= 0
##$F2P= 0
##$FCOR= 0.5
##$FTSIZE= 131072
##$FT_mod= 6
##$GAMMA= 0
##$GB= 0
##$INTBC= 1
##$INTSCL= 1
##$ISEN= 128
##$LB= 0.3
##$LEV0= 0
##$LPBIN= 0
##$MAXI= 10000
##$MC2= 0
##$MEAN= 0
##$ME_mod= 0
##$MI= 0
##$NCOEF= 0
##$NC_proc= -2
##$NLEV= 6
##$NOISF1= 0
##$NOISF2= 0
##$NSP= 0
##$NTH_PI= 0
##$NZP= 0
##$OFFSET= 14.963
##$PC= 1
##$PHC0= -85.95154
##$PHC1= 0
##$PH_mod= 1
##$PKNL= yes
##$PPARMOD= 0
##$PPDIAG= 0
##$PPIPTYP= 0
##$PPMPNUM= 2147483647
##$PPRESOL= 1
##$PSCAL= 4
##$PSIGN= 0
##$PYNMP= <proc.py>
##$REVERSE= no
##$SF= 400.020008835306
##$SI= 131072
##$SIGF1= 0
##$SIGF2= 0
##$SINO= 400
##$SIOLD= 131072
##$SPECTYP= <>
##$SREGLST= <1H.CDCl3>
##$SSB= 0
##$STSI= 131072
##$STSR= 0
##$SW_p= 8223.68421052631
##$SYMM= 0
##$S_DEV= 0
##$TDeff= 65536
##$TDoff= 0
##$TI= <>
##$TILT= no
##$TM1= 0
##$TM2= 0
##$TOPLEV= 0
##$USERP1= <user>
##$USERP2= <user>
##$USERP3= <user>
##$USERP4= <user>
##$USERP5= <user>
##$WDW= 1
##$XDIM= 131072
##$YMAX_p= 424959107
##$YMIN_p= -12902
##$CURPLOT= <Network HP LaserJet P1505>
##$CURPRIN= <$Network HP LaserJet P1505>
##$DFORMAT= <normdp>
##$LAYOUT= <+/1D_H.xwp>
##$LFORMAT= <normlp>
##$PFORMAT= <normpl>
##$SURQMSG= 1
$$ End of Bruker specific parameters
$$ ---------------------------------
##NTUPLES= NMR SPECTRUM
##VAR_NAME=  FREQUENCY,     SPECTRUM/REAL,   SPECTRUM/IMAG
##SYMBOL=    X,             R,               I
##VAR_TYPE=  INDEPENDENT,   DEPENDENT,       DEPENDENT
##VAR_FORM=  AFFN,          ASDF,            ASDF
##VAR_DIM=   131072,        131072,          131072
##UNITS=     HZ,            ARBITRARY UNITS, ARBITRARY UNITS
##FACTOR=    0.0627417313425164, 1,          1
##FIRST=     8223.62146879497, -3952,        -53320
##LAST=      0,             -1885,           -54858
##MIN=       0,             -12902,          0
##MAX=       8223.62146879497, 424959107,    0
$$ Real data points
##PAGE= N=1
##DATA TABLE= (X++(R..R)), XYDATA
$$ [...]
63201I17289j7207k1443k4046k5110k5236k4989k4664k4227k3353k1724j9340
$$ 917289 900082 878639 854593 829483 804247 779258 754594 730367 707014 685290 665950
63190F65950j6451j3284j0035p066m668k655m82K023M383O105P364Q710J0332
$$ 665950 649499 636215 626180 619114 614446 611791 611309 613332 617715 623820 631184 639894 650226
63177F50226J1911J3180J4212J5086J5613J5573J5107J4655J4564J4847J5295
$$ 650226 662137 675317 689529 704615 720228 735801 750908 765563 780127 794974 810269
63166H10269J5589J5325J4172J2201R992Q150O649M795J957j738n571r012j2161
$$ 810269 825858 841183 855355 867556 877548 885698 892347 897142 899099 897361 891790 882778 870617
63153H70617j5306j8326k0720k2148k2708k2608k1905k0699j9361j8272j7351
$$ 870617 855311 836985 816265 794117 771409 748801 726896 706197 686836 668564 651213
63142F51213j6154j4501j2769j1533j1021j0963j0797r978q384o549n254m720
$$ 651213 635059 620558 607789 596256 585235 574272 563475 553497 545113 538564 533310 528590
63130E28590m379l661k691j919j314m62O49J478J709J745K146K873L407L492L460
$$ 528590 524211 520550 517859 515940 514626 514164 514813 516291 518000 519745 521891 524764 528171 531663 535123
63115E35123L835M696N520N690N243M949N422O275O549O021N520N794O442O440
$$ 535123 538958 543654 549174 554864 560107 565056 570478 576753 583302 589323 594843 600637 607079 613519
63101F13519N423M011K990K628K741K968K872K166J039R8k33r6Q4J27J65L61P00
$$ 613519 618942 622953 625943 628571 631312 634280 637152 639318 640357 640455 640222 640126 640210 640337 640502 640863 641563
63084F41563J005J074Q53O32Q53J639K493K743K263J601J339J564K015K561L300
$$ 641563 642568 643642 644495 645127 645980 647619 650112 652855 655118 656719 658058 659622 661637 664198 667498
63069F67498M249N286O358P519Q656R438R788J0222J1440J3526J5871J7918J9757
$$ 667498 671747 677033 683391 690910 699566 709004 718792 729014 740454 753980 769851 787769 807526
63056H07526K1778K4007K6144K8157L0389L2947L5404L7417L9270M1389M3478
$$ 807526 829304 853311 879455 907612 938001 970948 1006352 1043769 1083039 1124428 1167906
63045A167906M4801M5334M5892M6850M7400M6661M5001M3505M2506M1460M0159
$$ 1167906 1212707 1258041 1303933 1350783 1398183 1444844 1489845 1533350 1575856 1617316 1657475
63034A657475L9076L8422L7792L7044L6641L6597L5770L2982K8302K2608J6303
$$ 1657475 1696551 1734973 1772765 1809809 1846450 1883047 1918817 1951799 1980101 2002709 2019012
63023B019012R170J159p472j6538k5774l4427m1686m7450n2044n5326n6773n6399
$$ 2019012 2028182 2029341 2021869 2005331 1979557 1945130 1903444 1855994 1803950 1748624 1691851 1635452
63011A635452n4808n2302m8673m4056l9190l4583k9962k4850j9161j3093o958
$$ 1635452 1580644 1528342 1479669 1435613 1396423 1361840 1331878 1307028 1287867 1274774 1267816
63000A267816j271L631Q176J3027J7759K0903K1858K1949K2860K4638K6002K6232
$$ 1267816 1266545 1270176 1278352 1291379 1309138 1330041 1351899 1373848 1396708 1421346 1447348 1473580
62988A473580K5862K5657K5734K5690K5052K3500K1034J8010J4674J0844O323
$$ 1473580 1499442 1525099 1550833 1576523 1601575 1625075 1646109 1664119 1678793 1689637 1695960
62977A695960J464l204p829j3196j9784k7109l4103l9878m4190m7365m9846n1667
$$ 1695960 1697424 1694220 1686391 1673195 1653411 1626302 1592199 1552321 1508131 1460766 1410920 1359253
62965A359253n2428n1863n0172m7711m4666m1291l8097l5403l2912l0166k7213
$$ 1359253 1306825 1254962 1204790 1157079 1112413 1071122 1033025 997622 964710 934544 907331
62954I07331k4472k2164k0318j9043j8254j7301j5526j3181j1258j0299r936r586
$$ 907331 882859 860695 840377 821334 803080 785779 770253 757072 745814 735515 725579 715993
62942G15993r104q632q285q181q407q745q766q338p710p095o509o063n977o138
$$ 715993 706889 698257 689972 681791 673384 664639 655873 647535 639825 632730 626221 620158 614181 608043
62928F08043o108n711n228m854m412l837l469l530l717l729l766m132m636m861
$$ 608043 601935 596224 590996 586142 581730 577893 574424 570894 567177 563448 559682 555550 550914 546053
62914E46053m788m636m313l560k608k045j936j663q66m2J75k0J52R84J882K058
$$ 546053 541265 536629 532316 528756 526148 524103 522167 520504 519638 519596 519771 519751 519903 520887 522769 524827
62898E24827J272j60j736k987l549l413k995k768k737k498j821j035p09j063j723
$$ 524827 526099 525939 524203 521216 517667 514254 511259 508491 505754 503256 501435 500400 499691 498628 496905
62883D96905k033j597o71J8ml76k46P39J947K469K093J430J131J262J431J408
$$ 496905 494872 493275 492604 492622 492618 492242 491996 492735 494682 497151 499244 500674 501805 503067 504498 505906
62867E05906J472K059L041L570K979J756J101J425J862J599J065J123J601J519
$$ 505906 507378 509437 512478 516048 519027 520783 521884 523309 525171 526770 527835 528958 530559 532078
62853E32078P07J26L38N79j32j556k610k739k319j928j843k202l037m051m745
$$ 532078 532785 532911 533249 533828 533696 532140 529530 526791 524472 522544 520701 518499 515462 511411 506666
62838E06666m932m857m741m490l986l364k897k746k903l185l296l091k855l092
$$ 506666 501734 496877 492136 487646 483660 480296 477399 474653 471750 468565 465269 462178 459323 456231
62824D56231l872m654m895m620m136l456k402j183m01l98q76j304j410j167n73
$$ 456231 452359 447705 442810 438190 434054 430598 428196 427013 426612 426214 425338 424034 422624 421457 420884
62809D20884K87J123J715K140K551K842K883K994L726N066O221O489O141O127
$$ 420884 421171 422294 424009 426149 428700 431542 434425 437419 441145 446211 452432 458921 465062 471189
62795D71189O973Q226R177R867J1083J3255J5662J7107J7359J7580J9126K2217
$$ 471189 478162 486388 495565 505432 516515 529770 545432 562539 579898 597478 616604 638821
62783F38821K5988K9523L2529L5219L8039M1437M5469M9695N3754N7883O2374
$$ 638821 664809 694332 726861 762080 800119 841556 887025 936720 990474 1048357 1110731
62772A110731O6711O9939P1901P3297P4276P3831P1039O6205O0122N2855M4054
$$ 1110731 1177442 1247381 1319282 1392579 1466855 1540686 1611725 1677930 1738052 1790907 1834961
62761A834961L4001K3361J2081m36j3922k6824l7710m6498n3955o0498o5859o9568
$$ 1834961 1868962 1892323 1904404 1903968 1890046 1863222 1825512 1779014 1725059 1664561 1598702 1529134
62749A529134p1383p1416p0237o8639o6995o4906o1792n7742n3531m9754m6294
$$ 1529134 1457751 1386335 1316098 1247459 1180464 1115558 1053766 996024 942493 892739 846445
62738H46445m2767l9198l5996l3288l0682k7818k4955k2683k1184j9985j8431
$$ 846445 803678 764480 728484 695196 664514 636696 611741 589058 567874 547889 529458
62727E29458j6235j3608j1176r675r298r279q563o980n303m047k777j030P14J616
$$ 529458 513223 499615 488439 478764 469466 460187 451624 444644 439341 435294 432517 431487 432201 433817
62713D33817J712J894K777M151N522O662P631Q689J0195J2227J4276J5829J7151
$$ 433817 435529 437423 440200 444351 449873 456535 464166 472855 483050 495277 509553 525382 542533
62700E42533J8994K1530K4189K6674K9490L3113L7153M0819M3956M7091N0535
$$ 542533 561527 583057 607246 633920 663410 696523 733676 774495 818451 865542 916077
62689I16077N3834N6179N7029N6283N3966N0042M4557L7848L0413K2563J4309
$$ 916077 969911 1026090 1083119 1139402 1193368 1243410 1287967 1325815 1356228 1378791 1393100
62678A393100N640l259j2126k0696k8578l5289m0623m4796m7983m9958n0533n0045
$$ 1393100 1398740 1395481 1383355 1362659 1334081 1298792 1258169 1213373 1165390 1115432 1064899 1014854
62666A014854m9051m7656m5589m2850l9862l7011l4397l2065l0045k8165k6154
$$ 1014854 965803 918147 872558 829708 789846 752835 718438 686373 656328 628163 602009
62655F02009k4025k2078k0496j9159j7831j6302j4450j2421j0669r504q719q008
$$ 602009 577984 555906 535410 516251 498420 482118 467668 455247 444578 435074 426355 418347
62643D18347p501p455p567p224o430n860n880o040n830n372n100n058m848m146
$$ 418347 410846 403391 395824 388600 382170 376310 370430 364390 358560 353188 348088 343030 338182 334036
62629C34036l074k145j856k245k823l107k956k341j185K11J016Q20L55N62J254
$$ 334036 330962 328817 326961 324716 321893 318786 315830 313489 312304 312515 313531 314351 314706 315268 316522
62614C16522J548J397J613K335K688K287J992K600L694M514N155O153P439Q524
$$ 316522 318070 319467 321080 323415 326103 328390 330382 332982 336676 341190 346345 352498 359937 368461
62600C68461R388J0524J2227J4383J6663J8699K0303K1863K4036K6752K9149L0886
$$ 368461 377849 388373 400600 414983 431646 450345 470648 492511 516547 543299 572448 603334
62588F03334L2865L5924L9342M1446M1442L9883L7561L4704L1193K6875K1624
$$ 603334 636199 672123 711465 752911 794353 834236 871797 906501 937694 964569 986193
62577I86193J5538R054K526m171j1106j7606k2649k5924k7998k9524l0707l1494
$$ 986193 1001731 1010785 1013311 1009140 998034 980428 957779 931855 903857 874333 843626 812132
62565H12132l1813l1610l0969l0113k9059k7461k5189k2753k0750j9160j7708
$$ 812132 780319 748709 717740 687627 658568 631107 605918 583165 562415 543255 525547
62554E25547j6639j6421j6786j6790j5922j4579j3364j2438j1679j0976j0174
$$ 525547 508908 492487 475701 458911 442989 428410 415046 402608 390929 379953 369779
62543C69779r178q160p362o619n513m052k775k061j730j395q75j79N52J011J044
$$ 369779 360601 352441 345079 338460 332947 328895 326120 324059 322329 320934 320059 319880 320432 321443 322487
62528C22487J062J678K837L728L818L561L757M597N670O721P893R329J0849J2213
$$ 322487 323549 325227 328064 331792 335610 339171 342928 347525 353195 359916 367809 377138 387987 400200
62514D00200J3504J5079J7112J9339K1342K3000K4466K5754K6711K7459K8426
$$ 400200 413704 428783 445895 465234 486576 509576 534042 559796 586507 613966 642392
62503F42392K9634L0298K9586K7529K4768K1564J7547J2433O512M21n214r950
$$ 642392 672026 702324 731910 759439 784207 805771 823318 835751 842263 842684 837470 827520
62491H27520j3703j6862j9852k2585k4604k5646k5739k4857k3034k0774j8809
$$ 827520 813817 796955 777103 754518 729914 704268 678529 653672 630638 609864 591055
62480E91055j7307j5800j4017j2290j1001j0097r393q921q606q026o857n369m108
$$ 591055 573748 557948 543931 531641 520640 510543 501150 492229 483623 475597 468740 463371 459263
62467D59263l261k610j966j291n21L92J299J934K253K549L158M121N097N634N585
$$ 459263 456002 453392 451426 450135 449614 450006 451305 453239 455492 458041 461199 465320 470417 476051 481636
62452D81636N271N133N220N096M345K944J168p37k660m476n996p076p786q366
$$ 481636 486907 492040 497260 502356 506701 509645 510813 510076 507416 502940 496944 489868 482082 473716
62438D73716r019r673j0061j0002r539q841q083p441o972o467n682m749l991l213
$$ 473716 464697 455024 444963 434961 425422 416581 408498 401057 394085 387618 381936 377187 373196 369983
62424C69983j735N64K711L767M070M644N697O563P101Q080R884J1676J2438J2283
$$ 369983 368248 368812 371523 375290 379360 384004 389701 396264 403365 411445 421329 433005 445443 457726
62410D57726J1998J1742J0905R202P280N977N380M819L640J802j90j768k687k993
$$ 457726 469724 481466 492371 501573 508853 514830 520210 525029 528669 530471 530281 528513 525826 522833
62396E22833k923k881l295m260n323n887n771n274m727m248l850l468k881j843
$$ 522833 519910 517029 513734 509474 504151 498264 492493 487219 482492 478244 474394 470926 468045 466202
62382D66202l76J265K960M853P180J0065J3423J6813J9596K1551K3262K5527K8440
$$ 466202 465826 467091 470051 474904 482084 492149 505572 522385 541981 563532 586794 612321 640761
62369F40761L1427L4131L6735L9423M1980M4026M5202M5102M3533M0973L8159
$$ 640761 672188 706319 743054 782477 824457 868483 913685 958787 1002320 1043293 1081452
62358A081452L5038L0690K4584J7331R846K350n134j1917j7107k0735k3639k6294
$$ 1081452 1116490 1147180 1171764 1189095 1198941 1201291 1196157 1184240 1167133 1146398 1122759 1096465
62346A096465k8443k9961l1279l2691l3758l3851l2928l1408k9490k7052k4153
$$ 1096465 1068022 1038061 1006782 974091 940333 906482 873554 842146 812656 785604 761451
62335G61451k1277j8983j7435j6383j5391j4100j2403j0533q900p642o428m789
$$ 761451 740174 721191 703756 687373 671982 657882 645479 634946 626046 618404 611976 607187
62323F07187k753r09J73M55K49k54j031j918k589k987l438m216n110n640n700
$$ 607187 604434 603525 603698 604153 604402 604148 603117 601199 598610 595623 592185 587969 582859 577219 571519
62308E71519n765o326p260p908p792p071o187n296m308l292k489j890j203l34
$$ 571519 565754 559428 552168 544260 536468 529397 523210 517914 513606 510314 507825 505935 504732 504398
62294E04398M82J151J948L076M332N402O161O482O208N614N345N572N717N527
$$ 504398 504880 506031 507979 511055 515387 520789 526950 533432 539640 545254 550599 556171 561888 567415
62280E67415N778P111Q661Q990Q112P518Q114R302J0326J1413J2944J4465J5430
$$ 567415 573193 580304 588965 597955 606067 613585 621699 631001 641327 652740 665684 680149 695579
62267F95579J6309J8083K0907K4119K7348L0849L4643L8022M0216M1212M1490
$$ 695579 711888 729971 750878 774997 802345 833194 867837 905859 946075 987287 1028777
62256A028777M1103L9339L5414K9384K2134J4523O822q49p932j3703j8068k1580
$$ 1028777 1069880 1109219 1144633 1174017 1196151 1210674 1217496 1216647 1208715 1195012 1176944 1155364
62244A155364k4674k7269k9163l0424l1147l1196l0368k8658k6276k3517k0652
$$ 1155364 1130690 1103421 1074258 1043834 1012687 981491 951123 922465 896189 872672 852020
62233H52020j7813j5001j2356j0257q928q131p498o973o601o248n917n992o526
$$ 852020 834207 819206 806850 796593 787665 779534 772036 765063 758462 752214 746297 740305 733779
62220G33779o692n772m420l952m438m609l773k658j945j187J85J756K822L517
$$ 733779 727087 721315 716895 712943 708505 703896 700123 697465 695520 694333 694518 696274 699096 702613
62206G02613M411N555O670P810R150J0491J1688J3181J5420J8028K0234K1889
$$ 702613 707024 712579 719249 727059 736209 746700 758388 771569 786989 805017 825251 847140
62194H47140K3483K5323K7263K9030L0313L0720L0069K8551K6257K2977J8890
$$ 847140 870623 895946 923209 952239 982552 1013272 1043341 1071892 1098149 1121126 1140016
62183A140016J4926J1792R103O216L554K191K294K942L501M399O320R339J3043
$$ 1140016 1154942 1166734 1175837 1182053 1185607 1187798 1190092 1193034 1196535 1200934 1207254 1216593 1229636
62170A229636J6956K0500K3013K4079K3755K2344K0124J7221J3605R287M778J049
$$ 1229636 1246592 1267092 1290105 1314184 1337939 1360283 1380407 1397628 1411233 1420520 1425298 1426347
62158A426347j303k753m323o489q869j0883j2324j3364j4233j4861j4725j3315
$$ 1426347 1425044 1422291 1417968 1411479 1402610 1391727 1379403 1366039 1351806 1336945 1322220 1308905
62146A308905j0954q698p165n891m208k243n09R85K491L773M421M683N254O352
$$ 1308905 1297951 1289253 1282088 1276197 1271989 1269746 1269237 1270222 1272713 1276486 1280907 1285590 1290844 1297196
62132A297196P704R237J1071J2995J4671J6265J8142K0061K1495K2622K4141K6084
$$ 1297196 1304900 1314137 1325208 1338203 1352874 1369139 1387281 1407342 1428837 1451459 1475600 1501684
62120A501684K7715K8752K9746L1112L2550L3775L4884L5771L5936L5366L4875
$$ 1501684 1529399 1558151 1587897 1619009 1651559 1685334 1720218 1755989 1791925 1827291 1862166
62109A862166L5097L5806L6598L7549L8624L9203L8917L8511L9049M0508M1826
$$ 1862166 1897263 1933069 1969667 2007216 2045840 2085043 2123960 2162471 2201520 2242028 2283854
62098B283854M2290M2206M2264M2767M3619M4717M6094M7890N0229N3048N5983
$$ 2283854 2326144 2368350 2410614 2453381 2497000 2541717 2587811 2635701 2685930 2738978 2794961
62087B794961N8442N9879O0091N9413N8528N7946N7718N7752N8114N8698N8872
$$ 2794961 2853403 2913282 2973373 3032786 3091314 3149260 3206978 3264730 3322844 3381542 3440414
62076C440414N7916N5801N3188N0776M9048M8466M9144N0357N1021N0786N0123
$$ 3440414 3498330 3554131 3607319 3658095 3707143 3755609 3804753 3855110 3906131 3956917 4007040
62065D007040M9216M7569M4940M1960L9347L7077L4816L2622L0640K8488K5587
$$ 4007040 4056256 4103825 4148765 4190725 4230072 4267149 4301965 4334587 4365227 4393715 4419302
62054D419302K1966J8215J4690J1153P224K880j430n020p458q988j0304j1879
$$ 4419302 4441268 4459483 4474173 4485326 4492550 4495430 4494000 4488980 4481522 4472534 4462230 4450351
62042D450351j3629j5338j6989j8503j9592k0173k0662k1495k2540k3314k3528
$$ 4450351 4436722 4421384 4404395 4385892 4366300 4346127 4325465 4303970 4281430 4258116 4234588
62031D234588k3203k2360k1006j9317j7554j5818j4043j2183j0286q373o411m274
$$ 4234588 4211385 4189025 4168019 4148702 4131148 4115330 4101287 4089104 4078818 4070445 4064034 4059760
62019D059760j805R57L672O022Q146J0452J3005J5405J7389J9213K1217K3347
$$ 4059760 4057955 4058912 4062584 4068606 4076752 4087204 4100209 4115614 4133003 4152216 4173433 4196780
62007D196780K5252K6688K7633K8092K7945K6928K4778K1491J7249J1912M862
$$ 4196780 4222032 4248720 4276353 4304445 4332390 4359318 4384096 4405587 4422836 4434748 4439610
61996D439610m204j4518k4748l4019m1960m8098n2129n4755n7203n9693o1281
$$ 4439610 4435406 4420888 4396140 4362121 4320161 4272063 4219934 4165179 4107976 4048283 3987002
61985C987002o1500o1139o0930o0449n9064n7078n5137n3186n0947m8879m7632
$$ 3987002 3925502 3864363 3803433 3742984 3683920 3626842 3571705 3518519 3467572 3418693 3371061
61974C371061m6924m5931m4555m3282m1989l9951l7101l4343l2356l0838k9261
$$ 3371061 3324137 3278206 3233651 3190369 3148380 3108429 3071328 3036985 3004629 2973791 2944530
61963B944530k7671k6371k5252k3874k1987j9740j7551j5856j4773j3821j2233
$$ 2944530 2916859 2890488 2865236 2841362 2819375 2799635 2782084 2766228 2751455 2737634 2725401
61952B725401r657o536l752j901p58N83K860N778Q264R681J0481J1476J2884J4465
$$ 2725401 2715744 2709208 2705456 2703555 2702797 2703380 2706240 2712018 2720282 2729963 2740444 2751920 2764804 2779269
61938B779269J6151J8041K0046K2084K4397K7204L0259L3246L6345L9827M3287
$$ 2779269 2795420 2813461 2833507 2855591 2879988 2907192 2937451 2970697 3007042 3046869 3090156
61927C090156M6065M8386N1425N6254O3237P2519Q4450R9341J17332J38641J63484
$$ 3090156 3136221 3184607 3236032 3292286 3355523 3428042 3512492 3611833 3729165 3867806 4031290
61916D031290J91614K22367K55383K91014L30002L72950M20084M71065N25049
$$ 4031290 4222904 4445271 4700654 4991668 5321670 5694620 6114704 6585769 7110818
61907G110818N81117O38132O93297P40578P71026P74710P42413O66872N45000
$$ 7110818 7691935 8330067 9023364 9763942 10534968 11309678 12052091 12718963 13263963
61898A3263963L80776J86160k1338k22644m00725n43545o46126p10103p40783
$$ 13263963 13644739 13830899 13809561 13586917 13186192 12642647 11996521 11286418 10545635
61889A0545635p44300p26917o95213o55156o10666n63720n15734m68402m23296
$$ 10545635 9801335 9074418 8379205 7724049 7113383 6549663 6033929 5565527 5142231
61880E142231l81345l42831l07652k75563k46422k20225j96830j75919j57420
$$ 5142231 4760886 4418055 4110403 3834840 3588418 3368193 3171363 2995444 2838024
61871B838024j41521j27920j15429j02950r0646p9536p0044o1578n3479m5686
$$ 2838024 2696503 2568583 2453154 2350204 2259558 2180022 2109978 2048400 1994921 1949235
61861A949235l8270l0979k3650j6690j0717n862j744J984N366Q333J0870J2920
$$ 1949235 1910965 1879986 1856336 1839646 1828929 1823067 1821323 1823307 1828673 1837006 1847876 1860796
61849A860796J4212J4329J3018J0498P416M417J710p88k963m358m603l831k449
$$ 1860796 1875008 1889337 1902355 1912853 1920269 1924686 1926396 1925608 1922645 1918287 1913684 1909853 1907404
61836A907404o20J749M473O861Q226Q514Q115P122N186K274q06l076m435n643
$$ 1907404 1906784 1908533 1913006 1919867 1928093 1936607 1944722 1951844 1957030 1959304 1958498 1955422 1950987 1945344
61822A945344p230q825r582q936o833l601J86L974P578J1128J4499J7164J8916
$$ 1945344 1938114 1929289 1919707 1910771 1903938 1900337 1900523 1904497 1912075 1923203 1937702 1954866 1973782
61809A973782K0470K2983K7023L2317L8371M4948N2018N9610O7855P6852Q6391
$$ 1973782 1994252 2017235 2044258 2076575 2114946 2159894 2211912 2271522 2339377 2416229 2502620
61798B502620R6030J05656J15909J27853J42199J58815J77064J96780K18867K44765
$$ 2502620 2598650 2704306 2820215 2948068 3090267 3249082 3426146 3622926 3841793 4086558
61788D086558K75220L09887L48348L91140M39403M93788N54316O21244O95419
$$ 4086558 4361778 4671665 5020013 5411153 5850556 6344344 6898660 7519904 8215323
61779H215323P77535Q67380R63871J065038J167170J263785J345189J398432J407590
$$ 8215323 8992858 9860238 10824109 11889147 13056317 14320102 15665291 17063723 18471313
61770A8471313J355436J227570J017854P32487L90724K1857l40730o66543r33550
$$ 18471313 19826749 21054319 22072173 22804660 23195384 23217241 22876511 22209968 21276418
61761B1276418j130537j256564j318742j329063j300700j245169j171560j087258
$$ 21276418 20145881 18889317 17570575 16241512 14940812 13695643 12524083 11436825
61753A1436825r98326r09121q22370p40094o64130n95514n33960m78569m28884
$$ 11436825 10438499 9529378 8707008 7966914 7302784 6707270 6173310 5694741 5265857
61744E265857l84799l45723l10523k78449k49590k24235k02083j82344j64366
$$ 5265857 4881058 4535335 4224812 3946363 3696773 3472538 3270455 3088111 2923745
61735B923745j47863j32677j18668j05842r4351q4210p5160o7020o0047n4734
$$ 2923745 2775882 2643205 2524537 2418695 2324344 2240134 2164974 2097954 2037907 1983173
61725A983173n1168m8800m6934m5267m3788m2450m1175m0012l8909l7421l5127
$$ 1983173 1932005 1883205 1836271 1791004 1747216 1704766 1663591 1623579 1584670 1547249 1512122
61714A512122l2301k9731k7845k6375k4986k3643k2266k0649j8986j7921j7637
$$ 1512122 1479821 1450090 1422245 1395870 1370884 1347241 1324975 1304326 1285340 1267419 1249782
61703A249782j7463j6903j6488j6904j7768j8081j7657j7235j7291j7527j7547
$$ 1249782 1232319 1215416 1198928 1182024 1164256 1146175 1128518 1111283 1093992 1076465 1058918
61692A058918j7227j6373j4828j3067j1943j1624j1431j0874j0162r535q835q041
$$ 1058918 1041691 1025318 1010490 997423 985480 973856 962425 951551 941389 931854 923019 914978
61680I14978p471p103o401n206m081l398k806k124j861k201k334j657r56j295
$$ 914978 907507 900404 894003 888797 884716 881318 878512 876388 874527 872326 869992 868335 867379 866084
61666H66084k252k495j819j391k024l260m304m900n052m745m242l889l455k380
$$ 866084 863832 861337 859518 858127 856103 852843 848539 843639 838587 833842 829600 825711 822256 819876
61652H19876q68O5p4n63n86l04l19o70r18q94p76o95o21m39J74J575L618N652
$$ 819876 819008 819073 818999 818436 817850 817546 817227 816557 815639 814745 813969 813274 812653 812214 812388 813963 817581 823233
61634H23233P315Q973J0985J3024J4455J5077J4955J3956J2016R613P322N053
$$ 823233 830548 839521 850506 863530 877985 893062 908017 921973 933989 943602 950924 955977
61622I55977K242j250m847p816r616r910q856p406o756p222q123q787r231r741
$$ 955977 958219 956969 952122 944306 934690 924780 915924 908518 901762 894540 886417 877630 868399 858658
61608H58658j0299j0729j1002j1045j0614r712q848q491q414q029p236o465n918
$$ 858658 848359 837630 826628 815583 804969 795257 786409 777918 769504 761475 754239 747774 741856
61595G41856n176l845k243j153r58j250j227l73J228L069M635N737O606P650R085
$$ 741856 736680 732835 730592 729439 728481 727231 726004 725631 726859 729928 734563 740300 746906 754556 763641
61580G63641J0767J2360J3705J4975J6458J8230K0115K1939K3713K5462K7018
$$ 763641 774408 786768 800473 815448 831906 850136 870251 892190 915903 941365 968383
61569I68383K8146K8862K9438L0063L0625L0938L0997L0858L0394K9428K8049
$$ 968383 996529 1025391 1054829 1084892 1115517 1146455 1177452 1208310 1238704 1268132 1296181
61558A296181K6660K5589K4826K4152K3423K2659K1920K1149K0129J8629J6627
$$ 1296181 1322841 1348430 1373256 1397408 1420831 1443490 1465410 1486559 1506688 1525317 1541944
61547A541944J4320J1818Q914N328J082l507q061j2163j5292j7156j8116j8836
$$ 1541944 1556264 1568082 1576996 1582324 1583406 1579899 1571838 1559675 1544383 1527227 1509111 1490275
61535A490275j9430j9367j8352j6844j5420j4014j2218j0008p710n400k779L55
$$ 1490275 1470845 1451478 1433126 1416282 1400862 1386848 1374630 1364622 1356912 1351512 1348733 1349088
61523A349088L934P861J2145J6780K1728K7013L2578L8221M3930N0172N7503O5984
$$ 1349088 1353022 1360883 1373028 1389808 1411536 1438549 1471127 1509348 1553278 1603450 1660953 1726937
61511A726937P5284Q5266R6095J07884J20675J34689J50091J66560J83601K01238
$$ 1726937 1802221 1887487 1983582 2091466 2212141 2346830 2496921 2663481 2847082 3048320
61501C048320K19708K38295K55066K67937K75298K75243K65122K42908K08830
$$ 3048320 3268028 3506323 3761389 4029326 4304624 4579867 4844989 5087897 5296727
61492E296727J65175J14846O0826O670m3713q7380j23198j51251j71900j85537
$$ 5296727 5461902 5576748 5637574 5644244 5600531 5513151 5389953 5238702 5066802 4881265
61482D881265j92660j93785j89489j80760j69015j55525j41017j26038j11280
$$ 4881265 4688605 4494820 4305331 4124571 3955556 3800031 3659014 3532976 3421696
61473C421696r7186q3479o9542n5293m1374k8506j6930o390L641J3585K3215L1526
$$ 3421696 3324510 3241031 3171489 3116196 3074822 3046316 3029386 3022996 3026637 3040222 3063437 3094963
61461C094963L7609M1687M4844M7594M9243M8987M7092M4589M2133L9758L7528
$$ 3094963 3132572 3174259 3219103 3266697 3315940 3364927 3412019 3456608 3498741 3538499 3576027
61450C576027L5847L5108L5484L7023L9568M2610M5654M8670N1837N4974N7743
$$ 3576027 3611874 3646982 3682466 3719489 3759057 3801667 3847321 3895991 3947828 4002802 4060545
61439D060545O0222O2501O3749O2583N8565N2579M5335L6369K5160J2399o37j3414
$$ 4060545 4120767 4183268 4247017 4309600 4368165 4420744 4466079 4502448 4527608 4540007 4539370 4525956
61427D525956k5872l7331m6678n3535n8326o1245o2058o0973n8737n5658n1360
$$ 4525956 4500084 4462753 4416075 4362540 4304214 4242969 4180911 4119938 4061201 4005543 3954183
61416C954183m5798l9682l3506k6864j9383j1771n269l28L621P265J0759J3788
$$ 3954183 3908385 3868703 3835197 3808333 3788950 3777179 3771910 3771582 3775203 3782468 3793227 3807015
61404C807015J5690J5655J3303R250M789Q18k682o029q903j0298r370o061p58
$$ 3807015 3822705 3838360 3851663 3860913 3865702 3866520 3863838 3857809 3848906 3838608 3829238 3823177 3822419
61391C822419O581J6457K8984M3400N8773P4960R2462J11549J32091J54039J77327
$$ 3822419 3829000 3845457 3874441 3917841 3976614 4051574 4144036 4255585 4387676 4541715 4719042
61380D719042K01231K24440K46056K65839K83071K95716L01210K97710K84037
$$ 4719042 4920273 5144713 5390769 5656608 5939679 6235395 6536605 6834315 7118352
61371G118352K59049K22248J75262J22024O6955J3246l7133q2497j21442j53727
$$ 7118352 7377401 7599649 7774911 7896935 7963890 7977136 7940003 7857506 7736064 7582337
61361G582337j80515k03328k22905k39155k51800k60645k65450k66129k63197
$$ 7582337 7401822 7198494 6975589 6736434 6484634 6223989 5958539 5692410 5429213
61352E429213k57549k49614k39147k26167k11605j96487j80876j64292j47046
$$ 5429213 5171664 4922050 4682903 4456736 4245131 4048644 3867768 3703476 3556430
61343C556430j30328j14864j00184q5583p1184n7603m4992l3060k1825j1737k908
$$ 3556430 3426102 3311238 3211054 3125471 3054287 2996684 2951692 2918632 2896807 2885070 2882162
61332B882162N265J3423K1417K8426L3871L7922M1079M3510M5057M5656M5439
$$ 2882162 2887427 2900850 2922267 2950693 2984564 3022486 3063565 3107075 3152132 3197788 3243227
61321C243227M4417M2533M0094L7705L5663L3778L2006L0691K9826K8637K6467
$$ 3243227 3287644 3330177 3370271 3407976 3443639 3477417 3509423 3540114 3569940 3598577 3625044
61310C625044K3559K0374J6581J1585N812N10l661p125j0530j4217j8475k3495
$$ 3625044 3648603 3668977 3685558 3697143 3702955 3703465 3699804 3692679 3682149 3667932 3649457 3625962
61298C625962k8889l4065l9119m4563n0048n4338n6865n8406n9757o0531n9800
$$ 3625962 3597073 3563008 3523889 3479326 3429278 3374940 3318075 3259669 3199912 3139381 3079581
61287C079581n7219n3023m7593m1504l5410k9376k2946j6236j0235n501j451K416
$$ 3079581 3022362 2969339 2921746 2880242 2844832 2815456 2792510 2776274 2766039 2760538 2759087 2761503
61275B761503N368O465O065N302M533L246J150j551m888r141j4112j9028k3058
$$ 2761503 2766871 2773336 2779401 2784703 2789236 2792482 2793632 2792081 2787193 2778052 2763940 2744912 2721854
61262B721854k5508k5775k3699j9683j3950o030M324J6211K8450M0977N4428O8618
$$ 2721854 2696346 2670571 2646872 2627189 2613239 2607209 2611533 2627744 2656194 2697171 2751599 2820217
61250B820217Q2432R5245J07387J19087J29704J38019J42517J41473J33626J18877
$$ 2820217 2902649 2997894 3105281 3224368 3354072 3492091 3634608 3776081 3909707 4028584
61240D028584R7672O9983L5963k339m1168p7331j09359j36242j56382j68665j73755
$$ 4028584 4126256 4196239 4232202 4229863 4188695 4111364 4002005 3865763 3709381 3540716 3366961
61229C366961j73469j69250j61855j51954j40375j27946j15531j03912r3299q3425
$$ 3366961 3193492 3024242 2862387 2710433 2570058 2442112 2326581 2222669 2129370 2045945
61219B045945p4359o6709o0635n5269m9714m4003l8545l3127k7280k1264j5805
$$ 2045945 1971586 1904877 1844242 1788973 1739259 1695256 1656711 1623584 1596304 1575040 1559235
61208A559235j0968n978k81N868J1839J7095K1071K3129K2975K0875J7320J2800
$$ 1559235 1548267 1542289 1542008 1547876 1559715 1576810 1597881 1621010 1643985 1664860 1682180 1694980
61196A694980P970L679M08k157m663p198r179j0277j1097j2631j5134j7992k0751
$$ 1694980 1702950 1706629 1707037 1704880 1700217 1693019 1683840 1673563 1662466 1649835 1634701 1616709 1595958
61183A595958k3692k7039l0063l1583l1317l0189k9231k8633k7894k6523k4442
$$ 1595958 1572266 1545227 1515164 1483581 1452264 1422075 1392844 1364211 1336317 1309794 1285352
61172A285352k2104k0281j9424j9068j8212j6434j4338j2867j2420j2678j2827
$$ 1285352 1263248 1242967 1223543 1204475 1186263 1169829 1155491 1142624 1130204 1117526 1104699
61161A104699j1965r774p066n265n093o098p615r759j3073j7496k2075k5621k7455
$$ 1104699 1092734 1082960 1075894 1070629 1065536 1059438 1051823 1042064 1028991 1011495 989420 963799 936344
61148I36344k7712k7084k6168k4877k2728j9626j6101j2716r707p251n592m533
$$ 936344 908632 881548 855380 830503 807775 788149 772048 759332 749625 742374 736782 732249
61136G32249l380j758j41R10J639K693M105N265N823O039O198O208N954N686N785
$$ 732249 728869 727111 726970 727880 729519 732212 736317 741582 747405 753444 759642 765850 771804 777490 783275
61121G83275O304O914P282P406P577P998Q535Q911R085R177R101Q470O937M422
$$ 783275 789579 796493 803775 811181 818758 826756 835291 844202 853287 862464 871565 880035 886972 891394
61107H91394J010k966o731r403j0870j1970j3484j5175j6181j6118j5494j5057
$$ 891394 892404 889438 882707 873304 862434 850464 836980 821805 805624 789506 774012 758955
61095G58955j5092j5331j5342j4953j4313j3514j2321j0623r034q455q854r010
$$ 758955 743863 728532 713190 698237 683924 670410 658089 647466 638432 629977 621123 612113
61083F12113p942o092m624l911l288k122n07J077K230K788K903L035L509M052
$$ 612113 604171 598079 593455 589544 586256 584134 583627 584704 586934 589722 592625 595660 599169 603221
61069F03221M166L935L984M586N222N284M867M614M899N406N501M856L743K757
$$ 603221 607387 611322 615306 619892 625114 630398 635265 639879 644778 650184 655685 660541 664284 667041
61055F67041K318K444K922L574M295N038N915P084Q459R661J0411J0859J1291
$$ 667041 669359 671803 674725 678299 682594 687632 693547 700631 709090 718751 729162 740021 751312
61042G51312J1696J1846J1729J1632J1755J1900J1593J0515Q863P260O182N512
$$ 751312 763008 774854 786583 798215 809970 821870 833463 843978 852841 860101 866283 871795
61030H71795M785L830K777J555j39k131l549l660k593j001O55K132L217L947M748
$$ 871795 876580 880410 883187 884742 884603 882472 878923 875263 872670 871669 872324 874456 877673 881620 886368
61015H86368N916P235Q550J0218J2561J5183J7523J9788K2611K5952K9168L2079
$$ 886368 892284 899519 908069 918287 930848 946031 963554 983342 1005953 1031905 1061073 1093152
61003A093152L5315L9467M4578N0462N6822O2950O7962P1611P4400P6885P9450
$$ 1093152 1128467 1167934 1212512 1262974 1319796 1382746 1450708 1522319 1596719 1673604 1753054
60992A753054Q2813Q7999R5518J05055J16073J28142J40697J53397J67224J84550
$$ 1753054 1835867 1923866 2019384 2124439 2240512 2368654 2509351 2662748 2829972 3014522
60982C014522K07756K38328K77452L26494L86367M57268N39880O36562P51463
$$ 3014522 3222278 3460606 3738058 4064552 4450919 4908187 5448067 6084629 6836092
60973F836092Q91129J066297J292018J582038J935678K318552K645618K787219
$$ 6836092 7727221 8793518 10085536 11667574 13603252 15921804 18567422 21354641
60965B1354641K618441K099712J332292N31239p7768l62534l18747l7589L37150
$$ 21354641 23973082 26072794 27405086 27936325 27858557 27496023 27177276 27139687 27476837
60956B7476837O32331O76092L63702k73625j065496j787029k272741k476758k451530
$$ 27476837 28109168 28785260 29148962 28875337 27809841 26022812 23750071 21273313 18821783
60947A8821783k285545k054951j808721j573402j360422j171692j005115q58660
$$ 18821783 16536238 14481287 12672566 11099164 9738742 8567050 7561935 6703275
60939F703275p31173o21400n27952m49930l86619l36368k96324k63433k35469
$$ 6703275 5972102 5350702 4822750 4372820 3986201 3649833 3353509 3090076 2854607
60930B854607k11222j90183j72074j56334j41794j27163j12083r7560q5172p5844
$$ 2854607 2643385 2453202 2281128 2124794 1983000 1855837 1743754 1646194 1561022 1485178
60920A485178o9431o5182o2256n9805n7033n3498m9342m5046m0883l6792l2653
$$ 1485178 1415747 1350565 1288309 1228504 1171471 1117973 1068631 1023585 982702 945910 913257
60909I13257k8503k4429k0534j7151j4833j3803j3472j2817j1326r366p610o386
$$ 913257 884754 860325 839791 822640 807807 794004 780532 767715 756389 747023 739413 733027
60897G33027n588m871l770j976J77J805K372K324K406K539J969M80j269k794m519
$$ 733027 727439 722568 718798 716822 716999 718804 721176 723500 725906 728445 730414 730894 729625 726831 722312
60882G22312o857r109j0054r559q858r113j0251j1400j1977j1870j1040r500p664
$$ 722312 715455 706346 696292 686733 677875 668762 658511 647111 635134 623264 612224 602724 595060
60869E95060o156n166m320l299k274j542j011l82L38R24J501K530M064N461O206
$$ 595060 588904 583738 579418 576119 573845 572303 571292 570910 571248 572172 573673 576203 580267 585728 591934
60854E91934O687P685R206J0480J1182J1999J3589J5500J6695J6966J7130J7789
$$ 591934 598621 606306 615512 625992 637174 649173 662762 678262 694957 711923 729053 746842
60842G46842J8455J8271J7210J6086J5452J4862J3443J0995Q220N864L924K000
$$ 746842 765297 783568 800778 816864 832316 847178 860621 871616 879836 885700 889624 891624
60830H91624K24p02n24m5l31j604l274m868o471q286j0169j1726j2616j2775j2554
$$ 891624 891848 891146 890622 890577 890246 888642 885368 880500 874029 865743 855574 843848 831232 818457 805903
60815H05903j2597j3216j3904j3746j2476j0763r417q552p671o308m468k632j379
$$ 805903 793306 780090 766186 752440 739964 729201 719784 711232 703561 697253 692785 690153 688774
60802F88774p92k20J056K867M292M841N083N746O627O824N898M389L158K530K095
$$ 688774 687982 687762 688818 691685 695977 700818 705901 711647 718274 725098 730996 735385 738543 741073 743168
60787G43168J283L5j075j500j402j352j414j020P2J256J994K732M248O317P871
$$ 743168 744451 744486 743411 741911 740509 739157 737743 736723 736795 738051 740045 742777 747025 753342 761213
60772G61213Q535R174J0568J2139J2684J2044J1306J1258J1303J0316Q225O062
$$ 761213 769748 778922 789490 801629 814313 826357 837663 848921 860224 870540 878765 884827
60760H84827M589L495K250J040K78l11j247k113j857m74O45O03L20J109K548K937
$$ 884827 889416 892911 895161 896201 896479 896168 894921 892808 890951 890477 891122 891725 892045 893154 895702 898639
60744H98639J601l55j777k834m221n838o973p433p752q373r126r599r694r664
$$ 898639 900240 899885 898108 895274 891053 885215 878242 870809 863057 854684 845558 835959 826265 816601
60730H16601r787j0103j0435j0607j0577j0380r962r218q177p007n810m521l061
$$ 816601 806814 796711 786276 775669 765092 754712 744750 735532 727355 720348 714538 710017 706956
60717G06956j556l42K15jo52j076p77K14J508K809L980M816N057M731M218L784
$$ 706956 705400 705058 705273 705272 704620 703544 702767 702981 704489 707298 711278 716094 721151 725882 730100 733884
60701G33884L246K294J007k75j478k964m941o968q326q821q955r251r679r896
$$ 733884 737130 739424 740431 740156 738678 735714 730773 723805 715479 706658 697703 688452 678773 668877
60687F68877r803r563r229q680p867o871n749m580l644l147k773j967p15M25J193
$$ 668877 659074 649511 640282 631602 623735 616864 611115 606535 602891 599744 596971 595004 594289 594714 595907
60672E95907K017L264M666N808O769P751Q468Q521Q099P734P495O979O041N011
$$ 595907 597924 601188 605854 611662 618431 626182 634650 643171 651270 659004 666499 673478 679519 684530
60658F84530M225L761L605L737M053M591N593O993Q113Q446Q482Q989R748R886
$$ 684530 688755 692516 696121 699858 703911 708502 714095 721088 729201 737647 746129 755118 764866 774752
60644G74752R366R060R150Q658P053N360M841N335N795N799N618N256M459L526
$$ 774752 784118 793178 802328 810986 818039 823399 828240 833575 839370 845169 850787 856043 860502 864028
60630H64028K985K530J214j127l429m717n167n595o480p837r514j1091j1942j1839
$$ 864028 867013 869543 870757 869630 866201 861484 856317 850722 844242 836405 826891 815800 803858 792019
60616G92019j1298j0934j0708j0173r168p887o445m894l496k524j725n00J395
$$ 792019 780721 769787 759079 748906 739738 731851 725406 720512 717016 714492 712767 712267 713662
60603G13662L636N857P948R716J0766J1001J0895J0915J0903J0371R209P772O474
$$ 713662 717298 723155 731103 740819 751585 762586 773481 784396 795299 805670 814879 822651 829125
60590H29125N581N262N377N348M694L670K930K493J606k48k612m642o034p081
$$ 829125 834706 839968 845345 850693 855387 859057 861987 864480 866086 865838 863226 858584 852550 845469
60576H45469q090r128j0191j1230j2040j2396j2260j1834j1470j1541j2125j2669
$$ 845469 837379 828251 818060 806830 794790 782394 770134 758300 746830 735289 723164 710495
60564G10495j2309j0793q804p129n859m712l770l275k919k019m34J214K359L055
$$ 710495 698186 687393 678589 671460 665601 660889 657119 653844 650925 648906 648472 649686 652045 655100
60550F55100L595M022M287M571N121N908O676P257P790Q655J0167J2293J4791
$$ 655100 658695 662717 667004 671575 676696 682604 689280 696537 704327 712982 723149 735442 750233
60537G50233J7663K1235K5498K9690L2937L5115L6457L6475L3999K8559K1082
$$ 750233 767896 789131 814629 844319 877256 912371 948828 985303 1019302 1047861 1068943
60526A068943J2919M751l208j0355j5729j8759j9643j8997j7347j4885j1537p403
$$ 1068943 1081862 1086613 1083405 1073050 1057321 1038562 1018919 999922 982575 967690 956153 948750
60514I48750l159K58K580M430O392Q171R094R084Q697Q386Q332Q821J0233J2482
$$ 948750 945591 945849 948429 952859 959251 967422 976516 985600 994297 1002683 1011015 1019836 1030069 1042551
60500A042551J5051J7782K1252K6029L1920L8335M5177N2971O2097P2269Q2893
$$ 1042551 1057602 1075384 1096636 1122665 1154585 1192920 1238097 1291068 1353165 1425434 1508327
60489A508327R3760J05186J17536J30804J44901J60369J78659K01392K29020K60050
$$ 1508327 1602087 1707273 1824809 1955613 2100514 2260883 2439542 2640934 2869954 3130004
60479C130004K91177L17781L34090L33561L10377K61888J90174J01475M187r2760
$$ 3130004 3421181 3738962 4073052 4406613 4716990 4978878 5169052 5270527 5274714 5181954
60469E181954j80621k51676l00890l27264l33607l24872l06366k82632k56879
$$ 5181954 5001333 4749657 4448767 4121503 3787896 3463024 3156658 2874026 2617147
60460B617147k30906k05668j81976j60634j41894j25265j10090r6250q4113p3892
$$ 2617147 2386241 2180573 1998597 1837963 1696069 1570804 1460714 1364464 1280351 1206459
60450A206459o5267n7656n0696m4404l8957l4440l0800k7884k5402k2956k0278
$$ 1206459 1141192 1083536 1032840 988436 949479 915039 884239 856355 830953 807997 787719
60439G87719j7561j5380j4180j3845j3853j3658j2905j1448r413p161n044l208
$$ 787719 770158 754778 740598 726753 712900 699242 686337 674889 665476 658315 653271 650063
60427F50063j748q56n93n97l92J5J18l30p89m14R79K603L516L559L377L484L631
$$ 650063 648315 647459 646866 646269 645877 645892 646010 645680 644891 644477 645456 648059 651575 655134 658511 661995 665626
60410F65626L304K608K178K330K719K977L173L387L330K751J898J153M94k54r25
$$ 665626 668930 671538 673716 676046 678765 681742 684915 688302 691632 694383 696281 697434 697928 697674 696749
60395F96749j201j161j073q26r5J055K182L072L816M315M307L898L631L795M098
$$ 696749 695548 694387 693314 692488 692393 693448 695630 698702 702518 706833 711140 715038 718669 722464 726562
60380G26562M096L597K572J122k92j006p65O5R91J843K634L275L592L479L058
$$ 726562 730658 734255 736827 737949 737657 736651 735886 735951 736942 738785 741419 744694 748286 751765 754823
60365G54823K716K888L509L941L748L304L271L724M330M994N667N832N164M581
$$ 754823 757539 760427 763936 767877 771625 774929 778200 781924 786254 791248 796915 802747 807911 812492
60351H12492N446P611R393R903J0184J1377J2881J3363J2816J2377J2455J2199
$$ 812492 817938 825549 834942 844845 855029 866406 879287 892650 905466 917843 930298 942497
60339I42497J0855Q679O407M468K842J267n37k495m043m622m310l590k693j497
$$ 942497 953352 962031 968438 972906 975748 977015 976478 973983 969940 965318 961008 957418 954725 953228
60325I53228JJ473K490K697J902K48j808l890n943p818r009r185q742q388q344
$$ 953228 953229 954702 957192 959889 961791 962039 960231 956341 950398 942580 933571 924386 915644 907256 898912
60310H98912q317q018p291n993m315l062k975l761m406m404m160l989l494k190
$$ 898912 890595 882577 875286 869293 864978 861916 858941 855180 850774 846370 842210 838221 834727 832537
60296H32537l35J309K285K703K905L183L710M368M683M143K746J094r8n51m93
$$ 832537 832202 833511 835796 838499 841404 844587 848297 852665 857348 861491 864237 865331 865233 864682 864189
60281H64189k30J90Q54J704K515L112L485L765M184N031O370P864R063R906J0705
$$ 864189 863959 864149 865003 866707 869222 872334 875819 879584 883768 888799 895169 903033 912096 922002 932707
60266I32707J1741J3034J4524J6114J7643J9150K1066K3743K6817K9597L2085
$$ 932707 944448 957482 972006 988120 1005763 1024913 1045979 1069722 1096539 1126136 1158221
60255A158221L5030L8828M3106M7518N2231N7245O2050O6568P1698P8208Q5607
$$ 1158221 1193251 1232079 1275185 1322703 1374934 1432179 1494229 1560797 1632495 1710703 1796310
60244A796310R2946J00217J07934J15629J21866J25862J28060J28869J27656J23543
$$ 1796310 1889256 1989473 2097407 2213036 2334902 2460764 2588824 2717693 2845349 2968892
60234B968892J16587J07609R7198Q5263P1540N6187L9925K3716Q254o269j9842
$$ 2968892 3085479 3193088 3290286 3375549 3447089 3503276 3543201 3566917 3575171 3568902 3549060
60223C549060l2139m2429m9976n4438n5933n4857n1586m6241l8827k9618j9218
$$ 3549060 3516921 3474492 3424516 3370078 3314145 3259288 3207702 3161461 3122634 3093016 3073798
60212C073798q116L640J6162K9288M2662N6085O9552Q2982R6033J08116J18594
$$ 3073798 3065682 3069322 3085484 3114772 3157434 3213519 3283071 3366053 3462086 3570202 3688796
60201C688796J27091J33507J37467J37865J33525J24399J11625R6342P8974N9805
$$ 3688796 3815887 3949394 4086861 4224726 4358251 4482650 4594275 4690617 4769591 4829396
60191D829396L9471J8533k772k3963m4142o2835q0151r5504j07024j13243j14643
$$ 4829396 4868867 4887400 4884628 4860665 4816523 4753688 4673537 4578033 4471009 4357766 4243123
60180D243123j12611j07494r8986q7828p5545o2497m7708l0884j3251M033K1121
$$ 4243123 4130512 4023018 3924032 3836204 3760659 3698162 3650454 3619570 3606319 3610352 3631473
60169C631473L8430N5353P0789Q4120R4826J01720J03565J00299R2920Q2305O8713
$$ 3631473 3669903 3725256 3796045 3880165 3974991 4076711 4180276 4280575 4373495 4455800 4524513
60158D524513N2456L4504J6163j604j8305l3404m5900n4668n9208n9831n6947
$$ 4524513 4576969 4611473 4627636 4626032 4607727 4574323 4528423 4473755 4414547 4354716 4297769
60147D297769n0584m0833k8384j4034K064K0189M0284O1839Q4385J07598J31188
$$ 4297769 4247185 4206352 4177968 4163934 4165998 4186187 4226471 4288310 4372695 4480293 4611481
60136D611481J55363J81028K08644K37110K64747K91286L17638L43527L66729
$$ 4611481 4766844 4947872 5156516 5393626 5658373 5949659 6267297 6610824 6977553
60127F977553L85202L98828M08098M12069M08829L97510L78631L52693L19627
$$ 6977553 7362755 7761583 8169681 8581750 8990579 9388089 9766720 10119413 10439040
60118A0439040K79893K35144J87140J36452Q2752K6225l1709q9114j44595j97261
$$ 10439040 10718933 10954077 11141217 11277669 11360421 11386646 11354937 11265823 11121228 10923967
60108A0923967k45798k88043l21816l45924l60061l64113l58162l43186l21162
$$ 10923967 10678169 10390126 10068310 9722386 9362325 8998212 8640050 8296864 7975702
60099G975702k94077k63194k29273j93208j56120j19027q2524m6754j1781K1812
$$ 7975702 7681625 7418431 7189158 6995950 6839830 6720803 6638279 6591525 6579744 6601556
60089F601556N2837Q0248J03649J22664J36031J41977J39514J28859J10857Q6771
$$ 6601556 6654393 6734641 6838290 6960954 7096985 7238962 7378476 7507335 7618192 7704963
60079G704963N8607K8698j430l1176n9706q5617j08141j27974j46173j62729j76738
$$ 7704963 7763570 7792268 7790838 7759662 7699956 7614339 7506198 7378224 7232051 7069322 6892584
60068F892584j87481j94741j98398j98381j94902j88260j78532j65901j51144
$$ 6892584 6705103 6510362 6311964 6113583 5918681 5730421 5551889 5385988 5234844
60059E234844j35336j19037j02034q3893o4530m4381k4090m031J6003L6393N7033
$$ 5234844 5099508 4980471 4878437 4794544 4730014 4685633 4661543 4657512 4673515 4709908 4766941
60048D766941P7169R5898J12484J26204J36333J42431J44202J40972J31884J17007
$$ 4766941 4844110 4940008 5052492 5178696 5315029 5457460 5601662 5742634 5874518 5991525
60038E991525R7834P6109N2467K6584j403l0189n8018q3775j07178j28070j45697
$$ 5991525 6089359 6165468 6217935 6244519 6243116 6212927 6154909 6071134 5963956 5835886 5690189
60027E690189j58937j67119j70400j69174j63559j53814j40912j26103j10020
$$ 5690189 5531252 5364133 5193733 5024559 4861000 4707186 4566274 4440171 4330151
60018D330151r2725p4463n5675l6408j6441L966K4215M4301O4740Q5499J05884
$$ 4330151 4237426 4162963 4107288 4070880 4054439 4058405 4082620 4126921 4191661 4277160 4383044
60007D383044J25744J45728J65741J83964J98213K07588K12092K11199K03774
$$ 4383044 4508788 4654516 4820257 5004221 5202434 5410022 5622114 5833313 6037087
59998F037087J89269J68369J42592J13656Q3023N1450J9043j3964m6660p7846
$$ 6037087 6226356 6394725 6537317 6650973 6733996 6785446 6804489 6790525 6743865 6666019
59988F666019j06622j32245j53784j70308j81188j85987j84452j76951j64557
$$ 6666019 6559397 6427152 6273368 6103060 5921872 5735885 5551433 5374482 5209925
59979E209925j48410j29390j08509q6942o5279m3308k1098L91K0330L9043N7229
$$ 5209925 5061515 4932125 4823616 4736674 4671395 4628087 4606989 4607380 4627710 4666753 4723982
59968D723982P4659R0413J04012J15379J23983J28974J30224J28335J23512J15177
$$ 4723982 4798641 4889054 4993066 5108445 5232428 5361402 5491626 5619961 5743473 5858650
59958E858650J02995Q7864P1460N5125L9304K4011R653k661j1742j7222j9417
$$ 5858650 5961645 6049509 6120969 6176094 6215398 6239409 6249062 6246401 6234659 6217437 6198020
59947F198020j8308j3090k918J2394L2616N7438Q6210J17957J52134J88879K28125
$$ 6198020 6179712 6166622 6163704 6176098 6208714 6266152 6352362 6470319 6622453 6811332 7039457
59936G039457K69041L10738L52655L93582M30992M62251M85757M99842N01151
$$ 7039457 7308498 7619236 7971891 8365473 8796465 9258716 9744473 10244315 10745466
59927A0745466M85498M50341L95522L22085K31976J29245K0293q7800j88880k77891
$$ 10745466 11230964 11681305 12076827 12398912 12630888 12760133 12780426 12692626 12503746 12225855
59917A2225855l50785m05186m40832m59088m62220m52972m34007m07342l74604
$$ 12225855 11875070 11469884 11029052 10569964 10107744 9654772 9220765 8813423 8438819
59908H438819l37722k98745k58972k18828j78672j39084j00294o2122k4736J1151
$$ 8438819 8101097 7802352 7543380 7324552 7145880 7006796 6906502 6844380 6819644 6830795
59898F830795M5134P7557J08781J38412J65489J88777K06652K17108K18423K09507
$$ 6830795 6875929 6953486 7062267 7200679 7366168 7554945 7761597 7978705 8197128 8406635
59888H406635J89640J58407J16324O5241P894n2534j12439j68119k16768k56935
$$ 8406635 8596275 8754682 8871006 8936247 8944141 8891607 8779168 8611049 8394281 8137346
59878H137346k87828l08655l19056l19798l12529k98969k80762k59739k37682
$$ 8137346 7849518 7540863 7221807 6902009 6589480 6290511 6009749 5750010 5512328
59869E512328k15765j94629j75020j57938j44045j33303j25373j19989j16634
$$ 5512328 5296563 5101934 4926914 4768976 4624931 4491628 4366255 4246266 4129632
59860D129632j14112j10988j06574j01088r4783q7283p8163o7730n6687m5296
$$ 4129632 4015520 3904532 3797958 3696870 3602087 3514804 3436641 3368911 3312224 3266928
59850C266928l3634k2604j3852q392o030o438r911j6427k4739l3157m0849m7529
$$ 3266928 3233294 3210690 3196838 3188446 3182416 3175978 3166067 3149640 3124901 3091744 3050895 3003366
59838C003366n2483n4861n4780n3102n0144m5553l9467l2842k6345j9683j2384
$$ 3003366 2950883 2896022 2841242 2788140 2737996 2692443 2652976 2620134 2593789 2574106 2561722
59827B561722m548L535J1818K0220K8405L6370M4757N4085O3859P2811P9835Q4304
$$ 2561722 2557174 2560709 2572527 2592747 2621152 2657522 2702279 2756364 2820223 2893034 2972869 3057173
59815C057173Q5804Q4011P8943P1126O1414N0683L9623K8757J8590R584J892m656
$$ 3057173 3142977 3226988 3305931 3377057 3438471 3489154 3528777 3557534 3576124 3585708 3587600 3582944
59803C582944j0055j3708j4735j2623p337J032J2402K6448M2546O0023P8425R7722
$$ 3582944 3572889 3559181 3544446 3531823 3524486 3525518 3537920 3564368 3606914 3666937 3745362 3843084
59791C843084J18517J41924J68880J99562K33553K70398L09745L50783L91370
$$ 3843084 3961601 4103525 4272405 4471967 4705520 4975918 5285663 5636446 6027816
59782F027816M27013M50405M52447M24883L63170K68491J48796J8237j06282k10654
$$ 6027816 6454829 6905234 7357681 7782564 8145734 8414225 8563021 8581258 8474976 8264322
59772H264322k87476l35721l58117l59397l45503l22077k92956k60506k27010
$$ 8264322 7976846 7641125 7283008 6923611 6578108 6256031 5963075 5702569 5475559
59763E475559j94691j64553j36415j10178q6187o4308m3810k4431o617R621K5238
$$ 5475559 5280868 5116315 4979900 4869722 4783535 4719227 4675417 4650986 4644369 4653990 4679228
59752D679228M1179N7610P4460R1896J09844J27760J45451J63652J83374K04945
$$ 4679228 4720407 4778017 4852477 4944373 5054217 5181977 5327428 5491080 5674454 5879399
59742E879399K28035K52298K77822L05192L35112L67708M02284M38220M75678
$$ 5879399 6107434 6359732 6637554 6942746 7277858 7645566 8047850 8486070 8961748
59733H961748N14686N53800N90577O23107O49948O68620O75599O68354O46668
$$ 8961748 9476434 10030234 10620811 11243918 11893866 12562486 13238085 13906439 14553107
59724A4553107O11931N66656N15195M63625M17832L82186L60093L54259L65365
$$ 14553107 15165038 15731694 16246889 16710514 17128346 17510532 17870625 18224884 18590249
59715A8590249L91412M29409M76928N31152N87483O40403O85205P17727P33094
$$ 18590249 18981661 19411070 19887998 20419150 21006633 21647036 22332241 23049968 23783062
59706B3783062P26337O94495O37445N57017M56537L41321K18591R6281j8116j18198
$$ 23783062 24509399 25203894 25841339 26398356 26854893 27196214 27414805 27511086 27492970 27374772
59696B7374772j99073k57479k91394l00028k84660k48674j95769j28243m7634
$$ 27374772 27175699 26918220 26626826 26326798 26042138 25793464 25597695 25469452 25421818
59687B5421818M3657J42549K47025L56538M70571N87697P06072Q23607R36944
$$ 25421818 25465475 25608024 25855049 26211587 26682158 27269855 27975927 28799534 29736478
59678B9736478J040564J126915J186821J209753J184988J103793R61294P57627
$$ 29736478 30777042 31903957 33090778 34300531 35485519 36589312 37550606 38308233
59670C8308233M99379K00971j16379m28825p14594r56505j142763j267779j332585
$$ 38308233 38807612 39008583 38892204 38463379 37748785 36792280 35649517 34381738 33049153
59661C3049153j343497j309723j242211j154155j061059r78834r20784q95010
$$ 33049153 31705656 30395933 29153722 27999567 26938508 25959674 25038890 24143880
59653B4143880r02673r37312r86175j034052j068089j080932j071097j041489
$$ 24143880 23241207 22303895 21317720 20283668 19215579 18134647 17063550 16022061
59645A6022061r97322r44003q85533q24326p62131p00765o41789n86029n33804
$$ 16022061 15024739 14080736 13195203 12370877 11608746 10907981 10266192 9680163 9146359
59636I146359m85315m40535l99058l60563l25113k92624k62402k33833k07261
$$ 9146359 8661044 8220509 7821451 7460888 7135775 6843151 6580749 6346916 6139655
59627F139655j83468j62385j43028j24676j07497r1924p8148o6391n7072n0378
$$ 6139655 5956187 5793802 5650774 5526098 5418601 5326677 5248529 5182138 5125066 5074688
59617E074688m6114m4114m4543m7665n3618o2222p2543q2836r1608r8665j04462
$$ 5074688 5028574 4984460 4939917 4892252 4838634 4776412 4703869 4621033 4529425 4430760 4326298
59606D326298j08618j10003j08206j04029r8355r1534q4007p6379o8503n9601
$$ 4326298 4217680 4107677 3999471 3895442 3797087 3705553 3621546 3545167 3476664 3417063
59596C417063m9743m0235l1960k4341j6584q952k007M457J0773J6488K0995K4431
$$ 3417063 3367320 3327085 3295125 3270784 3254200 3245248 3243241 3247698 3258471 3274959 3295954 3320385
59584C320385K6980K8074K7275K5419K3712K2254K0579J9232J9460K1535K4610
$$ 3320385 3347365 3375439 3402714 3428133 3451845 3474099 3494678 3513910 3533370 3554905 3579515
59573C579515K8295L3176L9690M7482N6083O5449P5566Q6334R8013J11104J25554
$$ 3579515 3607810 3640986 3680676 3728158 3784241 3849690 3925256 4011590 4109603 4220707 4346261
59562D346261J40711J56228J72472J89938K08729K28625K49116K69272K88099
$$ 4346261 4486972 4643200 4815672 5005610 5214339 5442964 5692080 5961352 6249451
59553F249451L05103L19990L31909L39630L42595L41128L35528L25603L11396
$$ 6249451 6554554 6874544 7206453 7546083 7888678 8229806 8565334 8890937 9202333
59544I202333K93804K74150K53546K32953K13371J95460J78942J62640J45327
$$ 9202333 9496137 9770287 10023833 10256786 10470157 10665617 10844559 11007199 11152526
59535A1152526J26952J09453R6255R0493R3300J03513J18511J34939J49072J57358
$$ 11152526 11279478 11388931 11485186 11575679 11668979 11772492 11891003 12025942 12175014 12332372
59525A2332372J56920J45489J21225Q3353L3025k6918r3241j63048k33349l00556
$$ 12332372 12489292 12634781 12756006 12839359 12872384 12845466 12752225 12589177 12355828 12055272
59515A2055272l60910m11405m50292m77039m92011m96177m90925m77944m58949
$$ 12055272 11694362 11282957 10832665 10355626 9863615 9367438 8876513 8398569 7939620
59506G939620m35401m08608l79933l50456l20467k89820k59106k29775k02782
$$ 7939620 7504219 7095611 6715678 6365222 6044755 5754935 5495829 5266054 5063272
59497E063272j77728j53887j31501j11304r3117p5799n8439m0985k3750o886R737
$$ 5063272 4885544 4731657 4600156 4488852 4395735 4319936 4261497 4220512 4196762 4189876 4199613
59486D199613K6553M4064O2222Q0359R8190J16376J35553J55284J74858J94649
$$ 4199613 4226166 4270230 4332452 4412811 4511001 4627377 4762930 4918214 5093072 5287721
59476E287721K15584K37277K57720K74848K87657K95675K98107K93675K80616
$$ 5287721 5503305 5740582 5998302 6273150 6560807 6856482 7154589 7448264 7728880
59467G728880K56956K21681J75887J22175O2904j03o4245j25686j80897k28032
$$ 7728880 7985836 8207517 8383404 8505579 8568483 8568380 8504135 8378449 8197552 7969520
59457G969520k66471k95742l15440l25810l27905l23352l14023l01501k86634
$$ 7969520 7703049 7407307 7091867 6766057 6438152 6114800 5800777 5499276 5212642
59448E212642k69871k51934k33637k15160j96350j77819j60876j46002j32227
$$ 5212642 4942771 4690837 4457200 4242040 4045690 3867871 3706995 3560993 3428766
59439C428766j18436j04694r1727p9803o8819n9031n0857m4045l7623l0853k3836
$$ 3428766 3310330 3205636 3113909 3034106 2965287 2906256 2855399 2811354 2773731 2742878 2719042
59428B719042j7207j1416o374j758K487O018Q649J0715J2660J4472J6082J8114
$$ 2719042 2701835 2690419 2684045 2682287 2684774 2690792 2699441 2710156 2722816 2737288 2753370 2771484
59416B771484K1603K6779L2757L8401M2962M5790M6330M5025M3805M5111N0368
$$ 2771484 2793087 2819866 2852623 2891024 2933986 2979776 3026106 3071131 3114936 3160047 3210415
59405C210415N9495P1511Q5448J00919J17980J36318J54658J71469J86422K00884
$$ 3210415 3269910 3341421 3426869 3527788 3645768 3782086 3936744 4108213 4294635 4495519
59395D495519K16999K36671K61278K91586L27522L68345M13140M60789N09524
$$ 4495519 4712518 4949189 5210467 5502053 5829575 6197920 6611060 7071849 7581373
59386G581373N57011O00950O38903O67570O83161O83081O66951O36074N92830
$$ 7581373 8138384 8739334 9378237 10045807 10728968 11412049 12079000 12715074 13307904
59377A3307904N40822M84489M27411L71378L17474K67370K22503J82346J44395
$$ 13307904 13848726 14333215 14760626 15132004 15449478 15716848 15939351 16121697 16266092
59368A6266092J05896O4955K0337k8818q2694j40586k00946k61091l16829l63184
$$ 16266092 16371988 16436943 16457280 16428462 16345768 16205182 16004236 15743145 15426316 15063132
59358A5063132l96214m14373m18427m10674l94458l73945l53521l36864l26239
$$ 15063132 14666918 14252545 13834118 13423444 13028986 12655041 12301520 11964656 11638417
59349A1638417l22477l25358l33860l46101l59499l71417l79914l83771l82138
$$ 11638417 11315940 10990582 10656722 10310621 9951122 9579705 9199791 8816020 8433882
59340H433882l74580l61567l44386l24232l01585k76759k50714k24920k00367
$$ 8433882 8059302 7697735 7353349 7029117 6727532 6450773 6200059 5975139 5774772
59331E774772j77018j54236j31561j09077q7158o6074m5918k6851r166P090K2292
$$ 5774772 5597754 5443518 5311957 5202880 5115722 5049648 5003730 4976879 4967713 4974803 4997095
59320D997095L6729M9927O0888O9053P4663P7954P8390P5051O7618N6670M3120
$$ 4997095 5033824 5083751 5144639 5213692 5288355 5366309 5444699 5519750 5587368 5644038 5687158
59309E687158K7682J0826o922k4811m1844n6884o8983p7788q3545q6528q6512
$$ 5687158 5714840 5725666 5718744 5693933 5652089 5595205 5526222 5448434 5364889 5278361 5191849
59298E191849q3100p6547o7855n7710m5763l1427j5133J950J9330L7459N6476
$$ 5191849 5108749 5032202 4964347 4906637 4860874 4829447 4814314 4816264 4835594 4873053 4929529
59287D929529P5613R4260J12767J31544J49946J66732J81124J92783K01194K05808
$$ 4929529 5005142 5099402 5212169 5343713 5493659 5660391 5841515 6034298 6235492 6441300
59277F441300K06377K02466J93086J77706J57358J33950J08897Q3222N8488L6309
$$ 6441300 6647677 6850143 7043229 7220935 7378293 7512243 7621140 7704362 7762850 7799159
59267G799159J6828j331j9461l7867n6383p4662r1785j06597j18802j28970j37381
$$ 7799159 7815987 7814656 7795195 7757328 7700945 7626283 7534498 7427901 7309099 7180129 7042748
59256G042748j43708j47946j50627j51836j50897j47462j41966j34632j24807
$$ 7042748 6899040 6751094 6600467 6448631 6297734 6150272 6008306 5873674 5748867
59247E748867j11888r6199p8430n8828l7282j3663J2332M1044P2238J05295J40276
$$ 5748867 5636979 5540780 5462350 5403522 5366240 5352577 5364909 5405953 5478191 5583486 5723762
59236E723762J77975K18421K60173L01661L42467L82375M19530M50207M70049
$$ 5723762 5901737 6120158 6380331 6681992 7024459 7406834 7826364 8276571 8746620
59227H746620M75221M63025M32408L83916L18802K38458J45040M2317o4549j69929
$$ 8746620 9221841 9684866 10117274 10501190 10819992 11058450 11203490 11245807 11181258 11011329
59217A1011329k68358l54973m26064m79389n14089n30818n31944n20795n00226
$$ 11011329 10742971 10387998 9961934 9482545 8968456 8437638 7905694 7384899 6884673
59208F884673m72298m39300m04055l68693l33876k99856k67647k38354k12009
$$ 6884673 6412375 5973075 5569020 5200327 4866451 4566595 4298948 4060594 3848585
59199C848585j87862j65527j45156j26852j10575r6397q4196p3395o3486n4605
$$ 3848585 3660723 3495196 3350040 3223188 3112613 3016216 2932020 2858625 2795139 2740534
59189B740534m7026m0398l4028k7665k1520j5691j0094m725L84N357J0241J4909
$$ 2740534 2693508 2653110 2619082 2591417 2569897 2554206 2544112 2539387 2539771 2545128 2555369 2570278
59177B570278J9476K4517L0370L6594M2553M8249N4139O0422O6956P3610Q0297
$$ 2570278 2589754 2614271 2644641 2681235 2723788 2772037 2826176 2886598 2953554 3027164 3107461
59166C107461Q6867R3319R9810J06108J11444J15182J17255J17491J15140J09563
$$ 3107461 3194328 3287647 3387457 3493565 3605009 3720191 3837446 3954937 4070077 4179640
59156D179640J01012R0097P6921O1357M3888K5492O934j1287k8534m4151n7765
$$ 4179640 4280652 4370749 4447670 4509027 4552915 4578407 4585341 4574054 4545520 4501369 4443604
59145D443604o8969p7048q1583q3099q2510q0103p5641o9283o1715n3356m4065
$$ 4443604 4374635 4297587 4216004 4132905 4050395 3970292 3894651 3825368 3763653 3710297 3666232
59134C666232l3627k2157r993K501J5085K7878M1351N5835P1134Q6870J02926
$$ 3666232 3632605 3610448 3600455 3602956 3618041 3645919 3687270 3743105 3814239 3901109 4004035
59123D004035J19399J36383J54031J72490J91552K10773K30124K49962K70072
$$ 4004035 4123434 4259817 4413848 4586338 4777890 4988663 5218787 5468749 5738821
59114E738821K89367L06933L22601L35773L44387L45950L39177L23626K98145
$$ 5738821 6028188 6335121 6657722 6993495 7337882 7683832 8023009 8346635 8644780
59105H644780K60813K10734J49286P9580N422o9179j40285k04471k59181l02960
$$ 8644780 8905593 9116327 9265613 9345193 9350615 9281436 9141151 8936680 8677499 8374539
59095H374539l35586l57864l70962l76033l74381l67440l56226l41218l23191
$$ 8374539 8038953 7681089 7310127 6934094 6559713 6192273 5836047 5494829 5171638
59086E171638l03580k83592k63492k43306k23739k05686j89271j74133j60249
$$ 5171638 4868058 4584466 4320974 4077668 3853929 3648243 3458972 3284839 3124590
59077C124590j47810j36526j25890j15838j06483r7514q8629q0381p3625o8205
$$ 3124590 2976780 2840254 2714364 2598526 2492043 2394529 2305900 2225519 2151894 2083689
59067B083689o3001n7371n1743m6742m2393l8474l5029l2233l0085k8466k7283
$$ 2083689 2020688 1963317 1911574 1864832 1822439 1783965 1748936 1716703 1686618 1658152 1630869
59056A630869k6510k6145k6099k6001k5389k4177k2654k0820j8258j4957j1742
$$ 1630869 1604359 1578214 1552115 1526114 1500725 1476548 1453894 1433074 1414816 1399859 1388117
59045A388117r430p967o820n781m868l907k713j402P7K221N344R044J2759J6344
$$ 1388117 1378687 1370720 1363900 1358119 1353251 1349344 1346631 1345229 1345306 1347527 1352871 1361915 1374674 1391018
59031A391018J9571K1787K2693K2802K2372K0650J7074J2605Q782O000L801K299
$$ 1391018 1410589 1432376 1455069 1477871 1500243 1520893 1537967 1550572 1559354 1565354 1569155 1571454
59019A571454K006K553K991L277M242O073Q024R684J1395J3178J4324J4329J3394
$$ 1571454 1573460 1576013 1579004 1582281 1586523 1592596 1600620 1610304 1621699 1634877 1649201 1663530 1676924
59006A676924J1785R495O618L343m64m863r043j1810j2968j3378j3553j3191j2177
$$ 1676924 1688709 1698204 1704822 1708165 1707701 1702838 1693795 1681985 1669017 1655639 1642086 1628895 1616718
58993A616718j1037j0103r024p480n634l627j337J105L221M873O470Q222R796
$$ 1616718 1605681 1595578 1586554 1579074 1573440 1569813 1568476 1569581 1572802 1577675 1584145 1592367 1602163
58980A602163J0893J1727J2726J4164J6090J8220J9960K1098K2310K4410K7282
$$ 1602163 1613056 1624783 1637509 1651673 1667763 1685983 1705943 1727041 1749351 1773761 1801043
58969A801043L0219L3098L6347L9854M2797M4567M5159M4703M3448M2145M1524
$$ 1801043 1831262 1864360 1900707 1940561 1983358 2027925 2073084 2117787 2161235 2203380 2244904
58958B244904M1403M1125M0814M1283M2812M4985M7752N1477N5956O0591O5631
$$ 2244904 2286307 2327432 2368246 2409529 2452341 2497326 2545078 2596555 2652511 2713102 2778733
58947B778733P2016P9653Q7200R4067J01338J09991J19348J28248J36949J46807
$$ 2778733 2850749 2930402 3017602 3111669 3213007 3322998 3442346 3570594 3707543 3854350
58937C854350J58593J71981J86507K02311K20089K40631K64254K90467L18440
$$ 3854350 4012943 4184924 4371431 4573742 4793831 5034462 5298716 5589183 5907623
58928E907623L47897L79280M13085M49502M88592N30180N73698O18687O65311
$$ 5907623 6255520 6634800 7047885 7497387 7985979 8516159 9089857 9708544 10373855
58919A0373855P13379P60874Q04401Q41035Q68577Q83829Q81833Q57609Q07922
$$ 10373855 11087234 11848108 12652509 13493544 14362121 15245950 16127783 16985392 17793314
58910A7793314P31233O27233M97551L46543J80905Q844j60548l18498m58417n76572
$$ 17793314 18524547 19151780 19649331 19995874 20176779 20185623 20025075 19706577 19248160 18671588
58900A8671588o71072p41070p87341q12495q19700q11454p89888p57466p16702
$$ 18671588 18000516 17259446 16472105 15659610 14839910 14028456 13238568 12481102 11764400
58891A1764400o69760o18953n67239n17639m72426m33140m00780l75339l55409
$$ 11764400 11094640 10475687 9908448 9390809 8918383 8485243 8084463 7709124 7353715
58882G353715l38782l23420l07902k91494k74146k56153k37802k19538k02190
$$ 7353715 7014933 6691513 6383611 6092117 5817971 5561818 5324016 5104478 4902288
58873D902288j86333j71474j56697j42058j28552j16579j05529r5036q5641p7767
$$ 4902288 4715955 4544481 4387784 4245726 4117174 4000595 3895066 3800030 3714389 3636622
58863C636622p0899o4241n7510n0684m3727l6908l0658k4792j8585j1883n300
$$ 3636622 3565723 3501482 3443972 3393288 3349561 3312653 3281995 3257203 3238618 3226735 3221435
58852C221435Q60O978J3131J8751K3789K9195L5669M2899N0530N8902O8176P7655
$$ 3221435 3222295 3229273 3242404 3261155 3284944 3314139 3349808 3392707 3443237 3502139 3570315 3647970
58840C647970Q6827R6273J06770J18185J29967J42125J55002J68679J83267J99273
$$ 3647970 3734797 3831070 3937840 4056025 4185992 4328117 4483119 4651798 4835065 5034338
58830E034338K17065K36552K57860K81614L08050L36550L66778L99529M35817
$$ 5034338 5251403 5487955 5745815 6027429 6335479 6672029 7038807 7438336 7874153
58821G874153M75744N18814N64586O12190O59948P06208P49987P89799Q22362
$$ 7874153 8349897 8868711 9433297 10045487 10705435 11411643 12161630 12951429 13773791
58812A3773791Q43121Q47688Q32140P92746P26638O32948N13062L70392K10579
$$ 13773791 14616912 15464600 16296740 17089486 17816124 18449072 18962134 19332526 19543105
58803A9543105M1366j28608k91092m38658n65184o67007p43372p95281q24354
$$ 19543105 19584471 19455863 19164771 18726113 18160929 17493922 16750550 15955269 15130915
58794A5130915q33063q25035q04083p73173p34792o91585o45952n99462n53242
$$ 15130915 14297852 13472817 12668734 11895561 11160769 10469184 9823232 9223770 8670528
58785H670528n08325m65051m22755l80851l39709k99867k61048k22831j86024
$$ 8670528 8162203 7697152 7274397 6893546 6553837 6253970 5992922 5770091 5584067
58776E584067j53038j27523j13914j15801j32916j59653j87386k08653k19524
$$ 5584067 5431029 5303506 5189592 5073791 4940875 4781222 4593836 4385183 4165659
58767D165659k19525k10739j96623j80347j63735j47625j32518j18496j05148
$$ 4165659 3946134 3735395 3538772 3358425 3194690 3047065 2914547 2796051 2690903
58758B690903r2373q0713p0513o1386n3052m5958m0391l5736l1305k7147k3424
$$ 2690903 2598530 2517817 2447304 2385918 2332866 2286908 2246517 2210781 2179476 2152329 2128905
58747B128905j9754j5992j2864j0962r905r363r973j2240j5239j7598j9136k0469
$$ 2128905 2109151 2093159 2080295 2069333 2059428 2050065 2040092 2027852 2012613 1995015 1975879 1955410
58735A955410k1694k2648k3849k5836k7986k9252k9875l1107l3392l5893l7825
$$ 1955410 1933716 1911068 1887219 1861383 1833397 1804145 1774270 1743163 1709771 1673878 1636053
58724A636053l9166m0134m0701m0770m0231l9033l7520l6274l5113l3024k9737
$$ 1636053 1596887 1556753 1516052 1475282 1435051 1396018 1358498 1322224 1287111 1254087 1224350
58713A224350k6602k4948k4306k3249k1313j8997j6483j3698j1168r515q348o771
$$ 1224350 1197748 1172800 1148494 1125245 1103932 1084935 1068452 1054754 1043586 1034071 1025723 1018952
58701A018952m827l355k738k830l717n490p493q951j0091j1528j2897j3233j2473
$$ 1018952 1014125 1010770 1008032 1005202 1001485 995995 988502 979551 969460 957932 945035 931802 919329
58688I19329j1371j0095q159n666l377j547L03K449M780P507J1032J5081J8878
$$ 919329 907958 897863 889704 884038 880661 879114 879417 881866 886646 894153 905185 920266 939144
58675I39144K2174K5271K8230L0928L3800L7583M2585M9065N7964P0081Q4399
$$ 939144 961318 986589 1014819 1045747 1079547 1117130 1159715 1208780 1266744 1336825 1421224
58664A421224R7966J06956J07105R4164O6445K7663j3878m9693p4684q7545q9772
$$ 1421224 1519190 1626146 1733251 1827415 1893860 1921523 1907645 1857952 1783268 1695723 1605951
58653A605951q4809p6553o7437n8068m8607l9561l1165k3037j4916p206l85N513
$$ 1605951 1521142 1444589 1377152 1319084 1270477 1230916 1199751 1176714 1161798 1154592 1154207 1159720
58641A159720J0712J5485K0214K5168L0267L5412M0852M6810N3013N9229O5841
$$ 1159720 1170432 1185917 1206131 1231299 1261566 1296978 1337830 1384640 1437653 1496882 1562723
58630A562723P3321Q1466Q9922R8968J09033J19961J31584J44522J59335J75365
$$ 1562723 1636044 1717510 1807432 1906400 2015433 2135394 2266978 2411500 2570835 2746200
58620B746200J91488K07574K23967K39718K52532K60254K61248K53534K34875
$$ 2746200 2937688 3145262 3369229 3608947 3861479 4121733 4382981 4636515 4871390
58611D871390K04090J61655J09333N0263j0888o9164j20992j64246j97389k19726
$$ 4871390 5075480 5237135 5346468 5396731 5385843 5316679 5195687 5031441 4834052 4614326
58601D614326k32153k36403k33691k25069k12564j98564j84230j69652j55206
$$ 4614326 4382173 4145770 3912079 3687010 3474446 3275882 3091652 2922000 2766794
58592B766794j41457j28059j14289j00584q8148p7116o6536n6128m6727l8964
$$ 2766794 2625337 2497278 2382989 2282405 2194257 2117141 2050605 1994477 1947750 1908786
58582A908786l2877k8722k6891k6822k7312k7838k8448k8580k7371k5019k2356
$$ 1908786 1875909 1847187 1820296 1793474 1766162 1738324 1709876 1681296 1653925 1628906 1606550
58571A606550j9201j4745r506n275l021k419l446o677j1689j6988k1816k6501
$$ 1606550 1587349 1572604 1563098 1557823 1554802 1552383 1548937 1542260 1530571 1513583 1491767 1465266
58559A465266l0551l2190l0417k6122k0561j4142p232q39M109O990O604J531p978
$$ 1465266 1434715 1402525 1372108 1345986 1325425 1311283 1304051 1303212 1307321 1314311 1320915 1322446 1314468
58546A314468j9544l0536l9316m4660m5701m3208l9492l6166l3014k9454k5824
$$ 1314468 1294924 1264388 1225072 1180412 1134711 1091503 1052011 1015845 982831 953377 927553
58535I27553k2608j9697j7033j5026j3724j2658j1819j1704j2029j1686j0399
$$ 927553 904945 885248 868215 853189 839465 826807 814988 803284 791255 779569 769170
58524G69170r130q404p507n916m201k959k036j342j116r23L23K626M608N564O558
$$ 769170 760040 751636 744129 738213 734012 731053 729017 727675 726559 725636 725959 728585 733193 738757 745315
58509G45315Q612J1077J2655J3061J2756J1937J0597Q870O714M011J299m18r08
$$ 745315 753927 765004 777659 790720 803476 815413 826010 834880 841594 845605 846904 846486 845578
58496H45578q33m53O32K121K773K047Q66J74k63j100k481m245o188p794q627r098
$$ 845578 844745 844292 844924 847045 849818 851865 852731 852905 852642 851542 849061 844816 838628 830834 822207 813109
58480H13109r822j0300r509p758o441n926n324m487m403n271n972o013o264p183
$$ 813109 803287 792987 783478 775720 769279 763353 758029 753542 749139 743868 737896 731883 725619 718436
58466G18436p973q113q063p786o374l807j488k64M69J103J067M92O95K099L457
$$ 718436 710463 702350 694287 686501 680127 676320 674832 674568 675037 676140 677207 677699 678394 680493 683950
58451F83950M101N121P281R539J0867J1794J2890J3361J2532J1244J0421R681
$$ 683950 688051 693172 700453 709992 720859 732653 745543 758904 771436 782680 793101 802782
58439H02782Q499P354O354M265L16m259p847j0397j2517j3885j3974j3234j2239
$$ 802782 811281 818635 824989 829254 829570 825311 817464 807067 794550 780665 766691 753457 741218
58426G41218j0655q235n802m142k884j508l84K15J011K680M815O855Q894J0834
$$ 741218 730563 722328 716526 712384 709500 707992 707608 707823 708834 711514 716329 723184 732078 742912
58412G42912J1911J1926J1740J1850J1635J0631R178P232M164M36k271l433m407
$$ 742912 754823 766749 778489 790339 801974 812605 821783 829015 833179 833615 831344 827911 823504
58399H23504n970p016o640n604m675l402j684n81l33M46K300L729L791L844N066
$$ 823504 817534 810518 803878 798274 793599 790197 788513 787932 787599 788045 790345 794074 797865 801709 806775
58384H06775O295O068M997M353L969L337L109L759M286L853L273L334L318K599
$$ 806775 813070 819138 824135 828488 832457 835794 838903 842662 846948 850801 854074 857408 860726 863325
58370H63325K051K408K931L127L819N148N669M975M912O455P802P531P193Q432
$$ 863325 865376 867784 870715 873842 877661 882809 888478 893453 898365 904820 912622 920153 927346 935778
58356I35778J0007J0170R752J0107J0060P883M558K248R44o33k218k784k725k771
$$ 935778 945785 955955 965707 975814 985874 993757 998315 1000563 1001507 1000874 998656 995872 993147 990376
58342I90376k073J58K556L573M045N404O939P393P650R140J1085J1972J2324J3312
$$ 990376 988303 988461 991017 994590 998635 1004039 1010978 1018371 1026021 1035161 1046246 1058218 1070542 1083854
58328A083854J4144J3487J2167J1777J2110J2383J3400J5776J7793J7838J7199
$$ 1083854 1097998 1111485 1123652 1135429 1147539 1159922 1173322 1189098 1206891 1224729 1241928
58317A241928J7670J8123J6558J3673J1318R170O199L653L113L290K274J233K331
$$ 1241928 1259598 1277721 1294279 1307952 1319270 1328440 1334639 1338292 1341405 1344695 1346969 1348202 1350533
58304A350533M538N482N836P883J0943J2427J2472J3406J5406J6637J7054J8239
$$ 1350533 1355071 1360553 1366389 1374272 1385215 1397642 1410114 1423520 1438926 1455563 1472617 1490856
58292A490856J9964K0587K0376K1066K2658K3859K4970K7082K9446L0853L2434
$$ 1490856 1510820 1531407 1551783 1572849 1595507 1619366 1644336 1671418 1700864 1731717 1764151
58281A764151L5796L9682M1936M3238M5309M7040M6382M4462M3716M3400M1256
$$ 1764151 1799947 1839629 1881565 1924803 1970112 2017152 2063534 2107996 2151712 2195112 2236368
58270B236368L8052L6200L5292L3542L2045L2901L4651L4536L3894L6169M0818
$$ 2236368 2274420 2310620 2345912 2379454 2411499 2444400 2479051 2513587 2547481 2583650 2624468
58259B624468M4413M6698N0245N5045N8760O1440O4917O8471P0310P2102P6659
$$ 2624468 2668881 2715579 2765824 2820869 2879629 2941069 3005986 3074457 3144767 3216869 3293528
58248C293528Q2391Q5728Q7615R1712R7512J01641J04786J10654J19005J26251
$$ 3293528 3375919 3461647 3549262 3640974 3738486 3840127 3944913 4055567 4174572 4300823
58238D300823J32342J40346J50104J58850J67274J78171J90256K00388K10613
$$ 4300823 4433165 4573511 4723615 4882465 5049739 5227910 5418166 5618554 5829167
58229E829167K25381K43117K58597K72399K89611L10410L31025L52924L81355
$$ 5829167 6054548 6297665 6556262 6828661 7118272 7428682 7759707 8112631 8493986
58220H493986M15409M49445M83947N24895N72865O23600O79094P46838Q27955
$$ 8493986 8909395 9358840 9842787 10367682 10940547 11564147 12243241 12990079 13818034
58211A3818034R17856J018900J140315J285560J453015J649830J891514K187915
$$ 13818034 14735890 15754790 16895105 18180665 19633680 21283510 23175024 25362939
58203B5362939K545113K981210L521332M173363M927752N787874O783809P951962
$$ 25362939 27908052 30889262 34410594 38583957 43511709 49299583 56083392 64035354
58195F4035354R323114J0943552J2896389J5303245J8335448K2230807K7221242
$$ 64035354 73358468 84302020 97198409 112501654 130837102 153067909 180289151
58188A80289151L3271921L9670241M4712184M5885392M0827116K8773270J1529832
$$ 180289151 213561072 253231313 297943497 343828889 384656005 413429275 424959107
58181D24959107p001297k2661965l2951313l7669109l8148887l6061951l2716187
$$ 424959107 417957810 395295845 362344532 324675423 286526536 250464585 217748398
58174B17748398k8951150k5246512k1818757j8726310j5979829j3584222j1519929
$$ 217748398 188797248 163550736 141731979 123005669 107025840 93441618 81921689
58167H1921689r743349q218117o921870n824202m884306m072387l372576k763933
$$ 81921689 72178340 63960223 57038353 51214151 46329845 42257458 38884882 36120949
58159C6120949k217159j710849j233572p67087k80124K61466Q89095J623673K433308
$$ 36120949 33903790 32192941 30959369 30192282 29912158 30173624 31062719 32686392 35119700
58150C5119700L167947L547846L270983K204349N24333j325510k859215l794563
$$ 35119700 38287647 41835493 45106476 47310825 47835158 46509648 43650433 39855870
58142C9855870m134789m057571l753641l352441k932786k541197k192909j883193
$$ 39855870 35721081 31663510 27909869 24557428 21624642 19083445 16890536 15007343
58134A5007343j609729j376606j180960j011867q63830p39042o35976n47609m71926
$$ 15007343 13397614 12021008 10840048 9828181 8964351 8225309 7589333 7041724 6569798
58125F569798m12988l70116l35910l06395k83845k68125k53942k38377k23227
$$ 6569798 6156810 5786694 5450784 5144389 4860544 4592419 4338477 4100100 3876873
58116C876873k08546j91421j72409j55817j42251j27680j11109r6488q6062p8307
$$ 3876873 3668327 3476906 3304497 3148680 3006429 2878749 2767640 2671152 2585090 2506783
58106B506783p3327p3486p7349p9387p7259p3707p0236o5026n8290n3617n2157
$$ 2506783 2433456 2359970 2282621 2203234 2125975 2052268 1982032 1917006 1858716 1805099 1752942
58095A752942n0999m8816m7810m8539m8203m5813m3939m3507m1725l7217l2662
$$ 1752942 1701943 1653127 1605317 1556778 1508575 1462762 1418823 1375316 1333591 1296374 1263712
58084A263712l0330k9191k8165k8125k8918k8352k5913k3903k3370k2508k0374
$$ 1263712 1233382 1204191 1176026 1147901 1118983 1090631 1064718 1040815 1017445 994937 974563
58073I74563j8518j7600j6109j3761j2561j3055j3112j1820j0973j1295j0802
$$ 974563 956045 938445 922336 908575 896014 882959 869847 858027 847054 835759 824957
58062H24957q651p020p376q022p329o467o996q412r763j1298j2892j3182j1749
$$ 824957 816306 809286 801910 793888 786559 780092 773096 764684 754921 743623 730731 717549 705800
58049G05800j0042r000p973o812o575p234p180n919m779m169k825o75M13j98o73
$$ 705800 695758 686758 678785 671973 665398 658164 650984 645065 640286 636117 633292 632617 633030 632832 632159
58034F32159J71J156J300J432K001J795K48j309j930k319k775k319r84m93j379
$$ 632159 632330 633486 634786 636218 638219 640014 640262 638953 637023 634704 631929 629610 628626 628133 626754
58019F26754j905j140o10j533k766l009k727k376j107J091K199R87q87j464j305
$$ 626754 624849 623709 623099 621566 618800 615791 613064 610688 609581 610672 612871 613858 612971 611507 610202
58004F10202j987l459m764o021p826r831j1377j2562j3540j3902j3718j3930j4717
$$ 610202 608215 604756 599992 593971 586145 576314 564937 552375 538835 524933 511215 497285 482568
57991D82568j4831j3465j1328r016n883j637K523N408P210Q360Q535P686O697
$$ 482568 467737 454272 442944 433928 428045 426408 428931 434339 441549 449909 458444 466130 472827
57978D72827O097N431M634M423M715M381L327K892L334L023J178o52j168j224
$$ 472827 478924 484355 488989 493412 498127 502508 505835 508727 512061 515084 516262 515610 514442 513218
57964E13218j752j856p31L72J1j062j285o24J51J209K831M109M326M563O050P962
$$ 513218 511466 509610 508879 509251 509262 508200 506915 506291 506442 507651 510482 514591 518917 523480 529530 537492
57948E37492Q685Q395Q396Q632P820N686L228R80j399l900n914p247q311r365
$$ 537492 546177 554572 562968 571600 579420 585106 588334 589314 587915 584015 578101 570854 562543 553178
57934E53178j0338j1122j1334j0353q386o945p272q853j0313j1247j2084j2626
$$ 553178 542840 531718 520384 510031 501645 494700 487428 478575 468262 457015 444931 432305
57922D32305j1928r575o267l114p57R05K389L826M525L937K889K921M353O109
$$ 432305 420377 410802 404535 401421 400664 401569 403958 407784 412309 416246 419135 422056 426409 432518
57908D32518P618R407J1463J2557J2034J0848R958Q930P141N141L683K440Q64
$$ 432518 440136 449543 461006 473563 485597 496445 506403 515333 522474 527615 531298 533738 534602
57895E34602n97j331j832l023m876o696q122r068r296q944q697q725q190o619
$$ 534602 534005 532674 530842 527819 522943 516247 508125 499057 489761 480817 472120 463395 455205 448586
57881D48586m868l815l032j726j50R83J784K789L929M879N824O914P637P649P588
$$ 448586 443718 439903 436871 435145 434995 435978 437762 440551 444480 449359 455183 462097 469734 477383 484971
57866D84971Q024Q241P152M930K704J083p2q78j382k014l182m603n723o401o702
$$ 484971 492995 501236 508388 513318 516022 517105 517033 516155 514773 512759 509577 504974 499251 492850 486148
57851D86148o397n350m022k998k410k194k327k432j791k25J607L099M163M538
$$ 486148 479751 474401 470379 467381 464971 462777 460450 458018 456227 456002 457609 460708 464871 469409
57837D69409L729K035M97o16k172m476o561p841r034j0532j1372j1065j0946j2076
$$ 469409 473138 475173 475670 475054 472882 468406 461845 454004 444970 434438 423066 412001 401055 388979
57823C88979j3097j1948r002o647o272p171p994p853o306l754j711j430k367k934
$$ 388979 375882 363934 354932 348285 342013 334842 326848 318995 312689 308935 307224 305794 303427 300493
57809C00493k481j492l64Q98K065K901L795N249P055Q775J0505J2323J3683J4358
$$ 300493 298012 296520 296156 297054 299119 302020 305815 311064 318119 326894 337399 349722 363405 377763
57795C77763J5321J7462J9982K1329K1052J9592J6793J2311P043K636m50l059
$$ 377763 393084 410546 430528 451857 472909 492501 509294 521605 528648 531284 530834 527775
57783E27775n672p914r679j1411j3193j4593j5418j5709j5180j3703j2142j1528
$$ 527775 522103 514189 504510 493099 479906 465313 449895 434186 419006 405303 393161 381633
57771C81633j1519j0824r019o820m751k757j089k82j01L52J315K151K557K971
$$ 381633 370114 359290 350271 343451 338700 335943 334854 334572 334471 334823 336138 338289 340846 343817
57757C43817L626M156M362M509M717M796M667M361L756L034L001M068N189N034
$$ 343817 347443 351599 355961 360470 365187 369983 374650 379011 382767 385801 388802 392870 398059 403093
57743D03093L948L480M146M923N025M802M754M882N356O579Q193R098Q970Q832
$$ 403093 407041 410521 414667 419590 424615 429417 434171 439053 444409 450988 459181 468279 477249 486081
57729D86081R642J1110J2334J2889J3011J3279J4374J6451J8664J9969K0459K1139
$$ 486081 495723 506833 519167 532056 545067 558346 572720 589171 607835 627804 648263 669402
57717F69402K2448K3968K5581K7801L0677L3482L5984L9054M3445M8725N4040
$$ 669402 691850 715818 741399 769200 799877 833359 869343 908397 951842 1000567 1054607
57706A054607N9394O5639P3574Q3318R4309J05771J17619J30733J45866J62463
$$ 1054607 1114001 1179640 1253214 1336532 1430841 1536612 1654231 1784964 1930830 2093293
57696B093293J79308J96193K13895K32528K50794K66826K78571K83169K77275
$$ 2093293 2272601 2468794 2682689 2915217 3166011 3432837 3711408 3994577 4271852
57687D271852K58640K26788J82176J26220O2836j392n9954j09135j47743j75226
$$ 4271852 4530492 4757280 4939456 5065676 5128512 5127120 5067166 4958031 4810288 4635062
57677D635062j91143j95937j91087j78400j59500j35679j07524p4845l7604K553
$$ 4635062 4443919 4247982 4056895 3878495 3718995 3583316 3475792 3400947 3363343 3365896
57667C365896M1059O9980P9427O1865J7506m3791j06674j57441j88838k00377
$$ 3365896 3406955 3476935 3556362 3618227 3635733 3591942 3485268 3327827 3138989 2938612
57657B938612j95974j81206j61271j39879j19110r9689q1423o3845m6993l1471
$$ 2938612 2742638 2561432 2400161 2260282 2141172 2041483 1960060 1896215 1849222 1817751
57647A817751j7656m992P602K0762L4216M7250N9579P1839Q5128R9983J15980
$$ 1817751 1800095 1795103 1802705 1823467 1857683 1904933 1964512 2036351 2121479 2221462 2337442
57636B337442J32532J49698J67755J86235K03964K19831K32650K40294K39804
$$ 2337442 2469974 2619672 2787427 2973662 3177626 3397457 3630107 3870401 4110205
57627D110205K28854K06562J72898J28221P4249J4989m4177r8540j45281j83052
$$ 4110205 4339059 4545621 4718519 4846740 4920989 4935978 4891801 4793261 4647980 4464928
57617D464928k11081k28956k37110k37216k31714k22657k11091j97626j83254
$$ 4464928 4253847 4024891 3787781 3550565 3318851 3096194 2885103 2687477 2504223
57608B504223j69124j55682j42633j29809j17636j06665r6998q8309q0227p2597
$$ 2504223 2335099 2179417 2036784 1906975 1789339 1682674 1585676 1497367 1417140 1344543
57598A344543o5564n9355n3852m8627m3589l9240l5946l3326l0854k8646k6962
$$ 1344543 1278979 1219624 1165772 1117145 1073556 1034316 998370 965044 934190 905544 878582
57587H78582k5322k2914j9793j6889j4839j3483j2423j1367j0010q342o976o394
$$ 878582 853260 830346 810553 793664 778825 765342 752919 741552 731542 723200 716224 709830
57575G09830n967m625k472p00J96J049K490M017N056O047P643R576J1071J1997
$$ 709830 703863 699238 696766 696066 696262 697311 699801 703818 708874 714921 722564 732140 743211 755208
57561G55208J2906J4263J6118J8353K0811K3406K6280K9613L3275L7094M1468
$$ 755208 768114 782377 798495 816848 837659 861065 887345 916958 950233 987327 1028795
57550A028795M7020N3561O0112O6295P3008Q1302R1188J02045J13551J25669J38141
$$ 1028795 1075815 1129376 1189488 1255783 1328791 1410093 1501281 1603326 1716877 1842546 1980687
57539A980687J50680J63283J75820J87291J95875J99594J96743J85927J66051
$$ 1980687 2131367 2294650 2470470 2657761 2853636 3053230 3249973 3435900 3601951
57530C601951J36437R7326N0863J395m6062q8118j23453j51242j70265j80150
$$ 3601951 3738388 3835714 3886577 3887972 3841910 3753792 3630339 3479097 3308832 3128682
57520C128682j82588j80375j75380j67992j58154j46316j33444j20563j08322
$$ 3128682 2946094 2765719 2590339 2422347 2264193 2117877 1984433 1863870 1755548
57511A755548r6843q6046p6050o7008n8662n0633m3164l6909l1815k6964k1804
$$ 1755548 1658705 1572659 1496609 1429601 1370939 1320306 1277142 1240233 1208418 1181454 1159650
57500A159650j6833j2657q955m984n33M109Q727J3258J7630K2023K6958L2783
$$ 1159650 1142817 1130160 1121205 1116221 1115688 1119797 1128524 1141782 1159412 1181435 1208393 1241176
57488A241176L9373M6567N4465O3029P1965Q1375R1966J04093J17089J30007J42545
$$ 1241176 1280549 1327116 1381581 1444610 1516575 1597950 1689916 1794009 1911098 2041105 2183650
57477B183650J54741J66208J76139J83512J86692J83282J71105J49225J17812
$$ 2183650 2338391 2504599 2680738 2864250 3050942 3234224 3405329 3554554 3672366
57468C672366P7749L1152j8189o5833j08290j43405j69819j86947j95386j96631
$$ 3672366 3750115 3781267 3763078 3697245 3588955 3445550 3275731 3088784 2893398 2696767
57458B696767j92351j84171j73700j62165j50076j37728j25678j14362j03684
$$ 2696767 2504416 2320245 2146545 1984380 1834304 1696576 1570898 1456536 1352852
57449A352852r3574q4495p6716o9575o2273n5135m9153m4528m0535l6709l3205
$$ 1352852 1259278 1174783 1098067 1028492 966219 911084 861931 817403 776868 740159 706954
57438G06954l0015k6847k3911k1931k1038k0440j9472j8322j7344j6331j4864
$$ 706954 676939 650092 626181 604250 583212 562772 543300 524978 507634 491303 476439
57427D76439j2978j1043r431q445q211q349q229p724p314p166o737n656m491m105
$$ 476439 463461 452418 442987 434542 426331 417982 409753 402029 394715 387549 380812 375156 370665 366560
57413C66560m555n126n232m780l874k699j641j019o37l3P86J293J199R08R06J128
$$ 366560 362005 356879 351647 346867 342993 340294 338653 337634 336997 336964 337750 339043 340242 341150 342056 343184
57397C43184J177J042J082J414J693J611J238P97L76J12K88R54J641J847J694
$$ 343184 344361 345403 346485 347899 349592 351203 352441 353238 353614 353726 354014 354968 356609 358456 360150
57382C60150J685J929K039J833J650J814K196K571L000L568L943L683K833J972
$$ 360150 361835 363764 365803 367636 369286 371100 373296 375867 378867 382435 386378 390061 392894 394866
57368C94866J547J458J342J109J035J411K149K851L150K956K370J587R15O78Q97
$$ 394866 396413 397871 399213 400322 401357 402768 404917 407768 410918 413874 416244 417831 418746 419424 420321
57353D20321J209J238J029R80J509K800M607O161O619N909M889M446M732N529
$$ 420321 421530 422768 423797 424777 426286 429086 433693 439854 446473 452382 457271 461717 466449 471978
57339D71978O836Q572J0201J1284J2060J2762J2906J2095J1148J1224J2024J2153
$$ 471978 478814 487386 497587 508871 520931 533693 546599 558694 569842 581066 593090 605243
57327F05243J1296J0700J1157J1768J1425J0442R869J0040J0564J1121J1537J1591
$$ 605243 616539 627239 638396 650164 661589 672031 681900 691940 702504 713625 725162 736753
57315G36753J1416J1625J2498J3531J4308J5170J6432J7607J8164J8551J9602
$$ 736753 748169 759794 772292 785823 800131 815301 831733 849340 867504 886055 905657
57304I05657K1297K2886K3941K4702K5546K6808K8735L1090L3079L4253L5117
$$ 905657 926954 949840 973781 998483 1024029 1050837 1079572 1110662 1143741 1177994 1213111
57293A213111L6334L7766L8882L9618M0117M0046L8956L6975L4413L0984K6186
$$ 1213111 1249445 1287211 1326093 1365711 1405828 1445874 1484830 1521805 1556218 1587202 1613388
57282A613388K0231J3828P340R20m859r396j2931j6037j8454j9305j8507j6977
$$ 1613388 1633619 1647447 1654787 1655707 1650848 1641452 1628521 1612484 1594030 1574725 1556218 1539241
57270A539241j5391j3586j1386r139p162n315l394j474M05K356M393O465Q706
$$ 1539241 1523850 1510264 1498878 1489739 1482577 1477262 1473868 1472394 1472799 1475155 1479548 1486013 1494719
57257A494719J1128J3125J3971J3947J4208J5382J6847J7643J7587J7244J7264
$$ 1494719 1505847 1518972 1532943 1546890 1561098 1576480 1593327 1610970 1628557 1645801 1663065
57246A663065J7955J9051J9781J9555J8787J8627J9664K1301K2572K3200K3604
$$ 1663065 1681020 1700071 1719852 1739407 1758194 1776821 1796485 1817786 1840358 1863558 1887162
57235A887162K4167K4780K5040K4742K4171K3821K3767K3637K3359K3469K4312
$$ 1887162 1911329 1936109 1961149 1985891 2010062 2033883 2057650 2081287 2104646 2128115 2152427
57224B152427K5346K5824K5890K6319K7384K8706L0113L1803L3643L5039L5746
$$ 2152427 2177773 2203597 2229487 2255806 2283190 2311896 2342009 2373812 2407455 2442494 2478240
57213B478240L6202L6791L7338L7496L7222L6610L5651L4356L2750L0789K8597
$$ 2478240 2514442 2551233 2588571 2626067 2663289 2699899 2735550 2769906 2802656 2833445 2862042
57202B862042K6731K5703K5208K4368K2873K1333K0452K0368K0961K2216K3907
$$ 2862042 2888773 2914476 2939684 2964052 2986925 3008258 3028710 3049078 3070039 3092255 3116162
57191C116162K5414K6233K6542K7007K8096K9642L0983L1616L1712L1911L2397
$$ 3116162 3141576 3167809 3194351 3221358 3249454 3279096 3310079 3341695 3373407 3405318 3437715
57180C437715L2608L2103L1341L1090L1455L2037L2663L3271L3354L2382L0698
$$ 3437715 3470323 3502426 3533767 3564857 3596312 3628349 3661012 3694283 3727637 3760019 3790717
57169C790717K9199K8180K7170K5798K4022K1638J8492J5185J2621J0714Q515
$$ 3790717 3819916 3848096 3875266 3901064 3925086 3946724 3965216 3980401 3993022 4003736 4012251
57158D012251N734L138J191p05l129n809q328j0775j3127j4809j5583j6117j6884
$$ 4012251 4017985 4021123 4022314 4021609 4018480 4012671 4004343 3993568 3980441 3965632 3950049 3933932 3917048
57145C917048j7243j6413j4859j3703j3058j1976r905p438n423m013k769j344
$$ 3917048 3899805 3883392 3868533 3854830 3841772 3829796 3819891 3812453 3807030 3803017 3800248 3798904
57133C798904J96J390J608M36k001n216q890j3120j8040k3220k7624l0373l1455
$$ 3798904 3799100 3800490 3802098 3802534 3800533 3795317 3786427 3773307 3755267 3732047 3704423 3674050 3642595
57120C642595l1477l0767k9291k7443k6236k6182k6611k6682k6500k6531k6377
$$ 3642595 3611118 3580351 3551060 3523617 3497381 3471199 3444588 3417906 3391406 3364875 3338498
57109C338498k5072k2286j8155j1984k111J2813L3301N9924R4015J37392J92049
$$ 3338498 3313426 3291140 3272985 3261001 3258890 3271703 3305004 3364928 3458943 3596335 3788384
57098C788384K60162L43683M43976N62355P00558Q59380J036453J225963J420560
$$ 3788384 4048546 4392229 4836205 5398560 6099118 6958498 7994951 9220914 10641474
57089A0641474J612497J790952J935527K011749J980685J829409J603722J403185
$$ 10641474 12253971 14044923 15980450 17992199 19972884 21802293 23406015 24809200
57081B4809200J320973J370202J466820J489970J363550J088205P13743K97828
$$ 24809200 26130173 27500375 28967195 30457165 31820715 32908920 33622663 33920491
57073C3920491j12435m81834p90226j036922j235256j399285j535255j642271
$$ 33920491 33808056 33326222 32535996 31499074 30263818 28864533 27329278 25687007
57065B5687007j716016j751028j743131j692570j604882j488799j354338j212622
$$ 25687007 23970991 22219963 20476832 18784262 17179380 15690581 14336243 13123621
57057A3123621j074915r49566q40003p46534o69150o06898n54984n05588m53884
$$ 13123621 12048706 11099140 10259137 9512603 8843453 8236555 7681571 7175983 6722099
57048F722099m02638l58983l26804l03888k86454k74026k68489k69909k75073
$$ 6722099 6319461 5960478 5633674 5329786 5043332 4769306 4500817 4230908 3955835
57039C955835k79514k79464k72487k58128k38356k16228j93760j71618j50612
$$ 3955835 3676321 3396857 3124370 2866242 2627886 2411658 2217898 2046280 1895668
57030A895668j32153j17007j04557r3713q3940p5084o6880n9047n1627m4935l9336
$$ 1895668 1763515 1646508 1541951 1448238 1364298 1289214 1222334 1163287 1111660 1066725 1027389
57019A027389l4938l1330k7749k3912k0376j7716j5720j3941j2550j1827j1070
$$ 1027389 992451 961121 933372 909460 889084 871368 855648 841707 829157 817330 806260
57008H06260r055n554j528K324O453J1704J8402K6500L6043M7230O0384P6255
$$ 806260 797205 791651 790123 792447 798900 810604 829006 855506 891549 938779 999163 1075418
56996A075418R6036J20195J45875J64453J62736J30263O8648o166p2879j17454
$$ 1075418 1171454 1291649 1437524 1601977 1764713 1894976 1963624 1957458 1884579 1767125
56986A767125j37959j39831j29515j12609r4442p9283o8867o2619n9014n6356
$$ 1767125 1629166 1489335 1359820 1247211 1152769 1073486 1004619 942000 882986 826630
56976H26630n3040m8188m2080l5619k9508k4096j9572j5895j2917j0689r334q475
$$ 826630 773590 725402 683322 647703 618195 594099 574527 558632 545715 535026 525692 517217
56964E17217p281n185k208J471N756J0377J5048J9768K4161K6371K3701J5108
$$ 517217 509936 504751 502543 504014 509770 520147 535195 554963 579124 605495 629196 644304
56952F44304K635j0031k0052k6336k8944k8487k5978k2571j9108j5862j2630r183
$$ 644304 646939 636908 616856 590520 561576 533089 507111 484540 465432 449570 436940 427757
56940D27757n816l209j456M15L378P255J1447J6300K2599K9689L5266L7174L4362
$$ 427757 421941 418732 417276 417691 421069 428324 439771 456071 478670 508359 543625 580799 615161
56927F15161K6285J3109k860j7468k7596l3056l5158l4659l2080k8754k5991k3709
$$ 615161 641446 654555 651695 634227 606631 573575 538417 503758 471678 442924 416933 393224
56915C93224k1097j8173j5609j3429j1125q868p391o717o062n051m135l588l040
$$ 393224 372127 353954 338345 324916 313791 304923 297532 290815 284753 279702 275567 271979 268939
56902B68939k234j567j520j938k167j616j72J674L113L767M153N157P193J0145
$$ 268939 266705 265138 263618 261680 259513 257897 257725 259399 262512 266279 270432 275589 282782 292927
56888B92927J3814J7891K1586K3834K3921K1688J7266J1078M075k496p747j1369
$$ 292927 306741 324632 346218 370052 393973 415661 432927 444005 448080 445584 437837 426468
56876D26468j3370j3797j2789j0631p799m873k199M99L783P663J1492J4997J8849
$$ 426468 413098 399301 386512 375881 368082 363209 361010 361509 365292 372955 384447 399444 418293
56863D18293K3793K9718L6120M2959M9960N5190N5287M7756L2839J3297o970k4107
$$ 418293 442086 471804 507924 550883 600843 656033 711320 759076 791915 805212 798242 774135
56851G74135l5237l9471l8251l4245k9557k4788j9643j3995q150k289L872J0642
$$ 774135 738898 699427 661176 626931 597374 572586 552943 538948 530798 528509 532381 543023
56839E43023J7980K5882L4866M5642N8310P2066Q5153R4304R4720Q2175N6307
$$ 543023 561003 586885 621751 667393 725703 797769 882922 977226 1071946 1154121 1210428
56828A210428K1745j4160m4650o5369p4918p5025o9630o2575n5654m8800m1530
$$ 1210428 1232173 1218013 1173363 1107994 1033076 958051 888421 825846 770192 721392 679862
56817F79862l3681k5313j6643q098K8P948J6274K5721L6864M9488O1688O9945
$$ 679862 646181 620868 604225 596127 596155 604103 620377 646098 682962 732450 794138 864083
56805H64083P0583O1311M2000J5231j3633l8286n4815o3209o5533o3514n8362
$$ 864083 934666 995977 1037977 1053208 1039575 1001289 946474 883265 817732 754218 695856
56794F95856n1612m4691l8012l1524k5614k0499j5349r244k669L178Q302J3841
$$ 695856 644244 599553 561541 530017 504403 483904 468555 459311 456642 459820 468122 481963
56782D81963K0189K6397L1225L3477L1292K2921R038o744k0444l0214l6076l8388
$$ 481963 502152 528549 559774 593251 624543 647464 656502 649758 629314 599100 563024 524636
56770E24636l7473l4241l0121k6325k3300k0753j8135j5339j2941j1392j0245
$$ 524636 487163 452922 422801 396476 373176 352423 334288 318949 306008 294616 284371
56759B84371q772p165o218n925n368m209l290l274l575l267k408j785j791k154
$$ 284371 275599 268434 262216 256291 250923 246714 243424 240150 236575 233308 230900 229115 227324 225170
56745B25170k470k536k335k037j873j805j605j406j709k595l340l170k190j191
$$ 225170 222700 220164 217829 215792 213919 212114 210509 209103 207394 204799 201459 198289 196099 194908
56731A94908q18j089j557j768j651j512j540j425q66k74m46j437k361k451j904
$$ 194908 194090 193001 191444 189676 188025 186513 184973 183548 182682 182408 181962 180525 178164 175713 173809
56716A73809j409j237j096o00K90J099J140K47q11j025k48P25J115Q18J60m50
$$ 173809 172400 171163 170067 169467 169757 170856 171996 172243 171432 170407 170159 170884 171999 172817 172977 172527
56700A72527o32k75K37M50M09M61P08J090J823K951L717L255J946J142J397J836
$$ 172527 171895 171620 171857 172307 172716 173177 173885 174975 176798 179749 183466 186721 188667 189809 191206 193042
56684A93042J520O01k38o62o60l60j94o20j264j140l6R91R38Jr92j614j773j412
$$ 193042 194562 195163 194925 194263 193603 193243 193049 192429 191165 190025 189989 190980 191918 191919 190927 189313 187540 186128
56666A86128p92n95j081j627j562j027n83m72o51j003j098m02Q35J530J137L95
$$ 186128 185336 184741 183660 182033 180471 179444 178861 178389 177738 176735 175637 175235 176070 177600 178737 179132
56650A79132J60J70k60r95j392j359j242r87l46L62N43L17L80Q76J142O88j33
$$ 179132 179292 179462 179202 178207 176815 175456 174214 173227 172881 173243 173786 174103 174483 175359 176501 177189 177056
56633A77056o42n95l33l39p13j048r16m53j30M2M95J224J575J226P36O78Q36P67
$$ 177056 176414 175819 175486 175147 174434 173386 172470 172017 171887 171929 172424 173648 175223 176449 177185 177863 178699 179466
56615A79466N24L33Q2k99m56k32o5k56l19K05Q18P38R1l53k71R1N47R94J069N70
$$ 179466 179990 180323 180405 180106 179650 179418 179353 179097 178778 178983 179801 180539 180630 180277 180006 180097 180644 181638 182707 183277
56595A83277o0k54j06l0n0Kk3j71mO45J068P51M43J077K122K273J540J222J859
$$ 183277 183217 182963 182857 182827 182777 182779 182756 182585 182581 183226 184294 185045 185488 186565 188687 190960 192500 193722 195581
56576A95581K557K595K400K519K688K478K034J680J438J373J781K638L376L576
$$ 195581 198138 200733 203133 205652 208340 210818 212852 214532 215970 217343 219124 221762 225138 228714
56562B28714L492L581L901M198M254M056L854L972M320M277L534K676K354K249
$$ 228714 232206 235787 239688 243886 248140 252196 256050 260022 264342 268619 272153 274829 277183 279432
56548B79432J662Q42O55J008Q01m25j846k685l135l522l558l015k416k359k706
$$ 279432 281094 281936 282591 283599 284400 283975 282129 279444 276309 272787 269229 266214 263798 261439 258733
56533B58733k970l031k985k786k481k416k731l012k860k432k092j858j576j335
$$ 258733 255763 252732 249747 246961 244480 242064 239333 236321 233461 231029 228937 227079 225503 224168
56519B24168j323j508j701j777j661j381j223j425j697j457o78J5K01J23O3j29
$$ 224168 222845 221337 219636 217859 216198 214817 213594 212169 210472 209015 208337 208352 208553 208676 208739 208610
56503B08610n55q45o63k05J84M86P77R00P70O57P49P42L01l19n72l45M0M34J003
$$ 208610 208055 207210 206547 206342 206526 207012 207789 208689 209459 210116 210865 211607 211908 211589 211017 210672 210712 211146 212149
56484B12149J789K534K986L119L026K748K336J919J651J643J955K530L085L158
$$ 212149 213938 216472 219458 222577 225603 228351 230687 232606 234257 235900 237855 240385 243470 246628
56470B46628K478J417Q03J058J605J552R39P46J522K638L215L200K983K526J595
$$ 246628 249106 250523 251326 252384 253989 255541 256480 257226 258748 261386 264601 267801 270784 273310 274905
56455B74905N47N6J85L98M29N73J096J915K796L405L311K503J718J574J575P29
$$ 274905 275452 275508 275693 276091 276520 277093 278189 280104 282900 286305 289616 292119 293837 295411 296986 297715
56439B97715q79k000j853j110q96j464k199k504k349k178k466l236m005m333m249
$$ 297715 296836 294836 292983 291873 290977 289513 287314 284810 282461 280283 277817 274581 270576 266243 261994
56424B61994l914l339k740k705l309l609k752j260l29j88j42Q3R9q9K9M12L93
$$ 261994 258080 254741 252001 249296 245987 242378 239626 238366 238037 237849 237707 237790 237889 237800 237829 238241 238634
56407B38634j50n29l44nQ5M6M8J46O29J628K373J899N45k95j56J9l38m86J95J063
$$ 238634 238484 237955 237611 237606 237691 237737 237785 237931 238560 240188 242561 244460 245005 244710 244554 244573 244235 243749 243944 245007
56387B45007J294J177J445K003K171J692J004P55J327K346K728J873Q02J042K392
$$ 245007 246301 247478 248923 250926 253097 254789 255793 256548 257875 260221 262949 264822 265624 266666 269058
56372B69058L062K253J186J025J263R79M66M26O61O75P23J147J390Q30M8J31J048
$$ 269058 272120 274373 275559 276584 277847 278826 279292 279718 280379 281054 281777 282924 284314 285144 285192 285323 286371
56355B86371J745J653J208J003J102J167R19N80R02K314L996M595L986L420L701
$$ 286371 288116 289769 290977 291980 293082 294249 295168 295748 296650 298964 302960 307555 311541 314961 318662
56340C18662M285M598N016N861O579O825P313Q559R766R976R554R333R085Q065
$$ 318662 322947 327545 332561 338422 345001 351826 359139 367698 377464 387440 396994 406327 415412 423477
56326D23477O490N208M336L375K419K087K344K358J570J94j216k215k591k570
$$ 423477 429967 435175 439511 442886 445305 447392 449736 452094 453664 453858 452642 450427 447836 445266
56312D45266k674l098l579m011m535m813m114k583j420j256j304p57J8M68R18
$$ 445266 442592 439494 435915 431904 427369 422556 418442 415859 414439 413183 411879 411122 411140 411608 412526
56297D12526J717K352K426K610L468M310M323M073M594N815P098Q533J0346J1737
$$ 412526 414243 416595 419021 421631 425099 429409 433732 437805 442399 448214 455312 463845 474191 485928
56283D85928J1793J1121J1172J2306J3762J5113J6518J7933J9299K1168K3986
$$ 485928 497721 508842 520014 532320 546082 561195 577713 595646 614945 636113 660099
56272F60099K7093K9599L1873L5008L9203M3816M8625N3958N9910O6440P3758
$$ 660099 687192 716791 748664 783672 822875 866691 915316 969274 1029184 1095624 1169382
56261A169382Q1619Q8869R4785J00218J06243J12350J17138J20078J21185J19845
$$ 1169382 1251001 1339870 1434655 1534873 1641116 1753466 1870604 1990682 2111867 2231712
56251B231712J15544J09060J01297R1591P8950O4298M9655L5631K1766Q843j388
$$ 2231712 2347256 2456316 2557613 2649204 2728154 2792452 2842107 2877738 2899504 2908347 2906959
56240B906959q758j4799k0212k4284k7013k9742l3203l6794m0269m4433m9633
$$ 2906959 2898201 2883402 2863190 2838906 2811893 2782151 2748948 2712154 2671885 2627452 2577819
56229B577819n5165o0681o6709p3236p9219q3941q7475q9605q9751q8349q6786
$$ 2577819 2522654 2461973 2395264 2322028 2242809 2158868 2071393 1981788 1892037 1803688 1716902
56218A716902q5442q3303p9934p6350p3218o9717o4967n9368n3664m7834m1772
$$ 1716902 1631460 1548157 1468223 1391873 1318655 1248938 1183971 1124603 1070939 1023105 981333
56207I81333l6141l1814k9027k7556k6977k6464k5149k2948k0345j7352j3645
$$ 981333 945192 913378 884351 856795 829818 803354 778205 755257 734912 717560 703915
56196G03915r652o390m076k067k31P95J015J474K923N062P330R433J0874J1101
$$ 703915 694263 687873 683797 681730 681499 682294 683309 684783 687706 692768 700098 709531 720405 731506
56182G31506J0288R197Q106O851N705N136M801M003K928K280J857R19k70p86p47
$$ 731506 741794 750991 759097 765948 771653 776789 781590 785593 788521 790801 792658 793577 793307 792521 791774
56167G91774j013j367p91N33J429J994L582O262Q379R244J0198J2230J4474J6047
$$ 791774 790761 789394 788603 789136 790565 792559 796141 802403 810782 820026 830224 842454 856928 872975
56153H72975J7646K0199K3377K6507K9768L3625L8160M3717N1099O0396P0636
$$ 872975 890621 910820 934197 960704 990472 1024097 1062257 1105974 1157073 1217469 1288105
56142A288105Q1247R2955J06858J23602J43531J66290J89688K09956K23545K27990
$$ 1288105 1369352 1462307 1569165 1692767 1836298 2002588 2192276 2402232 2625777 2853767
56132B853767K21667K04687J80410J54509J31897J15165J05103J00454R6926Q8836
$$ 2853767 3075434 3280121 3460531 3615040 3746937 3862102 3967205 4067659 4164585 4253421
56122D253421P2971N0186K3648k666k4247l7942m4912n0372n9770p6037r9728
$$ 4253421 4326392 4376578 4400226 4397560 4373313 4335371 4290459 4240087 4180317 4104280 4004552
56111D004552j29076j59497j85402k03560k13446k14875k07813j94424j78416
$$ 4004552 3875476 3715979 3530577 3327017 3113571 2898696 2690883 2496459 2318043
56102B318043j61705j44137j26594j11442r9159q7642p5766o4893n5912m7775
$$ 2318043 2156338 2012201 1885607 1774165 1675006 1587364 1511598 1446705 1390793 1343018
56092A343018m0059l4025k9850k5703k0977j7522j6114j4658j1652q565o925n718
$$ 1343018 1302959 1268934 1239084 1213381 1192404 1174882 1158768 1144110 1132458 1123893 1116968 1111250
56080A111250l758j986j299n09J396L175L627L743M668N686O123O996Q777R854
$$ 1111250 1107492 1105506 1104207 1103698 1105094 1108269 1111896 1115639 1120307 1125993 1132116 1139112 1147889 1157743
56066A157743R240Q571R383J0618J0875J0876J1629J2404J2572J3216J4879J6066
$$ 1157743 1166983 1175554 1184937 1195555 1206430 1217306 1228935 1241339 1253911 1267127 1282006 1298072
56054A298072J5966J6109J7369J8065J7302J7267J9598K2311K3131K3181K4361
$$ 1298072 1314038 1330147 1347516 1365581 1382883 1400150 1419748 1442059 1465190 1488371 1512732
56043A512732K5765K5913K6168K8369L1256L2538L2652L3291L4140L4222L4723
$$ 1512732 1538497 1564410 1590578 1618947 1650203 1682741 1715393 1748684 1782824 1817046 1851769
56032A851769L7169M0406M2337M3135M4004M4504M3844M3044M3202M3438M3050
$$ 1851769 1888938 1929344 1971681 2014816 2058820 2103324 2147168 2190212 2233414 2276852 2319902
56021B319902M3474M5617M7724M8581N0221N4505N9652O3243O5962O9268P2208
$$ 2319902 2363376 2408993 2456717 2505298 2555519 2610024 2669676 2732919 2798881 2868149 2940357
56010B940357P3805P5819P9743Q3913Q6866R0508R6421J02451J06688J11371J18749
$$ 2940357 3014162 3089981 3169724 3253637 3340503 3431011 3527432 3629883 3736571 3847942 3966691
55999C966691J26652J32483J38128J46232J55080J61879J67808J75085J82545
$$ 3966691 4093343 4225826 4363954 4510186 4665266 4827145 4994953 5170038 5352583
55990E352583J88926J96899K08841K22427K35413K50513K70196K91480L11797
$$ 5352583 5541509 5738408 5947249 6169676 6405089 6655602 6925798 7217278 7529075
55981G529075L35055L65292L99330M32891M68871N12004N60543O11620O69725
$$ 7529075 7864130 8229422 8628752 9061643 9530514 10042518 10603061 11214681 11884406
55972A1884406P41015Q24300R16834J023745J152076J301520J472080J675300
$$ 11884406 12625421 13449721 14366555 15390300 16542376 17843896 19315976 20991276
55964B0991276J926489K232469K599985L048873L600237M256749N012879N882275
$$ 20991276 22917765 25150234 27750219 30799092 34399329 38656078 43668957 49551232
55956D9551232O898690Q094523R500710J1171645J3198690J5711805J8899780
$$ 49551232 56449922 64544445 74045155 85216800 98415490 114127295 133027075
55949A33027075K3015238K8250004L4409716M0495963M4514694M3905854L6715165
$$ 133027075 156042313 184292317 218702033 259197996 303712690 347618544 384333709
55942C84333709K2977121N260220j2312869k6049507l4246671l7317904l6787256
$$ 384333709 407310830 412571050 400258181 374208674 339962003 302644099 265856843
55935B65856843l4217617l0739203k7051967k3531522k0319958j7440447j4895397
$$ 265856843 231639226 200900023 173848056 150316534 129996576 112556129 97660732
55928I7660732j2683890j0781081r150519p769626o619850n665258m864042m191708
$$ 97660732 84976842 74195761 65045242 57275616 50655766 44990508 40126466 35934758
55920C5934758l634661l171262k777012k440156k156094j913385j699202j511479
$$ 35934758 32300097 29128835 26351823 23911667 21755573 19842188 18142986 16631507
55912A6631507j352246j215012j090720r79730q86076q05330p29582o59321n99477
$$ 16631507 15279261 14064249 12973529 11993799 11107723 10302393 9572811 8913490 8314013
55903H314013n48072m99180m53133m13906l79827l46197l14050k87510k65299
$$ 8314013 7765941 7266761 6813628 6399722 6019895 5673698 5359648 5072138 4806839
55894D806839k43150k21918k05351j92284j78670j64992j54454j46046j36497
$$ 4806839 4563689 4341771 4136420 3944136 3765466 3600474 3446020 3299974 3163477
55885C163477j26929j20643j16254j09697j01348r4755q9987q4457p8794p5660
$$ 3163477 3036548 2915905 2799651 2689954 2588606 2493851 2403864 2319407 2240613 2164953
55875B164953p4069p0664o5533o1231n7352n1657m5411m2131m1819m1518m0613
$$ 2164953 2090884 2020220 1954687 1893456 1836104 1784447 1739036 1696905 1655086 1613568 1572955
55864A572955m0491l9983l6387l0491k5674k2449j8493j3494r374o019j311M744
$$ 1572955 1532464 1492481 1456094 1425603 1399929 1377480 1358987 1345493 1336119 1330100 1328789 1333533
55852A333533R895J3299J5355J4494Q319k161j3277k3362l3081m1588m6480m7644
$$ 1333533 1343428 1356727 1372082 1386576 1394895 1392734 1379457 1356095 1323014 1281426 1234946 1187302
55840A187302m7434m6833m4796m1392l8346l6199l3913l1323k9191k7035k3672
$$ 1187302 1139868 1093035 1048239 1006847 968501 932302 898389 867066 837875 810840 787168
55829G87168j9768j7013j5118j2417r101p071o786o931o916p106o994n753m245
$$ 787168 767400 750387 735269 722852 713751 706680 699894 692963 686047 678941 671947 666194 661949
55816F61949l947m348l890k748k199k029j407j448l834p463r594r878j0201j0939
$$ 661949 658002 653654 649764 647016 644817 642788 641381 639933 636099 628636 619042 609164 598963 588024
55802E88024j0573q958p849q028q609r289j0658j2281j2998j3019j3333j3430
$$ 588024 577451 568493 560644 552616 544007 534718 524060 511779 498781 485762 472429 458999
55790D58999j2168j0408r925j0116q855o327m821m718l978j883l3P19J258J397
$$ 458999 446831 436423 426498 416382 407527 401200 396379 391661 387683 385800 385767 386486 387744 389141
55776C89141o88n232r789j2425j3651j4325j4019j2522j0875r844r057q273p751
$$ 389141 388453 383221 373432 361007 347356 333031 319012 306490 295615 285771 276714 268441 260690
55763B60690p105n695m448n067p077p946o626m863m337m776n563o975q798r654
$$ 260690 253585 247890 243442 238375 231298 223352 216726 211863 207526 202750 197187 190212 181414 171760
55749A71760q803o997m904k279N99K466K846K759K990L140K860K578K402J801
$$ 171760 162957 155960 151056 148777 149376 151842 154688 157447 160437 163577 166437 169015 171417 173218
55735A73218Q23J58k48j089k044j953r02l00n40n60j00l02j439k124j668j322
$$ 173218 174041 174199 173951 172862 170818 168865 167963 167663 167123 166563 166463 166161 164722 162598 160930 159608
55719A59608k073k952k592j141M66J826K859L368L589M197N202N981O554P528
$$ 159608 157535 154583 151991 150850 151316 153142 156001 159369 162958 167155 172357 178338 184892 192420
55705A92420Q583Q590P626P135P554P469N866L562J564m53k994n412o735o802
$$ 192420 201003 209593 217219 224354 231908 239377 245243 248805 250369 249916 246922 241510 234775 227973
55691B27973n887m242k604k030k628l465m119n057o139o257n019l410k147p00
$$ 227973 222086 217844 215240 213210 210582 207117 202998 197941 191802 185545 180526 177116 174969 174269
55677A74269J322L219M241M418L746J885p16k659l255l151k794j681K61J868K093
$$ 174269 175591 178810 183051 187469 191215 193100 192384 189725 186470 183319 180525 178844 179105 180973 183066
55662A83066J035q66l280n221n398m076l081l198l206k248j426j861k835l246
$$ 183066 184101 183235 179955 174734 169336 165260 162179 158981 155775 153527 152101 150240 147405 144159
55648A44159l479m325n253n292m763m644m910m875m552m440m413l950l086k288
$$ 144159 140680 136355 131102 125810 121047 116403 111493 106618 102066 97626 93213 89263 86177 83889
55634H3889j744j466j557j812j712j328j408k014k087j102j25k62r53r85m04k22
$$ 83889 82145 80679 79122 77310 75598 74270 72862 70848 68761 67659 67534 67272 66319 65334 64930 64708
55618F4708o45p79j3J159J711J090k22r98n73K00n5j291k094j775j160q87l94
$$ 64708 64063 63284 63271 64430 66141 67231 67009 66011 65438 65638 65583 64292 62198 60423 59263 58376 57982
55601E7982O93J362N93j000j894j465k88Q03J209P60R4K01J124J773J478Q78P36
$$ 57982 58675 60037 60630 59630 57736 56271 55983 56786 57995 58755 58849 59050 60174 61947 63425 64303 65039
55584F5039Q47P50N98N64K46n28j122j017n74k19K96J101J609J501J448K089L032
$$ 65039 65886 66636 67234 67798 68044 67516 66394 65377 64803 64584 64880 65981 67590 69091 70539 72628 75660
55567G5660L649M095M704N157N087M752M324L273J331p15k033k839l663m235m068
$$ 75660 79309 83404 88108 93265 98352 103104 107428 110701 112032 111317 109284 106445 102782 98547 94479
55552I4479l432k912k529k169k156k565k655j933j073r14j132q96k62J09P8k7
$$ 94479 91047 88135 85606 83437 81281 78716 76061 74128 73055 72141 71009 70113 69851 69960 70038 70011
55536G0011j62l60k48L79R20O81j05p58j136j461j636j550j551j898k204k084
$$ 70011 69849 69489 69241 69620 70540 71221 71116 70358 69222 67761 66125 64575 63024 61126 58922 56838
55520E6838j887k019k119j623p53k07l13r56j896k632k616k068j813j943j593
$$ 56838 54951 52932 50813 49190 48437 48230 47917 46961 45065 42433 39817 37749 35936 33993 32400
55505C2400n21K44Q4j66J86L99k25p77j94P52N91n09j210j215j299j535j201k77
$$ 32400 31879 32123 32207 32041 32227 32626 32401 31624 31430 32182 32773 32264 31054 29839 28540 27005 25804 25527
55487B5527M84Q98J376J681J102j48r99j101j080j243j178p70m30k26J80O11M17
$$ 25527 26011 26909 28285 29966 31068 30920 29921 28820 27740 26497 25319 24549 24119 23893 24073 24684 25101
55470B5101l60r46j001r67j027p17J48R84J231J005P57P54R65J049N53m82j314
$$ 25101 24741 23795 22794 21827 20800 20083 20231 21215 22446 23451 24208 24962 25927 26976 27529 27047 25733
55453B5733j393j076r07o52J23J015J208P13K23O0O9K85P32Q77L07l55k26L61
$$ 25733 24340 23264 22357 21705 21828 22843 24051 24764 24987 25047 25116 25401 26133 27010 27317 26962 26736 27097
55435B7097K92n55j200j140q07m66J69R60J191O83J31j9j00l46m08r9J76R8j44
$$ 27097 27389 26834 25634 24494 23687 23221 23390 24350 25541 26224 26355 26336 26236 25890 25482 25383 25559 25657 25513
55416B5513l69o43q28n37J73P80J109J550K236K703K638K277J869J336P54M92
$$ 25513 25144 24501 23673 23136 23309 24089 25198 26748 28984 31687 34325 36602 38471 39807 40561 41053
55400D1053N63L83l86j253j445q42n4J68m67j536k194j929j040k15J43J6m68q98
$$ 41053 41616 41999 41613 40360 38915 38073 38019 38187 37720 36184 33990 32061 31021 30806 30949 30965 30497 29599
55382B9599o36L97J279J048r8j139j553j626j681j755j880k038j871j045J56J132
$$ 29599 28963 29360 30639 31687 31589 30450 28897 27271 25590 23835 21955 19917 18046 17001 17157 18289
55366A8289J667J779J265J65p07n40K89O74K89k04k88r4J96N73Q13O30K14pp5
$$ 18289 19956 21735 23000 23165 22458 21918 22207 22881 23170 22966 22678 22584 22780 23353 24166 24796 25010 25003 24928
55347B4928k38l02j5J87k15p30m65L73P20L31l3r5m75j323j798j329l68M32R19
$$ 24928 24690 24388 24373 24560 24345 23615 23150 23523 24243 24574 24541 24446 23971 22648 20850 19521 19153 19585 20504
55328B0504J006N59L3K00Q97J091N28K03O67J071N53l71o86l25R8L56N25M17r4
$$ 20504 21510 22069 22102 22302 23199 24290 24818 25021 25688 26759 27312 26941 26255 25930 26028 26384 26909 27326 27232
55309B7232n98o39m00k71j42K71P95J037R53P15K55m20q62o65j23R4j41l61k35
$$ 27232 26634 25995 25595 25324 25182 25453 26248 27285 28238 28953 29208 28788 27926 27261 27138 27232 27091 26730 26495
55290B6495K9P1j77n03o85o99o48n39k49J92M13J19m35p19n75k29J71O73J154
$$ 26495 26524 26595 26418 25915 25230 24531 23883 23344 23095 23287 23700 23819 23384 22665 22090 21861 22032 22705 23859
55271B3859J272Q33l9j003j553j244k71M80M17K0J09O47R61P79L58k18r75j416
$$ 23859 25131 25964 25925 24922 23369 22125 21854 22334 22751 22771 22880 23527 24488 25267 25625 25407 24432 23016
55253B3016r27K30J053J052N96J56l1M05J594K619K187L21j430j803j048j21M29
$$ 23016 22089 22319 23372 24424 25020 25176 25145 25550 27144 29763 31950 32271 30841 29038 27990 27869 28298
55236B8298N09J90j91k42q9k01n58o68m26k07r1K07N76O07N30J007J858K098J424
$$ 28298 28807 28997 28806 28564 28475 28274 27716 27048 26622 26415 26324 26531 27107 27714 28244 29251 31109 33207 34631
55217C4631O40K55j35p07q77m38q4k05k13K39M93P8l40q5M38N72M94N74N35J32
$$ 34631 35271 35526 35391 34684 33807 33369 33285 33080 32867 33106 33599 33677 33337 33252 33690 34262 34756 35330 35865 35997
55197C5997j10J81L72r4n26n0P62O33m91j422j423q53k58J78K97ol69k63J92L73
$$ 35997 35887 36068 36440 36346 35820 35770 36532 37165 36674 35252 33829 32976 32718 32896 33193 33187 32818 32555 32747 33120
55177C3120N4l33l69j23Q8P3n3M9M96P91L39n48q61k84L36L38J06J22M5m20o70
$$ 33120 33174 32841 32472 32349 32437 32510 32457 32506 33002 33793 34132 33584 32723 32439 32775 33113 33219 33341 33386 32966 32296
55156C2296k05K51k26j163j332o02P4L12P08J563K363K643K432J692L22j067j315
$$ 32296 32091 32342 32116 30953 29621 29019 29093 29405 30113 31676 34039 36682 39114 40806 41128 40061 38746
55139C8746j37J292J706J228J012J693K634K688J498p0q45o14j98l15q51j431
$$ 38746 38609 39901 41607 42835 43847 45540 48174 50862 52360 52290 51445 50831 50633 50318 49467 48036
55123D8036k031k596k597j698n02O8p6k92k14QL32Q53J306J260Q59P48J068J193
$$ 48036 46005 43409 40812 39114 38612 38680 38604 38312 38098 38106 38438 39291 40597 41857 42716 43464 44532 45725
55105D5725P10O2n5L59O86M68j06m99m13j5L79O64Q50P56K18l94l34N82J619J956
$$ 45725 46435 46497 46442 46801 47487 47955 47849 47350 46937 46922 47301 47965 48815 49571 49789 49395 49061 49643 51262 53218
55085E3218J546R03M25K11K25K74J51k2J10M58M42j60p39o51j8N88Q11N78j7m82
$$ 53218 54764 55667 56092 56303 56528 56802 56953 56931 57041 57499 57941 57781 57042 56391 56373 56961 57772 58350 58333 57851
55065E7851j76P99J482J293P99P57R79Q18K32l20o39p33m47K58R92J429J714J895
$$ 57851 57675 58474 59956 61249 62048 62805 63784 64602 64834 64514 63875 63142 62695 62953 63945 65374 67088 68983
55047F8983J567O79k1m0N4l39p83p55q17j602k314j760l92K21j94l98J93P02N01
$$ 68983 70550 71229 71208 71168 71222 70883 70100 69345 68528 66926 64612 62852 62460 62681 62487 62089 62282 62984 63485
55028F3485K23M98R45R80O76J55p71j835k086j171r6L4o56j270j393j207q21k09
$$ 63485 63708 64206 65151 66131 66807 66962 66191 64356 62270 61099 61003 61037 60381 59111 57718 56511 55690 55481
55010E5481M51Q53Q57M68k34r72j404j530j650j829j817j560j274q96p6J169K261
$$ 55481 55932 56785 57642 58110 57876 56904 55500 53970 52320 50491 48674 47114 45840 44944 44868 46037 48298
54993D8298K769K764K435J844J288J182J441J545J422J499J726J444O62L80J041
$$ 48298 51067 53831 56266 58110 59398 60580 62021 63566 64988 66487 68213 69657 70319 70699 71740
54978G1740J607J147N08J220L200M827N144M776M626M798N154N933P184Q265Q566
$$ 71740 73347 74494 75002 76222 79422 84249 89393 94169 98795 103593 108747 114680 121864 130129 138695
54963A38695Q337Q322Q874R867J1167J2663J4041J4982J5452J5335J4015J0883
$$ 138695 147032 155354 164228 174095 185262 197925 211966 226948 242400 257735 271750 282633
54951B82633O333J558k764o946j1169j4606j6300j6431j6003j5478j4506j2884
$$ 282633 288966 290524 287760 280814 269645 255039 238739 222308 206305 190827 176321 163437
54939A63437j0988r159p429o017n456n801o226n816m466k762j334m76l2N65J708
$$ 163437 152449 143290 135861 129844 124388 118587 112361 106545 102079 99317 97983 97507 97475 98040 99748
54924I9748K972L566L541L886N148O704P816Q682R859J1315J2720J4084J5359
$$ 99748 102720 106286 109827 113713 118861 125565 133381 142063 151922 163237 175957 190041 205400
54911B05400J5826J4658J1802P785L019k040o591j0072j2660j4563j5290j4470
$$ 205400 221226 235884 247686 255471 258490 256450 249859 239787 227127 212564 197274 182804
54899A82804j2881j1735j1219j0704r980r266q344o823n113m029l458k616j562
$$ 182804 169923 158188 146969 136265 126285 117019 108675 101852 96739 92710 89252 86636 85074
54886H5074j231j810k324k153j809j771j673j196p75q07r20p24n42p96j208j283
$$ 85074 83843 82033 79709 77556 75747 73976 72303 71107 70332 69525 68605 67881 67339 66543 65335 64052
54870F4052j068q72o97m67m24p56j160j162p01m9M71N05j79j226j755j327n01
$$ 64052 62984 62112 61415 60948 60524 59768 58608 57446 56745 56696 57167 57672 57493 56267 54512 53185 52684
54853E2684j02j98j88L19J041J357Q65k51j340j827j685j241o86p2M11O03P29
$$ 52684 52582 52384 52196 52515 53556 54913 55778 55527 54187 52360 50675 49434 48748 48676 49087 49690 50419
54836E0419J083J451J343Q02L94M11O71J053J573J906J549O48L6J52N69P48P09
$$ 50419 51502 52953 54296 55098 55492 55903 56574 57627 59200 61106 62655 63303 63339 63491 64060 64808 65517
54819F5517P58J037J584K355L040L366L576M171N105N940O663P656Q839R783J0732
$$ 65517 66275 67312 68896 71251 74291 77657 81233 85404 90509 96449 103112 110768 119607 129390 140122
54804A40122J2498J5021J7021J7520J6795J5387J3111R739N792J899j982n947
$$ 140122 152620 167641 184662 202182 218977 234364 247475 257214 263006 264905 262923 256976
54792B56976r359j1432j2188j2208j1812j1119j0460j0128r885r250q069o560
$$ 256976 247617 236185 223997 211789 199977 188858 178398 168270 158385 149135 141066 134506
54780A34506n091m100l735l408k351q44q5m75q78j20J596L447N214O948Q180Q541
$$ 134506 129415 125315 121580 118172 115821 114977 114892 114417 113539 113419 115015 118462 123676 130624 138804 147345
54764A47345Q653R443J0954J2686J4622J6884J8811J9406J8556J6806J4153J0087
$$ 147345 155998 165441 176395 189081 203703 220587 239398 258804 277360 294166 308319 318406
54752C18406M726r38o042j0316j3617j5789j7011j7626j7612j6891j5885j5100
$$ 318406 323132 322194 316152 305836 292219 276430 259419 241793 224181 207290 191405 176305
54740A76305j4159j2254r505p011n481m667m306m621n456n828n001l508k486k250
$$ 176305 162146 149892 140387 133376 127895 123228 118922 114301 108845 103017 98016 94508 92022 89772
54726H9772k134j532o26k4O6O0L91Q50Q61L88J02L73O18K33l12j15O97J039M10
$$ 89772 87638 86106 85480 85456 85522 85582 85973 86823 87684 88072 88174 88547 89165 89398 89086 88971 89668 90707 91117
54707I1117m93r14r78j107j223j061p37m86j90L06O80M80j55o06n05q1L01N44
$$ 91117 90624 89710 88732 87625 86402 85341 84604 84118 83928 84234 84914 85394 85239 84633 84128 84047 84348 84892
54689H4892P02P81P77P46P00N08J28j78k5O34J393J780J668J250Q13O35Q98J489
$$ 84892 85594 86375 87152 87898 88598 89106 89234 89056 89031 89665 91058 92838 94506 95756 96569 97204 98102 99591
54671I9591K007K226K358K681L112L515M126N094N793N365L989K907K880L322
$$ 99591 101598 103824 106182 108863 111975 115490 119616 124710 130503 135868 139857 142764 145644 148966
54657A48966L310K790K282J999J853K056K939M380N871P009P611P563P003O390
$$ 148966 152276 155066 157348 159347 161200 163256 166195 170575 176446 183455 191066 198629 205632 212022
54643B12022N921N076L238N70k210m737p121r233j0564j0854j0433r727q858p847
$$ 212022 217943 223019 226257 226827 224617 219880 212759 203526 192962 182108 171675 161948 153090 145243
54629A45243o892o191n695n204m598l916l257k711k304j944j442o48L50J178J496
$$ 145243 138351 132160 126465 121261 116663 112747 109490 106779 104475 102531 101089 100441 100791 101969 103465
54614A03465J457J605K205K899L305L517L596L042J542j22q06n56l87n97m90l3
$$ 103465 104922 106527 108732 111631 114936 118453 122049 125091 126633 126511 125705 125149 124762 124165 123675 123642
54598A23642l06j713k980k994k553l053m229m538l420j907j072r93j255j537j611
$$ 123642 123336 121623 118643 115649 113096 110043 105814 101276 97856 95949 94877 93884 92629 91092 89481
54583H9481j428j324j606j986j977j609j218p74j25L58J40n73r89p26l2P38J228
$$ 89481 88053 86729 85123 83137 81160 79551 78333 77559 77434 77792 77932 77359 76370 75644 75612 76350 77578
54566G7578R38k25j331j251q2R53J027L93l92j041j313r75k39L87P43J049J281
$$ 77578 78516 78291 76960 75709 75627 76580 77607 78000 77608 76567 75254 74279 74040 74427 75170 76219 77500
54549G7500J237J145J486K189K679K773K844L003K946K667K625K970L317L447
$$ 77500 78737 79882 81368 83557 86236 89009 91853 94856 97802 100469 103094 106064 109381 112828
54535A12828L541L515K890J625M92J67M07M56p6r70j756k208k649l625m948n527
$$ 112828 116369 119884 122774 124399 124891 125058 125465 125921 125845 124875 123119 120911 118262 114637 109689 104162
54519A04162m683l282k664k813k615j816j381j772k120j603n47L51R47J201P81
$$ 104162 99479 96197 93533 90720 88105 86289 84908 83136 81016 79413 78866 79217 80164 81365 82146
54504H2146j73p30l58K97N17O56J352K175K141J179J93j97j50R0N46J133J507
$$ 82146 81973 81243 80885 81182 81699 82355 83707 85882 88023 89202 89395 89198 89048 89138 89684 90817 92324
54487I2324J513J383J347J345J161O96R3l60m68l05j8M17R81J273Q69Nn94n82
$$ 92324 93837 95220 96567 97912 99073 99769 99862 99502 99034 98729 98711 99128 100109 101382 102251 102256 101662 101080
54469A01080k17K90R45J419J111J39n51m27j11k96o86n87m0L87M87L49j93j276
$$ 101080 100863 101153 102098 103517 104628 104767 104216 103789 103678 103382 102696 102109 102069 102456 102943 103292 103099 101823
54451A01823k366k700k215j486q42k11K77K29l26q29q60n56k36l4l0l26p46p88
$$ 101823 99457 96757 94542 93056 92214 92003 92280 92509 92183 91354 90494 89938 89702 89668 89638 89312 88566 87778
54433H7778j05J030J855J784R09j01o45p11o89p68p48m53QM83R61J373J465J163
$$ 87778 87673 88703 90558 92342 93251 93150 92505 91794 91105 90337 89589 89136 89144 89627 90588 91961 93426 94589
54415I4589Q00P77J118J517J729J768J870K311L059L667L691L254K873K775K789
$$ 94589 95389 96166 97284 98801 100530 102298 104168 106479 109538 113205 116896 120150 123023 125798 128587
54400A28587K846L078L291K972K104J388J323J477J102J23r23j572j718j499j310
$$ 128587 131433 134511 137802 140774 142878 144266 145589 147066 148168 148291 147368 145796 144078 142579 141269
54385A41269j681k734l891m427m158l412k594k051k014k345k527k185j492r18
$$ 141269 139588 136854 132963 128536 124378 120966 118372 116321 114307 111962 109435 107250 105758 104840
54371A04840q18j286k071k485j956p73J64M62N30N46N2r59j439o13P70J389J138
$$ 104840 104022 102736 100665 98180 96224 95451 95615 96077 96607 97153 97205 96246 94807 94194 94964 96353 97491
54354I7491R84J354J693J578J312J264J375J472J537J518J381J442K098L142L813
$$ 97491 98475 99829 101522 103100 104412 105676 107051 108523 110060 111578 112959 114401 116499 119641 123454
54339A23454L615K778J791R49L69J6l88j141k099k719k668k169j737j752k281
$$ 123454 127069 129847 131638 132587 132956 132972 132584 131443 129344 126625 123957 121788 120051 118299 116018
54324A16018l030l574l790l944m126l976l271k505k269k353k084j486j340j938
$$ 116018 112988 109414 105624 101680 97554 93578 90307 87802 85533 83180 81096 79610 78270 76332
54310G6332k509k159r74K14P33N12j21o93q12m42O0K46m1o35j189j416j291j047
$$ 76332 73823 71664 70690 70904 71637 72149 72028 71335 70523 70081 70141 70387 70346 69711 68522 67106 65815 64768
54292F4768q51n68n9M41M81Pn06n83k17K52N31N75M87L77L06L72P02J221J482
$$ 64768 63917 63349 63290 63731 64212 64219 63713 63130 62913 63165 63696 64271 64758 65135 65441 65813 66515 67736 69218
54273F9218J033J1q28q44p5R91J861K148J706R33O08J035J618J605R63J87l67
$$ 69218 70251 70262 69434 68590 68515 69506 71367 73515 75221 76154 76762 77797 79415 81020 81983 82170 81803
54256H1803o16m98r7J92P7k02l26m07n84n08J47Q51P28j74q87q71n90o01q24j048
$$ 81803 81187 80689 80592 80784 80861 80659 80333 79926 79342 78834 78981 79832 80560 80386 79499 78628 78038 77437 76613 75565
54236G5565j435k027k239j448O1J275J479Q65P9m61p69r74j037q24m27j41r1n8
$$ 75565 74130 72103 69864 68416 68477 69752 71231 72096 72175 71714 70945 69971 68934 68110 67683 67542 67451 67393
54218F7393K09O55J079J348J330Q73J51k98j47L00N75O55P15O06R0o43j137j246
$$ 67393 67602 68257 69336 70684 72014 72887 73038 72740 72593 72893 73468 74123 74838 75444 75534 74891 73754 72508
54200G2508j040m55M54J088Q51l8q07j092r99n11L84J087Q46j38q84j001r83j045
$$ 72508 71468 71013 71467 72555 73406 73368 72561 71469 70470 69959 70343 71430 72276 72138 71254 70253 69270 68225
54182F8225p10J09O61N70M45P07O84j81j110j035l06j62q08j228q62l08j65j16
$$ 68225 67515 67624 68285 68855 69300 70007 70691 70510 69400 68365 68059 67897 67089 65861 64999 64691 64526 64410
54164F4410K83P62P73L74R6J95M34M59J50k73l08L94J493K053J525M11l54m49
$$ 64410 64693 65455 66228 66602 66698 66893 67327 67786 67936 67663 67355 67749 69242 71295 72820 73231 72877 72428
54146G2428k80j69o7mk85q74j195q92m18l30l70N6P58R13L92JK12N20M49L39N17
$$ 72428 72148 71979 71912 71908 71623 70749 69554 68662 68244 67914 67544 67600 68358 69271 69663 69664 69876 70396 70845 71184 71701
54125G1701M40m23j450j602r59m73l92j11L99K40q73j765j232L45J457J197Kj087
$$ 71701 72141 71718 70268 68666 67707 67234 66842 66731 67130 67370 66497 64732 63500 63845 65302 66499 66501 65414
54107F5414j373r06k32J96M60Q04R95M66p96k041k599k463j855q41L42J146J303
$$ 65414 64041 63135 62903 63099 63559 64363 65358 65824 65028 62987 60388 57925 56070 55229 55571 56717 58020
54090E8020J159R95N22m65j384j526j057p31p55o08k4N07L87l27r72q66J02J299
$$ 58020 59179 60174 60696 60231 58847 57321 56264 55533 54778 54170 54146 54653 55040 54713 53741 52875 52977 54276
54072E4276J837J439P93P42J284J694J555J201J097J160R46L25k47j73O22J446
$$ 54276 56113 57552 58345 59087 60371 62065 63620 64821 65918 67078 68024 68349 68102 67929 68551 69997
54056F9997J493P07j35k99J38O01P67P73Q30J076J623K383K858K523J540P62Q69
$$ 69997 71490 72197 72062 71763 71901 72502 73269 74042 74872 75948 77571 79954 82812 85335 86875 87637 88506
54039H8506J747K762L426L636L549L400L455L825M325M598M425L966L691L981
$$ 88506 90253 93015 96441 100077 103626 107026 110481 114306 118631 123229 127654 131620 135311 139292
54025A39292M696N214M991M172L437L261L431L381K901K242J632R36M6o48n83
$$ 139292 143988 149202 154193 158365 161802 165063 168494 171875 174776 177018 178650 179586 179632 178984 178401
54010A78401J17N06j85j634k837l233l084k861k714k628k666k836k984l003k941
$$ 178401 178518 179024 178839 177205 174368 171135 168051 165190 162476 159848 157182 154346 151362 148359 145418
53995A45418k795k464k014j754j800j812j450q63n09n60p52o91j92O02J211J139
$$ 145418 142623 140159 138145 136391 134591 132779 131329 130466 129957 129397 128645 127954 127762 128364 129575 130714
53979A30714L98l89n86k04K62M68M97N93R03J360J655J392N45l35o84n83n72q55
$$ 130714 131112 130723 130137 129933 130195 130663 131160 131753 132656 134016 135671 137063 137608 137273 136589 136006 135434 134579
53961A34579j116j170j271j610j874j634r64l04R8K68K39N6PM27J207J891K325
$$ 134579 133463 132293 131022 129412 127538 125904 124940 124636 124734 125002 125241 125297 125304 125731 126938 128829 131154
53944A31154K812L512M144M511M929N712O544O887O699O235N346L708J668R2p71
$$ 131154 133966 137478 141622 146133 151062 156774 163318 170205 176904 183139 188485 192193 193861 193953 193182
53929A93182j544k625l542l793l563l138k231o39J015J979K398K833L153K834
$$ 193182 191638 189013 185471 181678 178115 174977 172746 172107 173122 175101 177499 180332 183485 186319
53915A86319K186K141K808L246K919K549L007M176N287N885N981N779N634N813
$$ 186319 188505 190646 193454 196700 199619 202168 205175 209351 214638 220523 226504 232283 237917 243730
53901B43730N906N004K905O66n26o96p77j310k028k485k549k331k092k256l053
$$ 243730 249636 254640 257545 258211 257685 256989 256212 254902 252874 250389 247840 245509 243417 241161 238108
53886B38108m176n069n587o067o766p472p695p161o057m932m254m007l744l174
$$ 238108 233932 228863 223276 217209 210443 202971 195276 188115 182058 177126 172872 168865 165121 161947
53872A61947k567k445k955l664l991l773l386l289l466l490l172k838k723k550
$$ 161947 159380 156935 153980 150316 146325 142552 139166 135877 132411 128921 125749 122911 120188 117638
53858A17638k088j749j975k342k066j289r50j270j407q45j92o5j28Q7K36j15m73
$$ 117638 115550 113801 111826 109484 107418 106129 105179 103909 102502 101657 101465 101400 101272 101359 101595 101480 101007
53841A01007j39N09N19j30m86j40J75k79j240j867j712j013l83l02o92r48n84
$$ 101007 100868 101377 101896 101766 101280 101140 101315 101036 99796 97929 96217 95204 94821 94519 93827 92879 92295
53824I2295K70J167J884K280K035J134K78J91N46M02l15n77K44J475K097K031
$$ 92295 92565 93732 95616 97896 99931 101065 101343 101534 102080 102482 102167 101590 101834 103309 105406 107437
53808A07437J866J749J342O81M52J148K393L407L924M248M503M331L604L017L394
$$ 107437 109303 111052 112394 113075 113527 114675 117068 120475 124399 128647 133150 137481 141085 144102 147496
53793A47496M522N289N054M318L812L496K902K010J267R82J111J440J654J502
$$ 147496 152018 157307 162361 166679 170491 173987 176889 178899 180166 181148 182259 183699 185353 186855
53779A86855J146R90R38L07j100k421k836k692k819l206l279l019k857k665j965
$$ 186855 188001 188991 189929 190236 189136 186715 183879 181187 178368 175162 171883 168864 166007 163342 161377
53764A61377j055q10j274j489r67k71J00L85P52P40J70l20k63j48n35j084j281
$$ 161377 160322 159512 158238 156749 155782 155511 155611 155996 156748 157488 157658 157338 157075 156927 156392 155308 154027
53747A54027j444k121k967l194k835k640k758k568j848j266j333j620j488j108
$$ 154027 152583 150462 147495 144301 141466 138826 136068 133500 131652 130386 129053 127433 125945 124837
53733A24837j175j829k349k086j256o17m81l98R8O98O96jn72k40P57J391R18l40
$$ 124837 123662 121833 119484 117398 116142 115525 115044 114646 114744 115442 116138 116137 115565 115325 116082 117473 118391 118051
53715A18051j289j080Q2J199J569J465J524J780J785J525J591K255L021L345L362
$$ 118051 116762 115682 115764 116963 118532 119997 121521 123301 125086 126611 128202 130457 133478 136823 140185
53700A40185L499L773L843L613L391L532M072M636M628L811K704K028J745J168
$$ 140185 143684 147457 151300 154913 158304 161836 165908 170544 175172 178983 181687 183715 185460 186628
53686A86628P9q81j177j021p10l1J029J724J506J008J169J720J668J000P86J422
$$ 186628 186707 185826 184649 183628 182918 182887 183916 185640 187146 188154 189323 191043 192711 193711 194497 195919
53670A95919J966J617Q94O08N45n2j033j326l73J031J566Q18l32o79j6O76M52
$$ 195919 197885 199502 200396 201004 201549 201497 200464 199138 198765 199796 201362 202180 201848 201169 201153 201829 202281
53653B02281m08q22l71K03J35l70o05l87r7M3J82M22O20N84K33l97j053j347j199
$$ 202281 201873 201051 200680 200883 201018 200648 200043 199656 199559 199602 199784 200206 200826 201410 201643 201246 200193 198846 197647
53634A97647j038j237j502j295o63j76k6K15Q13J327J273Q71P32J045J446J637
$$ 197647 196609 195372 193870 192575 191912 191736 191710 191925 192738 194065 195338 196209 196941 197986 199432 201069
53618B01069J702J841K091K396K694K888K877K722K640K766K991L132L171L257
$$ 201069 202771 204612 206703 209099 211793 214681 217558 220280 222920 225686 228677 231809 234980 238237
53604B38237L484L785M057M298M554M795M944N049N180N182M775M043L559L727
$$ 238237 241721 245506 249563 253861 258415 263210 268154 273203 278383 283565 288340 292383 295942 299669
53590B99669M211M420M378M633N279N748N696N482N455N365M940M565M687M957
$$ 299669 303880 308300 312678 317311 322590 328338 334034 339516 344971 350336 355276 359841 364528 369485
53576C69485M694M031L794M254M705M491L849L405L357L432L332K957K405J889
$$ 369485 374179 378210 382004 386258 390963 395454 399303 402708 406065 409497 412829 415786 418191 420080
53562D20080J499J068M55r1k54k53o44j508k381k963l367l559l247k542k054k036
$$ 420080 421579 422647 423102 423011 422757 422504 421860 420352 417971 415008 411641 408082 404835 402293 400239 398203
53546C98203k040j781j705k188k794k897k609k477k684l038l387l479k838j408
$$ 398203 396163 394382 392677 390489 387695 384798 382189 379712 377028 373990 370603 367124 364286 362878
53532C62878QO80R20J478K298K723K631K562K747K960L253M006N067N757N902
$$ 362878 362886 363566 364486 365964 368262 370985 373616 376178 378925 381885 385138 389144 394211 399968 405870
53517D05870O135O861P667Q090Q349Q889R718J0586J1439J2302J3023J3514J3956
$$ 405870 412005 418866 426533 434623 442972 451861 461579 472165 483604 495906 508929 522443 536399
53504E36399J4562J5350J6342J7662J9227K0634K1563K2078K2409K2750K3355
$$ 536399 550961 566311 582653 600315 619542 640176 661739 683817 706226 728976 752331
53493G52331K4417K5691K6567K6794K6778K7031K7585K8151K8518K8530K8067
$$ 752331 776748 802439 829006 855800 882578 909609 937194 965345 993863 1022393 1050460
53482A050460K7315K6809K6815K6941K6662K6060K5746K6098K6822K7256K6950
$$ 1050460 1077775 1104584 1131399 1158340 1185002 1211062 1236808 1262906 1289728 1316984 1343934
53471A343934K6009K4904K3964K3079K1986K0707J9464J8240J6811J5196J3689
$$ 1343934 1369943 1394847 1418811 1441890 1463876 1484583 1504047 1522287 1539098 1554294 1567983
53460A567983J2385J1126R942R164Q901Q789Q492Q049P480O420M456J724j176
$$ 1567983 1580368 1591494 1601436 1610600 1619501 1628290 1636782 1644831 1652311 1658731 1663187 1664911 1663735
53447A663735l729n807p592r370j1333j3440j5520j7387j8827j9599j9780j9955
$$ 1663735 1660006 1654199 1646607 1637237 1625904 1612464 1596944 1579557 1560730 1541131 1521351 1501396
53435A501396k0683k1842k2889k3693k4590k5695k6700k7424k7953k8127k7513
$$ 1501396 1480713 1458871 1435982 1412289 1387699 1362004 1335304 1307880 1279927 1251800 1224287
53424A224287k6144k4712k3731k2970k1987k0742j9386j7961j6628j5636j4753
$$ 1224287 1198143 1173431 1149700 1126730 1104743 1084001 1064615 1046654 1030026 1014390 999637
53413I99637j3241j0799q057n736l858k135n88Q23K570M890P158Q674R763J1308
$$ 999637 986396 975597 967540 961804 957946 955811 955223 956046 958616 963506 970664 979338 989101 1000409
53399A000409J3488J5704J7649J9628K1816K3910K5680K7232K8639K9696L0320
$$ 1000409 1013897 1029601 1047250 1066878 1088694 1112604 1138284 1165516 1194155 1223851 1254171
53388A254171L0832L1687L3207L5501L8371M1228M3457M5004M6399M8171N0398
$$ 1254171 1285003 1316690 1349897 1385398 1423769 1464997 1508454 1553458 1599857 1648028 1698426
53377A698426N2741N4784N6341N7595N8864O0123O0956O1087O0742O0314N9967
$$ 1698426 1751167 1805951 1862292 1919887 1978751 2038874 2099830 2160917 2221659 2281973 2341940
53366B341940N9710N9483N8895N7298N4462N0909M7316M3896M0641L7611L4589
$$ 2341940 2401650 2461133 2520028 2577326 2631788 2682697 2730013 2773909 2814550 2852161 2886750
53355B886750L1071K7153K3840K1608J9242J5152R582M369N52k685o555j1284
$$ 2886750 2917821 2944974 2968814 2990422 3009664 3024816 3034398 3038767 3039319 3036634 3030079 3018795
53343C018795j6612k2655k9520l6648m3222m8941n3890n7912o0569o1681o1551
$$ 3018795 3002183 2979528 2950008 2913360 2870138 2821197 2767307 2709395 2648826 2587145 2525594
53332B525594o0714n9578n8267n6750n5220n4211n4026n4188n3877n2934n1978
$$ 2525594 2464880 2405302 2347035 2290285 2235065 2180854 2126828 2072640 2018763 1965829 1913851
53321A913851n1440n0940m9796m7778m5194m2546m0189l8065l5649l2516k9004
$$ 1913851 1862411 1811471 1761675 1713897 1668703 1626157 1585968 1547903 1512254 1479738 1450734
53310A450734k5949k3667k1762j9967j8520j7447j6129j4132j2048j0901j0835
$$ 1450734 1424785 1401118 1379356 1359389 1340869 1323422 1307293 1293161 1281113 1270212 1259377
53299A259377j0955j0357q947p296o049n448n172m631l580k354j411p22N8J120
$$ 1259377 1248422 1238065 1229118 1221822 1215773 1210325 1205153 1200522 1196942 1194588 1193177 1192455 1192513 1193633
53285A193633K393L914N826P969R845J1171J2334J4023J6463J9151K1377K2947
$$ 1193633 1196026 1199940 1205766 1213735 1223580 1234751 1247085 1261108 1277571 1296722 1318099 1341046
53273A341046K4206K5456K6514K7000K6921K6708K6697K6754K6502K5754K4657
$$ 1341046 1365252 1390708 1417222 1444222 1471143 1497851 1524548 1551302 1577804 1603558 1628215
53262A628215K3462K2261K0914J9242J7309J5516J4280J3603J3022J2004J0352
$$ 1628215 1651677 1673938 1694852 1714094 1731403 1746919 1761199 1774802 1787824 1799828 1810180
53251A810180Q293O139L921J371j743n253q711j1788j4447j6812j9133k1782k4851
$$ 1810180 1818473 1824612 1828533 1829904 1828161 1822908 1814197 1802409 1787962 1771150 1752017 1730235 1705384
53238A705384k7662k9224k9409k9284k9885l0992l1574l1070k9786k8264k6846
$$ 1705384 1677722 1648498 1619089 1589805 1559920 1528928 1497354 1466284 1436498 1408234 1381388
53227A381388k5785k5224k5015k4898k4891k5080k5189k4799k3977k3264k3086
$$ 1381388 1355603 1330379 1305364 1280466 1255575 1230495 1205306 1180507 1156530 1133266 1110180
53216A110180k3494k4380k5453k6023k5417k3702k1609j9733j8271j7419j7352
$$ 1110180 1086686 1062306 1036853 1010830 985413 961711 940102 920369 902098 884679 867327
53205H67327j7684j7632j6991j6393j6377j6705j6939j7120j7463j7834j7979
$$ 867327 849643 832011 815020 798627 782250 765545 748606 731486 714023 696189 678210
53194F78210j7954j7858j7454j6465j5139j4090j3642j3612j3613j3397j3002
$$ 678210 660256 642398 624944 608479 593340 579250 565608 551996 538383 524986 511984
53183E11984j2715j2816j3168j3322j3090j2793j2751j2784j2438j1569j0462
$$ 511984 499269 486453 473285 459963 446873 434080 421329 408545 396107 384538 374076
53172C74076r540r095r192r624j0044j0167r815q911p613o404n709n453n299n207
$$ 374076 364536 355441 346249 336625 326581 316414 306599 297688 290075 283671 277962 272509 267210 262003
53158B62003n357n548n265m438l625l217l031k891k985l364l531l057k195j488
$$ 262003 256646 251098 245833 241395 237770 234553 231522 228631 225646 222282 218751 215694 213499 212011
53144B12011j086q15o12m50j73K47N18N05N89J121J821K147K086K057K204K201
$$ 212011 210925 210110 209498 209048 208875 209122 209640 210145 210734 211855 213676 215823 217909 219966 222170 224371
53128B24371J722P55m77j628k380k715k892l055l088l016l113l372l361k892k424
$$ 224371 226093 226848 226371 224743 222363 219648 216756 213701 210613 207597 204484 201112 197751 194859 192435
53113A92435k309k216j863j727k280k973k950k441k426k990l127k350j404j045
$$ 192435 190126 187910 186047 184320 182040 179067 176117 173676 171250 168260 165133 162783 161379 160334
53099A60334j007p46m15m52p82j086j436k046k592k467j622p33m92j028j910k500
$$ 160334 159327 158581 158166 157714 156932 155846 154410 152364 149772 147305 145683 144950 144458 143430 141520 139020
53083A39020k385j705r95o23n39o84j235k133k692k274j164l53l93q65j063p97
$$ 139020 136635 134930 133935 133312 132773 132089 130854 128721 126029 123755 122591 122238 121845 120980 119917 119120
53067A19120l86j71k47m66n19j71M30Q40Q46P09P13P23M51K3j72r0j07k98j64
$$ 119120 118734 118563 118316 117850 117331 117160 117590 118430 119276 119985 120698 121421 121872 121895 121723 121633 121526 121228 121064
53048A21064O35J600J889J334N13j03o04j119j359r67q6P21J020P41N4p51j277
$$ 121064 121699 123299 125188 126522 127035 126932 126328 125209 123850 122883 122797 123518 124538 125279 125333 124582 123305
53031A23305j230p09j50N8n7j67l3K48M16M01L58L80M04M29N87Q26P98L81j0J1
$$ 123305 122075 121366 121216 121274 121217 121050 121017 121265 121681 122082 122440 122820 123224 123653 124240 125066 125864 126245 126235 126246
53011A26246J33j74p21q44n27m79r29j181p42k06l48r12j037n11R8M20O49J035
$$ 126246 126379 126205 125484 124640 124113 123634 122705 121524 120782 120576 120228 119316 118279 117768 117866 118286 118935 119970
52993A19970J554K161K840L407L606L431L078K659K304K279K609K721K053R24
$$ 119970 121524 123685 126525 129932 133538 136969 140047 142706 145010 147289 149898 152619 154672 155596
52979A55596K21K50M68L39j46q66j847k803l128k580j669r47m50n3Qm91j190j467
$$ 155596 155817 156067 156535 156874 156728 155862 154015 151212 148084 145504 143835 142888 142438 142385 142393 141902 140712 139245
52961A39245j183p65n80o31p42p18l78K79Q70R19M10j45l28k61k84l91k47K46
$$ 139245 138062 137297 136717 136086 135344 134626 134248 134527 135397 136316 136726 136581 136253 135992 135708 135317 135070 135316
52943A35316O60N45O6j91M1M15N52N27N48M77J53r8K26R43J243P53K9k81l30o42
$$ 135316 135976 136521 136587 136396 136437 136852 137404 137931 138479 138956 139109 139011 139237 140180 141423 142176 142205 141924 141594 140952
52923A40952j139j141l24Q16J611J947K089K015J335l4j406j851j181j58L38J65
$$ 140952 139813 138672 138348 139164 140775 142722 144811 146826 148161 148127 146721 144870 143689 143531 143869 144034
52907A44034j72k58j55j44l13n10n30l53j91k54l95k03M68J185J483J488J655
$$ 144034 143862 143604 143449 143305 142992 142482 141952 141599 141408 141154 140759 140556 141024 142209 143692 145180 146835
52890A46835K005K078J705J335J408J766J924J693J231P11J86k27l88l16k08j85
$$ 146835 148840 150918 152623 153958 155366 157132 159056 160749 161980 162691 162877 162650 162262 161946 161738 161553
52874A61553j11K65R78J710K043J941J839K177K906L638M131M429M580M494M118
$$ 161553 161442 161707 162685 164395 166438 168379 170218 172395 175301 178939 183070 187499 192079 196573 200691
52859B00691L521K809K147J746J609J338N70m40j024r04l86K31R61J662J896J555
$$ 200691 204212 207021 209168 210914 212523 213861 214431 213991 212967 212063 211677 211908 212869 214531 216427 217982
52843B17982J155J063Q21j71j606k492k403j890j624j625j535j305j249j615k274
$$ 217982 219137 220200 221021 220850 219244 216752 214349 212459 210835 209210 207675 206370 205121 203506 201232
52828B01232k811k868k478k087k078k350k494k399k387k667k844k366j292m45
$$ 201232 198421 195553 193075 190988 188910 186560 184066 181667 179280 176613 173769 171403 170111 169666
52814A69666n68j458k191k159j666j336j238r60m20l7l3q9j0j76q48j480j340
$$ 169666 169098 167640 165449 163290 161624 160288 159050 158090 157670 157633 157600 157511 157501 157325 156477 154997 153657
52797A53657o54l15n47n83K9O05K83p19j438j470j303j396j556j414r88n69l03
$$ 153657 153003 152688 152141 151558 151587 152192 152475 151756 150318 148848 147545 146149 144593 143179 142191 141622 141319
52780A41319j95k52m19m69k56K9L4l04o56p40o26n30m64l10j98m66j154j773j862
$$ 141319 141124 140872 140453 139984 139728 139757 139791 139487 138831 138091 137465 136935 136471 136161 135963 135497 134343 132570 130708
52761A30708j678j871k504k777k043p91j48n42j340j843k126k597l107l015k050
$$ 130708 129030 127159 124655 121878 119835 119044 118896 118354 117014 115171 113045 110448 107341 104326 102276
52746A02276p21K08M60L38K96M58N84L86j16n64o59m68l07l00k30J63Q13J309
$$ 102276 101555 101763 102223 102561 102857 103315 103899 104285 104169 103605 102946 102478 102171 101871 101641 101804 102617 103926
52728A03926J308R24O30O97Q52O88L46L77R14J381J251P57N10P17J138J587J960
$$ 103926 105234 106158 106788 107485 108337 109025 109371 109748 110662 112043 113294 114051 114561 115278 116416 118003 119963
52711A19963J902J052k97j323j572j412j452j854k335k509k160j444r45j163j904
$$ 119963 121865 122917 122620 121297 119725 118313 116861 115007 112672 110163 108003 106559 105614 104451 102547
52696A02547k467k545k457k455k352k021j727j561j078j0J037J186M05m75p91
$$ 102547 100080 97535 95078 92623 90271 88250 86523 84962 83884 83874 84911 86097 86502 86027 85236
52681H5236o65n92p80r93r20n85l71n31q07q33p98j207j933k175j549n93Q6N71
$$ 85236 84571 83979 83199 82206 81286 80701 80330 79799 78992 78159 77361 76154 74221 72046 70497 69904 69990 70561
52663G0561J053J233R08N76P08Q88N06j44l33j12j09l62l65j80l96r24r42k57
$$ 70561 71614 72847 73755 74331 75039 75927 76433 76289 75956 75844 75735 75373 75008 74828 74432 73508 72566 72309
52645G2309L30L73M96J250K092K236J815J542J658J963K372K867L066K520J332
$$ 72309 72639 73012 73508 74758 76850 79086 80901 82443 84101 86064 88436 91303 94369 96889 98221
52630I8221O6q94j545j983k190k083j587p71k3K35J7k41l88q26j788k696k675
$$ 98221 98287 97393 95848 93865 91675 89592 88005 87234 87211 87446 87463 87222 86834 86008 84220 81524 78849
52613G8849j552j18O32L74k50k16Q14K023K281J432K95n00j047j448j327n25L66
$$ 78849 77297 77179 77811 78185 77935 77719 78533 80556 82837 84269 84564 84064 83017 81569 80242 79717 80083
52596H0083O76N33N40Q55J117J066P81M66L43N70R66J069P28M00N35R02R46M97
$$ 80083 80759 81292 81832 82687 83804 84870 85651 86117 86460 87030 87996 89065 89793 90193 90728 91630 92576 93073
52578I3073j15n05l94L26J366K101K223K085K036J816J075J37l82m69n59o40k34
$$ 93073 92958 92453 92059 92385 93751 95852 98075 100160 102196 104012 105087 105224 104842 104373 103814 103174 102940
52561A02940O58J324J261Q04N78P22R23R36P58M63J69P4L85J038J568J415N37
$$ 102940 103598 104922 106183 106987 107565 108287 109210 110146 110904 111367 111536 111610 111995 113033 114601 116016 116553
52544A16553l82o46m54o27j378j874j317k9R81J195Q19K43k37l69j15K04L11K89
$$ 116553 116171 115525 115071 114444 113066 111192 109875 109846 110827 112022 112841 113084 112847 112478 112363 112567 112878 113167
52526A13167K50k5o76j298j423j138p26o1R46J652J331L44k30q8R4n3p3L12O68
$$ 113167 113417 113392 112716 111418 109995 108857 108131 108070 109016 110668 111999 112343 112113 112025 112119 112066 111993 112305 112973
52507A12973P12R23J641K275K021R71o6n62o02n05n26p41r10o36J21R00J246J080
$$ 112973 113685 114608 116249 118524 120545 121516 121450 120888 120286 119781 119255 118514 117604 116968 117089 117989 119235 120315
52489A20315M66m85j319j337m58N38R72J072J364J763J865J770J888K097J865
$$ 120315 120781 120296 118977 117640 117182 117720 118692 119764 121128 122891 124756 126526 128414 130511 132376
52474A32376J235R83J563K407K590J855P75R2J44P27J312J429R54N8j050k161
$$ 132376 133611 134594 136157 138564 141154 143009 143784 143876 144020 144747 146059 147488 148442 148500 147450 145289
52458A45289k911k956k368j722j570j887k187k118j859j797j987k058j742j295
$$ 145289 142378 139422 137054 135332 133762 131875 129688 127570 125711 123914 121927 119869 118127 116832
52444A16832j207j455j425p42Q1J36p23j588j476m30N86Q16M47J83L17N33M71
$$ 116832 115625 114170 112745 112003 112084 112220 111497 109909 108433 108003 108589 109405 109852 110035 110352 110885 111356
52427A11356J61j83m19m11K7P91J333J168N30J49M56J180J666J410M37n93q15
$$ 111356 111517 111334 110915 110504 110531 111322 112655 113823 114353 114502 114958 116138 117804 119214 119651 119058 118243
52410A18243r0O75N47k32o31l42j25n06r18n92K85Q85Q19L49k40q12j048o08L80
$$ 118243 118153 118828 119375 119143 118512 118170 118045 117539 116621 116029 116314 117199 118018 118367 118127 117315 116267 115659 116039
52391A16039J318J799J908J917J964K051K065J745R60M4m54l75j0M72J196K083
$$ 116039 117357 119156 121064 122981 124945 126996 129061 130806 131766 131810 131356 130981 130971 131443 132639 134722
52375A34722K531K038R19N6k3M57R43J146J130J130J335J742K071J987J527J131
$$ 134722 137253 139291 140210 140266 140243 140700 141643 142789 143919 145049 146384 148126 150197 152184 153711 154842
52359A54842J161J474J674J610J430J220R92R75J470K273K631K157J394J093J206
$$ 154842 156003 157477 159151 160761 162191 163411 164403 165378 166848 169121 171752 173909 175303 176396 177602
52344A77602J099O17K84M53Q33J078J288J608J832J750J578J604J660J426J085
$$ 177602 178701 179318 179602 180055 180888 181966 183254 184862 186694 188444 190022 191626 193286 194712 195797
52329A95797J210J928K620K656K134J698J731J973J963J682J555J871K452L007
$$ 195797 197007 198935 201555 204211 206345 208043 209774 211747 213710 215392 216947 218818 221270 224277
52315B24277L604M454N405O027O222O301O379O128N350M415L818L649L803M367
$$ 224277 227881 232335 237740 243767 249989 256290 262669 268797 274147 278562 282380 286029 289832 294199
52301B94199N315O060N890M928M217M677O228P970R035R202Q903Q739Q896R093
$$ 294199 299514 305574 311464 316392 320609 325286 331514 339484 348519 357721 366624 375363 384259 393352
52287C93352R084R059R404J0200J1213J2215J3056J3577J3771J3905J4198J4468
$$ 393352 402436 411495 420899 431099 442312 454527 467583 481160 494931 508836 523034 537502
52275E37502J4455J4344J4445J4484J3865J2705J1932J2037J2386J2215J1745
$$ 537502 551957 566301 580746 595230 609095 621800 633732 645769 658155 670370 682115
52264F82115J1585J1490J0617Q940P480O887O592N798M664L863L398K679J620
$$ 682115 693700 705190 715807 724747 732227 739114 745706 751504 756168 760031 763429 766108 767728
52251G67728Q72P29O08Pn63k98N48P77k08j599k191j745r92n49l66j08L74J077
$$ 767728 768600 769329 769937 769944 769381 769083 769631 770408 770200 768601 766410 764665 763673 763124 762758 762650 763024 764101
52233G64101K079L430M925O171O933P363P800Q369Q896R233R621J0447J1641J2507
$$ 764101 766180 769610 774535 780706 787639 795002 802802 811171 820067 829300 838921 849368 861009 873516
52219H73516J2404J1484J0551J0150J0020R525Q457P228O336N790N147M033K498
$$ 873516 885920 897404 907955 918105 928125 937650 946107 953335 959671 965461 970608 974641 977139
52206I77139R05l82j190j601j950k621l651m580m944m832m748m950n302n791o767
$$ 977139 978044 977662 976472 974871 972921 970300 966649 962069 957125 952293 947545 942595 937293 931502 924735
52191I24735q302r640r811q758p438o743o620o462o069n847o129o578o520n778
$$ 924735 916433 906793 896982 888224 880786 874043 867423 860961 854892 849045 842916 836338 829818 824040
52177H24040m885m484m597m754m681m600m779n081n117m686l890k971k184j775
$$ 824040 819155 814671 810074 805320 800639 796039 791260 786179 781062 776376 772486 769515 767331 765556
52163G65556j855k356l119l937m364l840k376r30n87j314j963j657p96l55n66
$$ 765556 763701 761345 758226 754289 749925 746085 743709 742779 742192 740878 738915 737258 736462 736107 735541
52148G35541o73p4Q28J035J16j299k223k379k418k997l895m289l872l303l350
$$ 735541 734868 734794 735622 736657 736773 735474 733251 730872 728454 725457 721562 717273 713401 710098 706748
52133G06748l984m610m923n053m955m295l147k294k426l273m010m269m349m544
$$ 706748 702764 698154 693231 688178 683223 678928 675781 673487 671061 667788 663778 659509 655160 650616
52119F50616m758m884m988n005m687m113l800l942l947l184j914r73o19l87R6
$$ 650616 645858 640974 635986 630981 626294 622181 618381 614439 610492 607308 605394 604421 603802 603415 603511
52104F03511O50J107J694K588L486L938L913L794L987M693N799O921P820Q807
$$ 603511 604161 605268 606962 609550 613036 616974 620887 624681 628668 633361 639160 646081 653901 662708
52090F62708J0374J2306J3729J4226J4390J4877J5527J5910J6165J6620J6989
$$ 662708 673082 685388 699117 713343 727733 742610 758137 774047 790212 806832 823821
52079H23821J6860J6714J7395J8624J9002J7849J6145J5142J4861J4479J3627
$$ 823821 840681 857395 874790 893414 912416 930265 946410 961552 976413 990892 1004519
52068A004519J2574J1446J0078Q504P026N789M651L442K070N02j017j983k272
$$ 1004519 1017093 1028539 1038617 1047121 1054147 1059936 1064587 1068029 1070099 1070601 1069584 1067601 1065329
$$ [...]
##END NTUPLES=NMR SPECTRUM
##END=
