##TITLE=NES1053_Conilon_9268809_NPuQtcayzX
##JCAMPDX= 6.0         $$ Bruker NMR JCAMP-DX V2.0
##DATA TYPE= NMR SPECTRUM
##DATA CLASS= NTUPLES
##ORIGIN= BRUKER
##OWNER= Administrator
$$ 1.72 TOPSPIN		Version 2.1
$$ 2015-07-10 20:08:04.347 -0700  Administrator@X
$$ Compression mode = diff/dup
##.OBSERVE FREQUENCY= 400.02188249412
##.OBSERVE NUCLEUS= ^1H
##.ACQUISITION MODE= SIMULTANEOUS (DQD)
##.ACQUISITION SCHEME= undefined
##.AVERAGES= 8
##.DIGITISER RES= 22
##SPECTROMETER/DATA SYSTEM= spect
##.PULSE SEQUENCE= zg30
##.SOLVENT NAME= COFFEE_meoh
##.SHIFT REFERENCE= INTERNAL, COFFEE_meoh, 1, 14.98509
##AUDIT TRAIL= $$ (NUMBER, WHEN, WHO, WHERE, PROCESS, VERSION, WHAT)
$$ ##TITLE= Audit trail, TOPSPIN		Version 2.1
$$ ##JCAMPDX= 5.01
$$ ##ORIGIN= Bruker BioSpin GmbH
$$ ##OWNER= Administrator
$$ $$ E:\/data/COFFEE/nmr/NES1053_Conilon_9268809_NPuQtcayzX/10/pdata/1/auditp.txt
$$ ##AUDIT TRAIL=  $$ (NUMBER, WHEN, WHO, WHERE, PROCESS, VERSION, WHAT)
(   1,<2015-07-10 20:07:56.988 -0700>,<Administrator>,<X>,<go>,<TOPSPIN 2.1>,
      <created by zg
	started at 2015-07-10 20:06:50.988 -0700,
	POWCHK enabled, PULCHK disabled,
       configuration hash MD5:
       21 0F 79 D6 B3 7B B4 F6 88 20 88 DB 03 48 BD 9F
       data hash MD5: 64K
       F8 E6 0F 7E C8 76 9A BC 60 58 D5 0D BF 0C B9 D6>)
(   2,<2015-07-10 20:08:00.222 -0700>,<Administrator>,<X>,<proc1d>,<TOPSPIN 2.1>,
      <Start of raw data processing
       efp LB = 0 FT_mod = 6 PKNL = 1 PHC0 = 0 PHC1 = 0 SI = 32K 
       data hash MD5: 32K
       64 58 BC 8D 70 84 68 6C 43 2F 42 4F 60 7B 88 F9>)
(   3,<2015-07-10 20:08:00.503 -0700>,<Administrator>,<X>,<proc1d>,<TOPSPIN 2.1>,
      <pk PHC0 = 92.7356 PHC1 = 0 
       data hash MD5: 32K
       43 A6 27 B3 74 EE 8C 6F 0A 89 A1 6F E6 BE 57 3A>)
(   4,<2015-07-10 20:08:00.628 -0700>,<Administrator>,<X>,<proc1d>,<TOPSPIN 2.1>,
      <abs ABSG = 1 
       data hash MD5: 32K
       8C 06 56 56 48 50 C7 3F 2F C6 85 48 92 23 C1 A4>)
(   5,<2015-07-10 20:08:00.691 -0700>,<Administrator>,<X>,<proc1d>,<TOPSPIN 2.1>,
      <abs ABSG = 2 
       data hash MD5: 32K
       F7 16 FE DE E5 EF 26 55 D6 9D 3D EF A1 6E EE EF>)
(   6,<2015-07-10 20:08:00.753 -0700>,<Administrator>,<X>,<proc1d>,<TOPSPIN 2.1>,
      <abs ABSG = 3 
       data hash MD5: 32K
       A9 02 10 D9 18 CF 19 C2 67 BD C2 7A B8 84 62 F0>)
(   7,<2015-07-10 20:08:00.816 -0700>,<Administrator>,<X>,<proc1d>,<TOPSPIN 2.1>,
      <abs ABSG = 4 
       data hash MD5: 32K
       7E CD 10 C3 4C 53 5B 23 05 59 C7 10 8A 4D B5 5B>)
(   8,<2015-07-10 20:08:00.863 -0700>,<Administrator>,<X>,<proc1d>,<TOPSPIN 2.1>,
      <abs ABSG = 5 
       data hash MD5: 32K
       FA 69 DD 20 CE B0 2F 37 7C B5 F2 B9 B6 C4 7C 1D>)
$$ ##END=
$$ 
$$ $$ hash MD5
$$ $$ 0A A9 3C 36 42 17 C0 79 D9 C3 55 A7 7A 7D 04 F5
##$RELAX= 
##$RELAX= 
##$RELAX= 
##$RELAX= 
##$RELAX= 
##$RELAX= 
##$RELAX= 
$$ Bruker specific parameters
$$ --------------------------
##$DU= <E:\>
##$EXPNO= 10
##$NAME= <NES1053_Conilon_9268809_NPuQtcayzX>
$$ [...]
##$TP= (0..7)
150 150 150 150 150 150 150 150
##$TP07= 0
##$TPNAME0= <>
##$TPNAME1= <>
##$TPNAME2= <>
##$TPNAME3= <>
##$TPNAME4= <>
##$TPNAME5= <>
##$TPNAME6= <>
##$TPNAME7= <>
##$TPOAL= (0..7)
0.5 0.5 0.5 0.5 0.5 0.5 0.5 0.5
##$TPOFFS= (0..7)
0 0 0 0 0 0 0 0
##$TUNHIN= 0
##$TUNHOUT= 0
##$TUNXOUT= 0
##$USERA1= <user>
##$USERA2= <user>
##$USERA3= <user>
##$USERA4= <user>
##$USERA5= <user>
##$V9= 5
##$VALIST= <valist>
##$VCLIST= <CCCCCCCCCCCCCCC>
##$VD= 0
##$VDLIST= <DDDDDDDDDDDDDDD>
##$VPLIST= <PPPPPPPPPPPPPPP>
##$VTLIST= <TTTTTTTTTTTTTTT>
##$WBST= 2048
##$WBSW= 25
##$XGAIN= (0..3)
0 0 0 0
##$XL= 0
##$YL= 0
##$YMAX_a= 548968
##$YMIN_a= -460070
##$ZGOPTNS= <>
##$ZL1= 120
##$ZL2= 120
##$ZL3= 120
##$ZL4= 120
##$ABSF1= 14.98509
##$ABSF2= -5.573092
##$ABSG= 5
##$ABSL= 3
##$ALPHA= 0
##$AQORDER= 0
##$ASSFAC= 0
##$ASSFACI= 0
##$ASSFACX= 0
##$ASSWID= 0
##$AUNMP= <proc_prof1d_extract_pilot.lims>
##$AXLEFT= 0
##$AXNAME= <>
##$AXNUC= <1H>
##$AXRIGHT= 0
##$AXTYPE= 0
##$AXUNIT= <>
##$AZFE= 0.1
##$AZFW= 0.1
##$BCFW= 0
##$BC_mod= 0
##$BYTORDP= 0
##$COROFFS= 0
##$CY= 15
##$DATMOD= 1
##$DC= 0
##$DFILT= <>
##$DTYPP= 0
##$F1P= 0
##$F2P= 0
##$FCOR= 0.5
##$FTSIZE= 32768
##$FT_mod= 6
##$GAMMA= 0
##$GB= 0
##$INTBC= 1
##$INTSCL= 1
##$ISEN= 128
##$LB= 0
##$LEV0= 0
##$LPBIN= 0
##$MAXI= 10000
##$MC2= 0
##$MEAN= 0
##$ME_mod= 0
##$MI= 0
##$NCOEF= 0
##$NC_proc= -8
##$NLEV= 6
##$NOISF1= 0
##$NOISF2= 0
##$NSP= 0
##$NTH_PI= 0
##$NZP= 0
##$OFFSET= 14.98509
##$PC= 1
##$PHC0= 92.7356
##$PHC1= 0
##$PH_mod= 1
##$PKNL= yes
##$PPARMOD= 0
##$PPDIAG= 0
##$PPIPTYP= 0
##$PPMPNUM= 2147483647
##$PPRESOL= 1
##$PSCAL= 4
##$PSIGN= 0
##$PYNMP= <proc.py>
##$REVERSE= no
##$SF= 400.02
##$SI= 32768
##$SIGF1= 0
##$SIGF2= 0
##$SINO= 400
##$SIOLD= 32768
##$SPECTYP= <>
##$SREGLST= <1H.CDCl3>
##$SSB= 0
##$STSI= 32768
##$STSR= 0
##$SW_p= 8223.68421052631
##$SYMM= 0
##$S_DEV= 0
##$TDeff= 65536
##$TDoff= 0
##$TI= <>
##$TILT= no
##$TM1= 0
##$TM2= 0
##$TOPLEV= 0
##$USERP1= <user>
##$USERP2= <user>
##$USERP3= <user>
##$USERP4= <user>
##$USERP5= <user>
##$WDW= 1
##$XDIM= 32768
##$YMAX_p= 386589883
##$YMIN_p= -637163
##$CURPLOT= <Network HP LaserJet P1505>
##$CURPRIN= <$Network HP LaserJet P1505>
##$DFORMAT= <normdp>
##$LAYOUT= <+/1D_H.xwp>
##$LFORMAT= <normlp>
##$PFORMAT= <normpl>
##$SURQMSG= 1
$$ End of Bruker specific parameters
$$ ---------------------------------
##NTUPLES= NMR SPECTRUM
##VAR_NAME=  FREQUENCY,     SPECTRUM/REAL,   SPECTRUM/IMAG
##SYMBOL=    X,             R,               I
##VAR_TYPE=  INDEPENDENT,   DEPENDENT,       DEPENDENT
##VAR_FORM=  AFFN,          ASDF,            ASDF
##VAR_DIM=   32768,         32768,           32768
##UNITS=     HZ,            ARBITRARY UNITS, ARBITRARY UNITS
##FACTOR=    0.250966925370066, 1,           1
##FIRST=     8223.43324360094, -76201,       67117
##LAST=      0,             35602,           -370619
##MIN=       0,             -637163,         0
##MAX=       8223.43324360094, 386589883,    0
$$ Real data points
##PAGE= N=1
##DATA TABLE= (X++(R..R)), XYDATA
$$ [...]
23805 270220 230723 -126525 129511 -117457 -105146 -69214 130943 43449 196689 -26552
23794 61667 149589 59718 -339077 118599 -1390 -119804 -391426 125199 -164135 56247 77738
23783 77738 10616 217216 262660 -30070 171524 173024 -132933 -146316 -171471 -126039 -332187
23772 -332187 -233559 100161 -49081 2259 48138 53879 145337 58183 -26387 145492 8582 -44801
23759 171985 -45172 -227882 21469 -299833 248363 119637 65719 11448 46660 -112464
23748 -28664 -135852 -67657 -108699 -295485 128173 -19450 -80957 -93312 -78747 -168086 117223
23736 -188436 181160 -21440 219190 143491 85990 28409 17288 -187565 -88688 26806 142703
23725 142703 165835 -28018 -26835 -38676 -20058 -16795 72014 -44047 13080 -168974 216596
23713 -57915 -116578 -222649 -230914 -42699 -169289 105509 -90789 -144382 -93386 160827 58372
23701 10399 101553 -32914 -41104 192834 45565 275194 -234144 -69960 -299737 -197085 8082
23689 -71041 -7284 -208567 -149675 25516 -119880 58143 88478 172725 -98071 41027 -387364
23677 -347365 -53339 71161 -225708 49466 79516 304514 54299 5824 166807 -25991 -214319
23666 -214319 -116779 59460 -212729 -101660 -235178 -137903 -119516 -31780 352037 198885
23656 198885 -148129 339562 -274105 99452 -96458 15713 96930 -327083 -135997 -11375
23645 251940 223490 108248 -127550 -236241 -10643 -83681 -65687 -327486 -86626 -489 264119
23633 -107315 115234 35359 45708 437274 -89733 -70912 -291419 134381 108032 300702
23623 300702 73912 -177873 84931 -403012 183967 -60919 172421 172889 -112005 -122615 -54683
23611 -134422 -223542 135096 158073 135477 -12127 -219465 148757 -58171 65619 99088 26787
23599 -263043 333934 -213844 -25598 -211366 -160849 31803 -317520 -180443 -25433 -122332
23589 -122332 316547 -64206 -24640 203191 146729 105461 -85807 156704 -76014 54469 -242295
23577 198635 343668 -82354 51997 -149221 136627 -50304 -127208 74393 15053 276218 196075
23566 196075 -318983 75376 252071 121957 -30073 -7500 -128330 -276066 -224992 -264882 124865
23554 263387 4466 -184617 275353 -124804 2181 -165221 12627 56628 5194 -95561 -96891
23543 -96891 113785 218372 -350732 54132 100032 -103080 -4 -315482 59604 53903 -219767
23531 -194158 -20326 -26976 -12782 -13964 82274 -35314 -220139 -255652 18654 80247 -153146
23519 256135 -128838 -227200 117660 -161737 -149633 -106265 148234 -127140 -285729 -248377
23509 -248377 -447279 102793 16829 -32232 267200 223744 26058 214580 123508 252551
23499 252551 61185 95639 -89947 88956 78032 178743 -56708 115761 7685 -323320 -21154
23487 -201364 135093 168204 445170 -134577 -159587 -40371 -65216 -5161 -326617 184780 64898
23475 242818 -182896 -336174 -48986 67383 -173415 -66032 71448 -327256 19074 -21939 -27415
23464 -27415 -316971 164577 29481 -119265 102091 -34975 -130325 -79974 -35119 156883 -172292
23452 -360529 -15411 -202920 201808 -236224 229471 -108693 83236 236454 388752 -16101
23441 -221685 -187517 165541 70251 186605 113183 -75351 100191 -35005 -125392 96427 -26871
23429 96587 24744 132417 90749 137464 -342634 135199 -196040 -185222 185518 173544 -256188
23417 240041 148619 -234992 91862 -148204 124831 -157914 -84759 -222517 167895 171868
23407 171868 -60785 -76768 -70287 -764 -161141 42005 -112160 26476 30553 -37911 -101090 10125
23394 -197858 150363 33725 -179543 30336 -133240 -145346 77677 29605 -54287 -103257 157148
23382 -116251 -209140 56493 -35733 401296 23475 170686 -234925 -26993 -128220 -239532
23372 -239532 -157925 -68572 135226 -126222 5585 365399 -86035 1453 17528 -26606 -164782
23361 -164782 334262 102970 -131040 -213723 94420 83748 222365 4143 -11740 158643 54340
23349 -265748 -332810 119479 -84664 -18187 -213677 -152979 -102167 -135902 -110078 160080 -99627
23337 50835 293324 407279 -491581 -94167 247135 -116712 -3676 -336138 -76066 -22649 60449
23325 138210 -85683 70351 940 -240024 248586 329496 -211527 -48422 99755 112526 235871
23314 235871 -237239 181971 -13455 124150 -96645 -35016 -188351 -314475 175358 -5181
23303 -36207 -163427 -124773 -240743 102027 6297 -154339 260064 -25349 -129600 -57827 -201306
23292 -201306 -99876 98268 27681 211628 -155145 239380 194456 64317 -125410 112827
23281 15453 -35852 124076 -74829 216821 -255930 120777 241861 6532 -204035 -152161 177531
23269 194140 -82721 325963 -100820 209048 41358 -13257 -103692 -34781 46268 -126503 154856
23257 -73562 -217396 80903 174669 -34979 -135494 146892 -292836 133864 45466 100920 -162899
23245 -60040 136176 262503 -86975 -79896 267570 -53607 29477 -55631 61583 -49905 -114910
23234 -114910 25915 -236240 85136 -11763 -276608 -113528 368690 300232 -80506 -109429 -109490
23223 -109490 18453 -31815 65867 136655 264642 -105430 179895 -193867 52383 194935
23213 194935 155202 -162325 -104121 -77085 -347756 -145857 90792 9399 86412 440 185523
23202 185523 -165024 133680 -33217 217860 -58109 3590 -21439 27921 -301968 -132319 -395061
23191 -395061 -181687 -97336 4191 8415 -373249 -5375 -115827 -190646 -351211 374085 -171912
23179 -402637 271900 42753 6245 246155 -202344 -1563 195947 49634 -26324 -27521 -143934
23168 -143934 -311007 164307 -73242 -90390 -192604 193768 -68385 -94329 -12769 89600 60352
23157 60352 270041 -14183 -141591 -57937 -185797 -386245 219537 76686 1163 -258611 -164579
23146 -164579 43213 142165 232786 -125343 -17620 38166 -216319 119836 155694 -218763 -367399
23135 -367399 39312 -63426 219393 -25781 386995 -36288 -178181 76511 -71666 65195 54034
23124 54034 42237 361498 242139 176850 217508 76092 -54531 -83678 244636 -204517 63230
23112 189331 -218103 141356 -102851 -21902 -93084 108879 330463 33783 -94457 246993
23101 -229676 270785 -230700 69782 105043 -19974 16476 64557 124952 58927 -386311 -20329
23089 -69299 -438863 27292 -265212 -156379 -34840 134082 -332359 17331 241294 -40136
23078 -112073 131983 43374 -11944 55724 2162 28052 114759 -17063 -284714 -188967 -111438
23067 -111438 -175709 -35656 -39561 -259741 242896 62803 -15348 122168 -397219 88098 -141832
23055 -164177 -125821 119989 -13620 -283939 92068 -48505 -133405 343631 -213693 107159
23044 -89318 140490 150329 -86829 170794 7421 17557 276550 -145940 -22106 -303417 186515
23032 -253191 182295 -248454 -128164 -61677 -71474 105454 -134737 4538 134321 -61489 -72416
23021 -72416 -178957 54757 40430 -66457 96866 -103105 -366537 71122 -305050 -118779 -91414
23010 -91414 282899 -95599 -74294 -26265 -142654 158598 -70964 -90035 -227774 -331405 -14455
22998 -162034 -344093 204521 -76147 -20846 8300 71019 -114251 -79876 -234590 124890 93750
22987 93750 11534 -130255 199696 37749 -306292 -104217 15683 -72320 252241 -184154
22976 9795 31796 153506 -289445 -21409 -122690 -414616 -23575 259528 563519 -225256
22965 -77821 209222 -261104 19622 11182 -130190 95778 -32751 -67269 -191245 332579 -335728
22953 208439 -269408 -32258 -13758 -113442 129806 -35493 -69724 -97314 -188335 -284663 89357
22941 -19873 9742 -141781 -219010 6378 -59837 -168880 12531 -163802 8750 186012 -29164
22929 45851 218544 -117585 -3274 -165159 -1793 258529 -27088 -96909 430461 -51687 308029
22917 102472 360810 -24164 -84912 -36856 -42657 -318739 -136898 -127302 131360 94411 -75857
22905 -135807 266416 -1783 -231317 136091 -183051 -222049 -279927 -123595 164203 -373455
22894 -80934 -61240 -190483 177375 53532 -216577 -38921 224261 -199812 134939 -181408
22883 154768 166629 -141841 43469 98000 -72394 -123574 -211522 162403 -364749 -119773 122
22871 -17813 41568 107119 -260817 49685 -65409 -276817 84778 -20882 6192 403258 42426
22859 121390 -296055 -65119 92988 77145 252445 -191427 444605 -492521 -41419 -83034
22849 -83034 -146203 -74972 -108380 -238620 -160753 141811 -410445 -159072 81994 -261097 -134831
22838 -134831 -167646 337188 -170489 -69022 311234 8175 -331876 -45125 -75909 52062 145263
22827 145263 6935 -61770 -112223 -60265 -140314 374353 -92232 92394 -41748 236456 -37861
22815 90721 -51362 79423 -135501 -5333 216291 -59694 301093 83468 -231237 1297 -193596
22803 169901 156116 -310518 -46119 20841 -77724 156712 93355 -125784 13379 49653 -158814
22791 -252997 -44447 126217 184021 87759 5499 -145388 -285905 95296 70451 220740 595213
22780 595213 -99927 -169915 -97487 110003 -334382 -162207 163910 207779 -91578 -160592 -33855
22768 -361960 54669 7553 40334 -180193 -222785 117979 -27029 -228553 -50124 -65380 173528
22756 -201826 60343 -43830 20641 -58213 -307935 -7030 264074 178713 106474 61020 80160
22745 80160 123417 -57521 -475093 51622 158937 -66449 -136668 42552 -33121 -119531 171901
22733 -77484 141271 -66214 64015 191405 -3449 -316072 71146 148395 -182045 -118985 -287016
22722 -287016 154022 -214795 148901 76756 -157525 -224386 -69025 -144220 -107248 -225645
22712 -225645 48756 26185 -18586 -50612 -63915 67484 15867 297341 -4849 444331 -155205
22700 -168722 -270414 306506 -118701 106074 -31289 161132 -175390 289900 -277650 325845
22689 -14153 -20744 -42522 -420743 -7160 -109418 178924 -10063 -152550 62580 -4025 -77940
22678 -77940 272967 -125809 20520 100610 261056 131421 205170 -150946 -430269 108662
22667 -186625 -13896 -147381 -91981 -422231 141737 -40971 5912 135853 33692 6995 -30843
22655 9104 -185211 -176773 57278 -171953 23473 -62253 10750 4042 -127105 -101601 -138418 -248264
22643 -248264 -138711 -103991 -37392 -47978 -52595 3458 -314003 22979 -157560 236216 -149152
22631 -105525 122985 109576 -152929 105148 -22276 43031 74876 47132 183431 236770 -71773
22619 105449 -172430 88222 28518 -81646 -27849 -97134 89649 -366427 247835 -97342 57659
22607 344980 -8946 -121264 -212729 -158036 -248970 120227 -20775 -20953 -163614 -280610 -136200
22595 96411 58470 -140355 -180193 -88616 -220698 -137604 -225752 -151908 -152668 -208110 -193938 -255090
22583 -255090 29751 287003 -139904 139943 7184 111833 -89337 -26696 47051 -333228 -263853
22572 -263853 268166 -36250 -251532 -53394 -238768 -130015 -361852 -88567 158408 51429
22561 -91038 157692 33710 157046 -67101 -159452 -62059 105323 11062 128216 232691 44605
22549 -18387 -36818 -26511 89214 -177552 9273 -68085 -50325 8917 -183705 -231555 267990
22537 -279244 -174369 250737 -57896 50579 -123368 553859 305415 -448129 -17967 -171039
22527 -171039 -117341 -201359 -62794 95666 157388 -43305 -58027 126167 -26216 10894 -37132
22515 -16754 244706 -227083 124174 -346537 237938 65430 154410 207429 -295949 -23359
22504 -95483 -383331 -229476 114386 -283622 -160529 -499958 -246491 -13854 72667 47506
22494 47506 -7801 -152356 16609 -101212 -231113 -244124 71196 -257115 -366374 -243570 -263773
22483 -263773 106666 -377942 292395 284347 -30974 -91687 -92699 340855 -229062 -54336 172322
22471 -231253 -145222 239255 121956 -209782 -34863 328045 -49460 103737 -228472 16830
22460 -237859 -64725 592070 70306 -34446 -144404 -243467 13486 57669 -65421 143534 89842
22449 89842 -448009 -16763 -265786 175429 -96285 -67548 88330 167639 -204204 -422294 -207387
22437 -66091 -219406 -436753 -101687 -29549 25312 299426 158461 -18115 -64664 -80438 32354
22425 134645 78975 -55439 -64414 252939 13732 42758 -33563 -226715 -115201 -88977 100406
22413 -32197 -30297 -296663 236570 -247684 202725 -92886 -65233 -164731 -20545 -301824 110595
22401 -103551 -32490 399314 -50144 51763 -153532 213206 136485 -134177 -158460 109515
22390 33282 -71477 -45760 113619 -317543 -48204 252441 -155547 -231129 -93972 119675 120106
22379 120106 -293289 193891 -42694 -89729 7493 83714 185956 -82977 -2333 42643 -181376
22367 133562 -10485 221251 74976 -60444 92481 -27860 -200597 -163034 -325417 76942 -167944
22355 101930 -143230 41251 77772 21127 -145472 -451340 -17571 -9578 209098 -444335 -115862
22343 125916 -174494 -99025 123668 -295222 -13065 319025 -68993 180136 73812 197029
22333 197029 -119222 -47209 155763 -54896 -70107 101434 -200261 41293 -155635 105436
22322 -94735 -251394 -63409 100323 87355 11463 -56774 -136225 -81991 -112224 185078 162099
22311 162099 254506 -51753 -385048 -204879 -116041 246687 207347 -250450 -280134 -188255 -270399
22300 -270399 257946 123280 -117627 -144309 -196006 -85410 -259909 167978 -217001 330265
22289 -92074 -136755 -232425 7653 -18924 234160 -53292 -6647 8827 -106666 -64325 228298 2167
22276 -83938 215215 -41716 -2566 -49665 -84795 50487 -84897 210457 -20996 -52095 -48635 35556
22263 57295 -44400 -167273 -70602 -51484 11068 93064 -57433 234836 -98659 -83418 -60179
22252 -60179 -84599 -370947 -153835 -185677 -135004 -27661 -66024 -95053 17398 -254028 -59031
22240 177478 41020 -79073 160324 99688 17407 -28531 77318 31981 74748 -186338 -159298
22229 -159298 -304470 -73116 22110 185118 203880 -174133 91622 -20001 -365133 -399535 -36836
22217 -27167 -24531 -100006 -26383 -35888 216845 -75758 268394 -153103 -37919 -208656 41447
22205 155432 -75255 248073 -35568 202519 -54146 70467 -265433 -85393 -175783 100458 18408
22193 60728 -152583 -19268 -330602 -294987 247127 89119 121782 11237 -117846 322462 9872
22181 -202566 65497 3117 -48401 54276 111867 -83144 258066 40982 -180746 219940 -93822
22169 -29284 71502 -8354 -224620 -209852 -114136 57266 -38969 -53103 -412892 -69536 -162362
22158 -162362 -131832 165097 5010 -112177 -131604 -300599 -212171 -256197 78979 -181044 103098
22146 -285341 -199265 85167 -112842 -344344 96683 -83602 224859 94962 20628 -98527 211008
22134 -171055 126002 -182084 165578 -367708 -300028 -2122 -76076 99105 -134505 90747 -132933
22122 -213874 143085 -54639 -118624 -277045 -5441 -347571 -168913 -109444 163248 -124952
22111 -211374 24927 -16966 -175727 -29550 -88800 -335326 98087 -26410 -3327 63769 -73974
22099 94995 -221175 -171647 -7827 -331941 -24680 -282718 -57342 126506 82685 -34143 -143530
22088 -143530 -109892 79436 66752 124594 200523 439082 -65741 -132413 -132724 -354456 24942
22076 91109 -41989 -297546 -401709 -310117 -115913 -19385 -100969 40420 198397 -13474 -76430
22065 -76430 -61810 99983 37909 3357 153860 24672 99299 154422 2222 -5892 -153777 -56158
22052 -108979 -242540 -123538 -134717 198871 -126758 -186005 90587 -373208 -53948 158844
22041 -258812 343627 184080 -11430 -105594 137443 -11167 112958 179155 -227325 -81684
22030 105536 74169 -75084 -183280 32942 -60419 255845 -244850 56543 -88913 168240 -282501
22018 -195592 -188187 -50470 226264 51617 -164711 166702 292169 196556 224581 174192 174099
22007 174099 -8659 -174066 21417 16055 -232585 -129606 -25228 -126404 41695 51888 212242
21996 212242 57200 -19069 166824 -146132 -149694 85988 -166630 183507 144783 -91117 -72953
21985 -72953 8878 -148494 -58299 19955 -172845 185239 55721 -255262 -3220 146322 -222404
21973 -140752 4596 -135033 -48536 195145 -117306 53818 138346 630 49047 -42023 4597 -96632
21960 -393375 21981 -416262 -286895 -286241 -182834 -129620 -135255 48506 -232941 272066 -31094
21948 -71731 17597 61832 -167780 -135589 306082 163968 278152 -357561 -231103 -242491
21938 -242491 35550 69359 -316832 -18620 -73735 -178189 -127916 94408 268902 33761 -56669
21926 -183970 74199 -292495 -358717 -55564 -138246 -177409 -94975 24609 -241827 74428 -42447
21914 11659 -53518 198512 -79845 -257131 -58877 -24217 48190 -266426 -73977 -68434 -142404
21903 -142404 167938 -145124 71434 -102380 -244239 -126161 -63249 -11167 304649 -38692
21892 -140867 -181720 94670 229281 150654 -50790 -360976 67683 -152731 248157 126406
21882 126406 283142 -56434 45593 96106 89735 -14513 -319004 -146289 93856 -255983 -236439
21871 -236439 185409 -273501 137079 -117215 67352 -154895 63542 2443 -337115 -59750
21860 265721 -177042 45905 193733 -35459 -225760 -33175 -235169 47421 -128598 -302838
21850 -302838 177548 128301 1576 -122472 80321 196294 137515 -62608 228449 -55520 -337953
21839 -337953 20328 20577 -1443 -150263 129032 -110961 -40305 4780 75844 -325502 54714
21827 -244219 101773 -51863 -271737 147752 -291004 -215160 -378184 -398727 -12271 -14177 -65839
21816 -65839 -103009 -111322 -110437 156382 76674 -44887 -136741 -422451 -64408 -172382 32175 79787
21804 79787 -248697 143176 -45002 180214 -160271 298219 -242717 -115941 -153629 -1083
21793 89385 -170267 92480 -76724 -85219 19442 111910 46563 -110305 24942 -21993 -79217
21782 -79217 -15602 -73426 85983 -62608 142332 -194319 337444 210333 -46754 -344695 -31457
21770 -239515 -23712 -54995 -109598 218944 -74549 165759 -131960 -281205 98686 -58917 248474
21758 68713 -109481 297093 -17463 -97237 -128123 260672 -175279 227826 -40913 -175149
21748 -175149 -275233 67208 153051 24439 -18650 242593 -62059 -56652 141624 -32578 35037
21736 -213490 -110690 59936 93731 346356 -153094 90729 59309 -146033 203363 113756
21726 113756 67520 -3494 -61657 73083 66298 16346 -109540 -20059 44623 -200480 127488
21714 -232784 9587 223174 -181996 -49864 -227944 -138010 -113015 -140464 -317291 -115701 -40959
21702 -204036 -78416 -186236 5240 -411354 -51457 -200002 143656 -13705 32255 176411 73259
21690 308606 -80869 -44838 40967 -97741 -25459 -279957 -73122 -158036 -384137 -32742 227761
21678 -154204 -126500 -318535 -75263 -220944 12132 121006 -72145 -180460 183275 34288
21667 -66382 -327184 -117610 244927 20580 -68117 -85717 120701 -100695 -183352 96801 24202
21655 -119226 -21326 -30556 174547 -289965 -321683 35534 -183429 31359 -37243 82772 329
21643 -30082 -189889 187291 -19680 19954 -13453 -451942 449554 208578 -13868 171255
21632 -104979 37917 -152041 181587 -232669 -202744 -375704 -157599 -40002 -263158 239672
21621 -148628 -120754 253328 247611 -76816 -188686 23003 -263474 98454 241243 -8871 163368
21609 -66727 -186863 7725 -18222 -229421 29624 -109137 -65910 -131957 138231 397473 97428
21597 21391 -28904 -16195 137326 136807 117755 128231 -172588 7731 31038 -83894 -101534 -126809
21585 -126809 -324488 -154652 -49301 209287 88185 103706 38168 210778 -11330 8663 53992
21574 53992 198765 -306152 -16248 -135855 -360526 -145244 118626 29839 -77254 -256942
21564 -256942 -419544 -111466 71228 -238773 -174792 52900 -334040 -141147 49509 -146989
21553 -174318 -231774 122176 -104074 -132325 -37153 20501 166825 108192 3123 -174641 -83814
21541 92927 -394684 -65888 -150677 73487 -43733 165954 -146875 216943 -232654 -28421 -328058
21530 -328058 -66845 -117917 -46509 -123793 198254 -150475 123873 66314 305308 24521 -143323
21518 -189727 86638 -90782 378499 46702 -219368 -241141 -234095 181505 -347231 -231011 78768
21506 18337 193344 233784 -94545 173731 -141582 94251 16562 -128219 -5867 -40268 -115830
21495 -115830 165981 -11151 -44034 43058 -140505 -197224 10902 388485 -200092 214629
21484 -77715 188548 -59424 51846 -142355 -40059 -195888 -45513 208509 -8780 -1733 -167638
21473 -167638 -19822 -225558 -15586 -423384 -186994 30337 -90483 -234489 -173884 53329 -266284
21461 -336483 -9874 -141371 95644 -116260 -323196 -463322 -293752 317000 -62911 23872
21450 -69889 4815 83905 56670 -3434 -253848 209498 60074 -475095 22258 9215 -90008 -41595
21437 -143906 356510 84927 218732 274706 495866 406313 542360 -130519 380912 67976
21426 -147417 170141 23030 156261 -110116 5414 -262829 -224639 89900 -307982 13311 13311
21415 13311 190983 16992 -38135 -154827 -306692 256434 -137606 -290828 -109834 -124413
21405 -124413 -46050 -509495 -122237 -453369 -73346 18765 -508775 122111 -155070 195622
21394 -56538 -252773 103933 -175118 40373 -15290 78983 -87678 72256 -18735 6985 76530
21383 76530 273151 -67054 249754 475811 -111325 -81521 52767 -21053 73829 238751 -34853
21371 -47992 -23597 -162319 -166972 -60098 282899 -101978 -30121 112071 -31731 -22998 -101166
21360 -101166 67389 70104 -101140 92114 -186631 90294 46461 -290016 -69833 -98201 104688
21348 212545 -188337 26613 -340182 232368 193554 71767 -87841 134156 -44783 62058 -201513
21336 -237112 -130507 89644 -369697 -146848 -21032 -234199 -247782 34198 -158247 37587
21325 -174683 -235720 137542 -282352 891 -18755 -319943 34958 -129925 166397 -102952 -350886
21314 -350886 231865 7765 -125492 -37319 84403 58876 -137802 -101454 -168892 -51365 -110701
21303 -110701 -128109 254279 -219717 36507 -318499 -91834 -46298 279871 -150895 115836
21292 -148956 205468 56844 55160 -100164 -182279 -283576 -90019 122000 -215996 31762 -138120
21280 -163858 98118 40714 -59315 -44394 -156466 36187 33603 -226892 -31327 127013 -91468
21268 198859 -314929 154687 -33666 -83022 -79435 -92411 91474 -236031 42830 -40314 154340
21256 -40873 118504 -233480 -43735 86651 -82478 -25231 -186348 -258020 -90853 -242385 -110163
21244 -211695 -141735 -167741 105493 -236160 24504 -339434 3711 131033 -94830 268484 -235027
21232 395079 -161244 -184078 -140323 -42266 -225271 -47440 59098 -43443 3980 -123378 -41328
21220 -193885 -90626 41475 -164333 -191175 1753 82358 360480 38691 -349171 119502 -57554
21208 -25436 -132361 -298562 -109758 -111334 -17072 -294718 449722 104033 -5068 -67363 104004
21196 -78493 -157597 -216017 -74841 -281640 -120036 9086 79807 -45906 -17827 -15113 -132904
21185 -132904 123952 -161860 90568 -35582 -1418 79129 166126 -200663 162362 -57934 -183312
21174 -183312 38499 215800 61964 -526953 120482 -182975 -74271 -6394 -82841 309437 150552
21162 94155 36265 220584 -69242 -340720 149333 229921 -44254 -97539 93646 6085 -204220
21150 -75110 -235876 -486021 298585 9258 -129737 -325478 -32879 -320077 74078 144855 -344813
21138 209642 -222264 74058 -81591 -112618 -14474 256457 -51937 126474 -146609 -50486 -177715
21127 -177715 -146227 -21725 92089 -149534 -138651 -110614 -168051 -2222 87744 50762 259106
21116 259106 153845 129024 -107106 -31197 -258413 33226 123195 -144448 -149421 -87090 70071
21104 -484003 -126263 -168580 -231460 256137 -169700 11011 -74367 -243299 -227327 -311109 -10954
21092 44745 -105528 -196355 -4193 -143277 60847 217906 -34074 75179 -208293 -165261 -81716
21080 -35616 325736 -228241 289375 -67219 -192798 85595 -103562 -98292 181579 -239826
21069 56636 -379092 68933 72021 187545 -151782 -75435 70855 219992 -40227 -33023 -401962
21058 -401962 -174649 101672 113048 -162289 -205351 73752 -131137 43600 -171056 -44607
21047 93187 -8905 2988 -306963 32866 148492 264753 117590 -26317 263556 128931 -225035
21035 -276707 34403 3756 365257 83107 -36740 89344 365918 -146167 -87235 271276 -137419
21023 75772 54948 -112922 5992 -315935 -139412 70801 -21267 314977 -221322 213830 114914
21012 114914 -151869 100628 -184061 189132 -83873 -138187 13367 -158172 108309 -307963
21001 131143 -116361 -14459 36868 43211 -36343 35429 -167502 105866 -98748 -183687 109343
20989 -32132 -108673 -50290 -36039 160680 32398 116597 -26907 -166698 -128126 23469 -1259
20977 -108921 -158916 7744 49410 91011 -272219 1520 -293170 124701 -64121 -65383 -170172
20966 -170172 12483 228614 186228 20388 297141 -218201 -197750 -176009 173127 -176088
20955 69957 257396 144070 4543 15446 107624 -14428 -20193 392051 103515 -105900 -204110
20944 -204110 -173602 -295332 30640 121948 230593 294690 -100080 -93676 172992 41388 -82188
20932 215024 146304 -63556 202985 5176 156246 -187709 -66587 128016 68650 -124923 -171152
20921 -171152 186544 -70540 -79750 46920 94825 -212549 -111602 -129538 -221374 -291019 206136
20909 -224318 -170219 -26145 -122946 -74734 265157 97368 -88754 -94858 -106623 -221781 110148
20897 135303 31186 -25021 290412 -537972 207503 -8670 -13162 205137 -361679 438089 -265082
20885 161478 133875 47106 -69242 82832 -254111 -494900 65213 -240029 -45119 355057 -304996
20873 -19737 -526707 -62215 -132692 -9620 132075 -181150 -201946 29127 3452 197800 -166745
20861 -164465 -41536 28368 -60806 59152 -250683 -279062 -189321 61212 -9497 -30897 2980 -120864
20848 5061 -313270 136233 -111061 96540 93076 -119464 -79525 76384 -93119 195618 29579
20836 86032 45384 91499 65528 139401 -38772 -46503 18084 138476 -164675 -55695 -186636
20825 -186636 -83617 -148628 6402 18123 94949 -223414 -17158 -161418 -402196 -125056 125238
20813 -313662 207961 80250 131508 -98815 -123629 -107912 -152270 -326732 -293915 -31534 -349577
20802 -349577 315224 -160244 106256 14371 -279707 -238915 253255 -115521 344880 -29896
20791 498294 10788 7248 -211878 -171234 -123435 -254549 97269 -266437 163310 51707 -75910
20779 -113629 -213966 -17434 53185 127136 -61378 4588 2179 23938 -1991 230002 20939 -46752
20766 -227561 -513469 -261880 -113009 23439 -134182 -290901 -131194 -42401 -260728 -39218
20755 -536341 144982 -143969 20003 22510 79949 20714 127214 -183015 7312 -223471 -33719
20743 -69841 -164236 -200800 153572 9912 -341294 120128 -286630 -290313 176777 -178421 -34616
20731 38110 -325968 -70024 -37604 -344406 127732 -119366 21788 141839 182637 -159921
20720 193996 113746 -114423 -186049 -80221 -106295 -12348 193319 -132268 -9114 -76994 -206352
20709 -206352 -388511 -186615 -22180 326270 77517 138439 84710 48032 -167062 184943
20698 -243154 92719 -263379 -238795 -284286 -22513 -99395 -181638 -37766 -258239 -247694 97779
20686 -21991 -273980 -79394 -47972 -129487 -216140 309208 -368853 -226583 157127 -206394
20675 288632 249299 -48026 24180 7152 -8887 -258179 -47972 100048 -139293 450803 -120867
20663 -13892 98473 -2298 -329580 -15632 74697 -259350 -240788 -331877 -46856 -143362 -214332
20652 -214332 -16975 -358431 -131105 72039 310162 -71627 -112303 236561 -338865 65591
20641 -66840 -63648 -59297 8981 -481660 -36906 -184034 -22955 -219471 34453 45945 142679 -60366
20628 91166 54059 -22594 273204 139800 6886 -137349 -156266 175945 -113788 38903 -310171
20616 -25306 190657 -113307 -405072 -155763 -290335 46494 -78584 -171649 -37826 -22268 5730
20604 194070 -121623 88430 138647 265654 191455 -57370 7030 1056 -112919 -65992 -425813
20593 -425813 -278034 -375988 -107884 130755 -182055 -383741 135808 52582 -62424 -46957
20583 -46957 154988 -196972 -3224 280217 -80567 273754 -87516 -11940 -166875 193242 -131439
20571 146501 -27418 -33564 -59465 -73428 142217 -386905 -208423 -264115 -64345 -245437 -50493
20559 34789 -182492 297475 -38929 215607 193658 -162926 -79562 -79861 -301255 -74047 68053
20547 -11387 40245 -17344 35934 191658 72484 -111216 399494 35580 -82860 -220137 46025
20535 207870 218567 -78196 -128136 -151889 -81528 -47732 289177 15293 301268 -4645 -118439
20524 -118439 -128860 -335135 171657 70429 -21848 -51650 158700 31944 -54496 -272894 119021
20512 -424632 -88523 159119 -97468 -148239 -69698 -145464 238689 283540 126370 16755 -124003
20500 -170082 46223 -351108 -156910 7257 -372959 -264842 49608 115274 -35925 174178 -206056
20488 -15589 -145787 183496 -124617 135098 -186703 -26069 76187 -122744 -450615 271378
20477 266258 8048 199504 13155 -226496 -238050 -151435 81426 -137295 -321632 121240 184997
20466 184997 -180717 -207233 -279881 71267 -144220 173352 -104747 -4948 -164052 79 -43454
20454 147726 -35453 73812 -146131 -154816 177530 -40177 -261950 237785 26581 -11484 -42125
20443 -42125 -67466 -66745 -280697 -140271 -132001 143424 -116808 153679 80941 -270322 277165
20431 173034 -65720 -94193 -2832 65617 -95971 26968 -357246 -343359 -49181 -106670 301277
20419 -420871 -106882 8027 -189458 32336 53012 -50613 105548 -406306 -222450 141427
20408 -192545 260925 -234647 -141005 32306 -85279 -611217 -145964 -52408 -48328 75200 84821
20397 84821 -106949 42970 -271107 -95504 -41845 115938 -31323 -205150 -71901 238345 -159219
20385 -222139 54948 109697 -131601 -165910 -20774 226595 -179285 -218058 -182467 -214025 161486
20373 351157 164205 14695 -247446 147318 -273154 82269 -191614 33912 -262072 -77773
20362 -109627 -85776 -22284 -48380 40583 44210 -106253 -30665 -166309 -59120 -55239 45029
20350 -293919 130718 -225771 314567 270869 79759 -305855 -94309 -113721 -39335 -305668
20340 -305668 45831 113034 -100849 184915 -111351 -67768 13129 148255 136007 -123771
20329 214394 -107944 -42022 -368213 -224214 3949 -122320 -407555 -14659 -113192 297704
20318 27522 -504386 -204414 -72067 302555 -73413 -248057 -197673 -144720 -326039 408767
20307 -278843 126701 -71210 10120 -36611 -44672 188039 -6275 -228122 -119410 16373 233328
20296 233328 138636 -9913 -23244 53028 -93713 6072 -96648 175483 13959 -234981 105159
20284 -95702 4871 -125475 -11209 -38415 7507 -63588 -84481 -70926 165651 5568 255831 -288624
20271 -88682 -115913 134084 -119113 -207185 112999 -40523 -52095 -343850 -68316 -362232 -5600
20259 -65770 -94071 -533177 191661 103565 -113359 -133584 -175065 -25073 -188110 -148514 -206109
20248 -206109 -157217 36761 -7333 215252 95386 -575951 -287174 -107533 -46611 -89099 -151249
20237 -151249 -130122 74941 -28220 380353 -83841 -70265 -60652 -74825 184424 -36918 252778
20225 -157623 -39820 52473 2218 -114436 -50628 78624 -291208 -96155 -129059 -181537 123262
20213 12144 -49310 -116829 -71236 -367950 -169766 -162785 -76430 -99623 301534 -111538 29768
20201 105793 60252 110309 208805 252360 -254264 -248408 -98241 184590 -130858 148384 -219894
20189 -23254 37566 95819 -81054 89323 142454 430575 92705 -129473 -267696 -226423 -54753
20177 -9702 -246507 -77656 -113099 32206 127587 -35152 208320 -77733 51905 -296736 130401
20165 97785 150672 -194191 68635 75648 409240 166832 -146959 -59060 28635 -190935 320416
20153 213357 -137824 -29447 -91518 154223 167974 -188357 -25467 64017 -179782 255546
20142 124008 -6547 355354 191764 -51748 372732 -180795 -104366 128376 352055 24362
20131 446792 296669 253895 -39206 309545 -131483 256792 -297436 -270537 -84246 -159374
20121 -159374 -135628 169378 -181497 12190 96885 23275 -152768 -309892 -16668 -3544 -292528
20110 -292528 -93174 65614 -91480 75835 7856 -317507 -68953 104402 -40818 -171998 -183564
20099 -183564 -222873 14173 -95084 22393 224687 68673 -976 208658 -216112 20179 85562
20088 85562 -214891 13530 -364576 -139339 -67522 84233 46066 61890 -6412 -16374 -34096
20077 -34096 -192512 -408870 37419 10285 60504 185142 311928 -203103 -42395 -150759
20067 -150759 -96694 155071 -213827 -167000 -190133 -21155 -369543 -295893 -15768 44787 -55113
20055 -64934 -155813 -29780 151073 -24496 130574 -161354 -74045 -59209 -2148 267549 -287734
20043 -93331 -147456 168148 47152 -107933 -66888 -251482 -181417 -110719 -140488 177466 -219699
20031 29042 38819 -25708 56761 -239711 -4187 -374868 -38642 -162108 257892 -25354 63596
20019 35801 -210730 115621 389555 253691 -16860 76996 -163373 -101604 176544 6941 -25109
20007 101121 226080 -330186 -8003 -71700 105744 -392187 4573 -428622 53710 -26227 -65150
19996 -65150 340684 36437 189744 -204934 -192139 21947 272626 154674 59249 -303526
19985 126188 -159833 -25682 -87636 2656 258089 -239264 -991 267122 -116411 -27088 93277
19973 -399296 330744 283858 -187596 133098 -96378 -101612 -7429 9246 -239558 -52203 -110891
19962 -110891 -237852 -215022 -132792 -30705 189337 -189657 70856 -97574 -265098 108992
19951 141088 158724 202181 3094 150358 9033 -90533 -352530 132033 47831 183673 -85985
19939 -20995 -359185 51103 -149934 -69783 303072 -102433 -129765 -115593 178429 -246145
19928 109176 93855 103247 123445 -362391 -235370 200808 12542 -103005 170538 -224285
19917 -173489 -48200 -41342 -297518 349175 117354 131093 -153417 -135166 16209 -354101 -99222
19905 -53857 -169031 -81756 230102 53116 -51982 -249666 -176469 121561 -32616 83719 -64541
19893 -139751 -195290 337313 -30964 -128107 156742 -11441 -183976 89406 59632 103512 -59893
19881 112191 -279246 -155996 242829 33519 -234098 -242268 -132918 16920 171139 377082
19871 377082 -331150 -182483 -125086 -114205 -119164 26270 -35218 147902 -63163 -122819 -155432
19860 -155432 245811 236395 -80844 -125469 -173687 199818 -57804 -169669 -51762 -46031 129496
19848 -229899 -101642 50588 179866 2360 -148799 -306591 -98846 -137767 -183004 1060 126063
19837 126063 58088 24758 -176241 -207706 -31822 -197306 -129865 -192416 -27309 -26985 -264718
19826 -264718 167874 -245750 -71234 -199086 16155 -192516 -66613 277261 163054 -230654
19815 -159542 93905 -84342 -174930 116396 -445719 38170 37866 -65212 -43278 30414 194317
19804 194317 -144345 -95759 -284965 -426325 -40195 -163400 146328 -20690 -58815 176356
19793 145019 131938 26357 -250585 -30634 -83120 -489335 262181 -17480 -289504 -62898 -397253
19782 -397253 -33111 135289 -65795 -337167 -139608 -172016 111757 165278 -151003 -98625
19772 -98625 -369019 313347 -236123 78489 -210048 23154 -248409 37433 -2883 -180907 11878
19760 -74050 111244 390006 -230251 92480 82026 -142685 215875 -106980 164669 114921
19750 114921 -175115 26332 183675 198239 -80724 61847 165096 -304177 205837 200491 -210452
19738 -112753 64800 -171461 121945 -102974 -44315 95749 -299334 79126 -235083 -33263
19727 26331 33654 252478 246336 442924 29545 223916 185297 130399 -37285 39138 35860 -228799
19714 -98208 -236708 107006 32918 26872 132828 103095 -185912 46469 140902 153196 -12616
19702 65690 257550 279572 82497 64176 140550 -47459 147874 3255 8818 -57551 123273
19690 36048 131815 174535 295811 98821 110328 -489544 -4198 -52093 57455 -147036 -179181
19679 -179181 -216725 -302240 -27162 -135801 62963 186279 326447 -191811 -243521 154337
19668 83162 -328672 71253 47959 -69693 136087 -276807 50202 -92197 155521 -202816 -8803
19656 -143079 -92396 -181670 204752 196330 -114759 27252 153487 -216436 -243595 -156514 -244470
19645 -244470 -116429 -201545 140772 -127019 -195082 456496 131749 -30295 240 -87644 -41281
19633 -299168 -148679 -268705 -281047 -53480 -66146 63299 186411 -227076 -246579 -33743 -223679
19622 -223679 -50468 -49749 -338201 -6262 -205824 -272629 -71906 -240505 102171 -323169 -14360
19610 48939 -297007 -162586 313640 -143044 -232900 -96920 -120591 70687 -203704 329610
19599 26477 281659 4029 80710 -39279 -386075 -173142 -35049 309305 94224 -364886 -137369
19587 136105 59616 -115037 -49500 -157563 61044 -134025 -77878 296932 -227929 188711
19576 -63562 -100536 -273436 -153191 34485 123916 16568 -161577 -432165 -107897 -131909 -430856
19565 -430856 230253 194906 -75267 75151 56115 40337 -309276 101336 -246386 -156729 -80134
19554 -80134 -7894 -240679 34061 8807 155446 131125 -7327 82997 -111246 -279330 -302605
19543 -302605 28247 50155 -100297 -392640 185352 61 61596 -353556 22016 -126884 32375
19531 -111262 -364586 216408 -126227 -6196 94935 -54773 -159258 83611 5735 218480 57636
19519 -438381 -119101 -316823 -330357 -127550 -208321 177218 53598 -284767 -163401 -71910
19508 -54049 -121054 142414 -488510 74695 -334082 9864 -54077 -291959 -322337 -84236 -261901
19497 -261901 34697 -8168 -48088 95447 -75978 -458445 85469 106232 -188064 251342 -132320
19485 -48411 200008 -193850 311154 -37081 22751 -167376 -312730 44944 49920 219831 -147783
19473 -398996 -261892 1734 134758 173258 -286825 -25728 -200314 132013 -199903 -159173
19463 -159173 -180392 -121269 136063 -32937 -1031 -159506 -125817 -308159 -139829 66591 100534
19452 100534 200450 137475 108399 -274958 -260313 -22712 -151538 -111966 -60340 70680 -148130
19440 49784 -30401 -148757 410704 210548 15614 -205145 61404 -268752 68354 -71421 -103939
19429 -103939 -109216 -63432 -143894 -255270 -135472 -15793 -100454 -254200 142820 105336 -129551
19417 90667 -127948 68541 36593 -220680 -37982 37270 -249697 -226087 -341973 -225539 -272148
19406 -272148 4174 158302 -175516 -197536 -214911 -136628 -120565 -326761 64933 214261 -36361
19394 -256311 -22524 -182236 -55409 104256 34676 -56649 321003 44777 -86607 -70494 125434
19382 56198 -115884 364938 -180996 -220100 -256454 -63970 65290 -206963 -91344 82577 53476
19371 53476 -34069 -102652 6947 -251273 223077 -103175 -532264 -69984 18866 -31836 104039
19359 -209111 -197465 -101732 290285 68281 -115237 22591 -53689 -174964 -128599 -270992 272821
19347 -30847 20253 -121835 -73242 -39652 72136 237579 -178947 -255920 -47290 236207 121671
19336 121671 44031 -404093 240863 -114772 40090 -131240 123761 18831 -121539 -243948
19326 -243948 -193124 -203007 -84254 114071 -77618 23405 -373137 -180669 -101390 -421196 -112144
19314 -368833 62752 -209542 383697 167784 -180114 725 -80577 -287852 64476 93371 -22517
19302 -42324 -310125 60089 174879 -164544 -136595 -34831 -28245 -149340 -17685 128359 -97723
19290 -205131 -91605 -120443 161360 -193566 -70091 132057 -62167 -18304 -123864 -149949 2683
19278 -233827 7954 -341556 179619 -275755 50273 -124594 -192631 -345358 238942 182592
19268 182592 -309920 88501 -82555 -67147 105976 -190276 105744 70814 -154385 -404359
19258 -404359 -124910 -82497 -176538 -174187 -302971 -738 -125236 231979 156408 196436 -160918
19246 231493 324964 -29034 -141388 -211801 17385 68557 -4093 -34660 -346279 -36582 55750
19234 145118 140815 -47234 -356091 -121721 -82802 65352 22254 -88375 -36669 2702 -140956
19222 -72249 -72915 -65266 210881 43173 99978 -97546 6626 67394 46095 -286908 -60608 -56701
19210 -56701 197308 -315067 201835 451217 -2580 -60881 -147225 -360257 -67603 -375786 -139134
19198 -84641 -131117 -208074 339804 12232 -54728 -5526 -109235 -128543 -400659 101171 -59777
19186 93304 -255471 -126034 191426 -198140 65764 -258788 -134808 312973 -485221 -169521
19175 106888 -199340 -119004 76851 -177700 -40435 -78558 -637163 71069 -282563 -134008
19164 9121 188863 162847 -73588 -70887 -515288 -89419 -107572 72898 -78782 51180 357718
19153 357718 106547 -166643 -177741 179183 -251745 -399761 22352 -5548 -354561 -16711
19142 -165726 63897 -197603 119864 -57037 -12636 -87990 39809 -39416 -92256 282133 157802
19131 157802 168260 33506 65945 -50999 -188548 58432 -8998 38357 -213117 -20216 -55422
19120 -55422 -269473 -66100 -9143 -177099 -217284 -101590 113599 -70298 -43233 -33751 -278954
19109 -278954 -32793 -183144 -344717 -195440 394199 58031 -117219 109779 -474948 -43160
19098 256001 38019 -214365 -112037 -64577 38127 -126496 -203557 -37972 -198932 75092 -259634
19086 -11010 1116 188827 -119682 124145 20819 18623 31872 -275132 -89931 303200 163891
19075 163891 61011 259625 177219 233715 51869 -103119 -151727 102201 -80062 -236994 -47710
19063 125943 -289419 -15752 -260589 -108346 -309254 146410 258760 -295699 -72193 -114583
19053 -114583 -144645 -110044 64466 -139281 -316798 -228917 171213 63052 -124541 111895
19042 216539 -234434 -152799 -267608 -287462 13927 338808 -119310 119893 -310308 130299
19031 -203776 -254576 -403318 -16397 -156318 107245 150278 -18621 -139276 -200144 -112211 -29451
19019 86367 -66244 -72939 -61017 -220111 209921 -33897 -75718 87702 8414 -164642 170604
19007 43925 -70606 14300 -37779 -286559 -64966 -76102 103410 -18845 -183316 -296027 1643
18995 45404 85724 249142 -163100 -269233 -204402 -346325 -39494 -105925 114428 -67058 -74047
18984 -74047 38424 54615 -141286 -216910 -46996 -33029 -65116 -92594 -122971 -130368 -92433 -418923
18972 -418923 101187 -182173 138669 -261728 49725 -76768 157300 -195803 304730 217403
18962 217403 -19728 -33737 -119433 83243 188802 -139189 -292573 -122844 -353056 48534
18951 -199120 333318 -48617 137274 -190847 -125335 106355 18331 9268 188799 -77368 216928
18939 -21503 157137 -274688 -234721 -269198 -377677 -174663 -344125 -317137 -125071 -122276 245142
18927 46704 35768 163777 -278987 -317796 138602 -106184 77275 -136219 80059 -40521 -57299
18916 -57299 -123960 -43145 279443 229028 -10895 -170072 -253308 -517008 -403605 112233 49401
18904 74894 152081 45344 -99367 91331 92923 236244 179760 255200 83874 -180125 -337962
18893 -337962 -133810 -132850 -91327 -246133 -233651 92845 132488 -1232 -39678 -63521 203172
18881 -322015 -271141 393303 -150270 -98445 115501 54825 -126131 -187979 -92007 -300097
18871 -300097 306467 124249 -129252 -257113 34423 -189944 -5751 -259109 -221926 -38688
18860 117480 -64701 -353493 -6486 -98991 128273 63971 -138649 -169043 -118687 -196352 202532
18848 177356 120908 -154870 59274 -169256 -157498 49971 -477657 -33045 -292456 -50204 278890
18836 109147 127920 -184581 -71731 -45900 62135 -119615 -7813 -193329 -118262 -238623 -339042
18825 -339042 193714 436497 -167827 19224 -155590 -275898 66495 -63534 112978 115774
18815 115774 -40696 -170806 -314291 -250760 -52919 172240 -57547 -197074 140779 178749
18805 178749 -147530 -89539 -209987 -139028 4821 -209528 56489 -211828 -66566 -73788 232050
18793 -67610 191402 -82929 -104085 -80170 39327 -349412 220027 303049 -39009 -36201 144 52299
18781 52299 -102527 -385049 -362371 61261 -82791 -79226 -124609 126118 -137967 -63640 -13413
18769 -90569 135668 243464 236979 22123 -195057 -175478 -316001 -327382 2137 -188527 204074
18757 -301427 -148339 58944 92993 -258603 -226820 16223 -146259 -322943 235523 118793
18747 118793 -125902 54506 -73543 -344791 -160221 -12801 -256481 120434 -272804 -131982
18736 239413 6699 -137937 -119891 -133415 176392 -160623 71074 -5813 -179049 -71753 -603094
18725 -603094 286687 269567 91918 31804 -197658 -310670 312898 -23078 149090 180980
18715 180980 -60654 227370 -302047 201707 -16964 50461 16178 -368532 -122854 76552
18704 90224 70989 -284109 92441 -241460 -26782 -6418 -5604 -53083 -7146 23509 -64929 -191662
18692 -191662 33785 -134507 2364 -76600 143099 -16734 -48581 -318862 198624 -88997 -46316
18681 -46316 -128733 -202007 -78176 -49029 234836 -8338 151772 78090 -61714 36251 139434
18670 139434 -76388 -367010 92222 -322255 163363 36057 -74934 -103360 -219695 -156794 -13737
18658 -298190 -135234 -178775 97283 134092 -59421 -218583 -220056 -73104 165496 33041 -54674
18646 155732 66613 51648 -186371 464036 -216479 26444 32097 48880 -172046 -44508 -108656
18635 -108656 -200867 52397 -28051 -401629 -270945 -553519 119188 -227704 -15146 212644
18624 11030 -48452 -102682 135457 17470 24049 -87663 182957 188497 -183354 -65695 -153627
18613 -153627 -102308 -225053 -14502 -82182 54174 -13843 -42445 -52818 -204661 -67446 -39760
18602 -39760 399997 6058 134722 -1569 -36258 -111711 -22538 18707 -204191 -229968 -227873 -27221
18589 -23198 239562 -31321 -147935 -128986 -43661 164019 71596 -72017 48656 36742 318974
18578 318974 -64379 134176 51714 50114 -384543 -227575 62217 -180476 -259418 171667 -84979
18566 -170247 -15667 -237807 -138507 -111559 -182456 108895 -271147 412812 417369 -92830 -180512
18555 -180512 84972 73573 -310591 -236567 134245 -128266 92376 57773 -252022 -162280 80974
18543 -124828 3143 -165842 121388 131547 -84790 187676 -264190 83374 -183063 -123755 123303
18531 -202170 -37753 -7906 -216622 23611 310795 -101424 218673 108466 29500 -133106
18520 -192652 86155 -35505 -513731 96543 53521 137641 -157093 -87285 -197776 12990 -62215
18508 136499 -216494 -106406 205981 -150649 -145245 -127109 -95815 73168 -49535 -14520 -407031
18497 -407031 -63823 -468504 -17630 492007 -172630 -85394 22254 57002 -62085 -78742 107925
18485 56398 -118754 37305 -312718 -334386 -44487 -247083 273754 -134180 115306 -185463
18474 -100307 -28745 189981 179561 193899 166526 -238131 145482 102519 22357 235259 -14661
18462 229123 235325 -185531 -63347 78832 -170346 177016 -115741 146903 68785 -309252
18451 267841 -102521 -192902 65067 -160661 -21255 69 24262 -395352 -100973 -264828 -250110
18440 -250110 240884 149761 -22413 -87200 223180 -217272 -269848 4960 98881 -181547 -213162
18429 -213162 74974 142922 256115 -152267 -243862 -74694 147074 -126285 228428 -39364
18418 -206558 80964 -133992 6857 -177262 -153744 -135246 -208781 260649 -138860 -233937 -228385
18407 -228385 -227226 78466 -114698 -267557 328453 -46063 -613457 59726 -234401 -378997
18397 -378997 18481 142977 19812 -7022 -19865 171712 77434 12478 -45949 58884 -268165
18385 60101 360425 190184 -252722 -220175 -115151 -116553 26958 -262705 -414162 17551 -227177
18373 184690 -126515 -242411 34134 -61195 -430732 43986 58777 -295861 -62773 -50593 101671
18361 45223 -178391 60756 87298 6574 -69758 -47741 -10714 180296 -275537 -364209 78546
18349 -11197 -62385 122952 73673 140673 -387059 -288947 117477 128782 -23652 -91707 13769
18337 -201719 8826 139662 -29523 -293310 18031 -9516 163721 267202 159051 158481 -31813
18325 -105468 82040 60338 51885 -346750 -120655 148845 -369975 -246272 -12686 -104896 35795
18313 -237218 -123235 195747 15475 -48028 140520 -105462 -41868 -286560 -15581 -213134
18303 -213134 25441 -89158 -76907 4558 -217081 -10428 101588 -20718 -131189 -4815 -35987
18292 -35987 200149 66884 -189136 -156955 -306286 -170975 193597 3285 -13914 408104 -89350
18280 -148611 369659 1607 92959 -287892 112430 -37438 3677 -235318 -154486 163334 -45276
18268 -232708 179556 -128191 357258 -283679 294779 -183324 -428625 -2340 158767 9034
18257 187670 -115504 162454 20067 38740 324906 -127734 -151537 -1270 89526 -63214 -203838
18246 -203838 -126563 -24692 126649 -192808 -71506 35080 42846 -94494 -21572 -46942 -109685
18235 -109685 16211 -223304 -245490 -50218 -54546 263859 -263526 30733 -39480 -290990 -1428
18223 -436909 44905 -476478 36000 119787 -33567 158321 25911 -60079 -252393 57416 -140243
18211 -242057 -217159 27250 -144956 -103033 -127537 150757 -87302 -262515 71837 -147489 -127120
18200 -127120 65158 65959 -135405 -233476 237751 -32697 28924 -508947 -120597 64534 6872
18188 50773 -205904 236956 -79527 248029 -63741 -105189 112031 -222161 -127028 -214269 -275629
18177 -275629 -20326 -178175 -203608 145815 -227792 -154951 17868 28235 -233121 -180358 -293852
18166 -293852 -224698 177584 182029 -33 51034 -93652 -16093 -91073 95814 81763 195106 -229438
18153 61203 -108479 387798 70831 -48967 -148545 -82456 -124679 -82511 -36356 -128455 30161
18141 59104 139971 51798 4378 -168656 -167374 -53583 -33136 -179093 -160941 -250018 434499
18129 -60927 88333 164458 -43390 -382344 -15869 23782 -62152 244806 -81039 -141047 -119349
18118 -119349 69539 -23152 -353827 -140718 114309 -101374 40876 42465 19364 276452 -135445
18106 -114238 -106135 -371648 -37799 -380673 69656 171620 2709 121670 105841 9907 -94127
18094 113547 94331 27619 -493209 -129765 -54361 -120051 176625 267773 -335 12329 427512
18083 427512 356120 262890 -2932 -176858 193066 -157184 -20608 -142127 -114480 34550 188670
18072 188670 348293 -221539 96838 166884 103686 107875 -153952 22649 112560 10764 -81258
18060 -51605 -44994 55212 304676 -142625 -2238 -257128 17366 109211 -10492 119316 259470
18049 259470 -23018 -39944 -25578 50287 248415 -372972 -299322 -7937 -20894 38699 -126656
18037 -283013 222377 100158 91864 -4763 -240424 120305 11561 -413810 223778 -98252 58283
18025 9696 -57349 -51873 -613 -172941 182555 -12801 -293641 -377768 -231616 60439 83842 130045
18013 130045 108298 -224555 69705 -206275 -101983 525511 -14828 108182 150438 -65746
18002 -24603 -89500 84178 -218857 4708 14156 -14912 166398 129976 68488 142425 -106232
17990 -7090 -463259 -19941 48089 -25215 27023 -147833 -30369 -106757 34791 39827 -152055
17978 45836 57384 -289715 -20579 117079 49569 -223453 -107586 -249305 -1931 46606 88947
17967 88947 86270 -219399 -145484 -243952 58417 7566 71462 224289 -303337 158767 152454
17956 152454 -173401 -33412 -377093 -106063 274507 -241587 -251150 -242268 147395 -59710 -53446
17945 -53446 -234128 -100831 403425 -139058 -123683 -172366 -260472 100494 -35293 -209342
17935 -209342 16561 -76951 -131209 218195 -182024 114131 12775 58717 -162890 -38683 -71954
17924 -71954 -91139 28949 167369 -41319 84158 221171 282679 -158783 54886 286089 -41144
17912 -251837 58361 -260557 -74485 -274846 99307 -227076 95313 141845 90023 109090 -295048
17900 86844 4414 -156488 35226 -161705 -131614 56381 -150391 306323 68581 283410 -3057
17888 -309246 -183504 51886 -317042 30844 76256 -62580 -324616 221563 -36321 -116342 -49996
17876 -139745 54829 126077 213765 -22514 183693 64002 -102765 232742 334736 -248819
17865 -200566 -12591 364969 80355 135702 78830 -198426 203762 -2790 182872 -262820 313934
17853 -27626 -361715 93654 -469510 16858 45864 87811 150150 42470 116252 62621 194690
17842 194690 46145 -21891 71762 85702 325191 -171917 -4713 106766 68557 -231053 38070
17830 28101 345665 189452 409734 -22449 -43052 -58744 -272042 -163169 52019 36657 -16079
17818 47761 123091 136666 -107111 221136 64310 -46537 113105 16203 70073 175667 57052
17806 81873 -411736 -64167 388317 87194 -10244 45254 178603 10983 -27171 124704 141306
17795 141306 152417 -19868 248069 -205486 91839 -55917 -176555 123847 137990 65103 76109
17784 76109 49413 93845 42677 141207 -134727 145335 -20644 -290428 -186623 31509 -35973
17772 -97478 36676 -62462 37100 -195684 251320 -156841 87283 -224486 164490 -145856
17761 65804 -117509 -24363 -155582 -10202 -94061 131850 -39063 109575 -92499 -17039 -127049
17750 -127049 38388 48222 -161908 16352 46350 308186 -76331 -141581 -81645 -213039 -124354
17739 -124354 192957 -5885 -4895 129612 43558 -224845 -142624 -70540 162944 3594 28498
17728 28498 -8339 28484 -211082 201906 -187286 -60070 130655 -47958 148276 265055 56270
17716 -164639 -54426 202188 32623 176030 194363 -80469 320870 79805 224786 141365 129710
17705 129710 72148 -1483 16190 -105316 539671 -45612 109534 185844 45871 48102 -178947
17693 -10304 -108474 -84257 25922 -390887 293625 153716 -90261 -34275 126919 73107 152641
17682 152641 -73196 55073 34165 43749 292352 -66924 19521 -13747 223643 351321 32141
17670 -161701 -322500 110639 146944 269757 -847 -232977 -66069 47032 130382 87998 -128068
17658 84760 -47468 33760 326880 39192 24747 -111831 292165 34226 225021 345764 -188133
17646 -67800 42386 194695 161048 -93617 66427 -20088 140447 170682 284095 -81037 339131
17634 -49974 11192 113219 297195 189856 56112 228553 119633 -222196 72307 118140
17624 118140 -2318 -264036 49025 -320298 201910 -18368 -26210 70043 -230764 64817 -159586
17612 443919 -102709 121988 52476 142720 -194271 83497 28388 40182 100543 66243 22797
17600 308436 -272551 76352 17626 439189 -51190 10373 -144982 157844 172859 5944 -5718
17588 -94343 348506 -177832 44383 15956 -102195 164514 162445 300293 -84884 127214 564428
17577 564428 140682 72201 126511 126662 57482 231504 -5435 114955 281636 85341 -47644
17565 -95485 -81176 -26424 62783 180071 -31121 237450 293463 -109708 -29440 -3396 -222442
17554 -222442 216402 132435 133067 6151 206836 -21851 190189 283039 242472 302222 73864
17542 114034 277023 -278619 112524 304897 56680 -198701 140472 -57969 574394 318649
17532 318649 236551 -118651 42265 -52454 114012 202365 -126129 290599 167204 187640
17522 187640 238981 140150 33688 64882 20053 255821 157368 226082 -2946 -59523 -186963
17511 -186963 -39283 397008 246560 314213 264866 311400 246254 240176 523531 73744 752792
17500 752792 329437 118649 210076 -146080 155565 233154 128053 -244614 78533 406966
17490 406966 263421 201869 -51936 33784 199950 171814 111309 322354 362430 122330 -107426
17478 130484 495629 391127 -3940 132604 427888 200373 -104346 244084 105174 139439
17468 139439 172713 458 5079 61233 123570 196775 -177680 -116339 50067 314521 -276867
17456 451206 308416 -70079 130374 227014 -38736 -146597 563043 555975 364176 70387 393728
17445 393728 246930 447465 501989 436288 63404 195417 69568 340699 225436 169495
17435 169495 561299 65429 219268 110903 149553 457865 -84157 420310 139516 167124
17425 167124 180778 87746 -70956 315417 357736 7080 273257 130035 340287 53954 251873
17414 251873 434741 444365 271650 354588 96391 143222 232771 308397 123677 -91948 155115
17402 201712 251744 155852 439622 373963 425514 236550 184387 -161105 465298 -65908 124894
17390 183856 252649 285692 2806 132785 257213 -106872 253126 155033 160538 140841 -6811
17378 -107413 55988 98640 332152 -89218 -48514 -98948 191627 214914 -421024 -6650 154772
17366 212080 127406 108381 218975 387921 -18838 119058 20310 239426 155371 282789
17356 282789 -54171 258229 44005 311385 148440 33587 124122 51400 383645 320106 46561
17344 168021 198047 266957 355982 74089 355619 36150 117233 423936 223823 253399 157732
17333 157732 280414 485444 273161 295862 167904 -10113 561668 319462 144332 206698
17323 206698 190497 412939 171300 477978 133399 11836 202209 48077 -22190 212842
17312 20744 305734 232835 63213 484955 -80782 39252 420996 194246 36356 2235 236351
17301 236351 191680 86070 278609 29349 -118561 289310 233221 167530 -49343 120052 37850
17289 465129 256565 438528 341297 365386 168450 21517 109668 236760 94178 250008
17279 250008 195505 382940 -19660 120013 113056 47054 462995 192942 503349 269266
17269 269266 124348 461285 211436 198858 128380 573683 381810 328734 224126 475675
17259 475675 241651 63898 264716 92456 223932 343200 -5299 158745 479295 303027
17249 303027 303190 288678 406702 534475 109529 529232 563103 71952 160168 484297 458154
17238 458154 -154682 491758 167463 26335 411080 320929 56523 345432 48861 165857
17228 165857 113340 360720 -63450 410507 340301 35833 121363 244483 434288 383012 435253
17217 435253 276827 74302 568344 277524 255794 411461 113990 210509 111798 310748
17207 310748 70747 225393 282851 315587 139771 317219 295000 161406 352710 563304
17197 563304 174220 534842 402340 285293 557692 -7271 566045 151195 502278 436023
17187 436023 485449 85983 282204 45368 281416 48208 -50617 277267 272205 355276 214239
17176 214239 216989 642097 416278 337020 460719 349360 15668 354799 148237 494034
17166 494034 405577 282030 253965 470038 399484 298865 561234 432541 349205 603816
17156 603816 511043 534278 277231 384261 290439 432048 281849 258476 363279 467476
17146 467476 507371 552971 554751 426685 406540 504447 551807 463188 345523 205338 225842
17135 225842 675033 585312 459063 325044 457638 367253 100671 324879 238806 425230
17125 425230 427714 586763 587972 350304 421227 569974 196032 354647 311542 426438 352037
17114 352037 365578 419828 570067 352011 486221 1035418 419913 590161 479390 21591
17103 501943 491917 479714 396003 196356 518073 435182 574821 503575 323350 474849
17093 474849 647409 493964 453880 915062 218358 713419 435330 652520 737109 332321
17082 983688 963339 640016 572602 751959 778046 562060 356022 755159 749349 702164 791362
17071 791362 394327 425523 405767 228464 844390 839984 462645 349833 493407 666951
17061 666951 389393 580821 793795 864833 849081 749768 482068 549445 737636 872226
17051 872226 329974 754278 728634 662451 546493 808201 497666 952914 600769 862373
17041 862373 531519 668526 1237670 689717 610314 984774 890589 763778 808416 606794
17031 606794 514093 817596 385713 656041 695047 839226 1001104 861266 822095 823596
17021 823596 885370 928999 821933 820779 1200229 610288 956196 1037460 724174 798480 1104564
17010 1104564 933272 1055791 801149 1002456 624615 1111283 749944 977186 843214
17001 843214 1001877 1133992 1080482 836350 668814 1053359 965003 880075 1067342 1055754
16991 1055754 993543 988725 1125050 1022591 1191873 1323411 1279625 995865 964843 1286699
16981 1286699 1362798 1184345 1112408 1190371 1335033 1121829 1194504 1296208 1491399 1500870
16971 1500870 1493052 763294 1364426 1601574 1390398 1185770 1564533 1415920 1305660 1189678
16961 1189678 1572061 1678462 1387294 1475622 1717055 1059998 1654587 1491604 1317760 1667330
16951 1667330 1619106 1752132 1589193 1437949 1744891 1854809 1764011 1867916 1522145 1624048
16941 1624048 1990513 1580393 2028047 1663177 1786106 2014838 1838868 1722248 1838244
16932 1838244 1603905 2131932 1852070 2210741 1938121 1967252 2297573 2032471 1844852 2054608
16922 2054608 2080741 2124836 1973991 2262444 2284461 2026713 2330532 2419607 2481338 2285032
16912 2285032 2535870 2432607 2436044 2610079 2543046 2858291 2481737 2653231 2616110 2629795
16902 2629795 2412027 2807285 2739809 2707935 2806563 2950087 3134710 3088211 2821308 3272233
16892 3272233 3170482 3127515 2807842 2842819 3210582 3467414 2628092 3350967 3283070 3449397
16882 3449397 3430142 3278478 3431186 3588903 3701326 3684013 3964420 3897813 4081782 3708763
16872 3708763 4138225 3920792 4145702 4237867 3818344 4034887 4251673 4423108 4589278 4582263
16862 4582263 4437892 4544121 4553697 4757775 4808011 4882794 4915016 5062106 4857516 5243281
16852 5243281 5576193 5332748 5380660 5794713 5835076 5808527 5782628 5972175 6272003 6137308
16842 6137308 6312435 6662976 6794672 6775762 6768451 6972914 6690493 6910104 7196128 7290130
16832 7290130 7574204 7776895 7804515 8015945 8246625 8103367 8257396 8768265 8871507 8909990
16822 8909990 9291415 9221087 9470948 9690747 9822811 10191083 10514614 10626006 10609766 10743108
16812 10743108 11508651 11522925 11912625 11975050 12319833 12379881 13014732 13128229 13250526 13674284
16802 13674284 14382974 14615307 15036429 15167486 15298057 15887020 16564395 16732636 16956516
16793 16956516 17534491 18021124 18334032 19208376 19616241 20286134 20931015 21039207 21829663
16784 21829663 22704188 22760055 24051646 24543680 25322709 25617369 26504017 27442849 28468007
16775 28468007 28821547 29972355 30876042 31637643 32679225 33570976 34930909 35972558 37001291
16766 37001291 38304290 39571485 40570889 41902026 43164721 44562361 46212232 47363478
16758 47363478 48822793 50208783 51956491 53294124 55217993 56610690 58503745 60303343
16750 60303343 61900107 63792820 65320034 67412056 68644723 70229290 72309846 73931905
16742 73931905 75351677 77168111 78614932 79966226 81171235 82524837 84098663 84416371
16734 84416371 85519107 86484651 86691904 87445941 87704324 87692397 87765421 87631361 87339490
16725 87339490 86921575 86485214 85480685 84754831 83635927 82198776 81369815 80018897 79008819
16716 79008819 77326640 75619325 73754017 72715476 70832844 69086268 67427034 65652745
16708 65652745 63879875 62182545 60805056 59046531 57164231 56074847 53950243 52738308
16700 52738308 51646139 49559795 48636449 46821264 45550426 43983075 42883241 41830887
16692 41830887 40444318 39542364 38227275 37135101 36108970 34977905 34070991 33235574
16684 33235574 32152438 31449591 30560805 29876505 28698075 27992205 27207872 26845215 25949989
16675 25949989 25527197 24642675 24185685 23709331 22758428 22349976 21812850 21086692 20670202
16666 20670202 20260551 19919415 19517147 19007947 18342075 18155216 17703990 17159108 16767619
16657 16767619 16687362 16052948 15893757 15593119 15067425 14840752 14732640 14236577 14136313
16648 14136313 13452241 13436333 13045747 12913826 12651092 12419234 12042190 11838970 11369641
16639 11369641 11546191 11288427 11253433 10981796 10501276 10566176 10303684 10053538 9710434 9856364
16629 9856364 9351726 9142815 9409790 8683678 9170426 8825255 8581000 8704242 8383394
16620 8383394 7974519 8088692 7951580 8150409 7684721 7762543 7679549 7536000 7414004 7082069
16610 7082069 7245040 6837277 6930420 6839606 6610550 6722856 6608907 6510556 6383781 6369662
16600 6369662 6160610 6073281 6469107 6077482 5894462 5677968 5495942 6049369 5530019 5658507
16590 5658507 5312077 5836893 5346744 5287607 5271035 5102737 5180981 5397650 5079896 4715894
16580 4715894 4862055 4633550 4890106 4550759 4594658 4761651 4146424 4236342 4597623 4306875
16570 4306875 4178053 4327502 4091890 4257200 4153531 4226737 4095718 4153150 4197119 4075644
16560 4075644 3989779 3806441 4030870 3658608 3701720 3561856 3717176 3541977 3532726 3503040
16550 3503040 3598174 3373134 3490779 3176014 3467908 3312586 3289873 3401443 3422439 3199327
16540 3199327 3502741 3375550 3343858 3245951 3058059 2700631 3185336 2836608 2839617 2726573
16530 2726573 3046387 2937373 3058436 2803660 2904897 2691785 2945541 2821358 2590850
16521 2590850 2748175 3148740 3147062 2696758 2386821 2642837 2252769 2592490 2934726 2995137
16511 2995137 2366367 2750018 2297360 2526024 2298641 2577655 2263315 2230924 2585365 2491003
16501 2491003 2435744 2401347 2444057 2205491 2376437 2194016 2327589 2497874 2100589 2470435
16491 2470435 2308041 2148474 2476405 2094260 2372155 2464641 2127049 2309267 2219124 1975943
16481 1975943 1793292 1854468 1925015 2048864 1790343 1987832 1933698 1867830 2036229 2203496
16471 2203496 1795447 1982259 1944669 2276079 2137046 1706601 1825018 2013044 2099502 1897034
16461 1897034 1673290 1619487 2062155 1800951 1916061 1895876 1858443 1922367 1799474 1685706
16451 1685706 1754978 1913089 1739345 1345997 1751801 1498266 1554314 1608074 1542635 1503376
16441 1503376 1314055 1514742 1588084 1290457 1340165 1537739 1662574 1589797 1559974 1303140
16431 1303140 1600335 1339902 1968969 1647924 1689106 1453401 1546413 1320892 1234108 1258093
16421 1258093 1341330 1432115 1517337 1228361 1357398 1219181 1549198 1558593 1171576 1595388
16411 1595388 1644639 1551036 1361611 1467886 1365978 1490219 1211190 1416305 1437270 1186584
16401 1186584 1153160 1363299 1484444 1803316 1173905 1185261 1162325 1389531 1529830 1227271
16391 1227271 1404595 1497214 1341349 1264626 1158924 1191825 1052739 1501167 1366329 1390323
16381 1390323 1394949 1042361 1247242 1533241 1197901 1193255 1451217 1456989 1232863 1076087
16371 1076087 1062401 899351 1224237 1596585 1141225 1076404 1160813 1064020 1098768 1068805
16361 1068805 1054747 1058747 1166453 973643 1043287 1084522 934943 1157964 945380 907113
16351 907113 1244192 1242067 986586 840376 1089389 943808 1245844 1100122 1030004 1127674
16341 1127674 1198887 750703 1043845 1109417 1023368 1320622 874205 1304993 803434 686538
16331 686538 919655 1042217 658189 946524 824441 1218658 1212346 935587 1071941 567845
16321 567845 905942 1006156 980092 952072 1080460 958464 731374 796652 1006056 632458
16311 632458 879997 758440 626760 1083954 1058109 609826 841959 1150685 832824 900559
16301 900559 721854 1019437 898545 598935 1068286 1057210 798537 814839 907628 1104840
16291 1104840 839001 605965 814102 491751 918106 786497 870570 641499 652299 778597
16281 778597 725458 820935 653016 881165 638307 501178 793400 819698 830395 367523
16270 639326 711474 712536 490526 703193 968580 1116109 743788 793097 718991 704179 856953
16259 856953 717915 906798 512366 721898 708583 452521 835563 615436 709177 961617
16249 961617 707521 644850 677073 806955 696532 850633 827874 484450 391219 822695
16239 822695 787552 851512 668714 741672 795870 695029 738419 466019 941262 463847
16228 473302 613065 471060 478225 558587 666144 626298 375249 732028 341038 620584
16218 620584 499817 596007 730101 404227 453613 499157 500461 448619 250701 393391 466397
16207 466397 266881 658308 471436 525455 953744 419369 401247 528343 686417 504263
16197 504263 502673 568696 584789 364318 336868 363990 685137 575777 571523 569389 406512
16186 406512 338526 690566 439740 485019 379303 404420 488580 510945 596753 475675 448445
16175 448445 383521 339290 385358 490312 187726 685721 246079 277035 394594 308784
16165 308784 416734 495032 535838 706029 329822 430976 773653 470455 480852 413505
16155 413505 310794 455300 555162 554838 286137 342176 369234 622962 324574 195756 341791
16144 341791 359070 240794 199614 241629 639352 142599 593516 486232 146518 807589
16134 807589 748206 387730 424931 332370 215286 273381 344484 369514 238726 338283 235847
16123 235847 277761 411158 283418 456995 212839 264668 242646 252094 -146605 131731
16112 754750 300471 439970 409152 396188 592281 67785 151739 136413 362473 63227 -2287
16100 464935 292157 82239 -13633 362685 434083 430177 122860 329649 180716 220720 156073
16089 156073 362078 617922 202603 311300 -122598 630287 325508 395759 670418 331466
16078 368250 -38678 -70539 345678 302649 255022 162760 -39759 117214 185870 426930 -26810
16066 42265 200572 -109154 300168 153993 201862 87486 352397 147666 -41878 155010
16055 151566 244440 178462 261415 270498 482423 19643 233412 99343 152424 299502 221758
16044 221758 26406 315245 266463 208082 508429 -68586 213513 174221 209057 114170 80321
16033 80321 -81320 -209365 151281 187022 -42231 75041 355128 262959 -35918 240813 24281
16021 415732 68848 75358 47276 115004 359898 186238 333199 128059 -81037 298485 81061
16009 217458 339084 143768 121337 151444 273664 364246 5605 21160 167062 -75828 -7808
15997 -120588 -143277 -165094 353065 501996 420804 92164 71981 -32035 101937 376418 139983
15985 124021 319296 265054 670902 175474 209892 285421 198809 166516 94606 158881 433954
15974 433954 200094 265673 452210 62772 -247016 11493 424112 -93004 8519 93392 95844
15963 95844 -8002 105783 14795 73657 -74349 204205 -136856 19898 -160917 6235 8613
15952 8613 211483 -7155 -266674 -13561 80374 37701 -179340 133440 27573 -210345 10990
15940 -211646 -61894 159351 -134497 249602 159238 258831 85893 107033 -40393 137321 129739
15929 129739 92403 -172816 -418913 328070 103588 100644 -33469 234908 9774 167519 -408079
15917 67045 73241 177484 -116 14000 -209806 162195 323109 -9961 98496 99876 -34228 58552
15904 14451 274770 21115 21938 -85417 -106248 -46147 16502 54875 -97124 -343059 393809
15892 -54597 -40950 1895 -94606 232947 119755 -175093 86290 -164380 -116993 -42701 15375
15880 79585 71318 -100094 -255940 7032 50195 -133182 89748 -59986 -146493 340759 233392
15869 233392 -23008 -97030 100270 -30287 -102662 -41472 -245067 -6818 -29766 224459 178922
15858 178922 153529 458636 -2221 -202308 -79380 19230 -49473 354473 140477 -89206 -355856
15847 -355856 240856 -32535 -223418 -90070 -196242 61147 -163543 260584 -214513 -221863
15837 -221863 44389 57776 327510 392275 35104 184326 -116507 134258 -169847 -69323
15826 -42164 -172571 5696 -181258 76495 -115501 -58972 -310110 3874 -38585 287838 108121
15814 -61950 -83740 93217 -62519 139487 171517 -141696 45971 280050 -16959 36758 -42837
15802 115390 -111841 -342873 210352 157264 107066 59539 -110399 189351 -397205 -97874
15791 205923 -62576 -39678 -62390 292841 80636 228534 369809 48257 8421 198501 182108
15780 182108 -176652 -207635 30324 -271733 125626 -192258 -134751 -157689 155786 132168
15770 132168 255061 151633 62027 -156603 -274796 192611 -17144 -67022 -292469 -162755
15760 -162755 91029 146269 -137028 147962 162700 299994 143337 147921 -122447 -58052 -18986
15748 -271311 113061 117910 244378 -151919 72556 -7692 -53914 -80395 -155764 119564 44484
15736 -116717 55839 8713 60005 -41916 -317267 45314 -184695 -33985 -73843 34431 91228
15725 91228 -62960 -178745 -17538 103735 -98001 -282966 25671 69418 -225955 208671 -317413
15713 113402 50278 254307 -16388 -105562 11010 -231387 -237114 -407637 -373350 81014 -1114
15701 144283 48151 -87027 -111926 231759 -184218 245728 72922 -233466 -127493 30280
15690 3760 -123801 -46933 -434461 25904 -24634 175724 10619 307418 225373 57438 53127
15679 53127 -239207 -44742 23557 16924 54692 292491 -205710 -89734 -118644 241802 148133
15668 148133 -185739 50273 -220242 -91704 44196 -315821 -166543 680 -125623 220398 -311511
15656 194891 281954 204551 118259 -173574 -227113 -143166 -170195 -38012 158946 -51969 -248845
15645 -248845 247054 112418 -86707 -241331 62644 -242502 -129371 -170243 231514 -250361
15634 -55392 99816 -83775 -180886 -281781 -94162 5446 161824 -11812 -67531 -270034 -140270
15623 -140270 -15200 18080 29432 296205 -328210 180986 -114433 -178473 -125150 99546 165640
15612 165640 -170766 -4562 -336359 19457 -180149 269986 -30965 -343209 -14866 187900
15601 116259 34724 323 354503 -236806 -95492 249558 71233 -278117 -109781 -39428 86462
15589 24732 -91100 -178543 -14354 110465 -211418 -73430 -84916 -25025 293097 -121452 77209
15577 -41573 -35021 60033 151452 27618 159330 69622 140354 -332359 -38321 -114995 -73789
15566 -73789 -160588 30645 -51679 -28349 139029 174713 59647 -159262 -40578 139016 93355
15555 93355 135013 -31990 -38857 -196891 -13231 -14475 57620 117017 69181 266086 57997 262834
15543 262834 157014 153765 -106751 -26731 -84401 -187330 273721 20588 49225 -100334 81433
15531 278840 375546 49915 115305 116270 -147143 -193050 189375 -12952 63831 -122341 12710
15519 -44791 57286 180732 -40982 26177 -43546 -6248 55448 -138023 -23466 -91110 -280025
15508 -280025 -254 103360 -38556 -196392 -117421 14789 82478 107178 -63464 12838 22524 -551
15495 -28349 131086 -185549 -76843 21404 58926 -182406 -31250 13899 -32616 -24202 -178415
15484 -178415 169356 -208818 -47245 159490 -377621 250944 33268 2941 210057 117494
15474 117494 331397 -172346 70256 -36258 428663 20731 -334230 121840 81698 93527
15464 93527 -72635 270630 -341990 62280 -45258 132972 445080 -109932 212070 -30910
15453 44472 106756 -51056 -47751 -301 -7892 34341 -22100 117783 -62960 -24755 346776 11392
15440 148646 -28583 104692 -214340 197358 -334138 24351 -96210 -273218 -48339 66249
15429 25257 -25750 305207 -409767 44109 -266285 23672 21694 108037 -81528 -48748 510868
15417 -59714 67758 -244273 138162 -196627 33963 161226 364852 155164 -175727 10652
15406 318115 -355900 -261270 236893 -187760 -345230 -15352 -97871 -230311 -61983 55444
15395 -99067 63896 -224955 5973 -47607 -22703 -74258 14096 -163002 98513 80816 -270784
15383 114089 -179233 191458 8421 -346475 137573 -24240 321685 33296 -110704 -323840
15373 -323840 -186334 -9808 -186875 162307 7210 -44060 -1045 47791 127549 -3762 -450189
15362 -450189 -137533 192801 95044 -103988 179566 390207 111845 -102248 -3958 -76305
15352 -76305 457 144506 114470 394258 69773 74301 61425 384905 287769 40212 310659
15341 310659 269963 33664 175222 357746 269239 -34084 -147540 -181077 -47139 83355 -72692
15329 295420 280205 -34994 58889 144118 -175319 -249301 -94857 -74941 -23830 -180980 200635
15317 -158417 -33609 171749 188371 -21684 -206141 -16041 125249 385155 369621 131942
15306 -193117 -15903 235660 -227200 -79985 -622 3814 117812 -39643 -9225 -21233 84487 302582
15294 302582 -149780 242551 -92458 253045 -120701 -4880 36947 -48133 122872 37649 49057
15283 49057 -168686 268785 -14688 72596 3302 112632 -101066 320532 -133441 94162 -115413
15271 -37367 -249842 -26216 -166481 179661 21120 45297 260881 215889 178260 2434 62568
15260 62568 221630 -115082 62572 277297 183390 -150418 -309140 200303 -36734 -34812 -3679
15248 -220384 -107429 240215 116503 341536 307418 495005 902616 2389037 1594644 2051185
15238 2051185 2191016 955346 695639 46058 -155248 105889 151843 226981 172411 -52286
15227 50541 -262723 -188010 148824 145116 417323 121247 144058 186165 -44769 -112694 -194740
15216 -194740 -82453 -362197 326654 -213730 36841 -186141 -193745 -46949 -107711 50814 396973
15205 396973 -4141 21984 108552 84745 -442985 7142 381378 210765 -17566 165452 20492
15193 10382 -96099 106945 117307 5951 252612 287299 295440 22640 251679 -28030 243326
15181 437138 -293258 -207585 366921 24647 -48926 22723 327615 -120392 100795 155698
15171 155698 169383 19660 165986 -87346 5675 -27826 482226 218569 -64571 377739 365106
15160 365106 245631 41831 -73073 385064 125322 71103 -167327 204259 -67924 52280
15149 172617 -105466 138333 -105188 -168674 -30039 286533 4948 81614 -191819 -215484 -246563
15138 -246563 -97428 99139 -98773 -87171 -138618 180929 31792 -34381 73738 165178 336248
15127 336248 76324 143236 15574 273430 82558 -167316 140113 89438 -7691 392138 154396
15115 -101777 75127 69253 100863 633231 155373 333059 281244 118160 235576 83355 -38784
15103 108793 100141 163353 -290723 124753 66102 109167 81589 242130 117004 -118546 -61231
15092 -61231 136610 278010 -255747 297105 237922 113690 195301 269773 29241 386138
15082 386138 280276 -34778 97378 -117544 -34643 -101306 21474 291432 -33226 -148024 73009
15070 326 94317 437514 -60570 -58600 12227 -464521 328159 257043 35148 -69849 14271 -139771
15057 26008 290552 -92836 202165 214029 58341 173570 -41859 -108554 -12715 101168 167605
15046 167605 81603 296020 197367 368531 685195 167709 380826 83900 199620 260228
15036 260228 316004 276194 -332701 -4690 202150 109294 304485 135736 202808 77837 173483
15025 173483 416410 158746 71395 12832 398138 15845 575362 170838 -52510 202158
15014 274992 -142916 94631 20718 24438 573857 451472 323462 185750 45439 227787
15004 227787 114636 256543 291876 103193 -112800 343664 162591 218674 495718 238153
14993 158814 283864 194137 304580 94335 99352 37659 342464 124977 234710 196058 -97327
14981 307358 -40519 427827 358120 400455 164760 38936 299547 25907 388371 403460 343351
14970 343351 6074 251329 150932 113019 47418 187987 -114116 210431 433429 -10994
14959 123285 -11214 239243 156307 312674 497536 196579 -68661 605914 201926 189771
14949 189771 99905 60019 215318 237380 192450 687218 120453 352425 258500 330670 229241
14938 229241 109116 53164 182363 285430 -17086 460848 350374 -3317 402190 156115
14927 214890 331642 624632 492736 787277 607765 476116 448857 528946 381529 558982
14917 558982 212518 762526 478153 290039 184949 369335 563496 314750 73376 265612
14907 265612 453164 588110 316151 523893 165790 209627 138357 368265 149298 381151
14897 381151 -28992 389230 -81652 25723 330937 48363 229680 238470 -4500 290771 9296
14885 610092 577373 407024 674593 -60233 699447 244495 456250 436461 160629 555899
14875 555899 354760 303860 307654 290677 601906 576280 585847 575651 415513 597924 70122
14863 235852 321939 232457 544957 235231 37609 187814 557529 571364 153243 334647
14853 334647 554184 286387 485146 237826 387761 134011 96504 225554 96313 758672
14843 758672 325814 280447 483141 577408 410288 419518 593559 368960 224210 366060
14833 366060 376498 282975 277891 626419 260581 483984 434305 214757 416340 446242 435181
14822 435181 502242 246087 511203 410041 538127 405885 413043 184533 646816 133108
14811 373894 259686 179802 241615 522177 367186 419129 187085 308988 494259 446975
14801 446975 676880 659904 650474 270952 388434 464958 464340 290597 453119 441828 170492
14789 452301 363831 448455 670729 361910 -59057 456088 470099 269240 503026 312794
14779 312794 419370 572675 418937 619970 327073 404675 475007 517415 547890 680684
14769 680684 579646 521491 416437 525272 363512 415555 817913 723770 338104 597018
14759 597018 485090 274476 737174 760213 302526 551984 568170 561011 354097 377209
14749 377209 777078 275219 576761 302387 364987 680065 704508 489706 444788 319564
14739 319564 425289 716948 586832 1068259 315380 592390 826258 752765 770040 467714
14729 467714 437134 871541 798669 528527 1125037 529044 924747 819852 634917 765949
14719 765949 760188 772327 793341 668742 409414 653087 695332 609545 317938 448075 662614
14708 662614 573652 668110 470407 537965 428524 739783 464395 979409 865950 614269
14698 614269 953016 467777 882703 592569 695305 635271 758454 571733 746129 702481
14688 702481 847007 530294 555625 901778 750590 758563 746150 592178 993842 816320
14678 816320 1057272 1107793 869719 748451 704240 601500 810900 695898 664648 585057
14668 585057 995726 803278 600734 1010764 706262 1006404 976526 844156 864266 1071495
14658 1071495 629923 653505 819817 823904 848152 723837 860143 1031877 838642 741951
14648 741951 1048815 873075 710824 1067193 875637 982102 933228 1046858 931810 1040704
14638 1040704 887425 1126410 872613 1126024 1140046 1080388 1142304 1346125 1170845 579531
14627 979182 1247379 1267462 911703 1087708 1055183 1174386 1206293 1225024 1535424 1135554
14617 1135554 902755 1204455 905487 1145631 1067653 1091252 1084487 1137934 933942 1315454
14607 1315454 1164098 1179221 1147439 1320843 1187082 1212417 1532061 1146872 1247712 1198674
14597 1198674 1374471 1372590 1339004 1503022 1514693 1296917 1558442 1353300 1582466 1531030
14587 1531030 1419299 1422291 1316839 1633889 1621889 1494332 1257953 1619240 1384526 1645101
14577 1645101 1506631 1579970 1623831 1671989 1411468 1312995 1304756 1435267 1907639 1651016
14567 1651016 1624684 1975165 2091823 1817644 2089536 2032152 2039107 2290514 2342025 2159107
14557 2159107 2542642 2589087 2951753 2908293 3314176 3688477 4487127 5049860 7334462 11001015
14547 11001015 17519094 28927349 30605339 16339635 8810887 5635935 3882500 2819509
14539 2819509 2882175 3756383 5539774 4598196 2138938 2132623 2108086 1720851 1775072 2016001
14529 2016001 1635869 2045662 1569021 1950363 2116953 2040654 2096039 1822105 2055008 2221140
14519 2221140 1928052 1958577 1961382 1727230 2167326 2121366 2208386 2273437 2080001 2233090
14509 2233090 2571009 2342873 2435214 2144088 2541457 2238790 2289372 2578986 2661116 2715977
14499 2715977 2516858 2620296 2478674 3051815 2831085 2903495 2872047 2552357 2739114 2773566
14489 2773566 3016951 2897321 3043478 2769858 3300778 3098842 3044596 3022237 3053258 3269242
14479 3269242 3134425 2969832 3344398 3234928 3413883 3516589 3675836 3493282 3352806
14470 3352806 3662039 3696140 3674667 3545983 3813390 4232892 3803939 3883944 3688633 4057055
14460 4057055 3815224 3991486 4065615 4249553 3994591 4396563 4108580 4397452 4414477 4632581
14450 4632581 4614328 4375328 4655041 4789848 4693151 4662877 4618279 4594496 4783973 4922354
14440 4922354 4844787 5014999 5163653 5546086 5201011 5380067 5463811 5652436 5446413 5794821
14430 5794821 5483933 5918343 6068087 6082515 5979568 6201369 6587164 6502862 6706020 6738240
14420 6738240 6538626 6762270 7045528 6786693 7167234 7422393 7196005 7219833 7497732 7316817
14410 7316817 7765532 7857060 7928907 7886920 7950214 8084211 8137197 8328118 8506787 8963109
14400 8963109 8806922 9097625 9048268 9609202 9281163 9659660 9391733 9749183 10027919 10333005
14390 10333005 10310592 10439965 10647908 10959797 11561291 11462802 11663909 11779614 11952714 12409584
14380 12409584 12408733 12818096 13342078 13382060 13216556 13710839 13986524 14543141 14445025 14694517
14370 14694517 15034853 15283248 15735606 16054125 16331339 16952145 17164722 17606399 18019145
14361 18019145 18148038 18838747 19280845 19318108 19611010 20253457 20901465 20878636 21517737 22088008
14351 22088008 22520232 23422008 24014010 24238851 25151949 25383099 26338412 27070243 27801508
14342 27801508 28367886 29073800 30032390 30829144 31681080 32636014 33516972 34365012 35387977
14333 35387977 36472604 37552907 38678764 39515833 40991536 42300725 43582809 45358468
14325 45358468 46786751 48249987 50163935 51815985 53701812 55315730 57253861 59215335
14317 59215335 61334524 63616872 66416488 68564632 71480257 74004377 76907176 80458657
14309 80458657 83655942 87134738 91008937 94917290 99255574 103407018 108014945 113124924
14301 113124924 117895199 123432680 129745311 135837789 142256628 149312243 156528852 164357771
14293 164357771 172466315 181328821 190435700 200081924 210237843 220605965 231722545
14286 231722545 243189224 254958598 267036671 279406020 291853037 304088921 317122800
14279 317122800 329064670 341354953 352356217 362760085 371645446 378703253 382458752
14272 382458752 383657899 384873346 385512862 386589883 382052401 378011764 373705435 367974802
14264 367974802 361099266 352311466 342083731 330881939 318841460 306419637 293358656
14257 293358656 280164718 267267439 254611843 242248259 230532445 218868085 207984199
14250 207984199 197239403 187462495 178331225 171553513 162874688 154771170 147367973 140444312
14242 140444312 133689707 127510824 121506687 116231725 110994599 106199970 101540275 97176117
14234 97176117 92825721 89107150 85474980 82060861 78840323 75840714 72862171 69934499
14226 69934499 67363192 65061425 62608777 60385635 58495212 56402244 54583233 52769738
14218 52769738 50890814 49373724 47437754 46175373 44700476 43442778 41925842 40901358
14210 40901358 39488969 38272564 37648017 36593518 35517451 34416853 33374376 32461327
14202 32461327 31498989 30704590 30219642 29302182 28306478 27827832 26715396 26493910 25831863
14193 25831863 25239424 24391323 23801726 23223549 22475635 22071426 21488927 21268409 20614870
14184 20614870 19918444 19788892 18999978 19223897 18230650 18061063 17440278 17304964 16883978
14175 16883978 16677251 16041965 15802811 15832730 15061055 14764477 14615687 14434053 14083501
14166 14083501 14028512 14000469 13417038 13099500 13009782 12731374 12305034 12132616 12033647 11838847
14156 11838847 11365601 11540298 11301894 11255494 10785358 10761432 10344632 10378143 10444853 10182342
14146 10182342 9819939 9788648 9532338 9497287 9241772 9227148 9219565 8845497 8613395 8869173
14136 8869173 8724652 8601015 8862839 8045401 7925321 7575125 7654710 7746935 7497192 7468551
14126 7468551 7520220 7370518 7000214 6985297 7189121 6913694 6615121 6388790 6486172 6518664
14116 6518664 6353806 6350362 6421705 6155917 6194066 6162894 6320251 5964910 5772757 5883483
14106 5883483 6070680 5603489 5470741 5744819 5573541 5362547 5231588 5198145 5327769 5176973
14096 5176973 5053625 5191630 4705562 4742128 5008297 4851829 4347640 4575912 4348002 4648150
14086 4648150 4476097 4538486 4612511 4299237 4363826 4187965 4576763 4365207 4097102 4010351
14076 4010351 4221476 3892856 4158435 3736814 4091646 3711881 3969987 3569856 3724545
14067 3724545 3840165 3852383 3824764 3539401 3345850 3697925 3433510 3468968 3409233 3446095
14057 3446095 3581633 3272477 3433341 3347732 3617298 3212715 3096285 3183232 3157493 3152197
14047 3152197 2970882 3286747 3168143 3096694 2688170 2923342 2847802 2819411 3035329 2705832
14037 2705832 2661278 2540704 2895291 2573887 2595832 2570838 2657070 2475129 2926085 2409616
14027 2409616 2511174 2340308 2665747 2376741 2406868 2322683 2316444 2290489 2435445 2378310
14017 2378310 2302650 2247064 2379656 2125532 2370482 2316277 2046540 2088490 2212165 2138850
14007 2138850 2216586 2392247 1959893 2160716 2158100 1885360 2005168 1969906 2010460 1942963
13997 1942963 1961094 1755587 1899337 1773895 2197707 2256877 2236407 2793971 3879120 6404697
13987 6404697 11735234 22575026 33200034 22360007 13228625 8568514 6427502 5125886
13979 5125886 4224910 3484117 3168936 2718286 2342040 2760658 2436362 2666903 2688427 2455663
13969 2455663 2252515 2077970 2163514 2139451 1881711 2281690 2032314 1833881 1637628 2018156
13959 2018156 1877108 1995403 2063292 2123385 1540695 1979599 1874497 1808689 1912284 1860752
13949 1860752 1626961 1810213 1651701 1675605 1676226 1750941 1551204 1453020 1730176 1447120
13939 1447120 1312642 1254472 1510313 1449122 1407247 1628424 1619201 1556965 1212966 1395261
13929 1395261 1333987 1328008 1489511 1330602 1642771 1537950 1337455 1536937 1240714 1336059
13919 1336059 1391178 1446522 1199031 1453760 1713645 1577659 1171690 1231741 1661179 1227638
13909 1227638 1227280 1281105 1297049 1295912 1174484 1184935 1209174 939088 1442865 1301311 1152351
13898 1152351 1232275 1499343 1435859 1069245 1161853 1167870 1416676 980227 1082756 1230143
13888 1230143 1181305 927984 1246892 1133821 1174047 1325949 1308727 1282614 734847 932283
13878 932283 1083055 1122951 753279 896627 1204067 945208 1282684 1321618 828931 1000729
13868 1000729 833162 1122852 1145502 1037884 708194 1097924 1112117 727869 596664 988174
13858 988174 1050121 1067045 803923 937971 1003548 696612 778926 995471 540903 868124
13848 868124 568351 875631 836217 918849 1280443 1010176 1136478 932552 1070334 688156
13838 688156 1136316 754759 785433 918329 884806 630758 957460 762641 969164 618121
13828 618121 937897 752735 769539 534928 907652 858464 939564 835584 821791 823794 966914
13817 966914 807427 678254 759089 627929 731161 1016004 978822 676945 615167 849831
13807 849831 813073 637467 1184992 925774 801410 736320 932065 935440 544376 791365
13797 791365 481611 805310 544646 766943 493227 603460 740544 743198 657506 810057
13787 810057 764867 701027 830955 1141303 597425 521194 511617 717430 743969 678684 292185
13775 555659 1017626 461098 729760 336871 440636 716235 178781 724710 685227 495291
13765 495291 621818 633385 719857 940328 531306 827328 602719 698284 358773 502733
13755 502733 801692 479930 642935 521341 746282 245895 677605 458241 631100 355026
13745 355026 397280 379233 602323 656007 546603 653088 904596 340665 852773 380991
13734 403826 400641 650385 843793 722749 374425 642973 657595 423166 183299 565612
13724 565612 724109 539314 291511 309746 554392 600305 325207 497467 788801 599337
13714 599337 422186 584708 425936 607967 1094181 -18972 288549 586297 714633 586864
13704 586864 618265 429797 283243 525400 228547 380007 647539 662357 724766 542923
13694 542923 342995 285668 502066 500835 703201 223110 557862 402917 575647 400095
13684 400095 706324 447626 611038 272531 380183 246771 380056 622219 342024 157046
13673 156872 356619 768546 450590 318562 448795 275259 398079 211220 675262 724729
13663 724729 636123 516699 598781 1000818 310695 272853 90290 244908 575293 115607
13652 425531 630494 204351 603648 475071 336478 411896 601365 445885 397665 621783
13642 621783 415734 514494 546071 255529 449350 465261 456642 290659 558024 317454
13632 317454 243378 297910 276559 342356 535497 413619 67916 56563 195523 541285 243961
13620 461370 180023 357422 722769 413766 206826 192493 76920 571302 282831 80571
13609 449968 212875 204931 230345 -46424 366443 562807 389402 132041 186221 313524
13599 313524 622556 356745 272010 188729 462654 176324 371313 539116 412949 320165
13589 320165 476539 376072 364120 131996 327275 -54732 214041 586405 509073 178515
13578 752532 21793 252792 35513 50722 349272 295550 267064 413917 360466 534073 331372
13567 331372 202179 -3616 445184 -36283 145577 195632 -37599 378683 206123 99933 262424
13556 262424 400806 119106 -51494 275077 451322 431751 299646 142033 242358 283298
13546 283298 328429 237643 239262 142126 405350 296593 -177413 400911 273202 436148
13536 436148 231738 369854 91939 369638 207473 582746 481696 105892 290092 384237
13526 384237 54660 158156 220015 217279 327262 464142 450734 325726 176081 288079
13516 288079 298814 367657 380911 258259 331132 355429 392064 109147 397557 271770 276718
13505 276718 331846 74385 236104 139764 259312 -21195 240207 29935 58439 373721 97789
13493 271288 375332 261238 108523 160632 -161875 13651 164696 265299 -42312 216692
13482 114388 418692 451238 352345 152983 464691 143328 9079 377697 353313 203946
13472 203946 -130057 99443 204088 137541 185374 545866 222294 -17677 34010 245482
13462 245482 201869 233834 279574 170503 142640 330698 341567 204153 331287 182714
13452 182714 37127 407273 292645 -186710 340287 235126 168179 210752 469342 280321
13442 280321 160412 159702 230094 362972 -165771 146480 255494 48180 335886 65074 347773
13431 347773 333655 54938 223846 188135 228165 -243122 28516 82415 224946 -105278 356830
13419 244984 329299 20089 157197 -17515 242619 57660 -48492 42880 377115 229218 123597
13408 123597 437042 288288 215304 193514 17743 300502 -30062 168813 155868 276269
13398 276269 254051 -13012 367418 43565 596732 210108 -138142 126550 32561 470218
13388 470218 277928 67008 183339 169213 42154 423300 64522 102336 313045 -2269 256486
13376 217790 235920 388877 177693 278430 95421 -136832 378898 345168 437970 68674
13365 25706 383854 250392 395774 169514 209551 -212520 170218 176245 58425 399211
13355 399211 256179 111898 112274 318197 -58616 192060 465805 12264 370550 -23105 167113
13343 330197 -90798 430147 231397 442450 490473 94326 360225 53099 306630 304241 242790
13332 242790 336499 -174673 651508 -96204 134893 254837 260199 197245 201592 128208 -342536
13320 172391 -81268 108392 -30129 -58093 374923 115234 239420 168924 225503 59030 181316
13309 181316 73351 317721 178101 333477 -20990 -346613 365230 113279 434257 -312077
13298 352122 186976 138829 185087 -75901 130908 -15887 298334 -140356 194391 185140 253182
13287 253182 175999 250907 28870 -142739 7896 -320946 -57855 50485 479728 132999 330378
13276 330378 -60654 -71382 503633 -73859 -219822 63865 295587 47862 21745 277578 1587
13264 235652 341538 -21897 -28626 206491 243354 215099 -98800 202494 159652 -136138 -116959
13253 -116959 209233 73899 28082 -94565 72402 -24887 93891 207461 -114511 149158 3301
13241 -41709 152528 105187 273342 113691 30646 260389 -38647 113949 256920 56568
13230 -46289 139899 591653 186119 194139 -202980 -50729 -3256 278436 62412 33230 70756
13219 70756 276073 108518 -127472 156526 159131 -83276 -78758 -202875 176989 -256393 60227
13207 4812 122880 439866 512 75230 234139 -5932 116791 180193 389448 35343 90073
13196 90073 -180812 -1740 -190283 196459 161503 207775 270515 263470 177206 178081 -1715 -31781
13184 -31781 353728 252464 145751 -116851 -295811 180754 110210 -184616 221040 50057
13173 232224 -198544 57962 319259 244756 44728 29253 25440 65257 332009 226631 95003
13161 106305 -193946 49584 101416 79680 328566 363209 321112 80068 -8220 303618 -145513
13149 -61296 207003 7315 97804 199605 155062 60423 63694 97804 -96335 -296051 130978
13137 169933 -206810 148311 -82392 163846 84710 -80306 367591 10353 -93800 169326
13126 78290 99360 -14531 70653 -19268 109902 103615 -114071 46186 -140194 67528 -7838
13114 -218328 -32020 139098 172274 45840 -73428 -404421 -129904 -3007 95472 325016 4565
13102 -13426 68965 367026 24978 -162099 2172 -64477 -276648 68681 194252 179994 -146419
13090 -20989 -273069 -44788 3012 21833 31330 309855 169336 -104352 -165168 173866 308434
13079 308434 -297874 254433 -32909 31504 -43958 -9397 -36255 155693 34673 -209522 195445
13067 349587 -141577 -20410 352097 129527 140916 206529 -101118 26398 -162653 119112
13056 -24717 -4564 209531 149375 104722 218184 89335 242229 245280 228454 127371 -6628
13044 86849 143 -54177 133312 -61010 -24405 176449 -171476 113248 -60782 -73599 128358
13032 476087 -54194 95423 71916 -84396 8657 -68336 -93052 -1512 110417 111575 211197 213709
13020 213709 -109325 -100375 206292 -16193 85175 -110841 6342 -13410 -78241 91434 38101
13008 -34438 -15275 102292 107826 -113981 15028 -177690 42563 216140 222582 -38754 127097
12996 53100 -7716 45643 -230778 -106265 253288 384884 -117591 192644 87118 67284 114979
12985 114979 500472 43673 -98100 -414100 40782 476577 132919 151049 435800 122446
12974 217207 74345 269251 196291 39341 233657 -43385 -43479 -372603 52787 -395455 190507
12962 -150966 260533 -43573 -61343 -202391 108523 160876 432381 163943 99167 242490
12952 242490 148008 37798 -4912 118072 155183 -41969 167631 -91685 -164600 169762 -5539
12940 -118154 -71727 -60813 205541 -91722 162553 -93265 -60790 384224 -45959 -197981 253050
12928 93549 -58083 -245965 403983 -210600 172624 37053 -28243 28554 41183 43038 -235908
12916 199895 90174 43203 -17405 61644 23111 108111 -43897 -67021 -485744 74601 -149378
12904 -163226 -391195 224098 -118196 -416704 129705 -98142 49626 -22765 -56936 254126
12893 -336174 401346 190883 -121530 65885 151217 42712 -276408 127355 -12652 186115
12882 -35553 154054 -127238 -100886 14480 55427 98927 23271 102332 -221711 -14425 432887
12870 178091 -105325 170594 268326 -72520 315647 270532 -184613 171411 254973 122481
12859 -170738 -23281 -242066 -116367 -227120 204283 193015 155905 -171577 100813 -77264
12848 -45742 55505 87968 104831 -55641 52680 -68309 4122 -41520 108062 -1474 -445709 198235
12835 321818 -26902 262677 -102024 495680 -211472 -219395 -9188 109688 42243 -81001 473788
12823 133890 334091 -143299 -243854 83135 -184608 -356808 81203 -16800 211675 138443
12813 138443 -24635 -283737 58038 -193312 -283140 30714 -102890 -51694 -159924 42014 -228172
12801 -173519 202796 1599 82388 78135 99496 -151606 11575 -10836 360027 154381 55779
12789 36642 251865 -72016 -149024 -172092 -18185 -68640 261991 -187991 34775 270693 113275
12777 -149539 236335 31900 93943 122846 -103542 -76736 120796 113672 159539 148330 24864
12765 -33262 -182316 150503 173787 -37589 34443 -262505 9256 79368 -197792 170752 -228522
12753 77587 -278784 22435 -157358 -9546 112105 -56220 964 -250284 46669 -359927 463360
12741 -4092 10596 -109699 209619 863 41721 141344 -234005 55535 -21988 204091 72108
12729 -217311 -375645 13715 -176598 359938 -180728 119244 60850 245533 -204710 -12023
12718 161907 -161107 -37570 381781 -253989 -143347 -140701 -152857 -275061 -212940 76701 254355
12707 254355 -89282 -127329 -249860 -146022 162659 -3360 -40754 -38653 -214328 -253170 -41144
12695 134076 -164866 305222 67024 96616 159534 -11441 -210014 132831 67034 60804 -185913
12683 -110279 -91541 235640 -173946 160884 391799 126681 171401 -197671 -53960 97909
12672 -266445 -72215 66723 299322 -83287 11704 102618 -44222 -70359 423136 343857 109954
12660 158583 -151273 -101267 21711 -73624 -49690 -50717 -244986 24980 262500 165265 -84645
12648 -275759 -89917 116847 -114512 -365153 147154 -14956 355642 -26967 15202 -64588
12637 -35058 325373 316553 -172133 34450 -56191 92118 -57675 165256 96853 -35466 -218112
12626 -218112 -72736 70791 415288 32106 114458 81702 100851 -81523 -223930 -4909 179704
12614 180603 -26422 -63926 176745 390914 133919 38187 201667 125371 186180 148793 156908
12603 156908 177212 -174778 -107445 21363 -160930 4846 163758 -269986 19684 305864 -37948
12591 -52114 -78756 -53019 -140001 -94441 -120824 124567 153890 100552 65032 -14433 -89547
12580 -89547 -131366 -187241 -11834 54792 229131 77362 37789 41488 109631 2587 231385 133482
12568 133482 -43530 131093 167392 -35438 95747 131604 -281802 -14405 -1133 -268915 -115063
12556 -19628 39014 144923 -269187 -261071 -142947 -47933 67797 -87370 -65515 -282545 143756
12544 -26366 399925 -102655 -28683 52733 29990 258866 335418 183317 26764 -210593 158493
12532 52842 -89642 76454 -101046 149000 -163112 3433 203997 -253647 96327 2462 -71601
12520 -32758 198259 143554 -400315 151078 -38379 -25536 356296 -124469 335514 103887
12509 109022 310973 18971 86034 -93350 -8316 94447 -156323 -25210 94490 215344 -164824
12497 19699 279152 149219 -34240 244106 -255295 163423 -21706 -154228 48019 50379 172704
12486 172704 -24291 190652 320007 -35653 -95953 192246 -66967 175777 -30919 -181378
12476 -181378 -25721 140567 -106400 -272820 -82573 -342340 -310591 -420425 -81986 -133619
12466 -133619 136786 -336633 -18436 -143542 -298585 37788 31397 -30855 -50815 -56799 -69401
12455 -69401 54980 -290361 -10011 472472 -111750 75405 156823 275847 209589 113755 -97472
12443 -114913 -141109 -360328 -81389 -248043 -227514 -9262 112135 -288031 329057 -19343 72213
12431 47155 249149 -49615 46104 89132 214361 -26687 -162402 -22930 -86816 53860 -10085
12419 -148470 -220233 278296 218649 -73951 130244 -159460 -285737 -255467 -25081 -5766 -304744
12408 -304744 -28001 7282 -22059 -91566 -23458 197894 31874 -61965 -139625 -224845 12017
12396 186519 -269424 315207 -104881 55037 -50067 287703 8378 -47206 -279955 -142312
12386 -142312 9968 -221531 122056 99726 253821 -77604 -31851 -66366 -188963 176258 -212052
12374 121680 -20378 -62423 221109 -177572 -105776 -166874 -40255 155835 244741 313319 -196959
12362 -158875 234946 505863 53840 101926 40752 -62097 6163 -86543 174640 147 309729
12351 309729 -95675 136938 41484 261632 -139646 -300214 273458 -1328 308829 279161
12341 279161 -90670 232599 -17342 254194 138316 -67316 -104145 99927 125064 177579 178665
12330 178665 -39398 63003 52272 267208 378323 -36377 -349186 249750 134097 47432
12319 -210450 162615 313850 97770 -245472 -174363 83490 -138188 24649 28127 -141008 -487605
12308 -487605 274838 -126486 -100688 425550 153689 -212700 44083 97301 259089 153495
12298 153495 -175636 -390746 132181 86364 -205693 484767 111757 147452 87176 25471
12287 121369 457716 314191 102891 13862 163490 71355 188972 349322 141733 119472
12277 119472 -174954 -67274 -45636 114869 15124 -118886 169986 122008 11025 -268918
12266 -269079 -79119 -97655 179995 -40680 118976 -175695 -84940 -79253 177005 -9602 74700
12254 28490 10704 250671 473013 -340772 236492 117710 -64692 53752 238164 322131
12244 322131 148364 153845 -73018 -267042 -192457 -350391 477366 -28253 112688 198936 206537
12233 206537 286133 188105 352028 -76481 105196 397086 -363436 176007 211147 229691
12223 229691 54073 183269 155442 234215 134580 152966 367915 351483 145585 -20412 159617
12211 -21160 126094 105835 -161544 365500 -13459 -330473 40246 -3749 -252089 183101 187337
12200 187337 -81299 199337 -140246 27662 -296773 -66115 292041 348378 275526 182134 -185554
12188 402761 108728 220282 179415 322726 3217 174600 6028 -16698 228912 302076 322804
12177 322804 188311 138583 -202016 84067 -175553 16546 -71396 126788 47153 136280 63751
12165 -41655 194124 115474 125053 43632 101696 -50292 170313 407608 77812 79058 -49721
12153 44901 72401 81647 500315 38126 133742 -82046 10034 37286 221302 367617 82740
12141 177019 371511 177451 160939 182275 362816 -42844 -7049 246455 -88488 -52143 221183
12129 87048 377216 -22054 195333 -140448 -136360 314628 34176 51007 168284 -170049 -7895
12117 -157232 276951 -4151 19922 -29143 -130065 231809 162117 4040 -194496 -288371 375697
12105 -225363 15989 244021 -59316 127756 -222677 -72929 -35052 -200961 16142 212496
12095 212496 118154 -1029 110221 -130459 -236032 61854 9878 34698 -187220 -209995 18930
12083 146132 -72035 150431 58524 136520 248441 -181952 175483 -198607 58835 220529
12073 220529 154873 -288907 51987 -65493 6946 105916 173538 116491 64114 -75797 222070
12061 32254 -86499 -325699 321491 -243171 242729 -80411 241191 464524 132980 -452758
12050 -25656 -281601 -137315 27139 113904 35521 -142198 -177395 180696 -6650 -237985 40863
12038 -188174 -146713 -175600 -62449 248312 -56825 -38320 -47019 150282 -267710 150689 -179276
12026 -105516 138884 2344 -206352 -188652 -179426 -411900 -111005 15014 -264427 240257 -218930
12014 -147578 9292 336662 -20122 79981 28845 59516 51924 58186 108238 -174497 -17678 27220
12001 44962 -303083 -81055 -20757 -320200 213477 -60265 -12203 402409 -127575 -206975 -59396
11989 109345 98011 -75388 -219581 -19125 80899 -36345 -100381 -405451 8461 19261 477123
11978 477123 105157 -196770 -158490 171377 -136569 -278530 -223036 9894 174555 96525
11968 96525 135646 -318084 104391 -106629 -273269 166391 166187 129606 96331 211349 48780
11956 -290690 -174269 -84633 51325 22250 -114974 -67859 -155525 -133475 296814 32530 -204009
11944 -26805 -5207 -173768 165636 -31676 64409 -138143 39297 -224916 -436500 165269 60043
11932 234394 164605 -95088 -39337 -249717 206279 -369402 -82006 -322954 15473 245671
11922 245671 20273 110001 201754 -288332 -103045 -216312 29770 10360 -28326 45645 131160
11911 131160 -80633 -5376 241881 9498 64599 94590 -267293 97110 -286050 36740 -132582
11899 -270386 393457 -142149 -183543 -9211 -203009 -29604 -19565 25227 -34055 -100343 -23360
11887 -18727 81602 89077 7790 -101516 -42959 -96720 -303257 -164164 -285985 -226391 106209
11875 -103568 228596 173287 138933 15280 -88290 166238 -58855 -223428 -236749 -65187 25011
11863 -114517 970 -134956 -153245 -266250 22635 20406 -128774 -44478 130096 -117951 2492
11851 196949 -74661 -210518 -226332 -168452 257863 44568 212058 -100052 51571 -132348
11840 -253482 -376714 7601 -182591 145688 36469 -183826 -37529 137698 266024 -81290
11829 -73346 95991 -138579 -145466 162375 -241274 69701 -118889 222621 -151613 181073
11818 -266246 -120973 -167670 -458601 28416 100751 -76897 -204823 76279 -44473 167777 -160471
11806 -75552 -329641 -126913 64919 105622 -224355 -117613 -111997 54840 -34888 248371 -265971
11794 67879 122703 -216013 122822 97340 107544 47087 42496 -73877 185006 -275884 141166
11782 -162677 7366 -240421 -2292 -131947 55694 -157310 -136120 -29337 -316058 184765 -11402
11770 -57560 -39613 169918 -424024 -147920 101955 -108218 -77485 22250 -117579 172857
11759 -9518 -59968 62864 111646 134272 -184685 118722 -174010 -125000 45579 -453909 45975
11747 99576 17557 -215991 -57666 -64588 130649 122404 -16147 -145459 -3513 83983 116093 79206
11735 79206 -173640 -44660 335781 -9618 123570 -310380 -63977 184917 200418 -329792 -94433
11723 52514 -115964 -230518 -228179 193964 77354 -178669 -188301 242337 -80398 -282967 -284048
11712 -284048 -17740 -61470 -113850 -199458 -28265 163010 -52993 -270088 -89237 -146089 309615
11700 63062 -194009 230164 -122666 185215 -416333 41438 -239136 35751 234398 278901
11690 278901 62376 -101236 95496 -331294 10069 -171859 93854 -48648 23279 101956 104060
11679 104060 73812 365202 -203702 -43264 -41860 -114480 -11571 266046 75951 199358 -234611
11667 -100733 170848 -156344 -55770 172232 58142 -108083 12925 263713 199915 -118085
11656 -126102 129082 -178406 -220181 264043 -54496 -54709 -188590 -204326 -243266 -187266 384638
11644 -286445 242539 128601 -276318 -219456 262545 34196 -73535 34745 -91391 -126816 22822
11632 137028 -23843 -220515 122801 -138688 86227 -97130 -288499 130528 278690 80543
11621 -359952 -57559 201026 138327 -105338 250391 63968 -56537 84847 -72931 61285 -465784
11609 -160942 189679 150497 -481482 -231603 -8960 123554 -29623 -400737 25109 -116673
11598 -138584 15286 72457 178848 155330 -322686 21338 -96696 -87519 -75966 -110711 138491
11586 -171447 -163911 -47817 -168764 86649 248820 -117573 212605 165308 77351 -173322 -15720
11574 73005 -6560 -141959 -51700 -6219 -73731 -16296 187674 -94620 15188 47078 122908 -163201
11561 -70335 37837 384626 227872 -58304 209505 -170414 -164623 -299330 -97023 142730 -127976
11549 270235 -70193 43374 43325 245179 -159005 -155914 -175263 110307 -43258 -8632 113189 -272799
11536 3683 357643 144015 -398418 145777 -51655 -428868 75675 27857 -134676 -72739 -230382
11525 -230382 50161 331278 -51538 -32007 -297561 -58429 -49075 -245215 -137666 -222500 147760
11513 99464 -17524 -87310 -289008 -267177 62215 7856 134663 141360 -81155 198305 29540
11501 94014 -76097 316790 133609 -109092 6922 -34399 222869 279888 58025 203426 -261213
11489 29779 -254053 88550 262017 37482 182899 123539 -331610 66287 224395 -48146 92177
11477 10138 80923 -85531 134711 271811 -113143 206619 -12307 128915 -148951 147101
11466 -6783 236499 144757 193409 212344 42804 52996 185831 170417 285528 181304 -141070
11454 -53282 -2070 -259704 4741 61782 185018 -224766 67035 110465 -16809 50950 162421
11443 162421 -12258 -141622 163149 67541 243658 3996 -41088 -175803 89372 -87090 237033
11431 -64102 -55173 11545 70710 -89464 -93319 131241 -32442 142427 -137371 -226695 265338
11419 281296 166864 -171154 -95980 45059 -10052 81141 9901 -180259 2258 33737 -29383
11407 114293 -225157 -59827 -319540 -266650 32923 -155612 146938 -92270 -374692 -227986
11397 -227986 134919 -241902 116331 327860 -149138 251428 -166647 -292145 -45403 56255
11386 -282641 12280 159048 -133111 -166778 -61036 -101255 51647 73269 141446 -27697 83287
11374 133622 306300 110908 8381 -203254 -147576 -384217 -276718 -24461 -95097 115306
11363 -62871 -3202 -82012 -427605 26420 -160169 3764 140857 -9096 -192675 144016 -341770
11351 115506 221104 -85761 -64929 297330 88950 -223046 52247 -250577 73150 -60294 127807
11339 264957 -227015 212371 -104408 104360 -170482 -54120 -111054 -128861 -322019 27525
11328 -94311 -229961 -20825 -9541 -113212 -86057 -5730 40865 113096 151195 -138310 -191964
11317 -191964 188506 -4031 140653 200257 -47212 88216 -249654 -40041 133886 355094 11336
11305 93113 -31009 -177555 -255767 -290221 -158934 -162874 -325061 84409 169033 -193508 114149
11293 -218845 117327 19916 7948 131399 -193042 268220 -116660 -1313 -213985 -1676 23114
11281 -78871 208359 -90228 17526 57823 28172 -129849 -194210 -77033 -171653 -229403 191883
11269 -47483 317830 6060 113712 -232053 142663 47309 198608 158959 -53718 -153994 5887
11257 -3054 296577 -116166 -173547 -50776 160164 -48490 100038 -167007 -325180 -49196 -63117
11246 -63117 -205839 232279 294590 -410122 -35578 -52030 -127499 45282 14565 -20419 -3592
11234 166031 -264932 -299935 73981 -288679 112742 56408 279516 -516382 153408 266465
11224 266465 320635 34400 -119771 -236626 -193430 -198401 -46003 12451 107499 134427 127534
11213 127534 125171 50771 -87105 61246 -101725 -80039 -89403 -6669 503457 -122160 -163506
11202 -163506 237849 -225093 148203 167368 -184652 125781 146542 -109764 -172668 47843
11191 -462588 -159163 149159 -72975 9048 543600 93868 -402316 319669 130747 -151791
11180 -105185 -76686 -392908 -52439 233671 -191018 106315 207386 -450466 -70541 216409
11169 -268523 -162379 -138110 -97133 -193402 -247027 -90069 -159092 -123694 -168800 -260108 -144964
11158 -144964 -39549 -206236 307877 -307795 -72428 378089 46515 151417 -121449 87745
11147 -397378 -315728 -172801 -45507 174713 -9107 210609 135112 69712 -260341 -83509 -241578
11136 -241578 -173450 -399084 -165196 132853 -191487 170861 -26217 -59554 -204707 118780
11125 -183606 306093 76726 257121 -101860 -159133 58474 236917 73612 28867 -51025 244954
11113 100887 -65495 191028 -100248 188467 48544 388175 -12329 -76116 -71754 -110482 123385
11101 232045 58270 54627 279978 27900 106105 -1034 -42707 289628 458366 -38393 149987
11089 34173 -234112 66931 251294 372457 41421 -257181 380834 219564 138769 -69102
11078 40542 198171 351347 204028 294308 31403 179705 193160 432495 -155459 132162
11067 34477 164960 -24551 84071 15100 -41844 212667 250976 -24805 -113772 340785 199279
11056 199279 115772 269408 195247 346356 428687 -45672 347173 571247 382296 154770
11045 690630 406292 688927 958976 532439 440257 545503 630127 614418 413838 563767
11035 563767 676908 527931 388148 703402 598443 659236 425861 618622 729311 430248
11025 430248 877819 439560 327585 99268 249951 442306 347636 513154 113795 393747
11015 393747 601862 83965 475880 481165 426062 478041 513301 297634 577045 165310 323678
11004 323678 305211 589203 278754 376234 559979 166892 127613 463709 342899 333226
10994 333226 221189 423616 710909 341186 359177 473373 52420 508614 82227 699264
10984 699264 547100 721951 459685 359780 669328 593628 505660 745379 820540 1090171
10974 1090171 766019 735187 974847 1093506 1049313 1396323 1426811 1455818 1534247 2141514
10964 2141514 2281186 1730930 1630035 1487871 1121263 637675 971075 1011218 604508 659333
10954 659333 696755 571881 893828 543673 321877 468513 263062 281166 394489 270443
10944 270443 80968 103132 134440 334044 98806 277284 301705 20440 -159694 -35387 41318
10932 -82172 19502 -243138 -160053 -37619 -275568 -160661 257486 63968 44741 -123661 12557
10920 3999 -183251 -104686 -50603 59276 34142 -46932 -264706 21902 -118542 -126251 -13535
10908 -214830 128160 -110321 152388 -143593 179383 -227980 -138654 -514034 217585 35819
10897 -216968 -105326 -46289 -53927 452025 152262 -137503 -105557 -201722 -410523 8761 -13124
10885 165613 17280 -52598 -263090 -94413 -80069 -142818 -124171 -158667 -198892 -28254 16259
10873 -259024 228065 -58962 144416 25630 -95010 62141 -58459 28798 386157 34142 -154510
10861 208949 73669 97613 -185894 178293 -188912 91797 74431 -129453 -618982 -76566
10850 9822 -299768 193992 100921 -119621 -93930 -114671 -50121 -112154 73526 89474 65748
10839 65748 32108 -73764 111257 -106747 -192063 -81010 50554 -236902 448567 -27319 -337984
10828 -337984 165767 57469 128815 -54935 9895 -104464 -291533 56854 -132418 36093 -16001
10816 233980 8458 -205493 -102712 -126194 -249056 53607 19142 -35848 448266 -125111 -143436
10805 -143436 -8867 -489 56644 162828 202534 -176612 -72670 130164 -163091 -318351 -23319
10793 61391 -232096 134526 -65758 176710 -31381 -120033 -29615 -59502 21948 112041 -53374
10781 -269809 -292010 208655 -236398 211866 244613 -307497 -95273 36926 22517 226933
10771 226933 -114899 -73292 -259642 101697 70661 50085 -282687 54314 2018 289550 -183614
10759 -1528 -82418 -14074 258380 248891 24527 250856 -90588 -329565 -352842 -320128 -274235
10748 -274235 -150031 -94466 -68575 353454 22725 -87542 -312451 -125139 23285 9777 56377
10737 56377 -73194 -254129 300681 35243 84257 113350 32154 96273 -212131 -78245 -74076
10726 -74076 100381 77699 -33312 -24592 -72219 93547 -253947 113198 201125 -46798 -12214
10714 55444 144686 -39275 -64306 149461 101580 -296394 -93111 -317401 -175818 -419180 -385113
10703 -385113 -278264 127456 57719 -252851 -304926 -264441 -267598 -85761 -118764 6261 167215
10692 167215 20503 195085 84801 -300272 78219 -54126 4620 48360 -24641 21977 -154492
10680 60930 -213202 -158622 9271 -160636 237705 78061 510153 -197318 -125325 -151250 344388
10668 -158300 -87104 4280 -109879 15771 125442 226442 213090 5011 -52739 166105 -66708
10656 -172694 -30392 -276216 -199875 -122772 71374 108022 -94578 158339 -16859 -280639 -64801
10644 57791 -222660 129601 -73494 -217959 -20029 108709 124883 137805 -61741 -189306 -62352
10632 -214778 -29821 -222826 -279168 -303386 -67434 -38591 -394074 43929 82225 95930 -138677
10620 145975 103856 132405 -93646 118603 62881 6173 11929 -99061 -36126 -170224 -132725
10609 -132725 -292153 -138308 -317162 29028 -323504 213800 -229142 -349361 160036 -140485
10598 -132625 442239 140950 167405 -42359 -83193 3586 74215 -144200 -152678 182039 -37147
10586 -264888 -219438 -22869 47940 -194958 -261059 -266105 116956 92859 -69029 59357 -81157
10574 -112638 -20205 -29418 -178357 195980 115357 168551 -572913 161170 140390 -68971 -155641
10563 -155641 -123881 61779 -287850 77926 -244295 -51909 -332857 59472 4539 242254 -203163
10551 -39348 118553 77381 -185977 -93911 -77262 -422636 88915 -285829 -138625 61015 13327
10539 -101712 282833 -72420 -145835 -176935 102821 13507 46998 -80918 -32723 -140130 366746
10527 -102122 -420040 23371 1336 -135401 -173496 -196515 188014 -64488 -178730 -171072 -350217
10516 -350217 74495 -286354 -102780 79289 -5469 41535 49589 -420822 330893 -351317 -108955
10504 90788 -368909 43979 -347135 -4292 268903 -203814 -14592 88312 -191837 -200673 -58871
10492 -233215 -110269 144649 -54202 -158070 -120291 195107 92472 166491 116986 -100786
10481 -13034 193653 72688 -62926 6587 1938 1666 351282 -123388 -142209 -199116 -276139 -110563
10468 -10272 -114065 -73592 -363522 -332003 -107172 -72226 -9778 126872 178068 -123200 4389
10456 13268 -141974 -165566 -234439 183476 -34453 11190 97758 -291480 -91172 -181937 27709
10444 -158230 143383 -82933 217997 234658 -57657 63832 -39243 1252 -234005 -58097 -245889
10433 -245889 49110 179587 -259391 -96097 12349 -18670 84062 246221 114042 41683 -28483
10421 -348575 -110832 50031 289000 -149982 57435 231961 48335 -103728 92399 -211813
10410 238702 -140816 -46824 -52948 -113741 -48915 166916 82866 -465169 -62036 -47955 -6746
10398 -322491 -60935 20691 149298 127787 -14230 62308 -21330 236648 16771 149498 96322
10387 96322 383962 28076 -186273 280663 -83590 220957 301031 127080 -127133 -25925
10376 144702 233485 110856 116094 -63322 69421 14277 42576 203969 -38898 -13634 -102749
10365 -102749 54445 261502 15183 24260 313718 229720 229804 411518 -39059 -87526 -22726 255586
10352 -247865 189461 93814 176241 412034 71322 232008 398344 189547 146199 241493
10342 241493 -10975 94398 -156483 207816 241357 146183 76015 -114460 30380 -20432 357067
10330 260597 301918 265006 -86517 36011 148786 328751 317371 123514 14424 106047 327327
10319 327327 217680 490023 -143432 321539 168286 375203 148185 -267001 23268 299086
10309 299086 89428 -185079 117623 -72815 -56592 248644 -135887 9981 150449 -183210
10298 -141537 -157129 -61845 -137702 -112735 254409 -66055 44616 -8421 193827 -69571 -315237
10287 -315237 -184810 241389 -218498 -82955 -6328 62498 -122245 23407 132310 78343 216007
10276 216007 -78428 -74297 -59100 190147 194588 215366 41379 -252606 -233525 34546 145652
10265 145652 92576 -62867 -45889 -85395 -390515 95754 -67204 -109270 38180 261492 340318
10254 340318 174132 7980 150343 200326 233653 111085 -142794 181790 240394 8323 -167293
10242 -62139 -105060 235479 -26862 -9783 248598 -234649 88550 32642 312674 81008 4148
10230 -50426 105281 134233 -175678 -84000 -242888 -73156 -184617 58742 188996 -81466 -88922
10219 -88922 167102 -335918 238321 -36269 19654 195638 13830 -169095 -92374 184925
10208 -156547 -176533 304564 89325 -83828 377278 -294817 -37076 -13899 -212958 177988
10197 132453 128854 -367642 -407313 -141989 -82478 -169333 74878 75133 -84382 -321197 133597
10185 -178574 225265 -276888 22725 -236116 108696 -247735 -322386 116573 59797 210916
10175 210916 -102002 -174561 -105514 -236641 -195162 -329956 -358616 25037 -52738 -86890 -323332
10164 -323332 32483 174277 -181235 -215440 -370243 11795 -163375 -149253 -76892 -74790 -216795
10153 -216795 237265 -108308 -176491 -70301 -286761 -267899 34868 202017 -103449 -96116 -149047
10142 -149047 106183 -66062 -240986 -95664 -34447 95773 -23439 -111803 -130996 -284238 -135586
10130 100809 -124845 -241565 -37986 -253678 -15637 -80583 -358721 79928 -124474 171410
10119 142271 -20975 -266211 5602 -154021 4641 174537 234659 182661 -111743 -105023 186509
10107 -366419 155864 -126892 -1959 157395 -107530 -203538 -19103 57090 -90738 -297810 -256494
10096 -256494 -244201 147181 -1320 392195 241487 31982 -51308 32713 -4826 -21366 -56742
10085 -56742 -179401 -331653 244528 116944 142442 156832 -243000 282925 303625 75582
10074 114290 -292996 -97510 -318831 25498 -169161 -58792 -119009 135516 -149294 -162235
10064 -162235 -25364 -251247 16240 14556 -128573 61421 -109420 73656 -112985 -166 247694
10052 305663 -315076 284800 203372 -222738 158352 -155556 23746 -272146 -341981 45185
10041 139525 -238462 -124874 -284454 -119076 -31945 -634 50295 89023 78759 -3338 180880
10029 -223213 -77536 -125850 125382 -216321 65197 1388 -2339 147755 -209576 69037 -326550
10017 -115813 -211088 183061 -310465 67575 309625 -83962 -320211 90064 -60645 -74546 -23501
10005 -157365 41509 -308968 -190987 -113117 149607 216763 -4267 39735 -179709 -40141 -84160
9994 -84160 -370846 27494 -199882 -46980 -186535 -101740 -221707 -32822 -247686 -96172 117566
9982 -303583 32683 135085 6924 -88273 188155 47047 -302346 -185411 1559 160165 -106872
9970 -45949 -152575 -474201 -2682 294261 -167519 -178120 243352 -65141 -100791 37681 26232
9959 26232 -10301 -157672 11726 22676 -219567 -139607 -96198 -148090 -163542 302899 -98613
9947 158068 118698 25519 154744 -41651 -197231 -84551 -57081 148203 -2207 -40057 -110314
9936 -110314 62634 34611 -95505 -147408 7995 -29063 105823 32536 -218582 107398 138050
9925 138050 -96677 135678 304055 -80077 -77920 352641 -30984 175040 -118582 -139649 -213008
9914 -213008 -26468 -66576 -35966 -19103 -326194 -282011 69295 282452 144142 -19439 -341220
9903 -341220 189528 -40368 -143802 -195145 -196073 -136715 166024 -204109 -19781 -260551 153140
9891 -110770 -44383 -32963 -324010 -34013 -126254 -157578 107718 115446 -155038 -76063 -243653
9880 -243653 139549 191956 -35554 -28036 -86557 -163259 280025 21399 202859 54748 -141875
9868 -250034 319038 -489058 -212670 -80866 -146300 -20857 -96358 -230817 -195519 174125 -391935
9856 30814 -11877 -181904 -225908 7756 5493 -452488 218570 -180013 -274670 164961 193809
9845 193809 -108226 20457 -90042 -62368 5122 381748 -335695 -378157 166384 67751 137933
9834 137933 -18077 -43001 -15355 -200355 172267 -153249 -225847 135574 126478 120211 -1597
9822 -21381 61032 159702 -280753 -105170 -22734 -502822 444365 -237300 62193 137329 334129
9811 334129 -302845 -314913 -327055 -49819 -226562 -34355 -204490 126142 -376288 -188687
9801 -188687 -66519 -193849 -133605 215529 123015 230416 -142125 -227700 -18200 -123764 48336
9789 70691 42302 -39780 165228 -86085 -208756 -96585 -203327 -137997 -53716 -275757 213429
9777 -42343 -91000 -124568 -301250 -317779 -344402 -283486 35465 -219726 -238184 -32445 18851
9765 104987 -144267 -280902 -91221 -292978 -194000 -187824 50047 -27605 -10139 -357877 -172556
9753 -148707 -348973 -16258 -71778 191859 -20196 -38401 -92912 -386759 -34277 43839 -135500
9741 -161528 -20708 -103916 -208044 110408 203643 94090 -41129 241130 -208108 -335912 -107599
9729 -94796 -50867 214072 -372554 14245 9427 -122663 -170708 -252697 -63723 -312313 -109363
9717 -151700 28687 -100474 -32181 -54738 -65610 53778 -169342 258469 -32409 -180159 -47154
9705 60792 -266778 -269327 -84539 140284 141080 -59004 -249950 -60376 107704 -27695 -6971 -355731
9693 -355731 -128969 41611 121397 81386 -25947 295934 -195380 -173281 -27061 -238836 -32676
9681 147719 -76158 -20461 -118874 -227538 -142387 -353810 -102669 -181925 -301768 -46453 298619
9669 -76847 -187398 38856 51694 267790 45094 53355 22466 -15752 -89684 -95651 -21872 -224940
9657 -224940 45259 -62914 -116558 -43916 -138957 96356 -223221 136410 74778 -12065 -65704
9646 -65704 -226743 -135591 -393926 20490 129205 26693 -168987 280786 60655 -223164 112459
9634 83554 -189878 95086 -248500 23326 62840 -35779 -25264 241795 -91541 133838 141974
9623 141974 -306913 -112429 -160067 -210204 -183842 130853 22135 29752 -22990 53514 -99913
9611 -191192 -52185 76933 135130 -97030 -62128 29026 -42848 -5842 -41170 100252 205781
9600 205781 -95667 167985 107582 50216 404 -12923 134335 73871 157726 195501 132138 1047
9587 -381506 -4587 169003 21755 -104864 -147024 -61176 -22656 138058 -170129 105886 -11874
9575 -57868 30827 -139113 112004 -101809 -75324 -289787 -119228 47428 -156568 -97797 -22138
9563 -153933 -44637 -364745 132717 51989 -20813 -124213 262654 88956 10375 -9606 4244
9551 108843 126321 137502 -18346 -408601 33068 48771 39786 -59088 -62918 286801 -114740
9539 8975 28288 174874 -121571 -183999 -131963 -338099 -128606 42494 -295057 -131528 101213
9527 52312 -74754 -229377 -314444 -157699 112017 -188780 244866 -44242 -247452 97271 -129202
9515 -353659 37256 -93476 71079 120156 -158214 -169741 104749 162271 109477 -96457 -84691
9504 -84691 28680 -396940 12992 -18935 -107846 341720 -284706 103382 -187051 -215659 129538
9492 -38610 -8691 -151507 20290 -175577 80959 -126582 -127905 19802 -200061 -119235 -72963
9481 -72963 -278444 145875 124045 139380 155677 24276 -290205 4207 -210241 -35552 -54828
9470 -54828 169428 -384315 -97295 196248 -235047 -11956 -42420 -335953 88733 -74392 -301982
9459 -301982 49579 -3142 132188 146998 176251 -94011 -71260 -436339 -192701 -88923 -167463
9448 -167463 132423 -139915 165417 181772 -116637 -54372 148536 -23160 -57573 -328879
9438 -328879 -196299 -231814 209955 -64355 -127624 77431 -313706 5891 -80717 -165853 -28857
9426 19271 101817 427193 -457247 -343278 190418 4423 -39511 -69848 2600 -236752 -164556
9415 -164556 -176495 -130543 -59730 59928 125469 -12504 -117332 21349 46721 132105 -58386
9403 82362 -165068 -54859 -246200 -71519 -285609 34029 -183531 -175036 137021 -66317 -73766
9392 -73766 271135 -260469 -46483 -9957 -148679 217534 112870 -81370 159796 54906 -397377
9380 -75341 141892 -167981 -480837 -263128 -93850 -88100 -24954 -33896 -105335 270351 -151000
9368 167487 -109317 -144374 -82587 -250578 -70230 120342 -130229 -209579 -59547 -75833 -342563
9357 -342563 -248961 -99727 -136333 -400994 273633 62177 -105032 98665 -127229 16846 -362981
9345 110155 133938 11376 -318987 194319 -52783 -251082 -115940 40139 -170120 -207768 106381
9333 34046 33580 183641 -121700 -208903 13113 -9320 195737 20763 56396 99869 78573 -196324
9320 -59428 -68916 -136408 -367900 61360 -149380 -124088 102747 68809 92806 42529 -157144
9308 -164352 35259 -10418 -49273 28139 97060 75776 -199939 107509 -216311 -118783 -46231
9296 -151871 -29122 -3238 247918 2229 -47508 -149307 -71315 -31930 -52084 -21984 322747
9284 -253544 -92544 -216563 -333620 -429396 225013 -97203 340737 -30330 -291633 -331932 -90030
9272 -126543 189789 -49239 282248 129304 -214582 -255020 110931 -369571 286877 -355586
9261 123187 82279 210912 258313 -60181 10764 -123142 -114760 -122842 -480966 -15891 413668
9249 282 -112758 -61615 -19280 86692 -318403 -75583 65292 -107766 -515987 -269047 13393
9237 -117171 175312 231453 -221516 67078 10909 -194149 -129892 -244460 -172425 -469682 -28424
9225 195063 -210874 83546 -342579 229076 304303 -321405 190955 53292 33387 -241220
9214 -105096 -123778 -158162 -89173 -335483 244369 -181380 684 -198586 109497 -128207 -76631
9203 -76631 -205612 -207182 -69087 -39643 -1601 369257 3221 -86009 -78500 -143833 -4916 -24824
9191 -24824 -47517 -141270 -369181 93662 -391488 -147436 167697 116306 -105359 -144441 -107196
9180 -107196 114385 23177 -4843 114526 -164946 -137126 77361 160830 192216 -129801 -222682
9169 -222682 42643 114981 86191 -363476 182393 150896 -89889 -50356 -155387 -574074 151186
9157 13328 139512 15920 -16620 43719 203732 106759 -11285 -55859 -174904 -118022 -181974
9146 -181974 73392 65636 -168050 -155436 -35295 -52196 -61401 41578 -114886 -415070 77850
9134 -225866 180364 248875 -58139 428945 -57137 -159848 -180561 -441353 -36089 140822 251753
9123 251753 -67142 317668 -244601 -80169 -66636 170631 -148364 108716 -265490 -25330
9112 -60022 -130882 -80962 -264518 -297892 192346 -38834 -331288 210325 -22599 -65820 -245722
9101 -245722 84276 -123135 -259102 53397 -7372 -191707 -119890 66713 -186265 -161254 -74343
9089 151564 24656 -249599 -1476 62379 26056 -328207 82477 19022 113112 50693 -21857
9077 -233303 -120982 -51908 69385 167094 23532 143929 178084 106429 165237 -80375 165777
9065 -57904 -88155 -300265 157781 -86225 407262 -190994 -177404 65662 -76013 129552 -433723
9053 -188406 -50849 98646 -91384 -4590 -126409 135594 142541 30205 -72056 -72453 76432 -77945
9040 -67289 -122489 -245341 239807 -280481 -173200 -50044 -107727 -157048 -23526 350843 -417969
9028 247275 -107113 -2274 -129015 207331 -152712 116162 -29034 94106 30604 140784 137058
9017 137058 -36563 -31015 -176797 -305209 -56721 -312335 320343 -436434 90035 -26404 -140081
9006 -140081 -217051 159184 -135794 -270546 -76592 232175 60749 94683 38596 -41607 116748
8994 -105989 62327 -55503 -157709 -80241 249023 80018 250337 -180834 545028 -254305
8983 -239777 -367040 -245963 -87026 273627 -148607 130450 -101960 195547 275729 1191
8972 113143 9551 -46436 -93755 -262752 43476 -19877 264615 350884 -283173 -165073 385536
8960 98779 -196469 -236365 113400 -128633 192542 36221 -243061 14470 -108791 157151
8949 231162 -47239 -127024 -87869 -180338 -130608 980 -412626 -142241 111697 83619 118330
8938 118330 31351 -246149 -99490 67544 255736 -63549 -160954 -190920 -210453 -26013 353593
8926 -70716 -10149 -23276 217026 -105619 -73083 44164 -172335 378015 687770 141376 92463
8915 92463 -133711 -57788 -456038 -322292 53817 107991 -235227 -41430 257324 93890 -2252
8903 171031 239118 -242561 -164447 9739 -83983 -174375 -68676 128570 -80986 -62908 157109
8891 -67529 -110158 -67159 -271357 15427 249088 -85809 57956 -64748 -300761 112677 -85662
8879 -46703 -202975 64344 99603 -5371 -214210 64808 -12553 161691 324448 -143641 -85541
8868 -85541 -306429 -3006 -91441 58093 -37790 -273463 -306537 -259093 96009 126818 -317730
8856 58765 -216903 -128064 -304389 -109544 -229959 208607 29983 -127320 165943 164176 116360
8845 116360 -203394 102533 281121 -179118 18452 39370 100719 240439 -69297 -15672 -187039
8834 -187039 86583 7298 -17074 43592 -103061 147459 -39105 -181822 17671 -61832 -437039
8823 -437039 -203805 228022 66922 24489 -134207 21401 -105216 -174326 -242790 238439 -117612
8811 -94952 -11131 2697 85491 -23735 2222 7139 -249728 102761 17565 -214333 72323 -78259
8798 -14614 5655 -15539 -301711 -176173 286043 -269234 -87478 -41458 -267105 130256 -383155
8786 7549 -39852 -80522 48675 -20099 -191124 153198 177365 -77668 -475763 -103007 -41310
8774 -81736 101570 -427082 27544 80270 -40561 -142412 -133760 166163 154607 235230 264851
8763 264851 45277 177188 -321880 -55264 -65959 -98156 78784 -209914 -6875 -129706 116690
8751 -50340 -12628 94863 -198559 -137107 241162 -129391 -107481 126578 8993 -174 -128583
8740 -128583 -82343 45256 -343073 -138544 -127273 39399 276992 156582 -49787 63038 668
8728 -89902 41907 39451 -45410 -32552 84481 153046 44862 188690 175321 -94293 351004 15175
8715 -31572 116760 -236717 184109 -8676 -54415 196084 -399897 167192 56920 -41792 -14461
8703 116206 -112116 93638 184897 -309722 -329118 103266 158137 -121349 212782 259153 -62501
8691 150460 -345306 -389768 -354013 53819 -31600 -239472 236748 317000 -233534 -85968 -361540
8680 -361540 -6907 -203861 -138068 82623 -147577 315662 -170399 15032 -185736 -48788 138560
8668 -161557 -109671 -28824 -129716 -153361 -366995 -26849 88107 -11395 22633 -467122 -138814
8656 121483 -201540 -27340 14164 -223589 -366680 16830 -17352 80754 -62520 93219 -155974
8644 -74442 360137 -70776 -196214 -146998 200759 160042 -27323 -31900 -11749 -303320 -22433
8632 -77520 50221 -142445 -100674 -213207 -189549 -194867 -58472 214622 -48808 -138036 -85692
8621 -85692 83852 -87352 -75130 -549774 60307 157971 -144436 -76895 -331652 -118857 291613
8609 -178792 -285513 -29885 -58272 153845 -26788 -26520 -148449 208091 -255895 170813 -162891
8597 -195899 290098 -156630 -255450 -29299 73910 -325907 -392020 -153170 -90093 -211217 75021
8585 -83875 148227 18566 -86711 -85605 -313986 -143985 -261160 180625 -248532 -45356 -164490
8574 -164490 74805 178875 -73629 39833 -203795 -9206 179474 -266049 -196255 59594 33536
8563 33536 -69908 99620 262479 -196757 -168391 226255 -80652 204858 -152587 111566 -117095
8551 -82362 127612 -140561 141958 188098 -180523 -3740 -390133 180238 -178834 -121204 -9465
8539 -199042 -134595 118468 517833 -60545 56308 32344 -100839 21907 -12635 -308990 -171932
8528 -171932 -178446 111890 -122899 131565 317690 -234427 -65096 15427 -60683 -101909 -69045
8517 -69045 138745 123523 -159521 63728 235570 108817 61936 -362799 187 52609 -389705
8505 -139872 104566 -269873 248534 -9083 -213646 -248779 25634 159424 144425 -240659 -47973
8493 -129145 -17631 -84825 -108030 -10390 99966 -247705 208554 92111 -79850 -91037 -67171
8482 -67171 7537 -221776 27443 -177542 -201606 -79300 -77701 38987 -171190 -165062 169102 -98860
8469 163891 -340157 154388 66217 110627 -207407 39457 -186280 -165997 222205 -98963 -51207
8458 -51207 165822 -350515 402036 -190415 -100920 -172055 137429 -391775 189115 213120
8448 213120 92385 -324383 44058 180071 -734 -304377 118544 58233 52952 -73441 -253136
8437 -253136 176198 175543 182062 16445 -114202 344036 282350 239582 -342508 -56311 -94846
8426 -94846 -185739 -113414 14765 -69981 -92262 -259993 -152570 185185 11755 -75258 215514
8414 -61986 -1049 -1724 -58794 8771 -178246 113901 -25288 -48462 79673 18373 283057 -28350
8401 9879 -115551 212355 -13098 79685 37055 -65709 117278 -143448 -91732 -152279 -165552
8390 -165552 -279050 -150440 203529 -170153 -305376 -38667 -218427 -134215 -302704 -45272
8379 77286 25185 -139959 -227620 -93419 328109 -75608 43203 95224 -71205 -367241 -26856
8367 -299755 -328295 -266367 109124 115781 120710 142780 -139038 -72712 79498 156024 107391 -63427
8354 472869 -148368 33694 72809 -128814 318178 -36817 -98960 279531 207293 85733 -240895
8342 -44637 129743 -13833 136171 -136635 43427 -37272 -76874 66983 749 10954 -72567 -269926
8330 -269926 -127875 -57576 30420 1676 -161091 -123322 -80715 290654 90954 325503 -38904
8318 -381154 135827 -115822 8109 -129169 -235547 -153523 26345 83453 -250869 129970 -253189
8306 160171 103482 -112283 36262 7825 -96823 -5726 13207 -42426 27481 89188 -48837 -208185
8294 -208185 -387824 -86025 79515 -201355 -52827 -108354 111586 233764 185928 -166754 115670
8282 47872 -87882 -157242 13450 -188009 379782 153090 -244636 5817 -41097 -210309 123343
8270 -199382 93129 -77393 -331005 -10417 -188767 -164857 -30413 -174328 133212 -190782 -53130
8258 20273 35208 270061 -217170 -205901 272404 336332 -117019 256664 -129943 -233427
8248 -233427 1679 66808 26642 -271911 -32817 117556 129902 -65288 -177919 -7202 89275
8236 93150 275970 182801 267269 175320 -304841 222108 -51383 -131966 -26063 68593 139691
8225 139691 52541 14798 -11165 121088 -37226 -144850 50633 97124 -258724 -126224 171514
8213 -2086 162024 -77427 -338520 68562 186097 -139326 127211 74873 -131775 -57908 -322666
8202 -322666 75164 137405 -54852 -318406 -19295 -10165 -221351 -131527 189259 -121612 -335177
8191 -335177 -373037 -122738 143019 -116017 60811 86127 155715 63626 -288835 112659 -187868
8179 44852 -108362 -115100 7033 234040 31385 -94919 177330 -283364 -272443 133864 146100
8168 146100 75354 -257493 -36780 118688 -186637 -60360 -230670 106746 270174 1417 52583
8157 52583 -147939 -95874 -218142 -162546 -16009 62112 -351632 -155810 -148893 -86016 -407294
8146 -407294 -12961 61144 -132209 -155142 -189422 128133 272168 60170 70604 -47545 -163172
8135 -163172 -83401 -232188 -152444 6865 -99927 79767 -162550 -65507 -59108 -3634 61022 161623
8123 161623 -91773 174072 -306352 64643 175678 -173074 -34768 -66396 8429 74864 -251240
8111 -35908 -19967 -241424 120678 34233 211313 35536 -48407 -254694 116587 -181565 136830
8099 109363 58184 -463984 131734 -230080 -54130 -174175 -295531 -92376 -43532 -33258 264891
8087 -106238 62624 -40673 -1833 193021 57014 -333510 -104107 505997 -211030 -63848 -328780
8076 -328780 -139531 182231 208623 -233763 182583 -116174 -88096 84013 118320 69801 -97587
8064 -147834 -84083 225 -186969 172068 155292 44898 -112883 193943 -423869 130028 -159453
8052 117440 -77988 -141967 230975 -153503 134198 158451 134686 -118741 -291766 -542348
8042 -542348 -318466 -74804 19031 -180662 340723 349710 -1460 -283957 -67850 -265369 -84052
8030 -317832 143956 169508 -121197 110347 -199028 -70683 -197303 -158174 145478 38457
8019 -239600 -147991 -121323 -14387 -118921 227987 64096 -56512 -63843 -251023 -144000 -279706
8008 -279706 -168125 -315854 76197 -20299 61183 159924 -25376 -156872 -129913 63747 57320
7997 57320 48716 -257675 -92552 287061 -79394 -535874 33254 39649 131881 -184842 -61819
7985 94923 -52026 -107572 -48389 -37240 48231 -130452 3252 82970 -37456 -130547 -238512 83038
7972 -186585 185488 16202 36076 118066 52520 154158 -35465 -230143 -74625 -85924 11406
7960 -193706 424444 161637 1453 -60652 -17501 -137148 49605 -10244 34469 -233185 190901
7948 161118 -153796 -424962 107601 150951 83283 204889 42088 -8676 -133677 -23361 -52654
7937 -52654 -107337 41162 276912 -233710 -125502 113346 305842 97544 -206613 -169629 42092
7925 -102979 -49425 -144405 -177099 433026 -223533 -142787 -92521 -71394 -90068 -250682 212858
7913 -70976 -334450 -15139 160422 -69945 -196882 67743 -79348 -96162 20564 -202479 -134236
7902 -134236 -119445 21672 -105615 90450 -186533 201299 133650 -93479 -91684 74030 -205593
7890 -154286 -16996 -244689 124628 -330284 158984 200578 73905 -18790 261485 60523 -314780
7878 -12604 38387 64309 73091 153029 -90916 62889 -398218 -189282 -49019 83212 172831 91689
7866 91689 -25179 150909 351859 50375 38549 -154745 -133534 51566 -41453 -99897 -233030
7855 -233030 -23942 -106515 -335620 -296607 -8393 -111321 -240846 -51482 -32198 119384 -61291
7843 15339 -302603 154547 43452 -32510 -39158 -270020 3049 109332 -33565 -183268 -101469
7832 -101469 -94006 140544 -1137 -281254 -560568 -118498 -247310 45261 131712 -167755 -62060
7820 553218 123904 159786 91123 70557 283845 372946 180694 135889 142948 -138455 59491
7808 -303042 -168543 -110015 -39584 -205116 -90927 218548 448339 108938 -249682 -220115
7798 -220115 80596 -127264 5485 -44673 203126 -87851 362226 256762 -34191 -241881 46072
7786 -130817 271159 -66239 -139045 -3751 -211998 -27138 -21839 -67343 91261 80730 38680 -396855
7773 -69309 -215839 -7252 65519 -28683 -93493 98541 18524 -309549 -44223 -158938 106326
7761 -96835 35331 183082 320889 45910 26561 -367378 -30941 -384450 43380 -162371 -36787
7749 -126766 49889 -515753 -12759 279410 108095 19143 60958 28536 209002 297397 -101728
7737 42300 67241 -25439 320004 -25485 28526 -26516 -280774 -304550 -207825 -83146 49966
7725 -238309 -38350 6940 -164137 -182200 148773 111323 -155512 -94643 -24829 -301502 -55631
7713 -117076 201548 137434 184160 -318138 -38590 -21259 -254686 -80034 4155 -201187 -830
7701 -63885 13550 213837 11058 -142488 196788 -63138 -28338 70030 -88144 24315 63482
7690 63482 42072 -126240 103718 -235981 -165511 132689 -172381 28049 37256 -7869 394199
7678 -38049 -111893 -97486 53730 238149 29685 -99266 350858 110100 -177993 -85574 168786
7666 303471 168486 91963 -320502 -114226 -152646 105940 -93975 -21043 99371 -269190 17825
7654 196667 9895 295243 187497 -338413 -87072 327038 224131 -99849 -66202 62597 62136
7643 62136 309756 139164 -35560 -135906 -215492 -43814 -349506 -269240 -187049 -54434 91563
7631 -261953 -78512 171298 178904 201127 63760 -132780 220726 106975 -36079 181647 262914
7620 262914 196787 239614 128418 -236532 -69817 -310979 -119245 -206515 170842 9591 -124493
7608 -74695 -38982 -77128 112045 -48326 -176004 96836 -14969 40751 -16065 257938 -198659
7596 -141592 -66852 158532 -201624 -2620 -62586 -130703 92271 -21145 105770 392169 -157723
7584 -58775 116929 208588 288650 -8594 210392 38488 -367425 6254 -92114 -250652 -65681
7572 317765 -133266 -127126 -116717 -123809 141542 83391 -288009 -1251 -115311 -286527 -153675
7561 -153675 30437 157669 -127306 99510 -94399 348616 -118587 20402 -58199 -71596 276150
7549 -68069 -88725 153937 -272747 53335 88438 -349265 -64432 -353951 -78238 -109567 -214415
7538 -214415 -242471 -114589 242520 72325 -361506 -22564 14526 28732 172042 -129405 78232
7526 -197892 -93737 -172291 2583 -11312 221246 151401 -255060 -73795 -221362 88673 -77130
7514 -170840 51076 -237082 102742 9943 -1576 -56034 69270 102291 207807 -102727 -71521
7503 -71521 -86494 -126462 -3228 -53173 147273 -264386 -138991 -354696 -124036 -23255 64362
7491 -136578 5463 67867 -298512 175255 250497 -63624 -236391 -86742 154884 36309 203712
7480 203712 86965 1326 -345056 -288129 -30150 -120116 36567 6983 -219135 8592 -112798 -155741
7468 -155741 -383683 -116022 57471 -211481 36552 98179 -321223 -89127 1576 342219 -32260
7456 -10485 -110939 81243 -168669 317696 -141013 126679 59824 154164 35228 -91146 -140771
7445 -140771 -108582 -351981 -199220 -68980 42831 -165770 -139532 322014 -86733 -64822 -179176
7434 -179176 267925 -189684 188441 -321493 -104166 -127592 -43997 214634 -106350 140978
7423 298017 -5434 222051 37864 49586 230124 -388426 -204484 92992 134089 -53247 4886
7411 -191229 244195 -222477 -55413 144143 -2125 15607 -113019 -121290 118444 -153009 193170
7399 -28298 -205475 57958 -196338 58316 104759 23283 -61239 -83290 316449 24762 -219502
7387 -203079 107025 -191169 127547 88297 59716 76510 70210 -154506 6182 193826 143332
7376 143332 265414 -37427 90758 -84466 -125213 -151785 -109869 20925 -597824 166809 -170842
7364 52436 74970 -16659 -46591 88214 70528 -108115 -61458 -351195 237700 -58845 144127
7352 -184846 -173959 -147454 -118580 -121710 -252316 -53585 65264 -179027 -351733 178664 61997
7340 -8876 122825 -20893 28089 -197917 417366 -310063 -109804 92873 -302714 -114094 161897
7328 252259 -36031 178153 41656 5963 413372 52759 230979 -74295 110553 114508 -137192
7316 58499 70551 -169348 -156769 85115 -195801 -269827 422599 -174226 -376446 -183791 192345
7304 -125291 124042 -124927 70782 117856 257071 -366495 -59608 233292 166946 -159280
7293 -76172 -161340 129717 -49166 94825 -285213 -21345 -160877 161541 199501 48429 -254418
7281 58486 92743 3544 402649 -54172 255035 47352 131514 -215601 -226031 -94023 155846
7269 -131340 -296427 300018 82663 -86781 -387408 140880 -45203 -121989 7132 -238142 -1309
7257 191963 83055 -98904 -79855 -196220 204044 185078 -27614 -403639 -396011 -48755 333387
7245 165311 24533 1451 98726 121340 -12659 -100481 -127456 168558 -232017 133504 -274371
7233 -57308 -17289 -347983 -26302 -360248 265357 98598 -66283 38602 57174 -90709 -113555
7222 -113555 -20557 -173209 125526 -145580 236840 -89573 205819 18129 430541 -37850
7211 5020 -3549 -48440 -412871 -9422 43460 205882 -217871 -54961 -146675 106510 -186128
7199 -109408 -178230 -213957 -255626 -78115 -106182 284302 -331619 113394 -58533 -74079 -58983
7188 -58983 -38650 -109059 264704 -73422 129266 -18561 1572 -155368 -32203 -102735 -162554
7177 -162554 -51441 -220947 166606 -223440 50239 -41752 -96520 167010 -131535 78423 -141147
7165 30274 -160879 -119398 -61961 -180867 -69988 170136 204757 27102 178448 -92878 254246
7153 -61280 -244672 143299 278365 14477 -278908 73169 149872 147746 -121259 -28251 282630
7141 13988 51395 62758 -26946 -113853 5256 -246768 -10202 -93672 -205920 109104 -238174
7129 -68997 -5071 39799 578255 -76718 -107322 -9875 142938 195835 -169715 167301 -195784
7117 -183237 194995 -148410 -195559 -10626 191980 -14486 -149769 -105901 67745 -134437 73668
7105 -211215 -183198 104931 -147498 -771 142843 42780 -115743 -57719 -31599 141772 193567
7094 193567 179351 86343 -12166 51662 233142 258518 164658 -130398 -96071 206163 70070
7082 -214858 -35993 -19722 -361882 -126012 186322 -209919 84730 -107889 115001 -15166
7071 -75015 220376 195941 -64371 -147559 -158540 -6584 54868 -52282 -392817 -6957 -2070 10919
7058 314748 157938 18734 -155382 -110542 -172064 51376 -301829 175457 -311248 -163401
7048 -163401 287865 -56754 -290348 1335 -138783 330277 -124945 -75007 -204340 -96650 -143248
7037 -143248 36789 -43573 92307 -111856 -746 -126360 -125450 135423 44966 58725 -294838 -60010
7024 -2735 77437 228631 -77154 13110 29519 -109462 -65521 -165803 -80876 -65592 178226
7012 -173120 236437 -179779 -47510 18635 -132523 -118987 28393 -95237 306429 -157707 -27348
7000 242166 110209 10111 203267 62980 122958 6732 300010 -12735 78459 -123556 44405
6988 -62378 -259337 -30070 -28224 -76293 -98565 109957 9147 -196272 197103 207187 -51691
6976 -314173 -136571 -99674 -96539 -26615 -154971 17839 -172132 -18917 31551 -210980 -136822
6965 -136822 75264 -107105 1574 117866 -188149 -131441 -208616 59149 -4394 9207 78501 81474
6953 81474 121444 212413 -167737 -102338 -364032 -182495 -150704 375054 -182331 7008 201159
6942 201159 -133827 181147 -125927 -247960 21359 141298 -207056 218177 126435 131288
6932 131288 -260384 -4360 75274 -60256 427535 37175 -61516 133343 -26396 -60604 -269739
6921 -269739 -69294 -121154 67427 104080 76869 127492 -72162 278813 261692 -123859 176261
6909 5587 -66380 43981 -112122 52467 -114893 -95044 59154 54437 306624 -88319 41614 -104544
6896 -32453 -15953 247551 -38068 -357579 -187274 -217141 49276 86697 64510 -2076 -207054
6885 -207054 116527 51620 -212196 62189 -87279 77979 -177756 -46129 114391 -15697 -202755
6874 -202755 76807 -41610 89629 -50936 32846 -15145 41013 -87577 244576 194571 -124959
6862 679 -83244 -31200 134014 -44073 62809 2703 -82737 -64913 180266 -163136 -2446 -310947
6850 -310947 -85371 -270252 -215874 -181290 70023 -58642 -243809 195924 298248 111055 -152217
6838 642 -164082 -54433 -33973 -157881 101475 189491 -202272 -129672 -6263 -109819 -216960
6827 -216960 29213 -11895 -389425 71389 94782 74721 22036 -40802 67648 -230810 -177181
6816 -177181 -31854 116259 -112516 -63421 153601 35225 65121 184922 -212589 -95230 -202629
6805 -202629 -116413 67331 -38301 57898 -87161 156170 -126389 -265132 -317104 -41798 40546
6793 53927 -38314 49239 179618 124340 47024 -223486 -156096 -31729 44554 11405 -204832
6781 -200373 81052 15831 77181 24298 152150 -268512 -184793 408742 52125 -62316 205377
6769 186125 29879 129959 303648 68420 163709 131556 202141 -250782 -18730 202189 184622
6758 184622 -68691 -261683 105812 218633 106988 -276195 -160741 -62972 26886 -180707
6747 -159058 94513 6162 -105002 -192926 -38756 230317 40650 316176 -234178 -8327 -30769
6736 -30769 -91441 63258 42 -52062 -26285 -70625 -136130 209183 -73011 -97905 -53937 -10728
6723 32585 -149984 4742 58401 61356 -298698 118893 312976 -37522 77015 -151312 372538
6711 -185532 -91452 -99923 287894 111871 -115944 -77660 -212692 22246 -302439 49342 -400519
6699 30823 -189442 -4354 46852 -5711 -48903 -31917 -33446 -36509 -46711 -171073 86435 -49653
6686 -129236 -126682 155420 2124 -172055 -10878 -142582 -58832 66344 -53548 53703 87400
6675 87400 168314 -26697 97813 10832 74453 -160048 75188 120977 3249 248309 -133711
6663 -88472 -193438 62927 -155422 102306 -124748 -207495 -35779 187568 -61738 96327 123892
6652 123892 -176904 -51888 266501 -152317 -434636 -4601 -28234 1878 299976 -70282 8927
6640 139167 -238600 -22024 44601 -78896 -56713 -107007 140607 118252 -190347 113520 -149962
6628 -59389 -177598 436300 56037 -183421 121597 -54443 -165400 -43833 16765 -279810 36376
6616 176119 235964 7587 37423 -145136 -230924 -175200 137754 -329845 185835 34049 49028
6605 49028 171642 123174 61856 302109 29212 300180 -141586 -173107 122576 -210177 180383
6593 358820 -33651 188097 359558 -10151 -5011 130552 6131 -46173 -283304 227579 45402
6581 -1336 169142 -269639 -131581 5479 -175075 -9190 -77479 -286165 84821 -138036 -229756
6570 -229756 73346 -40158 -142137 168260 -230044 -84902 1889 -389478 -105433 -154072 -165835
6559 -165835 131780 7812 1133 255303 174573 78856 -145764 -155071 -36805 -67515 -141057 68913
6546 -40988 -210826 -15219 71308 -48962 166494 101735 -190158 -47278 -311447 -270487 89558
6534 -131434 54228 -105378 -117488 -159313 209092 -21903 124351 36462 66876 -595 209479
6522 -179669 -292514 -250759 53311 -86231 61914 -141881 13656 8141 -96190 -27661 1492 49256
6510 49256 -33815 61725 30656 66049 -196173 52851 106872 211113 77679 9539 -334986
6498 61880 54140 -254654 -241957 -154577 171267 38562 325848 -223773 92070 121177 -63516
6486 -86655 -80384 -130040 -208150 -77893 62342 175969 -223672 -388620 -140754 35341 59783
6475 59783 24785 -246832 124484 -105493 273952 129577 -217232 8614 -78673 145624 113994
6464 113994 137674 -149978 -169569 -114024 -42468 -418106 -107951 -19129 -16362 -139167 158547
6452 -84993 94188 74297 -278821 105915 16599 75847 174448 176013 -46670 -71951 -200181
6441 -200181 57368 -125145 8503 -136695 -108683 -247759 58814 190952 -120875 -193106 228005
6429 58229 187240 -493500 115332 114849 -260879 193047 53034 24025 -219691 166830 -138528
6417 110670 109570 -188629 97650 -121705 -197355 -118269 -47577 -252272 -200076 162210 201015
6406 201015 -94802 -175643 168157 -63948 49727 -172391 -118662 -201641 -144258 106934 -259852
6394 -54580 158128 -199874 -19240 119172 348660 -123604 -114646 111367 100400 -34271 228690
6382 -306125 -205928 70059 -66514 8982 -135845 -136718 -124794 18062 25858 -48231 -114766 -77646
6370 -77646 307168 89601 -95333 -84722 -30575 -350628 -78626 -102268 -409313 -81514 -99352
6359 -99352 9561 173402 20190 219478 130226 -197779 -152742 -218417 53871 -2723 -248269
6348 -248269 -181053 -432238 -106914 151023 -219815 59233 -170975 -64213 -108622 -130823 125187
6336 -151769 65462 -257499 180748 149173 -54366 -140702 -100728 -231564 66138 48052 -133058
6324 -13228 480453 139113 25755 173846 10343 100922 185822 249428 941 222729 -258506
6312 -6281 117511 -217352 44321 -66149 231815 269500 97461 -125986 -243780 -136558 -21090
6300 -160555 -258858 222637 218233 -220519 -43314 273916 146489 -149588 117157 56006 -152856
6288 -24220 9930 178094 31210 230732 88965 -146336 -62353 275303 -383053 -230659 156413
6276 -26144 6473 315433 181565 -104905 -306334 16847 63230 -217369 84042 -22635 -71782
6265 -71782 68207 -224457 -307183 169980 177213 -99389 112454 23674 82916 45973 348107
6254 348107 -144394 20467 -38637 -12081 176856 -28117 36083 43965 -230708 -44136 -210199
6243 -210199 53269 -341384 86221 5166 -166087 3487 -16575 -244531 58507 78866 -222179
6231 -55068 12047 77548 80419 220841 35547 -102341 -325393 -104224 93219 275423 132036
6219 360019 10457 -103513 -67824 135072 198592 -33069 -34833 -414482 213733 -294574 -78968
6207 146933 -209083 202637 75223 -3904 19645 93253 189983 77172 89892 -262240 -164443
6196 -164443 67420 124939 -217064 57342 235182 213166 102596 -261559 473036 131992
6185 94158 -2446 133110 -222155 -109710 -113961 46670 -255125 -373094 -64354 176847 92224
6174 92224 -324214 -120632 -212770 -138599 111301 97869 4930 -133758 -71635 82569 81519
6163 81519 75916 -272909 -115531 -109794 -177343 17930 16796 109074 -33666 -156420 -236933 30823
6150 19422 81250 37537 280681 -103222 -74761 -195155 178207 2453 -96016 31685 75133
6139 75133 -35829 174844 17002 113303 356303 158625 -204464 43763 60544 -129716 -1559
6127 -87029 170236 194733 83873 32745 192565 37379 81761 236637 85820 82564 56099
6116 56099 -131077 -171463 -161527 -230016 8437 149304 -461886 264312 -18230 141522 64383
6104 -225955 -183182 245472 60930 -45999 -147700 65125 -142337 -122430 114769 -229567 -119755
6093 -119755 -73177 -104698 338199 -29921 125489 27587 -207290 291040 -128815 349374
6082 173281 -19669 -197823 -170410 -50126 -133570 330461 81864 218596 -239610 115377 -98486
6070 -86527 -38606 253948 137126 291123 -441791 -242438 122349 283413 115855 -377125
6059 145539 -24895 -68260 -331131 -135229 -146549 -346303 -214173 227180 166664 355870
6049 355870 189344 44763 -134090 -98206 -52612 114805 -98039 -178329 59877 145414 48319
6037 -130067 71691 -227627 67651 -112690 -63893 143913 -42787 -156289 -231079 -271751 -2351
6025 -97636 -14350 -1779 65167 -120210 -178465 59579 -603 -125585 48875 -172858 -179969 -231277
6013 -231277 112120 -184674 -153782 163087 64265 -141271 85037 79318 216103 -138468 87445
6001 -476196 -459300 -132637 -20 113703 265011 200647 -293184 207954 -68399 -62486 71254
5989 -268931 -386582 -378404 -73444 -73117 142056 142794 40149 702389 16420 113411 275273 -86490
5976 246925 -160415 -276765 239651 -85917 -100891 -20261 -104839 278510 47102 9605 -29396
5964 229 -16140 108885 -74447 -292300 563 -48175 -80838 267200 42353 53554 -65373 102397
5951 -186850 123680 87351 -35195 -139264 60538 -109660 47922 -106537 12314 289706 33926
5939 186706 -86965 -15312 -201809 31090 243386 -16285 411475 433635 168506 -42851 -7336
5927 -271276 23353 147732 -118709 -328653 -304431 196394 -101060 -19358 -22557 -191995 -5920
5915 -58067 67236 -9582 103136 93370 4442 22243 -77929 -160726 3870 192753 42506 -142539
5902 -80778 -355254 3007 154294 173343 176370 -153017 202184 -19389 -45398 57108 92588
5891 92588 64620 71687 84675 -83542 155616 -30348 116386 53694 93614 -38427 216149
5879 387235 -106729 -100679 -68531 -10672 -246832 -101380 242421 184415 -250038 17156 43135
5868 43135 3484 -130999 -188819 -18665 227323 144822 -68240 145210 97592 -262796 8837
5856 -128585 -346165 113310 289963 82883 -99433 339750 158025 -285512 228510 -213369
5845 -87292 273313 48165 19126 186518 -174374 57065 85270 -14787 -179489 302313 -410912
5833 339740 91643 -221529 157268 -283961 38335 176042 35181 60892 -113366 -116850 238452
5821 8969 453188 91759 -57867 -174911 -282642 151141 -108063 -191812 177495 14063 -99054
5809 -121766 87033 232615 -217032 -213853 -260846 372825 170005 297415 -61768 -147100 -95411
5798 -95411 -439195 106298 254977 -3457 -117595 212672 236404 265001 -16444 -75950 59405
5786 -93213 -79093 218088 62298 -94868 82624 -182813 -79253 -102997 -75324 -129600 -90489
5775 -90489 -20742 -117564 209030 354236 -140824 297262 -63537 -176105 210843 64534 -98867
5763 253286 85026 -174978 17041 -5380 32390 39385 94163 -314169 -86614 201073 -8183 -95515
5751 -95515 -234710 257622 69054 -124105 -180873 -120204 -93632 -192079 310414 115302 77197
5740 77197 -139216 -246591 3912 109336 -174691 -365669 -314573 -79415 58477 189498 92905
5728 -22693 -35960 -34856 -31116 -69312 -91347 54571 322124 -40880 126991 190973 -134883 51920
5715 -40473 224608 -152365 25666 -78206 151453 117112 -146985 -296567 209662 109970 56998
5704 56998 126200 -49181 266719 -392519 -388084 142210 -1394 110995 -18324 -31664 203366
5692 31676 18546 -243767 -4377 -137049 4976 -43650 -103609 246423 188546 194790 -129578 -118435
5680 -118435 -54468 -238545 61452 -165580 -150193 227898 120461 63892 -205637 -126802 165482
5668 243544 -81030 -101605 -135533 7630 -98027 -117841 -209179 226426 -91590 -8994 268273 -476
5655 51115 218127 -252092 364094 110489 -29204 82046 -112107 38028 34501 154134 -331617
5643 -41361 180590 -64627 -16668 -166791 -307977 -37747 146620 36359 122220 -110914 -67262
5632 -67262 -295100 21933 344932 -2867 142379 -187990 441661 -256707 54102 -81921 -95907
5621 -95907 18330 -49121 -259166 -124628 -115649 -65955 15055 -10076 -118433 217394 55439
5609 114637 -84155 132934 -10417 -48211 -160377 -221827 -123314 54518 502992 267625 121191
5597 -402689 -6804 -303818 -18112 -233579 -73838 -58101 72741 -145124 96638 163529 123466
5586 123466 15367 -47251 28729 -210568 -216391 79651 56814 28191 -66157 167432 74117
5574 -275515 -247091 -86963 -186551 -12335 -155797 169931 -180517 112958 -69511 -158927 -32046
5562 36053 -108869 63541 -11930 204036 -466023 -59250 488 -192538 -233160 258667 21549
5550 -14094 246968 192897 8081 44798 216656 3843 -258621 -47675 14412 23014 171268 -65917
5537 262695 -92505 14913 146720 -70376 147072 232318 169202 -246726 -49350 187318 134377
5526 134377 161077 -162931 96342 -113801 -198471 18085 104006 86131 -28908 -146113 -31896
5514 -114040 259820 46184 277040 -213542 -10274 -43540 12403 188675 173043 157578 -158518
5502 184105 17415 -225459 -276803 -142550 215662 167289 -109776 389975 -57199 -86050 219193
5490 -54950 -4368 50325 -161942 -65262 244323 49890 76819 -105406 -437907 -94916 -93832
5479 -93832 270493 173852 -120467 308671 -127984 -64140 -187674 -356984 -65355 -140023 228367
5467 85635 -193733 -15603 -449137 -154583 175894 -283368 182412 -129161 -125435 80788 84343
5456 84343 -130996 -82510 -30920 -387580 1543 27934 50305 -96331 -133293 -311544 -152015
5444 -185823 140894 135959 5759 -118146 -117498 -22346 -184409 -71780 -89430 -265754 -277763 311976
5431 42945 213164 -101672 106011 241698 -120947 -90299 -169210 28159 -127552 125349
5420 -291269 -259681 -270647 181928 22651 15754 -118188 -99653 -97669 -220156 35681 -49546
5408 -84096 -68622 -234983 -64537 -64418 302711 377351 34472 66842 28379 154211 -251259
5396 100617 406433 60963 -60424 -103190 99225 125072 -399554 86879 35364 151804 175175
5385 175175 -23787 -141929 129726 12111 5039 -41097 84080 15920 209975 75786 -32993
5373 -116880 59567 187920 -18730 -111521 59061 -154443 -74551 -100942 -310390 35288 199704
5362 199704 185230 44883 192437 103918 66374 164995 -172647 -113543 168166 -290 -27744
5351 -27744 68720 55736 151641 180863 -152148 153082 473506 186064 180392 7152 -15924
5339 104373 72851 101901 -70896 -352124 -163630 118951 -220874 257615 86512 309801
5329 309801 -72570 -179574 -77082 152097 39754 33100 160561 -365176 -140829 25762 -70651
5317 200931 -52351 331784 -33022 -202729 -185591 275500 84739 121641 186165 54091 212088
5306 212088 188280 -186341 365644 -172706 -203328 383288 -15188 -9499 -81372 143628 145561
5295 145561 -167145 -161543 -43222 84382 -43780 -380974 -168299 -81097 -27593 75466 95376
5284 95376 -141906 -26542 -179411 122383 -322475 -29519 -28218 109811 190983 87996 119956
5273 119956 -57304 -90246 77720 -375540 -83850 -110515 8705 129578 97741 48894 -110079
5261 26931 83982 -186692 9697 -218531 -102609 256796 152798 -74433 94331 349660 93730
5249 18122 -56460 182086 269642 52202 56232 98552 -66419 -56790 -9390 20521 -56325 -8552
5236 79216 239156 -144389 -19444 -15307 -237221 -140758 -165470 -59770 30485 -59917 -90139
5225 -90139 -348066 -113994 91108 -80333 -58775 -36045 -158119 337600 252233 -211206 276300
5213 -70512 -224182 104597 -132594 -87930 151169 426912 14202 10392 -110420 221141 -278468
5201 -213918 72247 -222306 -398012 190545 -123373 104375 80938 -56081 218695 -76422
5190 -312278 -138686 -240095 -352621 -123302 -62735 235116 -49972 -3197 405197 -272496
5179 -251935 -283862 -164922 73936 -134933 127708 35473 -123759 231376 -18199 -293551
5169 -293551 125145 245538 185520 51828 1780 66564 -103362 -80976 -168255 20152 158741
5158 158741 -172316 210416 176392 -527327 -340717 420631 -139003 130578 11366 9696
5148 9696 138776 126594 -41033 41633 -44640 -39241 -62647 1999 -28509 -208971 -22207 133898
5135 154201 238324 -118881 190491 -218269 214368 126845 227340 193339 -13883 -383773
5125 -383773 103655 201962 69880 -8504 -169493 -79419 -121075 -34726 172651 53261 14249
5113 116977 66161 314540 -147357 3923 270894 291413 23157 170878 -479197 126346 39515
5101 122320 19609 117965 429348 25161 185581 -288705 231201 32861 -92006 -169767 60831
5089 -73867 72911 54010 -282765 -49203 4078 -186908 301664 -89399 -32944 43337 122593
5078 122593 198601 -184282 289202 186053 -61644 32011 -65965 -52851 46447 328637 124869
5066 248548 -336127 -19514 85908 64893 18496 6539 145369 124515 121978 375198 143033
5054 51356 -28933 -101157 96039 -82677 -222913 130005 361551 78744 233389 165885 160262
5043 160262 -45732 -176538 -151327 -146101 143958 278653 20182 -11343 -174525 195185 250869
5032 250869 -74037 -32312 -293109 137216 45383 -253287 1846 4995 33718 170956 179297
5021 179297 -21965 210771 321612 55928 -172446 97989 -99143 -42706 -141603 -168580 18220
5009 123163 62133 -107365 144314 5562 91967 -345745 -17641 -89637 146068 -154687 140881
4997 -16555 -105972 -134825 68409 -86264 124554 -100430 -35206 -150123 217742 -39868 -69286
4986 -69286 -12510 30232 -201001 -25965 123043 -23938 124214 123214 -114314 180314 -162154
4974 233715 -126003 104996 6488 99383 118242 -6599 115437 -86613 -21908 77183 165431
4963 165431 -113223 199848 172492 485181 -96115 -114869 -5668 107695 169854 -159597 1246
4951 -57246 94241 321790 -24831 254870 276782 -400 -74617 63179 -43949 19323 81126 -56790
4938 -91854 -233795 13157 9689 83556 45323 -224455 45964 -288074 -33981 -111196 66169
4926 351572 -156918 -205848 65789 -71865 25452 -57092 -1644 -189294 -315088 -94550 -81065
4915 -81065 -154475 -140265 -100783 -144350 145228 -225855 -97895 -273672 132144 -253898 213242
4903 -145183 -40838 -52817 218974 -255578 -288181 -142320 -131151 158712 -47636 219769 -113897
4891 91216 46293 280551 -311012 85080 -87499 -144281 -214074 77846 6711 8097 36118 2674
4878 55951 54904 -159992 128466 30606 -260614 -56502 98824 -59338 -334619 -46340 201502
4866 45293 -96398 110700 -246984 104558 32704 -147830 106257 263018 23396 228861
4856 228861 -72930 161869 -90165 -12284 -2534 50084 -177616 77296 112663 -204351 -110542
4845 -110542 -197074 -203486 -108908 -23786 141877 32261 -60908 138066 -121506 284036 204730
4834 204730 7149 -122749 89509 -70904 -32726 -124894 -66006 58116 -32350 -381021 219211
4822 5312 319371 283250 -156971 55254 -171325 86279 10746 187500 19901 263721 155049
4811 155049 -357807 -15155 215167 139389 -54840 16364 -159344 67606 71911 96027 196045
4800 196045 -126574 73988 282968 122314 87452 -81848 -1047 343144 -15280 151703 -5563
4788 169275 -128803 173946 -192317 275604 -22055 202956 3042 -97768 2362 179422 -94675
4776 93888 -70919 -263615 -387356 -93122 -158703 -110643 -410687 178430 -6996 81336 -84757
4764 -121750 -129691 29676 -39754 -24000 -133783 121056 33186 83305 -188649 -164217 135452
4752 241654 93615 -89337 98791 98605 29054 -272752 165754 244519 -199503 -217344 -169986
4741 -169986 60828 92952 198477 -119150 58437 88900 -83463 95688 5639 -453470 314068
4729 366467 74169 12542 366425 -18012 -149545 55093 -168774 292402 119874 68273 -34439
4717 -13001 -132463 13384 -193434 -11684 -193531 -246572 112551 259767 -11759 -131939 149152
4705 52057 80878 96529 -45584 70563 27084 13505 130126 525875 -33794 202409 -89158
4693 341906 178385 -141185 -26317 306134 395428 308439 -343014 -118424 406428 -124010
4682 -308461 -388274 -202161 -136173 -182880 -72566 -149767 121329 -258027 -351919 -87973 149319
4670 24074 145847 257128 -431795 185968 -14311 -111436 117331 20134 -85127 -311390 212301
4658 526 41301 -246152 363148 -65774 -219574 263138 9818 259381 75699 -94085 -184510
4647 -184510 -177849 -75835 -29774 16982 84937 9566 -102793 -49004 -190289 -29633 17831 228331
4635 228331 62507 -132606 38955 64949 199984 -125375 276598 -88979 339899 -138114
4624 47998 159456 26749 -200914 -134713 110913 28876 127117 -2306 -231642 347495 96233
4612 -76866 -247720 -7878 -65096 -108250 273061 63302 -218745 -4805 -109260 76585 56892
4601 56892 27376 -26212 12563 540 49426 -23478 -40892 -52082 43797 -294248 324994 -77763
4588 -114245 -26660 288785 12133 -147511 210259 114204 16734 -386980 8376 -8180 -51446
4577 -51446 13218 70891 -97593 420845 -118220 47023 13710 -66228 97638 149716 34539
4565 123108 -218523 -23568 351427 261284 111677 39563 -94346 119345 -48887 211340 -78356
4553 -61711 -112981 198983 -148208 -40134 -22205 -116524 3150 -102327 148332 -160473 63434
4541 322043 -92567 -152331 -11950 216968 -303841 13994 188013 45769 -22959 -50041 -25545
4530 -25545 -973 113737 -53088 505223 -146788 461131 192938 61911 -26203 -249711 -10822
4518 -147771 -318673 31356 -13854 116850 121633 -70155 52789 -179395 252141 -94464 45052
4506 257386 272388 390903 -215662 -17761 136731 23977 130871 -366280 99995 -126577
4495 172619 79067 122144 -38686 73697 -165427 23505 284250 -204206 128020 -303925 -273774
4484 -273774 246886 91907 58399 200651 167037 188919 111162 163909 67924 -13887 343774
4472 -7476 -85958 -145207 40051 35909 -229069 -69795 244482 163909 25504 199843 288781 21702
4459 -188385 20436 20932 423260 -347577 2944 65384 -20225 -29698 17435 208221 355794 114771
$$ [...]
##END NTUPLES=NMR SPECTRUM
##END=
