##TITLE=NES1053_Conilon_9268809_NPuQtcayzX
##JCAMPDX= 6.0         $$ Bruker NMR JCAMP-DX V2.0
##DATA TYPE= NMR SPECTRUM
##DATA CLASS= NTUPLES
##ORIGIN= BRUKER
##OWNER= Administrator
$$ 1.72 TOPSPIN		Version 2.1
$$ 2015-07-10 20:21:07.910 -0700  Administrator@X
$$ Compression mode = diff/dup
##.OBSERVE FREQUENCY= 400.02188249412
##.OBSERVE NUCLEUS= ^1H
##.ACQUISITION MODE= SIMULTANEOUS (DQD)
##.ACQUISITION SCHEME= undefined
##.AVERAGES= 64
##.DIGITISER RES= 22
##SPECTROMETER/DATA SYSTEM= spect
##.PULSE SEQUENCE= noesygpps1d.comp
##.SOLVENT NAME= COFFEE_meoh
##.SHIFT REFERENCE= INTERNAL, COFFEE_meoh, 1, 14.963
##AUDIT TRAIL= $$ (NUMBER, WHEN, WHO, WHERE, PROCESS, VERSION, WHAT)
$$ ##TITLE= Audit trail, TOPSPIN		Version 2.1
$$ ##JCAMPDX= 5.01
$$ ##ORIGIN= Bruker BioSpin GmbH
$$ ##OWNER= Administrator
$$ $$ E:\/data/COFFEE/nmr/NES1053_Conilon_9268809_NPuQtcayzX/12/pdata/1/auditp.txt
$$ ##AUDIT TRAIL=  $$ (NUMBER, WHEN, WHO, WHERE, PROCESS, VERSION, WHAT)
(   1,<2015-07-10 20:21:02.300 -0700>,<Administrator>,<X>,<go>,<TOPSPIN 2.1>,
      <created by zg
	started at 2015-07-10 20:09:32.894 -0700,
	POWCHK enabled, PULCHK disabled,
       configuration hash MD5:
       21 0F 79 D6 B3 7B B4 F6 88 20 88 DB 03 48 BD 9F
       data hash MD5: 64K
       7D 20 B0 BA 80 8E F7 2B E0 87 97 06 55 71 98 3F>)
(   2,<2015-07-10 20:21:05.816 -0700>,<Administrator>,<X>,<proc1d>,<TOPSPIN 2.1>,
      <Start of raw data processing
       efp LB = 0.3 FT_mod = 6 PKNL = 1 PHC0 = 0 PHC1 = 0 SI = 128K 
       data hash MD5: 128K
       38 EB 12 F5 31 9A F3 4B 6F FA F0 F3 A1 85 3F 32>)
(   3,<2015-07-10 20:21:06.691 -0700>,<Administrator>,<X>,<proc1d>,<TOPSPIN 2.1>,
      <pk PHC0 = -84.86938 PHC1 = 0 
       data hash MD5: 128K
       78 5F 34 EE A2 A2 1C 7F 44 2B A9 E9 B7 5E 4B 61>)
(   4,<2015-07-10 20:21:07.066 -0700>,<Administrator>,<X>,<proc1d>,<TOPSPIN 2.1>,
      <abs ABSG = 1 
       data hash MD5: 128K
       1C C8 8B 62 3B 6C AC 04 54 DA 3B A8 5F 38 39 14>)
(   5,<2015-07-10 20:21:07.175 -0700>,<Administrator>,<X>,<proc1d>,<TOPSPIN 2.1>,
      <abs ABSG = 2 
       data hash MD5: 128K
       87 C1 F6 34 06 8E 68 BA FC 0E 48 E9 60 80 58 96>)
(   6,<2015-07-10 20:21:07.253 -0700>,<Administrator>,<X>,<proc1d>,<TOPSPIN 2.1>,
      <abs ABSG = 3 
       data hash MD5: 128K
       C6 67 E5 59 83 D4 F9 21 E5 2C 06 F4 55 42 A1 B7>)
(   7,<2015-07-10 20:21:07.347 -0700>,<Administrator>,<X>,<proc1d>,<TOPSPIN 2.1>,
      <abs ABSG = 4 
       data hash MD5: 128K
       D8 C8 73 36 4F 3B 97 83 1F 06 6D F9 39 BB D2 10>)
(   8,<2015-07-10 20:21:07.441 -0700>,<Administrator>,<X>,<proc1d>,<TOPSPIN 2.1>,
      <abs ABSG = 5 
       data hash MD5: 128K
       71 D1 DB 37 4E B3 F7 88 46 5E F0 ED A1 70 46 A1>)
$$ ##END=
$$ 
$$ $$ hash MD5
$$ $$ 4F C9 FE 60 FD 0F A2 90 5B FC 47 07 10 46 ED 2F
##$RELAX= 
##$RELAX= 
##$RELAX= 
##$RELAX= 
##$RELAX= 
##$RELAX= 
##$RELAX= 
##$RELAX= 
$$ Bruker specific parameters
$$ --------------------------
##$DU= <E:\>
##$EXPNO= 12
$$ [...]
150 150 150 150 150 150 150 150
##$TP07= 0
##$TPNAME0= <>
##$TPNAME1= <>
##$TPNAME2= <>
##$TPNAME3= <>
##$TPNAME4= <>
##$TPNAME5= <>
##$TPNAME6= <>
##$TPNAME7= <>
##$TPOAL= (0..7)
0.5 0.5 0.5 0.5 0.5 0.5 0.5 0.5
##$TPOFFS= (0..7)
0 0 0 0 0 0 0 0
##$TUNHIN= 0
##$TUNHOUT= 0
##$TUNXOUT= 0
##$USERA1= <user>
##$USERA2= <user>
##$USERA3= <user>
##$USERA4= <user>
##$USERA5= <user>
##$V9= 5
##$VALIST= <valist>
##$VCLIST= <CCCCCCCCCCCCCCC>
##$VD= 0
##$VDLIST= <DDDDDDDDDDDDDDD>
##$VPLIST= <PPPPPPPPPPPPPPP>
##$VTLIST= <TTTTTTTTTTTTTTT>
##$WBST= 2048
##$WBSW= 25
##$XGAIN= (0..3)
0 0 0 0
##$XL= 0
##$YL= 0
##$YMAX_a= 5750693
##$YMIN_a= -11822197
##$ZGOPTNS= <>
##$ZL1= 120
##$ZL2= 120
##$ZL3= 120
##$ZL4= 120
##$ABSF1= 14.963
##$ABSF2= -5.595181
##$ABSG= 5
##$ABSL= 3
##$ALPHA= 0
##$AQORDER= 0
##$ASSFAC= 0
##$ASSFACI= 0
##$ASSFACX= 0
##$ASSWID= 0
##$AUNMP= <proc_prof1d_extract.lims>
##$AXLEFT= 0
##$AXNAME= <>
##$AXNUC= <1H>
##$AXRIGHT= 0
##$AXTYPE= 0
##$AXUNIT= <>
##$AZFE= 0.1
##$AZFW= 0.1
##$BCFW= 0
##$BC_mod= 0
##$BYTORDP= 0
##$COROFFS= 0
##$CY= 15
##$DATMOD= 1
##$DC= 0
##$DFILT= <>
##$DTYPP= 0
##$F1P= 0
##$F2P= 0
##$FCOR= 0.5
##$FTSIZE= 131072
##$FT_mod= 6
##$GAMMA= 0
##$GB= 0
##$INTBC= 1
##$INTSCL= 1
##$ISEN= 128
##$LB= 0.3
##$LEV0= 0
##$LPBIN= 0
##$MAXI= 10000
##$MC2= 0
##$MEAN= 0
##$ME_mod= 0
##$MI= 0
##$NCOEF= 0
##$NC_proc= -2
##$NLEV= 6
##$NOISF1= 0
##$NOISF2= 0
##$NSP= 0
##$NTH_PI= 0
##$NZP= 0
##$OFFSET= 14.963
##$PC= 1
##$PHC0= -84.86938
##$PHC1= 0
##$PH_mod= 1
##$PKNL= yes
##$PPARMOD= 0
##$PPDIAG= 0
##$PPIPTYP= 0
##$PPMPNUM= 2147483647
##$PPRESOL= 1
##$PSCAL= 4
##$PSIGN= 0
##$PYNMP= <proc.py>
##$REVERSE= no
##$SF= 400.020008838247
##$SI= 131072
##$SIGF1= 0
##$SIGF2= 0
##$SINO= 400
##$SIOLD= 131072
##$SPECTYP= <>
##$SREGLST= <1H.CDCl3>
##$SSB= 0
##$STSI= 131072
##$STSR= 0
##$SW_p= 8223.68421052631
##$SYMM= 0
##$S_DEV= 0
##$TDeff= 65536
##$TDoff= 0
##$TI= <>
##$TILT= no
##$TM1= 0
##$TM2= 0
##$TOPLEV= 0
##$USERP1= <user>
##$USERP2= <user>
##$USERP3= <user>
##$USERP4= <user>
##$USERP5= <user>
##$WDW= 1
##$XDIM= 131072
##$YMAX_p= 378914164
##$YMIN_p= -10767
##$CURPLOT= <Network HP LaserJet P1505>
##$CURPRIN= <$Network HP LaserJet P1505>
##$DFORMAT= <normdp>
##$LAYOUT= <+/1D_H.xwp>
##$LFORMAT= <normlp>
##$PFORMAT= <normpl>
##$SURQMSG= 1
$$ End of Bruker specific parameters
$$ ---------------------------------
##NTUPLES= NMR SPECTRUM
##VAR_NAME=  FREQUENCY,     SPECTRUM/REAL,   SPECTRUM/IMAG
##SYMBOL=    X,             R,               I
##VAR_TYPE=  INDEPENDENT,   DEPENDENT,       DEPENDENT
##VAR_FORM=  AFFN,          ASDF,            ASDF
##VAR_DIM=   131072,        131072,          131072
##UNITS=     HZ,            ARBITRARY UNITS, ARBITRARY UNITS
##FACTOR=    0.0627417313425164, 1,          1
##FIRST=     8223.62146879497, 93,           -40384
##LAST=      0,             996,             -40052
##MIN=       0,             -10767,          0
##MAX=       8223.62146879497, 378914164,    0
$$ Real data points
##PAGE= N=1
##DATA TABLE= (X++(R..R)), XYDATA
$$ [...]
$$ plain form
63627 239496 249617 260837 272330 283840 295845 308509 321150 332959 343710 353379 361495 367347
63615 367347 370680 371897 371661 370588 369209 367950 367062 366657 366817 367591 368742 369487 368659 365506 360483 354962
63599 354962 349860 344820 339085 332827 327016 322086 317509 312863 308650 305664 303983 303015 302228 301424 300534
63584 300534 299575 298777 298426 298567 299013 299575 300142 300677 301348 302580 304844 308381 313124 318758 324802 330828
63568 330828 336765 342932 349777 357732 367165 378065 389633 400594 410170 418567 426274 433187 438686
63555 438686 442383 444541 445908 447337 449358 451863 454377 456899 460268 465299 471699 478218 483855 488583
63541 488583 492826 496594 499357 500586 500220 498599 496013 492368 487290 480441 471601 460540 447176 432037
63527 432037 416293 401039 386605 372735 359291 346563 335007 324927 316352 309009 302439 296329
$$ packed form
63627B39496J0121J1220J1493J1510J2005J2664J2641J1809J0751R669Q116N852
63615C67347L333J217k36j073j379j259q88m05J60P74J151P45q28l153n023n521
63599C54962n102n040n735o258n811m930m577m646m213k986j681r68p87q04q90
63584C00534r59p98l51J41M46N62N67N35O71J232K264L537M743N634O044O026
63568C30828N937O167O845P955R433J0900J1568J0961R576Q397P707O913N499
63555D38686L697K158J367J429K021K505K514K522L369N031O400O519N637M728
63541D88583M243L768K763J229l66j621k586l645n078o849q840j1061j3364j5139
63527D32037j5744j5254j4434j3870j3444j2728j1556j0080q575p343o570o110
$$ plain form
63515 296329 290723 285854 281889 278942 277086 276074 275184 273698 271552 269299 267499 266396 266036 266289 266666
63500 266666 266565 265935 265548 266461 269323 274160 280492 287460 294158 300235 306161 312740 320418 329119 338471
63485 338471 347855 356428 363535 369243 374044 377969 380335 380593 378976 375906 371088 363882 354555 344548
63471 344548 335219 326794 318801 311114 304172 298450 294117 291013 288564 285954 282889 280099 278663 278852
63457 278852 280042 281632 283523 285753 288260 291208 294958 299431 303959 308140 312493 317880 324522 331923
63443 331923 339643 347785 356771 366874 377955 389608 401592 414128 427601 442087 457371 473315
63431 473315 489730 505901 520788 533855 545232 554945 562600 568105 572055 574975 576749 577345 577556
63418 577556 578307 579648 581058 582336 583329 583058 580196 574531 567195 559198 550446 540400 529076 517062
$$ packed form
63515B96329n606m869l965k947j856j012q90j486k146k253j800j103l60K53L77
63500B66666j01o30l87R13K862M837O332O968O698O077N926O579P678Q701R352
63485C38471R384Q573P107N708M801L925K366K58j617l070m818p206r327j0007
63471C44548r329q425p993p687o942n722m333l104k449k610l065k790j436J89
63457B78852J190J590J891K230K507K948L750M473M528M181M353N387O642P401
63443C31923P720Q142Q986J0103J1081J1653J1984J2536J3473J4486J5284J5944
63431D73315J6415J6171J4887J3067J1377R713P655N505L950K920J774N96K11
63418E77556P51J341J410J278R93k71k862n665p336p997q752j0046j1324j2014
$$ plain form
63404 517062 505006 493425 482652 472673 463349 454984 448348 443944 441487 440167 439065 437332 434541
63391 434541 431238 428708 427894 428814 431210 435193 440834 447523 454387 461224 468541 476732 485619 494787 504012
63376 504012 513330 522980 533276 544349 556006 567988 580168 592158 602907 611185 616607 619790
63364 619790 621419 621524 619903 616863 613178 609482 606103 603355 601512 600302 598766 595900 591368 585439
63350 585439 578341 569851 559544 547261 533387 518778 504391 490782 477859 465160 452403 439728
63338 439728 427499 416120 406004 397421 390130 383355 376427 369443 363136 358130 354429 351523 348766
63325 348766 345681 342203 338755 335883 333658 331506 328774 325391 321851 318601 315594 312498 309181 305823
63311 305823 302528 299027 294919 290197 285361 280931 277023 273463 270197 267371 265051 263066 261200 259361
$$ packed form
63404E17062j2056j1581j0773r979r324q365o636m404k457j320j102j733k791
63391D34541l303k530q14R20K396L983N641O689O864O837P317Q191Q887R168R225
63376E04012R318R650J0296J1073J1657J1982J2180J1990J0749Q278N422L183
63364F19790J629J05j621l040l685l696l379k748j843j210j536k866m532n929
63350E85439p098q490j0307j2283j3874j4609j4387j3609j2923j2699j2757j2675
63338D39728j2229j1379j0116q583p291o775o928o984o307n006l701k906k757
63325C48766l085l478l448k872k225k152k732l383l540l250l007l096l317l358
63311C05823l295l501m108m722m836m430l908l560l266k826k320j985j866j839
$$ plain form
63297 259361 257477 255416 253177 251082 249530 248517 247581 246291 244609 242691 240631 238683 237493 237606 238709
63282 238709 239820 240330 240464 240535 240246 239066 237011 234657 232645 231497 231520 232433 233389 233921 234543 235795 237044
63265 237044 237174 236329 235975 237015 238806 240372 241655 243040 244532 246112 248241 251199 254376 256977 259097
63250 259097 261392 264053 266868 270005 273853 278164 282115 285288 288018 290811 293992 297818 302305 306880
63236 306880 310807 314004 316931 319706 321952 323542 324866 326233 327665 329399 331931 335272 338753 341882
63222 341882 344825 347710 350053 351413 352258 353579 355877 358925 362384 366135 370050 373846 377272 380280
63208 380280 383030 385825 388987 392645 396688 400971 405409 409769 413608 416711 419559 423119 428044 434086
63194 434086 440340 446068 451346 456951 463630 471529 480250 489277 498296 507363 516937 527619 539599 552503
$$ packed form
63297B59361j884k061k239k095j552j013r36j290j682j918k060j948j190J13J103
63282B38709J111N10J34P1k89j180k055k354k012j148K3R13R56N32O22J252J249
63265B37044J30q45l54J040J791J566J283J385J492J580K129K958L177K601K120
63250B59097K295K661K815L137L848M311L951L173K730K793L181L826M487M575
63236C06880L927L197K927K775K246J590J324J367J432J734K532L341L481L129
63222C41882K943K885K343J360Q45J321K298L048L459L751L915L796L426L008
63208C80280K750K795L162L658M043M283M438M360L839L103K848L560M925O042
63194D34086O254N728N278N605O679P899Q721R027R019R067R574J0682J1980J2904
$$ plain form
63180 552503 565918 579802 594090 608236 621723 634962 649100 664758 681353 697849 713752
63169 713752 729199 744381 759249 773647 787421 800400 812369 823118 832512 840564 847291 852427
63157 852427 855355 855476 852550 846613 837797 826414 813002 798006 781669 764446 747172 730390 713826
63144 713826 697102 680659 665346 651327 638232 626247 616147 608057 601103 594605 588877 584398
63132 584398 580865 577637 574621 572104 570078 568212 566279 564214 561997 559792 557942 556472 554900 552913
63118 552913 550936 549624 548983 548341 547103 545227 543131 541403 540435 540080 539800 539393 539353 540250 541884 543375
63102 543375 544015 543809 543251 542824 542686 542731 542913 543446 544575 546218 548109 550263 552987 556402 560326 564639
63086 564639 569372 574317 578953 582868 585967 588213 589587 590349 590806 590718 589501 587133 584236 581063 577092
$$ packed form
63180E52503J3415J3884J4288J4146J3487J3239J4138J5658J6595J6496J5903
63169G13752J5447J5182J4868J4398J3774J2979J1969J0749R394Q052O727N136
63157H52427K928J21k926n937q816j1383j3412j4996j6337j7223j7274j6782j6564
63144G13826j6724j6443j5313j4019j3095j1985j0100q090o954o498n728m479
63132E84398l533l228l016k517k026j866j933k065k217k205j850j470j572j987
63118E52913j977j312o41o42j238j876k096j728r68l55k80m07m0Q97J634J491
63102E43375O40k06n58m27j38M5J82N33J129J643J891K154K724L415L924M313
63086E64639M733M945M636L915L099K246J374P62M57q8j217k368k897l173l971
$$ plain form
63071 577092 571959 566133 560280 554644 549464 545196 541648 537614 532190 525937 519941 514345 508720 503404
63057 503404 499264 496274 493409 489993 486203 482262 478121 474096 470825 468332 465957 463510 461562 460201
63043 460201 458431 455490 452137 449803 448886 448608 448212 447497 446295 444343 441941 440048 439240 438891 437932 436297
63027 436297 435129 435412 436771 437916 438072 437637 437547 438353 439917 441619 442772 443162 443335 444146 445957 448600
63011 448600 452001 456323 461347 466408 471291 476653 483124 490613 499033 509102 521531 535804 550750
62998 550750 566256 583501 603403 625613 649245 673864 699382 725578 752163 779062 806353
62987 806353 834051 862026 889856 916778 942158 966097 989197 1011671 1032952 1052161 1068464
62976 1068464 1080847 1088115 1089492 1085042 1075242 1060345 1040327 1015283 985679 952276 915853 876994
$$ packed form
63071E77092n133n826n853n636n180m268l548m034n424o253n996n596n625n316
63057E03404m140k990k865l416l790l941m141m025l271k493k375k447j948j361
63043D60201j770k941l353k334r17k78l96p15j202j952k402j893q08l49r59j635
63027D36297j168K83J359J145J56m35r0Q06J564J702J153L90J73Q11J811K643
63011D48600L401M322N024N061M883N362O471P489Q420J0069J2429J4273J4946
62998E50750J5506J7245J9902K2210K3632K4619K5518K6196K6585K6899K7291
62987H06353K7698K7975K7830K6922K5380K3939K3100K2474K1281J9209J6303
62976A068464J2383P268J377m450r800j4897k0018k5044k9604l3403l6423l8859
$$ plain form
62964 876994 836227 794459 753005 712896 674407 637630 603220 571983 543854 518031 494163
62953 494163 472669 453734 436738 421081 406907 394461 383200 372225 361346 351110 341862 333311
62941 333311 325058 317124 309811 303326 297657 292638 288056 283790 279868 276302 272863 269252 265564 262388
62927 262388 260158 258394 255946 252257 248210 245315 244088 243627 242840 241539 240079 238481 236533 234470 232978
62912 232978 232492 232835 233432 233544 232562 230573 228533 227391 227134 227152 227340 228198 229919 232090 234391 236900 239464
62895 239464 241406 242279 242477 242846 243945 245920 248682 251931 255236 258297 261038 263454 265645 267857 270085
62880 270085 271684 271961 271121 270064 269200 268157 266691 265045 263148 260365 256565 252672 249485 246579 243064
62865 243064 238915 234760 230744 226512 222154 218330 215395 213001 210589 207790 204359 200359 196486 193710
$$ packed form
62964H76994m0767m1768m1454m0109l8489l6777l4410l1237k8129k5823k3868
62953D94163k1494j8935j6996j5657j4174j2446j1261j0975j0879j0236r248q551
62941C33311q253p934p313o485n669n019m582m266l922l566l439l611l688l176
62927B62388k230j764k448l689m047k895j227m61p87j301j460j598j948k063j492
62912B32978m86L43N97J12r82j989k040j142k57J8J88Q58J721K171K301K509K564
62895B39464J942Q73J98L69J099J975K762L249L305L061K741K416K191K212K228
62880B70085J599K77q40j057q64j043j466j646j897k783l800l893l187k906l515
62865B43064m149m155m016m232m358l824k935k394k412k799l431m000l873k776
$$ plain form
62851 193710 192342 191786 191294 190653 190017 189366 188399 186911 185124 183602 182753 182410 182108 181803 181962 182786 183721
62834 183721 184120 184094 184223 184659 185067 185344 185806 186518 186953 186554 185363 183945 182955 182859 183747 185122 186040 185751
62816 185751 184247 182137 180115 178595 177731 177537 177918 178641 179369 179783 179738 179269 178440 177263 175831 174486 173641
62799 173641 173346 173073 172158 170574 169207 169114 170485 172464 174029 174784 174852 174418 173777 173509 174011 174917 175463 175447
62781 175447 175352 175474 175468 175029 174537 174676 175644 177056 178460 179739 181098 182744 184542 186039 187040 188009 189528
62764 189528 191507 193426 195282 197578 200279 202552 203905 204889 206183 207569 208391 208556 208442 208142 207425 206214
62748 206214 204572 202471 200072 198012 196805 196132 195241 193914 192502 191168 189712 188076 186546 185405 184844
62733 184844 185103 186211 187628 188634 189116 189581 190462 191803 193479 195300 197010 198690 201046 204711 209288
$$ packed form
62851A93710j368n56m92o41o36o51r67j488j787j522q49l43l02l05J59Q24R35
62834A83721L99k6J29M36M08K77M62P12M35l99j191j418r90r6Q88J375R18k89
62816A85751j504k110k022j520q64j94L81P23P28M14m5m69q29j177j432j345q45
62799A73641k95k73r15j584j367r3J371J979J565P55O8m34o41k68N02R06N46j6
62781A75447r5J22om39m92J39R68J412J404J279J359J646J798J497J001R69J519
62764A89528J979J919J856K296K701K273J353R84J294J386Q22J65j14l00p17j211
62748B06214j642k101k399k060j207o73q91j327j412j334j456j636j530j141n61
62733A84844K59J108J417J006M82M65Q81J341J676J821J710J680K356L665M577
$$ plain form
62718 209288 213691 217448 221090 225284 230240 236051 242872 250516 258559 267204 277456 289983 304273
62705 304273 319351 334931 351474 369496 389374 411642 436913 465415 496806 530460 565862
62694 565862 602913 641963 683357 726755 771076 815112 857905 898498 935818 969054 997785
62683 997785 1021373 1038665 1048651 1051109 1046123 1033412 1012836 985456 953321 918042 880170 840138
62671 840138 799141 758589 719043 680275 642291 605830 571759 540270 510863 482975 456520
62660 456520 431889 409553 389606 371655 355170 339902 325909 313195 301523 290653 280637
62649 280637 271668 263751 256689 250345 244691 239616 234927 230593 226744 223360 220178 217056 214131 211457
62635 211457 208723 205674 202603 200092 198301 196900 195665 194725 194080 193229 191651 189509 187572 186351 185565
$$ packed form
62718B09288M403L757L642M194M956N811O821P644Q043Q645J0252J2527J4290
62705C04273J5078J5580J6543J8022J9878K2268K5271K8502L1391L3654L5402
62694E65862L7051L9050M1394M3398M4321M4036M2793M0593L7320L3236K8731
62683I97785K3588J7292R986K458m986j2711k0576k7380l2135l5279l7872m0032
62671H40138m0997m0552l9546l8768l7984l6461l4071l1489k9407k7888k6455
62660D56520k4631k2336j9947j7951j6485j5268j3993j2714j1672j0870j0016
62649B80637q969p917p062o344n654n075m689m334l849l384l182l122k925k674
62635B11457k734l049l071k511j791j401j235r40o45q51j578k142j937j221p86
$$ plain form
62620 185565 184598 183363 182438 182326 182783 183135 183079 182854 182703 182589 182541 182880 183759 184766 185278 185060 184210 182773
62602 182773 180828 178874 177691 177703 178723 180280 181906 183104 183439 182931 182218 182156 183185 185075 187153 188849
62586 188849 190127 191412 193016 194756 196246 197398 198414 199384 200111 200348 200004 199206 198317 197809 197934 198556
62570 198556 199443 200575 201943 203240 204062 204316 204162 203766 203373 203398 203987 204645 204847 204885 205465 206452 206727 205554
62552 205554 203500 201640 200345 199260 198029 196583 194975 193490 192742 193240 194812 196758 198529 200031 201335
62537 201335 202418 203239 203935 204841 206368 208776 211989 215669 219481 223247 226918 230669 234969 240261 246467
62522 246467 253142 260223 268284 277777 288435 299808 312114 326070 341952 359278 377463 396435
62510 396435 416522 438043 461112 485537 510739 535879 560170 582974 603612 621309 635428
$$ packed form
62620A85565r67j235r25j12M57L52n6k25j51j14m8L39Q79J007N12k18q50j437
62602A82773j945j954j183J2J020J557J626J198L35n08p13o2J029J890K078J696
62586A88849J278J285J604J740J490J152J016R70P27K37l44p98q89n08J25O22
62570A98556Q87J132J368J297Q22K54j54l96l93K5N89O58K02L8N80R87K75j173
62552B05554k054j860j295j085j231j446j608j485p48M98J572J946J771J502J304
62537B01335J083Q21O96R06J527K408L213L680L812L766L671L751M300N292O206
62522B46467O675P081Q061R493J0658J1373J2306J3956J5882J7326J8185J8972
62510C96435K0087K1521K3069K4425K5202K5140K4291K2804K0638J7697J4119
$$ plain form
62499 635428 645591 651506 652922 649966 643354 633934 622006 607342 589937 570557 550386 530280
62487 530280 510545 491374 473179 456320 440628 425433 410178 395051 381002 369053 359454 351483
62475 351483 344084 336710 329515 322874 317016 312156 308637 306670 306005 306087 306488 307081 307898 309024 310564 312535
62459 312535 314769 317040 319298 321750 324788 328833 333993 339705 344963 349179 352700 356220 359857 363150
62445 363150 365816 368066 370100 371696 372452 372186 370988 369056 366579 363642 360258 356660 353480 351276 349858
62430 349858 348395 346358 344098 342333 341392 341145 341489 342583 344652 347729 351605 355981 360630 365502 370661
62415 370661 376205 382283 389029 396347 403878 411365 419023 427346 436608 446648 457001 467013 476057
62402 476057 484009 491438 498977 506579 513728 520298 526679 533014 538780 543343 546625 549085 551290 553517
$$ packed form
62499F35428J0163N915J416k956o612r420j1928j4664j7405j9380k0171k0106
62487E30280j9735j9171j8195j6859j5692j5195j5255j5127j4049j1949r599p971
62475C51483p399p374p195o641n858m860l519j967o65Q2M01N93Q17J126J540J971
62459C12535K234K271K258K452L038M045N160N712N258M216L521L520L637L293
62445C63150K666K250K034J596P56k66j198j932k477k937l384l598l180k204j418
62430C49858j463k037k260j765r41k47L44J094K069L077L876M376M649M872N159
62415C70661N544O078O746P318P531P487P658Q323R262J0040J0353J0012R044
62402D76057P952P429P539P602P149O570O381O335N766M563L282K460K205K227
$$ plain form
62388 553517 555475 556437 556122 555498 556185 558898 562955 567490 572640 579184 587555 597634 609242 622439
62374 622439 637527 655038 675446 698687 724225 751804 781692 813928 847873 882991 919570
62363 919570 957973 997411 1036109 1072621 1106409 1137264 1164730 1188234 1207310 1221667 1231324 1236651
62351 1236651 1237864 1234565 1226275 1213373 1196989 1177856 1155790 1130510 1102572 1073281 1044065 1016155
62339 1016155 990441 967178 945884 925849 906765 888908 872874 859238 848160 839064 830878 822873
62327 822873 815223 808625 803499 799823 797572 796887 797719 799625 802200 805542 810029 815708 822110 828658 834999
62312 834999 840936 846388 851549 856787 862139 867158 871517 875501 879521 883399 886712 889666 892930 896489
62298 896489 899415 901140 902398 904391 907506 911393 915943 921503 928165 935499 943104 951026 959577 969028
$$ packed form
62388E53517J958R62l15o24O87K713M057M535N150O544Q371J0079J1608J3197
62374F22439J5088J7511K0408K3241K5538K7579K9888L2236L3945L5118L6579
62363I19570L8403L9438L8698L6512L3788L0855K7466K3504J9076J4357R657N327
62351A236651J213l299q290j2902j6384j9133k2066k5280k7938k9291k9216k7910
62339A016155k5714k3263k1294k0035j9084j7857j6034j3636j1078r096q186q005
62327H22873p650o598n126l676k251o85Q32J906K575L342M487N679O402O548O341
62312H34999N937N452N161N238N352N019M359L984M020L878L313K954L264L559
62298H96489K926J725J258J993L115L887M550N560O662P334P605P922Q551R451
$$ plain form
62284 969028 979550 991216 1003953 1017649 1032260 1047753 1064154 1081820 1101380 1123007 1146028
62273 1146028 1169677 1194126 1220242 1248434 1278337 1309682 1342852 1378290 1415891 1455319 1496534
62262 1496534 1539486 1583433 1626937 1668497 1706992 1741648 1771919 1797521 1818433 1834814 1846859
62251 1846859 1854644 1858090 1857224 1852513 1844763 1834543 1821838 1806474 1788926 1770590 1753175 1737758
62239 1737758 1724359 1712476 1702048 1693742 1688144 1684915 1683119 1682299 1682748 1684615 1687317 1690214 1693461 1697631
62225 1697631 1702690 1707936 1713028 1718485 1724998 1732634 1741092 1750388 1760785 1772106 1783556 1794405 1804635
62212 1804635 1814768 1825199 1835845 1846358 1856573 1866783 1877643 1889745 1903238 1917908 1933566
62201 1933566 1950169 1967573 1985456 2003740 2022826 2043105 2064360 2086043 2108086 2130936 2154568
$$ packed form
62284I69028J0522J1666J2737J3696J4611J5493J6401J7666J9560K1627K3021
62273A146028K3649K4449K6116K8192K9903L1345L3170L5438L7601L9428M1215
62262A496534M2952M3947M3504M1560L8495L4656L0271K5602K0912J6381J2045
62251A846859P785L446q66m711p750j0220j2705j5364j7548j8336j7415j5417
62239A737758j3399j1883j0428q306n598l229j796q20M49J867K702K897L247M170
62225A697631N059N246N092N457O513P636Q458R296J0397J1321J1450J0849J0230
62212A804635J0133J0431J0646J0513J0215J0210J0860J2102J3493J4670J5658
62201A933566J6603J7404J7883J8284J9086K0279K1255K1683K2043K2850K3632
$$ plain form
62190 2154568 2177815 2198944 2216640 2230295 2239680 2244892 2246506 2245374 2242175 2237464 2232203 2227869 2225799
62177 2225799 2226539 2229967 2235831 2243967 2254135 2265944 2278930 2292481 2305663 2317368 2326803 2333696 2337936
62164 2337936 2339321 2337956 2334646 2330328 2324936 2317249 2306088 2291361 2273720 2253617 2231181 2206800
62152 2206800 2181209 2154952 2128283 2101724 2076267 2052712 2031006 2010427 1990266 1970226 1950395
62141 1950395 1930977 1911944 1892893 1873408 1853526 1833544 1813351 1792395 1770526 1748484 1727217
62130 1727217 1706954 1687251 1667707 1648269 1629008 1610091 1591982 1575246 1559903 1545141 1529899
62119 1529899 1513681 1496728 1479498 1462180 1444821 1427730 1411441 1396133 1381281 1366083 1350168
62108 1350168 1333847 1317895 1303222 1290376 1279019 1268149 1257236 1246925 1238110 1230668 1223870 1217948
$$ packed form
62190B154568K3247K1129J7696J3655R385N212J614j132l199m711n261m334k070
62177B225799P40L428N864Q136J0168J1809J2986J3551J3182J1705R435O893M240
62164B337936J385j365l310m318n392p687j1161j4727j7641k0103k2436k4381
62152B206800k5591k6257k6669k6559k5457k3555k1706k0579k0161k0040j9831
62141A950395j9418j9033j9051j9485j9882j9982k0193k0956k1869k2042k1267
62130A727217k0263j9703j9544j9438j9261j8917j8109j6736j5343j4762j5242
62119A529899j6218j6953j7230j7318j7359j7091j6289j5308j4852j5198j5915
62108A350168j6321j5952j4673j2846j1357j0870j0913j0311q815p442o798n922
$$ plain form
62096 1217948 1214295 1213963 1216806 1222414 1231039 1243056 1258285 1276528 1298072 1322676 1348314 1371858
62084 1371858 1391171 1406202 1418256 1428781 1438754 1448541 1457913 1466100 1471712 1472729 1467322 1455244 1438200
62071 1438200 1418454 1397402 1375694 1354010 1332893 1312206 1291615 1271402 1251986 1232769 1212419
62060 1212419 1190408 1167561 1144853 1122296 1099190 1074920 1049246 1022340 994849 967630 941242
62049 941242 915931 892043 869985 849722 830759 812773 795898 780249 765473 750886 735870
62038 735870 720221 704399 689325 675538 662672 650091 637810 626265 615444 604938 594699
62027 594699 584941 575347 565301 555071 545830 538162 531373 524669 518265 512799 508425 505092 503125 502768
62013 502768 503620 505257 508051 512611 518622 525040 531463 538667 547594 558197 569398 579879 588800 595950
$$ packed form
62096A217948l653l32K843N608Q625J2017J5229J8243K1544K4604K5638K3544
62084A371858J9313J5031J2054J0525R973R787R372Q187N612J017n407j2078j7044
62071A438200j9746k1052k1708k1684k1117k0687k0591k0213j9416j9217k0350
62060A212419k2011k2847k2708k2557k3106k4270k5674k6906k7491k7219k6388
62049I41242k5311k3888k2058k0263j8963j7986j6875j5649j4776j4587j5016
62038G35870j5649j5822j5074j3787j2866j2581j2281j1545j0821j0506j0239
62027E94699r758r594j0046j0230r241p668o789o704o404n466m374l333j967l57
62013E02768Q52J637K794M560O011O418O423P204Q927J0603J1201J0481Q921P150
$$ plain form
61999 595950 601279 604317 604157 600084 592022 580348 565631 548767 531006 513423 496439 480048 464330
61986 464330 449557 436134 424697 415885 409572 404519 399302 393589 388182 383923 380975 379141 378353 378567
61972 378567 379434 380328 380729 380505 379887 379220 378877 379385 381407 385239 390342 395763 401120 406927 413830 421881
61956 421881 430716 440051 449755 459885 471028 484274 500275 518420 537374 556383 575785 596383
61944 596383 618752 642987 668653 694954 721379 748214 776112 805143 834731 864559 895027
61933 895027 926469 958193 988547 1015778 1038711 1057039 1071518 1083888 1096198 1109941 1125840
61922 1125840 1144429 1166578 1193420 1225971 1265011 1311178 1364854 1425946 1494015 1568751 1650134
61911 1650134 1737964 1831376 1929064 2029940 2133375 2238766 2344981 2450124 2551478 2645483
$$ packed form
61999E95950N329L038j60m073q062j1674j4717j6864j7761j7583j6984j6391j5718
61986D64330j4773j3423j1437q812o313n053n217n713n407m259k948j834p88K14
61972C78567Q67Q94M01k24o18o67l43N08K022L832N103N421N357N807O903Q051
61956D21881Q835R335R704J0130J1143J3246J6001J8145J8954J9009J9402K0598
61944E96383K2369K4235K5666K6301K6425K6835K7898K9031K9588K9828L0468
61933H95027L1442L1724L0354K7231K2933J8328J4479J2370J2310J3743J5899
61922A125840J8589K2149K6842L2551L9040M6167N3676O1092O8069P4736Q1383
61911A650134Q7830R3412R7688J00876J03435J05391J06215J05143J01354R4005
$$ plain form
61901 2645483 2727961 2794704 2842089 2867474 2869373 2847612 2803433 2739407 2659056 2566219 2464419
61890 2464419 2356601 2245236 2132393 2019631 1908076 1798853 1693342 1592933 1498714 1411504
61880 1411504 1331824 1259507 1193643 1133359 1078520 1029333 985557 946615 912308 882804 857988
61869 857988 837407 820824 808169 798939 792359 788228 786933 788475 792334 798576 808209 821818 838529
61856 838529 857034 877042 898907 922212 945591 967847 988444 1006971 1022864 1035761 1045574 1052095
61844 1052095 1055065 1054839 1052538 1049365 1046058 1043101 1041117 1040722 1042126 1045082 1049195 1054264 1060360 1067471
61830 1067471 1074922 1081259 1084920 1085143 1082115 1076422 1068554 1058989 1048476 1037980 1028198 1019107 1010067 1000485
61816 1000485 990281 979527 967812 954507 939769 924893 911394 900070 891105 884622 880717 879304
$$ packed form
61901B645483Q2478O6743M7385K5385J899k1761m4179o4026q0351r2837j01800
61890B464419j07818j11365j12843j12762j11555j09223j05511j00409r4219q7210
61880A411504p9680p2317o5864o0284n4839m9187m3776l8942l4307k9504k4816
61869H57988k0581j6583j2655r230o580m131j295J542L859O242R633J3609J6711
61856H38529J8505K0008K1865K3305K3379K2256K0597J8527J5893J2897R813O521
61844A052095K970k26k301l173l307k957j984l95J404K956M113N069O096P111
61830A067471P451O337L661K23l028n693p868r565j0513j0496r782r091r040r582
61816A000485j0204j0754j1715j3305j4738j4876j3499j1324q965o483l905j413
$$ plain form
61804 879304 880470 884815 892910 904517 918849 935650 955604 979568 1007720 1039602 1074801 1113441
61792 1113441 1156159 1203716 1256673 1315495 1380945 1454087 1535733 1626113 1725337 1834029 1953253
61781 1953253 2083979 2226804 2381962 2549035 2726660 2912808 3105320 3301704 3498170
61772 3498170 3689053 3867271 4025277 4155778 4252223 4309466 4324507 4296899 4228628 4123649
61762 4123649 3987425 3826531 3648028 3458549 3263624 3067808 2875260 2689780 2514163
61753 2514163 2349716 2196560 2054257 1922223 1799973 1687247 1583801 1488998 1401911 1321865
61743 1321865 1248618 1181892 1121093 1065598 1014964 968710 926384 888089 854381 825209 799346
61732 799346 775296 752429 730876 710805 692410 676138 662149 649686 637716 626204 616077
$$ packed form
61804H79304J166M345Q095J1607J4332J6801J9954K3964K8152L1882L5199L8640
61792A113441M2718M7557N2957N8822O5450P3142Q1646R0380R9224J08692J19224
61781A953253J30726J42825J55158J67073J77625J86148J92512J96384J96466
61772C498170J90883J78218J58006J30501R6445N7243J5041k7608o8271j04979
61762D123649j36224j60894j78503j89479j94925j95816j92548j85480j75617
61753B514163j64447j53156j42303j32034j22250j12726j03446r4803q7087q0046
61743A321865p3247o6726o0799n5495n0634m6254m2326l8295l3708k9172k5863
61732G99346k4050k2867k1553k0071j8395j6272j3989j2463j1970j1512j0127
$$ plain form
61721 616077 607855 600862 593865 586040 577228 567678 557764 547692 537452 527180 517375 508358 499787
61708 499787 491217 483031 476124 470606 465434 459509 452665 445395 438173 431309 424954 418825 412250 404878
61694 404878 397143 389690 382576 375408 368142 361335 355528 350670 346250 341845 337397 333066 328972 325124
61680 325124 321445 317733 313714 309301 304819 300720 297055 293433 289594 285810 282589 280202 278594 277500
61666 277500 276532 275427 274396 273956 274278 275025 276002 277491 279634 281910 283740 285242 286961 289184 292064
61651 292064 295997 301111 306548 311044 314255 316792 318953 320187 320108 319327 318857 319068 319589 319882 319588 318617
61635 318617 317312 316443 316693 318054 319874 321576 323359 326085 330275 335246 339585 342621 345043 347765 350625
61620 350625 352661 353363 353022 351956 350033 347018 342953 338116 332947 327924 323130 318044 312307 306585 302094
$$ packed form
61721F16077q222o993o997p825q812r550r914j0072j0240j0272r805r017q571
61708D99787q570q186o907n518n172n925o844p270p222o864o355o129o575p372
61694D04878p735p453p114p168p266o807n807m858m420m405m448m331m094l848
61680C25124l679l712m019m413m482m099l665l622l839l784l221k387j608j094
61666B77500r68j105j031m40L22P47R77J489K143K276J830J502J719K223K880
61651B92064L933N114N437M496L211K537K161J234p9p81m70K11N21K93k94r71
61635C18617j305q69K50J361J820J702J783K726M190M971M339L036K422K722K860
61620C50625K036P02l41j066j923l015m065m837n169n023m794n086n737n722m491
$$ plain form
61605 302094 299191 296975 294383 291164 287663 284202 280986 278260 276235 274987 274482 274532 274769 274954 275266 275982
61589 275982 276975 277949 279061 280783 283153 285720 288310 291346 295270 300066 305486 311339 317454 323697 330087
61574 330087 336573 342799 348553 354340 360900 368152 375239 381707 387967 394439 400936 407208 413412 419653
61560 419653 425543 430662 435076 439065 442657 445796 448647 451484 454510 457937 461890 466086 469999 473559
61546 473559 477270 481451 485799 489917 493829 497659 501152 503863 505560 506207 505804 504418 502182 499158 495461
61531 495461 491453 487447 483338 479054 475264 472884 471826 471086 470254 470145 471583 474465 478484 483929 491082
61516 491082 499513 508746 519088 531080 544603 559330 575658 594421 615913 639920 666551 696274
61504 696274 729271 765388 804684 847425 893520 942463 993763 1046908 1100946 1154553 1206563
$$ packed form
61605C02094k903k216k592l219l501l461l216k726k025j248n05N0K37J85L12P16
61589B75982R93R74J112J722K370K567K590L036L924M796N420N853O115O243O390
61574C30087O486O226N754N787O560P252P087O468O260O472O497O272O204O241
61560D19653N890N119M414L989L592L139K851K837L026L427L953M196L913L560
61546D73559L711M181M348M118L912L830L493K711J697O47m03j386k236l024l697
61531D95461m008m006m109m284l790k380j058p40q32j09J438K882M019N445P153
61516D91082Q431R233J0342J1992J3523J4727J6328J8763K1492K4007K6631K9723
61504F96274L2997L6117L9296M2741M6095M8943N1300N3145N4038N3607N2010
$$ plain form
61493 1206563 1255991 1301587 1341816 1375351 1401247 1418721 1427263 1427193 1419744 1406354 1388009 1365403
61481 1365403 1339650 1312554 1285947 1260718 1236693 1213617 1191869 1171789 1152673 1133263 1113284
61470 1113284 1093652 1074934 1056443 1037358 1018037 999599 982733 967566 954221 942865 933549
61459 933549 926614 922832 922449 924384 927166 930506 935286 942175 951048 961579 973543 986433 999645
61446 999645 1013387 1028713 1046296 1065590 1085608 1106139 1127724 1150501 1173412 1194597 1212465
61435 1212465 1226365 1236428 1243051 1246679 1247883 1247241 1245114 1241759 1237609 1232993 1227623 1220939 1213218 1205809
61421 1205809 1199950 1195768 1192666 1190133 1187749 1184937 1181233 1176415 1169988 1161108 1149621 1136756 1124071
61408 1124071 1112071 1100415 1089071 1078494 1068966 1060559 1053528 1047938 1043056 1037929 1032563 1027713 1023578
$$ packed form
61493A206563M9428M5596M0229L3535K5896J7474Q542p0p449j3390j8345k2606
61481A365403k5753k7096k6607k5229k4025k3076k1748k0080j9116j9410j9979
61470A113284j9632j8718j8491j9085j9321j8438j6866j5167j3345j1356r316
61459I33549o935l782l83J935K782L340M780O889Q873J0531J1964J2890J3212
61446I99645J3742J5326J7583J9294K0018K0531K1585K2777K2911K1185J7868
61435A212465J3900J0063O623L628J204o42k127l355m150m616n370o684p721p409
61421A205809n859m182l102k533k384k812l704m818o427q880j1487j2865j2685
61408A124071j2000j1656j1344j0577r528q407p031n590m882n127n366m850m135
$$ plain form
61395 1023578 1019550 1015424 1012024 1010337 1010618 1012621 1016273 1021893 1030190 1042129 1058269 1078079 1100441
61382 1100441 1125061 1152928 1185180 1222015 1262942 1307634 1356058 1407997 1462738 1519134 1575808
61371 1575808 1631404 1684732 1734514 1779098 1816767 1846506 1868221 1882117 1888113 1886040 1876221 1859650
61359 1859650 1837612 1811174 1780974 1747439 1711117 1672677 1632641 1591349 1549183 1506480 1463156
61348 1463156 1418893 1374025 1329890 1287875 1248369 1210992 1175578 1142557 1112576 1086174 1063606
61337 1063606 1044571 1028326 1014451 1003288 995171 989451 984797 980355 976244 973171 971974 973222 976710
61324 976710 981486 986882 993230 1001061 1010010 1019267 1028760 1038970 1049738 1060347 1070904 1082616 1096287
61311 1096287 1111313 1126552 1141518 1156176 1170079 1182306 1192049 1198858 1202482 1202802 1199916 1194232 1186477
$$ packed form
61395A023578m028m126l400j687K81K003L652N620Q297J1939J6140J9810K2362
61382A100441K4620K7867L2252L6835M0927M4692M8424N1939N4741N6396N6674
61371A575808N5596N3328M9782M4584L7669K9739K1715J3896N996k073r819j6571
61359A859650k2038k6438l0200l3535l6322l8440m0036m1292m2166m2703m3324
61348A463156m4263m4868m4135m2015l9506l7377l5414l3021k9981k6402k2568
61337A063606j9035j6245j3875j1163q117n720m654m442m111l073j197J248L488
61324I76710M776N396O348P831Q949R257R493J0210J0768J0609J0557J1712J3671
61311A096287J5026J5239J4966J4658J3903J2227R743O809L624L20k886n684p755
$$ plain form
61298 1186477 1177528 1168034 1158217 1148188 1138233 1128531 1118896 1109156 1099542 1090307 1081311 1072551 1064793 1058928
61284 1058928 1054951 1052336 1051267 1052546 1056225 1061332 1067215 1074318 1083236 1093735 1105132 1116995 1128917
61271 1128917 1140127 1149932 1158283 1165530 1171885 1177473 1182601 1187565 1192323 1196624 1200307 1203184 1204760 1204423
61257 1204423 1202092 1198693 1195891 1195174 1197144 1201866 1209879 1222363 1240048 1262443 1288571 1318010 1350635
61244 1350635 1385746 1422158 1458801 1494411 1526762 1553121 1571564 1581357 1582310 1574641 1559390 1538019
61232 1538019 1511413 1480049 1445142 1408704 1372225 1336158 1300877 1267283 1236101 1207422 1181389
61221 1181389 1158595 1139286 1122634 1107215 1091728 1075077 1056419 1035683 1013618 991057 968520
61210 968520 946681 926603 909122 894389 882301 872967 866598 863326 863261 866282 871827 879447 889427
$$ packed form
61298A186477q949r494r817j0029r955r702r635r740r614r235q996q760p758n865
61284A058928l977k615j069J279L679N107N883P103Q918J0499J1397J1863J1922
61271A128917J1210R805Q351P247O355N588N128M964M758M301L683K877J576l37
61257A204423k331l399k802p17J970M722Q013J2484J7685K2395K6128K9439L2625
61244A350635L5111L6412L6643L5610L2351K6359J8443R793R53p669j5251k1371
61232A538019k6606l1364l4907l6438l6479l6067l5281l3594l1182k8679k6033
61221A181389k2794j9309j6652j5419j5487j6651j8658k0736k2065k2561k2537
61210I68520k1839k0078j7481j4733j2088r334o369l272o5L021N545P620R980
$$ plain form
61197 889427 902042 916083 929100 939334 946639 951347 953364 952913 951149 949223 947266 944914 942211
61184 942211 939378 936202 932287 927542 921994 915569 908450 901157 893867 886154 877829 869500 861897 855142
61170 855142 849059 843641 838772 834046 829310 824902 820952 817036 812893 808873 805238 801702 798211 795499
61156 795499 794236 794232 795160 797448 801466 806085 808857 807705 802004 792268 779291 763604 745492 725530
61142 725530 704994 685343 667228 650422 634673 620005 606248 593105 580861 570151 560846 552091
61130 552091 543669 536312 530325 525051 520239 516733 515024 514180 513173 512338 512569 513831 515489 517412 519772
61115 519772 522312 524758 527454 530777 534492 538416 543072 548761 554624 559451 562844 564768 564709 562302 558144
61100 558144 552997 546797 539491 532173 526211 521725 518081 515357 514039 513621 512844 511257 509474 508063 507158
$$ packed form
61197H89427J2615J4041J3017J0234P305M708K017m51j764j926j957k352k703
61184I42211k833l176l915m745n548o425p119p293p290p713q325q329p603o755
61170H55142o083n418m869m726m736m408l950l916m143m020l635l536l491k712
61156G95499j263mR28K288M018M619K772j152n701r736j2977j5687j8112j9962
61142G25530k0536j9651j8115j6806j5749j4668j3757j3143j2244j0710r305q755
61130E52091q422p357n987n274m812l506j709q44j007q35K31J262J658J923K360
61115E19772K540K446K696L323L715L924M656N689N863M827L393J924n9k407m158
61100E58144n147o200p306p318n962m486l644k724j318m18p77j587j783j411r05
$$ plain form
61085 507158 507004 507885 509565 511633 514158 517250 520312 522635 524422 526321 528285 529821 530970 532069 532831
61070 532831 532722 532057 531849 532695 534530 537055 539660 541396 541911 541970 542234 542154 540962 539048 537331 536054 535374
61053 535374 536272 539327 543184 545864 547298 549062 551942 555256 558395 561578 565113 569111 573843 579333
61039 579333 584971 590489 596687 604047 611536 618263 625441 634868 646241 657918 669694 682667 696834
61026 696834 711193 725985 742543 760878 779684 798741 819108 840795 862463 883675 905328
61015 905328 927662 950009 972745 997310 1024017 1051964 1081282 1113233 1147914 1184354 1223214
61004 1223214 1266877 1316466 1371217 1431171 1497776 1571308 1650278 1733795 1821848 1913200 2006534
60993 2006534 2104457 2213046 2336624 2476320 2634107 2813813 3016843 3241531 3488827 3764851
$$ packed form
61085E07158j54Q81J680K068K525L092L062K323J787J899J964J536J149J099P62
61070E32831j09o65k08Q46J835K525K605J736N15N9K64q0j192j914j717j277o80
61053E35374Q98L055L857K680J434J764K880L314L139L183L535L998M732N490
61039E79333N638N518O198P360P489O727P178R427J1373J1677J1776J2973J4167
61026F96834J4359J4792J6558J8335J8806J9057K0367K1687K1668K1212K1653
61015I05328K2334K2347K2736K4565K6707K7947K9318L1951L4681L6440L8860
61004A223214M3663M9589N4751N9954O6605P3532P8970Q3517Q8053R1352R3334
60993B006534R7923J08589J23578J39696J57787J79706K03030K24688K47296K76024
$$ plain form
60983 3764851 4076924 4432873 4846711 5338970 5927539 6623443 7439029 8394159 9511738
60974 9511738 10818606 12360471 14206775 16428789 19080048 22202956 25811902 29790313
60966 29790313 33766275 37147651 39393166 40333902 40258929 39699089 39137413 38888880 39131592
60957 39131592 39895039 40946113 41751549 41683478 40363003 37853226 34553965 30936460 27352931
60948 27352931 24004313 20985018 18319872 15988876 13957722 12199785 10693456 9411282
60940 9411282 8322192 7399985 6622283 5964593 5402169 4916072 4492793 4120170 3788216
60931 3788216 3491906 3228468 2993012 2780255 2588710 2419111 2269746 2136844 2018243
60922 2018243 1912823 1817057 1725867 1636818 1550529 1467385 1386954 1310374 1240051 1176482 1117874
$$ packed form
60983C764851L12073L55949M13838M92259N88569O95904Q15586R55130J117579
60974I511738J306868J541865J846304K222014K651259L122908L608946L978411
60966B9790313L975962L381376K245515R40736p4973n59840n61676k48533K42712
60957C9131592P63447J051074Q05436o8071j320475k509777l299261l617505l583529
60948B7352931l348618l019295k665146k330996k031154j757937j506329j282174
60940I411282j089090r22207p77702o57690n62424m86097m23279l72623l31954
60931C788216k96310k63438k35456k12757j91545j69599j49365j32902j18601
60922B018243j05420r5766r1190q9049q6289q3144q0431p6580p0323o3569n8608
$$ plain form
60911 1117874 1063110 1012845 967497 926415 889270 856222 826389 798014 770396 744045 719033
60900 719033 695048 672971 654280 638570 623566 607982 592673 578641 565701 553640 542891
60889 542891 533302 523686 513448 503531 495083 488140 482171 476945 472288 467794 463231 458658 453960 448928
60875 448928 443808 438980 434132 428650 422754 417328 412697 408548 404938 402186 399846 397074 394127 392206
60861 392206 391552 390980 389683 388342 387976 388679 389959 391416 392674 393499 394335 395926 398203 400366 402158 403975
60845 403975 405624 406203 405612 405014 405252 405936 406575 407468 408793 409852 410017 409552 408780 407387 405359 403785 403744
60828 403744 404932 406122 406439 405526 403132 399428 395305 391596 388288 385034 381962 379372 377051 374502 371569
60813 371569 368410 365260 362494 360313 357991 354241 348938 343709 340093 337798 335554 332925 330313 327776
$$ packed form
60911A117874n4764n0265m5348m1082l7145l3048k9833k8375k7618k6351k5012
60900G19033k3985k2077j8691j5710j5004j5584j5309j4032j2940j2061j0749
60889E42891r589r616j0238r917q448o943n969n226m657m494m563m573m698n032
60875D48928n120m828m848n482n896n426m631m149l610k752k340k772k947j921
60861C92206o54n72j297j341l66P03J280J457J258Q25Q36J591K277K163J792J817
60845D03975J649N79n91n98K38O84O39Q93J325J059J65m65p72j393k028j574m1
60828D03744J188J190L17r13k394l704m123l709l308l254l072k590k321k549k933
60813C71569l159l150k766k181k322l750n303n229l616k295k244k629k612k537
$$ plain form
60799 327776 325043 322410 320512 319316 318224 317098 316285 315721 314855 313508 312086 311002 310498 310932 312445
60784 312445 314387 315812 316602 317418 318560 319661 320549 321552 322679 323244 322715 321398 319938 318546 317084
60769 317084 315573 314249 313278 312695 312508 312752 313436 314436 315386 315839 315692 315266 314766 313991 312905 312115 312254
60752 312254 313105 313942 314542 315246 316067 316425 315828 314242 311739 308370 304480 300597 296829 292886 288807 285140
60736 285140 282226 279847 277794 276229 275232 274484 273763 273340 273475 273831 273758 272979 271741 270481 269547 269072 268920
60719 268920 268900 269063 269574 270316 270969 271469 271959 272267 271985 271204 270588 270507 270634 270701 271008 271746 272404 272485 272409 273056
60699 273056 274648 276715 278969 281566 284552 287605 290423 292984 295419 297931 300740 303818 306814 309582
60685 309582 312593 316375 320703 324808 328249 331039 333065 334119 334627 335551 337200 338702 339122 338716 338604
$$ packed form
60799C27776k733k633j898j196j092j126q13n64q66j347j422j084n04M34J513
60784C12445J942J425P90Q16J142J101Q88J003J127N65n29j317j460j392j462
60769C17084j511j324r71n83j87K44O84J000R50M53j47m26n00p75j086p90J39
60752C12254Q51Q37O00P04Q21L58n97j586k503l369l890l883l768l943m079l667
60736B85140k914k379k053j565r97p48p21m23J35L56p3p79j238j260r34m75j52
60719B68920k0J63N11P42O53N00M90L08k82p81o16q1J27O7L07P38O58Q1p6O47
60699B73056J592K067K254K597K986L053K818K561K435K512K809L078K996K768
60685C09582L011L782M328M105L441K790K026J054N08R24J649J502M20m06j12
$$ plain form
60670 338604 339485 341174 343181 345122 346538 346918 346278 345454 345436 346392 347615 348410 348788 349192 349829 350613 351582
60653 351582 352916 354434 355535 355890 355850 355855 355682 354710 352754 350247 347675 345271 343248 341865 341131 340803 340778
60636 340778 341198 342079 343229 344626 346517 348904 351316 353383 355335 357571 360005 362240 364225 366268 368418
60621 368418 370293 371665 372806 373999 374989 375319 375148 375353 376667 378881 381108 382760 384063 385716 388351
60606 388351 392413 398213 405709 414378 423670 433607 444619 456748 469374 481891 494332 506991 519522
60593 519522 530720 539189 544060 545105 542465 536439 527542 516598 504632 492557 480938 470069 460169
60580 460169 451356 443519 436463 430243 425144 421256 418217 415479 412721 409931 407311 405157 403638 402553
60566 402553 401548 400692 400549 401423 402831 404061 405012 406018 407075 407867 408585 410043 412755 416345 420182 424091
$$ packed form
60670C38604Q81J689K007J941J416L80o40q24j8R56J223P95L78M04O37P84R69
60653C51582J334J518J101L55m0Nj73r72j956k507k572k404k023j383p34l28k5
60636C40778M20Q81J150J397J891K387K412K067J952K236K434K235J985K043K150
60621C68418J875J372J141J193R90L30j71K05J314K214K227J652J303J653K635
60606C88351M062N800P496Q669R292R937J1012J2129J2626J2517J2441J2659J2531
60593E19522J1198Q469M871J045k640o026q897j0944j1966j2075j1619j0869r900
60580D60169q813p837p056o220n099l888l039k738k758k790k620k154j519j085
60566D02553j005q56j43Q74J408J230R51J006J057P92P18J458K712L590L837L909
$$ plain form
60550 424091 428034 431506 433919 435475 437153 439769 443479 448183 453876 460380 467193 473966 480941 488669
60536 488669 497514 507706 519574 533244 548200 563747 580154 598910 621509 648152 677994 710611
60524 710611 746884 788479 836821 892755 956861 1029681 1111522 1202281 1301384 1407411 1517297
60513 1517297 1625908 1726868 1814204 1883423 1931395 1955945 1956256 1933712 1892011 1836117 1770985
60502 1770985 1700875 1629283 1558990 1492085 1430040 1373831 1324129 1281563 1246912 1221021 1204537
60491 1204537 1197809 1201052 1214480 1238252 1272238 1315627 1366426 1421252 1475778 1525419 1565715 1592686
60479 1592686 1603786 1598928 1580180 1550273 1511703 1467277 1420564 1374904 1332136 1292847 1257616
60468 1257616 1227409 1202931 1184468 1172500 1167839 1170935 1181608 1199816 1226354 1262639 1310173 1370318
$$ packed form
60550D24091L943L472K413J556J678K616L710M704N693O504O813O773O975P728
60536D88669Q845J0192J1868J3670J4956J5547J6407J8756K2599K6643K9842L2617
60524G10611L6273M1595M8342N5934O4106P2820Q1841R0759R9103J06027J09886
60513A517297J08611J00960Q7336O9219M7972K4550L11k2544m1701n5894o5132
60502A770985p0110p1592p0293o6905o2045n6209m9702m2566l4651k5891j6484
60491A204537o728L243J3428K3772L3986M3389N0799N4826N4526M9641M0296K6971
60479A592686J1100m858j8748k9907l8570m4426m6713m5660m2768l9289l5231
60468A257616l0207k4478j8463j1968m661L096J0673J8208K6538L6285M7534O0145
$$ plain form
60456 1370318 1444073 1531752 1633457 1750421 1885733 2043310 2226277 2436547 2675599 2944960
60446 2944960 3245793 3578113 3939883 4325629 4724721 5120432 5490818 5811462 6059149
60437 6059149 6215217 6267831 6213263 6056657 5811859 5499380 5142559 4763622 4381137 4008880
60427 4008880 3655599 3325859 3021903 2745130 2496051 2273562 2075310 1899055 1743310
60418 1743310 1606732 1487532 1383769 1293673 1215312 1146369 1084808 1029624 980533 937053 898284
60407 898284 863499 832340 804247 778132 753019 728852 706355 686148 668246 652357 638255
60396 638255 625690 614147 603040 592167 581805 572272 563437 554675 545320 535238 524992 515375
60384 515375 506697 498660 490996 484011 478267 473838 470160 466604 462963 459342 455859 452549 449348 446087
$$ packed form
60456A370318P3755Q7679J01705J16964J35312J57577J82967K10270K39052K69361
60446B944960L00833L32320L61770L85746L99092L95711L70386L20644K47687
60437F059149J56068N2614n4568j56606k44798l12479l56821l78937l82485l72257
60427D008880l53281l29740l03956k76773k49079k22489j98252j76255j55745
60418A743310j36578j19200j03763r0096p8361o8943o1561n5184m9091m3480l8769
60407H98284l4785l1159k8093k6115k5113k4167k2497k0207j7902j5889j4102
60396F38255j2565j1543j1107j0873j0362r533q835q762r355j0082j0246r617
60384E15375q678q037p664o985n744m429l678l556l641l621l483l310l201l261
$$ plain form
60370 446087 442656 439255 436290 433919 431924 430070 428324 426593 424567 422052 419268 416616 414246 412003
60356 412003 409544 406350 401981 396687 391536 387487 384426 381482 378226 375108 372757 371292 370430 369796 368916
60341 368916 367272 364708 361620 358546 355709 353108 350822 348967 347544 346599 346407 347124 348313 349178 349397
60326 349397 349375 349541 349708 349424 348777 348478 349148 350761 352790 354665 356061 357028 357940 359123 360484 361737 362993
60309 362993 364712 366893 368757 369621 369722 369713 369697 369369 368898 368851 369165 368973 367722 365854 364059 362369 360414
60292 360414 358153 355872 353789 352105 351180 351153 351539 351584 350995 350120 349574 349860 351029 352477 353423 353946 355140
60275 355140 357748 360994 363401 364523 365272 366712 369231 372754 376962 381102 384297 386372 387970 389753
60261 389753 391943 394699 398243 402320 406163 409435 412744 416768 421338 425906 430569 435974 442358 449240
$$ packed form
60370D46087l431l401k965k371j995j854j746j731k026k515k784k652k370k243
60356D12003k459l194m369n294n151m049l061k944l256l118k351j465q62o34q80
60341C68916j644k564l088l074k837k601k286j855j423r45j92P17J189Q65K19
60326C49397k2J66J67k84o47k99O70J613K029J875J396R67R12J183J361J253J256
60309C62993J719K181J864Q64J01rj6l28m71m7L14j92j251j868j795j690j955
60292C60414k261k281k083j684r25k7L86M5n89q75n46K86J169J448R46N23J194
60275C55140K608L246K407J122P49J440K519L523M208M140L195K075J598J783
60261C89753K190K756L544M077L843L272L309M024M570M568M663N405O384O882
$$ plain form
60247 449240 456129 463012 470075 477379 485036 493433 502984 513724 525283 537310 549854 563374 578376
60234 578376 595098 613574 633949 656531 681455 708376 736644 765764 795596 826113 857033
60223 857033 887751 917626 946274 973513 999052 1022369 1042954 1060510 1074763 1085321 1092002 1095239
60211 1095239 1095784 1093966 1089603 1082801 1074567 1066367 1059136 1052901 1047284 1042177 1037952 1035273 1034806 1037054
60197 1037054 1042274 1050418 1061213 1074533 1090753 1110532 1134024 1160413 1188473 1217504 1247473 1278289
60185 1278289 1309279 1339455 1367952 1394022 1416793 1435347 1449066 1457841 1461957 1461759 1457308 1448301
60173 1448301 1434444 1416017 1394124 1370298 1345822 1321348 1297186 1273935 1252737 1234716 1220244
60162 1220244 1209083 1201315 1197743 1199161 1205572 1216496 1231824 1251897 1276791 1305813 1337658 1370761
$$ packed form
60247D49240O889O883P063P304P657Q397R551J0740J1559J2027J2544J3520J5002
60234E78376J6722J8476K0375K2582K4924K6921K8268K9120K9832L0517L0920
60223H57033L0718K9875K8648K7239K5539K3317K0585J7556J4253J0558O681L237
60211A095239N45j818m363o802q234q200p231o235n617n107m225k679m67K248
60197A037054N220Q144J0795J3320J6220J9779K3492K6389K8060K9031K9969L0816
60185A278289L0990L0176K8497K6070K2771J8554J3719Q775M116j98m451r007
60173A448301j3857j8427k1893k3826k4476k4474k4162k3251k1198j8021j4472
60162A220244j1161p768l572J418O411J0924J5328K0073K4894K9022L1845L3103
$$ plain form
60150 1370761 1403671 1435539 1466312 1496211 1525075 1552480 1578306 1602800 1626240 1649065 1672198
60139 1672198 1696516 1721771 1746391 1768466 1786538 1799519 1806567 1807484 1802909 1793943 1781991 1769073
60127 1769073 1757724 1750229 1748294 1753627 1768253 1793798 1830758 1878800 1937422 2006075 2084085 2170874
60115 2170874 2265777 2367063 2471446 2575110 2675076 2769152 2854974 2929918 2992038 3040504 3075039
60104 3075039 3095313 3100985 3091888 3068066 3029998 2978893 2916482 2844387 2763928 2676656 2584815 2491127
60092 2491127 2398252 2308497 2223775 2145488 2074284 2009995 1952079 1900421 1855773 1819216 1791171
60081 1791171 1771168 1758573 1753116 1754533 1762101 1774891 1792153 1813083 1836498 1861221 1886585 1912027
60069 1912027 1936346 1957993 1976208 1991386 2004272 2015267 2024673 2033075 2041085 2048903 2056394 2063532
$$ packed form
60150A370761L2910L1868L0773K9899K8864K7405K5826K4494K3440K2825K3133
60139A672198K4318K5255K4620K2075J8072J2981P048R17m575q966j1952j2918
60127A769073j1349p495j935N333J4626K5545L6960M8042N8622O8653P8010Q6789
60115B170874R4903J01286J04383J03664R9966R4076Q5822P4944O2120M8466L4535
60104C075039K0274N672r097k3822l8068n1105o2411p2095q0459q7272r1841r3688
60092B491127r2875q9755q4722p8287p1204o4289n7916n1658m4648l6557k8045
60081A791171k0003j2595n457J417P568J2790J7262K0930K3415K4723K5364K5442
60069A912027K4319K1647J8215J5178J2886J0995R406Q402Q010P818P491P138
$$ plain form
60057 2063532 2070661 2078519 2088186 2100874 2117484 2138180 2162181 2187747 2212407 2233588 2249420 2259065
60045 2259065 2262362 2259240 2249521 2233251 2211245 2185338 2158015 2131698 2108376 2089735 2077142 2071119
60033 2071119 2070995 2075430 2083229 2093450 2104961 2116344 2126263 2133541 2136875 2134950 2127048 2113259 2093964
60020 2093964 2069364 2039617 2005025 1965830 1922194 1874803 1825299 1775740 1727570 1681327 1637213
60009 1637213 1595596 1557019 1522128 1491768 1466823 1447701 1434069 1425355 1421436 1422583 1428812 1439668
59997 1439668 1454796 1474452 1499146 1528964 1563508 1602370 1645197 1691224 1739191 1787926 1836597
59986 1836597 1883997 1927903 1965768 1996207 2019450 2036209 2046446 2049443 2044815 2033016 2014767 1990392
59974 1990392 1960130 1925101 1887532 1849659 1812591 1776557 1742122 1710531 1682742 1658699 1638039
$$ packed form
60057B063532P129P858R667J2688J6610K0696K4001K5566K4660K1181J5832R645
60045B259065L297l122r719j6270k2006k5907k7323k6317k3322j8641j2593o023
60033B071119j24M435P799J0221J1511J1383R919P278L334j925p902j3789j9295
60020B093964k4600k9747l4592l9195m3636m7391m9504m9559m8170m6243m4114
60009A637213m1617l8577l4891l0360k4945j9122j3632q714l919J147O229J0856
59997A439668J5128J9656K4694K9818L4544L8862M2827M6027M7967M8735M8671
59986A836597M7400M3906L7865L0439K3243J6759J0237K997m628j1799j8249k4375
59974A990392l0262l5029l7569l7873l7068l6034l4435l1591k7789k4043k0660
$$ plain form
59963 1638039 1621135 1608989 1602296 1601069 1604990 1613542 1625774 1640580 1657430 1676436 1697547 1720089
59951 1720089 1743282 1766828 1790618 1814115 1836397 1856634 1874184 1888419 1898922 1905949 1910365 1913035
59939 1913035 1914533 1915462 1916695 1919023 1922823 1928406 1936611 1948732 1965871 1988648 2017593 2053418 2096686
59926 2096686 2147448 2205454 2270478 2342088 2419275 2500780 2585731 2673403 2762127 2848784 2929636
59915 2929636 3001417 3061440 3107168 3136322 3147550 3140733 3116586 3076212 3021121 2953538 2876563
59904 2876563 2793920 2709296 2625622 2544830 2468251 2397115 2332599 2275520 2226192 2184617 2150793
59893 2150793 2124873 2107065 2097451 2095963 2102609 2117479 2140258 2169866 2205011 2245166 2290528 2340765
59881 2340765 2394126 2448026 2500241 2549186 2593305 2630553 2658444 2674402 2676305 2663159 2635407
$$ packed form
59963A638039j6904j2146o693j227L921Q552J2232J4806J6850J9006K1111K2542
59951A720089K3193K3546K3790K3497K2282K0237J7550J4235J0503P027M416K670
59939A913035J498R29J233K328L800N583Q205J2121J7139K2777K8945L5825M3268
59926B096686N0762N8006O5024P1610P7187Q1505Q4951Q7672Q8724Q6657Q0852
59915B929636P1781O0023M5728K9154J1228o817k4147m0374n5091o7583p6975
59904B876563q2643q4624q3674q0792p6579p1136o4516n7079m9328m1575l3824
59893B150793k5920j7808r614j488O646J4870K2779K9608L5145M0155M5362N0237
59881B340765N3361N3900N2215M8945M4119L7248K7891J5958J903j3146k7752
$$ plain form
59870 2635407 2594492 2542224 2480556 2411664 2337880 2261569 2185070 2110338 2038364 1969220 1903023
59859 1903023 1840544 1782488 1728583 1678031 1630783 1587672 1549227 1514951 1483980 1456007 1431335
59848 1431335 1410364 1393330 1380343 1371421 1366506 1365440 1367794 1372757 1379410 1387161 1395810 1405277 1415300
59835 1415300 1425129 1433231 1437630 1437136 1432211 1424239 1414076 1401901 1388325 1374706 1362001 1350056 1338577
59822 1338577 1328272 1320357 1315292 1312706 1312365 1314270 1317514 1319800 1318820 1314082 1307066 1299795 1293745 1290062
59808 1290062 1289909 1293678 1299806 1305000 1305964 1300902 1289642 1273141 1253303 1232632 1213199 1195776 1180200
59795 1180200 1166355 1154515 1145180 1139279 1138353 1143780 1155640 1172910 1194852 1221720 1254125 1292503
59783 1292503 1337500 1390172 1451266 1520716 1598211 1683619 1775975 1872128 1966799 2053726 2126315
$$ packed form
59870B635407m0915n2268o1668o8892p3784p6311p6499p4732p1974o9144o6197
59859A903023o2479n8056n3905n0552m7248m3111l8445l4276l0971k7973k4672
59848A431335k0971j7034j2987q922m915j066K354M963O653P751Q649R467J0023
59835A415300R829Q102M399m94m925p972j0163j2175j3576j3619j2705j1945j1479
59822A338577j0305p915n065k586l41J905L244K286r80m738p016p271o050l683
59808A290062j53L769O128N194R64n062j1260j6501j9838k0671j9433j7423j5576
59795A180200j3845j1840r335n901r26N427J1860J7270K1942K6868L2405L8378
59783A292503M4997N2672O1094O9450P7495Q5408R2356R6153R4671Q6927P2589
$$ plain form
59772 2126315 2177862 2202804 2199033 2169027 2118440 2053572 1980000 1902681 1826026 1753212 1685685
59761 1685685 1623905 1568591 1520968 1481817 1450666 1426170 1407008 1392198 1380920 1372616 1367321 1365532
59749 1365532 1367579 1373293 1382331 1394542 1409955 1428639 1450775 1476794 1507249 1542530 1582652 1627346
59737 1627346 1676486 1730513 1790339 1856781 1930243 2011021 2099585 2196299 2301181 2414273 2536015
59726 2536015 2666751 2805998 2952541 3104996 3261662 3419910 3576396 3728033 3872382
59717 3872382 4007273 4130933 4242877 4344235 4437043 4523649 4606855 4689699 4774388 4861602
59707 4861602 4951082 5042446 5135116 5227883 5318985 5406319 5487391 5559584 5621018 5670843 5708436
59696 5708436 5733025 5744762 5745728 5738934 5726503 5709545 5689658 5669619 5652437 5640526 5636199 5642359
$$ packed form
59772B126315N1547K4942l771l0006n0587o4868p3572p7319p6655p2814o7527
59761A685685o1780n5314m7623l9151l1151k4496j9162j4810j1278q304n295j789
59749A365532K047N714R038J2211J5413J8684K2136K6019L0455L5281M0122M4694
59737A627346M9140N4027N9826O6442P3462Q0778Q8564R6714J04882J13092J21742
59726B536015J30736J39247J46543J52455J56666J58248J56486J51637J44349
59717C872382J34891J23660J11944J01358R2808Q6606Q3206Q2844Q4689Q7214
59707D861602Q9480R1364R2670R2767R1102Q7334Q1072P2193O1434M9825L7593
59696E708436K4589J1737R66o794j2431j6958j9887k0039j7182j1911m327O160
$$ plain form
59684 5642359 5662015 5697233 5748828 5817020 5902217 6005150 6126261 6264867 6419003 6586167
59674 6586167 6763949 6949451 7138092 7323451 7498414 7656134 7789856 7892501 7957269 7978936
59664 7978936 7954749 7884587 7770979 7619130 7436429 7231292 7012013 6786267 6561136 6342851
59654 6342851 6135929 5942243 5760810 5588350 5419974 5249749 5071594 4880946 4676406
59645 4676406 4460161 4236925 4012292 3791468 3578550 3376180 3185689 3007658 2842459
59636 2842459 2690270 2550792 2423233 2306728 2200735 2104958 2018938 1941799 1872410 1809799
59626 1809799 1753450 1703194 1658794 1619639 1584955 1554305 1527657 1504793 1484826 1466631 1449735
59615 1449735 1434493 1421246 1409577 1398489 1387079 1374816 1361384 1346614 1330586 1313553 1295681
$$ packed form
59684E642359J9656L5218N1595O8192Q5197J02933J21111J38606J54136J67164
59674F586167J77782J85502J88641J85359J74963J57720J33722J02645O4768K1667
59664G978936k4187p0162j13608j51849j82701k05137k19279k25746k25131k18285
59654F342851k06922j93686j81433j72460j68376j70225j78155j90648k04540
59645D676406k16245k23236k24633k20824k12918k02370j90491j78031j65199
59636B842459j52189j39478j27559j16505j05993r5777q6020p7139o9389o2611
59626A809799n6349n0256m4400l9155l4684l0650k6648k2864j9967j8195j6896
59615A449735j5242j3247j1669j1088j1410j2263j3432j4770j6028j7033j7872
$$ plain form
59604 1295681 1276894 1257066 1236365 1215490 1195424 1176704 1158947 1141368 1123813 1106945 1091415
59593 1091415 1077318 1064631 1053650 1044571 1037028 1030535 1025111 1021036 1018301 1016759 1016538 1017768 1020094
59580 1020094 1023026 1026569 1030914 1035810 1040955 1046813 1054145 1062738 1071486 1079933 1088906 1099346 1111341
59567 1111341 1124694 1139692 1156771 1175862 1196567 1218626 1241934 1266625 1293415 1323343 1356770
59556 1356770 1393147 1432086 1474025 1519368 1567682 1618490 1672231 1729533 1789825 1851539 1913541
59545 1913541 1975540 2037208 2097858 2157117 2214810 2269371 2316744 2351781 2371271 2375830 2369043 2354819
59533 2354819 2335355 2311195 2282617 2250461 2215750 2179197 2141535 2103937 2067660 2033451 2001780
59522 2001780 1973602 1950466 1933779 1924210 1921862 1926849 1939695 1961275 1992365 2033142 2083068 2141112
$$ packed form
59604A295681j8787j9828k0701k0875k0066j8720j7757j7579j7555j6868j5530
59593A091415j4097j2687j0981r079p543o493n424m075k735j542k21J230K326
59580A020094K932L543M345M896N145N858P332Q593Q748Q447Q973J0440J1995
59567A111341J3353J4998J7079J9091K0705K2059K3308K4691K6790K9928L3427
59556A356770L6377L8939M1939M5343M8314N0808N3741N7302O0292O1714O2002
59545A913541O1999O1668O0650N9259N7693N4561M7373L5037J9490M559o787j4224
59533B354819j9464k4160k8578l2156l4711l6553l7662l7598l6277l4209l1671
59522B001780k8178k3136j6687r569k348M987J2846K1580L1090M0777M9926N8044
$$ plain form
59510 2141112 2205847 2275381 2347574 2420429 2491876 2559007 2617959 2664933 2697240 2713335 2712427 2694488
59498 2694488 2660358 2611437 2549445 2476735 2396420 2311701 2225176 2139042 2055560 1976779 1903988
59487 1903988 1837900 1779193 1728455 1685770 1650877 1623662 1604061 1591617 1585607 1585635 1591736 1603994
59475 1603994 1622359 1646708 1676597 1710994 1748613 1788508 1830040 1872352 1914184 1954040 1990128
59464 1990128 2020363 2043005 2057377 2063581 2061571 2050931 2031522 2003864 1968874 1927665 1881561 1831811
59452 1831811 1779175 1724257 1668278 1613024 1559811 1508912 1460141 1413668 1370053 1329869 1293485
59441 1293485 1261004 1232177 1206558 1183870 1164171 1147739 1134982 1126199 1121026 1118291 1116989 1117427
59429 1117427 1120778 1127465 1136660 1147575 1160421 1175670 1193098 1212308 1233700 1258114 1285832 1316680
$$ packed form
59510B141112O4735O9534P2193P2855P1447O7131N8952M6974L2307J6095r08j7939
59498B694488l4130m8921o1992p2710q0315q4719q6525q6134q3482p8781p2791
59487A903988o6088n8707n0738m2685l4893k7215j9601j2444o010K8O101J2258
59475A603994J8365K4349K9889L4397L7619L9895M1532M2312M1832L9856L6088
59464A990128L0235K2642J4372O204k010j0640j9409k7658l4990m1209m6104m9750
59452A831811n2636n4918n5979n5254n3213n0899m8771m6473m3615m0184l6384
59441A293485l2481k8827k5619k2688j9699j6432j2757q783n173k735j302M38
59429A117427L351O687R195J0915J2846J5249J7428J9210K1392K4414K7718L0848
$$ plain form
59417 1316680 1350688 1387336 1423916 1455941 1480265 1497607 1511580 1525655 1541514 1559667 1580495
59406 1580495 1604564 1632670 1665680 1703419 1743275 1780683 1811910 1836443 1856613 1875498 1895526
59395 1895526 1918231 1944012 1971983 2000886 2030421 2061267 2093861 2127836 2162745 2198594 2235365
59384 2235365 2272627 2309948 2347279 2384701 2422347 2460802 2501078 2543871 2589355 2638135 2691962
59373 2691962 2753121 2823405 2903913 2995268 3097565 3210547 3334219 3468796 3613483 3765675
59363 3765675 3921769 4078416 4232631 4381396 4522144 4653570 4775427 4887629 4989955
59354 4989955 5082234 5164159 5234997 5293911 5340280 5373194 5390853 5390983 5371606 5331041 5267666 5180569
59342 5180569 5070472 4939601 4790967 4628266 4456026 4278824 4100262 3923067 3749795
$$ packed form
59417A316680L4008L6648L6580L2025K4324J7342J3973J4075J5859J8153K0828
59406A580495K4069K8106L3010L7739L9856L7408L1227K4533K0170J8885K0028
59395A895526K2705K5781K7971K8903K9535L0846L2594L3975L4909L5849L6771
59384B235365L7262L7321L7331L7422L7646L8455M0276M2793M5484M8780N3827
59373B691962O1159P0284Q0508R1355J02297J12982J23672J34577J44687J52192
59363C765675J56094J56647J54215J48765J40748J31426J21857J12202J02326
59354D989955R2279Q1925P0838N8914M6369L2914J7659J30j9377m0565o3375q7097
59342E180569j10097j30871j48634j62701j72240j77202j78562j77195j73272
$$ plain form
59333 3749795 3582618 3422595 3269927 3124844 2987594 2857838 2734963 2618946 2510082
59324 2510082 2407936 2311494 2220388 2135025 2055387 1980624 1910154 1844247 1783154 1726439 1673607
59313 1673607 1624734 1579997 1539089 1501505 1466985 1435360 1406387 1379969 1356177 1334892 1315831
59302 1315831 1299005 1284593 1272295 1261450 1251965 1244461 1239222 1235702 1233438 1232860 1234782 1239613 1247400
59289 1247400 1258088 1271357 1286808 1304802 1326480 1352413 1381766 1413430 1447483 1484740 1525245
59278 1525245 1567991 1612025 1657006 1702703 1748728 1794926 1841383 1887756 1933124 1976844 2018961
59267 2018961 2058931 2093796 2118303 2127554 2119915 2097626 2065073 2026775 1986500 1947085 1910228 1876553
59255 1876553 1846252 1819566 1796562 1776955 1760675 1748325 1740512 1736892 1736466 1738635 1743357 1750407 1759247
$$ packed form
59333C749795j67177j60023j52668j45083j37250j29756j22875j16017j08864
59324B510082j02146r6442r1106q5363p9638p4763p0470o5907o1093n6715n2832
59313A673607m8873m4737m0908l7584l4520l1625k8973k6418k3792k1285j9061
59302A315831j6826j4412j2298j0845r485p504n239l520k264n78J922M831P787
59289A247400J0688J3269J5451J7994K1678K5933K9353L1664L4053L7257M0505
59278A525245M2746M4034M4981M5697M6025M6198M6457M6373M5368M3720M2117
59267B018961L9970L4865K4507R251p639k2289l2553l8298m0275l9415l6857l3675
59255A876553l0301k6686k3004j9607j6280j2350p813l620m26K169M722P050Q840
$$ plain form
59242 1759247 1769766 1782452 1797578 1814600 1832544 1850593 1868288 1885636 1903130 1921215 1939655
59231 1939655 1957819 1975633 1993744 2012765 2032860 2054151 2076948 2101501 2128101 2157572 2191076
59220 2191076 2229290 2272284 2320359 2374424 2435317 2503301 2578399 2660608 2749450 2843690 2941632
59209 2941632 3041164 3139351 3232574 3317362 3390650 3449266 3490047 3510965 3511588 3492199 3453204 3395910
59197 3395910 3323240 3238997 3146707 3049477 2950336 2851962 2756224 2664402 2577584 2496562 2421636
59186 2421636 2352855 2290160 2233100 2180868 2132875 2088781 2047723 2008182 1969151 1930823 1893489
59175 1893489 1856203 1817268 1775780 1732106 1687016 1640974 1594178 1546819 1499205 1451913 1405698
59164 1405698 1361019 1317812 1275895 1235343 1196306 1158892 1123494 1090841 1061248 1034122 1008581
$$ packed form
59242A759247J0519J2686J5126J7022J7944J8049J7695J7348J7494J8085J8440
59231A939655J8164J7814J8111J9021K0095K1291K2797K4553K6600K9471L3504
59220B191076L8214M2994M8075N4065O0893O7984P5098Q2209Q8842R4240R7942
59209B941632R9532R8187R3223Q4788P3288N8616M0781K0918O23j9389l8995n7294
59197C395910p2670q4243r2290r7230r9141r8374r5738r1822q6818q1022p4926
59186B421636o8781o2695n7060n2232m7993m4094m1058l9541l9031l8328l7334
59175A893489l7286l8935m1488m3674m5090m6042m6796m7359m7614m7292m6215
59164A405698m4679m3207m1917m0552l9037l7414l5398l2653k9593k7126k5541
$$ plain form
59153 1008581 984352 961769 941178 922680 906149 891159 877179 864208 852964 844090 837458 832521
59141 832521 828991 826749 825478 824923 825314 827007 829836 833295 837329 842508 849383 857965 867925 879103
59127 879103 891751 906251 922617 940456 959661 980928 1005151 1032396 1061965 1093342 1126324
59116 1126324 1160097 1193109 1224264 1253579 1281147 1306126 1327381 1344629 1358282 1368551 1375441
59105 1375441 1379420 1381401 1382063 1381670 1380632 1379868 1380458 1382970 1387114 1392105 1397548 1403831 1411307 1419305 1426620
59090 1426620 1432954 1439076 1445278 1450438 1453027 1452455 1449034 1443147 1434868 1423876 1409307 1390175 1366314
59077 1366314 1338537 1307650 1273948 1237906 1200581 1162879 1125158 1088044 1052822 1020359 990277
59066 990277 961860 935149 910531 887936 867186 848485 831764 816139 800924 786685 774428
$$ packed form
59153A008581k4229k2583k0591j8498j6531j4990j3980j2971j1244q874o632m937
59141H32521l530k242j271n55L91J693K829L459M034N179O875Q582R960J1178
59127H79103J2648J4500J6366J7839J9205K1267K4223K7245K9569L1377L2982
59116A126324L3773L3012L1155K9315K7568K4979K1255J7248J3653J0269O890
59105A375441L979J981O62l93j038p64N90K512M144M991N443O283P476P998P315
59090A426620O334O122O202N160K589n72l421n887q279j0992j4569j9132k3861
59077A366314k7777l0887l3702l6042l7325l7702l7721l7114l5222l2463l0082
59066I90277k8417k6711k4618k2595k0750j8701j6721j5625j5215j4239j2257
$$ plain form
59055 774428 764197 755332 747637 741369 736461 732793 730974 731900 735643 741561 749302 758868 769862 781472
59041 781472 793065 804133 813955 822152 829384 836624 843894 850524 856525 862868 870429 879334 889220 899352
59027 899352 908619 916202 922263 927323 931157 933074 933171 932496 932029 932238 933551 936427 940923 946860 954345
59012 954345 963468 973651 984106 994784 1005972 1017011 1026439 1033484 1038556 1042136 1044166 1044664 1043850
58999 1043850 1041168 1035135 1024893 1011371 996337 980723 964401 947276 929955 913353 897921 883413
58987 883413 869439 856290 844918 835879 828569 821926 815649 810217 805976 802902 801190 801338 803422 806786
58973 806786 810643 814610 818610 822672 826998 831971 837935 845015 852996 861256 869123 876581 884343 892911
58959 892911 901927 910726 918954 926161 931346 933781 934046 933604 933546 934255 935852 938144 940446 942315 944370
$$ packed form
59055G74428j0231q865p695o268m908l668j819R26L743N918P741R566J0994J1610
59041G81472J1593J1068R822Q197P232P240P270O630O001O343P561Q905R886J0132
59027H99352R267P583O061N060L834J917R7o75m67K09J313K876M496N937P485
59012I54345R123J0183J0455J0678J1188J1039R428P045N072L580K030M98q14
58999A043850k682o033j0242j3522j5034j5614j6322j7125j7321j6602j5432j4508
58987H83413j3974j3149j1372r039p310o643o277n432m241l074j712J48K084L364
58973H06786L857L967M000M062M326M973N964P080P981Q260P867P458P762Q568
58959H92911R016Q799Q228P207N185K435K65m42n8P09J597K292K302J869K055
$$ plain form
58944 944370 947646 952308 957638 963097 968608 974036 979298 984973 992032 1000905 1011493 1023954 1038790
58931 1038790 1056176 1075920 1098015 1122593 1149337 1177479 1206195 1234609 1261835 1287837 1313889
58920 1313889 1341438 1370792 1401701 1434670 1470633 1509727 1551606 1596808 1646704 1702292 1764177
58909 1764177 1833406 1910871 1995902 2086871 2183332 2286233 2395830 2510907 2630458 2754719
58899 2754719 2883849 3016760 3151953 3288473 3425243 3560258 3691161 3816014 3932914
58890 3932914 4039346 4132334 4208807 4265772 4300959 4313741 4304927 4275588 4226816 4160605 4079886
58879 4079886 3987279 3884513 3773278 3655758 3534063 3409897 3285007 3161009 3038556 2917612
58869 2917612 2798796 2683492 2572396 2465094 2361453 2262321 2168349 2079277 1994983 1916167
$$ packed form
58944I44370L276M662N330N459N511N428N262N675P059Q873J0588J2461J4836
58931A038790J7386J9744K2095K4578K6744K8142K8716K8414K7226K6002K6052
58920A313889K7549K9354L0909L2969L5963L9094M1879M5202M9896N5588O1885
58909A764177O9229P7465Q5031R0969R6461J02901J09597J15077J19551J24261
58899B754719J29130J32911J35193J36520J36770J35015J30903J24853J16900
58890C932914J06432R2988P6473N6965L5187J2782q814k9339m8772o6211q0719
58879D079886r2607j02766j11235j17520j21695j24166j24890j23998j22453j20944
58869B917612j18816j15304j11096j07302j03641r9132r3972q9072q4294p8816
$$ plain form
58859 1916167 1843191 1775210 1711307 1651749 1597337 1548093 1503286 1462142 1423952 1388192 1355163
58848 1355163 1325897 1300793 1278983 1259598 1242950 1229765 1219902 1212529 1207078 1203331 1201079 1200340 1201494
58835 1201494 1204577 1208856 1213680 1219348 1226659 1235955 1247084 1259847 1274057 1289619 1306992 1327119
58823 1327119 1350393 1376110 1403325 1431863 1462132 1494488 1529147 1566279 1605793 1647524 1691991
58812 1691991 1740430 1793716 1851747 1914254 1981679 2054840 2134259 2220251 2313170 2413077 2519480
58801 2519480 2631761 2749537 2872325 2999160 3128575 3258493 3386058 3508136 3622080
58792 3622080 3725580 3816020 3890882 3948771 3989049 4010494 4011598 3992631 3956353 3906317 3845484
58781 3845484 3776755 3703366 3627672 3550258 3470747 3388405 3301180 3205357 3097659 2977706 2848056
$$ packed form
58859A916167p2976o7981o3903n9558n4412m9244m4807m1144l8190l5760l3029
58848A355163k9266k5104k1810j9385j6648j3185r863p373n451l747k252p39J154
58835A201494L083M279M824N668P311R296J1129J2763J4210J5562J7373K0127
58823A327119K3274K5717K7215K8538L0269L2356L4659L7132L9514M1731M4467
58812A691991M8439N3286N8031O2507O7425P3161P9419Q5992R2919R9907J06403
58801B519480J12281J17776J22788J26835J29415J29918J27565J22078J13944
58792C622080J03500R0440P4862N7889M0278K1445J104j8967l6278n0036o0833
58781C845484o8729p3389p5694p7414p9511q2342q7225r5823j07698j19953j29650
$$ plain form
58770 2848056 2712661 2575912 2442200 2314925 2195705 2084937 1982802 1889366 1804223 1726669
58760 1726669 1656108 1592137 1534639 1483838 1439647 1401037 1366834 1337160 1313127 1294949 1281412
58749 1281412 1271378 1264565 1260632 1258868 1259246 1262354 1267636 1273051 1277180 1280282 1282466 1282389 1278943 1272839
58735 1272839 1265221 1255971 1244865 1233326 1223309 1215060 1207322 1199134 1190005 1178903 1164618 1146976
58723 1146976 1126648 1104032 1079259 1052866 1025445 996988 967470 937611 908208 879231 850500
58712 850500 822642 796424 771732 748260 726669 707972 692167 678490 666666 656991 649556 644271
58700 644271 641156 639769 638763 636850 633740 629445 623398 615225 605757 596295 587389 579216 572402 567483
58686 567483 564167 562102 561754 563615 567381 572939 581262 593125 607804 624425 643816 667428 695051
$$ packed form
58770B848056j35395j36749j33712j27275j19220j10768j02135r3436q5143p7554
58760A726669p0561o3971n7498n0801m4191l8610l4203k9674k4033j8178j3537
58749A281412j0034o813l933j764L78L108N282N415M129L102K184p7l446o104
58735A272839p618r250j1106j1539j0017q249p738q188r129j1102j4285j7642
58723A146976k0328k2616k4773k6393k7421k8457k9518k9859k9403k8977k8731
58712H50500k7858k6218k4692k3472k1591j8697j5805j3677j1824r675p435n285
58700F44271l115j387j006j913l110m295o047q173r468r462q906q173o814m919
58686E67483l316k065l48J861L766N558Q323J1863J4679J6621J9391K3612K7623
$$ plain form
58673 695051 725200 757294 791825 828664 866844 905942 946252 987523 1028503 1067289 1100675
58662 1100675 1123531 1130668 1119979 1093218 1054183 1007234 956943 907120 859498 814189 771442
58651 771442 732154 696925 665829 639017 616525 597587 581164 566985 555184 545208 536254 528537
58639 528537 522942 519551 517538 516349 515918 515926 515951 516161 516888 517822 518603 519789 522109 525229 528491 532395 537959
58622 537959 545072 552968 561964 573043 585871 598971 611941 625907 641627 658718 677076 697523
58610 697523 720546 745698 772737 802247 834649 869491 906161 944528 984607 1026245 1069184
58599 1069184 1112765 1155633 1196414 1234446 1269104 1298837 1321914 1337805 1346833 1348862 1343517 1331368
58587 1331368 1313729 1291576 1265808 1238138 1210387 1183190 1156703 1132162 1111193 1093869 1079022
$$ packed form
58673F95051L0149L2094L4531L6839L8180L9098M0310M1271M0980L8786L3386
58662A100675K2856P137j0689k6761l9035m6949n0291m9823m7622m5309m2747
58651G71442l9288l5229l1096k6812k2492j8938j6423j4179j1801r976q954p717
58639E28537n595l391k013j189m31QK5K10P27R34P81J186K320L120L262L904N564
58622E37959P113P896Q996J1079J2828J3100J2970J3966J5720J7091J8358K0447
58610F97523K3023K5152K7039K9510L2402L4842L6670L8367M0079M1638M2939
58599A069184M3581M2868M0781L8032L4658K9733K3077J5891R028K029n345j2149
58587A331368j7639k2153k5768k7670k7751k7197k6487k4541k0969j7324j4847
$$ plain form
58576 1079022 1066293 1056359 1049283 1044289 1041144 1040216 1041223 1043492 1047378 1053735 1061958 1070216 1077694 1084863
58562 1084863 1091352 1095335 1095441 1091765 1084791 1074851 1062946 1050489 1037759 1023872 1008331 991117 971314
58549 971314 947524 919974 890421 859673 827081 792981 759659 729052 701131 675377 652214
58538 652214 632007 614078 597705 583016 570096 558337 547327 537420 528853 521335 514834 509684
58526 509684 505577 501641 497758 494535 491828 488818 485737 483827 483185 482423 481028 480258 480945 482200 483248
58511 483248 484931 488262 492890 498100 504055 510980 518190 525007 531683 538620 545601 552497 559727 567370
58497 567370 574898 582415 591015 601295 612680 624713 637704 651391 664325 675404 684853 692930
58485 692930 698913 702264 703656 703906 702887 700258 696270 691086 684314 675917 666678 657168 647247 637102
$$ packed form
58576A079022j2729r934p076m994l145r28J007K269L886O357Q223Q258P478P169
58562A084863O489L983J06l676o974r940j1905j2457j2730j3887j5541j7214j9803
58549I71314k3790k7550k9553l0748l2592l4100l3322l0607k7921k5754k3163
58538F52214k0207j7929j6373j4689j2920j1759j1010r907q567p518o501n150
58526E09684m107l936l883l223k707l010l081j910o42p62j395p70O87J255J048
58511D83248J683L331M628N210N955O925P210O817O676O937O981O896P230P643
58497E67370P528P517Q600J0280J1385J2033J2991J3687J2934J1079R449Q077
58485F92930N983L351J392K50j019k629l988n184o772q397r239r510r921j0145
$$ plain form
58471 637102 627629 619123 610699 601597 592051 582385 572460 562555 553608 546001 539267 533427 529298 526974
58457 526974 525388 523875 522793 522118 521016 519467 518674 519061 519515 519511 520402 523524 528497 534461 541494 549603
58441 549603 557651 564736 571557 579158 587130 594187 599732 603953 607073 609255 610553 610466 608427 605033 601774
58426 601774 599266 596992 594974 594164 594834 596209 598176 601554 606140 610346 613599 617272 622401 628265 634138
58411 634138 640584 647987 655624 663344 672296 682732 692804 700909 707692 714541 721735 729411 738593 749612
58397 749612 760748 769808 775901 778738 777840 773870 769289 766248 764859 764522 765510 768117 771608 775195 778812
58382 778812 782089 784040 784604 784915 785302 784837 783566 783059 783830 784512 784653 785872 788854 791827 793770 796626
58366 796626 802255 809438 816110 822551 830042 838199 845956 853647 861980 870401 878404 886935 896664 906515
$$ packed form
58471F37102r473q506q424r102r546r666r925r905q947p607o734n840m129k324
58457E26974j586j513j082o75j102j549p93L87M54mQ91L122M973N964P033Q109
58441E49603Q048P085O821P601P972P057N545M221L120K182J298q7k039l394l259
58426F01774k508k274k018q10O70J375J967L378M586M206L253L673N129N864N873
58411F34138O446P403P637P720Q952J0436J0072Q105O783O849P194P676R182J1019
58397G49612J1136R060O093K837q98l970m581l041j389l37R88K607L491L587L617
58382G78812L277J951N64L11L87m65j271n07P71O82J41J219K982K973J943K856
58366G96626N629P183O672O441P491Q157P757P691Q333Q421Q003Q531R729R851
$$ plain form
58352 906515 915740 925640 937155 948581 957859 965506 973162 980851 987782 994272 1000695 1006099 1009984 1013946
58338 1013946 1019555 1026163 1032743 1040087 1049096 1058764 1068100 1078244 1090349 1103167 1115121 1127076 1140707
58325 1140707 1155793 1171456 1188307 1206950 1226094 1244528 1263197 1283007 1302591 1320692 1338639
58314 1338639 1357767 1376436 1392502 1406765 1421100 1435122 1447751 1460181 1474141 1488907 1503046
58303 1503046 1517372 1533283 1550051 1566785 1585040 1606311 1628973 1650966 1673401 1698157 1724143
58292 1724143 1749675 1776330 1806557 1839465 1873006 1908296 1947482 1989196 2030522 2071961 2116183
58281 2116183 2163423 2212405 2264126 2320209 2378965 2437572 2496647 2558100 2619957 2678111 2731862
58270 2731862 2782972 2830724 2873100 2911741 2950529 2990036 3028308 3066250 3107250 3152297 3200349
$$ packed form
58352I06515R225R900J1515J1426R278P647P656P689O931O490O423N404L885L962
58338A013946N609O608O580P344R009R668R336J0144J2105J2818J1954J1955J3631
58325A140707J5086J5663J6851J8643J9144J8434J8669J9810J9584J8101J7947
58314A338639J9128J8669J6066J4263J4335J4022J2629J2430J3960J4766J4139
58303A503046J4326J5911J6768J6734J8255K1271K2662K1993K2435K4756K5986
58292A724143K5532K6655L0227L2908L3541L5290L9186M1714M1326M1439M4222
58281B116183M7240M8982N1721N6083N8756N8607N9075O1453O1857N8154N3751
58270B731862N1110M7752M2376L8641L8788L9507L8272L7942M1000M5047M8052
$$ plain form
58259 3200349 3252498 3310666 3373228 3437126 3503398 3575467 3653130 3733716 3818034 3909287 4007064
58248 4007064 4108361 4213776 4326742 4447354 4572980 4704219 4844101 4992221 5146002
58239 5146002 5306895 5478809 5661393 5851735 6051600 6265673 6493630 6731847 6982211
58230 6982211 7251016 7539603 7844747 8168107 8516399 8892118 9293225 9722360 10186946
58221 10186946 10689749 11229183 11809697 12441735 13130737 13877069 14688047 15578752 16559768
58212 16559768 17636417 18822292 20141189 21613828 23256659 25097269 27177697 29540797
58204 29540797 32230571 35311733 38874351 43016807 47843978 53486729 60099534 67829406
58196 67829406 76811591 87210770 99250614 113205184 129402924 148249395 170178411
$$ packed form
58259C200349N2149N8168O2562O3898O6272P2069P7663Q0586Q4318R1253R7777
58248D007064J01297J05415J12966J20612J25626J31239J39882J48120J53781
58239E146002J60893J71914J82584J90342J99865K14073K27957K38217K50364
58230F982211K68805K88587L05144L23360L48292L75719M01107M29135M64586
58221A0186946N02803N39434N80514O32038O89002P46332Q10978Q90705R81016
58212A6559768J076649J185875J318897J472639J642831J840610K080428K363100
58204B9540797K689774L081162L562618M142456M827171N642751O612805P729872
58196F7829406Q982185J0399179J2039844J3954570J6197740J8846471K1929016
$$ plain form
58189 170178411 195501910 224257591 256060253 289763656 322928154 351650706 371431133
58182 371431133 378914164 373348612 356682347 332376504 303976500 274295263 245252039
58175 245252039 217989561 193053676 170615529 150672830 133135266 117828879 104529027
58168 104529027 93024912 83134618 74673163 67455612 61339695 56228224 52023441 48617509
58160 48617509 45936737 43954864 42652460 42011959 42072742 42936191 44682550 47336700 50935689
58151 50935689 55479991 60611693 65330635 68250445 68363394 65636911 60892329 55180160
58143 55180160 49286869 43659455 38528988 33983097 29998723 26513925 23489061 20893770
58135 20893770 18673473 16764515 15124971 13725428 12526007 11486650 10587503 9817457
$$ packed form
58189A70178411K5323499K8755681L1802662L3703403L3164498K8722552J9780427
58182C71431133P483031n565552j6666265k4305843k8400004k9681237k9043224
58175B45252039k7262478k4935885k2438147j9942699j7537564j5306387j3299852
58168A04529027j1504115r890294q461455p217551o115917n111471m204783l405932
58160D8617509k680772j981873j302404o40501O0783Q63449J746359K654150L598989
58151E0935689M544302N131702M718942K919810J12949k726483m744582n712169
58143E5180160n893291n627414n130467m545891l984374l484798l024864k595291
58135B0893770k220297j908958j639544j399543j199421j039357q99147p70046
$$ plain form
58127 9817457 9152049 8561346 8030971 7557583 7130242 6732298 6356489 6003899 5672404
58118 5672404 5358649 5066870 4803522 4566475 4349556 4153354 3981377 3829966 3692209
58109 3692209 3567634 3457622 3354898 3248249 3135561 3022929 2913383 2805696 2702063
58100 2702063 2607274 2520997 2438952 2360733 2289000 2222346 2156534 2091700 2031055 1973527 1914885
58089 1914885 1855335 1799094 1747029 1696315 1646752 1600912 1558374 1516039 1473938 1434947 1399075
58078 1399075 1363656 1328732 1296612 1266566 1235665 1204594 1177020 1153322 1130412 1107659 1087459
58067 1087459 1069762 1051505 1032016 1013876 997781 981355 963737 946771 930978 914669 897660
58056 897660 881667 866535 850189 832885 817394 804390 791603 778141 765725 754996 744440
$$ packed form
58127I817457o65408n90703n30375m73388m27341l97944l75809l52590l31495
58118E672404l13755k91779k63348k37047k16919j96202j71977j51411j37757
58109C692209j24575j10012j02724j06649j12688j12632j09546j07687j03633
58100B702063r4789q6277q2045p8219p1733o6654o5812o4834o0645n7528n8642
58089A914885n9550n6241n2065n0714m9563m5840m2538m2335m2101l8991l5872
58078A399075l5419l4924l2120l0046l0901l1071k7574k3698k2910k2753k0200
58067A087459j7697j8257j9489j8140j6095j6426j7618j6966j5793j6309j7009
58056H97660j5993j5132j6346j7304j5491j3004j2787j3462j2416j0729j0556
$$ plain form
58045 744440 733752 724668 717674 711255 704982 699959 695702 690005 682535 675274 668874 661901 654227 647683
58031 647683 642585 636865 629509 621803 614350 605928 596202 586741 578509 570972 564319 559782 557031 554009
58017 554009 550046 546581 544224 541795 538896 536707 535530 534197 532705 532819 535239 538611 542077 546341
58003 546341 551481 556203 560161 564631 569951 574454 576804 577334 576396 573570 569316 565290 562220 559300 556262
57988 556262 554069 552998 552043 550761 549725 548696 546488 543223 540672 539706 539415 539266 540062 542176 544875
57973 544875 548062 552644 558434 563593 566825 568257 567626 563695 556218 546611 535922 523934 510923 498333
57959 498333 486902 475828 464623 454089 444795 436236 428224 421543 416529 412528 409245 407146 406144
57946 406144 405497 405317 406498 408841 411189 413755 418312 425548 434261 443740 454918 468335 482918 497648
$$ packed form
58045G44440j0688r084o994o419o273n023m257n697p470p261o400o973p674o544
58031F47683n098n720p356p706p453q422r726r461q232p537o653m537k751l022
58017E54009l963l465k357k429k899k189j177j333j492J14K420L372L466M264
58003E46341N140M722L958M470N320M503K350N30r38k826m254m026l070k920l038
57988E56262k193j071r55j282j036j029k208l265k551r66k91j49P96K114K699
57973E44875L187M582N790N159L232J432o31l931p477r607j0689j1988j3011j2590
57959D98333j1431j1074j1205j0534r294q559q012o681n014m001l283k099j002
57946D06144o47j80J181K343K348K566M557P236Q713R479J1178J3417J4583J4730
$$ plain form
57932 497648 512642 527733 541691 553693 563885 571709 575402 574103 568940 561214 550982 538046
57920 538046 522805 505453 485916 465224 445296 426801 408904 391627 376566 364578 354746 346405
57908 346405 340126 335703 331200 325280 318758 312620 306277 299092 291987 286115 281319 277231 274504 273611
57894 273611 273685 273877 274722 276922 279905 282789 285719 289093 292522 295638 298887 302377 304900 305244 303665
57879 303665 301206 298433 295632 293223 291024 288074 284102 280259 277617 275787 273791 271352 268702 266141
57865 266141 264489 264892 267466 271012 274671 278760 283563 288648 294011 300476 308148 315781 322412 328334
57851 328334 333731 337839 340366 342229 343872 344332 343021 340932 338882 336072 331794 327126 323368 319994
57837 319994 315794 311056 306980 303786 300991 298904 298239 298696 299253 299581 300122 301205 302974 305587 308575
$$ packed form
57932D97648J4994J5091J3958J2002J0192P824L693j299n163p726j0232j2936
57920E38046j5241j7352j9537k0692j9928j8495j7897j7277j5061j1988r832q341
57908C46405o279m423m503n920o522o138o343p185p105n872m796m088k727q93
57894B73611P4J92Q45K200K983K884K930L374L429L116L249L490K523L44j579
57879C03665k459k773k801k409k199k950l972l843k642j830j996k439k650k561
57865B66141j652M03K574L546L659M089M803N085N363O465P672P633O631N922
57851C28334N397M108K527J863J643M60j311k089k050k810m278m668l758l374
57837C19994m200m738m076l194k795k087o65M57N57L28N41J083J769K613K988
$$ plain form
57822 308575 310614 310889 310105 309368 308813 308062 307100 305799 303519 300177 296885 294483 292384 289878 287589 286443
57806 286443 286133 285976 286542 289054 293737 299976 307535 316437 326203 336398 347473 359950 373160 385778
57792 385778 397008 406237 412216 413881 411654 406915 400585 393159 385509 378492 372136 366249 361442 358583
57778 358583 357602 357745 358628 360156 361880 363242 363996 363737 361703 357865 353316 348635 342730 334516 324920
57763 324920 315897 308110 300996 294528 289327 285249 281305 277011 272731 268828 265481 263078 261717 260616
57749 260616 259060 257659 257588 258877 260662 262855 266245 270901 275665 279443 282090 283933 285237 286232 286943
57734 286943 287022 286396 285910 286572 288267 289890 290594 290357 289621 289156 289925 292277 295433 298465 301513 305346 310080
57717 310080 315168 320311 325531 330517 334712 337971 340611 343118 346245 350849 356893 363150 368678 374027
$$ packed form
57822C08575K039K75p84p37n55p51r62j301k280l342l292k402k099k506k289j146
57806B86443l10j57N66K512M683O239P559Q902R766J0195J1075J2477J3210J2618
57792C85778J1230R229N979J665k227m739o330p426p650p017o356n887m807k859
57778C58583r81J43Q83J528J724J362P54k59k034l838m549m681n905q214r596
57763C24920r023p787p114o468n201m078l944m294m280l903l347k403j361j101
57749B60616j556j401p1J289J785K193L390M656M764L778K647J843J304R95P11
57734B86943P9o26m86O62J695J623P04k37p36m65P69K352L156L032L048L833M734
57717C10080N088N143N220M986M195L259K640K507L127M604O044O257N528N349
$$ plain form
57703 374027 380253 387390 394831 402569 410923 419500 427578 435217 443042 451319 460189 470290 482095 495132
57689 495132 508960 524405 542614 563447 586175 611263 639922 672197 707175 745071 787501
57678 787501 835508 888722 946637 1009421 1077181 1149550 1226247 1307110 1391741 1480386 1575147
57667 1575147 1679088 1794097 1920289 2055740 2192939 2314329 2394868 2413478 2364299 2258155
57657 2258155 2114959 1954842 1793131 1639091 1496974 1368183 1253054 1151314 1062098 984383
57647 984383 917322 859952 811039 769495 734532 705208 680357 659202 641567 627263 615836
57636 615836 607124 601439 598860 598856 600921 605043 611216 618960 627729 637422 648284 660703 675308 692708
57622 692708 712818 734842 758191 783014 809681 838164 868155 899242 930625 961032 989322
$$ packed form
57703C74027O226P137P441P738Q354Q577Q078P639P825Q277Q870J0101J1805J3037
57689D95132J3828J5445J8209K0833K2728K5088K8659L2275L4978L7896M2430
57678G87501M8007N3214N7915O2784O7760P2369P6697Q0863Q4631Q8645R4761
57667A575147J03941J15009J26192J35451J37199J21390Q0539J8610m9179j06144
57657B258155j43196j60117j61711j54040j42117j28791j15129j01740q9216p7715
57647I84383o7061n7370m8913m1544l4963k9324k4851k1155j7635j4304j1427
57636F15836q712n685k579mK065M122O173P744Q769R693J0862J2419J4605J7400
57622F92708K0110K2024K3349K4823K6667K8483K9991L1087L1383L0407K8290
$$ plain form
57611 989322 1014925 1037518 1056533 1071117 1080278 1083011 1078675 1067505 1050473 1028584 1002538 973127
57599 973127 941450 908588 875347 842411 810376 779507 749748 721090 693693 667655 642955
57588 642955 619624 597723 577267 558500 542045 528232 516359 505127 493864 482906 472871
57577 472871 464062 456519 450048 444118 438225 432489 427461 423302 419570 415831 412094 408612 405675 403539
57563 403539 402120 400870 399436 398362 398631 400601 403805 407593 411303 414062 415333 415712 416474 418200 420569
57548 420569 423420 427162 431920 437206 442771 449025 456230 463973 471845 479993 488587 497408 506463 516404
57534 516404 527767 540220 553223 567036 582442 599650 618205 637972 659638 683934 710636
57523 710636 738632 767016 795873 825729 856229 885708 912340 935399 955034 971053 982474
$$ packed form
57611I89322K5603K2593J9015J4584R161K733m336j1170j7032k1889k6046k9411
57599I73127l1677l2862l3241l2936l2035l0869k9759k8658k7397k6038k4700
57588F42955k3331k1901k0456j8767j6455j3813j1873j1232j1263j0958j0035
57577D72871q809p543o471n930n893n736n028m159l732l739l737l482k937k136
57563D03539j419j250j434j074K69J970L204L788L710K759J271L79P62J726K369
57548D20569K851L742M758N286N565O254P205P743P872Q148Q594Q821R055R941
57534E16404J1363J2453J3003J3813J5406J7208J8555J9767K1666K4296K6702
57523G10636K7996K8384K8857K9856L0500K9479K6632K3059J9635J6019J1421
$$ plain form
57512 982474 988281 988141 982379 971699 957003 939144 918712 896274 872668 848767 825031 801637
57500 801637 778876 757060 736246 716516 698341 682123 667567 654115 641887 631505 623095 616140
57488 616140 610340 605898 602885 601039 600297 600825 602377 604277 606294 608897 612508 617090 622641 629342 636960
57473 636960 644826 652867 662017 673136 686048 700176 715661 733241 753214 775046 797911 821293
57461 821293 845134 869686 895134 921131 946686 970558 991753 1009678 1023980 1034190 1039487 1039047
57449 1039047 1032850 1021846 1007019 988691 967208 943895 920516 897909 875913 854528 834277
57438 834277 815375 797478 780567 765354 752341 741095 730846 721351 712825 705388 698948 693329
57426 693329 688357 684028 680628 678270 676362 674040 671182 668546 666837 666195 666555 667832 669623 671414 673306
$$ packed form
57512I82474N807j40n762j0680j4696j7859k0432k2438k3606k3901k3736k3394
57500H01637k2761k1816k0814j9730j8175j6218j4556j3452j2228j0382q410o955
57488F16140n800m442l013j846p42N28J552J900K017K603L611M582N551O701P618
57473F36960P866Q041R150J1119J2912J4128J5485J7580J9973K1832K2865K3382
57461H21293K3841K4552K5448K5997K5555K3872K1195J7925J4302J0210N297m40
57449A039047o197j1004j4827j8328k1483k3313k3379k2607k1996k1385k0251
57438H34277j8902j7897j6911j5213j3013j1246j0249r495q526p437o440n619
57426F93329m972m329l400k358j908k322k858k636j709o42L60J277J791J791J892
$$ plain form
57411 673306 675934 679492 683429 687306 691283 695542 699886 704213 708740 713441 717879 721967 726334 731533
57397 731533 737364 743329 749251 755230 761495 768517 776638 785243 793067 799741 806388 814195 823049 832089
57383 832089 840956 849775 858488 867025 875848 885518 895764 905576 914170 921572 928387 935300 942627 950051
57369 950051 957038 963679 970766 978786 987250 995336 1002840 1010161 1017756 1025921 1034698 1043613 1051890 1059261
57355 1059261 1066255 1073395 1080572 1087521 1094365 1101304 1108237 1115156 1122379 1129940 1137250 1143915 1150359 1157071
57341 1157071 1163763 1169977 1175967 1182155 1188146 1193325 1198241 1204384 1212483 1221800 1231171 1240003 1248155 1255622
57327 1255622 1262702 1270029 1278105 1287032 1296722 1307032 1317698 1328568 1339926 1352174 1365170 1378307
57315 1378307 1391301 1404466 1418138 1432307 1446888 1461910 1477236 1492554 1507859 1523544 1539727
$$ packed form
57411F73306K628L558L937L877L977M259M344M327M527M701M438M088M367N199
57397G31533N831N965N922N979O265P022Q121Q605P824O674O647P807Q854R040
57383H32089Q867Q819Q713Q537Q823R670J0246R812Q594P402O815O913P327P424
57369I50051O987O641P087Q020Q464Q086P504P321P595Q165Q777Q915Q277P371
57355A059261O994P140P177O949O844O939O933O919P223P561P310O665O444O712
57341A157071O692O214N990O188N991N179M916O143Q099R317R371Q832Q152P467
57327A255622P080P327Q076Q927R690J0310J0666J0870J1358J2248J2996J3137
57315A378307J2994J3165J3672J4169J4581J5022J5326J5318J5305J5685J6183
$$ plain form
57304 1539727 1555916 1571721 1587628 1604549 1622731 1641546 1660341 1679054 1697845 1716581 1735050
57293 1735050 1753482 1772395 1791901 1811474 1830503 1848765 1866216 1882605 1897538 1910806 1922442
57282 1922442 1932657 1941901 1950743 1959358 1967303 1974097 1979898 1985275 1990551 1995793 2001290 2007511 2014590 2022333
57268 2022333 2030699 2039782 2049372 2059106 2069138 2080078 2092039 2104286 2116098 2127572 2139301 2151612
57256 2151612 2164343 2177085 2189475 2201541 2213837 2226902 2240588 2254316 2267917 2281645 2295376
57245 2295376 2308605 2321474 2334948 2349554 2364605 2379258 2393742 2408833 2424546 2440063 2454792
57234 2454792 2468854 2482593 2496152 2509567 2522915 2536261 2549628 2562990 2576232 2589274 2602306
57223 2602306 2615645 2629262 2642734 2655755 2668400 2680753 2692754 2704550 2716575 2728972 2741282
$$ packed form
57304A539727J6189J5805J5907J6921J8182J8815J8795J8713J8791J8736J8469
57293A735050J8432J8913J9506J9573J9029J8262J7451J6389J4933J3268J1636
57282A922442J0215R244Q842Q615P945O794N801N377N276N242N497O221P079P743
57268B022333Q366R083R590R734J0032J0940J1961J2247J1812J1474J1729J2311
57256B151612J2731J2742J2390J2066J2296J3065J3686J3728J3601J3728J3731
57245B295376J3229J2869J3474J4606J5051J4653J4484J5091J5713J5517J4729
57234B454792J4062J3739J3559J3415J3348J3346J3367J3362J3242J3042J3032
57223B602306J3339J3617J3472J3021J2645J2353J2001J1796J2025J2397J2310
$$ plain form
57212 2741282 2752989 2764053 2774700 2785047 2795160 2805106 2814737 2823789 2832430 2841251 2850471 2859552 2867900
57199 2867900 2875518 2882777 2890031 2897719 2906218 2915189 2923656 2931181 2938500 2946533 2955309 2964406 2973851 2983833
57185 2983833 2993898 3003158 3011169 3018095 3024309 3030393 3037203 3045204 3053843 3062173 3070005 3077956 3086552 3095791
57171 3095791 3105439 3115126 3124259 3132428 3139971 3147682 3155917 3164325 3172391 3179860 3186663 3192870 3198754 3204574
57157 3204574 3210212 3215220 3219280 3222524 3225540 3229176 3234110 3240329 3247072 3253447 3259128 3264654 3271326 3280639
57143 3280639 3293176 3307798 3322322 3334974 3344719 3350307 3350161 3343810 3332724 3319114 3304360 3288934
57131 3288934 3273031 3256496 3238692 3219210 3198433 3176875 3154564 3131716 3109426 3088849 3070126
57120 3070126 3052975 3037889 3025917 3017659 3013457 3014189 3020764 3032912 3049560 3070524 3096988 3130358
$$ packed form
57212B741282J1707J1064J0647J0347J0113R946R631R052Q641Q821R220R081Q348
57199B867900P618P259P254P688Q499Q971Q467P525P319Q033Q776R097R445R982
57185B983833J0065R260Q011O926O214O084O810Q001Q639Q330P832P951Q596R239
57171C095791R648R687R133Q169P543P711Q235Q408Q066P469O803O207N884N820
57157C204574N638N008M060L244L016L636M934O219O743O375N681N526O672R313
57143C280639J2537J4622J4524J2652R745N588j46o351j1086j3610j4754j5426
57131C288934j5903j6535j7804j9482k0777k1558k2311k2848k2290k0577j8723
57120C070126j7151j5086j1972q258m202P32O575J2148J6648K0964K6464L3370
$$ plain form
57108 3130358 3171596 3221900 3283163 3357481 3447016 3554845 3685556 3844758 4038446 4273153
57098 4273153 4556450 4897068 5304522 5788380 6357359 7018693 7777958 8638807 9602347
57089 9602347 10666705 11826436 13070277 14377502 15716588 17049289 18338139 19552209
57081 19552209 20668032 21666271 22526192 23221324 23720674 23996941 24036587 23844189 23439053
57072 23439053 22848504 22102370 21229386 20255135 19201992 18090900 16943098 15780487 14624929
57063 14624929 13496928 12413764 11388013 10427700 9537544 8719582 7973072 7295140 6682216
57054 6682216 6130666 5636213 5193508 4796602 4439573 4116957 3824379 3558921 3318354
57045 3318354 3099943 2900493 2717360 2548595 2392131 2245668 2107659 1977774 1856185
$$ packed form
57108C130358M1238N0304O1263P4318Q9535J07829J30711J59202J93688K34707
57098D273153K83297L40618M07454M83858N68979O61334P59265Q60849R63540
57089I602347J064358J159731J243841J307225J339086J332701J288850J214070
57081A9552209J115823R98239Q59921O95132M99350K76267L9646j92398m05136
57072B3439053n90549p46134q72984r74251j053143j111092j147802j162611j155558
57063A4624929j128001j083164j025751r60313q90156q17962p46510o77932o12924
57054F682216n51550m94453m42705l96906l57029l22616k92578k65458k40567
57045C318354k18411j99450j83133j68765j56464j46463j38009j29885j21589
$$ plain form
57036 1856185 1742842 1637531 1539982 1449716 1366179 1289021 1217868 1151978 1090669 1033952 982114
57025 982114 934878 891673 852511 817751 787091 759634 734938 713232 694605 678718 665240
57014 665240 653916 644421 636945 632612 632448 636317 643882 656174 675129 702016 737549 782978 839738
57001 839738 908933 992894 1096208 1223089 1375426 1556438 1772577 2021819 2275435 2478365
56991 2478365 2577918 2556324 2436113 2258162 2058317 1859838 1676018 1512573 1369428 1244333
56981 1244333 1135486 1040724 956672 880577 811945 751069 697065 648610 605543 568334 536488
56970 536488 508605 483591 460919 440201 421418 405258 392340 382311 374398 368678 366173 367686
56958 367686 373024 381219 391016 401006 409536 414684 414625 408513 397204 382835 367472 352259 337698
$$ packed form
57036A856185j13343j05311r7549r0266q3537p7158p1153o5890o1309n6717n1838
57025I82114m7236m3205l9162l4760l0660k7457k4696k1706j8627j5887j3478
57014F65240j1324r495p476m333j64L869P565J2292J8955K6887L5533M5429N6760
57001H39738O9195Q3961J03314J26881J52337J81012K16139K49242K53616K02930
56991B478365R9553k1594j20211j77951j99845j98479j83820j63445j43145j25095
56981A244333j08847r4762q4052p6095o8632o0876n4004m8455m3067l7209l1846
56970E36488k7883k5014k2672k0718j8783j6160j2918j0029p913n720k505J513
56958C67686N338Q195R797R990Q530N148n9o112j1309j4369j5363j5213j4561
$$ plain form
56945 337698 324196 312095 301590 292914 286347 281889 279221 278142 278813 281537 286619 294498 305494
56932 305494 319240 334744 351121 367697 383098 394855 400569 399287 391405 377744 359379 338174
56920 338174 316570 296391 278079 261218 245504 231065 218169 206951 197424 189496 182882 177166
56908 177166 172110 167871 164712 162444 160444 158365 156612 155755 155676 155727 155771 156505 158531 161522 164707 167980
56892 167980 172014 177445 184347 192561 202086 212861 224487 236446 248360 259626 268913 274595 275961
56879 275961 273751 269277 263347 256355 249052 242572 237666 234392 232666 232677 234647 238627 244757 253309 264255
56864 264255 277271 292487 310838 333187 359342 388204 418278 447275 471584 487307 492427 487762
56852 487762 475859 459426 440760 421806 404033 388332 375275 365371 359015 356443 357961 363920
$$ packed form
56945C37698j3502j2101j0505q676o567m458k668j079O71K724N082P879J0996
56932C05494J3746J5504J6377J6576J5401J1757N714j282p882j3661j8365k1205
56920C38174k1604k0179j8312j6861j5714j4439j2896j1218r527p928o614n716
56908A77166n056m239l159k268k000k079j753q57p9N1M4P34K026K991L185L273
56892A67980M034N431O902Q214R525J0775J1626J1959J1914J1266R287N682J366
56879B75961k210m474n930o992p303o480m906l274j726J1J970L980O130Q552J0946
56864B64255J3016J5216J8351K2349K6155K8862L0074K8997K4309J5723N120m665
56852D87762j1903j6433j8666j8954j7773j5701j3057r904o356k572J518N959
$$ plain form
56840 363920 374380 389114 408161 432108 461535 496452 536560 581544 630130 678469 720019
56829 720019 747903 758041 750547 728652 696678 658731 618373 578579 541568 508715 480663 457471
56817 457471 438806 424437 414699 410240 411073 416306 425273 438798 458729 485944 519008 554632 588829
56804 588829 617385 636039 641468 632796 612081 583127 549672 514471 479468 446249 416087 389740
56792 389740 367440 349071 334260 322426 313051 306092 302086 301755 305496 313197 324340 338189 353875
56779 353875 370206 385186 395879 399387 394527 382506 365816 346594 326102 305188 284497 264282
56767 264282 244635 226069 209429 195140 182913 172320 163230 155450 148418 141638 135171 129348 124227
56754 124227 119677 115783 112743 110403 108286 106076 103820 101713 99996 99018 98960 99422 99641 99282 98746 98519
$$ packed form
56840C63920J0460J4734J9047K3947K9427L4917M0108M4984M8586M8339M1550
56829G20019K7884J0138p494k1895l1974l7947m0358l9794l7011l2853k8052k3192
56817D57471j8665j4369r738m459Q33N233Q967J3525J9931K7215L3064L5624L4197
56804E88829K8556J8654N429q672k0715k8954l3455l5201l5003l3219l0162k6347
56792C89740k2300j8369j4811j1834r375o959m006l31L741P701J1143J3849J5686
56779C53875J6331J4980J0693L508m860j2021j6690j9222k0492k0914k0691k0215
56767B64282j9647j8566j6640j4289j2227j0593r090p780p032o780o467n823n121
56754A24227m550l894l040k340k117k210k256k107j717r78n8M62K19l59n36k27
$$ plain form
56738 98519 98547 98450 98093 97606 97045 96479 96273 96812 97793 98198 97287 95422 93695 92893 93028 93718 94632 95570 96472
56719 96472 97476 98718 99957 100645 100578 100229 100176 100390 100404 100118 100028 100548 101461 102213 102488 102302 101746 100969 100314
56700 100314 100189 100722 101709 102867 104000 104934 105513 105710 105647 105512 105524 105894 106643 107535 108418 109579 111404 113607
56682 113607 115237 115738 115699 116216 117682 119608 121512 123472 125594 127390 128118 127655 126691 126009 125775 125662 125498
56665 125498 125449 125492 125058 123640 121738 120692 121248 122572 123072 122088 120307 118560 116778 114480 111895 110074
56649 110074 109820 110818 111965 112390 112030 111384 110954 110984 111502 112344 113151 113544 113399 112857 112136 111514 111472 112429 114130
56630 114130 115561 115814 114871 113367 111875 110797 110629 111685 113574 115451 116920 118275 119780 121176 122158
56615 122158 122901 123831 124988 125883 125936 124998 123528 122208 121249 120256 119061 118368 119027 120752 122258 122757 122703
$$ packed form
56738I8519K8r7l57m87n61n66k06N39R81M05r11j865j727q02J35O90R14R38R02
56719I6472J004J242J239O88o7l49n3K14J4k86r0N20R13P52K75j86n56p77o55
56700A00314j25N33R87J158J133R34N79J97o3j35J2L70P49Q92Q83J161J825K203
56682A13607J630N01l9N17J466J926J904J960K122J796P28m63r64o82k34j13j64
56665A25498m9M3m34j418j902j046N56J324N00r84j781j747j782k298k585j821
56649A10074k54R98J147M25l60o46m30L0N18Q42Q07L93j45n42p21o22m2R57J701
56630A14130J431K53r43j504j492j078j68J056J889J877J469J355J505J396R82
56615A22158P43R30J157Q95N3r38j470j320r59r93j195o93O59J725J506M99n4
$$ plain form
56598 122703 122924 123752 125282 127661 130501 132588 132997 132250 131789 132415 133779 135209 136460 137698 139199 141118
56582 141118 143240 145013 146113 146877 147886 149251 150623 151783 152877 154144 155700 157569 159738 162171
56568 162171 164882 167832 170752 173389 176085 179623 184246 189300 194198 199229 204882 210865 216506 221862
56554 221862 227608 233942 240325 246367 252253 258106 263517 268021 271698 275065 278535 282039 285013 286818
56540 286818 287378 287323 287330 287470 287435 287045 286100 284030 280324 275265 269761 264470 259474 254662 249873 244721 238873
56523 238873 232628 226808 221940 217863 214151 210595 207231 204210 201631 199314 196838 193979 190959 188012
56509 188012 185081 182271 180132 178944 178018 176375 173888 171219 168884 167014 165703 164818 163702 161877 159900
56494 159900 158726 158379 158096 157660 157565 157894 158041 157724 157268 156737 155799 154762 154722 156193 158373 160221 161516
$$ packed form
56598A22703K21Q28J530K379K840K087M09p47m61O26J364J430J251J238J501J919
56582A41118K122J773J100P64J009J365J372J160J094J267J556J869K169K433
56568A62171K711K950K920K637K696L538M623N054M898N031N653N983N641N356
56554B21862N746O334O383O042N886N853N411M504L677L367L470L504K974J805
56540B86818N60n5PJ40l5l90r45k070l706n059n504n291m996m812m789n152n848
56523B38873o245n820m868m077l712l556l364l021k579k317k476k859l020k947
56509A88012k931k810k139j188r26j643k487k669k335j870j311q85j116j825j977
56494A59900j174l47k83m36r5L29J47l17m56n31r38j037m0J471K180J848J295
$$ plain form
56477 161516 162538 163524 164913 167266 170380 173203 175128 176722 178615 180449 181589 182242 183136 184586 186552
56462 186552 189126 192266 195454 198257 200911 203746 206360 208002 208575 208729 209206 210495 212770 215605 218044
56447 218044 219458 220140 220692 221191 221513 222090 223672 226469 230018 233742 237146 239756 241481 242951 244931
56432 244931 247424 249749 251421 252456 252896 252554 251354 249546 247472 245295 242983 240392 237460 234440 231840
56417 231840 229933 228490 227123 225616 223743 221089 217519 213668 210557 208699 207781 207179 206536 205907 205492
56402 205492 205248 204790 203853 202828 202518 203264 204642 206105 207472 208562 208822 207824 205904 203909 202428 201585
56386 201585 201344 201564 201766 201264 199774 197764 196066 195110 194536 193681 192491 191751 192165 193374 194341 194607 194656
56369 194656 194932 195049 194361 193048 192185 192704 194457 196341 197375 197620 197940 198940 200451 202142 204066 206252
$$ packed form
56477A61516J022R86J389K353L114K823J925J594J893J834J140O53Q94J450J966
56462A86552K574L140L188K803K654K835K614J642N73J54M77J289K275K835K439
56447B18044J414O82N52M99L22N77J582K797L549L724L404K610J725J470J980
56432B44931K493K325J672J035M40l42j200j808k074k177k312k591k932l020k600
56417B31840j907j443j367j507j873k654l570l851l111j858r18o02o43o29m15
56402B05492k44m58r37j025l10P46J378J463J367J090K60r98j920j995j481q43
56386B01585k41K20K02n02j490k010j698r56n74q55j190p40M14J209R67K66M9
56369A94656K76J17o88j313q63N19J753J884J034K45L20J000J511J691J924K186
$$ plain form
56353 206252 208291 209892 211402 213099 214432 214838 214984 216134 218366 220560 222222 224211 227270 230799 233573
56338 233573 235046 235555 235824 236618 238360 240811 243448 246078 248585 250430 251375 252517 255389 259925 264554
56323 264554 268461 272441 277157 282027 286517 291138 296282 301231 305370 309383 314153 319285 323777 327434
56309 327434 330633 333356 335572 337979 341249 344881 347809 349800 351341 352559 353277 353876 355091 356956 358789
56294 358789 360222 361545 363075 364805 366742 369087 371995 375414 379154 382991 386933 391437 397036 403749
56280 403749 411302 419841 429671 440318 450841 461241 472541 485180 498548 512608 528666 547706
56268 547706 569157 592275 617714 646573 678785 713752 751894 794319 841398 892763 948334
56257 948334 1008286 1072279 1139646 1210022 1282944 1357145 1431029 1503467 1573330 1638751 1697623
$$ packed form
56353B06252K039J601J510J697J333M06J46J150K232K194J662J989L059L529K774
56338B33573J473N09K69P94J742K451K637K630K507J845R45J142K872M536M629
56323B64554L907L980M716M870M490M621N144M949M139M013M770N132M492L657
56309C27434L199K723K216K407L270L632K928J991J541J218P18N99J215J865J833
56294C58789J433J323J530J730J937K345K908L419L740L837L942M504N599O713
56280D03749P553Q539R830J0647J0523J0400J1300J2639J3368J4060J6058J9040
56268E47706K1451K3118K5439K8859L2212L4967L8142M2425M7079N1365N5571
56257I48334N9952O3993O7367P0376P2922P4201P3884P2438O9863O5421N8872
$$ plain form
56246 1697623 1748516 1790529 1822862 1845283 1858327 1862209 1856219 1840082 1815263 1783949 1747320 1705806
56234 1705806 1660319 1612052 1561518 1508916 1454988 1400498 1345342 1289297 1233232 1178435 1125132
56223 1125132 1072857 1021999 973872 929430 888889 852356 819775 790416 763352 738361 715643
56212 715643 694959 675854 658337 642543 628126 614732 602611 592052 582763 574555 567817 562405
56200 562405 556948 550474 543974 539057 535682 532578 529276 526292 523744 521254 518998 517511 516641 515877 515386
56185 515386 515560 515935 515809 515545 515989 517031 518069 519513 522322 526259 530081 533427 537199 542067 547762
56170 547762 553799 559844 565474 570597 575947 582227 589041 595559 601753 608014 614162 619939 625874 632487
56156 632487 639327 646102 653975 664247 676388 688895 701475 714795 728734 742804 757918 775909
$$ packed form
56246A697623N0893M2013L2333K2421J3044L882n990j6137k4819l1314l6629m1514
56234A705806m5487m8267n0534n2602n3928n4490n5156n6045n6065n4797n3303
56223A125132n2275n0858m8127m4442m0541l6533l2581k9359k7064k4991k2718
56212G15643k0684j9105j7517j5794j4417j3394j2121j0559r289q208o738n412
56200E62405n457o474o500m917l375l104l302k984k548k490k256j487q70p64m91
56185E15386J74L75j26k64M44J042J038J444K809L937L822L346L772M868N695
56170E47762O037O045N630N123N350O280O814O518O194O261O148N777N935O613
56156F32487O840O775P873J0272J2141J2507J2580J3320J3939J4070J5114J7991
$$ plain form
56144 775909 797410 821775 848844 879160 912749 949358 989878 1036118 1089486 1151318 1224065
56133 1224065 1310431 1411483 1526808 1655685 1796042 1942548 2087538 2223944 2346508 2451740
56123 2451740 2539388 2613694 2680745 2743991 2803272 2856895 2902221 2934909 2950853 2949792 2935621
56112 2935621 2913261 2886599 2858195 2827776 2790610 2739738 2670609 2582620 2477381 2358355 2231893
56101 2231893 2105588 1984775 1872231 1770700 1682871 1608749 1545698 1491538 1445468 1406022
56091 1406022 1370847 1338885 1310485 1285139 1261526 1239845 1221522 1206364 1192636 1180176 1170675
56080 1170675 1164524 1160092 1156609 1154994 1155265 1155933 1156699 1159108 1163796 1169560 1175894 1183878 1193857 1204648
56066 1204648 1215769 1228124 1241855 1255932 1270315 1286079 1302980 1319460 1335442 1352482 1370826
$$ packed form
56144G75909K1501K4365K7069L0316L3589L6609M0520M6240N3368O1832P2747
56133A224065Q6366J01052J15325J28877J40357J46506J44990J36406J22564J05232
56123B451740Q7648P4306O7051O3246N9281N3623M5326L2688J5944j061j4171
56112B935621k2360k6662k8404l0419l7166n0872o9129q7989j05239j19026j26462
56101B231893j26305j20813j12544j01531q7829p4122o3051n4160m6070l9446
56091A406022l5175l1962k8400k5346k3613k1681j8323j5158j3728j2460r501
56080A170675o151m432l483j615K71O68P66K409M688N764O334P984R979J0791
56066A204648J1121J2355J3731J4077J4383J5764J6901J6480J5982J7040J8344
$$ plain form
56055 1370826 1389146 1407492 1427573 1449635 1472102 1494765 1519232 1545678 1572416 1599272 1628078
56044 1628078 1659075 1690208 1720829 1752711 1786511 1820558 1854136 1888582 1924195 1959419 1994069
56033 1994069 2029908 2067111 2103687 2139368 2176425 2215689 2255589 2296237 2340454 2389358 2440751
56022 2440751 2493369 2548948 2608740 2671684 2737317 2806662 2879104 2952367 3026680 3104855 3187256
56011 3187256 3271189 3356297 3445725 3540733 3639239 3741071 3849308 3964701 4084247 4207226
56001 4207226 4337258 4476297 4622146 4774050 4935132 5106969 5287532 5476805 5678718
55992 5678718 5895143 6123913 6364970 6622255 6897411 7188433 7496811 7828785 8187075
55983 8187075 8569096 8976010 9415308 9891461 10402862 10951571 11546994 12196119 12899758
$$ packed form
56055A370826J8320J8346K0081K2062K2467K2663K4467K6446K6738K6856K8806
56044A628078L0997L1133L0621L1882L3800L4047L3578L4446L5613L5224L4650
56033A994069L5839L7203L6576L5681L7057L9264L9900M0648M4217M8904N1393
56022B440751N2618N5579N9792O2944O5633O9345P2442P3263P4313P8175Q2401
56011C187256Q3933Q5108Q9428R5008R8506J01832J08237J15393J19546J22979
56001D207226J30032J39039J45849J51904J61082J71837J80563J89273K01913
55992E678718K16425K28770K41057K57285K75156K91022L08378L31974L58290
55983H187075L82021M06914M39298M76153N11401N48709N95423O49125P03639
$$ plain form
55974 12899758 13662875 14498913 15419630 16431324 17546169 18786547 20173556 21723649
55966 21723649 23462715 25431555 27673108 30230182 33164063 36561720 40519446 45137838
55958 45137838 50539909 56871997 64275868 72883743 82857466 94417352 107833215 123426263
55950 123426263 141587539 162726165 187123795 214788459 245292760 277407196 308587190
55943 308587190 334924144 352156666 357402182 350388920 333288286 309465280 282196312
55936 282196312 254019549 226633353 201013032 177601266 156531429 137793131 121288472
55929 121288472 106846197 94260945 83330749 73857110 65639904 58498024 52285826
55922 52285826 46878980 42159288 38024575 34398363 31216431 28413855 25933790 23736383
$$ packed form
55974A2899758P63117Q36038R20717J011694J114845J240378J387009J550093
55966B1723649J739066J968840K241553K557074K933881L397657L957726M618392
55958D5137838N402071O332088P403871Q607875R973723J1559886J3415863J5593048
55950A23426263J8161276K1138626K4397630K7664664L0504301L2114436L1179994
55943C08587190K6336954J7232522N245516p013262j7100634k3823006k7268968
55936B82196312k8176763k7386196k5620321k3411766k1069837j8738298j6504659
55929A21288472j4442275j2585252j0930196r473639q217206p141880o212198
55922E2285826n406846m719692m134713l626212l181932k802576k480065k197407
$$ plain form
55914 23736383 21788160 20051752 18494352 17096318 15842445 14712731 13688963 12761794
55906 12761794 11923448 11160690 10461785 9823112 9242052 8709827 8217644 7763575 7347166
55897 7347166 6963062 6605768 6275279 5972318 5692877 5432431 5190728 4967810 4760129
55888 4760129 4565033 4384409 4219632 4067563 3925491 3795305 3678689 3573013 3476187 3391008
55878 3391008 3320247 3261443 3210701 3167607 3132188 3100627 3068002 3031950 2990151 2937882 2872160
55867 2872160 2795491 2712202 2624033 2532242 2440571 2352565 2268700 2188936 2115112 2048156 1986210
55856 1986210 1928395 1877254 1834864 1799895 1770997 1748964 1732074 1712994 1684440 1645545 1599728
55845 1599728 1549532 1496996 1445925 1399471 1357250 1317987 1282886 1253466 1228431 1205831 1186092
$$ packed form
55914B3736383j948223j736408j557400j398034j253873j129714j023768r27169
55906A2761794q38346p62758o98905o38673n81060n32225m92183m54069m16409
55897G347166l84104l57294l30489l02961k79441k60446k41703k22918k07681
55888D760129j95096j80624j64777j52069j42072j30186j16616j05676r6826q5179
55878C391008p0761n8804n0742m3094l5419l1561l2625l6052m1799n2269o5722
55867B872160p6669q3289q8169r1791r1671q8006q3865p9764p3824o6956o1946
55856A986210n7815n1141m2390l4969k8898k2033j6890j9080k8554l8895m5817
55845A599728n0196n2536n1071m6454m2221l9263l5101k9420k5035k2600j9739
$$ plain form
55834 1186092 1169926 1155515 1140860 1126716 1114130 1101206 1085482 1067627 1049650 1031278 1011151
55823 1011151 989891 968936 947811 925392 902413 880009 857360 833555 810326 790164 772943
55812 772943 756971 742044 728958 717291 706216 696384 688691 682340 676323 671561 669338 668939 668983 669733
55798 669733 671753 673607 673252 670605 666594 660874 652722 643013 633178 623251 613094 604286 598429 594358
55784 594358 589039 580517 568461 553121 535764 518996 504649 492125 480269 469482 460354 451787
55772 451787 442584 433507 425726 418509 410491 401897 393441 384380 373884 363158 353969 346165 338705 331884
55758 331884 326305 320917 314498 307992 302928 298494 292664 285364 278011 270695 262430 253734 246408 240967
55744 240967 236502 232814 230583 229632 229032 228666 228900 229072 228158 226598 225718 225665 225545 225067 224427 223228 221288
$$ packed form
55834A186092j6166j4411j4655j4144j2586j2924j5724j7855j7977j8372k0127
55823A011151k1260k0955k1125k2419k2979k2404k2649k3805k3229k0162j7221
55812G72943j5972j4927j3086j1667j1075r832p693o351o017m762k223l99M4P50
55798F69733K020J854l55k647m011n720q152r709r835r927j0157q808n857m071
55784E94358n319q522j2056j5340j7357j6768j4347j2524j1856j0787r128q567
55772D51787r203r077p781p217q018q594q456r061j0496j0726r189p804p460o821
55758C31884n579n388o419o506n064m434n830p300p353p316q265q696p326n441
55744B40967m465l688k231r51o00l66K34J72r14j560q80n3j20m78o40j199j940
$$ plain form
55727 221288 219776 219645 219646 217879 214674 211849 209738 207232 204328 202256 201116 199644 197484 195718 194927
55712 194927 194470 193933 193756 194218 195090 196275 197672 198717 199256 200321 202682 205253 206494 206700 207214 208059
55696 208059 208322 208361 209469 211625 213663 215551 218449 222506 226651 230647 235365 240755 245444 248743 251297
55681 251297 253378 254156 253161 250928 247774 243340 237798 232153 226882 221470 215678 210086 204992 199909 194576
55666 194576 189532 185251 181451 177492 172874 167344 161245 155679 151639 149162 147834 147646 148560 149906 151187
55651 151187 152901 155524 158422 160911 163532 166773 169341 169482 167530 165311 163363 160599 156598 152341
55637 152341 148617 145414 143047 142178 142453 142589 142068 141433 140838 139758 138244 136966 135840 134007 131369 128776
55621 128776 126517 124058 121424 119401 118080 116654 114977 113903 113690 113421 112547 111753 111767 112322 112795 112935
$$ packed form
55727B21288j512j31Jj767l205k825k111k506k904k072j140j472k160j766p91
55712A94927m57n37j77M62Q72J185J397J045N39J065K361K571J241K06N14Q45
55696B08059K63L9J108K156K038J888K898M057M145L996M718N390M689L299K554
55681B51297K081P78r95k233l154m434n542n645n271n412n792n592n094n083n333
55666A94576n044m281l800l959m618n530o099n566m040k477j328j88R14J346J281
55651A51187J714K623K898K489K621L241K568J41j952k219j948k764m001m257
55637A52341l724l203k367q69K75J36n21o35n95j080j514j278j126j833k638k593
55621A28776k259k459k634k023j321j426j677j074k13k69q74p94J4N55M73J40
$$ plain form
55605 112935 112629 111816 110926 110598 110828 111151 111543 112227 112781 112562 111818 111190 110320 108373 105818 104144 103753 103658
55587 103658 103378 103492 104008 103826 102432 100706 99528 98810 98407 98650 99355 99546 98861 98245 98703 100314 102852
55570 102852 106270 110062 113225 115418 117259 119036 120068 119763 118403 116473 114131 111608 109108 106091
55556 106091 101737 96468 91837 88434 85120 80825 75963 71417 67279 63373 60040 57608 55780 54305
55542 54305 53535 53680 54119 54047 53297 52065 50496 48995 48348 49004 50602 52420 53848 54359 53752 52634 52021
55525 52021 52261 52875 53446 53964 54366 54586 54994 55924 56844 56971 56603 56741 57520 58312 59302 61442 64577 67205
55507 67205 68543 69394 70417 71002 70611 69858 69350 68654 67286 65685 64339 62953 61285 59816 58722 57177
55491 57177 54657 51994 50110 48567 46497 44248 42849 42342 41842 41031 40480 40507 40573 39998 38754 37436 36737
$$ packed form
55605A12935l06q13q90l28K30L23L92O84N54k19p44o28q70j947k555j674l91r5
55587A03658k80J14N16j82j394j726j178p18m03K43P05J91o85o16M58J611K538
55570A02852L418L792L163K193J841J777J032l05j360j930k342k523k500l017
55556A06091m354n269m631l403l314m295m862m546m138l906l333k432j828j475
55542E4305p70J45M39p2p50j232j569j501o47O56J598J818J428N11o07j118o13
55525E2021K40O14N71N18M02K20M08R30R20J27l68J38P79P92R90K140L135K628
55507F7205J338Q51J023N85l91p53n08o96j368j601j346j386j668j469j094j545
55491E7177k520k663j884j543k070k249j399n07n00q11n51K7O6n75j244j318o99
$$ plain form
55474 36737 36894 37490 37883 37829 37395 36509 35171 34018 33848 34510 35016 34892 34502 33950 32787 31194 30380 31126
55456 31126 32756 34164 35160 36189 37399 38558 39389 39549 38868 37919 37627 37918 37576 35895 33685 32141
55440 32141 31488 31327 31565 32290 33298 34298 35155 35584 35245 34474 34214 34860 35937 37146 38782 40633 41639
55423 41639 41398 41038 41649 42686 42913 42272 41764 41989 42803 44100 45981 48208 50307 52156 53964 55783
55407 55783 57436 58806 59842 60478 60740 60727 60370 59553 58438 57161 55301 52417 49154 46914 46211 46200 46042
55390 46042 45728 45269 44220 42567 41071 40095 38999 37312 35585 34417 33521 32480 31537 30859 29910 28415
55374 28415 27168 26956 27314 27233 26473 25462 24546 24109 24737 26311 27550 27313 25873 24174 22547 21026 20233
55357 20233 20786 22227 23515 24317 25014 25780 26470 27115 27773 28165 28056 27623 26971 25818 24266 23195 23160 23488
$$ packed form
55474C6737J57N96L93n4m34q86j338j153j70O62N06j24l90n52j163j593q14P46
55456C1126J630J408R96J029J210J159Q31J60o81r49k92K91l42j681k210j544
55440C2141o53j61K38P25J008J000Q57M29l39p71k60O46J077J209J636J851J006
55423D1639k41l60O11J037K27o41n08K25Q14J297J881K227K099J849J808J819
55407E5783J653J370J036O36K62j3l57q17j115j277j860k884l263k240p03j1j58
55390D6042l14m59j049j653j496r76j096j687j727j168q96j041r43o78r49j495
55374B8415j247k12L58q1p60j011r16m37O28J574J239k37j440j699j627j521p93
55357B0233N53J441J288Q02O97P66O90O45O58L92j09m33o52j153j552j071l5L28
$$ plain form
55339 23488 23237 22456 21766 21349 21156 21455 22235 22711 22389 21996 22350 22985 23024 22839 23492 24860 25686 25385 24605
55320 24605 23994 23477 22867 22269 21814 21662 22160 23243 23964 23471 22282 21692 22061 22577 22621 22422 22345 22340 22235 21952
55300 21952 21400 20695 20322 20545 20896 20819 20494 20357 20229 19714 19105 19010 19363 19737 20293 21392 22502 22644 21971
55281 21971 21775 22756 24178 24987 24917 24334 23699 23499 24093 25379 26941 28467 29665 30071 29553 28806 28611 28800
55263 28800 28649 28078 27633 27437 27053 26415 26071 26388 27172 28140 29172 30092 30722 31060 31013 30284 29134 28709 29701
55244 29701 31093 31307 30276 29159 28247 26624 24050 21678 20416 19786 19082 18643 19218 20823 22901 25051
55228 25051 26932 28013 28033 27444 26879 26490 26074 25604 25291 25380 26039 27138 28019 27939 26998 26299 26870 28578 30212
55209 30212 30511 29128 26842 24897 23994 23980 24508 25569 27036 28218 28476 28031 27529 27134 26699 26490 26876
$$ packed form
55339B3488k51p81o90m17j93K99P80M76l22l93L54O35L9j85O53J368Q26l01p80
55320B4605o11n17o10n98m55j52M98J083P21m93j189n90L69N16M4j99p7nj05k83
55300B1952n52p05l73K23L51p7l25j37j28n15o09r5L53L74N56J099J110J42o73
55281B1971j96R81J422Q09p0n83o35k00N94J286J562J526J198M06n18p47j95J89
55263B8800j51n71m45j96l84o38l44L17P84R68J032R20O30L38m7p29j150m25R92
55244B9701J392K14j031j117r12j623k574k372j262o30p04m39N75J605K078K150
55228B5051J881J081K0n89n65l89m16m70l13Q9O59J099Q81q0r41o99N71J708J634
55209C0212K99j383k286j945r03j4N28J061J467J182K58m45n02l95m35k09L86
$$ plain form
55192 26876 27460 27443 26813 26294 26109 25697 24785 23842 23198 22600 21985 21883 22543 23280 23223 22305 21123 20224 19853
55173 19853 20022 20446 20661 20527 20401 20620 21057 21423 21765 22456 23753 25431 26861 27568 27764 28050 28463 28263
55155 28263 27013 25393 24421 24259 24427 24797 25553 26422 26804 26686 26626 26912 27439 28357 29958 31858 33102 33296
55137 33296 32974 32749 32767 33070 33711 34306 34204 33384 32529 31993 31326 30141 28864 28252 28578 29553 30725 31772
55119 31772 32775 34202 36327 38731 40847 42864 45431 48533 51381 53415 54780 55706 56156 56194 55969 55222
55103 55222 53473 50873 48202 45896 43736 41633 40003 39147 38995 39607 41149 43072 44143 43742 42533
55088 42533 41451 40644 39814 39044 38774 39269 40403 41682 42394 42218 41724 41727 42063 41692 40093 37899 35991 34722
55070 34722 34209 34492 35042 34948 34083 33424 33745 34628 35195 35159 34697 33972 33345 33456 34440 35495 35799 35506 35367
$$ packed form
55192B6876N84j7o30n19j85m12r12r43o44n98o15j02O60P37n7r18j182q99l71
55173A9853J69M24K15j34j26K19M37L66L42O91J297J678J430P07J96K86M13k00
55155B8263j250j620r72j62J68L70P56Q69L82j18o0K86N27R18J601J900J244J94
55137C3296l22k25J8L03O41N95j02q20q55n36o67j185j277o12L26R75J172J047
55119C1772J003J427K125K404K116K017K567L102K848K034J365R26M50L8k25p47
55103E5222j749k600k671k306k160k103j630q56j52O12J542J923J071m01j209
55088D2533j082q07q30p70k70M95J134J279P12j76m94LL36l71j599k194j908j269
55070C4722n13K83N50r4q65o59L21Q83N67l6m62p25o27J11R84J055L04k93j39
$$ plain form
55051 35367 35738 36476 37465 38709 40107 41467 42589 43165 42937 42133 41347 40772 40021 38879 37772 37273 37612
55034 37612 38816 40776 43004 44913 46530 48297 50036 50946 50894 50809 51303 51805 51681 51459 52147 53886 55942
55017 55942 57584 58423 58420 58133 58453 59491 60273 60092 59525 59403 59419 58664 57074 55359 53781 51945 49720 47561
54999 47561 45935 45050 45072 45963 47137 47788 47595 46763 45605 44438 43644 43280 42879 42075 41174 40636 40395 40282
54981 40282 40700 42084 43919 45171 45644 46157 47270 48601 49586 50254 50977 51885 52852 53762 54601 55524 56910
54964 56910 59110 62078 65441 68994 72931 77552 82846 88366 93531 98216 103150 109545 118167 128939
54950 128939 141465 155542 170898 186811 202273 216337 228031 236299 240382 240139 235803 227745 216747
54937 216747 204046 190678 177001 163222 150079 138530 128962 121086 114398 108399 102651 97103 92247
$$ packed form
55051C5367L71P38R89J244J398J360J122N76k28q04p86n75p51j142j107m99L39
55034C7612J204J960K228J909J617J767J739R10n2q5M94N02j24k22O88J739K056
55017E5942J642Q39lk87L20J038P82j81n67j22J6p55j590j715j578j836k225k159
54999D7561j626q85K2Q91J174O51j93q32j158j167p94l64m01q04r01n38k41j13
54981D0282M18J384J835J252M73N13J113J331R85O68P23R08R67R10Q39R23J386
54964E6910K200K968L363L553L937M621N294N520N165M685M934O395Q622J0772
54950A28939J2526J4077J5356J5913J5462J4064J1694Q268M083k43m336q058j0998
54937B16747j2701j3368j3677j3779j3143j1549r568p876o688n999n748n548m856
$$ plain form
54924 92247 88506 85633 83048 80661 78984 78552 79479 81393 83560 85333 86860 89109 92856 97881 103563
54909 103563 109959 117798 127561 139009 151466 164095 175986 186424 195052 201493 205009 204906 201136
54896 201136 194131 184284 172131 158911 146295 135316 125796 116881 107961 99130 91051 84401 79288
54883 79288 75253 71898 69285 67553 66458 65580 64791 64136 63450 62423 61018 59600 58741 58940 60201 61720
54867 61720 62339 61648 60343 59215 58162 56599 54517 52576 51286 50515 49760 48601 46988 45319 44077
54852 44077 43254 42379 41242 40157 39313 38452 37537 37141 37598 38327 38617 38617 38784 38783 37886 36282 35113 35133 36101
54833 36101 37479 38931 40028 40253 39683 39154 39393 40338 41531 42807 44266 45820 47107 47836 48064 48050 47937
54816 47937 47646 47239 47179 47899 49152 50258 51071 52157 53889 56006 58378 61499 65708 70557 75576 81151
$$ packed form
54924I2247l741k873k585k387j677m32R27J914K167J773J527K249L747N025N682
54909A03563O396P839R763J1448J2457J2629J1891J0438Q628O441L516j03l770
54896B01136p005r847j2153j3220j2616j0979r520q915q920q831q079o650n113
54883G9288m035l355k613j732j095q78p89o55o86j027j405j418q59J99J261J519
54867F1720O19o91j305j128j053j563k082j941j290p71p55j159j613j669j242
54852D4077q23q75j137j085q44q61r15l96M57P29K90%J67jq97j604j169K0R68
54833C6101J378J452J097K25n70n29K39R45J193J276J459J554J287P29K28j4j13
54816D7937k91m07o0P20J253J106Q13J086J732K117K372L121M209M849N019N575
$$ plain form
54800 81151 87914 95765 104248 113490 123961 135590 147986 161229 175526 190175 203675 214740
54788 214740 222476 225890 224340 218568 210332 200887 190592 179963 170005 161191 153097 145435 138667 133165
54774 133165 128508 124155 120234 117220 115328 114619 115173 116762 118783 120928 123566 127153 131737 137322 144248
54759 144248 152748 162496 173007 184165 196009 208325 220853 233600 246536 259148 270590 280140
54747 280140 287220 291194 291504 287949 280717 270242 257152 242159 225914 209158 192995 178549 166198
54734 166198 155540 146285 138693 132776 127596 122074 116311 111491 108454 106852 105824 105020 104613 104560 104242
54719 104242 102917 100363 97040 93681 90800 88512 86733 85428 84670 84470 84621 84758 84597 84003 82837 80932
54703 80932 78456 76097 74591 74118 74445 75528 77428 79598 80909 80685 79331 77670 76107 74749 73814
$$ packed form
54800H1151O763P851Q483R242J0471J1629J2396J3243J4297J4649J3500J1065
54788B14740P736L414j550n772q236r445j0295j0629r958q814q094p662o768n502
54774A33165m657m353l921l014j892p09N54J589K021K145K638L587M584N585O926
54759A44248Q500R748J0511J1158J1844J2316J2528J2747J2936J2612J1442R550
54747B80140P080L974L10l555p232j0475j3090j4993j6245j6756j6163j4446j2351
54734A66198j0658r255p592n917n180n522n763m820l037j602j028q04m07n3l18
54719A04242j325k554l323l359k881k288j779j305p58k00J51J37j61n94j166j905
54703H0932k476k359j506m73L27J083J900K170J311k24j354j661j563j358r35
$$ plain form
54688 73814 73437 73397 73514 73999 74984 76022 76578 76705 76734 76641 76370 76486 77723 79912 82013 83251 83752 84076
54670 84076 84646 85612 86830 88010 89225 90953 93182 94908 95316 95139 95947 98240 101237 104518 108706 114226
54654 114226 120494 126861 133523 140937 149082 157956 168124 180040 193199 206642 219995 233354 246314
54641 246314 257691 266189 270950 271569 268113 261294 252296 242218 231645 220724 209565 198530 188161
54628 188161 178818 170548 163386 157596 153356 150362 148023 145997 144288 142955 141989 141312 140561 139093 136683
54613 136683 134036 132087 130911 129845 128550 127264 126105 124903 123807 123259 123137 122638 121347 119793 118586
54598 118586 117644 116662 115770 115164 114557 113554 112313 111298 110642 110174 109909 110009 110361 110565 110406 110082 109957 110147
54580 110147 110343 110001 108851 107212 105690 104607 103874 103216 102186 100132 96743 92720 89443 87773 87493
$$ packed form
54688G3814l77m0J17M85R85J038N56J27K9r3k71J16J237K189K101J238N01L24
54670H4076N70R66J218J180J215J728K229J726M08j77Q08K293K997L281M188N520
54654A14226O268O367O662P414Q145Q874J0168J1916J3159J3443J3353J3359J2960
54641B46314J1377Q498M761O19l456o819q998j0078j0573j0921j1159j1035j0369
54628A88161r343q270p162n790m240k994k339k026j709j333r66o77p51j468k410
54613A36683k647j949j176j066j295j286j159j202j096n48j22m99j291j554j207
54598A18586r42r82q92o06o07j003j241j015o56m68k65J00L52K04j59l24j25J90
54580A10147J96l42j150j639j522j083p33o58j030k054l389m023l277j670k80
$$ plain form
54565 87493 87960 88820 89909 90909 91442 91343 90786 90281 90500 91721 93475 95044 96233 97194 97802 97904 98096
54548 98096 99362 101751 104198 105944 107377 109154 111357 114035 117829 123257 129751 136077 141563 146525
54534 146525 151722 157762 164692 171772 177859 182343 185470 187553 188283 187136 184142 179878 175042 170290
54520 170290 166124 162547 159073 155333 151432 147608 144055 141257 139885 139933 140490 140773 140911 141314 141801 141984
54504 141984 142036 142473 143459 144861 146559 148164 148827 148117 146845 146295 146748 147395 147577 147401 147123 146637 145777 144651
54486 144651 143469 142313 141178 140028 138832 137716 136981 136717 136516 135899 134914 134011 133437 133030 132522 131742 130575
54469 130575 128989 127059 124835 122365 119980 118244 117345 116757 115864 114661 113544 112602 111619 110680 110324 110936
54453 110936 112136 112859 112111 109876 107294 105669 105196 104940 104124 102984 102217 102068 102282 102524 102528 102231 102041 102550
$$ packed form
54565H7493M67Q60J089J000N33r9n57n05K19J221J754J569J189R61O08J02J92
54548I8096J266K389K447J746J433J777K203K678L794N428O494O326N486M962
54534A46525N197O040O930P080O087M484L127K083P30j147k994m264m836m752
54520A70290m166l577l474l740l901l824l553k798j372M8N57K83J38M03M87J83
54504A41984N2M37R86J402J698J605O63p10j272n50M53O47J82j76k78m86q60j126
54486A44651j182j156j135j150j196j116p35k64k01o17r85r03n74m07n08p80j167
54469A30575j586j930k224k470k385j736q99n88q93j203j117r42r83r39l56O12
54453A10936J200P23p48k235k582j625m73k56q16j140p67j49K14K42Mk97j90N09
$$ plain form
54435 102550 103633 104355 104148 103529 103212 103097 102821 102713 103394 104748 106118 107297 108540 109734 110383 110378 110095
54418 110095 109760 109381 109284 109963 111329 112739 113946 115359 117259 119327 121182 122871 124594 126349 128043
54403 128043 129608 130787 131187 130721 129810 129065 128918 129452 130282 130668 130199 129366 129062 129499 130058 130182 129916 129448
54385 129448 128660 127475 126279 125637 125672 125916 125703 124667 122955 121005 119032 116836 114168 111149 108146 105450
54369 105450 103354 102279 102397 103249 104116 104674 104991 105077 104952 105057 106013 107900 110138 112082 113342 113637 112972
54352 112972 112056 111905 112791 113993 114840 115492 116355 117124 116842 114815 111251 107192 103994 102581 102815 103629 103959
54335 103959 103550 102821 102117 101280 99909 97868 95475 93212 91264 89437 87512 85520 83566 81546 79295
54320 79295 76891 74579 72416 70241 67975 65758 63770 62116 60912 60331 60528 61492 62790 63469 62590 60218
$$ packed form
54435A02550J083P22k07o19l17j15k76j08O81J354J370J179J243J194O49nk83
54418A10095l35l79r7O79J366J410J207J413J900K068J855J689J723J755J694
54403A28043J565J179M00m66r11p45j47N34Q30L86m69q33l04M37N59J24k66m68
54385A29448p88j185j196o42L5K44k13j036j712j950j973k196k668l019l003k696
54369A05450k096j075J18Q52Q67N58L17Q6j25J05R56J887K238J944J260K95o65
54352A12972r16j51Q86J202Q47O52Q63P69k82k027l564m059l198j413K34Q14L30
54335A03959m09p29p04q37j371k041k393k263j948j827j925j992j954k020k251
54320G9295k404k312k163k175k266k217j988j654j204n81J97R64J298O79q79k372
$$ plain form
54304 60218 57586 55850 54783 53215 50728 48357 47376 47799 48448 48314 47521 46951 47224 48247 49637 51169
54288 51169 52611 53387 52902 51276 49339 47790 46692 45903 45534 45678 46096 46556 47134 47818 48147 47724 46890
54271 46890 46431 46713 47445 48175 48648 48854 49040 49589 50621 51843 52980 53987 54622 54331 53064 51777 51474
54254 51474 52042 52594 52666 52382 51810 51027 50660 51355 52622 53083 52137 50627 49658 49445 49709 50468 51831 53385
54236 53385 54332 54188 53128 51781 50822 50565 50810 51174 51519 51896 52225 52356 52329 52229 51912 51266 50640 50520 50860
54217 50860 51161 51146 50824 50071 48727 47110 45734 44524 43025 41424 40587 40750 40929 40070 38284 36533 35562
54200 35562 35575 36533 38234 40155 41551 41806 40807 39235 38350 38962 40568 41862 42129 41630 40775 39673 38674
54183 38674 38502 39345 40373 40607 39833 38395 36635 35027 34244 34450 34849 34530 33601 32972 33175 33931 34794 35698
$$ packed form
54304F0218k632j736j067j568k487k371r81M23O49j34p93n70K73J023J390J532
54288E1169J442P76m85j626j937j549j098p89l69J44M18M60N78O84L29m23q34
54271D6890m59K82P32P30M73K06J86N49J032J222J137J007O35k91j267j287l03
54254E1474N68N52P2k84n72p83l67O95J267M61r46j510r69k13K64P59J363J554
54236E3385R47j44j060j347r59k57K45L64L45L77L29J31k7j00l17o46o26j20L40
54217E0860L01j5l22p53j344j617j376j210j499j601q37J63J79q59j786j751r71
54200C5562J3R58J701J921J396K55r99j572q85O12J606J294K67m99q55j102r99
54183C8674j72Q43J028K34p74j438j760j608p83K06L99l19r29o29K03P56Q63R04
$$ plain form
54165 35698 36804 38133 39499 40612 41230 41304 41008 40657 40656 41389 42876 44523 45485 45359 44312 42666 40786
54148 40786 39300 38785 39004 38979 38159 37102 36698 37105 37824 38435 38823 38906 38648 38242 37955 37851 37863 38064 38601
54129 38601 39432 40273 40774 40714 40191 39626 39395 39354 39014 38240 37540 37552 38477 40056 41761 42964 43235 42704 41939
54110 41939 41469 41584 42408 43660 44479 44134 43027 42329 42490 42777 42504 41975 41759 41734 41502 41242 41426 41976 42339
54091 42339 42255 41967 41778 41801 41999 42137 41823 40912 39723 38687 38050 38031 38787 39911 40495 40210 39883 40415 41544
54072 41544 42358 42705 43229 44148 44852 44916 44773 45023 45594 45983 46022 46053 46464 47315 48389 49445 50383 51191 51744
54053 51744 51807 51336 50694 50458 51023 52436 54441 56625 58630 60326 61752 62960 64115 65693 68150 71275
54037 71275 74254 76589 78667 81157 84217 87586 91182 95097 99093 102568 105223 107562 110595 114892
$$ packed form
54165C5698J106J329J366J113O18P4k96l51jP33J487J647R62j26j047j646j880
54148D0786j486n15K19k5q20j057m04M07P19O11L88Q3k58m06k87j04J2K01N37
54129C8601Q31Q41N01o0n23n65k31m1l40p74p00J2R25J579J705J203K71n31p65
54110D1939m70J15Q24J252Q19l45j107o98J61K87k73n29k16k5k32k60J84N50L63
54091D2339q4k88j89K3J98J38l14r11j189j036o37j9P56J124N84k85l27N32J129
54072D1544Q14L47N24R19P04O4j43K50N71L89L9L1M11Q51J074J056R38Q08N53
54053E1744O3m71o42k36N65J413K005K184K005J696J426J208J155J578K457L125
54037G1275K979K335K078K490L060L369L596L915L996L475K655K339L033M297
$$ plain form
54023 114892 119908 124360 127468 129738 132219 135125 137679 139233 139960 140277 140225 139737 138980 138058 136817 135319
54007 135319 134029 133089 131814 129465 126188 122726 119498 116501 113877 111939 110687 109758 108804 107612 105989
53992 105989 103968 102010 100630 99867 99368 98812 97985 96628 94598 92081 89377 86655 84108 82075 80660
53977 80660 79539 78485 77749 77482 77202 76432 75619 75716 76885 78193 78650 78078 76987 76066 75800 76151 76548 76499
53959 76499 76183 76060 76112 75968 75751 76165 77550 79318 80549 80910 80742 80495 80243 79749 78970 78490 79252 81698
53941 81698 85325 89184 92543 94928 96026 96054 95872 96192 96809 97158 97407 98378 100471 103331 106555 110098
53925 110098 113835 117337 120384 123285 126455 130007 133890 138087 142518 146985 151398 155864 160484 165295
53911 165295 170396 175863 181549 187263 193105 199214 205190 210247 214140 217526 221113 224716 227406 228439
$$ packed form
54023A14892N016M452L108K270K481K906K554J554P27L17n2m88p57r22j241j498
54007A35319j290r40j275k349l277l462l228k997k624j938j252r29r54j192j623
53992A05989k021j958j380p63m99n56q27j357k030k517k704k722k547k033j415
53977H0660j121j054p36k67k80p70q13R7J169J308M57n72j091r21k66L51L97m9
53959G6499l16j23N2j44k17M14J385J768J231L61j68k47k52m94p79m80P62K446
53941H1698L627L859L359K385J098K8j82L20O17L49K49R71K093K860L224L543
53925A10098L737L502L047K901L170L552L883M197M431M467M413M466M620M811
53911A65295N101N467N686N714N842O109N976N057L893L386L587L603K690J033
$$ plain form
53897 228439 227883 226495 225179 224480 224369 224401 224102 223226 221763 219742 217084 213655 209663 205817 202662 199698
53881 199698 195734 190441 185075 181105 178517 176087 173040 169643 166288 162840 159125 155376 151837 148433
53867 148433 145152 142341 140202 138318 136036 133169 129997 126717 123192 119295 115301 111877 109644 108672
53853 108672 108356 107860 106733 105097 103358 101847 100688 99835 99191 98698 98226 97381 95714 93346 91158 90061
53837 90061 90122 90685 91287 92152 93747 96051 98378 99881 100238 99821 99151 98283 97001 95497 94344 93719 93178
53820 93178 92492 92185 92807 94072 95195 95853 96304 96808 97420 98188 99090 99886 100377 100687 100999 101289 101629 102394
53802 102394 103696 105026 105991 107034 108831 111283 113878 116772 120611 125342 130020 133927 137155 140013
53788 140013 142527 144687 146560 147929 148347 147776 146759 145884 145462 145667 146467 147354 147712 147508 147155 146664 145546
$$ packed form
53897B28439n56j388j316o99j11L2k99q76j463k021k658l429l992l846l155k964
53881A99698l964n293n366l970k588k430l047l397l355l448l715l749l539l404
53867A48433l281k811k139j884k282k867l172l280l525l897l994l424k233r72
53853A08672l16m96j127j636j739j511j159q53o44m93m72q45j667k368k188j097
53837I0061O1N63O02Q65J595K304K327J503L57m17o70q68j282j504j153o25n41
53820I3178o86l07O22J265J123O58M51N04O12P68R02P96M91L10L12K90L40P65
53802A02394J302J330R65J043J797K452K595K894L839M731M678L907L228K858
53788A40013K514K160J873J369M18n71j017q75m22K05Q00Q87L58k04l53m91j118
$$ plain form
53771 145546 143595 141221 138902 136873 135455 135031 135421 135712 134995 132982 129965 126588 123642 121510 119768
53756 119768 117807 115796 114416 113721 113037 112053 111192 110700 110172 109280 108283 107421 106458 105162 103704 102245 100647
53739 100647 98896 97261 95770 94119 92326 90894 89987 89098 87856 86527 85377 84281 83378 83413 84737
53724 84737 86607 88086 89148 90257 91351 91930 91770 90912 89292 87140 85443 85253 86493 87992 88698 88469
53708 88469 87839 87411 87486 87946 88548 89401 90832 92594 93675 93301 91793 90067 88705 87962 88282 90076 93091
53691 93091 96544 99858 102925 105769 108299 110346 111697 112266 112462 113101 114597 116536 118347 120109 122231
53676 122231 124621 126717 128217 129328 130361 131465 132685 133946 135046 135907 136750 137769 138830 139728 140485
53661 140485 141186 141779 142348 143198 144306 145059 145015 144639 144740 145425 146194 146838 147589 148384 148664 148108 147115 146370 146175
$$ packed form
53771A45546j951k374k319k029j418m24L90K91p17k013l017l377k946k132j742
53756A19768j961k011j380o95o84r84q61m92n28q92r97q62r63j296j458j459j598
53739A00647j751j635j491j651j793j432r07q89j242j329j150j096r03L5J324
53724H4737J870J479J062J109J094N79j60q58j620k152j697j90J240J499P06k29
53708H8469o30m28P5M60O02Q53J431J762J081l74j508j726j362p43L20J794L015
53691I3091L453L314L067K844K530K047J351N69J96O39J496J939J811J762K122
53676A22231K390K096J500J111J033J104J220J261J100Q61Q43J019J061Q98P57
53661A40485P01N93N69Q50J108P53m4l76J01O85P69O44P51P95K80n56r93p45j95
$$ plain form
53642 146175 146284 146126 145210 143587 141966 141139 141206 141538 141460 140772 139642 138196 136355 134078 131768 130306 130338
53625 130338 131503 132648 132912 132335 131379 130344 129404 128706 128110 127293 126442 126417 127767 129974 132103 133818 135304
53608 135304 136641 137904 139593 142210 145449 148399 150525 152057 153517 155259 157334 159401 160932 161961
53594 161961 163333 165720 168598 170884 172406 174079 176582 179570 182313 184514 186287 187825 189413 191477
53580 191477 194338 197946 201820 205120 207020 207429 207245 207543 208508 209472 209836 209534 208761 207756 206870 206364 206037
53563 206037 205401 204265 202837 201362 199991 198935 198298 197797 197059 196171 195530 195167 194683 193834 192720 191429
53547 191429 190022 188852 188305 188080 187301 185585 183542 181999 181181 180946 181331 182391 183805 185079 186039 186830
53531 186830 187521 188048 188541 189393 190849 192597 194012 194913 195947 197953 200952 204147 207033 210087 214003
$$ packed form
53642A46175J09j58r16j623j621q27O7L32p8o88j130j446j841k277k310j462L2
53625A30338J165J145K64n77r56j035r40o98n96q17q51k5J350K207K129J715J486
53608A35304J337J263J689K617L239K950K126J532J460J742K075K067J531J029
53594A61961J372K387K878K286J522J673K503K988K743K201J773J538J588K064
53580A91477K861L608L874L300J900M09j84K98R65R64L64l02p73j005q86n06l27
53563B06037o36j136j428j475j371j056o37n01p38q88o41l63m84q49j114j291
53547A91429j407j170n47k25p79j716k043j543q18k35L85J060J414J274R60P91
53531A86830O91N27M93Q52J456J748J415R01J034K006K999L195K886L054L916
$$ plain form
53516 214003 218644 223301 227761 232547 238136 244507 251480 258992 266924 275128 283781 293293 303736 314712
53502 314712 325958 337702 350203 363263 376499 389909 403963 419224 435976 454119 473334
53491 473334 493419 514367 535951 557377 577721 596759 615147 633754 653118 673488 694893
53480 694893 716920 738774 759959 780799 802141 824525 847802 871438 895001 918286 941078
53469 941078 962952 983438 1002371 1019980 1036636 1052606 1067989 1082692 1096499 1109376 1121647
53458 1121647 1133582 1144943 1155436 1165546 1176152 1187078 1196768 1203864 1208438 1211115 1211761 1209925 1206050
53445 1206050 1201112 1195186 1187308 1176774 1163746 1148590 1131538 1113249 1094842 1076872 1058707 1039262
53433 1039262 1018101 995704 973039 950977 929733 908752 887407 865837 844773 824591 804962
$$ packed form
53516B14003M641M657M460M786N589O371O973P512P932Q204Q653R512J0443J0976
53502C14712J1246J1744J2501J3060J3236J3410J4054J5261J6752J8143J9215
53491D73334K0085K0948K1584K1426K0344J9038J8388J8607J9364K0370K1405
53480F94893K2027K1854K1185K0840K1342K2384K3277K3636K3563K3285K2792
53469I41078K1874K0486J8933J7609J6656J5970J5383J4703J3807J2877J2271
53458A121647J1935J1361J0493J0110J0606J0926R690P096M574K677O46j836l875
53445A206050m938n926p878j0534j3028j5156j7052j8289j8407j7970j8165j9445
53433A039262k1161k2397k2665k2062k1244k0981k1345k1570k1064k0182j9629
$$ plain form
53422 804962 785369 765620 745977 727166 710131 695254 681977 669653 658540 649336 642074 636331
53410 636331 632352 630915 632032 634773 638597 643895 650976 659483 669319 681215 695736 712356 730073
53397 730073 748426 767454 787262 808147 830669 855082 881116 908600 937766 968553 1000285
53386 1000285 1032582 1066052 1101540 1139222 1178970 1221012 1265554 1312166 1360198 1409459 1459889
53375 1459889 1510982 1562224 1613763 1665991 1718769 1771738 1825030 1878784 1932111 1983478 2032257
53364 2032257 2079186 2125043 2169383 2210820 2248247 2281663 2312038 2340428 2367061 2391313 2412729
53353 2412729 2431756 2449100 2464583 2477073 2485412 2488897 2486944 2478810 2463838 2441673 2412207 2375623
53341 2375623 2332571 2284099 2231365 2175500 2117589 2058512 1998824 1938902 1879089 1819567 1760366
$$ packed form
53422H04962j9593j9749j9643j8811j7035j4877j3277j2324j1113r204p262n743
53410F36331l979j437J117K741L824N298P081Q507R836J1896J4521J6620J7717
53397G30073J8353J9028J9808K0885K2522K4413K6034K7484K9166L0787L1732
53386A000285L2297L3470L5488L7682L9748M2042M4542M6612M8032M9261N0430
53375A459889N1093N1242N1539N2228N2778N2969N3292N3754N3327N1367M8779
53364B032257M6929M5857M4340M1437L7427L3416L0375K8390K6633K4252K1416
53353B412729J9027J7344J5483J2490Q339L485j953q134j4972k2165k9466l6584
53341B375623m3052m8472n2734n5865n7911n9077n9688n9922n9813n9522n9201
$$ plain form
53330 1760366 1701742 1644288 1588380 1533727 1479783 1426339 1373409 1320829 1268501 1216871 1166697
53319 1166697 1118401 1072063 1027932 986428 947677 911448 877583 846154 817247 791001 767749
53308 767749 747627 730058 714162 699775 687522 677697 669636 662595 656850 653365 652384 652821 653198 653055
53294 653055 653297 655174 659114 664585 670932 678000 685919 694690 704325 715206 727882 742461 758431
53281 758431 775180 792645 811469 832513 856032 881235 906850 932162 957302 982466 1007391
53270 1007391 1031887 1056336 1081113 1105845 1129856 1153085 1175827 1197693 1217726 1235718 1252660
53259 1252660 1269487 1285956 1301160 1314574 1326061 1335332 1342142 1346801 1349783 1350735 1348533 1342480 1332949
53246 1332949 1320570 1305233 1286339 1263777 1238138 1210105 1180126 1148698 1116373 1083217 1048731
$$ packed form
53330A760366n8624n7454n5908n4653n3944n3444n2930n2580n2328n1630n0174
53319A166697m8296m6338m4131m1504l8751l6229l3865l1429k8907k6246k3252
53308G67749k0122j7569j5896j4387j2253r825q061p041n745l485r81M37L77j43
53294F53055K42J877L940N471O347P068P919Q771R635J0881J2676J4579J5970
53281G58431J6749J7465J8824K1044K3519K5203K5615K5312K5140K5164K4925
53270A007391K4496K4449K4777K4732K4011K3229K2742K1866K0033J7992J6942
53259A252660J6827J6469J5204J3414J1487R271O810M659K982R52k202o053r531
53246A332949j2379j5337j8894k2562k5639k8033k9979l1428l2325l3156l4486
$$ plain form
53235 1048731 1012795 976455 941254 907902 876015 845103 815285 786869 759723 733342 707228
53224 707228 680935 654078 626635 599102 571956 544979 517423 488963 460353 433032 408114
53213 408114 385753 365460 346896 330164 315349 302148 290287 280035 271823 265348 259527 253419
53201 253419 246824 239981 233182 226844 221416 216866 212585 208079 203458 199015 194736 190562 186772 183679
53187 183679 181105 178539 175705 172711 169788 167091 164584 161989 159102 156344 154593 154203 154487 154472 153795
53172 153795 152565 150803 148594 146462 144963 143927 142583 140444 137704 134845 132245 130127 128575 127519
53158 127519 126846 126415 125873 124732 122901 120910 119362 118441 118133 118471 119138 119244 118061 115731 112933 110206
53142 110206 108063 107185 107704 108620 108758 108117 107510 107083 106170 104560 102938 101896 101347 101131 101295 101465 100820
$$ packed form
53235A048731l5936l6340l5201l3352l1887l0912k9818k8416k7146k6381k6114
53224G07228k6293k6857k7443k7533k7146k6977k7556k8460k8610k7321k4918
53213D08114k2361k0293j8564j6732j4815j3201j1861j0252q212o475n821o108
53201B53419o595o843o799o338n428m550m281m506m621m443m279m174l790l093
53187A83679k574k566k834k994k923k697k507k595k887k758j751l90K84j5o77
53172A53795j230j762k209k132j499j036j344k139k740k859k600k118j552j056
53158A27519o73m31n42j141j831j991j548r21l08L38O67J06j183k330k798k727
53142A10206k143q78N19R16J38o41o07m27r13j610j622j042n49k16J64J70o45
$$ plain form
53125 100820 99211 97679 97312 98047 99052 99820 100394 100955 101678 102708 103823 104383 104054 103367 103106 103324 103415
53108 103415 103017 102394 101906 101532 101089 100679 100667 101212 101992 102519 102709 102910 103232 103207 102417 101193 100170 99320 98103
53089 98103 96562 95492 95281 95299 94918 94535 94897 95791 96142 95347 93927 92834 92577 93155 94366 95887 97251
53072 97251 98051 98176 97812 97219 96569 96002 95764 96151 97208 98569 99773 100755 101853 103312 104978 106541 107848
53055 107848 108879 109568 109818 109599 108939 107861 106386 104589 102596 100591 98769 97201 95724 94052 91955
53040 91955 89369 86441 83609 81432 80124 79350 78645 77847 76915 75547 73391 70540 67456 64518 62074
53025 62074 60734 60980 62387 63755 64232 63866 62960 61513 59654 58098 57583 58013 58607 58777 58568 58312 58212
53008 58212 58254 58325 58338 58298 58249 58148 57923 57673 57615 57793 57978 57942 57663 57253 56876 56731 56880 57049 56832 56146 55314
$$ packed form
53125A00820j609j532l67P35J005P68N74N61P23J030J115N60l29o87k61K18R1
53108A03415l98o23m88l74m43m10j2N45P80N27J90K01L22k5p90j224j023q50j217
53089I8103j541j070k11J8l81l83L62Q94L51p95j420j093k57N78J211J521J364
53072I7251Q00J25l64n93o50n67k38L87J057J361J204R82J098J459J666J563J307
53055A07848J031O89K50k19o60j078j475j797j993k005j822j568j477j672k097
53040I1955k586k928k832k177j308p74p05p98r32j368k156k851l084k938k444
53025F2074j340K46J407J368M77l66r06j447j859j556n15M30N94J70k09k56j00
53008E8212M2P1J3m0m9j01k25k50n8J78J85l6k79m10l77j45J49J69k17o86q32
$$ plain form
52987 55314 54716 54553 54861 55397 55588 55012 53984 53273 53182 53373 53596 54022 54677 55166 55268 55295 55513 55684 55544
52968 55544 55251 54943 54292 53060 51697 50817 50384 50015 49829 50318 51458 52615 53389 54024 54847 55764 56459 56801
52950 56801 56924 57119 57605 58209 58399 57976 57606 58209 59765 61162 61309 60096 58174 56216 54554 53219 52098
52933 52098 51161 50637 50821 51652 52723 53771 54969 56624 58744 61002 62958 64281 64971 65494 66527 68381
52917 68381 70710 72860 74482 75745 77024 78436 79691 80435 80698 80907 81337 81724 81555 80687 79467 78300
52901 78300 77293 76320 75218 73841 72146 70368 68968 68269 68133 68089 67753 67067 66095 64726 62754 60384
52885 60384 58429 57626 57745 57727 56874 55578 54656 54362 54444 54884 55900 57253 58195 58350 58169 58220 58385 58144 57406
52866 57406 56609 56075 55707 55390 55301 55626 56213 56783 57400 58470 60278 62658 65159 67390 69201 70735 72374
$$ packed form
52987E5314n98j63L08N36J91n76j028p11r1J91K23M26O55M89J02K7K18J71j40
52968E5544k93l08o51j232j363q80m33l69j86M89J140J157P74O35Q23R17O95L42
52950E6801J23J95M86O04J90m23l70O03J556J397J47j213j922j958j662j335j121
52933E2098r37n24J84Q31J071J048J198J655K120K258J956J323O90N23J033J854
52917F8381K329K150J622J263J279J412J255P44K63K09M30L87j69q68j220j167
52901G8300j007r73j102j377j695j778j400o99j36m4l36o86r72j369j972k370
52885F0384j955q03J19j8q53j296r22k94Q2M40J016J353R42J55j81N1J65k41p38
52866E7406p97n34l68l17q9L25N87N70O17J070J808K380K501K231J811J534J639
$$ plain form
52849 72374 74447 76784 78664 79389 78856 77403 75251 72420 69138 65989 63506 61826 60793 60127 59364
52834 59364 58027 56088 54114 52679 51802 51157 50619 50334 50368 50566 50722 50622 50067 49178 48611 49089 50570 52145
52816 52145 52929 52850 52457 52132 51717 50840 49387 47629 46016 45015 45015 46097 47751 49059 49486 49443 49793 50830
52798 50830 52104 53245 54404 55677 56659 57141 57837 59713 62716 65745 67874 69016 69397 69113 68478 68115
52782 68115 68186 67965 66753 64913 63450 62717 62165 61351 60539 60094 59821 59286 58482 57736 57094 56224 54893 53260
52764 53260 51630 50210 49187 48773 48976 49498 50030 50529 51044 51443 51542 51432 51340 51238 50878 50272 49862 50029 50676
52745 50676 51425 51993 52192 51812 50850 49797 49389 49959 51148 52263 52806 52741 52469 52573 53433 54996 56950 59038
52727 59038 61066 62708 63597 63663 63206 62576 61940 61380 60907 60224 58797 56520 54151 52682 52271 52152 51646
$$ packed form
52849G2374K073K337J880P25n33j453k152k831l282l149k483j680j033o66p63
52834E9364j337j939j974j435q77o45n38k85L4J98J56j00n55q89n67M78J481J575
52816E2145P84p9l93l25m15q77j453j758j613j001%J082J654J308M27m3L50J037
52798E0830J274J141J159J273R82M82O96J876L003L029K129J142L81k84o35l63
52782F8115P1k21j212j840j463p33n52q14q12m45k73n35q04p46o42q70j331j633
52764E3260j630j420j023m14K03N22N32M99N15L99R9j10r2j02l60o06m10J67O47
52745E0676P49N68J99l80r62j053m08N70J189J115N43o5k72J04Q60J563J954K088
52727E9038K028J642Q89O6m57o30o36n60m73o83j427k277k369j469m11j19n06
$$ plain form
52710 51646 50851 50156 49518 48655 47748 47417 47942 48885 49587 49678 49050 47723 46069 44843 44574 44978 45292 45136
52692 45136 44824 44866 45415 46177 46684 46662 46307 46157 46494 46992 47214 47350 48047 49510 51104 52051 52195 52009 52079
52673 52079 52751 53962 55176 55706 55320 54476 53785 53441 53321 53417 53788 54222 54335 54134 54181 54969 56316 57600
52655 57600 58538 59480 60831 62459 63924 65148 66504 68146 69674 70625 71027 71217 71374 71576 72085 73173
52639 73173 74749 76546 78555 80834 82938 84078 83944 82925 81395 79236 76356 73314 71001 69735 68862
52624 68862 67334 64718 61675 59298 57886 56634 54822 52894 51840 51806 52068 52194 52415 52767 52822 52493 52255
52607 52255 52172 51541 50027 48444 47704 47621 47436 47013 46788 46970 47550 48745 50627 52513 53507 53518 53120 52595
52589 52595 51837 51047 50729 50943 51230 51366 51616 52190 53029 54159 55639 57047 57643 57292 56746 56795 57516 58475
$$ packed form
52710E1646p95o95o38q63r07l31N25R43P02R1o28j327j654j226k69M04L14j56
52692D5136l12M2N49P62N07k2l55j50L37M98K22J36O97J463J594R47J44j86P0
52673E2079O72J211J214N30l86q44o91l44j20R6L71M34J13k01M7P88J347J284
52655E7600R38R42J351J628J465J224J356J642J528R51M02J90J57K02N09J088
52639G3173J576J797K009K279K104J140j34j019j530k159k880l042k313j266q73
52624F8862j528k616l043k377j412j252j812j928j054l4K62J26K21L52N5l29k38
52607E2255q3o31j514j583p40q3j85m23k25J82N80J195J882J886R94J1l98n25
52589E2595p58p90l18K14K87J36K50N74Q39J130J480J408N96l51n46M9P21R59
$$ plain form
52571 58475 59293 59822 60139 60533 61246 62173 63042 63816 64530 64873 64449 63499 62824 62874 63377 63944 64503 64974 65072 64758
52551 64758 64451 64534 64987 65688 66665 67714 68255 67990 67492 67679 68817 70310 71377 71690 71431 70966 70498 69940
52533 69940 69146 68231 67556 67402 67774 68468 69115 69337 69114 68964 69351 69922 69785 68615 67053 65877 65204 64738
52515 64738 64417 64426 64810 65392 65968 66410 66717 67066 67638 68269 68520 68196 67559 66940 66406 65928 65558 65288 64992 64705
52495 64705 64658 64834 64798 64244 63477 63007 62863 62631 62070 61389 60927 60783 60828 60950 61221 61828 62805 63966 65169
52476 65169 66505 67966 69064 69214 68474 67518 66842 66428 66238 66462 67009 67323 67081 66705 66752 67149 67445 67519 67526
52457 67526 67392 66917 66345 66287 67015 68149 69108 69588 69562 69143 68569 68108 67839 67604 67235 66824 66782 67573 69265
52438 69265 71306 72965 73992 74648 75070 75029 74497 74033 74239 75071 76068 77008 77896 78516 78533 78058 77630 77554 77594
$$ packed form
52571E8475Q18N29L17L94P13R27Q69P74P14L43m24r50o75N0N03N67N59M71R8l14
52551F4758l07Q3M53P01R77J049N41k65m98J87J138J493J067L13k59m65m68n58
52533F9940p94r15o75j54L72O94O47K22k23j50L87N71j37j170j562j176o73m66
52515F4738l21RL84N82N76M42L07L49N72O31K51l24o37o19n34m78l70k70k96k87
52495F4705m7J76l6n54p67m70j44k32n61o81m62j44M5J22K71O07R77J161J203
52476F5169J336J461J098J50p40r56o76m14j90K24N47L14k42l76M7L97K96P4P
52457F7526j34m75n72n8P28J134R59M80k6m19n74m61k69k35l69m11m2P91J692
52438F9265K041J659J027O56M22m1n32m64K06Q32R97R40Q88O20J7m75m28p6M0
$$ plain form
52419 77594 77427 77062 76681 76384 76307 76754 77931 79609 81176 82049 82005 81234 80149 79097 78185 77363 76631 76112
52401 76112 75931 76042 76200 76130 75785 75404 75250 75336 75564 76009 76795 77659 78004 77551 76652 75806 75137 74589 74303 74427
52381 74427 74736 74891 75005 75542 76609 77732 78471 78943 79628 80796 82279 83644 84519 84895 85162 85723 86549
52364 86549 87229 87490 87468 87371 87096 86436 85575 85132 85562 86605 87454 87490 86812 86054 85785 86183 87112 88288 89320
52345 89320 89811 89696 89443 89759 90956 92576 93720 93855 93347 93099 93614 94496 94997 94884 94571 94555 95028 96011
52327 96011 97526 99432 101351 102901 103934 104552 105027 105657 106450 106990 106907 106526 106733 108139 110662 113882 117350
52310 117350 120486 122791 124457 126293 128650 130861 132202 132978 134147 136185 138960 142407 146579 151096
52296 151096 155288 158968 162467 165825 168665 171140 174285 178858 184240 189026 192435 194648 196029 196735
$$ packed form
52419G7594j67l65l81k97p7M47J177J678J567Q73m4p71j085j052r12q22p32n19
52401G6112j81J11J58p0l45l81j54Q6K28M45P86Q64L45m53q99q46o69n48k86J24
52381G4427L09J55J14N37J067J123P39M72O85J168J483J365Q75L76K67N61Q26
52364H6549O80K61k2r7k75o60q61m43M30J043Q49L6o78p58k69L98R29J176J032
52345H9320M91j15k53L16J197J620J144J35n08k48N15Q82N01j13l13j6M73R83
52327I6011J515J906J919J550J033O18M75O30P93N40q3l81K07J406K523L220L468
52310A17350L136K305J666J836K357K211J341P76J169K038K775L447M172M517
52296A51096M192L680L499L358K840K475L145M573N382M786L409K213J381P06
$$ plain form
52282 196735 197176 198177 200235 202895 205253 206993 208617 210639 212891 214737 215753 215982 215687 215150 214724
52267 214724 214825 215676 217073 218425 219118 218991 218584 218789 220063 222074 224245 226429 228708 230821 232387 233715
52251 233715 235686 238547 241405 243382 244800 246713 249572 253007 256700 260724 264988 268964 272298 275281
52237 275281 278430 281851 285264 288476 291579 294768 298131 301644 305293 309143 313232 317311 320814 323265
52223 323265 324752 325919 327547 330170 333924 338445 342992 346946 350323 353641 357231 360882 364252 367430
52209 367430 370843 374662 378564 382232 385917 390216 395254 400393 405017 409410 414436 420339 426271 431186
52195 431186 434922 438183 441712 445760 450229 455023 460200 465849 471762 477311 481896 485587 489032 492611
52181 492611 496053 499109 502208 505948 510092 513548 515369 515538 514828 514175 514135 514613 515022 514852 514142 513313 512675
$$ packed form
52282A96735M41J001K058K660K358J740J624K022K252J846J016K29k95n37m26
52267B14724J01Q51J397J352O93j27m07K05J274K011K171K184K279K113J566J328
52251B33715J971K861K858J977J418J913K859L435L693M024M264L976L334K983
52237B75281L149L421L413L212L103L189L363L513L649L850M089M079L503K451
52223C23265J487J167J628K623L754M521M547L954L377L318L590L651L370L178
52209C67430L413L819L902L668L685M299N038N139M624M393N026N903N932M915
52195D31186L736L261L529M048M469M794N177N649N913N549M585L691L445L579
52181D92611L442L056L099L740M144L456J821J69p10o53m0M78M09j70p10q29o38
$$ plain form
52164 512675 512245 511960 511860 512018 512353 512471 511746 509763 506732 503209 499434 495370 491496 488904 488116 488255
52148 488255 487973 486860 485361 483629 481228 477990 474421 471120 468308 466028 464294 462857 461258 459286
52134 459286 457042 454504 451499 448282 445645 444077 443083 441591 438914 435179 431053 427232 424022 421274
52120 421274 418698 416196 413781 411309 408620 405863 403324 400985 398609 396223 394129 392418 390960 389852
52106 389852 389371 389334 389028 388082 386940 386169 385731 385262 384739 384442 384558 385227 386752 389369 392885 396880 401152
52089 401152 405656 410167 414387 418309 422146 425903 429329 432367 435357 438667 442233 445577 448243 450278
52075 450278 452354 455248 459031 462865 465846 467949 469880 472070 474255 476177 478170 480658 483399 485739
52061 485739 487587 489518 491823 493994 495478 496516 497796 499609 501868 504690 508246 512122 515515 518214
$$ packed form
52164E12675m30k85j00J58L35J18p25j983l031l523l775m064l874k592p88J39
52148D88255k82j113j499j732k401l238l569l301k812k280j734j437j599j972
52134D59286k244k538l005l217k637j568r94j492k677l735m126l821l210k748
52120D21274k576k502k415k472k689k757k539k339k376k386k094j711j458j108
52106C89852m81l7l06r46j142p71m38m69n23k97J16O69J525K617L516L995M272
52089D01152M504M511M220L922L837L757L426L038K990L310L566L344K666K035
52075D50278K076K894L783L834K981K103J931K190K185J922J993K488K741K340
52061D85739J848J931K305K171J484J038J280J813K259K822L556L876L393K699
$$ plain form
52047 518214 520698 523148 525072 526239 527198 528323 528957 528301 526692 525235 524345 523410 521799 519526 516943
52032 516943 514396 512190 510347 508329 505471 501693 497414 492897 488240 483886 480360 477379 473889 469227
52018 469227 463774 458310 453293 448942 445461 442762 440310 437586 434538 431537 429067 427382 426137 424495
52004 424495 422080 419641 418107 417129 415386 412406 409109 406275 403457 399950 396016 392454 389492 386748
$$ packed form
52047E18214K484K450J924J167R59J125O34o56j609j457q90r35j611k273k583
52032E16943k547k206j843k018k858l778m279m517m657m354l526k981l490m662
52018D69227n453n464n017m351l481k699k452k724l048l001k470j685j245j642
52004D24495k415k439j534r78j743k980l297k834k818l507l934l562k962k744
$$ [...]
##END NTUPLES=NMR SPECTRUM
##END=
