##TITLE=NES1057_10436_9270512_i6ZycdL28d
##JCAMPDX= 6.0         $$ Bruker NMR JCAMP-DX V2.0
##DATA TYPE= NMR SPECTRUM
##DATA CLASS= NTUPLES
##ORIGIN= BRUKER
##OWNER= Administrator
$$ 1.72 TOPSPIN		Version 2.1
$$ 2015-07-11 19:51:29.456 -0700  Administrator@X
$$ Compression mode = diff/dup
##.OBSERVE FREQUENCY= 400.02188249412
##.OBSERVE NUCLEUS= ^1H
##.ACQUISITION MODE= SIMULTANEOUS (DQD)
##.ACQUISITION SCHEME= undefined
##.AVERAGES= 8
##.DIGITISER RES= 22
##SPECTROMETER/DATA SYSTEM= spect
##.PULSE SEQUENCE= zg30
##.SOLVENT NAME= COFFEE_meoh
##.SHIFT REFERENCE= INTERNAL, COFFEE_meoh, 1, 14.98509
##AUDIT TRAIL= $$ (NUMBER, WHEN, WHO, WHERE, PROCESS, VERSION, WHAT)
$$ ##TITLE= Audit trail, TOPSPIN		Version 2.1
$$ ##JCAMPDX= 5.01
$$ ##ORIGIN= Bruker BioSpin GmbH
$$ ##OWNER= Administrator
$$ $$ E:\/data/COFFEE/nmr/NES1057_10436_9270512_i6ZycdL28d/10/pdata/1/auditp.txt
$$ ##AUDIT TRAIL=  $$ (NUMBER, WHEN, WHO, WHERE, PROCESS, VERSION, WHAT)
(   1,<2015-07-11 19:51:21.988 -0700>,<Administrator>,<X>,<go>,<TOPSPIN 2.1>,
      <created by zg
	started at 2015-07-11 19:50:15.738 -0700,
	POWCHK enabled, PULCHK disabled,
       configuration hash MD5:
       21 0F 79 D6 B3 7B B4 F6 88 20 88 DB 03 48 BD 9F
       data hash MD5: 64K
       EC BA 7D 14 34 B9 F6 18 0A FF D1 79 0D C4 77 8E>)
(   2,<2015-07-11 19:51:25.316 -0700>,<Administrator>,<X>,<proc1d>,<TOPSPIN 2.1>,
      <Start of raw data processing
       efp LB = 0 FT_mod = 6 PKNL = 1 PHC0 = 0 PHC1 = 0 SI = 32K 
       data hash MD5: 32K
       7D 8B 10 DE D9 95 2C 15 70 5E 3B BC C7 B3 23 77>)
(   3,<2015-07-11 19:51:25.597 -0700>,<Administrator>,<X>,<proc1d>,<TOPSPIN 2.1>,
      <pk PHC0 = 93.80127 PHC1 = 0 
       data hash MD5: 32K
       39 BD D7 9A 0B CA 82 30 9E D4 89 27 9C 5B 61 42>)
(   4,<2015-07-11 19:51:25.722 -0700>,<Administrator>,<X>,<proc1d>,<TOPSPIN 2.1>,
      <abs ABSG = 1 
       data hash MD5: 32K
       0C 0C 87 A9 30 1C 5D E9 B9 F3 E0 60 5E C3 FE E1>)
(   5,<2015-07-11 19:51:25.769 -0700>,<Administrator>,<X>,<proc1d>,<TOPSPIN 2.1>,
      <abs ABSG = 2 
       data hash MD5: 32K
       5A 11 0F D3 FB EA B7 A2 97 68 E3 E3 15 F2 84 61>)
(   6,<2015-07-11 19:51:25.831 -0700>,<Administrator>,<X>,<proc1d>,<TOPSPIN 2.1>,
      <abs ABSG = 3 
       data hash MD5: 32K
       96 90 2D E4 25 0C E6 9B 38 66 AA F8 1C 5F C8 16>)
(   7,<2015-07-11 19:51:25.894 -0700>,<Administrator>,<X>,<proc1d>,<TOPSPIN 2.1>,
      <abs ABSG = 4 
       data hash MD5: 32K
       FC 4A 0D 67 41 71 88 7C B9 21 0D 77 45 2E A0 A2>)
(   8,<2015-07-11 19:51:25.972 -0700>,<Administrator>,<X>,<proc1d>,<TOPSPIN 2.1>,
      <abs ABSG = 5 
       data hash MD5: 32K
       0D 19 A7 96 19 61 BD BA 05 18 F7 63 6B 1F 69 E0>)
$$ ##END=
$$ 
$$ $$ hash MD5
$$ $$ 2F F4 2A 3A AA 3F 77 FE FF 67 3F AE 87 A7 A9 8C
##$RELAX= 
##$RELAX= 
##$RELAX= 
##$RELAX= 
##$RELAX= 
##$RELAX= 
##$RELAX= 
$$ Bruker specific parameters
$$ --------------------------
##$DU= <E:\>
##$EXPNO= 10
##$NAME= <NES1057_10436_9270512_i6ZycdL28d>
##$PROCNO= 1
$$ [...]
150 150 150 150 150 150 150 150
##$TP07= 0
##$TPNAME0= <>
##$TPNAME1= <>
##$TPNAME2= <>
##$TPNAME3= <>
##$TPNAME4= <>
##$TPNAME5= <>
##$TPNAME6= <>
##$TPNAME7= <>
##$TPOAL= (0..7)
0.5 0.5 0.5 0.5 0.5 0.5 0.5 0.5
##$TPOFFS= (0..7)
0 0 0 0 0 0 0 0
##$TUNHIN= 0
##$TUNHOUT= 0
##$TUNXOUT= 0
##$USERA1= <user>
##$USERA2= <user>
##$USERA3= <user>
##$USERA4= <user>
##$USERA5= <user>
##$V9= 5
##$VALIST= <valist>
##$VCLIST= <CCCCCCCCCCCCCCC>
##$VD= 0
##$VDLIST= <DDDDDDDDDDDDDDD>
##$VPLIST= <PPPPPPPPPPPPPPP>
##$VTLIST= <TTTTTTTTTTTTTTT>
##$WBST= 2048
##$WBSW= 25
##$XGAIN= (0..3)
0 0 0 0
##$XL= 0
##$YL= 0
##$YMAX_a= 586579
##$YMIN_a= -490304
##$ZGOPTNS= <>
##$ZL1= 120
##$ZL2= 120
##$ZL3= 120
##$ZL4= 120
##$ABSF1= 14.98509
##$ABSF2= -5.573092
##$ABSG= 5
##$ABSL= 3
##$ALPHA= 0
##$AQORDER= 0
##$ASSFAC= 0
##$ASSFACI= 0
##$ASSFACX= 0
##$ASSWID= 0
##$AUNMP= <proc_prof1d_extract_pilot.lims>
##$AXLEFT= 0
##$AXNAME= <>
##$AXNUC= <1H>
##$AXRIGHT= 0
##$AXTYPE= 0
##$AXUNIT= <>
##$AZFE= 0.1
##$AZFW= 0.1
##$BCFW= 0
##$BC_mod= 0
##$BYTORDP= 0
##$COROFFS= 0
##$CY= 15
##$DATMOD= 1
##$DC= 0
##$DFILT= <>
##$DTYPP= 0
##$F1P= 0
##$F2P= 0
##$FCOR= 0.5
##$FTSIZE= 32768
##$FT_mod= 6
##$GAMMA= 0
##$GB= 0
##$INTBC= 1
##$INTSCL= 1
##$ISEN= 128
##$LB= 0
##$LEV0= 0
##$LPBIN= 0
##$MAXI= 10000
##$MC2= 0
##$MEAN= 0
##$ME_mod= 0
##$MI= 0
##$NCOEF= 0
##$NC_proc= -8
##$NLEV= 6
##$NOISF1= 0
##$NOISF2= 0
##$NSP= 0
##$NTH_PI= 0
##$NZP= 0
##$OFFSET= 14.98509
##$PC= 1
##$PHC0= 93.80127
##$PHC1= 0
##$PH_mod= 1
##$PKNL= yes
##$PPARMOD= 0
##$PPDIAG= 0
##$PPIPTYP= 0
##$PPMPNUM= 2147483647
##$PPRESOL= 1
##$PSCAL= 4
##$PSIGN= 0
##$PYNMP= <proc.py>
##$REVERSE= no
##$SF= 400.02
##$SI= 32768
##$SIGF1= 0
##$SIGF2= 0
##$SINO= 400
##$SIOLD= 32768
##$SPECTYP= <>
##$SREGLST= <1H.CDCl3>
##$SSB= 0
##$STSI= 32768
##$STSR= 0
##$SW_p= 8223.68421052631
##$SYMM= 0
##$S_DEV= 0
##$TDeff= 65536
##$TDoff= 0
##$TI= <>
##$TILT= no
##$TM1= 0
##$TM2= 0
##$TOPLEV= 0
##$USERP1= <user>
##$USERP2= <user>
##$USERP3= <user>
##$USERP4= <user>
##$USERP5= <user>
##$WDW= 1
##$XDIM= 32768
##$YMAX_p= 420565525
##$YMIN_p= -661133
##$CURPLOT= <Network HP LaserJet P1505>
##$CURPRIN= <$Network HP LaserJet P1505>
##$DFORMAT= <normdp>
##$LAYOUT= <+/1D_H.xwp>
##$LFORMAT= <normlp>
##$PFORMAT= <normpl>
##$SURQMSG= 1
$$ End of Bruker specific parameters
$$ ---------------------------------
##NTUPLES= NMR SPECTRUM
##VAR_NAME=  FREQUENCY,     SPECTRUM/REAL,   SPECTRUM/IMAG
##SYMBOL=    X,             R,               I
##VAR_TYPE=  INDEPENDENT,   DEPENDENT,       DEPENDENT
##VAR_FORM=  AFFN,          ASDF,            ASDF
##VAR_DIM=   32768,         32768,           32768
##UNITS=     HZ,            ARBITRARY UNITS, ARBITRARY UNITS
##FACTOR=    0.250966925370066, 1,           1
##FIRST=     8223.43324360094, 90734,        -271604
##LAST=      0,             -107614,         -188536
##MIN=       0,             -661133,         0
##MAX=       8223.43324360094, 420565525,    0
$$ Real data points
##PAGE= N=1
##DATA TABLE= (X++(R..R)), XYDATA
$$ [...]
19499a42899b5846j35045j6002m352d048F855J61224a3126D8688b1589j18391
19488a39980k2174B60245d7180I219J16615E3651a23121j20448C6092c17812A00277
19476A8773Q574i4482l29489d6929l9760l13135a53218b674B02221d8096B51509
19464I6108B0187b5244j53931B24315c53532d8741l329k6666H3716a84371C44756
19452E6176I739b38115J11522d8530A19618b16430i2743r1780O5249j73500B4363
19440c64439d7187m4742G3671a66342f5909j54972m5702A34038a97509e8657n6612
19429a15269J7754n3656m0359K5868G2017b38844I6079k9616j9430b67658a33517
19417A6961a32354N1954B89450a01382c7715n0131j44513N4218j65896D47986
$$ plain form
19499 -142899 -25846 -160891 -176893 -181245 -4048 6855 168079 -13126 48688 -21589 -139980
19488 -139980 -162154 260245 -47180 9219 125834 53651 -123121 -243569 36092 -317812 100277
19476 18773 27347 -94482 -423971 -46929 -86689 -399824 -153218 -2674 202221 -48096 251509
19464 96108 20187 -25244 -179175 224315 -353532 -48741 -52070 -78736 83716 -184371 344756
19452 56176 9739 -238115 -126593 -48530 119618 -216430 -92743 -184523 -119274 -292774 24363
19440 -364439 -47187 -91929 73671 -166342 -65909 -220881 -266583 134038 -197509 -58657 -115269
19429 -115269 -97515 -151171 -191530 -165662 72017 -238844 96079 66463 47033 -267658 -133517
19417 16961 -132354 -80400 289450 -101382 -37715 -87846 -232359 -178141 -344037 447986
19406E3986c42949a47877O6889k2017l00338H7871i4795a9768l62132J23332D8335
19394A26e7353l76396a80088e4794k0779i741j28415B91323g6725A99968I5198
19382b23150e2176k52354g8216E7835b8454l4238j83154R7535g4024G9583d6729
19370i9248b2755A86283c5499j30150m53A23073i0076q9046p7842c2671k10575
19359b43246k6134h832I6396a46611d8956l20148F0419c75958J85762c509r8426
19348a01935k00658B27841B0999J8801a19574o0738l4538G4017Q1513c25254J22467
19337b02787P9351n3389j38525d2091n1045k94037J44506i3841H5192b70232b1873
19325a86733e5129j72908H9957e470j06543j58522m3583e075n0876E1325J29614
$$ plain form
19406 53986 -342949 -147877 -80988 -103005 -403343 87871 -94795 -19768 -381900 -258568 48335
19394 126 -57353 -433749 -180088 -54794 -75573 -9741 -138156 291323 -76725 199968 95198
19382 -223150 -52176 -304530 -78216 57835 -28454 -62692 -245846 -148311 -74024 79583 -46729
19370 -99248 -22755 186283 -35499 -165649 -166102 123073 -90076 -179122 -256964 -32671 -243246
19359 -243246 -269380 -8832 96396 -146611 -48956 -369104 60419 -375958 -190196 -3509 -101935
19348 -101935 -302593 227841 20999 39800 -119574 -180312 -214850 74017 155530 -325254 -202787
19337 -202787 -123436 -176825 -315350 -42091 -93136 -387173 -242667 -93841 85192 -270232 -21873
19325 -186733 -55129 -228037 89957 -5470 -112013 -270535 -314118 -5075 -55951 51325 180939
19314A80939a36634e1821E6809a81025B5872J28329E0214b99018J22793e9506
19303e8630n81j34711Q2442G5282L9467b02785M2906D3764b0578l36220J6814
19292c39984h1616E6979Q6252B818b5672H211c89573d0928j20393D4148a80762
19280a18114N7662j74326J06399A32123a88644b4669D8923K1114h4390A02158
19269A47003h222G792b88138C2096R7554F0934J15951b86883F5776M507c6629
19257a79348F7326f997j04694C03867r6822J76872d57025B8509e2308J2991k31391
19246b70708h8414k56773G5580d2619m5822j43615g8473A66129c19280K4726D9396
19234f5837j34946d592j18228B9779J6027Q7227b84143J9007q5797g0830j95164
$$ plain form
19314 180939 -136634 -51821 56809 -181025 25872 154201 50214 -299018 -176225 -59506
19303 -58630 -59211 -193922 -111480 75282 114749 -202785 -159879 43764 -20578 -356798 -339984
19292 -339984 -81616 56979 143231 2818 -25672 8211 -389573 -40928 -161321 44148 -180762
19280 -118114 -60452 -234778 -128379 132123 -188644 -24669 48923 70037 -84390 102158
19269 147003 -8222 7792 -288138 32096 129650 60934 176885 -286883 65776 70283 -36629
19257 -179348 67326 -6997 -111691 303867 207045 383917 -457025 28509 -52308 -39317 -270708
19246 -270708 -88414 -345187 75580 -42619 -88441 -232056 -78473 166129 -319280 -294554 49396
19234 -65837 -200783 -4592 -122820 29779 45806 133033 -284143 -265136 -350933 -70830 -265994
19223b65994J04357K9100k03631A47923a85352B12026b69680j43775i5961C22200
19212a13893B14956F9942a32827j3161d4076A9700K10183n4711h3936D8306b33482
19200f8252B08481D4302b712q0963A66596m8078c10392B26257C0223a48295A05278
19188B45425b23157F3756b02149Q1322l0681j41853J15200g9133j7831k4046q2844
19177b03854B57533g4949j13878Q0429J4608F0477a21643B90648b60162a02086
19166I2854c47420A77273F9421h4450j97944N0447g3132A6314a19208M029a1587
19154b73190f3529O508n8913j01499k04630h9960j24063G5388O2169o4698M8198
19143A21057c15785d6712E0861C458J36878K6154a38695k25280A79196i2338k4999
$$ plain form
19223 -265994 -161637 -132537 -336168 147923 -185352 212026 -269680 -413455 -95961 322200
19212 -113893 214956 69942 -132827 -145988 -44076 19700 229883 175172 -83936 48306 -233482
19200 -68252 208481 44302 -2712 -83675 166596 118518 -310392 226257 30223 -148295 105278
19188 245425 -223157 63756 -202149 -120827 -151508 -293361 -178161 -79133 -96964 -121010 -203854
19177 -203854 257533 -74949 -188827 -108398 -93790 60477 -121643 290648 -260162 -102086
19166 92854 -347420 177273 69421 -84450 -282394 -231947 -73132 16314 -119208 -115179 -11587
19154 -273190 -63529 -57021 -115934 -217433 -422063 -89960 -214023 75388 137557 72859 121057
19143 121057 -315785 -46712 50861 3458 140336 166490 -138695 -363975 179196 -92338 -117337
19132a17337j84053J05963f475F6076a83385n060D3312d2077j07890g3385D6552
19120B35973F5809i5849A21543K36142b48051J06553K4624C9854i8823k0002A22515
19108c8976k91322P7143h2704k42714J04778A91634d3387r4392B49016b54297
19097E8217I596m617b52351A50005F1686Q439e2109G5915i359m18996A0052O5520
19085G5572b06020A66438a59369C7125a10281m4157g2178J0221q0324b3440l13968
19074c37408B1905J05952b63631O5072p3596F1731p582O332a67691a9132r138
19063b8270B370a0078F5517i5775J7789E939b62125a16167D1701Q854a47263G3418
19050d1964l96841b17150J5142j48916e7049l15719A71693C1312b86476d2435
$$ plain form
19132 -117337 -301390 -195427 -6475 66076 -183385 -188445 43312 -42077 -149967 -73385 46552
19120 235973 65809 -95849 121543 357685 -248051 -141498 -116874 39854 -98823 -118825 122515
19108 -38976 -330298 -253155 -82704 -325418 -220640 191634 -43387 -137779 249016 -254297
19097 58217 9596 4979 -252351 150005 61686 70125 -52109 75915 -9359 -428355 10052 75572
19085 75572 -206020 166438 -159369 37125 -110281 -154438 -72178 -61957 -142281 -23440 -337408
19074 -337408 21905 127857 -263631 -198559 -272155 61731 54149 60481 -167691 -19132 -28270
19063 -28270 2370 -10078 65517 -95775 -77986 5939 -262125 -116167 41701 50555 -147263 73418
19050 -41964 -438805 -217150 -202008 -350924 -57049 -372768 171693 31312 -286476 -42435
19039E28897A44175J91924r8345A16291a10286m3812j8452C0525D712M6022D173
19027a15647m8200p9115A30739l2174B4747K61456b0099l3081a8571G3351b60681
19015C34976b89118a10071D1924b49507A31361b61029A28518A8008K4885h6645
19004a0627k5154G7555K8513J31627C6587b45566A87474a93714A93023r2186b6948
18992a47569A2945J62900i3585q9731l7557B51874a13025J9832d1385m34350A61
18980a47436o4128J9997a2669A13467K1341a40890A83961F5958a24564j94032
18970c18596A20542J6697K51123J71099j66400j21979o0050h2079j2980j57796
18960b52855E7600J33377C2398i4588N490j90036A95177A2918e9181l3334q8492
$$ plain form
19039 528897 144175 336099 237754 116291 -110286 -154098 -172550 30525 4712 50734 4173
19027 -115647 -163847 -242962 130739 98565 24747 286203 -20099 -53180 -18571 73351 -260681
19015 334976 -289118 -110071 41924 -249507 131361 -261029 128518 18008 42893 -86645
19004 -10627 -35781 77555 106068 237695 36587 -245566 187474 -193714 193023 100837 -26948
18992 -147569 12945 175845 -93585 -183316 -220873 251874 -113025 -93193 -41385 -475735 161
18980 -147436 -211564 -191567 -12669 113467 134808 -140890 183961 65958 -124564 -318596
18970 -318596 120542 137239 388362 559461 393061 271082 211032 -82079 -95059 -252855
18960 -252855 57600 190977 32398 -94588 -89098 -279134 195177 12918 -59181 -92515 -181007
18949a81007D6138a21021K9545k91869C02083O8657b0394C5203a9848A18610J26087
18938B44697a25000C0389A3721d6281E176h4889C14800a56088o4864a06370E4011
18926h0417n3101k06895J61262A1914J28888a37259A7268g8590j36375q3591J8048
18915b80508A5073b16821A84789h5369O266j71640D5089J21009c8887r4878B70670
18903C31168j09919L0560c3479D8447b2666A31528c00197M2620K1161i2078E973
18891a67263E5868r452h0658d934j77262Q4734R030M354K0272A32701a23948j24090
18879b48038a05909k69759C2943K219b09076A29609e6710j78785B17014c4119
18868A65382g7000l07449A54862b8159j11719H5415O0377c8928j79346d3294G3042
$$ plain form
18949 -181007 46138 -121021 -91476 -383345 302083 370740 -20394 35203 -19848 118610 244697
18938 244697 -125000 30389 13721 -46281 5176 -84889 314800 -156088 -220952 -106370 54011
18926 -80417 -133518 -340413 -179151 11914 140802 -137259 17268 -78590 -214965 -298556 -280508
18915 -280508 15073 -216821 184789 -85369 -79103 -250743 45089 166098 -38887 -133765 270670
18903 331168 221249 251809 -33479 48447 -22666 131528 -300197 -257577 -236416 -92078 5973
18891 -167263 55868 46416 -80658 -4934 -182196 -97462 -88432 -84078 -63806 132701 -123948 -248038
18879 -248038 -105909 -375668 32943 35162 -209076 129609 -56710 -235495 217014 -34119
18868 165382 -77000 -384449 154862 -28159 -139878 85415 145792 -38928 -218274 -43294 73042
18856b02928C5096e2837l00517i4367H2097h0905j44890q5027g5460G1092P738
18845G8830J42048A6808a56804k048A25578b0211j04405k643E2000b69558J09666
18834a59892A68542c4474D3640A5615a31308A65708k4876d28020a16793l8233
18824a55026m4816k888A52592p5752B0706d6695D8860g7278m8024I5452K3180
18813A18632c3156a3788j29145N3209A41012L1903J00304F6779N8889a86886A53908
18801a85481B5704P5536J9373A3088N5801e4758j18677J8295B2428L2388B1520
18789g7375D9324a01274j00613B85001a91466g2166n03A44347h7344k706H6713
18777b51753H5000c12345R9327b8573j12457B4812a29277k70585C7027K4169B8755
$$ plain form
18856 -202928 35096 -52837 -353354 -94367 82097 -80905 -225795 -310822 -75460 71092 78830
18845 78830 220878 16808 -156804 -158852 125578 -20211 -124616 -127259 52000 -269558 -159892
18834 -159892 168542 -34474 43640 15615 -131308 165708 140832 -428020 -116793 -155026
18824 -155026 -199842 -202730 152592 76840 20706 -46695 48860 -77278 -125302 95452 118632
18813 118632 -33156 -13788 -142933 -89724 141012 172915 273219 66779 125668 -186886 153908
18801 -185481 25704 101240 120613 13088 68889 -54758 -173435 -155140 22428 54816 21520
18789 -77375 49324 -101274 -201887 285001 -191466 -72166 -72669 144347 -87344 -90050 86713
18777 -251753 85000 -312345 -213018 -28573 -141030 24812 -129277 -399862 37027 61196 28755
18765E7896c29462d1540j09808I5300J55245a62922D3278K1629a14402p9795C1061
18753B31391H36c98628e5897C0532h4121C9556J43203a72547m6583a06091d5236
18741h2923m2820b540k3508j45608L0477e4395c105k83600d6761A19466a03787
18729a76938e7517r9584e0192B38539h4957j43499k1967D7772a37D7190b21860
18717G5344e59602c9749J7586d723j71802H0953n230a74732F9831h1064K2253
18706e8811r1959l46514A72344d20219a59471M8445j14726L8976A9264b3569l95472
18695d19041a65177P2548l8110R982K8122A8429e7986C2586f7958j93333B42117
18683i3031l78082J86403I6069b56746n2825A7689K0098a69287H3778a53536A00674
$$ plain form
18765 57896 -329462 -41540 -151348 95300 250545 -162922 43278 64907 -114402 -194197 31061
18753 231391 836 -398628 -55897 30532 -84121 39556 182759 -172547 -219130 -106091 -45236
18741 -82923 -125743 -2540 -26048 -171656 -141179 -54395 -3105 -286705 -46761 119466 -103787
18729 -176938 -57517 -157101 -50192 238539 -84957 -228456 -250423 47772 -137 47190 -221860
18717 75344 -559602 -39749 -22163 -4723 -176525 80953 75723 -174732 69831 -81064 -58811
18706 -58811 -150770 -497284 172344 -420219 -159471 -111026 -225752 -186776 19264 -23569 -419041
18695 -419041 -165177 -92629 -130739 -120757 -92635 18429 -57986 32586 -67958 -261291 242117
18683 -93031 -471113 -284710 96069 -256746 -309571 17689 37787 -169287 83778 -153536 100674
18671h7484E4894J66407a21232k22832F6010c8173j848j35655M10N801d2394k06058
18659b48452a15961b8042O751p4675M939J6987m444k09834P2684C53393j70907
18648A82486c14131D1680b25441g9855C0668N7884a1878B17302i9477D1082K54178
18637B95260n6642j15926B9160b10456L051d7286p5820a0744l2837j43596D5058
18625A438c48292J57839g0131B4522b75704a36113C14596b12003D0744a12533
18614g6138G2531a57423C9188c21974a26253K3735B38842C4049K70715H7742J4518
18603A02260a03959b9976k79968H4115b40318R5173b3271F6971K4855b43148m4175
18592b87323i0605q0226E4947g7488A04906A4853a49570C8396b58289a00705m27967
$$ plain form
18671 -87484 54894 221301 -121232 -344064 66010 -38173 -40021 -175676 -175266 -169465 -42394 -248452
18659 -248452 -115961 -28042 -21291 -95966 -91027 -74040 -78484 -288318 -215634 353393 182486
18648 182486 -314131 41680 -225441 -79855 30668 88552 -11878 217302 -99477 41082 295260
18637 295260 238618 122692 29160 -210456 -207405 -47286 -123106 -10744 -43581 -187177 45058
18625 1438 -348292 -190453 -70131 24522 -275704 -136113 314596 -212003 40744 -112533
18614 -76138 72531 -157423 39188 -321974 -126253 -102518 238842 34049 304764 87742 102260
18603 102260 -103959 -29976 -309944 84115 -240318 -145145 -23271 66971 91826 -243148 -287323
18592 -287323 -90605 -170831 54947 -77488 104906 14853 -149570 38396 -258289 -100705 -528672
18581e28672K13377f7877k51722J04809n9225C3703K52834a57137d8754m79887
18571e28641C4534c19402B30669m3539a90551B4100b40557A0054Q0912d67843
18560d0456j31933b9036j1774q1965B64566a65444A29635b59687Q0742K0467C3263
18548A98496g3457C909N907a33583j64716A59435m9207f9586j76255L1845C0397
18536b9689A5768O3891f7314k5423d0659D8132E55a5185k82059b3100q2564L3054
18524g2610j94387B55187a51521j66728A01509c66409i4116a6925f99j63108D1370
18512b6256A57125d58936j17386A34361b7389A12059a7766j30052A56199g5671
18501b19624a0660o7919a1781j53433A18744n9269P5746a61843L9690p9070f9458
$$ plain form
18581 -528672 -315295 -67877 -319599 -214790 -274015 33703 286537 -157137 -48754 -528641
18571 -528641 34534 -319402 230669 187130 -190551 24100 -240557 10054 90966 -467843
18560 -40456 -172389 -29036 -40810 -122775 264566 -165444 129635 -259687 -178945 -158478 33263
18548 198496 -73457 3909 9816 -133583 -298299 159435 110228 -69586 -245841 -213996 30397
18536 -29689 15768 79659 -67314 -92737 -40659 48132 555 -15185 -297244 -23100 -105664 -72610
18524 -72610 -266997 255187 -151521 -318249 101509 -366409 -94116 -16925 -699 -163807 41370
18512 -26256 157125 -458936 -576322 134361 -27389 112059 -17766 -147818 156199 -75671
18501 -219624 -10660 -78579 -11781 -165214 118744 59475 135221 -161843 -122153 -201223 -69458
18489A79719F4060a2021A40955b48486B79254a74633b7568G72a10798L4588P01
18478g5509l30525I3656J7279b55957e6903k81336a29551C1905J6486c54118A30915
18466d5849k5566j07563p9589P3658B43592p2626h9391j7237k4937A78932a65385
18454a83062g8368k0676m7577j72842i4434j49810A51413o4989d41529C3045d2199
18442a00442j31069A32389o2850a7645p2279G8683b8499I0739B1751d42230C04383
18430A03015g3540J8055o8004k2150A52170c52084l6361f3068B5933b10278k54718
18419d64996B7820J53835o9641J21992a00966I768c3039d872A48244a45209j28208
18408b73417B22488c6708A0908c28019A2366a9703k4722F7937J44440n468a31488
$$ plain form
18489 179719 64060 -12021 140955 -248486 279254 -174633 -27568 772 -110798 -76210 -75509
18478 -75509 -406034 93656 110935 -255957 -56903 -338239 -129551 31905 48391 -354118 130915
18466 -45849 -71415 -178978 -258567 -184909 243592 170966 -89391 -106628 -131565 178932 -165385
18454 -183062 -78368 -99044 -146621 -319463 -94434 -244244 151413 86424 -441529 33045 -42199
18442 -100442 -231511 132389 69539 -17645 -89924 78683 -28499 90739 21751 -442230 304383
18430 103015 -73540 -55485 -123489 -145639 152170 -352084 -388445 -63068 25933 -210278 -464996
18419 -464996 27820 181655 112014 234006 -100966 9768 -33039 -4872 148244 -145209 -273417
18408 -273417 222488 -36708 10908 -328019 12366 -19703 -44425 67937 212377 206909 -131488
18396e5556r6771M1267a4670r9422C8912j8051b6719C54913I2178h5429k0372
18385a05801B22308b4727E4332c19549a4352j21520A98683h472A6287b77007R6182
18374a80825J1636d3950A4066J86633F8207R531a92120M7522A66167c95277a00711
18362g0000M64K2668l1847j3966A157c0173k62555Q5254A6509b07606k3406C2975
18349c71554e5477j9558j71729B7059h010j77239b0576C07282k6758a11234d5005
18337A60737l025i8443n45012B8986h8560c7490C52483d02491f3925k90469i9000
18325b53739J2835i4659j77975i8010B6915k696a15338A87184b0315k32139G3813
18313e8335E2948K50798A10743l3369b14441F60b7123G4877A7581J29442B2332
$$ plain form
18396 -55556 -152327 -111060 -14670 -114092 38912 20861 -26719 354913 92178 -85429 -105801
18385 -105801 222308 -24727 54332 -319549 -14352 -135872 198683 -8472 16287 -277007 -180825
18374 -180825 -169189 -43950 14066 200699 68207 77738 -192120 -144598 166167 -395277 -100711
18362 -70000 -69536 -46868 -78715 -92681 1157 -30173 -292728 -207474 16509 -207606 -231012 32975
18349 -371554 -55477 -75035 -246764 27059 -8010 -185249 -20576 307282 280524 -111234 -45005
18337 160737 157712 -98443 -643455 28986 -88560 -37490 352483 -402491 -63925 -354394 -99000
18325 -253739 -240904 -94659 -272634 -98010 26915 24219 -115338 187184 -20315 -252454 73813
18313 -58335 52948 303746 110743 77374 -214441 660 -27123 74877 17581 147023 22332
18301B85609A10386i4885d3361B47971a50850B87938A41425h947D04075g5724
18290A3511c3785j17285O6473A39912J41840C4212L3287f033B79918A10278a54507
18278A2936c10555a08102A59291a74606f3734A89362i7670B6071f4852l18291
18268c83143C7473d5109k34513C8395J47567c03013c6436G8862a16415j740j4385
18257a32540a1740l0995J6661k2810H4850a36396A11933a20297a4047l25534a42462
18245B14373e2247E9590P8004c25878a8500q0788C2054J2140h4265n4021j15173
18234b53459a22514M2978k43734e9389C55a88198q510k730f1701B07948E4163
18222a44058B02922B9696b58991B56676A13526e2500H386b84009B75288a85678
$$ plain form
18301 285609 110386 -94885 -43361 247971 -150850 287938 141425 -8947 404075 -75724
18290 13511 -33785 -151070 -84597 139912 281752 34212 67499 -6033 279918 110278 -154507
18278 12936 -310555 -108102 159291 -174606 -63734 189362 -97670 26071 -64852 -383143
18268 -383143 37473 -45109 -279622 38395 185962 -303013 -36436 78862 -116415 -118155 -132540
18257 -132540 -11740 -42735 -26074 -48884 84850 -136396 111933 -120297 -14047 -339581 -142462
18245 214373 -52247 59590 137594 -325878 -18500 -99288 32054 44194 -84265 -138286 -253459
18234 -253459 -122514 -79536 -323270 -59389 355 -188198 -196708 -199438 -61701 207948 54163
18222 -144058 202922 29696 -258991 256676 113526 -52500 8386 -284009 275288 -185678
18211B44341G8709k8069f8320F7791k1740a04131p3472h7989p679j3957j09637
18200b19262A9901J01801P686n9766a07275M0077I4173b51427J05966A39188b32978
18188A92376D1842a47351r2817i455j31316B2753a00714d445j82840j24655J14690
18177a97250c85k32129p2253A13231a31696D209N0170b33282g2437A82856e4504
18165C3M2286a92882Q2093A09810A0935f6146A86380b26B54781e1300B3328l103
18153B0225a9034C6063c12395I4110g0380C7699d21477a77286A14660D7760i2491
18141f3396n9899c5733B00437o6712a99786e0888c284B10428e3229I0432e8361
18129I9330R8350r7094f8175q8565Q69G9652f6258m6674B87145f9300m593m0019
$$ plain form
18211 244341 78709 50640 -68320 67791 46051 -104131 -177603 -87989 -95668 -109625 -219262
18200 -219262 19901 121702 129388 69622 -107275 -67198 94173 -251427 -145461 139188 -232978
18188 192376 41842 -147351 -240168 -9455 -140771 22753 -100714 -4445 -187285 -311940 -197250
18177 -197250 -385 -232514 -304767 113231 -131696 4209 54379 -233282 -72437 182856 -54504
18165 33 42319 -192882 -110789 109810 10935 -66146 186380 -226 254781 -51300 23328 20225
18153 20225 -19034 36063 -312395 94110 -70380 37699 -421477 -177286 114660 47760 -92491
18141 -63396 -123295 -35733 200437 133725 -199786 -50888 -3284 210428 -53229 90432 -58361
18129 99330 197680 100586 -68175 -156740 -155871 79652 -66258 -112932 287145 -69300 -73893 -113912
18117a13912q9735f5065B56309j20598d8320K3048r5216K2488j06250R8528I1003
18105C8875b60079D0688a87443G2679A4080B592h5620A08090J70707c26291B0022
18093A35839N1218C6804J69243b31854B24035g1712B07581C218a08008A68076
18082a28192j77009A8289n912d4660j04823m0351d1918G8665b76552B04449H7076
18070C8774J84280C0861L8662f5012Q185A0074b36696R5405B34030a11035A65595
18058c53147A68341n4910l6737b00961Q5410B09181d4439n5862H7614P6311N8604
18047B22529j6672B1993J85820b85892C0439a21652A88536b72781A55539a80009
18036i407A89445b15488P9162A30089J9074j696b57479a12267A91703k9211m994
$$ plain form
18117 -113912 -203647 -65065 256309 135711 -48320 -25272 -120488 -98000 -204250 -105722 91003
18105 38875 -260079 40688 -187443 72679 14080 2592 -85620 108090 278797 -326291 20022
18093 135839 187057 36804 206047 -231854 224035 -71712 207581 3218 -108008 168076
18082 -128192 -305201 18289 12377 -44660 -149483 -189834 -41918 78665 -276552 204449 87076
18070 38774 223054 30861 69523 -65012 -56827 10074 -236696 -141291 234030 -111035 165595
18058 -353147 168341 113431 76694 -200961 -115551 209181 -44439 -100301 87614 163925 222529
18047 222529 205857 21993 207813 -285892 30439 -121652 188536 -272781 155539 -180009
18036 -9407 189445 -215488 -136326 130089 149163 147467 -257479 -112267 191703 162492 157498
18025A57498a94080A0836c3428J0511A70619e48B50837a66634q9312d6210g952
18013A14138N7351f4006r1409N6606K1579j05776A04791D5858e2095B27102G0608
18001b12807F5652P5032Q6361a11036K2870E6169M399J78751b18148h2310k82242
17990c64552J34166A41405b39697a08441L0266A02044a06717j1200K3803j3427
17980a07541l5449A32312J73465b34883P0010d0752B27902d01924A17911a23436
17969a89173C4831J53776f1467A57746d33318C4045f1415j83505c6088A47634
17958i7010B8823b8009i40j04931L7395B20105h6885C4413a16688B0063C774b99514
17945A44476L8062a7820k7679o4900A14121a49663A82635I0063a91858C17280
$$ plain form
18025 157498 -194080 10836 -33428 -22917 170619 -548 250837 -166634 -255946 -46210 -7952
18013 114138 171489 -64006 -155415 -98809 -77230 -183006 104791 45858 -52095 227102 70608
18001 -212807 65652 140684 227045 -111036 -88166 56169 60568 239319 -218148 -82310 -364552
17990 -364552 -230386 141405 -239697 -108441 -78175 102044 -106717 -117917 -94114 -107541
17980 -107541 -142990 132312 305777 -234883 -164873 -40752 227902 -401924 117911 -123436
17969 -189173 34831 188607 -61467 157746 -433318 34045 -61415 -244920 -36088 147634
17958 -97010 28823 -28009 -940 -105871 -68476 220105 -86885 34413 -116688 20063 3774 -299514
17945 144476 182538 -17820 -45499 -110399 114121 -149663 182635 90063 -191858 317280
17934A12767b406k60074B35453J13548p2357m1396b24693D5131J4940a20282e2311
17922a82511l2591R1329c6265l7478B56721a71180l9520A7951K31584G1453J7360
17911H8813c2093r1982M0695A3208c17034A93232P4982a34695D3745a41928c2169
17899b5254A45988K74533a44752d9642C60593c10496B98441A23189b99640A77176
17888h0512A75754J71094a66205M4954C521a49201A83176A9190b19088B37172
17877A42994j1828a25669o98a1755l01447g5636J7376j09209b3105j07609M0585
17866i0129A95771i1964G7280b61j11313M1455A6176J9074a84393C39302q0606
17855B58696A8653P1384J0215k2094J22226C9660O8007b81595B3730J00383a70160
$$ plain form
17934 112767 -2406 -262480 235453 349001 276644 235248 -224693 45131 60071 -120282 -52311
17922 -182511 -215102 -123773 -36265 -73743 256721 -171180 -210700 17951 249535 71453 88813
17911 88813 -32093 -124075 -83380 13208 -317034 193232 268214 -134695 43745 -141928 -32169
17899 -25254 145988 420521 -144752 -49642 360593 -310496 298441 123189 -299640 177176
17888 -80512 175754 346848 -166205 -121251 3521 -149201 183176 19190 -219088 237172
17877 142994 131166 -125669 -126367 -11755 -313202 -75636 -58260 -167469 -23105 -130714 -90129
17866 -90129 195771 -91964 77280 -261 -111574 -70119 16176 35250 -184393 339302 258696
17855 258696 18653 90037 100252 78158 200384 39660 107667 -281595 23730 124113 -170160
17843c70362A05514J81528G4583b2620A10731h0489B08093J10507a91552A35486
17832C9778a02699J5620n1534d1618j3525B59522o5709a79983e6263e230k05732
17821b10962K5175g1997E572J2678K04030K25389b41119J17532d7558D038J4591
17810A8629J08995J72766a14853j43498B45251B1987a55380C00669A03611B311
17799C8809N0818h7903A62438i030A58086j6358j5363D7441b27226R9897j10648
17788b37977A91536e6733J4974j4639l13217B3146J43218a8999A23458m0020L27610
17777D11048p4565A16273m1285d2048o3766K6485q4137b0657k40006Q9572h2127
17765A99575h4746E8793J60459b3867A48316c7521A37004g1125A20358O6451a0928
$$ plain form
17843 -370362 105514 287042 74583 -22620 110731 -80489 208093 318600 -191552 135486
17832 39778 -102699 -87079 -138613 -41618 -55143 259522 193813 -179983 -56263 -5230 -210962
17821 -210962 -185787 -71997 5572 18250 222280 447669 -241119 -123587 -47558 4038 18629
17810 18629 127624 300390 -114853 -258351 245251 21987 -155380 300669 103611 2311
17799 38809 89627 -87903 162438 -9030 158086 141728 126365 47441 -227226 -127329 -237977
17788 -237977 191536 -56733 -41759 -56398 -369615 23146 166364 -18999 123458 83438 411048
17777 411048 336483 116273 74988 -42048 -105814 -79329 -163466 -20657 -260663 -171091 -82127
17765 199575 -84746 58793 219252 -23867 148316 -37521 137004 -71125 120358 186809 -10928
17753A03001i3724k51851B10822D1400R4550a87476b6874j63951F3846L22026
17743C85872j84526E1835b30915B9078K99163a44353B8382L2522O059F270e5198
17731a58498A8536J31910J62081a85404M3446n7166A2798J92500Q9302a9428E9047
17719I6562k3945b2545A95217o7339E9175J16865b21134A49857E4484g63A74306
17707I9281E548b20745B52373P2302G3695a95557B43679q0926K19787A30871Q2177
17696B13048F3216e924A67698O8145G2643k2630c5685N857k28408B43508m1603
17685B01905d4263A93113a13523B8461L5239G974K52826j23743a19588C69629
17674E8003p783K61030j28861P8549j13213O709j3832N6149D8461b36817B03768
$$ plain form
17753 103001 -93724 -345575 210822 41400 135950 -187476 -26874 -190825 63846 385872
17743 385872 201346 51835 -230915 29078 328241 -144353 28382 60904 66963 6270 -55198
17731 -158498 18536 150446 312527 -185404 -141958 -199124 12798 205298 294600 -19428 59047
17719 96562 72617 -22545 195217 127878 59175 176040 -221134 149857 54484 -763 174306
17707 99281 5548 -220745 252373 324675 73695 -195557 243679 162753 382540 130871 213048
17696 213048 63216 -5924 167698 235843 72643 50013 -35685 -29828 -258236 243508 201905
17685 201905 -44263 193113 -113523 28461 63700 7974 260800 137057 -119588 369629
17674 58003 50220 311250 182389 260938 147725 154434 140602 196751 48461 -236817 203768
17662B73376j7372g7343C26844J78705a60042B09885c0115F3959A1585J79516
17652A91101N5471k965A17511L8191K4285L216c031k34343A20879L98393b72800
17640b792n8544B1632b392B38413j0189I7463a32279B00298p9814j1963A0139
17628A84960h9611I0731B8188J61376f3824B95894C3872A1643K02037A8721P5238
17617I3959l2918K79754D5339J39010r1787J45892L249A07821N4755d5414j31098
17606a76512N2180B59384j8338K42878A01897J90704c28862J45884i322A45330
17595A73210K07504j16800a18538B5998J10664J49223g350I4068A4127K48364
17585B62491A09783n579J13707B5281h0821B12600n3808h6679j20760A27799A931
$$ plain form
17662 273376 256004 -77343 326844 505549 -160042 209885 -30115 63959 11585 191101
17652 191101 246572 243607 117511 155702 179987 183203 -3031 -237374 120879 519272 -272800
17640 -2792 -61336 21632 -2392 238413 228224 97463 -132279 200298 120484 108521 10139
17628 184960 -89611 90731 28188 189564 -63824 295894 33872 11643 213680 18721 93959
17617 93959 61041 340795 45339 184349 92562 238454 241703 107821 162576 -45414 -176512
17606 -176512 -124332 259384 241046 483924 101897 292601 -328862 -182978 -9322 145330
17595 173210 380714 263914 -118538 25998 136662 285885 -7350 94068 14127 262491
17585 262491 109783 104204 217911 25281 -80821 212600 158792 -86679 -207439 127799 1931
17573d4504J9744f524B21978a01963H9986c33946B04828J50097b51734B66123
17562d2313C6575L77155D9738J04302l0057j3590J54153d3297A12798a78268B41557
17550B10566P3376D3767q354P5309b39103C87436a40686C4914e4352A94147J48268
17539C42415l7801A6864R692L92178A62308O566R866l9653K58982G9263J02108
17528A81371b32807C35277o3364K70681K63271J13009j2254j26407k89163L89778
17518H80828B52677Q316J97781r8937A22595K46441j54291K48670J921K71154
17508G36490J46654j23378J11427D06369j3457j3446K39908B15853J63745r4522
17498B85076h7586H8239D1510K61043K1106j01886K33012A09183K55957K59444
$$ plain form
17573 -44504 -24760 -6524 221978 -101963 89986 -333946 204828 354925 -251734 266123
17562 -42313 36575 413730 49738 154040 123983 110393 264546 -43297 112798 -178268 241557
17550 210566 283942 43767 35413 110722 -239103 387436 -140686 34914 -54352 194147 342415
17539 342415 304614 16864 26556 418734 162308 168874 178740 139087 398069 79263 181371
17528 181371 -232807 335277 271913 542594 805865 918874 906620 780213 491050 880828
17518 880828 252677 260993 458774 359837 122595 369036 214745 463415 465336 736490
17508 736490 883144 759766 871193 406369 392912 379466 619374 215853 379598 285076
17498 285076 -87586 88239 41510 302553 323659 221773 454785 109183 365140 624584
17488F24584B94597J34739A77869l3694J82267O6568A03923M56159E2743L56994
17478D09737j59091M5761j10949J98284A07926P2064J67880P401j7177C1815J92848
17467B24663I8215C8540J88062n6870J98156D5817K83967j39352J79774A15897
17456A80766J2625J43265H6030K59167J24916B08955k7206L35480A11656M33754
17446E45410B52459l9117J90862K56227C03589r5932J48204K1375b0598A37780
17435C31872k3690L82301B79906R7340n5966A5827L08796d6222C84045j47544
17425B36501K56519k14650H8549L02297l4216k5059J15203k3596q7196A51780
17414C29169L16600A24739L26225K23521F8882M13682j36604p7183G1778M52168
$$ plain form
17488 624584 294597 429336 177869 144175 326442 393010 103923 560082 52743 409737
17478 409737 250646 296407 185458 383742 107926 179990 347870 355271 338094 31815 224663
17467 224663 98215 38540 226602 169732 367888 45817 329784 190432 370206 115897
17456 180766 193391 336656 86030 345197 470113 208955 181749 517229 111656 545410
17446 545410 252459 213342 404204 660431 303589 207657 355861 377236 -20598 137780
17435 331872 308182 690483 279906 377246 321280 15827 324623 -46222 384045 236501
17425 236501 493020 278370 88549 390846 356630 331571 446774 423178 335982 151780
17414 329169 645769 124739 450964 674485 68882 482564 345960 268777 71778 523946
17404E23946A79659G3547L56685r2485E7785K02766K20728j85824A29299l377
17394A25922L02244K1477C9818c043A82938K74720k26917g5825D01067H4543K8418
17383A12961Q7117J14696J51979B4385K13412r0802a4359C07609j41388J97114
17373C63335j25099K11630B18462n6813N876L04770k14128M57415B61829O2595
17363C24424o3241r630E4237L88656j94522F8137K40039A17228L3379n2138c9580
17351D44445A12294M17986k55560J58040j98467o8360n0139J44730I576K76618
17341B86194l0734p3022f5565C55390p5055Q4655r0894N994b6229A7427K18583
17330B36010A00K72384H7829K9086M77573k32011A18678J89930H8473K09918A24786
$$ plain form
17404 523946 179659 73547 430232 337747 57785 260551 481279 295455 129299 125922
17394 125922 428166 449643 39818 -3043 182938 457658 230741 -75825 401067 84543 112961
17383 112961 200078 314774 466753 24385 237797 146995 -14359 307609 166221 363335
17373 363335 238236 449866 218462 161649 167525 472295 258167 715582 261829 324424
17363 324424 261183 251553 54237 442893 248371 68137 308176 117228 150607 98469 -39580
17351 444445 112294 530280 274720 432760 234293 165933 115794 260524 9576 286194
17341 286194 255460 182438 -65565 355390 280335 364990 274096 280090 -26229 17427 236010
17330 236010 100 272484 87829 116915 594488 362477 118678 308608 88473 298391 124786
17318B48036k8957Q5993a68001C20691f33E5674O6411J94538R7660J26679A08283
17306b6907E3131O77384B60268J9820D186L18334j01632Q2835J14012k2780j61572
17295B33383j16509J49575n1417l9J48548K27163j44303I9551L23335H64M66517
17284D67381j0427J66674B23371K3566J99356f236l9973H3051L16470A75536J68116
17273C43652a49253A26503E5043Q9242K36262Q5614o6053j28246A05422L42712
17263D48134G742K66329A18011a24967F23517G6510K55919K3403b23957E78112
17252B67357m4535J1863J31438I0358J63868k3987P8865j12149K07325j25716
17242B78564M4441a39324D92835B0754L49619L8674j83176L56866C8372J59164
$$ plain form
17318 248036 219079 305072 -168001 320691 -633 55674 122085 316623 414283 540962 108283
17306 -26907 53131 730515 260268 280088 4186 322520 220888 303723 417735 394955 233383
17295 233383 116874 266449 215032 214993 363541 590704 446401 99551 422886 864 467381
17284 467381 456954 623628 223371 246937 446293 -6236 -46209 83051 399521 175536 343652
17273 343652 -149253 126503 55043 144285 380547 466161 400108 271862 105422 448134
17263 448134 7742 274071 118011 -124967 623517 76510 332429 355832 -223957 578112
17252 267357 222822 234685 366123 90358 254226 230239 309104 196955 404280 278564
17242 278564 323005 -139324 492835 20754 370373 409047 225871 582737 38372 197536
17232A97536R6806Q0802n7501J35316j31251o2988L4954B0728M15490K37388k50051
17221D23555J59211r0854O8888j24380E2131K73385J67627j29562K0712M2940
17211D27233K1486N7683k26612l6824L53089m654j85748A96596J69958A05986
17200F84417k48371A69803J02780M00285C08101A03608L85536k29698M9381l3169
17190B75658J43706K43122k90031J85084k29998J40384j43746R2759J93575J35083
17180G45596j93502q8909A66648K63562q5523j7822R5862L22792C12695m1662
17170B71033L7414K98604k22532L02940k19782Q2971k05601a43365E15334K57958
17160G73292B95681L48754C18762J41149m8294J68147j18123N8682j0386j58728
$$ plain form
17232 197536 294342 375144 317643 452959 321708 258720 293674 20728 436218 673606 423555
17221 423555 582766 491912 560800 436420 52131 325516 493143 363581 384293 427233
17211 427233 448719 506402 279790 242966 596055 591401 405653 196596 366554 105986
17200 684417 436046 169803 272583 672868 308101 103608 489144 259446 308827 275658
17190 275658 419364 662486 372455 557539 327541 467925 324179 416938 610513 745596
17180 745596 552094 463185 166648 430210 344687 326865 422727 745519 312695 271033
17170 271033 308447 607051 384519 687459 467677 550648 345047 -143365 515334 773292
17160 773292 295681 644435 318762 459911 411617 579764 461641 520323 509937 351209
17150C51209L31337j75283J22511k35963J59213m6755O6402J05632A52046O49563
17140H01609j05446C24845L8864J61260J75993q5864j90693L05006l45712P5333
17130D59032N1099L307K51458q693k24659j11022J6076k03571N60603l59284K63585
17119F97931K42763k14040A08205P87431k87221O8488o7828J03685O6071q9667
17109F89164J9952k65097J40193J52143K1980l35271J4156J69589j31715j04576
17099C70518K15701j90100K56977L61096k42049J7879J67848C80762M22633q256
17089G95139l47623K57211q3963j19189J76737k53365K90259R726K22422j29711
17079H17643r5759j01898M0778P7867p9892j37152M82042l02019n4704j31700
$$ plain form
17150 351209 682546 507263 629774 393811 553024 506269 572671 678303 152046 801609
17140 801609 696163 324845 363709 524969 700962 615098 424405 729411 383699 459032
17130 459032 510131 513438 764896 756203 531544 420522 436598 233027 793630 434346 697931
17119 697931 940694 726654 108205 895636 608415 676903 609075 712760 778831 689164
17109 689164 709116 444019 584212 736355 758335 423064 437220 606809 475094 370518
17099 370518 586219 396119 653096 1014192 772143 790022 957870 380762 803395 795139
17089 795139 447516 704727 620764 501575 678312 424947 715206 724932 947354 817643
17079 817643 721884 619986 660764 738631 658739 521587 1003629 701610 646906 515206
17069E15206M34013l6712r0549l41129N65694l61126r4791R4603N35833E85937
17058H83104k27841L55628j01179P0141j25683o9206L66202D93979L31498L5650
17048H61127J14919m16207P90028n30908o3147J08547J15196J74945k17467o6626
17038H70407P8605j24318K41996p7213j534k33192L42313k02262K11711L1998
17028A138511l45542J94127q3485o4220K07648j46539J70724m29950K37493L26164
17018A204931j70795O5715j95299J12648J05109l46281L57394p7477r7831j06048
17008H52066M24414j39036o2900p6896J32181k42236M26122j28912J35327P654
16998A327784l06624O793Q6664J50113j4330k24811M07464q245o85556P39029
$$ plain form
17069 515206 949219 912507 821958 480829 1046523 685397 590606 685209 1221042 585937
17058 883104 655263 1010891 909712 979853 854170 784964 1151166 493979 825477 861127
17048 861127 976046 559839 1349867 818959 755812 864359 979555 1154500 937033 870407
17038 870407 949012 824694 1066690 989477 987943 754751 1097064 894802 1106513 1138511
17028 1138511 792969 987096 903611 839391 1047039 900500 1071224 641274 878767 1204931
17018 1204931 1034136 1099851 904552 1017200 1122309 776028 1133422 1055945 958114 852066
17008 852066 1276480 1137444 1074544 997648 1129829 887593 1313715 1184803 1320130 1327784
16998 1327784 1021160 1027953 1114617 1264730 1250400 1025589 1433053 1424808 739252 1478281
16988A478281j66179o3096O2510l38218N88314j06768k75233J74124n2228J78864
16978A480371j42938J05087j7407l9194L288K48584k54907J18941m6175J23197
16968A578847J55222j9641N1070j89640p307N1616k60305J65931J80754k14090
16958A492457N2750L42603j52935J88629j81738k44545K83917J07312j53028J53000
16948A888422m4961J9042L15961l19341M3149Q2601K95991m63411K51373L4263
16938B103089j64617L51669j60817Q8189k37663j5467M6595J30219K03088P5314
16928B419599K0607l57929J60929J78412k92978K14538J10035L2817j90218J81660
16918B477472Q8048K0555K06106j10102m73700M54867l27114L24539J78694j28874
$$ plain form
16988 1478281 1312102 1249006 1311516 973298 1561612 1454844 1179611 1353735 1301507 1480371
16978 1480371 1337433 1442520 1425113 1385919 1389207 1637791 1382884 1501825 1455650 1578847
16968 1578847 1734069 1714428 1765498 1575858 1568551 1620167 1359862 1525793 1706547 1492457
16958 1492457 1545207 1887810 1734875 1923504 1741766 1497221 1781138 1888450 1735422 1888422
16948 1888422 1843461 1862503 2178464 1859123 1902272 1984873 2280864 1817453 2068826 2103089
16938 2103089 1938472 2290141 2129324 2217513 1979850 1964383 2010978 2141197 2344285 2419599
16928 2419599 2440206 2082277 2243206 2421618 2128640 2343178 2453213 2486030 2295812 2477472
16918 2477472 2565520 2586075 2792181 2682079 2208379 2663246 2336132 2660671 2839365 2710491
16908B710491J22281K86558j27046q2262M04876n09535K16548K2314j58254L11316
16898C197287j81474J66384o1728O4614K17754l16019L58938N2972n1515j06432
16888C340781n1558N69063l99226P2535K29763j27043n9782M78098j63859M7867
16878C936639l08502J61865K95255Q5753J47170L8016l70259K60845O4886N13959
16868D825627l67128N0641o0661K75933J35765p0985o1754k5993J19511J83203
16858E004159K09091j47254L6560M88780L3163m8343J12735j7065J31750J04372
16848E907948N752L30670k224K44813k29834k0498L65947r9411N53039l47028
16838F709174M07406J34392k12597O39776l24403M7876L04670k20061K86649K42056
$$ plain form
16908 2710491 2832772 3119330 2992284 2910022 3314898 2805363 3021911 3044225 2885971 3197287
16898 3197287 3015813 3182197 3120469 3185083 3402837 3086818 3445756 3498728 3447213 3340781
16888 3340781 3289223 3858286 3459060 3531595 3761358 3634315 3574533 4052631 3888772 3936639
16878 3936639 3628137 3790002 4085257 4171010 4318180 4356196 3985937 4246782 4311668 4825627
16868 4825627 4458499 4509140 4448479 4724412 4860177 4789192 4727438 4701445 4820956 5004159
16858 5004159 5213250 5065996 5102556 5591336 5624499 5576156 5688891 5671826 5803576 5907948
16848 5907948 5913700 6244370 6242146 6486959 6257125 6236627 6602574 6503163 7056202 6709174
16838 6709174 7116580 7250972 7038375 7678151 7353748 7401624 7706294 7486233 7772882 8014938
16828H014938L82842n2327L60355p3568R118L55140K24861K74360R7813L95335
16818I988867l62912P9332L98960J68427M21995K11036J36906M4313K60651N93604
16808A1941179K47079N2915Q8868M08543L5109P18220N7177O28429k7335J10019
16798A4260203O40524M99306l428N0299J000420J68663J62253O60117K26162O04323
16788A8268842N37341L26165O49139Q58444N0170P38669N46841K34675O25005
16779B2835291O91641O05937M45033J273719J75658O03240P79995P82247Q04720
16770B8997481J145155R37145R74138N66496R68214J061491Q17108J078452J204345
16761C7750025J090344J473215R74494J056577J354837J348448J209422J667161
$$ plain form
16828 8014938 8397780 8345453 8705808 8632240 8641358 8996498 9221359 9495719 9593532 9988867
16818 9988867 9625955 9705287 10104247 10272674 10694669 10905705 11042611 11086924 11347575 11941179
16808 11941179 12188258 12241173 12330041 12738584 12773693 13491913 13549090 14177519 14150184 14260203
16798 14260203 14900727 15400033 15396605 15446904 16447324 16615987 16778240 17438357 17664519 18268842
16788 18268842 18806183 19132348 19781487 20639931 20690101 21428770 21975611 22210286 22835291
16779 22835291 23526932 24132869 24577902 25851621 26027279 26630519 27410514 28192761 28997481
16770 28997481 30142636 31079781 32053919 32620415 33588629 34650120 35467228 36545680 37750025
16761 37750025 38840369 40313584 41288078 42344655 43699492 45047940 46257362 47924523
16753D7924523J092691J915724J531004J053421J889947J473077J732712J529669
16745F0142768J930342J723651J681645J743864J673852J839076K191086J465178
16737G4391462J610163J921895J236006J955352J139574J613925J170809J358869
16729H6398055J458724O43965J044508J141670K87929O10364O8755J74687J15773
16720I1944430l58559k12049p06740j92282p89474j223042o36255j487067j193330
16711H5145632j344560j351857j627266j187921j663707k114120j638055j520632
16703G2697514j917490j790551j473907j891958j702332j671082j704974j647786
16695E8897434j433460k214218j607204j294252j825370j035621j655410j028741
$$ plain form
16753 47924523 49017214 50932938 52463942 53517363 55407310 56880387 58613099 60142768
16745 60142768 62073110 63796761 65478406 67222270 68896122 70735198 72926284 74391462
16737 74391462 76001625 77923520 79159526 81114878 82254452 83868377 85039186 86398055
16729 86398055 87856779 88500744 89545252 90686922 90974851 91585215 91653970 91828657 91944430
16720 91944430 91585871 91373822 90667082 90474800 89685326 88462284 87826029 86338962 85145632
16711 85145632 83801072 82449215 80821949 79634028 77970321 75856201 74218146 72697514
16703 72697514 70780024 68989473 67515566 65623608 63921276 62250194 60545220 58897434
16695 58897434 57463974 55249756 53642552 52348300 50522930 49487309 47831899 46803158
16687D6803158j677680j102211j061803j730347q38540j152898j038457j158701
16679C7042521j398673r06492r49978q84695q69982q44387j010751p06451o82296
16670B8788816q24291o99015p48148o89192m81702p24534o20771p83058l91169
16661B2826936j073465N4877q58561m68436j00195p80448l08670r60737k29385
16652A8101916k23929m40428j37825k54463p86465m61412r6841n19206m12809
16643A4768538l41001l59167k87583j76401K5716m55902l16843r4155m90959J19803
16633A2392046n05197l97244J70866m69509k71836n0983k3967k12500l86385k91215
16623I954076k29891k15207N3326k35998K41589k80440n07942q4453j73897j64405
$$ plain form
16687 46803158 45125478 44023267 42961464 41231117 40392577 39239679 38201222 37042521
16679 37042521 35643848 34737356 33787378 32902683 32032701 31188314 30177563 29471112 28788816
16670 28788816 27964525 27265510 26517362 25828170 25346468 24621934 24001163 23218105 22826936
16661 22826936 21753471 21808348 20949787 20481351 20381156 19600708 19292038 18331301 18101916
16652 18101916 17877987 17437559 17299734 17045271 16258806 15797394 15700553 15181347 14768538
16643 14768538 14427537 14068370 13780787 13604386 13630102 13174200 12857357 12763202 12272243 12392046
16633 12392046 11886849 11489605 11660471 11190962 10919126 10868143 10844176 10631676 10245291 9954076
16623 9954076 9724185 9508978 9562304 9326306 9567895 9287455 8779513 8695060 8521163 8356758
16613H356758J27757l23801P0249o15676J16098R0141l7674k69069l65955J48152
16603G296980j5650n08774r2804K53308l16707m3782l112N564k84819l8098n04635
16592E747471K09847J15337k58599m3626J35744k70791j20634Q2705j03124l6184
16582E458146k415m11623K27966k10852k72248M87162l94013j39361K22150l77572
16572D587340L30496m31287k18495J39181n7489L0325m20726L45253p7485k42159
16562C984954K00268r5158p8009K13952k13416o2369j29765k30829J28170P3984
16552C791782r2181j7623l37267P2931J64402k40329P4866l0823k06940J35198
16542C314016q5605l39970K84116M37067k62848J6263k749j0345l71855K11023
$$ plain form
16613 8356758 8484515 8160714 8230963 7615287 7731385 7821526 7783852 7514783 7148828 7296980
16603 7296980 7281330 6772556 6679752 6933060 6616353 6572571 6569459 6575023 6290204 6252106 5747471
16592 5747471 5957318 6072655 5814056 5770430 5906174 5635383 5514749 5597454 5494330 5458146
16582 5458146 5455731 5044108 5272074 5061222 4788974 5276136 4882123 4742762 4964912 4587340
16572 4587340 4917836 4486549 4268054 4407235 4349746 4380071 3959345 4304598 4227113 3984954
16562 3984954 4185222 4090064 4012055 4226007 4012591 3950222 3820457 3589628 3717798 3791782
16552 3791782 3699601 3681978 3344711 3417642 3582044 3341715 3416581 3385758 3178818 3314016
16542 3314016 3228411 2888441 3172557 3609624 3346776 3363039 3360290 3349945 2978090 3189113
16532C189113N6644J7642m41721j75173J62849J01288J19157m82175K35541l16893
16522B466272K29250o8990k16110L23692j3464j14341m42055O52188l30213l75230
16512B110999L6305M37973o14151L90230Q8868K16500l60003Q7235J04238j65163
16502B333031M6056k12724J15477j23724j49632K21299k51086K42319j21933j29037
16492A970046K09851M364J07307m49463n7548k12749M88587m17635K4364K54296
16482A921420r9668p0830R4976o5285M41085m91560O5153L07211j73722O7004
16472A995784L3582l31870J05773j45945K0766q7312K58523l75929L07031j91521
16462A588882l83259L75130j30689L69761p4248j03860k53093p2771M24613j8593
$$ plain form
16532 3189113 3245757 3263399 2821678 2646505 2809354 2910642 3029799 2547624 2783165 2466272
16522 2466272 2695522 2626532 2410422 2734114 2720650 2606309 2164254 2816442 2486229 2110999
16512 2110999 2147304 2585277 1971126 2361356 2450224 2666724 2306721 2393956 2498194 2333031
16502 2333031 2379087 2166363 2281840 2158116 2008484 2229783 1978697 2221016 2099083 1970046
16492 1970046 2179897 2184261 2291568 1842105 1784557 1571808 2060395 1642760 1667124 1921420
16482 1921420 1821752 1750922 1845898 1780613 2221698 1730138 1795291 2102502 1928780 1995784
16472 1995784 2029366 1697496 1803269 1657324 1678090 1590778 1849301 1473372 1780403 1588882
16462 1588882 1205623 1580753 1450064 1819825 1745577 1641717 1388624 1315853 1740466 1721873
16452A721873k62569j79792K72994J29894j819K2069m42276j64207M69063m6753
16442A518477R6279m13371K52411k07349j55651K94690J36934j99618L98200k86125
16432A434877o4717j5728k33494K44206k54398J88517O831j90886J24596Q9119
16422A328923r6109k17565K76048k25339J71413L7455k56366J92721k60398J86820
16412A137603K35577l56284n3882j15658L18834o1949J46398k04201J51547O9022
16402A267007k34260J04886n2329K14170k97992L64730l27526m3847j27353K22352
16392A089838l07154L38468j04794o1846P0220j50390j04068N47420n00752J00665
16382I17607j17697J16518N7781J84253j62965J22483j84024p5379M22314n11505
$$ plain form
16452 1721873 1459304 1279512 1552506 1682400 1680581 1702650 1260374 1096167 1565230 1518477
16442 1518477 1614756 1201385 1453796 1246447 1090796 1385486 1522420 1322802 1721002 1434877
16432 1434877 1370160 1354432 1120938 1365144 1110746 1299263 1306094 1115208 1239804 1328923
16422 1328923 1232814 1015249 1291297 1065958 1237371 1274826 1018460 1211181 950783 1137603
16412 1137603 1373180 1016896 963014 847356 1166190 1104241 1250639 1046438 1197985 1267007
16402 1267007 1032747 1137633 1085304 1299474 1001482 1366212 1038686 994839 867486 1089838
16392 1089838 782684 1121152 1016358 954512 1024732 874342 770274 1317694 816942 917607
16382 917607 799910 916428 974209 1158462 995497 1117980 933956 858577 1280891 769386
16372G69386o7365j22533K62040K80653l38937Q412M03011p2255k27700j83238
16362G11474j2010J27267J1372j52687j32012J94814k2278K48166o1815J7336
16352I29627k69391k9834P8882Q3950J18536l43279n6353j21827N21606J20939
16342A032856k64254p5796R6057k92349r6050L36478k75788K12377J02618N578
16332G81727j34330j12796K82032q2709J63919k59016k8653M8737L56547m39827
16322E75631K67693J05955k40113M3169l16171j9373J14928Q4962j59318L11304
16312G68667J5066m6418k19170L43318j73263k21107M7025K37731k09742j38833
16302D03274J15766J1326q6229k0393J69024N4851J29865P0321C35505N77187
$$ plain form
16372 769386 702021 579488 841528 1122181 783244 791656 1194667 1122412 894712 711474
16362 711474 699464 826731 838103 685416 553404 748218 725940 974106 912291 929627
16352 929627 660236 630402 709284 793234 911770 568491 512138 390311 911917 1032856
16342 1032856 768602 692806 788863 496514 400464 736942 461154 673531 776149 781727
16332 781727 647397 534601 816633 733924 897843 638827 610174 658911 1015458 575631
16322 575631 843324 949279 709166 752335 436164 416791 531719 616681 457363 768667
16312 768667 783733 737315 518145 861463 688200 467093 514118 751849 542107 403274
16302 403274 519040 530366 444137 423744 592768 647619 777484 847805 335505 912692
16292I12692k99822J00395k75914p8755J11350J61037k60552j57279N41063j68106
16282E86109B81292A38927K46462k3379J63754m6495K25049k60606Q6854B30522
16271a786D80380J05164k56206Q5599P216K84193k17066p3121A68372K6660N19757
16260G14789l18188n9597J12756n7512J2510L2170K07737C10850q052J48996A95141
16248D81998K82068K4435C21622K26268L3715n2587j59778K37147k84628K94959
16238F16718B24197L04104j09849l8305Q7731J96987Q1737l13589J08080B10608
16227D09833O7533m9929N6760J49607l6347r6054j19958o0286J26969j11301j27106
16216B09721m1449J3991R9048K57283K0046j36816m6858k0214J26429k31326n1009
$$ plain form
16292 912692 612870 713265 437351 358596 469946 630983 370431 213152 754215 586109
16282 586109 281292 138927 385389 362010 525764 479269 704318 443712 530566 230522
16271 -1786 480380 585544 329338 414937 422153 706346 489280 416159 168372 195032 714789
16260 714789 396601 337004 449760 392248 404758 436928 644665 310850 302798 451794 195141
16248 481998 764066 788501 321622 547890 581605 529018 369240 606387 321759 616718
16238 616718 224197 528301 418452 380147 467878 664865 746602 433013 541093 210608
16227 409833 477366 427437 484197 633804 597457 501403 381445 321159 448128 336827 209721
16216 209721 168272 182263 281311 538594 558640 421824 374966 354752 481181 249855 198846
16205A98846K35913b29350F47036k08758k02572R6795J59877A63002M6580L26929
16195E36511k29789P9364J05075j00344j35220j13674K34325a88533A03577N50447
16185F54024A35685M13294k65297j12979C8845J55865K19658G2377K92540O1317
16175D26234A52085Q2517I5524K59380k1678K4470A20582L67843m6497J98488
16165F40416k52285j618A84600K46994A62949L84541B69561l9338J88048p4685
16155C43586j9332p880e6685B63040q283L65247j54889A29452K83730j04307A32743
16143i8480B54679m2428J82052b2264B17450K10767E5653J2365L2823L20497j45664
16132B75674J7246K02597j15295G5076J8080b8082B66200c8124B4917K73619A6782
$$ plain form
16205 198846 434759 -229350 647036 438278 235706 332501 492378 163002 209582 536511
16195 536511 306722 386086 491161 390817 255597 141923 376248 -188533 103577 654024
16185 654024 135685 548979 283682 170703 38845 194710 414368 72377 364917 426234
16175 426234 152085 234602 95524 354904 333226 357696 120582 488425 441928 640416
16165 640416 388131 386513 184600 431594 162949 547490 269561 230223 418271 343586
16155 343586 324254 316374 -56685 263040 254757 620004 465115 129452 413182 308875 132743
16143 -98480 254679 212251 394303 -22264 217450 428217 55653 68018 100841 421338 275674
16132 275674 292920 495517 380222 75076 93156 -28082 266200 -38124 24917 298536 16782
16120B77091I387f9255C25273J00417F6976R7604b35775C2337g156p75H2424e1853
16107C08543c5055D03057N9843j39010j33584a44195A02324M0286L9332J42574
16097C24516m3435L37578B59822j26030L75559B22326k9508h3244E8880J45203
16087B04083e7748A70333J20638D2652R1213G307M1595i0425B26154j07571P1183
16076A89766O118J53088A62770J1243K58670f6073j64717B50760q5248a20197
16065C76509j6954I0068k216c5161A32669J04859D9517K09128e7554B24898q8254
16054A36644P9090p6638c78041F7941J49013J12969a93601C20127m7601J2016
16044B84542d1668B21274m8447R623E7256a34344B32373f9097C26989j58352G607
$$ plain form
16120 277091 9387 -69255 325273 425690 66976 164580 -235775 32337 -7156 -7931 82424 -51853
16107 308543 -35055 403057 462900 323890 190306 -144195 102324 142610 181942 324516
16097 324516 281081 618659 259822 133792 509351 222326 192818 -83244 58880 204083
16087 204083 -57748 170333 290971 42652 133865 7307 48902 -90425 226154 118583 189766
16076 189766 195884 348972 162770 174013 432683 -66073 -230790 250760 165512 -120197
16065 376509 359555 90068 87852 -35161 132669 237528 49517 258645 -57554 224898 136644
16054 136644 215734 139096 -378041 67941 216954 329923 -193601 320127 272526 284542
16044 284542 -41668 221274 172827 182450 57256 -134344 232373 -69097 326989 168637 7607
16032f2764I0477K12321a69829C66147j06903O6901j53674o8956D5526a86175
16021a94403h0529a1159o2690A59491a2860A23465O4984R6150b00252B94524a08694
16009B7832i4382B11925N4331A08355m5373B2035d8422A23905A8372J88821Q2440
15998B89633A37032K4846J15683c58629A82967n1125N0152K5753a07418B82604
15987E19560K54100o0620J97564k24552J8806C02600q8954R2130j36428R4954
15977B64302a3503q9142C04009J1930K39659d2938B32442a24755E4781K65489
15967C20270j19190E2480K8689a92772E3586K58675j4217a61945g6980A22827
15956A84213A3084K42113G3833b21706B51661F9596J8499M6452g3179r2235I3430
$$ plain form
16032 -62764 90477 302798 -169829 366147 259244 326145 172471 103515 45526 -186175
16021 -194403 -80529 -11159 -73849 159491 -12860 123465 188449 284599 -200252 294524 -108694
16009 27832 -94382 211925 266256 108355 62982 22035 -48422 123905 18372 207193 289633
15998 289633 137032 161878 277561 -358629 182967 131842 181994 207747 -107418 282604
15987 519560 773660 713040 910604 686052 704858 302600 213646 305776 169348 264302
15977 264302 -13503 -102645 304009 315939 555598 -42938 232442 -124755 54781 320270
15967 320270 201080 52480 81169 -192772 53586 312261 298044 -161945 -76980 122827
15956 184213 13084 255197 73833 -221706 251661 69596 88095 134547 -73179 -165414 93430
15944a22342a5816B87505e9465a2520p5904o9010k8567F5512d5210A52642a24383
15932A99359J31881e5399j11273n2856L5856A69750a07591k77J3255P92j52967
15921b46788c5537D1774K07648A12196h5991o9450p65E9606i2977k07280C81304
15909A95825i520E2629g2888j25238A62648F3983R6801c09308A13018K3641n3544
15898H3115P8787c7424k03461i9160L8843l4150a5717k1550a6024E8762b31043
15886A98309b33503E3647J62744J18365n0561q6006o4806i3987k84645A41339
15875B8541J91231f2264k58683D6894L6058F469g8537A39926c63686A18898Q3276
15864B02174p7256k0407b09080R994A40039j4024k6070a78350c3078A82025a58522
$$ plain form
15944 -122342 -15816 287505 -59465 -12520 -88424 -157434 -186001 65512 -45210 152642 -124383
15932 199359 331240 -55399 -166672 -219528 -183672 169750 -107591 -107868 -94613 -93821 -246788
15921 -246788 -35537 41774 249422 112196 -85991 -155441 -156206 59606 -92977 -300257 381304
15909 195825 -9520 52629 -72888 -198126 162648 63983 160784 -309308 113018 136659 83115
15898 83115 161902 -37424 -240885 -99160 -60317 -94467 -15717 -37267 -16024 58762 -231043
15886 198309 -233503 53647 216391 334756 284195 198189 133383 -93987 -378632 141339
15875 28541 219772 -62264 -320947 46894 82952 6469 -78537 139926 -363686 118898 202174
15864 202174 124918 104511 -209080 -199086 140039 126015 99945 -178350 -33078 182025 -158522
15852D02084j80932A630a4361j55251F4246d9809A44959h9599B5532d2600B81913
15840B05162G1731b55672D96019E2164J93327a12165I2448a52599j23857B98859
15829a74181O6453a3574A50608a27548L0007m6843c3566I6354j0017a31938J4533
15818a17405k42753A43364f039k14884A59575c65594a59442A61067L7649a85200
15807G71c9898C649b8674r3538B38264B692b03438A40242M610i9904A07390m9931
15795E7459j328J99196F9479K60112O9399c3402j408j41964C3800e1238j25633
15784a76871m7142C00559G3134C2982J54791M1062a56696M0489N3134B45703c46673
15772h0296B14260J35990a60670b1670j40661n720g3801B1763b70644C87698A05887
$$ plain form
15852 402084 221152 1630 -14361 -169612 64246 -49809 144959 -89599 25532 -42600 281913
15840 205162 71731 -255672 496019 52164 245491 -112165 92448 -152599 -276456 298859
15829 -174181 -107728 -13574 150608 -127548 -97541 -144384 -33566 96354 86337 -131938 -117405
15818 -117405 -360158 143364 -6039 -220923 159575 -365594 -159442 161067 198716 -185200
15807 771 -39898 3649 -28674 -122212 238264 2692 -203438 140242 144852 -99904 107390 57459
15795 57459 56131 255327 69479 329591 398990 -33402 -34810 -176774 33800 -51238 -176871
15784 -176871 -224013 300559 73134 32982 187773 228835 -156696 -116207 -63073 245703 -346673
15772 -80296 214260 350250 -160670 -21670 -162331 -168051 -73801 21763 -270644 387698 105887
15760g4685a385j48674A82721a17040C90780B5816c31197A56943a69246H4024
15749F4639M72886a50337B46013j03875o6704a64739A41538a15010h912H2052
15738a25751A45749B1274L7283a15499j71205A54346b52236e9494C31051c33323
15727a63834A89209J75161M9926a19526b4410A46242J57525i8035l6179M6040
15717h8174A9385b49634G4940K34050J6651A04430K1969E9984c4561k2802j7443
15706g4806A54709c67194A23380A5510b14729F0794a30745c021l49253A0774N437
15695A6211O8377c8173C66556H7002b62252a2278A09055a78236A43219Q135a25492
15683E1665h5231A62461J57772f9370c1461j64315K5378G6294a48320A92738L966
$$ plain form
15760 -74685 -1385 -150059 182721 -117040 390780 25816 -331197 156943 -169246 84024
15749 64639 537525 -150337 246013 142138 75434 -164739 141538 -115010 -8912 82052
15738 -125751 145749 21274 58557 -115499 -286704 154346 -252236 -59494 331051 -333323
15727 -163834 189209 364370 414296 -119526 -24410 146242 303767 -98035 -134214 -88174
15717 -88174 19385 -249634 74940 308990 325641 104430 126399 59984 -34561 -57363 -74806
15706 -74806 154709 -367194 123380 15510 -214729 60794 -130745 -3021 -352274 10774 16211
15695 16211 84588 -38173 366556 87002 -262252 -12278 109055 -178236 143219 151354 -125492
15683 51665 -85231 162461 320233 -69370 -31461 -195776 -170398 76294 -148320 192738 196704
15672A96704a54073e539B6945i5994A60333c5432n7527d5701k34075N7450M2274
15661a80052m1868I5395k3556a03465C7880e8014A86575g4690k49729R7810O7929
15650a58680A38990b23244C17010j51692c11231a23606j2013A57525B2719F961
15639d1359A82615b85723b5246k57425n0980H7510b68369J29762m1564B76115
15628I5348B4219b00245B28018a8487k1625k22882h6625j06430A83328a79424
15617c1524A54909d74564C8955a02055C7472f6493h531A28026N0633H6238b75225
15605C38706d1895A27802c6430F1091A893L4079a80477r3449i0405k31580h5576
15593c12046A64709F9101K5820b07487h2258a014B69975h7605C5381K82712a40205
$$ plain form
15672 196704 -154073 -5539 26945 -95994 160333 -35432 -92959 -45701 -279776 -222326 -180052
15661 -180052 -221920 95395 71839 -103465 37880 -58014 186575 -74690 -324419 -226609 -158680
15650 -158680 138990 -223244 317010 165318 -311231 -123606 -135619 157525 22719 6961
15639 -41359 182615 -285723 -25246 -282671 -333651 87510 -268369 -138607 -180171 276115
15628 95348 24219 -200245 228018 -18487 -40112 -262994 -86625 -193055 183328 -179424
15617 -31524 154909 -474564 38955 -102055 37472 -66493 -8531 128026 178659 86238 -275225
15605 338706 -41895 127802 -36430 61091 1893 35972 -180477 -273926 -90405 -321985 -85576
15593 -312046 164709 69101 94921 -207487 -82258 -1014 269975 -87605 35381 318093 -140205
15581c2079j44937a8984q6574e0418j63869d8560n489P765o9281B56423D4594
15569a04928C89044f8586F8234b13917a9701n4379B18632q3646j2669i9591k21899
15558c21490G8932R0032J0789e7601G3175A7148a72869k8039A54994G5625b39157
15546C0792J07388O0089O8501j20139J03155j11407c08694N3713R2167F4879e2211
15534A98666c1446B54O241J51472a4224B69012a41409E94987e2152B09746a21147
15522A63030a3419A45931C775N033Q147L12352b83928a17058N7440A83432M4866
15511B28298m5391J7366D7258P6603A1698J2962c9988k46506B67244b2598k50952
15500b73550G4697J02761m3222a09024b2130A6442b01384B87851r1517c8439B31603
$$ plain form
15581 -32079 -177016 -18984 -105558 -50418 -214287 -48560 -54049 -46284 -115565 256423 44594
15569 -104928 389044 -68586 68234 -213917 -19701 -74080 218632 134986 122317 -99591 -321490
15558 -321490 78932 168964 179753 -57601 73175 17148 -172869 -200908 154994 75625 -239157
15546 30792 138180 198269 266770 146631 249786 138379 -308694 -254981 -162814 64879 -52211
15534 198666 -31446 254 6495 157967 -14224 269012 -141409 594987 -52152 209746 -121147
15522 163030 -13419 145931 3775 8808 16955 329307 -283928 -117058 -59618 183432 228298
15511 228298 182907 200273 47258 123861 11698 24660 -39988 -286494 267244 -22598 -273550
15500 -273550 74697 177458 134236 -109024 -22130 16442 -201384 287851 196334 -38439 231603
15488A56516o4404l0354J3734j9007a96129C98378I6232G071K65373a10832E70905
15476A06786K7341L69036P0547a8817C47476A3489J75491o6526a23137e3244H5608
15464C2287K55068a23424F2235J54528H4172J79838a470b02A29221a14617L5090
15453g9527A51541e5277E7813J99752J3628J48695j41728A26312J1354K52219
15443C89885J72967M95130l68284k31929j85549D2883A5522G355K84368J05579
15433C97302c25053a21408D2769a63418F3454i2580G5726O0633C5731R49c648
15421G1570a7341k43047C50894b11920d1513F1894a51548E6465a00950j13733
15411b14683A28730K06954A08509O0390E7253f1304J13F3514M4530e7229D7968
$$ plain form
15488 156516 92112 61758 75492 56485 -196129 398378 96232 7071 272444 -110832 570905
15476 106786 134127 503163 573710 -18817 347476 13489 188980 122454 -123137 -53244 85608
15464 32287 287355 -123424 62235 216763 84172 264010 -1470 -202 129221 -114617 -79527
15453 -79527 151541 -55277 57813 257565 271193 419888 278160 126312 137666 389885
15443 389885 562852 1057982 689698 457769 272220 42883 15522 7355 291723 397302
15433 397302 -325053 -121408 42769 -163418 63454 -92580 75726 136359 35731 36680 -3648
15421 71570 -17341 -260388 350894 -211920 -41513 61894 -151548 56465 -100950 -214683
15411 -214683 128730 335684 108509 168899 57253 -61304 -61191 63514 108044 -57229 47968
15399b55413a06032B9158K79122e809k29125A08650K861a66613b3974A6841R2002
15388A08843O1605c4609j61447M9629B25282a42482A56481a66962A75498p5951
15378I9547c5873n3759j2156E08163B30220j12930k2090L87070A0884a29127B44110
15366e8822A10173a99986A13571h1667a1845A35381o0771L3622l3820K2551D6712
15354D6624O5826K2133K27195A64027a60815e0362k52657c7893G1220K94865A68014
15342H776M1859N762O840K50941E7862J98355o9814a45176F383c1512B21849I7304
15329C45445b7002A11028Q0345i3480a0778A34391p391j8259Q9180G2379k0572
15318E1807J82822a72187D28407A54806g5034H5634J73776a27161E03576A64058
$$ plain form
15399 -255413 -106032 29158 308280 -5809 -234934 108650 111511 -166613 -23974 16841 108843
15388 108843 170448 -34609 -196056 -146427 225282 -142482 156481 -166962 175498 99547
15378 99547 -35873 -89632 -101788 508163 230220 117290 95200 482270 10884 -129127 244110
15366 -58822 110173 -199986 113571 -81667 -11845 135381 74610 108232 74412 96963 46712
15354 46624 112450 134583 361778 164027 -160815 -50362 -303019 -37893 71220 366085 168014
15342 8776 50635 56397 63237 314178 57862 256217 186403 -145176 6383 -31512 221849 97304
15329 345445 -27002 111028 191373 -93480 -10778 134391 127000 108741 197921 72379 51807
15318 51807 234629 -172187 428407 154806 -75034 85634 259410 -127161 503576 164058
15307B32934l0298A7242N9480G124b24459A73239J6817a90102B03151E4668B4922
15295A10265I575M6926a29790B2708C488K13782k6504a79951H8831a11837H622
15283f6866j78828L0334A7833J90044a07122K06m5038A89746K685O7967i5268
15271d08139h7344C09126k4887G796a25643A04627k6453J63072G7987M14123g1279
15259b50960J7128A63867N7321E8576a9014k8887J6881j21809B00996g2546A92828
15247B07443m8860L4093A9803O49820N52134P20402o97922O70216q91331C27767
15236A0308J53587M8207G1193e0893F9962K75801f6243C08940a06864j36508j35374
15225c78746A59970a02946A05822g7617B57558a36392D8325c86431b4731l93347
$$ plain form
15307 232934 202636 17242 76722 7124 -224459 173239 190056 -190102 203151 54668 24922
15295 110265 9575 56501 -129790 22708 3488 217270 190766 -179951 88831 -111837 8622
15283 -66866 -245694 -215360 17833 207877 -107122 -106916 -151954 189746 192431 260398 -95268
15271 -408139 -87344 309126 284239 7796 -125643 104627 78174 241246 77987 492110 -71279
15259 -250960 -233832 163867 221188 58576 -19014 -47901 -31020 -152829 200996 -72546 192828
15247 207443 158583 192676 19803 669623 1221757 1942159 1244237 1914453 1023122 327767
15236 10308 163895 212102 71193 -50893 69962 345763 -66243 308940 -106864 -243372 -378746
15225 -378746 159970 -102946 105822 -77617 257558 -136392 48325 -386431 -24731 -418078
15215d18078K05591A89822J01003H751P0156R6839a3208j75059f8681A38029n42
15204A37487a98698D1714L0070a18383B06247J8283O1336a14612A26019L6373
15194A62392e9813A31080m1060c6957j07302B69078E6571J8037J1627a60794c4955
15182a24651A0385K25711f5351k4378B62242a37377k17196Q9245g3660j50730
15172b24390C21419r1337L8076a56288e8104B96768r4619R6338b6225A79188n3301
15161A25887a70314H6498b4155I5361K91510P9722b74129e8477G2488e3422k11982
15150b65404A87910K40575e3019J4935k9522P01k25379E9203J06640o7522B7627
15138i267A27683b06963G9041J33543a35796J5092B07096a00903k45050a8076
$$ plain form
15215 -418078 -212487 189822 290825 8751 78907 175746 -13208 -188267 -68681 138029 137487
15204 137487 -198698 41714 71784 -118383 206247 224530 285866 -114612 126019 162392
15194 162392 -59813 131080 90020 -36957 -144259 269078 56571 74608 86235 -160794 -34955
15182 -124651 10385 236096 -65351 -89729 262242 -137377 -354573 -265328 -73660 -224390
15172 -224390 321419 230082 268158 -156288 -58104 296768 202149 298487 -26225 179188 125887
15161 125887 -170314 86498 -24155 95361 386871 466593 -274129 -58477 72488 -53422 -265404
15150 -265404 187910 428485 -53019 -38084 -67606 -66905 -292284 59203 165843 98321 27627
15138 -9267 127683 -206963 79041 212584 -135796 -120704 207096 -100903 -345953 -18076
15127H6008R6575J23696N7568b2841r9062A28237N5649G9856b11972A46561J46641
15116B93202Q760K90536k80712m255L5936j34033H7698J36551L2775h3357p4590
15105a57947C3164L13946I3345g7468A99041J6843O3935a07670H6135A7680K21182
15094B38862a66212B24863F3935B2704J81657N6057I4213h286C14586K05111B13969
15082f9270r7714C2533O3355M5544k5588L7208P9824C9201a34466A81104a87322
15070B5793P2681D1504J9396a9172A36534O3385b19913B88096e1713a7370F30833
15058C14171n3843J03641A70820J31588O2784j104a1841A55232L79503F6058J11743
15047A77801k9503L6345M5463J57537j09734b5062I2029J84228Q079D1394L81170
$$ plain form
15127 86008 182583 306279 363847 -22841 -121903 128237 183886 79856 -211972 146561 293202
15116 293202 301962 592498 311786 307531 343467 209434 87698 224249 257024 -83357 -157947
15105 -157947 33164 347110 93345 -77468 199041 215884 279819 -107670 86135 17680 238862
15094 238862 -166212 224863 63935 22704 204361 260418 94213 -8286 314586 519697 213969
15082 -69270 -166984 32533 95888 141432 115844 153052 232876 39201 -134466 181104 -187322
15070 25793 98474 41504 60900 -19172 136534 199919 -219913 288096 -51713 -17370 630833
15058 314171 260328 363969 170820 302408 365192 364088 -11841 155232 534735 66058 177801
15047 177801 148298 184643 230106 387643 277909 -25062 92029 276257 284336 41394 422564
15036D22564a7161B07186J6864n7209L9732J38569J62653K01923k47790H6999
15025F62580k32666K2542J43587A04809d820E73571j79829J59929A33044K46346
15015C79390P711k2443A348K19707L194L9383B3664J00527L90043j63086m1262
15004C09886L3514R6142A76928J71728q2523J95460A99349k3789J39672K07471
14994E22703j62779A32913J85229M04741A86387M43497B26201J40259j34717L26925
14984E58668k68854j9006M9125K66731j18205K97781k35859j73994N239Q4269
14974D45895J3119q1708J43771K86215l02039M6871j49746j93024J51341l8118
14964C22577P8799M64o3692L9189L1243o5556F5116K3488M82966P6322D8178J33553
$$ plain form
15036 422564 -17161 207186 224050 166841 206573 345142 507795 709718 461928 86999
15025 662580 429914 452456 596043 104809 -4820 573571 393742 553671 133044 379390
15015 379390 387101 364658 1348 221055 224249 263632 23664 124191 514234 351148 309886
15004 309886 343400 439542 176928 348656 266133 461593 199349 175560 315232 522703
14994 522703 359924 132913 318142 722883 186387 629884 226201 366460 231743 558668
14984 558668 289814 270808 319933 586664 468459 766240 530381 356387 361626 445895
14974 445895 459014 377306 521077 807292 505253 552124 402378 209354 360695 322577
14964 322577 401376 401840 338148 377337 408580 343024 65116 88604 571570 647892 48178 181731
14952A81731a19147D19480j19353l1341K61947B49556k1297J59456J82423J48561
14942G18699k62831d301A83628L94618P0118e1471E06603K26080B59738O23354
14932H83092C60909L79969J4550k7360K38790K7508R1200n122l1627k16951K32626
14921A064492k01810N1249M44723J78726J59095K14978m42206l06973l16863J57672
14911A003083m70916N696k45216a46374E65112m1750j81673G8170L89737k3753
14901D44154o6589o8497A48548J56987K37772B66974J7197J77701j24566J68263
14891E05569C4550N12865K44K21807k18510J63030k66821Q8687B09891O13185
14881H23076l64498J27791B42527N20095B39103K0943L0588L05635k98045q5129
$$ plain form
14952 181731 -119147 419480 300127 268786 530733 249556 228259 387715 570138 718699
14942 718699 455868 -4301 183628 578246 648364 -51471 506603 732683 259738 883092
14932 883092 360909 740878 755428 728068 966858 994366 1085566 1080444 1048817 831866 1064492
14921 1064492 862682 913931 1358654 1537380 1696475 1911453 1469247 1162274 845411 1003083
14911 1003083 532167 537863 292647 -146374 565112 523362 341689 78170 467907 444154
14901 444154 377565 309068 148548 305535 543307 266974 284171 461872 337306 505569
14891 505569 34550 547415 547659 769466 550956 713986 447165 535852 209891 823076
14881 823076 458578 586369 242527 762622 239103 260046 290634 596269 298224 213095
14871B13095J4738K82449A27469O01843k40778j64954K63082m5841J02033j59637
14861D83217o1642J16134B08159L19824o2852A96519L1535L35322A48491K50591
14851C99082p0192l6932J51886r3621l8059J66023O44905l01669J7300N7099K95959
14840A191781m21382J90142J08983j25539L941k57409J71069l23426n0746K25193
14830G12607C20417L01055k49075M51858l93194R076k3786Q6062q6119L74513
14820G90807k31921j726K05422B54446K81000q2470J3532n9023j27769M50694
14810G30410k35664K85186k64340J4799J28448K80097N7749j4881l26038M4896
14800G00662p6778K69493j53276J9791j31149J39123l79995K88468r9618B41203
$$ plain form
14871 213095 227833 510282 127469 729312 488534 323580 586662 540821 642854 483217
14861 483217 421575 537709 208159 527983 465131 196519 228054 563376 148491 399082
14851 399082 328890 291958 443844 350223 312164 478187 1123092 821423 838723 895822 1191781
14840 1191781 770399 960541 1069524 943985 947926 690517 861586 538160 487414 712607
14830 712607 320417 621472 372397 824255 431061 440137 416351 502413 416294 790807
14820 790807 558886 557160 762582 254446 535446 452976 466508 407485 279716 730410
14810 730410 494746 779932 515592 530391 658839 938936 996685 981804 655766 700662
14800 700662 623884 893377 740101 759892 628743 767866 387871 676339 576721 241203
14789F75139O1138J55826j41230j50275m0178j93368K86501l4345K1159P5276
14779G15643l12944j150J80076A92435M18711K78180o8809j1316k14573k15038
14769C79590J89693A38206M00855L82639m42443J85573j95915K13004l04400j39342
14759B38177J14466L3931J36077p5655K30951j98530Q8802Q7890j66478K98658
14749G88289l42313q6060j41240P0114M0114k8695A40674M22702q12J78493k99982
14738D41075J83569J61774k48353J36737M3865j2637L27579l62615j95681L75799
14728H51112K8347Q3032J23344K9223M18146O3988k87466q3087k41758J1689l0267
14717I66303r0852O2352q0344R6651o6636l46636L60709n7206l6160J88990j30928
$$ plain form
14789 675139 736277 892103 750873 600598 560420 367052 653553 619208 640367 715643
14779 715643 402699 401549 581625 192435 611146 889326 820517 809201 594628 379590
14769 379590 569283 138206 539061 921700 479257 664830 468915 681919 377519 238177
14759 238177 352643 386574 522651 446996 677947 479417 568219 656109 489631 788289
14749 788289 445976 359916 218676 288790 328904 300209 140674 563376 562564 741057 441075
14738 441075 624644 786418 538065 674802 718667 706030 1033609 670994 475313 851112
14728 851112 879459 962491 1085835 1115058 1533204 1597192 1309726 1226639 984881 996570 966303
14717 966303 875451 937803 857459 954110 887474 540838 901547 844341 808181 997171 866243
14706H66243J0333J92614N4905J2449k22098J25149N42066m25202j18680J04960
14696A142739Q8041l69194Q5698r9451K2008J55676k930k16871O8421r8781M027
14685G79383j14664L54286l56575J57206N843j73922j08776K09543j54057N5561
14675F53828L08807Q180j99821J13766q1481n3518L28812l53228K11367K62348
14665A199060k33721k71845K25928k02352J58583R730J55637j11182Q415n9604
14655H78649L32093m99887M09439m8672q3612L66550j77210p0846K86537k61723
14645A131318p0169K59358m61250p4429M15439o3943l49057J7514L48508l26923
14635H26366L36244q011j52083q7941j26002J04374J99467o5908K85395j82042
$$ plain form
14706 866243 876576 1069190 1124095 1136544 914446 1039595 1581661 1156459 1037779 1142739
14696 1142739 1230780 861586 947284 847833 869841 1025517 1022587 805716 874137 775356 779383
14685 779383 664719 1019005 662430 819636 825479 651557 542781 752324 598267 653828
14675 653828 962635 970815 770994 884760 803279 749761 1078573 725345 936712 1199060
14665 1199060 965339 693494 919422 717070 875653 885383 1041020 929838 938253 878649
14655 878649 1210742 710855 1120294 1071622 988010 1354560 1177350 1106504 1393041 1131318
14645 1131318 1061149 1320507 859257 784828 1200267 1136324 787267 804781 1153289 826366
14635 826366 1162610 1154599 1002516 914575 788573 892947 1092414 1026506 1311901 1129859
14625A129859j99829K44450j08555J49980p4091K9905K22588m3797j80053j43198
14615A027259K87339m22037J69728K06581q0314M1171j20569K33100k94035K37417
14605A285640M2490r0947k14421L40555k21307J69577j01893N40452l97023K5956
14595A379079m56908M91863J83689l89361K47445R9348k99652K45785L43426j83329
14585A661385j08501L14862r8302j58811k3084L4177J49652k22316l4036K17370
14575A732396M2688j26467n2136L17218m1371l63292K88366K76580K2832j26825
14565A969989l20728M71917J33210J37308j83592k73769M08422r3153L39113P7220
14555B665937M85732j70151J34992L26570R71513Q63032J151583M085406O954231
$$ plain form
14625 1129859 930030 1174480 1065925 1215905 1141814 1171719 1394307 1350510 1170457 1027259
14615 1027259 1314598 892561 1062289 1268870 1188556 1229727 1109158 1342258 1048223 1285640
14605 1285640 1328130 1237183 1022762 1363317 1142010 1311587 1209694 1750146 1353123 1379079
14595 1379079 922171 1414034 1597723 1208362 1455807 1555155 1255503 1501288 1844714 1661385
14585 1661385 1552884 1867746 1769444 1610633 1587549 1621726 1771378 1549062 1515026 1732396
14575 1732396 1775084 1648617 1596481 1913699 1872328 1509036 1797402 2073982 2096814 1969989
14565 1969989 1649261 2121178 2254388 2391696 2208104 1934335 2342757 2249604 2588717 2665937
14555 2665937 3151669 2981518 3116510 3443080 4414593 5277625 6429208 10514614 17468845
14546A7468845J7515673N772185A6741815G167205l547913p43406k3271Q25833
14538C678448J495153k504347o65660m34465J38525p8k36085L25754l56212M67253
14528A908286N7675j6963J21258r9880j10801K07928J309K6398J24737k40457
14518A979490j86197M41311r0365J07880Q3963k27357L4338q4457J23856J76220
14508B358682J060M70457n18365L55674j9578l70106K15499J24756M06171k52014
14498B772236O6910J72152p5551K09869k86429k10148J09204L49950k72883L89439
14488C224749j32841j13563K39102j2198j30112L72225n17286K77693J03953j1770
14478C299952L62184n03351L42603J32283k721o444l258l4740L7309L59741j40235
$$ plain form
14546 17468845 34984518 40756703 16741815 7167205 3619292 2875886 2852615 3678448
14538 3678448 5173601 2669254 2003594 1569129 1707654 1707576 1471491 1797245 1441033 1908286
14528 1908286 1965961 1948998 2070256 1970376 1859575 2067503 2068812 2095210 2219947 1979490
14518 1979490 1793293 2234604 2144239 2252119 2336082 2108725 2143063 2058606 2182462 2358682
14508 2358682 2359742 2830199 2311834 2667508 2647930 2277824 2493323 2618079 3024250 2772236
14498 2772236 2839146 3011298 2935747 3145616 2859187 2649039 2758243 3108193 2835310 3224749
14488 3224749 3091908 2978345 3217447 3205249 3075137 3447362 2930076 3207769 3311722 3299952
14478 3299952 3662136 3158785 3501388 3633671 3630950 3624506 3621248 3586508 3623817 3983558 3843323
14467C843323L33956l18322J45896N7103j07155K38322J75037k76441N16217j06613
14457D501323l57168K54243j75981K88461p5691M23445q0061k30904K73588K12352
14447E033607j16490j04426L24711j18784J09523k45612N46900l5291m16358M01510
14437E379290J75252j16581L77861l56292J23791K47404J97568r0892J87338j72453
14427E952286L43362J61410Q0208K99074j22223L52273o9415M36811Q7949k44366
14417G277369O0576K29797j06893J76758Q0367j32092K59142N4961L96828q5042
14407H211771K17567N98539L4794j17980N0447j45129K92433K25130l7772J41942
14397I471742K7185L44605J97792r9983N86130j23561L36278R9873M23801j02169
$$ plain form
14467 3843323 4177279 3858957 4004853 4061956 3954801 4193123 4368160 4091719 4607936 4501323
14457 4501323 4144155 4398398 4222417 4510878 4435187 4858632 4778571 4547667 4821255 5033607
14447 5033607 4917117 4812691 5137402 5018618 5128141 4882529 5429429 5394138 4977780 5379290
14437 5379290 5554542 5437961 5815822 5459530 5583321 5830725 6028293 5937401 6124739 5952286
14427 5952286 6295648 6457058 6537266 6836340 6714117 7066390 6996975 7433786 7521735 7277369
14417 7277369 7337945 7567742 7460849 7637607 7717974 7585882 7845024 7899985 8296813 8211771
14407 8211771 8429338 9027877 9062671 8944691 8995138 8850009 9142442 9367572 9329800 9471742
14397 9471742 9498927 9843532 10041324 9941341 10527471 10403910 10740188 10840061 11263862 11161693
14387A1161693J47187N64559K89120k90113N49842K91063N57374L3644k55401
14378A3048968J94115K11886K25085L81745J52266N11926M92616J57027N2875
14369A5428509P43454J77011M30979K49705K99355O18755n4328O33251J04360
14360A8631051N39041L18575K65462P10985N06492J90244J074558L27433M59817
14351B3023658M60002O08982O06099P81935L63841Q02628P40917N05071J174004
14342B9067137N15051Q71216R46398P51075L93789J447494R82803R20754J013159
14333C6908876J183629O71671J606581J325546J306080J046165J691458J090498
14325D6830504J927810J321360K045550J681401J550397J950284J961826K030129
$$ plain form
14387 11161693 11308880 11873439 12162559 11872446 12422288 12713351 13270725 13304369 13048968
14378 13048968 13243083 13454969 13680054 14061799 14214065 14725991 15218607 15375634 15428509
14369 15428509 16171963 16348974 16779953 17029658 17329013 17947768 17893440 18526691 18631051
14360 18631051 19170092 19488667 19754129 20465114 20971606 21161850 22236408 22563841 23023658
14351 23023658 23483660 24092642 24698741 25480676 25844517 26647145 27388062 27893133 29067137
14342 29067137 29582188 30453404 31399802 32150877 32544666 33992160 34974963 35895717 36908876
14333 36908876 38092505 38764176 40370757 41696303 43002383 44048548 45740006 46830504
14325 46830504 48758314 50079674 52125224 53806625 55357022 57307306 59269132 61299261
14317F1299261K152640K718244K708619K442811K320103L335200L055856L496414
14309H3529148L320176L495685L992329L420274M691101M566299M768808N046718
14301A16830538N509851N567111O335540O395310O647183P466236P277028Q242190
14293A70270987Q652055Q931174R574659J0011539J0692264J1478382J1621038
14286B41232098J1954050J2703129J2990777J3426161J3634744J3966094J4008120
14279C33915173J3910130J3744581J3157982J2244655J0935323R340392O249802
14272D13498038J983377K233990K473327L76793l167781l068211m898269o576040
14264D02855224q471959j0337123j2094438j3377222j4151981j4339500j4650635
$$ plain form
14317 61299261 63451901 66170145 68878764 71321575 73641678 76976878 80032734 83529148
14309 83529148 86849324 90345009 94337338 97757612 102448713 107015012 111783820 116830538
14301 116830538 122340389 127907500 134243040 140638350 147285533 154751769 162028797 170270987
14293 170270987 178923042 187854216 197428875 207440414 218132678 229611060 241232098
14286 241232098 253186148 265889277 278880054 292306215 305940959 319907053 333915173
14279 333915173 347825303 361569884 374727866 386972521 397907844 407248236 413498038
14272 413498038 415481415 417715405 420188732 420565525 417397744 414329533 409431264 402855224
14264 402855224 394383265 384046142 371951704 358574482 344422501 330083001 315432366
14257C15432366j4652138j3933247j4351260j3209518j3030337j2532362j1905072
14250B21818432j1236871r594887r459264r803286r238065q210843p593318p945552
14242A48736346o937887o807268o570656n447493n523215n231743m659865m711050
14234A02847169m343436m384177l686778l051098l418585l926763l082264k644423
14226G4309645k888072l016485k507756k287405k127566k042035k207407j849142
14218E5383777j882325j968139j596065j461759j096996j430601j536537j550500
14210D2860855j448617j042364j295299m75292j024361j712249q61433r99710
14202C4001530j152940m87516o29042r33208j104883n46633p12561j004785k06280
$$ plain form
14257 315432366 300780228 286846981 272495721 259286203 246255866 233723504 221818432
14250 221818432 210581561 200986674 191527410 181724124 172486059 164275216 156681898 148736346
14242 148736346 141798459 134991191 128420535 122973042 117449827 112218084 107558219 102847169
14234 102847169 98503733 94119556 90432778 87381680 83963095 80036332 76954068 74309645
14226 74309645 71421573 68405088 65897332 63609927 61482361 59440326 57232919 55383777
14218 55383777 53501452 51533313 49937248 48475489 47378493 45947892 44411355 42860855
14210 42860855 41412238 40369874 39074575 38599283 37574922 35862673 35001240 34001530
14202 34001530 32848590 32361074 31732032 30798824 29693941 29147308 28434747 27429962 27223682
14193B7223682p22856r22748r93974k3375o65755m11644n37550p99858l28341
14184B1817581o99042j62862r32538J45074q84333R5139p34452l23564p63218
14175A7557785j52674p0720m41830k50563p09729j67314k16313m49817j40930
14166A4957895j36303k99687k23366m59792k27985l26621j96287k0208L5669n80536
14156A2522779j77179J61n62889J35095m14394m67809K74707j15934n87556j11899
14146A0495082J15177m59032j46588j15052k14271K28822m82459J3184k77851
14137I157012q3668l4718O452l75237m8399o4238p3475m34144J58368k32511J0798
14126G986240m47649P1084l14093J43824m5259n8016j19559j56593Q9226o53291
$$ plain form
14193 27223682 26500826 25578078 24584104 24560729 23894974 23483330 22945780 22145922 21817581
14184 21817581 21118539 20955677 20023139 20168213 19283880 19379019 18644567 18321003 17557785
14175 17557785 17405111 17334391 16892561 16641998 15932269 15764955 15548642 15098825 14957895
14166 14957895 14821592 14521905 14298539 13838747 13610762 13284141 13087854 13067646 13103315 12522779
14156 12522779 12345600 12345761 11782872 11917967 11503573 11035764 11310471 11194537 10606981 10495082
14146 10495082 10610259 10151227 10004639 9889587 9675316 9904138 9421679 9434863 9157012
14137 9157012 9073344 9038626 9045078 8669841 8621442 8557204 8483729 8049585 8207953 7975442 7986240
14126 7986240 7538591 7609675 7295582 7439406 7394147 7336131 7216572 7059979 7149205 6495914
14116F495914N34589q5833l89807n3711J67783l48872Q14n35539N5303K34912
14106F075553k47189j7100r2835j77652J70875l1693k79557k03800L45770l5789
14096E506583l19694o5349N95Q8404j97680k93337m2337K20027J36451j96226
14086D837437J78441q4200k05721k8005j52576R7796R9190k20511l3403l59509
14076D128939o6069J23008k76681K73317r8972j17897n3855J02240o0510q5651
14066C867869J8362j58926J44054P8400l17885O0636K49903j51696j18678K4503
14056C696542j77753J43932m19780M59266k11751j23508J57421k11080m13776
14047B899513L13011j70454M95675J10036m76519M1478k146J75942o59748L08116
$$ plain form
14116 6495914 7030503 6944670 6554863 6501152 6668935 6320063 6320877 5785338 5840641 6075553
14106 6075553 5828364 5811264 5718429 5540777 5711652 5679959 5400402 5196602 5542372 5506583
14096 5506583 5186889 5121540 5122135 5210539 5012859 4719522 4677185 4897212 5033663 4837437
14086 4837437 5015878 4931678 4725957 4697952 4545376 4643172 4742362 4521851 4488448 4128939
14076 4128939 4062870 4185878 3909197 4182514 4083542 3965645 3911790 4014030 3953520 3867869
14066 3867869 3886231 3727305 3871359 3949759 3631874 3692510 3942413 3790717 3672039 3696542
14056 3696542 3518789 3662721 3242941 3702207 3490456 3366948 3524369 3313289 2899513
14047 2899513 3212524 3042070 3537745 3647781 3171262 3212740 3210594 3386536 2726788 3034904
14037C034904j02196P377L9398k672k5789K56521m1031k00509P0945k24148j61474
14026B651326L12373j44270k50252P4123Q7730m88941J77682K67924k46217M4719
14016B486197j86253J3232J15984l1542k46723l8150J57137Q1892m3740p9482
14006B228552k4225j92784l1873J95056q1080m9826l4746l2808Q3529k8152K5786
13995B057429J45451m02245K31144j25477K08112L98043P06655K301402M854168
13986A0374682J3980174K1336761k0366543j2126113n560011j973628j185809
13979D479513k53254p97615k67453j08673m70911K82915n03167J88734j19454
13970B430635l16568L90974j11729l11995K59712k76721j34321K97669j07302
$$ plain form
14037 3034904 2932708 2940085 2979483 2976811 2951022 3207543 3166512 2966003 3036948 2812800 2651326
14026 2651326 2963699 2819429 2569177 2643300 2731030 2242089 2419771 2687695 2441478 2486197
14016 2486197 2299944 2313176 2429160 2397618 2150895 2112745 2269882 2351774 2308034 2228552
14006 2228552 2204327 2011543 1979670 2174726 2093646 2043820 2009074 1976266 2059795 2031643 2057429
13995 2057429 2202880 1800635 2031779 1906302 2114414 2512457 3219112 5520514 10374682
13986 10374682 24354856 45691617 25325074 13198961 7638950 5665322 4479513
13979 4479513 4226259 3428644 3161191 3052518 2581607 2864522 2361355 2550089 2430635
13970 2430635 2114067 2505041 2393312 2081317 2341029 2064308 1929987 2227656 2120354
13961B120354j93059Q7297Q9711L2436l19550L92962l96753p5060K72057m33650
13951A576745L53773k56284J07958P0658m4040p8824R7156k694R7951l79784j72453
13940A370162K21830J64240K34867m81798k9935L7781p1788R0431j77878L88468
13930A746380j13441q6819L28761k72949l34751L65134j49344l08701k0958J56785
13920A310097J60770j9234L3647l7085j60185K8402K59152k65340J58633k3667
13910A445190k42362K04695r1950K86177r7977j05990N4539k94163K63368K09771
13900A631298n78656K02738J71675L5923l43980J75152O3012R6433m76850L32190
13890A308935k74465L06602j06643j62827K49870n20955M58623j97017J02712
$$ plain form
13961 2120354 1927295 2014592 2104303 2136739 1817189 2210151 1813398 1738338 2010395 1576745
13951 1576745 1930518 1674234 1782192 1852850 1808810 1729986 1827142 1824448 1922399 1542615 1370162
13940 1370162 1591992 1756232 1991099 1509301 1479366 1517147 1445359 1535790 1357912 1746380
13930 1746380 1632939 1546120 1874881 1601932 1267181 1632315 1482971 1174270 1153312 1310097
13920 1310097 1470867 1451633 1485280 1448195 1288010 1316412 1575564 1310224 1468857 1445190
13910 1445190 1202828 1407523 1315573 1601750 1503773 1397783 1452322 1158159 1421527 1631298
13900 1631298 1052642 1255380 1427055 1462978 1118998 1294150 1357162 1453595 976745 1308935
13890 1308935 1034470 1341072 1234429 1071602 1321472 800517 1259140 1062123 1164835
13881A164835j83524J78641k082J51689k71836L69134q9901j78656k05988K37543
13871A169855j73890K44576m56345M51266J91594n76509R3368j13223J78628m5083
13861I64237j74772M14020r0155j87787L4718k5543J94066k32266l1260P8245
13851I43503J76100l7366l27729r232l49427N26342P3913j3898j74454Q7442k57719
13840F37475L58230j87708K78129E42478O14913m5553k43302L72902m12543k27534
13830F01361L18759j0954L0604j8970j27250L36357k81505K63734m16971L15446
13820A010611l40884K18287O5749j47166J68099j38693j21690m0971K31680k0954
13810H84068C76669J86646L03379l46381K13611K11670l9978k40898k30315L78221
$$ plain form
13881 1164835 981311 1159952 1157870 1309559 1037723 1406857 1316956 1138300 932312 1169855
13871 1169855 995965 1240541 784196 1235462 1427056 850547 943915 830692 1009320 964237
13861 964237 789465 1203485 1113330 925543 960261 934718 1128784 896518 865258 943503
13851 943503 1119603 1082237 754508 745276 395849 922191 996104 982206 807752 895194 637475
13840 637475 995705 807997 1086126 542478 1157391 1111838 868536 1241438 828895 601361
13830 601361 920120 909166 939770 920800 793550 1129907 848402 1112136 695165 1010611
13820 1010611 669727 888014 953763 806597 974696 836003 714313 673342 905022 884068
13810 884068 376669 563315 866694 520313 733924 945594 905616 664718 434403 812624
13800H12624O2079J0994j88220J50285k93960K73052J22882j06845K22338m43924
13790F21305J58426j70041J82781l27841J49067n8400o225N0236J10091M9082
13780G58481o8157J11845l7831P9419l14476K03661Q886k729j05977J83337q9826
13769G26633j64937j84565L80806J10779B73798O52672k05236k1979l19343J89013
13759E68925J46116l5423j68682J76754M3899k93263j97748N34421l70417L13772
13749G18354j19048L5542B72720K75162J09912k04067J33461k37578K68282j92278
13739D25614l1408J48895J42850k1677Q9440j54143J52892k18556J91924B45022
13728F54080C18211J87404l9988M87777C56437A54792L67268j80917M06554l0113
$$ plain form
13800 812624 874703 885697 697477 847762 553802 826854 949736 842891 1065229 621305
13790 621305 779731 609690 792471 464630 613697 555297 549072 599308 709399 758481
13780 758481 690324 802169 764338 843757 529281 732942 741828 739099 633122 816459 726633
13769 726633 561696 377131 757937 868716 273798 926470 721234 699255 379912 568925
13759 568925 715041 679618 510936 687690 731589 438326 240578 774999 404582 718354
13749 718354 599306 634848 272720 547882 657794 453727 587188 349610 617892 425614
13739 425614 394206 543101 685951 664274 753714 599571 752463 533907 725831 245022
13728 654080 318211 505615 465627 953404 356437 154792 522060 341143 747697 717584
13718G17584k67113K05369j67596L16128k06309J28862k06914M7058j60984j53407
13708B52678J94604j82298K53069k56931N97907B83963M67618j91628k59837L4239
13698C34355J21759R572L9929J88333k2034r8486o5768j86111K19279l7366L2244
13687E35706j44223N5896O1058p6755B09413p9576O795O06264k31500K4118N6753
13676E92267k30036M33164k97543j80137K89652m3187M14k0369p2097j69865J85720
13665D87983A83283L84401B14309J77406q302r949J21587C1804L39155N5587M7412
13654D73958j37470M34442B61344K95296j84719R6073L479J73079L9181j82037
13644E01696R6843k05121q3392J08232l0938J07738A88583J06322l0708Q1947
$$ plain form
13718 717584 450471 655840 488244 804372 598063 726925 520011 567069 406085 252678
13708 252678 447282 264984 518053 261122 859029 283963 751581 559953 300116 334355
13698 334355 456114 465686 505615 693948 671914 573428 507660 321549 540828 503462 535706
13687 535706 391483 447379 508437 431682 209413 129837 136632 742896 511396 535514 592267
13676 592267 362231 795395 497852 317715 607367 564180 564594 544225 472128 302263 487983
13665 487983 183283 567684 214309 391715 383413 373464 495051 31804 370959 426546 473958
13654 473958 336488 770930 261344 556640 371921 467994 471473 644552 683733 501696
13644 501696 598539 393418 310026 418258 387320 495058 188583 294905 264197 346144
13634C46144J40332N7755j31234M8739K41026p7913k63563j61791K95948j33871
13624C61572n0255n3357J28728J6580A67642K1699L27599n805B30160m3064L04298
13613D91394A10721L00793o780j7524j30967j922N8368L6941J42095B19172L59659
13602E78831K8746P598B18081j6461L21685J59409B75068L444m2320h9887h456
13590D01752j16431J92873J27066k63659K3134l6933q2081M33979B77114J40830
13580D17944j23353K33559k14893Q6480J08406k14168j10089p8210O9239j6029
13570A58886j9738L63141D8174O30613j85581l0905j37023J54320M7765p7260
13560D50103A85379P7165J65067B938L82999b5511C98490p9212A07042Q0811m4351
$$ plain form
13634 346144 486476 544231 412997 461736 702762 624849 361286 199495 495443 361572
13624 361572 311317 257960 386688 403268 167642 189341 516940 511135 230160 187096 491394
13613 491394 110721 411514 404734 387210 256243 254321 312689 349630 491725 219172 578831
13602 578831 607577 615175 218081 201620 523305 682714 275068 278512 236192 -89887 -8456
13590 401752 285321 478194 605260 341601 364735 327802 245721 679700 277114 417944
13580 417944 294591 528150 313257 399737 508143 293975 183886 105676 174915 158886
13570 158886 139148 502289 48174 678787 493206 462301 325278 479598 527363 450103
13560 450103 185379 262544 427611 2938 385937 -25511 398490 319278 107042 187853 143502
13549A43502J85864A16712K19023O599R7554j56525J65971q1922A79533K18812
13539C98345j68900p785K28174j04491L2768a00613F5391M24173j84929A38136
13528D90251B41548J00731g618D88825A9995K44542j0701G0853J68957o515b2403
13516D58740O4985j1445k55896L8873D6684L88535A87282K46061j46035A36924
13505B65918N7450d3750B60273j4190G4207c6816B11308l4113c0594C94839j34195
13494B60644j11251K19188A40631O9971d7436F8538J17497Q3627o2828L55330
13484E62164j83744m8244B1356M79768c2591B68168a7981C22160j18835K71853
13474D75178k18231n4930L97713k19916o22J40805A50205K14426l6360J28929
$$ plain form
13549 143502 329366 116712 335735 342334 439888 283363 449334 367412 179533 398345
13539 398345 229445 221660 449834 345343 378111 -100613 65391 489564 304635 138136
13528 490251 241548 342279 -7618 488825 19995 264537 253836 70853 239810 233295 -22403
13516 458740 523725 512280 256384 295257 46684 435219 187282 433343 287308 136924
13505 265918 323368 -43750 260273 246083 74207 -36816 211308 177195 -30594 394839 260644
13494 260644 149393 368581 140631 210602 -47436 68538 186035 269662 206834 562164
13484 562164 378420 330176 21356 501124 -32591 268168 -17981 322160 203325 475178
13474 475178 256947 202017 599730 379814 379192 519997 150205 364631 328271 457200
13464D57200a9821E26365F8536M22447A29947J27152r5650K31684I4173L0590
13454A24763j7742c1454A79620a26967F8049J82936L8304A19174B259a18753D11396
13442C02866l7178m7932c8063F23335A54098E2952J66713l3920q2508K77685A56943
13430E27329F0128J30385E0907O3690c8696F05006A73785n258J31770o5283a66099
13418d6844F8295a05613B66979L20940B92250j12594o5614c6919A96897G7615
13407h5021A23601K99895O9012k41140O373A23007J10516p1941J14010a58511
13396B8516J53210n2170i3969G8778J36780p2854g2118B64837k9525o8044G8169
13384B97961O5681j43874n8322C7595K62672A01534K8512n705a06408C16670I4981
$$ plain form
13464 457200 -19821 526365 68536 490983 129947 257099 161449 393133 94173 124763
13454 124763 107021 -31454 179620 -126967 68049 250985 289289 119174 2259 -118753 411396
13442 302866 265688 217756 -38063 623335 154098 52952 219665 185745 103237 380922 156943
13430 527329 60128 190513 50907 114597 -38696 605006 173785 168527 300297 235014 -166099
13418 -46844 68295 -105613 266979 587919 292250 179656 114042 -36919 196897 77615
13407 -85021 123601 423496 492508 251368 257741 123007 233523 161582 275592 -158511
13396 28516 181726 129556 -93969 78778 215558 142704 -72118 264837 235312 167268 78169
13384 297961 363642 219768 161446 37595 300267 101534 130046 124341 -106408 316670 94981
13372G2859j3473O4415K74768K27719B59398J08121j36227K05600o1804J07103
13362D82191o5044A57065J43138O6521j72951Q9088M6153L4886j29153R0127O5263
13351C90137J11341C6035L33890N3105A47785P6829J927K83163e339E8973K47695
13340C06668J110p130o8562D5433L21349j47803M37380k54576A7899L02536A6628
13328a46937E07873j99997q9530a89928B81541l5260A5460M50981A43948c3658
13317C88475e6870A83889O9987m3069J71355B6890N99197A62017C2924J52426
13307A85350p1539K5218F9307A8017k747J01939K6404o3411a13948A43468J17398
13296B60866j06879D2751J17177F0008N6502O5133J33546j23572p8351J17432
$$ plain form
13372 72859 59386 123801 398569 626288 259398 367519 231292 436892 375088 482191
13362 482191 417147 157065 300203 366724 193773 282861 329014 363900 234747 324874 390137
13351 390137 501478 36035 369925 423030 147785 224614 226541 509704 -5339 58973 306668
13340 306668 307778 300648 232086 45433 366782 218979 656359 401783 17899 320435 16628
13328 -146937 507873 307876 218346 -189928 281541 246281 15460 466441 143948 -33658
13317 388475 -56870 183889 253876 210807 382162 26890 626087 162017 32924 185350
13307 185350 113811 139029 69307 18017 15270 117209 143613 80202 -113948 143468 260866
13296 260866 153987 42751 159928 60008 116510 181643 315189 191617 113266 230698
13286B30698P6438a14381l2230q0827A52500m5495Q7991a88827A28282J7476a07304
13274E9214b9238o198B08481h4631D26213G2903h6091A68157K23854j86191a3615
13262A25534P3729L8719H9486J40561D4278K52030M111j13440a56116c377A42384
13250E8201j4720M007j3694d6619B92287n0731k4245H6657J62845J42827a88985
13238C66027A69173H3554k7302R7486a48723A81502d703A35620B3953K71430n4114
13227B41269G9693J45871h4036A52006b41428L3851A16473b96397A23509a02663
13216e790j65613A73476K517p0757a10391B6954J32069P4504i0997F0206b68580
13204B38933p1304l877m5017L41185j86392c5276B28329B1021a09244C7027J48964
$$ plain form
13286 230698 307136 -114381 -146611 -227438 152500 107005 194996 -188827 128282 145758 -107304
13274 59214 -29238 -35436 208481 -84631 426213 72903 -86091 168157 392011 205820 -13615
13262 125534 199263 237982 89486 230047 44278 296308 300419 186979 -156116 -3377 142384
13250 58201 43481 47488 33794 -46619 292287 241556 217311 86657 249502 392329 -188985
13238 366027 169173 83554 56252 153738 -148723 181502 -4703 135620 23953 295383 241269
13227 241269 79693 225564 -84036 152006 -241428 -207577 116473 -296397 123509 -102663
13216 -5790 -171403 173476 175993 105236 -110391 26954 159023 233527 -90997 60206 -268580
13204 238933 167629 163752 118735 459920 273528 -35276 228329 21021 -109244 37027 185991
13193A85991f4321F5939L2576a24624A81895a7801B10242J42044B2113K83257
13183C05370h1578B29187B16K44089c3755H4662i9509B74867j26158J6484c55661
13171A09716e6394O027A43520K16036C957O905J77327J23373I3282J72247i9567
13159a0157B48363b69024A26968n4414b37128A332J38829i4063a5413a659A33038
13147E0849J7312J2099J9488b6358A40516O3657a08503A45841L314D5630J49588
13136A95218M6287a57399o6090a11149D7334a09783J6244A22790c4968o7058k6281
13125a28307A5980R7430n5348c18553B03630B6624f2260A34620d160r9005c3819
13113a64377C09472b09227B18256r1266j4642K34705a62462P4326A33553a26274
$$ plain form
13193 185991 -64321 65939 98515 -124624 181895 -17801 210242 352286 22113 305370
13183 305370 -81578 229187 216 244305 -33755 84662 -99509 274867 148709 165193 -355661
13171 109716 -56394 -50367 143520 359556 3957 10862 188189 311562 93282 265529 -99567
13159 -10157 248363 -269024 126968 72554 -237128 1332 140161 -94063 -15413 -1659 133038
13147 50849 68161 80260 99748 -26358 140516 204173 -108503 145841 149155 45630 195218
13136 195218 241505 -157399 -223489 -111149 47334 -109783 -93539 122790 -34968 -102026 -128307
13125 -128307 15980 113410 58062 -318553 203630 26624 -62260 134620 -4160 -103165 -33819
13113 -164377 309472 -209227 218256 126990 112348 347053 -162462 -88136 133553 -126274
13102G8775K8234J63442b49384i757C900a79390H5622J27042A02417a89505c2887
13090A33360b04697d4452J8673C4599i6649B57763k7046J71652k01099b94899
13079B08002m6991K74569H802J46838b83306A37233e9581A89455a4944B69701
13068e4475r619C72583r2147A26385D8919a06306a4819C1437O2962C9219F303
13056a31960c2189A40978C747M08356C3548L8594N6669K6970m0449b47112h6609
13044A00609N539a56865F4408K62264e8755A35765b4747A22683c6377j25213G5910
13032I6169l6891L34605j33583q4064J27392j47165a14860B87278j1744F2440
13021a84538A24746a88849I6236O4902b4687A29832J4198J28169j22678N8651
$$ plain form
13102 78775 107009 270451 -249384 -9757 3900 -179390 85622 212664 102417 -189505 -32887
13090 133360 -204697 -44452 -25779 34599 -96649 257763 230717 402369 201270 -294899
13079 208002 161011 435580 8802 155640 -283306 137233 -59581 189455 -14944 269701
13068 -54475 -64094 372583 280436 126385 48919 -106306 -14819 31437 94399 39219 6303
13056 -131960 -32189 140978 3747 412103 33548 72142 128811 155781 115332 -247112 -86609
13044 100609 106148 -156865 64408 326672 -58755 135765 -24747 122683 -36377 -161590 75910
13032 96169 59278 393883 260300 176236 303628 156463 -114860 287278 275534 62440
13021 -184538 124746 -188849 96236 161138 -24687 129832 144030 272199 149521 208172
13011B08172d1852b184k78981B60515J27150q5205k4703E8327J5155h362o1426
13000f9788C02846I9489a02731j46746B24063I9930J88256G1915K2588a06755
12989A52581n7263b7869M747q8658A87101a96878g0104A18635J68718A9368f9009
12977E56028d5605B6381L5059a55056A55459J42265G9388N37216B17425j04561
12967A12864f1115B35874A3211h5476n7681j3529B11524i9196I391b5112B50527
12955h2948r6694C42991a3237p7394B02692q9443d4834j89293Q7727B3627c60850
12943A43971a56560F8144K13750d16239H8809C6794e6862o1271A29412c4060k54296
12932b88356A20866b29099i6810j29134o9379E340g1264C071c46223g5247J6925
$$ plain form
13011 208172 -41852 -2184 -281165 260515 387665 302460 277757 58327 73482 -8362 -69788
13000 -69788 302846 99489 -102731 -249477 224063 99930 288186 71915 94503 -106755
12989 152581 95318 -27869 -23122 -111780 187101 -196878 -70104 118635 287353 19368 -69009
12977 556028 -45605 26381 61440 -155056 155459 297724 79388 616604 217425 112864
12967 112864 -61115 235874 13211 -85476 -143157 -156686 211524 -99196 9391 -25112 250527
12955 -82948 -179642 342991 -13237 -90631 202692 113249 -44834 -234127 -146400 23627 -360850
12943 143971 -156560 68144 281894 -416239 88809 36794 -56862 -118133 129412 -34060 -288356
12932 -288356 120866 -229099 -96810 -225944 -295323 5340 -71264 3071 -346223 -75247 -58322
12921e8322A26080L5305J7830C6787b2177n4116n0072k16982f4541k40529B5052
12909B9683J5733K31433n0819B4307g3290H3283M2170b07361A08326n3118J58515
12898B13723B3990b00138B82618J4566e2820p3901e4051C90004j01458a345D4169
12886a92339A62873a16466j0009A39559a5897A21222a0595E5279J63379M4407
12876B63065A04875O0722J9730J26036j13033o1607g5715F6764O6363K5845f9424
12864a2166A08374O0606H2627J41207A06366h9850q1760L8679A62227R1098F9756
12852B07464i5982A55032F088J64851b48078I6933j1225A2534d05312D1077h174
12840a55683L3177K9637A60203b92529h1964A0532J71228j3561K9565C8088a64994
$$ plain form
12921 -58322 126080 161385 179215 36787 -22177 -76293 -126365 -343347 -64541 -305070 25052
12909 29683 45416 276849 226030 24307 -73290 83283 125453 -207361 108326 55208 213723
12898 213723 23990 -200138 282618 297184 -52820 -126721 -54051 390004 288546 -1345 44169
12886 -192339 162873 -116466 -126475 139559 -15897 121222 -10595 55279 218658 263065
12876 263065 104875 165597 185327 311363 198330 136723 -75715 66764 133127 158972 -69424
12864 -12166 108374 168980 82627 223834 106366 -89850 -171610 -132931 162227 253325 69756
12852 207464 -95982 155032 6088 170939 -248078 96933 85708 12534 -405312 41077 -8174
12840 -155683 -122506 -92869 160203 -292529 -81964 10532 181760 168199 197764 38088 -164994
12828a13479C1532a31589B35741A00925C3455J07055e0047j84391A88061e8795
12817c4066l26664N8741g2450j27640E8717K40368G606c620B13237R310J57843
12806C80390E7855g2730j36015A89342L03794G6067k5382P264Q2399b16137G9734
12794b09675N5860B5946J148a69187B57504e4585j41085B35958i9407k20965O3065
12783b57307I0911m4613O1546b25375L0003A16071R7755a20901g895l41989g824
12771A90836G053a88125d3567q2478D6930P3344D2883J16459g2339i980j12393
12760a22373j88930I302f2055k8335c8930F113c7481A9595h719A1409d54393A20888
12747B01482a93921A07520D7208K01830I0334f7448G0537b10766H4485m2016K08672
$$ plain form
12828 -113479 31532 -131589 235741 100925 33455 140510 -50047 -234438 188061 -58795
12817 -34066 -360730 -301989 -72450 -200090 58717 299085 7606 -3620 213237 222547 380390
12806 380390 57855 -72730 -208745 189342 493136 76067 50685 57949 140348 -216137 79734
12794 -209675 -153815 25946 27094 -169187 257504 -54585 -195670 235958 -99407 -320372 -257307
12783 -257307 90911 46298 107844 -225375 -195372 116071 213826 -120901 -7895 -349884 -7824
12771 190836 7053 -188125 -43567 -126045 46930 120274 42883 159342 -72339 -9980 -122373
12760 -122373 -311303 9302 -62055 -90390 -38930 6113 -37481 19595 -8719 11409 -454393 120888
12747 201482 -193921 107520 47208 249038 90334 -67448 70537 -210766 84485 42469 251141
12736B51141b07632A62545b50132D5971J17239a95995L9734a2785A59055c05525
12725B15632b02253P5432j6916F9252P0130b23049i2122F141a76847m4885F5423
12713a17315B80637L0008k2915H7402J41387b2657G8185J45889F2524J82519A13604
12701b38367A01198a33073r2889A06047n2324J38980n3289b11180j04322G7697
12690A51417m5102D2208b023r6880j80340C06011a59798B44085J8357A14277P3146
12679A87423a46840C6346R5819c3650F6835a54623O8960j68926h9754n0741L4953
12668a05542j9371N9494j8390B25897i041D04512j94115P5750q880P1081c13294
12656A07512f3524C01783C6789K82821J09611I960c8673j27503P3786A53846i405
$$ plain form
12736 251141 -207632 162545 -250132 45971 163210 -195995 -156261 -12785 159055 -305525
12725 215632 -202253 -126821 -143737 69252 139382 -223049 -92122 6141 -176847 -221732 65423
12713 -117315 280637 310645 287730 87402 228789 -22657 78185 224074 62524 245043 113604
12701 -238367 101198 -133073 -225962 106047 53723 192703 139414 -211180 -315502 77697
12690 151417 106315 42208 -2023 -98903 -279243 306011 -159798 244085 262442 114277 187423
12679 187423 -146840 36346 132165 -33650 66835 -154623 -85663 -254589 -89754 -140495 -105542
12668 -105542 -124913 -65419 -83809 225897 -9041 404512 210397 286147 277267 348348 -313294
12656 107512 -63524 301783 36789 319610 429221 9960 -38673 -166176 -92390 153846 -9405
12644a85755F1381M4111j6065J81049a20802j60566D7591J96311a32204C23509
12633a4525B3486L8826a14472A78380D0425M63575A14818Q1548K64748g7829B05102
12621b8579G8095K65735a59797k2634c9237A53782j7200h8525m1821C97497c11777
12609A27250e2730l6783C11249A3469R4500J40062j07873J34053A07760a1192
12598A59443D5337N04401b37582k4806B83884d3955a2601E5855R5488b94075f6394
12586a12555K4967j41781I3928a43543L8202n975A4195b68872G7125a16281B03733
12574B02259M7000E2900C510b67241e299l46190A4430a65500F8923N2454P3219
12563A94596b88982o4769C2062j3506c00788A05900O2756b02612m2635a3959r8067
$$ plain form
12644 -185755 61381 105492 89427 270476 -120802 -281368 47591 243902 -132204 323509
12633 -14525 23486 62312 -114472 178380 40425 504000 114818 196366 461114 -77829 205102
12621 -28579 78095 343830 -159797 -182431 -39237 153782 136582 -88525 -130346 397497 -311777
12609 127250 -52730 -89513 311249 13469 107969 248031 140158 274211 107760 -11192
12598 159443 45337 549738 -237582 -262388 283884 -43955 -12601 55855 151343 -294075 -66394
12586 -112555 -87588 -229369 93928 -143543 -105341 -111316 14195 -268872 77125 -116281 203733
12574 202259 249259 52900 3510 -267241 -5299 -351489 14430 -165500 68923 121377 194596
12563 194596 -288982 -353751 32062 18556 -300788 105900 168656 -202612 -245247 -13959 -112026
12552a12026A30854a19635F2484J47015A782M9214b27595F3744J7714K23508a70002
12540h4091M190H8302a03245J5613j71882c0640B2293N6321a8138A21778J55997
12529B77775a99675A5805J83406F5750J00027c351A05087b38724c3157p7741D6917
12517B9684L50119A37945Q7076M4914a58605b32j09487A76042h0174A979M181
12506F160b11600G4851K97903j05130J34523j80581F8961M6295b60088A93715
12495H8273Q0078b0842B96917F5423K7831f3087b7259J1544A10529d07281a33312
12483F5500b76078i9829D810J86670D6664M1018C8495L85361A46755k8466L2652
12472A50941K36295A45379J87258A4953J01421a3666B0940a00532D1208a87798
$$ plain form
12552 -112026 130854 -119635 62484 209499 1782 50996 -227595 63744 81458 304966 -170002
12540 -84091 -79901 88302 -103245 -87632 -259514 -30640 22293 78614 -18138 121778 277775
12529 277775 -199675 15805 199211 65750 165777 -3351 105087 -238724 -33157 -110898 46917
12517 29684 379803 137945 225021 269935 -158605 -232 -109719 176042 -80174 1979 6160
12506 6160 -211600 74851 372754 267624 402147 221566 68961 115256 -260088 193715
12495 88273 168351 -20842 296917 65423 93254 -63087 -27259 -15715 110529 -407281 -133312
12483 65500 -276078 -99829 4810 191480 46664 87682 38495 423856 146755 118289 150941
12472 150941 387236 145379 332637 14953 116374 -13666 20940 -100532 41208 -187798
12461c7903k383k31542F8816f714E508b28553C25201e61386A12229e1152B2235
12449A38780F1684b37036k70982E9867A1632L7162L23932A04707a60286j2936
12439a73222q5945e9429I4397a86790I0842g2794K2532J8488j61299a5370k43540
12428b58910a09261B04497f3319b1844k93424A9586J82534A3931J6856d7541p2400
12417a19941c5134k22655C11581A30544J9682a05523c5124j28113A1845J10654
12407A22499D5691i1200J9197m2688A78616a76640C67068b35160G5657j4209h3742
12395d9562j04556A50792K0977a10638N2672E7827b34881D5296i9833A90651D0146
12383B6925R3782L2809K976D1137a08231B05694h8723b4014j51070A04444F095
$$ plain form
12461 -37903 -40286 -271828 68816 -6714 5508 -228553 325201 -561386 112229 -51152 22235
12449 138780 61684 -237036 -508018 59867 11632 48794 372726 104707 -160286 -173222
12439 -173222 -259167 -59429 94397 -186790 90842 -72794 -50262 -31774 -193073 -15370 -258910
12428 -258910 -109261 204497 -63319 -21844 -315268 19586 202120 13931 30787 -47541 -119941
12417 -119941 -35134 -257789 311581 130544 150226 -105523 -35124 -163237 11845 122499
12407 122499 45691 -91200 -72003 -114691 178616 -176640 367068 -235160 75657 61448 -83742
12395 -49562 -154118 150792 171769 -110638 -57966 57827 -234881 45296 -99833 190651 40146
12383 26925 120707 153516 156492 41137 -108231 205694 -88723 -24014 -175084 104444 6095
12371A65828j9474K35287j76165J30461A49957K36789a41975M5988B76517D0992
12360c74700a50058G3906K403R2595a11345j73944k58190a43773A74836m0665
12350A34171a4449B40748c739B28612a51015B64108H6607a33160j8807N4584A46122
12338C40659B4764N3401M0436e2922l3627A92499D1289J2679J5839P7141K8103
12327A75051C8207K45710A04198D1696J37693J1462J77014a7750o8500j01566
12317a87816B64902H7362k920L40845a7892C24631i1218b4657B26052J14426D3195
12305B68066H6310b9617F7898k9895J46150D2706L4307N0770i0997p3991E4352
12293a68534B5175L01944B0806g8786A755a0840I8308M9221F7529J55021j00571
$$ plain form
12371 165828 146354 381641 205476 335937 149957 386746 -141975 -95987 276517 40992
12360 -374700 -150058 73906 76309 168904 -111345 -285289 -543479 -143773 174836 134171
12350 134171 -14449 240748 -3739 228612 -151015 264108 86607 -133160 -151967 -97383 146122
12338 340659 24764 78165 118601 -52922 -86549 192499 41289 53968 69807 146948 175051
12327 175051 38207 283917 104198 41696 179389 190851 367865 -17750 -86250 -187816
12317 -187816 264902 87362 84442 425287 -17892 324631 -91218 -24657 226052 340478 43195
12305 268066 86310 -29617 67898 38003 184153 42706 77013 127783 -90997 -164988 54352
12293 -168534 25175 327119 20806 -78786 1755 -10840 98308 147529 67529 222550 121979
12282A21979a67201a2754E14380A17288k0189c9343B65694p1497e2658H5610g4288
12270A50117E0573P1521N1352k2700p0093J19408B1541b78680a22763I5631K9984
12259A25615f0637k18050B76356d21951C73144l2856j05841J98812a793B29361
12248I9572f4A57678e34l9j8196d20A31545M0710J21372b4129n3264o8432C26877
12234I8829l8074K06566e0668E9693i6974a1753B0538K25352J00144o3025c78086
12222A6293K11059F6920e8050B13068J46091L9496A03399K99451j50319R6130
12212C48661A55874D7899a88758A73379K24058A4448L23125b30241A25805K68357
12202C94162A13942K09261A56723K08496A62632D0003L56436G0173M51789A91624
$$ plain form
12282 121979 -167201 -12754 514380 117288 97099 -39343 265694 194197 -52658 85610 -74288
12270 150117 50573 122094 173446 150746 80653 200061 21541 -278680 -122763 95631 125615
12259 125615 -60637 -278687 276356 -421951 373144 340288 234447 433259 -1793 229361
12248 99572 -64 157678 -534 -573 -18769 -420 131545 172255 293627 -24129 -77393 -145825 326877
12234 98829 60755 267321 -50668 59693 -96974 -11753 20538 245890 346034 283009 -378086
12222 16293 227352 66920 -58050 213068 359159 398655 103399 402850 252531 348661
12212 348661 155874 47899 -188758 173379 397437 14448 337573 -230241 125805 394162
12202 394162 113942 323203 156723 365219 162632 40003 396439 70173 521962 191624
12191E24361I4116K09136J35252A51914J7814L40829B19939J01818J09743F8777
12180D95017j33309j79410L32897n8121G9944L12030J72654A83410b27969B66475
12169D07479A37171M36704k47570a18431G9118L07511j86786J7768N3796e8831
12158b8576G8641J42432H5798K58278o6869A06981L23495D3455Q8460a66139H1109
12146a13780B47220o8527b09607A23616J68164F3690J14675a61256A73686a99042
12135B37802B5638h881r991A44366J26227K09525b0445A22030J43853I5767N8790
12124A54557Q7992n407n8133J14589A45510J809F9258b04010O3530B10263I7045
12112C07740K0771G644K45922A04757j7871l480K06839I8069Q3981a06012B01726
$$ plain form
12191 524361 94116 303252 438504 151914 169728 510557 219939 321757 431500 68777
12180 495017 361708 182298 515195 457074 79944 391974 564628 183410 -227969 266475
12169 407479 137171 573875 326305 -118431 79118 386629 199843 217611 271407 -58831
12158 -28576 78641 221073 85798 344076 277207 106981 430476 43455 131915 -166139 81109
12146 -113780 247220 178693 -209607 123616 291780 63690 178365 -161256 173686 -199042
12135 237802 25638 -8881 -18872 144366 270593 480118 -20445 122030 265883 95767 154557
12124 154557 242549 237142 179009 293598 145510 147319 69258 -204010 -140480 210263 97045
12112 307740 328511 7644 253566 104757 86886 83406 290245 98069 182050 -106012 201726
12100a08346F9895a21715C54674E9167M0270g0440H8165O0885b4299A8752K64167
12089B82919d33068A64658J72324j34075M13J04336j49023B2484J94781G2086
12078A11283J60131a58729N5261D5836J32935l0714k1478O2749J05475n3299k2152
12067B19352n5022A3193c27904A14196K60161f4475I0820P2924p571g0893B3631
12055h2071B59008j4018k2138D9377K52870A47242a91452A61998b72568I816M36674
12044D46490b5801F1866L21625a53392f9323B23482p5811c6840A80653a13376
12033a51643B94704D9869b4382p2680j73428A43107J74030b51637j15277I2890
12022C1917a94743A46991o4051J51811a49191m7997R3199G2660j0469a39860A53499
$$ plain form
12100 -108346 69895 -121715 354674 59167 99437 -70440 88165 149050 -24299 18752 282919
12089 282919 -433068 164658 336982 202907 203320 307656 158633 22484 217265 72086
12078 111283 271414 -158729 -103468 45836 178771 148057 126579 189328 294803 241504 219352
12067 219352 164330 13193 -327904 114196 374357 -64475 90820 163744 156173 -70893 23631
12055 -82071 259008 244990 222852 49377 302247 147242 -191452 161998 -272568 9816 446490
12044 446490 -25801 61866 383491 -153392 -69323 223482 147671 -36840 180653 -113376
12033 -151643 294704 49869 -24382 -97062 -270490 143107 317137 -251637 -366914 92890
12022 31917 -194743 146991 82940 234751 -149191 -197188 -103989 72660 62191 -139860 153499
12010A1413c85781a72925A08012j3206J05461f6546B24462j7755a18281J3181
12000a05100J8953M1985o9810k10662E1661c97888C87170A32178b71859f3871
11989h667j98865l38054e7257p2666A87547g8755A5111b09451m179P0132j05490
11978b48988i3962A07084a8714D8088a01566B44933b58222C8403a1009j42272
11968a53281D8096i8432I5776B0785J78192a4877m7328A1838J2924e4770B1876
11956b21141q1607A40014p663a53756l8902O4116e4159A34130J77586N7671A07286
11944a02689o0183j2695P7283m8704B59552a99848c1865q7505j87461D01586j87826
11933B13760a05693B45974q2312b15922A80945c5211A12664l9359Q9180a2772
$$ plain form
12010 11413 -385781 -172925 108012 94806 200267 -66546 224462 206707 -118281 -105100
12000 -105100 -86147 -44162 -113972 -324634 51661 -397888 387170 132178 -271859 -63871
11989 -8667 -207532 -545586 -57257 -129923 187547 -78755 15111 -209451 -213630 -143498 -248988
11978 -248988 -93962 107084 -18714 48088 -101566 244933 -258222 38403 -11009 -153281
11968 -153281 48096 -98432 95776 20785 198977 -14877 -62205 11838 24762 -54770 21876
11956 -221141 -302748 140014 132351 -153756 -192658 -128542 -54159 134130 311716 369387 107286
11944 -102689 -162872 -175567 -98284 -146988 259552 -199848 -31865 -119370 -306831 401586 213760
11933 213760 -105693 245974 163662 -215922 180945 -35211 112664 73305 162485 -12772
11922c28397a03705r8159C5831J61213a99119H5667d5857I212J48799a26399B3030
11910a14394A8164L8739b07085A29584a00439k47245E6812K09699a56630A50005
11899c14655g655j76535o9862G1638b24539a03570I0592D788K8575L8736J47965
11888B20064c35045B7021b24575B1899c2606n1884j47784j7363i8350O528j47500
11877b39322f322B04769a21611K3633I4567b07652A21649K5616c7848m1015j24028
11866b02891A7367i4699o3756L7950F6503a40483j06019A5954a00892C4835f9249
11854b39648c0316j57667q3158J04532H42a43946M9965b6762l20341n3425B1932
11842a65623d9473r5716N4538B22437e7433A4568K94986A50324b82886P7164f3616
$$ plain form
11922 -328397 -103705 -201864 35831 197044 -199119 85667 -45857 9212 158011 -126399 23030
11910 -114394 18164 56903 -207085 129584 -100439 -347684 56812 266511 -156630 150005
11899 -314655 -7655 -184190 -254052 71638 -224539 -103570 90592 4788 33363 72099 220064
11888 220064 -335045 27021 -224575 21899 -32606 -84490 -232274 -249637 -98350 -91822 -239322
11877 -239322 -6322 204769 -121611 -97978 94567 -207652 121649 147265 -37848 -78863 -202891
11866 -202891 17367 -94699 -158455 -120505 66503 -140483 -246502 15954 -100892 34835 -69249
11854 -239648 -30316 -187983 -271141 -166609 842 -143946 -93981 -26762 -347103 -400528 21932
11842 -165623 -49473 -145189 -90651 222437 -57433 14568 309554 150324 -282886 -205722 -63616
11830A38109b6617j64359g7808b1985l63006a59203e455k27851C0893N1617B3241
11818A37736a75396C70728c39343R0288a07422B10956a49650e3806j53167q094
11808b15067b5431B02222J65871b5811C8691a87755g8870n3925E3173a07405k08540
11797c15945A08544c17295j7482C23096q1322q7256a84407O416b4197k50106I5521
11785a22922A26368a31103j39422B56176b41702R1837l8342j9835G2075b7944
11774A48797f9975k19539g7744j42253A03357P2069o3880a46121r3329D21352
11763E9785a52823A97144q1436A8644J42429F1412f8283a2815A59429j6871m9096
11752I3462b55629A47065K30867A24439L1201g4938B5909a41809a8151l61262
$$ plain form
11830 138109 -26617 -190976 -77808 -21985 -384991 -159203 -5455 -233306 30893 82510 23241
11818 137736 -175396 370728 -339343 -249055 -107422 210956 -149650 -53806 -206973 -215067
11808 -215067 -25431 202222 368093 -25811 38691 -187755 -78870 -132795 53173 -107405 -315945
11797 -315945 108544 -317295 -334777 323096 241774 154518 -184407 -177991 -24197 -274303 95521
11785 -122922 126368 -131103 -270525 256176 -241702 -149865 -188207 -208042 72075 -27944
11774 148797 -69975 -289514 -77744 -219997 103357 175426 111546 -146121 -239450 421352
11763 59785 -152823 197144 115708 18644 161073 61412 -68283 -12815 159429 142558 93462
11752 93462 -255629 147065 377932 124439 155640 -74938 25909 -141809 -18151 -379413
11742c79413P7023A23154i1654E2625K0093M4037a7084B20815b02134i1103j54012
11731b45115g0553j93730A3857b09176q9387A88399J0208o4426a50040I0322J2579
11720A02901I263J15948c9923G828G89R1688a71576F8483J5341g0312C2096g8727
11707f7167B1617Q2757M6356a94941B85400a77296c0848k13709A28972D6116J21699
11696A67815L714a08636O709b2366j13145j8513E1012e3624A3203K54146n7067
11685B10282I6827a96355B23099b63349R881I2595J54282b77482B53476A02277
11674A44683c41727b1008k8230o4730I7878B9518L37299D7128a76816A25768g6097
11662B52197F7514a71305k1241Q6320B39645O558C7795J25445E591d3148o6657
$$ plain form
11742 -379413 -302390 123154 -91654 52625 72718 116755 -17084 220815 -202134 -91103 -245115
11731 -245115 -70553 -264283 13857 -209176 -298563 188399 198607 134181 -150040 90322 102901
11720 102901 9263 125211 -39923 7828 789 92477 -171576 68483 83824 -70312 32096 -78727
11707 -67167 21617 104374 150730 -194941 285400 -177296 -30848 -244557 128972 46116 167815
11696 167815 171529 -108636 -101927 -22366 -135511 -154024 51012 -53624 13203 267349 210282
11685 210282 96827 -196355 223099 -263349 -253468 92595 246877 -277482 253476 102277
11674 144683 -341727 -21008 -49238 -113968 97878 29518 366817 47128 -176816 125768 -76097
11662 252197 67514 -171305 -192546 -106226 239645 246203 37795 163240 5591 -43148 -109805
11651a09805A89338J85448G4607Q9520K10253C9072K12263b00k98523B18667b83112
11639g022A06803b1233o9037m3080A12759b22704A64677a9083j58647B03595F369
11627A84940a52349D4065J5004N8620A1265M0611B0007K91864C8375N2929a07852
11615a37464l0504m2579b9014A69212g4524A45575M131k8399b46137A83338B8687
11603a17395F9772k7313g0228C2854J47218b69766o6375R8872J11638F7132c7401
11591D6711k665J4138a446j6598A20893N1703d2780a5302q1699A5325J4450b1766
11578A64004K10955H8167k7017Q0028A9924b60171D45h5340D310O7217J33301
11567B04828D5510i4558b1859C04026f317A40579n6005q398J35424b96788E7154
$$ plain form
11651 -109805 189338 374786 74607 164127 374380 39072 251335 -200 -298723 218667 -283112
11639 -7022 106803 -21233 -90270 -133350 112759 -222704 164677 -19083 -177730 203595 6369
11627 184940 -152349 44065 59069 117689 11265 51876 20007 311871 38375 91304 -107852
11615 -137464 -167968 -210547 -29014 169212 -74524 145575 149706 121307 -246137 183338 28687
11603 -117395 69772 42459 -70228 32854 180072 -269766 -336141 -237269 -125631 67132 -37401
11591 46711 44046 58184 -1446 -18044 120893 172596 -42780 -15302 -97001 15325 29775 -21766
11578 164004 374959 88167 61150 141178 19924 -260171 445 -85340 4310 71527 204828
11567 204828 45510 -94558 -21859 304026 -6317 140579 84574 76176 211600 -296788 57154
11555C7764I696a201k5928l9684L1178G9654b32734e4573j09389P9164l20075
11544d04873J45368M678a26747H0733c3910l0535H9321J7033f5075A92989n7508
11533A35481D7472N3404M1927L59390b11784B67076a63328f0576n5099B35084
11522C42440A5836b62353H7499L2425K60813I9495c3309C5791c18051B13005J28043
11511C41048o45a31180A37029a003j48158G4274A4894n959K72644k1559r3895
11500A66125J52324C238K62137a2963A05319K2111L5789M2876C1881J02941N2085
11489A86907h7781A98389R7628d5229B27635J87691e6621a0510A11212a75282
11478a24837A69227C7092L1844R8489L4114q6466m4458J29919p3997m1436h6522
$$ plain form
11555 37764 9696 -1201 -27129 -66813 -35635 79654 -232734 -54573 -163962 -84798 -404873
11544 -404873 -259505 -254827 -126747 80733 -33910 -64445 89321 106354 -65075 192989 135481
11533 135481 47472 100876 142803 502193 -211784 267076 -163328 -60576 -115675 235084
11522 342440 15836 -262353 87499 119924 380737 99495 -33309 35791 -318051 213005 341048
11511 341048 340403 -131180 137029 -1003 -149161 74274 14894 8935 281579 260020 166125
11500 166125 318449 3238 265375 -12963 105319 127430 163219 206095 31881 134822 186907
11489 186907 -87781 198389 296017 -45229 227635 415326 -56621 -10510 111212 -175282
11478 -124837 169227 37092 68936 167425 201539 115073 70615 200534 126537 85101 -86522
11466D38261B02550m5021K58780I8875D5332K26684F9001J00277Q075G6434J74572
11455B51006j17317R4782h3482B20350F1062K66034a56288l09503a41426f0380
11444B65949n385n5250L5297B9223J88364b27940B23232R0036j11892N4496q0888
11433A74984A1074Q468J95448A6329L70931d2859A09675B9188A0215b36648a758
11421a20439H0704J32882m4014F506K35480c18769b0771A32973d9827E9879b87978
11409a73739A44364a09407k81835D6058a1390k1747A12484B0420b03862j4640
11399b18502C03619b73738a33134A45862g5199K7153A54071G30g359E9238a09521
11387A13631J1070c5486A58493J52530j42989n3254C1014K22765A08186a492A9433
$$ plain form
11466 438261 202550 157529 416309 98875 45332 272016 69001 169278 177353 76434 251006
11455 251006 133689 228471 -83482 220350 61062 327096 -156288 -465791 -141426 -60380
11444 265949 260564 205314 240611 29223 217587 -227940 223232 313268 201376 255872 174984
11433 174984 11074 19542 214990 16329 387260 -42859 109675 29188 10215 -236648 -1758
11421 -120439 80704 213586 169572 6506 241986 -318769 -20771 132973 -49827 59879 -287978
11409 -173739 144364 -109407 -391242 46058 -11390 -33137 112484 20420 -203862 -218502
11399 -218502 303619 -273738 -133134 145862 -75199 -48046 154071 730 -7359 59238 -109521
11387 113631 124701 -35486 158493 311023 168034 114780 31014 253779 108186 -1492 19433
11375A50084k882R8181j19612k9904i8622n5965e8483B92665n1433a69945j3379
11364a83324P9232L5953H5152C3012c16805b9825j09167B07719p5970J62413J3829
11353C07991b9914l6459A35894i6458g478k23728M2885F3823B7530K32167e0193
11341A38415e12625F9982c919A76816K61859a43032A26245R2951c35796e9457
11330c72656a42973d7589A60487a49563I894h762m88321C6207b0347c789m8925
11319e2714o2866k99266J83392l8863F843d5935B79561B0255K43642e26779g6494
11307a90870N8194k20387A51616O1926n2847a60268B96202d79987K39566f8472
11296a10018L0202j26292A36371c6474I3679J36881H7157c4588m5336a2743a815
$$ plain form
11375 150084 147202 245383 125771 95867 -98622 -154587 -58483 292665 241232 -169945 -183324
11364 -183324 -104092 -68139 85152 33012 -316805 -29825 -138992 207719 131749 294162 307991
11353 307991 -29914 -66373 135894 -96458 -7478 -231206 -188321 63823 27530 259697 -50193
11341 138415 -512625 69982 -3919 176816 438675 -143032 126245 219196 -335796 -59457
11330 -372656 -142973 -47589 160487 -149563 9894 -8762 -497083 36207 -20347 -3789 -52714
11319 -52714 -115580 -414846 -231454 -270317 6843 -45935 279561 20255 263897 -526779 -76494
11307 -190870 -132676 -353063 151616 213542 160695 -160268 296202 -479987 -240421 -68472
11296 -110018 -79816 -206108 136371 -36474 93679 230560 87157 -34588 -79924 -12743 -1815
11284A44688e8871K5309j5813A58211n4963a76057M6994l8666m606A36182k8939
11273A07243b83915O5931b4636p4154A09069M6952G0226B5431J47645C7762c62430
11261b28568E0353a3573m249A97139a15261j5358O4453K6455D1786M1328b06362
11249h7427E4746M5847c5227J3072m1840I9578g7522E7255b29648B58876l0532
11238B28344a01209k49929a9512q8645C55J1098a21795N4850F9206h3940B55005
11226B82210A38733C158b8303j75394N229g386j13072A9665a89357e9840F5247
11214B66087e4377I6783f27782A38362a5425j12116C4304a29167k61113a75376
11203f8201I2957a79145B7018f378m6779C47659d0916H9828e9190F1027a60377
$$ plain form
11284 144688 -58871 -33562 -49375 158211 103248 -176057 -129063 -167729 -172335 136182 107243
11273 107243 -283915 -217984 -24636 -98790 109069 156021 70226 25431 173076 37762 -362430
11261 -228568 50353 -13573 -17822 197139 -115261 -130619 -66166 -39711 41786 83114 -206362
11249 -87427 54746 100593 -35227 -22155 -63995 99578 -77522 57255 -229648 258876 228344
11238 228344 -101209 -351138 -19512 -108157 355 11453 -121795 -66945 69206 -83940 255005
11226 282210 138733 3158 -28303 -203697 -198468 -7386 -120458 19665 -189357 -59840 65247
11214 266087 -54377 96783 -627782 138362 -15425 -127541 34304 -129167 -390280 -175376
11203 -68201 92957 -179145 27018 -6378 -53157 347659 -40916 89828 -59190 61027 -160377
11191d7327p1357E1894i2229K0131o0353k21595J48691A20135c36981a604m30835
11180d32439a27985c0732a1870k52256B11799p6243e3912H9153b31548g9781B7559
11168I7435P3338m2626d2756j06740c9363k97360b9835H8286a60783h345n4549
11157f2894G9213b24819B39231a70022L9195a2980k1153E6524a52489P1254j67808
11146b49043A38861b61488P5868F9483a06410G424c3294n087B34931e0256A9280
11134H0646c65388J68050A04467L378J9744E664f6845q7893B882L5011J0143Q7343
11122A35379a02952j06574Q4403I6569m5572L05014A44939L26265k01355I5482
11111I6701f3262H2330J50070H7736C0594J60210O4676R516a64057D27121f0048
$$ plain form
11191 -47327 -118684 51894 -92229 -72098 -132451 -354046 -205355 120135 -336981 -1604 -432439
11180 -432439 -127985 -30732 -11870 -264126 211799 135556 -53912 89153 -231548 -79781 27559
11168 97435 170773 128147 -42756 -149496 -39363 -336723 -29835 88286 -160783 -8345 -62894
11157 -62894 79213 -224819 239231 -170022 -130827 -12980 -34133 56524 -152489 -81235 -249043
11146 -249043 138861 -261488 -185620 69483 -106410 7424 -33294 -38381 234931 -50256 19280
11134 80646 -365388 -197338 104467 107845 127589 5664 -66845 -154738 2882 37893 48036 135379
11122 135379 -102952 -209526 -125123 96569 50997 356011 144939 471204 269849 95482
11111 96701 -63262 82330 232400 87736 30594 190804 255480 264996 -164057 427121 -60048
11099A05855K21450c273B27470j08130L15185A45522h9959j88221C76531q9716
11089B86815o7617L9809i7303B14022B624J69899m4705J5886K73959B8150L44674
11078C72824j11914p7774E6183J49363J38625H6873J20044J91917A17280K08050
11068C25330K12434O8488B39189J3620J16256J2997J70746j18316A99625K99897
11058D99522J63069k77062K99659o0803N9983j63969j65452K95888L09298j01807
11048H58326P586Q3358L01346k72788k61691K4226K14454Q9100Q1522m05845K88472
11037A008066k8757J63276J38593m55778l54015L03780r1641K2856o5639K49608
11027H90349D10386P70941k16327M1487j01428o5702q9563k5824O6263L5590K10064
$$ plain form
11099 105855 327305 -3273 227470 119340 434525 145522 -89959 -278180 376531 286815
11089 286815 219198 259007 -97303 214022 2624 172523 127818 143704 417663 28150 372824
11078 372824 260910 183136 56183 205546 344171 86873 206917 398834 117280 325330
11068 325330 537764 606252 239189 252809 369065 382062 552808 434492 199625 499522
11058 499522 662591 385529 685188 624385 684368 520399 354947 650835 960133 858326
11048 858326 865912 949270 1250616 977828 716137 740363 954817 1043917 1125439 719594 1008066
11037 1008066 979309 1142585 1281178 825400 471385 775165 683524 706380 640741 890349
11027 890349 410386 1181327 965000 1006487 905059 839357 749794 723970 790233 825823 1035887
11016A035887m41452l156o6983M38711D05819L98465q818j95995k00446L06069
11006G05094j19673J35385k6574j15289L09650k51100j19725j12886j05537K20807
10996E20152R5929N6646K77139j21166l744j24488J17372J01318p6147j32951
10986G10060j92357M32676J43945n00345K80726p009L2227O0564L03732k92633
10976I71586j4423K95425n1403l7580P04125N1416L17335J44838O9220Q14245
10966C264784K42088j90831M67782k45555J44533p50154k41772q89118L1465l94152
10956A439070J17432q4384m29127O7753K31916m19965J45045K75733E63731K14493
10946G78224J74647k53906j05419j03755k32634L12785k10143A24197J34369o1670
$$ plain form
11016 1035887 594435 591279 524296 963007 405819 804284 795466 599471 399025 705094
11006 705094 585421 720806 694232 578943 888593 637493 517768 404882 299345 520152
10996 520152 616081 672727 949866 828700 824956 700468 817840 919158 843011 710060
10986 710060 517703 950379 1094324 593979 874705 867696 899923 960487 1264219 971586
10976 971586 957163 1252588 1201185 1163605 1867730 1919146 2236481 2381319 2450539 3264784
10966 3264784 3506872 3316041 3783823 3538268 3682801 2932647 2690875 1801757 1833222 1439070
10956 1439070 1556502 1472118 1042991 1110744 1342660 922695 1067740 1343473 563731 778224
10946 778224 952871 698965 593546 489791 257157 569942 359799 124197 258566 196896
10936A96896M1606r3784J3433I687R5731N6145a7853l5328A98479I7037J08535
10925B05572A239b38265E5210J80496e1781B5799Q201K8434M8210K18347a75796
10913A61429b2537P781F0662J05480a97016A24746m2977H729a14307C6148a20991
10901a86340L4835g4975k36980e3779D418J30667b12568C7072J70173c67440E7180
10889b37535A7401b20256D6274J00846B3144J36334e2798F6786Q4367b92543a4091
10877E4074d6229m5025B19623G6360c50202R9182B33043G7603i8763j2886H5635
10865a59607b1319A3355i1353G81Q165f2598D20772a61442A45244C6662K0274
10854E6936g9168h108A54623a3718n6845K2630A83156a9168m9243e85B65617d71446
$$ plain form
10936 196896 238502 144718 158151 9687 105418 161563 -17853 -53181 198479 97037 205572
10925 205572 1239 -238265 55210 235706 -51781 25799 34000 62434 110644 328991 -175796
10913 161429 -22537 -14756 60662 166142 -197016 124746 81769 8729 -114307 36148 -120991
10901 -186340 -151505 -74975 -311955 -53779 4418 135085 -212568 37072 207245 -367440 57180
10889 -237535 17401 -220256 46274 147120 23144 159478 -52798 66786 151153 -292543 -14091
10877 54074 -46229 -91254 219623 76360 -350202 -251020 233043 77603 -98763 -111649 85635
10865 -159607 -21319 13355 -91353 781 8946 -62598 420772 -161442 145244 36662 56936
10854 56936 -79168 -8108 154623 -13718 -70563 -47933 183156 -19168 -68411 -585 265617 -471446
10841d3488D98301c4927A1388b99813R8409B51063h8774A20169n5927k1117i9264
10829A11766a92921B06220I2271L47978A40643p0099h3875B40590a10751j53181
10819b63932j92380B65351h411k1437p3145q2400D1376a2443j7049o0840A223
10807i9086p540j27761R6451A95370J86315j12377b83750b368n1830G91997k31895
10796E60102a35685C3710J05625a75192A220a10085A8047L9010e1979k630E1379
10784B44151a35407C4746h9631A20244d23702G9512J8328c432C5654P7231L9756
10773A52641a41340B55959a97920E36937h946A25037a15542l9027j8418L2468
10763a40519C6328a56242P323N1968o9300O9773a4300m7059A79311b57372j51673
$$ plain form
10841 -43488 498301 -34927 11388 -299813 -201404 251063 -88774 120169 64242 43125 -99264
10829 111766 -192921 206220 92271 440249 140643 70544 -83875 240590 -110751 -263932
10819 -263932 -456312 265351 -8411 -29848 -102993 -185393 41376 -12443 -29492 -90332 1223
10807 -99086 -106626 -234387 -137936 195370 381685 269308 -283750 -2368 -54198 791997 560102
10796 560102 -135685 33710 139335 -175192 1220 -110085 18047 57057 -51979 -54609 51379
10784 244151 -135407 34746 -89631 120244 -423702 79512 97840 -3432 35654 112885 152641
10773 152641 -141340 255959 -197920 536937 -8946 125037 -115542 -154569 -172987 -140519
10763 -140519 36328 -156242 -148919 -96951 -166251 -96478 -14300 -61359 179311 -257372 -409045
10752d09045g5197C7624a54944q1219C6744b36996B47286C5221a57679D3617a73003
10740A57534b22297L2426A89357G5571a58797Q756H265M9400b45110C27158j03802
10729B23356a78144A6584J93528b61203B66627e3106C1578L1005B6486b12366
10718b14878A78466a40431N2453A9410a44907j14179L3643d5316A402a57684F2855
10706b1202A37189C4415N1072h5113J5759n8888k18114Q6970e0276r3463j75824
10695c19563q6948a64275A5639d32595a20515j07920G8790j5499J86729e5372
10684b42944e0901o4303B10104k1414a71586k05369C60093b23910K6975A11449
10673A80499b0792p5920r5911i2994r3577l3536E3046a43209j49123F4805a74952
$$ plain form
10752 -409045 -75197 37624 -154944 -236163 36744 -236996 247286 35221 -157679 43617 -173003
10740 157534 -222297 -189871 189357 75571 -158797 -150041 8265 57665 -245110 327158 223356
10729 223356 -178144 16584 210112 -261203 266627 -53106 31578 62583 26486 -212366
10718 -214878 178466 -140431 -87978 19410 -144907 -259086 -225443 -45316 1402 -157684 62855
10706 -21202 137189 34415 85487 -85113 -69354 -128242 -346356 -259386 -50276 -143739 -319563
10695 -319563 -406511 -164275 15639 -432595 -120515 -228435 78790 63291 250020 -55372
10684 -242944 -50901 -115204 210104 188690 -171586 -376955 360093 -223910 -196935 111449
10673 180499 -20792 -96712 -192623 -92994 -186571 -220107 53046 -143209 -292332 64805 -174952
10661B72514a0877k79173h8653N590B129b818B27149b05304b8361A04939h3009
10649B8651d35741A54629p1518A3036M7681a70462b2931M886m5495H3540b75015
10637f7029j16734A227a92370H4174i9870C1080O6875c5201r4190n0432M1851
10626a37972B01216c22395g3515l7968j9412K0693C8498b66429C7409K58959H6667
10614d1212n6635r5631o250E6426b05109e4450j00182a3507k95224D5193L23032
10603C68225c05516a16160M1914c5393C6172j5654i3283k05129I8076a4653B3139
10591d4558K0574D1845q611J34034h1228B51314F0144a42483p9995Q0423b5816
10579c91770H6292a1076p4307D3201f7988q1110J3966I089J93741F2312i9360
$$ plain form
10661 272514 -10877 -290050 -88653 -83063 2129 -2818 227149 -205304 -28361 104939 -83009
10649 28651 -435741 154629 83111 13036 60717 -170462 -22931 -18045 -63540 83540 -275015
10637 -67029 -183763 1227 -192370 84174 -99870 31080 97955 -35201 -129391 -179823 -137972
10626 -137972 201216 -322395 -73515 -111483 -130895 -110202 38498 -266429 37409 296368 86667
10614 -41212 -97847 -193478 -199728 56426 -205109 -54450 -154632 -13507 -308731 45193 368225
10603 368225 -305516 -116160 -74246 -35393 36172 20518 -93283 -298412 98076 -14653 23139
10591 -44558 -23984 41845 33234 167268 -81228 251314 60144 -142483 -222478 -142055 -25816
10579 -391770 86292 -11076 -85383 43201 -67988 -149098 -135132 9089 202830 62312 -99360
10567b45440k0371B38405c80691c94j31917J8725I7560b20074f5798n5883A17819
10555D2762o520J23546b14834E1654J39339q0956j1232O7170G2018O998L18820
10544C97836a61279I5534N7997i0891H351d8659J8689j06599O0187A3317a680
10532a4058k6295h217j77366A06108b459E898J21169f7894n8236A66578J23900
10521B90478a78113O5347O089A15678L10370d2305j19221L2867A12311J8935b83521
10509b28729P279d6485A75761a3714A12418b6581B17698p3350R5357a67467A16273
10497A60101b22306a8049j3147B08441f1953b177j51756B08530A0805b12807B50274
10485A9478b96124d9874K4473j39942I0900L5651f7647e232C0909a66592Q1191
$$ plain form
10567 -245440 -265811 238405 -380691 -394 -132311 -113586 97560 -220074 -65798 -121681 117819
10555 42762 36242 159788 -214834 51654 190993 110037 98805 165975 72018 79016 397836
10544 397836 -161279 95534 153531 -90891 8351 -48659 -29970 -136569 -76382 13317 -1680
10532 -14058 -40353 -8217 -185583 106108 -2459 5898 127067 -67894 -126130 166578 290478
10521 290478 -178113 -112766 -106677 115678 426048 -42305 -161526 -128659 112311 131246 -283521
10509 -228729 -221450 -46485 175761 -13714 112418 -26581 217698 144348 239705 -167467 116273
10497 160101 -222306 -18049 -31196 208441 -61953 -2177 -153933 208530 10805 -212807 250274
10485 19478 -296124 -49874 -25401 -165343 90900 126551 -67647 -5232 30909 -166592 -85401
10474h5401M0988A51621a5821o4524E08830A95959K3974D9558i9978I8958g809
10462A22353b36003l5903L90B68840O6489C3428J10560a56510n5813L2588p7934
10451b57669A36551b63410i1987A64071c15549a37085D3753e1432C09584a91499
10440B11559a46225K8725K4151p4887B04579b25582A68886N9817G1208a7343k3763
10429d1106A22400a42607j70061A45152b6756A10089a43962N0211l26321c1974
10418a30335r3508g7928F4636J05698B0270J73102k2426a22894D9124c12129B74636
10406A97601o9367a49136b9420l1252k5396j21882d0001j72729j6247h6203H8836
10394b489A79943d0659k7708j93033B21097H9114J26284J22397J41670B5117K76448
$$ plain form
10474 -85401 -44413 151621 -15821 -80345 508830 195959 219933 49558 -99978 98958 -7809
10462 122353 -236003 -271906 -271516 268840 335329 33428 143988 -156510 -212323 -179735 -257669
10451 -257669 136551 -263410 -91987 164071 -315549 -137085 43753 -51432 309584 -191499
10440 211559 -146225 -117500 -93349 -168236 204579 -225582 168886 228703 71208 -17343 -41106
10429 -41106 122400 -142607 -312668 145152 -26756 110089 -143962 -93751 -420072 -31974
10418 -130335 -223843 -77928 64636 170334 20270 193372 170946 -122894 49124 -312129 274636
10406 197601 128234 -149136 -29420 -60672 -86068 -207950 -40001 -212730 -228977 -86203 88836
10394 -2489 179943 -40659 -68367 -261400 221097 89114 215398 337795 479465 25117 301565
10383C01565A35221m6261R7600g5700B88289H7830H373J36045J19064j00278J70466
10372C33670j25409r5371D5799M19267k05563A22416A7987K07914O1505J61501
10362D48907J16331j31740K67341j19834O6451C17978l0671o6133K2470b366E5125
10350C5315J86280k8686J75398J19149K53894k16413k19541l4655m2154o385K22853
10339D45055l9009p7702A40550E9965K70086J44426j02072k6320A06120b6186
10328i6109C58402D5847K30944j10069c25660c4844A17977K18846m7251M37755
10318G27327B90693n8170H6228a70788A71758C6862M81190I6624k0973j7417a21407
10306a85002c0214B51093H8461m165J7289b23979P9701M9271J8562B10095J27210
$$ plain form
10383 301565 135221 88960 186560 -75700 288289 87830 8373 144418 263482 163204 333670
10372 333670 208261 112890 45799 465066 259503 122416 17987 225901 287406 448907
10362 448907 565238 433498 700839 581005 647456 317978 287307 221174 243644 -2366 55125
10350 35315 221595 192909 368307 487456 741350 524937 305396 270741 228587 222202 445055
10339 445055 406046 328344 140550 59965 330051 474477 372405 346085 106120 -26186
10328 -96109 358402 45847 276791 166722 -325660 -34844 117977 336823 289572 727327
10318 727327 290693 232523 86228 -170788 171758 36862 518052 96624 75651 58234 -121407
10306 -185002 -30214 251093 88461 84296 101585 -223979 -144278 -95007 -76445 210095 337305
10295C37305a00494B65264a4267k39948g6441b4085a1226C62587e8389r351j23006
10284a90746h6218m59992b41785B76179j32210b21816k1068B4445b47323A51196
10273c80822A44956a67132p812d9307j48204H4067c50532g1291n3593A2911b5402
10261h5141B76572i6105c1676A99116j8573a44711q2009f6079H8684L9917J92039
10250C20640A23276a04801A91151g5790A04751C0344K28006F9404a04985b5824
10239a64338M4949j2822j58530a07315A82250d6561D4808L97823B438K11936H6182
10227B52786F0633b2755D7740e4719j272l85130A82645b4472D3454a00141E4675
10215b5719n1212J7923E1045Q8312h953A22425d5048A3563J76089a53389B54239
$$ plain form
10295 337305 -100494 265264 -14267 -254215 -76441 -24085 -11226 362587 -58389 -67740 -190746
10284 -190746 -86218 -546210 -241785 276179 143969 -221816 -242884 24445 -247323 151196
10273 -380822 144956 -167132 -174944 -49307 -197511 84067 -350532 -71291 -124884 12911 -25402
10261 -85141 276572 -96105 -31676 199116 180543 -144711 -226720 -66079 88684 128601 320640
10250 320640 123276 -104801 191151 -75790 104751 30344 258350 69404 -104985 -25824
10239 -164338 -119389 -132211 -290741 -107315 182250 -46561 44808 442631 2438 214374 86182
10227 252786 60633 -22755 47740 -54719 -55991 -441121 182645 -24472 43454 -100141 54675
10215 -25719 -76931 -59008 51045 139357 -8953 122425 -45048 13563 189652 -153389 254239
10203A94905c15854R2952c6267p403I5910a07863q5612j17939A10689g2998p2624
10192a45622j52271P1411o3393B77216b18626a00714J0636L756o5816O6468q546
10181i4216D74572A75792a27397J0353l05396A16220a84075a667F1860b9591A2877
10169g5637B5047a62149A15870c14175A30007J84101G3530f5312k21305A30647
10158a11682l12262b1445k09063O3163E5131b2471j02170k26345h5899o9060B74860
10146A20398a90143B05869d8291j10007A64861k761a30381l20247J90719P5976
10136a83933Q3941I8390a87342F3782b13128H5065a38311N697G3230B9382J57460
10125A86842E5971a13744I0461c16755a36890A23800c33179M3869B07646K4864
$$ plain form
10203 194905 -315854 -222902 -36267 -43670 95910 -107863 -193475 -311414 110689 -72998 -145622
10192 -145622 -297893 -226482 -289875 277216 -218626 -100714 -90078 -86322 -152138 -85670 -94216
10181 -94216 474572 175792 -127397 -117044 -422440 116220 -184075 -1667 61860 -29591 12877
10169 -75637 25047 -162149 115870 -314175 130007 314108 73530 -65312 -286617 130647
10158 -111682 -423944 -21445 -230508 -167345 55131 -22471 -124641 -350986 -85899 -154959 274860
10146 120398 -190143 205869 -48291 -158298 164861 162100 -130381 -450628 -259909 -183933
10136 -183933 -99992 98390 -187342 63782 -213128 85065 -138311 -132614 73230 29382 186842
10125 186842 55971 -113744 90461 -316755 -136890 123800 -333179 -289310 207646 232510
10115B32510b25612j9345J11970A32517c25500l7795A36125n969h8586m62787
10105e51373a38311E989R3306a96363L709R2960d6397E3767A1194J98166a37154
10093a63424p669A92778b06139b7873p6495D5840c06172r4224c3184l7593k38782
10082c09559J09345c0921k0394o5776e7422k43396H97b05262R0597j74949B995
10070a47245q0803B1627a86877l4267F2945a0177n4894b423j03124a0552B9099
10058A42163a86860j46157b9536l6609l22851P4848g2445n2845k16183J46989
10048a94484B16467R94n0047F090a57097p443k67922I6481J34261h8085K8107
10037e9978p6992j29688C45897a23424j55175M7988e2482j01567j55450B6420
$$ plain form
10115 232510 -225612 -244957 -132987 132517 -325500 -363295 136125 130156 -88586 -551373
10105 -551373 -138311 5989 99295 -196363 -192654 -99694 -46397 53767 11194 209360 -137154
10093 -163424 -171093 192778 -206139 -27873 -104368 45840 -306172 -400396 -33184 -70777 -309559
10082 -309559 -200214 -30921 -51315 -117091 -57422 -300818 897 -205262 -114665 -289614 2995
10070 -147245 -228048 21627 -186877 -221144 62945 -10177 -65071 -2423 -105547 -10552 29099
10058 142163 -186860 -333017 -29536 -66145 -388996 -314148 -72445 -125290 -341473 -194484
10048 -194484 216467 217461 167414 6090 -157097 -164540 -432462 96481 230742 -88085 -59978
10037 -59978 -136970 -266658 345897 -123424 -278599 -230611 -52482 -154049 -309499 26420
10026a82619A01908J14722F7260d6021B8095b10996g6257A57808c09385J10946
10016a98439J8206j2426d066j86748j3235A33212J30186b69715A62139n8000b23893
10004b60078J25024A9194a2919I5647K66096b1410A2051a31139B4707b83341f3099
9992c4827j7478q5764M9091l3021H1107j6562J94326c87059a44758l83452a46223
9980f3551B36261a61651f0940k78073a26988c6011B38301i9424F7686b96806R9153
9969a97653G8440e3915j62123c4478l47234g8121L3054k95179a44138A31945h6333
9957a57948H4612i0392E7578b45717E6690a34536A414K08669b72355L6103f764
9945A90439A6007Q4592c4283A15415A3134a18723k9582A43283b56r3381M324c4379
$$ plain form
10026 -182619 101908 216630 67260 -46021 28095 -210996 -76257 157808 -309385 -198439
10016 -198439 -180233 -192659 -4066 -190814 -204049 133212 263398 -269715 162139 104139 -223893
10004 -260078 -135054 19194 -12919 95647 361743 -21410 12051 -131139 24707 -283341 -63099
9992 -34827 -52305 -138069 -88978 -121999 81107 64545 258871 -387059 -144758 -528210 -146223
9980 -63551 236261 -161651 -60940 -339013 -126988 -36011 238301 -99424 67686 -296806 -197653
9969 -197653 78440 -53915 -216038 -34478 -381712 -78121 -45067 -340246 -144138 131945 -86333
9957 -157948 84612 -90392 57578 -245717 56690 -134536 1414 210083 -272355 -236252 -6764
9945 190439 16007 100599 -34283 115415 13134 -118723 -148305 143283 -256 -93637 -89313 -34379
9932a42220F5954J56603N6365f6740G0930b9821k22269J339E6587d96663b23473
9920G0496a96633b3994p7172l3974j87186Q8957B09798a93693A24884a4060B51006
9908A09832b20995a2755k65340A3390h2576m3636N3228D2937e2648j3765N927
9897f0486B6007c03017E2631a36285B05164a58753A1346b80851N4283J6576A0354
9885f5237k27607q2691M0725a43702A3367d04514a0575j28072j10275F5880K2343
9874H8223h3576j4380j04517q1242d9932A52421g4918p2943A03995d61342C0412
9862B55178a61212B31578A3378b35736C38259c30400B7267a25212L2673l1949
9852a24488L8846Q878I083a73934C4254K0829c74752j41506E2215k0421a45953
$$ plain form
9932 -142220 65954 222557 278922 -66740 70930 -29821 -252090 -250751 56587 -496663 -223473
9920 70496 -196633 -23994 -101166 -135140 -322326 -233369 209798 -193693 124884 -14060 251006
9908 109832 -220995 -12755 -278095 13390 -82576 -126212 -72984 42937 -52648 -66413 -60486
9897 -60486 26007 -303017 52631 -136285 205164 -158753 11346 -280851 -226568 -209992 10354
9885 -65237 -292844 -375535 -334810 -143702 13367 -404514 -10575 -138647 -248922 65880 88223
9874 88223 -83576 -97956 -202473 -283715 -49932 152421 -74918 -147861 103995 -461342 30412
9862 255178 -161212 231578 13378 -235736 338259 -330400 27267 -125212 -92539 -124488
9852 -124488 -85642 -76764 9083 -173934 34254 55083 -374752 -516258 52215 31794 -145953
9840b14326d3173G3388J23157G1035K36804j17579D843a14409B11132b18278P9150
9829a39128j7822K106e0904j25979A88332i2572b3199r622B36479G3241J9066
9818I2307e29l91408a64475k18356J63050C05238b90275C51144a42341B91796
9807A82318n8323L3277g3512A74530c9146G9610a44468B1408b85145A58885k6546
9796A32339a37999o7532m5393j17824R6861h1129B12152a2169j01411B7156a19629
9784b7831A5013c77592J07085A55854b1466j27967A6403C507a78896j49304R8308
9773b29892a08213k40702j07879d1233j09568j14180J31189J1091j1715C5541
9762A04759a29771N6603B8768a63590C9646c1188j81295L3779f6002m9322l11207
$$ plain form
9840 -214326 -43173 73388 196545 71035 307839 190260 4843 -114409 211132 -218278 -139128
9829 -139128 -156950 -154844 -50904 -176883 188332 -92572 -23199 -32821 236479 73241 92307
9818 92307 -529 -391937 -164475 -382831 -219781 305238 -290275 351144 -142341 291796
9807 182318 123995 157272 -73512 174530 -39146 79610 -144468 21408 -285145 158885 132339
9796 132339 -137999 -205531 -250924 -368748 -271887 -81129 212152 -12169 -113580 27156 -119629
9784 -27831 15013 -377592 -270507 155854 -21466 -149433 16403 3507 -178896 -328200 -229892
9773 -229892 -108213 -348915 -456794 -41233 -150801 -264981 -133792 -122701 -134416 35541
9762 104759 -129771 -73168 28768 -163590 39646 -31188 -212483 -178704 -66002 -115324 -426531
9751d26531J74986E4833B4756c91893Q5673E1046J19941a68354j93838M4660I7548
9739A42498c15548A03078a27711l0839k10121b7428A6232L92619a81237K8191
9729a53046J7380R343m4333k2931J304m6290B74281b74776P3942c3541c148A15652
9716a45294A98737n6568D0823q420A5285a32529a729G7747l424J3791l5699h6427
9703a64056A46677a65450A07759O0412b98167g3630n7264e7771k51151a01142
9692a71925r3853R0770o9169r5842D998a17602A23665d62110f9481o9943A66556
9680a19733j50070A8508h1545j52138D2153a12185a9289A41480b77330M9480F0171
9668b77848A73674a75996j18325A71998l6454c01947A06649P2355h6138k71317
$$ plain form
9751 -426531 -251545 54833 24756 -391893 -306220 51046 170987 -168354 -362192 -317532 97548
9739 142498 -315548 103078 -127711 -158550 -368671 -27428 16232 408851 -181237 -153046
9729 -153046 -135666 -126323 -170656 -193587 -192283 -238573 274281 -274776 -200834 -33541 -3148 115652
9716 -145294 198737 142169 40823 32403 15285 -132529 -1729 77747 74323 88114 52415 -86427
9703 -164056 146677 -165450 107759 168171 -298167 -73630 -130894 -57771 -308922 -101142
9692 -171925 -265778 -175008 -244177 -340019 4998 -117602 123665 -462110 -69481 -139424 166556
9680 -119733 -269803 18508 -81545 -233683 42153 -112185 -19289 141480 -277330 -227850 60171
9668 -277848 173674 -175996 -294321 171998 135544 -301947 106649 179004 -86138 -357455
9658c57455D708P1640b375k7595k6612j17007A15616K63271a37516J9228C26722
9646a81862Q6230k2629B77368H1014k5484d0815o2198j2949k26981B6495D693
9634F4943a2453A76901a93759m5549d5590B25288M6552h2122A40880i5976j61770
9623b57746A6039h9056j0942N424L1061k1631A71663b74456R3901e0341q0603
9612a30944o0337A15692b08369R9528l8918A91359B1812b873j85753c4164A93075
9600B63072a35567N7646J6729a9378G5520d2266n1628k6167g616p3426A22334
9588h1829L3849j72185A32132b7189k02324O5322C48130j38951h7816A29561n1897
9577G7664h3173a8418g013B5563h0899A32228Q8945b61110l0004B31947a08320
$$ plain form
9658 -357455 4708 76348 -2375 -29970 -56582 -173589 115616 378887 -137516 -118288 326722
9646 -181862 -95632 -118261 277368 81014 55530 -40815 -103013 -115962 -342943 26495 4693
9634 64943 -12453 176901 -193759 -239308 -45590 225288 271840 -82122 140880 -95976 -257746
9623 -257746 16039 -89056 -99998 -94574 -63513 -85144 171663 -274456 -180555 -50341 -130944
9612 -130944 -191281 115692 -208369 -108841 -147759 191359 21812 -2873 -188626 -34164 193075
9600 263072 -135567 -77921 -61192 -19378 75520 -42266 -93894 -120061 -7616 -81042 122334
9588 -81829 -47980 -220165 132132 -27189 -229513 -164191 348130 209179 -87816 129561 77664
9577 77664 -83173 -18418 -7013 25563 -80899 132228 221173 -261110 -291114 231947 -108320
9565B06168c24275g4339E5716c1938l03013M8598A2841J90047a208H38c34788
9553a28147k4392E2574F943b7731j02716P111K9154n6901A0480r96e1341j910
9541e3251C9981c38236m8557e0430B00089M753a83780r9320g2738A29913d2603
9529G3531j312O0173b11604B29181b8256C15254a49997C2309P0557k0447e1260
9517b03869K8032A10059a93887c2622E1512K76752j39707d33884B5708D805b39801
9505a508q4566C7074b66267h8742A09239a06473N0517a9026A04676K13220d94369
9493D8098b66954J16328K5312k99824a38947e3619D1891b26318J03702l3292E632
9481a13323j8667C4855J8576c62789A82052I0293m4151g5156j96876C46525a84072
$$ plain form
9565 206168 -324275 -74339 55716 -31938 -334951 -286353 12841 202888 -1208 838 -334788
9553 -128147 -152539 52574 6943 -27731 -130447 -123336 -94182 -151083 10480 9484 -51341 -53251
9541 -53251 39981 -338236 -386793 -50430 200089 204842 -183780 -283100 -72738 129913 -42603
9529 73531 72219 132392 -211604 229181 -28256 315254 -149997 32309 102866 82419 -51260
9517 -203869 -175837 110059 -193887 -32622 51512 328264 188557 -433884 25708 4805 -239801
9505 -1508 -86074 37074 -266267 -88742 109239 -106473 -55956 -19026 104676 317896 -494369
9493 48098 -266954 -150626 -125314 -425138 -138947 -53619 41891 -226318 -122616 -155908 5632
9481 -113323 -131990 34855 53431 -362789 182052 90293 46142 -75156 -272032 346525 -184072
9469F3291c30929Q6678J4841e438A3172b57884a19431B9524g9411j60483a00880
9457g5349A12418c81123f5658a6844k40530M3229B91681A5495J28097N0200c50393
9445A95940b28813J13312c8071k4774l2828N564c8521j10135B56696a67594N9312
9434a08282r5092i1124a306H547J34082a10483E1398J65715h5942J0869C6526
9422F078e4367j75269B03359c29273m5662J46427c423o5303B7151N9786O6322
9411A53259G5250a12503C4294K12991e1722q1236c4045j62408C1654L24854A03712
9399a60986a6836N546D6821c7971j69288j06357b9331l64543c8416k40072B26413
9387c04337J01006m3508c6158G0790b61776J14902A06801a85316M8764c7212j95967
$$ plain form
9469 63291 -330929 -244251 -229410 -5438 13172 -257884 -119431 29524 -79411 -239894 -100880
9457 -75349 112418 -381123 -65658 -16844 -257374 -214145 291681 15495 143592 193792 -350393
9445 195940 -228813 -115501 -38071 -62845 -95673 -90109 -38521 -148656 256696 -167594 -108282
9434 -108282 -203374 -91124 -1306 8547 142629 -110483 51398 217113 -85942 -75073 36526
9422 6078 -54367 -229636 203359 -329273 -374935 -228508 -3423 -68726 27151 86937 153259
9411 153259 75250 -112503 34294 247285 -51722 -132958 -34045 -196453 31654 356508 103712
9399 -160986 -16836 -11290 46821 -37971 -207259 -313616 -29331 -393874 -38416 -278488 226413
9387 -304337 -203331 -246839 -36158 70790 -261776 -146874 106801 -185316 -136552 -37212 -233179
9376b33179C5206a14867F7988K1079i1868c8723a9322A33790f6772j02819H1396
9364A44353a65501C03411b83383a303j00522K5759j57913B15417A9244a86959
9353h1440B8710A669N1758a10231d6929m8021F0613f2392j53217g3096j78127
9342b51223A48558K09470a78604E3908c53178B57376a05886C3629h8951l9339
9332a28290e090l29420a18287j3577I4005f9734j83800a0652j59128j45849G4204
9320b0316j84860M0720j86045d8875j63655c5178l7515A29455d10741e4164A15556
9308b69734P7970A76647E1919a86431g6393j24386j8449A18621g538n1580j04913
9297a64031c0949k73238g326D3613J7003b05206a8728B26P0483i4358j54482A53912
$$ plain form
9376 -233179 35206 -114867 67988 89067 -91868 -38723 -19322 133790 -66772 -169591 81396
9364 144353 -165501 303411 -283383 -1303 -101825 -76066 -233979 215417 19244 -186959
9353 -81440 28710 1669 53427 -110231 -46929 -94950 60613 -62392 -215609 -73096 -251223
9342 -251223 148558 358028 -178604 53908 -353178 257376 -105886 33629 -88951 -128290
9332 -128290 -5090 -334510 -118287 -131864 94005 -69734 -253534 -10652 -169780 -315629 74204
9320 -20316 -205176 -164456 -350501 -48875 -212530 -35178 -72693 129455 -410741 -54164 115556
9308 -269734 -191764 176647 51919 -186431 -76393 -200779 -219228 118621 -7538 -59118 -164031
9297 -164031 -30949 -304187 -7326 43613 60616 -205206 -18728 226 70709 -94358 -248840 153912
9284A73844e0443J9004p7140k676j96671A46115E4641P140h8166B3512b40936
9272B28474F2478L5482K87720c32864c8226J6260q7023C2161J44652a57964c332
9260D6630c060o0007c0134m7815A23475M5756c81386B04259e16r7069b4462j79787
9248b04249h2858k13518a5532l642j08121j08813A00255M7986R0098h2868c3052
9236b8359j35752C36728p1578a2882k01009B63423c83247d8799k01885a06512
9225C18584J47196a53204p1145P2024N029m7147H5295l5020a36470e0848n7280
9214a08128B52206a82489l9419p7667E2527g1551l811k9909l12490a78905B7397
9202I4559a00677k61125A4384a98763d3524A09042h5989B51784b77761O8627I1650
$$ plain form
9284 173844 -50443 -31439 -108579 -111255 -307926 146115 54641 61781 -88166 23512 -240936
9272 228474 62478 97960 385680 -332864 -38226 -21966 -108989 32161 176813 -157964 -3332
9260 46630 -3060 -63067 -30134 -77949 123475 169231 -381386 204259 -516 -97585 -24462 -204249
9248 -204249 -82858 -296376 -15532 -19174 -127295 -236108 100255 148241 238339 -82868 -33052
9236 -28359 -164111 336728 265150 -12882 -213891 263423 -383247 -48799 -250684 -106512
9225 318584 465780 -153204 -224349 -152325 -147296 -194443 85295 50275 -136470 -50848 -108128
9214 -108128 252206 -182489 -221908 -299575 52527 -71551 -75362 -105271 -417761 -178905 27397
9202 94559 -100677 -361802 14384 -198763 -43524 109042 -85989 251784 -277761 -209134 91650
9190b57287d3484J121C8504a07313E0094b82840A32815a17113G4417b02695j71660
9179c74355E6824J0469a34251O5625l13610A01656B5351d53716c5467i868E7811
9167b12516f1384C03840f7146j1092a1590j45080m9228F1784d1206q1821q1986
9156b05013i7118I8211j2193e7008j85226A58011P3718G6044c36336B12273I849
9144b18931c3808j8793j58330B80068d5278A14985c3541C66530a83487B16304
9133a257p3608c2611J0544A01122d00023A83894e7530K7433k62063Q140c5834
9121A21822b46111o8159A52225c34046B389c74575G1411c68042a9484B36487h5614
9109A18432B0640a43675A6627b93077J07702l3756i5998b1345j71946A69709E6216
$$ plain form
9190 -257287 -43484 -42363 38504 -107313 50094 -282840 132815 -117113 74417 -202695 -374355
9179 -374355 56824 67293 -134251 -68626 -382236 101656 25351 -453716 -35467 -9868 57811
9167 -212516 -61384 303840 -67146 -78238 -11590 -156670 -205898 61784 -41206 -123027 -205013
9156 -205013 -97118 98211 86018 -57008 -242234 158011 231729 76044 -336336 212273 9849
9144 -218931 -33808 -52601 -210931 280068 -45278 114985 -33541 366530 -183487 216304
9133 -1257 -74865 -32611 -22067 101122 -400023 183894 -57530 -30097 -292160 -284020 -35834
9121 121822 -246111 -314270 152225 -334046 2389 -374575 71411 -368042 -19484 236487 -85614
9109 118432 20640 -143675 16627 -293077 -185375 -219131 -95998 -21345 -193291 169709 56216
9097a03396c7432l2450q9237P2235l3416A81868a31365l0856A42029b15217k23416
9086d38633R4847a68800k57042b06810P6943A5775K00250d1957B25767h3256l38440
9075d21696a32529B57407D0519J14907C253b22820O8196F0467a76940k34281J14621
9064b96600m8555i4208k08479A30934f4594j0394m0571C81912A41277C8844P6826
9053A15670a7291j36636f7178C1700L52951b79552B3705c00265g4373k28105B86124
9041I4564a63000L674j57236A28788a65655P7029A1828K3600P4949J89066A46035
9029a17884j4110A10672a55206B20750p6059e0213A15730B5602a27466j82863
9019c10329j31089i3869a8213n1544I7051P3156o5596k4223J51243e4417K1625
$$ plain form
9097 -103396 -37432 -69882 -159119 -86884 -120300 181868 -131365 -162221 142029 -215217 -438633
9086 -438633 -343786 -168800 -425842 -206810 -129867 15775 216025 -41957 225767 -83256 -421696
9075 -421696 -132529 257407 40519 155426 3253 -222820 -154624 60467 -176940 -411221 -296600
9064 -296600 -345155 -94208 -302687 130934 -64594 -74988 -115559 381912 141277 38844 115670
9053 115670 -17291 -153927 -67178 31700 384651 -279552 23705 -300265 -74373 -302478 286124
9041 94564 -163000 -159326 -316562 128788 -165655 -88626 11828 35428 110377 299443 146035
9029 -117884 -131994 110672 -155206 220750 144691 -50213 115730 25602 -127466 -310329
9019 -310329 -441418 -93869 -18213 -69757 97051 170207 104611 80388 231631 -54417 -32792
9008c2792j82659C8363A3499a20044j11248N8886H604a10264A11427k9476b08134
8996B40957A02958J26364d51595e823B3978a31585A29156a90860A94365b4614
8985i0033o5308N8441D7585a26243D7874a9555k30466K815C6774b91247f5915
8973a16140B59785a18788k9524H4660R1958a66574K2433M9750A03092k8284c69489
8961i3205n0723a3519A94919h868H4009a74003M5254r5520P0026r1316a11625
8949d33623A78432J51954b2341G3340e9205B3764J63441g3122A26020A250M3459
8938D4709c18317h9775G8554a68880j58877A10451j5105a96668B53383E6519d4919
8926f9405m2253I5448c7600p0941B76982a28694A67182A5508Q30898C86995h7878
$$ plain form
9008 -32792 -215451 38363 13499 -120044 -231292 -172406 8604 -110264 111427 81951 -208134
8996 240957 102958 229322 -451595 -5823 23978 -131585 129156 -190860 194365 -24614
8985 -90033 -155341 -96900 47585 -126243 47874 -19555 -250021 -247206 36774 -291247 -65915
8973 -116140 259785 -118788 -148312 84660 176618 -166574 -144141 -94391 103092 74808 -369489
8961 -93205 -143928 -13519 194919 -8868 84009 -174003 -128749 -224269 -154243 -245559 -111625
8949 -433623 178432 330386 -22341 73340 -59205 23764 187205 -73122 126020 1250 44709
8938 44709 -318317 -89775 78554 -168880 -327757 110451 95346 -196668 253383 56519 -44919
8926 -69405 -111658 95448 -37600 -108541 276982 -128694 167182 15508 846406 386995 -87878
8914a59714A16796J32124a86821G9639R240f2535i188l87684h5824k09518m3086
8903c38428A10882D8813f1737H4043C388K66115p7990J00747a49291j5481P2627
8892i2145k61909a00420A23172a14548A17197l1434b17235j05591J11066A03937
8881c20174k3556A10187D5095a87200A9528d4073m1024J0560F4364O1304a95968
8869e46692B11459b43568b3444A2675i5770A80842f6520r2628o600A06218f0126
$$ plain form
8914 -159714 116796 248920 -186821 79639 88879 -62535 -9188 -396872 -85824 -295342 -338428
8903 -338428 110882 48813 -61737 84043 3388 269503 191513 292260 -149291 -164772 -92145
8892 -92145 -354054 -100420 123172 -114548 117197 85763 -217235 -322826 -211760 103937
8881 -320174 -343730 110187 45095 -187200 19528 -44073 -85097 -74537 64364 125668 -195968
8869 -546692 211459 -243568 -23444 12675 -95770 180842 -66520 -159148 -165748 106218 -60126
$$ [...]
##END NTUPLES=NMR SPECTRUM
##END=
