##TITLE=NES1058_SeabridgeLH_9270760_XtPAL5oZl9
##JCAMPDX= 6.0         $$ Bruker NMR JCAMP-DX V2.0
##DATA TYPE= NMR SPECTRUM
##DATA CLASS= NTUPLES
##ORIGIN= BRUKER
##OWNER= Administrator
$$ 1.72 TOPSPIN		Version 2.1
$$ 2015-07-11 23:46:39.566 -0700  Administrator@X
$$ Compression mode = diff/dup
##.OBSERVE FREQUENCY= 400.02188249412
##.OBSERVE NUCLEUS= ^1H
##.ACQUISITION MODE= SIMULTANEOUS (DQD)
##.ACQUISITION SCHEME= undefined
##.AVERAGES= 64
##.DIGITISER RES= 22
##SPECTROMETER/DATA SYSTEM= spect
##.PULSE SEQUENCE= noesygpps1d.comp
##.SOLVENT NAME= COFFEE_meoh
##.SHIFT REFERENCE= INTERNAL, COFFEE_meoh, 1, 14.96387
##AUDIT TRAIL= $$ (NUMBER, WHEN, WHO, WHERE, PROCESS, VERSION, WHAT)
$$ ##TITLE= Audit trail, TOPSPIN		Version 2.1
$$ ##JCAMPDX= 5.01
$$ ##ORIGIN= Bruker BioSpin GmbH
$$ ##OWNER= Administrator
$$ $$ E:\/data/COFFEE/nmr/NES1058_SeabridgeLH_9270760_XtPAL5oZl9/12/pdata/1/auditp.txt
$$ ##AUDIT TRAIL=  $$ (NUMBER, WHEN, WHO, WHERE, PROCESS, VERSION, WHAT)
(   1,<2015-07-11 23:46:33.956 -0700>,<Administrator>,<X>,<go>,<TOPSPIN 2.1>,
      <created by zg
	started at 2015-07-11 23:35:04.581 -0700,
	POWCHK enabled, PULCHK disabled,
       configuration hash MD5:
       21 0F 79 D6 B3 7B B4 F6 88 20 88 DB 03 48 BD 9F
       data hash MD5: 64K
       57 D9 E1 33 A5 4E 97 60 B3 B4 8A C5 85 43 E5 0B>)
(   2,<2015-07-11 23:46:37.425 -0700>,<Administrator>,<X>,<proc1d>,<TOPSPIN 2.1>,
      <Start of raw data processing
       efp LB = 0.3 FT_mod = 6 PKNL = 1 PHC0 = 0 PHC1 = 0 SI = 128K 
       data hash MD5: 128K
       3B 89 3E AA 1A BE 4E A3 32 71 64 58 3E 65 07 96>)
(   3,<2015-07-11 23:46:38.316 -0700>,<Administrator>,<X>,<proc1d>,<TOPSPIN 2.1>,
      <pk PHC0 = -84.18823 PHC1 = 0 
       data hash MD5: 128K
       6C FB 5A A0 C2 68 0C 94 71 43 05 27 E2 32 5A DD>)
(   4,<2015-07-11 23:46:38.722 -0700>,<Administrator>,<X>,<proc1d>,<TOPSPIN 2.1>,
      <abs ABSG = 1 
       data hash MD5: 128K
       ED 0A 05 AC AB 8D 39 FD 89 57 50 DA 1B D5 69 C9>)
(   5,<2015-07-11 23:46:38.847 -0700>,<Administrator>,<X>,<proc1d>,<TOPSPIN 2.1>,
      <abs ABSG = 2 
       data hash MD5: 128K
       F7 8E F8 E2 14 9D CC 86 C8 EE DF 27 31 BA CD 07>)
(   6,<2015-07-11 23:46:38.925 -0700>,<Administrator>,<X>,<proc1d>,<TOPSPIN 2.1>,
      <abs ABSG = 3 
       data hash MD5: 128K
       CC EA 73 09 9B E0 7B 01 3F 90 A2 BC 32 59 94 CE>)
(   7,<2015-07-11 23:46:39.019 -0700>,<Administrator>,<X>,<proc1d>,<TOPSPIN 2.1>,
      <abs ABSG = 4 
       data hash MD5: 128K
       CE CB 1A 56 70 46 C0 81 0C 20 E1 2F F3 A5 9B 03>)
(   8,<2015-07-11 23:46:39.144 -0700>,<Administrator>,<X>,<proc1d>,<TOPSPIN 2.1>,
      <abs ABSG = 5 
       data hash MD5: 128K
       F9 69 F9 86 14 27 C0 25 36 58 B8 9A 60 B6 10 BF>)
$$ ##END=
$$ 
$$ $$ hash MD5
$$ $$ 35 03 1D BF F6 E9 E9 5B 9D A1 9E 1F D5 64 C6 8B
##$RELAX= 
##$RELAX= 
##$RELAX= 
##$RELAX= 
##$RELAX= 
##$RELAX= 
##$RELAX= 
##$RELAX= 
$$ Bruker specific parameters
$$ --------------------------
##$DU= <E:\>
##$EXPNO= 12
$$ [...]
##$TP07= 0
##$TPNAME0= <>
##$TPNAME1= <>
##$TPNAME2= <>
##$TPNAME3= <>
##$TPNAME4= <>
##$TPNAME5= <>
##$TPNAME6= <>
##$TPNAME7= <>
##$TPOAL= (0..7)
0.5 0.5 0.5 0.5 0.5 0.5 0.5 0.5
##$TPOFFS= (0..7)
0 0 0 0 0 0 0 0
##$TUNHIN= 0
##$TUNHOUT= 0
##$TUNXOUT= 0
##$USERA1= <user>
##$USERA2= <user>
##$USERA3= <user>
##$USERA4= <user>
##$USERA5= <user>
##$V9= 5
##$VALIST= <valist>
##$VCLIST= <CCCCCCCCCCCCCCC>
##$VD= 0
##$VDLIST= <DDDDDDDDDDDDDDD>
##$VPLIST= <PPPPPPPPPPPPPPP>
##$VTLIST= <TTTTTTTTTTTTTTT>
##$WBST= 2048
##$WBSW= 25
##$XGAIN= (0..3)
0 0 0 0
##$XL= 0
##$YL= 0
##$YMAX_a= 8731799
##$YMIN_a= -16042552
##$ZGOPTNS= <>
##$ZL1= 120
##$ZL2= 120
##$ZL3= 120
##$ZL4= 120
##$ABSF1= 14.96387
##$ABSF2= -5.594312
##$ABSG= 5
##$ABSL= 3
##$ALPHA= 0
##$AQORDER= 0
##$ASSFAC= 0
##$ASSFACI= 0
##$ASSFACX= 0
##$ASSWID= 0
##$AUNMP= <proc_prof1d_extract.lims>
##$AXLEFT= 0
##$AXNAME= <>
##$AXNUC= <1H>
##$AXRIGHT= 0
##$AXTYPE= 0
##$AXUNIT= <>
##$AZFE= 0.1
##$AZFW= 0.1
##$BCFW= 0
##$BC_mod= 0
##$BYTORDP= 0
##$COROFFS= 0
##$CY= 15
##$DATMOD= 1
##$DC= 0
##$DFILT= <>
##$DTYPP= 0
##$F1P= 0
##$F2P= 0
##$FCOR= 0.5
##$FTSIZE= 131072
##$FT_mod= 6
##$GAMMA= 0
##$GB= 0
##$INTBC= 1
##$INTSCL= 1
##$ISEN= 128
##$LB= 0.3
##$LEV0= 0
##$LPBIN= 0
##$MAXI= 10000
##$MC2= 0
##$MEAN= 0
##$ME_mod= 0
##$MI= 0
##$NCOEF= 0
##$NC_proc= -2
##$NLEV= 6
##$NOISF1= 0
##$NOISF2= 0
##$NSP= 0
##$NTH_PI= 0
##$NZP= 0
##$OFFSET= 14.96387
##$PC= 1
##$PHC0= -84.18823
##$PHC1= 0
##$PH_mod= 1
##$PKNL= yes
##$PPARMOD= 0
##$PPDIAG= 0
##$PPIPTYP= 0
##$PPMPNUM= 2147483647
##$PPRESOL= 1
##$PSCAL= 4
##$PSIGN= 0
##$PYNMP= <proc.py>
##$REVERSE= no
##$SF= 400.020008489737
##$SI= 131072
##$SIGF1= 0
##$SIGF2= 0
##$SINO= 400
##$SIOLD= 131072
##$SPECTYP= <>
##$SREGLST= <1H.CDCl3>
##$SSB= 0
##$STSI= 131072
##$STSR= 0
##$SW_p= 8223.68421052631
##$SYMM= 0
##$S_DEV= 0
##$TDeff= 65536
##$TDoff= 0
##$TI= <>
##$TILT= no
##$TM1= 0
##$TM2= 0
##$TOPLEV= 0
##$USERP1= <user>
##$USERP2= <user>
##$USERP3= <user>
##$USERP4= <user>
##$USERP5= <user>
##$WDW= 1
##$XDIM= 131072
##$YMAX_p= 437117021
##$YMIN_p= -11839
##$CURPLOT= <Network HP LaserJet P1505>
##$CURPRIN= <$Network HP LaserJet P1505>
##$DFORMAT= <normdp>
##$LAYOUT= <+/1D_H.xwp>
##$LFORMAT= <normlp>
##$PFORMAT= <normpl>
##$SURQMSG= 1
$$ End of Bruker specific parameters
$$ ---------------------------------
##NTUPLES= NMR SPECTRUM
##VAR_NAME=  FREQUENCY,     SPECTRUM/REAL,   SPECTRUM/IMAG
##SYMBOL=    X,             R,               I
##VAR_TYPE=  INDEPENDENT,   DEPENDENT,       DEPENDENT
##VAR_FORM=  AFFN,          ASDF,            ASDF
##VAR_DIM=   131072,        131072,          131072
##UNITS=     HZ,            ARBITRARY UNITS, ARBITRARY UNITS
##FACTOR=    0.0627417313425164, 1,          1
##FIRST=     8223.62146879497, -1639,        -61632
##LAST=      0,             935,             -61977
##MIN=       0,             -11839,          0
##MAX=       8223.62146879497, 437117021,    0
$$ Real data points
##PAGE= N=1
##DATA TABLE= (X++(R..R)), XYDATA
$$ [...]
$$ plain form
63379 436184 432590 428699 425034 421680 418748 416711 415943 416251 417199 418627 420395 421904 422400 421786 420574
63364 420574 419007 416616 412780 407466 401264 394869 388541 381915 374337 365598 356334 347551 339772 332715
63350 332715 325754 318580 311511 305216 300031 295510 290882 286003 281536 278068 275443 273233 271452 270361
63336 270361 269765 268989 267492 265282 262830 260850 259996 260389 261447 262342 262652 262500 262315 262546 263390 264565 265560
63319 265560 266207 266752 267310 267648 267641 267510 267315 266673 265232 262993 259934 255877 251110 246587 243050 240400 238365
63302 238365 237120 236672 236298 235365 234265 233690 233398 232636 231456 230624 230326 229941 229084 227967 226634 224718 222191
63285 222191 219718 217972 217084 216846 216944 216960 216682 216464 216800 217477 217713 217151 216189 215326 214742 214559 214931 215654 216188
63266 216188 216249 216088 216128 216666 217909 219975 222808 226287 230185 233829 236276 237332 237960 239094 240502 241563
$$ packed form
63379D36184l594l891l665l354k932k037p68L08R48J428J768J509M96o14j212
63364D20574j567k391l836n314o202o395o328o626p578q739r264q783p779p057
63350C32715o961p174p069o295n185m521m628m879m467l468k625k210j781j091
63336B70361n96p76j497k210k452j980q54L93J058Q95L10j52j85K31Q44J175R95
63319B65560O47N45N58L38pj31j95o42j441k239l059m057m767m523l537k650k035
63302B38365j245m48l74r33j100n75k92p62j180q32k98l85q57j117j333j916k527
63285B22191k473j746q88k38R8J6k78k18L36O77K36n62r62q63n84j83L72P23N34
63266B16188O1j61M0N38J243K066K833L479L898L644K447J056O28J134J408J061
$$ plain form
63250 241563 242632 244593 247437 250418 253439 257060 261183 265067 268815 273531 279641 286334 293196 301188
63236 301188 311198 322670 334555 346865 360351 375233 391112 407750 425086 442762 460266
63225 460266 477381 494070 510160 525512 540164 554011 566763 578652 590730 604078 619037
63214 619037 635455 653109 671427 689311 705764 720303 732326 740583 743854 741794 734725 723058
63202 723058 707429 688882 668281 645892 622118 598144 575188 553465 532678 513200 495936
63191 495936 481190 468492 457585 448848 442625 438686 436501 435636 435860 437305 440437 445502 452032 459343
63177 459343 467341 476286 485905 495413 504511 513716 523573 534044 544829 555715 566350 576267 585511
63164 585511 594827 604714 614558 623118 629662 634161 636477 635981 632144 625111 615430 603465 589438 573901
$$ packed form
63250B41563J069J961K844K981L021L621M123L884L748M716O110O693O862P992
63236C01188J0010J1472J1885J2310J3486J4882J5879J6638J7336J7676J7504
63225D60266J7115J6689J6090J5352J4652J3847J2752J1889J2078J3348J4959
63214F19037J6418J7654J8318J7884J6453J4539J2023Q257L271k060p069j1667
63202G23058j5629j8547k0601k2389k3774k3974k2956k1723k0787j9478j7264
63191D95936j4746j2698j0907q737o223l939k185q65K24J445L132N065O530P311
63177D59343P998Q945R619R508R098R205R857J0471J0785J0886J0635R917R244
63164E85511R316R887R844Q560O544M499K316m96l837p033r681j1965j4027j5537
$$ plain form
63150 573901 557725 541466 524992 507999 490768 474204 459146 445822 433980 423398 414190 406658
63138 406658 400834 396131 391659 387036 382781 379644 377682 376255 374850 373533 372545 371792 370886 369529 367755
63123 367755 365993 364845 364542 364564 364029 362577 360665 358980 357751 356729 355597 354336 353297 352941 353396 354352
63107 354352 355480 356771 358236 359635 360874 362391 364576 367007 368950 370533 372652 375651 378869 381737
63093 381737 384567 387860 391469 394903 397953 400570 402602 404119 405585 407297 409032 410652 412558 414999
63079 414999 417415 419133 420453 422305 424983 427904 430600 433326 436562 440411 444662 449141 453904 459308
63065 459308 465880 473796 482574 491633 501192 512218 525347 540208 556037 572754 591157 612060
63053 612060 635459 660638 687009 714751 744551 776842 811390 847509 884479 921763 959041
$$ packed form
63150E73901j6176j6259j6474j6993j7231j6564j5058j3324j1842j0582r208p532
63138D06658n824m703m472m623m255l137j962j427j405j317r88p53r06j357j774
63123C67755j762j148l03K2n35j452j912j685j229j022j132j261j039l56M55R56
63107C54352J128J291J465J399J239J517K185K431J943J583K119K999L218K868
63093C81737K830L293L609L434L050K617K032J517J466J712J735J620J906K441
63079D14999K416J718J320J852K678K921K696K726L236L849M251M479M763N404
63065D59308O572P916Q778R059R559J1026J3129J4861J5829J6717J8403K0903
63053F12060K3399K5179K6371K7742K9800L2291L4548L6119L6970L7284L7278
$$ plain form
63042 959041 996072 1032451 1067546 1100884 1132574 1163124 1192916 1222197 1251477 1281447 1312362
63031 1312362 1343889 1375714 1407780 1439589 1469573 1495556 1515757 1529161 1535161 1533143 1522392 1502300
63019 1502300 1472845 1434973 1390327 1340516 1286872 1230961 1174870 1120573 1069161 1020932 976094
63008 976094 935194 898931 867815 841957 821122 805000 793345 785731 781316 779232 779300 782022 787756
62995 787756 796193 806695 818805 832235 846627 861537 876572 891516 906489 921841 937593 953158
62983 953158 968041 982643 997665 1012703 1026109 1036411 1043183 1046321 1045253 1039350 1028433 1012346
62971 1012346 990591 963101 931017 896090 859491 821694 783241 745043 707913 672264 638271
62960 638271 606082 575874 547824 521976 498124 476041 455856 437822 421716 406873 392973
$$ packed form
63042I59041L7031L6379L5095L3338L1690L0550K9792K9281K9280K9970L0915
63031A312362L1527L1825L2066L1809K9984K5983K0201J3404O000k018j0751k0092
63019A502300k9455l7872m4646m9811n3644n5911n6091n4297n1412m8229m4838
63008I76094m0900l6263l1116k5858k0835j6122j1655p614m415k084O8K722N734
62995G87756Q437J0502J2110J3430J4392J4910J5035J4944J4973J5352J5752J5565
62983I53158J4883J4602J5022J5038J3406J0302O772L138j068n903j0917j6087
62971A012346k1755k7490l2084l4927l6599l7797l8453l8198l7130l5649l3993
62960F38271l2189l0208k8050k5848k3852k2083k0185j8034j6106j4843j3900
$$ plain form
62949 392973 380305 369102 359107 350011 341787 334366 327535 321445 316573 312778 308980 304325 299174 294486
62935 294486 290688 287636 285145 282956 280624 278039 275703 273942 272289 270241 268206 266968 266559 266367 266151
62920 266151 266193 266570 266940 267059 266948 266588 265866 264784 263347 261385 258815 255877 252847 249767 246752 244139
62904 244139 241969 239793 237472 235631 234774 234422 233753 232612 231167 229125 226251 223298 221367 220466 219679
62889 219679 218733 218421 219335 221084 223027 225066 227334 229580 231202 231700 231082 230065 229675 230237 230979 231054 230738
62872 230738 231057 232442 234280 235663 235986 235059 233282 231588 230600 229983 229161 228416 228564 229827 231755 234039
62856 234039 236528 238625 239664 239890 240224 241030 242000 243207 245205 247885 250289 251916 253374 255299 257400
62841 257400 259042 260178 261250 262591 264234 265890 266998 267282 267370 268268 270085 271917 273100 273922 274908 276137
$$ packed form
62949C92973j2668j1203r995r096q224p421o831o090m872l795l798m655n151m688
62935B94486l798l052k491k189k332k585k336j761j653k048k035j238m09j92k16
62920B66151M2L77L70J19j11l60p22j082j437j962k570k938l030l080l015k613
62904B44139k170k176k321j841q57l52o69j141j445k042k874k953j931r01p87
62889B19679r46l12R14J749J943K039K268K246J622M98o18j017l90N62P42P5l16
62872B30738L19J385J838J383L23r27j777j694r88o17q22p45J48J263J928K284
62856B34039K489K097J039K26L34Q06R70J207J998K680K404J627J458J925K101
62841B57400J642J136J072J341J643J656J108K84Q8Q98J817J832J183Q22R86J229
$$ plain form
62825 276137 277533 279129 280670 281656 282212 283350 285891 289594 293740 298136 303056 308518 314051 319088 323425
62810 323425 327444 331814 336730 341626 346113 350885 356900 363802 370186 375655 381573 389407 399232 410396
62796 410396 422806 436823 452487 469648 488516 509494 532699 558121 585965 616482 649712
62785 649712 685714 724758 767112 812975 862730 916660 974161 1033820 1094545 1156046 1217828
62774 1217828 1278314 1335379 1387197 1432142 1468581 1495436 1512533 1519828 1516711 1502678 1478306 1444997
62762 1444997 1404094 1356750 1304304 1248179 1189620 1129945 1070624 1012586 955808 900202 846548
62751 846548 795989 748954 705198 664619 627299 592958 561116 531815 505536 482411 462007
62740 462007 443832 427560 412824 399310 387089 376467 367534 360191 354409 349999 346361 343056 340424
$$ packed form
62825B76137J396J596J541R86N56J138K541L703M146M396M920N462N533N037M337
62810C23425M019M370M916M896M487M772O015O902O384N469N918P834R825J1164
62796D10396J2410J4017J5664J7161J8868K0978K3205K5422K7844L0517L3230
62785F49712L6002L9044M2354M5863M9755N3930N7501N9659O0725O1501O1782
62774A217828O0486N7065N1818M4945L6439K6855J7097P295l117j4033k4372l3309
62762A444997m0903m7344n2446n6125n8559n9675n9321n8038n6778n5606n3654
62751H46548n0559m7035m3756m0579l7320l4341l1842k9301k6279k3125k0404
62740D62007j8175j6272j4736j3514j2221j0622q933p343n782m410l638l305k632
$$ plain form
62727 340424 338890 337779 335725 332490 329573 328537 329348 330844 332386 334389 337449 341685 346994 353433
62713 353433 361073 369788 379459 390251 402422 416014 431021 447879 467423 490172 515896 544117
62701 544117 574760 607956 643359 680117 717541 755378 793390 830975 867258 901179 931358
62690 931358 956302 974965 986944 992062 990084 980943 964899 942415 914185 881409 845621 808057
62678 808057 769520 730948 693533 657947 623870 590751 558745 528557 500623 474849 450968
62667 450968 428815 408408 390069 374296 361168 349966 339687 329865 320742 312744 305989 300124
62655 300124 294431 288278 281704 275528 270666 267401 265305 263672 261948 259993 258097 256584 255270 253555
62641 253555 251069 248010 244854 242062 240093 239106 238528 237451 235781 234520 234552 235598 236778 237745 238801
$$ packed form
62727C40424j534j111k054l235k917j036Q11J496J542K003L060M236N309O439
62713C53433P640Q715R671J0792J2171J3592J5007J6858J9544K2749K5724K8221
62701E44117L0643L3196L5403L6758L7424L7837L8012L7585L6283L3921L0179
62690I31358K4944J8663J1979N118j978r141j6044k2484k8230l2776l5788l7564
62678H08057l8537l8572l7415l5586l4077l3119l2006l0188k7934k5774k3881
62667D50968k2153k0407j8339j5773j3128j1202j0279r822r123p998o755n865
62655C00124n693o153o574o176m862l265k096j633j724j955j896j513j314j715
62641B53555k486l059l156k792j969r87n78j077j670j261L2J046J180R67J056
$$ plain form
62626 238801 240151 241537 242487 242611 241933 241201 241559 243522 246542 249896 253624 258154 263379 268651 273530
62611 273530 278093 282750 288185 295218 304209 314732 326264 338939 353173 368820 385448 403303
62599 403303 423261 445703 470024 495451 521913 549838 579387 610059 640871 670798 699170
62588 699170 725610 749456 769386 783873 791958 793472 788694 778158 762614 742833 719500 693518
62576 693518 666209 638736 611406 583918 556245 528892 502347 476771 452340 429485 408603
62565 408603 389729 372638 357049 342703 329460 317406 306668 297059 288123 279626 271823 265134
62553 265134 259687 255264 251628 248767 246786 245616 244920 244308 243557 242527 241063 239276 237784 237293 237878
62538 237878 239028 240468 242483 245302 248649 252203 256105 260660 265832 271429 277523 284349 291934 300080
$$ packed form
62626B38801J350J386R50J24o78p32L58J963L020L354L728M530N225N272M879
62611B73530M563M657N435P033Q991J0523J1532J2675J4234J5647J6628J7855
62599D03303J9958K2442K4321K5427K6462K7925K9549L0672L0812K9927K8372
62588F99170K6440K3846J9930J4487Q085J514m778j0536j5544j9781k3333k5982
62576F93518k7309k7473k7330k7488k7673k7353k6545k5576k4431k2855k0882
62565D08603j8874j7091j5589j4346j3243j2054j0738r609q936q497p803o689
62553B65134n447m423l636k861j981j170o96o12p51j030j464j787j492m91N85
62538B37878J150J440K015K819L347L554L902M555N172N597O094O826P585Q146
$$ plain form
62524 300080 308562 317150 325828 335251 346600 360539 376531 393493 410858 428721 447341 467047
62512 467047 488189 510451 532338 552000 568632 582595 594206 602997 608170 609272 606234 599232
62500 599232 588789 575770 561056 545295 528932 512311 495772 479799 465031 451953 440631
62489 440631 430868 422468 415211 408843 403317 398755 394843 390567 385038 378408 371450 364393 356721 348156
62475 348156 339238 330774 323127 316277 310217 304967 300360 296103 292056 288351 285117 282119 278891 275442
62461 275442 272662 271469 271462 270928 268546 264673 260603 257114 254299 252406 251861 252436 253065 252804 251638 250263
62445 250263 249370 249168 249252 248902 247816 246593 246224 247085 248703 250493 252439 255013 258656 263398 268825 274436
62429 274436 280064 285815 291547 296796 301566 306765 313350 321185 329209 336594 343253 349324 354843 359983
$$ packed form
62524C00080Q482Q588Q678R423J1349J3939J5992J6962J7365J7863J8620J9706
62512D67047K1142K2262K1887J9662J6632J3963J1611Q791N173J102l038p002
62500E99232j0443j3019j4714j5761j6363j6621j6539j5973j4768j3078j1322
62489D40631r763q400p257o368n526m562l912m276n529o630o958p057p672q565
62475C48156q918q464p647o850o060n250m607m257m047l705l234k998l228l449
62461B75442k780j193pn34k382l873m070l489k815j893n45N75O29k61j166j375
62445B50263q93k02Q4l50j086j223l69Q61J618J790J946K574L643M742N427N611
62429B74436N628N751N732N249M770N199O585P835Q024P385O659O071N519N140
$$ plain form
62415 359983 365061 370022 374270 377229 378875 379561 379592 379091 378098 376612 374617 372216 369766 367822 366826 366660
62399 366660 366593 366063 365578 366461 369497 374136 379290 384502 390017 396135 403018 410967 420342 431301 443909
62384 443909 458410 475058 493867 514786 537847 562776 588824 615463 642992 671878 701721
62373 701721 731384 760006 787255 812626 835015 853048 865492 871579 871600 867231 860721 853472 845562
62360 845562 836525 826230 815030 803394 791478 778941 765314 750624 735339 719574 702911 685280
62348 685280 667355 649593 631639 613449 596263 581440 568800 557297 546902 538499 532079 526598
62336 526598 521799 518744 517947 518243 518242 517896 517826 517912 517518 516529 515217 513373 510410 506288 501716 497409 493492
62319 493492 489628 485455 480951 476531 472676 469414 466353 463275 460415 458091 456416 455496 455554 456618 458361
$$ packed form
62415C59983N078M961M248K959J646O86L1n01r93j486j995k401k450j944r96j66
62399C66660o7n30m85Q83L036M639N154N212N515O118O883P949R375J0959J2608
62384D43909J4501J6648J8809K0919K3061K4929K6048K6639K7529K8886K9843
62373G01721K9663K8622K7249K5371K2389J8033J2444O087K1m369o510p249p910
62360H45562r037j0295j1200j1636j1916j2537j3627j4690j5285j5765j6663j7631
62348F85280j7925j7762j7954j8190j7186j4823j2640j1503j0395q403o420n481
62336E26598m799l055p97K96jl46p0Q6l94r89j312j844k963m122m572m307l917
62319D93492l864m173m504m420l855l262l061l078k860k324j675r20N8J064J743
$$ plain form
62304 458361 460404 462576 464775 466842 468724 470612 472863 475915 480117 485367 491038 496626 502296 508392
62290 508392 514636 520473 526147 532665 540503 549003 557274 565182 573312 582547 593918 608193 625169
62277 625169 643771 663250 683950 706632 731383 757479 783955 809958 834780 857850 878582
62266 878582 896209 910134 920632 928829 935734 941525 945921 948838 950402 950552 948977 945365 939647 932166
62252 932166 923700 915185 907334 900613 895405 891877 889759 888581 888101 888303 889126 890584 892943 896326 900313
62237 900313 904454 908995 914474 920704 926836 932428 937799 943342 949232 955852 963710 972756 982461 992753
62223 992753 1004144 1016688 1029567 1042083 1054381 1066879 1079638 1092770 1106863 1122497 1139669
62212 1139669 1158073 1177540 1197916 1219004 1241061 1265017 1291752 1321263 1352693 1385009 1417656
$$ packed form
62304D58361K043K172K199K067J882J888K251L052M202N250N671N588N670O096
62290E08392O244N837N674O518P838Q500Q271P908Q130R235J1371J4275J6976
62277F25169J8602J9479K0700K2682K4751K6096K6476K6003K4822K3070K0732
62266H78582J7627J3925J0498Q197O905N791M396K917J564J50j575l612n718p481
62252I32166q466q515p851o721n208l528k118j178m80K02Q23J458K359L383L987
62237I00313M141M541N479O230O132N592N371N543N890O620P858R046R705J0292
62223I92753J1391J2544J2879J2516J2298J2498J2759J3132J4093J5634J7172
62212A139669J8404J9467K0376K1088K2057K3956K6735K9511L1430L2316L2647
$$ plain form
62201 1417656 1450873 1485255 1520514 1554725 1585399 1611279 1632504 1649216 1661094 1668496 1673132 1677101
62189 1677101 1681854 1688299 1697026 1708053 1721112 1736606 1755517 1777965 1802638 1828069 1853602 1878665
62177 1878665 1902145 1923309 1942628 1960859 1977928 1993452 2007668 2020968 2033042 2043329 2051791
62166 2051791 2058453 2062694 2064017 2063144 2061360 2058963 2055282 2050107 2044235 2038562 2033316 2028248 2023033 2017512
62152 2017512 2011986 2007190 2003552 2000679 1997949 1995330 1993090 1991060 1988785 1986192 1983467 1980547 1977379 1974476
62138 1974476 1972477 1971190 1969761 1967859 1966115 1965256 1965252 1965449 1965224 1964472 1963641 1963262 1963305 1963244 1962977 1963244 1964705 1966919
62120 1966919 1968803 1969968 1971093 1973038 1976059 1979997 1984914 1991503 2000893 2013730 2028994 2043755 2054458
62107 2054458 2058746 2056496 2049737 2041758 2035732 2033527 2035521 2041118 2048758 2055581 2058262 2055014 2046570 2035033
$$ packed form
62201A417656L3217L4382L5259L4211L0674K5880K1225J6712J1878P402M636L969
62189A677101M753O445Q727J1027J3059J5494J8911K2448K4673K5431K5533K5063
62177A878665K3480K1164J9319J8231J7069J5524J4216J3300J2074J0287Q462
62166B051791O662M241J323q73j784k397l681n175n872n673n246n068n215n521
62152B017512n526m796l638k873k730k619k240k030k275k593k725k920l168k903
62138A974476j999j287j429j902j744q59mJ97k25p52q31l79M3o1k67K67J461K214
62120A966919J884J165J125J945L021L938M917O589R390J2837J5264J4761J0703
62107B054458M288k250o759p979o026k205J994N597P640O823K681l248q444j1537
$$ plain form
62093 2035033 2022331 2009889 1998601 1988160 1976895 1963126 1946519 1927712 1907213 1885315 1862591
62082 1862591 1839614 1816505 1793431 1771192 1750573 1731260 1711973 1691487 1669116 1644648 1618511
62071 1618511 1591802 1565601 1540415 1516507 1494103 1472723 1450934 1427627 1403142 1378507 1354133
62060 1354133 1330034 1306745 1285009 1264953 1246558 1230573 1217838 1207873 1199209 1190988 1183275 1175854
62048 1175854 1167691 1157640 1144891 1128848 1109495 1087915 1065632 1043397 1021349 1000071 980357
62037 980357 962034 944186 926738 910694 896507 883239 869818 856276 843260 831123 819979
62026 819979 810021 801225 793196 785752 779310 774363 770931 768791 767930 768622 771322 776560 784491 794513
62012 794513 805661 817400 829574 841600 852200 860009 864065 863785 859003 850107 837727 822347 804622
$$ packed form
62093B035033j2702j2442j1288j0441j1265j3769j6607j8807k0499k1898k2724
62082A862591k2977k3109k3074k2239k0619j9313j9287k0486k2371k4468k6137
62071A618511k6709k6201k5186k3908k2404k1380k1789k3307k4485k4635k4374
62060A354133k4099k3289k1736k0056j8395j5985j2735r965q664q221p713p421
62048A175854q163j0051j2749j6043j9353k1580k2283k2235k2048k1278j9714
62037I80357j8323j7848j7448j6044j4187j3268j3421j3542j3016j2137j1144
62026H19979r958q796q029p444o442m947l432k140q61O92K700N238P931J0022
62012G94513J1148J1739J2174J2026J0600P809M056k80m782q896j2380j5380j7725
$$ plain form
61999 804622 785888 767727 751036 735957 722515 710755 700490 691639 684695 680098 677313 675359
61987 675359 674141 674362 676128 678640 681434 684976 689800 695860 702985 711116 719894 728898 738625 750292
61973 750292 764214 779225 794278 809838 826999 845850 865478 885188 905009 925205 945899
61962 945899 967181 989228 1012221 1036180 1060909 1086350 1113341 1143602 1178284 1216661 1257067
61951 1257067 1299047 1343682 1391794 1443079 1497476 1556223 1620639 1690545 1764838 1843269 1926917
61940 1926917 2017169 2114854 2220039 2331819 2448067 2565912 2682886 2798049 2912613 3029916
61930 3029916 3154732 3292442 3448705 3629373 3839770 4083617 4362886 4678561 5030774
61921 5030774 5417694 5834475 6273113 6722213 7166082 7584277 7952911 8247416 8445967
$$ packed form
61999H04622j8734j8161j6691j5079j3442j1760j0265q851o944m597k785j954
61987F75359j218K21J766K512K794L542M824O060P125Q131Q778R004R727J1667
61973G50292J3922J5011J5053J5560J7161J8851J9628J9710J9821K0196K0694
61962I45899K1282K2047K2993K3959K4729K5441K6991L0261L4682L8377M0406
61951A257067M1980M4635M8112N1285N4397N8747O4416O9906P4293P8431Q3648
61940A926917R0252R7685J05185J11780J16248J17845J16974J15163J14564J17303
61930C029916J24816J37710J56263J80668K10397K43847K79269L15675L52213
61921E030774L86920M16781M38638M49100M43869M18195L68634K94505J98551
$$ plain form
61912 8445967 8533188 8503151 8360108 8116667 7791192 7405572 6982629 6542839 6102080 5671820
61902 5671820 5260534 4874259 4516256 4187111 3885667 3610002 3357996 3127701 2917507
61893 2917507 2726009 2551801 2393490 2249777 2119543 2002039 1897008 1804252 1722876 1651135
61883 1651135 1587198 1529955 1479096 1434582 1396123 1363111 1335035 1311906 1293943 1280773 1271460
61872 1271460 1265644 1264038 1267190 1274316 1284289 1297404 1315044 1337643 1364077 1393131 1424489 1457941
61860 1457941 1492655 1527767 1562879 1597471 1630441 1660617 1687133 1708995 1725149 1735585 1741769
61849 1741769 1745470 1747617 1748801 1750226 1753475 1759525 1768393 1779331 1790967 1801677 1810318 1816459 1819834
61836 1819834 1820115 1817549 1813255 1808475 1803995 1800630 1799746 1802835 1811027 1825471 1847662 1878645 1917892
$$ packed form
61912H445967Q7221l0037j43043k43441l25475l85620m22943m39790m40759m30260
61902E671820m11286l86275l58003l29145l01444k75665k52006k30295k10194
61893B917507j91498j74208j58311j43713j30234j17504j05031r2756q1376p1741
61883A651135o3937n7243n0859m4514l8459l3012k8076k3129j7963j3170r313
61872A271460n816j606L152P126R973J3115J7640K2599K6434K9054L1358L3452
61860A457941L4714L5112L5112L4592L2970L0176K6516K1862J6154J0436O184
61849A741769L701K147J184J425L249O050Q868J0938J1636J0710Q641O141L375
61836A819834K81k566m294m780m480l365q84L089Q192J4444K2191L0983L9247
$$ plain form
61823 1917892 1963122 2010899 2057268 2098555 2132456 2158646 2178477 2194549 2210584 2230774 2258461
61812 2258461 2295479 2342900 2401880 2473459 2558080 2655892 2767352 2893320 3034992 3194086
61802 3194086 3372835 3573608 3798901 4051779 4335773 4654179 5010100 5407465 5851257
61793 5851257 6346144 6895070 7499067 8157199 8865378 9614704 10390135 11169051 11920028
61784 11920028 12603874 13178079 13602924 13847091 13892410 13737297 13396959 12899531 12280427
61775 12280427 11577468 10826857 10059572 9299481 8564116 7866261 7214296 6612084 6060197
61766 6060197 5557779 5103205 4693710 4325509 3994615 3697361 3430496 3191269 2977204
61757 2977204 2785457 2612807 2456614 2315371 2187928 2072715 1968212 1873534 1787886 1709914
$$ packed form
61823A917892M5230M7777M6369M1287L3901K6190J9831J6072J6035K0190K7687
61812B258461L7018M7421N8980P1579Q4621R7812J11460J25968J41672J59094
61802C194086J78749K00773K25293K52878K83994L18406L55921L97365M43792
61793E851257M94887N48926O03997O58132P08179P49326P75431P78916P50977
61784A1920028O83846N74205M24845K44167M5319j55113l40338m97428o19104
61775A2280427p02959p50611p67285p60091p35365o97855o51965o02212n51887
61766F060197n02418m54574m09495l68201l30894k97254k66865k39227k14065
61757B977204j91747j72650j56193j41243j27443j15213j04503r4678q5648p7972
$$ plain form
61747 1709914 1638271 1572371 1511988 1456526 1405330 1358289 1315360 1275893 1239096 1204762 1172845
61736 1172845 1142762 1113940 1086749 1062072 1040127 1020415 1002535 986304 971254 956767 942640
61725 942640 928961 915622 902495 889811 877801 866250 854961 844276 834541 825590 817497 811302
61713 811302 807974 807006 807011 807367 808134 808505 806582 800922 791422 778614 762982 745247 726508 707800 689924
61698 689924 673685 659633 647561 636882 627476 619531 612675 606107 599594 593513 587777 581513 574009
61685 574009 565365 556081 546706 538017 530739 524726 518983 512833 506619 501031 496212 491766 487284 482667
61671 482667 478182 474253 470936 467706 464156 460751 458396 457347 457097 457216 457705 458549 459546 460565 461314 460915
61655 460915 458495 454377 449922 445956 442032 437555 432956 429191 426489 424131 421290 417727 413736 409682
$$ packed form
61747A709914p1643o5900o0383n5462n1196m7041m2929l9467l6797l4334l1917
61736A172845l0083k8822k7191k4677k1945j9712j7880j6231j5050j4487j4127
61725I42640j3679j3339j3127j2684j2010j1551j1289j0685r735q951q093o195
61713H11302l328r68NL56P67L71j923n660r500j2808j5632j7735j8739j8708j7876
61698F89924j6239j4052j2072j0679r406p945o856o568o513o081n736o264p504
61685E74009q644r284r375q689p278o013n743o150o214n588m819m446m482m617
61671D82667m485l929l317l230l550l405k355j049k50J19M89Q44R97J019P49l99
61655D60915k420m118m455l966l924m477m599l765k702k358k841l563l991m054
$$ plain form
61641 409682 405708 401900 398581 396135 394415 392763 390971 389813 390131 391724 393772 396025 398831 402096
61627 402096 404978 406710 407142 406507 405231 403949 403052 402177 400707 398690 396623 394429 391531 388045 385019
61612 385019 383154 382016 380885 379820 379418 379996 381396 383263 385199 386953 388780 391362 395156 399929 404991
61597 404991 409654 413511 416658 419725 423379 427759 432610 437836 443562 449735 456134 462669 469321 475936
61583 475936 482636 490282 499902 511683 525111 540034 556885 575801 596312 618157 641694 667144
61571 667144 693821 720335 745183 767093 785417 800546 813556 825197 835477 844278 851867 858671
61559 858671 864993 871185 877684 884680 892113 900159 909404 920340 932896 946506 960355 973618 985861
61546 985861 997275 1008148 1018108 1026261 1032025 1035424 1036572 1035443 1032259 1027689 1022456 1016955 1011257 1005276
$$ packed form
61641D09682l974l808l319k446j720j652j792j158L18J593K048K253K806L265
61627D02096K882J732M32o35j276j282q97q75j470k017k067k194k898l486l026
61612C85019j865j138j131j065m02N78J400J867J936J754J827K582L794M773N062
61597D04991M663L857L147L067L654M380M851N226N726O173O399O535O652O615
61583D75936O700P646R620J1781J3428J4923J6851J8916K0511K1845K3537K5450
61571F67144K6677K6514K4848K1910J8324J5129J3010J1641J0280Q801P589O804
61559H58671O322O192O499O996P433Q046R245J0936J2556J3610J3849J3263J2243
61546I85861J1414J0873R960Q153N764L399J148j129l184m570n233n501n698n981
$$ plain form
61532 1005276 999063 993240 988887 986636 986103 986683 988483 991908 996780 1002805 1010747 1022084 1037436 1056221
61518 1056221 1077937 1102942 1131787 1164690 1201979 1244318 1292216 1345964 1406259 1474141 1550063
61507 1550063 1633727 1725213 1825616 1936195 2057375 2188755 2329427 2477954 2632682 2792372
61497 2792372 2955910 3120983 3283476 3438340 3580454 3704540 3805273 3878460 3922149 3936653
61487 3936653 3924170 3888574 3834725 3767206 3689811 3606164 3519824 3433073 3346048 3257704 3167412
61476 3167412 3075367 2982083 2888308 2795472 2705823 2621970 2546262 2480232 2424446 2378876 2343286
61465 2343286 2317020 2298763 2287193 2281876 2282980 2290124 2302084 2317493 2335136 2353668 2371959 2389853
61453 2389853 2407811 2425772 2443302 2460898 2479981 2501229 2524045 2548153 2574685 2604964 2639258
$$ packed form
61532A005276o213n823m353k251n33N80J800L425M872O025P942J1337J5352J8785
61518A056221K1716K5005K8845L2903L7289M2339M7898N3748O0295O7882P5922
61507A550063Q3664R1486J00403J10579J21180J31380J40672J48527J54728J59690
61497B792372J63538J65073J62493J54864J42114J24086J00733P3187M3689J4504
61487C936653j2483l5596n3849o7519p7395q3647q6340q6751q7025q8344r0292
61476C167412r2045r3284r3775r2836q9649q3853p5708o6030n5786m5570l5590
61465B343286k6266j8257j1570n317J104P144J1960J5409J7643J8532J8291J7894
61453B389853J7958J7961J7530J7596J9083K1248K2816K4108K6532L0279L4294
$$ plain form
61442 2639258 2677482 2720260 2768291 2821288 2878403 2938993 3001853 3063930 3120784 3168454 3204551
61431 3204551 3228096 3239237 3239075 3229063 3210343 3183785 3150437 3111681 3069307 3025754 2983870 2945917
61419 2945917 2912895 2885106 2863033 2847336 2838157 2834510 2834020 2833321 2829500 2821628 2810596 2797503 2783007
61406 2783007 2768331 2755676 2746663 2740976 2737258 2734827 2733764 2733796 2734056 2733961 2733799 2734485 2736988 2741761 2748585
61391 2748585 2757366 2769265 2786387 2810083 2840382 2877673 2924148 2982643 3054542 3139708 3238211
61380 3238211 3351209 3480083 3625278 3786068 3960914 4147777 4343787 4544102 4741025
61371 4741025 4924928 5086699 5219368 5317971 5379346 5402944 5391139 5347821 5276892 5182252 5068121
61360 5068121 4938177 4794714 4639450 4474872 4304097 4129839 3954344 3780091 3609736
$$ packed form
61442B639258L8224M2778M8031N2997N7115O0590O2860O2077N6854M7670L6097
61431C204551K3545J1141j62j0012j8720k6558l3348l8756m2374m3553m1884l7953
61419B945917l3022k7789k2073j5697r179l647m90o99l821p872j1032j3093j4496
61406B783007j4676j2655r013n687l718k431j063L2K60r5j62O86K503M773O824
61391B748585Q781J1899J7122K3696L0299L7291M6475N8495P1899Q5166R8503
61380C238211J12998J28874J45195J60790J74846J86863J96010K00315J96923
61371D741025J83903J61771J32669R8603O1375K3598j1805m3318p0929r4640j14131
61360E068121j29944j43463j55264j64578j70775j74258j75495j74253j70355
$$ plain form
61351 3609736 3445450 3288895 3141640 3004953 2879244 2764259 2659778 2565845 2482571 2410053
61341 2410053 2348179 2296208 2253023 2218211 2192438 2176335 2169479 2170907 2180074 2196786 2220794 2251925
61329 2251925 2289862 2332780 2376585 2416327 2448360 2470983 2483912 2488145 2485885 2479577 2470962 2461359
61317 2461359 2452150 2444131 2436896 2429754 2422934 2417149 2412505 2408890 2407102 2408580 2414110 2423529 2436377 2451917
61303 2451917 2468854 2486072 2503545 2521518 2538863 2553216 2562761 2567028 2565882 2558756 2545242 2525842
61291 2525842 2501927 2475337 2448074 2421915 2398207 2378065 2362190 2349923 2338863 2326125 2309802
61280 2309802 2288891 2262648 2231158 2196282 2160947 2127423 2096871 2070106 2047691 2029299 2014022
61269 2014022 2001545 1992328 1986537 1983453 1982125 1982132 1983644 1986982 1991971 1997509 2002328 2006599 2012311 2021583
$$ packed form
61351C609736j64286j56555j47255j36687j25709j14985j04481r3933q3274p2518
61341B410053o1874n1971m3185l4812k5773j6103o856J428R167J6712K4008L1131
61329B251925L7937M2918M3805L9742L2033K2623J2929M233k260o308q615r603
61317B461359r209q019p235p142o820n785m644l615j788J478N530R419J2848J5540
61303B451917J6937J7218J7473J7973J7345J4353R545M267j146p126j3514j9400
61291B525842k3915k6590k7263k6159k3708k0142j5875j2267j1060j2738j6323
61280B309802k0911k6243l1490l4876l5335l3524l0552k6765k2415j8392j5277
61269B014022j2477r217n791l084j328PJ512L338M989N538M819M271N712R272
$$ plain form
61255 2021583 2035343 2054225 2079715 2113146 2154191 2201614 2255116 2315279 2382158 2455303 2534907
61244 2534907 2621508 2714480 2811835 2911060 3008570 3098232 3171861 3221677 3241836 3228467 3180506
61233 3180506 3101162 2997255 2876323 2744929 2609373 2476188 2350926 2237145 2136863 2051120
61223 2051120 1979915 1922730 1879666 1851296 1837096 1834529 1839442 1846295 1848301 1839253 1816304 1780491
61211 1780491 1734694 1682132 1626617 1572243 1521668 1475452 1433356 1395175 1360028 1326447 1294047
61200 1294047 1263971 1236974 1212235 1188851 1167318 1148498 1132171 1117750 1105553 1096157 1088999 1082789
61188 1082789 1077008 1072057 1068135 1064715 1061070 1056842 1052286 1048272 1045735 1044947 1045762 1048707 1055089 1065660
61174 1065660 1079663 1095252 1109853 1119784 1120832 1110391 1088939 1059146 1024103 986649 949260 913508
$$ packed form
61255B021583J3760J8882K5490L3431M1045M7423N3502O0163O6879P3145P9604
61244B534907Q6601R2972R7355R9225R7510Q9662P3629M9816K0159j3369m7961
61233C180506p9344j03907j20932j31394j35556j33185j25262j13781j00282q5743
61223B051120p1205n7185m3064k8370j4200k567M913O853K006r048k2949l5813
61211A780491m5797n2562n5515n4374n0575m6216m2096l8181l5147l3581l2400
61200A294047l0076k6997k4739k3384k1533j8820j6327j4421j2197r396p158o210
61188A082789n781m951l922l420l645m228m556m014k537p88Q15K945O382J0571
61174A065660J4003J5589J4601R931J048j0441k1452k9793l5043l7454l7389l5752
$$ plain form
61162 913508 879802 848077 818429 790877 765214 741476 719938 700351 681852 664011 647229
61151 647229 631758 617162 603213 590490 579511 569983 561418 553826 547343 541839 537350 534231 532519
61138 532519 531868 532378 534593 538447 543328 549594 558781 571666 587236 604131 621689 638618 651996
61125 651996 659042 659249 653837 644026 630887 615921 600466 585036 570145 556964 546084 536489 527025
61112 527025 518167 511072 505555 500401 495261 490888 487773 485732 484600 484220 483918 483050 481908 481234 481167 481465
61096 481465 482314 483947 485850 487316 488543 490324 493035 496654 501218 506444 511518 516179 521371 527869
61082 527869 534993 541782 548618 556404 564817 572822 580292 587712 594786 600848 606264 611936 617792 623264
61068 623264 628850 635512 642748 648956 653728 658209 663216 668524 674103 680562 688114 696422 705661 716577
$$ packed form
61162I13508l3706l1725k9648k7552k5663k3738k1538j9587j8499j7841j6782
61151F47229j5471j4596j3949j2723j0979r528q565p592o483n504m489l119j712
61138E32519o51N10K215L854M881O266R187J2885J5570J6895J7558J6929J3378
61125F51996P046K07n412r811j3139j4966j5455j5430j4891j3181j0880r595r464
61112E27025q858p095n517n154n140m373l115k041j132l80l02q68j142o74o7K98
61096D81465Q49J633J903J466J227J781K711L619M564N226N074M661N192O498
61082E27869P124O789O836P786Q413Q005P470P420P074O062N416N672N856N472
61068F23264N586O662P236O208M772M481N007N308N579O459P552Q308R239J0916
$$ plain form
61054 716577 729483 744260 761168 780446 801350 822952 845643 870501 897532 926005 956058
61043 956058 988140 1021200 1053432 1084710 1116274 1148047 1178400 1206727 1234113 1261149 1287161
61032 1287161 1312072 1336975 1362430 1388182 1415033 1444963 1479010 1517110 1560388 1611316 1670880
61021 1670880 1737627 1809841 1886354 1965193 2044565 2126117 2214503 2313092 2423160 2547701 2691740
61010 2691740 2857035 3040271 3238462 3452675 3685243 3939007 4222985 4554313 4950871
61001 4950871 5426603 5997739 6687455 7519442 8515303 9708340 11155431 12929866 15118180
60992 15118180 17838356 21219377 25262062 29642170 33676655 36597689 37975063 37938051
60984 37938051 37029403 35881709 35015083 34811053 35472940 36868044 38424038 39310770 38861108
$$ packed form
61054G16577J2906J4777J6908J9278K0904K1602K2691K4858K7031K8473L0053
61043I56058L2082L3060L2232L1278L1564L1773L0353K8327K7386K7036K6012
61032A287161K4911K4903K5455K5752K6851K9930L4047L8100M3278N0928N9564
61021A670880O6747P2214P6513P8839P9372Q1552Q8386R8589J10068J24541J44039
61010B691740J65295J83236J98191K14213K32568K53764K83978L31328L96558
61001D950871M75732N71136O89716Q31987R95861J193037J447091J774435K188314
60992A5118180K720176L381021M042685M380108M034485K921034J377374l7012
60984C7938051r08648j147694q66626k04030O61887J395104J555994Q86732m49662
$$ plain form
60975 38861108 36908313 33785046 30049934 26206558 22584714 19353431 16566486 14202133
60967 14202133 12204758 10520004 9104930 7920972 6932104 6110173 5433766 4880439 4424806
60958 4424806 4044244 3722012 3445027 3203015 2990212 2803974 2640794 2496066 2367340
60949 2367340 2254459 2156253 2069951 1993950 1927940 1869534 1813383 1754632 1691461 1624100 1553749
60938 1553749 1483077 1415496 1352709 1294142 1238991 1187271 1138762 1092906 1050103 1011362 976334
60927 976334 943449 912271 883835 858348 834643 812395 792775 776086 760758 745640 731389
60916 731389 718548 706122 693333 681166 670716 661376 651939 642266 632650 622800 612869 604321 598283
60903 598283 593905 589665 585451 582051 579461 577161 575412 574882 575365 576104 576984 578364 580124 581914 583929
$$ packed form
60975C8861108j952795l123267l735112l843376l621844l231283k786945k364353
60967A4202133j997375j684754j415074j183958r88868q21931o76407n53327m55633
60958D424806l80562l22232k76985k42012k12803j86238j63180j44728j28726
60949B367340j12881r8206q6302p6001o6010n8406n6151n8751o3171o7361p0351
60938A553749p0672o7581o2787n8567n5151n1720m8509m5856m2803l8741l5028
60927I76334l2885l1178k8436k5487k3705k2248j9620j6689j5328j5118j4251
60916G31389j2841j2426j2789j2167j0450r340r437r673r616r850r931q548o038
60903E98283m378m240m214l400k590k300j749n30M83P39Q80J380J760J790K015
$$ plain form
60888 583929 586443 589019 591115 592955 594846 596177 596155 595042 593589 591757 589135 586210 583941 582316 580546
60873 580546 578549 577106 576584 576525 576500 576427 576144 575622 575572 576875 579379 582080 584472 587001 590339 595014 601532
60856 601532 609734 617988 624032 626877 627208 626017 623812 621209 619145 617946 616841 614684 610619 604030
60842 604030 594704 583502 572210 562246 553759 546122 538850 531929 525661 520437 516409 513336 510909 509010
60828 509010 507418 505653 503634 502101 501734 502177 502681 503356 504842 506973 508812 510054 511297 512734 513627
60813 513627 513508 513070 513349 514572 516229 517843 519288 520640 522034 523478 524771 525769 526494 526733 525898 523849
60797 523849 521489 519852 518898 517926 516795 515726 514217 511388 507415 503461 500014 496412 492227 487949 483901
60782 483901 479562 474523 469172 463900 458476 452800 447490 443159 439763 437151 435616 435329 435832 436530 437215
$$ packed form
60888E83929K514K576K096J840J891J331k2j113j453j832k622k925k269j625j770
60873E80546j997j443n22n9k5p3k83n22n0J303K504K701K392K529L338M675O518
60856F01532Q202Q254O044K845L31j191k205k603k064j199j105k157m065o589
60842F04030r326j1202j1292r964q487p637p272o921o268n224m028l073k427j899
60828E09010j592j765k019j533l67M43N04O75J486K131J839J242J243J437Q93
60813E13627j19m38K79J223J657J614J445J352J394J444J293R98P25K39q35k049
60797E23849k360j637r54r72j131j069j509k829l973l954l447l602m185m278m048
60782D83901m339n039n351n272n424n676n310m331l396k612j535k87N03O98O85
$$ plain form
60767 437215 437811 438250 438871 440172 441832 442823 442944 443352 445004 447425 449704 451842 454224 456417 457492 457207
60751 457207 456033 454258 451743 448376 444225 439569 435225 432402 431591 431888 431953 431334 430330 429081 427478
60736 427478 425752 424323 423123 421592 419338 416381 412831 408686 403933 398654 393100 387735 382965 378738
60722 378738 374762 371083 367925 364979 361670 358357 356396 356463 357588 358404 358683 358919 359102 358881 358543 358924
60706 358924 360453 362932 366101 369787 373720 377763 382196 387236 392439 397086 401023 404676 408393 412113
60692 412113 415552 418346 420246 421448 422430 423220 423313 422657 422158 422641 423741 424486 424608 424613 424801 424939 424866 424857 425356
60673 425356 426612 428502 430533 432286 433988 436225 438922 441240 442856 444657 447610 451536 455718 460140
60659 460140 465253 470793 475661 478916 480305 480039 478580 476464 473908 470867 467855 466068 466128 467204 468175
$$ packed form
60767D37215N96M39O21J301J660R91J21M08J652K421K279K138K382K193J075k85
60751D57207j174j775k515l367m151m656m344k823q11K97O5o19j004j249j603
60736D27478j726j429j200j531k254k957l550m145m753n279n554n365m770m227
60722C78738l976l679l158k946l309l313j961O7J125Q16K79K36J83k21l38L81
60706C58924J529K479L169L686L933M043M433N040N203M647L937L653L717L720
60692D12113L439K794J900J202R82P90R3o56m99M83J100P45J22NJ88J38p3rM99
60673D25356J256J890K031J753J702K237K697K318J616J801K953L926M182M422
60659D60140N113N540M868L255J389k66j459k116k556l041l012j787O0J076R71
$$ plain form
60644 468175 469162 470994 473620 476118 478136 480215 482621 484805 486285 487324 488414 489577 490404 490451 489471
60629 489471 487551 485071 482363 479558 476864 474590 472620 470355 467673 465431 464442 464437 464724 465385 466986 469467
60613 469467 472245 475258 478988 483460 488064 492399 496601 500759 504739 508672 513078 518312 524220 530226
60599 530226 535424 538890 540469 541032 541371 541054 538985 534807 529149 522802 516393 510595 505699 501073 495904
60584 495904 490484 485970 482866 480577 478538 476903 475903 475194 474216 472746 470948 469219 468083 467868 468485
60569 468485 469746 471650 473983 476075 477469 478548 479835 481039 481494 481205 480620 479613 477628 474687 471432
60554 471432 468242 465091 462109 459408 456517 452916 449023 445789 443493 441936 441591 443343 447057 451660
60540 451660 456813 463300 471478 480592 490146 500883 513805 529144 546823 567184 590666 617404
$$ packed form
60644D68175R87J832K626K498K018K079K406K184J480J039J090J163Q27M7r80
60629D89471j920k480k708k805k694k274j970k265k682k242r89nK87O61J601K481
60613D69467K778L013L730M472M604M335M202M158L980L933M406N234N908O006
60599E30226N198L466J579N63L39l17k069m178n658o347o409n798m896m626n169
60584D95904n420m514l104k289k039j635j000p09r78j470j798j729j136k15O17
60569D68485J261J904K333K092J394J079J287J204M55k89n85j007j985k941l255
60554D71432l190l151k982k701k891l601l893l234k296j557l45J752L714M603
60540D51660N153O487Q178R114R554J0737J2922J5339J7679K0361K3482K6738
$$ plain form
60528 617404 647469 680615 715270 748540 777877 802281 821553 835126 842147 842121 835081 821807
60516 821807 804311 785330 766592 748066 729329 711031 694395 679905 667296 656495 647798 641301
60504 641301 636835 634469 634638 637770 644074 653621 666377 682164 700730 721835 745260 770776 797826
60491 797826 824865 849302 868738 882445 891365 896885 900236 902939 906978 914198 925976 943423 967119
60478 967119 996397 1029624 1065663 1104720 1147737 1195652 1249612 1311390 1383285 1468007 1568827
60467 1568827 1689165 1831474 1996397 2182418 2384999 2595263 2799887 2983072 3129229
60458 3129229 3225114 3261479 3234529 3146590 3005725 2824642 2618722 2402920 2188931 1984629
60448 1984629 1795370 1624725 1473910 1341793 1226337 1125924 1039295 965065 901829 848345
$$ packed form
60528F17404L0065L3146L4655L3270K9337K4404J9272J3573P021k6p040j3274
60516H21807j7496j8981j8738j8526j8737j8298j6636j4490j2609j0801q697o497
60504F41301m466k366J69L132O304R547J2756J5787J8566K1105K3425K5516K7050
60491G97826K7039K4437J9436J3707Q920N520L351K703M039P220J1778J7447K3696
60478I67119K9278L3227L6039L9057M3017M7915N3960O1778P1895Q4722J00820
60467A568827J20338J42309J64923J86021K02581K10264K04624J83185J46157
60458C129229R5885L6365k6950q7939j40865j81083k05920k15802k13989k04302
60448A984629j89259j70645j50815j32117j15456j00413q6629p4230o3236n3484
$$ plain form
60438 848345 803355 765611 734139 707946 685430 664817 645350 627424 611394 596985 584015
60427 584015 572845 563698 556176 549784 544326 539513 534830 530157 526001 522921 521282 521612 524345 528977
60413 528977 534270 539574 545183 551213 557158 563008 569885 578931 590236 603293 617738 633182 649079
60400 649079 665323 682187 699143 714532 727049 736877 744756 750688 754343 756074 756771 757123 757674 759031
60386 759031 761398 764337 767519 771118 774904 777727 778723 778548 778500 778827 778718 777721 776328 775279 775002 775822
60370 775822 778184 782509 788910 796861 805097 812179 817267 820025 819931 816517 810375 802992 795124 786148 775461
60355 775461 763727 752122 741104 730585 720641 711316 702249 693178 684377 676051 667819 659342 650979
60342 650979 643377 637009 632497 630511 630633 631102 630559 629529 629419 630612 632334 633813 634660 634523 633290 631393
$$ packed form
60438H48345m4990l7744l1472k6193k2516k0613j9467j7926j6030j4409j2970
60427E84015j1170r147p522o392n458m813m683m673m156l080j639L30K733M632
60413E28977N293N304N609O030N945N850O877R046J1305J3057J4445J5444J5897
60400F49079J6244J6864J6956J5389J2517R828P879N932L655J731O97L52N51J357
60386G59031K367K939L182L599L786K823R96j75m8L27j09r97j393j049k77Q20
60370G75822K362M325O401P951Q236P082N088K758r4l414o142p383p868q976j0687
60355G75461j1734j1605j1018j0519r944r325r067r071q801q326q232q477q363
60342F50979p602o368m512j986J22M69n43j030j10J193J722J479Q47j37j233j897
$$ plain form
60326 631393 629189 626338 622431 617872 613520 609801 606783 604653 603387 602356 600966 599380 597984 596523
60312 596523 594507 592083 589820 587857 585868 583575 580773 577215 573033 568886 565190 561652 558058 554941
60298 554941 552868 551603 550688 550330 550982 552543 554610 557066 559777 562319 564655 567452 570941 574184 576342
60283 576342 578021 580360 583479 586993 591497 598164 607015 616752 626221 635072 643210 650745 658489 667473
60269 667473 677767 688424 698564 707840 716113 723515 730784 738749 747467 756456 765592 775130 785119
60256 785119 795518 806708 819178 832911 847704 863810 881585 900863 921389 943591 968153
60245 968153 995171 1024519 1056654 1092181 1130903 1172181 1216005 1262952 1313426 1367748 1426635
60234 1426635 1490656 1559480 1632508 1709905 1792102 1878612 1968252 2060046 2152874 2244683 2333344
$$ packed form
60326F31393k204k851l907m559m352l719l018k130j266j031j390j586j396j461
60312E96523k016k424k263j963j989k293k802l558m182m147l696l538l594l117
60298E54941k073j265r15l58O52J561K067K456K711K542K336K797L489L243K158
60283E76342J679K339L119L514M504O667Q851R737R469Q851Q138P535P744Q984
60269F67473J0294J0657J0140R276Q273P402P269P965Q718Q989R136R538R989
60256G85119J0399J1190J2470J3733J4793J6106J7775J9278K0526K2202K4562
60245I68153K7018K9348L2135L5527L8722M1278M3824M6947N0474N4322N8887
60234A426635O4021O8824P3028P7397Q2197Q6510Q9640R1794R2828R1809Q8661
$$ plain form
60223 2333344 2418121 2499083 2575208 2644254 2704454 2755164 2795954 2826360 2846711 2858073 2861099
60212 2861099 2855885 2843142 2824714 2802819 2779452 2756408 2734957 2715570 2698765 2686089 2679391 2679469
60200 2679469 2686516 2701552 2726097 2760462 2803638 2854947 2914559 2982345 3057503 3139445 3227709
60189 3227709 3320614 3415101 3508177 3597498 3680414 3753806 3815368 3864130 3899431 3920415 3926743
60178 3926743 3918600 3895615 3856949 3802921 3735512 3656885 3568607 3472901 3373494 3274351 3178394
60167 3178394 3088014 3005880 2934320 2874522 2827021 2792525 2771723 2764828 2771796 2792523 2826392 2872084
60155 2872084 2928017 2992305 3061918 3132362 3198606 3256204 3301927 3334330 3353828 3361396 3356967 3339902
60143 3339902 3310913 3272447 3227025 3176486 3123248 3071017 3023411 2982716 2950495 2928361 2917377
$$ packed form
60223B333344Q4777Q0962P6125O9046O0200N0710M0790L0406K0351J1362L026
60212B861099n214j2743j8428k1895k3367k3044k1451j9387j6805j2676o698P8
60200B679469P047J5036K4545L4365M3176N1309N9612O7786P5158Q1942Q8264
60189C227709R2905R4487R3076Q9321Q2916P3392O1562M8762L5301K0984O328
60178C926743q143k2985l8666n4028o7409p8627q8278r5706r9407r9143r5957
60167C178394r0380q2134p1560n9798m7501l4496k0802o895O968K0727L3869M5692
60155B872084N5933O4288O9613P0444O6244N7598M5723L2403J9498P568m429j7065
60143C339902k8989l8466m5422n0539n3238n2231m7606m0695l2221k2134j0984
$$ plain form
60132 2917377 2917623 2929271 2953532 2991856 3044850 3112707 3196008 3295263 3410111 3539820 3684352
60121 3684352 3844323 4020086 4211253 4416743 4634803 4863083 5098866 5338946 5579294
60112 5579294 5815501 6043817 6261246 6464535 6649750 6813101 6951504 7062158 7142573 7191544
60102 7191544 7209353 7196376 7152111 7076032 6968699 6831427 6665706 6473999 6260976 6033250
60092 6033250 5797914 5561506 5329822 5107945 4900334 4710924 4542866 4398005 4277106
60083 4277106 4180806 4109814 4063944 4041643 4041142 4061785 4103735 4166444 4247591 4343196 4448409
60072 4448409 4558303 4668094 4772689 4866510 4944391 5002724 5039428 5053187 5043572 5011722 4959812
60061 4959812 4889544 4801868 4698296 4581548 4454536 4319584 4179091 4036262 3894641 3757449
$$ packed form
60132B917377K46J1648K4261L8324N2994O7857Q3301R9255J14848J29709J44532
60121C684352J59971J75763J91167K05490K18060K28280K35783K40080K40348
60112E579294K36207K28316K17429K03289J85215J63351J38403J10654Q0415M8971
60102G191544J7809j2977m4265p6079j07333j37272j65721j91707k13023k27726
60092F033250k35336k36408k31684k21877k07611j89410j68058j44861j20899
60083D277106r6300p0992m5870k2301n01K0643M1950O2709Q1147R5605J05213
60072D448409J09894J09791J04595R3821P7881N8333L6704J3759r615l1850n1910
60061D959812p0268q7676j03572j16748j27012j34952j40493j42829j41621j37192
$$ plain form
60051 3757449 3627706 3508312 3401461 3308315 3229521 3165648 3116941 3083171 3063931 3058690 3066632
60040 3066632 3087101 3120261 3166528 3225307 3295035 3374448 3462702 3557952 3656813 3755533 3850771
60029 3850771 3938912 4015816 4077990 4123369 4150596 4158543 4147049 4117109 4069568 4004457 3922341
60018 3922341 3825663 3718089 3603314 3485148 3367831 3255177 3149645 3052864 2966511 2892002
60008 2892002 2829871 2780270 2743756 2720989 2712094 2716942 2735715 2768611 2815373 2875739 2950150 3039542
59996 3039542 3144587 3265320 3400953 3549563 3708139 3873037 4039965 4203468 4357283
59987 4357283 4495809 4615119 4712753 4787374 4838772 4867212 4872292 4853023 4809178 4741698 4651675
59976 4651675 4540313 4410649 4268351 4120045 3971536 3828008 3694529 3575122 3471905
$$ packed form
60051C757449j29743j19394j06851r3146p8794o3873m8707l3770j9240n241P942
60040C066632K0469L3160M6267N8779O9728P9413Q8254R5250R8861R8720R5238
60029C850771Q8141P6904O2174M5379K7227P947j1494k9940m7541o5111q2116
60018C922341r6678j07574j14775j18166j17317j12654j05532r6781q6353p4509
60008B892002o2131m9601l6514k2767q895M848J8773L2896M6762O0366P4411Q9392
59996C039542J05045J20733J35633J48610J58576J64898J66928J63503J53815
59987D357283J38526J19310R7634P4621N1398K8440N080j9269m3845o7480r0023
59976D651675j11362j29664j42298j48306j48509j43528j33479j19407j03217
$$ plain form
59967 3471905 3385970 3318392 3269544 3238301 3223104 3223372 3238936 3268653 3310686 3363922 3428138 3502814
59955 3502814 3586424 3676671 3770699 3865266 3957323 4044523 4125007 4197176 4259967 4312843 4355118
59944 4355118 4385803 4404540 4412052 4409186 4396239 4373896 4344389 4311152 4277826 4248029 4225400 4213130
59932 4213130 4213847 4230364 4265858 4322662 4401465 4502328 4625943 4773320 4944944 5140908 5361340
59921 5361340 5605841 5872845 6159974 6464238 6780922 7102462 7418824 7718529 7989022
59912 7989022 8217212 8391194 8502105 8544845 8518361 8426169 8275931 8077587 7841869 7580330
59902 7580330 7305177 7027605 6756473 6498841 6260696 6046251 5857510 5695810 5563344
59893 5563344 5462291 5393064 5354360 5344289 5360304 5398471 5454183 5523781 5605103 5697019 5799343
$$ packed form
59967C471905q5935o7578m8848l1243j5197K68J5564K9717M2033N3236O4216P4676
59955C502814Q3610R0247R4028R4567R2057Q7200Q0484P2169O2791N2876M2275
59944D355118L0685J8737P512k866j2947k2343k9507l3237l3326k9797k2629j2270
59932D213130P17J6517L5494N6804P8803J00863J23615J47377J71624J95964K20432
59921E361340K44501K67004K87129L04264L16684L21540L16362K99705K70493
59912G989022K28190J73982J10911M2740k6484r2192j50238j98344k35718k61539
59902G580330k75153k77572k71132k57632k38145k14445j88741j61700j32466
59893E563344j01053o9227l8704j0071J6015L8167N5712O9598Q1322R1916J02324
$$ plain form
59882 5799343 5912779 6037728 6172787 6314428 6457491 6595348 6720158 6823830 6898797 6938099
59872 6938099 6936095 6890302 6802201 6675851 6516426 6330487 6126196 5911825 5694430 5480478
59862 5480478 5276484 5087592 4916288 4763683 4631329 4520545 4430805 4360310 4307582 4270921
59852 4270921 4246787 4230427 4218156 4207693 4196431 4180951 4158550 4128108 4089286 4042064 3987500
59841 3987500 3928145 3867125 3806818 3748089 3690264 3632210 3574029 3517521 3464768 3416931 3374871
59830 3374871 3339748 3311809 3289256 3269599 3251784 3236175 3223139 3212858 3205945 3202792 3202334 3202378 3200896
59817 3200896 3196258 3187068 3173141 3156258 3138743 3121626 3105323 3091565 3083237 3082615 3091121 3110494
59805 3110494 3142760 3189181 3250762 3329894 3430323 3555458 3707896 3890437 4106080 4356305
$$ packed form
59882E799343J13436J24949J35059J41641J43063J37857J24810J03672P4967L9302
59872F938099k004m5793q8101j26350j59425j85939k04291k14371k17395k13952
59862E480478k03994j88892j71304j52605j32354j10784q9740p0495n2728l6661
59852D270921k4134j6360j2271j0463j1262j5480k2401l0442l8822m7222n4564
59841C987500n9355o1020o0307n8729n7825n8054n8181n6508n2753m7837m2060
59830C374871l5123k7939k2553j9657j7815j5609j3036j0281o913l153m58M4j482
59817C200896m638r190j3927j6883j7515j7117j6303j3758q328o22Q506J9373
59805C110494L2266M6421O1581P9132J00429J25135J52438J82541K15643K50225
$$ plain form
59795 4356305 4639478 4949675 5274608 5593686 5879385 6102734 6240320 6280165 6224755 6089405
59785 6089405 5896104 5666940 5421131 5174764 4940041 4724308 4531174 4362671 4219534
59776 4219534 4100204 4001559 3921017 3857068 3808166 3772498 3748734 3735828 3732391 3737505 3751705
59765 3751705 3775671 3808330 3847726 3893383 3946044 4005386 4069922 4139146 4213806 4293980 4378803
59754 4378803 4468548 4565252 4671010 4787360 4916654 5062094 5225733 5407979 5609594 5832538
59744 5832538 6078283 6347015 6639151 6955820 7296485 7657113 8031244 8411367 8788318
59735 8788318 9150890 9487797 9790068 10051794 10270523 10448458 10592624 10712833 10819777
59726 10819777 10924963 11040609 11177766 11344518 11546184 11786091 12065116 12381058 12729397
$$ packed form
59795D356305K83173L10197L24933L19078K85699K23349J37586L9845n5410j35350
59785F089405j93301k29164k45809k46367k34723k15733j93134j68503j43137
59776D219534j19330r8645q0542o3949m8902l5668k3764j2906l437N114J4200
59765C751705K3966L2659L9396M5657N2661N9342O4536O9224P4660Q0174Q4823
59754D378803Q9745R6704J05758J16350J29294J45440J63639J82246K01615K22944
59744E832538K45745K68732K92136L16669L40665L60628L74131L80123L76951
59735H788318L62572L36907L02271K61726K18729J77935J44166J20209J06944
59726A0819777J05186J15646J37157J66752K01666K39907K79025L15942L48339
$$ plain form
59717 12729397 13104365 13498764 13903245 14306598 14696918 15062846 15394674 15685077 15928932
59708 15928932 16122859 16265617 16358841 16406660 16414784 16390627 16343803 16285100 16224868 16173387 16142398
59697 16142398 16144524 16190750 16289465 16447753 16671791 16965447 17329927 17765318 18271041 18844021
59687 18844021 19477202 20159780 20876876 21607730 22325219 22998266 23594890 24084263 24439450
59678 24439450 24641436 24681761 24562122 24293030 23893033 23386966 22802285 22165336 21498530
59669 21498530 20816849 20124128 19413177 18671623 17889800 17066189 16209540 15337900 14473908
59660 14473908 13637943 12843886 12099560 11408578 10770434 10180566 9632698 9121717 8644299
59651 8644299 8198006 7781018 7392270 7030886 6695528 6384655 6096961 5831288 5586689
$$ packed form
59717A2729397L74968L94399M04481M03353L90320L65928L31828K90403K43855
59708A5928932J93927J42758R3224M7819Q124k4157m6824n8703o0232n1481l0989
59697A6142398K126M6226R8715J58288K24038K93656L64480M35391N05723N72980
59687A8844021O33181O82578P17096P30854P17489O73047N96624M89373L55187
59678B4439450K01986M0325j19639k69092l99997n06067n84681o36949o66806
59669B1498530o81681o92721p10951p41554p81823q23611q56649q71640q63992
59660A4473908q35965p94057p44326o90982o38144n89868n47868n10981m77418
59651H644299m46293m16988l88748l61384l35358l10873k87694k65673k44599
$$ plain form
59642 5586689 5362827 5159647 4976448 4812036 4665809 4537642 4426575 4330800 4249184 4181400
59632 4181400 4126069 4080284 4041701 4009822 3984373 3963647 3945494 3928894 3913483 3898308 3881879
59621 3881879 3862667 3838808 3808186 3769684 3723722 3670969 3611469 3545731 3475757 3404174 3333081
59610 3333081 3264302 3199794 3140881 3087752 3040297 2998684 2962669 2931438 2904903 2884207 2870223
59599 2870223 2862415 2859851 2862425 2870391 2883630 2902041 2925624 2953440 2983418 3013803 3043839 3072508
59587 3072508 3097966 3119089 3136455 3151040 3163235 3174063 3185917 3200902 3219563 3242392 3271214
59576 3271214 3307690 3351683 3402728 3462122 3531877 3612334 3702540 3802508 3913516 4036403 4170906
59565 4170906 4316403 4472013 4636164 4807225 4984394 5166913 5352645 5538443 5721724
$$ packed form
59642E586689k23862k03180j83199j64412j46227j28167j11067r5775q1616o7784
59632D181400n5331m5785l8583l1879k5449k0726j8153j6600j5411j5175j6429
59621C881879j9212k3859l0622l8502m5962n2753n9500o5738o9974p1583p1093
59610C333081o8779o4508n8913n3129m7455m1613l6015l1231k6535k0696j3984
59599B870223p808k564K574P966J3239J8411K3583K7816K9978L0385L0036K8669
59587C072508K5458K1123J7366J4585J2195J0828J1854J4985J8661K2829K8822
59576C271214L6476M3993N1045N9394O9755Q0457R0206R9968J11008J22887J34503
59565D170906J45497J55610J64151J71061J77169J82519J85732J85798J83281
$$ plain form
59556 5721724 5900648 6072790 6234644 6382807 6515280 6631295 6729465 6805451 6851799 6861696
59546 6861696 6833936 6773741 6688683 6584862 6466976 6339714 6207456 6073811 5942992 5820776
59536 5820776 5712858 5623139 5554770 5511817 5498393 5516973 5568999 5656315 5780285 5939848 6131616
59525 6131616 6351091 6591989 6844596 7096397 7334505 7546679 7720853 7845782 7913003 7917775
59515 7917775 7858533 7736634 7556738 7326627 7056437 6757995 6443742 6124845 5810153 5507116
59505 5507116 5222664 4962120 4727754 4519458 4336617 4178838 4045655 3936596 3851202 3788387
59495 3788387 3746373 3723911 3720764 3736321 3768783 3816665 3880177 3960124 4056355 4168285 4295776
59484 4295776 4438080 4592674 4756273 4925943 5097694 5264826 5419254 5554041 5663565
$$ packed form
59556E721724J78924J72142J61854J48163J32473J16015R8170P5986M6348R897
59546F861696k7760o0195q5058j03821j17886j27262j32258j33645j30819j22216
59536E820776j07918q9719o8369m2953j3424J8580N2026Q7316J23970J59563J91768
59525F131616K19475K40898K52607K51801K38108K12174J74174J24929O7221M772
59515G917775n9242j21899j79896k30111k70190k98442l14253l18897l14692l03037
59505E507116k84452k60544k34366k08296j82841j57779j33183j09059q5394o2815
59495C788387m2014k2462l147J5557L2462M7882O3512P9947R6231J11930J27491
59484D295776J42304J54594J63599J69670J71751J67132J54428J34787J09524
$$ plain form
59475 5663565 5742402 5786024 5792209 5760313 5689937 5582104 5441286 5274357 5087593 4886064
59465 4886064 4675338 4461666 4250149 4044118 3846240 3658782 3482722 3317970 3164650
59456 3164650 3023144 2893150 2773968 2665549 2568028 2480466 2401430 2330702 2269043 2216345
59446 2216345 2171370 2133301 2102219 2078009 2059995 2047685 2040726 2038174 2038986 2043165 2051304 2063114
59434 2063114 2077674 2094964 2115679 2139502 2165123 2192463 2223514 2260055 2300950 2342001 2378134
59423 2378134 2406182 2426686 2443447 2460959 2482076 2508025 2539729 2578394 2625358 2681811 2747523
59412 2747523 2818819 2888982 2952504 3008911 3061644 3114231 3168866 3227563 3292310 3364015 3442902
59401 3442902 3529958 3626661 3733560 3850657 3979059 4120748 4276832 4447432 4633082 4834651
$$ packed form
59475E663565P8837M3622O185l1896p0376j07833j40818j66929j86764k01529
59465D886064k10726k13672k11517k06031j97878j87458j76060j64752j53320
59456C164650j41506j29994j19182j08419r7521q7562p9036p0728o1659n2698
59446B216345m4975l8069l1082k4210j8014j2310o959k552Q12M179Q139J1810
59434B063114J4560J7290K0715K3823K5621K7340L1051L6541M0895M1051L6133
59423B378134K8048K0504J6761J7512K1117K5949L1704L8665M6964N6453O5712
59412B747523P1296P0163O3522N6407N2733N2587N4635N8697O4747P1705P8887
59401C442902Q7056R6703J06899J17097J28402J41689J56084J70600J85650K01569
$$ plain form
59391 4834651 5051991 5284386 5532654 5799541 6087960 6400174 6738528 7105159 7500254
59382 7500254 7921286 8363610 8820297 9281363 9734942 10170226 10579090 10955764 11296804
59373 11296804 11601840 11873124 12113962 12328166 12520322 12694592 12852450 12992027 13109089
59364 13109089 13197206 13247229 13248366 13190484 13065042 12865092 12586999 12233171 11812316 11337087
59354 11337087 10822366 10284808 9741105 9205160 8687322 8195854 7737391 7315695 6931546
59345 6931546 6584370 6272896 5994293 5744365 5519205 5315623 5129927 4957873 4796353
59336 4796353 4644113 4500593 4365207 4237729 4117935 4004535 3895660 3790581 3689659
59327 3689659 3592465 3497402 3403481 3311167 3221173 3133733 3049425 2969450 2894627 2825130 2761441
$$ packed form
59391D834651K17340K32395K48268K66887K88419L12214L38354L66631L95095
59382G500254M21032M42324M56687M61066M53579M35284M08864L76674L41040
59373A1296804L05036K71284K40838K14204J92156J74270J57858J39577J17062
59364A3109089Q8117N0023J137n7882j25442j99950k78093l53828m20855m75229
59354A1337087n14721n37558n43703n35945n17838m91468m58463m21696l84149
59345F931546l47176l11474k78603k49928k25160k03582j85696j72054j61520
59336D796353j52240j43520j35386j27478j19794j13400j08875j05079j00922
59327C689659r7194r5063r3921r2314q9994q7440q4308p9975p4823o9497o3689
$$ plain form
59316 2761441 2704506 2654737 2611897 2576005 2547292 2525352 2509561 2500259 2498189 2502915 2513274 2529384
59304 2529384 2552632 2583533 2621155 2664866 2715184 2772743 2837846 2911177 2993430 3084073 3181983
59293 3181983 3287495 3402352 3527388 3661225 3800365 3938113 4063651 4165304 4236460 4277342
59283 4277342 4291016 4279765 4245533 4191061 4118866 4030663 3929092 3818683 3704109 3588638
59273 3588638 3474870 3365437 3262024 3165085 3075382 2994493 2923114 2860287 2805084 2757628 2717666
59262 2717666 2683703 2654653 2631088 2613946 2603193 2598645 2600893 2610419 2626736 2649203 2677714 2712060
59250 2712060 2751660 2796468 2847001 2903031 2963550 3028520 3099438 3177797 3264461 3360923 3469401
59239 3469401 3590985 3725361 3873112 4036668 4218218 4418451 4638262 4879704 5143791
$$ packed form
59316B761441n6935m9769m2840l5892k8713k1940j5791r302k070M726J0359J6110
59304B529384K3248L0901L7622M3711N0318N7559O5103P3331Q2253R0643R7910
59293C181983J05512J14857J25036J33837J39140J37748J25538J01653P1156M0882
59283D277342J3674j1251l4232n4472p2195q8203j01571j10409j14574j15471
59273C588638j13768j09433j03413r6939q9703q0889p1379o2827n5203m7456l9962
59262B717666l3963k9050k3565j7142j0753m548K248R526J6317K2467K8511L4346
59250B712060L9600M4808N0533N6030O0519O4970P0918P8359Q6664R6462J08478
59239C469401J21584J34376J47751J63556J81550K00233K19811K41442K64087
$$ plain form
59230 5143791 5428834 5732295 6052823 6388709 6734981 7082995 7421821 7738970 8021034
59221 8021034 8255314 8430985 8538824 8571489 8525355 8401559 8204967 7943428 7628453 7274771
59211 7274771 6897661 6510967 6127410 5758409 5411962 5091827 4799775 4537579 4306039
59202 4306039 4103672 3927773 3775861 3645271 3532718 3435490 3352167 3281303 3220578 3168110
59192 3168110 3123431 3086295 3055750 3031233 3013114 3001085 2993127 2986982 2981280 2974319 2963180 2945330
59180 2945330 2919932 2886700 2844872 2794498 2737476 2676199 2612259 2547301 2483621 2422798 2365050
59169 2365050 2310868 2261765 2218446 2179995 2146084 2118153 2096915 2080472 2066516 2054825 2045855
59158 2045855 2038572 2031708 2025829 2022243 2021142 2022744 2028997 2041855 2060654 2083108 2108011 2134993 2162554
$$ packed form
59230E143791K85043L03461L20528L35886L46272L48014L38826L17149K82064
59221H021034K34280J75671J07839L2665m6134j23796j96592k61539l14975l53682
59211G274771l77110l86694l83557l69001l46447l20135k92052k62196k31540
59202D306039k02367j75899j51912j30590j12553r7228q3323p0864o0725n2468
59192C168110m4679l7136l0545k4517j8119j2029p958o145n702o961j1139j7850
59180B945330k5398l3232m1828n0374n7022o1277o3940o4958o3680o0823n7748
59169B365050n4182m9103m3319l8451l3911k7931k1238j6443j3956j1691q970
59158B045855p283o864n879l586j101J602O253J2858J8799K2454K4903K6982K7561
$$ plain form
59145 2162554 2188630 2212750 2235789 2258069 2279427 2300638 2322726 2345016 2365401 2382319 2395044
59134 2395044 2402444 2403037 2396240 2382379 2361819 2335361 2305247 2274693 2246677 2223857 2208736 2202516
59122 2202516 2204216 2212012 2224972 2242604 2263642 2286572 2310792 2336126 2361890 2387636 2414239 2443170
59110 2443170 2475240 2510842 2550472 2593940 2639997 2687876 2738404 2792658 2850563 2911851 2977209
59099 2977209 3047224 3121392 3199440 3282314 3370292 3461142 3551624 3639615 3723101 3798187 3859990
59088 3859990 3904806 3929954 3932673 3911270 3866920 3802851 3722539 3630071 3530906 3429906 3328909
59077 3328909 3227759 3126991 3027862 2930770 2835885 2745023 2661074 2585844 2520037 2464786 2421443
59066 2421443 2390275 2371102 2364883 2373115 2395853 2431432 2477064 2527766 2575109 2609095 2621898 2609713
$$ packed form
59145B162554K6076K4120K3039K2280K1358K1211K2088K2290K0385J6918J2725
59134B395044P400N93o797j3861k0560k6458l0114l0554k8016k2820j5121o220
59122B202516J700P796J2960J7632K1038K2930K4220K5334K5764K5746K6603K8931
59110B443170L2070L5602L9630M3468M6057M7879N0528N4254N7905O1288O5358
59099B977209P0015P4168P8048Q2874Q7978R0850R0482Q7991Q3486P5086O1803
59088C859990M4816K5148K719k1403m4350o4069q0312r2468r9165j01000j00997
59077C328909j01150j00768r9129r7092r4885r0862q3949p5230o5807n5251m3343
59066B421443l1168j9173o219Q232K2738L5579M5632N0702M7343L3986J2803j2185
$$ plain form
59054 2609713 2572648 2514625 2442350 2362237 2278320 2193882 2113430 2041023 1977804 1923491 1879448
59043 1879448 1847901 1828745 1819416 1817360 1820231 1824155 1824607 1819383 1808849 1793440 1773107 1749148 1724242
59030 1724242 1700118 1676967 1655281 1636445 1621200 1609253 1600709 1596443 1596877 1601718 1610876 1624273
59018 1624273 1640885 1659394 1679618 1701851 1725153 1747908 1769796 1791617 1813439 1834605 1855231
59007 1855231 1875735 1894921 1910359 1920833 1926886 1929011 1927030 1921464 1914099 1907083 1902493 1902363 1907613
58994 1907613 1917104 1929045 1942832 1958094 1972697 1983619 1989460 1990348 1986004 1976085 1962193 1947450
58982 1947450 1934053 1923031 1916093 1915496 1921953 1934556 1952768 1976539 2004391 2033372 2061253 2087082
58970 2087082 2109585 2126961 2138688 2146004 2150421 2153148 2155856 2160244 2166653 2174437 2183503 2194063 2205169
$$ packed form
59054B609713l7065n8023p2275q0113q3917q4438q0452p2407o3219n4313m4043
59043A879448l1547j9156r329k056K871L924M52n224j0534j5409k0333k3959k4906
59030A724242k4124k3151k1686j8836j5245j1947q544m266M34M841R158J3397
59018A624273J6612J8509K0224K2233K3302K2755K1888K1821K1822K1166K0626
59007A855231K0504J9186J5438J0474O053K125j981n566p365p016m590j30N250
58994A907613R491J1941J3787J5262J4603J0922N841Q88m344r919j3892j4743
58982A947450j3397j1022o938n97O457J2603J8212K3771K7852K8981K7881K5829
58970B087082K2503J7376J1727P316M417K727K708M388O409P784R066J0560J1106
$$ plain form
58957 2205169 2215118 2222963 2228065 2228926 2224610 2216996 2209467 2203646 2199572 2198609 2203589 2215874 2234568 2258679
58943 2258679 2287728 2319992 2352613 2384032 2414363 2443273 2469774 2494605 2520585 2549973 2583238
58932 2583238 2620704 2663396 2711882 2766277 2827743 2898054 2977364 3064424 3159271 3263615 3378374
58921 3378374 3503138 3638510 3786621 3948665 4124140 4313304 4518187 4740325 4979346
58912 4979346 5234454 5505194 5789953 6085896 6391726 6709114 7040612 7387773 7751893
58903 7751893 8134671 8536786 8956780 9391653 9836996 10285936 10729327 11157341 11559561
58894 11559561 11923654 12236098 12484837 12659879 12751814 12752771 12660183 12478135 12214661 11879615
58884 11879615 11485362 11046599 10577497 10089752 9593397 9097292 8608010 8130043 7667994
$$ packed form
58957B205169R949P845N102Q61m316p614p529n821m074r63M980J2285J8694K4111
58943B258679K9049L2264L2621L1419L0331K8910K6501K4831K5980K9388L3265
58932B583238L7466M2692M8486N4395O1466P0311P9310Q7060R4847J04344J14759
58921C378374J24764J35372J48111J62044J75475J89164K04883K22138K39021
58912D979346K55108K70740K84759K95943L05830L17388L31498L47161L64120
58903G751893L82778M02115M19994M34873M45343M48940M43391M28014M02220
58894A1559561L64093L12444K48739J75042R1935R57r2588j82048k63474l35046
58884A1879615l94253m38763m69102m87745m96355m96105m89282m77967m62049
$$ plain form
58875 7667994 7226969 6810301 6418767 6052746 5713322 5400654 5113149 4849144 4607780
58866 4607780 4387663 4186482 4002721 3836102 3685781 3549788 3426729 3316229 3217290 3128120
58856 3128120 3048029 2977469 2915756 2860884 2812081 2770259 2735265 2705070 2678606 2657146 2641802
58845 2641802 2631803 2626325 2625936 2631028 2640627 2653887 2671134 2692613 2717997 2747906 2784073 2827271
58833 2827271 2877014 2933804 2999325 3073614 3154457 3240677 3333635 3434279 3541058 3652323 3768799
58822 3768799 3892262 4023672 4164049 4315484 4479937 4658578 4853241 5066717 5300565
58813 5300565 5554515 5828957 6126073 6447564 6793379 7163509 7558445 7976368 8411961
58804 8411961 8859151 9312535 9764466 10203000 10614581 10986914 11307925 11564566 11745384
$$ packed form
58875G667994m41025m16668l91534l66021l39424l12668k87505k64005k41364
58866D607780k20117k01181j83761j66619j50321j35993j23059j10500r8939q9170
58856C128120q0091p0560o1713n4872m8803m1822l4994l0195k6464k1460j5344
58845B641802r999n478l89N092R599J3260J7247K1479K5384K9909L6167M3198
58833B827271M9743N6790O5521P4289Q0843Q6220R2958J00644J06779J11265J16476
58822C768799J23463J31410J40377J51435J64453J78641J94663K13476K33848
58813E300565K53950K74442K97116L21491L45815L70130L94936M17923M35593
58804H411961M47190M53384M51931M38534M11581L72333L21011K56641J80818
$$ plain form
58795 11745384 11843410 11855596 11781681 11625545 11395928 11103817 10760085 10376520 9966790 9544262
58785 9544262 9119879 8703145 8303193 7927174 7578728 7258250 6961907 6679231 6395351
58776 6395351 6099525 5791480 5478918 5171134 4876192 4600715 4348416 4119249 3911892
58767 3911892 3726145 3561722 3416661 3288992 3178532 3085329 3008005 2945487 2898826 2869411
58757 2869411 2856919 2860886 2882785 2924621 2986817 3069091 3171472 3291814 3422848 3552990 3668990
58746 3668990 3757184 3805352 3806978 3763739 3682817 3573045 3444329 3307646 3172065 3042122
58736 3042122 2919569 2806245 2703380 2609713 2522664 2440666 2362803 2287423 2212927 2138923 2065272
58725 2065272 1991284 1917196 1844889 1775726 1709339 1645980 1588151 1538104 1495557 1459629 1430960
$$ packed form
58795A1745384R8026J2186p3915j56136k29617k92111l43732l83565m09730m22528
58785I544262m24383m16734l99952l76019l48446l20478k96343k82676k83880
58776F395351k95826l08045l12562l07784k94942k75477k52299k29167k07357
58767C911892j85747j64423j45061j27669j10460r3203p7324o2518m6661k9415
58757B869411j2492L967K1899M1836O2196Q2274J02381J20342J31034J30142J16000
58746C668990Q8194M8168J626m3239q0922j09772j28716j36683j35581j29943
58736C042122j22553j13324j02865r3667q7049q1998p7863p5380p4496p4004p3651
58725B065272p3988p4088p2307o9163o6387o3359n7829n0047m2547l5928k8669
$$ plain form
58714 1430960 1409625 1392624 1375899 1357728 1338307 1317586 1295655 1274017 1254423 1237521 1223979
58703 1223979 1215193 1210980 1208258 1203957 1197692 1189864 1179313 1165193 1149395 1134546 1120967 1107914
58691 1107914 1096413 1088554 1085206 1086489 1093213 1105879 1123751 1146839 1177132 1215728 1260469 1308663
58679 1308663 1360441 1417103 1477821 1540485 1604345 1669360 1734523 1799494 1866731 1939537 2018654
58668 2018654 2101656 2182681 2249979 2286630 2278788 2224190 2131565 2013668 1882974 1750979 1626404
58657 1626404 1513181 1412213 1324455 1250447 1188477 1136069 1092517 1057819 1030508 1008943 993316
58646 993316 983820 978234 973987 971250 971402 973905 977369 982172 989080 996660 1003052 1009117 1016955 1026617
58632 1026617 1037162 1049542 1065277 1083543 1102784 1124091 1149765 1179600 1211783 1246446 1285060
$$ packed form
58714A430960k1335j7001j6725j8171j9421k0721k1931k1638j9594j6902j3542
58703A223979q786m213k722m301o265p828j0551j4120j5798j4849j3579j3053
58691A107914j1501p859l348J283O724J2666J7872K3088L0293L8596M4741M8194
58679A308663N1778N6662O0718O2664O3860O5015O5163O4971O7237P2806P9117
58668B018654Q3002Q1025O7298L6651p842n4598r2625j17897j30694j31995j24575
58657A626404j13223j00968q7758p4008o1970n2408m3552l4698k7311k1565j5627
58646I93316r496n586m247k737J52K503L464M803O908P580O392O065P838R662
58632A026617J0545J2380J5735J8266J9241K1307K5674K9835L2183L4663L8614
$$ plain form
58621 1285060 1327259 1371654 1419217 1472718 1533329 1600596 1675050 1757950 1849201 1948255 2056190
58610 2056190 2174147 2300745 2433766 2572970 2718026 2864805 3006884 3139564 3259188
58601 3259188 3359903 3435171 3482100 3501265 3493319 3459418 3404164 3334388 3255277 3170784 3086822
58590 3086822 3010170 2944452 2890222 2848248 2819196 2800941 2790158 2786522 2792225 2808040 2833601 2871174
58578 2871174 2925466 2999702 3095067 3213409 3356513 3522070 3702603 3887245 4061090 4203758
58568 4203758 4293473 4314678 4261391 4136161 3950074 3722505 3475374 3225684 2984705 2761820
58558 2761820 2564416 2394500 2249565 2126618 2021959 1928413 1837973 1747751 1659712 1575054
58548 1575054 1493065 1415021 1344267 1281757 1225496 1174717 1130602 1092605 1058139 1026458 999131
$$ packed form
58621A285060M2199M4395M7563N3501O0611O7267P4454Q2900R1251R9054J07935
58610B056190J17957J26598J33021J39204J45056J46779J42079J32680J19624
58601C259188J00715P5268M6929J9165p946l3901n5254o9776p9111q4493q3962
58590C086822p6652o5718n4230m1974k9052j8255j0783l636N703J5815K5561L7573
58578B871174N4292P4236R5365J18342J43104J65557J80533J84642J73845J42668
58568D203758Q9715K1205n3287j25230j86087k27569k47131k49690k40979k22885
58558B761820j97404j69916j44935j22947j04659r3546r0440r0222q8039q4658
58548A575054q1989p8044p0754o2510n6261n0779m4115l7997l4466l1681k7327
$$ plain form
58537 999131 976295 956078 937881 922496 908846 894534 879870 867612 858526 850917 844497 840699
58525 840699 839131 837867 837489 840718 847774 856229 865675 878330 894658 912738 932483 956251 984548
58512 984548 1015202 1047380 1082491 1120681 1160593 1203165 1251609 1307161 1368983 1438560 1519751
58501 1519751 1613866 1718872 1833691 1958298 2088451 2214867 2328963 2425913 2502073 2554451
58491 2554451 2583631 2592400 2579991 2541834 2475995 2385746 2275417 2148856 2013011 1877612 1749008
58480 1749008 1628173 1515862 1415071 1326968 1249185 1180103 1120698 1070603 1026635 986899 952287
58469 952287 922490 894799 868324 845148 825771 807573 789121 771736 755562 738615 721094
58458 721094 705945 693589 680794 666413 653507 643891 635324 626175 618350 613444 610281 608353 609442
$$ packed form
58537I99131k2836k0217j8197j5385j3650j4312j4664j2258r086p609o420l798
58525H40699j568j264l78L229P056Q455R446J2655J6328J8080J9745K3768K8297
58512I84548L0654L2178L5111L8190L9912M2572M8444N5552O1822O9577Q1191
58501A519751R4115J05006J14819J24607J30153J26416J14096R6950P6160N2378
58491B554451K9180Q769j2409l8157o5839r0249j10329j26561j35845j35399j28604
58480A749008j20835j12311j00791q8103p7783o9082n9405n0095m3968l9736l4612
58469I52287k9797k7691k6475k3176j9377j8198j8452j7385j6174j6947j7521
58458G21094j5149j2356j2795j4381j2906r616q567r149p825m906l163j928J089
$$ plain form
58445 609442 613788 618746 623042 628279 634623 639348 641372 642891 644977 645945 645572 646208 648169 648877 648147
58430 648147 649193 652608 654702 653887 653514 656019 659445 662191 666075 672075 677952 682736 688773 696859 704139
58415 704139 709229 714458 720670 724935 725917 726398 727978 728480 727143 726947 729036 730314 729437 729589 732249 733937
58399 733937 732620 731779 734361 737973 739859 741605 745142 748936 751804 755727 761427 766025 768494 772435
58385 772435 780065 788502 795369 802679 811567 818589 821186 821748 822535 821799 818679 816541 817510 818914 819007 820760
58369 820760 826026 831486 834599 838170 844821 852389 859007 867100 877971 888039 894998 902167 912250
58356 912250 922334 929655 936596 945244 952755 957100 961744 969603 977870 983745 989735 998318 1007071 1014099
58342 1014099 1022593 1034933 1048046 1059568 1072582 1089223 1105881 1120118 1135927 1156520 1178289
$$ packed form
58445F09442M346M958M296N237O344M725K024J519K086R68l73O36J961P08p30
58430F48147J046L415K094q15l73K505L426K746L884O000N877M784O037Q086P280
58415G04139N090N229O212M265R82M81J580N02j337j96K089J278q77J52K660J688
58399G33937j317q41K582L612J886J746L537L794K868L923N700M598K469L941
58385G72435P630Q437O867P310Q888P022K597N62P87p36l120k138R69J404R3J753
58369H20760N266N460L113L571O651P568O618Q093J0871J0068O959P169J0083
58356I12250J0084P321O941Q648P511M345M644P859Q267N875N990Q583Q753P028
58342A014099Q494J2340J3113J1522J3014J6641J6658J4237J5809K0593K1769
$$ plain form
58331 1178289 1197675 1217551 1240841 1264380 1285250 1306683 1331227 1354590 1372739 1388680 1405747
58320 1405747 1420955 1431758 1442551 1457269 1472297 1484006 1496553 1514640 1535256 1554345 1575042
58309 1575042 1601292 1629880 1656892 1685609 1719841 1755921 1789613 1824417 1864764 1907691 1949894
58298 1949894 1996271 2052504 2115832 2182137 2255499 2341529 2438108 2542264 2659561 2797027 2953417
58287 2953417 3125991 3319703 3539099 3777264 4022235 4266953 4502519 4709446 4867703
58278 4867703 4970067 5016348 5003134 4931395 4816894 4680229 4532059 4378394 4231857 4104379
58268 4104379 3995451 3900300 3823093 3769760 3735233 3711148 3699351 3704758 3722220 3744127 3773860
58257 3773860 3817839 3871465 3926870 3987101 4058447 4136421 4214039 4296082 4390270 4492410 4595389
$$ packed form
58331A178289J9386J9876K3290K3539K0870K1433K4544K3363J8149J5941J7067
58320A405747J5208J0803J0793J4718J5028J1709J2547J8087K0616J9089K0697
58309A575042K6250K8588K7012K8717L4232L6080L3692L4804M0347M2927M2203
58298A949894M6377N6233O3328O6305P3362Q6030R6579J04156J17297J37466J56390
58287B953417J72574J93712K19396K38165K44971K44718K35566K06927J58257
58278D867703J02364M6281j3214p1739j14501j36665j48170j53665j46537j27478
58268D104379j08928r5151p7207n3333l4527k4085j1797N407J7462K1907K9733
58257C773860M3979N3626N5405O0231P1346P7974P7618Q2043R4188J02140J02979
$$ plain form
58246 4595389 4704057 4825434 4953340 5079355 5209509 5352927 5503871 5653287 5807983
58237 5807983 5979118 6161784 6346085 6538178 6749349 6974569 7203857 7444624 7710025
58228 7710025 7995568 8290759 8603180 8946541 9315875 9700140 10108068 10555024 11036129
58219 11036129 11540251 12078216 12668055 13305710 13981356 14710842 15518251 16402293 17355060
58210 17355060 18398310 19563902 20855583 22270991 23844093 25623211 27627710 29875106
58202 29875106 32431680 35387416 38807912 42771628 47431754 52981611 59593142 67464930
58194 67464930 76900422 88266769 101937345 118394051 138358972 162745144 192567677
58187 192567677 228909245 272346400 321294566 370322772 410700160 433914819 435821750
$$ packed form
58246D595389J08668J21377J27906J26015J30154J43418J50944J49416J54696
58237E807983J71135J82666J84301J92093K11171K25220K29288K40767K65401
58228G710025K85543K95191L12421L43361L69334L84265M07928M46956M81105
58219A1036129N04122N37965N89839O37655O75646P29486Q07409Q84042R52767
58210A7355060J043250J165592J291681J415408J573102J779118K004499K247396
58202B9875106K556574K955736L420496L963716M660126N549857O611531P871788
58194F7464930R435492J1366347J3670576J6456706J9964921K4386172K9822533
58187A92567677L6341568M3437155M8948166M9028206M0377388K3214659J906931
$$ plain form
58180 435821750 418181709 386838588 348605231 309107504 272116703 239751562 212957453
58173 212957453 191872737 175821805 163171808 151697369 139573945 126203358 112125137
58166 112125137 98272808 85384924 73883676 63936564 55488524 48341530 42294289
58159 42294289 37197438 32904630 29258942 26145283 23498153 21248085 19310392 17629938
58151 17629938 16186399 14947832 13861231 12892387 12034154 11270960 10571938 9922211 9326361
58142 9326361 8778227 8259283 7768214 7320753 6918176 6544652 6196279 5883988 5606486
58133 5606486 5347959 5104437 4886656 4695512 4519452 4356938 4216561 4093040 3966862
58124 3966862 3830489 3693464 3560389 3425682 3291931 3171688 3067763 2970982 2879725 2802959
$$ packed form
58180D35821750j7640041l1343121l8233357l9497727l6990801l2365141k6794109
58173B12957453k1084716j6050932j2649997j1474439j2123424j3370587j4078221
58166A12125137j3852329j2887884j1501248r947112q448040p146994o047241
58159D2294289n096851m292808l645688l113659k647130k250068j937693j680454
58151A7629938j443539j238567j086601r68844q58233p63194o99022o49727n95850
58142I326361n48134n18944m91069m47461m02577l73524l48373l12291k77502
58133E606486k58527k43522k17781j91144j76060j62514j40377j23521j26178
58124C966862j36373j37025j33075j34707j33751j20243j03925r6781r1257p6766
$$ plain form
58114 2802959 2742112 2688616 2641659 2610510 2597114 2593775 2600224 2625916 2672805 2731362 2794879 2861192
58102 2861192 2918449 2946197 2934650 2889304 2815298 2712541 2588141 2457580 2329313 2201209
58092 2201209 2074550 1957799 1853920 1757526 1667631 1590381 1526421 1468358 1413535 1366911 1328521
58081 1328521 1290532 1249983 1212646 1181111 1150498 1119085 1091884 1070315 1049018 1026094 1006208
58070 1006208 990653 974549 956683 941999 931522 919837 905324 893015 884565 875304 864088 856167
58058 856167 853070 849236 841967 835441 831524 825822 816308 807043 799794 790566 778018 766988 759973 753081
58044 753081 743920 735727 730273 724386 716913 711710 710319 708900 705712 704408 706801 709595 711515 716444
58030 716444 725931 735494 741928 747790 755286 762341 768208 776660 789956 805497 821725 841640 867498
$$ packed form
58114B802959o0847n3496m6957l1149j3396l339O449K5692M6889N8557O3517O6313
58102B861192N7257K7748j1547m5346p4006j02757j24400j30561j28267j28104
58092B201209j26659j16751j03879r6394q9895p7250o3960n8063n4823m6624l8390
58081A328521l7989m0549l7337l1535l0613l1413k7201k1569k1297k2924j9886
58070A006208j5555j6104j7866j4684j0477j1685j4513j2309q450r261j1216p921
58058H56167l097l834p269o526l917n702r514r265p249r228j2548j1030p015o892
58044G53081r161q193n454n887p473n203j391j419l188j304K393K794J920M929
58030G16444R487R563O434N862P496P055N867Q452J3296J5541J6228J9915K5858
$$ plain form
58017 867498 897897 933055 977075 1031864 1094369 1162606 1238563 1322082 1407443 1488900 1563993
58006 1563993 1628675 1675308 1699257 1702748 1689590 1661301 1620897 1574512 1525648 1472732 1415205
57995 1415205 1356954 1300956 1245914 1191287 1140573 1096499 1057917 1024449 999233 983992 976238
57984 976238 974277 979972 993256 1008652 1020481 1027110 1027321 1017651 997012 969568 939557 907309 873278
57971 873278 841373 814751 792405 773237 759425 752418 749714 749108 752378 761394 774240 788513 804839
57958 804839 823773 842624 858707 872566 884876 893364 895890 893558 887912 878140 863866 847655
57946 847655 831934 816375 800795 787518 778308 772105 768271 768762 774368 781917 787792 791149 791411 786050
57932 786050 773687 756278 735677 711183 682983 654560 628879 605331 583041 563781 548840
$$ packed form
58017H67498L0399L5158M4020N4789O2505O8237P5957Q3519Q5361Q1457P5093
58006A563993O4682M6633K3949L491j3158k8289m0404m6385m8864n2916n7527
57995A415205n8251n5998n5042n4627n0714m4074l8582l3468k5216j5241p754
57984I76238j961N695J3284J5396J1829O629K11r670k0639k7444l0011l2248l4031
57971H73278l1905k6622k2346j9168j3812p007k704o06L270R016J2846J4273J6326
57958H04839J8934J8851J6083J3859J2310Q488K526k332n646r772j4274j6211
57946H47655j5721j5559j5580j3277r210o203l834M91N606P549N875L357K62n361
57932G86050j2363j7409k0601k4494k8200k8423k5681k3548k2290j9260j4941
$$ plain form
57921 548840 536456 525437 517997 515784 516215 516135 516238 518396 521373 522664 522345 521760 520495 517702 514433
57906 514433 511779 508668 504192 500068 498212 497788 496992 495684 494061 491151 486975 483886 483361 483750 483464
57891 483464 483903 486930 491980 498048 505980 516318 527439 538364 550840 566091 582126 596887 611374
57878 611374 626809 641278 652164 659550 664351 665476 661832 654879 646203 634753 619405 601990 584813
57865 584813 567375 548671 530468 515033 501623 488595 477156 469594 465408 462558 461219 463116
57853 463116 468312 475583 484809 496219 508486 520129 531518 543020 552775 558926 562498 565393 567102
57840 567102 566123 563026 559188 553981 546167 536770 527741 519026 509708 500719 493590 487781 482031 477073
57826 477073 474233 472668 470898 469918 471891 476895 483822 493329 506947 524279 544058 566965 594406
$$ packed form
57921E48840j2384j1019p440k213M31q0J03K158K977J291l19n85j265k793l269
57906E14433k654l111m476m124j856m24p96j308j623k910m176l089n25L89k86
57891D83464M39L027N050O068P932J0338J1121J0925J2476J5251J6035J4761J4487
57878F11374J5435J4469J0886P386M801J125l644o953q676j1450j5348j7415j7177
57865E84813j7438j8704j8203j5435j3410j3028j1439p562m186k850j339J897
57853D63116N196P271R226J1410J2267J1643J1389J1502R755O151L572K895J709
57840E67102r79l097l838n207p814r397r029q715r318q989p129n809n750m958
57826D77073k840j565j770r80J973N004O927R507J3618J7332J9779K2907K7441
$$ plain form
57813 594406 625392 657698 691355 727892 766669 804967 841353 876163 908978 938351 963832
57802 963832 985694 1002783 1012945 1015471 1011140 1000409 983639 962509 938911 912940 883953 852952
57790 852952 821832 791095 760464 730868 703444 677364 651178 625652 602848 582884 564021
57779 564021 545461 527764 510992 494791 479987 467833 457978 449137 441220 434812 429267 423571 418441
57766 418441 415347 414033 413225 413083 414593 417197 419518 421939 426020 431787 437956 444500 452545 462020 471740
57751 471740 481581 492321 503601 514253 524330 534631 544605 553067 560563 568696 577407 585295 592396
57738 592396 600174 608955 617726 626347 635572 644949 653153 660483 668778 678820 690040 702711 718028
57725 718028 735815 754403 773022 792290 812246 832039 851668 871914 892472 912279 931871
$$ packed form
57813E94406L0986L2306L3657L6537L8777L8298L6386L4810L2815K9373K5481
57802I63832K1862J7089J0162K526m331j0731j6770k1130k3598k5971k8987l1001
57790H52952l1120l0737l0631k9596k7424k6080k6186k5526k2804j9964j8863
57779E64021j8560j7697j6772j6201j4804j2154r855q841p917o408n545n696n130
57766D18441l094j314q08j42J510K604K321K421M081N767O169O544Q045R475R720
57751D71740R841J0740J1280J0652J0077J0301R974Q462P496Q133Q711P888P101
57738E92396P778Q781Q771Q621R225R377Q204P330Q295J0042J1220J2671J5317
57725G18028J7787J8588J8619J9268J9956J9793J9629K0246K0558J9807J9592
$$ plain form
57714 931871 953363 977950 1005431 1036245 1071885 1113163 1160114 1213614 1275001 1344070 1419682
57703 1419682 1502395 1594211 1695675 1805633 1923986 2051881 2188514 2330125 2472738 2613311
57693 2613311 2747197 2866808 2964248 3033866 3071953 3076464 3048538 2992673 2914184 2817618 2708093
57682 2708093 2592070 2475504 2362431 2256134 2160159 2077158 2008170 1954193 1917509 1900710
57672 1900710 1905578 1934063 1989377 2074171 2185816 2311514 2427204 2503839 2519864 2471395 2371652
57661 2371652 2241394 2099912 1961800 1836740 1729404 1640636 1569919 1516331 1477666 1450951
57651 1450951 1434720 1429409 1435077 1450321 1473999 1506444 1548222 1599134 1659157 1729058 1809336 1899560
57639 1899560 1999252 2108184 2225294 2348295 2474606 2601408 2724451 2837998 2936222 3013620
$$ packed form
57714I31871K1492K4587K7481L0814L5640M1278M6951N3500O1387O9069P5612
57703A419682Q2713R1816J01464J09958J18353J27895J36633J41611J42613J40573
57693B613311J33886J19611R7440O9618L8087M511k7926n5865p8489r6566j09525
57682B708093j16023j16566j13073j06297r5975q3001o8988n3977l6684j6799
57672A900710M868K8485N5314Q4794J11645J25698J15690P6635J6025m8469r9743
57661B371652j30258j41482j38112j25060j07336q8768p0717n3588l8665k6715
57651A450951j6231n311N668J5244K3678L2445M1778N0912O0023O9901Q0278R0224
57639A899560R9692J08932J17110J23001J26311J26802J23043J13547R8224P7398
$$ plain form
57629 3013620 3064439 3083938 3071084 3028749 2960855 2870749 2762551 2641973 2514562 2384266
57619 2384266 2254328 2128128 2008228 1895686 1791068 1695103 1607835 1528288 1455639 1389721
57609 1389721 1330062 1275697 1226420 1182946 1145236 1111893 1081710 1054622 1030624 1009031 989445
57598 989445 972218 957380 944219 932429 922470 914288 906969 900136 894387 889812 885434 880793 876726
57585 876726 873880 871802 870264 870191 872317 876048 880484 885546 891356 897600 904245 911845 920392 928896 936775
57570 936775 944617 952908 961270 969670 979150 990394 1002747 1015615 1029847 1046674 1066131 1087500
57558 1087500 1110588 1135708 1163174 1193630 1228165 1267268 1310314 1356736 1407049 1462263 1523142
57547 1523142 1590537 1665423 1747815 1836415 1929940 2027958 2129827 2233630 2336494 2434860 2523867
$$ packed form
57629C013620N0819J9499j2854m2335o7894r0106j08198j20578j27411j30296
57619B384266j29938j26200j19900j12542j04618r5965q7268p9547p2649o5918
57609A389721n9659n4365m9277m3474l7710l3343l0183k7088k3998k1593j9586
57598I89445j7227j4838j3161j1790r959q182p319o833n749m575m378m641m067
57585H76726k846k078j538p3K126L731M436N062N810O244O645P600Q547Q504P879
57570I36775P842Q291Q362Q400R480J1244J2353J2868J4232J6827J9457K1369
57558A087500K3088K5120K7466L0456L4535L9103M3046M6422N0313N5214O0879
57547A523142O7395P4886Q2392Q8600R3525R8018J01869J03803J02864R8366Q9007
$$ plain form
57536 2523867 2597813 2652311 2685306 2695629 2682049 2644802 2587008 2513441 2428643 2336866 2242477
57525 2242477 2148973 2058251 1971816 1891777 1819539 1754401 1694825 1640622 1592709 1551310 1515650
57514 1515650 1485117 1459566 1438640 1421756 1408677 1399383 1393502 1390469 1389936 1391554 1394736 1399163 1405080
57501 1405080 1412641 1421555 1431917 1444697 1460722 1479736 1501222 1525630 1554053 1587202 1625311 1668638
57489 1668638 1717317 1771111 1829949 1894398 1965160 2042528 2126651 2217650 2314806 2416023 2518386
57478 2518386 2618606 2712566 2795348 2862442 2910433 2936312 2937408 2913100 2865970 2800379 2720471
57467 2720471 2630125 2533791 2435885 2339476 2246320 2157822 2075191 1999027 1929572 1867168 1811890
57456 1811890 1763124 1720103 1682503 1649996 1621746 1596983 1575647 1557823 1543043 1530720 1520760
$$ packed form
57536B523867P3946N4498L2995J0323j3580l7247n7794p3567q4798r1777r4389
57525B242477r3504r0722q6435q0039p2238o5138n9576n4203m7913m1399l5660
57514A515650l0533k5551k0926j6884j3079r294n881l033n33J618L182M427N917
57501A405080P561Q914J0362J2780J6025J9014K1486K4408K8423L3149L8109M3327
57489A668638M8679N3794N8838O4449P0762P7368Q4123R0999R7156J01217J02363
57478B518386J00220R3960Q2782O7094M7991K5879J096k4308m7130o5591p9908
57467B720471r0346r6334r7906r6409r3156q8498q2631p6164o9455o2404n5278
57456A811890m8766m3021l7600l2507k8250k4763k1336j7824j4780j2323r960
$$ plain form
57445 1520760 1513106 1507117 1502064 1497832 1494658 1492621 1491874 1492739 1495028 1497862 1500758 1504243 1508787 1513881
57431 1513881 1518882 1524090 1530134 1536921 1543975 1551251 1558843 1566466 1574036 1582122 1591038 1600141 1609032 1618727
57417 1618727 1630464 1643737 1656678 1668238 1679053 1690345 1702816 1716410 1730358 1743628 1756022
57406 1756022 1768509 1781865 1795552 1808773 1822010 1836449 1852232 1868422 1884536 1900974 1918004
57395 1918004 1935343 1952841 1970673 1988723 2006461 2023556 2040131 2056504 2073148 2090642 2109132
57384 2109132 2128025 2146745 2165409 2184309 2203281 2222272 2241886 2262506 2283433 2303919 2324516
57373 2324516 2346268 2368994 2391646 2414118 2437295 2461345 2485347 2508786 2532183 2555855 2579196
57362 2579196 2601654 2623485 2645076 2666296 2687001 2707492 2728038 2748528 2769020 2790088 2812243
$$ packed form
57445A520760p654n989n053m232l174k037p47Q65K289K834K896L485M544N094
57431A513881N001N208O044O787P054P276P592P623P570Q086Q916R103Q891R695
57417A618727J1737J3273J2941J1560J0815J1292J2471J3594J3948J3270J2394
57406A756022J2487J3356J3687J3221J3237J4439J5783J6190J6114J6438J7030
57395A918004J7339J7498J7832J8050J7738J7095J6575J6373J6644J7494J8490
57384B109132J8893J8720J8664J8900J8972J8991J9614K0620K0927K0486K0597
57373B324516K1752K2726K2652K2472K3177K4050K4002K3439K3397K3672K3341
57362B579196K2458K1831K1591K1220K0705K0491K0546K0490K0492K1068K2155
$$ plain form
57351 2812243 2835370 2859041 2883070 2907568 2932822 2959253 2987217 3016729 3047604 3079754 3112997
57340 3112997 3146799 3180672 3214726 3249209 3283698 3317422 3350396 3383550 3417663 3452781 3488736
57329 3488736 3525575 3563343 3602003 3641779 3683020 3725533 3768509 3811403 3854570 3898908 3945071
57318 3945071 3993005 4041931 4090943 4139960 4189941 4241658 4294462 4346805 4397778 4447344 4495175
57307 4495175 4540208 4581568 4619188 4653142 4683076 4708715 4730414 4748761 4764018 4776494 4787247
57296 4787247 4797969 4810125 4824285 4840208 4857455 4876000 4896365 4919221 4945005 4973898 5005862
57285 5005862 5040484 5077065 5115148 5154659 5195409 5236933 5279256 5323183 5369148 5416215 5463106
57274 5463106 5509925 5557917 5607610 5658216 5708966 5760027 5811743 5863773 5915459 5966503 6017008
$$ packed form
57351B812243K3127K3671K4029K4498K5254K6431K7964K9512L0875L2150L3243
57340C112997L3802L3873L4054L4483L4489L3724L2974L3154L4113L5118L5955
57329C488736L6839L7768L8660L9776M1241M2513M2976M2894M3167M4338M6163
57318C945071M7934M8926M9012M9017M9981N1717N2804N2343N0973M9566M7831
57307D495175M5033M1360L7620L3954K9934K5639K1699J8347J5257J2476J0753
57296D787247J0722J2156J4160J5923J7247J8545K0365K2856K5784K8893L1964
57285E005862L4622L6581L8083L9511M0750M1524M2323M3927M5965M7067M6891
57274E463106M6819M7992M9693N0606N0750N1061N1716N2030N1686N1044N0505
$$ plain form
57263 6017008 6067326 6118125 6169980 6222551 6274661 6325521 6375500 6425463 6475887 6526870 6578457
57252 6578457 6630490 6682616 6734936 6788304 6843537 6900565 6958776 7017941 7078358 7140249 7203491
57241 7203491 7267859 7333145 7399010 7465046 7531071 7597189 7663514 7729978 7796418 7862714 7928809
57230 7928809 7994854 8061610 8130627 8203440 8279873 8357000 8430332 8496616 8555678 8609704 8661137
57219 8661137 8711429 8761066 8809945 8857633 8903788 8948474 8991922 9034228 9075710 9117299 9159966
57208 9159966 9203764 9247992 9292376 9337502 9383863 9430966 9477645 9522950 9566524 9608381 9648586
57197 9648586 9687007 9723279 9757122 9788664 9818217 9845847 9871449 9895119 9917036 9936956 9954331
57186 9954331 9969060 9981748 9993119 10003528 10013109 10021851 10029241 10034256 10036095 10034753 10030650 10023884 10014035
$$ packed form
57263F017008N0318N0799N1855N2571N2110N0860M9979M9963N0424N0983N1587
57252F578457N2033N2126N2320N3368N5233N7028N8211N9165O0417O1891O3242
57241G203491O4368O5286O5865O6036O6025O6118O6325O6464O6440O6296O6095
57230G928809O6045O6756O9017P2813P6433P7127P3332O6284N9062N4026N1433
57219H661137N0292M9637M8879M7688M6155M4686M3448M2306M1482M1589M2667
57208I159966M3798M4228M4384M5126M6361M7103M6679M5305M3574M1857M0205
57197I648586L8421L6272L3843L1542K9553K7630K5602K3670K1917J9920J7375
57186I954331J4729J2688J1371J0409R581Q742P390N015J839j342m103o766r849
$$ plain form
57173 10014035 10000491 9982718 9960400 9933525 9902287 9866840 9827397 9784595 9739505 9693082 9645822
57162 9645822 9598103 9550537 9503657 9457382 9411156 9364654 9318182 9272444 9228162 9186030 9146816
57151 9146816 9111203 9079312 9050334 9022730 8994935 8965884 8934804 8900549 8861301 8815169 8761355
57140 8761355 8701216 8638853 8580848 8534336 8502733 8480710 8453097 8401624 8316625 8204193 8081747
57129 8081747 7965908 7863835 7773948 7691627 7612705 7533571 7451215 7364414 7274176 7182666 7092125
57118 7092125 7004737 6922696 6847931 6781862 6725243 6677876 6638679 6606740 6582494 6567748 6564814
57107 6564814 6576189 6604917 6654759 6729989 6835552 6977539 7163524 7402964 7708087 8094723
57097 8094723 8582465 9194876 9960361 10912737 12090327 13534090 15285452 17383085 19858277
$$ packed form
57173A0014035j3544j7773k2318k6875l1238l5447l9443m2802m5090m6423m7260
57162I645822m7719m7566m6880m6275m6226m6502m6472m5738m4282m2132l9214
57151I146816l5613l1891k8978k7604k7795k9051l1080l4255l9248m6132n3814
57140H761355o0139o2363n8005m6512l1603k2023k7613n1473q4999j12432j22446
57129H081747j15839j02073q9887q2321p8922p9134q2356q6801r0238r1510r0541
57118G092125q7388q2041p4765o6069n6619m7367l9197l1939k4246j4746k934
57107F564814J1375K8728M9842P5230J05563J41987J85985K39440L05123L86636
57097H094723M87742O12411P65485R52376J177590J443763J751362K097633K475192
$$ plain form
57088 19858277 22730644 26005304 29669602 33688246 37999274 42512775 47110523 51647161
57080 51647161 55960743 59896437 63329683 66168174 68332548 69741426 70322790 70043534
57072 70043534 68930161 67065669 64569873 61576450 58212776 54584974 50772887 46837677
57064 46837677 42836772 38836006 34912046 31145173 27607623 24353856 21416448 18807100
57056 18807100 16520033 14536121 12827615 11362876 10109957 9038657 8121638 7334809
57048 7334809 6657058 6070053 5558635 5111036 4718013 4371642 4065018 3792574 3549787
57039 3549787 3332481 3136846 2960117 2800729 2657638 2529594 2414864 2311357 2217139 2131129
57029 2131129 2053125 1982998 1920250 1864584 1816416 1776298 1744347 1720816 1706891 1704421 1715351
$$ packed form
57088A9858277K872367L274660L664298M018644M311028M513501M597748M536638
57080E1647161M313582L935694L433246K838491K164374J408878N81364k79256
57072G0043534j113373j864492k495796k993423l363674l627802l812087l935210
57064D6837677m000905m000766l923960l766873l537550l253767k937408k609348
57056A8807100k287067j983912j708506j464739j252919j071300r17019p86829
57048G334809o77751n87005n11418m47599l93023l46371l06624k72444k42787
57039C549787k17306j95635j76729j59388j43091j28044j14730j03507r4218q6010
57029B131129p8004p0127o2748n5666m8168m0118l1951k3531j3925k470J0930
$$ plain form
57018 1715351 1741963 1787445 1856119 1953906 2087787 2260210 2458556 2649215 2786680 2834461
57008 2834461 2781945 2645225 2455036 2243063 2033640 1841196 1671691 1526040 1402978 1300143
56998 1300143 1214576 1143729 1085918 1039413 1001830 971123 946584 928032 914460 904220 896190
56987 896190 889997 885458 882677 882508 886061 893525 903578 913447 919134 916460 903318 881152 853623
56974 853623 823903 793724 764429 737522 713873 693380 675861 661552 650386 641585 634600 630026
56962 630026 628991 631981 638750 649304 664435 685196 711783 742494 773238 798179 811673 810618
56950 810618 795739 770952 741332 711065 682661 657419 636111 619113 606250 596956 590692 587203
56938 587203 586587 589257 595654 605791 619219 635710 655946 681367 713091 750354 789128 822172
$$ packed form
57018A715351K6612M5482O8674R7787J33881J72423J98346J90659J37465M7781
57008B834461n2516j36720j90189k11973k09423j92444j69505j45651j23062j02835
56998A300143q5567p0847n7811m6505l7583l0707k4539j8552j3572j0240q030
56987H96190o193m539k781j69L553P464J0053R869N687k674j3142k2166k7529
56974H53623k9720l0179k9295k6907k3649k0493j7519j4309j1166q801o985m574
56962F30026j035K990O769J0554J5131K0761K6587L0711L0744K4941J3494j055
56950H10618j4879k4787k9620l0267k8404k5242k1308j6998j2863r294o264l489
56938E87203o16K670O397J0137J3428J6491K0236K5421L1724L7263L8774L3044
$$ plain form
56926 822172 841476 841986 823676 790501 747945 701421 655493 613096 575293 542216 514006 490428
56914 490428 470251 452093 435766 421949 410664 401020 392401 384971 378866 373814 369792 367144 365666
56901 365666 364356 362599 360964 360332 360821 362041 363945 366832 370824 375891 382259 390418 400809 413750
56887 413750 429595 448787 471627 497563 524250 547527 563159 569052 565714 554973 538993 520347
56875 520347 501740 484893 470166 457555 447556 440755 437294 437228 440942 448807 460923 477582 499567
56862 499567 527718 562809 606081 658784 719866 783852 841461 882738 900647 893507 865418 824169
56850 824169 777737 731958 690411 654953 625723 601719 582591 569696 564887 568727 580515 599647
56838 599647 626307 661298 705975 762202 831823 915871 1013301 1118312 1217780 1293254 1328869
$$ packed form
56926H22172J9304N10j8310l3175m2556m6524m5928m2397l7803l3077k8210k3578
56914D90428k0177j8158j6327j3817j1285r644q619p430o105n052m022k648j478
56901C65666j310j757j635o32M89J220J904K887L992N067O368Q159J0391J2941
56887D13750J5845J9192K2840K5936K6687K3277J5632N893l338j0741j5980j8646
56875E20347j8607j6847j4727j2611r999o801l461o6L714P865J2116J6659K1985
56862D99567K8151L5091M3272N2703O1082O3986N7609M1277J7909p140k8089m1249
56850H24169m6432m5779m1547l5458k9230k4004j9128j2895m809L840J1788J9132
56838E99647K6660L4991M4677N6227O9621Q4048R7430J05011R9468P5474L5615
$$ plain form
56827 1328869 1319363 1271165 1196822 1108922 1017389 929002 847547 774773 711830 659608 617985
56816 617985 585764 561718 545248 536114 534387 540839 556705 582947 620413 670547 734170 807924
56804 807924 881731 940792 971555 967659 932089 874735 807537 740462 679928 628941 587754 555041
56792 555041 529473 510438 497397 489354 485649 486662 492930 504005 519090 538530 563771 595899
56780 595899 634702 678308 722194 758723 779535 779727 759896 724594 679751 631215 583755 540034
56768 540034 500728 465939 436055 411104 390150 371929 355706 341206 328202 316571 306437
56757 306437 297966 291201 286097 282383 279453 276782 274377 272410 270618 268730 267189 266537 266195 264867 262355
56742 262355 259943 258681 258141 257302 255859 254144 252513 251373 251288 252465 254437 256586 258678 260765 263068
$$ packed form
56827A328869r506m8198p4343q7900r1533q8387q1455p2774o2943n2222m1623
56816F17985l2221k4046j6470r134j727O452J5866K6242L7466N0134O3623P3754
56804H07924P3807N9061L0763l896l5570n7354o7198o7075o0534n0987m1187l2713
56792E55041k5568j9035j3041q043l705J013O268J1075J5085J9440K5241L2128
56780E95899L8803M3606M3886L6529K0812J92j9831l5302m4843m8536m7460m3721
56768E40034l9306l4789k9884k4951k0954j8221j6223j4500j3004j1631j0134
56757C06437q471o765n104l714k930k671k405j967j792j888j541o52l42j328k512
56742B62355k412j262n40q39j443j715j631j140q5J177J972K149K092K087K303
$$ plain form
56727 263068 266141 270503 275838 281186 286279 292045 299398 308113 317413 327093 337354 347840 357523 365566
56713 365566 371882 376825 380611 383153 384411 384787 384956 385137 384906 384028 383180 383303 384477 386024 387519 388955
56697 388955 390104 390563 390497 390580 391102 391811 392621 393709 394795 395122 394275 392278 388852 383537 376756 369855 363677
56680 363677 357863 351838 345685 339700 333908 328450 323746 319867 316367 313051 310213 307862 305549 303249
56666 303249 301445 299924 297498 293698 289896 287879 287936 289074 290556 292321 294343 296460 298681 301010 303096
56651 303096 304557 305489 306246 306977 307707 308596 309735 310970 312294 314098 316615 319267 320891 320561 318130 314190
56635 314190 309635 305041 300467 295993 292180 289535 287831 286635 286263 287383 289818 292742 295979 299993
56621 299993 304445 308028 310183 311902 314243 316983 319311 321014 322278 323021 323126 322838 322465 322156 322215 322991
$$ packed form
56727B63068L073M362N335N348N093N766P353Q715R300R680J0261J0486R683Q043
56713C65566O316M943L786K542J258L76J69J81k31q78q48J23J174J547J495J436
56697C88955J149M59o6Q3N22P09Q10J088J086L27q47j997l426n315o781o901o178
56680C63677n814o025o153n985n792n458m704l879l500l316k838k351k313k300
56666C03249j804j521k426l800l802k017N7J138J482J765K022K117K221K329K086
56651C03096J461R32P57P31P30Q89J139J235J324J804K517K652J624l30k431l940
56635C14190m555m594m574m474l813k645j704j196l72J120K435K924L237M014
56621B99993M452L583K155J719K341K740K328J703J264P43J05k88l73l09N9P76
$$ plain form
56605 322991 324190 325053 325501 326236 327407 328153 327919 327195 326414 325116 322967 320690 319153 318306 317793 317813 318573
56588 318573 319586 320340 321030 321856 322242 321595 320243 318713 316572 312961 308020 302976 298865 295667 292507
56573 292507 288453 283396 278430 274902 273080 272329 272512 274118 276754 278881 279675 280045 280985 282064 282530 282887
56557 282887 284091 285850 286913 286677 285553 284084 282589 281345 280335 279038 277011 274384 271421 268163
56543 268163 264928 262415 260760 259174 257022 254497 251723 248227 244000 240104 237293 234885 231883 228414
56529 228414 225149 222174 219470 217699 217326 217533 217043 215534 213366 210603 207418 204801 203694 203781 204075 204255
56513 204255 204513 204574 203938 202755 201595 200719 200277 200652 201784 202774 202987 203031 203788 205119 206371 207504 208778
56496 208778 209977 210889 212028 213909 216119 217917 219215 220224 220914 221569 222971 225110 226703 227008 227159
$$ packed form
56605C22991J199Q63M48P35J171P46k34p24p81j298k149k277j537q47n13K0P60
56588C18573J013P54O90Q26L86o47j352j530k141l611m941n044m111l198l160
56573B92507m054n057m966l528j822p51J83J606K636K127P94L70R40J079M66L57
56557B82887J204J759J063k36j124j469j495j244j010j297k027k627k963l258
56543B68163l235k513j655j586k152k525k774l496m227l896k811k408l002l469
56529B28414l265k975k704j771l73K07m90j509k168k763l185k617j107Q7K94J80
56513B04255K58O1o36j183j160q76m42L75J132R90K13M4P57J331J252J133J274
56496B08778J199R12J139J881K210J798J298J009O90O55J402K139J593L05J51
$$ plain form
56481 227159 228495 230626 232504 234357 236926 239570 240970 241241 241661 242547 242966 242419 241394 240372 239495 239069
56465 239069 239199 239121 238013 236210 234600 233185 231410 229530 228451 228443 229106 230305 232081 233942 235269 236097
56449 236097 236623 236560 235965 235983 237497 239626 240812 240799 240292 239361 237662 235699 234333 233421 232369 231557 231748
56432 231748 232504 232770 232768 233749 235998 238515 240545 242156 243451 244471 245661 247294 248660 248884 248125 246926
56416 246926 245058 242273 239432 237421 235621 233056 230389 229054 228979 228979 228886 229365 229985 229546 228226 227520 228013
56399 228013 228889 229559 230089 230060 228844 227061 226151 226414 226992 227692 229107 230973 232137 232319 232379 232758 233203 233990
56381 233990 235813 238387 240661 242413 244182 245737 246271 246001 245933 246108 245795 245382 246178 248231 250068 250884
56365 250884 251373 252197 253202 254336 255777 257001 257170 256590 256381 256771 257199 257914 259681 261998 263415 263746
$$ packed form
56481B27159J336K131J878J853K569K644J400K71M20Q86M19n47j025j022q77m26
56465B39069J30p8j108j803j610j415j775j880j079qO63J199J776J861J327Q28
56449B36097N26o3n95J8J514K129J186j3n07r31j699j963j366r12j052q12J91
56432B31748P56K66kR81K249K517K030J611J295J020J190J633J366K24p59j199
56416B46926j868k785k841k011j800k565k667j335p5%r3M79O20m39j320p06M93
56399B28013Q76O70N30k9j216j783r10K63N78P00J415J866J164J82O0L79M45P87
56381B33990J823K574K274J752J769J555N34k70o8J75l13m13P96K053J837Q16
56365B50884M89Q24J005J134J441J224J69n80k09L90M28P15J767K317J417L31
$$ plain form
56349 263746 264250 265506 266840 267928 269204 270528 271142 271207 271778 273121 274606 276280 278851 282031 284594
56334 284594 286217 287645 289079 290053 290860 292282 293887 294460 294182 294535 295925 297239 297855 298223 298393 297847
56318 297847 297045 297259 298666 300272 301763 303708 305933 307590 308845 310653 312864 314451 315480 316894 318530
56303 318530 319490 320268 322189 324817 326311 326429 326766 328008 329431 331173 334293 338251 341001 342104 343250
56288 343250 345298 347334 349083 351560 354729 357231 359192 362623 368153 373889 378482 382905 388166 393656
56274 393656 398913 404832 412009 419743 427579 436018 445098 454305 464394 477182 492911 509907 527325
56261 527325 546048 566492 587928 610448 635172 661960 689322 717051 746319 776637 805463
56250 805463 831513 855847 879008 899831 917730 933307 945835 953063 954472 951928 946174 935530
$$ packed form
56349B63746N04J256J334J088J276J324O14O5N71J343J485J674K571L180K563
56334B84594J623J428J434R74Q07J422J605N73k78L53J390J314O16L68J70n46
56318B97847q02K14J407J606J491J945K225J657J255J808K211J587J029J414J636
56303C18530R60P78J921K628J494J18L37J242J423J742L120L958K750J103J146
56288C43250K048K036J749K477L169K502J961L431N530N736M593M423N261N490
56274C93656N257N919P177P734P836Q439R080R207J0089J2788J5729J6996J7418
56261E27325J8723K0444K1436K2520K4724K6788K7362K7729K9268L0318K8826
56250H05463K6050K4334K3161K0823J7899J5577J2528P228J409k544n754j0644
$$ plain form
56238 935530 919149 898733 875922 850728 823658 796591 770393 744365 719035 696671 678042
56227 678042 661653 647292 637165 632121 629654 627071 623833 619598 613081 604407 595680 587668 578625
56214 578625 567686 556589 546785 537892 530241 525752 524712 524787 524715 525886 528910 532035 534594 538688 545551
56199 545551 553419 560695 568051 575712 582064 586762 591896 598295 604047 608449 613740 621005 628111 633849
56185 633849 640282 648691 657061 664158 672280 683155 694825 705569 717378 732408 749328 766294
56173 766294 784328 804682 825981 847056 869653 895354 922875 951272 982595 1018372 1056728
56162 1056728 1096255 1139674 1190456 1248854 1314528 1390167 1479332 1583741 1706033 1852509 2029916
56151 2029916 2242096 2492180 2784164 3117890 3483920 3865236 4241039 4587982 4884586
$$ packed form
56238I35530j6381k0416k2811k5194k7070k7067k6198k6028k5330k2364j8629
56227F78042j6389j4361j0127n044k467k583l238m235o517q674q727q012r043
56214E78625j0939j1097r804q893p651m489j040P5p2J171L024L125K559M094O863
56199E45551P868P276P356P661O352M698N134O399N752M402N291P265P106N738
56185F33849O433Q409Q370P097Q122J0875J1670J0744J1809J5030J6920J6966
56173G66294J8034K0354K1299K1075K2597K5701K7521K8397L1323L5777L8356
56162A056728L9527M3419N0782N8398O5674P5639Q9165J04409J22292J46476J77407
56151B029916K12180K50084K91984L33726L66030L81316L75803L46943K96604
$$ plain form
56142 4884586 5121408 5306166 5456432 5589226 5717398 5847640 5974626 6080072 6144090 6158078
56132 6158078 6126211 6059921 5975207 5889527 5812352 5737313 5645902 5517473 5335292 5090058 4785278
56121 4785278 4438414 4072619 3707774 3359750 3041959 2761691 2517659 2305542 2123589
56112 2123589 1969901 1838814 1724930 1627465 1546343 1477679 1417656 1367126 1327412 1294973 1265099
56101 1265099 1237619 1214273 1193887 1174952 1159473 1149312 1141993 1134705 1128872 1126207 1124334 1121174
56089 1121174 1119477 1121801 1125296 1126848 1128973 1134925 1142435 1148348 1154957 1165246 1176206 1183677 1189865
56076 1189865 1199194 1210580 1220658 1230836 1244069 1258298 1270162 1281684 1296248 1311623 1324112
56065 1324112 1335943 1351285 1368600 1384257 1399949 1419084 1439676 1458367 1477583 1500901 1525475
$$ packed form
56142D884586K36822J84758J50266J32794J28172J30242J26986J05446O4018J3988
56132F158078l1867o6290q4714q5680p7175p5039r1411j28429j82181k45234l04780
56121D785278l46864l65795l64845l48024l17791k80268k44032k12117j81953
56112B123589j53688j31087j13884r7465q1122o8664o0023n0530l9714l2439k9874
56101A265099k7480k3346k0386j8935j5479j0161p319p288n833k665j873l160
56089A121174j697K324L495J552K125N952P510N913O609J0289J0960P471O188
56076A189865R329J1386J0078J0178J3233J4229J1864J1522J4564J5375J2489
56065A324112J1831J5342J7315J5657J5692J9135K0592J8691J9216K3318K4574
$$ plain form
56054 1525475 1547074 1568480 1594401 1622225 1646647 1669543 1696150 1725185 1751990 1777939 1807420
56043 1807420 1838936 1868541 1898672 1934060 1972245 2007568 2041159 2077551 2115233 2150346 2185973
56032 2185973 2227559 2272899 2316830 2361846 2413534 2469541 2523940 2578423 2638149 2700825 2761387
56021 2761387 2823091 2892054 2965286 3036401 3108565 3188974 3275225 3360472 3447351 3542898 3644395
56010 3644395 3744834 3847870 3962318 4086183 4211394 4339727 4477963 4621824 4761482
56001 4761482 4898888 5042773 5191028 5335714 5480999 5637579 5803682 5970589 6142502
55992 6142502 6331067 6534704 6744008 6963086 7204019 7464876 7735774 8022023 8337587
55983 8337587 8680324 9038539 9417333 9832403 10282688 10756801 11261707 11816010 12419926
$$ packed form
56054A525475K1599K1406K5921K7824K4422K2896K6607K9035K6805K5949K9481
56043A807420L1516K9605L0131L5388L8185L5323L3591L6392L7682L5113L5627
56032B185973M1586M5340M3931M5016N1688N6007N4399N4483N9726O2676O0562
56021B761387O1704O8963P3232P1115P2164Q0409Q6251Q5247Q6879R5547J01497
56010C644395J00439J03036J14448J23865J25211J28333J38236J43861J39658
56001D761482J37406J43885J48255J44686J45285J56580J66103J66907J71913
55992F142502J88565K03637K09304K19078K40933K60857K70898K86249L15564
55983H337587L42737L58215L78794M15070M50285M74113N04906N54303O03916
$$ plain form
55974 12419926 13062750 13755094 14521039 15363640 16273034 17263181 18363427 19580109 20907697
55965 20907697 22372535 24022591 25881492 27961979 30319453 33041729 36196669 39852143
55957 39852143 44142700 49254308 55358077 62640094 71390436 81982342 94792364 110267491
55949 110267491 129077511 152106551 180359241 214980591 256926109 305497390 356302683
55942 356302683 400925325 429862206 437117021 422854956 392305709 352500684 309584780
55935 309584780 267813777 229615401 195966977 166908099 142077993 121026544 103270040
55928 103270040 88317689 75753923 65251491 56498266 49178867 43035990 37885375
55921 37885375 33559083 29888236 26747865 24064295 21765905 19769097 18017342 16488609
$$ packed form
55974A2419926O42824O92344P65945Q42601R09394R90147J100246J216682J327588
55965B0907697J464838J650056J858901K080487K357474K722276L154940L655474
55957C9852143M290557N111608O103769P282017Q750342J0591906J2810022J5475127
55949A10267491J8810020K3029040K8252690L4621350M1945518M8571281N0805293
55942C56302683M4622642K8936881P254815j4262065l0549247l9805025m2915904
55935C09584780m1771003l8198376l3648424k9058878k4830106k1051449j7756504
55928A03270040j4952351j2563766j0502432q753225p319399o142877n150615
55921C7885375m326292l670847l140371k683570k298390j996808j751755j528733
$$ plain form
55913 16488609 15154472 13969224 12904810 11958783 11120255 10361306 9667585 9044775 8488460
55904 8488460 7977512 7502642 7072658 6686942 6328866 5991511 5683735 5405686 5143377
55895 5143377 4892506 4663572 4458175 4263263 4073953 3899940 3744136 3596253 3452730
55886 3452730 3322367 3206666 3094176 2979999 2872479 2775289 2680808 2586518 2500695 2426453
55876 2426453 2356432 2288261 2229401 2181999 2138680 2098201 2069666 2055566 2044751 2027366 2003473
55865 2003473 1972887 1930891 1879465 1829802 1788270 1751146 1716686 1689805 1670781 1651704 1628601
55854 1628601 1605619 1583495 1555700 1520053 1482646 1446265 1406044 1360403 1315015 1271998 1226293
55843 1226293 1176888 1130725 1091158 1053064 1013636 977629 947508 918606 888652 862372 842076
$$ packed form
55913A6488609j334137j185248j064414r46027q38528p58949o93721o22810n56315
55904H488460n10948m74870m29984l85716l58076l37355l07776k78049k62309
55895E143377k50871k28934k05397j94912j89310j74013j55804j47883j43523
55886C452730j30363j15701j12490j14177j07520r7190r4481r4290q5823p4242
55876B426453p0021o8171n8860m7402m3319m0479k8535j4100j0815j7385k3893
55865B003473l0586m1996n1426m9663m1532l7124l4460k6881j9024j9077k3103
55854A628601k2982k2124k7795l5647l7407l6381m0221m5641m5388m3017m5705
55843A226293m9405m6163l9567l8094l9428l6007l0121k8902k9954k6280k0296
$$ plain form
55832 842076 823086 803018 786514 776251 768099 759504 754069 753550 753747 752467 753161 756533 756754 750337
55818 750337 740937 731489 719471 703962 689424 678219 666776 653171 641268 633498 626809 619553
55806 619553 615144 615180 616161 616869 621860 633745 649009 665312 686082 713911 745940 779271 814089
55793 814089 847619 871909 881933 880001 868941 847657 817000 782972 749562 714516 676183 638389
55781 638389 604413 572271 540175 510868 486361 463954 441580 421758 406370 392831 379115
55770 379115 367258 358280 349099 338174 328844 323429 319306 314375 310904 310211 309002 304918 300572 298241
55756 298241 295657 290837 285908 282292 277164 268571 259148 250927 241490 229175 217104 208013 199915 190983
55742 190983 183905 181154 180452 179136 178696 180883 183571 184516 185150 186818 187475 185945 185223 187640 190863 192445
$$ packed form
55832H42076j8990k0068j6504j0263q152q595n435n19J97j280O94L372K21o417
55818G50337r400r448j2018j5509j4538j1205j1443j3605j1903p770o689p256
55806F19553m409L6R81P08M991J1885J5264J6303K0770K7829L2029L3331L4818
55793H14089L3530K4290J0024j932j1060k1284l0657l4028l3410l5046l8333l7794
55781F38389l3976l2142l2096k9307k4507k2407k2374j9822j5388j3539j3716
55770C79115j1857q978r181j0925r330n415m123m931l471o93j209m084m346k331
55756B98241k584m820m929l616n128q593r423q221r437j2315j2071r091q098q932
55742A90983p078k751p02j316m40K187K688R45O34J668O57j530p22K417L223J582
$$ plain form
55726 192445 194057 197367 200073 200189 200117 202364 205240 206913 209634 215669 222928 229006 235849 246086 258251
55711 258251 269865 281789 295297 308241 318329 326909 335385 341224 341741 338657 334679 328667 318422
55698 318422 305365 292304 279290 265674 253422 244398 236989 229282 222923 220171 219855 219955 221386
55685 221386 225592 231253 237088 245133 257520 272788 288987 307492 329997 354714 379507 405860
55673 405860 435652 466672 495350 521320 545344 565447 579270 587768 592496 591792 583808 571030
55661 571030 557622 544500 530987 518915 510702 505443 501158 499107 501838 508771 517518 527580 538746
55648 538746 547721 550455 546273 536145 518988 493697 462950 430866 398430 365033 332724 304635
55636 304635 280588 258215 237244 219005 203045 188013 174683 164564 156718 149289 142731 138158
$$ packed form
55726A92445J612L310K706J16p2K247K876J673K721O035P259O078O843J0237J2165
55711B58251J1614J1924J3508J2944J0088Q580Q476N839N17l084l978o012j0245
55698C18422j3057j3061j3014j3616j2252r024p409p707o359k752l16J00J431
55685B21386M206N661N835Q045J2387J5268J6199J8505K2505K4717K4793K6353
55673D05860K9792L1020K8678K5970K4024K0103J3823Q498M728p04p984j2778
55661E71030j3408j3122j3513j2072q213n259m285k051K731O933Q747J0062J1166
55648E38746Q975K734m182j0128j7157k5291l0747l2084l2436l3397l2309k8089
55636C04635k4047k2373k0971j8239j5960j5032j3330j0119p846p429o558m573
$$ plain form
55624 138158 134160 128763 123001 119007 116123 112520 109041 107721 107881 107308 105940 104931 103623 101029 98705
55609 98705 98434 98616 96706 93644 92003 91310 89308 86415 84694 83607 81020 77493 75402 74634 73173
55594 73173 71093 69983 69231 67026 64399 64079 65830 66950 67019 68066 70225 71301 70838 70912 72635 75161
55578 75161 78205 82317 86667 89674 91805 94882 98960 102814 106886 112458 118389 122002 122952 122997 122342
55563 122342 119611 115225 111364 108523 105238 101254 97960 95787 94050 93196 94219 96056 96522 95668 95377
55548 95377 96019 96490 97247 100171 105493 111734 118473 126337 134624 141963 149096 158096 169205 181301 194937
55533 194937 211647 230673 249718 268689 289361 311494 332682 351930 369918 385556 395700
55522 395700 398717 395242 385279 367865 344154 317728 291188 265057 240149 218003 198503 179937
$$ packed form
55624A38158l998n397n762l994k884l603l479j320J60n73j368j009j308k594k324
55609I8705k71J82j910l062j641o93k002k893j721j087k587l527k091p68j461
55594G3173k080j110p52k205k627l20J751J120O9J047K159J076m63P4J723K526
55578G5161L044M112M350L007K131L077M078L854M072N572N931L613R50M5o55
55563A22342k731m386l861k841l285l984l294k173j737q54J023J837M66q54k91
55548I5377O42M71P57K924N322O241O739P864Q287P339P133R000J1109J2096J3636
55533A94937J6710J9026J9045J8971K0672K2133K1188J9248J7988J5638J0144
55522C95700L017l475r963j7414k3711k6426k6540k6131k4908k2146j9500j8566
$$ plain form
55510 179937 161977 146067 132625 120546 109674 101038 94387 88169 82183 77665 74575 71454 68014
55497 68014 65200 62747 59480 56063 54483 54684 54571 53441 52487 51860 50393 48436 47774 48354 48184 46868
55481 46868 46114 46311 45829 44316 43467 43721 43330 41688 40546 40821 41018 39922 38228 36520 34253 31791
55465 31791 30904 32095 33667 34395 34876 35512 35522 34804 34455 34667 34328 33308 32788 32727 31507 28915 26990 27029
55447 27029 28024 28857 29728 30636 30806 30521 31288 33361 35173 35870 36193 36301 35164 32902 31318 31240 31554 31580
55429 31580 32164 33704 35360 36933 39213 41813 43035 42607 42169 42361 41961 40665 40079 40940 41863 41920 42063
55412 42063 42863 43246 42638 42097 42182 41870 40651 39523 38850 37505 35220 33553 33354 33417 32791 32335 32816 33561
55394 33561 34083 34984 36182 36375 35352 34786 35564 36366 35956 34846 33692 32182 30559 30079 30766 30853 29595
$$ packed form
55510A79937j7960j5910j3442j2079j0872q636o651o218n986m518l090l121l440
55497F8014k814k453l267l417j580K01j13j130r54o27j467j957o62N80j70j316
55481D6868p54J97m82j513q49K54l91j642j142K75J97j096j694j708k267k462
55465C1791q87J191J572P28M81O36J0p18l49K12l39j020n20o1j220k592j925L9
55447B7029R95Q33Q71R08J70k85P67K073J812O97L23J08j137k262j584p8L14K6
55429C1580N84J540J656J573K280K600J222m28m38J92m00j296n86Q61R23N7J43
55412D2063Q00L83o08n41Q5l12j219j128o73j345k285j667j99O3o26m56M81P45
55394C3561N22R01J198J93j023n66P78Q02m10j110j154j510j623m80O87Q7j258
$$ plain form
55377 29595 28524 28827 29631 30062 30712 31812 32126 31119 30142 30146 30227 29750 29731 30679 31150 30004 28240 27171
55359 27171 26603 26144 26373 27350 27890 27642 27975 29484 30674 30500 30121 30645 31192 30814 30401 30961 31805 32027
55341 32027 32019 32028 31080 28860 26856 26087 25554 24460 23963 25023 26446 26874 26882 27287 27250 26006 24783 24917 25666
55322 25666 25784 25746 26417 27011 26427 25315 24940 25193 25460 26134 27500 28485 28230 27558 27238 26362 24328 22791
55304 22791 23463 25311 26141 25817 25687 25874 25466 24694 24695 25520 26161 26197 25866 25103 23939 23214 23517 24111 24159 24170
55284 24170 24962 26055 26411 25973 25282 24497 23866 24126 25292 26210 26376 26831 28085 28744 27694 26157 25866
55267 25866 26479 26492 25610 24580 23779 23438 24103 25423 25809 24719 23835 24429 25236 24773 24062 24824 26417 26969
55249 26969 26402 25975 25776 25094 24523 25329 27169 28565 29138 29486 29428 28425 27179 26848 27088 26734 25955 25874
$$ packed form
55377B9595j071L03Q04M31O50J100L14j007r77MQ1m77j9R48M71j146j764j069
55359B7171n68m59K29R77N40k48L33J509J190j74l79N24N47l78m13N60Q44K22
55341C2027qRr48k220k004p69n33j094m97J060J423M28QM05l7j244j223J34P49
55322B5666J18l8O71N94n84j112l75K53K67O74J366R85k55o72l20q76k034j537
55304B2791O72J848Q30l24j30J87m08p72JQ25O41L6l31p63j164p25L03N94M8J1
55284B4170P92J093L56m38o91p85o31K60J166R18J66M55J254O59j050j537k91
55267B5866O13J3q82j030q01l41O65J320L86j090q84N94Q07m63p11P62J593N52
55249B6969n67m27j99o82n71Q06J840J396N73L48n8j003j246l31K40l54p79q1
$$ plain form
55231 25874 26514 26981 27273 28104 29306 30182 31065 32781 34848 35919 35755 35182 34450 33201 31720 30671 29907
55214 29907 28970 28368 28863 29935 30376 29997 29331 28282 26607 25190 25177 26226 27059 27249 27058 26178 24370
55197 24370 22789 22851 24123 24956 24855 24599 24459 24050 23706 24206 25188 25420 24615 23561 22595 21330 19846 18807
55179 18807 18445 18527 19137 20399 21771 22665 23328 24136 24658 24562 24658 25726 27096 27815 28453 30107 32335 33776
55161 33776 34255 34579 34817 34509 34126 34508 35187 35037 34290 34183 34867 35392 35549 35952 36443 36139 35129 34529 34813
55142 34813 35523 36583 38421 40826 43131 45528 48895 53428 58629 64448 71077 77816 83457 87627 90515
55127 90515 91649 90378 87224 83317 78818 73359 67691 63211 59997 56930 53715 51188 49605 48130
55113 48130 46208 44201 42577 41581 41559 42462 43247 42909 41903 41354 41283 40909 40305 40265 40797 41141 41128 41200 41316
$$ packed form
55231B5874O40M67K92Q31J202Q76Q83J716K067J071j64n73p32j249j481j049p64
55214B9907r37o02M95J072M41l79o66j049j675j417j3J049Q33J90j91q80j808
55197B4370j581O2J272Q33j01k56j40m09l44N00R82K32q05j054r66j265j484j039
55179A8807l62Q2O10J262J372Q94O63Q08N22r6R6J068J370P19O38J654K228J441
55161C3776M79L24K38l08l83L82O79j50p47j07O84N25J57M03M91l04j010o00K84
55142C4813P10J060J838K405K305K397L367M533N201N819O629O739N641M170K888
55127I0515J134j271l154l907m499n459n668m480l214l067l215k527j583j475
55113D8130j922k007j624r96k2R03P85l38j006n49p1l74o04m0N32L44j3P2J16
$$ plain form
55094 41316 41126 40913 41094 41150 40365 39225 38755 38974 39360 40226 42078 44187 45469 46302 47795 49763 51217
55077 51217 52332 54026 55985 57114 57618 58576 59671 59533 58303 57694 58367 59359 60292 62024 64602 66521
55061 66521 66752 65919 64994 64269 64014 64668 66020 67456 69240 72192 76112 79992 83819 88519 94004 98948
55045 98948 102735 105977 108778 110135 109558 107889 106103 104528 103425 102974 102465 100835 98264 96043 94774
55030 94774 93939 93148 92409 91166 88550 84688 80476 76160 71502 67078 63865 61696 59736 58219 58009
55015 58009 58687 58971 58914 59687 61166 61817 61076 59910 58803 57238 55406 54430 54473 54481 54184 54539 55897 57501
54997 57501 59044 60909 62733 63737 64608 66924 70448 73234 74781 76748 80078 83834 87572 92413 98753
54982 98753 105179 110804 116692 123975 132516 142454 155002 170464 187215 203738 219938 235493 248745
$$ packed form
55094D1316j90k13J81N6p85j140m70K19L86Q66J852K109J282Q33J493J968J454
55077E1217J115J694J959J129N04R58J095j38j230o09O73R92R33J732K578J919
55061F6521K31q33r25p25k55O54J352J436J784K952L920L880L827M700N485M944
55045I8948L787L242K801J357n77j669j786j575j103m51n09j630k571k221j269
55030I4774q35p91p39j243k616l862m212m316m658m424l213k169j960j517k10
55015E8009O78K84n7P73J479O51p41j166j107j565j832r76M3Qk97L55J358J604
54997E7501J543J865J824J004Q71K316L524K786J547J967L330L756L738M841O340
54982I8753O426N625N888P283Q541R938J2548J5462J6751J6523J6200J5555J3252
$$ plain form
54969 248745 258371 264475 267065 265354 259662 252118 244218 235313 224612 212870 200938 188472 175411
54956 175411 163015 152126 142016 132240 123894 117686 112449 107019 101957 97983 94387 90612 87848
54943 87848 87317 88385 89990 92498 96450 100818 104474 108296 114002 121768 130672 140589 151956 164344
54929 164344 176707 188379 198505 205342 207492 205214 199480 190688 179379 167072 155031 143222
54917 143222 131651 121513 113629 106967 100294 94179 89716 86353 82810 79307 77042 76026 75178 74050
54903 74050 72939 71826 70719 70512 71924 74038 75319 75609 75763 75858 75302 74259 73417 72584 70935 68479
54887 68479 66012 63877 61967 60625 60283 60453 60223 59489 58652 57600 56169 55123 55346 56341 56839 56568 56147
54870 56147 55511 53921 51529 49602 48956 49222 49750 50270 50521 50205 49565 49361 50032 51350 52845 54100 54777
$$ packed form
54969B48745R626O104K590j711n692p544p900q905j0701j1742j1932j2466j3061
54956A75411j2396j0889j0110r776q346o208n237n430n062l974l596l775k764
54943H7848n31J068J605K508L952M368L656L822N706P766Q904R917J1367J2388
54929A64344J2363J1672J0126O837K150k278n734q792j1309j2307j2041j1809
54917A43222j1571j0138p884o662o673o115m463l363l543l503k265j016q48j128
54903G4050j111j113j107k07J412K114J281K90J54R5n56j043q42q33j649k456
54887F8479k467k135j910j342l42J70k30p34q37j052j431j046K23R95M98k71m21
54870E6147o36j590k392j927o46K66N28N20K51l16o40k04O71J318J495J255O77
$$ plain form
54853 54777 54799 54448 53932 53193 52379 51998 52242 52692 53110 53829 54942 55872 56341 56998 58422 60243 61925 63643
54835 63643 65630 67441 68716 70012 72054 74790 77909 81602 86041 90884 96146 102804 111668 122362
54821 122362 134213 147333 161803 176611 190384 202466 212314 218682 220616 218692 214122 207240 197911
54808 197911 186910 175699 165234 155844 147775 140924 134611 128537 123376 119581 116408 113092 110152
54795 110152 108325 106971 104893 102216 100149 99373 99858 101804 105387 109853 114126 118217 123077 129278 136733
54780 136733 145442 155682 167681 181689 197813 215177 232021 247312 261335 273876 283101 287586
54768 287586 288444 287995 287193 285827 284305 283258 281823 278115 271345 262100 250903 238012 224423 211410
54754 211410 199053 186506 173690 161507 150551 140836 132615 126176 120916 115826 110770 106205 101973
$$ packed form
54853E4777K2l51n16p39q14l81K44M50M18P19J113R30M69O57J424J821J682J718
54835F3643J987J811J275J296K042K736L119L693M439M843N262O658Q864J0694
54821A22362J1851J3120J4470J4808J3773J2082R848O368J934j924m570o882r329
54808A97911j1001j1211j0465r390q069o851o313o074n161l795l173l316k940
54795A10152j827j354k078k677k067p76M85J946L583M466M273M091M860O201P455
54780A36733Q709J0240J1999J4008J6124J7364J6844J5291J4023J2541R225M485
54768B87586Q58m49q02j366j522j047j435l708o770r245j1197j2891j3589j3013
54754B11410j2357j2547j2816j2183j0956r715q221o439n260n090n056m565m232
$$ plain form
54741 101973 97621 93669 91124 89836 88568 86717 84785 83229 81973 80952 80055 78678 76461 74239
54727 74239 73161 73100 73104 73062 73638 74840 76056 77358 79326 81598 82980 83089 82682 82368 82120 81976 82020 81827
54709 81827 81177 81145 83034 86262 88669 88980 87749 85970 84237 83310 83911 85613 87176 88262 89592 91300
54693 91300 92484 92714 92734 93336 94672 96879 100130 103769 106652 108778 111518 115863 121390 127186 132696
54678 132696 137424 140904 143347 145410 147137 148096 148634 149877 152294 155419 159157 164099 170231 176624 182869
54663 182869 189689 197725 206829 217079 229321 244047 260751 279075 299639 322911 347819 372165
54651 372165 393861 411255 422728 426753 422432 410081 391501 369398 345871 321577 296833 272980
54639 272980 251727 233447 217302 202890 190583 180316 171387 163641 157607 153242 149681 146516 144169
$$ packed form
54741A01973m352l952k545j288j268j851j932j556j256j021q97j377k217k222
54727G4239j078o1Mm2N76J202J216J302J968K272J382J09m07l14k48j44M4j93
54709H1827o50l2J889L228K407L11j231j779j733r27O01J702J563J086J330J708
54693I1300J184K30K0O02J336K207L251L639K883K126K740M345N527N796N510
54678A32696M728L480K443K063J727R59N38J243K417L125L738M942O132O393O245
54663A82869O820Q036R104J0250J2242J4726J6704J8324K0564K3272K4908K4346
54651C72165K1696J7394J1473M025m321j2351j8580k2103k3527k4294k4744k3853
54639B72980k1253j8280j6145j4412j2307j0267q929p746o034m365l561l165k347
$$ plain form
54626 144169 142612 140902 138473 135893 133878 132440 131429 130987 130984 130853 130492 130528 131308 132254 132612 132182 131094
54609 131094 129520 127897 126729 125942 124985 123600 121885 119741 117112 114653 113155 112315 111174 109723 108869
54594 108869 108703 108130 106561 104759 103540 102745 101992 101393 100942 100105 98607 96930 95563 94484 93671 93387
54578 93387 93649 94133 94762 95637 96369 96474 96500 97594 99724 101493 102068 102147 102636 103471 104315 105353 106837 108687
54560 108687 110982 113952 117158 119717 121747 124432 128208 132129 135676 139942 146082 153659 161561 169787
54546 169787 179269 190424 202791 215685 228502 240629 251587 260947 267840 271139 270497 266658 260462
54533 260462 252136 241894 230461 218619 206879 195889 186425 178459 170894 162742 154137 146008 139260
54520 139260 134424 131321 128881 125967 122602 119734 117835 116600 116025 116610 118220 119836 120801 121390 121881
$$ packed form
54626A44169j557j710k429k580k015j438j011m42lj31l61L6P80R46L58m30j088
54609A31094j574j623j168p87r57j385j715k144k629k459j498q40j141j451q54
54594A08869j66n73j569j802j219p95p53n99m51q37j498j677j367j079q13k84
54578I3387K62M84O29Q75P32J05K6J094K130J769N75P9M89Q35Q44J038J484J850
54560A08687K295K970L206K559K030K685L776L921L547M266O140P577P902Q226
54546A69787R482J1155J2367J2894J2817J2127J0958R360O893L299o42l839o196
54533B60462q326j0242j1433j1842j1740j0990r464p966p565q152q605q129o748
54520A39260m836l103k440k914l365k868j899j235n75N85J610J616R65N89M91
$$ plain form
54505 121881 122136 122342 123011 123808 123564 121958 120124 119073 118528 117827 116872 115724 114338 113209 113102 113597 113170
54488 113170 111332 109396 108353 107421 105691 103881 103100 102939 102211 100949 100308 100873 102139 103368 104138 104328
54472 104328 104270 104570 105356 106167 106857 107825 108975 109461 109030 108584 108702 108652 107666 106259 105348 104913 104470 104103 104074
54453 104074 104129 104082 104369 105219 106007 106252 106428 106927 107096 106294 105034 104072 103226 102219 101870 103093 105277 106952
54435 106952 107634 107892 107980 107616 106782 105720 104415 102977 102180 102592 103501 103663 102953 102398 102855 104378 106539
54418 106539 108660 110112 111118 112806 115756 119041 121488 123272 125393 128108 130815 132957 134108 133726
54404 133726 131846 129606 128072 126939 125233 122811 120294 118089 116459 115909 116363 116456 114919 112265 109974
54389 109974 108453 107024 105530 104529 104077 103664 103267 103276 103377 102774 101484 100304 99472 98517 97473 97047 97461
$$ packed form
54505A21881K55K06O69P97k44j606j834j051n45p01r55j148j386j129j07M95m27
54488A13170j838j936j043r32j730j810p81j61p28j262o41N65J266J229P70J90
54472A04328n8L00P86Q11O90R68J150M86m31m46J18n0r86j407r11m35m43l67k9
54453A04074N5m7K87Q50P88K45J76M99J69q02j260r62q46j007l49J223K184J675
54435A06952O82K58Q8l64q34j062j305j438p97M12R09J62p10n55M57J523K161
54418A06539K121J452J006J688K950L285K447J784K121K715K707K142J151l82
54404A33726j880k240j534j133j706k422k517k205j630n50M54R3j537k654k291
54389A09974j521j429j494j001m52m13l97RJ01o03j290j180q32r55j044m26M14
$$ plain form
54372 97461 98172 98915 100011 101426 102566 103197 103649 103857 103192 101613 100147 99787 100579 102069 104054 106501
54356 106501 109237 112006 114530 116428 117478 117940 118194 118097 117209 115600 113878 112419 111005 109267 107081
54341 107081 104624 102417 101126 100911 101121 101012 100488 99782 98809 97403 95793 94231 92516 90481 88545 87123
54325 87123 85860 84219 82477 81341 80863 80569 80364 80482 80773 80809 80509 79929 78733 76761 74785 73773 73591
54308 73591 73359 72872 72644 72718 72507 71900 71511 71630 71792 71472 70531 68959 66979 65366 64842 65081 65075 64469 63820
54289 63820 63568 63594 63808 64307 64917 65335 65816 66928 68623 70323 71871 73562 75264 76476 77289 78278 79308
54272 79308 79469 78530 77499 77311 77759 78106 78072 77756 77270 76806 76597 76531 76301 76089 76425 77236 77780 77828 78153 79404
54252 79404 81095 82205 82328 81866 81500 81782 82822 84023 84516 84128 83530 83169 82522 80845 78351 76103 74848
$$ packed form
54372I7461P11P43J096J415J140O31M52K08o65j579j466l60P92J490J985K447
54356A06501K736K769K524J898J050M62K54r7q88j609j722j459j414j738k186
54341A07081k457k207j291k15K10j09n24p06r73j406j610j562j715k035j936j422
54325H7123j263j641j742j136m78k94k05J18K91L6l00n80j196j972j976j012j82
54308G3591k32m87k28P4k11o07l89J19J62l20r41j572j980j613n24K39oo06o49
54289F3820k52K6K14M99O10M18M81J112J695J700J548J691J702J212Q13R89J030
54272G9308J61r39j031j88M48L47l4l16m86m64k09o6k30k12L36Q11N44M8L25J251
54252G9404J691J110J23m62l66K82J040J201M93l88n98l61o47j677k494k248j255
$$ plain form
54235 74848 74276 73490 72002 70235 69041 68805 69198 69794 70566 71516 72206 72175 71653 71449 72150 73682 75488 76792
54217 76792 76926 75867 74391 73392 73211 73780 74987 76492 77629 78073 78274 78651 78812 78232 77300 76843 76918 76938
54199 76938 76809 76959 77281 76978 75676 73939 72499 71574 71090 70968 70993 70859 70465 69853 68957 67821 66865 66399
54181 66399 66018 65056 63543 62109 61116 60508 60336 60733 61361 61607 61310 60780 60205 59604 59189 59070 58756 57682
54163 57682 56197 55326 55588 56684 58238 60052 61642 62322 61955 61083 60300 59909 60014 60378 60387 59764 59148 59293
54145 59293 59989 60451 60424 60062 59101 57234 55114 53883 53776 54205 55116 57038 59726 61994 63137 63488 63365
54128 63365 62609 61503 60979 61425 62203 62766 63298 63757 63385 61907 60384 60018 60675 61331 61545 61716 62133 62464
54110 62464 62196 61184 59778 58553 57878 57686 57648 57526 57236 56821 56557 56753 57246 57468 57321 57405 57943 58242 57923
$$ packed form
54235G4848n72p86j488j767j194k36L93N96P72R50O90l1n22k04P01J532J806J304
54217G6792J34j059j476r99j81N69J207J505J137M44K01L77J61n80r32m57P5K0
54199G6938j29J50L22l03j302j737j440r25m84j22K5j34l94o12q96j136r56m66
54181F6399l81r62j513j434r93o08j72L97O28K46k97n30n75o01m15j19l14j074
54163E7682j485q71K62J096J554J814J590O80l67q72p83l91J05L64Ro23o16J45
54145E9293O96M62k7l62r61j867k120j231j07M29R11J922K688K268J143L51j23
54128F3365p56j106n24M46P78N63N32M59l72j478j523l66O57O56K14J71M17L31
54110F2464k68j012j406j225o75j92l8j22k90m15k64J96M93K22j47Q4N38K99l19
$$ plain form
54091 57923 57900 59051 60610 61105 60463 59854 59810 59940 60262 61251 62491 62854 62275 61938 62437 63139 63724 64861
54073 64861 66792 68560 69370 69627 69954 70264 70462 71031 72160 73175 73499 73450 73521 73701 74012 74857 76234 77424
54055 77424 78061 78705 79800 80877 81385 81607 82151 83210 84812 87035 89444 91076 91617 91944 93039 94994
54039 94994 97494 100444 103606 106443 108934 111822 115552 119674 123735 127915 132249 136149 139323 142350
54025 142350 145666 148805 151327 153661 156235 158570 160082 161100 162237 163372 164078 164495 164968 165329 165258 164852
54009 164852 164151 162624 159905 156531 153260 150093 146665 143066 139601 136187 132696 129440 126711 124307
53995 124307 122100 120484 119600 118695 117098 115276 114125 113619 113006 112036 111091 110330 109455 108244 106715 104912
53979 104912 102985 101296 100049 99039 98082 97313 96769 96164 95427 94926 94749 94408 93724 93352 93811 94605 94955
$$ packed form
54091E7923k3J151J559M95o42o09m4J30L22R89J240L63n79l37M99P02N85J137
54073F4861J931J768Q10K57L27L10J98N69J129J015L24m9P1J80L11Q45J377J190
54055G7424O37O44J095J077N08K22N44J059J602K223K409J632N41L27J095J955
54039I4994K500K950L162K837K491K888L730M122M061M180M334L900L174L027
54025A42350L316L139K522K334K574K335J512J018J137J135P06M17M73L61p1m06
54009A64852p01j527k719l374l271l167l428l599l465l414l491l256k729k404
53995A24307k207j616q84r05j597j822j151n06o13r70r45p61q75j211j529j803
53979A04912j927j689j247j010r57p69n44o05p37n01j77l41o84l72M59P94L50
$$ plain form
53962 94955 94913 95027 95332 95342 94778 93782 92776 92420 93178 94549 95364 95270 95229 96086 97568 99321 101964 106082
53944 106082 110942 115320 119095 123049 127525 132315 137497 143282 149199 154400 158702 162532 165969 168525
53930 168525 169748 169477 167798 165364 163411 162754 163020 163435 163972 165042 166504 167867 169232 171250 174326
53915 174326 178496 183738 189688 195415 200332 205057 210520 216480 221795 226008 229698 233240 236127 237721
53901 237721 237969 237161 235533 233339 231033 229190 228255 228158 228021 226644 223592 219510 215166 210775 206547 203090
53885 203090 200539 197814 193567 187661 181166 175235 170495 167047 164406 161759 158837 156165 154044 151897
53871 151897 149218 146483 144318 142369 139859 136789 133690 130643 127531 124848 123235 122414 121471 120012 118293
53856 118293 116484 114700 113395 112828 112309 110810 108253 105418 102843 100576 98783 97708 97179 96894 96940 97274
$$ packed form
53962I4955m2J14L05J0n64r96j006l56P58J371Q15r4m1Q57J482J753K643M118
53944A06082M860M378L775L954M476M790N182N785N917N201M302L830L437K556
53930A68525J223k71j679k434j953o57K66M15N37J070J462J363J365K018L076
53915A74326M170N242N950N727M917M725N463N960N315M213L690L542K887J594
53901B37721K48q08j628k194k306j843r35r7j37j377l052m082m344m391m228l457
53885B03090k551k725m247n906o495n931m740l448k641k647k922k672k121k147
53871A51897k679k735k165j949k510l070l099l047l112k683j613q21r43j459j719
53856A18293j809j784j305n67n19j499k557k835k575k267j793j075n29k85M6L34
$$ plain form
53840 97274 97108 95793 94081 93440 94255 95599 96655 97297 97357 96535 95225 94476 94722 95280 95351 94891 94332 94019
53822 94019 94124 94648 95402 96296 97548 99271 101108 102718 104340 106313 108390 110117 111520 112803 113797 114476
53806 114476 115555 117678 120323 122450 124020 125951 128744 132072 135612 139359 143142 146637 149840 152866
53792 152866 155497 157588 159596 161930 164147 165644 166727 167978 169033 169183 168849 169062 169631 169264 167591
53777 167591 165672 164260 162884 161019 158982 157064 154785 151628 147818 143924 140310 137209 134681 132290
53763 132290 129496 126558 124367 123265 122674 121926 120787 119178 117207 115486 114579 114107 113239 112068 111484 111666
53747 111666 111786 111388 110926 110596 109719 107901 105894 104727 104634 105297 106477 107897 109017 109411 109064 108094 106573
53730 106573 104779 103167 101960 101054 100266 99318 97879 96219 95406 96074 97317 97749 97345 97151 97456 97604 97561
$$ packed form
53840I7274j66j315j712o41Q15J344J056O42O0q22j310p49K46N58P1m60n59l13
53822I4019J05N24P54Q94J252J723J837J610J622J973K077J727J403J283R94O79
53806A14476J079K123K645K127J570J931K793L328L540L747L783L495L203L026
53792A52866K631K091K008K334K217J497J083J251J055J50l34K13N69l67j673
53777A67591j919j412j376j865k037j918k279l157l810l894l614l101k528k391
53763A32290k794k938k191j102n91p48j139j609j971j721r07m72q68j171n84J82
53747A11666J20l98m62l30q77j818k007j167r3O63J180J420J120L94l47r70j521
53730A06573j794j612j207r06p88r48j439j660q13O68J243M32m04j94L05J48m3
$$ plain form
53713 97561 98175 99610 100825 101061 100680 100171 99504 98971 99481 101381 103896 106319 108811 111526 113919 115571
53697 115571 116882 118308 119773 121395 123854 127268 130494 132396 133224 133999 135101 136215 137226 138413 139996
53682 139996 142018 144512 147450 150780 154671 159293 164218 168549 171893 174716 177685 181191 185569 190944
53668 190944 196634 201447 204935 207736 210500 213199 215714 218283 221029 223762 226518 229594 232805 235509
53654 235509 237603 239613 241509 242433 242075 241405 241461 242210 243117 244009 244780 244981 244453 243813 243753 244258 244887 245270
53636 245270 245000 243746 241854 240228 239252 238427 237326 236112 234877 233333 231517 229903 228470 226631 224483
53621 224483 223059 222749 222590 221821 221047 221004 221120 220379 218901 217621 216983 216801 216947 217356 217781 218286 219507 221785
53603 221785 224506 226912 229049 231343 233840 236428 239216 242102 244589 246673 249273 253181 258145 263490
$$ packed form
53713I7561O14J435J215K36l81n09o67n33N10J900K515K423K492K715K393J652
53697A15571J311J426J465J622K459L414L226J902Q28P75J102J114J011J187J583
53682A39996K022K494K938L330L891M622M925M331L344K823K969L506M378N375
53668A90944N690M813L488K801K764K699K515K569K746K733K756L076L211K704
53654B35509K094K010J896R24l58o70N6P49R07Q92P71K01n28o40o0N05O29L83
53636B45270k70j254j892j626r76q25j101j214j235j544j816j614j433j839k148
53621B24483j424l10j59p69p74m3J16p41j478j280o38j82J46M09M25N05J221K278
53603B21785K721K406K137K294K497K588K788K886K487K084K600L908M964N345
$$ plain form
53589 263490 268887 273991 278237 281747 285608 290450 295544 300101 304532 309484 314516 318864 322836 327239
53575 327239 332013 336605 341208 346429 352111 357644 363103 368941 374797 379781 383748 387266 390384 392493
53561 392493 393424 393832 394388 395165 395725 395284 393155 389686 386400 384497 383581 382510 380939 379166 377017 374003
53545 374003 370288 366454 362526 358240 354029 350725 348365 346306 344328 342634 340860 338273 335054 332357
53531 332357 330863 330096 329352 328507 327722 327078 326733 326806 326918 326415 325174 323775 322848 322759 323822 326127 329087
53514 329087 331783 333950 336250 339474 343773 348646 353447 358012 362949 369017 376110 383391 390734 399278
53500 399278 409947 422191 434951 448173 462348 477163 491849 506562 522268 539335 557353
53489 557353 576272 596685 618828 642324 667131 693950 723323 754847 787323 819283 849543
$$ packed form
53589B63490N397N104M246L510L861M842N094M557M431M952N032M348L972M403
53575C27239M774M592M603N221N682N533N459N838N856M984L967L518L118K109
53561C92493R31M08N56P77N60m41k129l469l286j903r16j071j571j773k149l014
53545C74003l715l834l928m286m211l304k360k059j978j694j774k587l219k697
53531C32357j494p67p44q45p85o44l45P3J12n03j241j399r27q9J063K305K960
53514C29087K696K167K300L224M299M873M801M565M937O068P093P281P343Q544
53500C99278J0669J2244J2760J3222J4175J4815J4686J4713J5706J7067J8018
53489E57353J8919K0413K2143K3496K4807K6819K9373L1524L2476L1960L0260
$$ plain form
53478 849543 877895 905208 932373 959453 986445 1014391 1044852 1078522 1115273 1155203 1198562
53467 1198562 1244815 1292857 1342096 1392237 1442038 1489396 1532794 1571665 1605402 1633342 1656078
53456 1656078 1675505 1693050 1708897 1723441 1738431 1755846 1776401 1799885 1826257 1855492 1886593
53445 1886593 1917535 1946353 1972172 1995376 2016902 2037125 2055269 2069927 2079951 2084536 2082983 2075231
53433 2075231 2062550 2046840 2029104 2009121 1986470 1960999 1932350 1900014 1864229 1826120 1786790
53422 1786790 1747029 1707939 1670766 1635568 1600826 1564858 1526980 1487033 1444765 1400457 1355516
53411 1355516 1311708 1270139 1231543 1196993 1167432 1142635 1121313 1102336 1085484 1071108 1059505
53400 1059505 1050798 1045180 1043075 1045004 1051189 1061355 1074948 1091487 1110682 1132458 1157012 1184469
$$ packed form
53478H49543K8352K7313K7165K7080K6992K7946L0461L3670L6751L9930M3359
53467A198562M6253M8042M9239N0141M9801M7358M3398L8871L3737K7940K2736
53456A656078J9427J7545J5847J4544J4990J7415K0555K3484K6372K9235L1101
53445A886593L0942K8818K5819K3204K1526K0223J8144J4658J0024M585j553p752
53433B075231j2681j5710j7736j9983k2651k5471k8649l2336l5785l8109l9330
53422A786790l9761l9090l7173l5198l4742l5968l7878l9947m2268m4308m4941
53411A355516m3808m1569l8596l4550k9561k4797k1322j8977j6852j4376j1603
53400A059505q707n618k105J929O185J0166J3593J6539J9195K1776K4554K7457
$$ plain form
53388 1184469 1214151 1244576 1274653 1304583 1335140 1366451 1398175 1430512 1464183 1499555 1536687
53377 1536687 1576152 1618874 1665144 1714762 1768258 1826876 1891007 1959516 2031064 2105184 2181607
53366 2181607 2259451 2337929 2417341 2498717 2582780 2669656 2759039 2849936 2940521 3028808 3113395
53355 3113395 3193440 3268477 3338817 3405887 3471609 3537451 3604211 3672349 3742182 3813920 3887834
53344 3887834 3964158 4042550 4121788 4200026 4274820 4342340 4396796 4431430 4440832 4422956 4379580
53333 4379580 4315221 4235421 4145441 4049661 3951173 3851232 3749301 3644321 3536244 3426330
53323 3426330 3316328 3207849 3102255 3000161 2900752 2802123 2702735 2602346 2501540 2400910
53313 2400910 2300913 2202124 2105281 2011271 1921131 1835751 1755516 1680504 1611093 1548074 1492175
$$ packed form
53388A184469K9682L0425L0077K9930L0557L1311L1724L2337L3671L5372L7132
53377A536687L9465M2722M6270M9618N3496N8618O4131O8509P1548P4120P6423
53366B181607P7844P8478P9412Q1376Q4063Q6876Q9383R0897R0585Q8287Q4587
53355C113395Q0045P5037P0340O7070O5722O5842O6760O8138O9833P1738P3914
53344C887834P6324P8392P9238P8238P4794O7520N4456L4634R402j7876m3376
53333D379580o4359p9800q9980r5780r8488r9941j01931j04980j08077j09914
53323C426330j10002j08479j05594j02094r9409r8629r9388j00389j00806j00630
53313B400910r9997r8789r6843r4010r0140q5380q0235p5012o9411o3019n5899
$$ plain form
53302 1492175 1443846 1403360 1370497 1344092 1322464 1304518 1289966 1278372 1268641 1259798 1251841 1245289
53290 1245289 1240133 1235581 1230797 1225652 1220764 1216841 1214024 1212000 1210756 1210823 1212554 1215589 1219527 1224692
53276 1224692 1231588 1239946 1249183 1259619 1272373 1287931 1305658 1324845 1345446 1367533 1390812 1415098
53264 1415098 1440829 1468855 1500040 1535017 1573623 1614461 1655691 1696510 1737357 1778635 1820159
53253 1820159 1862159 1906011 1953286 2004401 2058411 2113501 2167301 2217323 2261853 2300344 2332746
53242 2332746 2358676 2377376 2388121 2390437 2384208 2369587 2346546 2314632 2273657 2224681 2169717 2110472
53230 2110472 2047900 1982917 1916788 1850749 1785951 1723895 1666090 1613051 1564209 1518925 1476812
53219 1476812 1436946 1397674 1357426 1314960 1268780 1217599 1161890 1103879 1045392 986644 927781
$$ packed form
53302A492175m8329m0486l2863k6405k1628j7946j4552j1594r731q843p957o552
53290A245289n156m552m784n145m888l923k817k024j244O7J731L035L938N165
53276A224692O896Q358R237J0436J2754J5558J7727J9187K0601K2087K3279K4286
53264A415098K5731K8026L1185L4977L8606M0838M1230M0819M0847M1278M1524
53253A820159M2000M3852M7275N1115N4010N5090N3800N0022M4530L8491L2402
53242B332746K5930J8700J0745K316o229j4621k3041l1914m0975m8976n4964n9245
53230B110472o2572o4983o6129o6039o4798o2056n7805n3039m8842m5284m2113
53219A476812l9866l9272m0248m2466m6180n1181n5709n8011n8487n8748n8863
$$ plain form
53208 927781 870502 817114 768740 725399 687174 654235 626122 601946 581137 563375 548183
53197 548183 535222 524474 515463 506830 497531 487995 479220 471083 462484 452859 442578 431965 420888
53184 420888 409299 397389 385157 372645 360643 350326 341964 334614 327274 319836 312722 306143 299988
53171 299988 293972 287623 280448 272411 264078 256057 248527 241421 234888 229256 224547 220253 215764 211008
53157 211008 206515 202804 199882 197424 195200 193070 190816 188357 185952 183826 181795 179723 178099 177512
53143 177512 177685 177768 177558 177636 178212 178740 178849 178759 178422 177082 174278 170610 167061 164117 161932 160642 159985
53126 159985 159253 158138 157082 156347 155475 154178 153058 152707 152716 152280 151285 150092 148801 147476 146634 146747 147595
53109 147595 148726 150133 151885 153642 155299 157474 160521 163592 165696 167242 169452 172536 175646 178449
$$ packed form
53208I27781n7279n3388m8374m3341l8225l2939k8113k4176k0809j7762j5192
53197E48183j2961j0748r011q633r299r536q775q137q599r625j0281j0613j1077
53184D20888j1589j1910j2232j2512j2002j0317q362p350p340p438p114o579o155
53171B99988o016o349p175q037q333q021p530p106o533n632m709m294m489m756
53157B11008m493l711k922k458k224k130k254k459k405k126k031k072j624n87
53143A77512J73Q3k10P8N76N28J09r0l37j340k804l668l549k944k185j290o57
53126A59985p32j115j056p35q72j297j120l51Rm36r95j193j291j325q42J13Q48
53109A47595J131J407J752J757J657K175L047L071K104J546K210L084L110K803
$$ plain form
53095 178449 181466 184734 187286 188373 188390 188161 187896 187139 185252 181728 176599 170760 165510 161479 158276
53080 158276 155214 151994 148635 145173 141681 138346 135397 132991 131118 129533 127939 126305 124754 123086
53066 123086 120933 118561 116942 116569 116767 116683 116379 116308 116269 115737 114910 114555 114956 115791 116863 118154 119292 119763
53048 119763 119691 119689 119967 120219 120361 120637 120987 121004 120597 120055 119444 118581 117631 117043 116784 116261 115130 113659 112184
53029 112184 110779 109551 108650 107859 106691 105073 103476 102278 101397 100586 99654 98421 96971 95901 95737 96081
53013 96081 95951 95005 93796 92779 91802 90754 89960 89579 89236 88676 88199 88071 87982 87574 87119 87162 87674 87995 87523
52994 87523 86215 84519 83088 82449 82707 83500 84293 84800 85180 85859 87005 88144 88583 88378 88490 89641 91352
52977 91352 92628 93294 93983 94951 95684 95765 95510 95500 95974 96880 98113 99481 100719 101680 102351 102663 102620 102552 102989
$$ packed form
53095A78449L017L268K552J087J7k29k65p57j887l524n129n839n250m031l203
53080A58276l062l220l359l462l492l335k949k406j873j585j594j634j551j668
53066A23086k153k372j619l73J98q4l04p1l9n32q27l55M01Q35J072J291J138M71
53048A19763p2kK78K52J42K76L50J7m07n42o11q63r50n88k59n23j131j471j475
53029A12184j405j228r01p91j168j618j597j198q81q11r32j233j450j070j64L44
53013I6081j30r46j209j017r77j048p94l81l43n60m77j28q9m08m55M3N12L21m72
52994H7523j308j696j431o39K58P93P93N07L80O79J146J139M39k05J12J151J711
52977I1352J276O66O89R68P33Q1k55j0M74R06J233J368J238R61O71L12m3o8M37
$$ plain form
52958 102989 104286 106621 110090 114354 118412 121375 123427 125491 128017 130725 133409 136129 138508 139778
52944 139778 139876 139740 140071 140421 140057 139147 138443 138178 137923 137376 136702 136104 135507 134687 133450 131723 129750 128140
52926 128140 127442 127616 128076 128309 128330 128494 128955 129429 129510 129170 128809 128772 128993 129215 129357 129486 129579 129482 129006 127967
52906 127967 126401 124903 124411 125268 126754 127842 128209 128159 127964 127823 128109 128946 129682 129555 128805 128392 128629 128943
52888 128943 129103 129711 130963 131795 130994 128782 126626 125774 126445 128170 130208 131666 131910 131135 130217 129773 129596
52871 129596 129201 128691 128784 129986 132042 134319 136490 138580 140582 142454 144505 147295 150932 154758 157856
52856 157856 159575 159504 157575 154509 151677 149952 148891 147455 145243 142648 140175 138196 137078 136922 137201
52841 137201 137120 136270 134681 132581 130565 129625 130243 131608 132356 131991 131102 130439 130487 131700 134185 137104 139198
$$ packed form
52958A02989J297K335L469M264M058K963K052K064K526K708K684K720K379J270
52944A39778R8j36L31L50l64r10p04k65k55n47o74n98n97q20j237j727j973j610
52926A28140o98J74M60K33K1J64M61M74Q1l40l61l7K21K22J42J29R3r7m76j039
52906A27967j566j498m92Q57J486J088L67n0j95j41K86Q37P36j27p50m13K37L14
52888A28943J60O08J252Q32q01k212k156q52O71J725K038J458K44p75r18m44j77
52871A29596l95n10R3J202K056K277K171K090K002J872K051K790L637L826L098
52856A57856J719p1j929l066k832j725j061j436k212k595k473j979j118j56K79
52841A37201q1q50j589k100k016r40O18J365P48l65q89o63M8J213K485K919K094
$$ plain form
52824 139198 140135 140663 141315 141652 141043 139579 137872 136400 135250 134189 132823 131042 129265 127846 126357
52809 126357 124064 121110 118581 117225 116706 116249 115480 114462 113434 112746 112606 112706 112463 111678 110551 109119
52793 109119 107245 105186 103516 102378 101382 100401 99796 99659 99477 98852 98022 97368 96889 96425 96001 95699 95561
52776 95561 95750 96431 97356 97950 97872 97121 95687 93681 91679 90306 89433 88512 87615 87338 87576 87419 86511 85587
52758 85587 85297 85410 85665 86472 88161 90232 92043 93566 94781 94976 93420 90397 86938 83820 81367 79734
52742 79734 78772 77897 76736 75740 75658 76536 77612 78010 77277 75558 73575 72144 71437 70999 70683 71022 72309
52725 72309 73797 74337 73463 71514 69084 66796 65263 64730 64914 65415 65999 66318 65920 64968 64429 65027 66399
52708 66399 67752 68954 70459 72431 74515 76260 77354 77624 77179 76392 75546 74791 74509 75171 76471 77276
$$ packed form
52824A39198R37N28O52L37o09j464j707j472j150j061j366j781j777j419j489
52809A26357k293k954k529j356n19m57p69j018j028o88j40J00k43p85j127j432
52793A09119j874k059j670j138r96r81o05j37j82o25q30o54m79m64m24l02j38
52776I5561J89O81R25N94p8p51j434k006k002j373q73r21q97k77K38j57r08r24
52758H5587k90J13K55Q07J689K071J811J523J215J95j556l023l459l118k453j633
52742G9734r62q75j161r96q2Q78J076L98p33j719j983j431p07m38l16L39J287
52725G2309J488N40q74j949k430k288j533n33J84N01N84L19l98r52n39N98J372
52708F6399J353J202J505J972K084J745J094K70m45p87q46p55k82O62J300Q05
$$ plain form
52692 77276 76936 76181 76182 77216 78790 80580 82510 84253 85473 86488 88083 90641 93830 96967 99347 100532
52676 100532 100771 100965 101775 102931 103705 103750 103172 102179 101097 100327 99876 99324 98685 98729 99919 101555 102694 103445
52658 103445 104625 106650 109668 114322 121104 128832 134834 137027 135348 131205 126249 121720 118073 114770
52644 114770 110886 106170 101283 96990 93590 91158 89744 89140 88937 88996 89471 90220 90639 90353 89755 89596 90170
52627 90170 91089 91722 91800 91640 91766 92242 92519 92098 91208 90620 90874 91856 92968 93515 93099 91888 90441 89194
52609 89194 88289 87871 88084 88588 88609 87876 87060 86936 87485 88273 89158 90032 90371 89874 89301 89798 91459 93289 94550
52590 94550 95358 95975 96310 96402 96745 97767 99363 101061 102294 102530 101702 100655 100562 101588 102626 102680 102069 101899
52572 101899 102667 103864 104799 105256 105314 104874 103735 102040 100368 99248 98769 98805 99418 100627 101879 102354 101971
$$ packed form
52692G7276l40p55JJ034J574J790J930J743J220J015J595K558L189L137K380J185
52676A00532K39J94Q10J156P74M5n78r93j082p70m51n52o39M4J190J636J139P51
52658A03445J180K025L018M654O782P728O002K193j679m143m956m529l647l303
52644A14770l884m716m887m293l400k432j414o04k03N9M75P49M19k86n98j59N74
52627I0170R19O33P8j60J26M76K77m21q90n88K54R82J112N47m16j211j447j247
52609H9194r05m18K13N04K1p33q16j24N49P88Q85Q74L39m97n73M97J661J830J261
52590I4550Q08O17L35R2L43J022J596J698J233K36q28j047r3J026J038N4o11j70
52572A01899P68J197R35M57N8m40j139j695j672j120m79L6O13J209J252M75l83
$$ plain form
52555 101971 101618 102052 103025 103833 104334 104886 105568 106043 106073 105740 105218 104742 104693 105293 106224 106840 106774 106133 105321 104829
52535 104829 104953 105358 105231 104211 102922 102172 101914 101478 100559 99392 98171 96961 96129 96212 97142 98111 98371
52518 98371 97908 97251 96886 96895 96947 96639 95964 95298 94806 94178 93197 92262 92025 92745 94257 96203 97941 98743 98630
52499 98630 98550 99099 99508 98724 97110 96098 96304 97017 97612 98394 99766 101414 102839 104031 105122 105819 105642
52482 105642 104508 102813 101187 100321 100685 102166 104148 106051 107639 108871 109811 110763 112134 114036 116221
52467 116221 118356 120127 121184 121343 120837 120066 119185 118287 117784 118078 118900 119530 119681 119713 119917 120144 120250 120427
52449 120427 120840 121348 121800 122313 123017 123720 123978 123463 122287 121077 120545 120786 121137 120978 120479 120281 120713 121685
52431 121685 123062 124637 125947 126664 127063 127660 128499 129242 129705 129830 129388 128329 127243 126815 126978 127221 127482
$$ packed form
52555A01971l53M34R73Q08N01N52O82M75L0l33n22m76m9O00R31O16o6o41q12m92
52535A04829J24M05j27j020j289p50k58m36r19j167j221j210q32Q3R30R69K60
52518I8371m63o57l65RN2l08o75o66m92o28r81r35k37P20J512J946J738Q02j13
52499I8630q0N49M09p84j614j012K06P13N95P82J372J648J425J192J091O97j77
52482A05642j134j695j626q66L64J481J982J903J588J232R40R52J371J902K185
52467A16221K135J771J057J59n06p71q81q98n03K94Q22O30J51L2K04K27J06J77
52449A20427M13N08M52N13P04P03K58n15j176j210n32K41L51j59m99j98M32R72
52431A21685J377J575J310P17L99N97Q39P43M63J25m42j059j086m28J63K43K61
$$ plain form
52414 127482 127963 128239 127543 125986 124659 124335 124787 125502 126288 127049 127684 128408 129433 130260 130078 129060 128394
52397 128394 128715 129321 129386 129134 129293 130017 130934 131716 132083 131731 130794 129992 129827 129982 129917 129669 129602 129653 129350 128430
52377 128430 127116 125875 125061 124621 124143 123440 123037 123587 124877 126027 126763 127762 129524 131644 133530 135141
52361 135141 136567 137570 138068 138504 139141 139578 139553 139695 140700 142162 143013 142939 142591 142510 142616 142814 143436 144783
52343 144783 146604 148277 149377 150018 150728 151954 153560 154929 155670 156033 156488 157132 157722 158132 158448 158737 158997
52326 158997 159351 160082 161376 163027 164428 164998 164796 164537 164797 165373 165729 165891 166377 167411 168761 170308 172103
52309 172103 173820 174939 175695 177135 179825 183159 186363 189561 193285 197483 201707 205902 210330 214908
52295 214908 219260 223371 227674 232525 237966 243942 250387 257085 263715 270022 275828 281043 285894 290934
$$ packed form
52414A27482M81K76o96j557j327l24M52P15P86P61O35P24J025Q27j82j018o66
52397A28394L21O06O5k52J59P24R17P82L67l52r37q02j65J55o5k48o7N1l03r20
52377A28430j314j241q14m40m78p03m03N50J290J150P36R99J762K120J886J611
52361A35141J426J003M98M36O37M37k5J42J005J462Q51p4l48q1J06J98O22J347
52343A44783J821J673J100O41P10J226J606J369P41L63M55O44N90M10L16K89K60
52326A58997L54P31J294J651J401N70k02k59K60N76L56J62M86J034J350J547J795
52309A72103J717J119P56J440K690L334L204L198L724M198M224M195M428M578
52295B14908M352M111M303M851N441N976O445O698O630O307N806N215M851N040
$$ plain form
52281 290934 296606 302928 309733 316940 324393 331760 338926 346308 354470 363589 373488 383917 394581 405156
52267 405156 415637 426459 437926 449641 460819 471071 480643 490027 499603 509540 519752 529951
52255 529951 539903 549639 559357 569245 579382 589621 599451 608175 615296 620667 624362 626735 628534 630439
52241 630439 632368 633593 633693 633047 632309 631784 631462 631166 630531 629344 628087 627618 628057 628580 628656 628891 630180
52224 630180 632589 635738 639788 645215 651771 658473 664721 670909 677828 685905 695065 704977 715224 725440
52210 725440 735463 745309 755037 764660 774102 783195 791832 800130 808204 815741 822033 826568 829349 830636
52196 830636 830742 830160 829478 828814 827648 825392 821898 817233 811342 804239 796285 787974 779591 771237 762933
52181 762933 754461 745334 735216 724286 713137 702469 692843 684373 676576 668835 661120 653895 647258
$$ packed form
52281B90934N672O322O805P207P453P367P166P382Q162R119R899J0429J0664J0575
52267D05156J0481J0822J1467J1715J1178J0252R572R384R576R937J0212J0199
52255E29951R952R736R718R888J0137J0239R830Q724P121N371L695K373J799J905
52241F30439J929J225J00o46p38n25l22k96o35j187j257m69M39N23P6K35J289
52224F30180K409L149M050N427O556O702O248O188O919Q077R160R912J0247J0216
52210G25440J0023R846R728R623R442R093Q637Q298Q074P537O292M535K781J287
52196H30636J06n82o82o64j166k256l494m665n891p103p954q311q383q354q304
52181G62933q472r127j0118j0930j1149j0668r626q470p797p741p715p225o637
$$ plain form
52168 647258 640592 633275 625412 617696 610840 605191 600529 596159 591555 586961 582970 579631 576493 573434
$$ packed form
52168F47258o666p317p863p716o856n649m662m370m604m594l991l339l138l059
$$ [...]
##END NTUPLES=NMR SPECTRUM
##END=
