##TITLE=NES1061_159122.0010_001_9704394_M04ESlPhw2
##JCAMPDX= 6.0         $$ Bruker NMR JCAMP-DX V2.0
##DATA TYPE= NMR SPECTRUM
##DATA CLASS= NTUPLES
##ORIGIN= BRUKER
##OWNER= Administrator
$$ 1.72 TOPSPIN		Version 2.1
$$ 2016-04-30 18:31:06.396 -0700  Administrator@X
$$ Compression mode = diff/dup
##.OBSERVE FREQUENCY= 400.02188249412
##.OBSERVE NUCLEUS= ^1H
##.ACQUISITION MODE= SIMULTANEOUS (DQD)
##.ACQUISITION SCHEME= undefined
##.AVERAGES= 8
##.DIGITISER RES= 22
##SPECTROMETER/DATA SYSTEM= spect
##.PULSE SEQUENCE= zg30
##.SOLVENT NAME= COFFEE_meoh
##.SHIFT REFERENCE= INTERNAL, COFFEE_meoh, 1, 14.98509
##AUDIT TRAIL= $$ (NUMBER, WHEN, WHO, WHERE, PROCESS, VERSION, WHAT)
$$ ##TITLE= Audit trail, TOPSPIN		Version 2.1
$$ ##JCAMPDX= 5.01
$$ ##ORIGIN= Bruker BioSpin GmbH
$$ ##OWNER= Administrator
$$ $$ E:\/data/COFFEE/nmr/NES1061_159122.0010_001_9704394_M04ESlPhw2/20/pdata/1/auditp.txt
$$ ##AUDIT TRAIL=  $$ (NUMBER, WHEN, WHO, WHERE, PROCESS, VERSION, WHAT)
(   1,<2016-04-30 18:30:59.271 -0700>,<Administrator>,<X>,<go>,<TOPSPIN 2.1>,
      <created by zg
	started at 2016-04-30 18:29:53.005 -0700,
	POWCHK enabled, PULCHK disabled,
       configuration hash MD5:
       21 0F 79 D6 B3 7B B4 F6 88 20 88 DB 03 48 BD 9F
       data hash MD5: 64K
       20 EE DE B0 3C 36 21 56 A9 86 92 11 F5 A8 AA 82>)
(   2,<2016-04-30 18:31:02.380 -0700>,<Administrator>,<X>,<proc1d>,<TOPSPIN 2.1>,
      <Start of raw data processing
       efp LB = 0 FT_mod = 6 PKNL = 1 PHC0 = 0 PHC1 = 0 SI = 32K 
       data hash MD5: 32K
       CF AE FD B3 FB 6D EF C8 07 32 E4 5C A7 BB 93 34>)
(   3,<2016-04-30 18:31:02.677 -0700>,<Administrator>,<X>,<proc1d>,<TOPSPIN 2.1>,
      <pk PHC0 = 93.41675 PHC1 = 0 
       data hash MD5: 32K
       32 49 A6 4E F2 C0 AD 83 2E 8A 54 E2 E9 FA 5A 77>)
(   4,<2016-04-30 18:31:02.786 -0700>,<Administrator>,<X>,<proc1d>,<TOPSPIN 2.1>,
      <abs ABSG = 1 
       data hash MD5: 32K
       47 40 4B FA 03 7B 35 73 D2 46 ED FA D2 84 B6 62>)
(   5,<2016-04-30 18:31:02.849 -0700>,<Administrator>,<X>,<proc1d>,<TOPSPIN 2.1>,
      <abs ABSG = 2 
       data hash MD5: 32K
       83 56 5F 47 3E AB 47 A0 33 0A 21 30 A6 30 02 12>)
(   6,<2016-04-30 18:31:02.911 -0700>,<Administrator>,<X>,<proc1d>,<TOPSPIN 2.1>,
      <abs ABSG = 3 
       data hash MD5: 32K
       E5 C7 F6 7E F0 A8 84 3B 89 2C 45 4E 72 FB 8E FF>)
(   7,<2016-04-30 18:31:02.974 -0700>,<Administrator>,<X>,<proc1d>,<TOPSPIN 2.1>,
      <abs ABSG = 4 
       data hash MD5: 32K
       E3 AB 10 2E 33 A8 39 E7 4F 62 D1 E5 85 6B A8 87>)
(   8,<2016-04-30 18:31:03.036 -0700>,<Administrator>,<X>,<proc1d>,<TOPSPIN 2.1>,
      <abs ABSG = 5 
       data hash MD5: 32K
       DB 86 0A E7 50 3B D9 61 4A FE A3 BA 96 A0 76 F2>)
$$ ##END=
$$ 
$$ $$ hash MD5
$$ $$ D5 FE 9C FD F2 11 3D 6A 6A EF 24 79 5A 71 6C C6
##$RELAX= 
##$RELAX= 
##$RELAX= 
##$RELAX= 
##$RELAX= 
##$RELAX= 
##$RELAX= 
$$ Bruker specific parameters
$$ --------------------------
##$DU= <E:\>
##$EXPNO= 20
$$ [...]
##$TP= (0..7)
150 150 150 150 150 150 150 150
##$TP07= 0
##$TPNAME0= <>
##$TPNAME1= <>
##$TPNAME2= <>
##$TPNAME3= <>
##$TPNAME4= <>
##$TPNAME5= <>
##$TPNAME6= <>
##$TPNAME7= <>
##$TPOAL= (0..7)
0.5 0.5 0.5 0.5 0.5 0.5 0.5 0.5
##$TPOFFS= (0..7)
0 0 0 0 0 0 0 0
##$TUNHIN= 0
##$TUNHOUT= 0
##$TUNXOUT= 0
##$USERA1= <user>
##$USERA2= <user>
##$USERA3= <user>
##$USERA4= <user>
##$USERA5= <user>
##$V9= 5
##$VALIST= <valist>
##$VCLIST= <CCCCCCCCCCCCCCC>
##$VD= 0
##$VDLIST= <DDDDDDDDDDDDDDD>
##$VPLIST= <PPPPPPPPPPPPPPP>
##$VTLIST= <TTTTTTTTTTTTTTT>
##$WBST= 2048
##$WBSW= 25
##$XGAIN= (0..3)
0 0 0 0
##$XL= 0
##$YL= 0
##$YMAX_a= 596228
##$YMIN_a= -502622
##$ZGOPTNS= <>
##$ZL1= 120
##$ZL2= 120
##$ZL3= 120
##$ZL4= 120
##$ABSF1= 14.98509
##$ABSF2= -5.573092
##$ABSG= 5
##$ABSL= 3
##$ALPHA= 0
##$AQORDER= 0
##$ASSFAC= 0
##$ASSFACI= 0
##$ASSFACX= 0
##$ASSWID= 0
##$AUNMP= <proc_prof1d_extract_pilot.lims>
##$AXLEFT= 0
##$AXNAME= <>
##$AXNUC= <1H>
##$AXRIGHT= 0
##$AXTYPE= 0
##$AXUNIT= <>
##$AZFE= 0.1
##$AZFW= 0.1
##$BCFW= 0
##$BC_mod= 0
##$BYTORDP= 0
##$COROFFS= 0
##$CY= 15
##$DATMOD= 1
##$DC= 0
##$DFILT= <>
##$DTYPP= 0
##$F1P= 0
##$F2P= 0
##$FCOR= 0.5
##$FTSIZE= 32768
##$FT_mod= 6
##$GAMMA= 0
##$GB= 0
##$INTBC= 1
##$INTSCL= 1
##$ISEN= 128
##$LB= 0
##$LEV0= 0
##$LPBIN= 0
##$MAXI= 10000
##$MC2= 0
##$MEAN= 0
##$ME_mod= 0
##$MI= 0
##$NCOEF= 0
##$NC_proc= -8
##$NLEV= 6
##$NOISF1= 0
##$NOISF2= 0
##$NSP= 0
##$NTH_PI= 0
##$NZP= 0
##$OFFSET= 14.98509
##$PC= 1
##$PHC0= 93.41675
##$PHC1= 0
##$PH_mod= 1
##$PKNL= yes
##$PPARMOD= 0
##$PPDIAG= 0
##$PPIPTYP= 0
##$PPMPNUM= 2147483647
##$PPRESOL= 1
##$PSCAL= 4
##$PSIGN= 0
##$PYNMP= <proc.py>
##$REVERSE= no
##$SF= 400.02
##$SI= 32768
##$SIGF1= 0
##$SIGF2= 0
##$SINO= 400
##$SIOLD= 32768
##$SPECTYP= <>
##$SREGLST= <1H.CDCl3>
##$SSB= 0
##$STSI= 32768
##$STSR= 0
##$SW_p= 8223.68421052631
##$SYMM= 0
##$S_DEV= 0
##$TDeff= 65536
##$TDoff= 0
##$TI= <>
##$TILT= no
##$TM1= 0
##$TM2= 0
##$TOPLEV= 0
##$USERP1= <user>
##$USERP2= <user>
##$USERP3= <user>
##$USERP4= <user>
##$USERP5= <user>
##$WDW= 1
##$XDIM= 32768
##$YMAX_p= 418549473
##$YMIN_p= -624217
##$CURPLOT= <Network HP LaserJet P1505>
##$CURPRIN= <$Network HP LaserJet P1505>
##$DFORMAT= <normdp>
##$LAYOUT= <+/1D_H.xwp>
##$LFORMAT= <normlp>
##$PFORMAT= <normpl>
##$SURQMSG= 1
$$ End of Bruker specific parameters
$$ ---------------------------------
##NTUPLES= NMR SPECTRUM
##VAR_NAME=  FREQUENCY,     SPECTRUM/REAL,   SPECTRUM/IMAG
##SYMBOL=    X,             R,               I
##VAR_TYPE=  INDEPENDENT,   DEPENDENT,       DEPENDENT
##VAR_FORM=  AFFN,          ASDF,            ASDF
##VAR_DIM=   32768,         32768,           32768
##UNITS=     HZ,            ARBITRARY UNITS, ARBITRARY UNITS
##FACTOR=    0.250966925370066, 1,           1
##FIRST=     8223.43324360094, -16464,       -27670
##LAST=      0,             -60060,          31193
##MIN=       0,             -624217,         0
##MAX=       8223.43324360094, 418549473,    0
$$ Real data points
##PAGE= N=1
##DATA TABLE= (X++(R..R)), XYDATA
$$ [...]
23837 263909 152989 104329 -232252 98791 92450 189968 -38641 157828 -41215 100598 -64876
23825 -315977 31999 136020 299946 -131398 216573 -50025 -279293 118362 -35031 -108996
23815 -108996 -6182 -28008 -41710 95413 335325 -92019 -168438 -86897 223166 -23846 152002
23803 -83809 -57970 -241689 267363 -207005 12388 -48137 -185712 142164 -385368 162272
23792 -116058 33460 -15229 -42852 96852 -18639 -445095 -48884 -224923 -164487 -207008 15682
23780 -103187 35839 292237 47850 -12428 186097 -134934 -26311 -80177 -229008 -324921 -99597
23768 -377 157705 -197528 31827 -16786 176245 31425 -274375 -24939 -29010 313262 115934
23756 -8048 -139802 147146 15342 221742 -229502 178523 -63722 -237836 -135595 -92298
23746 -92298 25835 102951 273558 -35754 -42468 134395 270232 361919 -197972 -194850 183722
23734 76431 -26687 -120164 -309885 -288838 180933 86768 330514 242192 -32629 116664 -116713
23722 -127656 64590 238684 -3038 -72733 37418 -222626 -143728 -141673 182124 -100694 -240984
23711 -240984 -94965 381318 -215730 16895 -160065 -149737 302359 23689 -97220 -162562 14158
23699 305900 23710 -255016 -108049 2853 -145317 -167046 -139324 -4343 42477 -38011 77823
23687 58465 -65338 -122623 207092 -265843 -12535 -21596 -216726 28029 -5265 -10318 -269502
23676 -269502 -32160 -255845 184183 6461 -212740 -133655 49915 -14861 137681 48743 -147761
23664 -13927 -372108 -199084 110215 -13687 -236657 228503 -14514 -157405 -334324 -11700
23653 -221804 172631 -23267 -202238 35523 52195 257648 129769 197457 230356 -89164 -20258
23641 7682 -177381 -277283 -86565 -205138 92468 -51747 198196 169257 156305 -266562 -86952
23629 104883 4198 -329051 82384 -251254 -12484 56166 -302999 -192091 -54981 19203 59958
23618 59958 32794 50037 172480 85829 -254539 -144727 -13723 141566 82956 -94081 -126680
23607 -126680 -12664 -13797 27052 111219 -42783 -376199 144574 -132843 28757 23272 -106505
23595 236829 140913 1869 45986 342956 -121036 105980 -440498 217678 -111348 -94946
23585 -94946 107452 -75054 26088 -240196 -110983 -264248 -204815 -72743 22178 44940 -56092
23573 -123762 -154909 -157572 11068 -50096 33513 33928 -292493 199536 -99548 179161 -203760
23561 18989 -142418 -52401 -31616 -102910 -220627 64816 -100798 97345 94610 278736 -10585
23549 62529 87673 -220529 -118133 -269509 -74175 -173238 -16711 -17283 -119990 -337629 -218144
23538 -218144 -179632 -186263 -14620 -144727 169659 -417562 -172838 158150 104454 414332
23528 414332 86137 69274 -76856 32450 117998 -81254 -99370 -147077 -232328 14398 -127019
23516 -223416 -288325 -267084 337965 98560 -164087 -244201 -12085 -10968 -362646 245219 -101590
23504 239364 -12112 -206103 -78021 -30160 -42767 147245 -240711 27230 20278 260592 200435
23493 200435 201051 -404459 -169651 134087 -65974 -238502 170577 -238309 2229 78658 170868
23482 170868 93360 -170033 -58626 -15859 214089 13546 132206 4242 177978 68588 123851
23471 123851 184203 -52436 163114 -103978 -472005 -228279 -256683 65034 -138222 -87260
23461 -87260 -216564 -187332 12047 -62981 -20283 178451 -19214 -31068 131220 -13088 77477
23449 13028 -465178 -136120 -2209 172044 22947 247496 454 275154 -51586 -74521 120056
23437 99821 90360 -9988 335877 -50296 -115139 -1108 -66781 -280895 324888 -85635 -6121 44412
23424 -14362 221404 -49563 -84401 -68463 88647 -59138 160199 -35904 -264651 -120243 58114
23412 143012 -135194 223983 -186780 151626 -177976 -52014 61921 -463712 353199 -250925
23401 -76631 103161 228881 -282639 -73230 -93951 143056 148678 99148 -37657 115074 366723
23390 366723 131646 174029 255818 246324 -174768 -241253 -254862 142954 81880 929 -237461
23378 54940 -22998 -131541 354 -320329 -196993 -37483 71258 129890 -186810 132813 -195287
23366 -1750 455554 -96994 69041 32294 331044 50790 -158513 388254 284299 -97145 -187585
23355 -187585 -149109 212090 40584 112063 87799 -16059 -227501 -69646 88602 -317428 -41335
23343 42292 26172 -258185 -151523 -107235 -43988 -329871 -109131 -174406 -2589 -252151 166710
23331 -37628 -131741 -235286 -141746 -101796 40883 -318580 17058 141578 -207808 -71389 43992
23319 401379 72026 -220679 190737 240130 -117967 -1987 57983 601 239874 64274 -99068
23307 -248968 -31500 -81658 -57497 -18165 394196 -285691 316417 102380 -171398 -381146
23297 -381146 -125557 -57363 13137 201333 -273846 -17421 57076 121385 12865 -91914 -406407
23286 -406407 -204213 3240 -110890 -262704 -170486 -2515 87076 58777 -161216 -28718 -176179
23275 -176179 -235676 95435 63923 -47035 -134242 169717 -119293 31809 115324 -16190 63837
23263 164183 -2420 268505 100833 -272722 10003 -136808 -98670 137738 -168911 -103233
23253 -103233 -123100 -67520 187442 101440 -176316 43624 735 -115878 -123211 173895 83736
23241 37545 166874 79063 -76456 -42897 25822 126092 -28188 -223567 407730 65753 69658
23230 69658 10720 -54811 -394361 -72947 69702 24924 -44606 240728 -110200 -398543 -24923
23218 209737 -178184 12487 208421 -281361 -126638 -170432 -109128 56945 -105645 -286049
23208 -286049 -29426 -251574 -192423 16557 -470548 2896 300936 1236 178354 144350 -153725
23196 12952 145044 -188997 101321 -178931 -293322 71971 11988 -43764 -452870 -382793
23186 -382793 350315 327775 61579 32105 -22336 76813 -75801 -14067 -268369 278187 -105127
23174 64447 -296342 60993 22799 -38029 279814 23146 83600 -64046 44619 -284481 -324859
23163 -324859 106140 -254767 -131407 -199313 272256 108853 227280 11870 -42647 63789
23152 120747 37403 90859 299173 224189 -39145 8663 -209904 -241698 -407 -246221 -166846
23141 -166846 -62136 60702 140346 -415508 -27930 16969 233349 -27725 259482 -138407 -79191
23130 -79191 206340 308833 242081 -343719 81723 192396 299673 -162965 -422885 -223518
23120 -223518 -83557 299723 214890 -191980 -355846 -129832 30485 222842 180681 58384
23109 134067 4418 130347 241203 18529 -71055 -74588 -214292 -116503 214553 -49083 -147461
23098 -147461 217377 56019 218305 9166 45075 267119 -248716 -277622 77810 115019 -7332
23086 376511 89477 -378197 -187786 157144 -122486 174046 -17244 -43763 277041 -163680
23075 -145380 -300024 2876 7681 207416 278305 53610 91754 -172037 -130046 -103716 -1821
23063 -1775 -113154 199118 -129246 -174100 -3684 111033 -46808 -194748 -180068 61754 -158014
23051 5042 357464 27621 79130 255618 150925 -312460 14366 -131846 -202941 9825 176818
23040 176818 -366873 -119818 -176268 -459504 -97853 -44208 -66162 102622 -50792 109728
23029 74654 -352596 -87193 -27930 156676 189434 109239 -63308 547022 71899 -265911 -14057
23017 98645 -168992 -48585 -90968 -290524 -201235 52970 -28733 -395465 -223531 -70342 76991
23005 -21856 -159550 -201344 -136908 -241336 -51050 113784 -23581 -205934 54875 -107952 163193
22993 86753 323382 -281136 141447 -222709 -127711 140562 -63435 -320708 94313 25692
22982 -3360 -84550 -153795 3706 -186592 45659 -268366 -68646 229629 316579 -162736 -149711
22971 -149711 -24833 -77147 205953 268542 42176 -460114 70767 -32962 -257244 -24194 -69594
22960 -69594 -181934 112908 -95360 118645 37756 148432 162713 399996 -9081 -197087 -173100
22949 -173100 -179137 39792 137895 -30419 76904 332 -192876 -314497 -271037 13301 291029
22938 291029 -18000 18674 19258 -161247 141127 57228 51901 59517 66529 262879 113346 10358
22925 210284 -183423 107405 -108511 46915 50863 49651 -151828 167288 -370851 236851
22914 130527 194718 -213223 -130418 -192061 -173560 -284246 268983 -7721 -241434 165686 -185807
22902 -134068 109550 -267196 195164 75064 -131084 -184250 123747 -87400 38746 -2648 269409
22890 125255 -43431 -114139 159004 -51301 -279074 15514 -112070 -64635 -59343 -68873 -180073
22879 -180073 -49413 -70289 -421123 -288359 -37747 126930 114542 -131403 5146 98819 190390
22868 190390 -285256 7831 158236 79194 -96800 -359123 -157007 82032 311346 -102936
22857 -117000 349459 -7663 -61842 168962 95738 192948 173046 -156157 -210011 198790 44327
22845 -103488 188821 226729 -163752 68205 -31879 -290788 57596 42410 -24223 -62523 -13120
22833 -165250 -176548 -270827 96674 183531 -77033 -76755 -241695 -156522 -99147 204095 -187729
22821 -21900 -48120 229660 -36032 -135926 101624 167080 -390287 158309 161800 -38383 25560
22809 -300416 8014 154781 222598 -187782 -61479 97569 -107152 -206857 -140783 173861 -125666
22797 -91147 142514 -97749 -52049 -343761 -247874 -281009 19777 63569 -81245 -301615 -112498
22785 -382460 99569 -198212 -19292 191243 406518 -232717 48148 290530 -194158 -130122
22775 -130122 -113836 245811 -292909 -283709 220081 12860 -359574 -87711 118262 -125550
22764 -297510 -171887 289190 -36932 86684 123619 -38788 135771 -170881 91524 -24027 -239233
22753 -239233 -217265 82610 -109753 30153 -45464 208148 382895 187364 -120675 -112503 176895
22741 -45642 67181 9708 104928 71598 -154683 -232200 64992 292537 15096 -182781 273249
22729 53903 211985 -57198 148098 -191726 104629 -294185 52038 -106675 -259499 -121436
22718 6105 -146689 147478 151487 -87113 -347462 84843 51893 -121897 10074 5962 1047 11549
22706 11549 350509 -107843 45952 -42272 -128372 -154788 38171 -135686 29048 44559 -51495
22694 45617 310579 -217113 4123 -67421 -59295 -49993 5342 -31393 63242 -77884 228823 -97186
22681 -34831 -3110 -250923 -227635 -203182 59034 87058 -60032 -247632 -266923 -17391 -215292
22670 -215292 28555 -260994 -267971 -63064 -108542 -99302 88497 -40960 40115 -459823 105092
22658 -73387 -61155 -117910 27019 -57800 -42387 -148350 -31205 116974 328708 165507 -266672
22646 39899 62973 -214370 115500 120120 -93393 189981 -61386 -12399 -109843 71576 114250
22635 114250 -21568 349303 -133711 129911 -179519 154194 -25605 -139966 197217 -108073
22624 -64304 -179560 118939 -12184 266821 -26608 9980 -67881 57549 -355621 -87034 -269237
22613 -269237 -255834 80620 -50256 -29935 -56264 87592 47606 72957 -55957 -136340 8733 -322975
22600 219215 208813 170196 161867 -103882 37447 -198359 106887 -33936 -25561 -504514 -11577
22588 87458 71187 110989 -127954 -26410 -99046 -401110 -65531 174829 166233 -148849 -63951
22576 290792 49541 -49701 72163 20373 -300376 167767 6886 -97060 115124 -108816 48434
22564 -237878 65865 -101175 -202823 -50596 -31165 111860 -27208 290435 -60905 -9085 -77400
22553 -77400 25770 62903 -137767 -34072 -69747 -141927 225010 118745 137105 -81611 4231
22541 -120900 -155988 -290107 28608 -277662 -30848 -28200 -218441 -64264 -122298 -208503 84855
22529 -72468 -104037 124757 7145 -40344 124628 -196384 59505 -7689 134281 8054 99452
22518 99452 77720 -40175 292776 87918 46069 -202382 -34588 -26833 -88925 204655 160030
22507 160030 -284100 60975 20414 55523 -161737 -98250 71726 -5974 -4321 -20424 -211016
22496 -211016 -96812 -74808 -137674 -43985 -11585 -70759 -230629 -11650 135410 19600 81625
22485 81625 -115006 73930 -143320 61080 395683 -224209 -142873 -40490 197017 -25045 -203614
22474 -203614 -127145 75393 -246336 -135884 46889 1979 -200344 131162 125326 -260109 -260440
22463 -260440 -291089 236725 -317807 -40127 203385 162189 -96278 5878 -26244 75092 70166
22452 70166 -281782 -59976 -14057 -48050 -177735 -20363 -60693 155257 -22297 6261 188794
22441 188794 167034 -239522 -229458 -47881 157837 -189505 260046 -39952 19129 -214700
22430 3734 -36743 -91608 104107 -49078 31752 -22286 -173268 202270 77062 -215008 -148453
22419 -148453 -420257 -46200 285355 218278 -30744 49917 -247451 168632 -152868 199515
22408 -69758 -239999 -147834 210009 262721 -71166 58531 89844 -107437 -306519 129684 -243646
22396 81631 -88865 -154387 30380 -187485 121479 266005 200353 42157 146567 81669 -144232
22384 3656 -58088 -21737 -190526 -234788 93600 172076 -94856 -168598 -124872 202236 39456
22372 52950 19509 -91975 7420 127988 351994 -191593 -167154 -246586 116148 70094 -224334
22360 -30586 111103 -57654 -7944 1655 -90754 160447 139237 -282562 -95396 45740 -143214
22348 22973 -52204 -80745 -219943 34487 -128878 -159571 264512 -92711 146420 -100258 -216927
22337 -216927 5324 -73240 -51880 208733 -85441 -211367 113794 -317221 -138929 110108
22326 -128196 -124971 -292914 19234 60079 232670 -90557 -28816 60015 86083 -201226 -281220
22315 -281220 187188 -62098 -33996 -77887 -3568 -95299 42295 76622 -241818 -240828 117126
22303 -253315 36340 -121271 -58388 -115466 -148760 -244332 -214630 21963 92489 -20135 -10337
22292 -10337 -151907 192190 151546 163852 140798 -246341 -193433 82821 308531 -325846 105466
22280 142522 -251061 -21638 79115 111534 -188291 -233551 -168029 -63461 -559153 40792 377796
22269 377796 -184912 3827 202033 -103812 68518 337113 -183351 -89897 -77418 -62832 70862
22257 -29707 52595 134061 -104127 50455 180475 138481 -344321 -163269 -267417 74851 -165801
22245 -2615 122317 53485 147912 92552 96599 -224151 152703 22021 -76980 7153 85344 -46859
22232 -82901 -218017 81116 -66087 -86489 -193652 -127321 9730 -141077 -52522 -214644 -83282
22220 9035 75476 -81359 205695 -255125 -33315 245340 -143288 -23206 298306 -12457 78729
22208 -31242 214348 -261417 -41612 44653 -172725 23202 -8512 -257730 -263703 115467 16775
22196 -358376 -67941 -154516 -398700 -186973 -22714 32048 -3236 -146835 -174188 -153836 -39774
22184 -141545 -35982 61642 -212010 -106289 -104072 -145803 -196283 -84373 -94857 -6331 205475
22172 -175636 -176673 -143222 37417 27485 -279273 -270578 77269 -125542 -129598 -44477 -217833 174195
22159 45139 22757 24538 101332 298507 -49219 70061 164511 185136 -158526 104469 48385
22147 11226 182673 -140908 83303 -119798 -119003 -219365 -169623 -81646 371017 -162562 -108080
22136 -108080 -143348 -90022 105100 -354866 182813 -328518 156837 244732 -121869 212894
22125 109750 -9286 -5805 -162231 -254199 145452 -29965 -89086 -210898 -30596 -108864 229617
22113 -29225 -177921 -177746 -85972 223062 -292249 33029 -6451 3770 4682 -117831 -85836 -45564
22101 -45564 106774 -69849 -363399 -324938 -176941 -76053 -323276 -122346 -50176 29795 1197
22089 149575 316824 202945 -230958 -7676 50998 -119495 137746 107622 -210974 71553
22078 -89510 184497 -19882 -15353 375617 -31826 7638 -206294 140509 9208 118712 231300
22067 231300 -116070 -22516 -294052 83947 -9857 -119406 -118574 -369463 199560 257538 25210
22055 243450 -120592 73418 30047 -121767 -264930 -297134 103249 -178554 122276 20157
22044 292554 176648 -143621 228316 96805 -62683 -144602 213579 -143194 47207 -187055
22033 -61955 71217 -419254 -16904 1225 80589 -125585 221308 -191187 1423 161995 131154
22022 131154 129051 -87129 -273515 29642 13704 -286447 143289 -87136 -63023 -207944 93639
22010 -114312 -207175 42631 -372010 -169808 84700 104515 -105104 71006 -75255 -5937 66953
21998 -275936 -101916 -266484 -298388 -30596 -365124 -126140 -83064 -123209 292157 2572 44899
21987 44899 -138175 268643 -33665 -203116 -144603 -76291 -75766 -60687 -162478 -91190 307056
21975 108545 -97399 -89227 103779 -158712 26274 50606 -4642 37406 -143556 254258 -156761
21963 -57450 -48064 236671 -216174 -1311 -58584 -61743 80865 94440 -122210 -224633 94688
21951 134418 -36881 76233 71984 -154803 -109153 69036 -174274 69429 -102091 -258715 -17957
21939 -167393 -161551 -208702 77939 329824 152654 -100960 -148760 148419 -133427 20719 -84098
21927 -193927 -142936 96168 -127076 -64161 310336 -336434 -31065 95589 -26545 -138162 341307
21915 -114026 22246 -148726 107558 -104196 -410172 -233185 151244 21523 -345290 36348
21904 -280250 179693 -105258 67590 -55537 -202741 315410 -307420 77750 221385 -293197
21893 -184275 -54985 10510 414280 356281 89319 37854 159459 -212233 -80584 232839 100355
21881 184109 201765 -160933 -92659 -76323 -208600 8067 79707 -246943 -61407 68784 27979
21869 -53472 -428094 43742 -223578 172256 -3977 -86850 -141440 -285869 8941 45596 96120
21858 96120 -169135 -93867 -172552 95844 -19654 -211200 -36250 126694 -149956 -294607 -138626
21846 91750 -86559 79411 -74777 -464118 -20298 -250761 179744 -71923 -167587 -145520 142366
21834 97197 75649 -255594 223494 -121073 -108735 -209906 -133289 -337469 -37788 -240616
21824 -240616 163608 -112727 -321938 13867 -231671 -36607 -22829 -213863 -352076 44609
21813 -358203 -152823 -304341 57463 -94260 -129418 -7515 -11184 62646 -12338 1028 36882 -112242
21800 -75790 -115808 50936 32391 159665 -125489 22775 203571 -11580 9220 208851 89086
21788 -263273 -275149 -5140 -221375 302076 -297437 -166215 130799 -299307 -94432 -13352
21777 -246753 -60248 115568 -11614 78139 -217118 76057 -73171 312260 -21047 29968 -175611
21765 -352161 -58925 -147821 -299938 -154455 91489 30306 -34408 105797 42193 360712 125804
21753 145555 25721 -188081 -124716 -32897 145453 -160637 173118 -202762 -174972 172457
21742 -93237 -36939 -140439 -232894 -81521 121280 -6012 -29042 -21822 -53410 -227 -74331 -115256
21730 -115256 -112204 78524 118159 -20021 191784 -199193 23214 87623 26605 -49215 119984
21718 -151769 -73344 76827 -88209 -29581 -57170 -198251 -591602 -131856 -313092 -22787 -204861
21707 -204861 69659 -162547 158151 -246930 -258425 63319 116833 -202717 148294 103614
21697 103614 -214601 -165153 -170688 -217993 89937 -47205 -208192 73184 -231874 -193945 -26032
21685 -365929 158634 -256258 -365025 1792 -25435 144360 -98070 118606 -345104 -85573
21674 -104015 47574 102960 -72640 -162690 -274277 -173146 69509 -93160 -255716 116781 -65680
21662 -72097 86262 -157858 272220 62062 -27817 -210374 261603 -43856 -179502 187556
21651 -17628 5207 192096 168443 38254 768 -60963 -176877 65561 -171590 274362 -221629
21639 143630 -286708 -137477 -147779 -73214 28948 -84647 -97460 112596 110715 160340 -387635
21627 146420 -247297 129652 -66426 35383 -79207 -122110 144570 -154033 129169 209434
21617 209434 -220989 33352 57744 -188423 121665 -17133 -46229 211761 -120059 73034
21606 150501 -91080 156131 -190850 193519 -33076 -31506 -35556 -125348 -145033 -292589 -398099
21595 -398099 -291762 -218342 -219541 -299944 -51003 -350337 -162634 336784 -166340 125240
21584 -111434 45314 -329597 -35208 212069 8122 -102273 -258288 111717 -326723 13971
21573 100349 166242 -139464 362617 187978 241618 63088 77725 -71076 -10776 -257994 -72508
21561 131991 44710 201036 -8544 -511 -144869 -277344 -32143 -160435 132295 -48882 -282405
21550 -282405 -91422 107793 64742 -396588 150966 -113126 -50720 134105 -360982 -164514
21539 75383 224007 102948 -271219 28545 16258 -114556 -17743 -154007 -149520 113375 52445
21527 -98414 -185760 -140482 61943 161301 -258806 -13065 -139576 27403 -308132 -328460 -40158
21515 -381703 -188999 -255580 -88469 84220 -12778 161664 -214290 -30145 -233307 -161818 -155662
21504 -155662 141731 120658 -397411 267833 8080 105524 -179717 149123 143211 -102671 106095
21492 232209 -191504 -98480 225724 -264707 -12459 -219683 54108 -152404 -1502 -2316 44417
21480 40481 -146375 -110469 -29719 -336844 91258 85132 27173 67093 117575 -266625 -133422
21469 -133422 -196523 11365 -80373 66247 53964 30684 -224654 163215 134816 -112510 -198620
21458 -198620 167861 442559 -57198 241339 230947 -118756 -122340 89092 69407 -73156 -393423
21447 -393423 46417 210182 185582 121849 359961 269526 -164639 -16312 287943 231605 -224776
21435 40264 -231907 -257457 -15635 -146526 -87913 -196900 114131 51652 -286618 -73151 -403854
21424 -403854 21714 -17057 -138271 -37979 -147993 -230882 -200466 -266387 -130286 31801 -137089
21412 94579 -108045 -3259 -69398 115050 -196332 -109031 -267788 32381 -45664 -366158 86340
21400 10339 50350 100032 56672 92582 -27532 -98385 -160701 92806 -136145 -7461 -183338
21389 -183338 -87138 58157 -281167 21656 192603 76286 -188487 39658 15429 -270714 -42588
21377 101387 204896 -362831 -52356 -39892 -177931 -149851 153336 156481 -67025 -142298 -127785
21366 -127785 -106832 -176763 246011 138489 298356 125315 -30201 -108291 -131248 -78856 -8466
21354 -48490 5325 -69407 89799 31433 22901 -97731 -38877 166814 162241 -300788 28833 -79874
21341 -92918 20040 -188859 -63433 103664 -151459 230911 -43072 -161122 -208298 -192504 -128171
21330 -128171 140918 214328 38901 -135813 -128779 257590 -166974 -95250 242146 -48179 -131582
21319 -131582 -29904 -151166 48064 -215104 -156601 -272555 -10940 156757 -70149 -9410 -144730
21308 -144730 135032 66522 -218423 108604 -145807 -88883 330045 -51545 -75561 18618
21297 -106484 202103 -160496 17215 -251825 108066 145324 -40235 -50420 -302163 -77313
21286 -68631 119495 270038 -301821 117875 123896 104312 -42817 -285661 86837 101446 -109009
21274 -219727 50853 -164282 -277285 31825 -7077 -115995 -74026 -1851 -15272 -214085 -122315
21263 -122315 -119784 -180113 -172695 -1082 -77256 -313766 -2729 179863 -199326 29221 46003 62309
21251 62309 -43738 -178255 117482 -52252 -29182 153466 -110859 84291 275170 -310211
21240 64767 -98831 -4498 -211569 -171952 -248311 -229565 -115563 -140208 28012 -395776 104496
21228 168586 38034 174003 122611 10829 100697 -77060 92899 -44420 125061 -35722 -159078
21217 -159078 -142023 308373 -199220 -264506 97640 -71650 255901 63310 -88236 134893 -92929
21205 -268809 16318 80264 -280139 115869 -10576 76807 -304849 -46001 -21093 14344 -178890
21193 -299808 38153 -175108 139977 170017 44387 126609 -20658 -63917 -43309 -198087 -172557
21182 -172557 -97634 90221 -56526 61220 -61694 -82606 -286418 -273288 5876 389322 -184317
21170 39145 -357619 205342 200930 -46354 -932 -159614 -66542 -82085 -440363 102635 -160619
21158 168302 -128262 -140819 -221760 59452 -100142 -43992 140412 -186465 -195236 -165295 -108127
21147 -108127 -4525 115394 -70692 -135007 -123809 114552 -139774 -30792 -270355 -164140 -84779
21136 -84779 -6117 73545 -112841 53534 -166310 138250 -196928 -37502 -32534 -127489 -99472
21125 -99472 9375 -149214 -422170 -311015 62408 -85856 -47061 -242791 -325533 151655 112506
21114 112506 -374399 -150437 73258 -145252 -29172 -730 198963 -116729 36362 22453 157837
21103 157837 -518747 156397 -64267 -109858 -317569 -150036 117201 -138502 -28454 221165
21092 -173669 182912 59377 -13890 53295 131649 17410 -14701 195787 -153652 -349678 -11330
21080 -157562 1411 -107138 159083 -12451 112948 -30569 -145847 120615 -132288 55199
21069 -6842 -76635 -280533 51308 -334275 -20869 -34717 -5575 239543 273787 -253165 -9576
21057 -247955 69535 87863 -38941 -204343 92286 -163720 79198 -48923 -67546 153470 202046
21046 202046 -60250 -50578 -2711 83715 -7093 140041 -138987 192344 -79 -57519 -201657 -83055
21033 -44580 46780 -165855 -179898 -151376 430976 132185 -73677 20271 -135138 -214404 -106629
21021 50404 -164383 -173594 -44576 -154699 66531 235117 -192522 -28679 -23706 -43749 -12547
21009 -84546 80219 -123686 17678 -30289 274926 233306 528861 245702 104080 -79197 36854
20997 -35712 207513 -51974 38062 -199461 -106696 -435704 -158555 247721 -91657 -59578 -11145
20985 55712 99173 -218571 -119368 77714 -205190 -259430 14153 -363130 -49935 -165110 -63839
20973 -25723 143636 118947 -275611 217890 -129708 106154 -49401 52964 -132746 -87512
20963 -87512 254841 -90416 -6795 38711 -40943 -117738 -281768 -81799 244117 -55362 -178698
20952 -178698 -140695 246026 -56502 -146952 130650 -255214 -246632 -216650 110172 -11615 -18899
20941 -18899 -54096 19000 -262948 -197717 -329079 -398983 -66004 11341 41099 31160 -109310
20929 -82211 -215163 61990 -270149 -50820 35106 125274 37938 14821 29658 -110814 330200
20917 76109 265716 -131405 -118814 -205124 -460686 98736 -4493 102023 -367747 -150181 -103184
20906 -103184 109504 -19186 -9444 310084 -230693 53845 17674 -131520 141196 156602 298092
20895 298092 -152417 271765 62107 68800 -211611 -33494 192334 -245999 170950 31622
20884 -100154 -47203 -235412 -251655 -30422 101760 -63150 -13494 99713 -53155 51221 -150289
20872 -13864 -154826 -192167 -219496 87072 -247486 -17323 -81460 -101404 -128031 -4247 -80691
20861 -80691 180297 109472 150625 -222001 -68255 54812 -120337 -165924 27173 9014 316648
20850 316648 -216140 31020 -37007 89285 -81756 -224839 255475 2043 -40657 278987 196424
20839 196424 18087 -207789 270710 48375 -10259 105821 -260909 -266770 29859 -107035 -269063
20828 -269063 171506 -111661 -58523 10774 322221 145473 210190 -169620 -145213 115183
20817 -221508 -68156 177870 179070 237516 -161214 -40195 -157023 -256682 -350228 -84736 -185460
20806 -185460 33749 -43846 66999 -111238 208967 -213225 -196562 -26759 -58202 -182699 -57565
20794 13152 52052 178770 -56723 54877 72888 -41326 -34595 47684 -227716 -46520 -159378
20783 -159378 -493132 -349108 -55607 136240 33915 129173 51278 -55361 50774 -92336 -70614
20772 -70614 -267200 75249 71429 187746 -187059 -20772 67992 -217719 276594 -69254 66448
20760 141460 8084 20491 -190712 1625 -309295 -51609 -158508 -44691 -4063 12575 -37491
20748 193514 -1405 -153502 -220782 136069 101885 -26673 -152500 -165599 -108658 -104214 1456
20736 -205221 -189568 -144306 49383 115697 89633 -115254 -87801 -71106 76963 348205 -31234
20724 172606 -115957 -162244 203729 -111130 269012 15977 -68476 -176560 -99005 1763 -177701
20712 -235139 -41643 -169394 35382 -60581 -36866 -206392 -155647 -12756 -215963 -355364 -31293
20700 -263401 -130964 109946 130786 -207842 -380323 -180781 -84116 -268464 -408816 88182
20689 156957 -293084 202219 -379812 -67776 -83733 -157925 -9458 -37092 51775 77963 -352110
20677 -205702 -322847 -143145 183787 238074 -53631 -268082 -44003 192351 8625 71114 -198117
20665 39034 -142044 -263566 -423785 -40899 -171428 63499 140068 81642 144162 -35347 -172063
20654 -172063 -117137 -183551 -144796 140696 -157616 -131157 -134321 83226 -304429 -98008 -69715
20643 -69715 -44078 -254471 65159 44920 -132354 -23776 -146767 -32570 -38399 -88848 -31880
20631 -171022 42612 78923 -180847 -217790 73508 -270233 -106668 124128 -140124 -20261
20620 -260443 -131207 317338 36656 -257116 36277 105097 142638 -104608 132057 128680 139509
20609 139509 -106993 -69715 -183626 -106443 -7373 277117 -250904 -232839 -67881 -43303 81141
20597 -61892 92360 99487 -145460 93296 108419 322849 -82835 -157609 -229115 69486 105723
20586 105723 11904 95503 173700 -132800 -63171 300067 111502 -109734 117710 -244033
20575 172020 96980 -168411 253435 46181 23397 -61807 259500 -334926 8856 -194372 -188240
20564 -188240 297360 -88380 -41953 -99414 -12463 -273215 -63416 -117405 30698 -54605 67672
20552 -164240 -48571 6195 70737 171423 196617 215695 -146975 -66424 -132661 24609 -208415
20540 5302 -202377 -75884 -12627 358618 -81469 55149 -287452 -21666 30391 -37689 -130766
20529 -130766 -335013 53860 -71075 -257973 200110 -82053 17197 -31255 13059 -99110 -174121
20518 -174121 48828 105995 6088 -72991 -261278 22029 -152415 -118530 -376686 69833 -352734
20506 35307 -235583 317433 -284765 -23130 -21542 -268081 -208437 -5236 31408 88917 -240710
20494 -65528 -98770 -220931 255595 22495 -16329 180403 -80889 -251478 -249659 -236530 112284
20482 -62800 -299752 35720 114096 52313 145053 301456 -200580 -196179 -505592 -140762 -35588
20470 131812 55754 124406 -329695 -9979 -31323 173566 -77236 137395 31356 -65863 -121800
20459 -121800 349887 126784 -164879 -123200 -118432 -123950 -194435 236506 318070 -339450 -253681
20448 -253681 -125595 285837 28178 -300258 -2187 -57390 -90343 104399 194804 55145 48076
20437 48076 101841 -307940 -110967 -286514 -127146 -122611 -51364 -431153 91408 253702 197980
20426 197980 -40739 -225004 -123576 245839 -9544 -166310 -191450 6091 -117350 53562 226270
20415 226270 51320 41486 -17941 -372462 218392 -106192 -44595 -141303 -47504 61702 -298675
20403 -138905 -136212 -154789 236759 54052 155084 -251530 53079 36862 338004 67671 -300725
20391 1518 201894 57395 101711 -98515 55285 162567 125008 51853 -109035 55128 -69624
20379 -287720 -61914 -255146 -229530 -370025 46856 -184790 -71596 -37271 -212138 -74138 -165945
20368 -165945 69652 305838 -255385 265258 -71584 -201062 149981 -184418 -131087 -20696
20357 34315 140947 193156 -310049 22511 -205996 -233613 -77169 93819 -187348 -296679 -18839
20345 224865 -193426 -247112 288503 -142665 -255117 167983 -83564 -91526 112063 173818
20335 173818 -331509 -352331 -109393 -106015 -15767 -139738 34891 -18982 -137336 48507 -166711
20323 160902 20783 -127320 -63052 -162929 -52325 16274 -282763 27451 -360990 -29925 -81544
20312 -81544 -254047 -151678 77404 -158748 108138 -136852 77485 -283446 -196542 91710
20301 18249 -208880 -289801 -141745 188024 160895 46713 -149363 -305576 -38570 -55234 -85040
20290 -85040 -78020 -6613 -39267 -58832 147784 -388129 59471 -154919 127310 205647 -49410
20278 -51864 -170871 -22173 -138412 -157337 267152 149291 -228222 -101857 -142960 -65983
20267 -103823 -84810 161093 -422380 264616 -120282 305320 -10520 59569 14832 -265097
20256 -534048 -70620 -39918 -8836 275499 54270 -51517 282861 -193756 -31054 -80231 -239301
20245 -239301 -392077 373293 -240997 -92014 -38478 -100416 249223 99400 21746 -112762
20234 116024 62538 132887 -218630 -162659 376883 57076 80596 -24056 -22169 -296957 121181
20222 -101765 3698 85977 -33330 -397016 -70128 168939 -146129 -373218 -31890 36690 -46055
20210 -333243 -34743 258221 297773 130771 -103182 -176167 117809 -198419 -179783 130346
20199 75929 -95953 -239308 -29872 2701 -244063 55696 262770 119231 42364 251443 8006
20187 70774 -161193 156956 -98675 -244332 -196125 -39060 167606 -83368 249802 402 -5048
20175 -100673 -278523 119727 -176333 -26701 141750 -127459 -20539 -80099 107529 -224047
20164 -29993 58341 54199 -162428 1299 59183 -24288 -21556 -259683 -46919 41763 47215 23850
20152 23850 -257943 312163 92257 -177578 59079 87612 94402 380942 -245063 -198692 -60621
20140 98844 18890 76286 -91489 -170582 -325073 -229140 -89261 -91338 286562 -181603 70875
20128 -67579 116944 -139457 -171215 -46756 -48016 -208836 -199719 46603 161331 -41043 -113487
20117 -113487 -224867 -133223 50564 -54435 35887 -299162 -210117 161799 63561 -185228 -186221
20106 -186221 131987 -257328 63915 -135199 30240 90851 151867 -104230 -89985 117812
20095 10818 40675 -356715 -129974 138390 135152 -227313 -83082 151974 316648 -56796 142423
20083 -36039 -199370 -288756 -38388 -322348 73730 93203 -92339 -75396 41416 -22820 -74666
20072 -74666 -336725 118738 -318579 -268109 -228097 19831 26918 80047 -167535 -22994 -237
20060 -141215 83739 -51897 -61932 -44531 -68040 231500 107738 -88728 491787 -178092 -120708
20049 -120708 -15984 -199908 -60619 -5650 -320115 -59763 -156830 -175955 15090 -213176 -83405
20037 -46293 -111139 -62202 29906 -92406 -429789 -144012 107190 158774 -325590 -27882 79930
20025 29335 196966 68425 -148724 56761 32296 214851 183495 -326292 109659 -57095 -45062
20014 -45062 40502 -197179 -122150 15570 -176006 -121965 -121362 -42542 -88930 -365476 397977
20002 -80627 -215822 -403367 -95358 -19410 -181613 73933 120019 -158088 -67424 -40365 -45023
19991 -45023 -301124 32023 100895 -47845 75084 5318 -156587 72451 -184198 72459 -170387
19979 320055 -207511 147798 -79335 -189177 -241742 -1435 -50020 -67194 53475 65658 -149375
19967 52183 326761 162395 173148 -254621 -163417 312792 -271112 250891 222678 261250
19957 261250 -101534 -141049 -249915 -60778 198974 112310 -88914 -330270 -98481 -178628 179094
19945 31290 212773 -170497 -41164 177771 -4362 -39323 -122230 -80877 78075 -337032 -49848
19933 -29190 -50961 -289156 -228627 -153540 63451 12071 -111837 -20129 -161919 173369 -120471
19921 -24720 -79127 -89024 -260583 27651 -302706 -11826 -386711 -213727 39265 -27272 109461
19909 41945 -310663 -111471 -137815 30720 78094 -40504 223640 132979 80257 -372126 -256392
19898 -256392 -158576 -53414 27233 -56712 -281771 -83524 24456 -44707 -382660 14197 -201847
19886 149647 -101686 23678 -158153 5258 -208644 -128076 -314861 -93381 -359667 44919 -93726
19874 -184901 29940 -213811 297629 126144 -69792 147054 24844 -240477 -210229 185982
19863 -107868 -94306 251747 285324 -123611 -85316 32367 144996 -105592 -99770 13976 -82032
19851 106139 -299924 -132635 -325246 -8884 -92359 -88946 48095 109126 -375595 -138362 -131292
19840 -131292 -397556 -52876 216874 -166538 -288260 53116 204695 -35876 -61880 27663
19829 -122173 246072 -110725 -219156 180047 -105967 -111387 -254944 57737 115187 -48568
19818 151127 -141489 98019 -182921 229671 -59354 -82689 -162272 -93472 61972 -17900 -130155
19807 -130155 3571 -69156 -270874 5787 72432 -220188 155527 -12474 -247749 32442 -358433
19795 -225034 48868 337599 352518 10677 -10995 -591870 296893 190494 -81874 -38351 -105331
19784 -105331 -258283 -380132 175848 160035 -129478 -121402 -195272 -192511 46261 -60865 209857
19772 -118071 7969 289 -55169 38403 -175042 -307909 -174383 28397 -59612 109971 -155535
19760 -385976 -403965 -81064 -75316 -25149 -152720 -304952 -87259 -321416 -72255 70328 49968
19749 49968 133728 -360615 -354751 166286 -368606 -152280 175297 29732 -14666 -36678 93527
19737 62534 -215853 -97624 -116975 -98498 132311 128068 -109363 131009 -162418 287026 -148211
19725 9965 -102071 29527 43105 83162 -104198 92187 -381785 -165096 7495 -72948 -218537
19714 -218537 -91703 154306 -135607 78262 163865 408607 -86382 -221228 282335 -50443
19703 -140374 57697 113424 -422378 111722 -174568 -237682 -49782 21863 -33210 -132692 -194485
19692 -194485 7134 -100110 -139905 -154798 -18031 -181663 -6105 111387 -209399 -251710 -35902
19680 334454 -281674 75760 -272153 -262203 -45907 -172802 76533 480 -35705 168357 -135668
19668 -132902 138169 -130616 -158101 -238415 -226165 -5677 162391 147253 85922 -383272 -163251
19656 -92257 276433 -160841 282645 -62508 67379 -140546 401559 -146706 28537 -86332
19645 -235759 290379 433991 -47344 -51390 85944 152743 -254657 -241823 -19331 -91487 -123856
19634 -123856 -200063 -115534 208777 -158578 -47467 310562 -130498 148990 -192223 -325982
19624 -325982 -137760 -47627 20210 -2861 19398 269383 -34703 68044 -151180 -129110 251809
19612 -180100 -122928 -137202 219928 21509 -62611 -178485 266226 -7688 -356078 62585 201
19600 -63173 -48728 -64414 -63683 -6892 -288406 -118158 170824 -296826 137779 150740 -28942
19588 -389060 -198989 -195460 -86751 -148633 -34034 -44417 173975 4306 -193348 -55413 61055
19576 -103597 -8472 -53545 345107 -189913 -20412 -45243 -90736 -156874 -44494 -6258 -148822
19565 -148822 -52854 -74184 -64998 78046 49164 -50496 34454 85673 -433365 -124564 -90052
19554 -90052 227670 -257455 -225094 160675 20875 17592 295673 -47526 -199349 51227 -104368
19542 8910 -104777 108788 -86035 -296365 -320965 -329042 -233425 155702 -114065 -118121 -141377
19531 -141377 -75366 36628 -68981 -281325 -24761 205612 39856 -149263 -159820 -271085 111141
19519 -191830 -129735 -105390 -50644 -125757 -91117 137589 74944 145177 -87508 81186 76184
19508 76184 -76115 99377 -119414 90077 -196358 -10649 87070 -145546 -324052 63669 -152480
19496 -104940 -350706 -310074 -241727 -156879 -480239 75191 -116807 -332456 -32688 59768 -49839
19484 57548 -65393 -103204 84606 149926 -98863 -75538 -32687 -169774 -257904 95271 -293747
19472 -190698 21474 -114570 137448 62743 -16770 72006 -36855 95109 112259 -60972 192154
19460 -98902 22044 -252971 222838 -265115 -285082 -158570 166857 371918 -40711 50182
19449 114290 -283510 106466 -291819 -79916 -229794 -116296 43794 312496 -91980 -12579
19438 -51709 36269 21935 82637 -113548 11219 -121645 -95660 334688 -400032 54670 -206033
19426 -77680 -115573 -431152 -293725 -35513 -125573 -231544 -81878 88672 -109328 91684 -204839
19414 17440 -40519 16983 7068 191123 -156420 -407428 -100968 -182574 -85582 -70776 -219831
19403 -219831 19620 -142330 241744 58832 -120276 -33345 -74016 -110358 105726 140026 -183027
19391 -71434 355895 -19363 -393506 109789 -464527 -342053 -51986 -202044 -117964 27170
19380 204676 -230529 -67886 72339 63860 221301 -35685 12420 -36403 -173591 111138 -57406
19368 -51780 -161488 7873 -103232 -311212 -19645 33098 67725 -198764 244703 -121789 28343
19356 -76050 -159084 -162938 -113338 237915 -230865 -478467 -423170 -145198 83657 -49218 -119801
19345 -119801 -124482 99392 -92961 -5910 100421 -3525 82708 -30918 -92640 244833 -37552 86900
19332 167845 -357605 -127715 203920 -87167 -342954 -194976 -941 -35355 -264387 18725 91867
19321 91867 -10520 -79939 -115192 137040 37625 5949 -136749 -7034 159826 213947 -173455
19309 -316076 44303 114957 -440896 -165165 67337 20550 3710 -125429 -219009 -300847 -50884
19297 195028 52696 33984 35960 -182420 -228671 -15281 164931 -31111 -287964 -11482 -154217
19286 -154217 65327 34421 -52569 89866 85915 117833 164821 265751 124565 261911 43263
19274 23143 -198403 -162791 -39233 -311323 125066 108286 -146617 161045 -31185 -113190 370707
19262 24928 -119675 -64941 -27632 183852 -243593 -340756 66456 3768 101217 -85290 -61061
19251 -61061 -184081 -230317 -89134 29684 -99239 249238 -211988 -51105 -173259 20279 -222022
19239 -168874 84768 -103608 -43833 -181045 -123055 -209233 -258750 -489394 104830 -119945
19228 69335 92392 -142455 -142732 -251954 -304505 -116508 147124 -72757 -40706 -118654 55453
19216 -78647 -114913 -304176 86984 90665 -322411 203131 -114995 -3351 -71173 -187139 61943
19204 -286177 -265508 -303426 218589 -79052 227050 119293 -100972 -171865 -165483 -152078 30748
19192 -94765 -136481 -96680 -43342 -74505 -175611 199015 -420781 157013 56943 84663 -192375
19180 -86857 354791 -61067 -37920 -98295 113170 117516 -61527 36487 -170744 -45540 -253566
19169 -253566 1838 46673 -170293 17605 -46159 62233 28699 -108260 242702 -244829 -116169
19157 -4317 229107 19456 -24959 75953 -123207 236531 90870 -146691 -112928 -82917 118420
19145 90097 272146 71117 12483 109904 10994 -209424 14900 -302789 -88054 27670 -275955
19133 -53836 -205209 131453 -96782 -276783 -121994 -300414 -158038 -10195 -150182 104918
19122 -59777 -262090 -66976 5831 -85937 -222341 -155361 -171349 -71084 -125886 -34938 -24338
19111 -24338 -341474 16489 10208 202634 102909 -342996 -187340 -375858 -228702 211522
19100 -90895 179434 711 -37184 -148880 -139767 -155500 268914 -271733 43086 70848 -265009
19088 -61882 -139987 -54964 -145218 -73705 225271 152458 65230 -126354 -220458 -222642 -283004
19077 -283004 -50813 71248 167127 210025 110669 56381 263650 -424591 -184870 12150 -156179
19065 -12620 174336 -74841 -484853 133109 -47750 -106648 285261 -157412 -85611 126436
19054 -126436 35735 378032 -28174 167881 224810 45706 -80689 -94509 -85278 -218656 -35132
19042 67291 -178302 -464764 -110199 106846 -111866 193269 -141177 -22123 163305 56249
19031 -145378 45637 444961 232752 -85684 -67788 -154165 -251790 380050 -271753 -230586 152745
19019 12359 -250420 -94613 -24037 -188866 -144629 -8010 -281217 125044 -398408 294121 -454784
19007 -28142 -27641 -78489 -161121 -5899 235686 -232500 -128722 -103275 -205102 -27662 -217942
18996 -217942 92710 251252 -158914 -43894 88972 82635 -100326 -124002 -103131 141961 -167907
18984 82351 -198448 283353 32271 -87542 -140830 12213 97163 -198036 213785 -54850 -85925
18973 -85925 -138551 -302941 125775 233059 325895 -364170 83039 104473 141713 -79592 -152031
18962 -152031 -104824 128594 178100 -117689 47265 282761 69245 -140769 28153 -14924 -61572
18951 -61572 -178527 37382 -188310 -26249 -164267 74503 -158393 -136637 398575 84815 95921
18940 95921 -50204 13383 -158109 -65380 -146702 13057 -64751 -255781 -193706 -25290 -242602
18929 -242602 -54223 63613 46959 -16865 198389 -283422 -243294 258033 284323 -53564 -170602
18918 -170602 -32365 -113392 13537 -260634 -392493 -255293 -118672 -141254 -196428 -106736 -215712
18907 -215712 62440 42457 384612 90360 -8342 -96322 91638 125476 161842 216674 161912
18896 161912 -201778 -255381 -193761 -242976 12414 -37128 -236914 -40488 -209797 -92945 233771
18884 197217 257730 -179601 -84719 301469 -106742 176246 -245873 -396231 64802 -20446
18873 78604 -68849 -160494 -273246 220522 66897 109522 -11738 21317 -254113 -3062 -117852
18862 -117852 -299419 -46678 -194740 -267957 33694 -245649 -487495 -236419 -271387 -194386
18852 -194386 68359 -295995 65574 417356 -23083 -39841 -120072 -175683 -262779 -290629 158152
18840 -118434 -181444 -174986 -280608 -14832 248509 99834 5132 -84936 111451 189917 -171817
18828 -281840 -188772 146048 -180072 76472 -247767 -367007 -118989 -70938 -100290 267679
18817 309675 57841 189871 47015 224337 -26267 322257 91783 94218 38988 150473 8326
18805 -92251 256894 165015 -245261 -187598 81383 -10520 375249 -246743 -295992 64669 -254271
18793 -18103 184926 -11830 -223536 -75078 -138171 -46334 -205656 -117192 -40173 49146 -34658
18781 109944 452640 -59741 -161326 -234439 -180401 -82470 -196267 -79379 22184 -123708 -122115
18770 -122115 66141 -129185 89006 -61631 -214925 -2297 -46103 -44202 -205483 65524 78332
18759 78332 -160338 -45921 -390348 138862 -21955 -109648 147895 81318 -259937 -120118
18748 -74525 68923 363 42614 300534 89555 -181810 173166 66987 13831 -126759 -26239
18736 -11817 50513 -163489 -310236 45183 154606 -54163 183215 -109001 196067 5179 68782
18725 68782 -103976 -34673 88454 -126869 -55083 -189823 -252163 -13582 -285710 36974 -10545
18713 -59188 -23162 224859 110695 -31545 -186121 -168880 -151651 -298354 -189880 35903 -351516
18701 -39003 -220438 -311448 -13568 -252370 -31766 122394 -271485 41955 -34190 -225764 208413
18689 -314896 -182460 -167820 -32034 -205881 12518 155444 -55452 -103552 410723 -355834
18678 136940 -107990 -45967 -130635 116658 -76870 24596 23940 -61954 1596 -20204 334335
18666 -65809 -243917 61687 -86806 79576 -119229 181878 -92637 160714 145972 35565 -155570
18654 74371 87307 154712 292259 47130 115997 -37559 8311 -211724 203312 -220202 -146833
18643 -146833 299644 157407 -16056 -148524 214733 -86563 -65932 -67513 103011 257250
18633 257250 -253611 122212 -346177 -244924 118942 281455 37188 -252602 -375056 167657
18622 90932 124620 15712 47221 -132799 226711 -221595 -208491 -48214 10270 -2220 -143785
18611 -143785 -161616 144667 -148522 -160411 99334 -28672 -261071 -148382 -370994 98648
18600 -132992 -364669 -188894 -422574 -130550 -299937 5641 -187750 133855 -231943 197208
18589 -253062 99390 367209 -171958 -273701 -15375 119317 -115376 17109 -18046 -15095 -220085
18578 -220085 -184019 -359914 98365 -196183 265511 -68833 -98812 -68882 -146421 -29639 -351001
18567 -351001 -430327 -230227 -36714 80152 55060 78971 67162 337958 50650 -28685 -70790
18556 -70790 -221661 -22251 -244914 -288993 56800 13297 -320719 -372482 -67005 95875 16176
18544 123563 -70464 134163 -217330 75770 121143 -75040 -72667 49905 383376 129471 -14479
18532 -97147 422510 9385 178914 -198546 113799 178503 -192540 -391320 57573 -162682
18521 68961 -92475 164325 49698 -81548 186968 -79341 55696 -12617 -66676 -39057 -190423
18510 -190423 216095 -195883 -241873 -107374 100542 -67215 -251861 -71930 132565 177669
18500 177669 71510 -5823 -229307 -158398 161367 23681 -401590 -256069 -274227 -140816 -1844
18488 98168 -48862 -120593 -4638 186325 -52565 -252276 246729 -219157 132492 -308894 30506
18476 -180206 -44962 9074 102656 -165959 -174309 -359796 -165009 15313 -105395 -72152 -153194
18465 -153194 247561 99704 -35088 8367 124186 -147354 24634 105361 50546 96491 -9530
18453 144134 160445 227755 39513 -193692 -170513 -56090 93254 275582 79011 -161509 237508
18441 -6453 -106374 -218726 131811 -58977 -426391 -199638 -88130 132362 -197961 32138 408747
18430 408747 31397 51015 148258 -42384 155275 -204548 -34201 -15344 59827 24583 214194
18419 214194 118988 -113063 -52990 -296071 -74782 66729 -92409 111591 -143812 15254 35409
18408 35409 55226 33890 -267017 203153 -148866 -156255 -134542 -229934 35346 -249228 -125706
18397 -125706 133002 176417 -123025 87697 -294752 -27655 -131901 -62257 108868 -173609
18386 1014 -223714 -391595 -49347 92444 -138474 -317015 184598 -90235 -195662 83393 -321307
18374 -180909 -55426 -54256 62678 33515 -28500 -152423 98651 145502 222664 -166915 2632
18362 54981 -104184 -169548 -118916 194092 184955 -375057 -130039 23556 -101792 109610 -34078
18350 -20612 70208 150528 -200844 66617 77827 67544 -147354 243480 -111302 215718 -200999
18338 -87442 55349 -162024 79523 149696 -99352 124056 -79469 28537 52052 35578 -140673
18326 12276 -73776 -82859 -6716 13092 301622 -82671 -87237 -125063 -263802 31802 137118 44739
18313 -37990 -16782 -121182 121494 -12296 94765 -82936 29780 -9371 118903 139633 63732
18301 -221469 -256014 -164815 -259800 6235 203148 387755 159055 -67641 -190023 -8239 -36547
18290 -36547 41757 -181330 -94993 -394697 -81816 8103 120858 -18243 417139 -11968 58654
18278 -74833 134677 137465 -188970 -57021 -225923 -30466 84880 72727 22439 -40444 334019
18266 88545 -229042 -93200 -49821 -130491 -27205 3024 -81815 -63768 3530 -246090 -211949 -119471
18254 -119471 198658 -136541 136557 -11506 -61917 101185 -262412 -161417 -52789 -125380
18244 -125380 15382 75912 23455 -84737 -146443 146089 -214325 -67729 -54947 -82878 -276484
18233 -276484 57987 -25163 -60580 -131638 -98980 -19956 -70660 -132180 281483 -96354 -64486
18222 -64486 -89504 134157 198735 -87299 -156002 -18476 12455 -28199 -47686 -193749 -96025
18210 196533 73259 122288 -144114 -12210 210506 -110518 -110155 51487 274123 -38837 138071
18198 27966 199 21115 -242232 226262 -43858 73311 -1433 -14856 -354308 215155 205471 -36887
18185 4334 218533 -232835 54329 -31176 -52594 -87319 119839 12943 39690 -161035 114075
18173 6615 -190596 -130252 -180993 -11570 -53746 82389 389596 48254 -46388 160291 -21087
18161 -141819 -26275 -166057 21342 -27785 17720 132632 -237698 -118640 -161654 65771 29294
18149 -312677 103813 159944 -154926 -159919 -111540 133569 -113861 103221 122615 -192847
18138 270675 -151328 72975 305095 -65169 156918 -27321 -14732 67789 -398145 -303465 -121241
18126 110422 -139440 11853 -92748 -105355 -20442 -80741 -148966 -232959 78335 -37621 53441
18114 -32781 152125 -85925 83590 -289639 -175697 57240 203331 -204207 -74732 102106
18103 100030 -34262 149761 166806 170763 107571 76611 -35998 -326336 -140746 128369 -24859
18091 -68334 -14562 17293 23518 -203900 -63265 67724 -91273 -21975 -24045 14227 -25011 -154336
18079 -154336 240001 67669 109316 -51949 157541 -46100 26886 25591 183531 -66411 -148793
18068 -148793 12964 -70688 -16561 -42399 -145337 179049 -120593 -161220 -73403 -501061 -107176
18056 201290 109802 -87592 -218343 118723 -472927 55986 303439 335796 47105 -159321
18045 -92087 -113749 24255 166642 -60729 176807 -47911 -163281 15846 -91492 -281400 112112
18033 -182122 76274 -62986 80850 -172109 -218070 7522 46556 63292 233860 61699 -73051
18021 282465 -186447 -39269 111493 80705 -128548 172666 -35476 -250711 76792 -156007
18010 -205894 -142743 -208431 -221527 -179556 -56775 209874 94776 -231691 -37558 -363555 25295
17998 -283943 -66696 84015 146932 -1277 124370 385510 15399 -158135 -156861 -133056 18088
17986 187342 84313 41777 -42899 -80946 23757 -207310 -102749 110045 -27550 -54437 70238
17974 119647 -25506 105011 -26099 106151 -50396 -100651 93656 -226668 -65327 -260963 -202542
17963 -202542 40595 18247 -250889 -151329 127282 -270818 -163847 -16546 119049 30452
17952 155950 119395 -169228 -198855 207898 -182021 -171873 43672 -20414 141007 -231527
17941 -195333 -332227 -130464 -159777 -183045 100876 -133520 151955 -280141 -31793 127792
17930 108091 -188358 88668 69692 -182133 102560 -209251 -23588 127104 112241 -226375
17919 -186323 -177988 390561 -118007 -278278 257285 123086 79274 363480 44809 63292
17909 63292 42094 334729 241582 -85530 -117087 128972 183897 224046 7166 238632 258510
17898 258510 -123119 -101027 -16083 439922 18495 136045 -74173 75365 76628 58313 -217227
17886 -12830 -207522 -30563 -242767 -186517 -23669 -155298 -669 265454 -12210 92980 -84872
17874 24047 189804 -101326 165131 -287468 -341815 -74190 229390 371482 64437 -158966
17863 -64269 170389 66310 -396036 -17947 -221019 -253807 -132559 195783 -241875 -140953
17853 -140953 163566 137854 245741 -79177 56806 13881 -38541 109762 219711 11172 92211
17842 92211 30586 65006 -363500 -79127 214640 110710 -116987 -193922 318230 -9923 22979
17830 64046 -98675 2123 -104793 210655 -44938 56902 152542 79648 -14063 -103285 228956
17818 -310026 370959 -31281 -66475 27948 88985 87646 336713 256980 -172644 24133 -182644
17806 -73412 -179528 153796 6623 186846 78482 141675 -91427 -37880 57876 260192 45443
17794 181740 116931 64163 -34760 -129695 1342 -14098 83884 -139013 -256492 -167711 -64018
17782 -316758 199034 76571 -1923 -16785 205868 8041 191139 -45073 28363 291760 98197
17770 143282 70977 68737 239079 56833 184324 199952 -95565 37301 -75147 -261322 -30955
17758 92497 -10213 -263777 26382 23833 -37381 21123 -82229 86767 -73850 47082 65280 147509
17746 147509 -175981 -80194 -18114 -67331 -123697 385815 181505 -57934 -45125 98019 -35370
17734 117675 -31855 349219 181538 -83287 321162 -200331 121436 249980 82604 -21031
17723 24126 39023 310663 -117859 160591 -4069 -107682 142792 -118681 -48163 109099
17712 -10720 -39255 96511 56566 260961 140568 89661 211224 -106215 123141 -139071
17701 142465 -269765 209446 -11460 -27479 -133770 -64954 -6133 -8785 406740 -38540 40532
17689 252325 272816 -154752 281767 -98928 -298493 68678 217742 113415 -3782 42469 152554
17678 152554 99495 99864 104120 47959 122497 121743 -103357 -96010 137286 -27140 175846 402046
17666 402046 87532 -135988 73481 20535 156977 147773 -208708 100390 128379 128545 157477
17655 157477 140391 -153143 34311 -127987 185452 113477 11923 -125477 -33342 160422
17644 -126073 160781 48907 39700 93773 106478 -270262 -78318 -472325 282628 -85979 -176556
17633 -176556 80270 297892 -55009 -179631 89895 40323 104436 127820 192065 -181610 199958
17621 50575 -75717 -162858 378003 -20954 -210969 219611 149218 11633 41015 -96580 -38836
17609 35611 18529 -87940 136449 157171 316507 115558 -256795 141213 -15286 -151032
17599 -151032 56857 46273 -45610 214073 106243 -24482 150347 -84931 170039 12472 32454
17588 32454 -156909 105387 379282 -172066 -67232 30344 58307 -31662 -179077 207791
17577 240372 62457 -205934 127505 13698 226410 -34790 -309926 -98196 216522 -130458
17566 -57328 44968 122569 371525 34438 -127992 405315 -227766 -7861 25897 18457 -314831
17554 2755 -249802 23548 62056 76928 7979 -113915 222074 -37324 -137648 155945 33868
17542 357610 -160215 62843 301469 45396 20063 -61212 81241 132055 237197 -122707 184958
17530 93514 160851 -11145 -11466 157181 533162 -32346 254094 124244 308354 249318 80147
17518 434649 370977 359279 560169 263991 4090 228300 205833 138556 -160212 184599 198867
17507 198867 258178 161687 218963 363034 206707 174968 153530 336602 300465 188100 39668
17495 213852 -155268 -61435 74907 -19011 198401 -41995 118605 167495 -28517 99819 498641
17484 498641 552140 95645 16997 256684 3200 146206 64791 -65155 122549 137584 226866
17473 226866 263568 101078 122193 74190 -32407 -100241 -15413 -27331 -27166 -31486 68507 53790
17461 53790 241948 -227560 82161 -42984 83389 209885 28630 277826 -147398 333188
17450 356845 410308 79909 230467 185857 503460 361430 148231 122373 -21001 254531
17439 322332 343471 210266 183681 145676 173897 55643 114767 149398 193510 106285 353683
17428 353683 205929 378485 438873 93952 280736 289837 -9431 149661 174493 405260 159886
17416 29340 120652 -72573 59422 127460 20073 22691 169518 151766 169118 67079 29378 -47718
17403 136963 248878 219946 159857 59762 45096 160055 79463 -195998 88164 22919 22693
17392 22693 -16218 -26827 -295256 -190911 181869 417681 164818 142302 348383 144033
17381 237622 353431 229876 -94026 17657 70889 212793 345426 182644 58702 392047
17371 392047 103650 -74373 133830 141584 28153 107417 100665 300968 123189 256920 85236
17359 464023 -71562 31733 -126461 192992 -75738 11723 41325 -103676 134822 84055 -5941
17347 86307 189302 217880 119960 26927 330508 99493 -44781 90562 89458 -180884 173591
17335 387883 123428 73228 133606 189816 -203689 247816 -157954 103537 -68155 316442
17324 355327 158750 -34101 219417 198038 336293 20739 127039 8939 261426 245381 207257
17313 207257 247822 323902 199667 43918 -202534 187970 175174 375674 434196 -154164
17302 316655 -35035 -76935 364753 -23572 22964 -59377 314661 247730 418468 -72947 170618
17290 145309 378829 -13734 73593 312368 44754 210385 307685 -20828 452626 214621
17279 81407 115262 42577 216313 -22689 517661 -136794 345723 340341 133991 167440 185946
17268 185946 131699 289470 217000 237538 214569 58819 -31200 314636 208732 220793 195945
17257 195945 69747 270838 283746 21259 238099 20971 281464 108130 173348 -18631 52206
17245 372888 8540 -71125 395605 -5207 118215 50719 98179 176287 421474 185078 282477
17234 282477 58410 -178729 156577 84109 -134634 173840 233994 433430 343433 204068
17224 204068 92837 250186 450768 224497 215853 295170 15910 182723 296393 234411 133719
17213 133719 -103896 -132093 70653 218966 536031 213461 189653 295208 139263 283002
17203 283002 328029 225060 -28667 403430 187142 311119 201737 271761 264061 229150 371731
17192 371731 290918 511024 381556 72100 119978 224503 183011 129658 70193 412398 126294
17180 546555 256963 310470 133875 139536 145066 258017 285096 695821 250581 570502 167629
17168 269619 78812 423790 326784 137088 367876 278788 320064 146441 420216 500593
17158 500593 119358 429839 216284 203824 262347 591399 143785 -1445 566460 230017
17147 61528 292821 562454 367966 210116 417804 479146 535408 220760 472545 266500
17137 266500 285547 138000 259795 615958 538081 383193 288988 115981 -31957 226931
17126 284285 192275 320320 434527 204090 304408 234975 270771 146706 271588 332484
17116 332484 197020 340731 671911 184522 481488 385049 339457 214331 359793 201651
17106 201651 544793 326722 514539 424581 422540 403460 142229 343307 186665 502707
17096 502707 188847 667398 520840 718562 188427 512038 581215 76581 169566 220243
17086 220243 466784 741656 360929 433988 580503 443560 441465 819211 547228 403980
17076 403980 516976 270433 457298 421348 242339 415376 594529 442501 367737 740843
17066 740843 359965 199758 569127 341514 259628 396219 543644 277419 521874 556630
17056 556630 601240 258698 406225 297131 525461 643244 639819 431806 622525 495558
17046 495558 603711 476282 529686 563552 567165 485197 679770 478315 604276 670287 501988
17035 501988 516639 577321 597933 305591 554626 508566 537957 553858 604397 428920 382553
17024 382553 814264 793657 935488 744473 444091 362121 673944 565860 859151 560138
17014 560138 822155 844248 517141 835752 551865 435313 568349 821299 450318 799328
17004 799328 803060 428331 831868 882376 524559 652124 900693 966382 980912 810329
16994 810329 1020148 674317 718648 907891 655973 867142 697411 1001489 888083 718124
16984 718124 941491 560674 562824 698518 760446 1100213 825712 753208 750007 1069905 783557
16973 783557 879945 854064 1036309 907103 792564 975402 877090 1188286 1015116 658068
16963 658068 968827 795097 984240 904903 786368 899620 703295 1663088 1155384 1377715
16953 1377715 1061511 992234 835371 949350 1299818 1063395 1097972 1355347 1340342 1017713
16943 1017713 897045 1257054 1397349 948608 1108512 818388 1170248 1116579 1063912 1277371
16933 1277371 1556044 1303148 1439242 1521715 1185676 1612671 1006716 1413680 1481588 1598211
16923 1598211 1531927 1667851 1509511 1353187 1391144 1568262 1489895 1839321 1506495 1700958
16913 1700958 1616017 1492127 1924920 1435594 1793398 1277775 1886971 1658739 1457559 1805962
16903 1805962 1742413 1711674 1957498 1623740 1624460 2081370 2175438 1934598 1750979 2034658
16893 2034658 1942632 1749530 2149736 1964980 2078108 1878870 2321318 2203928 2216549 2385660
16883 2385660 2086527 2245538 2171142 2340754 2453684 2448499 2851264 2652201 2558785 2697296
16873 2697296 2639151 2767880 2533807 3037715 3051199 2898569 2903312 3148471 2981735 3197721
16863 3197721 3300118 3229596 3063976 3425432 3499801 3422531 3414293 3332531 3649704 3777620
16853 3777620 3727357 3712561 3891680 4045537 3896033 4179453 4042342 4150829 4470016 4364080
16843 4364080 4442206 4840983 4693865 4659925 4303615 4883922 4749142 5117848 5484502 5249197
16833 5249197 5449810 5408310 5659833 5929435 5972913 5968171 6697635 6524408 6323809 6962230
16823 6962230 6570927 7016524 7152282 7013046 7325293 7416356 7444155 7802277 8025606 8232632
16813 8232632 8651301 8520525 8761484 9071521 9519855 9483040 9714727 10174615 10567292 10980892
16803 10980892 11043001 11424940 11521353 12144481 12316202 12604271 13228859 13427180 13558405 14367053
16793 14367053 14542950 15158252 15787768 16203167 16380530 17001363 17769597 17964232 19172444
16784 19172444 19806113 20190726 20693713 21547536 22337453 23151708 23910841 24903977 25811352
16775 25811352 26799748 27430758 28557296 29659419 31134053 31969716 33252751 34783027
16767 34783027 36064221 37662877 39137675 40722214 42364965 43987652 45909079 47953681
16759 47953681 49970015 52349427 54292095 56581180 59041782 61848803 64618257 66904493
16751 66904493 70009626 73181520 75662581 79175706 82221934 85638954 88915047 92327760
16743 92327760 95681413 99182516 102498991 105662142 108905446 111878514 114754820 117429233
16735 117429233 119658645 121717276 123570603 124659795 125780997 126666620 126337025 126426953
16727 126426953 126098455 125000367 123893988 122115815 120179975 118240736 115362343 112880473
16719 112880473 109886652 107034891 103920247 101030099 97723786 94282615 91240942 87976824
16711 87976824 84687801 81887982 78409335 76042827 72912660 69997592 67167670 64662162
16703 64662162 62261784 60188280 57587808 55418333 53264627 51052747 49334098 47634215
16695 47634215 46124522 44318862 42440561 41092577 39461576 38131627 36901566 35319717
16687 35319717 34211820 32940916 32463582 30870946 29742281 28906179 28159168 27121410
16679 27121410 26439538 25782753 24611613 24006918 23304603 22477562 22062155 21164991 20499754
16670 20499754 20034755 19614071 18897382 18143019 17759189 17284647 17056108 16303513 16134563
16661 16134563 15444350 15178621 14691070 14358067 13919669 13710968 13393121 13119322 12648557
16652 12648557 12559164 12141039 11978037 11938707 11157095 10714639 10480019 10321604 10410010 9903816
16642 9903816 9786448 9730114 9530905 9243953 8831138 8790184 8511701 8016615 8066451 8348404
16632 8348404 7588064 7716145 7718856 7502768 7660751 7035857 7103208 6936645 7072428 6780227
16622 6780227 6580998 6354889 6469176 6252589 5964177 6153732 5882104 5566422 5623347 5434442
16612 5434442 5212228 5139879 4932770 5116525 5155995 4592606 4838596 4308482 4809245 4806679
16602 4806679 4413651 4779618 4272106 3977881 4314053 4096882 4166696 3838039 4102176 4156006
16592 4156006 3683804 3512245 3549565 3789818 3871234 3593481 3915332 3409905 3429913 3300606
16582 3300606 3279799 3134433 3227226 3235131 3027711 3141101 3240173 2791529 3095410 3227741
16572 3227741 2896503 2930752 2826081 2694067 2606479 2821420 2837063 2782971 2467858 2957935
16562 2957935 2757809 2406827 2620495 2112832 2273789 2620177 2636696 2218338 2221328 2431668
16552 2431668 2259960 2289932 2050033 2289502 2621503 2375264 2253967 2345659 2069631 2177538
16542 2177538 2143838 2319176 2207173 2139844 2046884 1989731 2081771 2206485 2348632 1981884
16532 1981884 1699405 2128838 1800006 1919285 1971816 2111884 1633784 1854402 1683987 1478051
16522 1478051 1580259 1952957 1660533 1665237 1892095 1356718 1266465 1629495 1565798 1882908
16512 1882908 1393137 1591905 1635347 1548556 1929997 1546169 1438359 1329492 1696204 1448603
16502 1448603 1377677 1306666 1572617 1639035 1422256 1693672 1505139 1548307 1480326 1389541
16492 1389541 1312120 1565488 1405103 1383589 1758767 1356597 1392679 1465395 1422424 1095792
16482 1095792 1665038 1421593 1537529 1423675 1256159 1084179 1322569 1035012 1300840
16473 1300840 1110928 1059422 1371832 1165840 1562549 1054111 1385057 1460594 1198335 1264746
16463 1264746 1483056 1212155 1428334 977080 1306113 996123 1698208 1203849 1335802
16454 1335802 1418215 1251055 1482874 1088360 968650 1305711 651835 1070519 1099781 1329485
16444 1329485 1073937 1294912 1256826 1072991 1335287 1148464 1365187 1296040 1182348 1320324
16434 1320324 1126192 1237138 1109468 1147689 1083379 1018170 1214567 1141496 1220498 1090457
16424 1090457 1039838 1022242 1322156 949495 1505356 1199212 1274452 1059709 1437760 1508275
16414 1508275 998614 1294919 1181458 1166751 1138916 954381 835132 1187542 1360939 940639
16404 940639 1529663 985492 981296 994707 1248972 1261669 1407777 1066745 1130642 1136948 1479004
16393 1479004 1307085 1394672 1385508 1157871 1090592 859499 923754 1530000 1324588 879930
16383 879930 1225023 1093137 1087256 1090109 1098734 1199307 1012854 1099575 1367406 1295623 988919
16372 988919 935820 831461 1270156 1051616 1344836 964770 702465 1189283 1308839 803533
16362 803533 1245037 1146066 1154124 1267165 967209 1290834 1228802 1225529 877280 1099213 912642
16351 912642 1078671 910323 1471525 1313301 1349151 1343430 1150411 1084842 1298756 1237540
16341 1237540 1286363 986810 1156729 1255600 1676960 1063675 1398041 1121284 990126 1213401
16331 1213401 1332528 1352624 1575133 1016468 1213067 1367033 1459204 1153486 1232766 1489462
16321 1489462 1143038 754569 1257294 961488 1376930 1077765 1282147 1177519 1520615
16312 1520615 966579 1245300 1397763 1316863 1394075 1393263 1213031 1206763 1386181 1274706 1387196
16301 1387196 1169145 1001529 1216830 1309842 1327673 1239982 1266488 1239504 1302920 1366986 1015417
16290 1015417 1426524 1605203 1136741 1383747 1085931 1467839 894585 1057172 1073057 1019831
16280 1019831 1384109 1280614 1152009 1248572 1130333 1347977 1077179 1255814 901426 1529976
16270 1529976 1005715 1271998 1104495 1478771 1188015 1090318 1089451 1427894 976964 1101083
16260 1101083 1170393 1249941 1292702 938206 969258 1375749 1282542 1046821 1292722 1051777
16250 1051777 1156327 1212251 1125844 1134681 1225815 1166045 1013838 937433 1016702 1336888 1172418
16239 1172418 1069117 886090 1164206 1335348 1113143 860220 958594 1185677 943370 935955
16229 935955 1205993 1040395 767554 935965 1195728 1274788 1283199 1244062 944226 748040
16219 748040 798627 783347 895855 824440 1130912 807603 858286 882105 1330301 1062972
16209 1062972 949230 865823 1086385 782720 770751 1220385 584904 712311 1150981 985542
16199 985542 602701 1117544 1072309 978048 810285 715926 771120 551434 876250 915851
16189 915851 537109 690784 945472 536443 823722 678345 769302 870019 604084 863343
16179 863343 591779 786585 783002 848037 907980 657342 525023 536739 755891 557227
16169 557227 820240 572632 637134 456945 704592 603901 439154 674293 755208 891581
16159 891581 716287 334109 419574 546417 495722 672310 542620 641245 241317 511476
16149 511476 360753 597166 380718 597178 772037 454486 311424 502591 370085 456330
16139 456330 354104 285283 573973 119837 -29591 501964 487928 450805 551449 476796
16129 476796 245300 419508 277645 100977 475956 320933 557253 473865 144137 712969
16119 712969 426062 309378 379446 278555 311678 378545 388805 497073 135626 128513 260879
16108 260879 582453 326794 340926 299562 550979 137712 488474 327533 139935 514400
16098 514400 396095 263841 125899 182679 318618 244345 236569 323890 164831 245703 101433
16086 211272 -18044 376108 -41527 483920 70060 429258 208519 86567 196900 278122
16076 278122 57250 470954 458356 160284 -95544 251433 242805 264666 139218 23382 260942
16065 260942 110881 200805 222747 359749 239507 201122 279875 68647 83763 257197 378368
16054 378368 187534 172157 123790 69156 -62951 308531 425134 370767 61500 139765 45051
16042 -140904 197321 162180 112581 222193 -33530 252641 319021 -48958 424309 2810 -8927
16030 -117938 191801 331199 420784 -87312 -15911 172116 81916 53697 317187 111994
16019 -28286 -218561 -518 218571 511477 69296 150016 -29685 6527 82366 202482 -182371
16007 170408 -103471 -76153 2891 363340 155988 145952 -229057 319782 305181 6396 1832
15995 177424 58991 -280957 92731 49107 -31322 43103 71476 299556 -22028 503078 256374
15984 256374 269711 196545 281218 100220 259632 271441 175326 354402 121817 90037 114363
15973 114363 -58516 -198293 62891 -159866 271553 -447503 -49058 -189605 252738 -77070
15962 100078 118623 -88343 111825 -74185 227577 -81022 -137870 -161463 -225809 9226 -32597
15950 -51771 267826 -155303 76574 146866 29654 301773 188729 305159 114067 176479
15940 176479 -227839 -82634 120131 -107702 -106156 -117936 84539 29866 178331 -37236 -105435
15929 -105435 -86596 -12614 -159898 -86948 -134189 -20831 60002 199841 95847 33089 15746
15917 113261 -105551 -14933 22695 -72631 1376 249534 -277021 -80540 -118472 -152270 -219752
15906 -219752 119991 -31733 -130116 106503 244321 42417 -10638 111371 -70455 178400
15895 68616 22575 251631 -43055 -86900 69930 51284 -156438 58090 -305071 -98209 182252
15883 149774 16201 -196287 -185347 172437 -12309 28091 -48545 257683 -139506 5638 14130
15872 14130 27336 -292703 -240631 68816 -485 -150634 -59912 -230901 -88560 -4806 3562 212610
15860 212610 -118897 65999 -18894 125508 -109918 36488 8874 -126889 66511 -167209 60270
15848 -78056 125153 -138365 -104742 -272035 22885 111512 -108529 142714 -413079 51500
15837 6961 -52002 6559 -154895 -42024 9103 -25493 -168556 -92276 -20678 76072 -130413 659109
15824 109617 132834 -264513 -22332 -33106 466579 -18860 -367555 -264493 -123504 1043 -80887
15812 175988 76925 -10689 -108003 -76638 -69550 52302 165234 -108810 -13112 206324 -149719
15800 -125815 195648 269333 170590 -184829 68977 -171197 140805 -25357 54738 -300774
15789 -66122 24608 93686 -247543 11634 -181782 67641 -286325 -212016 -151459 190594 225939
15778 225939 51136 -58843 -34933 -449432 -161393 -170583 19723 -41800 141840 -137975 111
15766 -68054 286687 -65022 141481 112998 262844 48434 -246698 302743 33980 -65847 88690
15754 -10333 -59868 228288 -83762 199565 -133915 65300 -30380 -205609 260192 230587 136412
15743 136412 233861 227948 174955 -54594 -33781 93842 158123 -199683 -162479 -246395 225315
15731 -301539 103397 -176477 -191337 -69291 -196256 -277127 -165457 -18927 298667 226999
15721 226999 -40907 8787 183029 -275857 196275 76573 -21532 -72145 -170592 -290935 -115383
15709 -197135 25940 -152051 -201774 157269 103260 -9989 -140742 -102565 -155631 117853 49076
15697 -154315 -61019 -9093 -135250 -49107 -62659 81260 48218 215537 24198 174072 -356521
15685 -173320 87361 258343 -72949 -298532 161930 -267236 -12491 -132877 -369648 -143655
15674 -382690 -6337 246883 -115781 -129118 21549 -184299 -5394 -64222 -106290 -208891 51009
15662 -7732 22855 -133809 -59868 -47478 232921 286741 276295 22761 -57373 308743 6771
15650 -130545 -37687 -52382 317848 -162840 -192701 -132408 40368 -23882 -199988 149897 20576
15638 -115740 -261071 -62766 267571 -29137 -79704 191859 149204 -47394 -44754 -82596 256730
15626 -161265 44205 -285345 -134229 -323435 90006 -87619 106861 11706 17052 -219207 220139
15614 -4917 -116312 113900 104808 -9342 -433782 -23770 -199671 -148083 88018 -109854 8264
15602 -390110 -164329 -26094 -121708 24457 117858 55461 54241 31300 36400 -50 -303818 58583
15589 -17925 -265979 -159403 -6228 -130028 233160 -163252 165651 26971 5533 -199780 383004
15577 -256750 -408918 -17369 -29547 -39727 -9343 104887 -18903 108241 -103590 -154011 30698
15565 -188602 -142618 -103799 -95076 16867 -106524 337605 3656 -112003 -78591 205809 47511
15553 40628 51163 94283 -231856 202092 263676 -108628 116124 126288 -50164 -74178 -379742
15542 -379742 -67840 -318789 178409 35582 -34788 182199 -155788 -25091 331402 137514
15531 49182 -249433 105096 -35115 43035 -103364 100857 252882 34421 -74057 -224365
15521 -224365 -141128 -173697 219343 -31685 112843 -37620 45045 -43907 -75915 130197 -41286
15509 -199783 29543 -199276 10558 -226366 117232 18499 -77222 153648 65025 -6134 -185385
15498 -185385 -117737 -258648 28597 73768 183853 66399 248172 -204776 -279226 114175
15487 -178655 -282096 -5538 259346 202153 -117531 -35886 121779 -258996 -167990 -134734 -89476
15476 -89476 -98615 224118 -42145 4978 59765 110198 223236 101386 -88887 110597 226983
15465 226983 16365 -8399 297923 56954 -44777 18566 59926 198351 -121325 -62895 32781
15453 -282208 185106 -73783 132497 193543 4637 43215 124224 -265951 2622 -165895 -61823
15441 73492 240000 133408 -39775 134157 171156 354275 271992 138477 175511 -7569 35621
15429 -43924 -13466 -122334 -40273 143373 41332 -86923 216113 4133 -195291 13580 -115553
15417 149004 236931 -62385 -18758 -157509 192170 -275331 -91240 160984 -51474 139978
15406 -14274 167947 -19134 -3965 -22547 -63351 -15647 98339 -184889 38627 -394694 62187
15394 -195096 -238493 -28404 -211245 50241 111708 -358774 168842 20899 163520 136555 -95025
15382 220452 321127 15594 166325 -230564 85192 -55033 -100016 -229828 -63583 -45763 -163855
15371 -163855 183407 -120600 -25988 166913 -31623 16312 404276 263033 109263 74387
15361 74387 128923 -228725 62568 13343 -254556 26243 -30652 62452 -87582 -277407 -6263
15349 -98299 -129385 39049 -337416 -151869 -61811 61888 48981 11660 -206763 -79486 121402
15337 74684 -13873 -52446 142513 -91022 126997 74525 108612 -41678 -42029 45449 118930 247145
15325 247145 237082 -160306 87632 -250847 -174049 52987 70376 201134 -55379 25764 -175035
15313 -340790 -32998 221387 -161531 429589 236875 -25854 59032 35628 271634 34935
15302 90270 -203911 234556 -260087 30102 -34932 -146090 65701 80200 211628 11388 233403
15291 233403 -350645 115647 -24692 46935 48577 -23859 -314261 -31499 140621 255047 152768
15280 152768 237921 46343 94775 -241183 90491 327935 70388 -309644 -14154 -158663 -149851
15269 -149851 -172707 149005 -57742 278083 127883 145247 35195 -185780 -35916 -63329 -171460
15258 -171460 184958 226933 218699 -234670 107312 523914 626319 1150326 867358 536117
15248 536117 1111103 687670 257738 79038 -76385 232978 -38141 57168 -140809 -256920
15238 -256920 262364 23095 71203 184873 27864 -6253 -1757 -253666 -20633 53798 224089
15227 224089 101481 -62068 -15694 -142643 5130 -106692 59905 -196176 145655 222782 -60067
15215 71435 -422193 406793 278742 -166912 -35388 104714 -14028 323490 66383 34387
15205 34387 75144 209227 -375317 132414 131226 498812 -94286 476895 105533 53879 133138
15194 133138 217200 30295 436547 -20605 -24660 -120822 227525 38838 146740 8779 -56258
15182 133141 -200861 36210 -92190 -113471 165121 -99853 -47370 142697 53345 469253 97513
15170 19332 262496 -38159 210146 -113563 394639 -19547 139852 206220 283509 27278 19577
15159 19577 382113 133997 64010 221333 144030 24076 184260 -136554 -12053 83073 -28083
15147 25656 161889 260089 -96477 237920 177118 108088 241980 177187 135293 169997 145580
15136 145580 243451 -88065 -112560 166814 194313 169219 200105 264306 -2594 165600 -230437
15124 -61502 55 33152 126868 322204 302 142071 -84587 -263938 110539 99786 61687 306639
15112 306639 42539 168258 189755 -137477 257917 46393 -12773 -11076 89120 -227137 67291
15100 -168993 113306 9596 -149588 17580 168671 53129 81247 141451 65688 374932 -462932
15088 -100982 381494 123107 76184 157402 141176 -137740 7222 -201070 -284612 -62314 76014
15076 -206521 601970 -13609 92244 193989 342653 -279309 418528 77539 251729 209864
15066 209864 192888 387282 -66626 140744 220716 -37126 -91791 -37014 275443 27192 191667
15055 191667 76407 -83881 11925 251917 46850 180392 423271 77987 202272 -316089
15044 277453 34360 -185372 27951 217323 300174 475139 -1031 136939 259206 156877
15034 156877 230267 162982 153073 245331 37624 155313 168705 393916 323149 414974 46723
15022 -8098 206842 214090 274361 165140 254302 219940 141169 324267 227128 243953 315418
15011 315418 82268 -82711 256816 372491 180646 20222 296584 157680 466742 258719
15001 258719 256983 579195 277739 231214 120826 170648 35739 482963 244938 331673 410609
14990 410609 228688 354274 375621 589000 290041 274932 402844 329633 539327 44418
14979 444447 268776 182583 426611 290317 167419 213759 368970 200084 291261 429460
14969 429460 159359 237696 291080 424819 145654 329634 257008 236244 222001 252075 416486
14958 416486 464156 196438 340684 404709 250291 244654 213708 209815 241866 128836 264210
14947 264210 438987 155747 -91153 252828 432202 551668 325962 718994 238213 236364
14937 236364 319257 216020 312376 287454 282950 580156 445211 221098 294882 513738 663118
14926 663118 498342 647460 301858 414798 609275 273287 336238 408917 554090 471415
14916 471415 474836 707679 592770 666927 562393 612423 649356 277316 403735 539841
14906 539841 484058 437317 97374 272988 410612 351939 109036 94445 160058 235489 117103
14894 161120 73741 128796 175062 128387 313320 241496 290828 304156 541616 367811 328599
14883 328599 524261 338705 166379 338128 113383 487252 156593 960086 228269 288151
14873 288151 370926 345503 420325 423711 417175 405118 206215 753335 336687 343213 581318
14862 581318 487052 475832 417430 444505 218307 213886 482919 348274 357940 292854 228413
14851 228413 93492 455156 391753 259026 109173 413930 218282 634116 433822 373738
14841 373738 441449 603927 391697 319921 781285 510716 330657 603993 613991 436901
14831 436901 287827 767693 628890 397591 484166 234753 336519 811099 482097 498509
14821 498509 693364 490363 537018 376967 479895 54135 507126 443142 283652 391969
14811 391969 416102 281914 349110 358557 586097 567226 322580 402684 590771 476730 117623
14799 398060 807651 375253 406654 631002 390346 887085 154531 374063 395520 392294
14789 392294 522139 632519 594404 203880 913481 646481 393207 578747 294075 327397
14779 327397 493289 423563 547273 535579 352470 517092 613867 693192 482785 447938
14769 447938 174517 664034 586017 489432 524947 384340 728698 658162 687846 773253 516836
14758 516836 430608 420983 1231476 776951 465425 569423 464836 572945 596831 413215
14748 413215 796090 604949 682548 691561 586478 1062745 779386 731333 645138 770289
14738 770289 624415 1005815 895970 840979 443205 687273 628782 569752 447354 612639
14728 612639 580561 690304 531050 595483 693372 605915 674331 1030115 935547 1211876 950577
14717 950577 543592 603854 691108 881716 905799 909331 953322 1054744 920423 759078 663534
14706 663534 689310 851096 828456 888285 1003454 612295 578990 871445 740257 812858
14696 812858 832925 565803 843745 658477 1050514 782006 894639 822397 1085992 1080486
14686 1080486 900451 826706 671768 954865 1128974 805598 658990 1290194 1063621 1103640
14676 1103640 1058471 1027207 889776 835803 907579 815721 1013264 764686 741645 850949
14666 850949 944267 1023973 759721 997194 1146669 943351 1016977 980975 718934 1052877
14656 1052877 1079656 1234232 1065338 640976 773980 1189310 1068106 1075744 1023214 1047676
14646 1047676 1190463 1063698 728149 1039919 1105666 1124203 1107396 852084 1167212 823174
14636 823174 1309020 1167053 982926 1030736 1349221 1046254 904332 1143285 1153158 1249447
14626 1249447 922415 1025594 1167108 1187633 1544828 1168567 1250065 1167554 1412788 1307980
14616 1307980 1477632 946667 1269288 1153250 1605236 1438290 1393734 1655384 1541666 1473930
14606 1473930 1287881 1447950 1113257 1385873 1393737 1390097 1363602 1549208 1502276 1721692
14596 1721692 1529999 1344418 1821779 1547030 1680196 1548287 1437336 1411771 1826222 1830731
14586 1830731 1668771 1758982 1602983 1803288 1649922 1771129 1917090 1891318 1741686 1653622
14576 1653622 2250618 1735743 2279569 1932448 2021815 2104175 1925631 2080508 2426681 1845065
14566 1845065 2107830 2505257 2167056 2410512 2580907 2831288 2824673 2808416 2654891 3047297
14556 3047297 3396680 3411489 3454490 4005260 4612814 5252782 6287983 9046775 13402576
14547 13402576 18370591 24408905 25882312 18608663 11579017 7681178 5562560 4285151
14539 4285151 3208831 2920963 2648968 2054188 2318364 2265012 2263713 2459911 2072474 1826912
14529 1826912 2240779 2336555 1896558 1827473 2291939 1953149 2061910 2217039 2160016 2136421
14519 2136421 2350352 2337919 2432077 2221209 2095575 2490670 2202662 2200831 2634236 2641338
14509 2641338 2453488 2379807 3143803 2533544 2558088 2801058 2675106 2901556 2918618 2692745
14499 2692745 3050493 2910964 3003207 2807255 2975845 2877774 3041755 3303753 3307090 3213095
14489 3213095 3159923 2977164 3402015 3537744 3144961 3174315 3525264 3229839 3436711 3720256
14479 3720256 3513414 3835840 3529759 3754840 3690871 3751035 3987289 4076281 3935695 4006610
14469 4006610 3607603 3917485 4160531 3987912 4171682 4269020 4402188 4110941 4432613 4184216
14459 4184216 4237006 4414092 4614269 4132997 4645153 4672658 4605773 4675565 4980164 4798459
14449 4798459 5142636 4921080 5142091 5042232 5165673 5483883 5292480 5509516 5456408 5483000
14439 5483000 5329570 5927683 5693538 5913371 5907925 6047900 5545179 6064641 5979859 6445287
14429 6445287 6309052 6131945 6636683 6939947 6975244 7153074 6917570 7037683 7163449 7285774
14419 7285774 7522625 7394748 7995434 7813332 8110747 8187316 7953146 8169010 8350189 8165220
14409 8165220 8432280 8641869 8941172 8980625 8854120 9226716 9475796 9636682 9649049 9619184
14399 9619184 10023702 10285516 10580346 10523145 10827153 10724752 11219478 11316765 11380519 11915091
14389 11915091 11905795 11675228 11974597 12377785 12796898 13207561 13039919 13496225 13749185 13945618
14379 13945618 14144269 14319437 14636350 14839497 15172479 15185153 16112166 16143972 16555602 16595162
14369 16595162 17201202 17606775 17696539 18140662 18307684 19028492 19318583 19910627 20422340
14360 20422340 20743996 21466065 21571180 21817937 22665510 22881220 23555792 24110450 24874283
14351 24874283 25309014 25683767 26398488 26741584 27816843 28457424 29452325 30180729 30706097
14342 30706097 31752074 32745639 33489802 34462652 35139419 36863558 37489114 38592443 40101537
14333 40101537 41123392 42295971 43472566 44614852 46107505 47913002 49388595 51165550
14325 51165550 52718494 54291933 56644709 58009269 60333271 62500961 64604520 66829185
14317 66829185 69367179 72014793 74841922 77665570 80622016 83817160 87154747 90528137
14309 90528137 94557881 98550208 102567694 106776218 111505000 116333028 121847871 127086707
14301 127086707 133215018 139027284 145447268 152369569 159864984 167562243 175479162 184196772
14293 184196772 193010300 202610621 212301222 223068018 234192432 245438527 257256937
14286 257256937 269406300 282263039 294776906 307987630 321151812 334378774 347235945
14279 347235945 359535700 371884699 383021115 393250293 402147592 409591389 414911490
14272 414911490 417587994 418549473 417740456 415894883 412314149 406912675 400494992 393145331
14264 393145331 384520835 374875616 364434244 352573136 340215315 326896373 314087369
14257 314087369 300732054 287475428 274236895 261338989 249058053 236767177 225486219
14250 225486219 214813349 204598544 194458416 184970434 176011511 167896528 160153072
14243 160153072 152786651 145787767 139210371 132655789 126895140 121517149 116321432 111289034
14235 111289034 106497778 101927392 97996421 93760862 90103682 87011036 83231825 80281591
14227 80281591 77022594 74016034 71089186 68930282 66263880 63781293 61793973 59366924
14219 59366924 57725289 55655162 53821700 52038373 50619727 49043460 47617515 45785585
14211 45785585 44711378 43511497 42112217 41067997 39878066 38689054 37668945 36714295
14203 36714295 35415902 34428590 33593044 32877515 32131970 31066041 30312878 29726884 28863462
14194 28863462 27803456 27265139 26393839 26084248 25430383 24603594 24291405 23562197 23137954
14185 23137954 22408515 22035974 21823058 21111061 20807817 20177015 19698070 19567219 18860725
14176 18860725 18598697 18392494 17766789 17383423 16830346 16446739 16032441 15923345 15543307
14167 15543307 15381964 15104880 15042792 14242273 14025441 14076171 13855516 13430597 13424209 12926314
14157 12926314 12788426 12485368 12385896 11962328 12041461 12027385 11331800 11100259 11227097 11024904
14147 11024904 11067351 10765259 10166531 10514490 10062352 9750507 9550890 9599270 9532463 9320451
14137 9320451 9458187 9300568 9173780 8739552 8904143 8703253 8574859 8549215 8144861 8281009
14127 8281009 7982570 7916335 7730587 7701642 7448813 7442770 7504565 7510956 7288314 7089753 6958302
14116 6958302 6886891 7097888 6833172 6795411 6226314 6312716 6323244 6230526 6325769 6301251 5940570
14105 5940570 6134223 5988767 5628941 5641074 5997901 5581923 5605612 5518845 5599641 5607154
14095 5607154 5190329 5226339 5081968 4841043 5033583 5097824 5058454 4549349 4494041 4704533
14085 4704533 4536560 4744883 4555507 4561128 4496799 4634370 4512564 4407572 4345798 4454055
14075 4454055 4199823 4094287 3959963 4159398 4395363 3944574 4038292 3985363 4182505 3822050
14065 3822050 4054053 4096373 3760428 3770015 3826913 3549126 3773047 3873374 3656674 3718588
14055 3718588 3653403 3665524 3295019 3276664 3705203 3205374 3461386 3204041 3018601 3263569
14045 3263569 3124418 3088323 3033560 3120230 3258925 2834614 3095579 3228197 2992816 3006957
14035 3006957 3032952 2807673 2687471 2808524 2648649 3118022 2921263 2829127 2666136 2452732
14025 2452732 2498979 2574201 2691070 2517501 2461937 2467731 2528472 2520256 2385323 2355321 2502619
14014 2502619 2350226 2366790 2555908 2143003 2317277 2604890 2292206 2161961 2193547 2077891
14004 2077891 2045170 2159222 2357183 2317463 2612011 2236823 2053111 2194415 2503013 2435865
13994 2435865 2522817 2449215 2660613 3116011 3935155 5160423 7555931 12810051 20283066
13985 20283066 25831006 21616287 14992632 10424364 7750082 5944827 4942113 4468798
13977 4468798 3822851 3576716 3365836 3064428 2593808 2696583 2422854 2416169 2281283 2400578
13967 2400578 2383636 2236517 2087957 2091392 2228473 2188505 2236005 1751446 1846079 2097603
13957 2097603 2067901 1963067 2053551 2288965 1819906 1792998 1801163 1876006 1936632 1869150 1825318
13946 1825318 1647770 2011274 1649102 1779978 2253199 1348222 1983576 1802471 1539689
13937 1539689 1595816 1780081 1468885 1534020 1384078 1534555 1644674 1497545 1752462 1603476
13927 1603476 1698551 1496900 1684445 1388993 1380799 1399787 1286098 1636788 1779703 1455605
13917 1455605 1583871 1118605 1509642 1307466 1285295 1704516 1204482 1435450 1148880 1409084
13907 1409084 1516601 1179248 1429315 1275524 1381081 1148946 1507217 1402976 1263431
13898 1263431 1503946 1181994 1039889 1147206 1213031 1169053 824220 1105024 1283063 1188247
13888 1188247 1202614 1137834 1031750 1243022 1193055 1282258 1422369 1129983 1101125 1027114
13878 1027114 997830 1361697 924529 1012245 971448 919621 874633 1035364 821414 949050
13868 949050 967399 951545 1110410 1100430 1077024 1030853 1291208 968501 857636 672090 1119237
13857 1119237 923798 1037999 817658 871783 841896 1032752 965213 979258 1282507 771003
13847 771003 917965 1271292 858954 1113081 921248 984541 1109206 830765 850612 890570
13837 890570 958813 894481 903998 888476 747228 930292 814730 807875 865810 1076454 779987
13826 779987 763410 753768 911727 874208 961505 467651 773742 635501 1048874 637080
13816 637080 923453 847389 959348 694019 557285 755798 1045114 695520 594429 991208
13806 991208 682043 814156 560038 968488 849744 818620 733638 632648 791496 866518
13796 866518 577525 721806 890762 821990 613288 246938 678948 734767 790466 643499
13786 643499 845631 652125 1018139 818106 782844 670927 700167 769521 371366 739024
13776 739024 665261 787812 855884 522279 781379 700323 889064 767578 569505 394025
13766 394025 488610 406488 418445 523352 768126 596911 201460 906365 828675 910979
13756 910979 562973 540932 687760 622838 583969 420189 701414 552457 432778 720715
13746 720715 503621 504644 600211 416101 833964 576397 656076 627477 876481 670798
13736 670798 619822 484224 517928 672062 262971 677131 534173 220858 736673 466972
13726 466972 663476 694821 290851 607353 570732 501604 499525 795768 666368 536871
13716 536871 163259 300857 638590 458441 514146 506807 737577 670902 708017 360281
13706 360281 218000 428273 554954 588338 793019 496178 416056 404383 491925 560854
13696 560854 486617 475883 771118 -15076 532983 506886 421009 380167 800661 360421 761798
13685 761798 800075 587350 358868 703844 331372 418929 174745 609992 435563 582585
13675 582585 465739 417028 325754 441775 649608 298980 452275 713844 262098 230639
13665 230639 349179 609845 730380 994108 465127 181154 293400 697541 442199 360740
13655 360740 409763 160656 630140 36683 569437 523898 143310 476217 492347 564442
13645 564442 409119 491057 510403 422079 467903 637268 362860 216412 265638 261431 494474
13634 494474 621426 422392 292541 296693 301975 171998 280427 530890 138517 561694
13624 561694 527340 425252 319774 388263 584185 479631 451118 119648 408806 568951
13614 568951 139276 102092 469963 300194 591857 -13828 319467 224733 339287 389093
13604 389093 611467 578637 533622 56071 64737 378205 623194 583178 434003 215581 270825
13593 270825 267516 130957 362514 198709 398901 272483 130438 279364 269886 571057
13583 571057 565521 269606 600628 386132 482379 464012 280210 517343 365301 535782
13573 535782 559922 326089 279910 292725 60157 528860 358231 170602 202796 415263
13563 415263 301170 107377 506245 161891 320374 273961 213722 140106 124175 437235
13553 437235 460768 733763 269630 484902 118522 204135 33330 352312 -35763 402353
13542 107715 372104 234596 374770 101583 352480 -16060 -98793 158001 111187 399549
13532 399549 64227 233323 466389 403458 457762 222438 187760 44447 109322 272604 183095
13521 183095 411102 137049 326573 275540 50022 342216 411401 189877 174535 255714
13511 255714 309377 242639 159551 420083 -64375 313932 225242 146875 333684 296442 414470
13500 414470 155639 462767 162799 508536 144184 377493 171753 150518 546985 372741
13490 372741 113158 59205 704000 222668 166588 267806 133714 354143 334254 468779
13480 468779 103252 342519 545603 102790 238297 282225 209862 240335 61690 57722 149467
13469 149467 408642 183061 156896 12710 78304 -61671 141318 307994 135948 369981
13459 369981 253926 169395 113047 634128 283577 49676 138115 161730 360948 -45318 225384
13447 393819 413449 210289 285428 -270 101420 284875 89651 -155353 344794 163059 292695
13436 292695 62668 186899 170828 209163 459895 -65587 64466 449110 359999 367480 72941
13424 175287 229147 341580 -46222 496 170120 110651 71260 233741 194679 185383 76670
13412 312054 180838 301421 541219 153944 45072 190254 145088 245446 36279 -40430
13401 73662 131736 68289 393628 165543 201346 -28713 53183 332243 366657 277700 115545
13389 117282 223159 92387 241637 207061 144236 168620 215592 477483 156390 73404 329762
13378 329762 209548 157305 386508 221308 193178 332684 74982 191793 274571 169426
13368 169426 145839 6561 80010 124282 395990 69538 63612 -236787 387391 -236 161283
13356 104388 241301 118662 -95330 39312 197020 235844 164497 223821 274197 295743 309705
13345 309705 94978 285633 276586 172154 126421 -11468 197129 176091 257802 180456 372741
13334 372741 227578 238301 199961 166476 320592 427078 192799 551841 214849 435946
13324 435946 -79821 223675 269802 -181502 264669 286253 -145094 268976 402754 294172
13314 294172 308886 -95139 93546 -149187 99904 246411 423706 -27376 62131 43332 325542
13303 325542 38445 315925 119694 156713 64308 276653 493674 164966 271384 233955
13293 233955 37837 112099 -152298 167256 -120701 -148381 307807 58302 11467 81199 364784
13282 364784 374273 124790 211348 124891 -18620 118051 40657 52215 313211 113274 202876
13271 202876 188408 198741 235449 264965 363572 536826 128621 23731 72968 8290 277311
13260 277311 -128507 -58050 160432 386002 -76375 159283 333140 383197 -12832 208981
13249 -27240 27048 184409 410704 101261 183487 200235 157868 -78440 201338 179041 245643
13238 245643 -79706 -79439 388328 -77196 -71352 164415 -214202 175875 5893 276992 38824
13226 265167 -80769 289150 299123 293621 534508 99900 -40538 42702 262462 356074 4183
13214 269111 367878 159274 286903 117486 279588 -259891 233885 39908 182155 -262681
13203 149379 -166328 83260 -221987 186370 -238171 259773 -63780 330583 256263 -53251
13192 -203514 614685 208726 5140 117118 229968 -6622 -26784 155119 127803 57954 143736
13181 143736 285732 -128206 -179594 -395592 151321 31498 312613 78560 -112504 -55504
13170 -29878 -99842 133813 91257 121162 -4207 184996 338074 251274 48523 95935 357162
13159 357162 180333 -107247 25648 163359 206062 11465 120188 25128 261180 -29193
13148 402615 -120759 172734 230525 281455 197878 267505 -143688 -10311 -97060 412697 193740
13136 -83790 -70075 71829 403348 -78521 -58741 179719 22968 -34998 43621 116334 174724
13125 174724 -120809 82553 -127966 -290825 394125 208906 154118 -87268 135828 236149
13115 236149 143141 -26468 -284123 342724 61114 121174 -211741 27689 -130297 101995
13104 65063 313288 1295 27617 16291 78695 227365 -44458 34702 -4268 -40990 15695 -49248
13091 156264 -84597 180487 230730 30609 -316224 364159 48475 -115143 184555 -42198
13080 194738 230391 -116509 173975 80791 -14129 11109 -201612 175090 176713 -15231 173941
13068 -47168 295886 521899 69074 84244 220309 324948 31172 -39876 401695 78385 688689
13057 688689 304343 -170753 -288254 447823 115574 95073 18408 165969 214621 254865
13047 254865 444808 -16315 374161 7263 11408 -234011 122848 236098 328234 298681 146189
13035 219841 112276 223151 250800 152042 102878 193651 63408 -2247 280176 -76207 18367
13023 200494 71871 248999 72186 129352 347566 195373 -136641 -312233 12370 -87419
13012 6070 99722 -60128 66745 -155194 -12798 248908 -13869 -40232 -38544 148684 159257
13001 159257 251807 -23239 10513 -201138 -267272 -79662 223025 66927 67795 286859 186046
12990 186046 87516 214747 -135789 -165106 123927 125490 -220360 235287 95133 -126846
12979 85027 -281466 277530 103197 179064 14672 -80323 -37523 -236747 128201 167093 93327
12968 93327 -102173 -123448 60770 -39312 -156182 -73175 93401 -592916 56113 -98292 6449
12956 12795 615 261882 63987 45246 56548 -173070 174056 -50648 -194419 168305 -24978
12944 143446 -91765 -98092 -33618 64600 292895 207281 271550 -19551 -77725 165655 338225
12933 338225 -31660 6218 -54996 -30268 -22608 -81214 110610 33436 261917 356227 -66884
12921 129985 -145278 328665 189522 216278 52354 -159121 -4096 465663 -14861 153058
12910 237693 -180409 237196 114007 78385 -29609 -61995 67536 -343853 -115615 37254
12899 -158566 53157 162016 -41619 66500 110534 -296355 80990 -105789 53855 -196251 -117979
12888 -117979 60923 -92424 132880 -320086 -25528 51160 78640 -119582 177837 112714 365675
12877 365675 187955 7093 -173737 118188 83927 -218026 -51833 1365 350215 2782 -180036
12865 480165 -124693 -13714 29550 -194655 38032 45641 69971 90149 -36314 172957 -265798
12853 325288 190820 -71784 43190 -188396 221954 106622 28782 194812 -50589 199028
12842 -142070 77280 74889 -228589 -168796 207864 21439 -155522 -478924 -418763 196603 305319
12831 305319 136896 -196196 -115209 -261757 393992 -105905 -133262 77132 -78477 -74818 53620
12819 105706 -229998 -86874 -173404 -146337 228392 -60642 -152606 124502 33609 -106442 121893
12807 -308293 144408 -117514 -100699 -65319 -231562 54565 148735 200373 114852 -33191 100236
12795 56358 78551 164021 59687 53661 -5501 -153008 341226 -294256 50428 9776 330661
12784 330661 187952 17337 200967 62837 52057 -71583 53650 50444 23055 116402 174458
12773 174458 170350 -177802 -15370 136878 151351 68466 -112687 26203 -63537 -120478 162839
12761 293505 163952 -143413 157049 -80960 280005 126964 -4407 271093 43194 124882
12751 124882 -140760 5104 34136 126140 95066 -204276 -231078 -42174 -212404 35249 175214
12740 175214 82828 400844 37192 -149132 182010 146951 286191 111635 -183698 -102214
12730 -102214 -2073 371947 55103 455393 132786 121963 52690 42959 192962 186547 99235
12719 99235 81394 99989 178006 -260260 22303 91937 16403 210469 187187 73224 207740
12708 207740 194516 -77676 143631 58928 48035 -77775 35881 -119528 -185112 92871 -55163
12696 52633 -9249 16279 -268868 133465 -96545 -43213 59498 -13062 68941 2723 -33633 236694
12683 133292 -262671 151803 -140990 -1401 -56093 93759 150265 452837 207532 58954 -150689
12671 -153238 -86937 40764 214384 -11112 217090 195314 -28121 -6363 298287 -33243 -116846
12660 -116846 156720 95569 -313124 -123486 -42190 304712 -27165 160058 -182373 335732
12649 43423 119637 -50821 154810 36152 -26340 -38406 -21969 48399 -122343 -47336 83847
12637 166828 231893 27680 -226109 -439 -418224 -38536 295680 439592 -833 -181256 27696
12625 -31533 -26694 215836 -91564 149828 -188310 -236442 -98289 390471 83680 -287949 -178933
12614 -178933 223090 102092 108628 120628 -25114 255 -46558 12268 -210395 9692 159252
12603 159252 -69947 203937 177446 34697 7309 5191 -16606 365940 85942 50850 77501
12592 77501 98954 -144341 -149476 -137463 -107207 -6666 -129764 206240 -193347 -9554 -168748
12581 -168748 98846 29052 -11901 122123 92299 151846 -176730 188550 1205 161133 -50700
12569 -84465 66389 213573 125835 274829 134178 91972 -155145 185753 -169614 119531
12558 26528 -178375 -205495 314757 193803 48192 130106 215981 48783 -21707 17772 -31685
12546 224233 6393 155278 281786 -58737 210133 81037 20275 222228 -1751 8287 -104176
12534 -165969 -14157 -80050 -34746 -347918 -138701 -25675 -248400 -37467 -130886 113647 -247386
12522 3311 10467 330261 107033 24461 8125 39283 181264 385243 -26349 -101811 -465184
12511 -465184 -98023 185379 22684 18900 -92057 -117797 127646 -322514 -208978 185148 56093
12499 -52193 128904 -192575 -318916 147603 179448 13735 -150316 -86260 216225 99034
12488 47116 -9535 -89856 -50636 120534 -10290 91742 -451772 353539 -32601 -250485 196601
12476 164636 -250885 -101627 -247360 -59649 10596 179873 -118952 -130337 -100284 -49659
12465 -292694 -138583 132640 84531 143214 -125109 -90964 352 -169360 373793 -43282 154696
12453 -104796 22459 114428 -94624 -123215 176659 169682 -124295 21094 -33558 170650 95565
12442 95565 107641 216554 -140116 -249635 -54271 -328447 -136762 -366984 -345527 -308527
12432 -308527 -306695 -359766 -47913 79170 163936 52831 86659 -79118 -290866 -45901 -31461
12421 -31461 65095 164253 -65259 -111447 57646 53606 55083 63287 121691 258966 91542 -139402
12408 -186100 193031 -124260 33431 194457 10000 -108918 -54328 -93966 -17831 -256388
12398 -256388 -25781 190610 377552 15311 132021 -3633 -68440 408503 92312 40792 -156534
12386 -127943 -92599 -12814 -83264 6644 300034 -35848 340967 236090 170684 -132133 -168855
12375 -168855 94016 272050 252561 2046 -95807 -268521 -28550 -189229 -39975 58649 102520
12364 102520 -29373 119172 -161672 -199217 203506 112819 102354 -147964 -244487 163475
12353 28265 -39207 -219802 174587 12206 -119049 -156418 69305 148683 23701 53869 -117436
12341 27577 -93838 -41825 44227 204120 333407 166846 -137134 -19042 -379438 -109196
12330 335383 72883 94034 187159 -77723 262876 108894 197024 132186 68431 -270333 -143339
12319 -143339 89231 705 -72904 85091 -78414 -17998 118822 80780 214856 -11405 152432
12307 83534 -46596 -127969 12526 262425 -149686 -160227 15854 266196 -209276 281485 -307477
12295 242028 -159041 134980 -129593 -145176 343358 129435 59833 -133514 -128759 -155333
12285 -155333 -41706 62897 441194 55289 75297 -104187 165676 -66975 -367553 -82713 -95456
12274 -95456 296686 -61285 69491 -128628 35184 -218020 11812 248782 165468 -3089 -105130
12263 -105130 150388 139301 45433 181189 136880 140112 310237 145993 -93070 118674 -181215
12251 34529 -187117 -16247 -73757 120647 -156227 -38569 365229 -174482 24144 -6838 8163
12239 98997 176712 156958 280792 118850 285022 -115115 108974 21681 -154572 545426
12228 201967 -23420 118592 -250772 81791 -91198 5355 215637 232182 69907 55895 312425
12217 312425 248715 174551 -46392 105838 383798 -43528 120938 134383 183481 109846 -17553
12205 171998 -16670 -115068 -249415 -8211 56596 276600 -114609 203501 441807 -20175 257014
12193 293498 372654 123536 -14199 -172397 -70785 -52497 53940 160652 -25638 73720 117208
12182 117208 85680 292165 -255686 -142343 15923 199573 175845 378923 413180 350613
12172 350613 198180 -74629 231647 225193 -19312 380016 424881 -11862 -152942 121219 243376
12161 243376 45672 355665 491001 84540 7046 -277416 130087 180967 116349 -138301 78329
12149 246985 152783 -16896 93014 -37875 -137429 288200 154240 234299 53261 67789 -159366
12137 156239 40361 13456 -65169 141387 -291439 212137 -201132 83686 213266 174733
12127 174733 104161 118891 243658 -76255 63214 166351 -107129 88251 54688 -107767 130397
12115 -230538 -212464 117164 -254146 160023 -3796 301512 5153 -278793 63147 89541 54687
12104 54687 -81677 174233 46792 -235782 155960 -262377 -160236 -139705 57079 88933 -50688
12092 -166108 -160668 7508 269946 107203 45342 -72631 -96958 13680 -194537 -250994 22778
12080 101556 -182493 -183549 -144453 -291127 9230 -236756 -212078 105261 -52746 -148342 -55864
12068 -163477 -102385 -296813 -19141 54837 -429396 -29211 266719 14508 235360 40045 -72791
12056 -54947 -28478 -131372 -58750 230931 5045 118421 100991 103782 -2172 108396 74643
12045 74643 -7866 -29138 243204 62197 168882 -270912 363892 -159013 -182820 -72219 43368
12033 -11766 -223934 -96500 189719 -240189 142119 -79976 -25220 -406256 -5617 2254 -96802
12021 133450 99909 -66101 224593 -53231 -254684 -39551 76852 -270658 -242435 11778 537256
12010 537256 -149135 -96582 -340067 -198453 -14761 -32571 32239 38032 286099 -79414 315576
11998 -297549 238137 -227433 -211258 181012 -168345 -20809 -128313 75675 -147666 21246
11987 -166242 -54192 296974 -10587 -33865 -368511 214835 -74243 120185 108272 93276 -116956
11975 206719 -156880 67461 243329 -132278 140285 -111509 -71365 156646 -225345 181657
11964 24006 26255 -246512 -19990 126485 31756 -14120 164249 110715 173674 76447 -46562
11952 154984 7337 -372128 -148816 -198747 81276 -274835 -199483 34546 131057 142247 252929
11941 252929 58132 95967 27894 88349 326125 -301924 106352 291507 80010 -393788
11930 -52032 -44386 -72314 103316 -81258 -64900 198872 -136210 -21218 -57830 -3225 -39177
11919 -39177 36461 77588 25506 -213084 16776 -185345 -43946 184581 -129033 -153979 97097
11907 51309 -125797 -270313 7660 -59641 2810 90279 -71955 -87733 213139 -171904 -202784
11896 -202784 -22248 -139118 -49785 -110856 -192135 -161991 -285089 -129145 -87276 -198418 -155211
11885 -155211 289581 384726 -136328 45611 118520 238227 -90982 -179976 -57848 -274566 115869
11873 11740 -327322 117263 -155189 -158833 -74576 -215179 408918 -225274 -251477 -134901
11863 -134901 -155963 27908 -156489 -59138 -55619 83707 -210952 -146747 111996 -44719 -16176
11851 -94784 -86843 33897 25492 -172558 138468 282843 132181 194050 -387890 -95324 -274714
11840 -274714 -67701 -131128 175231 -71287 -150376 274629 -112950 62741 -24805 -78463 -83909
11829 -83909 71751 -34972 105071 191898 4946 92463 -81126 -39905 -6869 -104295 -172049 -138564
11817 -138564 30335 -19066 401461 -57186 -310284 -170152 95022 80454 -68166 -199073 -119435
11806 -119435 150921 -253364 93690 -111345 192930 -413389 -167410 -76786 -251032 -64487
11795 40925 -215982 189934 -161319 170442 103990 -57076 -504008 15827 -126880 -184910
11785 -184910 -273166 -304508 114876 -4954 -154758 -271050 29513 54967 102740 -112266 -35498
11773 4846 -103908 -323556 -98092 -149381 77771 -67809 -309901 224453 71800 -117966 -160797
11762 -160797 27433 -436308 119116 239263 3942 -8622 -103729 143386 1003 -13397 -233013
11751 -233013 -335327 -79447 386604 -142989 -83972 214368 -198489 32947 -196281 -96845
11740 -139019 356360 246673 15057 -94109 20719 116075 -193939 -138299 214125 64147 10289
11728 -128801 112458 -379056 140270 -35532 -75853 -204979 11771 -67081 218267 189509
11718 189509 -63923 151064 87714 112618 62899 -264756 48224 31526 -119982 329688 240824
11707 240824 265273 178384 176851 -52488 -23954 -24821 63716 -255100 78590 -166227 192127
11695 -23047 -131242 194168 177436 -79075 -106632 -476969 -134044 134125 -76003 -98875 -67682
11684 -67682 -239879 -120275 -71015 -94977 -7207 -45962 -82455 -48272 268788 66707 -54832
11672 8501 133703 -193407 262113 -34741 -149071 -48345 155130 -21793 32797 -37856 96704
11660 9289 -55309 101568 3260 200925 155619 -70062 -174102 189435 -77826 179690 40741
11648 152603 -21685 -125374 132090 216857 -210225 143873 -22494 -319890 -229568 34866
11637 -133812 -90893 -33665 498201 36604 178777 48408 -352439 184751 -187738 80817
11626 -11057 67145 175751 -24837 222016 -13505 -202186 -36761 241317 116868 -21428 34146
11614 100691 156817 -94454 -149057 -183544 93726 -33135 113747 -4865 -281081 22541 104606
11603 104606 -32814 249212 557910 353118 50065 -266977 135037 194762 1982 -243386
11592 37750 543744 -354270 -9565 -70702 -111347 267265 152812 -83410 280648 44034 -91000
11580 -52671 141401 133165 123236 -38010 303112 151054 -73490 -80936 -221534 257527 53865
11568 53524 -132934 44850 59025 174103 128508 77677 47006 -136923 -137955 97123 -146376
11556 -94990 58553 -183541 -46659 -127438 -16512 -29043 -157681 83073 -147366 -114030 126635
11544 38719 75143 82302 -167509 -182926 443299 -75975 208549 -107214 48706 14835 122487
11533 122487 166891 15204 136089 133406 286666 83336 171820 343596 26372 -92244 150406
11521 356719 -64244 95625 168364 157272 190631 -74892 -58355 190548 143818 305384 -22012
11509 -168915 263850 -165013 197897 84979 120831 500666 18545 99999 -121493 -224668
11499 -224668 -48252 229421 -17654 49890 127497 189344 -78655 174623 -111727 -86838 179250
11487 372861 243164 339015 -32393 356066 4096 -44221 342674 11196 -66833 -90870 321957
11475 62242 367499 251447 69304 -238950 49475 -103096 -24997 59609 268368 234279 7
11463 60812 46065 -74999 -191080 25658 10847 155604 69784 126177 -78572 272663 175993
11452 175993 77439 -98093 -167644 -8088 -90366 51784 39933 145859 -50627 -111868 -481499
11441 -481499 -142853 301688 -46476 -21401 95419 -192628 168729 -211870 -111474 -382817
11431 -382817 17467 -149655 -239975 163866 -18820 9314 -193517 33078 74395 132395 266524
11420 266524 148206 284353 -78454 -263773 -115310 128400 115941 97269 -5701 -54287 -116719
11409 -116719 137851 163614 -9318 -180387 -295427 17772 -222353 -75841 17443 171633 -386237
11397 43523 32355 231306 -285144 -99137 -136572 -174442 -44177 -130296 -86923 326334 -65730
11385 30840 36140 93432 -44611 -256062 -127355 -202185 -415 -107313 27394 -24779 2068 -40854
11372 30389 -91088 63428 79024 304203 -137426 -85660 -305768 -51942 -165341 189103 -23357
11360 -234714 -76071 8798 -141310 201760 -11660 -106441 313570 28023 46718 101685 363473
11349 363473 74703 -220861 -111270 -180120 -63132 -115465 160243 15245 -56212 -49909 -28354
11338 -28354 63731 -419281 171702 -93808 -31557 -15236 167583 244844 -140631 83587 -162925
11326 -214173 -155584 62586 -225428 -31484 459081 194481 79277 -266236 213337 275787
11316 275787 -289177 -161602 -147403 8642 -181138 -154421 -143091 -7641 108904 -21707 172894
11304 -333002 199575 -68933 178644 239121 95789 -69418 -123201 272791 -200631 256438
11293 -126242 -250287 134820 38710 12666 -230470 -88837 -37929 -59438 277800 -204122
11282 -77814 84687 -98999 -99060 -213458 156782 88521 -35808 123399 80548 169269 -214593
11270 113690 128623 56312 -48236 -44876 -49074 -250578 -75186 136980 153558 98754 292376
11259 292376 241710 -35935 33011 -55385 -105212 76405 276335 44049 65047 -22620 -208099
11248 -208099 -6310 -246836 -159022 19721 169493 264338 -59829 168183 -230756 201106 -99778
11236 73697 132828 -58071 115140 -159332 188208 -109945 -6159 -109216 -99967 -251657 -108272
11224 73620 -223016 -19076 73767 14345 108964 12872 -66808 197649 -205987 -151651 -80715
11213 -80715 -533745 -37361 108522 -317124 -80835 -337707 23741 115695 -420213 92066 61605
11202 61605 -43288 -267195 -62109 37155 315296 -107440 59586 167859 -167268 182954
11191 -206345 -17215 58861 -162218 -119138 42130 -68706 -345365 -398693 -53390 -127907 272174
11179 -78509 7481 304727 -123248 -75292 -343340 -160153 -84284 -40093 -28064 179868 -69101
11167 24986 -319975 174685 185230 -82516 -232909 99021 206852 -122476 -242553 -5060 27824
11155 30525 202828 108615 -32041 -133444 -206565 212086 -129687 -270441 -145894 -108829
11145 -108829 -78758 95140 164145 50084 39573 -104294 -48264 -116504 -290850 -261239 -75986
11133 -196561 -22712 -68865 -140607 -278357 -198102 -313233 -36620 -106233 96476 55541 -89810
11121 -174370 -23411 -71677 56703 162119 -156025 25409 56299 -215035 -12079 -45996 -228558
11110 -228558 154149 -21576 51382 149423 37692 34145 29448 241199 381436 10713 147234
11099 147234 32675 141480 253469 15075 -53507 -654 -83298 238073 129550 37464 -52404
11087 37183 28071 -55225 145574 167921 210248 527366 418562 -209681 58826 199256 108974
11076 108974 400317 759335 12401 410293 324414 331833 266245 63989 287399 438069 232892
11065 232892 -91339 119190 255624 103435 101679 38853 306468 382212 393036 435837 316032
11054 316032 227886 568053 451074 394503 416967 362843 393303 160689 637768 555527 505554
11043 505554 568824 443296 483692 472307 345376 232998 250884 479021 119092 596355
11033 596355 336126 213990 221622 275546 429610 275925 327283 632021 355522 249995
11023 249995 285253 333694 284038 556606 160447 243833 686201 151203 -70942 688586
11012 269989 88247 577721 56834 144182 -2420 198698 332647 202582 617784 343979
11002 343979 118781 319300 391826 434177 202324 415560 391594 266679 402625 458196
10992 458196 584241 99977 203412 573452 428441 644797 329524 514883 717768 702288
10982 702288 602430 579314 638794 818434 683417 764411 1118582 943489 1568307 1271692
10972 1271692 1570230 1986206 1613115 1639207 1774806 1242574 1205919 1354791 1248665 921643
10962 921643 1160414 1174133 1015048 821941 1339183 1220290 791293 1207788 1478685 1081815
10952 1081815 886483 962089 952192 886400 60469 513912 488849 194828 166250 234734 282479
10941 282479 9874 3616 -294801 68966 412496 332892 89971 80158 -14363 -31348 -9388 -190107
10929 -190107 64212 328583 73432 320616 193995 291832 -108565 19493 204451 -220008
10918 130685 -324219 -123914 -82 -155319 -60829 4189 -222261 215741 -87275 -235785 69950
10906 -101228 21760 -34138 -238873 49702 -171852 -23759 -208612 150634 -372990 147748
10895 27290 -162333 -440843 5671 -17561 -245591 36862 93001 -442171 -175663 -158911 252014
10883 204210 71468 43769 -371417 27430 -11727 -530195 141877 -80608 -183362 290986
10872 21044 261935 30707 120324 -57648 201754 -184702 184612 -38872 93164 -337673 209675
10860 -55320 32444 230609 55969 -12802 97713 -18068 200140 108618 -91181 60794 -11233
10848 4733 -13542 -264493 -63478 135326 555192 128245 -242917 -106485 -211487 171241
10837 166771 146922 -130971 -146944 14906 -164561 -208356 107393 76279 11006 -134802 118839
10825 3580 -26252 159211 249354 -93091 -155948 -28490 -4942 -193991 40687 57316 -169091
10813 -77852 -56183 -286021 -173826 -82122 -352363 63240 349568 -226357 -98466 -103415 -80611
10802 -80611 12445 -162919 149293 214818 -109552 -93 238252 83773 -191616 -158451 123047
10790 -1626 -58026 -143102 -276407 -58693 -335495 -261029 5206 -263724 61062 -171372 -112502
10779 -112502 -218969 -92489 -21006 -218322 221590 -45841 113636 -108385 -22121 167909
10768 -290673 -157842 -218832 113189 174177 -164188 87833 -124071 -164099 67381 -213015
10757 134190 -218938 -207226 157649 -49015 31900 -92317 -130690 -80915 56260 -39284 -48503
10746 -48503 -161075 198897 -76573 -143623 -219766 -108593 68947 198091 -52948 -80437 -335855
10735 -335855 325059 -94894 -354668 -200141 102269 375626 -53363 -211393 -32546 22035
10724 35907 -40194 -290453 -307773 -423029 -67328 79431 -274704 -423598 2872 -111318 -25634
10712 79613 -113031 -104726 50089 -71136 -144246 104554 -282549 -133287 -4683 141002 -127009
10700 -28968 -155188 314211 -495879 -20605 12164 -67281 11118 72727 -89284 180768 -113453
10688 -71889 -49786 -232537 -106944 -110732 87932 -111607 -52418 113639 -121868 -133198 -87625
10677 -87625 -65691 3585 110755 -23942 -91093 -97544 82086 48426 -88956 -26157 128242 -49927
10664 -75987 -60107 160386 33543 -28132 -9365 -172246 -247783 36926 -237402 -149128 -154018
10653 -154018 -19826 -198801 -157758 172711 -54737 188239 -348428 43359 60166 113041 -30996
10641 -125368 -7159 -63182 20696 -13158 -162622 28046 -5701 -31813 124249 -1542 -142449
10630 -142449 113314 -315369 55992 19415 -41204 -199497 6060 49869 -100803 -237833 83873
10618 -29327 -177032 145650 7214 -110202 -139555 255910 146233 136465 -278927 -309477 60159
10606 109884 14460 97286 46497 1592 -6855 -175927 179054 75679 162080 -44604 -3612 -208351
10594 -208351 -2935 79514 376031 -76558 -217208 152766 -60948 7188 189233 -155600 -78793
10583 -78793 53540 27613 -66387 129341 -172694 -192149 34593 169736 -193051 -54168 -382641
10572 -382641 178582 119969 -171547 -14831 66547 -261609 -316447 -26057 -213898 140273
10561 -346766 55352 -148401 -162522 13102 111364 -151837 -118422 -117336 -1860 322555 -30988
10549 -220545 98836 162011 -4865 39529 -270776 -22770 -104795 -30592 165999 231276 -176719
10537 8899 -84779 95867 17228 -198460 -319397 204534 -201658 217452 49701 148950 5223
10525 -74710 -67215 -84947 -151549 55283 -73256 -155584 140053 76016 140648 -7528 44016 92602
10513 92602 -77860 -7301 94003 58766 98195 253520 -34678 -114617 -52436 -19330 -137629
10502 -137629 34288 -58510 -44612 -180586 -61761 -296524 -218125 -10704 8769 -69686 -246950
10491 -246950 14743 164719 -111527 199111 58529 172264 192918 5166 -39699 -38212 476734
10479 347073 316552 125986 -14491 185706 101651 158636 -35074 -79562 299920 56958 -81376
10467 14697 15018 241917 -138528 3510 204288 -306217 -65114 -162923 -127228 121393 -63076
10455 -121245 -154203 -92868 -110809 -158419 104753 106254 118912 50968 -27950 -3038 275524
10443 -109365 -315354 -151428 -149659 289853 339370 -63001 -94630 -111467 60885 -178652 107862
10431 62310 176491 55516 -129362 -143407 -63804 211146 -109746 67727 -61861 130722 148558
10420 148558 -91120 -90555 -435339 81306 27730 -153627 82562 -237446 137051 90606 -95346
10408 -186413 -92938 -355612 -16802 -293284 149594 -139797 -157314 141297 -220292 -339628
10398 -339628 -24749 -178915 98214 25855 -173664 138849 2719 78979 247083 -47869 263423
10386 48132 273778 -240121 234672 -86158 202625 -60654 -116013 192120 349460 438281
10376 438281 66142 -513491 228614 -79621 317966 306026 235646 403618 42478 294107
10366 294107 335519 46849 -31361 233371 84113 156396 290789 168927 -201407 189157
10355 263094 267066 84298 36250 511214 253302 77082 341691 344809 251680 51056 126252
10344 126252 317541 55765 46300 179370 464442 359098 354825 310189 -49022 437294 129839
10332 -66018 -28035 309716 76797 -246003 323185 75796 27555 -235257 162538 -71102 47750
10320 150081 93220 169603 139580 269980 130417 111513 -132420 185567 171043 -112843
10309 -37265 175472 -183612 222499 35057 124093 -137485 33350 -209778 248059 267336
10299 267336 254132 117370 -71451 -300357 5657 145965 -37420 58104 87369 -11293 189661
10287 57736 -97868 -118828 -69925 -84982 -436637 -96401 6232 -185186 -88905 99706 -128284
10275 -133293 113574 226028 61242 251537 -313245 141153 71610 -1650 -95348 4448 55468
10264 55468 155372 -60211 -13202 -70800 -6376 418237 85798 314635 381780 73966 375043
10253 375043 -40175 -308773 -32264 -276155 9626 -39433 -881 -189107 -122975 50427 -55390
10241 -167505 -362638 245738 142699 284039 228126 46955 18303 -1047 3489 -207901 -81293
10229 -148028 123511 -14332 -283344 -89691 108254 -247934 -79782 5180 -31693 105437 -186158
10217 -118279 285521 -77078 -260916 -2469 -102190 -131550 -304701 -252476 -299511 -279006 -173670
10206 -173670 42949 5306 -375865 -35724 69925 -86417 -425201 -237988 -150822 -110421 56694
10194 -112054 106610 -161421 238623 -78199 -1685 -177400 -337180 254977 116988 -241747
10183 67970 -213181 63120 95811 236719 -18993 89755 -30815 -205302 149146 138692 -154945
10171 -185745 -11825 -131551 146208 -188087 30234 -155735 -25451 -14532 228861 98410
10160 -293040 102010 15509 -192538 262774 15843 -181947 -292197 -30789 -125079 -133127 -501423
10149 -501423 155788 -76827 137544 -157921 86069 -111285 158106 -8277 34872 -190201
10138 -47450 -67314 -50246 -119483 60305 -100622 25221 12717 328732 -167172 -31719 -68892
10127 -68892 -106303 -128592 325521 -125994 244327 -276368 46196 -78190 -60898 277368 72673
10115 172533 -26123 -391761 -468194 -180069 -25223 355729 -300709 -66810 -84780 -452047
10105 -452047 139111 -389970 4051 -104784 -135315 34875 -49130 34049 -84325 -207225 6593
10093 -53637 52794 -71520 179013 -314000 -93180 73404 -280000 87554 -71098 17192 231314
10082 231314 -279114 -48053 -91508 -183810 151295 -312071 116414 71361 -35221 -224616
10072 -224616 -17919 -51936 21585 -80680 -44655 -202809 86493 -72301 -168143 324948 352060
10061 352060 12271 62108 56110 -23642 220950 -466780 -106531 189521 -181102 -236089 58757
10049 134998 -91536 -28765 -204592 -155158 96026 -154695 -252450 178685 -61889 234465 -151804
10037 415439 -54384 37277 -103726 -268920 -173143 -129236 31733 -144099 -374996 237796
10026 168288 51453 193141 -352984 -146927 39882 -132407 -264074 -70017 18378 -103884
10015 22439 167461 -37831 106691 -33296 167248 19715 21205 -146579 -178938 100174 -5596
10003 61980 -195946 -496075 83163 22408 168682 -253572 156623 132899 -85577 -221699
9993 -221699 -230458 250935 -90209 57175 -163905 -156016 190176 131319 265292 -27700 -207702
9982 -207702 -326911 -123167 -162879 7136 -187775 134356 68771 -76936 -226722 -135170 173012
9970 -148807 -43686 3854 -270715 -188246 -112216 107888 -72566 407222 -137529 196481 -16721
9958 -130923 -98173 -28961 76643 -137493 -158514 33347 -392132 -180118 -240355 -26979 -239950
9947 -239950 125175 -291033 126422 -38091 -39599 73526 -387414 18612 -83801 -46936 -187879
9936 -187879 -368477 190145 69451 -57918 -93846 70172 -48960 18838 -8471 56331 39734
9925 39734 232428 143301 -175979 -212267 -201714 -49307 101627 -258392 -250710 -54437 -151328
9914 -151328 162097 -39133 -125464 -162810 -18455 -87395 -308285 46200 -430900 -65365 -207916
9903 -207916 -157489 250079 165120 -264802 -36904 -34608 318282 -110122 -71290 -62461 -45936
9892 -45936 -368568 102644 174281 132127 48771 -303472 304217 163026 -183468 -188754 -204293
9881 -204293 81601 -246182 185210 161273 -50964 -59767 -149630 16467 -45802 -32406 -263326
9870 -263326 100034 116902 -741 66047 296312 -244748 -211260 -49700 -34874 -231104 7951
9858 -108914 151403 219048 102183 -246102 -185996 193612 -5690 -357134 -72875 -11058 -54840
9847 -54840 -76112 -167661 173066 -222338 155308 -185629 -31156 -73635 41047 -113470 -247304
9836 -247304 -63886 -21340 114623 10395 -56965 -398320 23988 -362219 -197224 -91974 -42760
9824 -364595 -46142 44760 -89886 147042 -39601 146950 -386350 -30233 103094 -148953 -197125
9813 -197125 -73481 8817 -250250 -164475 -153534 69725 85220 280922 151745 119815 -159297
9801 236356 -158670 -278327 4634 -137130 -136744 -98461 158026 24427 -112436 -168562 -92977
9790 -92977 -80274 29149 -12017 -133366 -111381 -110948 -248832 245547 -332398 -141194 -115455
9779 -115455 -308144 -46092 -86757 62196 -30034 -262554 27861 -187099 99078 -10227 -99516
9768 -99516 -384009 -418000 -390230 -85968 62674 38879 -128749 170097 -183046 -10926 -175998
9757 -175998 115072 -16199 -220466 123488 72115 58084 -90018 165581 -7609 -146059 -89571
9746 -89571 84185 101711 209657 -58230 236602 -130151 -91848 -118771 -204625 -19897 96949
9734 -188424 -73125 98445 -227130 -142254 -31956 -411895 -18882 37968 -301532 215376 -217365
9722 -88610 -297572 108503 80556 -125009 -187026 -206890 17404 -195548 -88894 137606 220867
9711 220867 -7595 -2121 55666 -235773 202311 -52612 -74590 350532 -304898 275167 14389
9699 129239 17118 -109927 -103266 97585 -14479 -360451 -256846 -246955 19761 173253 237337
9688 237337 -23340 -105459 -13494 -239013 30063 -288794 -18208 101997 -216521 -14076 -73322
9677 -73322 -38631 -37040 -37173 -203974 -118435 -217595 -122130 -218112 -75610 123971 -494335 -112745
9664 -180272 -69420 -175826 365905 -39257 -274689 -23236 54901 125528 96069 17274 17127
9653 17127 -276904 -37856 -73802 175358 -114115 -8328 36269 81655 29172 93929 -55920
9641 -76043 340419 -191513 -183851 -129018 -288891 174696 99283 -8590 -171977 -177479 25323
9629 -50809 -284989 14062 316692 75272 33187 50100 -27874 129505 -307077 -18678 -65278
9618 -65278 -74388 232306 25966 -164537 37128 169343 -98057 12302 -106014 125770 -167723
9606 -94193 -26796 -345434 13359 51697 -254919 -28271 21520 -184895 6949 -16410 104896
9594 163728 90674 -58476 119473 -47525 203143 -173583 -70716 326666 -101749 -331126
9584 -331126 252817 -275284 106313 13903 -70395 -167234 -62814 -73114 212747 241240 -391258
9572 -222026 -295542 162250 -98616 -74947 -209588 28119 -169477 54615 -240661 -220288 12352
9560 -464506 -310266 -72180 193540 -12573 -153794 -134133 114991 -56507 173219 -10696 182105
9548 -142015 -212432 -228180 104054 158774 107645 -18427 -248109 40087 226316 -166019 107962
9536 15938 12526 223976 17833 -98449 4049 2865 100143 -127499 84335 -27235 -219016 -20630
9523 -135221 -115687 -9771 108430 219061 -12730 -136365 42499 31160 -134159 -95268 -411709
9512 -411709 69160 -243257 -127798 -239500 -133161 89933 -212116 169130 -298906 66650
9501 205035 108893 -490510 95993 338730 17735 -79340 -159913 -285390 -36333 -27333 -200204
9490 -200204 60281 118773 -20741 65492 -310080 -339835 83368 152274 -105514 -231422 27044
9478 38153 -74080 136125 457430 -108564 -122708 -180436 -75886 312382 -11881 6588 -130802
9466 68468 19888 137434 41034 -155878 78387 59818 48252 -173639 -17601 -141353 -156813
9455 -156813 -127964 -101591 27728 -177518 200532 -223159 -18030 -222984 -82397 -201103 -215337
9444 -215337 17229 159237 145854 3265 91918 -83288 12527 -14157 -256144 148645 -98713
9432 -101311 -62210 6955 -104604 260551 -128549 92254 6405 -210722 -298442 -110327 153804
9420 -105982 -226052 -80795 143016 -386804 107905 -41716 -35914 -267623 116560 -64324 -430097
9409 -430097 20742 18191 -67958 235013 107028 23724 -231999 -257683 -58778 73076 61503
9398 61503 -31022 -40922 -461085 -371528 -138389 109371 14869 -163131 267519 -71875 -47713
9387 -47713 -13978 -178527 538 -101258 26315 -186407 82987 219197 260190 -29978 -48490
9376 -48490 160456 -243755 9596 -294773 -286551 -116498 -11393 -82254 -209152 55583 -184471
9364 274945 -123772 227464 159694 206553 244089 28998 39271 66813 -27230 97355 22908
9352 -155143 93527 294849 24038 -68816 -245548 33027 -16105 170388 -178930 -175109 -89855
9341 -89855 -173997 -356330 -238019 87376 -161394 97974 -122746 -133434 -279865 -309442 -153176
9329 140615 -71586 64020 -188902 -219258 -138966 -215564 -260969 17558 -70518 -31775 130165
9317 129611 195327 -36103 116994 -196743 -132857 47152 -212467 -76291 -110972 -126202 91155
9305 -112219 83452 10411 114839 339493 58798 -94691 -9089 -186410 201037 -73410 19041
9293 -82524 -539176 40827 -6421 -219752 -223571 -117452 -172034 -217408 -50057 124780 -98912
9281 -524743 -20556 225905 -1422 -220486 86722 -118847 -480 -8634 -56130 -141371 -43380 -76173
9269 -76173 -175018 -224058 -206715 -132381 277071 56788 -259583 -246496 -94752 -500143 -110250
9257 170702 -68157 299475 -46894 -157066 10322 -145043 21029 -130826 -161724 93652 213864
9246 213864 -314107 -123672 -224620 49449 -134208 -164075 101909 -110935 73860 -118055
9235 116200 -177864 -60053 -440476 -55300 -109661 -318731 -71545 39638 280588 148939 20100
9223 -92704 25035 105004 -110818 333789 17415 -152441 -163376 141940 -217556 -373529 124663
9211 -91181 -112110 -44497 -374774 -160234 -132929 -164027 89767 -322028 296894 29939 -449146
9199 -8305 168692 23127 189238 19914 23694 164455 8843 -377854 55347 90958 -301600
9187 -333134 218862 -132925 128344 29552 -100464 -152333 30138 27654 -98379 -35991 -48342
9176 -48342 -25872 -35382 -66694 -259076 225975 -32486 59304 -90949 -262435 69596 -236087
9164 -109866 -128283 -17236 -29692 180856 161573 -101378 300411 -235702 84078 117815 -193653
9152 -26115 284843 -255961 -90498 -53551 -62820 167504 -44450 -279934 -314984 -12008 61704
9140 -196391 51727 33281 -231735 3278 14777 -162967 22518 -65557 56451 -79908 120774
9128 -165333 174129 -225019 -371640 -283595 -83458 -279478 -273448 18250 113593 60961 101617
9117 101617 189244 -154299 320661 -68867 209434 -51768 76634 34506 143298 -33445 -248089
9106 -248089 -51445 -128820 -101865 -317780 -53405 -8298 -38129 -53986 278178 -95910 -75123
9095 -75123 -172178 139289 149578 202462 56242 -135253 -130731 -140666 244812 -124343 -100843
9084 -100843 -9005 119705 139429 122546 -292104 -403804 -256717 1518 -202950 -171915 199807
9072 162749 -77526 3442 105248 24935 -85803 -176735 -105192 60301 -238766 -173991 216780
9060 -359897 266672 -198250 98831 274269 -220311 -281770 105384 104348 68975 17912 -154129
9048 186957 -198449 -237497 80476 -98596 -19208 87916 219442 12743 -388066 33169 3124
9036 110543 -324347 -3254 -117305 112847 -26419 -312726 -112288 -174390 -128138 -51523 56323
9024 -125252 -28169 -63296 -70213 113275 -6095 96429 -128108 -159088 1086 -277985 213058
9012 -70954 -111585 26792 -15719 -283107 -80724 -237375 86361 120063 -1552 70065 -97659 -92032
9000 -92032 -346383 119376 79886 -53931 14106 -46560 111176 213311 -202114 247733 124863
8989 124863 -77704 -369042 13490 285779 28851 80212 -91600 96732 -244869 125095 187113
8978 187113 -175687 84389 -59800 -310583 -203351 -24147 -194325 -192146 -188565 -264025 54048
8966 199313 -247562 -134568 -124527 -107384 24176 256634 -274871 -31677 116931 -253820
8955 55766 -33682 -40395 -26304 -327007 -341662 -375288 -152968 -172951 -77433 312328 -263852
8943 -195848 -74245 -256726 -70554 -233718 225297 1246 1718 134946 -206564 -32071 323417
8931 334660 23601 -312501 173558 178833 55155 41925 43695 492025 401529 2026517 6957316
8920 6957316 15557363 5015808 1734383 947450 953349 426919 14427 25602 293851 280877
8910 280877 -35080 245404 363344 642164 -152236 138841 260355 -90310 94699 -44200
8899 -39407 -42911 65634 248219 51741 46858 -301225 151666 86182 -59859 154126 -112649
8887 -216772 -48517 -260957 -229418 109803 -67558 -290373 57082 56628 -245919 8208 -181883
8875 182876 -314884 12584 50228 109292 44075 56570 -139015 -162816 -8786 3546 -34346 -277224
8863 -277224 -112507 98426 131413 -222797 -395035 -134258 43783 104035 -71950 87069 9758
8851 402333 -210705 17907 -388767 82551 -131192 167946 161075 -136724 -23088 268394 96454
8839 -16442 -117411 -274396 -77902 63263 33785 44408 -26838 -27316 6454 -78113 98656 -199046
8826 45292 -64184 334400 254097 407825 106606 -302071 104493 95607 32972 -91528 203074
8814 -215478 -43895 -231494 328570 64011 103680 -54208 161081 323918 370383 -383650 -174497
8802 7313 -85736 123400 166622 121484 -50996 24199 8470 -229501 -232509 -215148 -328364 -64101
8789 175945 54874 -30065 165471 -25252 167623 -134970 -150462 -168836 -184484 -168721 -117012
8778 -117012 -550873 312664 -180464 202416 128211 -378957 109787 209346 110697 -120313
8767 -302117 -220179 -367676 107444 -240243 86838 184014 34036 166310 -34374 228971 -35744
8755 -221767 -21266 112497 1099 -35615 -247385 -126680 -131170 -44179 20694 -270704 -181819
8744 -181819 -108215 -246949 270055 95639 11788 90610 -163106 30395 78440 -28199 83834
8732 -191704 -17876 67776 132501 -300908 -76349 257337 -43408 -141602 -149006 -8945 -296589
8721 -296589 -196122 -230839 82524 66767 -232926 -111499 -105395 35160 28624 -16294 96397
8709 189841 167297 -8204 141067 -247475 -127784 -150578 -340358 -114951 6991 117043 -88931
8697 25045 8261 -79036 -286668 -11920 -160301 241911 -18193 109379 -33982 -287247 244871
8685 149613 149816 262947 173106 44101 214411 -198606 -31550 378682 -5875 43897 -441205
8673 -106663 42901 92576 -70216 -189608 75455 60555 11876 -180235 -106551 -128681 97609
8661 -40077 7587 195757 -143669 64442 -300 -149530 3653 113458 -135277 -253094 99467
8649 -70720 -32270 221303 95785 -224383 -11727 -245968 -178864 21363 -198463 189331 -350867
8637 -65056 -96489 80099 48852 -286255 183873 250336 63079 12848 -141534 -17443 -206304
8626 -206304 59051 -173239 -63566 38803 -5095 -51307 -210650 -224819 -14661 16109 -226512
8614 -70677 -49819 -80031 -83521 9278 -187062 29937 76104 36112 98591 -427828 -438301 -225170
8602 -225170 124342 -121975 43721 -382314 -11940 153490 -136823 -96153 2739 89874 -56259
8590 125030 54182 2489 201747 -64520 45670 -10811 10544 -100961 -242804 -241086 7168 59008
8578 59008 -134660 161555 -545806 41796 121212 -28291 -37437 173387 -164034 323263 4311
8566 143456 73454 -172386 -152121 176328 12431 -73362 -140719 -218738 -302329 -62086 -56605
8555 -56605 -104865 87035 -53246 42495 152427 208223 -201961 116791 66528 -11035 -76384
8544 -76384 266815 -89768 232414 -128139 -60841 29868 -114270 -257032 -280329 1377 -4703
8532 -247350 113969 -220697 38982 -201726 -163455 -163179 -137998 -58032 80432 162370 -64890
8520 33870 73524 -237949 -100320 -70874 -720 -137274 -13394 7183 100117 -87298 97436 42158
8507 -443491 213384 85742 -110263 -199624 -181842 -92504 124666 46141 126091 -135849 -8348
8495 -193736 -64108 -75112 7178 -243446 56616 71653 -57514 -205061 139125 -32911 101666
8483 -7692 -61720 121262 -87982 -145266 -84391 26935 -167625 -73335 -158005 -7008 -83114 20941
8470 -283340 65490 70738 -132009 293616 155303 -165744 278834 -97744 290294 92929 -83104
8458 112010 -175533 -173543 170851 -121355 109129 110091 -249074 35202 -98191 -160252 -86027
8447 -86027 -385010 -173304 -147467 21391 -548758 92757 -76474 -159654 94995 18397 -238608
8435 -170863 217625 240963 -145788 286799 -41079 -32536 -151143 176772 20321 -52365 -266763
8424 -266763 -21010 168176 105681 -106204 -241369 -145732 169112 54345 -200094 -408449
8414 -408449 -77547 -134678 73948 -11128 -358079 -33422 46589 -224890 -11524 -270747 158836
8402 88693 -34970 38541 169142 -87949 -451 -21536 303654 -199656 -68301 147331 69225
8390 23828 -210435 114882 145378 38557 -50420 4068 -252615 -129443 -62972 60230 -375452
8378 -68710 -61304 121802 -409845 105836 -213254 -253384 33952 -403862 227149 -228563 -193355
8367 -193355 -236115 -169033 -190976 177682 96549 -212083 -86274 -443067 -2046 -87880 -114925
8356 -114925 -125738 6849 -281944 -351610 8639 -141276 69212 -227071 -240417 103499 27945
8344 97378 277700 46966 -5424 -51793 84550 -165067 56089 -379121 5671 16404 -189541
8332 562310 -249750 101154 -153954 -165507 -55398 195858 146289 41166 97737 79977 -118122
8320 17294 170036 344234 -231446 159574 141727 -197724 -94455 -356289 26560 -64920 -130014
8309 -130014 3756 174068 -281851 195130 190299 88740 25171 -40027 -98498 -192132 95130
8297 114588 -190450 2342 12816 166803 41148 -88753 -19170 169493 205520 128187 -59286
8285 -179435 -30453 -163336 -44879 93851 -91012 245322 146411 -219239 48928 -72891 -159853
8274 -159853 -58905 -184407 -160070 -117086 -199211 155921 -357466 103504 77946 -359305 431418
8262 174288 -146127 124040 -101016 -40904 212709 -17935 -127538 -220944 -198143 -132463 -78302
8251 -78302 -101324 -18020 -256075 -232660 -249876 -13656 44696 102258 -238562 -319641 -233227
8240 -233227 320895 -94190 -213795 -5731 -64406 -81240 -259830 71507 87412 16901 -81213
8228 221687 -240603 104833 -130757 -153673 -120172 -222768 60465 -140970 -103026 -36549 42574
8216 130456 -6117 -149277 5468 234582 128167 -34418 154221 -71640 -88031 272244 55244
8204 35240 203087 -221304 228714 150401 -346576 81484 -3869 -72477 -86584 -192290 8343
8192 80752 86596 10179 169438 81178 -270965 -114954 -213472 -41520 -312 -204213 124187
8180 220923 89945 -49039 144122 -48481 -126113 -41442 -36082 -120082 -184553 -100784 -178156 -250815
8168 -250815 -216604 34710 130113 -283187 -298511 -122832 -65256 -153830 -3577 157691 786 72345
8156 72345 -161700 -148565 -8377 -9148 -130428 144677 71041 -86546 -143598 -191358 341795 -2743
8143 8696 301451 39693 197383 50217 -290625 -214948 203731 -4081 88317 -172814 -214752
8132 -214752 -141436 -50260 -161823 -24701 -176510 -118894 149713 548167 53040 -10852 -260303
8121 -260303 -35996 20158 194803 99155 -23373 12061 21643 -139249 203929 67279 48043
8110 48043 91369 -94081 23530 -148822 191982 253786 -311849 49618 130042 -23694 -192307
8099 -192307 -96439 -66082 -8741 -104768 -1188 90369 -379565 137738 -104336 -149295 -253188
8088 -253188 23270 -380890 48215 -79977 101428 -86017 -246932 84115 39107 -108389 106126
8076 -444421 -128895 -239471 -24530 -35832 297811 -261291 -31364 -211704 -48039 48922 -88170
8064 178118 -208761 92559 -168856 -60280 226447 25093 -65386 117049 182560 -127973 72653
8052 -243841 -184244 -398259 -184012 -133184 -341067 -202903 49309 -62627 -103387 169275 71160
8040 35271 906 60171 382026 -9761 -318312 725 -21013 -28407 -4238 -4238 71626 -64146 154060
8026 -44023 -88138 105827 24805 -197897 1414 -156749 38153 -74014 54604 58318 -24543 -27854
8014 -27854 159831 -96565 -115999 181695 219214 85861 -378735 8927 -123624 -120452 -164312
8003 -164312 -109795 -45010 -73410 -136549 -5441 -116155 -170675 125304 -28126 54886 17856
7991 217685 267431 83237 -79370 -248026 81330 -410411 -13498 4146 -309443 -217218 57637
7979 -199151 228451 -175099 -291899 -12050 -127529 28176 -181451 65696 -97433 -35451 36206
7967 29370 77321 -150619 -38343 -321618 -31720 -25556 18962 -119550 -53824 -260357 106571
7955 281884 50329 -27879 39252 -10588 -2430 -53960 -36812 -100987 223440 29335 -156655
7943 -276174 -196387 -115056 33183 85818 81209 -23190 119439 56955 -273004 67491 95207
7932 95207 -67597 -200412 282989 318 -194000 111355 -107143 -433582 -78952 4147 -141881
7920 2177 208121 -252039 241153 126248 222943 211974 127986 -22469 62946 -79165 -226001
7909 -226001 -72433 99706 -52397 -200046 -118789 138704 -132979 -62873 -202589 -127592 -87508
7898 -87508 -34086 82852 -191761 -316389 -148063 -207604 111928 -44666 29162 77209 -444416
7886 -17967 197465 -322706 -7467 -46393 -54108 186838 22994 -7703 -182636 54506 85796 28243
7873 13124 -88633 58873 15421 29914 -361503 69844 177497 -114455 49942 87862 -273329
7861 -176088 218732 -229641 66944 107404 57522 108040 97432 43563 1306 181073 -231333
7849 261684 -505815 208643 -39870 -33882 -284155 173484 -94885 -59303 -264620 123419 -10342
7837 -115700 86208 -304037 7556 -76439 -256221 -249503 213426 177410 -332537 15931 -61806
7825 -10756 -208181 32801 -277006 -44465 -96856 120936 -88051 -68812 -168333 147161 -101634
7813 -254358 -42982 -49185 13702 -36763 9355 -23307 -102950 181606 232790 427567 -126383
7801 -304112 92252 206548 221105 -329247 -20150 -493328 180159 -131220 -75346 99639 -145593
7789 8659 -212183 -39330 -60125 -192357 -1836 185868 -52755 18517 119998 52049 82121
7778 82121 -67927 -228051 -44972 -107064 6682 51037 37700 188944 -236013 201222 -97988
7766 -143382 -40335 -729 234549 -49680 -87179 -158500 -422270 -323304 -118171 -35198 -13544
7754 90893 53516 -160547 210185 196511 -70331 51097 17903 -93109 -25029 -93862 297245
7742 -193000 -176471 -52119 179032 -289493 -150567 -29871 147036 271772 292400 151738
7732 151738 275293 168380 -73923 -105528 -25989 -166935 -200773 -389 -370069 -244698 -108945
7720 107757 206013 -116655 -29693 -224551 -261778 -35764 8154 -45365 -15986 -19840 -120083
7709 -120083 223731 -128248 82906 128593 -42064 98058 -111247 -435110 -137505 122824
7698 -120051 -359389 29659 201499 -35363 46922 -60022 58616 -331630 -136179 -207778 49197
7686 128807 -150756 70174 62528 19466 245763 -111175 -59135 645 -407209 42877 -422437
7674 -215340 171898 -35437 -91850 317120 -275130 -21058 221215 -247279 -244065 -55208 64690
7662 -377715 207094 -132770 -73314 77327 -27926 -417882 -337768 202127 -39341 -216029 -217279
7651 -217279 88906 -77562 -139525 -82034 81235 85631 -30182 -17642 3740 -171420 -77037 -177648
7639 -177648 -300378 235765 106177 -215780 29115 -118156 70025 100436 329404 -155849
7628 -63601 -362439 13079 -61590 -103786 80688 163264 -70937 150267 113117 -212009 -219634
7617 -219634 -67074 28546 157490 -98224 35936 202096 -55255 170604 -254302 -60769 -122236
7606 -122236 103344 201895 45265 -149118 -73401 -35270 -124732 -35574 -39880 -449773 100117
7594 -154366 -1041 -255874 82050 -354480 207081 -77725 -49276 -26040 -208140 -22265 87999
7582 62376 127882 -34880 -165045 -182046 -211384 -103393 -51539 282094 69002 -172752 -83244
7570 102889 167923 -8942 159993 279028 -102237 -186692 -49590 15158 -91981 131520 122716
7559 122716 -79438 -73768 -130486 217841 -50228 98652 37251 97060 93608 299072 -194477
7547 -76181 -379811 -7909 67158 102185 417301 20467 84226 93630 -47468 204669 102160
7535 -16942 -9518 -108578 354822 -173160 249163 52938 -27098 225834 -195075 65139 -51239
7523 138830 -32645 -89421 215912 33487 78015 22055 -148758 100086 -40050 225838 136183
7512 136183 193859 -41921 27406 21946 167882 -88121 359722 53096 184076 -60843 -227580
7501 -227580 219185 -102346 -91607 16553 -50676 192964 16417 -24381 96105 -438601 -147852
7489 -189927 -159119 -122275 4556 68745 73508 -138773 303555 7979 -466611 -190749 -201859
7478 -201859 82965 145313 -56133 -64046 -74915 -69386 -66554 -10979 25739 377867 311967 -230261
7465 -49820 3222 -136243 -90017 17520 -81070 -183671 -172917 -95801 -152558 -229758 -117163
7454 -117163 111220 -130106 106733 -89618 570758 291979 91947 -54718 -10395 114552
7443 -208650 -3666 -66427 -222298 88234 -146884 60102 -24840 6897 -171098 320164 -121110
7431 133910 -82943 -104061 -234630 229601 -57458 -138178 -14867 -240348 -193362 -43237 -134292
7420 -134292 -20545 157136 -173489 -185334 -209112 -158610 -63020 77593 -220798 114297 -175162
7408 10063 -92345 -276800 -57563 -20270 42385 58871 84426 -73529 -191357 374793 -11886
7396 -366938 -158533 68066 26849 26572 -93966 43004 -50389 -117694 37575 -71403 353212 -93318
7383 -138437 93319 251019 106730 -230363 162116 46352 18594 -118849 -237019 18706
7372 -132465 97517 39676 -215411 -29372 85288 112876 141638 15951 409 -225776 115241
7360 53743 56788 9274 119327 -97471 -237579 23959 -137251 80327 -197477 189002 187380
7349 187380 -18122 344595 -43526 -237165 6292 -214037 -39032 222640 64148 -169940 -221223
7338 -221223 265310 -177962 90173 2811 -104924 -124888 44068 -207918 -127609 -120430 51563
7326 31087 74713 -45932 -88374 -275234 -124008 156930 201405 -211578 285288 -178061 59516
7314 298945 -217264 93076 -269141 33068 6080 -103909 -213057 23331 -106809 155289 -2557
7302 -14684 -2368 -191866 74693 -263832 -103567 82799 -80673 225578 150995 226222 -43413
7290 -89349 -14078 -189418 79528 -130565 196521 76546 -308201 112230 -181388 -80825 -117070
7279 -117070 113147 213431 -333174 -165750 -26609 103493 -80208 -271339 -15308 179644
7268 33434 63920 74071 -56155 -155177 -18411 246668 -51626 149163 -75804 -28460 17515
7256 -233718 148894 150012 -52238 -269948 -97405 -60038 148582 99089 -67894 -281089 -112402
7244 -14777 44174 180524 -60493 334313 -260432 -89732 -304008 -88350 259359 -12876 -257548
7233 -257548 78131 14645 -139035 -226567 4548 -232369 -64391 -116047 104541 -27260 47992
7221 -100038 221263 -124408 160167 -172296 -65437 124290 125614 -4324 -295844 -305548 -8607
7209 -48562 320976 -127251 -303543 -414538 -8010 -55706 228814 -171916 -74358 49572 94795
7198 94795 64372 -254920 -45261 -197055 288867 16453 28281 -179102 -219549 -11037 42375
7186 -71671 161093 261678 50573 350395 184126 15001 -209553 -104397 -265191 -40382
7175 229254 -45334 58536 17427 93024 -138636 -49323 185705 217647 -41540 37378 -96702
7163 -47273 -305161 33317 -151613 47979 1281 -198729 -178493 -275455 -92702 170635 -341280
7151 260652 -178935 97591 -188050 -164740 227840 -400959 39879 -53984 -105478 -568416 99166
7139 -98853 354517 -69477 -47683 -95168 -115771 87913 -61113 67906 -184541 -152740 -76944
7128 -76944 -65547 -139171 70364 14794 -347597 187506 -156845 -117584 218124 159199 144002
7117 144002 -192869 -96790 870 -45381 -101146 271930 280748 252299 104462 13191 -280429
7105 -203318 -90289 -168921 437930 15668 -56491 -210521 -188028 -415882 -83122 78438 -147961
7093 154349 66557 -281497 6334 33360 -56118 -7937 -94482 36687 -274251 -284133 -204574 -151521
7081 -151521 104804 169890 141710 -155353 49828 -20419 -125304 -111699 -84186 310936 -337804
7069 -151466 -202484 13274 40381 130359 -193323 -228550 344599 -142513 161138 64026 -240232
7057 77147 -110399 18574 188574 -189537 297135 366168 -49764 -71052 121168 -169836 244787
7045 -374437 -193466 -16951 -137406 -244467 143143 19886 29047 307628 -347108 -62739 -155766
7034 -155766 -4488 123793 -282679 -74577 251525 -168275 -73548 -100835 -63934 37794 182882
7023 182882 -10803 -244772 -193722 287198 -68991 -15479 310024 -214403 148926 -47883 98204
7011 53414 -251269 187356 100953 -104010 310644 -141801 -193686 -176524 -156636 -228635 184323
6999 -132518 -115840 11807 -227536 -117028 -109581 69574 53850 52271 16030 155407 -35507
6987 -72819 -5675 190488 -303102 -32303 -3276 -174635 -111318 -105269 138789 -135033 110044
6975 -51562 8388 93632 2092 309936 40018 -175417 -109934 321367 -164928 67674 -2079 106731
6962 -146568 334483 270102 -151471 -84078 21432 -221210 149135 -152125 152038 88949
6952 88949 165587 -223542 194074 278738 -157246 -175803 28162 32679 176668 136948 344977
6941 344977 -97427 -102534 -242475 -52357 94657 36734 11713 171643 -248671 61167 -183491
6929 -219557 164940 -262009 220721 -91221 -204803 -286184 156783 158974 -193296 224236
6918 -133031 234571 16717 -286374 -105367 -114350 96168 -218356 75664 507760 -118576 -208178
6907 -208178 32185 -167018 -41500 124611 -216193 36629 207310 357481 113592 -10292
6896 127906 8164 -167133 -171867 -99954 30844 -235031 319745 -25516 126386 -116111 -109503
6885 -109503 -209682 -165201 -10732 -233009 31793 68843 96907 -99378 -151058 7299 202716
6874 202716 -210276 -220727 -172977 -59221 92952 -279069 26700 163070 45458 135859 128016
6863 128016 75435 62870 -84945 26585 101068 -166430 -2194 167378 177557 -239994 -13572
6851 50258 -180782 98663 202800 -241264 78408 215716 -242188 145206 265363 -236446
6840 -173581 -33087 121704 80912 -180453 -8644 -304066 -397445 116337 -72677 -91713 142310
6828 219946 61153 -97708 -120137 -9352 -36320 -26751 161242 -93059 116179 -326127 -48995
6816 114818 -30141 -131550 -232636 295986 -143717 -204020 -74424 -186221 -15353 -271008
6806 -271008 56344 136160 22821 -47106 408002 -368702 -90171 -188620 27860 299282 -170781
6794 129022 115781 -1930 -7354 -72662 298734 39271 -182904 21478 -16701 -201394 33766
6782 -10261 -78202 -22723 60427 -309734 214196 334561 -14152 46325 34151 -59908 147045
6770 -206945 54475 123341 -401647 246162 -43130 182529 128723 -357561 80119 -48915 -230038
6759 -230038 -43576 22925 312573 -125873 123046 112192 92334 20630 -375381 172724 160442
6748 160442 -126085 186731 -38866 -279007 -70043 -138178 -30942 -81310 -194108 61927 -7238
6736 -174500 -192589 24655 -90481 -168052 104628 -24937 -185697 298569 -49759 -71280 -29813
6724 72367 66697 89664 156416 -224036 -94132 -195864 143970 118728 64883 -12610 -325462
6713 -325462 -334194 139430 64015 -27945 211710 122180 -104562 -171190 227627 81071 44400
6702 44400 103316 -388921 -97138 76455 369212 123692 39638 -10007 -205046 -219059 28195
6690 -79408 223502 100759 29375 -81404 14885 -38374 -38161 -109514 -74846 29550 -170628 -11579
6677 -70280 180592 -112984 74261 118126 -187743 99654 419090 76299 195609 93395 -213234
6665 92381 -333686 -203968 -112686 15069 -142692 -139291 41719 -80334 194966 -219370 292145
6653 -291672 134825 94526 -125522 -93315 -92630 52200 -102276 -292191 -26749 -340972 48490
6641 -208002 271436 90856 -449549 -183919 -32810 -59510 -94370 68467 -205745 -100355 -38803
6629 -69966 -53482 132140 197943 -136007 -36387 215841 66978 229222 189269 184276 61813
6617 332099 113143 -228911 -42364 -145038 -35549 -165962 19599 -102385 148000 -92525
6606 20100 -19147 61896 105100 64738 91624 34232 75653 -134665 -342326 -213323 16378
6594 -231234 -25478 -108984 45771 50332 -171792 -55016 -55875 -89244 -176122 -288263 211864 -187525
6581 93836 202840 84327 4155 36011 -149678 -212636 -45560 111097 231580 -62747 10919
6569 -222483 92706 -49784 6232 197891 190472 48684 -28555 -86687 41896 73291 -53182 -192304
6557 -192304 -194869 -204995 -12188 87135 134416 394808 111323 -7421 41399 260003 -255229
6545 -197316 -62257 3198 10022 -238348 -104299 89265 19827 143627 -240701 91158 -180502
6533 49479 -137287 19871 398102 -288268 -53845 100787 -32723 81060 342181 -298177 87671
6521 5665 400190 157101 -53122 -57816 52498 -146473 -46319 -10337 -313611 27161 28178 -119053
6508 -8604 -324488 -61160 81816 81241 58297 -127318 102196 73327 -293125 -8094 59363 -143177
6495 -76187 -76670 46328 -211002 -92 134150 -74618 -329547 60821 -21618 219150 296191 -158162
6482 -63889 14764 14137 -80264 -315336 -45532 90005 30972 27386 -135824 60986 23778 -42565
6469 -129439 -133617 -158988 -74124 -130943 106564 -187101 -109534 14288 113840 148172 164227
6458 164227 258488 49684 -83442 -263310 70731 -50181 -85626 -117773 207930 -25639 197820
6446 98426 -93836 285340 -187777 -163116 -38163 283799 262445 -165530 165851 67743 -203004
6434 -225989 -163485 170249 246142 57222 -57161 66739 -247832 -125398 48964 29492 377034
6423 377034 -2473 -56709 -27865 -190232 179495 103716 -292022 -70516 -90006 -77150 -223761
6412 -223761 -335187 88850 -30793 126780 -97260 -46886 -210432 -198169 62569 -2762 19904
6400 -150043 226892 -198215 -265210 186810 106851 -324151 267555 40696 -355112 -96049
6389 -120873 -59952 108481 -20705 -190981 -62987 140993 67949 143490 -38129 174386 -102381
6377 145525 -61817 -8720 317218 -273750 176080 -106864 -108576 -389755 -114837 -147011 493405
6365 -51329 -24140 -118479 -219459 213081 240390 -266791 -61012 64423 -111510 -329499 -108734
6353 188178 -258930 39124 -85828 156269 66640 127773 300747 -63900 -457268 -340647 -14435
6341 76349 39170 1137 117545 277432 -171085 9314 78723 -220879 72947 80205 119209 200303
6329 200303 26746 -197001 93706 105541 105918 -116516 166760 7523 -182312 77168 117437
6318 117437 1197 -164770 -207119 121608 116971 -196393 -20128 -22155 -180206 134488 106991
6307 106991 -75110 112984 230495 75630 -131462 -34631 -8343 15508 -7755 -184973 5251
6295 66181 -155782 227405 140491 221393 -77989 198851 -26419 -61413 -169498 -227150 -29503
6283 -10299 746 -104537 -110376 -87796 -106931 -44452 143233 96703 -77251 88217 29643 -85700
6270 208743 63747 10062 24533 -61719 311028 -274988 84883 110323 -149204 381147 304946
6259 304946 -126289 40607 105128 107569 -134742 -139081 -84254 -101729 -18781 18100 75380 80100
6247 80100 -88156 16021 -93752 -60114 214516 43753 -206362 -101974 58724 -243300 71195
6235 24918 194609 -134862 48445 -292892 -159823 251579 229247 -98768 -124365 68673 -93814
6223 79715 -272903 -170014 68704 -1349 -265982 117645 -305790 20210 72461 -84803 -18880
6211 37963 -1955 -226673 -288183 310952 28623 -200190 -60055 -138564 -96035 117706 180563
6200 180563 -277262 -8852 -105368 222802 151534 -119709 34527 78135 24107 -188043 -114361
6189 -114361 -323109 -265807 -154093 -203268 -42213 -243902 126480 -202302 -238799 -313623 -126109
6177 -255853 -84585 -27408 -87570 415401 176272 74783 -221725 85393 130369 160777 -282866
6165 4076 -36214 277817 110849 -85129 -68372 -3709 262410 -101092 -18689 -11447 264728
6153 -515817 21272 -143002 208026 50128 -111042 232019 138846 -57437 70486 124881 175649
6142 175649 -244223 -7125 -222440 163029 -46070 -123649 -168706 84914 49547 244743 -128293
6130 -170369 109775 137416 106276 -11706 -118247 68969 -74263 95983 -91720 -77454 -21334
6118 -148639 297822 -84902 -178775 -94378 -172323 64598 -38604 151205 259422 71895 146832
6107 146832 -57036 137750 -37912 177408 -7066 -91503 -172667 43119 -114928 -161169 -267823
6096 -267823 138118 -300326 77013 -64885 297836 -70800 -70643 6242 54977 82348 -76385 101502
6083 -1514 -7084 15694 33029 81001 134392 -126770 175165 -170020 283295 51203 71023
6072 71023 -92891 -70452 -383159 -213094 -68376 -85781 -72584 -340563 146275 -74627 157005
6060 129286 227659 311899 -49258 18992 -114858 -106246 217646 375876 -263798 54211 -108289
6048 -21617 23328 136767 -254136 1921 -45275 -304157 50383 5358 -374439 -234112 27515
6036 -195926 218446 161749 147558 57526 170197 199005 41610 167378 -132539 331116 -51517
6024 -93382 -84330 -211688 -164945 177197 29082 275621 65244 -330461 129577 135610 -98978
6012 111401 -105610 -185484 -245871 79132 51431 -1038 71585 -259613 23846 -186101 240359
6000 -409745 177868 -18916 -26478 110320 -66599 275484 13201 -216696 134611 -174807 148253
5988 -102534 -234843 11096 42015 319849 3344 -235652 18908 -238536 62709 80246 -131425
5976 101607 215655 -42665 -31899 271188 43422 207037 -110800 6240 -28821 -55189 279820
5964 71367 -176278 -61063 179533 -237374 -59407 -77240 82895 -253644 -73219 -86280 71511
5952 -287103 -115974 -26057 -148428 -69379 266764 -58721 -286372 -17847 -250148 217304
5941 346420 -94511 249928 97996 61524 -21493 169707 -252648 168944 32524 66058 39095
5930 39095 -110917 -152540 142812 22101 -244914 -92597 -108080 -137009 197822 40849 -40010
5918 325817 249904 31566 13994 -118593 -292544 38935 -409862 -160187 1013 64166 152985
5907 152985 -274674 -150839 234677 81224 188733 68538 -156831 -101356 -67182 20780 257387
5896 257387 -39357 87544 -100314 73088 -58542 -32712 -76284 -79887 -174403 131702 71278
5885 71278 262382 -186859 147859 8994 68486 207933 25465 327632 -310404 -71123 -362774
5874 -362774 136224 -163050 129512 129671 -140146 -123791 -154489 64644 72041 265047 -31849
5862 -134511 -145483 76024 -124575 178421 -252162 188888 233845 -217434 11524 197566
5852 197566 -312303 -233029 -97774 -150727 -144256 96791 -451518 -48202 253946 142345 -255370
5840 125718 111945 223305 -32031 -79325 -63499 -39073 -190709 228601 67857 -3250 -231715
5829 -231715 385311 -93289 92038 34813 -127111 180076 -291908 -214576 -8258 188288 -158218
5817 -160710 209465 60912 70788 248742 -7220 165603 123372 23211 -129220 -178022 102771
5805 318401 -144088 -108222 137336 87447 -41966 -26948 314244 247037 -20721 355442 74859
5793 -186117 -138980 38146 -298767 -222742 -247345 -225235 207239 -6915 -144831 72302 31959
5781 -18503 6156 39488 48130 -224771 -154093 5949 -79915 31806 -248049 -68340 -103833 158017
5768 -20431 169061 -57040 293958 44179 -90309 85900 182489 542696 -22133 -107775 -92686
5757 -92686 -54360 -129059 281612 -11715 144620 -163912 174719 145309 266181 -202651 22870
5745 302836 -27425 -124260 -45276 -25620 53269 -47318 -7295 -37418 -245780 148778 -111498
5733 26321 88690 -27590 356868 -230567 28120 130878 -294112 -172107 -19908 -148099 78628
5721 -35801 -18312 56325 -388112 -147603 -43993 -264375 194928 -1803 296384 131275 -196876
5709 99613 -44812 102887 367981 -9376 -187002 -6088 30525 -86573 -146503 -65705 192545
5697 48001 -2857 236850 221423 -50092 -18789 -118255 -135480 -104843 -25727 206437 -30769 -103997
5685 -103997 56753 -149402 -104221 -47753 100162 226639 87861 195195 114330 -48246 -192660
5674 -192660 172736 66644 -368837 360244 161132 -101285 -92464 -11928 -40149 -60166 35575
5662 177818 52506 -74085 -16953 14363 116877 -412915 57481 361267 -65829 250016 -185607
5650 121358 1098 -292507 235320 5894 3394 -197479 43198 -95362 61817 -156861 32436
5638 114094 -92191 253486 25215 -89457 -78342 -80599 -89668 301061 -48333 111262 -63045
5626 -270303 160195 -186755 -22206 66559 -69687 -82685 65370 -597711 -63476 -45113 -179042
5615 -179042 42230 124697 -323739 95892 -24227 -196224 -56128 -27492 40385 -549355 -31748
5603 112157 13036 23822 -64021 -51790 -44466 -215594 -120249 58888 56699 -127031 -152460 68385
5590 -27140 -309906 65681 -146955 121461 -69137 270193 262205 82041 335418 -201058 286970
5578 -21217 10446 -283936 248369 170003 -247378 45909 283530 -335970 111057 -53708 -130965
5567 -130965 64603 -33292 -233946 -1552 -150536 4857 46769 -238800 112066 111614 193226 18668
5554 -88896 -170656 2044 -246855 52912 -420374 218715 -145600 188078 -110925 18036 4500
5542 -11453 45651 166875 -171719 10441 5872 1504 43116 33937 -341757 192690 -74570 78588
5529 126472 164835 99579 238207 -140413 225536 -273356 -122160 -92041 -167030 -288639
5519 -288639 -78700 -246559 43439 268786 -1880 -288957 21718 -26170 -71105 219211 -134361
5507 59078 -4314 -108744 -251108 -65799 -86050 197224 -176485 31335 -103727 -347377 216373
5495 185130 33710 305303 -194951 -127056 150596 -46134 91274 76874 -123520 193725 164891
5484 164891 -118810 13695 -358860 -63998 84645 -28135 -79282 221391 351616 -11898 -40054
5473 -40054 435883 -331566 74509 -37733 121912 -178123 -194366 422702 -84242 198274 -112733
5461 -196672 68510 -88888 -172162 -113134 -81971 -67719 257434 3878 -95711 -40691 58645 18762
5448 28491 -255293 251848 -158224 381274 -175601 -92031 11766 -35230 127007 140617 -145097
5436 23957 43331 249415 -7158 257840 -100020 60055 82116 -330765 -164398 -70603 100449
5424 116652 218526 -74946 -67386 123425 66853 234879 192883 -331679 182021 31777 90865
5413 90865 57847 197389 -109893 248559 -116175 -86045 -193256 -146764 -190006 -104157 -173429
5402 -173429 242553 -25655 37356 169889 -149168 -232603 -288028 -14818 -128921 37283 -61671
5390 -133362 137718 -145868 -50203 180010 279262 -10104 -73596 -132953 -162024 164110 -186648
5378 -68962 -155312 275664 55949 35607 -283383 -30886 -1896 -29993 54732 111870 -195748
5366 -328520 78803 146941 -16425 8915 -1138 -188917 125837 -84868 -177409 -166710 93591 185268
5354 185268 -86473 75560 -40210 -182303 -353401 -73197 93421 14652 -125848 -90865 -117294
5343 -117294 -154369 287137 236913 15222 39225 75782 -228897 301796 235868 578856 -815
5331 -175961 69062 131749 -59970 -215879 -176159 -181943 304947 -102782 144028 114532 77191
5320 77191 101843 -164646 -152198 75534 -171317 38600 54271 -93647 -220078 -316321 30851
5308 74247 58660 -238241 -111553 116841 -106226 164561 -126476 186300 -72501 177748
5297 84937 379287 105625 -173951 183746 229533 153165 -113882 -61984 119965 126411 6440
5285 -73188 -21723 -143632 80668 286277 131279 -186939 -79138 -150971 -120413 284187 -38415
5273 32304 -102857 76483 13360 -930 -199029 -169217 -336501 -142741 71960 137737 85892
5262 85892 104686 -213491 296992 -261231 130143 232595 82810 -255405 12865 211288
5252 211288 3494 179404 100403 128277 24640 -8002 -41635 -61133 20804 271581 249918 -102445
5239 141158 -339240 -33044 199566 -244277 59093 259983 209615 -191717 91374 -116774
5228 163568 31032 -171572 57529 -123029 -471702 -118723 139688 55967 83033 106219 26950
5216 -84902 118783 -229696 -80636 144861 202544 80260 145430 -80421 -160385 113418 -232921
5204 -285569 -183940 -201938 85531 -265690 -144113 22755 -128963 38826 199706 48739 126254
5193 126254 -14583 -207460 10966 46317 -382001 328380 -11348 -80088 59595 -87172 -112292
5182 -112292 48935 -248039 73892 57946 -51635 -28506 313129 44219 181917 44832 -264341
5170 244416 -210855 -184376 398091 91065 -42417 92052 131236 35175 -61857 -181931 -83721
5158 148996 19552 -49786 -31879 -105438 195804 70931 -290011 177294 -50323 -51677 -207294
5147 -207294 153101 109654 -169858 186283 9380 300998 -69175 32408 8923 -183561 4414
5135 -124089 -263729 78824 80112 -94904 -129296 -10435 -38508 -58308 -94292 -353212 -27728
5123 -36901 256483 75299 -68158 -374992 -227243 -247160 -240708 -79312 67074 -58842 69883
5111 29448 -128471 -16170 82920 -249662 -296932 -41077 -212690 185638 -229230 257766 66586
5099 266045 206748 -116663 -46641 -44987 224322 65082 -38311 254426 -24381 -42034 -174717
5088 -174717 -92298 14954 81670 -144232 217974 92039 93192 -101488 134403 148770 -98633
5076 250204 242683 -47601 80505 -15715 -173875 -32995 -148345 19838 28157 23312 143919 375
5063 113708 -80043 -170060 207583 6699 146240 -33924 61252 174583 -38818 103886 -127082
5051 111452 -200675 -114862 -41481 -194831 -133604 82988 257390 196608 -10111 13717 -131023
5039 151252 412559 -111983 -107442 -16585 -237796 133747 -33015 -70032 -68524 47338 -166128
5027 -262559 -11702 -10014 -406510 -188025 76945 11804 -241156 -48547 -262853 90577 -172334
5015 198262 -223734 -137415 270451 241201 -74761 283194 198471 440584 23896 31474 -6919
5003 227671 160818 -118202 251286 271055 -154310 80827 57766 63192 110965 -92459 8608
4991 119861 116528 161798 112954 -146347 50071 87271 166214 -38412 -187040 360 76879 -152119
4978 151704 -93584 4729 480177 98470 214148 16171 -243761 27185 -65427 97611 340772
4967 340772 211475 119071 -138856 -39316 -336030 -33955 79661 -69700 -69594 -227976 -272599
4956 -272599 155644 -79540 143981 -18288 -214836 -349119 -220124 265487 -3857 228225
4945 34914 284120 -149442 -83416 -39001 160842 219276 -211422 -67314 -110623 -42803 291223
4933 -306950 -42421 -21841 -183644 211204 203446 158250 102715 32010 62939 -20361 -307616
4922 -307616 -304721 -115953 -275520 -5697 -194817 331276 79966 12328 -16688 -35909 -25091
4911 -25091 100262 -331008 291411 221343 -2535 267505 -202327 -76384 -60701 54199 -1648
4899 229103 -2067 85678 -24715 135836 18879 -139782 -46291 92403 -238006 -110381 -88736
4888 -88736 -48870 -210690 165929 165683 202957 -243370 -163421 48833 58378 183995 -1703 -37826
4876 -37826 -116186 -152722 268542 -99899 -11852 497196 -113346 -192734 -97045 -318647 159891
4864 -169303 -97339 212120 12333 -130615 94852 -11744 119144 64984 -15629 -24820 -105754
4853 -105754 -7635 -177734 31906 -14529 -142948 -36905 -88933 108016 44212 279698 161062
4842 161062 -37991 -204713 64560 -167635 97179 -3001 81200 -39070 220922 14137 308610
4831 308610 257286 -89166 -90951 1792 122642 -83147 150775 -64518 207192 13112 190807
4820 190807 -128016 -213431 -42095 6610 -297382 200674 307324 209433 -226922 -103208 63051
4808 123251 299712 110102 -85987 82164 -191978 192791 158741 -43356 150627 -134846
4797 -112779 -290217 -118537 166628 -22851 -43410 -124698 59391 -225716 -260519 -78630 337730
4785 196347 131480 -94912 224150 137811 246931 46632 209117 -150215 210184 -130189
4774 30305 -232526 19530 44984 62766 267484 -23866 -122935 -51783 -177638 63149 103213
4763 103213 -206443 171799 -274142 -63178 75859 -234584 -228615 -77792 49401 212488 -346072
4751 25209 167745 -76100 -237850 -100444 -49119 54067 -89527 -33997 247869 -142667 -128426
4740 -128426 -192252 -291330 73429 -447956 -85159 -18781 21440 -49639 -410609 41255 428965
4729 428965 199983 -114146 -17721 -121333 151208 148631 -116652 10382 160923 25992 186189
4718 186189 -210167 -48696 -76119 -115347 -192182 163045 -244307 76392 -143743 66878 44397
4707 44397 -37106 331519 21852 74977 -92464 -316363 -105294 15938 122101 86506 -229952
4695 -33088 -263005 -35443 155496 -87265 -76952 105043 241693 12192 98020 -152529 249437
4683 114626 74126 137922 -181344 -276709 -117275 194712 99389 -170 61228 285909 22429
4671 -113074 -41404 5837 398883 125374 72761 99625 24739 108317 -35422 -120777 138948
4659 -138635 116245 118430 107002 201369 131722 -19601 173773 -62514 236985 -21508 -186059
4648 -186059 -106390 -78774 113963 35986 -182525 48381 -124845 111061 75304 -91929 -52418
4637 -52418 -19691 9485 -74342 244924 41542 188217 131832 -109167 55423 156593 -102070
4625 120581 25282 -148794 277570 -43367 -8317 270550 -171660 60272 273553 43881 -262084
4613 274765 -76730 -119239 160775 658 -28473 115271 69079 140892 -196062 233499 258372
4602 258372 191734 -97309 -109810 11048 -30373 -198289 58374 -20044 -286356 186508 287663
4591 287663 -103190 29424 14948 160066 86236 -140109 100737 -34336 272419 78776 -27229
4579 -188874 -128915 -150015 -116543 152449 70477 -116448 -151916 206702 45833 123197 38146
4567 389587 -21387 75678 70786 -208252 -25556 -207173 155487 -82822 -77671 -150753 -55621
4555 -292470 49660 -52902 -152026 -24774 73813 326889 265134 2646 139114 48102 -206693
4543 -34156 -157434 -138191 -126017 -33166 -230082 107111 -102029 82881 -15143 -26817 -275505
4532 -275505 240660 -242958 -104564 -291169 -40407 60868 21723 125307 -209669 -113956
4522 -113956 109919 72170 -114060 -299054 168640 68642 -105844 -14075 22280 161269
4512 161269 178229 -21382 211563 -28380 -7526 -80588 14570 -232064 47737 62643 -59999
4500 286015 -91051 -240112 -133346 151842 -110695 57551 -88089 307596 201879 -92318
$$ [...]
##END NTUPLES=NMR SPECTRUM
##END=
