##TITLE=NES1063_159122.0004_001_9704314_vr22o5BivX
##JCAMPDX= 6.0         $$ Bruker NMR JCAMP-DX V2.0
##DATA TYPE= NMR SPECTRUM
##DATA CLASS= NTUPLES
##ORIGIN= BRUKER
##OWNER= Administrator
$$ 1.72 TOPSPIN		Version 2.1
$$ 2016-04-30 15:48:40.677 -0700  Administrator@X
$$ Compression mode = diff/dup
##.OBSERVE FREQUENCY= 400.02188249412
##.OBSERVE NUCLEUS= ^1H
##.ACQUISITION MODE= SIMULTANEOUS (DQD)
##.ACQUISITION SCHEME= undefined
##.AVERAGES= 8
##.DIGITISER RES= 22
##SPECTROMETER/DATA SYSTEM= spect
##.PULSE SEQUENCE= zg30
##.SOLVENT NAME= COFFEE_meoh
##.SHIFT REFERENCE= INTERNAL, COFFEE_meoh, 1, 14.98509
##AUDIT TRAIL= $$ (NUMBER, WHEN, WHO, WHERE, PROCESS, VERSION, WHAT)
$$ ##TITLE= Audit trail, TOPSPIN		Version 2.1
$$ ##JCAMPDX= 5.01
$$ ##ORIGIN= Bruker BioSpin GmbH
$$ ##OWNER= Administrator
$$ $$ E:\/data/COFFEE/nmr/NES1063_159122.0004_001_9704314_vr22o5BivX/10/pdata/1/auditp.txt
$$ ##AUDIT TRAIL=  $$ (NUMBER, WHEN, WHO, WHERE, PROCESS, VERSION, WHAT)
(   1,<2016-04-30 15:48:33.411 -0700>,<Administrator>,<X>,<go>,<TOPSPIN 2.1>,
      <created by zg
	started at 2016-04-30 15:47:27.505 -0700,
	POWCHK enabled, PULCHK disabled,
       configuration hash MD5:
       21 0F 79 D6 B3 7B B4 F6 88 20 88 DB 03 48 BD 9F
       data hash MD5: 64K
       6E 58 05 99 90 A6 34 3E 0E 6A D7 2D D8 67 68 9A>)
(   2,<2016-04-30 15:48:36.661 -0700>,<Administrator>,<X>,<proc1d>,<TOPSPIN 2.1>,
      <Start of raw data processing
       efp LB = 0 FT_mod = 6 PKNL = 1 PHC0 = 0 PHC1 = 0 SI = 32K 
       data hash MD5: 32K
       AF 66 20 9F F6 8A 7B 68 A4 E6 F4 29 36 F0 BB 40>)
(   3,<2016-04-30 15:48:36.958 -0700>,<Administrator>,<X>,<proc1d>,<TOPSPIN 2.1>,
      <pk PHC0 = 93.84521 PHC1 = 0 
       data hash MD5: 32K
       09 FF 02 72 5A 45 6F 90 B8 7B B7 01 7E 16 C4 28>)
(   4,<2016-04-30 15:48:37.067 -0700>,<Administrator>,<X>,<proc1d>,<TOPSPIN 2.1>,
      <abs ABSG = 1 
       data hash MD5: 32K
       F1 5E 8B CC 13 40 98 8B 96 26 A1 D2 1D C2 B8 FD>)
(   5,<2016-04-30 15:48:37.130 -0700>,<Administrator>,<X>,<proc1d>,<TOPSPIN 2.1>,
      <abs ABSG = 2 
       data hash MD5: 32K
       5A 7C BC 8E 63 00 BE 03 53 0E 0E 23 FF 84 8A E0>)
(   6,<2016-04-30 15:48:37.177 -0700>,<Administrator>,<X>,<proc1d>,<TOPSPIN 2.1>,
      <abs ABSG = 3 
       data hash MD5: 32K
       09 B6 74 E2 92 B0 B4 4C 81 77 08 B8 33 78 6F 8A>)
(   7,<2016-04-30 15:48:37.239 -0700>,<Administrator>,<X>,<proc1d>,<TOPSPIN 2.1>,
      <abs ABSG = 4 
       data hash MD5: 32K
       91 A5 6A AC A4 5F 88 75 7A 59 9E 72 6A 35 00 30>)
(   8,<2016-04-30 15:48:37.317 -0700>,<Administrator>,<X>,<proc1d>,<TOPSPIN 2.1>,
      <abs ABSG = 5 
       data hash MD5: 32K
       76 A4 0C D5 A6 51 62 0B AF 3A 5B 9E 9E 24 2D 5D>)
$$ ##END=
$$ 
$$ $$ hash MD5
$$ $$ 54 B5 D9 21 A8 A4 64 66 FB 26 2A F0 D8 FA 01 54
##$RELAX= 
##$RELAX= 
##$RELAX= 
##$RELAX= 
##$RELAX= 
##$RELAX= 
##$RELAX= 
$$ Bruker specific parameters
$$ --------------------------
##$DU= <E:\>
##$EXPNO= 10
$$ [...]
150 150 150 150 150 150 150 150
##$TP07= 0
##$TPNAME0= <>
##$TPNAME1= <>
##$TPNAME2= <>
##$TPNAME3= <>
##$TPNAME4= <>
##$TPNAME5= <>
##$TPNAME6= <>
##$TPNAME7= <>
##$TPOAL= (0..7)
0.5 0.5 0.5 0.5 0.5 0.5 0.5 0.5
##$TPOFFS= (0..7)
0 0 0 0 0 0 0 0
##$TUNHIN= 0
##$TUNHOUT= 0
##$TUNXOUT= 0
##$USERA1= <user>
##$USERA2= <user>
##$USERA3= <user>
##$USERA4= <user>
##$USERA5= <user>
##$V9= 5
##$VALIST= <valist>
##$VCLIST= <CCCCCCCCCCCCCCC>
##$VD= 0
##$VDLIST= <DDDDDDDDDDDDDDD>
##$VPLIST= <PPPPPPPPPPPPPPP>
##$VTLIST= <TTTTTTTTTTTTTTT>
##$WBST= 2048
##$WBSW= 25
##$XGAIN= (0..3)
0 0 0 0
##$XL= 0
##$YL= 0
##$YMAX_a= 614158
##$YMIN_a= -520257
##$ZGOPTNS= <>
##$ZL1= 120
##$ZL2= 120
##$ZL3= 120
##$ZL4= 120
##$ABSF1= 14.98509
##$ABSF2= -5.573092
##$ABSG= 5
##$ABSL= 3
##$ALPHA= 0
##$AQORDER= 0
##$ASSFAC= 0
##$ASSFACI= 0
##$ASSFACX= 0
##$ASSWID= 0
##$AUNMP= <proc_prof1d_extract_pilot.lims>
##$AXLEFT= 0
##$AXNAME= <>
##$AXNUC= <1H>
##$AXRIGHT= 0
##$AXTYPE= 0
##$AXUNIT= <>
##$AZFE= 0.1
##$AZFW= 0.1
##$BCFW= 0
##$BC_mod= 0
##$BYTORDP= 0
##$COROFFS= 0
##$CY= 15
##$DATMOD= 1
##$DC= 0
##$DFILT= <>
##$DTYPP= 0
##$F1P= 0
##$F2P= 0
##$FCOR= 0.5
##$FTSIZE= 32768
##$FT_mod= 6
##$GAMMA= 0
##$GB= 0
##$INTBC= 1
##$INTSCL= 1
##$ISEN= 128
##$LB= 0
##$LEV0= 0
##$LPBIN= 0
##$MAXI= 10000
##$MC2= 0
##$MEAN= 0
##$ME_mod= 0
##$MI= 0
##$NCOEF= 0
##$NC_proc= -8
##$NLEV= 6
##$NOISF1= 0
##$NOISF2= 0
##$NSP= 0
##$NTH_PI= 0
##$NZP= 0
##$OFFSET= 14.98509
##$PC= 1
##$PHC0= 93.84521
##$PHC1= 0
##$PH_mod= 1
##$PKNL= yes
##$PPARMOD= 0
##$PPDIAG= 0
##$PPIPTYP= 0
##$PPMPNUM= 2147483647
##$PPRESOL= 1
##$PSCAL= 4
##$PSIGN= 0
##$PYNMP= <proc.py>
##$REVERSE= no
##$SF= 400.02
##$SI= 32768
##$SIGF1= 0
##$SIGF2= 0
##$SINO= 400
##$SIOLD= 32768
##$SPECTYP= <>
##$SREGLST= <1H.CDCl3>
##$SSB= 0
##$STSI= 32768
##$STSR= 0
##$SW_p= 8223.68421052631
##$SYMM= 0
##$S_DEV= 0
##$TDeff= 65536
##$TDoff= 0
##$TI= <>
##$TILT= no
##$TM1= 0
##$TM2= 0
##$TOPLEV= 0
##$USERP1= <user>
##$USERP2= <user>
##$USERP3= <user>
##$USERP4= <user>
##$USERP5= <user>
##$WDW= 1
##$XDIM= 32768
##$YMAX_p= 430081657
##$YMIN_p= -654228
##$CURPLOT= <Network HP LaserJet P1505>
##$CURPRIN= <$Network HP LaserJet P1505>
##$DFORMAT= <normdp>
##$LAYOUT= <+/1D_H.xwp>
##$LFORMAT= <normlp>
##$PFORMAT= <normpl>
##$SURQMSG= 1
$$ End of Bruker specific parameters
$$ ---------------------------------
##NTUPLES= NMR SPECTRUM
##VAR_NAME=  FREQUENCY,     SPECTRUM/REAL,   SPECTRUM/IMAG
##SYMBOL=    X,             R,               I
##VAR_TYPE=  INDEPENDENT,   DEPENDENT,       DEPENDENT
##VAR_FORM=  AFFN,          ASDF,            ASDF
##VAR_DIM=   32768,         32768,           32768
##UNITS=     HZ,            ARBITRARY UNITS, ARBITRARY UNITS
##FACTOR=    0.250966925370066, 1,           1
##FIRST=     8223.43324360094, -86680,       -104730
##LAST=      0,             110257,          -138568
##MIN=       0,             -654228,         0
##MAX=       8223.43324360094, 430081657,    0
$$ Real data points
##PAGE= N=1
##DATA TABLE= (X++(R..R)), XYDATA
$$ [...]
$$ plain form
19517 -39421 -63053 -95665 228184 -45036 45329 114065 -124898 -192755 -135903 -14994 -292487
19506 -292487 4442 -185242 -163843 293204 -263868 -313839 -172784 43018 -44219 155893 108572
19495 108572 -68008 -134120 71084 -81697 -54240 -58955 51171 -98216 -16321 -161817 -31195
19483 -221034 -40783 -210232 -106104 -129048 -346779 173097 -54021 -366196 -13552 -146053
19473 -146053 -163804 -11320 99696 353871 -191921 -191966 -182392 -44625 -48194 -129307 -134005 -68915
19461 -68915 150508 -53183 -164398 -278002 -172663 -3423 -146453 -186706 -36236 -36659 31762
19449 15643 -180463 -53844 -1140 136705 -12696 -50181 63190 -264776 -17758 48070 -279444
19437 -131412 -323647 -116893 27567 75598 -189932 94249 -219917 -90860 151458 -279301
$$ packed form
19517c9421k3632l2612B28184d5036D5329O8736a24898o7857N6852a4994k77493
19506b92487D442a85242K1399B93204b63868m9971J41055D3018d4219A55893m7321
19495A08572f8008o6112G1084h1697K7457m715E1171i8216a6321j45496c1195
19483b21034d0783j69449J04128k2944k17731A73097e4021l12175a3552j32501
19473a46053j7751a1320I9696K54175a91921m5R574d4625l569q1113m698O5090
19461f8915A50508e3183j11215j13604J05339c423j43030m0253c6236m23C1762
19449A5643a80463e3844a140A36705a2696l7485F3190b64776a7758D8070b79444
19437a31412j92235a16893B7567M8031a89932I4249b19917i0860A51458b79301
$$ plain form
19426 -16672 36515 56556 85226 32364 -207758 4139 -2114 -220744 -192765 -4897 -63661 335923
19413 -233852 -128022 28848 -200394 -133285 155246 13310 231331 20321 175296 51899
19402 -249682 -30512 149429 53643 -60991 295350 -182645 -219459 32947 -85856 137674 -324122
19390 -122370 -142605 168112 63220 140572 153335 73274 -259861 -215420 -258787 -364596 271580
19378 90009 -21847 -331418 -111881 -244319 396210 68307 -27632 8050 -62558 -66398 -128302
19367 -128302 199043 83227 -142803 48714 393236 -102286 -8223 -55285 -101878 101167 -101072
19355 125982 18730 -387217 20596 159558 -229513 -172630 83663 -74283 -374686 -307994 -124773
19343 50076 -123687 -112316 -199212 119751 -37804 17524 -237978 152507 -196941 -247839 -358089
$$ packed form
19426a6672C6515K0041K8670C2364b07758D139b114k18630K7979d897n8764C35923
19413b33852J05830B8848b00394O7109A55246A3310K18021B0321J54975E1899
19402b49682c0512A49429E3643f0991B95350a82645l6814C2947h5856A37674c24122
19390a22370k0235A68112F3220P7352J2763G3274b59861M4441m3367j05809B71580
19378I0009b1847l09571a11881j32438C96210F8307b7632H050f2558l840o1904
19367a28302A99043H3227a42803D8714L44522a02286h223m7062m6593A01167a01072
19355A25982A8730c87217B0596J38962b29513N6883H3663g4283l00403O6692a24773
19343E0076a23687J1371q6896A19751c7804A7524b37978A52507a96941n0898j10250
$$ plain form
19332 -358089 -393171 -9078 -123220 -298104 -9173 -127990 -61477 -25596 -351341 336730 -357165
19320 114884 19708 85027 -121155 -272985 -325816 -310837 233685 -106164 192852 136697
19310 136697 96245 362496 83683 135660 -380908 54327 -393721 -122691 -120328 135957 99369
19299 99369 -57403 65481 -134802 10733 -275146 33228 -147853 -164777 -50813 43226 51821
19288 51821 -118253 -272831 87332 -92819 74845 22876 -369307 -57188 -63045 -101930 13199
19276 56219 -74256 72816 -251779 -228922 177730 124581 -194781 -240902 -44686 169797 122817
19265 122817 -209448 -10689 -254634 -88094 -5108 -174586 -113923 14275 40105 -13470 176671
19253 -218662 -174596 59561 -47888 58505 81661 323750 -127530 -123574 53578 -261643 119570
$$ packed form
19332c58089l5082i078j14142j74884i173j18817f1477b5596l25745C36730c57165
19320A14884A9708O5319a21155j51830n2831J4979B33685a06164A92852n6155
19310A36697m0452K66251H3683N1977c80908E4327c93721a22691K363A35957l6588
19299I9369e7403F5481a34802A0733b75146C3228a47853j6924e0813D3226Q595
19288E1821a18253j54578H7332i2819G4845B2876c69307e7188n857l8885A3199
19276E6219g4256G2816b51779K2857A77730n3149a94781m6121d4686A69797m6980
19265A22817b09448a0689k43945h8094e108j69478O0663A4275K5830a3470A76671
19253b18662M4066E9561d7888E8505K3156K42089a27530L956E3578b61643A19570
$$ plain form
19241 -22488 -123580 -56351 379088 395732 -122227 -21719 58654 55379 -45360 106411 -86775
19229 -142915 -248128 -129993 -368527 467911 68338 -142928 -138958 73286 -39810 -86060 245536
19217 -23584 -217923 -119897 -33862 5998 -196275 203117 172226 -14727 -372731 -34722 -151378
19206 -151378 253323 119203 -109540 378212 -142195 246338 -235028 -58340 94360 -90510
19195 -39066 108759 119119 8201 -115599 -82677 -55938 -5342 287105 -24764 -144833 89922
19183 -57569 73626 218137 283784 185153 136290 455121 -77117 65722 79335 -213937 426342
19171 122978 -33225 377647 124205 -303997 65230 -65430 49365 -293602 -163955 -78203
19160 -98864 -61073 -16717 -138102 -45830 -195407 -12120 184993 5686 12213 3282 -13503 2031
$$ packed form
19241b2488j01092e6351C79088J6644a22227b1719E8654l275d5360A06411h6775
19229a42915j05213J18135k38534D67911F8338a42928L970G3286c9810m6250B45536
19217b3584j94339R8026c3862E998a96275B03117l0891a4727l58004c4722j16656
19206a51378B53323A19203a09540C78212a42195B46338b35028e8340I4360i0510
19195c9066A08759J0360H201a15599L2922K6739e342B87105b4764j20069H9922
19183e7569G3626J44511O5647r8631m8863L18831g7117F5722J3613b13937D26342
19171A22978c3225C77647A24205c03997F5230f5430D9365b93602J29647g8203
19160i8864L7791a6717j21385d5830j49577a2120A84993E686O527C282a3503B031
$$ plain form
19147 26961 -45139 -3845 -83375 132455 -74148 151013 31982 -166634 -249585 -168290 -235062
19136 -235062 -29018 -179855 -124683 -153748 121333 75378 37140 -215516 -5087 -82368 140993
19124 22252 -300259 224318 341212 -38829 212932 91850 -100927 -40135 67670 -28556 -173193
19113 -173193 -195467 101116 428724 -172307 -91501 35307 56802 -184482 -15042 62372 139722
19102 139722 -76954 263274 -76127 -60975 -1319 119062 -127301 -186131 -159730 162070 27365
19090 -44207 -157053 -306344 -305761 -6086 184208 234136 62288 -87835 112620 -422260 -53090
19078 -15030 142471 -263949 37141 -143910 -166743 -238453 26431 5225 -46285 -88559 -294345
19067 -294345 -52869 -142421 201214 73351 -66822 36940 96720 138933 -403439 -138656 -139315
$$ packed form
19147B6961d5139c845p9530A32455g4148A51013C1982a66634q2951Q1295o6772
19136b35062b9018j50837N5172k9065A21333m5955C7140b15516e087p7281A40993
19124B2252c00259B24318J16894c8829B12932I1850a00927d0135F7670b8556j44637
19113a73193k2274A01116L27608a72307Q0806C5307K1495a84482a5042F2372P7350
19102A39722g6954B63274g6127J5152a319A19062a27301n8830K6401A62070B7365
19090d4207j12846j49291N83f086A84208M9928F2288h7835A12620d22260e3090
19078a5030A42471b63949C7141a43910k2833p1710B6431E225d6285m2274k05786
19067b94345e2869q9552B01214G3351f6822C6940N9780M2213d03439a38656o59
$$ plain form
19056 -139315 -86624 125584 11914 10432 -113166 -15804 -233656 -179342 -206964 -116975 -21977
19044 -230969 12377 -112921 -103445 -42393 -141792 84335 -86184 -410110 -337514 -101544 175719
19032 -93002 -87254 -43754 -178550 56637 -177134 27255 88465 115176 656398 -276991 179789
19020 485052 -133336 88087 -90437 -183886 -208091 -85957 -15095 3285 -94378 -11866 30032
19008 1026 -47421 -109268 -93036 172770 -22566 -236281 -142283 -41185 -156044 64636 -127479
18996 -242878 145621 136252 -348491 -75674 -35245 244882 -143798 -85443 -62195 -5216 -287602
18985 -287602 -218845 -131787 8812 -108264 171962 -170541 -109968 -248372 45875 77136 57590
18974 57590 -117806 77104 85744 54379 26301 37020 -8710 -45708 117993 -93768 123545
$$ packed form
19056a39315N2691A25584A1914j482a13166a5804k17852N4314k7622Q9989b1977
19044b30969A2377a12921R476d2393r9399H4335h6184l23926P2596a01544A75719
19032i3002N748M3500j34796E6637a77134B7255O1210K6711N41222b76991A79789
19020D85052a33336H8087i0437r3449k4205h5957a5095C285i4378a1866C0032
19008A026d7421o1847J6232A72770b2566k13715R3998d1185j14859F4636a27479
18996b42878A45621r369c48491g5674c5245B44882a43798N8355K3248e216k82386
18985b87602O8757Q7058H812a08264A71962a70541O0573j38404D5875L1261j9546
18974E7590a17806G7104Q640l1365B6301J0719h710l6998A17993i3768A23545
$$ plain form
18962 -96775 220997 19662 -337719 75147 25743 -7813 323468 181411 -48391 -31934 31422
18950 206114 -95289 104285 -13488 -39138 -373191 -170290 113771 -186222 130617 -192262
18939 -255639 -293668 65071 -61016 -56053 -16316 -129885 -396649 -42408 40268 134953 -116818
18927 -93002 -59415 -146626 197512 -21141 -185809 86131 -64857 -94814 15854 -73723 -51039
18916 -51039 -158295 -2222 -166126 235405 1240 -225738 -393962 18705 -52385 -202464 -237954
18905 -237954 177896 -290778 152772 155927 -165772 -249904 -109971 -235047 -63670 45303
18894 -252032 63772 -269051 -106396 161137 -194946 342155 -119656 -224377 -240927 70826
18883 60125 -35102 -31449 2949 362596 235993 -49698 -137302 114591 -31244 326152 -121127
$$ packed form
18962i6775B20997A9662c37719G5147B5743g813C23468j42057d8391J6457C1422
18950B06114i5289A04285a3488k5650l34053a70290A13771a86222A30617a92262
18939b55639l8029F5071f1016M963a6316j13569k66764d2408D0268R4685a16818
18927i3002L3587q7211A97512b1141j64668H6131f4857k9957A5854g3723K2684
18916e1039j07256b222j63904B35405A240b25738j68224A8705e2385j50079l5490
18905b37954A77896b90778A52772L155a65772q4132a09971j25076f3670D5303
18894b52032F3772b69051a06396A61137a94946C42155a19656j04721j6550G0826
18883F0125c5102L653B949L59647j26603d9698q7604A14591c1244C26152a21127
$$ plain form
18871 15578 142626 -50037 -41073 72880 113642 18909 -187588 99579 146732 -209712 40269
18859 81802 40757 51860 -13170 -53292 69253 -136105 53111 -3341 -74004 -67703 108441 -113239
18846 14094 154706 -7567 -168094 29119 48886 -260840 197213 2586 153554 -3577 239951
18834 104483 -65050 -45865 -176349 300585 -228435 -124785 156212 -305159 306791 -275851
18823 -375543 -488697 221488 -125546 -49628 -80945 28111 -142875 -89824 -102537 238175
18812 77255 -110619 124423 17809 86164 279159 -294312 45784 89770 -125319 346283
18801 85749 -195444 113443 -34314 63581 72460 22138 208077 28471 -344851 -83489 342510
18789 -160516 -35087 147149 98407 -109845 -83332 -20704 -80741 -86390 -58280 -114170 -189641
$$ packed form
18871A5578J27048e0037Q964G2880M0762A8909a87588I9579M7153b09712D0269
18859H1802D0757J1103a3170m0122F9253a36105E3111c341p0663O301A08441a13239
18846A4094J40612g567j60527B9119J9767b60840A97213B586J50968c577B39951
18834A04483f5050J9185j30484C00585b28435J03650A56212c05159C06791b75851
18823c75543j13154B21488a25546d9628l1317B8111a42875N3051j2713B38175
18812G7255a10619A24423A7809O8355J92995b94312D5784M3986a25319C46283
18801H5749a95444A13443c4314F3581Q879B2138J85939B8471c44851h3489C42510
18789a60516c5087A47149m8742a09845K6513b0704o0037n649K8110n5890p5471
$$ plain form
18778 -189641 -202394 94363 -473232 27040 151135 105707 -159747 73967 -161259 -165283 279877
18766 -9502 -74978 -138343 -197394 -173344 202556 58459 -105946 356889 -114134 -118227 -91584
18755 -91584 132807 250170 -118658 8262 -39913 -5037 -148490 -234097 5402 135188 60308
18743 -21730 -151508 227642 -320317 -316237 -134590 -151772 -292104 248060 49522 -161344
18732 -114824 -111032 -150342 -4034 -101812 -104359 68868 -13648 -121936 -44134 -69309 -238168 135685
18719 224286 25848 43831 -112025 232338 20582 208421 64854 35818 43464 18601 -168344
18707 -127864 -288943 -62043 50138 16441 -272206 -273503 36031 -181467 -5087 191240 -155423
18695 -158961 99877 -23532 119982 -113280 -696 -68785 45539 -94532 -142414 -174945 -298429
$$ packed form
18778a89641j2753I4363d73232B7040J24095m5428a59747G3967a61259m024B79877
18766i502o5476o3365n9051K4050B02556E8459a05946C56889a14134m093K6643
18755i1584A32807J17363a18658H262c9913e037j43453q5607E402J29786F0308
18743b1730j29778B27642c20317M080a34590j7182j40332B48060D9522a61344
18732a14824L792l9310d034r7778k547F8868a3648j08288d4134k5175j68859A35685
18719B24286B5848J7983a12025B32338B0582J87839F4854k9036P646A8601a68344
18707a27864j61079f2043E0138A6441b72206j297C6031a81467e087A91240a55423
18695a58961I9877b3532A19982a13280f96o8089D5539i4532m7882l2531j23484
$$ plain form
18684 -298429 -112355 66033 -33199 -49737 -133430 -53745 94989 80823 -391248 30526 156530
18673 156530 -209338 -331098 195 165897 -164830 -65504 121738 -304130 52762 -174872
18662 -205182 -213151 -19356 -140242 -118454 184601 44198 -22695 214068 11487 -102735 38812
18650 -216332 -396843 -116562 114820 10125 24273 11949 -29413 -32738 -232332 93845 -87845
18638 36452 -229921 -20714 394 155155 -141026 -279494 -262601 -87733 68662 -329769 -310926
18627 -310926 -226340 -56857 50279 119491 -176797 233310 -375067 242994 210965 -375755
18616 -111249 -222825 222113 -166708 -46124 2338 33081 -62497 -56455 -95475 -492543 68139
18604 -128113 186149 -94682 84858 32151 141581 82809 -38545 -153785 -208692 82499 -8357
$$ packed form
18684b98429a12355F6033c3199j6538q3693e3745I4989j4166c91248C0526J26004
18673A56530b09338j21760A95J65702a64830f5504A21738c04130E2762a74872
18662b05182p969a9356j20886K1788A84601D4198b2695B14068A1487a02735C8812
18650b16332j80511a16562A14820A0125J4148A1949b9413l325j99594I3845h7845
18638C6452b29921b0714C94J54761a41026j38468J6893h7733F8662c29769J8843
18627c10926Q4586e6857E0279O9212a76797B33310c75067B42994l2029c75755
18616a11249j11576B22113a66708d6124B338L0743f2497O042l9020l97068F8139
18604a28113A86149i4682H4858C2151J09430n8772c8545j15240n4907H2499h357
$$ plain form
18592 -211352 37962 -112330 -312679 13242 218723 81215 -4751 -28316 69645 -104676 6791
18580 198110 -59177 59489 80248 42389 -62719 136415 71390 247321 -139064 -169185 341815
18568 -192550 64870 277356 43433 42320 -36963 -379880 99106 -177405 -82116 -129354 249173
18556 -128058 -116660 12524 441677 -83300 40481 -185438 87482 209748 227479 -245378 100690
18544 -51926 -94613 -116122 -227486 85052 -110561 105865 -116094 17746 -47477 24482 718
18532 -106927 -245782 200413 89838 204693 252980 -260802 -12693 -61860 -262113 -398109
18522 -398109 214106 -178797 -149923 118235 130965 -79056 26754 -106620 141714 28461
18511 43755 100083 -32802 -163323 -14778 -54769 -151898 30620 385289 -86891 -242299 55741
$$ packed form
18592b11352C7962a12330k00349A3242K05481H1215d751k3565F9645a04676F791
18580A98110e9177E9489K0759l7859f2719A36415o5025J75931a39064l0121C41815
18568a92550F4870K12486D3433j113c6963l42917I9106a77405h2116m7238B49173
18556a28058J1398A2524M29153h3300D0481a85438H7482J22266J7731b45378A00690
18544e1926m2687k1509j11364H5052a10561A05865a16094A7746d7477B4482G18
18532a06927j38855B00413H9838J14855M8287b60802a2693m9167k00253j35996
18522c98109B14106a78797K8874A18235J2730g9056B6754a06620A41714B8461
18511D3755N6328c2802j30521a4778l9991r7129C0620L54669h6891j55408E5741
$$ plain form
18499 -46053 -286988 -129115 -224584 -106152 82641 -176065 -57524 -95721 383974 -58547 -198111
18488 -198111 312166 -6343 11806 34327 75228 86427 -36059 -9998 65831 24904 -137836
18476 -162024 -253482 -98255 -461974 -266908 17190 38190 -104987 -64992 -11513 19747 -372926
18464 -34952 -185719 -108875 -36114 -217903 -63629 -185328 88698 315486 -10068 -37650 -113019
18453 -113019 -41430 -77396 48311 -126796 45411 -16327 -286929 8477 -7223 73935 -80688
18441 -125960 27371 -173798 -20135 346024 7507 -78816 -10796 -97165 85135 -65658 158760
18429 108857 -46980 135143 -119824 -15335 -115594 -381129 -59317 487677 76953 108900
18419 108900 -176464 27941 19046 133043 -55108 -56212 -137930 61713 124825 -42268 135396
$$ packed form
18499d6053k40935a29115r5469a06152H2641a76065e7524l8197C83974e8547j39564
18488a98111C12166f343A1806K2521M0901J1199c6059i998F5831B4904a37836
18476a62024r1458i8255l63719J95066A7190K1000a04987L9995a1513A9747c72926
18464c4952j50767P6844c6114j81789f3629j21699H8698K26788a0068k7582p5369
18453a13019d1430l5966D8311a26796D5411a6327k70602H477g223G3935h0688
18441a25960B7371a73798b0135C46024G507g8816a0796q6369H5135f5658A58760
18429A08857d6980A35143a19824a5335j00259k65535e9317D87677G6953L1947
18419A08900a76464B7941q895J13997e5108j104q1718F1713O3112d2268A35396
$$ plain form
18407 -107613 -193464 -40094 -250414 150556 314682 -40503 259876 249827 -243346 -19930
18396 -146696 -14617 -25137 -191462 157795 -153808 -307854 54008 44652 -19335 -400573 67792
18384 224813 508370 45037 -168972 201832 -69172 54582 -253103 32168 175447 78315
18373 4029 -192700 152938 -22609 -321577 -234653 -54771 64480 -36825 202343 -309360 3801
18361 -59171 -11109 -252172 -185697 76489 291951 -330292 -3194 98500 -123394 -275259 -9307
18349 55462 -104997 -154969 315633 157815 305557 33332 -119727 -263018 267320 -90503
18338 276899 30725 -127702 73495 186351 31115 -612091 -5881 -4342 139050 -2253 -3348
18327 -3348 -76681 122696 -183088 172521 -18201 135808 123715 128709 -144742 -191676 71819
$$ packed form
18407a07613q5851d0094k10320A50556J64126d0503B59876j0049b43346a9930
18396a46696a4617j0520j66325A57795a53808j54046E4008r356a9335l81238F7792
18384B24813K83557D5037a68972B01832f9172E4582b53103C2168J43279G8315
18373D029a92700A52938b2609k98968Q6924e4771F4480c6825B02343c09360C801
18361e9171a1109k41063O6475G6489K15462c30292c194I8500a23394j51865i307
18349E5462a04997m9972C15633A57815J47742C3332a19727j43291B67320i0503
18338B76899C0725a27702G3495J12856C1115f12091e881J539A39050b253j095
18327c348p3333A22696a83088A72521a8201A35808j2093M994a44742m6934G1819
$$ plain form
18315 -9107 -148536 -148038 130598 95595 -37409 200571 -87394 -176270 346600 -72345 -173459
18304 -173459 238038 135977 -44403 -205021 23018 154443 -58478 -162227 -123789 -80443
18294 -80443 15489 -199214 192175 142773 213555 -218078 -21469 -237395 -183038 -143999 179624
18282 -197548 -533313 -57688 -138927 69783 306952 -144854 -276434 23731 -165546 95075
18271 23595 -140706 118289 -30462 -18576 -267199 -78950 -99634 -88451 8029 128903 167677
18260 167677 -57680 -142941 53307 247186 47556 94252 -4047 2537 -291010 123840 234816
18249 234816 -249754 -849 -215982 -120131 153628 222057 267284 -176435 -54069 91630 -83922
18237 -109488 -36706 -115658 285616 -45097 55500 -90217 -146234 247186 52565 93201 -113340
$$ packed form
18315i107j39429M98A30598l5003c7409B00571h7394q8876C46600g2345j01114
18304a73459B38038j02061d4403j60618B3018J31425e8478j03749L8438M3346
18294h0443A5489a99214A92175m9402P0782b18078b1469k15926N4357L9039A79624
18282a97548l35765e7688q1239F9783K37169a44854j31580B3731a65546I5075
18271B3595a40706A18289c0462J1886k48623g8950k0684J1183H029J20874L8774
18260A67677e7680q5261E3307J93879D7556M6696d047B537b91010A23840J10976
18249B34816b49754h49k15133R5851A53628O8429M5227a76435e4069I1630h3922
18237a09488c6706p8952B85616d5097E5500i0217n6017B47186E2565M0636a13340
$$ plain form
18225 -148479 3309 -230811 -23271 -100888 -287228 -1347 362804 -162416 135143 -138257 -108186
18214 -108186 -16018 -18941 61540 39456 94218 71845 104075 51835 -137131 -45364 -309934
18203 -309934 -396373 -200432 65254 -59303 190907 182491 23669 -164850 -67201 129252 -104503
18191 -454787 -20430 197096 147861 -3973 3450 -19106 -103504 -4899 26493 -203001 249623
18179 -312278 -214429 -375522 -92189 298169 264592 230013 -179854 -37957 -100988 343118 128997
18167 -50221 -67387 18569 -177940 -256927 59899 -155252 187820 -9615 -13352 -20748 15359 41999
18155 41999 -279234 300206 240550 218667 3023 187491 -20899 70998 -6014 16605 137357
18144 137357 -31770 -79287 -265636 -238421 148176 -137930 105124 -317482 -57111 -32937
$$ packed form
18225a48479C309b30811b3271p7617j86340a347C62804a62416A35143a38257L0071
18214a08186a6018k923F1540k2084N4762k2373L2230E1835a37131d5364k64570
18203c09934q6439J95941F5254e9303A90907q416B3669a64850f7201A29252a04503
18191d54787b0430A97096m9235c973C450a9106q4398d899B6493b03001B49623
18179c12278R7849j61093i2189B98169l3577l4579a79854c7957o3031C43118A28997
18167e0221j7166A8569a77940p8987E9899a55252A87820i615l737p396A5359K6640
18155D1999b79234C00206n9656k1883C023J84468b0899G0998f014A6605J20752
18144A37357c1770m7517j86349K7215A48176a37930A05124c17482e7111K4174
$$ plain form
18134 -32937 -123860 -277709 213294 -27492 299770 98925 -264145 38158 271056 -552852
18123 -6227 53887 -251966 -221472 -39148 131235 -76725 -114157 27393 -142500 -54967 -362849
18112 -362849 257478 119086 -191926 -53005 139291 -148194 -77877 -181439 -64851 169416
18101 101522 45686 136219 -55278 -212969 -143262 -254159 149595 111664 -106516 126209
18090 -252564 336341 220094 -1301 -234058 -103119 105836 -77306 174381 92074 219839
18080 219839 1944 -582241 -200737 105232 -175396 -33326 -1866 60832 68399 -10617 -103934
18069 -103934 178989 -281119 -108670 -208873 19781 162824 -404154 295649 -58373 125246
18058 102421 258731 39528 76193 130824 -109232 -20689 55578 -93387 17711 -181800 44474
$$ packed form
18134c2937r0923j53849B13294b7492B99770I8925b64145C8158K32898e52852
18123f227E3887b51966L0494c9148A31235g6725l7432B7393a42500e4967l07882
18112c62849B57478A19086a91926e3005A39291a48194P0317j03562f4851A69416
18101A01522D5686R0533e5278j57691O9707j10897A49595l7931a06516A26209
18090b52564C36341j16247a301k32757a03119A05836g7306A74381q2307J27765
18080B19839A944e82241b00737A05232a75396c3326a866F0832P567a0617r3317
18069a03934A78989b81119a08670j00203A9781J43043d04154B95649e8373A25246
18058A02421J56310C9528L6665N4631a09232b0689E5578i3387A7711a81800D4474
$$ plain form
18046 69071 -241002 -284518 85577 67039 -179751 58966 -52145 -255661 -18288 38906 26104
18035 26104 -234049 -118256 -20968 -2738 -21440 256741 80053 4175 173108 26671 35926
18024 35926 -108895 167573 -78206 -26916 -107624 84310 -144195 6006 -77781 -81075 -183820
18013 -183820 101908 -210872 -99093 -72177 154983 -150523 -362462 6294 -142869 -57212
18002 36513 73799 -4755 186880 295559 116740 97255 -87897 -93848 -90805 285432 -9022 85496
17989 78980 113647 -45593 77707 143572 -5029 248303 62011 -163558 -8400 -104584 325235
17977 120478 8841 68514 143781 -26047 355321 166245 237121 -174485 62414 -147972 -129138
17966 -129138 320999 135126 75371 190796 -79548 190828 4492 58575 -263075 11935 104831
$$ packed form
18046F9071b41002m3516H5577j8538a79751E8966e2145k03516a8288C8906j2802
18035B6104b34049J15793b0968b738j8702B56741H0053D175J68933B6671R255
18024C5926a08895A67573g8206b6916q0708H4310a44195F006g7781l294j02745
18013a83820A01908b10872i9093K6916A54983a50523k11939F294a42869e7212
18002C6513L7286d755A86880J08679A16740j9485h7897n951L043B85432i022H5496
17989G8980L4667d5593G7707O5865e029B48303F2011a63558h400r6184C25235
17977A20478H841N9673P5267b6047C55321A66245P0876a74485F2414a47972J8834
17966a29138C20999A35126n9755J15425g9548A90828D492N4083b63075A1935R2896
$$ plain form
17955 104831 -252805 299529 -199065 134837 20281 81026 -140925 -161293 55133 -89734
17944 -73442 -86361 52308 19601 200688 -19392 -56961 278222 253330 79103 -323720 11195
17932 -276543 55286 -86237 -182743 297181 -395921 296513 -34652 241168 -167930 213300
17921 -179484 121909 -30774 -15245 -91402 -99403 7963 -55535 -96470 31422 270816 -63231
17909 63849 -152379 -199056 71456 349069 -152510 -180466 -279815 156638 -114441 -70559 -81283
17898 -81283 -41042 38668 -92323 -269228 3129 222875 -484723 -10352 -353410 -20289 -88133
17887 -88133 247775 -59864 -119156 -141184 115436 -110288 -213591 302594 -27462 141723
17876 -200459 38927 258618 203831 16884 189945 -36507 -50003 -66161 144238 -310219 -128423
$$ packed form
17955A04831b52805B99529a99065A34837B0281O0745a40925k0368E5133h9734
17944g3442j2919E2308A9601J81087a9392l7569B78222k4892G9103c23720A1195
17932b76543E5286h6237r6506B97181c95921B96513c4652B41168a67930B13300
17921a79484A21909c0774a5245p6157q001G963e5535m0935C1422K39394f3231
17909F3849a52379m6677G1456K77613a52510k7956r9349A56638a14441M3882j0724
17898h1283M0241C8668i2323j76905C129K19746d84723a0352l43058b0289o7844
17887h8133B47775e9864n9292k2028A15436a10288j03303C02594b7462A41723
17876b00459C8927K19691n4787A6884J73061c6507j3496j6158A44238c10219a28423
$$ plain form
17864 8400 -142406 28360 -246332 158804 202465 94258 -184778 -1074 263323 73645 216776
17853 216776 151747 112873 -150473 24262 -103392 107773 -202147 412670 15567 141099
17843 141099 7929 102665 -274208 -65794 3272 43995 40128 -309259 101783 333987 -273752
17831 -1628 -124663 -125013 40904 -52279 84300 337848 39411 -12877 127700 -211960 21595
17819 -19619 195046 -316873 -135761 30804 -74927 20730 -249415 -54156 5779 -12784 -2556
17807 102229 -165302 34333 -65297 242915 -184483 -91451 292847 -97229 -140824 146107
17796 96668 107595 -61799 -141336 517045 4508 213143 -174404 -174300 103967 -197991 62015
17784 232915 -156657 120127 323072 106757 113775 -122302 -184618 289056 -103863 -137169
$$ packed form
17864H400a42406B8360b46332A58804M3661I4258a84778a074B63323G3645J43131
17853B16776o5029l8874a50473B4262a03392A07773b02147D12670A5567J25532
17843A41099G929R4736b74208f5794C272M0723l867c09259A01783K32204b73752
17831a628j23035l50D0904e2279H4300K53548C9411a2877A27700b11960B1595
17819a9619A95046c16873a35761C0804g4927B0730b49415e4156E779a2784b556
17807A02229a65302C4333f5297B42915a84483i1451B92847i7229m3595A46107
17796I6668J0927f1799p9537E17045D508K08635a74404J04A03967a97991F2015
17784B32915a56657A20127K02945A06757P018a22302o2316B89056a03863l3306
$$ plain form
17774 -137169 -301240 135454 47558 116483 -253176 -118135 -53559 -162013 16126 183314
17764 183314 154662 -98516 149617 -87636 -82300 15253 256078 302621 -34739 -344131 -61145
17752 165290 -134216 -98939 -125875 -4284 -203508 81753 191529 -71775 48927 45272 -1741
17740 -275343 74870 255090 230358 -224432 1795 126684 5199 -192222 -59754 -15729 227932
17728 362584 -12768 -120378 143570 -20319 125049 -17820 259242 -63728 4909 54781 -86937
17716 -114020 -97218 -86895 -118141 12029 185647 -156652 -243622 -438095 -81203 -1746 -5715
17705 -5715 64710 107489 387608 150305 -6513 66481 138239 238824 -31677 -207621 -334395
17694 -334395 -471632 -61061 -107871 134621 161293 125711 15061 -181569 96752 -10833 39387
$$ packed form
17774a37169j64071A35454D7558O8925b53176a18135e3559j08454A6126J67188
17764A83314k8652i8516A49617h7636N336A5253K40825M6543c4739l09392f1145
17752A65290a34216L5277k6936d284j99224H1753J09776g1775D8927l655a741
17740b75343G4870J80220k4732b24432A795J24889E199a92222e9754a5729B27932
17728C62584a2768j07610A43570b0319A25049a7820B59242f3728D909M9872h6937
17716a14020J6802J0323l1246A2029J73618a56652q6970j94473h1203a746l969
17705e715F4710M2779K80119A50305f513F6481P1758J00585c1677j75944j26774
17694c34395j37237f1061m6810A34621K6672l5582A5061a81569I6752a0833C9387
$$ plain form
17682 252850 204651 -9891 -66002 -153015 139694 172260 -27700 343657 89930 -234852 -55532
17670 56176 89721 52570 195121 -244119 -178379 -100009 -290210 61955 230612 118894 -69481
17658 24944 152628 -21989 117135 76430 141794 132545 -200163 -62736 164365 -71395 -286608
17647 -286608 352200 78406 158599 42137 16864 -69100 33594 120977 93670 274277 219807
17636 219807 37796 102947 -193699 174839 -42948 -55887 -56025 8290 -45163 -264664 278513
17624 -205079 -90337 99905 -60287 -845 59177 -159608 245813 -90642 140457 34919 321041
17613 321041 66646 26637 234193 292622 98937 335206 260280 79254 153339 -39532 75710
17601 92715 -39080 158456 7665 -44905 483181 150633 98893 205801 48263 109741 203126
$$ packed form
17682B52850m8199i891n6111q7013A39694L2566b7700C43657H9930b34852e5532
17670E6176L3545l7151J42551b44119O5740P8370j90201F1955J68657j11718f9481
17658B4944J27684b1989A17135m0705O5364r249b00163f2736A64365g1395k15213
17647b86608C52200G8406Q0193D2137A6864f9100C3594Q7383k7307J80607n4470
17636B19807C7796O5151a93699A74839d2948j2939j38H290d5163k19501B78513
17624b05079i0337I9905f0287h45E9177a59608B45813i0642A40457C4919K86122
17613C21041F6646B6637K07556N8429I8937K36269p4926G9254P4085c9532G5710
17601I2715c9080A58456G665d4905D83181A50633n1740J06908D8263O1478R3385
$$ plain form
17590 203126 138596 -278320 -17809 10213 472859 357746 -414775 -22799 -17051 38144 133881
17579 133881 -47041 16572 136283 176453 244555 -62828 -129289 292421 -301066 45635 5724
17567 18831 228367 140676 -1451 98207 51881 36166 72904 -112644 354870 -91891 190852
17555 392 105645 54911 -96433 11735 -143440 -240025 -258657 19414 -88090 108509 113918 234776
17543 234776 110863 247888 227141 240201 114184 -11431 -69739 22369 146694 433690
17533 433690 360814 172990 4769 -201897 202088 584225 -4020 -80559 -138572 140880 183600
17522 183600 -6629 190282 253592 294622 254699 117356 122564 67719 77386 -72835 3122 382315
17510 382315 98643 129236 145145 109033 109757 16345 434943 549496 230770 367792 -178939
$$ packed form
17590B03126o4530b78320a7809A0213M62646j15113d14775b2799N748C8144R5737
17579A33881d7041A6572J19711M0170O8102f2828o6461B92421c01066D5635E724
17567A8831K09536q7691a451I8207m6326j5715L6738a12644C54870i1891A90852
17555C92J05253n0734i6433A1735a43440r6585j8632A9414h8090A08509N409J20858
17543B34776A10863J37025k0747J3060A14184a1431n8308B2369J24325K86996
17533D33690p2876A72990D769b01897B02088L82137d020p6539n8013A40880M2720
17522A83600f629A90282O3310M1030l9923A17356N208n4845R667g2835C122L79193
17510C82315I8643L0593J5909l6112P24A6345M18598J14553B30770J37022a78939
$$ plain form
17498 160594 189755 119558 156620 301284 380371 174807 51391 87111 -171035 -209121 129595
17486 211729 205894 -126756 359613 55368 -134486 -117940 -39577 106330 202001 -120825 34842
17474 -148505 312251 250758 540244 308648 78961 335656 242242 -20420 -335578 -125223
17463 398834 2067 182260 244413 290150 23917 473630 189946 74313 197091 357058 194474
17452 194474 401146 241155 547308 354672 206007 254194 239276 158272 234358 26825
17441 131099 317965 -46417 421900 -86035 260377 9447 193326 184272 259030 202744 156933
17430 156933 154414 441796 155559 444736 31445 -17899 86068 252130 432140 94004 286057
17419 286057 286747 384854 192336 151288 281435 -45495 356170 57476 472056 257070 -36436
$$ packed form
17498A60594K9161p0197L7062J44664P9087A74807E1391L5720a71035l8086A29595
17486B11729n835a26756C59613E5368a34486J6546c9577A06330R5671a20825C4842
17474a48505C12251o1493K89486k31596G8961K56695r3414b0420l15158a25223
17463C98834B067J80193O2153M5737B3917M49713A89946G4313J22778J59967j62584
17452A94474K06672j59991L06153j92636j48665M8187j4918q1004P6086B6825
17441A31099J86866d6417D21900h6035B60377I447J83879r054P4758n6286m5811
17430A56933k519K87382A55559K89177C1445a7899H6068J66062J80010I4004J92053
17419B86057O90R8107A92336m1048J30147d5495C56170E7476M14580k14986c6436
$$ plain form
17407 -173344 376452 -34361 21364 209131 356129 267372 -38129 -15660 111787 4852 142687
17396 142687 35127 -99769 97927 239821 197080 294066 5318 130972 -152310 111674 196159
17385 196159 -7335 -65447 -34662 224023 -8462 93039 67816 415 229343 143662 334713 38286
17372 1327 127193 244449 216638 66211 -105928 461656 165589 33397 132290 -47345 -235333
17361 -235333 56523 132487 -25805 116340 -195089 -141068 -54391 484076 57226 211239 52859
17349 69289 92645 230109 364120 359800 -100987 -121422 88912 146309 -18825 59502 241817
17338 241817 269530 -36857 480189 -100500 155997 -16138 94160 -56816 109189 53656 145098
17327 145098 367950 160277 171212 -79909 192195 240087 278120 199920 204443 162251 37145
$$ packed form
17407a73344C76452c4361B1364J87767J46998q8757c8129a5660A11787D852J37835
17396A42687C5127i9769I7927J41894m2741R6986E318J25654a52310A11674Q4485
17385A96159g335n8112L0785B24023h462I3039k5223D15K28928q5681J91051C8286
17372A327J25866J17256k7811F6211a05928D61656A65589C3397R8893d7345j87988
17361b35333E6523P5964b5805A16340a95089N4021e4391D84076E7226J54013E2859
17349F9289K3356J37464J34011m320a00987k0435H8912N7397a8825E9502J82315
17338B41817K7713c6857D80189a00500A55997a6138I4160e6816A09189E3656R1442
17327A45098K22852A60277J0935g9909A92195M7892L8033p8200M523m2192C7145
$$ plain form
17315 84706 182545 94621 59219 241022 -156388 203991 203547 64452 47159 208289 425684
17304 425684 101011 141842 131794 298163 288707 -44507 39268 168464 165774 248291 278103
17293 278103 -5444 248263 174775 219154 366921 97208 85389 236581 585349 377187 224926
17282 224926 272627 -210364 230115 252061 206379 -83829 7670 329503 189998 334487 98938
17270 275620 -84934 286752 143806 225069 264609 473887 378168 160512 -11827 308699
17259 179334 205601 257744 214624 481262 187488 265708 9636 -86217 366527 122897 253608
17248 253608 148927 5558 642043 -163859 203780 250364 24923 315309 99704 -69913 -100278
17237 -100278 283203 478861 509656 143355 265839 636064 399325 124801 223636 354076
$$ packed form
17315H4706R7839q7924l5402J81803a56388B03991m44F4452j7293J61130K17395
17304D25684A01011M0831j0048J66369r456d4507C9268J29196k690Q2517K9812
17293B78103e444B48263p3488M4379J47767I7208j1819J51192L48768k08162j52261
17282B24926M7701b10364B30115K1946m5682h3829G670L21833j39505J44489I8938
17270B75620h4934B86752j42946Q1263L9540K09278r5719A60512a1827C08699
17259A79334K6267N2143m3120K66638A87488P8220I636h6217C66527A22897J30711
17248B53608j04681E558O36485a63859B03780M6584B4923K90386I9704f9913l0365
17237a00278B83203J95658L0795A43355J22484L70225k36739A24801R8835J30440
$$ plain form
17227 354076 -218211 449523 12339 174896 234118 174996 550487 72422 129709 309358
17217 309358 148902 59716 16488 189272 114253 126704 20034 245822 120907 333893
17207 333893 382253 298147 357027 76176 246231 71385 190007 251480 242468 348576 81658
17195 242073 185338 -15763 212199 169148 225418 296179 117254 486734 144635 564640
17185 564640 186114 539898 329194 424730 519311 261258 283697 451125 526331 275746
17175 275746 191340 397930 261263 510639 183025 167301 196831 285081 474324 362409
17165 362409 622562 373702 294000 371716 114119 330485 525877 248929 487410 618182
17155 618182 506734 209141 304642 660892 347361 245864 176152 52852 379938 435221
$$ packed form
17227C54076b18211D49523A2339J62557N9222n9122L75491G2422N7287J79649
17217C09358A48902E9716A6488J72784p5019J2451B0034K25788A20907K12986
17207C33893M8360q4106N8880G6176J70055G1385J18622O1473r012J06108H1658
17195B42073n6735a5763B12199m3051N6270P0761A17254L69480A44635M20005
17185E64640A86114L53784k10704R5536R4581k58053K2439J67428P5206k50585
17175B75746q4406K06590j36667K49376A83025j5724K9530Q8250J89243j11915
17165C62409K60153k48860p9702P7716A14119K16366J95392B48929K38481J30772
17155F18182j11448B09141R5501L56250l13531j01497o9712E2852L27086N5283
$$ plain form
17145 435221 381893 -64987 503196 394325 358772 -68469 193333 456680 -35278 583847
17134 731712 350799 531582 349753 607814 321816 223654 510319 660422 465909 305210
17124 305210 227725 387071 147512 621644 561770 323364 648914 509295 523871 275096
17114 275096 563308 390500 518120 526521 307961 282520 464705 299496 496131 503914
17104 503914 661111 785156 392980 161912 502061 355495 370091 550513 222903 83921
17093 480827 240564 388688 481486 359242 288246 232173 373122 521689 365003 182903
17083 182903 322130 445975 195722 463159 395066 491746 456333 466057 424756 302680 527862
17072 527862 232454 147491 481547 344832 684913 153345 198725 624209 71402 337027
$$ packed form
17145D35221n3328f4987E03196j08871l5553f8469A93333K63347c5278E83847
17134G31712C50799J80783j81829K58061k85998r8162K86665J50103j94513j60699
17124C05210p7485J59346A47512M74132n9874k38406L25550j39619J4576k48775
17114B75096K88212j72808J27620Q401k18560k5441J82185j65209J96635P783
17104E03914J57197J24045l92176A61912L40149j46566J4596J80422B22903H3921
17093D80827k40263J48124R2798j22244p0996n6073J40949J48567j56686j82100
17083A82903J39227J23845A95722K67437o8093R6680l5413R724m1301j22076K25182
17072E27862B32454q4963L34056j36715L40081A53345M5380M25484G1402K65625
$$ plain form
17062 337027 547876 80673 548924 735154 689312 761925 543252 597285 455154 652451
17052 652451 486146 418304 604805 698790 557638 635487 671551 520357 587418 528573 752816
17041 752816 608057 586640 565087 544626 279095 739155 538827 656564 748259 544948
17031 544948 656455 376088 449020 353032 391450 684971 656686 432965 428370 884154 474600
17020 474600 676761 754254 988959 637497 532152 477203 820098 982465 771839 828801
17010 828801 693716 848426 372033 760057 524399 734447 554480 615453 870748 651825
17000 651825 937618 763556 832189 908129 704099 877200 957772 922475 992224 502677
16990 502677 865577 644306 923464 777710 1033712 823992 703636 935564 1034077 906510
$$ packed form
17062C37027K10849H0673M68251J86230m5842P2613k18673N4033j42131J97297
17052F52451j66305o7842J86501R3985j41152P7849L6064j51194O7061n8845K24243
17041G52816j44759k1417k1553k0461k65531M60060k00328J17737R1695k03311
17031E44948J11507k80367P2932r5988L8418K93521k8285k23721m595M55784m09554
17020D74600K02161P7493K34705l51462j05345n4949L42895J62367k10626N6962
17010H28801j35085J54710C72033L88024k35658K10048j79967O0973K55295k18923
17000F51825K85793j74062O8633P5940k04030J73101Q0572l5297O9749m89547
16990E02677L62900k21271K79158j45754K56002k09720j20356K31928R8513j27567
$$ plain form
16980 906510 1191993 865241 1024288 638054 913157 992300 1225911 1574385 1012615 996176
16970 996176 1024012 1059204 1040470 902131 1394087 1291618 1357236 1142886 1101850 913551
16960 913551 1335650 948905 1144917 1122819 1121202 1168148 1144866 1058127 1078846 1199914 1339957
16949 1339957 1025558 1191583 834169 1152681 1590877 1347313 829951 1454903 1260879
16940 1260879 1470222 1345853 1175357 1473757 1272212 1565931 1554275 879955 1303088 1439273
16930 1439273 1636770 1546739 1548882 1614216 1533187 1294965 1516074 1593760 1699288 1863118
16920 1863118 1636229 1541460 1710554 1806329 1747559 1947417 1657716 2033566 1817653 2023202
16910 2023202 1941063 1960426 1899065 1612082 2090832 1849814 2060012 1863517 2118862 2252342
$$ packed form
16980I06510K85483l26752J59047l86234K75103P9143K33611L48474n61770j6439
16970I96176K7836L5192j8734j38339M91956j02469O5618k14350m1036j88299
16960I13551M22099l86745J96012k2098j617M6946k3282q6739K0719J21068J40043
16949A339957l14399J66025l57414L18512M38196k43564n17362O24952j94024
16940A260879K09343j24369j70496K98400k01545K93719j1656o74320M23133J36185
16930A439273J97497r0031K143O5334q1029k38222K21109P7686J05528J63830
16920A863118k26889r4769J69094R5775n8770J99858k89701L75850k15913K05549
16910B023202q2139J9363o1361k86983M78750k41018K10198j96495K55345J33480
$$ plain form
16900 2252342 1765427 1946996 2405787 1957790 2081203 2163515 2230894 2372313 2394708 2157104
16890 2157104 2260829 2349360 2102068 2131643 2518228 2636658 2551317 2597481 2801409 2714119
16880 2714119 2670487 2460069 2525792 2903681 2890297 2864014 3130752 2766573 2968328 3061740
16870 3061740 3072775 3118409 3162881 3145393 3584487 3328333 3557454 3255865 3568550 3734589
16860 3734589 3667043 3821609 3783169 3691723 3834521 4026362 3723330 4084887 4639016 4287668
16850 4287668 4616199 4249453 4389523 4607452 4338334 4708946 4540894 4769242 4704231 5087779
16840 5087779 4924835 5113922 5150199 5172761 5619479 5401613 5714414 5756751 5682358 6234451
16830 6234451 6186921 6348214 6531775 6486155 6369791 6713877 7375277 7278611 7485025 7566702
$$ packed form
16900B252342m86915J81569M58791m47997J23413Q2312O7379J41419K2395k37604
16890B157104J03725Q8531k47292K9575L86585J18430q5341M6164K03928q7290
16880B714119m3632k10418O5723L77889j3384k6283K66738l64179K01755R3412
16870C061740J1035M5634M4472j7488M39094k56154K29121l01589L12685J66039
16860C734589o7546J54566l8440r1446J42798J91841l03032L61557N54129l51348
16850D287668L28531l66746J40070K17929k69118L70612j68052K28348o5011L83548
16840E087779j62944J89087L6277K2562M46718k17866L12801M2337p4393N52093
16830F234451m7530J61293J83561m5620j16364L44086O61400r6666K06414Q1677
$$ plain form
16820 7566702 7778958 7878434 8265461 8099505 8111658 8570122 8611982 8679202 9123090 9307452
16810 9307452 9427539 9821746 9950654 10232549 10441168 10803376 11311392 11516779 11719170
16801 11719170 12120567 12241668 12702865 12997911 13336615 13925297 14154583 14563742 14714402
16792 14714402 15503608 16156763 16570551 17276185 17377648 17609320 18216625 18954674 19716416
16783 19716416 20615780 20855556 22141146 22589585 23499196 24339789 24836525 25959213 26682949
16774 26682949 27718599 28831707 29961243 31472042 32037464 33259169 34539784 35722748
16766 35722748 37261006 38878573 40494405 41662602 43817502 45501682 47623552 49325830
16758 49325830 51390151 53632340 55798854 58435174 60586587 63098327 66027009 68757429
$$ packed form
16820G566702K12256R9476L87027j65956J2153M58464M1860O7220M43888J84362
16810I307452J20087L94207J28908K81895K08619L62208N08016K05387K02391
16801A1719170M01397J21101M61197K95046L38704N88682K29286M09159J50660
16792A4714402P89206O53155M13788P05634J01463K31672O07305P38049P61742
16783A9716416Q99364K39776J285590M48439R09611Q40593M96736J122688P23736
16774B6682949J035650J113108J129536J510799N65422J221705J280615J182964
16766C5722748J538258J617567J615832J168197K154900J684180K121870J702278
16758D9325830K064321K242189K166514K636320K151413K511740K928682K730420
$$ plain form
16750 68757429 71705248 74618105 77762504 80863302 84365196 87576252 90846513 94232611
16742 94232611 98109406 101404563 104974603 108421630 111746965 114796181 117714245 120266372
16734 120266372 123021410 125022702 126929001 128428337 129596122 130268961 130707656 130818287
16726 130818287 130050096 129351503 128074377 126340487 124281011 121858597 119533203 116428430
16718 116428430 113526080 110447365 107298481 104114535 100346722 97302515 93882646 90352938
16710 90352938 87082876 83701355 80616650 77879213 74774924 71692203 68982954 66229858
16702 66229858 63777147 61314891 58851493 56449406 54081792 52251234 50125795 48318880
16694 48318880 46638483 44890274 42971428 41688296 40132563 38935444 37335852 35951645
$$ packed form
16750F8757429K947819K912857L144399L100798L501894L211056L270261L386098
16742I4232611L876795L295157L570040L447027L325335L049216K918064K552127
16734A20266372K755038K001292J906299J499336J167785O72839M38695J10631
16726A30818287p68191o98593j277126j733890k059476k422414k325394l104773
16718A16428430k902350l078715l148884l183946l767813l044207l419869l529708
16710I0352938l270062l381521l084705k737437l104289l082721k709249k753096
16702F6229858k452711k462256k463398k402087k367614j830558k125439j806915
16694D8318880j680397j748209j918846j283132j555733j197119j599592j384207
$$ plain form
16686 35951645 34634271 33207154 32602375 31080294 30573267 29227592 28529718 27506672
16678 27506672 26512815 25820187 25018575 24181977 23173171 22429540 22245473 21112544 20949215
16669 20949215 20320985 19531341 19400941 18715605 18247475 17666729 16956697 16514173 16225886
16660 16225886 16105346 15497940 15172173 14527044 14283447 13924691 13573410 13111850 12950575
16651 12950575 12547222 12378626 11939967 11554163 11175605 11109946 10971048 10874378 10520940 10375870
16641 10375870 10147382 9628587 9652597 9382513 9069948 8942328 9276386 8297107 8512941
16632 8512941 8466957 8250623 7812137 8079780 7624118 7678472 7312679 7137171 7385883 7075974
16622 7075974 7092950 6803773 6723889 6363085 6342517 6147227 6383399 6078009 5810175 5610921
$$ packed form
16686C5951645j317374j427117o04779j522081n07027j345675o97874j023046
16678B7506672r93857o92628q01612q36598j008806p43631j84067j132929j63329
16669B0949215o28230p89644j30400o85336m68130n80746p10032m42524k88287
16660A6225886j20540o07406l25767o45129k43597l58756l51281m61560j61275
16651A2950575m03353j68596m38659l85804l78558o5659j38898r6670l53438j45070
16641A0375870k28488n18795K4010k70084l12565j27620L34058r79279K15834
16632H512941m5984k16334m38486K67643m55662N4354l65793j75508K48712l09909
16622G075974J6976k89177p9884l60804k0568j95290K36172l05390k67834j99254
$$ plain form
16612 5610921 5971656 5662897 5734881 5354349 5468088 5175087 5349063 5100966 4743213 5277839
16602 5277839 4848360 4832727 4840393 4726199 4423957 4584457 4201576 4342616 4589344 4547099
16592 4547099 3962631 4276657 4446598 4121998 4108244 3834980 3891188 4152725 3917148 3659560
16582 3659560 3850776 3898750 3210858 3501356 3635328 3537626 3330565 3520659 3405161 3570070
16572 3570070 3344507 3261990 3048001 3161387 3208741 2989841 2993708 3140471 2963044 2780037
16562 2780037 2801099 3132229 2703702 2633647 2916856 2621296 2698657 2790618 2362506 2859032
16552 2859032 2482794 2543220 2701730 2483975 2470105 2580331 2381475 2423229 2453792 2436669
16542 2436669 2304215 2459818 2450579 2405791 2123804 1840420 2259941 2110200 2270126 2226599
$$ packed form
16612E610921L60735l08759P1984l80532J13739k93001J73976k48097l57753N34626
16602E277839m29479j5633P666j14194l02242J60500l82881J41040K46728m2245
16592D547099n84468L14026J69941l24600j3754k73264N6208K61537k35577k57588
16582C659560J91216M7974o87892K90498J33972r7702k07061J90094j15498J64909
16572C570070k25563q2517k13989J13386M7354k18900L867J46763j77427j83007
16562B780037K1062L31130m28527p0055K83209k95560P7361R1961m28112M96526
16552B859032l76238O0426J58510k17755j3870J10226j98856M1754L0563j7123
16542B436669j32454J55603r239m4788k81987k83384M19521j49741J59926m3527
$$ plain form
16532 2226599 2503264 2067793 2128754 2159320 2005406 2056386 2115066 2072472 2371882 1977513
16522 1977513 1794801 1884114 1981215 1812440 2043655 1729021 1718421 2145287 1615044 2033930
16512 2033930 1647935 1620703 1723432 1616871 1558005 1738292 1578239 1564661 1444329 1584911
16502 1584911 1608691 1586851 1763062 1397676 1308003 1731679 1692007 1586963 1514972 1742681
16492 1742681 1805739 1682631 1577337 1629961 1593780 1286383 1602559 1349199 1450164 1268269
16482 1268269 1344932 1393870 1519833 1371361 1110910 1423730 1161883 1434103 1469234 1674920
16472 1674920 1430759 1614330 1310029 1465260 1264202 1071909 1502008 1442988 1586578 1621236
16462 1621236 1257576 1444002 1232297 1511855 1281186 1222040 1357351 1432530 1149472 1324312
$$ packed form
16532B226599K76665m35471O0961L0566j53914N0980N8680m2594K99410l94369
16522A977513j82712Q9313R7101j68775K31215l14634j0600M26866n30243M18886
16512B033930l85995k7232J02729j06561n8866J80287j60053j3578j20332J40582
16502A584911K3780k1840J76211l65386q9673M23676l9672j05044p1991K27709
16492A742681O3058j23108j05294N2624l6181l07397L16176k53360J00965j81895
16482A268269P6663M8938J25963j48472k60451L12820k61847K72220L5131K05686
16472A674920k44161J83571l04301J55231k01058j92293M30099n9020J43590L4658
16462A621236l63660J86426k11705K79558k30669n9146J35311P5179k83058J74840
$$ plain form
16452 1324312 1605729 1460097 1142919 1199343 1507196 1373916 1408814 911494 881437 1226937
16442 1226937 937946 1236109 1184960 1135325 1066088 1287657 1206547 1149407 1134745 1439179
16432 1439179 841164 1006579 949160 1123225 1212931 991310 1415904 1192341 1383428 1204123
16422 1204123 962270 1048520 1480103 1292528 1205297 1210361 1036299 1159907 860880 1073790
16412 1073790 1146202 1116633 844234 1064451 1059350 1149656 1233567 1077733 966121 1236798
16402 1236798 1218590 965256 1318278 1058772 1082847 918191 1103185 1329215 1335891 1279776
16392 1279776 932519 901470 1012113 952866 1092778 1444399 1183200 1090497 1122285 1067244
16382 1067244 588481 1390326 1087868 982141 1116068 1108667 1012844 742843 1307230 1191399
$$ packed form
16452A324312K81417j45632l17178N6424L07853j33280L4898m97320l0057L45500
16442A226937k88991K98163n1149m9635o9237K21569q1110n7140j4662L04434
16432A439179n98015J65415n7419J74065Q9706k21621M24594k23563J91087j79305
16422A204123k41853Q6250M31583j87575q7231N064j74062J23608k99027K12910
16412A073790P2412k9569k72399K20217n101R0306Q3911j55834j11612K70677
16402A236798j8208k53334L53022k59506K4075j64656J84994K26030O676n6115
16392A279776l47257l1049J10643n9247J39912L51621k61199r2703L1788n5041
16382A067244m78763Q01845l02458j05727J33927p401r5823k70001N64387j15831
$$ plain form
16372 1191399 1209457 1149408 1233806 1073848 1039514 672516 1246361 1146348 1100695 998462
16362 998462 963752 976531 910719 1065140 1035459 1079767 1003706 1015803 787904 812769 872175
16351 872175 980427 1056972 1109082 862562 1170723 889072 1085972 845921 830590 588038
16341 588038 1046535 995764 790386 738785 840522 1287013 885861 980741 893478 990093
16331 990093 599240 921805 734669 1046353 1127060 1321163 870566 994002 1145679 786331
16321 786331 997065 1047131 720923 1029318 953055 974238 1230137 983100 1075740 852395
16311 852395 880219 1157090 761947 891845 1024183 1249837 958737 1081815 1265057 926307
16301 926307 1011575 923815 1321566 993235 728566 611318 956632 750192 777326 858843
$$ packed form
16372A191399J8058o0049Q4398j59958l4334l66998N73845j00013m5653j02233
16362I98462l4710J2779o5812J54421k9681M4308p6061J2097k27899K4865N9406
16351H72175J08252P6545N2110k46520L08161k81651J96900k40051j5331k42552
16341E88038M58497n0771k05378n1601J01737M46491m01152R4880q7263R6615
16331I90093l90853L22565j87136L11684Q0707J94103m50597J23436J51677l59348
16321G86331K10734N0066l26208L08395p6263K1183K55899k47037R2640k23345
16311H52395K7824K76871l95143J29898J32338K25654k91100J23078J83242l38750
16301I26307Q5268q7760L97751l28331k64669j17248L45314k06440K7134Q1517
$$ plain form
16291 858843 569334 1033462 983918 903549 844754 1074284 954093 900056 904539 907505 795482
16280 795482 934137 808303 759105 400978 743831 951270 944206 751431 764517 748014
16270 748014 743379 875786 661336 1000281 709136 806319 429568 640643 843568 937959
16260 937959 637577 834423 605821 839377 808876 866439 885162 778109 835333 1109829
16250 1109829 745776 742309 731881 837923 901475 435661 757470 661208 806688 526090
16240 526090 542908 826078 546397 740488 629519 791155 746989 618822 670266 405619
16230 405619 750006 761991 867912 565889 749806 994176 667050 581016 633143 369569
16220 369569 554281 745870 413009 746528 373655 183663 613685 655244 881939 515178
$$ packed form
16291H58843k89509M64128m9544q0369n8795K29530j20191n4037M483K966j12023
16280G95482J38655j25834m9198l58127L42853K07439p064j92775J3086j6503
16270G48014m635J32407k14450L38945k91145R7183l76751K11075K02925R4391
16260I37959l00382J96846k28602K33556l0501N7563J8723j07053N7224K74496
16250A109829l64053l467j0428J06042O3552D35661L21809r6262J45480k80598
16240E26090J6818K83170k79681J94091j10969J61636m4166j28167N1444k64647
16230D05619L44387J1985J05921l02023J83917K44370l27126q6034N2127k63574
16220C69569J84712J91589l32861L33519l72873A83663M30022M1559K26695l66761
$$ plain form
16210 515178 475335 704861 454965 706489 733455 824142 503753 636000 725446 272954
16199 870398 435241 672280 533262 607536 597549 572730 616924 636223 212258 747216 940912
16188 940912 917670 444370 152183 596941 211094 659381 216608 619334 269984 495468
16178 495468 630185 743096 478496 443120 308976 638303 547938 396334 306408 207191
16168 207191 613036 667715 209552 539401 638479 350309 98737 367101 465251 347494
16158 347494 529366 415875 385192 473989 353654 304384 420739 635037 235888 516258
16148 516258 153254 408580 411951 416797 810256 184115 330998 567878 289786 478855
16138 478855 519617 725875 491051 -365138 94161 263982 364135 481350 380013 684151
$$ packed form
16210E15178l9843K29526k49896K51524K6966R0687l20389J32247Q9446B72954
16199H70398m35157K37039j39018P4274r987k4819M4194J9299B12258N34958J93696
16188I40912k3242D44370A52183M44758B11094M48287B16608M02726B69984K25484
16178D95468J34717J12911k64600l5376j34144L29327r0365j51604q9926r9217
16168B07191M05845N4679B09552L29849R9078k88170I8737K68364R8150j17757
16158C47494J81872j13491l0683Q8797j20335m9270J16355K14298B35888K80370
16148E16258A53254K55326L371M846L93459A84115J46883K36880k78092J89069
16138D78855M0762K06258k34824c65138I4161J69821J00153J17215j01337L04138
$$ plain form
16128 684151 260081 379597 353437 121191 462164 194834 221555 331094 -50275 221318
16117 95689 283312 80817 156306 273100 165544 414391 88554 -81398 556389 280760
16107 280760 221460 408311 379236 76167 98227 443773 19682 249630 90674 89112 158727
16096 158727 114305 243609 267528 172567 274775 370389 275246 14524 207723 78998 158891
16085 158891 140912 105001 276230 131784 -132792 231830 306692 127202 -6433 -87493 66968
16073 355304 77956 131228 406318 7752 -92206 -143507 412306 -96974 -20014 123964 466329
16062 466329 -112322 388335 218943 27722 273076 96613 -26151 -97735 35916 242627
16052 242627 -49913 109986 337610 70945 196650 98485 320133 65360 -19021 126367
$$ packed form
16128F84151B60081J19516k6160A21191L40973A94834K6721J09539e0275B21318
16117I5689J87623H0817P5489J16794j07556K48847H8554h1398E56389k75629
16107B80760n9300J86851k9075G6167K2060L45546A9682K29948I0674j562O9615
16096A58727m4422J29304K3919r4961J02208R5614r5143A4524J93199G8998P9893
16085A58891j7979l5911J71229A31784a32792B31830P4862A27202f433q1060F6968
16073C55304G7956N3272K75090G752i2206n1301D12306i6974b0014A23964L42365
16062D66329a12322C88335j69392B7722K45354I6613b6151p1584C5916K06711
16052B42627d9913A09986K27624G0945J25705r8165K21648F5360a9021A26367
$$ plain form
16041 426289 356065 -124414 188524 -99627 35689 116888 -25991 501521 210965 81716 -6157
16029 -178235 70869 -113806 250352 192525 -172898 271422 281831 221977 -80430 -101944 229186
16017 86918 168804 17528 -31193 -140603 48150 296410 93614 -26123 202363 106188 355816
16006 355816 -57679 -62372 -64440 214488 -62741 45097 191419 98690 37837 226633 -11855
15994 78811 -168594 37502 45188 -292309 324910 146179 112544 186361 502378 184074 396313
15983 396313 263367 153328 104178 231462 190983 122226 49271 150447 -23435 -64837 154569
15971 57708 92949 29570 -151783 -113540 342164 19804 287914 -24197 106909 35176 154857
15960 154857 227015 -347910 -57942 43204 -45567 10154 -28106 -75725 438188 73596 298724
$$ packed form
16041D26289p0224a24414A88524i9627C5689Q1199b5991E01521B10965H1716f157
16029a78235G0869a13806B50352n7827a72898B71422J0409n9854h0430k1514B29186
16017H6918Q1886A7528c1193j09410D8150K48260I3614b6123B02363r6175K49628
16006C55816e7679m693k068B14488f2741D5097J46322r2729C7837J88796a1855
15994G8811a68594C7502P686b92309C24910A46179l3635P3817L16017A84074K12239
15983C96313j32946j10039m9150J27284m0479o8757D9271J01176b3435m1402A54569
15971E7708L5241B9570a51783L8243C42164A9804K68110b4197A06909C5176J19681
15960A54857P2158c47910e7942D3204d5567A0154b8106m7619D38188G3596K25128
$$ plain form
15949 298724 68771 2207 -23093 278811 -80496 -187437 -164968 120656 248754 193895 -71778
15937 165870 137887 -146717 58707 -164800 -65174 -92830 93900 -200272 61248 132445 -90587
15925 -140105 218762 -148039 100526 102151 -145963 -100700 -29213 41773 48030 -166784 74604
15913 -358957 -254338 99727 81176 76746 -94504 -259173 388754 271319 75747 -84463 171845
15901 209678 69868 -380370 -285602 -18348 87126 179069 -85582 244500 -35442 -109581 -113946
15890 -113946 89220 -242978 -69229 -185695 -174918 7374 -180828 -115870 211652 -301849 155307
15878 -186624 -128581 173191 54798 252051 70774 -360901 -264484 82995 -46442 42436 11929
15866 126381 -122317 -367841 103532 -384856 85801 -180392 -217777 118491 -104215 -97609
$$ packed form
15949B98724F8771B207b3093B78811h0496j06941K2469A20656J28098n4859g1778
15937A65870k7983a46717E8707a64800f5174k7656I3900b00272F1248P1197i0587
15925a40105B18762a48039A00526J625a45963M5263b9213D1773O257a66784G4604
15913c58957J04619I9727j8551m430i4504j64669C88754j17435G5747h4463A71845
15901B09678F9868c80370R4768a8348H7126R1943h5582B44500c5442p4139m365
15890a13946H9220b42978f9229j16466J0777G374a80828O4958B11652c01849A55307
15878a86624N8043A73191E4798J97253G0774c60901R6417H2995d6442D2436A1929
15866A26381a22317k45524A03532c84856H5801a80392l7385A18491a04215O606
$$ plain form
15856 -97609 -148083 124627 -220792 232608 -153807 75760 187604 -50623 -37152 -19936 -43062
15845 -43062 318404 78578 -401933 64001 141920 7047 11387 186732 263461 93550 -10296
15833 103748 5280 -204273 -113427 -236923 -6390 25582 178401 216603 48019 64897 -136151
15821 117994 -81140 18927 160093 145024 -7960 -6258 -83073 -149224 165121 64331 131210
15810 131210 53562 -56703 -108979 -101361 -357728 -171588 238115 -251868 137026 -281269
15799 136532 -143298 -158755 -175950 141665 -116086 -295394 -204059 -66406 199283 -171115
15788 -4828 -73854 -58821 -140344 178787 -120519 28238 -239149 -229999 72844 -175354 48421
15776 -81095 -13327 -247043 43599 -235567 -115991 -314429 -194648 317836 -73889 51974
$$ packed form
15856i7609n0474A24627b20792B32608a53807G5760J11844e0623J3471J7216k3126
15845d3062C18404G8578d01933F4001P7919G047M340J75345P6729I3550a0296
15833A03748E280b04273R0846j23496f390B5582J52819L8202D8019J6878a36151
15821A17994h1140A8927J41166j5069g960J702p6815o6151A65121F4331O6879
15810A31210E3562e6703n2276P618k56367a71588B38115b51868A37026b81269
15799A36532a43298j5457j7195A41665a16086j79308R1335f6406A99283a71115
15788d828o9026J5033q1523A78787a20519B8238b39149R150G2844a75354D8421
15776h1095a3327k33716D3599b35567a15991j98438J19781C17836g3889E1974
$$ plain form
15765 -217700 104912 36146 -13015 81834 -80022 -191783 49743 -354034 -120025 -128800 75578
15753 -2523 -101230 18828 193047 116751 151219 96941 -39069 295583 -44622 -89595 50194
15741 208651 -283147 257867 26000 282238 -190145 -309157 -152305 107379 35043 -291025
15730 -169812 198416 152404 -175475 135253 -61411 -313076 -237800 -9619 23780 -115334 -234926
15719 -234926 -332977 -20270 -178798 -296467 -91103 16328 105430 -109462 -111017 -378385 -50244
15707 -28454 -264897 242951 -396894 208615 -251694 -81223 194981 157759 -293887 96529
15696 -334887 -203197 -85697 -31883 -22971 99631 -173266 -35054 192421 508992 -55410 -306426
15685 -306426 -16379 -47778 218964 -213897 329114 331043 209990 -24151 137931 154166 -58159
$$ packed form
15765b17700A04912C6146a3015H1834h0022j11761D9743c54034a20025q775G5578
15753b523r8707A8828J74219p6296L4468n4278c9069B95583d4622m4973E0194
15741B08651b83147B57867B6000K56238a90145j19012a52305A07379C5043b91025
15730a69812A98416m6012a75475A35253f1411k51665P5276i619B3780a15334j19592
15719b34926r8051b0270j58528j17669i1103A6328Q9102a09462j555k67368e0244
15707b8454k36443B42951c96894B08615b51694h1223A94981l7222b93887I6529
15696c34887J31690h5697c1883Q912I9631a73266c5054A92421L16571e5410k51016
15685c06426a6379l1399B18964b13897C29114J929j21053b4151A37931J6235e8159
$$ plain form
15673 -62273 -35125 70842 -26634 -92803 -116521 -52084 43158 342 62194 -46795 -192478 -149139
15661 -149139 2290 94163 177437 -163994 -229082 70542 -75537 162252 -178043 315265 28155
15649 -333447 120718 -124918 32 134275 -162984 -447685 -128679 218142 -44633 46458 -70056
15637 -137484 -46977 -170532 54711 -74055 82691 204486 -20978 -162011 -173162 -18501 141064
15625 -126204 121639 12452 -330875 -196268 -68025 233227 -160385 -22130 -65242 -108770
15615 -108770 -95309 212955 -109753 257287 -66400 -126090 -124532 287074 -10188 -36128 174852
15603 -12112 95290 -3315 63489 43271 38414 -255570 68804 218668 -229288 -32797 -11169
15591 -31226 -12908 271080 -27341 -8882 -202946 262790 37057 167429 -78253 -320329 -288724
$$ packed form
15673f2273K7148G0842b6634o6169k3718e2084D3158C42O1852d6795j45683M3339
15661a49139B290R1873Q3274a63994o5088G0542g5537A62252a78043C15265B8155
15649c33447A20718a24918C2J34243a62984k84701a28679B18142d4633D6458g0056
15637a37484d6977j23555E4711g4055H2691J21795b0978j41033j1151a8501A41064
15625a26204A21639A2452c30875J34607f8025B33227a60385b2130m3112m3528
15615a08770J3461B12955a09753B57287f6400n9690J558B87074a0188k5940A74852
15603a2112I5290c315F3489k0218m857b55570F8804J49864b29288c2797a1169
15591c1226a2908B71080b7341h882j94064B62790C7057J30372g8253k42076L1605
$$ plain form
15580 -288724 -43497 322437 -110421 194901 -148010 -138027 147624 -193646 -245313 -124261
15570 -124261 144518 -103444 -58510 209500 -74432 56888 -403676 252048 16204 105687
15560 105687 317214 139919 -292134 -25454 124190 -108102 -52728 88278 228771 58918
15549 11299 -23999 14481 106306 -41895 -69556 146548 -17234 64693 -111330 -106874 -250333
15538 -250333 -180514 218168 120855 -401984 -69847 197067 -41546 -47604 -92669 187074 -102121
15526 18695 -76460 -119782 87788 -128078 34125 -103022 -260748 -36251 -319142 60687 80835
15515 80835 265245 162988 14390 -85987 149512 15286 51153 -214896 -26401 -242021 215207
15503 -153490 -48264 81663 -128548 417021 -60144 65649 -173518 95351 -166467 -198670 219426
$$ packed form
15580b88724d3497C22437a10421A94901a48010R983A47624a93646n1667J21052
15570a24261A44518a03444M4934B09500g4432E6888d03676B52048A6204Q9483
15560A05687K11527A39919b92134b5454A24190a08102e2728H8278J40493E8918
15549A1299b3999A4481R1825d1895k7661A46548a7234F4693a11330M456j43459
15538b50333O9819B18168r7313d01984f9847A97067d1546o058m5065A87074a02121
15526A8695g6460m3322H7788a28078C4125a03022j57726c6251k82891F0687K0148
15515H0835J84410j02257A4390h5987A49512A5286L5867b14896b6401k15620B15207
15503a53490d8264H1663a28548D17021f0144F5649a73518I5351a66467l2203B19426
$$ plain form
15491 177630 81438 69938 -181192 149089 68034 89956 -2576 -196291 -121794 148917 68527
15479 -95136 -148677 -272272 -245924 -212423 -39554 124943 100029 85206 -5914 -151089 129887
15467 -262262 147467 -315417 16273 155507 -284771 -3404 129069 215296 -90540 -91540 103311
15455 238059 53012 7427 55102 133654 -2337 271524 -13476 121609 -67226 156164 440421
15444 440421 -108723 124660 25326 92799 -15811 235245 358904 284714 -60495 -116190 -78932
15433 -78932 220811 151015 119028 184005 33457 -132165 172122 -99363 142095 -33218 73122
15421 267680 -75576 -3303 113949 -48668 288677 89502 -101367 -33577 -26446 -84321 -227969
15410 -227969 -127980 179944 -150 -157503 -32009 127029 53479 222854 183875 -114214 26126
$$ packed form
15491A77630H1438j1500a81192A49089F8034K1922b576j93715P4497A48917F8527
15479i5136n3541j23595K6348L3501c9554A24943k4914j4823e914j45175A29887
15467b62262A47467c15417A6273J39234b84771c404A29069Q6227i0540j000A03311
15455B38059E3012G427M7675P8552b337B71524a3476A21609f7226A56164K84257
15444D40421a08723A24660B5326O7473a5811B35245J23659p4190f0495n5695L7258
15433g8932B20811o9796l1987O4977C3457a32165A72122i9363A42095c3218G3122
15421B67680g5576c303A13949d8668B88677H9502a01367c3577P131n7875j43648
15410b27969R9989A79944a50j57353c2009A27029E3479J69375l8979a14214B6126
$$ plain form
15398 -347949 42794 222116 160314 97724 -175546 138338 -19920 247975 65330 201973
15388 201973 143389 -92707 348293 -19544 169563 1669 -269087 -282342 -139632 198888 -217454
15376 151838 -98088 36732 -328662 -144791 -48699 -29255 8947 26441 -78066 296983 357516
15365 357516 153827 183065 -2383 165399 -27503 34933 -253212 117697 49357 -124246 -154240
15354 -154240 134707 435214 162580 -144550 77109 -278276 -160362 -98278 2916 284340
15344 284340 -124830 81658 74047 644 -275999 293447 -161967 -12818 132908 -189718 93467
15332 107079 -126465 -50558 -56236 -166200 -93886 -171180 -120195 -18926 30681 18457 67654
15321 67654 -220959 209666 249331 -71542 123283 -6076 383376 -40259 -24465 -191810 35758
$$ packed form
15398c47949D2794J79322o1802o2590a75546A38338a9920B47975F5330J36643
15388B01973n8584i2707C48293a9544A69563A669b69087j3255a39632A98888b17454
15376A51838i8088C6732c28662a44791d8699J9444H947J7494g8066B96983O0533
15365C57516A53827K9238b383A65399b7503C4933b53212A17697D9357a24246k9994
15354a54240A34707L00507A62580a44550G7109b78276J17914O2084B916K81424
15344B84340a24830H1658p611F44b75999B93447a61967a2818A32908a89718I3467
15332A07079a26465e0558n678j09964P2314p7294N0985a8926C0681j2224M9197
15321F7654b20959B09666L9665g1542A23283f076C83376d0259J5794j67345C5758
$$ plain form
15309 83667 91550 29188 71779 325994 59989 -80912 373376 -132660 -80800 159060 96519
15298 96519 -6251 94756 477443 -181753 -78400 224989 -2984 81603 -195572 -15831 84549
15286 363316 55359 -99284 -55759 -122806 247381 178053 209091 247661 252376 -193311 -70506
15274 -17 35658 -96646 51955 118975 -36518 -107963 -63801 -6628 -30150 -120953 264341 -209251
15261 243515 -154791 343277 133334 -19404 147796 242403 354210 181025 343386 1121732
15251 1121732 759403 651590 777816 -52848 180133 412434 508179 -135773 -246856 20493
15240 -120901 -46466 -379452 46316 199188 54509 -2427 182885 -34735 117264 51995 215138
15229 215138 89125 72646 123821 145164 94762 336765 -87849 -29511 274017 373903 51989
$$ packed form
15309H3667P883B9188M2591K54215E9989h0912C73376a32660N1860A59060o2541
15298I6519f251I4756L82687a81753g8400B24989b984H1603a95572a5831H4549
15286C63316E5359i9284M3525o7047B47381o9328L1038L8570M715a93311g0506
15274a7C5658i6646E1955O7020c6518p1445M4162f628k3522r0803B64341b09251
15261B43515a54791C43277A33334a9404A47796R4607J11807j73185J62361P78346
15251A121732l62329j07813J26226e2848A80133K32301R5745a35773j11083B0493
15240a20901d6466l32986D6316J52872E4509b427A82885c4735A17264E1995J63143
15229B15138H9125j6479N1175K1343n0402K42003h7849b9511B74017R9886E1989
$$ plain form
15217 309776 -2039 326426 192729 -72772 171792 122476 248144 335917 -76356 234753 229073
15206 229073 165478 269809 -255671 -102163 216110 193447 -50766 39066 256044 32770
15195 170436 156935 5484 106377 321828 164740 22163 322673 8800 189774 71485 -94879
15183 167451 168482 125599 55018 65534 42924 227353 -51999 -259863 135618 98702 14814
15171 -22955 -101291 -214254 -72544 177193 5127 -36958 235715 114549 -75495 208969 -176032
15159 -10198 187831 10103 -198658 -244382 -66864 392049 106553 -197604 187407 261706
15149 261706 240678 209889 269260 352135 16675 35408 215362 342022 137824 -225770 -226835
15138 -226835 50494 18066 -97748 -56698 373032 130577 -115065 -121733 93353 151720 89731
$$ packed form
15217C09776b039C26426j33697g2772A71792m9316J25668Q7773g6356B34753n680
15206B29073o3595J04331b55671a02163B16110k2663e0766C9066K16978C2770
15195A70436j3501E484J00893K15451j57088B2163L00510H800J80974G1485i4879
15183A67451J031m2883E5018J0516k2610J84429e1999k07864A35618l6916A4814
15171b2955p8336j12963g2544A77193E127c6958B35715A14549g5495B08969a76032
15159a0198A87831A0103a98658m5724f6864C92049A06553a97604A87407P4299
15149B61706k1028l0789N9371Q2875A6675J8733J79954J26660A37824b25770j065
15138b26835E0494A8066i7748M1050C73032A30577a15065o668I3353N8367o1989
$$ plain form
15127 89731 -28030 81955 138845 217346 367203 -181900 114507 252079 206578 389494 312283
15116 312283 244838 22732 203564 -2966 -28754 340492 230057 -248560 11285 208970 83939
15104 231904 58672 331576 229371 150764 -37876 -40467 280264 245867 -88875 134976 -50344
15092 -43801 403843 174835 31510 298097 339425 153704 76451 -132029 444514 -51762
15081 157212 -57256 13285 186593 13920 124269 267092 -71854 3407 51466 284967 84724
15069 250306 173104 100581 283985 349115 -141125 176644 212518 615812 40667 -16619 250473
15057 342526 254756 151941 170634 202250 17075 107519 287025 275191 37450 293849 322617
15046 322617 97276 349874 535970 152547 343833 153528 -87531 46028 350468 158065
$$ packed form
15127H9731b8030H1955N6890P8501J49857a81900A14507J37572m5501J82916p7211
15116C12283o7445B2732J80832b966k5788C40492j10435b48560A1285J97685H3939
15104B31904E8672K72904j02205p8607c7876k591B80264l4397h8875A34976e0344
15092d3801D03843A74835C1510K66587M1328A53704G6451a32029D44514e1762
15081A57212e7256A3285J73308A3920J10349J42823g1854C407M8059K33501H4724
15069B50306p7202p2523J83404O5130a41125A76644L5874M03294D0667a6619B50473
15057C42526q7770j02815J8693L1616A7075R0444J79506j1834C7450K56399K8768
15046C22617I7276K52598J86096A52547J91286A53528h7531D6028L04440A58065
$$ plain form
15035 68025 -24039 204385 -187670 277763 -30386 360480 312487 67863 275123 534655
15025 534655 264445 180359 -32325 41653 276027 88955 -108757 225210 173897 46650 418474
15014 418474 29218 429944 155719 266714 43093 66984 -153530 248017 438516 226825
15004 226825 -73392 303272 191377 64813 255841 196342 235410 447203 103643 480664
14994 480664 155834 1052 169175 373168 361714 119427 232358 279763 229987 481864
14984 481864 179152 261877 304650 556410 416261 364214 145383 157470 484739 123329
14973 248449 33528 86809 49477 713907 403402 296851 483385 184475 625972 158874
14962 387755 188307 649089 186372 -32358 171771 498073 210982 299688 274202 193774
$$ packed form
15035F8025b4039B04385a87670B77763c0386C60480m7993F7863K07260K59532
15025E34655B64445q4086c2325D1653K34374H8955a08757B25210n1313D6650L71824
15014D18474B9218M00726A55719J10995D3093K3891a53530B48017J90499k11691
15004B26825g3392C03272j11895F4813J91028n9499L9068K11793A03643L77021
14994D80664A55834A052J68123K03993j1454A19427J12931M7405m9776K51877
14984D81864A79152Q2725M2773K51760j40149n2047A45383J2087L27269A23329
14973B48449C3528N3281l7332O64430l10505j06551J86534A84475M41497A58874
14962C87755A88307M60782A86372c2358A71771L26302B10982Q8706k5486q0428
$$ plain form
14952 193774 283022 291675 298850 305589 278040 207881 300840 -28404 113929 340026 145949
14940 71463 338172 192297 190695 339422 280945 307494 540540 425760 237449 25564 414361
14929 414361 109479 235508 573510 556911 503273 245337 752916 423688 235520 480359
14919 480359 292031 609979 456183 510345 525103 636546 406633 218357 411977 157579
14908 367089 551643 341100 263241 274895 447012 501294 427945 212318 226948 607419
14898 607419 261685 233278 163834 337439 366995 148794 256768 414563 350525 431348
14888 431348 227812 622545 476941 290040 560538 605082 367848 370714 342843 268097
14878 268097 380705 353541 474992 285242 368542 359652 359370 588562 92943 592905 526141
$$ packed form
14952A93774Q9248Q653P175O739k7549p0159R2959b8404A13929K26097A45949
14940G1463K66709j45875j602J48727n8477K6549K33046j14780j88311B5564L88797
14929D14361A09479J26029L38002j6599n3638B45337N07579l29228j88168K44839
14919D80359j88328L17948j53796N4162J4758J11443k29913j88276J93620A57579
14908C67089J84554k10543p7859J1654J72117N4282p3349B12318J4630L80471
14898F07419B61685k8407o9444J73605K9556A48794J07974J57795o4038Q0823
14888D31348k03536L94733j45604j86901K70498M4544k37234K866k7871p4746
14878B68097J12608k7164J21451j89750Q3300q890k82K29192I2943M99962o6764
$$ plain form
14867 526141 462213 297830 -15338 305250 403341 368902 546394 266743 285325 112824
14856 715965 332818 817248 380043 456157 428080 323606 161553 406186 337190 62573
14845 530928 581836 248670 427422 483787 411665 385623 531313 409762 605664 675951
14835 675951 588747 429002 353871 572802 536636 551101 739546 258725 618558 265314
14824 528068 605682 521779 381150 329189 236757 437950 474964 337125 767111 485182
14814 485182 321239 246320 608942 443298 361232 490193 573729 285477 498480 549037
14804 549037 391850 465580 214064 110668 545595 448199 669979 261217 448951 629260
14794 629260 633478 350693 694315 701593 595864 609303 625229 680007 791419 888141 522165
$$ packed form
14867E26141o3928j64383a5338C05250R8091l4439J77492B66743J8582A12824
14856G15965C32818M84430C80043P6114k8077j04474A61553K44633o8996F2573
14845E30928N0908B48670J78752N6365p2122k6042J45690j21551J95902P0287
14835F75951q7204j59745p5131K18931l6166J4465J88445B58725L59833B65314
14824E28068P7614q3903j40629n1961r2432K01193L7014j37839M29986k81929
14814D85182j63943p4919L62622j65644q2066J28961Q3536B85477K13003N0557
14804E49037j57187P3730B14064j03396M34927r7396K21780B61217J87734J80309
14794F29260M218k82785L43622P278j05729J3439J5926N4778J11412R6722l65976
$$ plain form
14783 522165 494173 523616 604990 877103 724407 720563 751804 809572 685098 537253 661030
14772 661030 213504 490883 542250 701898 568577 767699 495690 691062 713988 825601
14762 825601 491212 528142 487891 511060 510131 891873 676298 761750 356658 635129 860908
14751 860908 734301 653788 428743 606013 705894 368223 858180 539897 560476 917142
14741 917142 691684 545935 513987 372267 642667 963761 809913 760651 789111 684464
14731 684464 717326 767282 667181 1175995 1002352 692680 743186 820061 758435 778323 781989
14720 781989 639176 805036 1147000 680711 843607 794235 663979 471339 930951 782794
14710 782794 605964 789507 828845 1026088 714070 857369 626297 610961 766851 831255
$$ packed form
14783E22165k7992K9443Q1374K72113j52696l844L1241N7768j24474j47845J23777
14772F61030B13504K77379N1367J59648j33321J99122k72009J95372K2926J11613
14762H25601l34389L6930m0251K3169r29L81742k15575Q5452C56658K78471K25779
14751H60908j26607q0513k25045J77270R9881l37671M89957l18283K0579L56666
14741I17142k25458j45749l1948j41720K70400L21094j53848m9262K8460j04647
14731F84464L2862M9956j00101N08814j73643l09672N0506P6875o1626J9888L666
14720G81989j42813J65860L41964m66289J62896m9372j30256j92640M59612j48157
14710G82794j76830J83543L9338J97243l12018J43299k31072j5336J55890O4404
$$ plain form
14700 831255 713076 817954 801645 912596 725424 924777 751555 1188519 912719 1073534
14690 1073534 1096234 927135 1049449 836267 696547 892523 802797 1028896 1013590 850315
14680 850315 916482 1238191 1117212 867750 883254 877731 1407673 1007037 752468 877882
14670 877882 885916 808203 1011804 1028650 1127507 1150599 916565 1074975 1239584 822318 1300541
14659 1300541 767902 908261 1016870 1259445 1273264 768237 1021924 1016294 1195753 1152568
14649 1152568 846481 1130991 971873 1092456 1035787 1254516 931944 1185907 1099390 1021502
14639 1021502 1078755 1562958 979677 1226790 1156095 1481049 1062193 1390043 1233841 1310921
14629 1310921 1341502 1320371 1419868 1272451 1185933 1300317 1352422 1553581 1586002 1363631
$$ packed form
14700H31255j18179J04878j6309J10951j87172J99353j73222M36964k75800J60815
14690A073534K2700j69099J22314k13182j39720J95976q9726K26099j5306j63275
14680H50315O6167L21709j20979k49462J5504n523N29942m00636k54569J25414
14670H77882Q034p7713K03601J6846R8857K3092k34034J58410J64609m17266M78223
14659A300541n32639J40359J08609K42575J3819n05027K53687n630J79459m3185
14649A152568l06087K84510j59118J20583n6669K18729l22572K53963q6517p7888
14639A021502N7253M84203n83281K47113p0695L24954m18856L27850j56202P7080
14629A310921L0581k1131R9497j47417q6518J14384N2105K01159L2421k22371
$$ plain form
14619 1363631 1294255 1332465 1215418 1281463 1551271 1074585 1229102 1555519 1371451 1354161
14609 1354161 1467372 1482280 1460434 1597051 1612087 1478733 1503227 1538912 1344121 1688999
14599 1688999 1557613 1475949 1403208 1634279 1792557 1645866 1928519 1660681 1814921 1794505
14589 1794505 1785225 1767408 1756406 1947530 1963247 1746222 1762326 1957845 1844443 2113000
14579 2113000 1938561 2149237 2091073 1905282 2039997 1966628 2452038 2417533 2115177 2310464
14569 2310464 2397480 2315303 2268114 2264052 2886947 2550034 2823174 2653531 2512978 2966899
14559 2966899 2641578 3066778 3239513 3346421 3571851 3884698 4443404 4887947 6052366
14550 6052366 8111149 11075880 14317012 21837205 29928759 26814231 16065747 8683227
$$ packed form
14619A363631o9376L8210j17047O6045K69808m76686J54517L26417j84068j7290
14609A354161J13211J4908k1846J36617J5036j33354K4494L5685j94791L44878
14599A688999j31386q1664p2741K31071J58278j46691K82653k67838J54240k0416
14589A794505r280j7817j1002J91124J5717k17025J6104J95519j13402K68557
14579B113000j74439K10676n8164j85791J34715p3369M85410l4505l02356J95287
14569B310464Q7016q2177m7189m062O22895l36913K73140j69643j40553M53921
14559B966899l25321M25200J72735J06908K25430L12847N58706M44543J164419
14550F052366K058783K964731L241132P520193Q091554l114528j0748484p382520
$$ plain form
14542 8683227 5655957 3977810 3231472 3034241 2601738 2474582 2156134 2468079 2177200
14533 2177200 1811250 2180312 2474570 2204232 2691666 2628927 2638706 2187493 2260091 2349766
14523 2349766 2457386 2175090 2531336 2104409 2232894 2576799 2297267 2546360 2752395
14514 2752395 2662292 2620447 2646714 2698451 2776546 2676117 2532349 2905530 2981876 3018964 3049099
14503 3049099 2807134 2691623 3195111 3110637 3057264 3132384 3281718 2704873 3455769 3229499
14493 3229499 3646425 3263752 3376708 3508241 3488799 3252142 3610574 3468180 3638251 3591974
14483 3591974 4033220 3638352 3665935 3959528 3934968 3976143 4230683 3870615 3774160 4105125
14473 4105125 3963129 4093966 4295713 4147503 3908938 4324911 4318439 4591252 4321505 4367010
$$ packed form
14542H683227l027270j678147p46338j97231m32503j27156l18448L11945k90879
14533B177200l65950L69062K94258k70338M87434o2739R779m51213P2598Q9675
14523B349766J07620k82296L56246m26927J28485L43905k79532K49093K06035
14514B752395r0103m1845K6267N1737P8095j00429j43768L73181P6346L7088L0135
14503C049099k41965j15511N03488q4474n3373P5120J49334n76845P50896k26270
14493C229499M16926l82673J12956J31533j9442k36657L58432j42394J70071m6277
14483C591974M41246l94868K7583K93593k4560M1175K54540l60068r6455L30965
14473D105125j41996J30837K01747j48210k38565M15973o472K72813k69747M5505
$$ plain form
14463 4367010 4617533 4627490 4578424 4455516 4985744 4920278 4657415 4764473 4772088 5239240
14453 5239240 4990513 4758459 5180384 5084933 4960831 5521109 5389105 5419704 5604209 5772719
14443 5772719 5803990 5598279 5656426 5847447 5864925 6073421 5856994 5959799 6224209 6504498
14433 6504498 6744947 6563837 6426948 6523240 6805929 7094528 6855516 6668888 7466609 7246295
14423 7246295 7191709 7277286 7411750 7834714 7824345 7815975 7976282 8412802 8214385 8289957
14413 8289957 8471772 8575760 8728166 8791007 9008148 8964951 9439617 9393497 9315970 10067792
14403 10067792 9862616 10185165 10049682 10126964 10696862 10634091 10973566 10977063 11325897 11334879
14393 11334879 11706953 11579564 11875471 12077334 12213091 12455064 12771374 12966509 13043970
$$ packed form
14463D367010K50523R957m9066j22908N30228o5466k62863J07058P615M67152
14453E239240k48727k32054M21925r5451j24102N60278j32004L0599J84505J68510
14443E772719L1271k05711N8147J91021J7478K08496k16427J02805K64410K80289
14433F504498K40449j81110j36889R6292K82689K88599k39012j86628P97721k20314
14423G246295n4586Q5577J34464M22964j0369q370J60307M36520j98417P5572
14413H289957J81815J03988J52406O2841K17141m3197M74666m6120p7527P51822
14403A0067792k05176L22549j35483P7282N69898o2771L39475L497L48834Q982
14393A1334879L72074j27389K95907K01863J35757K41973L16310J95135P7461
$$ plain form
14384 13043970 13829345 13429736 13710911 13991528 14613324 14640721 14858251 15291765 15588292
14375 15588292 15709692 16164168 16576266 16403337 16893577 17414513 17491230 18103574 18298675
14366 18298675 19061001 19510626 19723249 20163384 20241273 21140449 21412863 21845824 22403683
14357 22403683 23073302 23387209 23936349 24707435 25150410 25513299 26339861 26909768 27603337
14348 27603337 27822286 29176920 29793255 30501977 31375937 32465241 33018874 34057229 34864215
14339 34864215 36026302 37064627 37954034 39023758 40078434 41280333 42638822 43812596
14331 43812596 45256449 46819249 48315187 49780659 51101779 53221838 54902828 56589560
14323 56589560 58241319 60744280 62558549 64981705 67352011 69841605 72231419 74811473
$$ packed form
14384A3043970P85375l99609K81175K80617O21796K7397K17530M33514K96527
14375A5588292J21400M54476M12098j72929M90240N20936P6717O12344J95101
14366A8298675P62326M49625K12623M40135P7889Q99176K72414M32961N57859
14357B2403683O69619L13907N49140P71086M42975L62889Q26562N69907O93569
14348B7603337K18949J354634O16335P08722Q73960J089304N53633J038355Q06986
14339C4864215J162087J038325Q89407J069724J054676J201899J358489J173774
14331D3812596J443853J562800J495938J465472J321120K120059J680990J686732
14323E6589560J651759K502961J814269K423156K370306K489594K389814K580054
$$ plain form
14315 74811473 77726541 80962294 84075906 87444253 90681257 94762155 98762398 102482497
14307 102482497 106638008 111638705 116542825 121734045 127388837 132916215 139184665 145638614
14299 145638614 152524814 160014444 167638929 175676507 184068044 193293198 202784366 212816887
14291 212816887 223115860 234575659 245918265 257910168 270255175 282895790 296067772
14284 296067772 309410439 322888022 336440978 349885575 362968771 375548114 387495573
14277 387495573 398316307 408328891 416817331 423720853 428125306 430031243 430081657 428964028
14269 428964028 426639537 422884845 417650945 411341038 403589451 394120170 383054964 371014406
14261 371014406 358014233 344449727 330907040 316967510 303051687 289319160 276189960
$$ packed form
14315G4811473K915068L235753L113612L368347L237004M080898M000243L720099
14307A02482497M155511N000697M904120N191220N654792N527378O268450O453949
14299A45638614O886200P489630P624485Q037578Q391537R225154R491168J0032521
14291B12816887J0298973J1459799J1342606J1991903J2345007J2640615J3171982
14284B96067772J3342667J3477583J3552956J3444597J3083196J2579343J1947459
14277C87495573J0820734J0012584Q488440O903522M404453J905937N0414j117629
14269D28964028k324491l754692n233900o309907p751587r469281j1065206j2040558
14261C71014406j3000173j3564506j3542687j3939530j3915823j3732527j3129200
$$ plain form
14254 276189960 263310685 250749395 238675966 227187143 216164884 205957852 195940547
14247 195940547 186596826 177699404 169499796 161625527 154111021 146973707 140531724 134211156
14239 134211156 128065959 122732392 117380675 112558127 107673000 103241524 98842259 94933274
14231 94933274 91533656 88037345 84514821 81191987 78178935 75136204 72443936 70036096
14223 70036096 67485403 64957254 62677273 60433968 58611788 56811542 55010122 53080451
14215 53080451 51421762 50135233 48503156 46945499 45331782 43965190 42672257 41577306
14207 41577306 41055022 39468001 38167007 37190424 36592739 35228219 34473624 33396367 32500724
14198 32500724 31730572 30876043 29941725 29242272 28662143 27908381 27375126 26202976 26093693
$$ packed form
14254B76189960j2879275j2561290j2073429j1488823j1022259j0207032j0017305
14247A95940547r343721q897422q199608p874269p514506p137314o441983o320568
14239A34211156o145197n333567n351717m822548m885127m431476m399265l908985
14231I4933274l399618l496311l522524l322834l013052l042731k692268k407840
14223G0036096k550693k528149k279981k243305j822180j800246j801420j929671
14215E3080451j658689j286529j632077j557657j613717j366592j292933j094951
14207D1577306n22284j587021j300994r76583n97685j364520p54595j077257q95643
14198C2500724p70152q54529r34318o99453n80129p53762n33255j172150j09283
$$ plain form
14189 26093693 25220769 24664495 24244732 23604229 23276944 22593196 22298917 21605098 21060873
14180 21060873 20612121 20297572 19707382 19544247 19042445 18476213 18187719 17872964 17522647
14171 17522647 17119328 16810271 16504569 16210879 15809093 15604326 15250655 14890483 14928746
14162 14928746 14345797 14044906 13743069 13527459 13477139 13166610 13000267 12299479 12439806
14153 12439806 12392170 12066496 11942212 11762826 11340407 11375720 11214112 10858297 10570517 10579839
14143 10579839 10085765 9948448 10054809 10098760 10018873 9579771 9598535 9210994 8987776 9069818
14133 9069818 8789051 8458608 8629221 8605838 8565436 8351486 8236938 7964098 7916410 7671600
14123 7671600 7538260 7714600 7575567 7623721 7385812 7450702 7134112 7120418 7230478 6854656
$$ packed form
14189B6093693q72924n56274m19763o40503l27285o83748k94279o93819n44225
14180B1060873m48752l14549n90190j63135n01802n66232k88494l14755l50317
14171A7522647m03319l09057l05702k93690m01786k04767l53671l60172L8263
14162A4928746n82949l00891l01837k15610n0320l10529j66343p00788J40327
14153A2439806m7636l25674j24284j79386m22419L5313j61608l55815k87780R322
14143A0579839m94074j37317J06361M3951p9887m39102J8764l87541k23218Q2042
14133I069818k80767l30443J70613k3383m0402k13950j14548k72840m7688k44810
14123G671600j33340J76340j39033M8154k37909O4890l16590j3694J10060l75822
$$ plain form
14113 6854656 6613358 6719635 6422702 6228619 6361060 6235602 6456701 6057474 6151397 6183336
14103 6183336 5859196 5645509 5708767 5879175 5813230 5775570 5595252 5877319 5413701 5424461
14093 5424461 5094095 5183078 5088025 5118288 5290409 5014788 5146198 4976677 4812443 4891828
14083 4891828 4479677 4655762 4338793 4377189 4788947 4709088 4471702 4222122 4484799 4385656
14073 4385656 4359832 4210735 4289653 4025661 4245763 4089075 4140637 3985618 3991538 3683248
14063 3683248 3767881 3919000 4047183 3666867 3756120 3271554 3555175 3507623 3319583 3651289
14053 3651289 3464531 3171943 3200728 3311200 3309804 3660800 3316529 3306424 3166809 3556335
14043 3556335 2995249 2937975 3189960 3159004 3078869 2602104 2995693 3171266 2989462 2656483
$$ packed form
14113F854656k41298J06277k96933j94083J32441j25458K21099l99227R3923L1939
14103F183336l24140k13687O3258J70408o5945l7660j80318K82067m63618J0760
14093E424461l30366Q8983r5053L0263J72121k75621J31410j69521j64234P9385
14083D891828m12151J76085l16969L8396M11758p9859k37386k49580K62677r9143
14073D385656k5824j49097P8918k63992K20102j56688N1562j55019N920l08290
14063C683248Q4633J51119J28183l80316Q9253m84566K83621m7552j88040L31706
14053C651289j86758k92588K8785J10472j396L50996l44271j0105j39615L89526
14043C556335n61086n7274K51985l0956q0135m76765L93589J75573j81804l32979
$$ plain form
14033 2656483 3213360 2779885 2993656 2687317 2788134 2989770 2751299 2339653 2797175
14024 2797175 2718409 2075910 2449325 2528392 2485914 2571049 2435464 2589066 2538087 2412611
14014 2412611 2395330 1997468 2567630 2429963 2558110 2435406 1990735 2312346 2418159 1945822
14004 1945822 2227159 2260635 2583227 2175575 1951363 2377010 2317913 2268762 1972414 2328715
13994 2328715 2572202 2687384 2695754 3195374 4287399 5752056 9615770 16449743 26706950
13985 26706950 29233454 20489934 12906660 8691067 6396227 5146924 4402325 3650544
13977 3650544 3600597 3155751 3127301 2706050 2815503 2726079 2441291 2404254 2475933 2302486
13967 2302486 2354631 2333051 2256643 2218971 1921450 2125964 2234359 1991393 1966818 2028346
$$ packed form
14033B656483N56877m33475K13771l06339J00817K01636k38471m11646M57522
14024B797175p8766o42499L73415P9067m2478Q5135j35585J53602n0979j25476
14014B412611j7281l97862N70162j37667J28147j22704m44671L21611J05813m72337
14004A945822K81337L3476L22592m07652k24212M25647n9097m9151k96348L56301
13994B328715K43487J15182Q370M99620J092025J464657L863714O833973J0257207
13985B6706950K526504q743520p583274m215593k294840j249303p44599p51781
13977C650544m9947m44846k8450m21251J09453q9424k84788l7037P1679j73447
13967B302486N2145k1580p6408l7672k97521K04514J08395k42966k4575O1528
$$ plain form
13957 2028346 1768924 1843904 1630793 2132614 1946939 1661849 1778708 1824836 1680309 1758639
13947 1758639 1924631 1775525 1831349 1770496 1865631 2049955 1789074 1638846 1499248 1587324
13937 1587324 1546710 1654877 1524655 1350613 1971825 1460653 1442029 1411552 1320481 1533107
13927 1533107 1641103 1591294 1368964 1205950 1314204 1550269 1379595 1441603 1446075 1484905
13917 1484905 1307367 1675635 1569531 1677736 1466536 1522613 1209779 1279477 1410268 1233522
13907 1233522 1149833 1199252 1391239 1173966 1153802 1272578 1056608 1340372 1273155 1326973
13897 1326973 1032503 1294214 1237428 1168299 1283537 1486218 1190892 1053474 1126616 1229371
13887 1229371 1168690 1156004 1329245 1011394 728161 926514 985974 935573 1259491 1053301
$$ packed form
13957B028346k59422P4980k13111N01821j85675k85090J16859M6128j44527P8330
13947A758639J65992j49106N5824o0853R5135J84324k60881j50228j39598Q8076
13937A587324m0614J08167j30222j74042O21212n11172j8624l0477r1071K12626
13927A533107J07996m9809k22330j63014J08254K36065j70674O2008M472L8830
13917A484905j77538L68268j06104J08205k11200N6077l12834O9698J30791j76746
13907A233522q3689M9419J91987k17273k0164J18776k15970K83764o7217N3818
13897A326973k94470K61711n6786o9129J15238K02681k95326j37418P3142J02755
13887A229371o0681j2686J73241l17851k83233J98353N9460n0401L23918k06190
$$ plain form
13877 1053301 906234 1016943 941175 1177263 889394 1369499 1111686 1021330 843179 1209194
13867 1209194 1244810 995307 806204 869743 1133844 916950 722046 1077558 1076919 842798
13857 842798 1184373 1059644 1089332 1034953 1209560 955805 928223 720053 1107430 820739
13847 820739 888554 970304 696084 591301 831922 1132016 1073526 1090189 878778 727069
13837 727069 750761 845677 1056940 578178 1090616 779285 1091064 1092116 1050538 1010714 1076168
13826 1076168 1317585 943463 876805 664774 728768 574283 679707 840932 687556 713022
13816 713022 1135868 470634 631305 909694 754570 882554 726561 778524 846740 877565
13806 877565 650175 685010 544811 606393 811936 567686 763739 879763 757851 663438
$$ packed form
13877A053301j47067J10709p5768K36088k87869M80105k57813r0356j78151L66015
13867A209194L5616k49503j89103O3539K64101k16894j94904L55512o39k34121
13857H42798L41575j24729K9688n4379J74607k53755k7582k08170L87377k86691
13847H20739O7815Q1750k74220j04783K40621L00094n8490J6663k11411j51709
13837G27069K3692R4916K11263m78762N12438l11331L11779J052m1578l9824O5454
13826A076168K41417l74122o6658k12031O3994j54485J05424J61225j53376K5466
13816G13022M22846D70634J60671K78389j55124J27984j55993N1963O8216L0825
13806H77565k27390L4835j40199O1582K05543k44250J96053J16024j21912r4413
$$ plain form
13796 663438 587004 538216 566273 810575 831275 783283 886127 831281 734601 851835 808723
13785 808723 582871 545765 705798 679416 776414 352556 894709 678909 779230 399095
13775 399095 691643 536514 680420 1000907 486914 831644 790630 581710 442575 678275
13765 678275 501182 683880 624853 443594 723728 613455 508210 868689 627161 548207
13755 548207 478326 655511 752056 619277 407746 355105 773717 758672 401003 311072
13745 311072 607748 499934 374253 588406 713027 511290 523436 617398 602081 733688
13735 733688 571635 770214 430442 909367 761602 610513 668749 633873 704653 439192
13725 439192 521679 529194 546537 705830 519029 548479 464669 575010 894024 587663 542468
$$ packed form
13796F63438p6434m8788K8057K44302K0700m7992J02844n4846r6680J17234m3112
13785H08723k25852l7106J60033k6382R6998C52556N42153k15800J00321l80135
13775C99095K92548j55129J43906L20487D86914L44730m1014k08920j39135K35700
13765F78275j77093J82698n9027j81259K80134j10273j05245L60479k41528p8954
13755E48207o9881J77185R6545j32779k11531n2641M18612j5045l57669q9931
13745C11072K96676j07814j25681K14153J24621k01737J2146R3962j5317J31607
13735G33688j62053J98579l39772M78925j47765j51089N8236l4876P0780k65461
13725D39192Q2487P515J7343J59293j86801K9450q3810J10341L19014l06361m5195
$$ plain form
13714 542468 605164 449507 409617 693843 480412 555172 369218 786615 553046 320635
13704 320635 630181 749709 401910 587459 249020 380941 285943 436692 195611 85420
13693 509446 344110 287227 344352 664989 520545 463768 388481 615217 269423 803303
13683 803303 495701 361672 613157 389653 718374 251813 475394 377983 366051 475912
13673 475912 346336 591485 636774 309068 380466 364321 227067 524978 483350 215013
13662 139227 431893 458469 761982 623048 204265 686409 540297 316332 585090 416028
13652 416028 476594 295596 519644 279435 228578 526142 463210 448944 73699 168489 577732
13641 577732 754716 310778 469103 294381 517941 266573 329693 461884 674034 29816
$$ packed form
13714E42468O2696j55657l9890K84226k13431P4760j85954M17397k33569k32411
13704C20635L09546J19528l47799J85549B49020J31921r4998J50749A95611H5420
13693E09446j65336n6883N7125L20637j44444n6777p5287K26736B69423N33880
13683H03303l07602j34029K51485k23504L28721B51813K23581r7411j1932J09861
13673D75912j29576K45149M5289C09068P1398j6145j37254K97911m1628B15013
13662A39227K92666K6576L03513j38934B04265M82144j46112k23965K68758j69062
13652D16028O0566j80998K24048k40209n0857K97564o2932j4266G3699R4790M09243
13641E77732J76984C10778J58325j74722K23560k51368O3120J32191K12150B9816
$$ plain form
13630 584174 619082 327984 367127 618303 359281 442448 76003 347614 334639 234617
13620 234617 234650 312170 241513 447223 94041 387580 174399 195325 483650 122448 343319
13609 343319 47352 518518 493566 181860 726756 328463 486589 54044 466598 663622
13599 663622 328760 181532 251496 322466 271307 284212 207891 481399 595252 262400
13588 213260 493660 317220 289876 341010 262992 55804 450496 361872 784522 610549
13578 610549 300731 398301 346362 371556 339321 268308 184793 154778 363262 290990 260964
13567 260964 371971 262717 -6678 87362 254664 156489 290302 329989 67948 256598 287115
13556 287115 -5587 486651 191781 235518 236596 168975 -55089 75601 378943 146521 391981
$$ packed form
13630E84174L4908k91098L9143K51176k59022Q3167G6003K71611j2975j00022
13620B34617L3P7520p0657K05710I4041K93539A74399K0926K88325A22448K20871
13609C43319D7352M71166k4952A81860N44896C28463J58126E4044M12554J97024
13599F63622C28760j47228O9964P0970n1159J2905p6321K73508J13853B62400
13588B13260K80400j76440k7344N1134p8018E5804L94692q8624M22650j73973
13578F10549C00731R7570n1939K5194l2235p1013q3515l0015K08484p2272l0026
13567B60964J11007j09254f678H7362J67302r8175J33813L9687F7948J88650L0517
13556B87115e587D86651A91781M3737J078o7621e5089G5601L03342A46521K45460
$$ plain form
13545 391981 33856 90568 290564 11213 252801 234730 141893 -516 108894 616020 471376
13534 471376 180103 18803 389560 167231 308227 146018 526625 479999 233964 188957
13524 188957 494571 611767 34590 367751 357479 167727 339644 548454 334990 364296
13514 364296 157737 360175 43304 221835 307471 180663 125759 175039 63241 180599
13504 180599 64827 -2830 350100 -41223 315752 264679 190783 274432 250558 157281 457604
13493 457604 36014 46267 264947 139056 93800 180385 124198 65275 299995 191107 173922
13482 173922 339285 409471 96368 435475 536669 266791 47936 76451 284997 62460
13471 374288 149832 568669 186621 114257 374622 103775 99111 162615 158878 -262515 -5650
$$ packed form
13545C91981C3856N6712J99996A1213K41588j8071r2837e16A08894N07126j44644
13534D71376A80103A8803L70757A67231J40996A46018L80607m6626B33964m5007
13524A88957L05614J17196C4590L33161j0272A67727J71917K08810k13464K9306
13514C64296A57737K02438D3304J78531Q5636j26808n4904M9280F3241J17358
13504A80599F4827b830C50100d1223C15752n1073p3896Q3649k3874r3277L00323
13493D57604C6014J0253K18680j25891m5256Q6585n6187n8923K34720j08888j7185
13482A73922J65363P0186I6368L39107J01194B66791D7936K8515K08546F2460
13471C74288A49832M18837A86621p2364K60365A03775m664O3504l737b62515e650
$$ plain form
13459 322530 155645 455540 105751 128407 47913 104961 280476 172215 118883 218638
13449 218638 245756 46521 -111684 105505 168571 245909 -18074 233153 460688 255426
13439 255426 6366 392035 112847 268641 137301 335723 190979 -58168 -237741 57698
13428 357198 177781 232462 357865 427210 250983 294902 298835 35674 179335 322393 215126
13417 215126 189218 283224 219749 446710 384497 183905 140375 297739 42236 462541 31149
13405 230718 -95193 147045 196678 106419 272970 291435 123337 460706 -98596 203835
13394 199192 102021 31671 -68320 230590 316739 100149 -1448 66388 163642 48839 140250
13383 140250 169944 114766 337621 331636 238831 350578 242124 25773 76476 174459 154882
$$ packed form
13459C22530A55645K99895A05751K2656D7913N7048J75515j08261n3332R9755
13449B18638K7118D6521a11684A05505O3066P7338a8074B33153K27535k05262
13439B55426F366L85669A12847J55794j31340J98422j44744e8168j79573E7698
13428C57198A77781N4681J25403O9345j76227M3919L933C5674J43661J43058j07267
13417B15126k5908R4006o3475K26961o2213A83905m3530J57364D2236M20305C1149
13405B30718i5193A47045M9633r0259J66551J8465A23337L37369i8596B03835
13394A99192r7171C1671f8320B30590Q6149A00149a448F6388R7254D8839R1411
13383A40250K9694n5178K22855n985r2805J11747j08454B5773N0703R7983j9577
$$ plain form
13372 154882 5864 319821 -191205 -9619 442733 -31604 282198 88247 125769 110059 207659
13361 207659 195744 -86949 140149 149960 163938 74792 91324 364197 326123 64469 -31034
13349 226529 209471 188992 294956 179678 617680 193736 -108336 213622 108625 22173
13338 510866 353287 90950 14895 398026 150625 -68121 266997 362485 56774 400045
13328 400045 28096 350215 328423 243221 137911 158372 141363 -32843 247675 324910 222277
13317 222277 500512 53871 -54406 21714 426575 116954 236755 298016 200724 129771 400368
13306 400368 91257 106107 419571 230572 83903 163728 -839 -16510 -17283 79689 -7450 347550
13293 -132026 307387 -322207 207696 87977 -2658 27744 -329901 130531 103237 372677
$$ packed form
13372A54882E864L13957a91205i619D42733c1604B82198H8247L7522j5710R7600
13361B07659j1915h6949A40149R811J3978G4792J6532K72873l8074F4469c1034
13349B26529j7058k0479J05964j15278M38002A93736a08336B13622j04997B2173
13338E10866j57579I0950A4895L83131A50625f8121B66997R5488E6774L43271
13328D00045B8096L22119k1792q5202j05310K0461j7009c2843B47675P7235j02633
13317B22277K78235E3871e4406B1714M04861A16954J19801O1261r7292p0953K70597
13306D00368I1257J4850L13464j88999H3903P9825h39j5671p73G9689g450C47550
13293a32026C07387c22207B07696H7977b658B7744c29901A30531k7294K69440
$$ plain form
13283 372677 12425 -178597 179108 282868 100100 69517 40717 367675 122247 -4396
13272 156139 -2518 282635 112358 308207 -27021 250190 -279461 410653 93724 427958
13262 427958 16148 51124 -2476 -28804 -57172 220167 213801 -17678 101581 362916 99025
13250 151709 70195 111316 138673 218966 -131860 289396 68661 87391 66681 88499 156006
13239 156006 158232 282723 76920 143385 -61372 15448 395031 -224175 135126 164906 404314
13228 404314 192635 250041 348952 15948 117050 -113838 -255182 76861 342122 -44806
13217 -201513 -347146 159604 173471 109058 406807 32034 -48393 -56334 -45312 138694 96917
13206 96917 -18433 35771 309609 330037 -37958 375468 84684 -121026 344925 -191744 216156
$$ packed form
13283C72677A2425a78597A79108J03760A00100l0583k8800L26958A22247d396
13272A56139b518B82635A12358J95849b7021B50190b79461D10653I3724L34234
13262D27958A6148L4976b476k6328k8368B20167o366a7678A01581K61335I9025
13250A51709G0195M1121K7357Q0293a31860B89396F8661J8730k0710K1818O7507
13239A56006K226J24491G6920O6465f1372A5448L79583b24175A35126K9780K39408
13228D04314A92635N7406R8911A5948J01102a13838j41344G6861K65261d4806
13217b01513j45633A59604J3867o4413K97749C2034d8393p941J1022A38694m1777
13206I6917a8433C5771K73838K0428c7958C75468H4684a21026C44925a91744B16156
$$ plain form
13194 -16649 5585 138658 125996 71750 121442 354918 -274125 77469 167121 -113572 -89396
13183 -89396 -101217 -234809 -18205 160922 95704 -114471 219566 121117 171437 106580 89909
13172 89909 150473 -93147 362687 252121 133269 318403 244841 -178997 270919 366930
13162 366930 84005 325428 170337 -140123 -248450 194980 200773 191241 148297 85067 233346
13151 233346 -8565 238240 -113874 -118224 93814 -345 53062 32111 261892 32792 86372 259344
13139 259344 74751 46950 -266033 106863 115339 128051 75866 10947 -22308 66724 -110149
13127 -135940 283802 170891 226931 -20859 198427 176921 258777 163253 -36974 66239 95778
13116 95778 327833 96852 66579 321618 -33481 37329 335004 208222 209450 -53281 -76608
$$ packed form
13194a6649E585J33073j2662n4246M9692K33476b74125G7469Q9652a13572K4176
13183h9396j1821j33592a8205A60922o5218a14471B19566r8449N0320o4857j6671
13172H9909O0564i3147C62687j10566j18852J85134p3562a78997B70919R6011
13162C66930H4005K41423j55091a40123j08327A94980N793r532m2944o3230J48279
13151B33346h565B38240a13874m350I3814c45E3062k0951K29781C2792N3580J72972
13139B59344G4751k7801b66033A06863Q476J2712n2185A0947b2308F6724a10149
13127a35940B83802j12911N6040b0859A98427k1506Q1856r5524c6974F6239K9539
13116I5778K32055I6852l0273K55039c3481C7329K97675j26782J228e3281k3327
$$ plain form
13105 -76608 76998 259747 28796 175012 -86958 80751 -29303 231357 34861 -180646 -224110
13094 -224110 -5965 165372 114130 161140 140043 -176133 129457 -41312 -162199 139690 -152268
13082 28477 254659 82671 370095 -51743 237716 23809 279684 167212 192532 -113574
13071 191888 143274 195440 -183971 -26861 -47612 307961 420192 114546 45068 2219 89519
13060 89519 10303 187255 137236 -59864 -148280 174716 197746 137099 130681 12986 153876
13049 153876 -68738 433216 -124764 -268254 -193090 315636 142421 8443 -118214 186941
13038 86621 -57900 54885 -227837 124886 51134 41673 -97432 -55948 -10300 26272 190414
13027 190414 -34806 -142172 3290 -40349 200842 22376 -119255 632702 78421 198119 -255
$$ packed form
13105g6608G6998J82749B8796J46216h6958H0751b9303B31357C4861a80646m3464
13094b24110e965A65372n1242M7010k1097a76133A29457d1312j20887A39690a52268
13082B8477K26182H2671K87424e1743B37716B3809K55875j12472K5320a13574
13071A91888m8614N2166a83971b6861k0751C07961J12231A14546D5068B219Q7300
13060H9519A0303J76952n0019e9864q8416A74716K3030o0647o418A2986J40890
13049A53876f8738D33216a24764j43490P5164C15636A42421H443a18214A86941
13038H6621e7900E4885b27837A24886E1134r461i7432M1484a0300B6272J64142
13027A90414c4806j07366C290d0349B00842B2376a19255F32702G8421J19698b55
$$ plain form
13015 13342 4563 81046 215722 117538 379975 -259668 88664 124937 25114 16111 155055
13004 155055 338375 120952 45243 -127264 363916 34561 43222 119785 -88749 -47662 111886
12992 34184 3650 495036 87955 28907 107718 54159 -41352 37879 156576 -129368 151338
12980 61257 -185964 181654 100704 291991 202987 303588 7186 98532 74272 1746 -83007
12968 -502251 478364 54347 158527 268329 33042 169718 12124 148137 -206265 -101713
12957 21010 39066 69849 240015 -203252 -114504 10762 152944 207403 -106051 -244299 215299
12945 70202 -113376 190800 -254160 -65211 44663 -161459 -67701 -133015 -73462 -73322 144238
12933 -48524 -117992 -74694 -118823 -150103 -61279 46660 -279575 91883 -249728 169621 -285022
$$ packed form
13015A3342D563P6483J34676r8184K62437b59668H8664L6273B5114r003J38944
13004A55055J83320A20952D5243a27264C63916C4561Q661P6563h8749M1087A11886
12992C4184C650M91386H7955B8907P8811n3559d1352C7879J18697a29368A51338
12980F1257a85964A81654q0950J91287q9004J00601G186R1346k4260A746h3007
12968e02251D78364E4347J04180J09802C3042J36676A2124J36013b06265a01713
12957B1010J8056L0783J70166b03252Q8748A0762J42182N4459a06051j38248B15299
12945G0202a13376A90800b54160f5211D4663a61459f7701o5314N9553J40A44238
12933d8524o9468M3298m4129l1280f1279D6660b79575I1883b49728A69621b85022
$$ plain form
12921 -71204 -50970 -66488 52442 -38014 150123 144196 -93006 -159980 -196056 -194025 -35303 192449
12908 349909 -226370 67454 -140336 591705 -11429 -458720 -63727 38588 57383 261948
12898 261948 175138 -94819 -111892 -434153 96675 189004 184935 361211 -22286 13158 -64689
12886 252015 50937 145731 -53926 -30757 96914 281465 239764 142566 192721 -57080 -198195
12875 -198195 30538 220949 91141 320190 32420 -132591 -136602 133280 -458310 -9836 68484
12863 25233 -227527 23924 -408619 246777 -125947 -52454 60217 -122181 140965 183003
12853 183003 -22798 -127089 133854 118235 283425 -83062 44282 272641 199517 163762 -130539
12841 -54479 248203 73051 -140529 -175501 124382 157701 -59850 69568 444346 55024 -28641
$$ packed form
12921g1204K0234j5518E2442c8014A50123n927i3006o6974l6076K031c5303A92449
12908C49909b26370F7454a40336E91705a1429m47291f3727C8588J8795K04565
12898B61948q6810i4819j7073l22261I6675R2329m069J76276b2286A3158f4689
12886B52015E0937R4794e3926K3169I6914J84551m1701r7198N0155e7080j41115
12875a98195C0538J90411I1141K29049C2420a32591m011A33280d58310i836F8484
12863B5233b27527B3924d08619B46777a25947e2454F0217a22181A40965M2038
12853A83003b2798j04291A33854j5619J65190h3062D4282K28359p3124l5755a30539
12841e4479B48203G3051a40529l4972A24382L3319e9850F9568L74778E5024b8641
$$ plain form
12829 -157986 231665 -10215 243292 -118507 21626 286372 86926 180512 18982 33484 33981
12818 33981 3623 -88730 73294 63147 -70944 -51427 60263 296552 -7371 -155083 80190 239642
12806 239642 -150535 -96725 203041 341936 55542 -112599 75536 -99157 349366 -26764
12795 -6919 266523 -73997 108526 148678 -18207 17426 -82526 -134541 8298 -97721 196011
12783 -49084 260300 -117338 -87489 93745 253267 -62986 60740 114260 -61764 204779 34309
12771 328478 124223 -14594 3124 -74423 -34563 -202081 -231848 -184426 176204 15250 -17563
12759 -36103 -116156 -92594 -39014 -205916 35340 -4830 -118320 -329482 94996 65178 182551
12748 182551 -105519 -233054 300064 -219143 108697 -339358 107958 58623 256040 -22426
$$ packed form
12829a57986B31665a0215B43292a18507B1626K64746H6926R3586A8982J4502M97
12818C3981C623h8730G3294j0147g0944J9517F0263K36289g371j47712H0190J59452
12806B39642a50535N3810B03041J38895E5542a12599G5536i9157C49366b6764
12795f919B66523g3997A08526M0152a8207A7426h2526n2015H298i7721A96011
12783d9084B60300a17338K9849I3745J59522f2986F0740N3520f1764B04779C4309
12771C28478A24223a4594C124g4423c4563j67518k9767M7422A76204A5250a7563
12759c6103q0053K3562c9014j66902C5340d830j13490k11162I4996k9818J17373
12748A82551a05519j27535C00064b19143A08697c39358A07958m9335J97417b2426
$$ plain form
12737 210193 -405593 362676 167373 18569 -175069 20829 12103 56432 -83246 46720 -89957
12725 -181553 -42635 -164689 21737 160681 -304334 -270346 -92653 -18113 -122 27355 211626
12714 211626 -147323 293031 -32567 -4920 243445 75896 252346 199036 90001 -118238 139708
12702 527535 175138 299357 140206 106441 -2428 -327226 60827 90386 -49054 26703 -97358
12690 338887 241809 -45943 -211798 25431 -245120 -25764 -145491 59292 238453 96996 -83105
12678 256171 64123 -20180 253890 236415 27910 110875 -35551 -44363 320171 -148055 -167199
12667 -167199 -221167 -196878 -49357 -132535 50817 74357 330127 -33168 264558 33486 -43623
12655 164755 19927 -97480 49403 16234 -78682 -53670 -1955 110481 67825 70780 36002 504415
$$ packed form
12737B10193d05593C62676A67373A8569a75069B0829q726M4329h3246D6720h9957
12725a81553d2635j22054B1737J38944c04334L3988i2653a8113a22B7355J84271
12714B11626a47323B93031c2567d920B43445G5896J76450n3310I0001a18238A39708
12702E27535A75138J24219A40206l3765b428l24798F0827K9559d9054B6703i7358
12690C38887r7078d5943j65855B5431b45120b5764j19727E9292J79161I6996h3105
12678B56171F4123b0180B53890j7475B7910Q2965c5551q812C20171a48055j9144
12667a67199n3968K4289d9357q3178E0817K3540K55770c3168B64558C3486d3623
12655A64755A9927i7480D9403A6234g8682K5012a955A10481m2656K955l4778M68413
$$ plain form
12643 504415 -17789 244045 6555 -103962 278979 -134534 262423 83584 177142 72300 23296
12631 240203 302146 187332 139938 197028 146733 112979 296993 19886 6350 176442 258334
12620 258334 29864 -88399 61647 125019 -64156 270196 260398 319541 -194999 -26579 90378
12608 -152261 -36549 13742 -56516 -105026 100641 151622 66270 -12380 -135727 88805 153627
12597 153627 -121718 2091 66693 106216 -161304 -24417 -2310 142398 156419 12935 -108130
12585 -65292 -259039 107844 200584 -157242 -174882 -24586 -226158 29674 238316 52264 -12898
12573 179184 -199866 -160845 -107376 108441 40778 165454 -189296 -239228 239238 177873
12563 177873 149674 -362978 203419 -47981 -28138 -235853 -43919 -31791 -80544 -94199 143665
$$ packed form
12643E04415a7789B44045F555a03962B78979a34534B62423H3584R3558G2300B3296
12631B40203O1943j14814m7394N7090n0295l3754J84014A9886F350J70092Q1892
12620B58334B9864h8399F1647O3372f4156B70196r798N9143a94999b6579I0378
12608a52261c6549A3742e6516m8510A00641N0981F6270a2380j23347H8805O4822
12597A53627a21718B091O4602L9523a61304b4417b310A42398J4021A2935a08130
12585f5292j93747A07844R2740a57242j7640b4586k01572B9674K08642E2264a2898
12573A79184a99866L9021N3469A08441D0778J24676a89296m9932B39238o1365
12563A77873k8199c62978B03419d7981J9843k07715d3919J2128m8753j3655A43665
$$ plain form
12551 277239 78049 178758 104437 -10651 132564 -50583 97962 -447315 -345300 -172860
12541 -172860 132235 61119 29231 -153859 -112119 -47407 -21908 -73801 -84689 191221 -92486
12529 73968 -35719 436514 24550 130123 -26727 -176414 60341 41046 77487 82318 -92903
12517 -29893 -181660 -41850 107567 75396 -293935 55613 141248 -116987 49410 247144 -33328
12505 -37209 271875 171335 -208201 -85604 -83803 18750 -98692 -187753 162455 -284579 79368
12493 -237236 40641 158027 18114 -47237 13549 4687 48722 156590 96761 -142139 100675
12481 60125 49586 -1369 -313384 -53748 -8136 -256977 -77814 45356 -72767 -179754 71893
12469 158354 -63132 -93726 111918 -266524 -125191 -207814 -215472 -75995 68683 173873 -45860
$$ packed form
12551B77239G8049J00709p4321a0651A32564e0583I7962d47315J02015J72440
12541a72860A32235F1119B9231a53859M1740d7407b1908n1893j0888A91221i2486
12529G3968c5719D36514B4550J05573b6727j49687F0341j9295L6441M831i2903
12517b9893j51767d1850A07567l2171b93935E5613Q5635a16987D9410J97734c3328
12505c7209B71875j00540b08201h5604J801A8750i8692q9061A62455b84579G9368
12493b37236D0641J17386A8114d7237A3549D687M4035J07868n9829a42139A00675
12481F0125j0539a369l12015e3748h136k48841g7814D5356g2767j06987G1893
12469A58354f3132l0594A11918b66524a25191q2623p658g5995F8683J05190d5860
$$ plain form
12457 -193343 155008 -37504 45694 -81532 219237 17900 171785 -184987 -186856 80570 -47512
12445 -113535 373835 125090 265725 25555 -45917 261282 169065 -347818 -112848 -283332
12435 -283332 -302938 -169194 -325107 -137018 217863 -80408 -98601 -9092 -115072 -125357 136074
12423 -130646 -205198 -156745 -115810 98170 -59501 -297701 66115 49590 69413 -126334 170924
12411 146873 -54632 -134696 126271 68612 66385 76978 38829 121972 -54200 285510 -89900
12399 156843 108323 242952 -165952 72815 57387 -176314 16484 -325201 -220978 -133656
12389 -133656 246862 -258468 -207307 -101048 244179 -98727 -55431 -272036 -102004 -30517
12378 64683 -115157 -7471 58674 -106106 -257860 -11796 -92242 -394326 -911 -50597 -280244
$$ packed form
12457a93343A55008c7504D5694h1532B19237A7900J53885a84987j869H0570d7512
12445a13535C73835A25090J40635B5555d5917B61282r2217c47818a12848j70484
12435b83332j9606J33744j55913a37018B17863h0408j8193i092j05980j0285A36074
12423a30646p4552M8453M0935I8170e9501k38200F6115j6525J9823a26334A70924
12411A46873e4632q0064A26271n7659k227J0593l8149Q3143e4200B85510h9900
12399A56843m8520J34629a65952G2815j5428a76314A6484c25201J04223Q7322
12389a33656B46862b58468N1161a01048B44179i8727M3296k16605a02004c0517
12378F4683a15157g471E8674a06106j51754a1796q0446l02084i11m9686k29647
$$ plain form
12367 -280244 168182 34245 54545 -64402 -286564 162024 116410 -325496 26113 498787
12357 498787 -54240 -230141 19344 -217052 -45164 55019 -127644 27105 110080 -214891 -253485
12346 -253485 10542 -409841 248167 -122447 18407 -109340 -147853 -174547 83474 -221492
12335 170563 12660 85645 17529 -25868 255361 202293 -48732 -84783 304441 -28917 81177
12323 -119287 304337 253481 66930 213428 -174447 61194 171933 212252 233078 34204 70862
12312 70862 120967 42011 -13890 72136 -79424 168269 86556 -107902 137909 -226495 -36892
12300 -385418 132975 -27953 -245009 -79358 -218824 97567 -24768 159653 -348717 -120496
12289 152694 -162593 26249 280553 247241 -20208 100815 -169214 213564 33013 379141
$$ packed form
12367b80244A68182C4245K0300f4402k22162A62024m5614c25496B6113M72674
12357D98787e4240j75901A9344b17052d5164E5019a27644B7105Q2975b14891l8594
12346b53485A0542d09841B48167a22447A8407a09340l8513k6694H3474b21492
12335A70563A2660P2985A7529b5868B55361n3068d8732l6051C04441b8917H1177
12323a19287C04337n0856F6930J46498a74447F1194J10739M0319K0826C4204L6658
12312G0862N0105D2011a3890G2136g9424A68269q1713a07902A37909b26495c6892
12300c85418A32975b7953k17056g9358j39466I7567b4768A59653c48717a20496
12289A52694a62593B6249K54304l3312b0208A00815a69214B13564C3013L46128
$$ plain form
12279 379141 -65130 318397 -84035 297350 78165 -46545 74750 43228 256897 15765 -27123
12267 275978 212950 -78681 61824 -39942 -117651 60758 -104242 -63562 16942 -187124 174088
12255 41592 -151638 23951 -141242 475562 88712 218102 -142596 -109317 93915 274449
12245 274449 298801 -45776 79023 70542 -19614 48706 32549 52110 135297 -100855 -20785
12233 -70112 -92470 314201 426317 12331 80981 132380 151440 -59948 -87517 172846 212536
12222 212536 44359 -9529 -12877 528373 -93105 -33935 13082 -137570 76280 -49160 254275
12210 83335 -93539 37489 203847 79189 376261 -99949 157113 -191989 273339 347234 84553
12198 270569 117267 315825 253737 146367 57763 421920 293806 96210 276770 143560
$$ packed form
12279C79141f5130C18397h4035B97350G8165d6545G4750l1522K13669A5765b7123
12267B75978o3028g8681F1824c9942p7709F0758a04242M0680A6942a87124A74088
12255D1592a51638B3951a41242D75562H8712J29390a42596L3279I3915J80534
12245B74449K4352d5776G9023q481a9614D8706j6157J9561Q3187a00855b0785
12233g0112k2358C14201J12116A2331O8650N1399J9060e9948k7569A72846L9690
12222B12536D4359i529l348E28373i3105c3935A3082a37570G6280d9160B54275
12210H3335i3539C7489J66358G9189K97072i9949A57113a91989B73339P3895H4553
12198B70569A17267J98558o2088j07370E7763L64157j28114I6210J80560j33210
$$ plain form
12188 143560 258308 -270000 163782 14529 69546 -124211 40877 -74202 -26886 163776
12177 416891 30926 12636 505653 -118829 -92611 263299 -245540 -146821 63371 102458 139813
12166 139813 159295 154903 -5753 -30253 40144 -37129 -14590 -94018 -232525 -231421 93587 60517
12154 60517 -279514 -6196 -140553 -36470 -73632 358969 -142570 73687 185610 44328 308145
12143 308145 89200 120622 64453 39678 -90609 82910 -110545 -53930 -24735 -224361 -5371
12131 168742 77367 -26835 -89599 263416 121510 89935 225559 128280 247509 135927
12121 135927 -174408 62689 163180 60228 139063 103354 23334 38792 -253493 -125793 -10577
12109 -34355 98600 20236 -156354 62232 -25888 -151943 83257 -9643 -224309 -21494 231960
$$ packed form
12188A43560J14748b70000A63782A4529N5017a24211D0877g4202b6886A63776
12177D16891C0926A2636M93017a18829K6218B63299b45540R8719F3371L9087L7355
12166A39813J9482m392e753k4500D0144c7129a4590p9428j38507J104I3587l3070
12154F0517b79514f196j34357c6470l7162C58969a42570G3687J11923D4328K63817
12143C08145H9200L1422n6169k4775i0609H2910a10545e3930b4735j99626e371
12131A68742G7367b6835o2764B63416A21510l1575J35624r7279J19229j11582
12121A35927a74408F2689J00491F0228P8835l5709B3334J5458b53493a25793a0577
12109c4355I8600B0236a56354F2232b5888j26055H3257i643k14666b1494B31960
$$ plain form
12097 -127842 -118564 -319715 -236753 -224198 -63339 -252060 -185935 -112385 258 31172 257559
12086 257559 117328 36278 -110342 -52760 -59180 22095 -3121 -91931 -80488 158094 -166551
12074 239295 -156787 -248008 17583 193098 -60897 -247774 -55562 129159 60171 111285 280867
12063 280867 227515 -93185 -372489 66615 180838 255836 80973 352352 126467 155970 -218625
12051 -343460 28324 75608 135724 92981 -309181 -65792 116001 22850 -9836 27555 85399
12040 85399 -13678 -138416 181648 154576 -215719 -118841 5457 175469 -198635 29824 -38283
12028 66774 1145 -47766 147598 146967 72850 -36830 -142358 143021 132748 152984 94565 111258
12016 111258 31196 -65889 -167173 127926 120471 223507 131678 -7675 29144 71243 67712
$$ packed form
12097a27842R278k01151Q2962J2555f3339j88721O6125P3550B58L0914K26387
12086B57559A17328C6278a10342e2760o420B2095c121q8810J1443A58094a66551
12074B39295a56787r1221A7583J75515f0897j86877e5562A29159F0171N1114J69582
12063B80867n3352i3185k79304F6615J14223P4998H0973K71379A26467K9503b18625
12051c43460B8324M7284O0116m2743c09181f5792A16001B2850i836B7555N7844
12040H5399a3678j24738A81648k7072b15719R6878E457J70012a98635B9824c8283
12028F6774A145d7766A47598o31G2850c6830j05528A43021j0273K0236n8419J6693
12016A11258C1196f5889j01284A27926p455J03036r1829g675B9144M2099l531
$$ plain form
12005 67712 318854 -123116 -13695 44653 -253409 183405 149426 -31942 -303437 -160880
11995 -160880 36226 1033 -165716 49593 -110246 -38391 190643 39114 16669 17871 229966
11984 229966 110237 144842 -234245 144075 -77123 -176188 -84818 -93714 -199383 -64248 -218125
11973 -218125 -95280 -77195 -53782 -63606 -144414 -247615 -114729 150930 12295 10280 45473
11962 45473 66021 16699 83582 -25055 196759 -149913 -249856 -171419 147311 -77676 -88373
11951 -88373 -155206 -276127 174911 -376325 -82176 -56063 132961 16156 59168 -114676 -236108
11940 -236108 -60226 -132603 -4952 -400880 68462 -148135 238538 -168621 -1012 -387390 137319
11928 257036 190071 -67327 220267 20660 298529 -113158 145361 -291547 -118643 15285
$$ packed form
12005F7712K51142a23116a3695D4653b53409A83405l3979c1942k71495J42557
11995a60880C6226A033a65716D9593a10246c8391A90643C9114A6669J202K12095
11984B29966A10237L4605b34245A44075g7123r9065h4818q896j05669f4248j53877
11973b18125i5280J8085K3413r824q0808j03201a14729A50930A2295k015L5193
11962D5473K0548A6699O6883b5055A96759a49913r9943P8437A47311g7676j0697
11951h8373o6833j20921A74911c76325h2176K6113A32961A6156M3012a14676j21432
11940b36108f0226p2377d952l95928F8462a48135B38538a68621a012l86378A37319
11928B57036o6965f7327B20267B0660K77869a13158A45361b91547a18643A5285
$$ plain form
11917 48398 189936 -56021 -256980 -7515 182167 -121121 -119584 -50002 87794 -50154 -233641
11906 -233641 -160186 109293 -209857 257246 49639 -70809 109476 126087 9689 -172857 -115468
11895 -115468 48699 -60971 208929 -306368 177 -159221 -71429 212119 -387038 -50873 -92882
11884 -92882 48805 545488 -60292 32260 -38846 -50991 -135707 -38279 -346249 244097 -4118
11872 617 -87326 290965 -94282 -417611 -230572 -184143 -25157 -183668 -49139 -148639 -198594
11861 -198594 -24497 -233382 -35255 -4055 32974 -253612 -212523 -1723 -333466 -148707 239956
11849 76942 41838 90058 -108470 -142123 105849 75426 -204835 -35310 -79038 -236511 -253271
11838 -253271 194434 72668 274563 -481257 216379 -47861 17652 -127788 -240698 -43566
$$ packed form
11917D8398J41538e6021k00959g515A82167a21121J537e0002H7794e0154j83487
11906b33641P3455A09293b09857B57246D9639g0809A09476J6611I689a72857N7389
11895a15468D8699f0971B08929c06368A77a59221g1429B12119c87038e0873m2009
11884i2882D8805M96683f0292C2260c8846j2145q4716c8279l07970B44097d118
11872F17h7326B90965i4282l23329J87039M6429b5157j58511d9139r9500m9955
11861a98594b4497k08885c5255d055C2974b53612M1089a723l31743a48707B39956
11849G6942l5104M8220a08470l3653A05849l0423b04835c5310m3728j57473j6760
11838b53271A94434G2668K01895d81257B16379d7861A7652a27788j12910d3566
$$ plain form
11827 -47998 -73721 -95690 -293875 -247948 155707 174795 70317 239413 29948 -123989 678
11815 -230043 -65418 97604 -462663 -24231 -199761 -54825 61465 -26246 47456 -160356 -175697
11804 -175697 -92493 226454 -164380 -30086 -141031 -94985 -81603 -45896 -355486 126403
11793 144034 76575 26346 -375088 -92220 41546 -130622 39853 -32275 191228 -200430 74380
11781 -150835 68247 -183776 -116703 -95249 107189 -12592 371370 -84650 68655 -312795 -165977
11770 -165977 -29764 -180857 -219126 -411519 -164397 189163 111351 -90596 -114506 -42768 63870
11758 -97415 80542 -88684 300 153518 -121797 225132 37359 -229524 -25265 -212960 -150977
11747 -150977 70936 -272417 -112921 96335 179393 -136269 -271568 -44694 224638 325164
$$ packed form
11827d7998k5723k1969j98185M5927A55707J9088G0317J69096B9948a23989F78
11815b30043f5418I7604d62663b4231j75530e4825F1465b6246D7456a60356j5341
11804a75697Q3204B26454a64380c0086j10945M6046J3382L5707l09590A26403
11793A44034o7459B6346c75088i2220D1546a30622C9853c2275A91228b00430G4380
11781a50835F8247a83776O7073K1454A07189a2592C71370h4650F8655c12795J46818
11770a65977b9764j51093l8269j92393a64397A89163p7812i0596k3910d2768F3870
11758i7415H0542h8684C00J53218a21797B25132C7359b29524b5265j87695O1983
11747a50977G0936b72417a12921I6335Q3058a36269j35299d4694B24638J00526
$$ plain form
11737 325164 110452 154355 43236 -11630 260923 -144175 -58518 -136986 125246 -97711 60497
11725 13786 256072 158699 67910 -243811 -122032 -75029 169382 179020 49399 75550 -89271
11713 19040 109621 -161809 78373 -31815 -62705 39025 -68300 -19379 -321830 241800 84745
11701 -196979 -75832 280695 -318819 73072 64144 43009 151209 116024 -179810 -50893 232057
11689 81913 21283 195991 -62054 -9956 251083 -38638 348734 158200 -249449 58337 182569
11678 182569 263867 46829 -168067 12800 -284878 154421 236078 -139370 -198882 -140861 36741
11666 247704 -161919 -325013 180801 -1035 118892 -169378 -128562 177990 179219 -128489
11655 191335 -278346 202583 -315945 -71254 -91163 -218352 3536 137288 -396564 42096
$$ packed form
11737C25164A10452M3903D3236a1630B60923a44175e8518p8468A25246i7711F0497
11725A3786K42286r7373F7910b43811J21779M7003A69382R638D9399K6151h9271
11713A9040R0581a61809G8373c1815l0890C9025f8300a9379l02451B41800H4745
11701a96979g5832B80695c18819G3072q928k1135J08200l5185a79810e0893B32057
11689H1913B1283J74708f2054i956B51083c8638C48734A58200b49449E8337J24232
11678A82569Q1298D6829a68067A2800b84878A54421Q1657a39370n9512N8021C6741
11666B47704a61919j63094A80801a035A18892a69378M0816A77990J229a28489
11655A91335b78346B02583c15945g1254j9909j27189C536J33752c96564D2096
$$ plain form
11644 109745 -150675 -186410 -119443 12928 93952 -291486 248296 -48555 -40604 106956 39904
11632 -15165 -300484 -145553 30033 -7907 76140 35741 7422 52417 -171487 24043 266933
11621 266933 29422 274376 64125 620 60868 -114813 352234 203318 320590 -105331 86108
11609 275239 -75897 -183344 -48324 -23675 -130240 162835 -142582 131173 185512 66684
11598 86176 95003 -81278 -501481 14278 398265 -152414 374617 94944 -104686 175737 432848
11587 432848 75374 18476 -194654 340409 -198821 -112525 -52881 -229093 -107350 -50938
11576 -18514 473944 99715 174091 10560 -135948 -107504 -49228 339843 19718 146421 142324
11565 142324 19867 28024 -99906 82645 282895 337223 147893 -163712 -17121 217551 107120
$$ packed form
11644A09745a50675l5735O6967A2928Q1024b91486B48296d8555P951A06956C9904
11632a5165k85319a45553C0033g907G6140C5741G422M4995a71487B4043K42890
11621B66933B9422K44954F4125F20O0248a14813C52234j48916J17272a05331H6108
11609B75239g5897j07447d8324b3675j06565A62835a42582A31173N4339F6684
11598H6176Q827h1278m20203A4278L83987a52414C74617I4944a04686A75737K57111
11587D32848G5374A8476a94654C40409a98821Q6296e2881j76212a07350e0938
11576a8514D73944I9715P4376A0560a35948K8444d9228C39843A9718J26703m097
11565A42324A9867Q157i9906H2645K00250N4328A47893a63712a7121B17551A07120
$$ plain form
11553 49983 -156725 -136698 -35224 -102801 26264 -256317 -235776 54514 87423 145976 205738
11542 205738 259121 -25022 -139673 85388 -130304 -88472 -15277 -7853 137270 -19929 55108
11530 -52701 257647 164340 49005 -48038 106708 -180374 -248997 15721 -60926 -186843 -20494
11518 -160167 120871 -249057 69356 189418 -121576 438001 209019 213818 -8573 4395 122424
11507 122424 182411 301336 423287 7129 102967 32600 196945 1498 1719 15920 -29758 86338
11494 409155 131935 115273 12807 -323712 -161287 211948 59727 -245228 44968 -22808
11483 65939 216686 -10456 84075 114260 -95413 113086 121439 -31108 60720 -12585 160085
11471 -125742 -328705 176310 392717 67694 7312 -103752 44612 -26227 -127705 7606 160375
$$ packed form
11553D9983a56725K0027c5224o7577B6264b56317K0541E4514L2909N8553N9762
11542B05738N3383b5022j14651H5388a30304M1832a5277P424A37270a9929E5108
11530e2701B57647r3307D9005d8038A06708a80374o8623A5721f0926j25917b0494
11518a60167A20871b49057F9356J20062a21576D38001B09019M799h573D395J18029
11507A22424N9987J18925J21951G129R5838C2600J64345A498K21J4201b9758H6338
11494D09155A31935j6662A2807c23712a61287B11948E9727b45228D4968b2808
11483F5939J50747a0456H4075L0185i5413A13086Q353c1108F0720a2585A60085
11471a25742k02963A76310K16407F7694G312a03752D4612b6227j01478G606J52769
$$ plain form
11460 160375 182738 -19203 -83884 -144342 -161176 216167 -91576 74707 -55796 -10454 207268
11448 75880 34530 232790 -43402 -44039 -38554 381241 195763 111929 -180477 -113198 -162112
11437 -162112 -157392 -17693 -132563 -264061 150845 -23028 216703 313477 46285 -289328 -75139
11425 164533 25898 -354488 -20700 -5494 115248 124886 -193640 84488 88854 212481 52452
11413 91293 -386349 -116065 55495 -93308 67936 145968 319040 -20440 205670 79839 166119
11402 166119 -7928 7866 -64154 -145307 -384160 -134312 -92967 -205066 181914 30404 -303322
11390 -59231 251435 -242866 201643 -205357 -306349 -220978 103369 15710 -126733 49253
11379 62846 201897 -120869 74277 144462 356896 -120765 55267 -291189 -133107 55025
$$ packed form
11460A60375K2363a9203o4681o0458j6834B16167i1576G4707e5796a0454B07268
11448G5880C4530J98260d3402o37N485C81241j85478q3834a80477O7279m8914
11437a62112M720a7693j14870j31498A50845b3028B16703R6774D6285b89328g5139
11425A64533B5898c54488b0700e494A15248R638a93640H4488M366J23627E2452
11413I1293c86349a16065E5495i3308F7936P8032J73072b0440B05670G9839Q6280
11402A66119g928G866f4154q1153k38853a34312M1345j12099A81914C0404c03322
11390e9231B51435b42866B01643b05357j00992Q5371A03369A5710a26733D9253
11379F2846J39051a20869G4277P0185K12434a20765E5267b91189a33107E5025
$$ plain form
11368 100509 138734 -84510 -128040 44858 -395496 259306 9866 254818 -85971 255286 -167038
11356 1048 65867 -233542 228989 -28014 -198293 31950 -128286 122000 -343388 191015
11345 -203373 -109936 27827 -37236 -192678 172719 97060 -101955 224745 351658 -103825
11334 -303479 60303 -13882 -88557 90465 -10366 -280572 330605 113246 -171480 -18165 188028
11322 -230835 -8285 168675 -346724 -73994 113369 -129387 79687 -156865 -17387 -165349
11312 -165349 -50451 -22858 -135878 -361077 134529 -66410 129621 -273419 187895 -181773
11301 60482 -197922 -384756 -204635 -144976 177925 -32472 87255 -111360 -174891 -50668 -1155
11289 147741 221793 -155285 111803 -75822 14417 140244 30628 -107983 -91306 -166477 186445
$$ packed form
11368A00509L8225h4510m3530D4858c95496B59306I866K44952h5971B55286a67038
11356A048O4819b33542B28989b8014j70279C1950a28286A22000c43388A91015
11345b03373R3437B7827c7236j55442A72719p5659a01955B24745J26913a03825
11334c03479F0303a3882p4675I0465a0366k70206C30605A13246a71480a8165A88028
11322b30835h285A68675c46724g3994A13369a29387G9687a56865a7387j47962
11312a65349e0451b2858j13020k25199A34529f6410A29621b73419A87895a81773
11301F0482a97922j86834J80121N9659A77925c2472H7255a11360o3531e0668a155
11289A47741P4052a55285A11803g5822A4417J25827C0628a07983J6677p5171A86445
$$ plain form
11277 190111 -134274 157926 197475 3449 -1619 -64084 192279 134819 -295769 9616 -331173
11265 6868 -106854 12572 -11036 -71712 -57311 119246 171683 51708 82834 -98031 74046
11253 68285 -222218 101292 -254675 -17654 16600 -85440 -120857 177537 13819 -57513 6184
11241 44994 -121674 -128166 98745 -125631 -62831 -365354 -354572 -166897 51926 -1725 -210466
11230 -210466 -157000 71338 175979 -81372 -156774 -581987 117678 -110262 88548 -54466 -50648
11219 -50648 -436898 140716 -72958 -59429 -129111 -58915 75337 -49849 -193722 -58345 71537
11207 138790 -435314 -60553 -56067 130092 15312 -103372 -34878 -257550 135901 -36246 -9986
11195 154600 -128954 -12159 -68907 -3594 -35217 16776 -112882 -57658 90841 215367 235742
$$ packed form
11277A90111a34274A57926L9549C449a619o2465A92279n7460b95769I616c31173
11265F868a06854A2572a1036o0676J4401A19246N2437E1708L1126i8031G4046
11253F8285b22218A01292b54675a7654A6600h5440l5417A77537A3819e7513F184
11241D4994a21674o492I8745a25631O2800l02523J0782a66897E1926a725k08741
11230b10466N3466G1338J04641h1372p5402m25213A17678a10262H8548e4466L818
11219e0648l86250A40716g2958J3529o9682e8915G5337d9849j43873e8345G1537
11207A38790d35314f0553M486A30092A5312a03372c4878k22672A35901c6246i986
11195A54600a28954a2159n6748c594l1623A6776a12882N5224I0841J24526K0375
$$ plain form
11184 235742 -146125 -63079 -186277 -25947 71602 -154793 -160413 -179844 329129 7538 6718
11173 6718 96098 93299 -71220 -145985 -103802 141415 -497769 -234251 -132970 26504 37542
11162 37542 -215768 -134502 -82417 100238 -706 258687 -344134 43698 -46227 -426567 32734
11150 -30988 -249 22189 -99173 -475157 172583 259097 -15571 -142802 -31696 265890 220644
11139 220644 -197855 -241089 228987 -341960 276385 33274 -24048 310033 222796 133322
11129 133322 -198795 -1917 -54710 150884 -7365 -59561 -193867 64403 -392355 9581 41156
11118 41156 -403182 -94106 205678 149853 113013 -2557 -367301 -5854 95392 -44111 156189
11106 -271031 104366 66084 68113 249559 181015 84946 -186210 200299 73945 22498 -136572
$$ packed form
11184B35742a46125f3079j23198b5947G1602a54793n620j9431C29129G538q20
11173F718Q9380k799g1220p4765M2183A41415d97769b34251J01281B6504J1038
11162C7542b15768Q1266N2085A00238g06B58687c44134D3698d6227l80340C2734
11150c0988b49B2189i9173l75984A72583Q6514a5571j27231c1696B65890m5246
11139B20644a97855m3234B28987c41960B76385C3274b4048C10033q7237q9474
11129A33322a98795a917n2793A50884g365n2196j34306F4403c92355I581L1575
11118D1156d03182i4106B05678n5825l6840b557l64744e854I5392d4111A56189
11106b71031A04366l8282K029J81446o8544H4946a86210B00299G3945B2498a36572
$$ plain form
11094 -173617 333374 205455 162567 391343 192206 115064 124910 -213818 -52996 96070 57427
11083 57427 135779 37196 -91991 -135422 107421 111270 142396 316159 31604 385792 80351
11071 65574 -100498 5440 443699 175459 444834 202598 214858 -6959 329128 268880 181713
11060 181713 366862 281095 415026 418608 503939 338826 444583 247367 524183 620304
11050 620304 662778 507851 603687 513162 600578 590712 297588 431945 357448 531137 477403
11039 477403 760789 381519 113819 359073 491798 256537 73343 521392 804923 401454
11028 608938 243813 426647 624625 614879 248890 583015 710212 -220347 340546 293951
11018 293951 337483 385805 110988 422731 551650 498927 348204 359690 259708 329760 441839
$$ packed form
11094a73617C33374j27919m2888K28776A92206p7142R846b13818e2996I6070l8643
11083E7427P8352C7196i1991m3431A07421L849L1126J73763C1604L54188H0351
11071F5574a00498E440M38259A75459K69375B02598J2260f959C29128o0248q7167
11060A81713J85149q5767J33931L582Q5331j65113J05757j97216K76816R6121
11050F20304M2474j54927R5836r0525Q7416r866k93124J34357p4497J73689n3734
11039D77403K83386l79270A13819K45254J32725k35261G3343M48049K83531D01454
11028F08938B43813J82834J97978r746B48890L34125J27197b20347C40546m6595
11018B93951M3532M8322A10988L11743J28919n2723j50723J1486r9982P0052J12079
$$ plain form
11007 441839 496668 543123 72176 365186 517973 732443 111289 297704 302386 311766 350288
10996 350288 365177 288943 403508 593954 573694 577828 514545 796328 528423 401433 368354
10985 368354 453342 660318 656599 638310 436915 569201 947421 643493 1050485 1386890
10975 1386890 1118095 1255553 1512172 1540387 1841075 1780135 1773545 1317186 1576849 1521966
10965 1521966 1437040 1182597 957751 1302738 902246 1010245 1046073 1112327 1114242 1189863
10955 1189863 1090602 964470 946782 677373 618457 760912 300924 565490 -662 181565
10944 451618 367255 15019 -134364 176010 -233066 77509 111596 -116928 -223888 -73866
10933 -319082 3251 -7424 -91280 -112299 -122954 186418 5994 9497 550733 53459 32875 131932
$$ packed form
11007D41839N4829M6455G2176K93010J52787K14470A11289J86415M682R380L8522
10996C50288J4889p6234J14565J90446k0260M134o3283K81783k67905j26990l3079
10985C68354Q4988K06976l719j8289k01395J32286L78220l03928M06992L36405
10975A386890k68795J37458K56619K8215L00688o0940o590m56359K59663n4883
10965A521966q4926k54443k24846L44987m00492J07999L5828O6254J915P5621
10955A189863r9261j26132j7688k69409n8916J42455C00924K64566f62A81565
10944D51618q4363A5019a34364A76010b33066G7509L4087a16928j06960g3866
10933c19082C251g424q3856k1019j0655A86418E994L503N41236E3459k0584R9057
$$ plain form
10921 131932 141083 -248456 130200 -186501 -7963 -109883 150608 28681 -157719 -193835 69360
10909 31863 -25104 -250431 -180860 -152625 -12950 102834 -242652 101045 155497 95765 -286077
10897 169412 89172 33831 -320624 256708 124888 -57439 35861 31640 61668 91586 -113314
10885 108880 28740 -81193 1576 69006 -101714 157974 -157930 -91145 -293566 -379974 133713
10873 118560 -85155 -60019 164204 -350590 79028 75450 50426 -301279 -310000 -342786 -13077
10861 84921 -54589 126846 -186245 -159293 -33236 -162366 152214 -82928 166409 -438721
10850 237441 -148906 159749 321030 -123711 152834 -26691 107520 -122477 141523 -68635
10839 -9843 47083 187367 -292606 175834 -100457 -58671 151887 -222882 51649 -39085 204089
$$ packed form
10921A31932R151b48456A30200a86501g963j01920A50608B8681a57719l6116F9360
10909C1863b5104k25327O9571K8235a2950A02834b42652A01045N4452n9732b86077
10897A69412q0240C3831c20624B56708A24888e7439C5861m221L0028K9918a13314
10885A08880B8740h1193A576O7430a01714A57974a57930O6785k02421q6408A33713
10873A18560h5155K5136A64204c50590G9028l578k5024c01279q721l2786a3077
10861H4921e4589A26846a86245K6952c3236j29130A52214h2928A66409d38721
10850B37441a48906A59749J61281a23711A52834b6691A07520a22477A41523f8635
10839i843D7083J40284b92606A75834a00457M1786A51887b22882E1649c9085B04089
$$ plain form
10827 303652 -94826 -145229 -89611 54356 -205609 69796 41320 76825 -269193 -119788 1831
10815 -199558 -85117 -118227 -74390 -297588 -111125 -204299 72041 -418379 -80848 11924 -110735
10803 120660 77362 -101401 -284099 179699 -241002 -201192 -72266 -36701 88031 23345 11130
10791 168363 -107605 -146068 -132613 49809 -157619 -240763 -206848 -8145 221550 -199692 -104300
10780 -104300 9329 47662 -181009 75427 240312 29235 145492 -24180 -366155 -13495 5023
10768 -54013 -32956 -56299 -133808 9040 -270736 108243 210376 210452 133933 -74455 198974 59994
10755 244309 -61894 -18213 -203663 -229040 71515 -3566 -440545 -113230 398391 -41171 -60694
10744 -60694 -109940 -212712 16923 -127658 16420 56143 -49782 -9059 -32513 -204531 153678
$$ packed form
10827C03652i4826n0403N5618E4356b05609F9796k8476L5505b69193a19788A831
10815a99558h5117l3110M3837k23198a11125r3174G2041d18379h0848A1924a10735
10803A20660m3298a01401j82698A79699b41002L9810g2266L5565H8031B3345A1130
10791A68363a07605l8463J3455D9809a57619q3144L3915h145B21550a99692R5392
10780a04300I329L8333a81009G5427J64885B9235J16257b4180l41975a3495E023
10768e4013K1057k3343p7509I040b70736A08243J02133P6p6519g4455A98974E9994
10755B44309f1894a8213j85450k5377G1515c566m36979a13230C98391d1171j9523
10744f0694m9246j02772A6923a27658A6420L9723d9782i059k3454j72018A53678
$$ plain form
10732 -230725 -286478 14861 -127877 -283053 -110727 -155480 -130482 -68976 453221 -92421 66695
10720 -291496 108397 49303 -45507 -16436 -269762 68951 -197352 92109 -35252 77642 -50603
10708 -184410 -438116 61379 -112882 -117295 -46828 -46353 32968 93580 -315738 -161745 -151211
10697 -151211 229009 302736 242894 -45482 79369 -89561 -37169 228144 145116 -242888 -145178
10686 -145178 129294 -131994 26668 -13289 -137212 204196 117853 241238 -36422 -154797
10676 -154797 -176766 31153 -175117 -376525 -263085 120563 -56020 -176314 -93105 -19619
10665 -226603 122800 -174696 361874 -318621 220133 -49243 135318 -7315 -425563 156811
10654 -148258 -197832 -251747 -190437 88722 43256 123205 -228624 -210344 15250 170354 226013
$$ packed form
10732b30725n5753A4861a27877j55176a10727m4753K4998O1506D53221i2421F6695
10720b91496A08397D9303d5507a6436k53326F8951a97352I2109c5252G7642e0603
10708a84410k53706F1379a12882m413d6828M75C2968O0612c15738J53993J0534
10697a51211B29009P3727n9842d5482G9369h9561c7169B28144q3028b42888R7710
10686a45178A29294a31994B6668a3289j23923B04196q6343J23385c6422j18375
10676a54797k1969C1153a75117k01408J13440A20563e6020j20294Q3209a9619
10665b26603A22800a74696C61874c18621B20133d9243A35318g315m18248A56811
10654a48258m9574n3915O1310H8722D3256P9949b28624J8280A5250J55104N5659
$$ plain form
10643 226013 17579 -150359 278793 -79452 -14447 126419 109187 28703 52395 -135120 53642
10631 -249671 -125738 -12154 -35437 -35879 -213000 39877 -186201 112590 -296942 -161102 -113471
10620 -113471 -122044 -13077 -14017 -216862 -45668 -180626 245760 -19957 -25773 81719 165673 -18214
10607 -222221 19514 19091 -214828 23567 -176530 -103592 -137783 -42511 54897 -219964 17355
10595 83938 186718 -121327 -350943 -82528 -11044 -51502 278266 -78269 112753 -51464 -74213
10584 -74213 -136344 -48687 177802 -166838 -15194 100772 220397 202373 -105788 -114062 185779
10572 -69391 274127 176669 205406 264747 -79871 -16944 -112657 139609 -67538 -56683 73064
10560 194020 -77280 -143910 -49200 50537 -260209 93096 320291 49313 28282 121083 -194881
$$ packed form
10643B26013A7579a50359B78793g9452a4447A26419j7232B8703K3692a35120E3642
10631b49671J23933a2154k3283m42j77121C9877a86201A12590b96942J35840M7631
10620a13471q573a3077r40k02845d5668j34958B45760a9957n816H1719Q3954a8214
10607b22221A9514m23b14828B3567a76530P2938l4191d2511E4897b19964A7355
10595H3938J02780a21327k29616h2528a1044m0458B78266g8269A12753e1464k2749
10584g4213o2131d8687A77802a66838a5194A00772J19625j8024a05788q274A85779
10572f9391B74127r7458K8737N9341g9871a6944r5713A39609f7538J0855G3064
10560A94020g7280o6630d9200E0537b60209I3096K27195D9313k1031R2801a94881
$$ plain form
10548 72702 49966 17928 7693 126167 61004 -107876 54593 -57989 59033 -207289 164492
10536 43315 48892 -330836 26189 -126716 -160049 -160259 30414 44743 -13574 -106650 93678 230123
10524 230123 1012 -247049 81042 200050 179809 -30361 13050 -472882 82509 -12047 -149102
10513 -149102 -66208 71517 338274 -66136 -31694 -241370 -184883 -249790 -304825 -330813 199351
10501 -174665 -24411 -42149 -249355 -32880 135939 -121601 141669 298037 -136688 122854
10490 167885 257077 -199919 30624 57157 -133071 438618 145908 196992 505505 397399
10480 397399 130215 -37324 204099 33861 -272523 50705 -25305 -227531 -44646 -211859
10470 -211859 -193980 -262928 -122025 -33124 124772 -109192 -59222 -102131 -218124 67937 -464964
$$ packed form
10548G2702k2736A7928G693J18474F1004a07876E4593e7989E9033b07289A64492
10536D3315N577c30836B6189a26716l3333k10C0414J4329a3574r3076I3678J36445
10524B30123A012b47049H1042J19008k0241c0361A3050d72882H2509a2047j37055
10513a49102f6208G1517K66757f6136c1694k09676N6487o4907n5035k5988A99351
10501a74665b4411j7738k07206c2880A35939a21601A41669J56368a36688A22854
10490A67885Q9192a99919C0624K6533a33071D38618A45908N1084L08513j08106
10480C97399A30215c7324B04099C3861b72523E0705b5305k02226d4646j67213
10470b11859J7879o8948a22025c3124A24772a09192M9970m2909j15993F7937d64964
$$ plain form
10458 -350555 -215526 100289 -254088 -104169 24031 -233649 -38733 -267827 -13609 -47649
10448 -47649 137585 -46588 -32335 -322906 -5955 8609 -361859 -468781 147754 103172 -355834
10436 -377710 -151280 -319898 -29798 54709 -20339 118309 -165781 75092 -21320 -12151 -270243
10425 -270243 -175236 47444 -186061 -220078 -218205 -104900 -104776 -206870 -17641 -46616 -140150
10414 -140150 -126645 300978 20702 -54243 -31830 233879 144240 -131895 3234 -387547 -143800
10402 77327 -155337 -10632 243507 -47871 35615 -176720 197433 157529 -262858 154670
10391 242546 91165 -103870 224306 -159368 -199277 75750 160437 105901 291393 61523 39743
10380 39743 -174533 126543 629844 -23993 119794 -111197 464642 154796 201994 -289180
$$ packed form
10458c50555J35029A00289b54088a04169B4031b33649c8733k29094a3609l4040
10448d7649A37585d6588J4253k90571e955H609c61859j06922A47754m4582c55834
10436c77710a51280j68618b9798E4709b0339A18309a65781G5092b1320R169k58092
10425b70243R5007D7444a86061l4017J873a04900J24j02094a7641k8975r3534
10414a40150J3505C00978B0702e4243K2413B33879q9639a31895C234c87547a43800
10402G7327a55337a0632B43507d7871C5615a76720A97433l9904b62858A54670
10391B42546I1165a03870B24306a59368l9909G5750Q4687n4536J85492F1523k1780
10380C9743a74533A26543N03301b3993A19794a11197D64642A54796M7198b89180
$$ plain form
10369 167530 309271 219636 55700 150648 423465 152722 153583 8194 -60073 170537 29063
10357 501511 -261760 -10483 -12469 24819 58160 411116 301977 162056 386837 150789
10346 -157276 -119188 56080 531895 120021 363799 807271 98840 152937 5412 -74710 115005
10334 245578 -6161 45526 186731 -65787 -19810 26839 -118114 -239361 70729 -18848 3496
10322 160828 93808 270976 -127391 122007 32550 -4375 120794 39641 -64638 183834 36487
10310 51217 -159609 18002 -189910 161809 4199 -28109 104306 -14170 194465 -137009 -83263
10299 -83263 -66607 -222 -6391 -78170 -162672 -113666 237520 -186229 -25569 -371227 391251
10287 -122422 39242 23440 -59486 53677 -248362 84563 18680 -26607 -122353 -37964 -20050
$$ packed form
10369A67530J41741q9635E5700R4948K72817A52722Q61H194f0073A70537B9063
10357E01511b61760a0483j986B4819L3341L52956j09139j39921K24781A50789
10346a57276L8088E6080M75815A20021K43778M43472I8840N4097E412g4710A15005
10334B45578f161D5526J41205f5787a9810B6839a18114j21247G0729a8848C496
10322A60828o7020J77168a27391A22007C2550d375A20794C9641f4638A83834C6487
10310E1217a59609A8002a89910A61809D199b8109A04306a4170A94465a37009N3746
10299h3263J6656b22o169p1779q4502M9006B37520a86229b5569l45658C91251
10287a22422C9242j5802e9486E3677b48362H4563A8680b6607r5746c7964J7914
$$ plain form
10276 -20050 -354769 -155930 -85169 68245 -121821 74965 105270 -184760 -103559 40472 52200
10265 52200 -106452 -160317 262773 127965 96711 435555 293572 457542 163357 -389374
10254 -227390 -20121 -162296 173631 -363608 3909 -223944 -70348 -128251 119778 78625 -4100
10242 -415712 -87073 -110749 108590 5472 -211654 -124720 -207990 211946 -51075 -24605 -58147
10231 -58147 75287 -66011 -155816 -8136 217187 224350 69159 82397 -66412 69050 -42187 61549
10218 37187 3509 -164660 18980 55649 1412 -335860 -70516 -300351 -229831 -356638 -262783
10207 -262783 -430828 -490964 -373045 -93380 -47153 -16953 -37391 -256241 103091 107925 6587
10195 -91837 -654228 274211 102130 -298583 99485 -5549 67693 283752 -61516 -278545 17409
$$ packed form
10276b0050l34719a55930P0761F8245a21821G4965L0305a84760Q1201D0472J1728
10265E2200a06452n3865B62773A27965l1254L38844j41983J63970A63357c89374
10254b27390b0121j42175A73631c63608C909b23944g0348n7903A19778m1153d100
10242d15712h7073k3676A08590E472b11654Q6934q3270B11946e1075b4605l3542
10231e8147G5287f6011q9805h136B17187P163F9159J3238f6412F9050d2187F1549
10218C7187C509a64660A8980L6669A412c35860g0516k29835P0520j26807R3855
10207b62783j68045o0136J17919i3380M6227a6953k0438k18850A03091M834F587
10195i1837n62391B74211A02130b98583I9485e549F7693K16059f1516k17029A7409
$$ plain form
10183 103221 -227765 135030 -123925 6151 20563 18326 112709 -312334 -229989 42933 -204269
10171 205196 -179340 -277592 -21968 -304372 -103912 -126417 360097 -71752 70638 64362 -95338
10159 283167 135300 -259308 -217735 -249194 -167375 86574 -28938 151091 -32892 -35973 -27992
10148 -27992 -182331 -41540 3394 -132213 69548 -145003 -346498 90924 -146418 -114632 84408
10136 177261 -291242 -110643 -63636 143198 42309 -390846 120348 151699 -184849 -58914
10125 48297 31317 -120823 57758 57977 -383928 68323 -305796 -195419 -75346 -166536 -148727
10114 -148727 -151914 -29328 -14690 -34031 166516 -185025 -298573 -225076 -174505 49712 -32761
10102 125848 -21561 -101396 -238616 49091 -260094 -160371 -71241 -115900 -115899 23261 -72630 -112518
$$ packed form
10183A03221b27765A35030a23925F151J4412k237R4383c12334Q2345D2933b04269
10171B05196a79340r8252b1968k82404a03912k2505C60097g1752G0638o276i5338
10159B83167A35300b59308M1573l1459Q1819H6574b8938A51091c2892l081P981
10148b7992j54339d1540C394a32213F9548a45003k01495I0924a46418L1786H4408
10136A77261b91242a10643M7007A43198D2309c90846A20348L1351a84849e8914
10125D8297j6980a20823E7758K19c83928F8323c05796J10377g5346r1190J7809
10114a48727l187b9328J4638j9341A66516a85025j13548P3497N0571D9712c2761
10102A25848b1561p9835j37220D9091b60094R9723g1241m4659JB3261g2630l9888
$$ plain form
10090 -112518 -37160 97479 156230 -284714 251829 -298764 -119515 98675 39660 288975
10080 288975 -36513 -181617 -60500 75727 -35344 -230512 -9989 187284 255196 -24717 -341893
10069 -341893 -127960 204510 72989 133232 -1378 -79653 -57484 -130499 106230 116153 88980
10058 88980 206461 66066 -40182 280761 -239772 -31183 85748 33103 -203066 -119771 105593
10046 -324867 31356 128459 -76723 3384 -224120 -96602 -1613 -171287 92795 -183950 -118493
10035 -118493 -223620 91854 -27210 -148039 9097 60392 204057 4205 125113 -33221 -56521
10024 -56521 -294878 -294382 -18533 -200406 -123369 63419 26158 -183405 -196374 259103 -224498
10012 126671 -72923 -194414 -88525 63177 -89717 270482 103880 526195 -3281 -42203 -29864
$$ packed form
10090a12518c7160I7479N8751b84714B51829b98764a19515I8675C9660K49315
10080B88975c6513j45104f0500G5727c5344j95168i989A87284O7912b4717l17176
10069c41893a27960B04510G2989O0243a378p8275K2169p3015A06230R923k7173
10058H8980J17481F6066d0182B80761b39772c1183H5748C3103b03066Q3295A05593
10046c24867C1356R7103g6723C384b24120i6602a613j69674I2795a83950O5457
10035a18493j05127I1854b7210j20829I097N1295J43665D205J20908c3221k3300
10024e6521k38357M96a8533j81873P7037F3419B6158a83405j2969B59103b24498
10012A26671g2923j21491h8525F3177h9717B70482A03880M22315c281l8922J2339
$$ plain form
10001 -29864 -122949 -168591 -131780 -295744 3285 199797 -17941 -15362 115868 -121946 -139397
9990 -139397 -303173 -189781 185455 -159411 -46822 196055 38987 20895 -107923 -108670 -149447
9979 -149447 -388278 36507 -101743 -74439 -178433 -48007 4379 -386160 -211916 175271 -52655
9967 -196761 -234658 161900 63014 -177562 167224 -100879 -53989 -7703 8088 -112749 -359961
9956 -359961 -19395 31115 23545 -143409 29583 -118919 9462 -94403 -257201 141195 -52675
9944 151300 -288683 -380920 -118261 -42263 -43914 -170529 -239490 261616 -216783 55073 19355
9932 203358 197559 44177 118429 -182197 -184647 67598 -158090 34929 -59970 -303809 -174559
9921 -174559 -7656 149814 -34259 -220144 -153151 -41644 -231100 11908 38210 -95976 -59546
$$ packed form
10001b9864r3085m5642L6811j63964C285J96512a7941K579A15868a21946j7451
9990a39397j63776J13392A85455a59411d6822A96055C8987j8092a07923p47m0777
9979a49447k38831C6507a01743K7304j03994d8007D379c86160J74244A75271e2655
9967a96761l7897A61900F3014a77562A67224a00879M6890g703H088a12749k47212
9956c59961a9395C1115p570a43409B9583a18919I462i4403j62798A41195e2675
9944A51300b88683r2237a18261d2263j651j26615o8961B61616b16783E5073A9355
9932B03358n799D4177P4252a82197k450F7598a58090C4929e9970k43839J29250
9921a74559g656A49814c4259j85885O6993d1644j89456A1908K6302i5976L6430
$$ plain form
9910 -59546 -24947 130679 40318 -573805 -144993 93187 -150078 348627 -276129 -264790 -101645
9898 160714 -119337 -107674 65105 123275 -80129 41424 -132016 -107085 -244814 -441846 69805
9886 191949 -132855 119730 -165298 -150659 -64002 -134192 93488 -66089 -172897 129051 312103
9875 312103 163515 -254148 -113724 -83320 -228979 -104742 -251486 45018 25433 296080
9865 296080 -82385 198963 -128364 -261468 -112745 -274990 53489 34803 -250375 -218865
9855 -218865 64123 239603 87240 -175004 -112023 -17402 -196562 -267746 -4544 66063 -116043
9843 -325177 -351660 -51164 30735 -323522 -270489 -40812 292127 99420 -269618 17673 -288334
9831 163774 -128396 -221022 -45984 -417256 -335 -433176 -71074 -8085 81148 115433 311103
$$ packed form
9910e9546b4947A30679D0318e73805a44993I3187a50078C48627b76129J1339a01645
9898A60714a19337J1663F5105N8170h0129D1424a32016K4931j37729j97032F9805
9886A91949a32855A19730a65298J4639f4002p0190I3488f6089j06808A29051J83052
9875C12103j48588b54148a13724L0404j45659a04742j46744D5018j9585K70647
9865B96080h2385A98963a28364j33104a12745j62245E3489j8686b50375L1510
9855b18865F4123J75480H7240a75004O2981a7402j79160p1184d544F6063a16043
9843c25177k6483e1164C0735c23522N3033d0812B92127I9420b69618A7673b88334
9831A63774a28396r2626d5984l71272c35m32841g1074h085H1148L4285J95670
$$ plain form
9820 311103 -61360 -110456 421413 195179 -77753 -211152 189163 -73676 -177942 78297 -20841
9808 -47360 35895 -170188 -37498 249840 140083 225357 -64478 -29686 -101137 47472 5131
9796 -81957 22136 1953 -177730 -223258 -33146 -50764 -6286 -197290 -648470 30778 294939
9785 294939 -145924 -175646 -15740 188948 -2228 132294 -43167 -99167 80662 -138450 200847
9773 -199692 76295 -87402 -68280 -50491 -149193 -23915 14609 -155101 -19649 180399 -111347
9761 -50643 -92097 -214438 -187665 -180928 -44944 -198214 -224658 189597 -236169 -331361 -319427
9750 -319427 -311229 -18987 162419 225695 -158880 -42327 73075 -115869 66092 206212 -326656
9738 -66984 34345 280253 32209 -122904 12985 136800 -121736 -340346 51878 -2848 -97007
$$ packed form
9820C11103f1360m9096D21413A95179g7753j33399A89163g3676j04266G8297b0841
9808d7360C5895a70188c7498B49840j09757Q5274f4478b9686p1451D7472E131
9796h1957B2136A953a77730m5528c3146j7618f286j91004m51180C0778K64161
9785B94939a45924k9722a5740A88948b228A32294d3167n6000H0662a38450B00847
9773a99692G6295h7402J9122J7789r8702b3915A4609a55101a9649A80399a11347
9761e0643m1454j22341K6773O737d4944j53270k6444A89597b36169r5192J1934
9750c19427Q198a8987A62419O3276a58880d2327G3075a15869F6092J40120c26656
9738f6984C4345K45908C2209a22904A2985J23815a21736k18610E1878b848r4159
$$ plain form
9727 -97007 -49780 78144 -175683 -170278 -190920 -46630 45478 151934 -40888 83479 39241 58516
9715 58516 -113442 -44987 -54168 -153199 79003 -163764 -153147 -200084 -9901 94562 -168906 77887
9702 107919 -41871 172072 -512423 -212904 2611 152985 -310794 26962 -237908 -99299 -36054
9690 38444 184853 -275404 88831 -85881 -271102 -341394 89935 -333424 -93741 29083 -362200
9678 71595 -312159 -224811 -85305 -260563 10200 -70346 -52670 -124791 232781 206708 -90658
9666 -234051 -71655 -64438 -62256 -165997 -113847 -238991 43562 -51480 -150982 20018 143402
9655 143402 -252620 -142204 -18617 -90101 -54683 -99696 -113057 -332233 -208155 -201967 120052
9643 -182060 44178 234764 -338919 -330445 -89175 114006 98965 -236141 -213686 -230489 -179822
$$ packed form
9727i7007M7227G8144a75683N405k0642d6630D5478J06456d0888H3479C9241J9275
9715E8516a13442d4987r181r9031G9003a63764J0617m6937i901I4562a68906G7887
9702A07919d1871A72072e12423b12904B611J50374c10794B6962b37908i9299c6054
9690C8444J46409b75404H8831h5881j85221p0292H9935c33424i3741B9083c62200
9678G1595c12159Q7348h5305j75258A0200g0346J7676p2121B32781k6073i0658
9666b34051g1655P217K182j03741N2150j25144D3562e1480r9502B0018J23384
9655A43402b52620J10416a8617p1484L5418m5013j3361k19176J24078O188A20052
9643a82060D4178J90586c38919Q474h9175A14006j5041b36141K2455j6803N0667
$$ plain form
9632 -179822 -177041 35460 -163574 79768 6922 -188972 -51639 106908 -128575 -5778 68596
9620 19445 24458 107458 31526 -48201 -68313 -24588 84042 -189959 -254836 88517 201928 -144885
9607 -159303 -279636 -42114 -89937 -136579 -114418 9992 71001 145146 -422930 -146808 272657
9595 -104636 22526 425955 -392129 38354 7857 -105806 -249769 280589 275795 -137408 -249583
9584 -249583 114979 -88313 130749 114841 264035 -32801 -289649 149543 45154 -63724 245767
9572 -20945 -198547 -44322 -155463 -14988 -233783 -317388 29658 44120 -151000 -254908 -212880
9561 -212880 15077 122635 -167331 -203972 43704 -179973 -284375 -98838 -382882 -63737 -150400
9550 -150400 -12783 106875 -116570 -137383 -243026 27770 89557 110378 -323731 110774 -185532
$$ packed form
9632a79822K781C5460a63574G9768F922a88972e1639A06908a28575e778F8596
9620A9445N013Q3000C1526d8201k0112b4588H4042a89959o4877H8517J13411a44885
9607a59303j20333d2114m7823m6642K2161I992O1009P4145d22930a46808B72657
9595a04636B2526M03429c92129C8354G857a05806j43963B80589m794a37408j12175
9584b49583A14979h8313A30749j5908J49194c2801k56848A49543D5154f3724B45767
9572b0945j77602d4322j11141a4988k18795q3605B9658J4462a51000j03908M2028
9561b12880A5077J07558a67331l6641D3704a79973j04402i8838k84044f3737q6663
9550a50400a2783A06875a16570k0813j05643B7770O1787K0821c23731A10774a85532
$$ plain form
9538 -103303 -130121 5620 -24722 -46174 -33182 -162205 39499 347012 254499 -181932 -74365
9526 -121772 -78647 49866 -2751 64167 -131696 -234672 155452 -212795 11709 -38232 -393765
9515 -393765 -5585 -110020 56755 -69405 140349 -134829 -340111 -78202 -345465 194322 -190675
9503 19669 -188291 62804 -43839 175713 -307490 254990 85410 -53034 -100951 150183 167839
9492 167839 83552 -260982 123153 102983 141723 -21941 -14268 -9126 49428 -173748 284996
9480 175621 127246 -25238 -382347 139948 73438 -289284 -80472 -246630 -185136 177612 -48780
9468 -64687 -183771 106131 -69952 92581 42588 224384 -127238 -255062 -93554 -272896 48603
9456 -38638 -144013 -7181 34730 -33106 -235361 76662 78078 -255715 -252566 143638 161825 134630
$$ packed form
9538a03303k6818E620b4722k1452J2992j29023C9499L07513r2513a81932g4365
9526a21772M3125D9866b751F4167a31696j02976A55452b12795A1709c8232l55533
9515c93765e585j04435E6755f9405A40349a34829k05282g8202k67263A94322a90675
9503A9669a88291F2804d3839A75713c07490B54990H5410e3034m7917A50183J7656
9492A67839H3552b60982A23153k0170L8740b1941P673N142D9428a73748B84996
9480A75621m8375b5238l57109A39948o6510b89284h0472j66158O1494A77612d8780
9468f4687j19084A06131f9952I2581D2588J81796a27238j27824i3554j79342D8603
9456c8638j05375g181C4730c3106k02255G6662J416b55715L149A43638J8187k7195
$$ plain form
9444 134630 -36992 -48046 301556 -33388 13933 -34041 -194114 23969 -5756 159594 -44200
9432 61388 138191 266101 -118551 -368139 -37773 109044 -123824 164037 -31958 -60252 197677
9420 -62069 -99680 -495010 131396 -51772 -317579 -28685 -143987 217143 38774 -177668 -273388
9409 -273388 144107 -87314 -293232 -171220 100341 -96335 140969 68869 48140 -85865 15609
9397 71975 374880 45946 -134332 123874 -160455 -103211 -104978 -61981 -259559 -83269 135416
9385 136392 138745 -391437 -32967 -179165 -16101 42758 -89876 -268877 -246311 -107409 82785
9373 -39579 29571 -372733 -180663 -165361 142506 252036 -26336 -277919 91359 198313 36627
9361 62772 46024 -221343 90197 -69606 62218 183134 94109 -329574 -81487 67273 -60097
$$ packed form
9444A34630c6992j1054C01556c3388A3933c4041j60073B3969e756A59594d4200
9432F1388P6803J27910a18551k49588c7773A09044a23824A64037c1958k8294A97677
9420f2069l7611l95330A31396e1772k65807b8685j15302B17143C8774a77668r5720
9409b73388A44107h7314k05918J22012A00341i6335A40969F8869k0729h5865A5609
9397G1975L02905D5946a34332A23874a60455N7244j767M2997j97578h3269A35416
9385A36392K353c91437c2967j46198a6101D2758h9876j79001K2566a07409H2785
9373c9579B9571c72733a80663J5302A42506J09530b6336k51583I1359J06954C6627
9361F2772j6748b21343I0197f9606F2218J20916q9025c29574h1487F7273f0097
$$ plain form
9349 134066 -240021 -77862 -401681 -63878 134677 -284035 -18539 -132007 -100260 -402344
9339 -402344 -169453 -111399 -172520 -53873 139477 221928 35611 -66829 60888 79007 -330525
9327 -33667 312495 5963 274466 -56923 -2466 -129963 -54568 156264 203473 34271 197947
9316 197947 -171394 21423 -99807 248703 -20048 -286711 179859 -138349 -108712 -75828 -368021
9305 -368021 -40214 -193279 29467 -253511 39185 122389 -164888 -152723 -236948 153467 -73181
9293 22637 -158736 124328 -16216 98690 -142549 -1355 -164472 -108889 -106983 27308 254915
9282 254915 -60833 47005 -163018 -77940 356791 20617 -16935 -8551 52940 138430 -114964
9270 -67174 -285802 -244956 -238998 -40747 -3895 -235902 -29140 -22533 42683 -146170 -4349 -141894
$$ packed form
9349A34066b40021g7862l23819f3878A34677b84035a8539j13468L1747l02084
9339d02344a69453N8054o1121e3873A39477Q2451C5611f6829F0888J8119c30525
9327c3667C12495E963K68503e6923b466j27497e4568A56264M7209C4271J63676
9316A97947a71394B1423i9807B48703b0048k66663A79859a38349K9637L2884k92193
9305c68021d0214j53065B9467b53511C9185Q3204a64888J2165q4225A53467g3181
9293B2637a58736A24328a6216I8690a42549a355j63117N5583J906B7308K27607
9282B54915f0833D7005a63018g7940C56791B0617a6935Q384E2940Q5490a14964
9270f7174k18628M0846N958d0747c895k32007b9140O607D2683a46170d349j37545
$$ plain form
9258 -141894 165146 39931 17820 -206986 -95336 115360 -120412 -74356 -286817 -32522 -18822
9247 -18822 94426 -127191 -108556 -12893 -350723 -243895 -167703 -72972 -371509 155003 56689
9235 -255365 164288 -63490 171749 169308 5553 -237887 -143567 -29295 -135228 49003 -159295
9223 -215323 179543 -240244 -228663 94861 95192 -219547 231642 226183 -164408 -81713 -231040
9212 -231040 67454 36992 -75599 106078 -213232 -356283 107476 -97559 -158847 389430 -250752
9200 -122323 -260425 49675 139603 -88737 -98202 -238503 -125491 -135202 116993 190460 65436
9188 -115441 -191830 6978 52266 32970 -255029 261646 -102996 -75877 -142158 -242480 96584
9176 -73093 -202842 130924 -227644 -17749 100953 -516145 7250 -14913 -23089 11686 -360334
$$ packed form
9258a41894A65146C9931A7820b06986i5336A15360a20412M6056k12461c2522J3700
9247a8822I4426a27191J8635a2893l37830J06828P6192g2972k98537A55003E6689
9235b55365A64288f3490A71749k441E553b37887R4320b9295j05933D9003a59295
9223b15323A79543b40244J1581I4861L31b19547B31642n459a64408h1713j49327
9212b31040F7454l0462g5599A06078b13232j43051A07476i7559o1288C89430b50752
9200a22323j38102D9675Q9928h8737r465j40301J13012r711A16993P3467F5436
9188a15441p6389F978M5288j9296b55029B61646a02996K7119o6281j00322I6584
9176g3093j29749A30924b27644a7749A00953e16145G250a4913q176A1686c60334
$$ plain form
9164 -90255 62162 158159 66813 125311 -134104 119721 -11113 103278 105007 -80249 37089
9152 -83283 -142915 -143561 49420 -51577 -41856 -321145 -191436 -113122 154832 -67870 29218 -39422
9139 54402 -82852 44501 -110213 194082 -187099 104153 -170129 -102838 332640 -76228 -237171
9128 -237171 -63729 135915 -132111 142839 -14419 38744 -224082 -143169 104355 88047 -87968
9116 101083 130611 -168814 -254332 -274979 -378646 -389222 411130 -141787 -131768 61009 -165288
9104 65895 -24275 -25180 -154472 -36093 174273 25712 16640 137300 -46546 -135075 -196834 -229985
9092 -229985 -204789 204256 -75606 50800 95883 -26593 237386 -124198 217179 44138 404941
9081 404941 -151853 -127037 -99746 125071 -103021 -195516 -29623 -287802 103274 -60769 -58814
$$ packed form
9164i0255F2162R5997F6813N8498a34104A19721a1113A03278J729h0249C7089
9152h3283n9632o46D9420e1577R721k79289J29709P8314A54832f7870B9218c9422
9139E4402h2852D4501a10213A94082a87099A04153a70129O7291C32640g6228j60943
9128b37171f3729A35915a32111A42839a4419C8744b24082Q0913A04355j6308h7968
9116A01083K9528a68814q5518k0647j03667j0576D11130a41787J0019F1009a65288
9104F5895b4275r05j29292c6093A74273B5712r072J20660d6546q8529o1759l3151
9092b29985K5196B04256g5606E0800M5083b6593B37386a24198B17179D4138L60803
9081D04941a51853K4816K7291A25071a03021r2495b9623k58179A03274f0769J955
$$ plain form
9070 -58814 79925 277250 -155093 50138 -67968 -229833 212307 -107857 146812 71115 -16230
9058 190718 72939 -199538 36952 268410 -167609 -259922 96335 116831 -16543 -65445 94848
9046 -72045 257181 -238634 30874 36325 22754 -2102 49378 139577 -74356 -159608 -40453 50528
9033 145836 -91530 -201290 -115787 -141362 -241263 -239411 -101666 -181675 -283440 138276 -351691
9021 143867 121734 161640 -21656 -7650 -363199 -29267 16663 94675 365077 38473 80442
9010 80442 -62191 -5033 -2700 -44480 46876 -237785 -68007 -353752 -47203 213172 -140253
8998 142865 -306877 27953 44101 156712 -354828 -225451 90619 -304931 282275 55018
8987 -184520 -175819 42825 -91207 -112049 -52433 52190 -124655 108191 -29805 -100684 -232973
$$ packed form
9070e8814G9925J97325a55093E0138f7968j61865B12307a07857A46812G1115a6230
9058A90718G2939a99538C6952K31458a67609r2313I6335K0496a6543m8902I4848
9046g2045B57181b38634C0874N451j3571b102D9378R0199g4356q5252d0453E0528
9033A45836i1530j09760Q5503k5575r9901J852a01666q0009j01765A38276c51691
9021A43867k2133L9906b1656g650l55549b9267A6663P8012K70402C8473M1969
9010H0442f2191e033K333m1780D6876b37785f8007k85745d7203B13172a40253
8998A42865c06877B7953J6148J12611c54828J29377I0619c04931B82275E5018
8987a84520Q701D2825i1207k0842e2433E2190a24655A08191b9805p0879j32289
$$ plain form
8976 -232973 -170339 -14924 270626 -74028 292962 -141004 -129916 91207 38028 -138407 106659
8964 -199729 193593 -65797 25225 -118621 195338 94265 -47904 -55887 -28406 19181 -7144
8952 -45361 119810 110377 71853 180633 -33425 -252630 -159888 -249960 -19235 19831 -89133
8940 -57263 -384482 165104 -291289 218200 -153778 173948 439217 285469 57627 112080
8930 112080 -270942 -186707 259677 95050 166331 197811 576283 1737150 5567350 14333338
8920 14333338 8622129 2031146 939498 289126 354604 40910 -36204 4638 189723 94120
8909 -257316 181357 188149 416727 41334 -75365 127623 95989 175649 68152 -403874 167009
8897 13090 -18599 -118067 -186544 -238586 126041 -30748 304841 -152499 167478 55480 -57568
$$ packed form
8976b32973O2634a4924B70626g4028B92962a41004J1088I1207C8028a38407A06659
8964a99729A93593f5797B5225a18621A95338I4265d7904p983K7481A9181g144
8952d5361A19810r433l8524J08780c3425k19205R2742r0072a9235A9831h9133
8940e7263l27219A65104b91289B18200a53778A73948K65269j53748E7627N4453
8930A12080b70942Q4235B59677I5050P1281L1480L78472J160867L830200Q765988
8920A4333338n711209B031146I39498B89126O5478D0910c6204D638J85085I4120
8909b57316A81357O792K28578D1334g5365A27623l1634P9660F8152d03874A67009
8897A3090a8599r9468o8477n2042A26041c0748C04841a52499A67478E5480e7568
$$ plain form
8885 -56104 -20957 -97705 73729 175752 185414 -203468 49964 10737 -73268 28790 -19780 -209596
8873 -209596 -145252 -238744 147975 -62984 -22867 -70251 -80924 -27577 -261183 -267709 -478290
8862 -478290 117931 100902 346979 -201163 1340 131318 7645 -4414 12582 2831 3466 -167038
8849 156973 148846 -135623 5967 -150058 -125594 -286889 -168186 -41438 108793 -312117 35849
8837 -43029 151329 19684 -21898 -53909 -167606 -395993 -70625 -307864 61338 -208069 210309
$$ packed form
8885e6104b0957p6748G3729J02023R662b03468D9964A0737g3268B8790a9780j89816
8873b09596O4344r3492A47975f2984b2867m7384j0673b7577k33606o526k10581
8862d78290A17931j7029K46077b01163A340J29978G645d414A2582B831O35a67038
8849A56973q127a35623E967a50058K4464j61295J18703d1438A08793c12117C5849
8837d3029A51329A9684b1898l2011j13697k28387g0625k37239F1338b08069B10309
$$ [...]
##END NTUPLES=NMR SPECTRUM
##END=
