##TITLE=NES1064_159122.0005_001_9704441_LixE7HFyrJ
##JCAMPDX= 6.0         $$ Bruker NMR JCAMP-DX V2.0
##DATA TYPE= NMR SPECTRUM
##DATA CLASS= NTUPLES
##ORIGIN= BRUKER
##OWNER= Administrator
$$ 1.72 TOPSPIN		Version 2.1
$$ 2016-04-30 17:06:51.114 -0700  Administrator@X
$$ Compression mode = diff/dup
##.OBSERVE FREQUENCY= 400.02188249412
##.OBSERVE NUCLEUS= ^1H
##.ACQUISITION MODE= SIMULTANEOUS (DQD)
##.ACQUISITION SCHEME= undefined
##.AVERAGES= 64
##.DIGITISER RES= 22
##SPECTROMETER/DATA SYSTEM= spect
##.PULSE SEQUENCE= noesygpps1d.comp
##.SOLVENT NAME= COFFEE_meoh
##.SHIFT REFERENCE= INTERNAL, COFFEE_meoh, 1, 14.9621
##AUDIT TRAIL= $$ (NUMBER, WHEN, WHO, WHERE, PROCESS, VERSION, WHAT)
$$ ##TITLE= Audit trail, TOPSPIN		Version 2.1
$$ ##JCAMPDX= 5.01
$$ ##ORIGIN= Bruker BioSpin GmbH
$$ ##OWNER= Administrator
$$ $$ E:\/data/COFFEE/nmr/NES1064_159122.0005_001_9704441_LixE7HFyrJ/12/pdata/1/auditp.txt
$$ ##AUDIT TRAIL=  $$ (NUMBER, WHEN, WHO, WHERE, PROCESS, VERSION, WHAT)
(   1,<2016-04-30 17:06:45.786 -0700>,<Administrator>,<X>,<go>,<TOPSPIN 2.1>,
      <created by zg
	started at 2016-04-30 16:55:16.130 -0700,
	POWCHK enabled, PULCHK disabled,
       configuration hash MD5:
       21 0F 79 D6 B3 7B B4 F6 88 20 88 DB 03 48 BD 9F
       data hash MD5: 64K
       24 BC 78 ED 8C 4E B6 0E 45 C3 9D AD EB A2 0F 97>)
(   2,<2016-04-30 17:06:49.083 -0700>,<Administrator>,<X>,<proc1d>,<TOPSPIN 2.1>,
      <Start of raw data processing
       efp LB = 0.3 FT_mod = 6 PKNL = 1 PHC0 = 0 PHC1 = 0 SI = 128K 
       data hash MD5: 128K
       83 73 22 7C 7A 74 66 DD 9D C7 A6 4E A1 07 D6 6F>)
(   3,<2016-04-30 17:06:49.942 -0700>,<Administrator>,<X>,<proc1d>,<TOPSPIN 2.1>,
      <pk PHC0 = -86.67664 PHC1 = 0 
       data hash MD5: 128K
       4C A5 EE 18 47 B1 D2 33 E5 63 1E 59 81 67 88 97>)
(   4,<2016-04-30 17:06:50.349 -0700>,<Administrator>,<X>,<proc1d>,<TOPSPIN 2.1>,
      <abs ABSG = 1 
       data hash MD5: 128K
       CA EF F5 44 E6 C5 A1 1D C6 71 B5 36 46 2B F6 D4>)
(   5,<2016-04-30 17:06:50.442 -0700>,<Administrator>,<X>,<proc1d>,<TOPSPIN 2.1>,
      <abs ABSG = 2 
       data hash MD5: 128K
       BF CD 3B 19 37 05 28 38 D0 6B 12 9D DE 9D 50 58>)
(   6,<2016-04-30 17:06:50.536 -0700>,<Administrator>,<X>,<proc1d>,<TOPSPIN 2.1>,
      <abs ABSG = 3 
       data hash MD5: 128K
       3C FD F2 76 0E 6F 21 1B CB 64 4F 0A D5 39 C4 7E>)
(   7,<2016-04-30 17:06:50.614 -0700>,<Administrator>,<X>,<proc1d>,<TOPSPIN 2.1>,
      <abs ABSG = 4 
       data hash MD5: 128K
       40 DA A2 BF DB 76 57 A0 5C D4 46 B1 BE 47 06 BA>)
(   8,<2016-04-30 17:06:50.739 -0700>,<Administrator>,<X>,<proc1d>,<TOPSPIN 2.1>,
      <abs ABSG = 5 
       data hash MD5: 128K
       60 8E F1 9F 1E DD FC 9B FA DA A0 1C A9 33 6D AE>)
$$ ##END=
$$ 
$$ $$ hash MD5
$$ $$ 4F 5A 57 04 B1 86 5D 19 12 FA CE 29 78 75 F6 EA
##$RELAX= 
##$RELAX= 
##$RELAX= 
##$RELAX= 
##$RELAX= 
##$RELAX= 
##$RELAX= 
##$RELAX= 
$$ Bruker specific parameters
$$ --------------------------
##$DU= <E:\>
##$EXPNO= 12
$$ [...]
150 150 150 150 150 150 150 150
##$TP07= 0
##$TPNAME0= <>
##$TPNAME1= <>
##$TPNAME2= <>
##$TPNAME3= <>
##$TPNAME4= <>
##$TPNAME5= <>
##$TPNAME6= <>
##$TPNAME7= <>
##$TPOAL= (0..7)
0.5 0.5 0.5 0.5 0.5 0.5 0.5 0.5
##$TPOFFS= (0..7)
0 0 0 0 0 0 0 0
##$TUNHIN= 0
##$TUNHOUT= 0
##$TUNXOUT= 0
##$USERA1= <user>
##$USERA2= <user>
##$USERA3= <user>
##$USERA4= <user>
##$USERA5= <user>
##$V9= 5
##$VALIST= <valist>
##$VCLIST= <CCCCCCCCCCCCCCC>
##$VD= 0
##$VDLIST= <DDDDDDDDDDDDDDD>
##$VPLIST= <PPPPPPPPPPPPPPP>
##$VTLIST= <TTTTTTTTTTTTTTT>
##$WBST= 2048
##$WBSW= 25
##$XGAIN= (0..3)
0 0 0 0
##$XL= 0
##$YL= 0
##$YMAX_a= 5424442
##$YMIN_a= -11490309
##$ZGOPTNS= <>
##$ZL1= 120
##$ZL2= 120
##$ZL3= 120
##$ZL4= 120
##$ABSF1= 14.9621
##$ABSF2= -5.596082
##$ABSG= 5
##$ABSL= 3
##$ALPHA= 0
##$AQORDER= 0
##$ASSFAC= 0
##$ASSFACI= 0
##$ASSFACX= 0
##$ASSWID= 0
##$AUNMP= <proc_prof1d_extract.lims>
##$AXLEFT= 0
##$AXNAME= <>
##$AXNUC= <1H>
##$AXRIGHT= 0
##$AXTYPE= 0
##$AXUNIT= <>
##$AZFE= 0.1
##$AZFW= 0.1
##$BCFW= 0
##$BC_mod= 0
##$BYTORDP= 0
##$COROFFS= 0
##$CY= 15
##$DATMOD= 1
##$DC= 0
##$DFILT= <>
##$DTYPP= 0
##$F1P= 0
##$F2P= 0
##$FCOR= 0.5
##$FTSIZE= 131072
##$FT_mod= 6
##$GAMMA= 0
##$GB= 0
##$INTBC= 1
##$INTSCL= 1
##$ISEN= 128
##$LB= 0.3
##$LEV0= 0
##$LPBIN= 0
##$MAXI= 10000
##$MC2= 0
##$MEAN= 0
##$ME_mod= 0
##$MI= 0
##$NCOEF= 0
##$NC_proc= -2
##$NLEV= 6
##$NOISF1= 0
##$NOISF2= 0
##$NSP= 0
##$NTH_PI= 0
##$NZP= 0
##$OFFSET= 14.9621
##$PC= 1
##$PHC0= -86.67664
##$PHC1= 0
##$PH_mod= 1
##$PKNL= yes
##$PPARMOD= 0
##$PPDIAG= 0
##$PPIPTYP= 0
##$PPMPNUM= 2147483647
##$PPRESOL= 1
##$PSCAL= 4
##$PSIGN= 0
##$PYNMP= <proc.py>
##$REVERSE= no
##$SF= 400.020009197052
##$SI= 131072
##$SIGF1= 0
##$SIGF2= 0
##$SINO= 400
##$SIOLD= 131072
##$SPECTYP= <>
##$SREGLST= <1H.CDCl3>
##$SSB= 0
##$STSI= 131072
##$STSR= 0
##$SW_p= 8223.68421052631
##$SYMM= 0
##$S_DEV= 0
##$TDeff= 65536
##$TDoff= 0
##$TI= <>
##$TILT= no
##$TM1= 0
##$TM2= 0
##$TOPLEV= 0
##$USERP1= <user>
##$USERP2= <user>
##$USERP3= <user>
##$USERP4= <user>
##$USERP5= <user>
##$WDW= 1
##$XDIM= 131072
##$YMAX_p= 399512024
##$YMIN_p= -11078
##$CURPLOT= <Network HP LaserJet P1505>
##$CURPRIN= <$Network HP LaserJet P1505>
##$DFORMAT= <normdp>
##$LAYOUT= <+/1D_H.xwp>
##$LFORMAT= <normlp>
##$PFORMAT= <normpl>
##$SURQMSG= 1
$$ End of Bruker specific parameters
$$ ---------------------------------
##NTUPLES= NMR SPECTRUM
##VAR_NAME=  FREQUENCY,     SPECTRUM/REAL,   SPECTRUM/IMAG
##SYMBOL=    X,             R,               I
##VAR_TYPE=  INDEPENDENT,   DEPENDENT,       DEPENDENT
##VAR_FORM=  AFFN,          ASDF,            ASDF
##VAR_DIM=   131072,        131072,          131072
##UNITS=     HZ,            ARBITRARY UNITS, ARBITRARY UNITS
##FACTOR=    0.0627417313425164, 1,          1
##FIRST=     8223.62146879497, 1395,         -48241
##LAST=      0,             3622,            -48277
##MIN=       0,             -11078,          0
##MAX=       8223.62146879497, 399512024,    0
$$ Real data points
##PAGE= N=1
##DATA TABLE= (X++(R..R)), XYDATA
$$ [...]
64585 158217 157723 157621 157424 156448 154392 151468 148263 145448 143228 141148 138762 136407 134890 134481 134740 135249
64569 135249 135911 136521 136700 136512 136592 137389 138697 140192 141970 144169 146471 148369 149774 150983 152177 153215
64553 153215 153882 154149 154201 154216 154044 153177 151285 148714 146155 143775 141100 137838 134470 131778 130095 129172
64537 129172 128513 127618 126149 124175 122154 120520 119344 118441 117667 117078 116967 117719 119354 121268 122756 123805
64521 123805 124945 126309 127340 127574 127185 126506 125503 124079 122488 121059 119798 118607 117513 116388 114826
64506 114826 112785 110950 109955 109491 108730 107427 106026 104861 103923 103321 103346 103957 104714 105342 105880 106207 105947
64489 105947 105070 104135 103648 103505 103313 102966 102653 102560 102825 103559 104604 105426 105563 105111 104558 104217 104064 104059 104302
64470 104302 104804 105293 105449 105288 105234 105806 107196 109094 110934 112388 113621 114993 116441 117343 117212 116511 116427
64453 116427 117633 119510 120951 121758 122781 124665 127000 128940 130187 130999 131649 132386 133692 135960 138934
64438 138934 141976 144931 148283 152393 157070 162008 167102 172057 176130 178784 180372 181816 183757 186350
64424 186350 189745 194299 200279 207687 216405 226194 236435 246237 255028 262932 270380 277460 283792 288940
64410 288940 292701 295028 295897 295305 293241 289570 284148 277219 269606 262267 255577 249128 242146 233983 224362
64395 224362 213555 202479 192351 183946 177258 171944 167835 164787 162404 160336 158730 157884 157515 156916
64381 156916 155943 155279 155472 156181 156781 157305 158251 159745 161465 163280 165352 167555 169353 170518 171541 173048
64365 173048 175050 177082 178899 180717 182794 184985 186820 188055 189119 190881 193767 197233 200373 202993
64351 202993 205694 208911 212429 216102 220521 226431 233732 241591 249368 257019 264720 272645 281090 290242
64337 290242 299701 308766 317408 326546 337035 348728 360779 372581 384080 395480 407021 418838
64325 418838 430639 441604 451073 459380 467780 477554 489476 504087 522059 544065 570622 602357
64313 602357 640344 685873 739811 802221 872626 950554 1035739 1127666 1224682 1323360 1418606
64302 1418606 1504458 1575031 1625122 1650509 1648442 1618599 1563908 1490175 1404214 1311841 1217261
64291 1217261 1123835 1034687 952264 877600 810381 749722 694867 645409 601175 561899 526956
64280 526956 495587 467470 442782 421533 403073 386543 371507 357816 345089 332823 320907
64269 320907 309564 298767 288190 277819 268222 260034 253419 248054 243357 238737 233993 229589 226169
64256 226169 223693 221385 218656 215683 212913 210425 208036 205690 203424 201256 199493 198816 199537 200961 201984
64241 201984 202387 203034 204700 207107 209314 210783 211762 212812 214255 216072 218068 219971 221493 222484 223107
64226 223107 223760 224728 225918 226965 227583 227758 227735 227947 228802 230302 231947 233373 235079 238165 243115 249206
64210 249206 255327 261189 267438 274795 283471 293308 304137 315917 328781 343021 358833 375974 393890
64197 393890 412306 431643 452744 476282 502563 531959 565367 604055 648974 700408 758491
64186 758491 823937 897859 980731 1071681 1168800 1269606 1370742 1467345 1553184 1621737 1667373
64175 1667373 1686110 1676114 1638150 1575685 1494403 1401110 1302320 1203070 1106619 1015060 930014
64164 930014 852569 782842 720072 663356 612227 566549 526064 490217 458347 429953 404778
64153 404778 382672 363408 346727 332509 320663 310706 301666 292662 283575 274917 267124 260183 253944
64140 253944 248407 243546 239093 234702 230296 226128 222492 219484 216993 214885 213139 211769 210636 209496
64126 209496 208283 207176 206241 205206 203925 202877 202800 203684 204574 204609 203964 203514 203757 204414 204962 205222 205387 205738
64108 205738 206393 207192 207823 208176 208627 209789 211952 214863 218082 221425 225027 229075 233596 238419 243270
64093 243270 247887 252044 255481 257889 259108 259306 258819 257830 256323 254374 252277 250310 248559 247025 245742
64078 245742 244654 243622 242713 242296 242634 243554 244830 246723 249766 254076 259315 265363 272608 281377 291425
64063 291425 302209 313481 325415 338331 352358 367162 381863 395500 407706 418608 427966 434891
64051 434891 438741 439909 439240 437028 433074 427524 421044 414288 407720 401807 396760 392070 386970 381432
64037 381432 376094 371102 365756 359618 353259 347443 342150 337027 332288 328393 325062 321431 317299 313580
64023 313580 311216 310101 309336 308282 307007 305890 305159 304937 305407 306662 308407 310153 311876 314234 317807
64008 317807 322250 326619 330539 334572 339290 344464 349548 354630 360418 367362 375173 383280 391535 400395
63994 400395 410473 421914 434214 446832 460001 474682 491544 510241 529970 550530 572475
63983 572475 596273 621637 647822 674395 701662 730419 761384 794874 831073 870472 913888
63972 913888 962060 1015535 1075062 1141909 1217721 1304346 1403944 1519041 1652280 1806278 1983844
63961 1983844 2188080 2422013 2688161 2988232 3322615 3689755 4086353 4508525 4952510
63952 4952510 5413924 5886665 6362910 6833660 7288574 7715584 8101848 8435974 8709571
63943 8709571 8917148 9055338 9122500 9118411 9043631 8898986 8686006 8408173 8072080 7687517
63933 7687517 7266339 6820751 6361939 5899346 5440322 4990303 4553938 4136406 3743262
63924 3743262 3378716 3044571 2741330 2469669 2229950 2020587 1838016 1678553 1539641
63915 1539641 1419192 1314628 1223163 1142669 1071799 1009425 954163 904366 858575 816200 777642
63904 777642 743281 712319 683122 654752 627548 601997 577693 553837 530218 507175 484949
63893 484949 463647 443605 425184 408279 392486 377747 364379 352495 341771 331868 322726 314349
63881 314349 306623 299536 293284 287886 282850 277519 271764 266138 261310 257460 254284 251420 248718 246178
63867 246178 243868 241905 240364 239151 238133 237361 236980 236890 236749 236400 236089 236120 236594 237536 238898 240155 240310
63850 240310 238782 236101 233314 230815 228177 224983 221356 217693 214294 211233 208255 204850 200795 196548
63836 196548 192745 189417 186180 183055 180525 178747 177280 175719 174123 172676 171450 170634 170505 170925 171288
63821 171288 171204 170845 170416 169744 168637 167253 165840 164466 163252 162494 162272 162293 162390 162802 163662 164628 165437 166436
63803 166436 168031 169843 170979 171034 170430 169773 169301 168966 168671 168240 167371 165839 163765 161675 160174 159454 159167
63786 159167 158918 158750 158896 159143 158902 157979 156833 155900 155043 153917 152549 151251 150187 149198 147928 146017
63770 146017 143414 140572 138051 135920 133932 132236 131277 130860 130109 128768 127854 128389 130055 131768 133115
63755 133115 134379 135454 135734 135101 134222 133680 133469 133540 134216 135678 137487 138991 139995 140750 141469 142201 143112
63738 143112 144582 146919 150042 153535 156990 160232 163273 166232 169391 173141 177522 181902 185466 188046
63724 188046 190134 192040 193448 193945 193608 192856 192019 191286 190707 190063 189098 188099 187852 188719 190177 191599 193113
63707 193113 195222 197942 200858 203825 207073 210661 214235 217350 219742 221375 222412 223046 223249 222832 221851
63692 221851 220606 219073 216797 213614 210088 206919 204343 202369 201083 200308 199545 198774 198766 199960 201593 202653
63676 202653 203206 203911 204633 204585 203641 202527 201685 200806 199514 197698 195178 191854 188254 185121 182402 179458
63660 179458 176335 173928 172656 171858 170813 169548 168294 166957 165685 165240 166206 168253 170671 173180 175743
63645 175743 178057 179871 181623 184216 188165 193187 198553 203751 208961 214941 222242 230555 239132 247749
63631 247749 256786 266482 276798 288080 301094 316089 332420 349392 366880 384757 402305 418607
63619 418607 433019 444898 453472 458516 460645 460465 457931 453135 447203 441673 437227 433690 430932 429021
63605 429021 427591 425791 422909 418503 412012 402937 391560 378935 366020 353250 341022 329996 320523
63592 320523 312173 304294 296868 290483 285542 281946 279593 278750 279547 281365 283311 285399 288723 294047 300667
63577 300667 307178 313081 318933 325065 331022 336506 342111 348667 356330 364721 373540 382711 392330 402862
63563 402862 414992 428771 443230 457254 470445 482595 492626 498894 500634 498569 494016 487826
63551 487826 480419 472514 465435 460610 458703 459168 460702 462146 462883 462542 460778 457497 452914 447072 439564
63536 439564 430039 418746 406298 393238 380114 367639 356199 345317 334142 322478 311008 300540
63524 300540 291374 283370 276197 269465 262976 257064 252439 249517 247905 246656 244995 242846 240650 238703
63510 238703 236775 234521 232082 229907 228027 225961 223470 220962 218853 216961 214903 212787 211077 210006
63496 210006 209508 209560 210240 211513 213231 215235 217316 219338 221556 224467 228066 231618 234518 236935 239224
63481 239224 241104 242041 242086 241672 240776 239044 236654 234337 232432 230565 228392 226159 224340 223155 222583 222478
63465 222478 222594 222876 223769 225826 228933 232329 235507 238712 242429 246831 251877 257569 263801 270228 276557
63450 276557 282872 289543 296924 305110 313842 322624 331169 339714 348767 358643 369473 381439 394647
63437 394647 408913 424170 441031 460453 482733 507210 532904 558905 584062 606849 625888
63426 625888 640423 650216 655407 656569 654543 650034 643704 636600 629996 624578 620252 616872 614565 612945
63412 612945 610509 605388 596565 584097 568467 550226 530176 509431 489129 470121 452783 436980
63400 436980 422347 408784 396586 386108 377539 371061 366880 364888 364565 365496 367825 372068 378726 388204
63386 388204 400725 416004 433242 451674 470897 490349 508870 525250 539128 550893 560845 568976
63374 568976 575649 581948 589004 597158 606018 615183 624553 633796 641767 646824 647941 645387 640160 632988
63360 632988 624221 614555 605237 597290 590850 585512 580977 576983 572867 567614 560318 550403 537594 522071
63346 522071 504619 486294 467896 449894 432727 416880 402641 390063 379165 369948 362159 355277
63334 355277 348827 342589 336530 330766 325652 321632 318733 316259 313242 309320 305074 301410 298642 296388
63320 296388 294419 293311 293989 296789 301318 307224 314597 323527 333749 345109 357916 372207 386747
63307 386747 399287 407953 412083 411789 407251 398730 386913 372841 357571 342113 327527 314660 303714
63294 303714 294281 285954 278701 272511 266985 261630 256549 252409 249607 247738 246125 244544 243126 241834
63280 241834 240578 239678 239608 240148 240423 240013 239599 240144 241827 244103 246419 248380 249539 249720 249526 249987 251575
63263 251575 253945 256666 259711 263061 266287 268908 271015 273235 276125 279751 283841 288210 293001 298505
63249 298505 304762 311502 318579 326289 334973 344452 354241 364370 375526 388181 402010 416499 431752
63236 431752 448217 465833 484050 502695 522279 543230 565247 587641 609986 632088 653694
63225 653694 674738 695786 717793 741319 766297 792501 819838 848017 876339 904028 930555
63214 930555 955407 977869 997300 1013423 1026006 1034547 1038706 1038888 1035807 1029332 1018207 1001155 978057
63201 978057 950014 918667 885636 852221 819200 786994 756278 728337 704609 685865 671994
63190 671994 662467 656872 655083 657064 662573 671016 681754 694597 709825 727516 746930 766765 786040
63177 786040 804695 823379 842737 862785 882827 902114 920612 938960 957491 975473 991540
63166 991540 1004686 1014526 1020759 1022878 1020580 1014113 1003935 990176 972647 951342 926822 900151
63154 900151 872481 844669 817225 790639 765670 743092 723146 705478 689754 676145 665045
63143 665045 656501 650288 646522 645881 649066 656170 666629 679551 693949 708882 723641 737691 750176
63130 750176 759530 763918 762247 754651 742152 726113 708100 689745 672328 656490 642484 630481
63118 630481 620419 611777 603965 596971 591375 587615 585425 584054 582950 582178 582178 583040 584029 584124 583088 581759
63102 581759 581060 581101 581556 582419 583745 584951 585238 584750 584556 585268 586398 587273 587908 588555 589038 589107 588988 589083 589438
63083 589438 589996 591011 592690 594763 596964 599656 603336 607794 612426 617235 622743 628969 635305 641583
63069 641583 648541 656874 666426 676726 687832 700165 713846 728737 745045 763393 784187 807134
63057 807134 831491 856704 882824 910384 939912 971560 1005219 1040766 1077983 1116308 1154971
63046 1154971 1193473 1231705 1269538 1306569 1342435 1377193 1411245 1445028 1478919 1513225 1548070
63035 1548070 1583261 1618378 1652892 1686110 1717057 1744456 1766738 1782119 1788931 1786146 1773629 1751831
63023 1751831 1721355 1682889 1637491 1586738 1532523 1476611 1420312 1364614 1310734 1260454 1215652
63012 1215652 1177345 1145363 1119072 1098300 1083334 1074177 1070145 1070377 1074595 1083184 1096530 1114419
63000 1114419 1136088 1160705 1187645 1216409 1246552 1277771 1309851 1342410 1374888 1406959 1438773
62989 1438773 1470516 1501851 1532061 1560644 1587342 1611444 1631433 1645510 1652364 1651288 1641827 1623626
62977 1623626 1596599 1561084 1517801 1467748 1412140 1352403 1290223 1227484 1165845 1106205 1048687
62966 1048687 993287 940450 890913 845093 802863 763917 728146 695651 666502 640558 617393
62955 617393 596327 576643 557896 540061 523378 508105 494436 482494 472218 463255 455127 447594
62943 447594 440727 434537 428695 422848 417105 411926 407481 403419 399388 395538 392310 389862 387937 386135
62929 386135 384061 381329 377767 373693 369796 366625 364274 362524 361069 359582 357721 355211 351932 348009
62915 348009 343860 340097 337115 334784 332649 330474 328473 326978 326054 325468 324989 324670 324827 325645 326811 327734
62899 327734 328263 328889 329989 331084 331288 330447 329366 328858 328923 328960 328419 327137 325358 323644 322521 322028 321798
62882 321798 321620 321591 321601 321124 319914 318608 318184 318834 319738 320009 319629 319382 319918 320930 321397 320779 319801 319625
62864 319625 320269 320511 319613 318483 318532 319843 321244 321912 322086 322212 322267 322200 322291 322616 322680 322077 321156 320563 320397
62845 320397 320274 320000 319637 319072 318052 316722 315633 315047 314644 314106 313708 314034 315308 317248 319470 321791
62829 321791 324173 326586 328991 331400 333968 337010 340751 344921 348720 351425 353020 354087 355187 356588
62815 356588 358501 361175 364615 368485 372498 376687 381087 385442 389550 393730 398602 404454 411116 418366
62801 418366 426104 434191 442641 452061 463381 476869 491817 507558 524505 543773 566032 591186
62789 591186 619040 649759 683686 721217 762973 809633 861372 917725 978197 1042657 1110892
62778 1110892 1182015 1254581 1327050 1397779 1464729 1525685 1578789 1622555 1655392 1675661 1682534
62767 1682534 1676544 1658899 1630370 1591160 1541894 1484397 1421369 1355406 1288341 1221254 1154779
62756 1154779 1089380 1025556 964001 905603 851234 801371 755837 713956 675163 639520 607555
62745 607555 579540 555078 533429 514064 496752 481332 467661 455698 445251 435671 426250 417119
62733 417119 409408 404110 400951 398686 396427 394368 393278 393675 395538 398417 401665 404888 408463 413372
62719 413372 420240 428642 437649 446945 457106 468874 482592 498394 516498 537071 560126 585870
62707 585870 614979 648133 685374 726181 770256 817956 869926 926501 987470 1052163 1119630
62696 1119630 1188839 1258718 1327751 1393521 1452985 1503535 1543730 1572893 1590308 1595157 1587152 1566808
62684 1566808 1535049 1492934 1441968 1384342 1322461 1258136 1192382 1125968 1060028 996109 935756
62673 935756 880033 829291 783204 741105 702432 666971 634661 605296 578566 554437 533260
62662 533260 515289 500139 486894 474688 463020 451582 440119 428582 417230 406402 396276
62651 396276 386886 378189 370040 362321 355256 349357 344784 340914 336869 332456 328318 325151 323010 321426
62637 321426 319937 318374 316768 315195 313707 312302 310882 309246 307198 304843 302763 301640 301562 301864 301861 301584
62621 301584 301619 302419 304106 306705 310084 313686 316903 319891 323599 328725 334984 341740 348957 357052 366106
62606 366106 375869 386632 399431 414970 432756 451875 472529 496171 523849 554864 587525 621002
62594 621002 655850 692643 730604 767838 802483 833258 859228 879641 894104 902581 905192 902087
62582 902087 893433 879233 859366 834227 805250 774371 742901 711266 679797 649208 620128 592705
62570 592705 567019 543526 522665 504250 487644 472435 458661 446476 435875 426715 418754 411698
62558 411698 405392 399945 395539 392165 389617 387608 385731 383440 380279 376126 371187 365914 361005 357204
62544 357204 354760 353143 351512 349545 347718 346861 347567 349899 353428 357553 361914 366544 371596 377111 383206
62529 383206 390347 399183 410055 422840 437313 453558 472019 493217 517391 544358 573737 605325
62517 605325 639309 676144 716311 760000 806736 855336 904550 953821 1003074 1051723 1098308
62506 1098308 1141415 1180493 1215387 1245381 1269373 1287007 1299151 1307117 1311601 1312333 1308409 1298938
62494 1298938 1283750 1263678 1240024 1213655 1184637 1152605 1117199 1078237 1035868 990806 944295
62483 944295 897685 852036 808006 765941 726072 688771 654519 623465 595162 569116 545525
62472 545525 525098 508032 493530 480523 468642 458301 450032 443948 439712 436870 435230 434981 436314
62459 436314 438970 442371 446221 450695 455916 461597 467447 473641 480552 488156 496138 504517 513711 523844
62445 523844 534302 544248 553407 562062 570334 577738 583527 587275 589005 588801 586471 581655 574275 564811
62431 564811 554062 542554 530235 516917 503018 489679 477979 468139 459647 452030 445261 439510
62419 439510 434844 431235 428612 426764 425415 424538 424365 424926 425813 426610 427422 428726 430777 433338 435993 438588
62403 438588 441442 445132 449919 455325 460484 465053 469539 474573 480099 485512 490283 494150 497052 499331
62389 499331 501814 505161 509151 513042 516555 520054 523818 527705 531626 535833 540564 545903 552209 560222
62375 560222 570452 582866 597496 614965 635919 660184 686939 715699 746730 780507 816945
62364 816945 855159 893776 931544 967760 1001952 1033078 1059366 1079412 1093346 1102530 1108175 1110652
62352 1110652 1110110 1107103 1102152 1094972 1084659 1070656 1053198 1032779 1009641 984098 957121 930088
62340 930088 903846 878346 853403 829459 807251 786928 768030 750345 734260 720043 707170
62329 707170 694798 682687 671260 660850 651329 642568 634833 628443 623214 618535 614034 609984 606980
62316 606980 605288 604575 604210 603800 603416 603375 603863 604801 606007 607471 609405 612021 615291 618925 622573 626029
62300 626029 629317 632643 636275 640357 644889 649911 655630 662206 669514 677346 685815 695220 705353 715295
62286 715295 724146 731727 738234 743414 746480 746848 744621 740388 734853 728738 722777 717637 713955 712407
62272 712407 713589 717805 725126 735566 749061 765513 785196 808911 837150 869072 902805 936924
62260 936924 971101 1005000 1037113 1065277 1088173 1105866 1118997 1127918 1132679 1133384 1130259 1123449 1112905
62247 1112905 1098504 1080256 1058446 1033619 1006572 978410 950439 923643 898238 873985 851073
62236 851073 830440 813043 799042 787899 779033 772119 766921 763206 760770 759294 758208 757046 756080
62223 756080 756373 759055 764523 772331 781662 791807 802322 812991 823784 834754 845724 855958 864342
62210 864342 870120 873403 874714 874125 871169 865649 858243 850125 842227 835009 828662 823234 818725 815304
62196 815304 813419 813458 815348 818602 822751 827597 833140 839354 846030 852740 859023 864604 869382 873284 876374
62181 876374 879093 882132 886008 891073 898016 907871 921161 937327 955380 974913 996068 1018645 1041611
62168 1041611 1063420 1082489 1097528 1107949 1114131 1116943 1116881 1113852 1107815 1099336 1089249 1077843 1064467
62155 1064467 1047957 1027634 1004077 978928 953840 929698 906873 885793 866851 849982 834906
62144 834906 821740 810826 801864 793801 785832 778047 770808 763925 756880 749513 742023 734528 727165 720567
62130 720567 715596 712494 710727 709906 710485 713219 718211 724737 731814 738412 743214 744848 742901 738552 733811
62115 733811 730096 727719 726473 726046 725644 723729 718798 710423 699297 686426 672680 659126 647113
62102 647113 637603 630556 625269 621173 618071 615714 613604 611422 609456 608381 608713 610618 614135 619224
62088 619224 625470 632039 638335 644655 651895 660529 670210 680458 691349 703169 715674 728253 740791
62075 740791 753897 768064 783024 798179 813337 828564 843381 856565 866893 873886 877631 878100
62063 878100 874951 868032 857850 845280 830877 814632 796416 776425 755002 732244 708056 682624
62051 682624 656580 630620 605167 580532 557168 535526 515766 497857 481944 468329 456981
62040 456981 447262 438304 429654 421473 414233 408325 403868 400667 398328 396520 395145 394175 393393 392529 391605
62025 391605 390892 390414 389717 388327 386243 383794 381227 378662 376309 374346 372648 370986 369501 368683 368823
62010 368823 369747 371141 372902 375106 377938 381725 386635 392153 397161 400822 403274 405256 407262 409209
61996 409209 410662 411143 410405 408674 406417 403706 400038 395154 389760 385047 381576 379022 376868 374794 372417
61981 372417 369274 365404 361546 358469 356295 354701 353516 352700 351907 350555 348501 346390 345102 344866 345128
61966 345128 345304 345525 346456 348476 351250 354194 357154 360421 364189 368273 372409 376624 381206 386381 392139
61951 392139 398369 405102 412632 421354 431519 443133 456034 469958 484518 499337 514262 529333
61939 529333 544405 558998 572712 585676 598344 610847 622788 633743 643771 653267 662344 670477
61927 670477 676943 681685 685730 690559 697057 705207 714866 726524 741056 758898 779841 803636 830448
61914 830448 860566 893939 930313 969828 1013216 1061233 1113920 1170647 1230930 1295066 1363762
61903 1363762 1437205 1514600 1594449 1674874 1753527 1827400 1892899 1946194 1983777 2003179 2003371 1984495
61891 1984495 1947402 1893834 1826869 1750507 1668468 1583585 1498297 1414953 1335274 1260058 1189878
61880 1189878 1125577 1067589 1015251 967532 924241 885831 852211 822489 795953 772644 752752
61869 752752 735941 721499 708941 698291 689929 684089 680404 678151 677212 678465 682787 689954 699050
61856 699050 709700 722124 736072 750478 764374 777524 790030 801882 813017 823194 831532 836809
61844 836809 838654 838105 836714 835447 834621 834512 835682 838983 845393 855543 869352 886522 907350 932337
61830 932337 960666 989653 1016096 1037679 1052822 1059959 1057820 1046267 1026343 999781 968824 936079
61818 936079 903755 872992 844260 818190 795553 776683 761469 749832 741648 736290 732844 730917
61806 730917 730822 732847 736687 741767 747792 754785 762821 771846 781688 792125 803068 814770 827824 842897
61792 842897 860382 880270 902438 927147 955142 986976 1022423 1060974 1102912 1149360 1201162
61781 1201162 1258339 1321038 1390440 1468143 1555022 1651244 1757064 1872814 1998106 2131706
61771 2131706 2272187 2418049 2566773 2713916 2853213 2977407 3079262 3152682 3193602 3200126
61761 3200126 3172150 3111258 3021045 2907028 2775743 2633647 2486420 2338640 2193644 2053730
61751 2053730 1920625 1795781 1680267 1574511 1478301 1391043 1312089 1240949 1177207 1120225
61741 1120225 1069059 1022682 980241 941164 905324 873141 845101 820862 799141 778829 759993
61730 759993 743335 728923 715994 703971 692999 683366 674917 667393 660950 655958 652378 649616 646904
61717 646904 643652 639543 634573 629065 623547 618449 613837 609417 604901 600368 596146 592270 588244 583549
61703 583549 578247 572879 567886 563366 559315 555784 552741 550043 547658 545805 544822 544955 546302 548844 552574
61688 552574 557668 564421 572920 582902 594075 606397 619789 633684 647249 659967 671686 682005
61676 682005 689941 694315 694278 689428 679748 665722 648361 628834 608041 586611 565300 545261 527807
61663 527807 513857 503639 496976 493783 494128 497828 504378 513422 525070 539384 555570 571841 586010
61650 586010 596120 600759 599253 591751 579078 562412 543094 522483 501767 481912 463817 448309
61638 448309 435784 425940 418038 411346 405355 399894 395237 391804 389481 387554 385587 384046 383612 384199
61624 384199 385169 386294 387844 389844 391901 393809 395700 397437 398442 398360 397535 396613 395986 395674 395386 394559
61608 394559 392762 390188 387444 384849 382393 380396 379589 380278 382008 384274 387008 390074 392984 395698 399102
61593 399102 403979 409894 415869 421900 428886 437140 445915 454666 463922 474344 485528 496436 506785
61580 506785 517296 528587 540395 552159 564003 576833 591623 608897 628808 651521 677387
61569 677387 706876 740277 777430 817773 860717 905770 952066 997897 1040987 1079180 1110589
61558 1110589 1133239 1145310 1146166 1136868 1119437 1095872 1067983 1037653 1006712 976703 948987 924661
61546 924661 903913 885849 869522 854886 842193 830872 819860 808966 798984 790320 782285 773987
61534 773987 765236 756247 747106 737993 729401 721644 714493 707725 701766 697422 695200 695156 697191 701147 706825
61519 706825 714194 723501 735037 748965 765435 784650 806726 831797 860382 893316 931230 974440
61507 974440 1023460 1079180 1142360 1213391 1292670 1380657 1477168 1581012 1690547 1804082 1919339
61496 1919339 2033099 2141892 2242611 2331957 2405919 2460861 2495326 2510414 2508675 2493298 2468190
61485 2468190 2437962 2407379 2380936 2362807 2356561 2364610 2387990 2426670 2479796 2545739 2622149 2705865
61473 2705865 2792496 2876202 2950306 3008316 3044491 3054065 3033901 2983502 2905394 2804593 2687564
61462 2687564 2561143 2431663 2304574 2184486 2074958 1977839 1893136 1820041 1757996 1706598
61452 1706598 1664941 1631819 1606576 1589293 1580264 1579901 1589138 1609278 1641213 1685113 1740822 1807852
61440 1807852 1884531 1967117 2049586 2123943 2181303 2214247 2219526 2198999 2158078 2103464 2041944
61429 2041944 1980001 1923152 1875153 1837908 1812177 1798398 1797136 1809097 1834764 1873940 1925590
61418 1925590 1987908 2057906 2130392 2197249 2248247 2273581 2267079 2228347 2162554 2078042 1983431
61407 1983431 1885911 1790877 1701974 1621098 1548617 1483932 1426060 1374059 1327324 1285510 1248076
61396 1248076 1214112 1182955 1154807 1130322 1109674 1092523 1078863 1069282 1064177 1063154 1065517 1071049
61384 1071049 1080134 1093386 1111313 1134058 1161242 1192265 1226824 1264829 1305833 1348992 1393688
61373 1393688 1439607 1485777 1530040 1569994 1604276 1632500 1654243 1668750 1675712 1675838 1670436 1660528
61361 1660528 1646390 1627752 1604396 1576655 1545344 1511211 1474618 1435820 1395387 1354216 1313345
61350 1313345 1273887 1236844 1202579 1170557 1139938 1110450 1082553 1056843 1033591 1012825 994577
61339 994577 978895 965746 954965 946320 939683 935234 933358 934218 937477 942536 948906 956342 964821 974633
61325 974633 986278 999968 1015300 1031636 1048722 1066626 1085186 1103865 1122138 1139613 1155667
61314 1155667 1169313 1179725 1186799 1191119 1193515 1194765 1195473 1196058 1196840 1198116 1199924 1201707 1202559 1202058 1200639
61299 1200639 1198906 1196745 1193471 1188705 1182698 1175752 1167792 1158714 1148832 1138693 1128696 1119216 1110904 1104405
61285 1104405 1099736 1096329 1093853 1092754 1093819 1097435 1103438 1111464 1121173 1132187 1144104 1156616 1169467
61272 1169467 1182177 1193821 1203093 1208669 1209761 1206589 1200382 1192831 1185479 1179462 1175609 1174562 1176802
61259 1176802 1182623 1192107 1205242 1222273 1243944 1271194 1304570 1344194 1390369 1443856 1505419 1575543
61247 1575543 1654915 1744777 1846242 1959276 2082333 2211933 2341329 2459710 2554304 2614765
61237 2614765 2636378 2620167 2571543 2499234 2413840 2325149 2239874 2161970 2094638 2041262 2004414
61226 2004414 1984816 1981848 1994819 2023420 2066985 2123365 2188249 2255123 2315740 2360916 2381817
61215 2381817 2371953 2329360 2257642 2164873 2060914 1954695 1852715 1758889 1675181 1602225 1539465
61204 1539465 1485088 1436625 1392252 1351654 1315437 1283777 1255915 1230962 1208795 1189922 1174577
61193 1174577 1162132 1151304 1140763 1129613 1117537 1104626 1090926 1075988 1058925 1039119 1016844
61182 1016844 993045 968567 943895 919626 896632 875435 855832 837639 821471 808156 797556
61171 797556 788732 781247 775523 771762 769423 768192 768700 771523 775988 780657 784633 787568 788607 786296
61157 786296 779730 769286 756067 741153 725527 710131 695609 682137 669715 658468 648635 640451
61145 640451 633982 628832 624114 619149 614188 610011 606709 603355 599125 594267 589662 585819 582782 580681
61131 580681 579700 579510 579338 578886 578795 579896 582316 585719 590247 596612 605157 615343 626505 638675 652098
61116 652098 666143 679281 690162 698183 703037 704461 702709 698646 692940 685696 677292 668947 661720
61103 661720 655396 649187 643252 638597 635591 633524 631727 630176 628693 626464 622978 618832 614995 611665
61089 611665 608439 605272 602531 600187 597598 594321 590799 587967 586369 585815 585892 586562 588106 590584 593668
61074 593668 597106 601047 605696 610980 616884 623771 631931 641028 650508 660259 670311 680148 689220 698018
61060 698018 707722 718666 729992 740967 751716 762417 772848 783199 794262 806179 818007 829360
61048 829360 841532 855919 872126 888838 906030 924880 945750 967628 989737 1012604 1037303
61037 1037303 1064559 1094827 1128401 1165046 1203968 1244339 1285553 1327189 1369437 1413546 1461373
61026 1461373 1514638 1575013 1644284 1723399 1811647 1907870 2012280 2126292 2251524 2391046
61016 2391046 2551687 2743316 2975794 3258790 3604896 4030557 4553442 5192231 5971083
61007 5971083 6921964 8080624 9481613 11152130 13087973 15204046 17295463 19069815
60999 19069815 20264242 20776169 20710024 20312641 19861785 19584970 19620523 19984526 20537290
60990 20537290 20998079 21045821 20463900 19232404 17509956 15536848 13537186 11668665 10016588
60981 10016588 8608359 7433685 6464443 5668496 5015164 4476740 4030520 3659975 3352632
60972 3352632 3097002 2882214 2699577 2542931 2407535 2289477 2185866 2094625 2014036 1942914
60962 1942914 1880843 1827467 1781593 1741412 1705356 1672202 1640678 1609606 1578414 1546977 1515035
60951 1515035 1482110 1447894 1412376 1375767 1338541 1301281 1264160 1226916 1189792 1154073 1121187
60940 1121187 1091559 1064950 1041566 1022079 1006706 995019 986730 981908 980238 980568 981460 981887 981365
60927 981365 979883 977871 975942 974542 974056 975164 978616 984532 992213 1000639 1008893 1016170 1021805 1025370
60913 1025370 1026457 1024525 1019480 1012373 1004963 998393 992717 987757 983738 980805 978460 975925 972635 967982
60899 967982 960987 950899 938095 924033 910305 897927 887296 878317 870543 863460 856734 850098 843126
60886 843126 835409 826853 817541 807353 796043 783806 771484 760050 750008 741343 733844 727199 720893
60873 720893 714313 707130 699538 692049 685066 678644 672567 666592 660659 654910 649463 644124 638454 632287
60859 632287 626144 620955 617395 615634 615649 617319 620060 622728 624332 624824 624904 625072 625121 624621 623651 622807 622493
60842 622493 622339 621395 618901 614750 609199 602458 594834 587011 579704 573083 567037 561979 558678 557107 556129
60827 556129 554814 553491 552918 552927 552529 551036 548401 544732 540238 535475 530914 526350 521377 516284 511682
60812 511682 507351 502401 496645 490821 485264 479348 472747 466281 460848 456218 451642 447082 443045 439562
60798 439562 436173 432757 429654 427008 424565 422162 419939 418038 416413 414969 413566 411960 410045 408152
60784 408152 406806 406137 405717 404936 403442 401358 399258 397823 397351 397712 398880 401241 405168 410503 416660
60769 416660 423073 429363 435331 441041 446669 451961 456054 458130 458159 456799 454769 452490 450135 447744 445462
60754 445462 443771 443175 443546 444223 444959 446190 447969 449218 448711 446322 442638 437756 431439 424220 417371
60739 417371 411675 406983 403049 399972 397565 395076 391973 388533 385381 382888 381177 380146 379212 377627
60725 377627 375418 373521 372579 372080 371097 369447 367587 365732 363742 361708 360093 359210 358973 359162 359600 360042
60709 360042 360224 360137 360114 360588 361835 363806 366045 367861 368838 369253 369876 371322 373595 376198 378618 380813
60693 380813 383287 386549 390466 394273 397318 399644 401747 403991 406446 409083 411831 414527 417053 419462
60679 419462 421832 424087 426205 428462 431120 433795 435428 435073 432570 428429 423278 417598 411802 406219
60665 406219 400944 395922 391274 387379 384462 382176 379861 377279 374961 373750 374088 375761 378068 380092
60651 380092 381019 380598 379299 377770 376077 373737 370530 366924 363496 360214 356597 352496 348389 344897 342263
60636 342263 340322 338749 337216 335586 334166 333673 334600 336677 339177 341813 344939 348721 352441 355057 356287
60621 356287 356707 356822 356550 355750 354734 353920 353303 352629 351893 351343 351184 351550 352475 353602 354218 354059 353842 354384
60603 354384 355429 355995 355820 355662 356016 356433 356486 356663 357625 359104 360337 361264 362502 364140 365344 365370 364453
60586 364453 363438 362947 363164 364096 365587 367148 368143 368300 367967 367834 368414 369751 371550 373527 375678 378220
60570 378220 381359 385074 389048 392830 396232 399711 404182 410224 417466 424907 431818 438181 444292 450248
60556 450248 455948 461394 466709 471926 476925 481606 485980 490129 494262 498934 505089 513754 525654 541205
60542 541205 560791 584889 613837 647574 685717 727828 773418 821507 870100 916176 956289
60531 956289 987295 1006711 1012809 1004855 983503 950905 910320 865531 820320 777788 739614 705942
60519 705942 676292 650639 629519 613299 601801 594651 591569 592200 596040 602779 612504 625394 641449
60506 641449 660734 683682 710918 742937 780105 822688 870402 921834 974350 1024538 1068791
60495 1068791 1103902 1127586 1138692 1137182 1124386 1103376 1078509 1053996 1032881 1017389 1009680 1011607
60483 1011607 1023906 1046016 1076395 1112381 1149890 1184080 1210656 1226377 1228577 1215155 1185632
60472 1185632 1141979 1088034 1028102 965937 904497 846050 792262 744090 701656 664507 632213
60461 632213 604497 580624 559126 538779 519685 502772 488326 475679 464362 454751 447274 441609
60449 441609 437099 433522 431024 429644 429279 429866 431266 433161 435301 437737 440729 444636 449913 456816 465035
60434 465035 473980 483450 493529 503797 513300 521572 528968 535582 540521 542860 542842 541531 539695 537665
60420 537665 535900 534892 534649 534936 535917 537986 541136 545171 550448 557670 566888 577361 588572 600793
60406 600793 614579 630253 648049 668155 690296 713814 738518 765008 793806 824582 856627
60395 856627 889731 923999 958901 993055 1025006 1053889 1079258 1100582 1117155 1128515 1134986 1137868
60383 1137868 1138985 1139798 1140846 1142015 1143197 1144446 1145648 1146428 1146520 1145948 1144646 1142164 1138114 1132767 1126901
60368 1126901 1121152 1115911 1111795 1109605 1109622 1111431 1114789 1120109 1127480 1135547 1142052 1145342 1144738 1139641 1129304
60353 1129304 1113760 1094133 1071483 1045906 1017327 986658 955475 924821 895006 866525 840458
60342 840458 817656 797881 780011 763062 746954 732323 719581 708257 697399 686629 676470
60331 676470 667571 660012 653584 648395 644737 642539 641390 641053 641624 643164 645417 647898 650097 651606 652256
60316 652256 652191 651756 651345 651247 651437 651572 651466 651571 652559 654374 656199 657559 658966 661135 664014 666973 669459
60299 669459 670923 670587 667957 663388 657429 649794 639707 627307 614098 601844 591450 582950 576038
60286 576038 570400 565876 562538 560503 559726 560149 561806 564417 567165 569462 571795 575183 579788 584796 589795
60271 589795 595578 603244 613046 624510 637211 650908 665139 679187 692485 704876 716570 727955
60259 727955 739393 751015 762643 773810 783770 791762 797594 801867 805306 808078 810208 812476 816196
60246 816196 822015 829600 838739 850048 864158 880791 899204 919128 940596 963093 985622 1007681
60234 1007681 1029625 1051964 1074770 1098032 1122216 1148098 1176112 1206184 1238228 1272632 1310108
60223 1310108 1351161 1395846 1444009 1495499 1549984 1606778 1665109 1724564 1785113 1846746 1909298
60212 1909298 1972551 2036267 2100030 2163256 2225445 2286305 2345517 2402337 2455378 2502823 2543163
60201 2543163 2575960 2601839 2621567 2635357 2643285 2646149 2645575 2643441 2641556 2641652 2645113 2652536 2663866
60188 2663866 2678870 2697096 2717442 2738406 2758998 2779142 2799122 2819070 2839027 2859030 2878812
60177 2878812 2897783 2915480 2931721 2946103 2957681 2965334 2968078 2964794 2953990 2934243 2904792 2865629
60165 2865629 2817422 2761641 2700443 2635970 2569783 2503151 2437551 2374372 2314118 2256314 2200412
60154 2200412 2146694 2096227 2049993 2008103 1969883 1934723 1902754 1874566 1850291 1829155 1809878
60143 1809878 1791325 1772786 1753915 1734521 1714293 1692721 1669421 1644461 1618098 1590207 1560328
60132 1560328 1528405 1495181 1461788 1429210 1398280 1369940 1345255 1325209 1310453 1301109 1296898 1297626
60120 1297626 1303435 1314368 1329985 1349926 1374742 1405518 1442625 1485376 1532957 1584936 1640634
60109 1640634 1698732 1758002 1817882 1877874 1936796 1993149 2045794 2093704 2135424 2169443 2194968
60098 2194968 2211828 2219785 2218530 2208277 2189716 2163248 2128770 2086575 2038275 1986550 1933959 1881916
60086 1881916 1830673 1780167 1730777 1683250 1638155 1595793 1556685 1521709 1491497 1465974 1444732
60075 1444732 1427641 1414919 1406840 1403626 1405323 1411443 1420824 1432101 1444266 1456663 1468728 1479991
60063 1479991 1490194 1499080 1506195 1511095 1513611 1513708 1511113 1505236 1495403 1481151 1462464 1439780 1413569
60050 1413569 1383968 1351167 1316186 1280815 1246656 1214606 1185351 1159737 1138252 1120620 1106363
60039 1106363 1095455 1088124 1084467 1084763 1089755 1100019 1115334 1135217 1159814 1189654 1224619 1263833
60027 1263833 1306615 1352999 1403114 1456235 1510392 1562625 1609680 1648826 1678142 1696145 1701571
60016 1701571 1693898 1673898 1643414 1604797 1560694 1513858 1466504 1419923 1375028 1332931 1294551
60005 1294551 1259967 1228791 1201043 1177162 1157267 1140953 1127765 1117440 1109800 1104824 1102775 1103892
59993 1103892 1108188 1115959 1128165 1145704 1168475 1195706 1226967 1262155 1300611 1341035 1382278 1423532
59981 1423532 1463742 1501576 1536154 1567256 1594783 1618653 1639206 1656873 1671225 1681025 1685487 1684787
59969 1684787 1679119 1668105 1651667 1630841 1607095 1581222 1553452 1524373 1495279 1467798 1443489
59958 1443489 1423507 1408284 1397792 1392319 1392684 1399410 1412039 1429704 1452076 1479302 1511172 1546811
59946 1546811 1585148 1625383 1666924 1709146 1751385 1793224 1834825 1876821 1919604 1962738 2005346
59935 2005346 2047031 2087920 2127710 2165088 2198402 2226647 2249641 2267685 2281463 2292164 2301340
59924 2301340 2310623 2321559 2335509 2353570 2376684 2405798 2441671 2484475 2533799 2588845 2648139
59913 2648139 2709032 2768088 2822153 2868714 2905333 2929597 2940000 2936276 2918560 2887057 2843174
59902 2843174 2790329 2732746 2673626 2614996 2558759 2506853 2460485 2420129 2386368 2359942 2340742
59891 2340742 2327534 2319177 2315748 2318186 2327206 2342838 2364723 2392437 2425658 2464362 2508985 2560401
59879 2560401 2619771 2688353 2767276 2857371 2959201 3073003 3198345 3333805 3477033 3624864
59869 3624864 3772894 3914822 4042438 4146367 4217032 4245995 4228166 4164063 4060105 3926392
59859 3926392 3773916 3613259 3454273 3305132 3170887 3053309 2952532 2868646 2801672 2750670
59849 2750670 2713790 2689342 2676489 2674850 2684001 2703670 2733919 2774530 2824299 2881579 2945758 3018011
59837 3018011 3100613 3195969 3306475 3434641 3582529 3750834 3938823 4145045 4367512 4602576
59827 4602576 4843495 5080088 5299928 5490461 5641278 5745935 5802815 5814907 5788790 5733221
59817 5733221 5657323 5568656 5472010 5369588 5261930 5148345 5026788 4894523 4750058 4594698
59807 4594698 4432041 4266090 4100077 3936622 3777957 3625438 3479222 3338899 3204457
59798 3204457 3076626 2956598 2845521 2743861 2650999 2565771 2487636 2417070 2354697 2300499
59788 2300499 2254184 2215827 2185658 2163666 2150053 2145749 2151713 2167844 2193163 2226981 2269125 2319074
59776 2319074 2375629 2437620 2504270 2574696 2647696 2722357 2798107 2873455 2944813 3006813 3053613
59765 3053613 3079916 3081803 3057939 3010592 2945326 2869404 2790035 2713315 2643790 2584342 2536161
59754 2536161 2498842 2470815 2450154 2435218 2424548 2416450 2409094 2401039 2391359 2379307 2364341 2346590
59742 2346590 2326852 2305970 2284532 2263308 2243534 2226385 2212363 2201363 2193130 2187448 2184226 2183708
59730 2183708 2186430 2192803 2202832 2216402 2233666 2255115 2281558 2314166 2354266 2402836 2460267 2526599
59718 2526599 2601678 2685008 2775703 2872575 2973921 3077202 3179529 3278759 3373866 3464262 3549436
59707 3549436 3629597 3706033 3780197 3852689 3923500 3992738 4060360 4125295 4185547 4239410 4286414
59696 4286414 4327169 4362595 4393203 4418790 4438748 4452809 4461474 4465625 4465995 4463193 4458024 4451496 4444681
59683 4444681 4438919 4436071 4438296 4447669 4466120 4495464 4536978 4590932 4656827 4734189 4823019 4923460
59671 4923460 5035154 5156856 5286491 5421337 5557862 5691251 5815415 5924096 6012150 6075621
59661 6075621 6110936 6114936 6086009 6024727 5933226 5814671 5673671 5516341 5349080 5177497
59651 5177497 5006852 4842688 4689840 4550746 4425336 4312393 4210137 4115402 4023093 3927037
59641 3927037 3821506 3702441 3568282 3420288 3262017 3098279 2934288 2775025 2624397
59632 2624397 2484698 2357126 2242695 2142170 2055282 1980803 1917798 1866362 1826815 1798498
59622 1798498 1779769 1769010 1765200 1767400 1773894 1782065 1789196 1793365 1793535 1789092 1779762 1766089 1749577
59609 1749577 1732002 1714729 1698704 1684549 1672201 1660832 1649628 1638576 1628095 1618286 1609088 1601036
59597 1601036 1595177 1592161 1591824 1593637 1596996 1600924 1603867 1603981 1599563 1589455 1573589 1553152 1529856
59584 1529856 1504980 1479385 1454222 1430950 1410548 1393208 1378988 1368280 1361441 1358392 1358903 1362938
59572 1362938 1370392 1380706 1393095 1407105 1422787 1440377 1459980 1481564 1505252 1531590 1561395
59561 1561395 1595178 1632732 1673436 1716831 1762697 1810673 1860031 1909824 1959157 2007497 2055037
59550 2055037 2102672 2151311 2201191 2252113 2304280 2358610 2415980 2476020 2536283 2592481 2640014
59539 2640014 2676008 2700174 2713763 2717909 2712989 2698964 2675789 2643733 2603825 2557859 2507539 2453653
59527 2453653 2396342 2335818 2272441 2206516 2138721 2070514 2003525 1938755 1877009 1819737 1768450
59516 1768450 1723387 1683703 1649138 1620650 1599328 1585536 1579354 1580890 1589725 1604896 1625945 1653371
59504 1653371 1687590 1728023 1773578 1823320 1876028 1929623 1981634 2029861 2072101 2105833 2128886
59493 2128886 2140252 2139878 2128080 2105705 2074362 2035728 1990846 1940747 1887564 1834297 1783424 1736214
59481 1736214 1693235 1654848 1621230 1592499 1569068 1551453 1539685 1533316 1532122 1536319 1545890 1560091
59469 1560091 1577917 1598742 1622155 1647349 1673094 1698255 1721989 1743270 1760585 1772463 1778193
59458 1778193 1777633 1770290 1755105 1731448 1700088 1662839 1621425 1577087 1531039 1484713 1439416 1396093
59446 1396093 1355441 1317871 1283283 1251316 1221905 1195277 1171343 1149557 1129477 1110996 1093833
59435 1093833 1077309 1060980 1045184 1030695 1018119 1007793 999878 994276 990791 989708 991849 997747
59423 997747 1007040 1019095 1034002 1052512 1074960 1100280 1125786 1147786 1163039 1170498 1172025 1171333
59411 1171333 1172093 1176689 1186047 1200195 1219111 1243068 1271646 1302156 1329780 1350212 1362314 1368004
59399 1368004 1370071 1370796 1372238 1376497 1384968 1397814 1414644 1435485 1460711 1490336 1523896 1561090
59387 1561090 1602145 1647364 1696554 1749182 1805119 1864983 1929625 1999315 2073468 2150859 2229758
59376 2229758 2307786 2381895 2448703 2504988 2548174 2576928 2591734 2595061 2590892 2583824 2578094 2576973
59364 2576973 2582821 2597567 2622856 2659687 2708309 2768677 2840496 2922381 3011406 3104129 3197889
59353 3197889 3290557 3379516 3461842 3535508 3599637 3653699 3697385 3731212 3756007 3771410 3775912
59342 3775912 3768787 3750863 3722688 3683027 3630263 3564599 3487828 3401544 3306815 3205468 3100557
59331 3100557 2995367 2892635 2794712 2703593 2620340 2544751 2475535 2410457 2346413 2280183 2209644
59320 2209644 2134459 2055788 1975510 1895519 1817387 1742689 1673468 1611870 1559030 1514732 1478484
59309 1478484 1450445 1430941 1419702 1416138 1419662 1428729 1439869 1448862 1453322 1453855 1452969 1453418 1457333 1465801
59295 1465801 1478714 1495188 1514182 1534455 1554304 1572053 1586926 1598991 1608326 1614782 1618628 1620948
59283 1620948 1623358 1627681 1635727 1648840 1667583 1692103 1722514 1758319 1797639 1837743 1876353 1911920
59271 1911920 1942821 1967115 1983246 1990364 1987935 1975729 1954283 1924648 1887479 1843059 1792399 1737652
59259 1737652 1681122 1624478 1569103 1516427 1467324 1421700 1379204 1340014 1304565 1272915 1244807
59248 1244807 1220014 1198162 1178523 1160492 1144158 1130026 1118250 1108419 1099937 1092367 1085470 1079200
59236 1079200 1073642 1068794 1064484 1060556 1057107 1054494 1053082 1052871 1053214 1053148 1052375 1051845 1052990 1056402 1061610
59221 1061610 1068100 1076055 1085974 1098095 1112446 1129227 1148950 1172391 1200394 1233425 1271367 1314104
59209 1314104 1362242 1416785 1478152 1546059 1620368 1701290 1788445 1880237 1974428 2068818 2161043
59198 2161043 2248250 2327466 2396105 2451945 2493122 2518574 2528209 2522427 2501806 2467424 2421004 2364446
59186 2364446 2299613 2228754 2154475 2078881 2003338 1929587 1860414 1798420 1744530 1698478 1660378
59175 1660378 1630990 1610713 1599338 1596914 1603988 1620771 1646778 1681630 1725614 1779065 1841578 1912084
59163 1912084 1989171 2070734 2153392 2232653 2303694 2361989 2403610 2425628 2426600 2406855 2368415 2314761
59151 2314761 2250473 2180580 2109671 2041278 1977885 1921347 1873028 1833395 1801810 1777148 1758779
59140 1758779 1746778 1741227 1741783 1748136 1760562 1779661 1805609 1837830 1875161 1916056 1958880 2002386
59128 2002386 2045887 2088606 2128939 2164710 2194163 2216392 2230854 2237030 2234951 2225773 2211308 2192838
59116 2192838 2170562 2144240 2114143 2081188 2046255 2009675 1971612 1932880 1895146 1860205 1829130
59105 1829130 1802155 1779129 1759820 1743776 1730245 1718460 1707893 1697992 1687716 1675677 1661014
59094 1661014 1644093 1626185 1608576 1592158 1577660 1565748 1556696 1550367 1546756 1546318 1549479 1556069 1565494
59081 1565494 1577179 1590484 1604473 1618282 1631548 1643925 1654238 1660782 1662589 1659858 1653029 1642019
59069 1642019 1626714 1607662 1585771 1561649 1535723 1508850 1482304 1457174 1434123 1413749 1396882
59058 1396882 1384307 1376205 1371851 1369801 1368470 1366668 1363653 1358804 1351459 1341071 1327341 1310226 1290049
59045 1290049 1267666 1244254 1220825 1198039 1176418 1156404 1138122 1121504 1106830 1094789 1085720
59034 1085720 1079068 1073886 1069648 1066218 1063201 1059839 1055720 1051354 1047911 1046306 1046514 1047755 1049418 1051789
59020 1051789 1055712 1061599 1069057 1077534 1086998 1097808 1110240 1124354 1140044 1156941 1174483 1192384
59008 1192384 1210888 1230293 1250387 1270717 1291328 1312924 1336263 1361694 1389314 1419439 1452908
58997 1452908 1491074 1535407 1586891 1645797 1712225 1786792 1870567 1964409 2068616 2183175 2307829
58986 2307829 2441444 2581309 2723214 2862140 2992615 3108553 3203426 3271383 3308714 3314435
58976 3314435 3289842 3237881 3162803 3069590 2962998 2847028 2725321 2601616 2479345 2361025
58966 2361025 2248507 2143707 2048534 1964112 1890532 1827375 1773957 1729085 1691274 1659529 1633468
58955 1633468 1612430 1594935 1579385 1564913 1551181 1537757 1524228 1510758 1498070 1486906 1477816
58944 1477816 1471393 1468359 1469242 1474050 1482269 1493191 1506359 1521725 1539364 1559181 1581174 1605819
58932 1605819 1633829 1665665 1701784 1743340 1792014 1849066 1915129 1991009 2077824 2175876 2283963
58921 2283963 2399986 2521100 2642325 2755615 2851515 2922133 2962737 2972004 2952401 2910194 2853548
58910 2853548 2789839 2724969 2664566 2614147 2577386 2555158 2546980 2552750 2572564 2605586 2650151 2704924
58898 2704924 2769388 2843340 2926540 3018911 3120687 3232246 3353865 3485276 3624714 3767953
58888 3767953 3908356 4038118 4149877 4237847 4298409 4330424 4335343 4316945 4280480 4231228 4173075
58877 4173075 4108062 4037095 3960843 3879942 3794692 3705195 3611987 3516269 3419371 3322270 3225842
58866 3225842 3131261 3039566 2950721 2863507 2776600 2689660 2603216 2517796 2433459 2350065 2267657
58855 2267657 2186522 2107145 2030210 1956576 1887080 1822316 1762439 1707189 1656201 1609432 1567092
58844 1567092 1529011 1494325 1462118 1432275 1405453 1382208 1362387 1345306 1330356 1317510 1307370
58833 1307370 1300506 1296617 1294722 1294517 1297066 1303601 1314114 1328011 1345807 1368923 1397668 1430608 1466421
58820 1466421 1505227 1547254 1590972 1633628 1673185 1708684 1738932 1761938 1776007 1780803 1777154 1766492
58808 1766492 1750881 1733174 1716438 1702931 1693641 1688874 1689216 1695796 1709601 1730799 1759022 1794106
58796 1794106 1836140 1884845 1939455 1999382 2064519 2134655 2208974 2286373 2365854 2446367 2526589
58785 2526589 2605107 2680369 2750203 2811860 2862985 2902323 2929196 2942680 2941660 2925470 2894148
58774 2894148 2848456 2790067 2721470 2645295 2563829 2479266 2393924 2309792 2228234 2150427 2077551
58763 2077551 2010025 1947082 1887791 1832254 1781166 1734493 1691283 1650647 1612263 1575905 1541155
58752 1541155 1507733 1475804 1445965 1419173 1396494 1378400 1364307 1353091 1343965 1336657 1331104 1327507
58740 1327507 1326503 1328701 1334061 1342071 1352368 1364796 1379157 1395598 1415274 1440128 1471982 1512224
58728 1512224 1562238 1623452 1696676 1781533 1876366 1978008 2081203 2178430 2260828 2320013 2350002
58717 2350002 2348408 2316407 2257905 2178727 2085876 1986154 1884547 1783983 1686737 1595549 1512984
58706 1512984 1440317 1377594 1324483 1280696 1246164 1221464 1207771 1205795 1215051 1234602 1263980 1302761
58694 1302761 1349608 1402278 1457859 1511966 1558089 1589005 1599265 1586290 1550090 1493374 1421743
58683 1421743 1342215 1260757 1181483 1107707 1042334 986735 940254 901515 869740 844447 824563
58672 824563 808503 794930 783103 772667 763362 754896 746939 739207 731397 723019 713605 703260 692574
58659 692574 681709 670148 657786 645761 635522 627448 620975 615640 611301 607762 604972 603245 602591
58646 602591 602258 601734 601723 603159 605779 608741 612182 616839 622405 627722 632592 638019 644578 651801 659313
58631 659313 667194 674935 681303 685671 688388 689499 688289 684585 679434 673970 668576 663595 659783 657405
58617 657405 655791 654408 653634 653989 655340 657359 659994 663101 666366 669955 674421 679601 684545 688985 693938
58602 693938 700412 708455 717998 729650 743983 760896 780373 803034 829172 857937 888175 919405
58590 919405 951362 983260 1014158 1043388 1069996 1092408 1109309 1120265 1125100 1123530 1116119 1104761
58578 1104761 1091345 1076468 1060218 1043581 1028197 1015076 1004228 995200 987436 980514 974489 969559
58566 969559 965075 959612 952544 944915 938158 932588 927626 922709 917267 910487 901863 891538 879630 865859
58552 865859 850314 833737 816481 798090 778635 759455 741672 724852 708239 692495 678974
58541 678974 667854 658235 649708 642548 636529 630711 624471 617869 611000 603736 596106 588414 581058 574595
58527 574595 569632 566182 563492 561030 559163 558398 558569 559388 561183 564331 568514 573350 579246 586782 595644
58512 595644 604948 614217 623347 632124 640593 649500 659579 670802 683041 696952 713409 732543 754132
58499 754132 778387 805422 834399 864068 893638 922142 947437 966954 979305 984414 982616 974623
58487 974623 961921 946081 927816 907510 886193 864955 843864 822573 801683 782367 765004
58476 765004 749370 735920 725520 717886 711513 705290 699175 693261 687396 682017 678369 677346 678640
58463 678640 681152 683714 685341 685326 683195 678359 670167 658839 645972 633483 622316 612611 604426 597541
58449 597541 591246 585413 581290 580090 581148 582536 583204 583381 583214 582296 580530 578324 575935 573541 571848
58434 571848 571618 572700 574483 577118 581180 586218 590789 593973 595879 596732 596615 596176 596462 597727 599261
58419 599261 600601 602140 604397 607413 610998 615047 619625 625223 632614 641789 651443 660314 668662 677547
58405 677547 687090 696533 705638 714779 723788 731844 738595 744460 749900 755178 760618 766241 771395 775655
58391 775655 779667 784164 788628 792105 794876 798012 801607 804808 807446 810286 813745 817488 821185 824544
58377 824544 826906 827967 828629 829979 831851 833653 835975 839736 844189 847592 849731 852049 855360 859222
58363 859222 863544 868970 875402 881834 887944 894361 901219 907990 914943 923111 932553 942181 951592 961574
58349 961574 972498 983683 994584 1005225 1015293 1024294 1032719 1041515 1050283 1057639 1063611 1069986 1077942
58336 1077942 1086898 1096031 1105374 1115095 1125186 1136170 1148671 1162142 1175526 1189283 1205149 1223738
58324 1223738 1244038 1265373 1288130 1312449 1337987 1365153 1394802 1426560 1459306 1493271 1529636
58313 1529636 1567974 1606290 1643700 1680757 1716767 1749135 1775866 1796567 1810733 1817694 1818931 1817907
58301 1817907 1816704 1814959 1812711 1811805 1813644 1818026 1825148 1836296 1851475 1868715 1886926 1907266 1930674
58288 1930674 1956203 1982879 2010977 2040476 2070422 2100910 2133533 2168911 2205856 2243766 2283467
58277 2283467 2324869 2366217 2406556 2446507 2485976 2523930 2561302 2601137 2644718 2690352 2736893
58266 2736893 2785305 2835682 2886203 2936471 2988580 3043321 3098676 3153684 3210337 3269906 3331008
58255 3331008 3393269 3459340 3531140 3607611 3688266 3775203 3869201 3967621 4068906 4175584 4290069
58244 4290069 4411069 4536958 4669131 4809028 4955375 5107391 5267307 5436814 5614555
58235 5614555 5800007 5996095 6205035 6425556 6657233 6903308 7166076 7444066 7737303
58226 7737303 8050577 8387674 8747315 9129092 9538486 9981555 10459631 10974069 11531241
58217 11531241 12138033 12797658 13515047 14301048 15166224 16116208 17158153 18305286 19570137
58208 19570137 20961857 22497911 24211672 26142850 28330951 30827808 33708350 37062172
58200 37062172 40989468 45621667 51140223 57768646 65766192 75451814 87225200 101548850
58192 101548850 118925452 139904436 165049379 194766447 229000863 266880664 306354691
58185 306354691 343946400 374980555 394624752 399512024 389042437 365515252 333080696
58178 333080696 296275367 258922968 223663032 191956968 164344249 140776831 120902582
58171 120902582 104240856 90282847 78561886 68689598 60348014 53268633 47229142
58164 47229142 42054847 37604911 33757632 30412381 27493836 24941655 22699310 20718403
58156 20718403 18965516 17415133 16039881 14813960 13720116 12745260 11873250 11088483
58148 11088483 10382335 9749231 9179487 8661622 8188257 7754100 7351416 6973155 6617992
58139 6617992 6287315 5979664 5692479 5426274 5182102 4957104 4746986 4550801 4369184
58130 4369184 4200086 4040384 3889673 3748518 3614836 3485886 3362113 3245390 3135031
58121 3135031 3028972 2927324 2831369 2740512 2653358 2570413 2492742 2419363 2348808 2281816 2219733
58110 2219733 2161782 2106660 2055272 2009007 1966715 1926169 1887284 1851296 1818038 1786532 1756914
58099 1756914 1729207 1701464 1671622 1640010 1607813 1574714 1540645 1508290 1480956 1458980 1440738
58088 1440738 1425871 1414768 1406058 1397559 1388918 1380664 1371476 1359100 1343453 1326315 1308505 1289714
58076 1289714 1270471 1251778 1233198 1213624 1193486 1173990 1154683 1134073 1112291 1090844 1069929
58065 1069929 1048205 1025163 1001777 978891 956743 935927 917029 899401 881823 864170 847032
58054 847032 830183 813057 796264 780979 767211 754228 742191 731742 722474 713500 705100 698174
58042 698174 692521 687300 682636 678991 675479 670747 665207 660465 656800 653147 649449 647009 646220 645658 643794
58027 643794 640305 635611 630446 625940 622887 620889 619219 618245 618800 620571 622496 624443 627135 630703 634741
58012 634741 639574 646047 654235 663665 674505 687171 701131 715528 730653 747387 765644 785027
58000 785027 806580 832015 861320 892887 925878 960698 997311 1035167 1075100 1119427 1169776
57989 1169776 1226472 1290371 1363432 1446835 1540124 1642816 1755342 1877553 2007539 2142704
57979 2142704 2280923 2419887 2556205 2685761 2804237 2906926 2988889 3045681 3073324 3067646
57969 3067646 3025085 2945057 2831347 2691240 2533819 2368479 2203302 2043866 1893761 1755796
57959 1755796 1631806 1521737 1424412 1339347 1266724 1205671 1153999 1109892 1072717 1042014 1016937
57948 1016937 996884 981466 969630 960043 952571 948093 946613 946793 947632 949251 951658 954192 956777 960514
57934 960514 966342 974188 983951 996185 1011262 1029032 1049990 1075788 1107943 1146985 1193355 1247994
57922 1247994 1311346 1382659 1460741 1544095 1629336 1710417 1780351 1833218 1864298 1869977 1849137
57911 1849137 1804259 1740141 1661848 1574358 1483065 1393056 1307727 1228608 1156145 1090092 1029656
57900 1029656 974144 923495 877897 837264 801392 770140 743110 719637 699391 682334 667707
57889 667707 653858 639716 625838 613357 602464 592514 583089 574225 566037 558831 553277 549799 547943
57876 547943 546780 545666 544307 542602 540936 540148 540660 541896 543046 544011 545088 546189 547009 547632 548236 548353
57860 548353 547075 544045 539801 535141 530478 525751 520546 514248 506395 497088 487090 477520 469357 462985
57846 462985 458187 454630 452236 450930 450399 450596 452213 455988 461550 467560 473001 477776 482092 485995 489587
57831 489587 492999 496037 498491 500827 503871 507733 511894 516455 522360 530106 539144 548872 559241 569897
57817 569897 579702 587856 594860 601902 609989 620184 633749 651254 672197 696199 724036 756907
57805 756907 795416 840013 891647 950992 1017562 1090563 1170049 1256021 1346322 1436230 1519938
57794 1519938 1591564 1645059 1674764 1677291 1653037 1605860 1541451 1465709 1383843 1300205 1218345
57783 1218345 1140776 1068699 1002440 942288 888528 840626 797239 757459 721499 689767 661961
57772 661961 637599 616728 599312 584447 571115 559382 549975 542843 537012 531837 527604 524760 523132
57759 523132 522139 521344 520673 520379 520793 521854 522928 523320 522914 522121 521393 520976 520967 521325 521969 522947 524284 525737
57741 525737 527187 529349 533385 539529 546847 554765 564014 575412 588454 601953 615371 628368 639404
57728 639404 646146 647418 643889 636748 626627 613999 599724 584660 569283 554112 540089 528051
57716 528051 517994 509195 501012 493409 486816 481623 477860 475334 473965 473838 474992 477321 480593 484205
57702 484205 487058 488294 488313 488439 489310 490147 489987 488982 487997 487465 487383 488011 489882 493194 497741 503323 509860
57685 509860 517324 525948 536241 548494 562688 579282 599546 624533 654193 688213 727385 773553
57673 773553 828660 894617 973621 1067463 1176228 1297733 1427069 1555100 1667729 1749036
57663 1749036 1787584 1781076 1736155 1664663 1579308 1490349 1403993 1322934 1248158 1180126 1118786
57652 1118786 1063521 1013634 968673 928129 891306 857687 827139 799641 775016 752928 732978
57641 732978 714865 698707 684998 673884 664801 657227 651465 647989 646287 645137 644005 643357 643557 644276
57627 644276 645187 646493 648397 650730 653472 657143 662133 668030 674039 679909 686143 693487 702445 713158
57613 713158 725455 739055 753871 770115 788088 807857 829089 851206 873770 896670 919607
57602 919607 941461 960616 976088 987863 995954 999756 998721 993057 983220 969392 952198 933325
57590 933325 914404 895585 876112 856103 836785 819101 803036 788266 774552 761494 748823
57579 748823 737067 727176 719399 713291 708689 705708 703806 701971 700050 698791 698302 697604 696167 694788
57565 694788 694260 694135 693608 692944 693169 694758 697283 700066 702708 705323 708617 713359 719485 726088 732500
57550 732500 738854 745427 752187 759316 767319 776088 784508 791575 797289 801925 805200 806873 807521 807901 808017
57535 808017 807657 807414 808302 810577 813702 817316 821589 826826 833406 841830 852115 863281 874303 885579
57521 885579 898688 914510 932115 949655 965962 981245 996767 1013998 1033628 1055160 1077534
57510 1077534 1100063 1122438 1144011 1163663 1180512 1194417 1205563 1213864 1218930 1220448 1218416 1213151
57498 1213151 1205185 1195151 1183664 1171263 1158386 1145427 1132897 1121451 1111618 1103475 1096810 1091600
57486 1091600 1088114 1086506 1086523 1087629 1089241 1090974 1092996 1096049 1100682 1106456 1112360 1117924 1123280 1128176
57472 1128176 1131876 1134445 1137299 1141852 1148108 1155165 1162622 1170853 1180331 1191322 1203994 1218164 1233115
57459 1233115 1248223 1263666 1280097 1297849 1316883 1337176 1358580 1380529 1402570 1425027 1448519
57448 1448519 1472815 1496762 1519304 1539987 1558420 1573877 1585688 1593685 1598116 1599382 1597986 1594461
57436 1594461 1589278 1582969 1576263 1569777 1563600 1557488 1551485 1546171 1542274 1540165 1539681 1540298 1541598 1543661
57422 1543661 1546851 1551106 1555804 1560499 1565461 1571195 1577812 1585235 1593611 1602970 1612779 1622370 1631683 1641100
57408 1641100 1650729 1660357 1669961 1679735 1689768 1700188 1711444 1723827 1736798 1749391 1761287 1772994
57396 1772994 1785040 1797554 1810560 1823938 1837044 1849125 1860395 1872136 1885385 1899933 1914878
57385 1914878 1929752 1944801 1960487 1977005 1994120 2011379 2028641 2046345 2064934 2084059 2102874
57374 2102874 2121124 2139380 2158063 2176829 2195251 2213520 2231974 2250329 2267985 2284946 2301922
57363 2301922 2319541 2337813 2356478 2375542 2395274 2415727 2436450 2456734 2476138 2494692 2512711
57352 2512711 2530667 2549243 2569087 2590143 2611483 2632200 2652293 2672299 2692395 2712492 2733039
57341 2733039 2754832 2777835 2800917 2823100 2844557 2866074 2888131 2910893 2934459 2958484 2981992
57330 2981992 3004340 3026190 3048862 3072797 3097290 3121674 3146050 3170667 3195269 3219490 3243445
57319 3243445 3267432 3291338 3314824 3337987 3361383 3385445 3410260 3435900 3462416 3489355 3515806
57308 3515806 3541355 3566614 3592316 3618188 3643379 3667941 3693112 3719943 3748229 3777164 3806447
57297 3806447 3836228 3866313 3896146 3925512 3954785 3984442 4014641 4045283 4076152 4107004 4137779
57286 4137779 4168687 4199828 4230810 4261081 4290582 4319689 4348449 4376287 4402678 4427864 4452610
57275 4452610 4477349 4501723 4525068 4547305 4569258 4591947 4615603 4639560 4663139 4686340 4709529
57264 4709529 4732841 4756170 4779483 4802790 4825998 4849180 4872815 4897377 4922716 4948153 4973069
57253 4973069 4997131 5020137 5042146 5063800 5086105 5109737 5134614 5160052 5185163 5209380 5232896
57242 5232896 5256455 5280434 5304399 5327946 5351533 5375836 5400472 5424088 5445764 5465699 5484513
57231 5484513 5502572 5520098 5537267 5553882 5569443 5583860 5597662 5611268 5624429 5636645 5647721
57220 5647721 5657715 5666742 5675161 5683614 5692544 5701888 5711489 5721563 5732514 5744427 5756955 5769600 5782009
57207 5782009 5794203 5806593 5819628 5833361 5847493 5861774 5876128 5890469 5904727 5918934 5932906
57196 5932906 5945915 5957204 5966790 5975249 5982664 5988476 5992522 5995550 5998317 6000679 6001952 6001807 6000408 5998103
57182 5998103 5995335 5992471 5989274 5984852 5978546 5970694 5962129 5953159 5943394 5932449 5920361 5907370 5893649
57169 5893649 5879276 5864266 5848489 5831591 5813038 5792340 5769411 5744613 5718208 5689846 5658977
57158 5658977 5625701 5590779 5554731 5517467 5478944 5439627 5399996 5360069 5319804 5279648 5240336
57147 5240336 5202473 5166673 5133799 5104579 5079057 5056705 5037006 5019778 5005151 4993385 4984484
57136 4984484 4977740 4971807 4965344 4957366 4947030 4933548 4916595 4896472 4873634 4848385 4821310 4793629
57124 4793629 4766787 4741899 4719658 4700366 4683783 4669411 4657334 4648536 4644113 4644455 4649516 4659519
57112 4659519 4675131 4697401 4728043 4769711 4825644 4899166 4993654 5112734 5260403 5441484 5662506
57101 5662506 5932352 6262442 6667186 7164768 7777297 8530222 9451998 10573906 11928382
57092 11928382 13545565 15449799 17656952 20171428 22982994 26065702 29379185 32869571
57084 32869571 36469211 40098033 43666563 47075206 50208216 52931913 55107888 56617833
57076 56617833 57384596 57379368 56618148 55154621 53071534 50470816 47465332 44174143 40718123
57067 40718123 37212437 33757734 30434563 27302072 24399006 21746029 19349495 17205405
57059 17205405 15301970 13621415 12142706 10844644 9707407 8712447 7842351 7081260
57051 7081260 6414997 5830756 5317146 4864485 4464616 4110409 3795874 3516594 3269351
57042 3269351 3051074 2858492 2688758 2539810 2409945 2297641 2202161 2123921 2064032 2023928
57032 2023928 2005454 2009466 2031771 2059513 2073292 2055590 1999276 1909450 1798374 1678885 1560747
57021 1560747 1449960 1349319 1259481 1180248 1111160 1051114 998211 950663 907710 869256 834913
57010 834913 803942 775987 751264 729941 711693 695866 681805 669072 657663 647904 639781 632504
56998 632504 625131 617606 610745 605247 601112 597968 595437 593045 590297 587200 584558 583576 585169 589520
56984 589520 596064 603860 612057 619727 625113 625595 619172 605992 587974 567113 544766 522289 501243
56971 501243 482532 466081 451771 440107 431507 425543 421541 419581 420339 424206 431170 441398 455331
56958 455331 473096 494155 517384 540891 561636 575907 580850 575817 562329 542965 520441 497330
56946 497330 475862 457418 442274 430110 420755 414263 410500 409196 410426 414550 421560 431087 443392
56933 443392 459752 481347 508026 538387 570207 600039 623073 634898 633853 621308 600020 573039
56921 573039 543808 515663 490445 468170 448374 431086 416250 403074 390590 378377 366384
56910 366384 354676 343747 334462 327111 321039 315653 311260 308407 306949 306452 307064 309287 313138 318170
56896 318170 324084 330734 337766 344882 352288 360329 368775 377110 385491 394899 406216 419380 433213
56883 433213 445599 453952 456176 451607 441047 426122 408806 391232 375242 361844 351206 343096
56871 343096 337195 333307 331688 333111 338248 347129 359513 375642 396217 421804 452594 488482 528562
56858 528562 570216 609045 640012 658896 663339 653525 632230 603799 572528 541672 513455 489334
56846 489334 470048 455849 446975 443810 446560 455078 469152 488832 514529 547063 587644 637342
56834 637342 696160 762365 832282 900026 957378 995094 1006154 989079 948634 893284 831518
56823 831518 769623 711575 659824 615742 579698 551307 529980 515326 507232 505845 511536 524706
56811 524706 545581 574294 611081 655923 707663 763396 818492 866911 901800 917153 910365 883745
56799 883745 843351 796037 747137 699990 656528 617850 584541 556817 534530 517223 504444
56788 504444 496059 492152 492695 497526 506678 520471 539145 562355 588831 616213 641103 659587 668229
56775 668229 665144 650636 627114 598246 567728 538320 511539 487824 466887 448133 431127 415810
56763 415810 402345 390769 380760 371590 362341 352409 341906 331455 321535 312156 303136 294380 285789
56750 285789 277248 268978 261604 255543 250415 245461 240483 236058 232693 230022 227048 223144 218683 214656
56736 214656 211732 209797 208367 207202 206369 205909 205742 205905 206542 207661 209126 210914 213111 215591 217961
56721 217961 219821 220934 221162 220573 219572 218566 217567 216460 215598 215625 216658 218220 220020 222160 224455 226285
56705 226285 227520 228924 231191 234128 237303 240977 245781 251828 258783 266570 275479 285811 297862 312013
56691 312013 328360 346544 366314 387895 411273 435457 459010 480991 500788 517458 530122
56680 530122 538858 544494 547672 548884 549229 550137 552121 554593 557134 560208 564313 569134 573970 578570 583128
56665 583128 587892 593081 598851 604913 610399 614418 616649 617234 616256 613527 608788 602001 593503 583841 573381
56650 573381 562090 549839 536816 523470 510226 497543 486078 476387 468436 461643 455339 448999
56638 448999 442267 435176 428212 421771 415632 409393 403310 398236 394862 393499 394472 398054 403921 411293
56624 411293 419671 428827 437925 445447 450419 453190 454589 454759 453331 450326 446245 441446 435979 430065
56610 430065 424207 418687 413244 407376 400820 393628 386067 378702 372473 368278 366277 365777 366058 367206 369884
56595 369884 374415 380469 387556 395314 403293 410988 418289 425282 431442 435786 438271 440349 443384 447092
56581 447092 450289 452666 454899 457383 459971 462818 466391 470495 474297 477512 480730 484249 487479 489847
56567 489847 491555 493031 494307 495458 497046 499570 502799 506072 508920 511105 512412 512819 512586 511861 510461
56552 510461 508232 505212 501153 495298 487054 476676 464924 452253 438630 424008 408630 392874
56540 392874 377043 361319 345870 330977 316991 304071 292121 281109 271202 262337 253966 245713
56528 245713 238059 231816 227070 223213 219871 217047 214356 211023 206919 202924 199864 197658 195801 194136
56514 194136 192770 191650 190596 189436 187922 185926 183878 182533 182073 181903 181552 181207 181092 180920 180409 179850
56498 179850 179687 179864 180007 179992 179975 180103 180466 181047 181473 181190 180234 179531 180123 182267 185407 188666 191201 192572
56480 192572 193114 193665 194614 195476 195572 194841 193796 193073 193201 194376 196117 197448 197706 196942 195504 193706 192064
56463 192064 191282 191599 192483 193260 193729 193977 193992 193797 193570 193404 193249 193236 193664 194479 195274 196050 197500 200185 203741
56444 203741 207159 209561 210629 210744 210857 211736 213205 214469 215148 215374 214942 213336 210800 208479 207063 206066
56428 206066 204825 203419 202152 200968 199868 199130 198531 197193 194832 192400 190783 189667 188508 187812 188472
56413 188472 190345 192498 194429 196178 197628 198590 199309 200062 200523 200272 199672 199476 199834 200320 200691 200953 201069
56396 201069 201234 202075 203839 205731 206826 207273 207933 209154 210700 212448 214263 215497 215601 215072 214932 215418
56380 215418 215982 216381 216812 217077 216588 215363 214273 214108 214926 216277 217496 217930 217506 217072 217633 219322 221579
56363 221579 224050 226665 229088 230904 232265 233659 235090 236123 236667 237110 237729 238504 239380 240261 240939 241541
56347 241541 242705 244741 246984 248625 249830 251337 253374 255779 258765 262550 266501 269612 271683 273173
56333 273173 274141 274349 274213 274567 275499 276464 277516 279382 282213 285286 288090 290747 293160 294753 295436 296062
56317 296062 297513 299880 302768 305886 309199 312904 317297 322266 327159 331664 336480 342430 349234 355957
56303 355957 362287 368476 374398 379751 384934 390471 395707 399370 401407 403027 404885 406593 408172 410508
56289 410508 413818 417024 419340 421450 424425 428346 432683 437309 442526 448682 456181 465288 475576 486221
56275 486221 497142 509214 523092 538586 555541 574553 596341 620961 648068 677578 709911
56264 709911 746009 787110 833963 886348 943909 1007172 1076888 1152705 1233641 1319647 1411285
56253 1411285 1507757 1606710 1706228 1805554 1903343 1996695 2082714 2159840 2226763 2281221 2320982
56242 2320982 2345388 2355125 2351159 2334629 2307094 2270027 2224432 2171440 2112721 2049871 1983865 1915440
56230 1915440 1845298 1773616 1700184 1625412 1550464 1476077 1402240 1329500 1259510 1193507 1131134
56219 1131134 1071517 1014722 961384 911676 865591 823676 786595 754279 726163 701919 681390
56208 681390 664112 649417 636738 625530 615316 606039 597858 590376 582731 574665 566845 559880 553713
56195 553713 548230 543662 540026 536976 534549 533303 533433 534563 536607 539877 544021 547960 551313 554835
56181 554835 559003 563266 567218 571398 576237 581336 586480 592321 599280 606774 614311 622419 631664 641727
56167 641727 652257 663667 676288 689716 703875 719700 737742 757120 776996 798257 822619
56156 822619 850784 882673 918829 960538 1009080 1065931 1133154 1212617 1305177 1411294 1531486
56145 1531486 1664873 1807453 1952578 2092826 2221169 2331925 2422567 2494922 2553905 2605024
56135 2605024 2652845 2700037 2745977 2786364 2815451 2829307 2827387 2812258 2788616 2761355 2732706
56124 2732706 2700520 2659365 2603012 2526339 2426858 2306275 2170547 2027678 1885292 1749801
56114 1749801 1626129 1516999 1422907 1343311 1277305 1223122 1178387 1141556 1112036 1088538 1068854
56103 1068854 1052013 1039111 1030931 1026185 1023236 1022156 1023689 1027440 1032524 1038942 1046859 1055379 1063458
56090 1063458 1071335 1079921 1089540 1100201 1112154 1125166 1138277 1151132 1164312 1177490 1188825 1197429
56078 1197429 1204824 1212561 1219975 1225982 1231510 1238216 1246029 1253903 1261949 1271011 1281180 1292450 1305735
56065 1305735 1321409 1337937 1353802 1369705 1387063 1405551 1424085 1443061 1463441 1484681 1505752
56054 1505752 1527300 1550600 1575188 1599695 1624297 1650222 1677532 1705348 1733543 1762335 1791128
56043 1791128 1819722 1849743 1882802 1918132 1953987 1990262 2027642 2065330 2101911 2137363 2171954
56032 2171954 2204419 2233871 2262518 2293945 2329574 2369150 2413366 2463187 2517515 2574377 2633704
56021 2633704 2696433 2761882 2828706 2897427 2969251 3043413 3118462 3195072 3274860 3357706 3443118
56010 3443118 3532813 3628731 3729818 3834011 3941999 4055716 4174643 4297211 4424394 4558134
56000 4558134 4697709 4841590 4991397 5150002 5317297 5492070 5676334 5873194 6082020
55991 6082020 6300599 6530525 6775566 7036308 7311649 7603966 7917321 8252248 8608083
55982 8608083 8988735 9400087 9843531 10318622 10830230 11386033 11988904 12639577 13345342
55973 13345342 14118162 14965888 15893975 16914536 18044930 19299418 20692291 22248104
55965 22248104 23999219 25976395 28214695 30768351 33709532 37118194 41091935 45768431
55957 45768431 51327455 57979755 65979691 75652084 87388422 101621448 118829387 139553041
55949 139553041 164344788 193627380 227485528 265313036 305235831 343601974 375226724
55942 375226724 394792989 398836201 387072993 362263376 328892904 291622080 254235587
55935 254235587 219247448 187975498 160849513 137759314 118318448 102024865 88365135
55928 88365135 76883271 67201431 59005227 52032405 46074037 40966493 36572713 32774894
55920 32774894 29479959 26616609 24122138 21938462 20019319 18330350 16839623 15515293
55912 15515293 14332837 13276281 12330629 11479511 10710616 10016370 9387998 8814818 8290021
55903 8290021 7811168 7374168 6972196 6601070 6260157 5947177 5657189 5387418 5138185
55894 5138185 4908421 4694916 4496530 4314444 4147550 3992022 3846130 3710976 3585528
55885 3585528 3465139 3346206 3228808 3113937 3001614 2892511 2788063 2688140 2591492 2498837
55875 2498837 2412430 2332384 2256666 2184895 2118809 2058599 2002103 1948055 1896862 1847701 1798176
55864 1798176 1747675 1698127 1650779 1604969 1560537 1518378 1477901 1436806 1394167 1351242 1308781
55853 1308781 1266290 1224534 1185967 1151787 1120996 1092922 1068095 1045949 1024329 1002204 980593
55842 980593 960107 939890 919775 901141 884733 869710 855542 842731 830987 818966 806651
55831 806651 795961 788164 782610 778699 777030 777777 779879 782705 786684 791559 795777 798312 799334 798494
55817 798494 794475 787018 777548 767021 754969 741381 727558 714136 700053 684599 668924 654470
55805 654470 641274 628813 617229 606784 597296 588910 582398 578019 575097 573156 572401 572802 574038 576622
55791 576622 581708 589310 597895 605921 612475 616436 616823 614390 611325 609063 608014 609532 616041 628587
55777 628587 646102 667615 693017 720712 746603 767057 781920 793931 806616 823465 847226
55766 847226 878338 914653 953315 991830 1026979 1054403 1070463 1073606 1063537 1040576 1006437 964027
55754 964027 915524 862000 805559 750010 698275 650645 606661 567081 532598 502101 473935
55743 473935 447960 424962 404825 386625 369912 354804 341350 329665 320018 312090 304911 298191
55731 298191 292687 288604 284796 280396 276044 272494 269123 264955 260220 255747 251680 247878 244759 242675
55717 242675 241206 240066 239951 241426 243688 245367 245916 245416 243909 241953 240914 241540 242893 243734 244314 245744
55701 245744 248235 251067 253762 256287 258606 260983 264244 268774 273703 277877 281077 283510 284829 284724
55687 284724 284009 284099 285668 288558 292531 297354 302601 308198 314666 322220 330147 337716 345048 352360 359090
55672 359090 364572 368873 372069 373418 372198 368723 363683 357197 349496 341716 334814 328326 321479 315053
55658 315053 310815 309495 310580 313877 319998 329370 342004 358349 379300 405161 435357 469300 506891
55645 506891 548197 593252 642145 694630 749518 804744 857749 905494 944685 972826 989066
55634 989066 993760 987790 972879 951979 928477 905092 883878 866703 854987 849421 850477 858550
55622 858550 872811 890498 908210 923468 934281 937898 931279 912741 882427 841596 792339 737665
55610 737665 680755 624072 569590 519270 474289 434211 397899 365118 336395 311665 290102
55599 290102 271102 254472 239761 226373 214311 203967 195188 187280 179891 173144 167057 161564 156960
55586 156960 153535 150836 148070 145167 142776 141261 140352 139692 139111 138474 137878 137840 138730 140214 141775 143452
55570 143452 145472 147525 149096 150141 150779 150749 149930 148987 148634 148636 148329 147692 147034 146194 145087 144616 145820 148365
55552 148365 150982 153117 155034 156585 157261 157431 158147 159551 160616 160626 159869 158727 157130 155114 152935 150440
55536 150440 147283 143857 141068 139078 137248 135451 134325 134025 133747 132901 131828 131047 130628 130587 131134 132281
55520 132281 133980 136743 141222 147093 153339 159810 167430 176633 186723 197230 208834 222385 237939
55507 237939 255430 275548 299320 327348 359729 396019 434965 474971 515206 555527 595107
55496 595107 631932 663797 688811 704726 709143 701153 681836 652656 614552 569415 521181 473999
55484 473999 429828 388761 350981 317126 287144 260195 235757 213956 194801 177921 163163
55473 163163 150713 140479 131851 124226 117371 111214 105582 100243 95055 90116 85791 82399 79746 77272
55459 77272 74775 72593 70919 69362 67549 65761 64567 64051 63721 62982 61504 59422 57374 56045 55456
55444 55456 55030 54488 54190 54327 54305 53427 51856 50393 49560 49338 49637 50534 52009 53649 54711 54506 52898
55427 52898 50536 48354 46829 45836 45050 44107 42583 40451 38519 37723 37902 37954 37354 36740 36740 37042 37119 37114 37395
55408 37395 37759 37731 37258 36598 35923 35493 35759 36715 37536 37465 36712 35994 35562 35347 35685 37058 39171 41002 41850
55389 41850 41866 41525 41082 40596 40102 39593 39031 38431 37847 37354 37196 37689 38832 40125 40990 41200 40817 39974 38919
55370 38919 37951 37112 36164 34993 33686 32117 29989 27550 25729 25087 25133 25133 25154 25686 26648 27507 28108 28637
55352 28637 28855 28178 26629 25091 24337 24281 24390 24392 24293 24041 23616 23364 23850 25210 26787 27642 27486 26915 26606
55333 26606 26546 26332 26010 26061 26539 26818 26443 25785 25614 26382 28123 30618 33240 35016 35346 34590 33645 33026
55315 33026 32536 31690 30306 28817 28070 28568 29872 31012 31553 31842 32299 32994 34020 35507 36976 37371 36304
55298 36304 34703 33688 33244 32583 31423 30196 29297 28747 28478 28420 28400 28373 28536 28851 28802 28112 27414 27612 28763
55279 28763 30154 31286 32241 33241 34365 35616 36743 37113 36287 34638 32943 31546 30444 29937 30438 31632
55263 31632 32540 32618 32238 31921 31683 31395 31277 31605 32138 32226 31416 29865 28174 26887 26112 25632 25342 25393 25797
55244 25797 26184 26220 26034 26003 26242 26536 26569 26045 24907 23717 23429 24381 25851 26994 27821 28669 29166 28551 26928
55225 26928 25347 24545 24254 23903 23404 23058 23159 23850 24949 25807 25829 25287 25137 25857 26862 27305 27012 26373
55207 26373 25699 25091 24715 24777 25211 25657 25862 25979 26368 27019 27350 26813 25750 25320 26324 28402 30579 32292
55189 32292 33488 34094 33953 33226 32368 31681 31235 31169 31630 32482 33406 34270 35050 35509 35348 34671 33926 33436 33274
55170 33274 33419 33605 33204 31849 30106 29004 28960 29659 30803 32242 33404 33465 32380 31066 30212 29534 28515
55153 28515 27325 26481 26046 25743 25595 25959 26978 28333 29519 30222 30527 30811 31291 31718 31766 31639 31836 32314
55135 32314 32505 32333 32553 33630 34840 35136 34563 34154 34532 35278 35753 35924 36138 36438 36486 36075 35513 35465 36417
55116 36417 38199 39966 40751 40153 38604 37028 36274 36688 37982 39361 39977 39581 38851 38839 39838 40953 41041
55099 41041 40039 39035 39061 40181 41808 43380 44495 44897 44772 44805 45462 46346 46699 46373 45944 45965 46452 47065
55081 47065 47468 47553 47585 48000 48817 49398 49070 47819 46138 44435 42955 41958 41523 41301 40946 40608 40594 40771 40779
55062 40779 40647 40612 40515 39973 39050 38185 37505 36790 36073 35716 35935 36751 38252 40266 41935 42372 41707 40832 40240
55043 40240 39897 40057 41151 42804 44014 44583 45335 46616 47630 47759 47569 47877 48656 49519 50509 51618 52160
55026 52160 51485 49911 48268 46962 46076 45858 46321 46716 46185 44782 43306 42328 41910 41949 42207 42236 41854 41447
55008 41447 41368 41322 40878 40282 40182 40772 41724 42711 43484 43721 43387 43008 43046 43246 43133 42841 42842 43166 43510 43892 44477
54987 44477 45045 45380 45908 47152 48745 49868 50526 51410 52542 53196 53303 53785 55001 55919 55547 54411 53818
54970 53818 54189 54952 55677 56457 57253 57685 57661 57734 58511 59929 61255 61731 61231 60378 60054 60707 62128 63866
54952 63866 65760 68043 71048 74883 79329 84071 89084 94775 101657 109929 119477 130028 141002 151277
54938 151277 159576 165273 168598 169926 169110 165659 159412 150881 141038 130899 121245 112499 104773 97957
54924 97957 91794 86042 80705 76081 72445 69781 67934 66925 66846 67515 68504 69477 70319 70924 71214 71433 72107
54907 72107 73485 75254 77090 79386 83115 88851 96161 104129 112355 121164 130815 140783 149990 157452
54893 157452 162427 164247 162594 157997 151554 144022 135593 126603 117797 109597 101701 93962 87174 82284
54879 82284 79063 76289 73178 70031 67489 65716 64436 63236 61649 59433 56988 55122 54176 53656 52914
54864 52914 51939 51280 51403 52289 53523 54606 55241 55428 55272 54806 54038 53068 51989 50851 49918 49722 50459 51470
54846 51470 51784 51142 50137 49366 48883 48479 48021 47404 46532 45477 44364 43092 41580 40279 39923 40621 41673
54829 41673 42463 43054 43644 44005 43892 43648 43926 45019 46810 49056 51302 52816 53167 52786 52501 52601 52811
54812 52811 53062 53694 54761 55710 56142 56490 57496 59137 60513 60870 60385 59836 59805 60541 62341 65497 69652
54795 69652 73717 76905 79715 83475 88975 95925 103721 112241 121660 131872 142398 152594 161704 168901
54781 168901 173609 175739 175447 172858 168206 162061 155102 147732 140147 132663 125672 119313 113516 108353
54767 108353 104023 100361 96751 92792 88914 86007 84453 83738 83054 82070 81063 80444 80407 80955 82066 83688
54751 83688 85711 88073 90902 94557 99504 106100 114303 123576 133150 142430 150987 158214 163364 166107
54737 166107 166691 165258 161286 154218 144588 133999 123923 114851 106653 99309 93036 88036 84329 81653
54723 81653 79394 76976 74511 72665 71607 70490 68475 65994 64317 63869 63602 62321 60144 58217 57274
54708 57274 56927 56387 55430 54501 54132 54479 55305 56195 56778 56909 56682 56216 55463 54363 53164 52409 52535 53548
54690 53548 55150 56987 58710 59996 60718 61041 61192 61228 61153 61154 61516 62353 63584 65087 66681 68034 68884 69374
54672 69374 69926 70718 71504 72088 72806 74376 77228 81019 84799 87669 89323 90032 90182 89940 89331 88342 86896
54655 86896 84958 82816 80971 79513 77913 75742 73378 71639 70796 70385 69835 68898 67547 65961 64687
54640 64687 64330 64908 65731 66030 65508 64396 63324 63019 63654 64507 64678 64132 63537 63153 62607 61846 61486 61837
54622 61837 62311 62311 62095 62131 62133 61539 60649 60432 61233 62333 62882 62695 62070 61305 60622 60183 59937 59649 59260 59016
54602 59016 59195 59774 60443 60839 60731 60115 59141 57951 56615 55256 54116 53486 53660 54900 57124 59600 61363
54585 61363 62133 62500 62982 63288 62838 61649 60231 58869 57522 56335 55700 55796 56450 57448 58596 59507 59716
54568 59716 59142 58184 57371 57111 57698 59156 61037 62700 63865 64710 65490 66308 67226 68251 69222 70004 70758
54551 70758 71670 72510 72848 72723 72678 73042 73566 73878 73917 73788 73481 72874 71787 69986 67429 64545 61981 60029
54533 60029 58618 57814 57782 58235 58502 58418 58570 59329 60148 60276 59754 59147 58597 57766 56607 55627 55324 55788 56954
54514 56954 58857 61382 63889 65372 65227 63994 63126 63659 65100 66032 65837 65276 65180 65262 64796 63895 63336 63392
54496 63392 63653 63962 64693 65924 67030 67414 67208 67001 67224 68049 69511 71477 73760 76382 79437 82619
54480 82619 85326 87396 89275 91192 92627 92984 92378 91292 89802 87728 85371 83431 82140 80988 79467
54465 79467 77703 76206 75297 74926 74835 74754 74594 74479 74443 74188 73382 72235 71392 71178 71268 71284 71333 71650 71939 71567
54445 71567 70413 69154 68556 68681 68981 69030 68933 69047 69468 69929 70104 69921 69564 69293 69238 69270 69112 68656 68197 68148
54425 68148 68554 69103 69632 70335 71348 72489 73664 75122 76962 78677 79724 80278 80844 81303 81087 80294 79804
54408 79804 80050 80434 80355 80166 80528 81320 81827 81748 81405 81111 80831 80404 79689 78644 77519 76817 76691 76735 76717 77167
54388 77167 78611 80531 81835 82238 82407 82723 82713 81938 80808 80179 80621 82275 84912 87820 90085 91367
54372 91367 92082 92662 93054 93178 93354 93841 94371 94604 94755 95246 95921 96054 95155 93414 91383 89494 87902 86566
54354 86566 85402 84440 83797 83502 83462 83588 83768 83794 83610 83626 84359 85684 86865 87445 87578 87328 86324 84607
54336 84607 83225 83199 84220 85037 84991 84459 83901 83221 82212 81049 80064 79428 79194 79270 79210 78426 76829 74953
54318 74953 73288 71799 70287 68888 67880 67188 66415 65331 64131 63214 62850 63014 63453 63882 64219 64604 65172
54301 65172 65825 66281 66386 66325 66398 66596 66554 66123 65812 66371 67895 69619 70727 71078 71083 71153 71416 71758 71937 71877
54281 71877 71894 72295 72695 72281 71066 70274 70944 72647 74233 75440 76850 78453 79321 78940 78009 77488 77488 77528
54263 77528 77368 77020 76296 74980 73349 72109 71705 71969 72417 72722 72872 73016 73237 73498 73752 73981 74037 73633
54245 73633 72735 71855 71581 71876 72164 72168 72283 72968 74039 74781 74613 73544 72151 71180 70992 71373 71962 72670 73387
54226 73387 73519 72473 70595 68969 68029 67109 65750 64743 65102 66410 67096 66364 65054 64447 64875 65857 66997
54209 66997 68156 69024 69186 68734 68322 68454 68996 69638 70472 71691 72913 73452 73424 73990 76088 79305 82446
54192 82446 84889 86790 88177 88669 88234 87547 87218 87068 86517 85311 83608 81648 79724 78193 77170 76329
54176 76329 75339 74277 73343 72379 71115 69776 68961 68785 68574 67660 66278 65323 65287 65716 65859 65619 65531 65800
54158 65800 65819 64933 63449 62428 62521 63362 64113 64259 63799 63029 62311 61871 61737 62018 63119 65219 67566 68851
54140 68851 68523 67354 66513 66475 67042 67892 68722 69216 69282 69144 68905 68384 67669 67369 67834 68528 68707 68422 68233
54121 68233 68180 67794 67034 66551 66883 67946 69347 70635 71235 70766 69642 68809 68623 68517 68036 67625 67907 68671
54103 68671 69200 69360 69698 70476 71246 71632 72034 73152 75008 76909 78403 79885 82001 84686 87187 89011
54087 89011 90501 92310 94554 96730 98260 98926 98904 98675 98766 99301 99798 99673 98909 97985 97132 95981 94088
54070 94088 91586 89159 87453 86648 86523 86799 87406 88420 89832 91475 93148 94695 95882 96451 96464 96479 97100
54053 97100 98389 99901 101259 102520 103996 105912 108268 110859 113386 115636 117627 119625 122103 125606
54039 125606 130344 135788 140972 145487 149943 155165 161118 166900 171693 175362 178255 180803 183250 185439
54025 185439 186913 187561 188008 188931 190077 190534 189964 188927 187793 186000 182922 179002 175413 172715 170277
54010 170277 167079 162705 157534 152269 147453 143331 139942 137206 134892 132646 130214 127627 125045 122503
53996 122503 119953 117456 115114 112913 110917 109506 109042 109252 109342 108864 108151 107722 107606 107447 106984 106195 105238
53979 105238 104494 104439 105155 106117 106684 106734 106581 106418 106114 105543 104919 104728 105301 106421 107377 107579 107167 106814 106947
53960 106947 107435 108046 108797 109696 110540 111307 112440 114385 117001 119780 122479 125244 128208 131337 134629 138121
53944 138121 141685 145013 147871 150278 152560 155328 159192 164206 169694 174870 179552 184104 188766 193307
53930 193307 197222 200095 201881 203059 204384 206215 208224 210007 211798 214222 217508 221299 225231 229308
53916 229308 233699 238502 243651 248782 253262 256757 259718 262866 266172 268786 270033 270043 269328 268225 266970
53901 266970 265819 264753 263329 261118 258041 254166 249506 244269 238901 233534 227631 220588 212535 204359
53887 204359 197062 191240 186884 183335 179744 175862 172194 169105 166154 162730 158973 155524 152530 149610
53873 149610 146634 143900 141491 139177 137027 135385 133953 131650 127946 123826 120813 119280 118280 116844
53859 116844 114900 112982 111560 110749 110300 109738 108751 107467 106177 104884 103448 102097 101306 101117 100926 100236
53843 100236 99263 98570 98350 98365 98401 98450 98480 98373 98119 97890 97849 98049 98508 99244 100196 101268 102465 103808 105084
53824 105084 105924 106225 106341 106639 107049 107312 107560 108367 110140 112704 115563 118386 121102 123754 126444 129329
53808 129329 132471 135768 139203 143025 147435 152135 156477 160080 163130 166051 169152 172592 176382 180258
53794 180258 183761 186599 188719 189943 189882 188495 186435 184446 182579 180394 177844 175455 173580 171889 169788
53779 169788 167042 163796 160259 156620 153124 149974 147172 144587 142122 139720 137215 134349 130983 127311
53765 127311 123814 120929 118742 117086 115908 115255 114786 113702 111593 109150 107487 106793 106226 105192 104108
53750 104108 103607 103594 103566 103418 103378 103396 103176 102675 102059 101251 100064 98791 98115 98268 98714 98861 98707 98591 98631 98785
53730 98785 99215 100154 101401 102319 102556 102576 103232 104746 106351 107118 107001 106794 107077 107627 108033 108488 109508 111062
53712 111062 112467 113239 113656 114326 115463 116758 117806 118494 119047 119806 120909 122137 123110 123633 123846 124068 124535
53695 124535 125261 126112 127092 128467 130397 132449 133870 134546 135336 137026 139208 140731 141168 141312 142116 143613
53679 143613 145101 145990 146236 146117 145890 145641 145408 145421 146066 147366 148668 149189 148865 148345 148177 148343 148616 148883
53661 148883 148997 148706 147983 147143 146438 145836 145332 145191 145649 146624 147862 149135 150162 150677 150770 150855 151116 151299
53643 151299 151221 151084 151004 150687 149970 149389 149707 151050 152873 154604 155943 156778 157256 157827 158779 159764 160182 160014
53625 160014 159903 160434 161670 163365 165276 167205 168983 170475 171499 171892 171891 172263 173703 176224 179382 182891
53609 182891 186557 189836 192106 193415 194510 196033 198125 200753 203806 206781 209055 210737 212703 215446
53595 215446 218380 220732 222651 224875 227630 230405 232699 234453 235783 236763 237549 238287 238823 238786 238123 237322
53579 237322 236968 237180 237573 237648 237179 236276 235177 233997 232743 231567 230860 230933 231641 232476 232981 233040 232860 232829 233231
53560 233231 233903 234183 233488 231973 230449 229586 229367 229372 229318 229189 229054 229069 229599 231008 233226 235712 237959 239919
53542 239919 241762 243394 244436 244739 244708 245052 246251 248318 250953 253829 256765 259701 262492 264876 266776
53527 266776 268665 271315 275004 279121 282821 286030 289522 294029 299529 305469 311415 317291 323215 329348
53513 329348 335868 342855 350138 357425 364656 372148 380332 389406 399305 409949 421388 433706 446879
53500 446879 460822 475468 490633 505872 520692 535094 549765 565483 582243 599104 615000
53489 615000 629722 644062 658968 674577 690079 704578 718007 731120 744613 758438 772079
53478 772079 785257 798094 810644 822701 834206 845597 857411 869578 881409 892402 902834
53467 902834 913329 923963 934063 942941 950525 957085 962553 966462 968482 968721 967381 964368 959409 952489
53453 952489 944127 935290 926962 919523 912501 905126 897172 888924 880291 870407 858564 845258 831880
53440 831880 819426 807868 796712 785698 774863 764252 753842 743598 733474 723470 713859 705293
53428 705293 698537 693918 690927 688433 685513 682137 678951 676434 674603 673521 673574 674934 677212 680088 683913
53413 683913 689106 695181 701158 706927 713545 722014 732330 743857 756101 768875 782182 796251 811377
53400 811377 827490 844188 861376 879514 899084 920183 942779 966897 992279 1018405 1045258
53389 1045258 1073599 1104037 1136186 1169187 1202679 1236697 1270985 1305157 1339427 1374529 1410843
53378 1410843 1448050 1485583 1522884 1559192 1593671 1625951 1656208 1684663 1711370 1736471 1760159
53367 1760159 1782212 1802012 1819225 1834145 1847150 1858143 1866662 1872242 1874449 1872818 1866983 1856749
53355 1856749 1841986 1822683 1799234 1772374 1742778 1710970 1677638 1643641 1609530 1575466 1541800
53344 1541800 1509303 1478521 1449247 1420993 1393676 1367468 1342225 1317512 1292993 1268375 1243195
53333 1243195 1217175 1190730 1164629 1139220 1114417 1090428 1067945 1047462 1028805 1011548 995553
53322 995553 980899 967595 955573 944828 935410 927392 920724 914814 908322 899846 889030 876700 863884
53309 863884 851154 839032 828340 819559 812158 805093 797860 790740 784327 779235 776009 774726 774777 775485
53295 775485 776844 779192 782323 785586 788878 792875 798139 804633 812291 821504 832663 845701 860347
53282 860347 876348 893114 909669 925460 940821 956169 971106 984912 997605 1009887 1022130
53271 1022130 1034047 1045297 1055834 1065536 1073938 1080438 1084498 1085770 1084470 1081524 1077783 1073080 1066619
53258 1066619 1058259 1048707 1038247 1026082 1011427 994711 977145 959488 941701 923447 904323 883951
53246 883951 862536 841298 821709 804222 788214 773107 758918 745542 732190 718057 703239
53235 703239 688533 674448 660792 647099 633047 618447 603232 587702 572533 558294 544983
53224 544983 532194 519698 507721 496744 487255 479640 473965 469670 465708 461244 456171 450778 445077
53211 445077 438731 431541 423619 415062 405816 395939 385676 375066 363815 351851 339781 328499 318429
53198 318429 309410 301170 293604 286630 280087 273877 267946 262133 256201 250080 243850 237496 230885 224119
53184 224119 217675 211979 206917 201905 196489 190816 185572 181445 178583 176534 174709 172879 171150 169579
53170 169579 168095 166823 166176 166334 166743 166488 165198 163370 161672 160151 158337 155955 153286 150776 148556
53155 148556 146489 144622 143386 143262 144225 145585 146470 146548 146254 146226 146601 146966 146900 146349 145473 144445 143507 142966
53137 142966 142903 143039 143082 143070 143204 143513 143883 144284 144703 144992 145074 145191 145554 145842 145497 144591 143932 144066 144533 144368
53117 144368 143139 141221 139277 137792 137038 137099 137746 138382 138313 137242 135545 133947 132820 131918 130972 130307 130513
53100 130513 131560 132659 133115 132988 132774 132789 133040 133352 133319 132405 130412 127778 125248 123357 122357 122324 123046
53083 123046 123943 124437 124373 123977 123482 122988 122550 122165 121758 121311 120947 120754 120673 120654 120711 120710 120316 119410 118391 117840
53063 117840 117980 118628 119445 120071 120227 119992 119796 119899 120031 119830 119423 119283 119640 120321 121092 121837 122515 123175 123891
53044 123891 124465 124427 123669 122896 122995 124078 125507 126712 127588 128203 128688 129444 130922 133023 135075 136509 137311
53027 137311 137822 138441 139565 141347 143326 144618 144697 143880 142941 142468 142536 142849 143139 143560 144535 146022 147261
53010 147261 147654 147587 147738 147806 146816 144787 143188 143328 144920 146710 147941 148680 149192 149628 150128 150714 151187 151469
52992 151469 151858 152651 153728 154846 156079 157566 159073 160227 161028 161721 162331 162787 163323 164226 165243 165753
52976 165753 165596 165221 164896 164266 162998 161523 160728 161001 161830 162327 162013 161117 160218 159650 159255 158730 158164 158130
52958 158130 159189 161296 163759 165790 167126 168086 169042 169910 170340 170299 170200 170343 170483 170147 169229 168054 166916
52941 166916 165845 164862 164176 163913 163789 163357 162706 162644 163813 165650 166667 166019 164452 163359 163164 163156 162721 162068
52923 162068 161615 161284 160777 160115 159533 159127 158936 159126 159735 160436 160819 160806 160539 160084 159510 159047 158820 158584 158034
52904 158034 157279 156702 156463 156428 156484 156562 156393 155592 154035 151947 149683 147651 146420 146452 147657 149407 151074
52887 151074 152343 153027 152907 151998 150794 150014 150036 150651 151326 151763 152174 153028 154538 156489 158530 160451 162163
52870 162163 163626 164938 166248 167404 167883 167309 165902 164190 162401 160351 157829 154793 151332 147648 144141
52855 144141 141247 139181 137889 137164 136678 136113 135424 134865 134533 134107 133197 131769 129991 127949 125900 124484
52839 124484 124148 124464 124537 124115 123757 123918 124382 124758 125097 125743 126906 128569 130477 132019 132438 131529 130016
52822 130016 128975 128905 129435 129811 129602 129018 128644 128777 129043 128773 127745 126445 125613 125644 126325 126957 126849 125926
52804 125926 124810 124070 123531 122698 121744 121599 122908 125266 127586 128915 128910 127923 126835 126446 126810 127340 127598
52787 127598 127691 127833 127971 128019 128122 128429 128870 129324 129761 130080 130133 130033 130089 130268 130157 129681 129424 129863 130676 131274
52767 131274 131627 132087 132621 132859 132759 132690 132804 132822 132553 132260 132368 133028 134067 135170 136095 136838 137618 138539 139386
52748 139386 139942 140395 141165 142361 143647 144683 145520 146547 148179 150536 153286 155855 157959 159840 161857
52733 161857 163987 165897 167369 168398 168977 169064 168682 167853 166492 164648 162757 161413 160848 160789 160707 160114 158849
52716 158849 157358 156479 156618 157309 157938 158643 159950 161693 162996 163369 163228 163176 163364 163799 164627 165688 166220
52699 166220 165566 163960 162281 161199 160869 161144 161656 161859 161450 160661 159856 158982 157776 156400 155376 154895 154585
52682 154585 153998 152923 151148 148430 145053 142056 140416 140033 139863 139095 137877 136828 136138 135494 134726 134121
52666 134121 133954 134034 133994 133887 134149 134984 136091 137088 137890 138525 138860 138869 139024 140077 142326 145268 147997 149832
52648 149832 150602 150576 150248 150040 150046 150099 150138 150443 151416 153114 155027 156340 156415 155177 153164 151228 149938 149132
52630 149132 148111 146451 144620 143543 143512 143773 143373 142188 140851 139884 139315 139066 139179 139490 139566 139273 139079
52613 139079 139460 140297 141187 142037 142880 143383 143223 142873 143274 144494 145371 144918 143618 142788 142963 143464 143420 142667
52595 142667 141544 140277 138815 137027 134979 133107 132054 132042 132439 132362 131731 131249 131228 131019 129997 128638 127960
52578 127960 128228 128857 129468 130216 130981 131091 130302 129412 129330 129881 130151 129733 129120 128999 129675 131021 132450 132999
52560 132999 132089 130283 128735 127839 127037 126089 125697 126377 127364 127378 126189 124756 124012 124091 124681 125457 126082 126341
52542 126341 126468 126998 128144 129643 131297 133303 135791 138333 140159 140758 140171 138868 137483 136492 136021 135965
52526 135965 136257 136859 137563 138071 138345 138584 138865 139027 139001 138917 138786 138416 137827 137393 137326 137267 136688 135523 134143
52507 134143 132846 131583 130066 128010 125464 123080 121763 121812 122621 123490 124448 125862 127509 128605 128785 128568
52491 128568 128694 129281 129824 129824 129350 129028 129416 130320 130963 130967 130832 131128 131555 131409 130813 130738 131708 133114 134065 134380
52471 134380 134461 134577 134679 134644 134405 133970 133535 133374 133472 133533 133485 133654 134188 134672 134695 134514 134764 135615 136679 137756
52451 137756 139275 141823 145348 148954 151519 152616 152865 153309 154424 155841 156898 157185 156578 155188 153490
52436 153490 152119 151302 150758 150358 150494 151409 152505 152786 151899 150336 148719 147266 145900 144498 142975 141380
52420 141380 139966 139040 138731 138974 139540 139980 139899 139516 139660 140805 142363 143350 143527 143443 143556 143862 144238 144635
52402 144635 144879 144846 144811 145132 145585 145566 144990 144436 144271 144213 143961 143772 144109 145191 147041 149487 151792 152887
52384 152887 152495 151654 151654 152671 153921 154861 155654 156575 157551 158450 159432 160770 162464 164188 165606 166751 168053
52367 168053 169894 172127 174245 176053 177915 180213 182822 185312 187419 189087 190323 191351 192759 195094
52353 195094 198260 201595 204546 207090 209498 211945 214459 217092 219947 222914 225485 227130 228003 229082
52339 229082 231182 233938 236204 237509 238620 240453 242939 245325 247239 248982 250994 253442 256238 259159
52325 259159 262078 265320 269528 274873 280618 285948 291099 297202 305051 314418 324565 335066 346065
52312 346065 358037 371330 385686 400296 414571 428771 443531 458919 474393 489616 504790
52301 504790 520133 535473 550482 564909 578535 591309 603614 615871 627704 638022 646242 652973
52289 652973 659105 664628 668857 671574 673357 674857 676189 677072 677184 676285 674294 671386 667899 664156 660428
52274 660428 656999 654049 651520 649276 647380 646037 645321 645188 645719 647106 649375 652434 656453 661919 669114
52259 669114 677727 687160 697054 707345 718002 729010 740563 752905 765947 779234 792404 805448
52247 805448 818437 831190 843335 854506 864360 872601 879237 884627 889036 892215 893692 893354 891457
52234 891457 888186 883644 878261 872699 867133 861001 853791 845758 837556 829421 821106 812484 803813 795478
52220 795478 787768 780898 774904 769508 764345 759406 755081 751795 749713 748672 748073 746972 744779 742037
52206 742037 740114 739840 740672 741454 741764 742171 743266 744898 746507 747852 749109 750360 751363 751903 752170 752542
52190 752542 753162 753847 754323 754309 753503 751790 749462 746982 744520 742021 739688 737876 736338 734072 730349 725632
52174 725632 721029 717112 713691 710527 707703 705297 703164 701178 699343 697583 695713 693701 691740 689995
52160 689995 688492 687237 686115 684707 682541 679662 676682 674160 672171 670546 669253 668317 667593 666806 665805
52145 665805 664691 663727 663070 662524 661550 659700 657065 654268 652125 651299 651979 653610 655186 656100 656558 656930
52129 656930 657025 656522 655867 656118 657966 661461 666599 673437 681529 689951 698177 706411 714888 723474 732214
52114 732214 741621 751997 763058 774679 787464 801954 817686 833734 849951 867063 885587 905171
52102 905171 924915 943919 961559 977644 992406 1006135 1018835 1030322 1040420 1048871 1055309 1059574
52090 1059574 1061821 1062166 1060612 1057610 1054160 1050855 1047138 1042101 1035707 1028655 1021362 1013755 1005945 998297
52076 998297 990884 983520 976392 969936 964034 958039 951840 946214 941870 938776 936745 936128 937360 940232
52062 940232 944087 948497 953420 959050 965820 974243 984220 994718 1004524 1013174 1020848 1027676 1033727 1039492
52048 1039492 1045669 1052261 1058324 1062852 1065597 1066854 1066800 1065369 1062602 1058765 1054087 1048585 1042163 1034713
52034 1034713 1026062 1015980 1004412 991736 978698 965988 953796 941750 929301 916140 902322
52023 902322 888051 873537 859141 845498 833200 822226 811828 801174 790001 778546 766947
52012 766947 755057 742807 730422 718125 705801 693094 679703 665476 650406 634732 618907
52001 618907 603344 588159 573141 557843 541781 524876 507745 491271 475796 461038 446836
51990 446836 433456 420887 408456 395691 383234 372268 363214 355516 348558 342139 336082 329976 323485
51977 323485 316473 308816 300518 292070 284189 277084 270405 263954 257925 252364 247008 241949 237845 235117
51963 235117 233362 231913 230528 229139 227433 225237 222964 221099 219455 217525 215425 213937 213618 214317 215525
51948 215525 216765 217620 217854 217658 217466 217449 217410 217196 216910 216678 216558 216717 217422 218717 220424 222474 224981 227802
51930 227802 230384 232304 233797 235566 238193 241864 246451 251601 256876 262173 268070 275543 285254 297236
51916 297236 311331 327721 346867 369019 393983 421344 450469 479954 507060 528098 539743
51905 539743 540244 529711 509735 482954 452595 421735 392517 365905 342107 321132 303007 287766
51893 287766 275393 265744 258394 252576 247404 242365 237669 234022 231856 230710 229565 227880 226155 225269
51879 225269 225396 225884 226092 225970 225609 224628 222403 218834 214507 210042 205592 201097 196686 192507 188361 183921
51863 183921 179279 174921 171087 167571 164256 161408 159135 156995 154667 152745 152160 152816 153460 153167 152386
51848 152386 152202 152975 154138 154970 155094 154407 153125 151857 151239 151416 152097 153049 154143 155007 155191 154902 155095
51831 155095 156409 158235 159278 159022 158298 158286 159201 160259 160767 160924 161340 162058 162481 162262 161822 161720 161873 161848
51813 161848 161750 162210 163405 164607 165082 165072 165476 166662 168071 169022 169543 170105 170821 171265 171189 171038 171472 172483
51795 172483 173354 173564 173439 173697 174540 175530 176265 176849 177617 178640 179645 180289 180380 179926 179104 178139 177160 176186
51777 176186 175281 174667 174663 175446 176849 178375 179513 180103 180381 180616 180858 181063 181231 181241 180787 179815 178875 178710 179536
51758 179536 181014 182820 184690 185979 185866 184356 182604 181808 182039 182495 182558 182194 181610 181096 181184 182415 184827
51741 184827 187922 191160 194236 196948 199221 201259 203408 205788 208336 211139 214387 217923 221191 223664
51727 223664 225053 225124 223782 221432 218838 216478 214443 213056 212860 213532 213424 210897 205962 200060 194469
51712 194469 189535 185276 181874 179363 177445 175982 175181 175024 174904 174243 173209 172400 171985 171541 170731 169804
51696 169804 169293 169353 169506 169050 167731 165952 164212 162459 160295 157825 155867 155097 155263 155599 155726 155784 155859
51679 155859 155843 155886 156467 157787 159473 161140 162987 165484 168593 171634 173880 175033 175120 174245 172588 170472
51663 170472 168225 166032 163977 162162 160646 159398 158425 157878 157782 157705 156953 155231 152972 150953 149791 149879
51647 149879 151388 153921 156282 157147 156212 154485 153358 153494 154627 156046 157107 157452 157051 156039 154526
51632 154526 152706 151169 150775 151974 154390 157235 159936 162217 163930 165238 166856 169613 173685 178469
51618 178469 183183 187322 190598 192848 194199 195021 195576 195863 195901 195871 195807 195390 194388 193170 192453 192497 192744 192362
51600 192362 190971 188739 185964 182847 179720 177168 175598 174794 174194 173619 173386 173580 173602 172787 171197 169509
51584 169509 168318 167908 168450 169795 171083 171216 169956 168198 166917 166229 165676 165052 164590 164601 165286 166682 168436
51567 168436 169761 170033 169461 168935 169183 170268 171807 173377 174690 175613 176185 176560 176857 177079 177156 177038 176823
51550 176823 176794 177222 178040 178832 179269 179427 179587 179843 180103 180339 180599 180829 180902 180855 180884 181025 180958 180270 178892 177311
51530 177311 176296 176337 177323 178825 180669 183041 185987 189107 191969 194735 198100 202656 208437 215038 221931
51515 221931 228616 234561 239086 241433 241248 239081 236152 233323 230420 226800 222407 217931 214042 210876
51501 210876 208237 205869 203363 200260 196540 192801 189629 186938 184172 181108 178172 175904 174269 172647
51487 172647 170482 167906 165676 164451 164151 164073 163590 162630 161461 160185 158609 156570 154292 152300 150939
51472 150939 150010 148993 147672 146408 145760 145919 146673 147749 148971 150142 151046 151637 152096 152608 153221 153885 154510
51455 154510 154972 155294 155808 156903 158494 159948 160701 160789 160623 160389 159870 158780 157090 155063 153088 151416
51439 151416 149905 148093 145694 143036 140850 139651 139435 139936 140927 142168 143249 143770 143706 143455 143443 143703 143934
51422 143934 143989 144266 145458 147823 150740 153171 154625 155575 156900 159037 161794 164752 167492 169425 169847
51407 169847 168513 166029 163414 161347 159953 159159 158897 158935 158856 158351 157376 156013 154381 152724 151282 149986
51391 149986 148549 147021 145926 145634 145879 146243 146896 148397 150843 153618 156064 158012 159571 160696 161233
51376 161233 161171 160650 159769 158589 157330 156362 155835 155375 154324 152440 150278 148682 147986 147974 148473 149496 150644
51359 150644 151009 150153 148780 147832 147209 146104 144492 143370 143364 143891 144159 144294 144800 145345 144902 143059 140481
51342 140481 137975 135623 133143 130664 128673 127346 126315 125200 124122 123495 123433 123604 123681 123710 123897 124225 124495
51325 124495 124640 124745 124796 124741 124840 125635 127352 129576 131712 133638 135727 138374 141725 145734 150170 154509
51309 154509 158124 160726 162510 163720 164125 163187 160784 157584 154471 151710 148930 145901 142921 140279 137762
51294 137762 135068 132445 130458 129281 128726 128851 129899 131515 132686 132807 132364 132185 132396 132578 132676 133183 134468
51277 134468 136298 138080 139367 140192 141076 142611 144821 147038 148618 149614 150485 151365 151978 152156 152037 151731
51261 151731 151242 150753 150622 150904 151194 151148 150937 150995 151445 151973 152187 152014 151826 152290 153934 156673 159689 161885
51243 161885 162548 161712 159972 157955 155887 153631 151129 148718 146914 145952 145593 145326 144691 143529 142104 140917
51227 140917 140260 139979 139804 139798 140193 140906 141564 142112 143030 144725 146989 149301 151511 153889 156531 159064 161058
51210 161058 162494 163640 164569 165033 164820 164060 163074 161996 160688 159024 157126 155259 153566 151995 150482
51195 150482 149131 148159 147673 147464 147088 146221 144989 143844 143082 142538 141799 140696 139546 138930 139171 139988 140700
51178 140700 140980 141360 142780 145503 148733 151447 153404 155097 156864 158409 159270 159472 159572 160079 160893 161287
51162 161287 160565 158844 157173 156704 157731 159596 161434 162895 164169 165577 167153 168526 169165 168873 168092
51147 168092 167612 167876 168550 168770 167822 165753 163382 161592 160495 159390 157708 155763 154313 153540 152918 152075
51131 152075 151316 151074 151233 151358 151331 151400 151670 151924 152029 152239 152967 154352 156162 158056 159827 161463 163063
51114 163063 164727 166451 168063 169258 169854 170044 170306 170872 171346 171029 169715 167967 166528 165661 165249 165365
51098 165365 166252 167663 168647 168440 167460 167005 167857 169490 170805 171323 171358 171282 171132 170923 170907 171345 172244 173388
51080 173388 174374 174598 173682 172082 170907 170809 171391 171962 172476 173233 174062 174518 174786 175642 177341 179167 180346
51063 180346 180927 181428 182033 182606 183275 184523 186663 189438 192235 194590 196562 198663 201346 204517 207553
51048 207553 209779 210838 210793 210191 209940 210622 211728 211999 210743 208567 206562 205142 204010 202978 202337 202492
51032 202492 203609 205603 208168 210907 213665 216664 220079 223639 227011 230427 234469 239213 244057 248564
51018 248564 253029 257986 263427 268825 273760 278250 282574 287004 291704 296710 301934 307221 312359 317013
51004 317013 320799 323591 325705 327742 330259 333619 338004 343434 349779 356802 364194 371618 378897 386227
50990 386227 394064 402661 411870 421552 431995 443629 456376 469739 483722 499416 518371 541515
50978 541515 568872 600116 634990 673160 714199 758097 805536 857184 912615 970161 1027936
50967 1027936 1084789 1140187 1193439 1243386 1288887 1329385 1364888 1395473 1420937 1440929 1455345
50956 1455345 1464519 1469105 1469943 1468032 1464466 1460163 1455704 1451511 1448040 1445560 1443851 1442431 1441081 1439751
50942 1439751 1437846 1433970 1426717 1415468 1400155 1380501 1355944 1326185 1291436 1252087 1208516 1161261
50930 1161261 1111099 1058887 1005612 952626 901404 852870 807220 764541 725247 689728 657936
50919 657936 629676 604988 583826 565591 549402 534737 521411 509047 497169 485840 475708
50908 475708 467229 460232 454360 449485 445473 442058 439321 437873 438086 439431 441087 442943 445407 448347
50894 448347 450964 452881 454702 457203 460397 463801 467280 471222 476060 481970 488890 496556 504560 512689
50880 512689 521185 530546 541132 553061 566304 580684 596001 612404 630483 650730 673113 697510
50868 697510 724357 754389 787924 825049 866548 913995 968595 1030441 1099212 1175108 1258625
50857 1258625 1349808 1448289 1553776 1665876 1783470 1904878 2028686 2153877 2278936 2401298
50847 2401298 2517902 2625833 2722168 2803769 2868075 2914287 2943484 2957626 2958710 2948795 2930283
50836 2930283 2905851 2878282 2850503 2825488 2805784 2793032 2787976 2790616 2800088 2814420 2830623 2845054
50824 2845054 2853694 2852537 2838414 2809795 2766613 2709227 2637772 2552587 2454875 2346554 2229643
50813 2229643 2106264 1979261 1852349 1729190 1612279 1502755 1401165 1308174 1224478 1150233
50803 1150233 1084860 1027524 977622 934678 897948 866541 839956 818096 800581 786435 774816
50792 774816 765721 759401 755231 751726 747782 743330 738606 733327 727063 720047 713078 706648 700561 694346
50778 694346 687741 680732 673464 666200 659139 652160 644872 637037 628877 621011 614181 608917 605170 602267
50764 602267 599549 597249 596527 598407 602836 608940 616030 624029 633033 642902 653529 665278 678929 695256
50750 695256 714724 737505 763639 793253 826786 864898 908073 956274 1009175 1066650 1128828
50739 1128828 1195555 1265886 1338239 1411069 1483401 1554703 1624203 1690365 1751193 1805176 1851785
50728 1851785 1890836 1921531 1942403 1952204 1950588 1938016 1915531 1884947 1849044 1811262 1775089 1743542
50716 1743542 1718675 1701234 1690941 1687288 1689808 1697480 1708374 1720342 1731674 1740455 1743605 1737515
50704 1737515 1720011 1691248 1652511 1604677 1548203 1484146 1414608 1342193 1269334 1198069 1130090
50693 1130090 1066821 1009426 958707 914891 877584 846042 819528 797499 779613 765657 755433
50682 755433 748697 745235 744921 747599 752951 760672 770684 782852 796393 809861 821949 832318 841524
50669 841524 850243 858573 866011 871992 876510 880190 883763 887519 891398 895432 899847 904837 910586 917495
50655 917495 926037 936342 948287 962137 978738 998851 1022540 1049429 1079275 1111964 1147057 1183620
50643 1183620 1220474 1256436 1290451 1321677 1349481 1373312 1392688 1407458 1417986 1424945 1428907 1430065
50631 1430065 1428262 1423234 1414989 1403934 1390599 1375345 1358575 1341175 1324399 1309239 1296127 1285156
50619 1285156 1276251 1269100 1263332 1258929 1256114 1254775 1254425 1254929 1256693 1259781 1263220 1265622 1266151 1264442 1259788
50604 1259788 1250939 1236722 1216615 1190862 1160382 1126510 1090502 1053290 1015794 979248 944910
50593 944910 913508 885109 859340 835564 813074 791412 770401 749815 729365 709238 690298
50582 690298 673395 658786 646476 636699 629602 624792 621763 620500 621158 623434 626834 631391 637462 644981
50568 644981 653546 663139 674065 686201 698963 712158 726232 741549 757975 775265 793330 811953
50556 811953 830816 849939 869523 889186 908008 925623 942739 960233 978311 996975 1016877
50545 1016877 1039049 1063999 1091519 1121306 1153454 1188475 1227125 1270160 1318027 1370786 1428376
50534 1428376 1490814 1558109 1630167 1706675 1786700 1868345 1949361 2028379 2105154 2179294 2249064
50523 2249064 2311796 2365152 2407642 2438239 2456041 2460362 2450833 2427454 2390792 2342135 2283236 2215965
50511 2215965 2142337 2064707 1985607 1907336 1831804 1760788 1696130 1639555 1592179 1554110 1524698
50500 1524698 1503403 1490487 1486676 1492201 1506393 1528164 1556494 1590316 1628146 1667827 1706230 1739198
50488 1739198 1762323 1772229 1767093 1746191 1709603 1658716 1596382 1526011 1450606 1372807 1295251 1220213
50476 1220213 1148997 1082155 1020160 963489 912258 866299 825574 790097 759546 733359 711168
50465 711168 692742 677648 665411 656065 649988 647063 646432 647319 649748 654200 660848 669460 679844 692038
50451 692038 706039 721638 738575 756580 774992 792462 807399 818883 827077 832696 836428 839061
50439 839061 841815 845888 851590 858352 865683 873657 882300 891058 899360 907418 916072 926030 937560 950657
50425 950657 965132 980672 997230 1015331 1035682 1058632 1084264 1112865 1144816 1180046 1217896
50414 1217896 1257479 1297866 1338012 1376970 1414186 1449245 1481363 1509508 1533008 1551507 1564123
50403 1564123 1569209 1565356 1552391 1531066 1502048 1465631 1422289 1372977 1318866 1261259 1202041 1143750
50391 1143750 1088633 1037651 990835 948608 912246 882765 859853 842449 830141 823419 822627 827295
50379 827295 836595 849840 866238 884626 903839 923023 941214 956902 968342 974118 973219 965001
50367 965001 949553 927918 901486 871244 837927 802715 767287 733151 701201 671801 644941
50356 644941 620290 597377 575858 555544 536308 518220 501722 487495 476069 467520 461341 456607
50344 456607 452653 449768 448862 450286 453355 457238 461788 467064 472662 478155 483804 490070 496617 502512
50330 502512 507303 511301 514918 518461 522530 527870 534689 542667 551609 561470 571631 580908 588545 594824
50316 594824 600544 606404 612979 620739 629790 639949 651253 664096 678899 696049 716084 739474
50304 739474 766367 797266 833930 878806 933243 996414 1065063 1132574 1188178 1219585 1219041 1187629
50292 1187629 1133635 1067336 997443 930571 871379 822087 782476 751000 726024 706420 691608
50281 691608 681231 674588 670599 668465 668052 669183 670985 672448 673373 674187 675057 675804 676550 677706 679244
50266 679244 680514 680954 680591 679782 678779 677607 676098 674097 671818 669898 668838 668601 669030 670357 672933
50251 672933 676722 681567 687685 695408 704800 716130 730355 748181 768697 789838 810251 829895
50239 829895 848795 866345 882286 897406 912529 927447 941433 954224 965757 975370 981956 984677
50227 984677 982944 976100 963818 946710 925972 902572 877304 851296 825652 800657 776107 752475
50215 752475 730913 711823 694195 676792 659397 642445 625924 609413 593007 577476 563404
50204 563404 550608 538513 526774 515390 504522 494461 485590 478142 471987 466799 462464 459219 457267
50191 457267 456257 455317 453784 451866 450383 449761 449461 448480 446236 442803 438563 433917 429243 424720 420148
50176 420148 415226 410076 405270 401201 397637 394063 390344 386968 384659 383727 383677 383561 382942 382384 382689 383773
50160 383773 384809 385514 386578 388494 390602 391787 391747 391015 390172 389677 390178 392117 395008 397834 400247 402814
50144 402814 406059 409971 414569 420239 427132 434851 443109 452187 462452 474004 487354 503888 524922
50131 524922 550433 579349 610988 645729 684212 726305 770851 816131 860484 902797 942607
50120 942607 979906 1014975 1048371 1080623 1111650 1140631 1166502 1188220 1204371 1213089 1212909 1203511
50108 1203511 1185334 1158929 1125305 1086582 1045440 1003769 962291 921418 881866 844319 809086
50097 809086 776305 746162 718732 693954 671845 652374 635037 619021 603969 590255 578342
50086 578342 568207 559616 552663 547689 544807 543670 543705 544560 546500 550272 556268 563836 571758 579441 587165
50071 587165 595110 602721 609351 615062 620355 625425 630109 634338 638147 641306 643392 644213 643899 642582 640294
50056 640294 637180 633582 629770 625700 621025 615351 608668 601677 595483 590706 587018 583751 580768 578381
50042 578381 576624 575129 573798 573152 573802 575905 579288 583755 588993 594453 599805 605356 611718 619034 626850
50027 626850 634681 642310 649477 655744 660985 665771 670870 676458 682118 687533 692790 697912 702547 706419
50013 706419 709911 713900 719071 725625 733605 743315 755320 770046 787297 806054 824873 842669 859121
50000 859121 874303 888133 900371 910892 919573 925903 929146 928944 925374 918177 906238 888268 863994
49987 863994 834549 801759 767230 732065 697170 663575 632371 604251 579204 556779 536682
49976 536682 518941 503381 489275 475796 462749 450548 439517 429496 420187 411524 403537 396165
49964 396165 389479 383827 379379 375670 372050 368639 366316 365542 365553 365046 363372 360724 357427 353615 349549
49949 349549 345716 342420 339623 337322 335725 334894 334491 334167 333972 334162 334785 335650 336591 337597 338751 340145
49933 340145 341708 343064 343740 343570 342708 341282 339421 337670 336819 337003 337427 337364 337034 337118 337825 338925 340315
49916 340315 341886 343035 342963 341387 338515 334570 329956 325620 322442 320181 317720 314413 310569 306719 303265
49901 303265 300920 300491 301718 303073 303272 302486 301675 301320 301310 301537 301924 302154 301869 301008 299701 298152 296904
49884 296904 296694 297661 299130 300540 302027 303597 304419 303765 302238 301173 300964 300810 299975 298536 296953 295694
49868 295694 295364 296510 298989 301951 304487 305981 306098 305120 304194 304473 305939 307673 309247 311022 313052
49853 313052 314723 315797 316857 318214 319228 319349 319055 319005 318907 318220 317479 317892 319740 322104 324133 325711
49837 325711 326734 326717 325496 323715 322161 321038 320184 319538 319015 318357 317644 317648 319145 321876 324659 326554 327624
49820 327624 328537 329830 331595 333510 334944 335319 334679 333779 333336 333301 333133 332626 332007 331160 329382 326319 322850
49803 322850 320413 319485 319175 318462 317350 316512 316179 315862 315133 314233 313775 314068 314845 315533 315700 315306 314581 313713
49785 313713 312710 311589 310601 310058 310045 310436 311185 312302 313461 313951 313317 311936 310678 309957 309436 308747 308177
49768 308177 308334 309333 310666 311928 313240 314807 316373 317489 318219 319175 320819 323042 325520 328135 330801
49753 330801 333120 334601 335166 335128 334689 333786 332580 331765 332085 333650 335966 338511 341030 343304 344967 345683
49737 345683 345356 344136 342441 341105 341151 343065 346324 349902 353203 356372 359851 363940 368637 373430 377163
49722 377163 378591 377412 374536 371251 368361 366222 365038 364641 364389 363914 363897 365493 368980 373485 378070
49707 378070 382472 386617 390114 392676 394607 396312 397618 398080 397793 397319 396948 396582 396428 397191 399344 402595
49691 402595 406385 410572 415335 420673 426467 432965 440749 450062 460202 469592 476401 479357 478415 474800
49677 474800 470249 466106 463064 461498 461668 463576 467005 471823 477896 484469 489906 492438 491165 486266
49663 486266 478506 468914 458768 449347 441470 435444 431469 429807 430521 433415 438351 445355 454358 465239
49649 465239 478285 493982 511615 528179 539431 542488 537437 526630 512870 498311 484377 471893
49637 471893 461053 451569 443156 435929 430306 426518 424252 422746 421234 419342 417238 415507 414804 415344
49623 415344 416645 417860 418499 418748 419084 419789 420925 422490 424306 425913 426896 427325 427663 428273 429252 430683
49607 430683 432716 435333 438234 441013 443319 444920 445930 446950 448635 450943 453125 454591 455535 456565
49593 456565 458032 459969 462373 465134 467846 470080 471865 473582 475335 476734 477443 477732 478314 479682 481700
49578 481700 483834 485712 487435 489339 491557 493903 496150 498275 500379 502542 504811 507191 509576 511847
49564 511847 514053 516233 517998 518664 518122 517272 517154 517828 518500 518660 518587 518761 519264 519909 520468 520584 519909 518707
49546 518707 517948 518406 519817 521274 522310 523257 524682 526901 530073 534439 540330 547980 557267 567418 577136
49531 577136 585439 592384 598703 604772 610381 615486 620507 625550 629870 632709 634376 635897 637718 639375
49517 639375 640450 641183 641843 642115 641597 640538 639500 638399 636461 633208 629014 624553 619993 615000 609279
49502 609279 602848 595933 588843 581922 575385 569177 563154 557399 552209 547665 543374 538816 533971 529541
49488 529541 526431 524988 524728 524788 524579 523981 523125 522220 521562 521411 521638 521666 520975 519622 518110 516816 515796
49471 515796 515074 514788 514934 515257 515604 516161 517028 517684 517304 515688 513613 512071 511389 511282 511504 512075 512880 513517
49453 513517 513757 513947 514679 516151 518063 520021 521847 523586 525535 528305 532454 537836 543521 548608 553029
49438 553029 557438 562535 568810 576661 586218 596804 606852 614613 619020 620016 618489 616003 614236 614212
49424 614212 615968 619000 622926 627648 633125 639272 646068 653507 661432 669579 677779 686061 694610 703673
49410 703673 713451 723921 734890 746329 758435 771150 783780 795533 806397 817113 828226 839537
49398 839537 850618 861432 872104 882350 891478 898903 904409 908005 909861 910359 909995 909047 907424 904943
49384 904943 901743 898405 895577 893446 891558 889271 886259 882540 878207 873496 868979 865257 862377 859981
49370 859981 858041 856935 856561 856024 854656 852876 851479 850444 849104 847224 845200 843241 841108 838719 836365
49355 836365 834164 831864 829432 827294 825766 824608 823396 821985 820429 818863 817621 817082 817154 817293 817189
49340 817189 817047 817042 817008 816919 817154 817899 818773 819440 820130 821085 821965 822374 822631 823333 824393 825137 825186 824746 824188 823893
49320 823893 824326 825637 827346 829074 831435 835475 841252 847766 854383 861515 869616 878280 886760 894726
49306 894726 901982 907840 911339 911905 909518 904526 897611 889608 881014 871837 862175 852565 843448 834629
49292 834629 825811 817389 810183 804429 799547 794937 790590 786847 783939 781984 781145 781555 783195 786018 790055
49277 790055 795184 800768 805773 809449 811873 813629 814966 815530 814969 813378 810800 806703 800579 792987 785374
49262 785374 778692 772724 766831 760766 754515 748010 741510 735762 731193 727311 723498 720030 717542 715646
49248 715646 712951 708659 703511 698885 695421 692744 690068 686731 682513 677935 674114 672011 671768 672910
49234 672910 675026 678001 681694 685697 689543 693033 696321 699733 703579 708084 713339 719224 725382 731387
49220 731387 737065 742671 748718 755677 763807 773170 783634 794859 806342 817622 828619 839825 852001
49207 852001 865390 879300 892750 905632 918862 933188 948103 962204 974472 984909 994155 1002871
49195 1002871 1011506 1020301 1029287 1038237 1046682 1054047 1060108 1065510 1071541 1079094 1087922 1097178 1106491 1116146
49181 1116146 1126404 1137088 1147841 1158356 1168357 1177792 1187114 1196931 1207224 1217375 1227079 1236828
49169 1236828 1247239 1258345 1269881 1281888 1294575 1307841 1321455 1335612 1350854 1367393 1384867
49158 1384867 1402767 1420804 1438803 1456545 1473853 1490631 1506729 1522022 1536745 1551520 1566751
49147 1566751 1582108 1596898 1610954 1624897 1639389 1654400 1669479 1684527 1699847 1715356 1730286
49136 1730286 1744103 1757403 1771398 1786612 1802636 1819201 1836802 1855988 1876644 1898513 1922107
49125 1922107 1948556 1978825 2013761 2054922 2104756 2165800 2239996 2328411 2430155 2540610 2651484
49114 2651484 2754641 2847403 2934234 3022083 3112324 3195714 3255186 3275529 3253192 3198375 3127469
49103 3127469 3052269 2974945 2891644 2799363 2699451 2596599 2496610 2405031 2325957 2260689 2207772
49092 2207772 2164966 2130990 2105051 2085461 2069774 2056338 2044922 2035654 2028053 2021473 2015880 2011593
49080 2011593 2008481 2005909 2003356 2000710 1998019 1995278 1992402 1989098 1984800 1979147 1972602 1966267 1960893 1956238
49066 1956238 1951502 1946155 1940197 1933865 1927351 1920732 1913956 1906904 1899592 1892276 1885154 1878015 1870396 1862110
49052 1862110 1853478 1844922 1836462 1827761 1818622 1809330 1800464 1792424 1785235 1778782 1773120 1768460 1764899 1762359
49038 1762359 1760879 1760820 1762546 1765909 1770243 1774922 1779754 1784785 1789933 1795007 1799982 1804986 1810025 1814873
49024 1814873 1819332 1823413 1827129 1830251 1832509 1834089 1835770 1838382 1842067 1846223 1850213 1854044 1858275 1863393
49010 1863393 1869490 1876457 1884171 1892427 1900945 1909676 1918897 1928767 1938841 1948221 1956231 1962850 1968621 1974275
48996 1974275 1980363 1987026 1994047 2001193 2008425 2015711 2022854 2029615 2035896 2041558 2046265 2049787 2052319 2054208
48982 2054208 2055492 2056042 2056027 2055797 2055399 2054702 2053954 2053620 2053563 2053033 2051717 2050307 2049710 2050176 2051535 2053753 2056754
48965 2056754 2060083 2063310 2066523 2069939 2073363 2076624 2080250 2084925 2090258 2094844 2097750 2099466 2101187 2103605
48951 2103605 2106654 2110018 2113504 2117062 2120663 2124172 2127272 2129677 2131464 2133057 2134944 2137518 2141165 2146250
48937 2146250 2152992 2161507 2171962 2184541 2199305 2216252 2235426 2256843 2280429 2306268 2334648 2365552
48925 2365552 2398298 2432127 2467075 2503768 2542428 2582576 2623721 2665894 2709364 2754280 2800578
48914 2800578 2847773 2894773 2940442 2984574 3027825 3070580 3112469 3153228 3193363 3233440 3273261
48903 3273261 3312282 3350418 3387775 3423882 3457961 3489940 3520692 3551184 3581767 3612243 3642150
48892 3642150 3670867 3697823 3722858 3746222 3768119 3788390 3806672 3822801 3837054 3849955 3861757
48881 3861757 3872086 3880327 3886412 3890822 3893622 3893936 3890864 3884594 3876034 3865469 3852268 3836006 3817175
48868 3817175 3796479 3773896 3748887 3721223 3691162 3658969 3624753 3588845 3551940 3514658 3477122
48857 3477122 3439174 3400840 3362432 3324258 3286529 3249587 3213956 3180073 3148080 3118003 3089983
48846 3089983 3064222 3040893 3020210 3002366 2987203 2974196 2963068 2954153 2947809 2943723 2941263 2940281
48834 2940281 2940983 2943188 2946485 2951092 2957689 2966209 2975640 2985408 2996155 3008644 3022581 3037179 3052270
48821 3052270 3068100 3084480 3100940 3117417 3134011 3150303 3165590 3179642 3192600 3204392 3214993
48810 3214993 3225123 3235831 3247382 3259195 3270757 3281827 3291863 3300219 3307098 3313467 3319754 3325431
48798 3325431 3330156 3334536 3339303 3344447 3349682 3355175 3361167 3367312 3372981 3378021 3382744 3387381 3391904 3396198
48784 3396198 3400090 3403449 3406457 3409523 3412692 3415469 3417417 3418555 3418865 3417963 3415693 3412660 3409520 3405979
48770 3405979 3400972 3393664 3383863 3371724 3357593 3342077 3325696 3308326 3289263 3267857 3243936 3217785
48758 3217785 3190069 3161607 3132856 3103621 3073485 3042377 3010503 2978058 2945475 2913709 2883650
48747 2883650 2855226 2827583 2800211 2773520 2748337 2725245 2704505 2686180 2670100 2655983 2643756
48736 2643756 2633573 2625504 2619418 2615281 2613283 2613584 2616030 2620176 2625494 2631601 2638351 2645490 2652148 2657046
48722 2657046 2659605 2660584 2661185 2661781 2662031 2661893 2661728 2661480 2660629 2659091 2657371 2655573 2653075 2649646 2646110 2643294
48706 2643294 2640868 2637868 2633966 2629557 2624972 2620386 2616373 2613813 2613140 2614070 2616051 2618593 2621350 2624433
48692 2624433 2628628 2634822 2643209 2653579 2666442 2683385 2706231 2736346 2774935 2823675 2884929 2961773
48680 2961773 3057904 3176931 3321175 3490803 3683436 3893261 4109627 4316893 4496672 4631378
48670 4631378 4707139 4715720 4656003 4534682 4365105 4164288 3949449 3735361 3533021 3349448
48660 3349448 3188150 3049600 2931730 2830996 2744041 2668701 2603596 2547218 2497933 2454602
48650 2454602 2416539 2382742 2351681 2322063 2293436 2265835 2239165 2213210 2188017 2163928 2141285
48639 2141285 2120260 2100829 2082671 2065174 2047784 2030424 2013503 1997521 1982656 1968650 1955011
48628 1955011 1941428 1928078 1915440 1903763 1892767 1882019 1871542 1861886 1853645 1846928 1841319 1836215
48616 1836215 1831175 1826017 1820759 1815559 1810689 1806376 1802576 1798996 1795475 1792243 1789671 1787808 1786339 1784932
48602 1784932 1783400 1781611 1779529 1777357 1775360 1773462 1771293 1768744 1766182 1763886 1761553 1758602 1754897 1750943
48588 1750943 1747397 1744480 1741798 1738619 1734451 1729473 1724376 1719794 1715990 1712958 1710531 1708302 1705853 1703122
48574 1703122 1700247 1696925 1692350 1686036 1678299 1669659 1660165 1649686 1638456 1626899 1615274 1603979 1593778
48561 1593778 1585099 1577293 1569296 1560836 1552386 1544096 1535599 1526801 1518088 1509630 1501285 1493291 1486203 1479901
48547 1479901 1473509 1466651 1459984 1453999 1448173 1441957 1435885 1430790 1426415 1421789 1416654 1411549 1406602 1401246
48533 1401246 1395267 1389306 1383966 1379031 1373891 1368334 1362585 1356929 1351598 1346752 1342278 1337765 1332884 1327645
48519 1327645 1322206 1316651 1311161 1306156 1301960 1298297 1294355 1289477 1283780 1278036 1272934 1268571 1264693 1261224
48505 1261224 1258267 1255641 1252874 1249819 1246865 1244249 1241520 1238124 1234270 1230707 1227815 1225459 1223624 1222575
48491 1222575 1222234 1221927 1221012 1219440 1217528 1215512 1213528 1211738 1210225 1208887 1207546 1205985 1203887 1201070 1197877
48476 1197877 1195003 1192791 1190949 1189087 1187149 1185186 1183148 1181228 1179981 1179558 1179094 1177371 1174073 1169947
48462 1169947 1165834 1161998 1158464 1155418 1152975 1150797 1148262 1144918 1140656 1135565 1129846 1123760 1117519 1111213
48448 1111213 1104903 1098728 1092904 1087656 1083205 1079618 1076538 1073168 1068847 1063685 1058495 1054015 1050358 1047207
48434 1047207 1044256 1041212 1037620 1033126 1027987 1022992 1018708 1015003 1011402 1007656 1003746 999610 995213 990809
48420 990809 986794 983267 979946 976519 972891 969065 965046 960904 956737 952523 948225 944104 940721 938465
48406 938465 937183 936361 935565 934592 933307 931557 929311 926837 924634 923076 922056 921000 919363 917060 914383
48391 914383 911604 908784 905909 903085 900597 898835 898000 897730 897127 895354 892163 887696 882019 875143 867424
48376 867424 859586 852365 846275 841520 837779 834243 830371 826588 823777 822086 820715 818850 816254 812968
48362 812968 809183 805605 803202 802134 801470 800430 799395 799226 800110 801704 803997 807309 811594 816398 821501
48347 821501 827121 833584 841176 850137 860290 870692 880092 887763 893686 898159 901664 904924 908586 912834
48333 912834 917605 923023 929250 936167 943606 951748 960893 971122 982693 996512 1013584 1034149 1057835
48320 1057835 1084385 1113694 1145558 1180332 1219664 1265693 1319529 1381330 1451800 1532824 1626857
48309 1626857 1736781 1866713 2022435 2211278 2442395 2726893 3077042 3506372 4031958
48300 4031958 4675478 5459447 6401885 7512305 8780046 10144833 11465903 12531296 13128013
48291 13128013 13135891 12577904 11595217 10376396 9092711 7866169 6765669 5817560 5021213
48282 5021213 4362795 3823170 3381460 3018176 2717926 2469365 2263239 2091560 1948108
48273 1948108 1828089 1727039 1640947 1567296 1504837 1452157 1407203 1368214 1334191 1304386 1278080
48262 1278080 1254988 1235150 1218252 1203652 1191089 1180646 1171902 1163867 1155970 1148500 1141875 1136050
48250 1136050 1130882 1126490 1122959 1120128 1117937 1116601 1116301 1117032 1118813 1121495 1124209 1125590 1124802 1121828 1116585
48235 1116585 1108498 1097497 1084821 1072042 1059543 1046582 1032703 1018457 1004733 991996 980267
48224 980267 969342 958804 948126 936959 925178 912570 898850 884174 869314 855017 841284
48213 841284 827601 813788 800263 787374 774846 762177 749374 736891 724899 713048 701089
48202 701089 689377 678512 668695 659719 651385 643622 636257 629008 621742 614602 607867 601762 596310 591225
48188 591225 586139 581010 576125 571563 567043 562640 559170 557232 556145 554572 552207 550068 548991 548607
48174 548607 548152 547590 547356 547431 547357 546994 546698 546734 546937 547082 547287 547878 548879 549793 550010 549468 548715 548156 547549
48155 547549 546609 545876 546346 548268 550942 553784 556912 560434 563866 566715 569119 571507 574105 577192 581239
48140 581239 586233 591340 595905 600325 605263 610446 615128 619381 623929 628760 632978 636189 639153 642736
48126 642736 646952 651381 655856 660223 663967 666646 668483 670174 672327 675277 679109 683588 688262 692847
48112 692847 697338 701657 705560 709016 712351 715791 719225 722645 726437 730921 735850 740659 745036 749026
48098 749026 752914 757252 762742 769637 777393 785236 792992 801023 809482 817948 825909 833456 841383 850507
48084 850507 860766 871045 880191 888211 896080 904311 912166 918610 923611 928085 932858 938124 943681 949164
48070 949164 954117 958288 961884 965196 967990 969596 969628 968356 966428 964495 963047 962276 962053 962173 962530 962876
48054 962876 962642 961427 959503 957451 955404 953130 950706 948438 946058 942688 937852 931973 925597 918700
48040 918700 911189 903514 896176 888948 881193 872741 863924 854914 845626 836195 826881 817509 807642 797440
48026 797440 787684 778603 769348 759137 748477 738618 730054 722248 714713 707644 701326 695587 690194 685321
48012 685321 681154 677332 673193 668450 663272 657911 652668 648079 644553 641709 638542 634419 629576 624513
47998 624513 619354 614183 609472 605594 602108 598145 593559 589117 585400 581997 578117 573619 569057 564908
47984 564908 561166 557643 554190 550563 546366 541375 535800 530130 524785 519965 515638 511516 507183 502475
47970 502475 497747 493595 490291 487521 484706 481510 478121 475114 472989 471725 470790 469735 468680 468059 467963
47955 467963 468043 468107 468444 469432 471102 473380 476396 480247 484638 489185 493970 499444 505871 513212 521466 530604
47939 530604 540186 549542 558466 567298 576238 585090 593812 602680 611557 619577 626096 631493 636412 640644
47925 640644 643482 644930 645730 646172 645720 644003 641540 639140 636991 634688 631796 628152 623913 619507 615311
47910 615311 611239 606905 602256 597711 593599 589936 586920 585066 584511 584638 584828 585197 586180 587765 589701
47895 589701 592152 595547 599924 604986 610605 616692 622718 628072 632919 638013 643563 648978 653931 659011
47881 659011 664872 671241 677230 682295 686499 690055 693030 695311 696634 696823 696196 695412 694669 693386 690939
47866 690939 687293 682530 676243 668050 658466 648563 638829 628993 618896 608857 599074 589294 579395 569750
47852 569750 560708 552117 543656 535368 527593 520627 514652 509707 505571 501966 498997 497034 496015 495329
47838 495329 494690 494631 495741 497815 500236 502803 505638 508667 511864 515788 520999 526996 532567 537338 542197
47823 542197 547852 553738 558884 563291 567722 572429 576830 580390 583202 585602 587680 589390 590765 591764
47809 591764 592114 591613 590511 589432 588922 589203 590266 591992 594152 596495 598956 601651 604577 607534 610558
47794 610558 614216 619113 625186 631941 639357 647941 657646 667286 675558 682242 687883 692701 696517 699530
47780 699530 702272 704719 706257 706698 706603 706278 705187 702853 699714 696504 693177 689140 684263 679033 673859
47765 673859 668814 663972 659406 654839 649779 644145 638398 632948 627741 622500 617107 611704 606616 602197
47751 602197 598513 595240 592144 589629 588483 589046 590827 592930 594647 595826 597089 599584 604086 610243
47737 610243 617149 624634 633387 643701 654781 665736 676651 688071 699854 711319 722444 734076
47725 734076 746676 759359 770548 779237 785345 789198 791201 791956 792105 791687 789977 786264 780748 774287
47711 774287 767275 759181 749357 737946 725674 713085 700449 688249 677138 667306 658295 649680 641588
47698 641588 634328 627829 621763 616013 610850 606808 604531 604385 605939 608161 610534 613712 618628 625203
47684 625203 632594 640584 649944 661171 673607 686232 698809 711576 724215 735926 746528 756786
47672 756786 767347 777796 787022 794147 798896 801428 802247 802062 801208 799236 795395 789546 782218 773801
47658 773801 764112 752888 740340 726989 713274 699608 686507 674247 662534 650939 639631 629317
47646 629317 620416 612643 605515 598903 592908 587461 582380 577715 573764 570756 568626 567153 566229 565929 566275
47631 566275 566916 567123 566270 564352 561857 559081 555759 551452 546161 540300 534194 527836 521236 514775 509019
47616 509019 504153 499761 495267 490584 486182 482453 479178 475828 472324 469200 466945 465411 464063 462589
47602 462589 461008 459316 457343 455065 452797 450974 449818 449256 449020 448772 448272 447553 446852 446321 445860 445331
47586 445331 444773 444213 443321 441557 438773 435504 432464 429853 427338 424627 421862 419406 417530 416377 415952
47571 415952 415866 415247 413285 409997 406228 402817 399922 397193 394363 391404 388291 385024 381885 379376 377669
47556 377669 376259 374434 372033 369579 367597 365985 364150 361680 358786 356065 353881 352043 350074 347768
47542 347768 345323 342927 340441 337749 335234 333440 332271 331001 329274 327617 326613 326029 325321 324628 324523
47527 324523 324890 324843 323871 322395 321045 320089 319820 320703 322578 324326 325026 325056 325465 326624 328124 329683 331320
47510 331320 332771 333537 333612 333561 333814 334397 335336 336639 337805 338075 337402 336644 336486 336736 336965 337274 337970 338900
47492 338900 339609 339988 340383 341183 342538 344338 346300 348258 350393 352911 355520 357728 359780 362652 366740
47477 366740 371113 374590 377111 379464 382071 384722 387320 390138 393296 396577 399806 402956 405769 407747
47463 407747 408721 409157 409763 410964 412756 414848 416923 418884 420830 422668 423978 424519 424668 424974 425475 425902
47447 425902 426434 427626 429512 431363 432621 433701 435537 438573 442412 446306 449810 453065 456595 460788
47433 460788 465592 470830 476634 483270 490575 498002 505233 512363 519366 525853 531663 537329 543544 550339
47419 550339 557131 563395 568928 573553 576963 578978 579642 578967 576779 572978 567849 561897 555415 548352 540664
47404 540664 532602 524521 516515 508522 500766 493689 487302 481001 474418 468164 463245 459916 457644 456147
47390 456147 455750 456512 457653 458356 458758 459755 462132 466282 472353 480010 488230 496064 503686 512051 521388
47375 521388 530681 538980 546600 554397 562248 569009 573881 577081 579034 579635 578668 576417 573249 568869 562620
47360 562620 554458 545111 535219 524829 513871 502635 491551 480832 470604 461008 451876 442604 432702
47347 432702 422330 412046 402255 393169 384981 377611 370564 363565 357205 352395 349166 346614 344079 341777
47333 341777 340039 338582 336983 335480 334754 335037 335922 337086 338829 341688 345645 349905 353522 356189 358329
47318 358329 360480 362861 365521 368528 371568 373698 374105 373139 372087 371755 371726 371133 369731 367925 366119 364373
47302 364373 362502 360215 357359 354177 351228 348948 347467 346855 347167 348142 349292 350485 352041 354066 356168
47287 356168 358150 360531 363902 368115 372591 377119 381895 387073 392864 399828 408387 418049 427674 436558
47273 436558 444862 453038 461397 470225 479779 489962 500393 510922 521746 532952 544298 555414
47261 555414 565807 574586 580693 583602 583522 580830 575720 568489 559752 550222 540563 531551 523866 517479
47247 517479 511657 505799 499876 493940 487824 481775 476788 473641 471864 470334 468739 467765 467853 468447 468758
47232 468758 468800 469333 471050 474079 478187 483167 489002 495751 503350 511543 520062 528796 537731 546813 555998
47217 555998 565358 574999 584785 594221 602653 609569 614788 618416 620578 621230 620347 618261 615525 612277 607991
47202 607991 602097 594738 586658 578464 570262 562032 554060 546884 540916 536173 532313 528958 526037 523823
47188 523823 522580 522231 522457 523041 524105 526119 529764 535559 543469 552975 563645 575481 588595 602793
47174 602793 617694 633012 648434 663530 678203 693015 708472 724084 738686 751710 763494
47163 763494 774196 783155 789776 794449 797930 800145 800268 797913 793658 788287 782035 774742 766442 757506
47149 757506 748368 739326 730567 722217 714331 706860 699697 692766 686053 679474 672787 665856 659071 653275
47135 653275 649072 646270 644204 642586 641853 642610 644831 647702 650289 652404 654728 657991 662157 666624 671123
47120 671123 676038 681731 687985 694404 700973 707651 713616 717503 718525 717029 713793 709125 702842 694911
47106 694911 685808 676206 666412 656148 644930 632722 620170 608060 596589 585274 573613 561725
47094 561725 550361 540329 531831 524303 516975 509639 502696 496457 490744 485390 480775 477451 475421 474255
47080 474255 473804 474250 475450 476781 477871 479103 481143 484199 487921 491738 495186 498159 501100 504702 509174
47065 509174 513938 518186 521589 524394 527040 529837 532842 535824 538489 540816 543045 545271 547264 548793
47051 548793 549983 551186 552667 554461 556406 558294 560139 562277 564955 567962 571044 574527 578957 584052
47037 584052 588703 592313 595582 599550 604387 609503 614419 619037 623502 628310 634165 641122 648187 654351
47023 654351 659844 665705 672332 679096 685348 691166 697031 703268 709823 716196 721638 725850 729359 732746
47009 732746 735715 737550 738287 738611 738631 737619 735192 731929 728473 724758 720676 716872 714255 712948 712233
46994 712233 711360 710078 708572 707225 706317 705763 705291 704990 705421 707008 709568 712595 715770 719104 722873 727528
46978 727528 733338 739954 746630 752998 759327 765879 772499 779068 785911 793410 801470 809676 817652 825013
46964 825013 831312 836391 840570 844286 847760 851158 854579 857622 859476 859902 859757 860042 860788 861375 861566 861635
46948 861635 861748 861859 862096 862653 863363 863900 864400 865412 867260 869874 873115 876794 880451 883690 886744 890274
46932 890274 894552 899281 904154 909126 914141 919112 924226 929737 935406 940721 945866 951831 959244 967542
46918 967542 975688 983319 990813 998543 1006486 1014326 1021468 1027039 1030342 1031422 1030877 1029026 1025539 1020039
46904 1020039 1012957 1005484 998643 992593 987018 982051 978427 976703 976766 978330 981577 986872 994135 1002950
46890 1002950 1013219 1025203 1038883 1053691 1068983 1084464 1100088 1115827 1131571 1146920 1161073
46879 1161073 1173217 1183194 1191494 1198637 1204793 1209976 1214172 1217237 1219140 1220444 1222110 1224624 1227743 1231253
46865 1231253 1235495 1240754 1246606 1252435 1258456 1265713 1275022 1286221 1298434 1310781 1322784 1334353 1345559
46852 1345559 1356348 1366423 1375393 1382990 1389147 1393921 1397291 1398990 1398659 1396379 1392887 1388950 1384539 1378983
46838 1378983 1371917 1363659 1354606 1344837 1334592 1324686 1315986 1308727 1302680 1297758 1294054 1291497 1290008 1289917
46824 1289917 1291779 1295649 1300963 1307316 1315059 1324838 1336647 1349637 1362970 1376704 1391609 1408092
46812 1408092 1425522 1442717 1458852 1473592 1486600 1497485 1506277 1513361 1518692 1521552 1521443 1518868 1514824
46799 1514824 1509712 1503193 1494975 1485383 1475206 1465251 1455967 1447194 1438344 1428999 1419308 1409724 1400674 1392714
46785 1392714 1386638 1382908 1381150 1380611 1380999 1382416 1384616 1386962 1389165 1391528 1394296 1397312 1400550 1404440
46771 1404440 1409235 1414404 1419133 1423323 1427656 1432710 1438380 1444283 1450401 1457065 1464373 1471945 1479459 1487334
46757 1487334 1496572 1507792 1520600 1534120 1547949 1562270 1577105 1591875 1605854 1618807 1630962
46746 1630962 1642567 1653612 1663849 1672875 1680257 1685751 1689434 1691652 1692877 1693589 1694095 1694347 1694071 1693167
46732 1693167 1691898 1690592 1689270 1687729 1685953 1684328 1683516 1684182 1686754 1691261 1697367 1704669 1712949 1722110
46718 1722110 1731892 1741842 1751592 1761048 1770128 1778403 1785150 1789847 1792521 1793541 1793111 1790987 1786577 1779231
46704 1779231 1768614 1755018 1739297 1722243 1703971 1684122 1662742 1640691 1618947 1597642 1576027
46693 1576027 1553361 1529655 1505561 1481776 1458601 1435933 1413509 1391219 1369299 1348322 1328909
46682 1328909 1311307 1295139 1279734 1264830 1250855 1238288 1226887 1215956 1205371 1195868 1188068 1181654
46670 1181654 1175882 1170553 1166033 1162535 1160009 1158729 1159480 1162891 1168762 1176134 1183913 1191518 1199139 1207359
46656 1207359 1216323 1225452 1234159 1242588 1251212 1259861 1267696 1274102 1278997 1282196 1283175 1281735 1278396 1273784
46642 1273784 1268150 1261867 1255895 1251130 1247547 1244509 1241765 1239725 1238947 1239867 1242913 1248351 1256028 1265705
46628 1265705 1277660 1292468 1310042 1329330 1349146 1368958 1388661 1407928 1426137 1442770 1457575
46617 1457575 1470283 1480365 1487160 1490281 1489886 1486461 1480284 1471232 1459287 1445006 1429173 1412094 1393744
46604 1393744 1374620 1355855 1338193 1321266 1304362 1287605 1271867 1257621 1244437 1231681 1219232
46593 1219232 1207330 1196139 1185804 1176643 1168829 1161907 1155050 1147872 1140735 1134118 1127981 1121915 1115685
46580 1115685 1109334 1102874 1096241 1089506 1082824 1076141 1069356 1062888 1057667 1054237 1052072 1050180 1048209 1046611
46566 1046611 1045847 1045974 1046975 1048939 1051652 1054421 1056656 1058425 1060187 1062204 1064514 1067241 1070589 1074567
46552 1074567 1078994 1083740 1088759 1093995 1099515 1105612 1112482 1119792 1126930 1133707 1140548 1147961 1156155 1165302
46538 1165302 1175772 1187782 1200942 1214444 1227713 1240823 1254385 1269145 1285570 1303651 1323132
46527 1323132 1343971 1366398 1390458 1415706 1441619 1468212 1496003 1525327 1555769 1586256 1615648
46516 1615648 1643376 1669654 1694989 1719373 1742021 1762022 1779061 1793346 1805079 1814386 1821601 1827101
46504 1827101 1830737 1831865 1830207 1826486 1821970 1817541 1813287 1808784 1803593 1797585 1790995 1784067 1776674 1768505
46490 1768505 1759672 1750772 1742054 1732850 1722239 1710050 1696741 1682386 1666374 1648182 1627932 1605914
46478 1605914 1582077 1556374 1529266 1501353 1472679 1442916 1412263 1381635 1351848 1323058 1295201
46467 1295201 1268610 1243775 1220763 1199357 1179729 1162530 1148257 1136931 1128556 1123470 1121852 1123101
46455 1123101 1126161 1130565 1136808 1145565 1156685 1169110 1181653 1193771 1205627 1217555 1229509 1241012
46443 1241012 1251515 1260673 1268227 1273896 1277587 1279613 1280375 1279826 1277535 1273406 1268072 1262404 1256862 1251567
46429 1251567 1246794 1242998 1240363 1238659 1237700 1237759 1239406 1243056 1248803 1256574 1266306 1277992 1291734 1307840
46415 1307840 1326755 1348752 1373531 1400160 1427533 1455063 1483021 1512151 1542921 1575145 1608233
46404 1608233 1641662 1675059 1707987 1739865 1770148 1798408 1824105 1846487 1864882 1879052 1889075
46393 1889075 1894971 1896674 1894346 1888408 1879201 1866878 1851764 1834465 1815420 1794634 1772193 1748814
46381 1748814 1725493 1702767 1680774 1659908 1640901 1624148 1609462 1596673 1586091 1578138 1572952 1570634
46369 1570634 1571607 1576319 1584729 1596482 1611536 1630333 1653299 1680357 1711006 1744821 1781843 1822451
46357 1822451 1866777 1914335 1964413 2016722 2071254 2127436 2183960 2239692 2294281 2347412 2397764
46346 2397764 2443378 2482987 2516454 2543880 2564759 2578218 2583758 2581562 2572174 2555961 2532843 2502633
46334 2502633 2465849 2424016 2378866 2331371 2281890 2231103 2180235 2130292 2081601 2034320 1988973
46323 1988973 1946234 1906607 1870656 1839092 1812184 1789254 1769340 1752324 1739068 1730430 1726480 1726671
46311 1726671 1730361 1737049 1746392 1758250 1772585 1789210 1807777 1828190 1850781 1875754 1902492 1929783
46299 1929783 1956865 1984061 2012124 2041115 2070192 2098398 2125274 2150535 2173548 2193539 2210234
46288 2210234 2223895 2234625 2241937 2245227 2244510 2240430 2233568 2223987 2211554 2196523 2179553 2161107 2141166
46275 2141166 2119806 2097951 2077151 2058476 2041867 2026743 2012943 2000895 1991122 1983923 1979337 1977023
46263 1977023 1976210 1976227 1977187 1979802 1984412 1990519 1997391 2004774 2012740 2021098 2029366 2037226 2044640 2051486 2057294
46248 2057294 2061468 2063604 2063461 2060745 2055138 2046652 2035818 2023338 2009533 1994276 1977477 1959349 1940100
46235 1940100 1919671 1898191 1876482 1855633 1835962 1816779 1797334 1777682 1758420 1739933 1722204
46224 1722204 1705234 1689190 1674132 1659825 1645961 1632560 1620144 1609523 1601250 1595169 1590537 1586660
46212 1586660 1583384 1581016 1579976 1580614 1583092 1587160 1592160 1597557 1603514 1610697 1619391 1628924 1638108 1646227
46198 1646227 1653506 1660714 1668425 1676726 1685455 1694400 1703151 1711010 1717494 1722948 1728336 1734187 1739987 1744871
46184 1744871 1748720 1752232 1755905 1759431 1762232 1764314 1766307 1768863 1772358 1777044 1783029 1789976 1797210 1804374
46170 1804374 1811812 1820076 1829257 1839129 1849664 1861026 1873118 1885603 1898387 1911623 1925157 1938474
46158 1938474 1951398 1964364 1977712 1991196 2004553 2017996 2031545 2044303 2055217 2064485 2073391 2082690
46146 2082690 2091860 2100132 2107517 2114396 2120598 2125521 2129042 2131888 2134987 2138553 2141839 2143799 2144076 2143211
46132 2143211 2141779 2139626 2136402 2132626 2129595 2128135 2128057 2128928 2130710 2133193 2135328 2135613 2132873 2126373 2115611
46117 2115611 2100625 2082342 2062200 2041489 2021328 2002967 1987431 1974804 1964124 1954155 1944164 1934177
46105 1934177 1924826 1916915 1910874 1906427 1902816 1899223 1895077 1890306 1885475 1881373 1878184 1875326 1872351 1869609
46091 1869609 1867614 1866056 1864087 1861506 1859161 1858123 1858855 1861212 1864834 1869315 1874304 1879596 1885058 1890442
46077 1890442 1895424 1899849 1903855 1907805 1912166 1917225 1922802 1928477 1934296 1940935 1948827 1957387 1965659 1973522
46063 1973522 1981754 1990958 2001075 2011955 2023816 2036839 2050790 2065305 2080223 2095416 2110610 2125670
46051 2125670 2140824 2156370 2172332 2188578 2205056 2221667 2238043 2253665 2268182 2281561 2294047
46040 2294047 2306005 2317537 2328152 2337078 2344163 2350302 2356722 2363855 2371089 2377563 2382972 2387566 2391538
46027 2391538 2394697 2396766 2397875 2398490 2398811 2398458 2396940 2394307 2391144 2388004 2384974 2381690 2377605 2372371 2366217
46012 2366217 2359909 2354080 2348721 2343536 2338629 2334378 2330698 2326947 2322676 2318073 2313468 2308874 2304266 2300003
45998 2300003 2296575 2294065 2292162 2290610 2289458 2288947 2289296 2290464 2291992 2293218 2293777 2293813 2293583 2293001 2291700 2289398
45982 2289398 2286111 2282154 2278049 2274209 2270532 2266483 2261756 2256682 2251783 2247149 2242593 2238256 2234648 2232072
45968 2232072 2230377 2229327 2228926 2229227 2230084 2231333 2233033 2235341 2238308 2242083 2247186 2254145 2262715 2271770 2280269
45953 2280269 2288148 2296087 2304588 2313685 2323405 2333931 2345113 2356331 2367290 2378616 2391169 2404891
$$ [...]
##END NTUPLES=NMR SPECTRUM
##END=
