##TITLE=NES1065_159122.0003_002_9705170_9dfmSsBsMY
##JCAMPDX= 6.0         $$ Bruker NMR JCAMP-DX V2.0
##DATA TYPE= NMR SPECTRUM
##DATA CLASS= NTUPLES
##ORIGIN= BRUKER
##OWNER= Administrator
$$ 1.72 TOPSPIN		Version 2.1
$$ 2016-05-01 20:14:05.333 -0700  Administrator@X
$$ Compression mode = diff/dup
##.OBSERVE FREQUENCY= 400.02188249412
##.OBSERVE NUCLEUS= ^1H
##.ACQUISITION MODE= SIMULTANEOUS (DQD)
##.ACQUISITION SCHEME= undefined
##.AVERAGES= 64
##.DIGITISER RES= 22
##SPECTROMETER/DATA SYSTEM= spect
##.PULSE SEQUENCE= noesygpps1d.comp
##.SOLVENT NAME= COFFEE_meoh
##.SHIFT REFERENCE= INTERNAL, COFFEE_meoh, 1, 14.96194
##AUDIT TRAIL= $$ (NUMBER, WHEN, WHO, WHERE, PROCESS, VERSION, WHAT)
$$ ##TITLE= Audit trail, TOPSPIN		Version 2.1
$$ ##JCAMPDX= 5.01
$$ ##ORIGIN= Bruker BioSpin GmbH
$$ ##OWNER= Administrator
$$ $$ E:\/data/COFFEE/nmr/NES1065_159122.0003_002_9705170_9dfmSsBsMY/12/pdata/1/auditp.txt
$$ ##AUDIT TRAIL=  $$ (NUMBER, WHEN, WHO, WHERE, PROCESS, VERSION, WHAT)
(   1,<2016-05-01 20:14:00.458 -0700>,<Administrator>,<X>,<go>,<TOPSPIN 2.1>,
      <created by zg
	started at 2016-05-01 20:02:30.864 -0700,
	POWCHK enabled, PULCHK disabled,
       configuration hash MD5:
       21 0F 79 D6 B3 7B B4 F6 88 20 88 DB 03 48 BD 9F
       data hash MD5: 64K
       2F 0A 51 01 86 73 B9 6D C2 85 C4 93 2F A7 A8 5D>)
(   2,<2016-05-01 20:14:03.599 -0700>,<Administrator>,<X>,<proc1d>,<TOPSPIN 2.1>,
      <Start of raw data processing
       efp LB = 0.3 FT_mod = 6 PKNL = 1 PHC0 = 0 PHC1 = 0 SI = 128K 
       data hash MD5: 128K
       12 78 F7 60 63 F7 0D 70 97 17 9B A5 9C A8 C5 08>)
(   3,<2016-05-01 20:14:04.458 -0700>,<Administrator>,<X>,<proc1d>,<TOPSPIN 2.1>,
      <pk PHC0 = -83.86963 PHC1 = 0 
       data hash MD5: 128K
       1E B6 CA 0D EA 71 ED 38 75 7B E6 85 F9 E4 0C 4E>)
(   4,<2016-05-01 20:14:04.833 -0700>,<Administrator>,<X>,<proc1d>,<TOPSPIN 2.1>,
      <abs ABSG = 1 
       data hash MD5: 128K
       A4 51 65 68 BC BD 70 F0 47 F2 68 0A B9 E4 8D FE>)
(   5,<2016-05-01 20:14:04.927 -0700>,<Administrator>,<X>,<proc1d>,<TOPSPIN 2.1>,
      <abs ABSG = 2 
       data hash MD5: 128K
       BD E0 D7 09 F0 18 7E 84 1D 34 94 BA 12 EB FC 73>)
(   6,<2016-05-01 20:14:05.021 -0700>,<Administrator>,<X>,<proc1d>,<TOPSPIN 2.1>,
      <abs ABSG = 3 
       data hash MD5: 128K
       F9 BE 12 8D 5E B5 BC B0 59 6A 9C 64 07 44 55 FC>)
(   7,<2016-05-01 20:14:05.099 -0700>,<Administrator>,<X>,<proc1d>,<TOPSPIN 2.1>,
      <abs ABSG = 4 
       data hash MD5: 128K
       62 5C 32 1B DA 8F 86 7E CF DA 91 E6 E4 FE B5 2C>)
(   8,<2016-05-01 20:14:05.177 -0700>,<Administrator>,<X>,<proc1d>,<TOPSPIN 2.1>,
      <abs ABSG = 5 
       data hash MD5: 128K
       70 E5 B7 73 8C AB E8 91 1E 0E CF E9 F6 80 A7 DE>)
$$ ##END=
$$ 
$$ $$ hash MD5
$$ $$ 45 9B E0 FF 85 38 30 E3 11 74 6A C1 67 49 D0 4E
##$RELAX= 
##$RELAX= 
##$RELAX= 
##$RELAX= 
##$RELAX= 
##$RELAX= 
##$RELAX= 
##$RELAX= 
$$ Bruker specific parameters
$$ --------------------------
##$DU= <E:\>
##$EXPNO= 12
$$ [...]
##$TP07= 0
##$TPNAME0= <>
##$TPNAME1= <>
##$TPNAME2= <>
##$TPNAME3= <>
##$TPNAME4= <>
##$TPNAME5= <>
##$TPNAME6= <>
##$TPNAME7= <>
##$TPOAL= (0..7)
0.5 0.5 0.5 0.5 0.5 0.5 0.5 0.5
##$TPOFFS= (0..7)
0 0 0 0 0 0 0 0
##$TUNHIN= 0
##$TUNHOUT= 0
##$TUNXOUT= 0
##$USERA1= <user>
##$USERA2= <user>
##$USERA3= <user>
##$USERA4= <user>
##$USERA5= <user>
##$V9= 5
##$VALIST= <valist>
##$VCLIST= <CCCCCCCCCCCCCCC>
##$VD= 0
##$VDLIST= <DDDDDDDDDDDDDDD>
##$VPLIST= <PPPPPPPPPPPPPPP>
##$VTLIST= <TTTTTTTTTTTTTTT>
##$WBST= 2048
##$WBSW= 25
##$XGAIN= (0..3)
0 0 0 0
##$XL= 0
##$YL= 0
##$YMAX_a= 5085597
##$YMIN_a= -10452478
##$ZGOPTNS= <>
##$ZL1= 120
##$ZL2= 120
##$ZL3= 120
##$ZL4= 120
##$ABSF1= 14.96194
##$ABSF2= -5.596242
##$ABSG= 5
##$ABSL= 3
##$ALPHA= 0
##$AQORDER= 0
##$ASSFAC= 0
##$ASSFACI= 0
##$ASSFACX= 0
##$ASSWID= 0
##$AUNMP= <proc_prof1d_extract.lims>
##$AXLEFT= 0
##$AXNAME= <>
##$AXNUC= <1H>
##$AXRIGHT= 0
##$AXTYPE= 0
##$AXUNIT= <>
##$AZFE= 0.1
##$AZFW= 0.1
##$BCFW= 0
##$BC_mod= 0
##$BYTORDP= 0
##$COROFFS= 0
##$CY= 15
##$DATMOD= 1
##$DC= 0
##$DFILT= <>
##$DTYPP= 0
##$F1P= 0
##$F2P= 0
##$FCOR= 0.5
##$FTSIZE= 131072
##$FT_mod= 6
##$GAMMA= 0
##$GB= 0
##$INTBC= 1
##$INTSCL= 1
##$ISEN= 128
##$LB= 0.3
##$LEV0= 0
##$LPBIN= 0
##$MAXI= 10000
##$MC2= 0
##$MEAN= 0
##$ME_mod= 0
##$MI= 0
##$NCOEF= 0
##$NC_proc= -2
##$NLEV= 6
##$NOISF1= 0
##$NOISF2= 0
##$NSP= 0
##$NTH_PI= 0
##$NZP= 0
##$OFFSET= 14.96194
##$PC= 1
##$PHC0= -83.86963
##$PHC1= 0
##$PH_mod= 1
##$PKNL= yes
##$PPARMOD= 0
##$PPDIAG= 0
##$PPIPTYP= 0
##$PPMPNUM= 2147483647
##$PPRESOL= 1
##$PSCAL= 4
##$PSIGN= 0
##$PYNMP= <proc.py>
##$REVERSE= no
##$SF= 400.020009259793
##$SI= 131072
##$SIGF1= 0
##$SIGF2= 0
##$SINO= 400
##$SIOLD= 131072
##$SPECTYP= <>
##$SREGLST= <1H.CDCl3>
##$SSB= 0
##$STSI= 131072
##$STSR= 0
##$SW_p= 8223.68421052631
##$SYMM= 0
##$S_DEV= 0
##$TDeff= 65536
##$TDoff= 0
##$TI= <>
##$TILT= no
##$TM1= 0
##$TM2= 0
##$TOPLEV= 0
##$USERP1= <user>
##$USERP2= <user>
##$USERP3= <user>
##$USERP4= <user>
##$USERP5= <user>
##$WDW= 1
##$XDIM= 131072
##$YMAX_p= 330664594
##$YMIN_p= -11542
##$CURPLOT= <Network HP LaserJet P1505>
##$CURPRIN= <$Network HP LaserJet P1505>
##$DFORMAT= <normdp>
##$LAYOUT= <+/1D_H.xwp>
##$LFORMAT= <normlp>
##$PFORMAT= <normpl>
##$SURQMSG= 1
$$ End of Bruker specific parameters
$$ ---------------------------------
##NTUPLES= NMR SPECTRUM
##VAR_NAME=  FREQUENCY,     SPECTRUM/REAL,   SPECTRUM/IMAG
##SYMBOL=    X,             R,               I
##VAR_TYPE=  INDEPENDENT,   DEPENDENT,       DEPENDENT
##VAR_FORM=  AFFN,          ASDF,            ASDF
##VAR_DIM=   131072,        131072,          131072
##UNITS=     HZ,            ARBITRARY UNITS, ARBITRARY UNITS
##FACTOR=    0.0627417313425164, 1,          1
##FIRST=     8223.62146879497, -2108,        -47302
##LAST=      0,             216,             -47945
##MIN=       0,             -11542,          0
##MAX=       8223.62146879497, 330664594,    0
$$ Real data points
##PAGE= N=1
##DATA TABLE= (X++(R..R)), XYDATA
$$ [...]
67783 43276 44026 45499 47331 48731 49302 49581 50375 51628 52455 52367 51923 51915 52378 52755 52738 52496 52190 51681 50760
67764 50760 49454 48060 46992 46543 46655 46891 46762 46153 45454 45242 45705 46384 46591 46218 45960 46542 47837 49086
67746 49086 49875 50474 51244 52194 53217 54258 54970 54664 53093 51005 49503 48960 48917 48882 48790 48719 48604 48330 47848
67727 47848 47098 46049 44851 43774 42952 42380 42103 42162 42317 42166 41705 41548 42313 43901 45568 46701 47333
67710 47333 47910 48770 49957 51340 52677 53618 53923 53771 53631 53735 53925 54118 54581 55473 56421 57017 57455 58096
67692 58096 58609 58309 57441 57290 58600 60594 62037 62721 63290 64048 64727 65139 65341 65224 64572 63540 62558 61752
67674 61752 60904 59936 58983 58073 57258 56950 57498 58446 58870 58544 58146 58153 58272 58207 58269 58716 59105 58854 58101 57485
67654 57485 57363 57736 58628 60018 61523 62638 63234 63548 63878 64594 66089 68228 70090 70832 70732 70889 71965
67637 71965 73692 75507 77060 78065 78286 77881 77342 76918 76536 76373 76927 78256 79725 80927 82382 84751
67621 84751 87666 89936 90808 90514 89640 88533 87346 86129 84640 82482 79705 76999 75077 74047 73531
67606 73531 73102 72379 70960 68723 66110 63797 62076 60788 59808 59241 59062 58955 58664 58279 57987 57776 57622
67589 57622 57798 58651 60092 61548 62469 62707 62450 62016 61762 61931 62402 62730 62577 62043 61488 61136 60983 60971 61042
67570 61042 61000 60569 59685 58616 57679 56864 55876 54621 53583 53605 55132 57595 59639 60174 59334 58289 57999
67553 57999 58294 58318 57727 57027 56709 56499 55854 54916 54456 54895 55794 56406 56406 55969 55472 55306 55633 56082 55903 54720
67533 54720 52976 51457 50562 50286 50608 51455 52417 52964 53044 53135 53674 54684 55953 57243 58250 58668 58463 57887
67515 57887 57160 56319 55460 54889 54881 55429 56258 56947 57064 56449 55459 54757 54779 55506 56680 58018 59213 60074 60736
67496 60736 61495 62364 63095 63598 63972 64056 63455 62250 61219 60975 61226 61277 60967 60690 60712 60944 61250 61555 61683
67477 61683 61522 61372 61755 62855 64409 66136 67915 69549 70732 71442 72026 72735 73398 73773 74042 74695 75937
67460 75937 77360 78232 78089 77065 75714 74575 73980 74177 75320 77152 78942 80012 80295 80169 79879 79413
67444 79413 78889 78621 78668 78591 77872 76497 74998 73980 73627 73582 73301 72596 71822 71413 71315 71079 70477 69767 69346
67425 69346 69385 69856 70589 71179 71138 70383 69403 68708 68261 67716 67077 66831 67431 68917 70990 73201 74998 75928
67407 75928 75972 75525 74852 73770 72136 70478 69718 70185 71269 72172 72667 72865 72637 71801 70787 70451 71047 71778
67389 71778 71669 70601 69283 68510 68708 69889 71588 73004 73634 73782 74137 74920 75761 76377 76909 77498 77929
67372 77929 77957 77761 77770 78146 78628 78839 78619 78086 77528 77276 77582 78481 79667 80597 80907 80823 80967 81610 82274 82304
67352 82304 81705 81161 81261 81961 82749 83134 83001 82688 82689 83065 83271 82869 82259 82281 83097 83997 84401 84501 84681 84800
67332 84800 84563 84245 84490 85466 86662 87568 88228 89067 90334 91790 92848 93051 92517 91813 91354 91113 91027 91380
67314 91380 92442 93959 95431 96771 98219 99591 100204 99790 99035 98791 99041 99073 98559 97979 97979 98705 99940 101491
67296 101491 103143 104485 105140 105157 104900 104563 104055 103334 102537 101718 100750 99725 99170 99582 100853 102431 103958
67279 103958 105458 106974 108354 109443 110232 110718 110854 110717 110566 110656 111146 112177 113790 115661 117126 117672
67263 117672 117304 116410 115463 114959 115379 116881 119042 121073 122346 122733 122587 122522 123036 124138 125367 126283 126907
67246 126907 127572 128404 129159 129626 130041 130929 132479 134253 135641 136552 137464 138771 140327 141762 142963 143972
67230 143972 144648 144825 144698 144679 144902 145306 146130 147774 150052 152059 153101 153313 153145 152703 152005 151496 151755 152788
67212 152788 154061 155099 155727 155882 155658 155544 156174 157715 159712 161590 163097 164316 165466 166749 168222
67197 168222 169839 171685 173947 176459 178503 179406 179266 178778 178516 178708 179511 180960 182701 184367 186216 188793
67181 188793 191765 193810 194103 193422 193233 194056 195295 196405 197459 198528 199267 199498 199802 201043 203437 206366
67165 206366 209004 210879 211965 212645 213642 215594 218374 221007 222522 222871 222872 223363 224663 226732 229394 232323
67149 232323 235138 237719 240186 242450 244112 245039 245734 246776 248140 249444 250686 252211 254060 255861 257504
67134 257504 259476 262289 265822 269422 272494 274879 276839 278776 280859 282899 284696 286427 288423 290627
67120 290627 292613 294231 295876 298009 300726 303884 307270 310481 313020 314832 316466 318460 320839 323494
67106 323494 326676 330666 335152 339439 343209 346630 349763 352392 354551 356808 359783 363616 368023 372631
67092 372631 377086 381072 384476 387479 390403 393536 397115 401247 405732 410142 414252 418245 422314 426256
67078 426256 429731 432911 436540 441183 446553 451795 456447 460949 466019 471653 477028 481498 485347 489251
67064 489251 493270 496890 500027 503378 507499 512101 516708 521571 527256 533616 539952 546148 552823 560108
67050 560108 567132 573233 579020 585514 592706 599802 606611 613726 621248 628328 634362 639945 646069 652898
67036 652898 659937 667069 674669 682741 690617 697717 704297 711192 719045 727855 737158 746513 755847 765324
67022 765324 774893 784122 792692 800948 809723 819544 830164 840862 851147 861147 871401 882231 893331
67009 893331 904132 914625 925493 937218 949385 961258 972780 984446 996328 1007904 1019041
66998 1019041 1030486 1042957 1056170 1069271 1081991 1094840 1108219 1121844 1135187 1148195 1161333
66987 1161333 1175062 1189402 1204035 1218714 1233484 1248444 1263364 1277710 1291208 1304293 1317840
66976 1317840 1332424 1347909 1363699 1379259 1394324 1408793 1422665 1436254 1450287 1465449 1481650
66965 1481650 1497940 1513441 1528272 1543264 1558824 1574537 1589968 1605394 1621345 1637705 1653763
66954 1653763 1669094 1683959 1698724 1713282 1727289 1740813 1754451 1768790 1783883 1799211 1814079
66943 1814079 1828085 1841333 1854202 1866839 1878903 1889944 1900033 1909861 1920112 1930855 1941628
66932 1941628 1951987 1961763 1970852 1979090 1986425 1993040 1999207 2005134 2011005 2016908 2022565 2027367 2030916 2033445
66918 2033445 2035530 2037498 2039305 2040858 2042137 2043008 2043194 2042506 2040956 2038636 2035639 2032135 2028376 2024652 2021209
66903 2021209 2018007 2014385 2009274 2002209 1994063 1986345 1979673 1973284 1966108 1957937 1949361 1940835 1932087 1922386
66889 1922386 1911343 1899496 1887978 1877368 1867019 1855912 1843994 1832108 1820610 1808762 1795786
66878 1795786 1781880 1767769 1753809 1740062 1726796 1714137 1701462 1687850 1673138 1657949 1642679
66867 1642679 1627088 1611011 1594914 1579416 1564582 1549966 1535112 1519860 1504391 1489193 1474783
66856 1474783 1461186 1447793 1433865 1419176 1404079 1389040 1374261 1359664 1345121 1330645 1316364
66845 1316364 1302364 1288619 1275158 1262148 1249673 1237457 1225055 1212351 1199714 1187520 1175623
66834 1175623 1163483 1150795 1137833 1125123 1112867 1100840 1088829 1076992 1065613 1054635 1043633
66823 1043633 1032303 1020772 1009370 998247 987319 976476 965755 955342 945387 935772 926060 915871
66811 915871 905265 894637 884282 874312 864906 856224 848042 839910 831826 824278 817391 810490 802896
66798 802896 794736 786475 778031 768941 759290 749844 741241 733486 726201 718950 711366 703511 696114 689904
66784 689904 684613 679124 672732 665764 658765 651640 644055 636286 629106 622913 617388 612040 606803 601933
66770 601933 597455 592902 587785 582250 576968 572177 567138 560973 553892 547086 541438 536880 533038 529807
66756 529807 526940 523686 519401 514303 509165 504455 500116 495940 491690 487026 481832 476628 472213 468833
66742 468833 465998 463138 460089 456891 453445 449628 445541 441465 437660 434260 431166 427985 424282 420127
66728 420127 416250 413387 411470 409673 407329 404594 402057 399842 397421 394371 390985 387857 384996 381767
66714 381767 377754 373374 369446 366291 363512 360568 357355 354215 351464 349018 346479 343577 340414 337246
66700 337246 334160 331158 328462 326403 324978 323814 322679 321678 320775 319494 317453 314985 312756 310870
66686 310870 308821 306397 304148 302706 301892 300813 298778 295940 293064 290836 289366 288233 286935 285290
66672 285290 283395 281321 279012 276527 274137 272024 270049 268031 266078 264358 262624 260438 257949 256009
66658 256009 255237 255298 255467 255543 255642 255367 254003 251648 249378 247919 246784 245252 243604 242633 242266 241547 239964
66641 239964 237956 235974 233785 231085 228278 226126 224899 224222 223572 222629 221351 219966 218812 217929 216881
66626 216881 215173 212802 210368 208686 208225 208652 208897 208008 206104 204228 203149 202629 201974 200932 199719 198548
66610 198548 197505 196688 196106 195560 194928 194400 194128 193811 193021 191830 190741 189981 189250 188211 186989 186058 185773
66593 185773 185993 186110 185554 184406 183362 182908 182723 182152 181055 179874 178980 178331 177739 177153 176634 176280 176122
66576 176122 175950 175349 174212 173030 172342 172017 171504 170651 169809 169169 168578 168070 167930 167954 167262 165318 162783 160815
66558 160815 159681 158569 156761 154557 152877 152239 152382 152832 153528 154679 156122 157136 157057 155879 154083 152107
66542 152107 150259 148902 148271 148128 147963 147537 146894 145925 144424 142612 141069 139974 138878 137444 135945 134731
66526 134731 133681 132579 131711 131578 132211 133130 133838 134050 133661 132850 132078 131660 131468 131329 131437 132008 132699 132849
66508 132849 132243 131229 130164 129165 128338 127769 127227 126299 124934 123531 122481 121954 122124 123097 124414 125079 124389
66491 124389 122543 120288 118238 116728 115935 115820 116032 116147 115945 115375 114446 113295 112195 111359 110910 111086 112139
66474 112139 113819 115309 115927 115695 114968 113843 112393 111187 110962 111717 112606 112860 112499 112056 111943 112227 112685
66457 112685 112911 112571 111710 110690 109818 109222 108986 109034 108853 107834 106086 104488 103659 103257 102693 102131 102240 103158
66439 103158 104314 105214 105844 106225 106135 105472 104525 103675 103092 102879 103159 103798 104291 104167 103377 102179 100884 99870
66421 99870 99523 99897 100551 100953 100949 100709 100383 99971 99329 98221 96609 95031 94283 94526 95066 95354 95685 96421 97000
66402 97000 96526 95143 93948 93496 93213 92471 91462 90690 90277 90226 90739 91728 92514 92598 92374 92467 92677 92274 91193
66383 91193 90239 90038 90357 90610 90567 90426 90472 90831 91351 91706 91788 91904 92300 92594 92096 90685 88977 87652 86937
66364 86937 86748 86813 86625 85785 84627 84038 84407 85144 85483 85334 85038 84745 84500 84528 84856 84851 83778 81828 80094
66345 80094 79478 79959 80929 81810 82220 81978 81212 80306 79628 79432 79941 81193 82739 83867 84294 84364 84417 84296 83763
66326 83763 83136 83050 83635 84300 84438 84052 83529 83026 82356 81480 80788 80704 81117 81460 81385 81122 81098 81459 82118 82980
66306 82980 83784 83956 83081 81507 80083 79276 78968 79087 79818 80961 81682 81388 80433 79498 78645 77606 76670 76448
66288 76448 76760 76589 75446 74142 73798 74552 75674 76592 77230 77592 77606 77448 77544 78050 78614 78783 78499 78057 77769
66269 77769 77740 77843 77778 77248 76230 75044 74085 73479 73034 72487 71765 71079 70814 71235 72171 72981 72986 72091 70966
66250 70966 70521 71105 72287 73375 74059 74469 74721 74647 74055 73074 72070 71240 70426 69413 68260 67251 66596
66233 66596 66311 66412 67007 68089 69330 70286 70807 71100 71429 71971 72909 74353 75979 77059 77141 76573 76041 75717
66215 75717 75181 74156 72954 72113 71882 72138 72569 72838 72801 72673 72771 73025 73011 72547 71950 71519 71057 70169 68857
66196 68857 67547 66709 66654 67492 68957 70348 71020 70967 70782 71098 72150 73713 75228 76149 76443 76592 76831 76648
66178 76648 75472 73719 72548 72472 72764 72475 71604 70929 71017 71760 72704 73428 73660 73356 72750 72147 71604 70916 69919
66159 69919 68709 67552 66622 65915 65467 65537 66387 67735 68736 68805 68319 68100 68222 67856 66453 64633 63511
66142 63511 63426 63758 63843 63664 63580 63734 63885 63706 63126 62399 61896 61872 62436 63614 65182 66533 67071 66893 66740
66123 66740 67043 67341 66949 65965 65190 65165 65719 66361 66717 66538 65706 64414 63106 62115 61533 61431 61862 62580 63067
66104 63067 63049 62790 62668 62644 62372 61703 60907 60396 60389 60806 61392 61918 62288 62480 62502 62536 62966 64011 65307 66136
66084 66136 66127 65505 64611 63543 62418 61572 61161 60793 59939 58611 57322 56446 55964 55833 56213 57186 58426 59322
66066 59322 59426 58847 58255 58319 58956 59265 58518 57095 56108 56149 56804 57422 57892 58434 59011 59306 59129 58605 58066
66047 58066 57875 58207 58790 59073 58818 58354 58087 58008 57945 58075 58788 60160 61839 63392 64487 64874 64633 64355
66029 64355 64691 65641 66648 67368 67934 68394 68418 67805 66911 66284 66148 66456 67094 67743 67874 67290 66468 66020 65970
66010 65970 65974 66061 66616 67659 68611 68941 68657 68059 67344 66681 66382 66713 67568 68468 68879 68532 67612 66681 66280 66545
65990 66545 67262 68183 69108 69722 69784 69546 69608 70130 70482 69997 68850 67831 67414 67446 67704 68245 69038 69663 69740 69453
65970 69453 69287 69308 69082 68358 67492 67002 66905 66794 66405 65850 65309 64829 64481 64397 64497 64455 64136 63819 63734 63595 62987
65949 62987 62100 61625 61823 62114 61839 61128 60706 60937 61420 61558 61242 60781 60310 59617 58619 57683 57162 56803 56083
65930 56083 55138 54839 55698 57164 58412 59398 60516 61538 61744 61191 61004 61969 63367 63768 62740 61283 60643
65913 60643 61089 61901 62298 62232 62307 62970 63959 64678 64970 65162 65376 65291 64756 64200 64112 64398 64581 64414 63951 63261
65893 63261 62470 61980 62224 63147 64194 64798 64723 63990 62741 61226 59733 58467 57524 56878 56374 55898 55641 55923
65875 55923 56621 57085 56910 56492 56465 56825 57088 57125 57187 57141 56399 54871 53492 53349 54519 56124 57384 58273 59139
65856 59139 59996 60377 59847 58521 56980 55721 54796 54067 53596 53635 54279 55288 56187 56510 56105 55350 54894 54985
65838 54985 55215 55093 54629 54124 53643 53165 53039 53741 55115 56350 56769 56329 55322 54052 52939 52475 52790
65821 52790 53554 54434 55372 56286 56882 57017 56953 57029 57334 57889 58847 60232 61707 62843 63454 63537 63100 62311 61526
65802 61526 60969 60571 60310 60397 60844 61207 61129 60915 61142 61842 62524 62964 63522 64620 66185 67686 68537 68530 68107
65783 68107 68136 69110 70568 71569 71685 71262 70753 70208 69465 68493 67411 66450 66000 66386 67414 68373 68688 68456
65765 68456 68202 68277 68646 69050 69182 68888 68478 68671 69925 71766 73114 73362 72895 72438 72169 71711 70762 69368
65747 69368 67621 65540 63377 61670 60708 60154 59477 58611 57899 57515 57287 57037 56720 56245 55539 54769 54170 53610
65729 53610 52783 51880 51507 51765 51971 51664 51323 51591 52270 52697 52775 52958 53366 53682 53837 54086 54375 54319 53987 54021
65709 54021 54666 55284 55213 54687 54480 54963 55837 56544 56604 55824 54539 53490 53168 53381 53636 53659 53361 52680 51843
65690 51843 51503 52161 53575 55086 56375 57514 58418 58806 58644 58173 57456 56338 54937 53793 53309 53397 53783
65673 53783 54376 55182 56110 57009 57707 57910 57419 56567 56112 56452 57169 57590 57576 57488 57634 58037 58566 58964 58906 58380
65653 58380 57916 58056 58638 58997 58858 58586 58508 58453 58221 58043 58241 58718 59198 59760 60695 61892 62828 63193 63109 62700
65633 62700 61889 60808 59976 59692 59563 58984 57967 57031 56411 55850 55207 54765 54781 55114 55573 56250 57163 57864 57904
65614 57904 57483 57171 57037 56612 55814 55299 55550 56011 55635 54167 52497 51754 52309 53630 54805 55194 54790 54080
65596 54080 53453 52807 51912 51067 51015 52091 53659 54658 54628 54083 53933 54648 55946 57124 57628 57326 56376 54998
65578 54998 53506 52395 52111 52635 53411 53776 53424 52558 51754 51680 52632 54205 55547 56090 55974 55715 55631 55674 55661
65559 55661 55465 55142 54972 55232 55746 55869 55183 54097 53423 53377 53331 52573 51103 49621 48999 49749 51682 53900
65541 53900 55394 55883 55964 56253 56576 56226 54875 52936 51119 49942 49686 50434 51883 53350 54267 54644 54827
65524 54827 54877 54455 53405 52117 51162 50772 50878 51454 52487 53690 54611 55104 55405 55704 55947 56142 56469 56884
65506 56884 56999 56623 56158 56077 56237 56151 55783 55597 55818 56147 56289 56355 56576 56958 57408 57931 58486 58905 59153 59410
65486 59410 59731 59858 59642 59435 59697 60315 60619 60140 59104 58170 57840 58140 58676 58960 58787 58349 57890 57316 56331
65467 56331 54955 53688 52999 52821 52715 52469 52278 52337 52507 52581 52703 53217 54110 54900 55215 55215 55233 55226 54898 54297 53874
65446 53874 53901 54137 54224 54174 54258 54580 54997 55373 55721 56065 56291 56233 55899 55539 55428 55572 55733 55757 55757 55881 56082 56331
65424 56331 56868 57908 59172 60066 60383 60463 60588 60609 60397 60296 60751 61656 62423 62664 62565 62537 62719 62872 62733 62405
65404 62405 62350 62887 63754 64323 64284 63896 63567 63437 63504 63888 64760 66082 67593 68942 69800 70037 69870 69697 69687
65385 69687 69780 70103 71047 72715 74651 76387 77987 79742 81638 83505 85495 87931 90794 93794 96880
65370 96880 100181 103424 105874 107105 107556 108097 109230 110828 112430 113597 114046 113694 112719 111597 110937 111037
65354 111037 111537 111711 111161 110036 108454 106110 102774 98927 95480 92949 91195 89830 88520 86989 85179
65339 85179 83421 82101 81155 80214 79185 78254 77346 76113 74578 73286 72584 72155 71575 70917 70475 70188 69801
65322 69801 69404 69407 69973 70809 71568 72219 72938 73799 74629 75120 75114 74827 74698 74906 75091 74698 73579 72207 71269 71157
65302 71157 71796 72798 73690 74054 73669 72635 71369 70302 69477 68501 66942 64746 62232 59826 57867 56494
65286 56494 55557 54729 53921 53567 54271 56092 58236 59530 59270 57773 56218 55764 56641 58143 59474 60416 61055
65269 61055 61271 60880 60133 59630 59710 60149 60434 60139 59192 58042 57443 57728 58375 58591 58211 57690 57371 57174 56966
65250 56966 56700 56231 55475 54740 54426 54368 54037 53447 53221 53582 53901 53572 52760 51980 51484 51395 51900 52741 53049 52327
65230 52327 51279 51068 52000 53513 55109 56559 57364 56900 55323 53696 52931 53004 53360 53630 53699 53490 53083 52854
65212 52854 53156 53905 54687 55176 55366 55477 55805 56547 57588 58466 58761 58550 58346 58531 58939 59141 59014 58802 58650
65193 58650 58378 57899 57549 57686 58126 58395 58487 58893 59852 61031 62094 63152 64344 65345 65664 65214 64257 63014
65175 63014 61664 60531 59867 59494 59021 58391 57905 57730 57715 57754 57991 58525 59092 59271 58940 58396 58039 57981 58063 58168
65155 58168 58348 58525 58282 57298 55930 55004 54971 55587 56493 57638 58878 59597 59187 57784 56236 55383 55495 56216
65137 56216 56888 57144 57334 58076 59282 60080 59974 59531 59437 59353 58436 56730 55264 54791 55107 55653 56141 56410 56282
65118 56282 55819 55337 55014 54841 54996 55775 56974 57899 58280 58658 59546 60629 61283 61554 62096 63321 65131 67367
65100 67367 69975 72626 74620 75484 75471 75293 75493 76189 77252 78460 79549 80370 81073 82014 83374 84985 86624
65083 86624 88279 89906 91111 91417 90867 89975 88951 87358 84849 81989 79943 79394 79966 80645 80533 79286
65067 79286 77183 74849 72786 71040 69368 67612 65861 64308 63033 61860 60480 58975 58172 59003 61223
65052 61223 63210 63495 62230 60714 59694 58732 57193 55259 53771 53385 54000 54877 55284 55226 55398 56247 57305
65035 57305 57825 57776 57691 57737 57591 57233 57131 57427 57591 57204 56580 56239 56127 55794 55110 54466 54329 54793 55431 55532
65015 55532 54726 53430 52457 52101 51990 51885 52180 53300 54948 56338 56974 56912 56429 55775 55192 54864 54786 54811 54817
64996 54817 54805 54943 55505 56633 58073 59304 59990 60213 60310 60623 61378 62519 63642 64327 64570 64660 64672 64404 63804
64977 63804 63103 62451 61810 61315 61319 61893 62561 62790 62510 61994 61489 61098 60793 60411 59829 59202 58760 58415 57916 57428
64957 57428 57415 57837 57984 57404 56582 56358 57048 58374 59890 61169 61968 62505 63243 64104 64318 63397 61834 60448
64939 60448 59408 58375 57236 56218 55502 55239 55679 56804 58035 58792 59130 59387 59416 58819 57781 57078 57193
64922 57193 57888 58701 59449 60181 60972 61793 62410 62485 62008 61481 61376 61612 61828 61866 61653 60923 59630 58325 57585
64903 57585 57243 56798 56360 56488 57183 57785 57873 57575 56988 56046 55085 54761 55161 55691 56053 56579 57299 57467 56599
64884 56599 55326 54596 54539 54820 55628 57463 60004 62035 62639 62007 60934 59975 59230 58623 58095 57636 57283 57056
64866 57056 56942 56994 57342 57946 58443 58399 57755 56883 56255 56186 56840 58255 60217 62194 63553 63997 63781 63404 63002
64847 63002 62182 60586 58523 56797 55915 55698 55731 55894 56287 56821 57128 56860 56056 55210 54895 55205 55659 55872
64829 55872 56182 57213 58758 59652 59045 57507 56416 56429 56954 57061 56453 55432 54298 53129 52029 51297 51193
64812 51193 51598 52054 52238 52323 52788 53899 55487 57202 58797 60100 60981 61537 62155 63100 64039 64266 63531 62449
64794 62449 61913 62122 62393 61931 60714 59498 59059 59484 60132 60191 59373 58160 57355 57252 57319 56848 55831 54957
64776 54957 54779 55193 55774 56215 56289 55748 54647 53569 53162 53531 54333 55291 56299 57154 57589 57587 57359 57014 56519
64757 56519 55974 55614 55477 55337 55069 54856 54938 55289 55643 55790 55858 56278 57301 58470 58868 58147 57061 56632 56985
64738 56985 57425 57483 57393 57584 58169 58999 59776 60101 59821 59398 59519 60211 60794 60779 60381 59979 59525 58727 57543 56264
64718 56264 55343 55189 55815 56607 56842 56539 56368 56697 57237 57768 58562 59735 60709 60841 60223 59454 58954 58885 59388
64699 59388 60382 61332 61649 61211 60251 59020 57870 57326 57595 58205 58517 58372 57933 57236 56361 55750 55753 56003 55827
64680 55827 55198 54778 55050 55862 56758 57273 56974 55751 54164 53079 52870 53272 53976 54907 55946 56844 57510 58062
64662 58062 58564 59097 59981 61392 62689 62752 61275 59286 58096 58057 58591 59082 59422 59851 60523 61225 61468 61103
64644 61103 60757 61232 62353 62860 61786 59622 57817 57380 58269 59868 61538 62776 63320 63321 63257 63530 64157 64838
64626 64838 65288 65525 65808 66224 66411 65958 65135 64894 65955 68075 70413 72403 74014 75305 76165 76592 76913
64609 76913 77502 78321 78880 78724 77944 77218 77233 78001 78785 78819 78106 77375 77224 77437 77351 76828 76545 77134 78250 78832
64589 78832 78256 76883 75445 74314 73506 72966 72540 72037 71687 72163 73629 75104 75420 74701 74168 74539 75439
64572 75439 76485 77991 80083 81898 82446 81897 81303 81257 81505 81744 82111 82804 83782 85034 86701 88743 90786
64555 90786 92499 93903 95167 96253 96936 97057 96710 96232 95996 96091 96257 96261 96196 96168 95744 94144 91081 87170
64537 87170 83357 80187 77701 75726 74029 72371 70690 69188 68087 67422 67189 67487 68268 69091 69427 69204
64521 69204 68809 68567 68450 68294 68027 67628 67151 66870 67144 67892 68486 68402 67882 67622 67813 67800 66800 64732 62274
64502 62274 60281 59272 59286 60015 61014 61910 62510 62771 62757 62588 62346 62048 61776 61705 61838 61782 61107 59974 59087
64483 59087 58891 59139 59447 59906 60790 61882 62587 62652 62381 62132 61996 62028 62395 63120 63922 64496 64749 64650 64060 62916
64463 62916 61491 60416 60427 61956 64662 67478 69433 70515 71384 72291 72746 72397 71699 71331 71399 71627 72027
64446 72027 72850 74074 75422 76777 78154 79327 79995 80347 81060 82638 85065 88087 91435 94688 97260
64431 97260 98776 99307 99220 99047 99437 100825 102994 105197 106863 107969 108716 109218 109683 110559 112223 114635 117396
64414 117396 119952 121708 122344 122194 122009 122091 121985 121212 119962 118706 117497 116090 114521 113019 111474 109513
64398 109513 107143 104828 102824 100796 98278 95308 92456 90339 89066 88056 86533 84460 82787 82414
64384 82414 83047 83511 83167 82500 82345 83009 84281 85745 86853 87183 86967 87020 87839 89077 90134 90881 91508 92050
64366 92050 92501 93062 93821 94391 94369 93970 93778 94020 94568 95455 96783 98164 98948 99179 99782 101465 103803 105769
64348 105769 106926 107839 109441 112251 116081 120234 123965 126923 129287 131556 134172 137259 140657 144211
64334 144211 147915 151587 154543 156133 156798 158013 160733 164327 167607 170490 173867 178128 182852 187967
64320 187967 194197 201983 210838 220319 230917 243419 257946 274297 292784 313972 337900 364211
64308 364211 392894 424189 457812 492829 528292 563405 596934 626952 651431 668955 678846 680916
64296 680916 675219 661980 641829 616148 586919 555870 523902 491583 459895 429997 402393 376881
64284 376881 353298 331821 312451 294730 278232 262993 249250 236997 226005 216093 207133 198882
64272 198882 190985 183186 175534 168333 161837 156023 150847 146666 143992 142631 141471 139541 137007 134725
64258 134725 133092 131817 130498 128840 126526 123666 121275 120436 120861 121054 120177 119011 118747 119552 120856 122348
64242 122348 124028 125697 127165 128749 130945 133659 136265 138341 139876 140786 140780 139824 138412 137191 136481 136207
64226 136207 136127 136054 135888 135465 134440 132613 130430 128899 128733 129747 131248 132803 134403 136124 137989 140023
64210 140023 142239 144669 147592 151475 156368 161604 166483 171071 175904 181071 186194 191311 197198 204562
64196 204562 213344 223091 233719 245574 258934 273808 290205 308387 328755 351535 376605 403652
64184 403652 432531 463421 496442 531084 566052 599695 630518 657308 678939 694199 701866 701021
64172 701021 691399 673585 648965 619463 587091 553411 519272 485171 451875 420523 391979 366250
64160 366250 342720 320903 300823 282755 266792 252691 240110 228968 219474 211678 205115 199175
64148 199175 193792 189324 185606 181687 176875 171684 167176 163590 160151 156150 151651 147129 142933 139305
64134 139305 136493 134581 133336 132353 131233 129695 127807 126130 125317 125469 126095 126682 127019 127002 126550 125874 125415
64117 125415 125319 125254 124970 124742 125029 125953 127351 129100 131099 133161 135258 137717 140855 144505 148197 151757
64101 151757 155481 159775 164891 170964 177925 185225 191891 197063 200532 202716 204243 205528 206579 207083
64087 207083 206733 205609 204261 203313 202914 202587 201770 200622 200129 201229 203890 207324 211101 215701 221798 229392
64071 229392 237944 247103 256799 266731 276325 285299 293827 301824 308356 312192 312916 311220 308095 303966
64057 303966 298724 292409 285608 279131 273416 268401 263956 260242 257506 255686 254425 253500 252980 252926 253149
64042 253149 253323 253109 252040 249633 245936 241725 237763 233993 229883 225449 221404 218195 215441 212568 209522
64027 209522 206539 203625 200739 198189 196387 195394 195072 195412 196259 197041 197409 197944 199508 201977 204422 206545
64011 206545 209036 212296 215769 219011 222531 226913 231778 236439 240975 245816 250739 255248 259703 265078
63997 265078 271676 278941 286534 294643 303192 311752 320483 330321 341877 354969 369545 386119 404686
63984 404686 424088 443324 462934 484216 507543 532335 558359 586039 615537 646604 679583
63973 679583 715810 756674 802859 854916 914067 981972 1060064 1149585 1252207 1370287 1506627
63962 1506627 1664293 1846599 2056807 2297389 2569304 2871808 3202918 3560139 3940794
63953 3940794 4341759 4759012 5187434 5620578 6050105 6465546 6855326 7208752 7517334
63944 7517334 7774589 7975251 8115105 8191215 8201767 8145672 8022794 7834876 7586174 7283265
63934 7283265 6934538 6549890 6140271 5716546 5288081 4862146 4444538 4040656 3655900
63925 3655900 3295096 2961709 2657661 2383753 2139958 1925148 1736875 1571993 1427862
63916 1427862 1302824 1195439 1103546 1024402 955537 895060 841325 792969 749487 711131 677755
63905 677755 648062 620416 594075 569135 545534 522812 500760 479561 459082 438708 418255
63894 418255 398487 380204 363208 346739 330736 316046 303352 292372 282293 272633 263481 255052
63882 255052 247234 239597 231854 224264 217457 211803 207132 203184 200032 197707 195659 193103 189937 186869
63868 186869 184465 182481 180350 178036 175995 174527 173558 173020 173066 173777 174953 176357 177958 179715 181303
63853 181303 182336 182851 183260 183661 183466 181983 179237 175887 172381 168569 164276 159890 156030 152818 149837
63838 149837 146804 143944 141559 139473 137115 134119 130721 127558 125093 123175 121203 118770 116182 114197
63824 114197 113230 112907 112467 111514 110283 109232 108552 108097 107666 107177 106504 105376 103650 101734 100440 100222 100632
63807 100632 100808 100438 99937 99645 99248 98298 97090 96536 97099 98166 98607 97750 95747 93343 91526 91086 92006
63790 92006 93283 93729 93056 91950 91046 90257 89245 88103 87231 86820 86854 87399 88430 89455 89788 89223 88146
63773 88146 86930 85657 84468 83759 83749 84176 84621 84899 84952 84687 84212 84011 84525 85606 86613 87012 86709 85931
63755 85931 85015 84247 83737 83404 83125 82798 82256 81370 80377 79863 80201 81189 82453 83954 85842 88032 90298
63738 90298 92640 95150 97581 99472 100727 101761 103034 104780 107129 110106 113362 116271 118460 120019
63724 120019 121122 121769 122017 122135 122273 122147 121299 119578 117269 114895 112996 111887 111483 111467 111729 112478 113846
63707 113846 115636 117572 119587 121659 123578 125174 126591 128091 129642 130870 131382 130959 129650 127908 126479
63692 126479 125759 125281 124226 122504 120945 120321 120504 120827 120929 120912 120926 121068 121638 123015 125113 127319 129126
63675 129126 130549 131705 132352 132218 131530 130771 130014 128973 127658 126396 125122 123289 120774 118335 116702
63660 116702 115699 114801 114152 114269 114894 114988 113970 112372 111183 111132 112688 115980 120301 124224 126759 128124
63644 128124 129128 130268 131862 134514 138657 143824 149053 154059 159455 165735 172625 179676 187088 195594
63630 195594 205643 216937 228768 240762 253295 267119 282516 298915 315412 331444 346688
63619 346688 360535 372080 380683 386246 388964 389115 387139 383621 379111 374155 369514 365972 363769 362368
63605 362368 360809 358103 353384 346203 336924 326519 315722 304564 292884 280958 269357 258506
63593 258506 248715 240436 234029 229265 225442 222000 218840 216092 213887 212415 211951 212759 214996 218648 223346
63578 223346 228361 233079 237549 242310 247669 253429 259364 265572 272232 279347 287017 295714 305927 317647
63564 317647 330435 343880 357676 371316 384082 395384 404859 412098 416623 418255 417272 414082 408997
63551 408997 402533 395676 389505 384597 380968 378429 376729 375483 374315 372978 371038 367499 361307 352420
63537 352420 342015 331416 321059 310690 300148 289535 278862 268024 257133 246492 236280
63526 236280 226544 217473 209253 201643 194076 186368 179050 172836 168009 164399 161655 159383 157257 155257
63512 155257 153597 152264 150834 148962 146885 145213 144310 144016 143821 143237 142185 141221 141080 141812 142602 142693 142186
63495 142186 141644 141320 141397 142649 145954 150949 155843 159031 160575 161878 164195 167718 171705 175132 177328
63480 177328 178292 178389 177748 176234 174030 171830 170144 168737 167087 165155 163334 161855 160658 159741 159249 159244
63464 159244 159740 160922 162996 165810 168898 171909 174823 177787 181028 184838 189289 193963 198291 202248
63450 202248 206397 211257 216929 223390 230698 238725 247060 255486 264319 274032 284781 296522 309426
63437 309426 323801 339759 357258 376486 397855 421472 446669 472049 495873 516505 532776
63426 532776 544195 550882 553323 552157 548151 542283 535746 529689 524752 520817 517337 513877 510187 505798
63412 505798 499912 491906 481748 469695 455781 439969 422769 405348 388825 373556 359203 345369
63400 345369 332078 319756 308896 299798 292460 286631 281957 278198 275370 273667 273261 274280 277003 281792
63386 281792 288613 296778 305528 314802 325067 336320 347754 358685 369424 380850 393343 406614
63374 406614 420477 435271 451343 468423 485662 502045 516621 528609 537561 543366 545998 545382
63362 545382 541756 536037 529510 523022 516695 510521 504962 500586 497195 493708 489055 482847 475028 465263
63348 465263 453155 438923 423338 407021 390261 373563 357791 343430 330158 317581 306100
63337 306100 296585 289273 283413 278000 272558 267204 262320 258236 255034 252466 250114 247666 245008 242158
63323 242158 239232 236382 233610 230754 227841 225420 224309 224951 227049 229841 232648 235276 237991 241133
63309 241133 244689 248280 251508 254048 255471 255349 253753 251328 248613 245537 241912 238081 234609 231515
63295 231515 228330 224861 221422 218263 215241 212199 209344 207072 205608 204843 204331 203439 201796 199654 197654
63280 197654 196232 195425 195084 195005 194934 194815 194914 195373 195773 195628 195271 195714 197584 200576 203930 206932 208951 209701
63262 209701 209799 210510 212619 215859 219562 223324 226843 229793 232332 235291 239308 244064 248788 253223 257639
63247 257639 262295 267402 273419 280811 289506 298976 308807 318955 329659 341420 354794 369818 385773
63234 385773 401934 418384 435685 453878 472250 490052 507049 523359 539123 554400 569201
63223 569201 583752 598899 615946 635557 656908 678287 698461 717021 733679 747949 759708
63212 759708 769408 777284 782632 784172 781051 773317 761622 746712 729179 709589 688704 667434 646504
63199 646504 626291 607036 588985 572263 557015 543985 534519 529459 528221 529511 532772 538377 546521
63186 546521 556737 568599 582266 597956 615412 634187 654023 674634 695423 715799 735559
63175 735559 754732 773255 791061 808295 825165 841621 857245 871373 883380 893018 900417 905424
63163 905424 907004 903735 894984 881226 863243 841602 817079 790889 763986 736563 708740 681402
63151 681402 655821 632629 611646 592583 575441 560273 546974 535332 525072 515980 508272 502674
63139 502674 499707 498944 499313 500107 501372 503348 505939 508738 511202 512671 512567 510797 507784 504019 499685
63124 499685 494759 489270 483391 477450 471948 467381 463889 461154 458734 456466 454484 452985 452024 451585 451710
63109 451710 452414 453397 454009 453876 453561 454212 456307 459049 461325 462982 464734 467009 469467 471699 473821 476132
63093 476132 478624 481134 483706 486440 489179 491704 494146 496835 499735 502291 504013 505031 506026 507685
63079 507685 510283 513693 517650 521991 526713 531786 536951 541765 546050 550362 555863 563498 573248 584349
63065 584349 596279 609332 624082 640522 658003 675961 694457 713980 734968 757621 781969
63054 781969 807991 835672 865001 895818 927682 960052 992623 1025332 1058026 1090367 1122209
63043 1122209 1153804 1185371 1216629 1247106 1276913 1306869 1337747 1369668 1402332 1435374 1468068
63032 1468068 1498822 1525557 1546719 1561614 1569671 1569898 1561529 1544905 1521181 1491143 1454883 1412845
63020 1412845 1366660 1318566 1270192 1222320 1175662 1131403 1090886 1055094 1024538 999414 979694
63009 979694 965239 955974 951897 952867 958542 968613 982956 1001432 1023647 1049083 1077309 1107850
62997 1107850 1139869 1172310 1204537 1236708 1269365 1302652 1336008 1368582 1399823 1429646 1458081
62986 1458081 1484770 1508756 1528741 1543566 1552416 1554576 1549085 1534887 1511458 1479193 1439149 1392464
62974 1392464 1340158 1283356 1223504 1162266 1101208 1041455 983529 927594 873982 823412 776505
62963 776505 733280 693442 657110 624704 595958 569573 544336 520398 498915 480512 464531
62952 464531 449850 436009 423292 412004 401946 392555 383397 374539 366443 359442 353356 347757 342500
62939 342500 337702 333271 328875 324509 320676 317664 315007 312044 308814 305922 303620 301543 299354 297156
62925 297156 295090 292981 290663 288296 286046 283739 281188 278621 276376 274333 272083 269611 267370 265629
62911 265629 264157 262607 260854 258785 256215 253306 250764 249285 248944 249312 249974 250649 251056 251081 251016 251264 251807
62894 251807 252261 252468 252697 253180 253755 254134 254282 254379 254525 254672 254772 254870 255035 255259 255430 255415 255203 254886 254544 254312
62874 254312 254589 255826 257845 259629 260190 259526 258384 257226 255935 254400 252743 250869 248492 245877 243929
62859 243929 243135 242866 242205 241016 239709 238384 236937 235687 235087 234793 233805 231701 229176 227147 225839 224990
62843 224990 224433 224069 223676 223147 222755 222821 223240 223655 223958 224333 224851 225342 225719 226232 227281 229052 231396 234053
62825 234053 236972 240282 243938 247505 250579 253365 256545 260404 264356 267490 269449 270603 271625 273128
62811 273128 275551 278972 282992 287062 291011 295136 299760 304933 310639 317081 324606 333435 343512 354516
62797 354516 365988 377671 389906 403648 419929 439287 461755 487295 516003 547900 582782
62786 582782 620489 661246 705554 753695 805455 860386 918204 978816 1041880 1106317 1170231
62775 1170231 1231384 1287896 1338538 1382300 1417689 1442684 1455620 1456127 1445141 1424018 1393775 1355130
62763 1355130 1309061 1257127 1201214 1143046 1083923 1024873 966894 910831 857007 805225 755433
62752 755433 708293 664761 625081 588597 554754 523962 497035 473937 453579 434884 417601
62741 417601 401926 387760 374806 363170 353345 345496 339143 333701 329075 325524 323061 321195 319298
62728 319298 317217 315561 315313 316924 319791 322871 325903 329692 335039 341802 349420 358058 368577 381360
62714 381360 395769 411034 427321 445666 467114 492119 520547 551996 586278 623859 665775
62703 665775 712875 765164 821907 882271 945748 1012042 1080553 1149824 1217495 1281048 1338653
62692 1338653 1389061 1430823 1462265 1482475 1491639 1489926 1476605 1451064 1414368 1368926 1316726 1258712
62680 1258712 1195986 1130665 1065102 1000831 938633 879045 822325 768435 717691 671038 629122
62669 629122 591352 556583 524597 496203 471816 450621 431393 413563 397052 381538 366574
62658 366574 352361 339780 329329 320339 311601 302698 294402 287620 282230 277216 271839 266299 261222
62645 261222 256871 253096 249744 246749 243889 240904 237885 235247 233161 231272 229164 226865 224631 222370
62631 222370 219681 216538 213624 211771 211228 211655 212664 214100 215798 217431 218749 219778 220619 221246 221719
62616 221719 222444 223885 226101 228921 232570 237706 244585 252508 260523 268545 277476 288200 300825 315039
62602 315039 330913 349016 369801 393157 418672 446121 475491 506594 538841 571391 603367
62591 603367 633848 661849 686516 707285 723700 735122 740821 740451 734322 723155 707598 688025
62579 688025 664743 638385 610041 580954 552038 523735 496309 470143 445662 423157 402798
62568 402798 384683 368650 354253 341189 329630 319772 311182 303072 295281 288508 283385 279697 276758
62555 276758 274150 271763 269438 266991 264435 261823 258975 255703 252196 248858 245876 243214 240908 239047
62541 239047 237664 237035 237850 240480 244094 247237 249448 251745 255267 260071 265668 272081 279699 288512 298293
62526 298293 309425 322748 338492 355975 374560 394431 416262 440670 468173 499140 533312
62515 533312 569670 607144 645210 683528 721338 757627 791552 822205 848189 868057 881128
62504 881128 887405 886856 879505 866318 849168 829498 807485 782880 756182 728480 700565 672738
62492 672738 645334 618825 593446 569189 546145 524492 504074 484413 465261 446895 429786
62481 429786 414128 399742 386266 373446 361393 350469 340742 331709 322853 314329 306762 300388 294814
62468 294814 289634 284855 280635 277040 274258 272680 272439 273078 273909 274617 275380 276614 278707 281818 285733
62453 285733 290058 294697 299981 306182 313072 320075 326698 332696 338014 342707 346770 349906 351631 351734
62439 351734 350432 347955 344248 339267 333316 326831 320036 313059 306206 299755 293546 287122 280311 273498
62425 273498 267286 262026 257650 253868 250576 248104 246882 246708 246602 245677 244068 242779 242682 243913 246108
62410 246108 248867 251893 254905 257602 259720 261249 262656 264758 268115 272588 277624 282838 288122 293309
62396 293309 298130 302590 307132 312257 317971 323696 328707 332788 336498 340632 345307 349759 353185 355626
62382 355626 357804 360364 363573 367576 372500 378372 385380 394173 405450 419151 434550 451339 470181
62369 470181 491887 516450 543285 572138 603269 636800 672281 708859 745363 780139 811237
62358 811237 837250 857889 873592 884741 891498 894296 893954 891061 885432 876416 863628 847231 827709
62345 827709 805717 782167 758076 734165 710721 687804 665397 643410 621952 601709 583592
62334 583592 567704 553004 538372 523746 509793 496737 484067 471429 459226 448141 438352 429411
62322 429411 420689 411841 403061 394999 388289 383054 378970 375771 373489 372101 371199 370213 368942 367787 367422
62307 367422 368177 369744 371557 373501 375995 379253 382716 385594 387866 390325 393639 397709 402018 406242
62293 406242 410317 414222 418013 421948 426338 431232 436345 441276 445747 449745 453496 457320 461423 465813
62279 465813 470389 475075 479993 485551 492235 500172 509025 518521 529077 541743 557503 576676 598939
62266 598939 623787 650997 680691 712887 746997 781904 816485 849738 880364 906806 928142
62255 928142 944640 957062 965647 970178 970671 967392 960329 949243 934171 915396 893012 867176 838788
62242 838788 809402 780398 752723 727309 704941 685520 668157 652323 638344 626565 616665 608174
62230 608174 601098 595558 591221 587516 584126 580966 578068 575739 574456 574286 574746 575399 576131 576722 576872 577020
62214 577020 578333 581218 584418 586331 586802 586868 587193 587639 588063 588577 589000 588907 588337 587813 587531 587161 586598 586371
62196 586371 587051 588651 590803 593326 596556 601229 607841 615803 623503 629747 634960 640420 646570 652805
62182 652805 658889 665718 674397 685267 698183 713219 730692 750782 773436 798386 825044 852590
62170 852590 880203 906982 931676 953067 970790 985372 997312 1006526 1012842 1016555 1018145 1017719 1014968
62157 1014968 1009423 1000670 988702 974271 958549 942293 925689 909084 893328 879061 866180 854383
62145 854383 843827 834884 827552 821571 816758 812831 809146 805126 800812 796695 793192 790569 789036 788448
62131 788448 788192 787875 788017 789597 793023 797897 803518 809088 813602 816272 817175 817017 816254 814933 813413 812507
62115 812507 812615 813160 813160 811944 809007 803649 795432 784980 773932 763875 755322 747632 739884 731921 724564
62100 724564 718713 714356 710755 707554 705197 704060 703650 703104 702217 701531 701625 702747 705024 708461 712681 717149
62084 717149 721870 727482 734440 742425 750858 759653 769091 779164 789603 800543 812672 826476 841659
62071 841659 857436 873055 887781 900732 911228 919224 924908 927902 927341 922968 915740 906971 897099
62058 897099 885606 871971 856219 838560 819011 797665 775104 752163 729366 706855 684862
62047 684862 663967 644750 627363 611619 597442 584966 574194 564792 556382 548930 542677 537768
62035 537768 534138 531660 530070 528711 526733 523825 520550 517638 515123 512524 509732 507169 504932 502307
62021 502307 498572 493964 489341 484974 480210 474444 467931 461417 455381 450028 445735 442849 441026 439288
62007 439288 437003 434564 432791 431843 431033 429630 427603 425479 423632 421867 419651 416683 413162 409451 405583
61992 405583 401266 396332 390951 385314 379397 373282 367511 362737 359041 355885 352789 349819 347345 345611
61978 345611 344608 344106 343661 342834 341640 340620 340224 340277 340283 340184 340512 341781 343987 346752 349687 352535 355216
61961 355216 357936 361118 364961 369200 373506 378052 383371 389632 396410 403377 410898 419597 429482 439937
61947 439937 450641 462091 474984 489319 504433 519798 535494 551821 568710 585637 602064
61936 602064 617840 633184 648346 663381 678294 693299 708772 724907 741584 758663 776324
61925 776324 795069 815532 838315 863809 892041 922884 956540 993633 1034722 1080003 1129673
61914 1129673 1184151 1243521 1307086 1374206 1445479 1522368 1605468 1693788 1786010 1881750 1981093
61903 1981093 2083388 2187164 2290826 2392551 2489538 2578191 2655403 2719196 2767925 2799430
61893 2799430 2811586 2803481 2775693 2729563 2666733 2589376 2500358 2402758 2299283 2192270 2083997
61882 2083997 1976726 1872421 1772583 1678255 1589919 1507405 1430197 1358049 1291190 1229880 1173981
61871 1173981 1123084 1076854 1035047 997274 963064 932112 904368 879892 858781 841122 826793
61860 826793 815349 806307 799502 794970 792528 791697 792013 793160 794876 797051 799895 803580 807578 810687
61846 810687 811995 811601 810232 808385 806120 803493 800865 798751 797526 797355 798397 801084 806041 813528 823043
61831 823043 833736 845145 857062 868652 878254 884427 886901 886245 882947 877271 869725 861121 852143
61818 852143 843173 834574 826859 820622 816456 814831 815796 818903 823702 830273 839029 850105 863230 878151
61804 878151 894868 913388 933556 955236 978559 1003904 1031630 1061739 1093839 1127649 1163600
61793 1163600 1202610 1245147 1290944 1339908 1392892 1451144 1515332 1585648 1662473 1746249 1836930
61782 1836930 1934424 2039587 2153931 2278187 2411887 2554584 2706669 2868526 3039497 3218151
61772 3218151 3402930 3591796 3781435 3967291 4144205 4306756 4449484 4567538 4657187 4715465
61762 4715465 4739731 4728244 4681212 4600968 4491235 4356476 4201620 4031626 3851076 3664329
61752 3664329 3475745 3289128 3106844 2929969 2759467 2596960 2444296 2302688 2172250
61743 2172250 2051983 1940230 1835681 1738222 1648510 1566646 1491650 1422404 1358603 1300402 1247457
61732 1247457 1198793 1153514 1111309 1072248 1036348 1003349 972809 944454 918488 895368 875115
61721 875115 856995 840079 823985 808927 795149 782541 770683 759096 747530 736205 725603
61710 725603 715818 706254 696276 686011 676173 667163 658753 650600 642634 634770 626704 618250 609612 601071
61696 601071 592646 584354 576500 569393 562926 556829 551178 546266 542034 538058 534205 530938 528801 527890
61682 527890 527942 528672 529744 530595 530623 529520 527308 524037 519618 513933 507010 499042 490286 480962 471274 461593
61666 461593 452525 444596 437780 431479 425151 418960 413805 410705 410131 411701 414423 417392 420374 423658
61652 423658 427279 430499 432189 431609 428801 424427 419381 414350 409419 404157 398346 392560 387747 384195
61638 384195 381189 377815 373917 370131 367143 365078 363536 362048 360411 358660 356887 355250 354076 353756
61624 353756 354365 355499 356588 357256 357373 357017 356581 356592 357060 357217 356247 354162 351596 348928 346167 343578 341637
61607 341637 340212 338515 336270 334281 333366 333194 332808 331940 331110 330666 330509 330740 331780 333623 335560 337020
61591 337020 338290 340089 342769 346224 350293 354850 359664 364512 369425 374590 380124 386135 392900 400673
61577 400673 409315 418436 427966 438345 450000 462846 476523 491038 506870 524360 543235 562931
61565 562931 583204 604054 625069 645278 663959 681311 697830 713113 725786 734808 740453 743755
61553 743755 745317 745067 742993 739621 735685 731649 727667 723717 719639 715249 710672 706410 702851 699730
61539 699730 696346 692348 688121 684238 680680 676883 672552 668167 664443 661431 658473 655087 651675 649193
61525 649193 648324 649150 651460 655033 659627 665042 671424 679386 689630 702483 717883 735758 756236
61512 756236 779458 805282 833306 863330 895832 931963 972884 1019048 1070159 1125795 1185870
61501 1185870 1250455 1319286 1391567 1466133 1541639 1616744 1690364 1761685 1829721 1892858 1949097
61490 1949097 1996834 2035270 2064117 2083328 2093396 2095623 2091661 2082751 2069752 2053956 2037442 2022250
61478 2022250 2009332 1998642 1990184 1984488 1981784 1981015 1980101 1977242 1971674 1963126 1950910 1933892 1911285
61465 1911285 1883204 1850489 1814248 1775689 1736130 1696800 1658514 1621663 1586719 1554717 1526994
61454 1526994 1504314 1486401 1472572 1462760 1457612 1457710 1463104 1473719 1489666 1510856 1536746 1566966
61442 1566966 1601903 1641943 1686010 1731165 1773609 1809795 1836896 1853107 1858028 1852656 1838921 1819380
61430 1819380 1797017 1774550 1753540 1734542 1718218 1705874 1698788 1697568 1702372 1713166 1729389 1749866
61418 1749866 1773335 1798370 1822215 1840387 1848443 1844123 1827478 1799588 1762173 1718079 1670819 1623114
61406 1623114 1576393 1531732 1490469 1453626 1421330 1393185 1368797 1347763 1329572 1313791 1300072
61395 1300072 1287939 1277050 1267709 1260647 1256210 1254287 1255093 1259361 1267521 1279341 1294620 1313628 1336550
61382 1336550 1363187 1393646 1428635 1468502 1512518 1559747 1610058 1663493 1719088 1775233 1831043
61371 1831043 1886466 1940913 1992540 2039033 2078687 2110690 2134926 2151629 2160756 2161507 2152870 2134753
61359 2134753 2108240 2074698 2035086 1990295 1941646 1890630 1838236 1784779 1730404 1675710 1621884
61348 1621884 1570119 1520866 1473845 1428924 1386635 1347515 1311296 1277321 1245556 1216542 1190445
61337 1190445 1166837 1145533 1126928 1111272 1098219 1087439 1079084 1073233 1069339 1066838 1066052 1067905 1072817
61324 1072817 1080252 1089301 1099355 1110255 1122119 1135104 1149103 1163601 1177835 1190989 1202301 1211317
61312 1211317 1218242 1223735 1228066 1230794 1231752 1232073 1233628 1237346 1242538 1247917 1252707 1256527 1258786 1258923 1257205
61297 1257205 1254784 1252685 1250837 1248165 1243598 1237013 1229311 1221694 1214857 1208814 1203296 1198077 1192974 1187879
61283 1187879 1183039 1179024 1176091 1173750 1171427 1169544 1169344 1171427 1174951 1178685 1182419 1186705 1191385 1195149
61269 1195149 1196746 1196064 1193726 1190121 1185359 1179907 1174790 1171045 1169229 1169437 1171652 1176140 1183634 1195036
61255 1195036 1210804 1230790 1254809 1283245 1316938 1356629 1402691 1455143 1513586 1577252 1645449
61244 1645449 1717812 1793580 1870298 1943338 2006822 2055254 2084959 2094841 2086215 2061809 2024807 1978645
61232 1978645 1927134 1874041 1822251 1773585 1729347 1690685 1658397 1632893 1614637 1604188 1601387
61221 1601387 1604552 1610678 1616274 1617887 1612210 1596429 1569036 1530540 1483407 1431173 1377337 1324713
61209 1324713 1275432 1231058 1192367 1159158 1130582 1105755 1083936 1064322 1046146 1029137 1013621
61198 1013621 1000038 988575 979280 972171 966927 962743 958765 954664 950565 946504 942173 937247 931736
61185 931736 925840 919498 912321 904140 895483 887215 879717 872809 866508 861241 856956 852619 847275 841320
61171 841320 835963 831641 827817 824256 821526 819923 818763 817244 815299 813053 809951 805055 797901 788583
61157 788583 777298 764306 750102 735201 719907 704582 689818 675949 662717 649846 637663
61146 637663 626700 616899 607662 598496 589188 579660 570164 561408 553881 547130 540228 532894 525679 519120
61132 519120 513255 507954 503171 498758 494524 490670 487857 486626 486949 488379 490445 492976 496288 500953
61118 500953 507049 513719 519780 524683 528537 531346 532746 532515 530897 528302 525020 521257 517160 512776
61104 512776 508241 503934 500187 496992 494304 492396 491452 491016 490419 489566 488675 487424 485259 482581 480736
61089 480736 480520 481435 482714 484294 486302 488356 490022 491524 493339 495472 497721 500327 503710 507705 511589
61074 511589 514824 517394 519525 521458 523367 525159 526430 526964 527170 527724 528979 531026 534070 538171 542656
61059 542656 546379 548855 550816 553452 557267 561851 566533 570940 575011 578861 582929 588032 594837 603224
61045 603224 612568 622801 634698 648767 664372 680655 698038 718057 741749 768866 798559 830005
61033 830005 862396 895293 929433 966472 1007649 1053404 1104482 1162356 1227983 1300915 1380363
61022 1380363 1466559 1560784 1665245 1784072 1924109 2094116 2303736 2563411 2884133 3276670
61012 3276670 3752955 4330392 5034934 5900083 6964568 8267886 9832293 11625191 13523932
61003 13523932 15323070 16798983 17797155 18287499 18363137 18199871 18002891 17949874 18132603
60994 18132603 18515033 18937015 19173930 19025691 18389118 17282086 15819502 14163057 12469784
60985 12469784 10856845 9390164 8093922 6968844 6006386 5194261 4517356 3958671 3500726
60976 3500726 3126407 2819772 2567224 2357931 2182936 2034397 1905969 1793179 1692838
60967 1692838 1602613 1521485 1449667 1387102 1332352 1283611 1240202 1202134 1168524 1137408 1107066
60956 1107066 1076760 1046275 1015570 984978 955037 925951 897636 870251 844097 819035 794554
60945 794554 770496 747211 725004 703965 684271 666102 649223 633308 618760 606614 597476 590991
60933 590991 586416 583139 580626 578578 577315 577301 578018 578052 576705 574873 573875 573979 574682 575852 577803 580464
60917 580464 583196 585412 586828 587172 586132 583666 580008 575383 570056 564594 559674 555552 551933 548479
60903 548479 545204 542289 539630 536670 532736 527664 522066 516791 512054 507417 502668 498328 494998 492540
60889 492540 490274 487703 484675 481052 476769 472138 467665 463532 459632 456071 453258 451419 450384 449930
60875 449930 449997 450452 450996 451496 452249 453793 456527 460389 464630 467977 469451 469226 468408 467898 467736 467605 467589
60858 467589 468098 469311 470920 472303 472784 471998 470276 468506 467362 466746 466131 465212 463896 461811 458369 453490
60842 453490 447956 442770 438206 433603 428112 421574 414691 408341 402776 397583 392407 387490 383350 380115
60828 380115 377431 374935 372514 370100 367587 365125 363184 362053 361360 360392 358832 356950 355093 353288 351445
60813 351445 349634 347953 346315 344710 343565 343466 344420 345701 346629 347253 348010 348943 349663 350006 350319 350965 351903
60796 351903 352999 354440 356492 358981 361383 363379 365019 366355 367307 367963 368662 369523 370228 370536 370791 371457
60780 371457 372303 372554 371928 371027 370469 370062 369220 367947 366934 366742 367295 368192 369157 370076 370893 371622 372265 372645
60762 372645 372516 371895 371024 369944 368419 366429 364361 362449 360398 357934 355480 353798 353069 352780 352469 352096
60746 352096 351637 350783 349252 347052 344333 341274 338285 335915 334267 332784 330932 328994 327843 328100 329708
60731 329708 332243 335314 338679 342178 345619 348690 351057 352583 353313 353182 352024 350056 348060 346692 345711
60716 345711 344268 341950 339154 336420 333776 330912 327712 324396 321261 318457 315922 313458 310879 308147
60702 308147 305308 302403 299578 297176 295415 293970 292220 290055 288134 287156 287105 287456 287927 288684 289869 291226
60686 291226 292268 292691 292654 292772 293744 295751 298214 300291 301658 302772 304408 307030 310482 314091 317125
60671 317125 319346 321123 322890 324620 326045 327269 328740 330553 332201 333266 334063 335300 337301 339878
60657 339878 342884 346502 350893 355758 360392 364156 366913 369046 370937 372350 372500 370916 368124 365222
60643 365222 362826 360711 358427 355887 353176 350202 346896 343609 340981 339297 338215 337144 335766 334109
60629 334109 332273 330292 328292 326650 325705 325301 324747 323416 321287 318733 315977 313044 310205 308002 306729
60614 306729 306200 306197 306804 308116 309921 311910 313849 315240 315290 313792 311746 310362 309528 308016 305283 302253
60598 302253 300005 298478 297036 295753 295270 295615 295935 295534 294590 293712 293242 293242 293772 294775 295856 296485 296475 296117
60580 296117 295815 295706 295674 295672 295869 296451 297412 298718 300579 303214 306284 308952 310790 312387 314692 317884 321257
60563 321257 324129 326471 328613 330785 333112 335736 338704 341946 345579 350051 355738 362571 370286 379002
60549 379002 389256 401497 415761 431973 450484 472232 498335 529521 565806 606588 650888
60538 650888 697359 744067 788380 827192 857395 876423 882816 876598 859152 832627 799328 761523
60526 761523 721515 681582 643710 609375 579452 554113 532820 514669 499040 486021 476165 469890
60514 469890 467157 467650 471035 477070 485730 497448 513083 533337 558228 587402 620868 659074 702032
60501 702032 748546 796325 842516 883978 917521 940578 951909 951669 941069 922304 898575 873547
60489 873547 850441 831653 819102 814472 818934 832805 855585 886179 923019 964217 1007571 1050228
60477 1050228 1088320 1117428 1133834 1135490 1122013 1094245 1053993 1003891 947037 886641 825783
60466 825783 767098 712352 662358 617355 577279 541747 510265 482708 459240 439531 422500
60455 422500 407285 394110 383626 375595 368914 362907 357890 354315 351925 350083 348443 346890 345149
60442 345149 342972 340608 338693 337669 337598 338496 340490 343515 347075 350525 353579 356430 359437 362679 365784
60427 365784 368114 369220 369183 368509 367648 366704 365669 364779 364402 364592 365018 365508 366447 368401 371436 375053 378768
60410 378768 382564 386782 391805 397853 404861 412559 420872 430154 440805 452657 465117 477892 491104
60397 491104 504649 518040 531191 544732 559021 573170 585736 596198 605203 613566 621600 629387
60385 629387 636937 643913 649738 654232 657834 661039 663985 666648 669031 670996 672335 673192 673971 674605 674410
60370 674410 672973 670797 668697 666976 665577 664599 664044 663364 661978 660208 659021 658736 658510 657267 654664
60355 654664 650984 646566 641676 636638 631595 626215 619896 612292 603560 594234 584949 576163 567936 559978
60341 559978 551963 543769 535492 527424 520052 513757 508295 502834 496775 490366 484200 478360 472503 466742
60327 466742 461823 458150 455060 451481 447083 442483 438463 435347 433005 431053 429039 426815 424785 423525
60313 423525 423113 423117 423290 423907 425336 427720 431221 436145 442399 449228 455955 462705 469884 477103 483197 487271
60297 487271 489144 488741 485751 480274 473257 465835 458430 450908 443423 436672 431271 427162 423697 420182
60283 420182 416385 412652 409597 407654 406921 407303 408589 410377 412232 414082 416289 419210 422877 427232 432425
60268 432425 438613 445580 452803 459854 466623 473285 480160 487448 494910 501963 508248 513893 519037 523381
60254 523381 526614 529147 531900 535297 538844 541833 544200 546596 549878 554705 561408 569991 580273 592145
60240 592145 605639 620718 637096 654299 671880 689671 707992 727631 749399 773565 799804
60229 799804 827759 857538 889638 924522 962410 1003369 1047426 1094504 1144299 1196287 1249868
60218 1249868 1304459 1359402 1413824 1466779 1517554 1565685 1610562 1651247 1686960 1717645 1743734
60207 1743734 1765403 1782332 1794268 1801501 1804664 1804357 1801193 1796070 1790082 1784137 1778841 1774770 1772746
60194 1772746 1773765 1778646 1787772 1801225 1819134 1841821 1869473 1901765 1937969 1977442 2019729 2064080
60182 2064080 2109156 2153519 2196402 2237667 2276945 2313051 2344468 2370174 2389651 2402140 2406400
60171 2406400 2401579 2388077 2367096 2339414 2304986 2263871 2217082 2166340 2113386 2059803 2007102
60160 2007102 1956419 1908279 1863138 1822079 1786452 1756743 1732270 1712199 1696545 1686027 1681276
60149 1681276 1682437 1689124 1700321 1714337 1729189 1743144 1754978 1763977 1769923 1772872 1772625 1768412 1759382
60136 1759382 1745491 1727730 1707411 1685383 1662047 1638000 1614344 1592350 1573087 1557572 1547039
60125 1547039 1542571 1544463 1552368 1566297 1587082 1615567 1651780 1695444 1746999 1807399 1876901 1954704
60113 1954704 2039915 2132233 2231352 2336181 2445003 2555942 2666898 2775378 2878925 2975602
60103 2975602 3063692 3141181 3206031 3256900 3293169 3314247 3319354 3308182 3281538 3241019 3188089
60092 3188089 3123600 3048322 2963903 2873109 2778897 2683367 2587922 2494299 2404855 2321601 2245403
60081 2245403 2176470 2115186 2062076 2017322 1980841 1952681 1932844 1920837 1915862 1917364 1924917 1937681
60069 1937681 1954422 1974028 1995576 2017894 2039511 2059083 2075541 2087916 2095550 2098407 2096602 2089614
60057 2089614 2076664 2058017 2035120 2008970 1978967 1943969 1904079 1860747 1815397 1768698 1721204
60046 1721204 1674094 1628983 1587192 1549343 1515516 1485799 1460764 1441333 1428054 1420644 1418521 1421749
60034 1421749 1431238 1447957 1472122 1503213 1540586 1583915 1632972 1687008 1744507 1803734 1863482
60023 1863482 1922966 1980837 2034546 2081004 2117899 2144324 2160307 2166043 2161581 2147040 2122963 2090438
60011 2090438 2050881 2005732 1956423 1904566 1851989 1800542 1752003 1708048 1669817 1637331 1609666
60000 1609666 1586090 1566897 1552897 1544420 1541231 1543283 1551009 1564839 1584809 1610789 1642780 1680881
59988 1680881 1725209 1775869 1832674 1894642 1959957 2026489 2092210 2155118 2213247 2265134 2310049
59977 2310049 2347463 2376399 2395623 2404394 2402727 2390987 2369625 2339446 2301773 2258138 2210035 2159202
59965 2159202 2107853 2058156 2011381 1967880 1928011 1892818 1863666 1841498 1826727 1819648 1820484 1828978
59953 1828978 1844301 1865578 1892368 1924476 1961469 2002509 2046530 2092410 2139116 2185909 2232334
59942 2232334 2277717 2320638 2359236 2392255 2419735 2442522 2461149 2475388 2484892 2490040 2491960 2491864
59930 2491864 2490681 2489380 2489375 2492358 2499825 2512908 2532493 2559273 2593758 2636493 2688222 2749523 2820247
59917 2820247 2899507 2986092 3078461 3174268 3270423 3363915 3452181 3532453 3601289 3655415 3692910
59906 3692910 3713050 3715211 3698707 3663989 3613476 3550831 3479614 3402785 3322979 3242579 3163362
59895 3163362 3086433 3012744 2943644 2880853 2825905 2779574 2741760 2711886 2689537 2674833 2668344
59884 2668344 2670555 2681368 2700136 2726280 2759868 2801342 2850623 2906653 2968007 3033771 3103524
59873 3103524 3176381 3250233 3322056 3388862 3448328 3498515 3537139 3561333 3568394 3556888 3527094
59862 3527094 3480518 3419376 3346545 3265566 3180229 3094050 3010112 2930907 2857795 2790692 2728670
59851 2728670 2671012 2617550 2568268 2523225 2483045 2448995 2422059 2401922 2387008 2375519 2366407
59840 2366407 2359586 2355588 2355200 2359341 2368968 2384815 2407133 2435848 2470918 2512234 2559034 2609724
59828 2609724 2662507 2715911 2768386 2817673 2861126 2896632 2922953 2939370 2945600 2942167 2930343 2911490
59816 2911490 2886715 2857209 2824519 2790169 2755152 2719836 2684128 2647654 2610039 2571115 2530786
59805 2530786 2488862 2445399 2401127 2357126 2314031 2271917 2230878 2191092 2152305 2113880 2075618
59794 2075618 2037959 2001224 1965326 1930591 1898211 1869417 1844784 1824801 1810467 1802577 1800931 1805071
59782 1805071 1815438 1833087 1858667 1892610 1936017 1990151 2054957 2129228 2212577 2306329 2411894
59771 2411894 2528867 2654953 2786539 2918121 3041456 3146535 3224177 3268117 3275618 3247464
59761 3247464 3187958 3104368 3005419 2899480 2793434 2692415 2599962 2518201 2447987 2389148 2340808
59750 2340808 2301704 2270457 2245927 2227477 2214746 2206992 2202885 2201174 2201434 2203905 2208850 2216563 2227893
59737 2227893 2244114 2266018 2293542 2326474 2365118 2409931 2460903 2517747 2580594 2650182 2727510
59726 2727510 2813639 2909724 3016802 3135424 3265763 3408071 3562789 3730051 3909197 4098733
59716 4098733 4296507 4499716 4704827 4907816 5104673 5291903 5466717 5627042 5771651
59707 5771651 5900497 6014907 6117186 6209750 6294477 6372704 6445542 6513971 6578636 6639718 6696994
59696 6696994 6749897 6797532 6838891 6873322 6900873 6922082 6937480 6947415 6952329 6953026 6950602 6946396
59684 6946396 6942297 6940884 6944859 6956297 6976748 7008029 7052374 7111591 7186514 7277626 7385666 7511031
59672 7511031 7652849 7809305 7978731 8159507 8348675 8541266 8731325 8913032 9080420
59663 9080420 9226642 9344511 9427975 9472776 9475826 9434757 9348663 9219275 9051223 8851192
59653 8851192 8626895 8386509 8138363 7890305 7648872 7418827 7203257 7003603 6819145
59644 6819145 6646333 6478791 6308262 6126186 5925594 5703024 5459606 5200471 4932794
59635 4932794 4663851 4399976 4146187 3906026 3681712 3474735 3286309 3117117 2966665
59626 2966665 2833181 2714413 2608668 2515149 2433441 2362854 2302235 2250155 2204933 2164629 2127504
59615 2127504 2092716 2060216 2029793 2000599 1971950 1944208 1918312 1894627 1872768 1852367 1833352
59604 1833352 1815455 1798062 1780705 1763250 1745543 1727398 1709064 1691164 1674019 1657558 1642010
59593 1642010 1627974 1615382 1603034 1589649 1574991 1559559 1543727 1527744 1512128 1497321 1483257
59582 1483257 1469924 1458094 1448752 1441867 1436463 1431984 1428966 1428275 1430235 1434672 1441292 1449772 1459836
59569 1459836 1471494 1484989 1500379 1517495 1536424 1557770 1582226 1610021 1640797 1673846 1708450
59558 1708450 1744301 1781744 1821429 1863727 1908627 1956087 2006127 2058562 2113067 2169707 2229173
59547 2229173 2292323 2359615 2430772 2504408 2577655 2646630 2707952 2760070 2803236 2838432 2866482
59536 2866482 2887789 2902348 2909879 2910113 2903085 2889099 2868525 2841828 2809753 2773158 2732484 2687614
59524 2687614 2638494 2585891 2531304 2476123 2421157 2367091 2315070 2266506 2222478 2183802 2151579
59513 2151579 2127133 2111214 2103747 2104716 2114921 2135448 2166626 2207933 2258773 2318899 2388116 2465866
59501 2465866 2551021 2641665 2735068 2828187 2918190 3002255 3077071 3139105 3185504 3214446 3224677
59490 3224677 3215376 3186771 3140615 3079686 3006958 2925338 2837840 2747621 2657764 2571050 2489734
59479 2489734 2415362 2348862 2290943 2242324 2203523 2174530 2154827 2143697 2140518 2144801 2155936 2172833
59467 2172833 2193951 2217804 2243317 2269484 2294763 2317143 2334888 2346972 2352744 2351450 2342228 2324460
59455 2324460 2298041 2263403 2221364 2172912 2119126 2061278 2000741 1938598 1875460 1811893 1748845
59444 1748845 1687365 1628056 1571093 1516638 1464843 1415601 1368824 1324972 1284837 1248635 1215703
59433 1215703 1185204 1156843 1130829 1107511 1087203 1070068 1056036 1045042 1037298 1033144 1032775 1036457
59421 1036457 1044649 1057137 1072002 1086222 1097466 1104854 1108115 1107159 1102958 1097930 1094702 1094918 1099587
59408 1099587 1109657 1125195 1144260 1163373 1179103 1189017 1191931 1188241 1179888 1169229 1158011 1147772
59396 1147772 1140572 1138215 1140854 1147321 1156938 1170196 1187709 1209438 1235192 1264996 1298544 1335024
59384 1335024 1373991 1415882 1461286 1510127 1561982 1616679 1674108 1733830 1795325 1858314 1922287
59373 1922287 1986029 2048263 2108800 2168746 2229710 2293230 2360879 2434358 2515270 2605084 2705399
59362 2705399 2817897 2943759 3083240 3235898 3400962 3577171 3762241 3952765 4144809
59353 4144809 4334637 4518919 4694553 4858631 5008714 5143025 5260272 5359408 5439654 5500674
59343 5500674 5542516 5565275 5568744 5552320 5515241 5457059 5377959 5278563 5159521 5021608 4866423
59332 4866423 4696800 4516277 4328321 4136215 3943408 3753396 3569093 3392419 3224433
59323 3224433 3065630 2916207 2776399 2646581 2526804 2416325 2314055 2219616 2133612 2056718
59313 2056718 1988847 1929398 1877994 1834616 1799096 1770595 1747288 1726354 1704735 1680605 1654264
59302 1654264 1627315 1601026 1575792 1552044 1530893 1513445 1499864 1489577 1482165 1477509 1475188 1474359
59290 1474359 1474416 1475304 1477041 1479433 1482637 1487609 1495454 1506483 1520315 1536681 1555650 1577205 1601196
59277 1601196 1627660 1656565 1687087 1717724 1747360 1775668 1802205 1825539 1843688 1855080 1858891
59266 1858891 1854937 1843663 1825927 1802355 1773152 1738774 1700367 1659113 1615596 1570346 1524512
59255 1524512 1479202 1434468 1389802 1345616 1303378 1264130 1227634 1193259 1161112 1131902 1106118
59244 1106118 1083681 1064091 1046593 1030525 1015851 1003277 993564 986762 982163 978921 976664 975631
59232 975631 976298 978836 982999 988603 995906 1005321 1016915 1030432 1045635 1062370 1080570 1100572 1123225
59219 1123225 1149244 1178690 1211488 1248188 1289633 1336106 1387534 1444389 1507560 1577428 1653957
59208 1653957 1737853 1830570 1932803 2043782 2162422 2288215 2420242 2555968 2691726 2823878
59198 2823878 2948851 3062656 3161383 3242055 3302304 3339532 3351330 3336912 3297565 3235687 3153897
59187 3153897 3055218 2943489 2823087 2698178 2572135 2447482 2326366 2211095 2104016 2006680
59177 2006680 1919387 1841724 1773218 1713295 1661148 1616298 1579073 1549972 1528601 1513702 1504143
59166 1504143 1499471 1499527 1504001 1512278 1523256 1535290 1546778 1556901 1565460 1571989 1575446 1574884 1570058 1561286
59152 1561286 1549022 1533661 1515511 1494888 1472477 1449549 1427472 1406885 1387615 1369460 1352758
59141 1352758 1338111 1325842 1315933 1308315 1303075 1300426 1300543 1303383 1308727 1316453 1326510 1338430 1351084
59128 1351084 1363299 1374673 1385489 1395944 1405754 1414380 1421246 1425815 1427940 1428135 1427057 1424649 1420284
59115 1420284 1413792 1405840 1397127 1387655 1377061 1365306 1352793 1340098 1327836 1316473 1306046 1296349
59103 1296349 1287526 1280110 1274258 1269382 1264965 1261383 1259458 1259381 1260568 1262508 1265333 1269510 1275290 1282500
59089 1282500 1290653 1299309 1308559 1319093 1331537 1345793 1361353 1378103 1396320 1415751 1435138 1452954
59077 1452954 1468366 1481243 1491505 1498879 1503206 1504540 1502781 1497544 1488584 1476236 1461180 1443770
59065 1443770 1423821 1401163 1376352 1350719 1325682 1301957 1279352 1257269 1235365 1213775 1192779
59054 1192779 1172435 1152641 1133376 1114605 1096024 1077226 1058262 1039756 1022199 1005350 988576
59043 988576 971727 955352 940070 925998 912927 900875 890315 881831 875529 870815 866859 863303
59031 863303 860340 857954 855370 851565 846312 840467 835253 831421 828989 827431 826111 824777 823727 823339
59017 823339 823564 824148 825242 827328 830463 834045 837466 840692 844013 847665 851934 857265 863881 871563 880112
59002 880112 889752 900688 912544 924820 937857 952762 970342 990571 1013277 1038913 1068281 1101753
58990 1101753 1139025 1179452 1222338 1267069 1313290 1360950 1409880 1459216 1507338 1552385 1592806
58979 1592806 1627481 1655605 1676490 1689426 1693778 1689440 1677210 1658462 1634335 1605381 1572132 1535744
58967 1535744 1497880 1460102 1423525 1388850 1356415 1326305 1298715 1274134 1252833 1234260 1217420
58956 1217420 1201928 1188237 1176670 1166792 1158067 1150718 1145391 1142177 1140483 1139772 1140014 1141441 1144322 1148976
58942 1148976 1155558 1163677 1172581 1181913 1192087 1203785 1217248 1232170 1248151 1265261 1284286 1306397
58930 1306397 1332410 1362383 1396095 1433776 1476097 1523564 1576353 1634634 1698438 1766911 1838049
58919 1838049 1909332 1978253 2042117 2097950 2143370 2177596 2201512 2217051 2226930 2234642 2243823 2257121
58907 2257121 2275695 2299862 2330029 2366957 2411317 2463285 2522625 2589201 2663290 2745319 2835313
58896 2835313 2932825 3037459 3149209 3268048 3393349 3523858 3658080 3794252 3929859 4061387
58886 4061387 4184753 4296104 4392571 4472727 4536589 4585129 4619672 4641587 4652124 4652059 4641451
58875 4641451 4620076 4588162 4546380 4494983 4433465 4361585 4280559 4192620 4099357 4001009 3897620
58864 3897620 3790360 3681154 3571311 3461153 3350959 3241580 3133852 3028006 2924112
58855 2924112 2822844 2725284 2632076 2543154 2458191 2376969 2299359 2225421 2155614 2090575 2030529
58844 2030529 1975119 1923859 1876539 1833157 1793807 1758721 1728100 1701647 1678488 1657843 1639674
58833 1639674 1624520 1612769 1604262 1598524 1595192 1594252 1595968 1600589 1608047 1617924 1629747 1643313 1658789
58820 1658789 1676544 1696793 1719249 1743179 1767892 1793091 1818594 1843867 1868224 1891602 1914865
58809 1914865 1939224 1965475 1993850 2024449 2057737 2094719 2136617 2184193 2237428 2296026 2360097
58798 2360097 2430029 2505847 2587272 2674443 2767939 2867715 2972408 3080141 3189705 3300613
58788 3300613 3412166 3522885 3630820 3734090 3831073 3920172 3999442 4066558 4119472 4157173
58778 4157173 4179517 4186280 4176789 4150626 4108222 4050523 3978633 3894278 3800152 3699076 3592933
58767 3592933 3482892 3370379 3257104 3144165 3031812 2920293 2810487 2703564 2600478
58758 2600478 2501889 2408159 2319192 2234585 2154166 2078157 2006783 1940023 1877881 1820516 1767892
58747 1767892 1719566 1675064 1634228 1597073 1563505 1533379 1506601 1482911 1461720 1442448 1424909
58736 1424909 1409158 1395074 1382404 1371277 1362440 1356920 1355532 1358760 1366930 1380333 1399162 1423329
58724 1423329 1452186 1484238 1516975 1547093 1571056 1585686 1588594 1578538 1555790 1522114 1480047
58713 1480047 1432001 1380003 1326005 1271985 1219538 1169672 1123127 1080608 1042563 1008990 979801
58702 979801 955141 935213 920027 909610 904238 904141 909191 919150 933840 952568 973532 994194 1012017
58689 1012017 1024405 1028451 1021889 1004667 978960 947425 911996 874411 836904 801541 769257 740102
58677 740102 714156 691667 672609 656741 643986 634180 626448 619467 612591 606390 601814 598982 596900
58664 596900 594249 590430 585921 581680 578181 575121 572052 569037 566495 564706 563794 563939 565115 566769 568309
58649 568309 569884 572089 574750 576591 576441 574375 571365 568240 565403 563158 561656 560711 560144 560262 561480
58634 561480 563596 565975 568404 571161 574192 576926 579151 581390 584035 586673 588805 590809 593544 597220
58620 597220 601244 605045 608578 612194 616536 622377 629900 638159 645951 653309 661569 671841 683994 697312
58606 697312 711429 726228 741457 757077 773745 792363 813269 836242 861143 888220 917776
58595 917776 949775 983692 1018624 1053692 1088527 1123152 1157266 1189852 1219713 1246123 1268741
58584 1268741 1287182 1300996 1309837 1313335 1311008 1302750 1289417 1272588 1253691 1233394 1211697 1188488
58572 1188488 1164171 1139875 1116799 1095206 1074383 1053735 1033516 1014193 995583 977153 958821
58561 958821 940884 923307 905665 887751 869804 852181 835212 819242 804358 790053 775596
58550 775596 760760 745940 731663 718259 705811 694041 682482 671246 661458 654350 650015 647551
58538 647551 646205 645708 645551 644780 642757 639451 634770 628276 619916 610513 601070 591879 582654 573247 563953
58523 563953 555257 547484 540597 534286 528480 523701 520573 518966 518024 517041 515939 514911 514154 514060 515066
58508 515066 517095 519616 522481 526247 531461 538117 546031 555133 565016 574803 584025 593261 603300 613960
58494 613960 624271 633550 641706 648584 653660 656571 657480 656689 654151 649649 643389 636177 628870 621700
58480 621700 614323 606609 599146 592647 587037 581523 575564 569397 563560 558241 553173 547957 542586 537956
58466 537956 535572 536080 538128 539420 539054 538094 537660 537434 536565 535172 534013 533140 531864 529952 528077 526938
58450 526938 526447 525933 524829 523147 521491 520517 520260 520214 520262 521113 523389 526603 529608 531899 533923 536171
58434 536171 538525 540599 542292 543842 545647 548136 551533 555613 559869 564039 568256 572602 576732 580159
58420 580159 582860 585373 588174 591087 593540 595430 597393 600059 603310 606612 609779 612918 615856 618297
58406 618297 620526 623304 626897 630841 634869 639423 644874 650784 656321 660995 664664 667333 669366 671525
58392 671525 674392 678059 682609 688313 694923 701430 707146 712561 718443 724452 729480 733176 736391 740096
58378 740096 744441 748919 752960 756325 759251 762283 765707 769299 772835 776549 780749 785319 790010 794965
58364 794965 800443 806295 812264 818626 825935 834145 842476 850148 856960 863294 869957 877830 887167 897279
58350 897279 907294 917091 927068 937202 946961 956141 965211 974709 984669 994768 1004731 1014462 1023972
58337 1023972 1033281 1042348 1051216 1060215 1069742 1079766 1089929 1100303 1111618 1124471 1138691 1153781
58325 1153781 1169473 1185525 1201560 1217630 1234434 1252407 1271092 1289965 1309342 1329747 1350903
58314 1350903 1372259 1394166 1417517 1442294 1467319 1491445 1514334 1536093 1556800 1576393 1594545
58303 1594545 1610846 1625620 1640255 1656066 1673046 1690334 1707552 1724954 1742685 1760825 1779901
58292 1779901 1800457 1822263 1844852 1868583 1894214 1921599 1949856 1978673 2008360 2038702 2069082
58281 2069082 2099852 2132376 2167307 2203947 2241740 2281405 2324053 2370058 2419334 2471935 2527744
58270 2527744 2586074 2646041 2707052 2768795 2831287 2895062 2960688 3027934 3096048 3164962 3235529
58259 3235529 3308320 3382971 3459106 3537354 3618966 3704742 3794631 3888189 3985307 4086631 4193206
58248 4193206 4305585 4423627 4547396 4677695 4815251 4960050 5112145 5272464 5441983
58239 5441983 5620804 5809037 6007924 6218877 6442123 6677631 6926811 7191854 7473865
58230 7473865 7773200 8091239 8430201 8791751 9177634 9591367 10037370 10518649 11037360
58221 11037360 11597552 12205272 12866147 13585156 14368901 15225780 16163639 17189473 18311783
58212 18311783 19541419 20890719 22375222 24017451 25847595 27901543 30222115 32863408
58204 32863408 35892441 39388500 43446311 48181484 53730943 60250947 67922252 76959327
58196 76959327 87611559 100158411 114905702 132158910 152130284 174787872 199726637
58189 199726637 226128144 252785824 278141209 300356044 317511142 327952460 330664594
58182 330664594 325503458 313202150 295173974 273193806 249056642 224311732 200133099
58175 200133099 177315878 156338086 137434758 120664775 105966896 93202154 82184492
58168 82184492 72706511 64561720 57558296 51523851 46307095 41779296 37833164 34379081
58160 34379081 31342331 28661895 26288034 24178865 22298982 20619628 19117016 17769426
58152 17769426 16556830 15462791 14474573 13580759 12769741 12030323 11352251 10726196 10144746
58143 10144746 9603572 9100257 8631927 8195116 7787570 7408283 7055519 6726359 6418566
58134 6418566 6131373 5863963 5614477 5381064 5162646 4957982 4765051 4582158 4408880
58125 4408880 4245284 4090845 3944608 3805764 3673571 3547224 3426327 3311095 3201791
58116 3201791 3098273 3000236 2907421 2819394 2735518 2655373 2578921 2506141 2436860 2370978 2308537
58105 2308537 2249494 2193664 2140750 2090169 2041075 1993122 1947080 1904157 1864691 1827833 1792384
58094 1792384 1757532 1722971 1688859 1655619 1623382 1591745 1560392 1529628 1499864 1470956 1442587
58083 1442587 1414892 1387955 1361061 1333378 1305223 1277772 1251542 1226017 1200776 1176112 1152407
58072 1152407 1129654 1107808 1086905 1066709 1046915 1027833 1010127 993682 977479 960887 944434
58061 944434 929001 914861 901793 889470 877315 864544 850883 836850 822927 808928 794626
58050 794626 780604 767850 756669 746520 736812 727403 718301 709342 700427 691830 684001 676999 670320
58037 670320 663388 656149 649031 642350 636018 629802 623584 617258 610712 604055 597575 591294 584920 578446
58023 578446 572419 567342 563223 559952 557640 556143 554860 553566 552898 553327 554126 554300 554199 555196 557852 561451
58007 561451 565390 570035 575912 582933 590822 599653 609596 620643 632894 646637 661860 678151 695314
57994 695314 713676 733569 754885 777369 800982 825957 852878 882685 915990 952317 990616
57983 990616 1030625 1072983 1117844 1164161 1210753 1257308 1303690 1348754 1390432 1426641 1455581
57972 1455581 1475509 1484897 1482823 1468957 1443461 1407305 1362488 1311413 1255988 1197542 1137546 1078150
57960 1078150 1021867 970551 924473 882540 843834 808861 778837 753818 732381 713354 697047
57949 697047 684220 674592 667215 661865 659044 658599 659185 659355 658702 657665 656623 655470 653896 651826 649513
57934 649513 647224 644880 642222 639415 637281 636722 638071 641271 646545 654564 665898 680558 698166 718346
57920 718346 740719 764504 788285 810334 829223 843996 853804 857740 855352 847111 833914 816178
57908 816178 793915 767761 739425 710794 682830 655564 628858 602964 578487 556054 535876
57897 535876 517525 500276 483733 467954 452991 438666 424883 411743 399190 386976 375272
57886 375272 364908 356568 349950 344073 338294 332701 327711 323696 320976 319830 320383 322562 326073 330294
57872 330294 334401 337924 341155 344816 349304 354384 359481 364074 367839 370619 372341 372999 372672 371534 369738
57857 369738 367256 363973 359889 355062 349463 343154 336615 330552 325278 320559 316142 312068 308370 304934
57843 304934 301985 300359 300856 303429 307226 311327 315205 318698 321894 325011 328197 331442 334684 337814
57829 337814 340469 342197 343093 344097 346299 350027 354722 359512 363660 366691 368462 369117 368802 367553 365683
57814 365683 364136 364084 366105 369878 374713 380305 387127 396212 408500 424241 443052 464542 488679
57801 488679 515495 544635 575276 606252 636142 663519 687295 706676 720787 728687 729863 724324
57789 724324 712082 693188 668684 640961 612469 584189 555832 527243 499030 471999 446665
57778 446665 423325 401986 382120 363018 344604 327501 312184 298467 286009 274850 265178 256820
57766 256820 249293 242246 235714 230052 225655 222576 220334 218297 216327 214848 214195 214162 214327 214590 215136 215996
57750 215996 216936 217797 218735 220028 221749 223730 225769 227783 229776 231812 234143 237222 241376 246434 251851
57735 251851 257261 262736 268505 274536 280497 285945 290521 294070 296659 298337 298904 298141 296270 293859 291189
57720 291189 288047 284281 280206 276265 272661 269556 267240 265663 264185 262254 260119 258400 257201 256236
57706 256236 255682 256196 257953 260302 262623 265074 268143 271839 275698 279465 283459 288254 294099 300638 307167
57691 307167 313294 319396 326356 334807 344784 356099 368901 383737 401132 421245 443988 469457
57679 469457 498204 531013 568578 611696 661768 720738 790369 871844 966132 1073982 1194352
57668 1194352 1322187 1447752 1558468 1642313 1691219 1703242 1682625 1637702 1577862 1511182 1443343
57657 1443343 1377491 1314788 1255409 1199304 1146223 1095600 1047002 1000650 957101 916452 878217
57646 878217 841904 807336 774450 743235 713929 686886 662141 639407 618513 599567 582762
57635 582762 568337 556612 547541 540258 533722 527886 523663 521563 520964 521031 521694 523276 525748 528976 533274
57620 533274 539009 545903 553457 562018 572691 586079 601630 618455 636348 655731 676985 700195
57608 700195 725283 751985 779671 807455 834514 860190 883883 905062 923397 938615 950148
57597 950148 957151 958997 955635 947284 933999 915862 893482 867940 840157 810626 779848 748655
57585 748655 717852 687782 658457 629933 602324 575673 550083 525828 503150 482097 462783
57574 462783 445524 430377 416729 403747 391119 379018 367549 356726 346872 338419 331215 324485
57562 324485 317656 310853 304528 299032 294688 291749 289929 288336 286308 284181 282887 282874 283691 284681 285791
57547 285791 287556 290279 293405 295849 296930 296855 296265 295666 295455 296104 297864 300427 303304 306433 310056 314163
57531 314163 318577 323531 329610 337051 345519 354676 364530 375223 386978 400316 415684 432641 449959
57518 449959 466882 483868 501807 521014 541352 562808 585324 608332 631006 652879 673769
57507 673769 693182 710268 724370 735255 742737 746405 745911 741337 733088 721451 706476 688438 668295
57494 668295 647352 626317 604911 582682 559926 537520 516159 496234 478134 461963 447063
57483 447063 432605 418779 406665 396763 388371 380669 373643 367503 361968 356778 352365 349380 347930
57470 347930 347841 349216 352074 355842 359881 364300 369611 375860 382809 390840 400917 413553 428292 444251
57456 444251 460793 477736 495325 513936 533460 553085 572064 590414 608420 625712 641403
57445 641403 654953 666264 675024 680604 682611 680932 675267 665247 651152 633979 614692 593793
57433 593793 571584 548291 523949 498767 473660 449764 427343 405877 385300 366329 349203
57422 349203 332985 316767 300998 286878 274805 264090 253999 244399 235364 226772 218447 210471
57410 210471 203181 196980 192084 188257 184880 181385 177566 173409 168884 164181 159899 156676 154560 152935
57396 152935 151114 148932 146784 145151 144098 143227 142139 140864 139672 138665 137810 137292 137382 137922 138373 138518
57380 138518 138692 139150 139700 140262 141290 143162 145488 147576 149336 151179 153181 154930 156199 157231 158275
57365 158275 159313 160328 161322 161901 161350 159468 157039 155163 154306 154167 154140 153637 152276 150265 148485 147765
57349 147765 148021 148394 148234 147640 147023 146531 146081 145583 144869 143600 141608 139275 137333 136245 135903 135866 135719
57332 135719 135244 134469 133640 133011 132666 132599 132873 133444 133886 133656 132845 132378 133136 134915 136584 137343 137582 138343
57314 138343 140143 142535 144790 146680 148476 150406 152418 154443 156582 158969 161630 164627 168099 172026
57300 172026 176145 180290 184651 189486 194797 200541 206888 213877 220931 227308 233020 238867 245409 252290
57286 252290 258674 263934 267818 270410 272160 273525 274320 273818 271761 268875 265967 262893 258842 253414 246945
57271 246945 239982 232866 225775 218829 212167 206155 201302 197667 194540 191078 187171 183359 180122 177594
57257 177594 175860 175050 175090 175646 176247 176327 175404 173596 171718 170444 169514 168254 166710 165720 165876 166942 168316
57240 168316 169582 170586 171431 172490 174027 175747 177157 178367 180061 182629 185841 189417 193311 197232
57226 197232 200491 202727 204414 206331 208802 211646 214503 216945 218657 219826 221139 223118 225639 228280
57212 228280 230835 233225 235264 236928 238684 241166 244509 248254 251888 255298 258729 262406 266264 270046
57198 270046 273679 277453 281717 286505 291614 296917 302331 307669 312853 318158 323814 329460 334444 338641
57184 338641 342516 346435 350503 355047 360494 366547 372167 376737 380734 384914 389451 394310 399970 407170
57170 407170 416136 426448 437525 448990 460879 473629 487524 502094 516668 531589 548027 566125
57158 566125 584263 601003 617067 634360 653485 673347 693067 713094 734243 756590 779709
57147 779709 803394 827784 853181 879947 908276 937946 968600 1000259 1033147 1067086 1101569
57136 1101569 1136519 1172489 1209988 1249023 1289410 1331126 1374221 1418715 1464765 1512657 1562580
57125 1562580 1614688 1669372 1727091 1787814 1851008 1916294 1983879 2054337 2128266 2206226 2288665
57114 2288665 2375844 2468116 2566311 2671595 2785056 2907866 3041862 3189482 3353075 3534827
57104 3534827 3737643 3965769 4224470 4519644 4858090 5247842 5697967 6218264 6819296
57095 6819296 7512135 8307313 9213509 10236543 11378617 12637766 14007901 15479226 17037947
57086 17037947 18664994 20334857 22015531 23669249 25253550 26723016 28031635 29134844
57078 29134844 29991125 30564631 30829683 30775141 30405657 29739338 28803975 27633829 26267410
57069 26267410 24745900 23112057 21409322 19680630 17966729 16304090 14722743 13244694
57061 13244694 11883663 10646120 9532630 8538996 7657592 6879064 6193597 5591171 5061643
57052 5061643 4595544 4184859 3822792 3502984 3219499 2967480 2743286 2543966 2367086
57043 2367086 2211057 2074937 1957520 1856933 1771446 1700459 1644455 1604295 1580662 1573431 1580299
57032 1580299 1595124 1607668 1605940 1580523 1528462 1454116 1366262 1273709 1182624 1096607 1017754
57021 1017754 946982 884008 828034 778652 735713 698445 665367 635359 608464 585307 565949
57010 565949 549493 534629 520316 506125 492224 479047 466812 455384 444647 434799 426065 418227
56998 418227 410766 403484 396779 391216 386965 383681 380800 377920 375049 372590 370992 370409 370712 371742 373379
56983 373379 375338 377057 377762 376610 372918 366624 358554 349918 341390 332842 324019 315197 307027 300030
56969 300030 294454 290423 287959 286989 287537 289784 293813 299485 306771 315911 326861 338738 350210 360346
56955 360346 368689 374544 376827 374947 369513 361812 352723 342467 331341 320364 310957 304027 299498
56942 299498 296692 295027 294298 294568 296149 299662 305699 314229 324593 336230 348981 362378 375016
56929 375016 385144 391761 394683 393728 388535 379286 367032 353029 338157 323150 308856 295776 283634
56916 283634 271884 260540 250196 241297 233747 227156 221151 215428 209883 204816 200786 198057 196305
56903 196305 195028 194119 193833 194250 195055 195994 197307 199457 202539 206318 210853 216665 224032 232386 240796
56888 240796 248898 256977 265143 272742 278711 282296 283406 282420 279759 275597 270027 263488 256853 250924
56874 250924 246021 242242 239859 239133 240004 242420 246794 253616 262726 273606 286409 301986 320659 341503
56860 341503 363057 384046 403066 418253 428068 432167 431041 425141 414976 401823 387634 374132
56848 374132 362367 353024 346563 343018 342180 344218 349819 359575 373544 391536 413544 439687 469801
56835 469801 503124 538143 572588 603674 628508 644481 649781 644077 628754 606201 578728 548285
56823 548285 516923 486868 459792 436252 416134 399484 386758 378472 374908 376151 382186 392899
56811 392899 408069 427288 449841 474625 500191 524742 546071 561691 569417 568094 557980 540595
56799 540595 518210 493286 467966 443739 421358 401087 383081 367649 355174 345916 339922 337132
56787 337132 337456 340727 346683 355003 365197 376430 387620 397805 406234 411981 413823 410943 403713
56774 403713 393412 381077 366981 351345 335119 319655 305716 293167 281543 270618 260368
56763 260368 250762 241846 233801 226649 220014 213419 206824 200617 194996 189644 184136 178481 173077 168302
56749 168302 164348 161280 158930 156757 154189 151232 148512 146584 145418 144709 144472 145021 146391 148046 149272
56734 149272 149792 149866 149780 149384 148363 146949 146035 146286 147312 148113 148226 148087 148287 148962 149963 151118 152074 152334
56716 152334 151842 151215 151137 151784 153049 154860 156894 158418 159026 159207 159603 160026 159957 159772 160559 162603 164958
56699 164958 166837 168640 171171 174475 178095 182021 186749 192588 199464 207196 215540 224040 232303 240383
56685 240383 248542 256675 264310 271089 276922 281738 285497 288387 290665 292278 293008 293021 292905 293087 293561 294271
56669 294271 295340 296764 298273 299735 301416 303547 305872 307925 309535 310771 311621 312052 312201 312087 311242
56654 311242 309089 305698 301754 297719 293503 289038 284729 280973 277602 274224 270931 268249 266389 264863
56640 264863 262905 260067 256447 252526 248813 245463 242229 238888 235639 232911 230856 229372 228557 228787 230178
56625 230178 232245 234344 236323 238521 241241 244380 247505 250103 251756 252272 251741 250461 248807 247142 245764
56610 245764 244827 244226 243479 241832 238704 234298 229652 225840 223061 220728 218441 216554 215628 215675 216252 217169
56594 217169 218705 221078 223982 226806 229189 231174 232887 234329 235571 237000 239049 241627 244080 245913
56580 245913 247367 249055 251220 253671 256309 259264 262452 265469 268120 270688 273423 276014 277879 278869
56566 278869 279494 280504 282358 284932 287643 289981 291963 293914 295826 297313 298259 299035 299930 300817 301653 302744
56550 302744 304047 304654 303573 300786 296982 292547 287476 282032 276599 270847 263907 255670 247164 239264
56536 239264 231694 223851 216080 209395 204189 199861 195712 191541 187281 182674 177761 173410 170733 169883
56522 169883 169730 168956 167285 165446 164084 163125 162219 161332 160609 159956 159117 158061 157034 156310 156082 156402 156963
56505 156963 157170 156742 156152 156124 156851 158024 159379 160687 161380 160890 159405 157758 156469 155469 154834 155047 156151
56488 156151 157286 157583 157178 156877 157180 158025 159121 160031 160225 159601 158806 158540 158705 158770 158853 159758 161851 164512
56470 164512 167010 169472 172570 176453 180381 183381 185028 185546 185390 184943 184545 184537 184970 185348 184986 183833 182713
56453 182713 182506 183199 184008 184329 184266 184230 184354 184470 184431 184221 183845 183381 183144 183544 184570 185563 185818 185487 185522 186457
56433 186457 187525 187371 185566 182969 180609 178719 177026 175461 174128 172914 171601 170249 169094 168156 167297
56418 167297 166638 166527 167030 167736 168115 167892 167116 166150 165655 166233 167848 169751 171128 171800 172169 172627 173179 173688
56400 173688 174257 175191 176582 178166 179752 181577 183950 186637 188979 190723 192304 194197 196353 198515 200652
56385 200652 202689 204194 204843 205009 205382 206133 206959 207746 208563 209060 208698 207734 207245 207801 208694 208909 208352 207630
56367 207630 207060 206513 205941 205477 205134 204942 205260 206382 207882 208942 209367 209825 210981 212861 215118 217390
56351 217390 219261 220462 221383 222884 225206 227518 228978 229838 230972 232632 234268 235428 236224 236979 237954
56336 237954 239417 241423 243457 244818 245481 246099 247069 248185 249331 250891 253062 255362 257328 259317 262022
56321 262022 265469 269091 272601 276162 279698 282672 284762 286386 288334 291049 294367 297858 301369 305230
56307 305230 309758 314509 318427 321039 323141 325902 329627 333924 338730 344336 350440 356092 360787 364916
56293 364916 368874 372375 375070 377256 379471 381824 384214 386872 390159 394044 398248 402770 407876 413715
56279 413715 420329 427945 436886 447214 458765 471450 485343 500580 517439 536419 557948 582058
56267 582058 608554 637478 669232 704394 743659 787851 837705 893557 955315 1022666 1095231
56256 1095231 1172653 1254708 1341201 1431592 1524710 1618794 1711667 1800950 1884508 1960845 2028766
56245 2028766 2086589 2132164 2164005 2182131 2187579 2181415 2164457 2137456 2101023 2055680 2002463 1943260
56233 1943260 1880078 1814161 1746181 1676974 1607452 1537998 1468570 1399443 1331381 1265160 1201441
56222 1201441 1141016 1084528 1031842 982164 934905 890104 848141 809534 774967 744870 718816
56211 718816 695797 675164 656829 640610 626093 613223 602286 593046 584607 576527 569404 563815
56199 563815 559251 554668 549690 544627 539678 534860 530547 527361 525434 524285 523488 522994 522781 522691 522847 523846
56183 523846 526148 529409 532710 535503 538171 541547 545935 550773 555378 559917 565342 572283 580297 588435
56169 588435 596330 604462 613420 623281 633846 645251 658014 672470 688370 705294 723473 743949
56157 743949 767815 795479 826879 862304 902800 949930 1005435 1071009 1147951 1236718 1336792
56146 1336792 1446664 1563471 1682664 1798582 1905902 2000812 2081467 2148256 2203911 2252524
56136 2252524 2297340 2338948 2375353 2403462 2420647 2425771 2419796 2405591 2386682 2365581 2342689 2316081
56124 2316081 2281937 2235690 2173732 2094922 2001089 1896525 1786864 1677644 1573093 1475910
56114 1475910 1387984 1310841 1245147 1190270 1144926 1108121 1079077 1056509 1038771 1024864 1014732
56103 1014732 1008260 1004434 1001891 1000087 999465 1000574 1003395 1007593 1013066 1019932 1028085 1037041 1046277 1055575
56089 1055575 1065014 1074830 1085373 1096934 1109417 1122357 1135410 1148620 1161919 1174660 1186191 1196802
56077 1196802 1207494 1218679 1229632 1239442 1248079 1256307 1264929 1274432 1284984 1296437 1308527 1321296
56065 1321296 1335061 1349788 1364936 1380211 1396114 1413333 1431931 1451476 1471691 1492595 1514308
56054 1514308 1537119 1561368 1586791 1612347 1637240 1661863 1687191 1713592 1740935 1769475 1799620
56043 1799620 1830848 1861874 1892178 1922603 1954132 1986851 2020499 2055382 2092212 2131492 2173499
56032 2173499 2218462 2266215 2316031 2367354 2420500 2476133 2534195 2593879 2654741 2717361 2782734
56021 2782734 2851214 2922305 2995458 3070801 3148916 3230038 3313863 3400308 3490038 3583877 3681958
56010 3681958 3783934 3889760 3999700 4113775 4232060 4355552 4485805 4623381 4767440
56001 4767440 4917324 5073884 5238711 5412722 5596159 5789461 5993400 6208608 6435700
55992 6435700 6675684 6929778 7199095 7485043 7789644 8114785 8461546 8831158 9226502
55983 9226502 9651766 10110686 10606055 11141094 11720331 12348754 13031009 13772234 14579432
55974 14579432 15461614 16428872 17491811 18662096 19953822 21385012 22978333 24760793
55966 24760793 26763697 29024186 31587866 34511018 37862601 41727238 46208617 51431193
55958 51431193 57539769 64698622 73090912 82917900 94398388 107767385 123266249 141110662
55950 141110662 161423345 184122917 208770686 234408720 259474944 281905914 299477012
55943 299477012 310295968 313257639 308276782 296230237 278669380 257433440 234295187
55936 234295187 210727315 187814012 166272756 146525225 128771121 113049312 99287619
55929 99287619 87343076 77033131 68159920 60529075 53961625 48298503 43401005 39150710
55921 39150710 35448553 32211808 29370472 26865469 24648124 22678693 20923896 19355192
55913 19355192 17948307 16682884 15541670 14509842 13574701 12725226 11951503 11244566 10596725
55904 10596725 10001706 9454265 8949599 8483115 8050759 7649527 7277450 6932788 6613304
55895 6613304 6316606 6041038 5785715 5549550 5330628 5126591 4935077 4753591 4579531
55886 4579531 4410929 4247059 4088171 3934964 3788384 3649188 3517067 3390585 3268599
55877 3268599 3151512 3040591 2936341 2838220 2745746 2659045 2578152 2502424 2430921 2362858 2297382
55866 2297382 2233413 2170216 2108078 2048059 1991065 1937251 1886296 1837991 1792425 1749671 1709498
55855 1709498 1671510 1635439 1601037 1567715 1534667 1501459 1468171 1434873 1401376 1367757 1334654
55844 1334654 1302617 1271461 1240768 1210757 1182114 1155070 1129260 1104458 1080919 1058877 1038258
55833 1038258 1019056 1001575 986002 972003 958974 946543 934744 923949 914723 907471 901987 897397
55821 897397 892660 887130 880769 873984 867171 860206 852413 843206 832620 821016 808499 795096 781308
55808 781308 767869 754870 741721 728198 715022 703046 692290 682185 672470 663386 655127 647633
55796 647633 641076 636197 633838 634082 635944 637958 639034 638669 636509 632172 625754 618166 610610 603890 598605
55781 598605 595706 596197 600226 606971 615337 624115 631511 635486 635170 631467 625893 619314 612351 606418 603423
55766 603423 604376 608740 615131 622221 629057 634959 639294 641157 639332 632823 621471 605916 587135 566258
55752 566258 544532 522917 501568 480059 458303 437031 417306 399683 383899 369222 355080
55741 355080 341491 328916 317682 307643 298530 290417 283589 278015 273242 268841 264732 260993 257495
55728 257495 253850 249701 245069 240478 236555 233413 230518 227319 223887 220728 218158 216161 214740 213962
55714 213962 213569 212940 211658 209833 207730 205333 202645 200212 198917 199141 200354 201701 202784 203685 204346
55699 204346 204330 203385 202022 201167 201249 201875 202461 202875 203324 203965 204983 206840 209927 213869 217618 220449 222707
55682 222707 225354 228913 232990 236722 239548 241628 243698 246483 250096 253972 257357 259801 261157 261389
55668 261389 260691 259677 259078 259100 259261 258955 257930 256115 253362 249712 245776 242416 240073 238729 238516 239895
55652 239895 243087 247748 253459 260208 268096 276968 286775 298089 311661 327464 344581 362066 379457
55639 379457 396333 411807 424827 434848 442006 446684 449042 448920 446246 441577 436064 430680 425608
55626 425608 420693 416349 413554 412883 413957 415961 418239 420194 421062 420218 417470 412686 405301 394592 380445
55611 380445 363589 345056 325614 305678 285612 265967 247384 230232 214459 199894 186554
55600 186554 174418 163142 152413 142613 134531 128315 123183 118428 114184 110795 107927 104848 101342
55587 101342 97817 94646 91820 89184 86630 84109 81749 79850 78463 77160 75552 73873 72649 71929
55573 71929 71303 70639 70228 70187 70109 69519 68392 67167 66422 66539 67393 68410 69183 69979 71350 73310 75307 76927
55555 76927 78202 79214 79898 80418 81272 82746 84556 86283 87930 89796 91990 94295 96445 98303 99803
55540 99803 100813 101070 100327 98647 96426 93959 91160 88018 85198 83602 83236 83025 82020 80435 79167
55525 79167 78609 78360 77964 77460 77147 77113 77183 77288 77729 79021 81401 84579 88079 91743 95719 100067 104735
55508 104735 110030 116685 125155 135029 145449 156026 167115 179218 192398 206268 220354 234262
55496 234262 247537 259461 269124 275798 279197 279354 276326 270202 261321 250203 237212 222489 206358
55483 206358 189636 173353 158251 144544 131974 119981 108064 96325 85615 76887 70262 64884
55471 64884 59765 54662 50022 46173 42895 39920 37560 36379 36212 35965 34666 32427 30147 28512 27681
55456 27681 27594 28017 28334 27942 26970 26096 25540 24757 23426 22195 21964 22674 23231 22496 20156 16888 14021 12758
55438 12758 13225 14341 14912 14770 14541 14583 14720 14922 15534 16529 17016 16031 13635 10912 8959 8145 8261 9011
55420 9011 10150 11363 12328 12968 13493 14028 14296 13909 12973 12172 12018 12230 12150 11682 11455 11934 12722 13045 12675
55401 12675 12006 11324 10483 9446 8706 8826 9756 10918 11817 12251 12116 11484 10859 10822 11258 11421 11019 10727 11229
55382 11229 12200 12776 12691 12323 11862 11173 10432 10101 10075 9594 8381 7282 7250 8102 8805 8699 7952 6951 5797
55363 5797 4488 3177 2118 1490 1309 1395 1463 1352 1104 732 50 -1074 -2414 -3521 -4117 -4224 -3967 -3450
55345 -3450 -2767 -1990 -1172 -435 33 188 246 434 662 548 -195 -1432 -2604 -3065 -2612 -1702 -999 -700 -537
55326 -537 -374 -430 -773 -1084 -1181 -1389 -1929 -2327 -1932 -914 -160 -243 -885 -1478 -1706 -1593 -1363 -1350 -1708 -2160 -2308
55305 -2308 -2204 -2183 -2146 -1571 -404 629 981 1037 1397 1757 1227 -297 -1752 -2100 -1419 -550 -19 336 870 1659
55285 1659 2548 3349 3869 3940 3641 3392 3648 4460 5436 6180 6639 6951 7100 6963 6628 6339 6013 5137 3469
55266 3469 1703 981 1667 2900 3539 3241 2420 1517 743 322 396 638 482 -130 -686 -964 -1422 -2368 -3266
55247 -3266 -3481 -3334 -3683 -4589 -5105 -4506 -3009 -1167 825 2826 4343 4919 4662 4029 3330 2779 2698 3249
55229 3249 4069 4567 4498 4026 3384 2734 2268 2065 1958 1758 1546 1520 1704 2036 2574 3284 3761 3589 2909 2291
55209 2291 1996 1750 1280 733 378 136 -345 -1218 -2126 -2407 -1626 -22 1650 2684 2832 2145 772 -839 -1880
55190 -1880 -1792 -931 -279 -413 -998 -1283 -904 -134 441 512 379 648 1477 2320 2617 2467 2260 1982 1407 832
55170 832 921 1785 2809 3523 3992 4193 3726 2585 1620 1613 2293 2875 3282 4064 5216 5854 5309 3977 2763
55151 2763 2068 1704 1469 1357 1291 1086 752 552 591 561 57 -938 -2074 -2993 -3552 -3744 -3619 -3248 -2565 -1321
55131 -1321 545 2504 3752 4032 3786 3447 3048 2736 3079 4318 5700 6199 5688 4809 3894 2792 1712
55114 1712 1354 1955 2965 4065 5806 8698 12154 14980 16658 17580 18236 18775 19289 19933 20625 21002 20845
55097 20845 20321 19726 19167 18579 17931 17348 17043 17097 17251 17133 16736 16479 16612 16825 16730 16518 16781 17744 19041
55078 19041 20150 20731 20547 19517 17995 16661 15971 15881 16182 16836 17790 18720 19247 19305 19135 18941 18685 18191
55060 18191 17393 16546 16199 16772 18018 19064 19201 18521 17628 16889 16270 15788 15657 15875 16043 15877 15626 15693 16006
55041 16006 16140 15917 15547 15224 15037 15285 16400 18283 20079 20934 20777 20134 19436 18832 18428 18310 18368 18453 18637
55022 18637 19053 19530 19759 19774 19855 19978 19779 19190 18703 18775 19271 19732 19974 20124 20193 19905 19016 17712 16616 16306
55002 16306 16712 17098 16799 15959 15378 15723 17079 19034 20858 21690 21196 20141 19810 20643 21835 22469 22556 22591
54984 22591 22606 22239 21507 20937 20908 21299 21804 22279 22723 23198 23844 24797 26006 27208 28088 28486 28543 28653 29107
54965 29107 29750 30176 30306 30472 30859 31258 31529 31937 32754 33855 34996 36183 37456 38656 39791 41307 43598
54948 43598 46575 50157 54736 60563 67096 73769 81095 89998 100097 109731 117892 125081 131771 136981
54934 136981 139136 137755 133498 127031 118721 109259 99741 90934 82904 75411 68251 61251 54431 48327
54920 48327 43725 40848 39023 37318 35301 33160 31329 30247 30269 31454 33424 35632 37871 40399 43453
54905 43453 46796 49928 52773 55929 60138 65620 72046 78985 86174 93434 100602 107554 114080 119646
54891 119646 123444 124764 123314 119311 113438 106551 99126 91075 82387 73818 66462 60633 55709 51156
54877 51156 47144 43817 40631 36992 33239 30329 28693 27950 27647 27705 28095 28630 29243 30040 30902 31383 31230
54860 31230 30728 30340 30195 30113 29947 29744 29718 30103 30846 31356 30880 29340 27605 26646 26507 26345 25417 23822 22260
54841 22260 21294 20975 21095 21613 22622 23894 24718 24457 23204 21634 20279 19255 18633 18576 18954 19296 19384 19539
54823 19539 19992 20376 20307 20140 20592 21793 23254 24632 25857 26645 26663 26314 26574 27662 28587 28479 27792 27539
54805 27539 27809 27897 27661 27938 29416 31779 34139 35892 36941 37534 38233 39789 42665 46693 51350 56372
54789 56372 62056 68973 77343 86627 95847 104383 112241 119396 125183 128755 129908 128968 126034 120972 114192
54774 114192 106727 99320 92034 85047 79113 74761 71528 68628 66017 64138 62922 61800 60688 60232
54760 60232 60848 62051 63011 63416 63578 64004 65173 67531 71376 76665 82936 89418 95368 100578 105564 111075
54744 111075 117357 124065 130757 137160 142904 147362 150004 150704 149529 146343 140845 132985 123264 112614
54730 112614 101975 91875 82430 73772 66305 60305 55339 50495 45363 40538 37011 35235 34943 35523
54716 35523 36292 36566 35945 34642 33291 32318 31641 31043 30614 30640 31136 31698 31868 31539 30989 30548 30307 30075 29604
54697 29604 28912 28440 28745 29871 31151 31867 32065 32383 33094 33756 33958 33946 34116 34318 34241 34193 34835 36200 37694
54678 37694 39154 41075 43451 45189 45372 44643 44511 45440 46424 46475 45777 45070 44523 43796 42885 42313 42466 43170
54660 43170 44010 44772 45393 45774 45923 46182 47036 48602 50467 52129 53515 55009 57086 60020 63802 68205
54644 68205 72982 78164 84132 91204 99120 107051 114101 119676 123498 125563 126191 125799 124393 121503 116869
54629 116869 111105 105398 100546 96456 92522 88262 83565 78647 73970 70063 67133 64768 62193 58995
54615 58995 55622 53074 51990 52026 52179 51696 50583 49264 47949 46515 44877 43287 42151 41635 41502 41320
54599 41320 40839 40179 39688 39569 39693 39736 39395 38447 36779 34663 32934 32549 33679 35378 36361 36077 34939
54582 34939 33711 32969 33007 33764 34678 34999 34539 33840 33351 32789 31724 30484 29847 29899 29843 29118 28131 27632 27853
54563 27853 28576 29576 30524 30853 30308 29464 29107 29191 28997 28300 27782 28102 29039 29842 30090 29917 29616 29384 29367
54544 29367 29768 30839 32743 35302 37920 39979 41378 42575 44069 46057 48558 51524 54703 57716 60450
54529 60450 63200 66197 69153 71441 72630 72670 71749 70109 67892 65053 61569 57856 54732 52648 51103
54514 51103 49157 46527 43889 42043 41061 40427 39806 39368 39346 39577 39705 39735 40064 40770 41153 40334 38327 36216
54496 36216 35151 35341 36040 36333 35805 34736 33847 33790 34608 35697 36401 36626 36821 37446 38544 39749 40592 40867
54478 40867 40817 40994 41817 43200 44590 45346 45099 43905 42166 40419 39084 38317 38053 38189 38707 39591 40596
54461 40596 41291 41472 41423 41492 41506 41025 40189 39717 39808 39708 38878 38020 38137 38944 39257 38819 38609 39145 39602 39217
54441 39217 38570 38644 39271 39502 39154 38955 39269 39559 39290 38657 38157 37889 37547 36803 35524 33845 32122 30691
54423 30691 29672 29165 29435 30607 32270 33838 35250 36957 39183 41605 43788 45576 46952 47958 48914
54408 48914 50293 52117 53788 54762 55158 55426 55668 55621 55214 54729 54452 54461 54802 55488 56224 56429 55847 54963 54478
54389 54478 54418 54109 53107 51757 50635 49778 48870 47918 47279 46988 46586 45734 44609 43574 42815 42440 42598 43237
54371 43237 44040 44800 45551 46139 46103 45315 44409 44149 44570 45119 45395 45381 45149 44859 44940 45794 47309 48972 50414
54352 50414 51481 52002 51944 51766 52097 52953 53685 53769 53267 52425 51268 49816 48370 47368 47048 47321 47789 47864
54334 47864 47165 45902 44704 43998 43720 43578 43385 43077 42655 42179 41688 41144 40568 40158 40113 40449 41130 42094 42900
54315 42900 42664 40914 38324 36090 34667 33631 32693 32116 32062 32258 32549 33167 34144 35001 35401 35623 36013 36401
54297 36401 36467 36320 36252 36185 35837 35224 34617 34172 33955 34136 34756 35444 35805 36044 36764 38085 39268 39428 38486
54278 38486 37313 36879 37328 37939 38052 37829 37818 37971 37642 36631 35698 35650 36349 37021 37282 37382 37560 37644 37399
54259 37399 36986 36912 37530 38589 39328 39212 38503 37912 37728 37716 37858 38576 39888 40910 40751 39631 38562 38120
54241 38120 38057 37978 37861 37884 38207 38999 40281 41635 42405 42316 41685 41023 40680 40850 41536 42296 42320 41080 38863
54222 38863 36570 35002 34397 34511 34942 35328 35411 35120 34636 34227 33935 33581 33209 33227 33853 34654 35089 35302 35823
54203 35823 36554 36755 36184 35515 35388 35722 36320 37380 38787 39619 39209 38263 38022 38597 39042 38854 38467 38212
54185 38212 37747 36800 35709 34913 34450 34240 34307 34467 34323 33913 33891 34682 35819 36457 36265 35523 34632 33827 33191
54166 33191 32671 32163 31666 31243 30815 30292 29908 30030 30557 30887 30620 29886 28956 28003 27431 27804 29098 30488
54148 30488 31310 31811 32536 33426 34069 34437 34732 34739 34045 32803 31673 31049 30932 31494 33016 35071 36495 36530
54130 36530 35592 34578 33824 33138 32472 32061 32024 32275 32772 33521 34328 34881 35170 35549 36310 37291 38012 38093 37536
54111 37536 36697 36027 35706 35525 35195 34771 34670 35200 36169 37003 37224 36825 36311 36367 37285 38643 39703 40194 40524
54092 40524 41049 41394 40869 39534 38465 38803 40673 43134 44996 45624 45180 44329 43689 43437 43441 43720 44560 46090
54074 46090 47931 49432 50203 50309 50084 49857 49762 49607 49048 48027 46999 46563 46852 47423 47754 47782 47959 48778
54056 48778 50219 51746 52977 54228 56064 58391 60504 62147 63985 66617 69622 72114 73959 75790
54042 75790 78031 80589 83523 87238 91814 96625 100955 104627 107883 111015 114328 118052 121980 125477
54028 125477 128107 129998 131417 132330 132746 133138 134069 135432 136430 136290 134784 132158 128840 125234 121545 117767
54012 117767 113945 110368 107369 104905 102550 99919 96983 93940 90893 87749 84450 81262 78677 76896
53998 76896 75510 73887 71880 69924 68440 67446 66777 66333 65924 65256 64354 63732 63751 63982 63650 62645 61643
53981 61643 61182 61024 60630 59942 59386 59254 59411 59604 59879 60508 61624 62975 64084 64650 64788 64906 65304 65907
53963 65907 66421 66760 67187 67935 68810 69417 69800 70537 71999 73789 75185 75975 76508 77088 77787 78816 80567
53946 80567 83043 85672 87986 90270 93204 97046 101402 105701 109678 113459 117434 122077 127692 134221
53932 134221 141236 148087 154117 158962 162724 165781 168456 170978 173642 176601 179509 181787 183493 185540
53918 185540 188726 192800 196839 200360 203673 207222 210998 214585 217506 219381 220009 219471 218114 216346 214434
53903 214434 212389 210034 207278 204326 201468 198628 195373 191439 186970 182084 176568 170355 163984 158129
53889 158129 152799 147483 142030 136908 132473 128459 124438 120499 117148 114674 112893 111505 110470 109840
53875 109840 109303 108142 105895 102945 100163 97913 95740 93189 90545 88431 86979 85812 84662 83497
53861 83497 82172 80472 78585 77036 75992 75049 73879 72698 71800 70996 69923 68739 68115 68514 69684 70857
53845 70857 71336 70923 70028 69364 69342 69634 69417 68136 66086 64219 63370 63629 64453 65291 66039 66884 67856 68704
53827 68704 69151 69135 68767 68220 67732 67622 68098 69028 70013 70801 71580 72724 74294 76007 77701 79598 81914
53810 81914 84518 87235 90269 93890 97903 101919 106053 110710 115597 119661 122318 124124 125869 127563
53796 127563 128838 129844 131022 132252 132969 133079 133142 133635 134410 134900 134560 133246 131426 129791 128316 126054
53780 126054 122358 117893 113825 110420 107264 104463 102498 100973 98762 95678 92864 91095 89705 87799
53766 87799 85585 83729 82183 80562 79161 78605 78740 78702 77980 76771 75375 73889 72440 71188 70090 69047
53750 69047 68155 67461 66635 65332 63702 62163 60819 59565 58507 57809 57319 56910 56995 58067 59847 61492
53734 61492 62620 63531 64402 65002 65262 65460 65597 65241 64259 63196 62584 62373 62376 62808 63885 65230 66135 66339
53716 66339 66198 66229 66697 67516 68303 68651 68516 68242 68127 68256 68835 70263 72524 74819 76291 76945 77458 78220
53698 78220 79073 79979 81351 83453 85821 87631 88542 88936 89414 90283 91555 93200 95187 97274 98938 99696
53682 99696 99506 98781 98080 97866 98498 100075 102098 103552 103788 103299 103298 104357 105735 106242 105547 104379 103593 103389
53664 103389 103450 103419 103030 102069 100597 99153 98427 98691 99662 100873 101912 102422 102264 101802 101714 102261 102970 103245
53646 103245 103087 103033 103525 104623 106112 107567 108414 108266 107274 106011 105045 104761 105366 106691 108067 108799 108838
53629 108838 108688 108661 108599 108393 108390 108982 110103 111383 112626 113918 115401 117229 119600 122500 125406 127491 128303
53612 128303 128179 127937 128181 128946 129910 130845 131749 132675 133644 134800 136355 138207 139794 140664 141113 142003 143898
53595 143898 146607 149557 152358 154946 157441 159951 162342 164177 165066 165131 164914 164814 164787 164608 164159 163469 162695
53578 162695 162114 161867 161738 161452 161091 160799 160168 158572 156256 154402 153773 153850 153733 153367 153277 153525 153637 153411
53560 153411 153166 153186 153409 153627 153630 153241 152611 152310 152724 153491 153997 154233 154618 155153 155448 155522 155776 156066 155709 154774
53540 154774 154575 156202 159031 161412 162626 163502 165161 167718 170439 172791 175043 177875 181614 185981 190580
53525 190580 195332 200162 204511 207688 209837 212063 215410 220015 225450 231465 238037 245018 252202 259594
53511 259594 267300 275278 283453 291946 300922 310350 320199 330731 342276 354784 367887 381385 395398
53498 395398 410079 425342 440839 456100 470833 485215 499624 513954 527554 540177 552559
53487 552559 565518 578818 591657 604111 617226 631499 646066 659833 672837 685951 699628
53476 699628 713420 726573 738666 749790 760495 771492 783103 794957 806380 816976 826621 835024
53464 835024 841662 846242 849088 850933 852278 852893 851969 848907 843942 837870 831203 823894 815896 807568 799313
53449 799313 791206 783257 775619 768103 759825 750005 739023 728124 718058 708532 699038 689511 679917
53436 679917 669805 658850 647567 636962 627571 619246 611858 605806 601606 599167 597591 595757 593175
53423 593175 590325 588090 586888 586506 586743 587820 589934 592750 595709 598689 602015 605996 610815 616760 624107
53408 624107 632753 642374 652928 664547 676893 689218 701347 714131 728504 744460 761400 779142
53396 779142 798055 818377 840017 862963 887356 913066 939731 967358 996431 1027160 1058969
53385 1058969 1090992 1122789 1154369 1185871 1217561 1249843 1282793 1315747 1347747 1378403 1407998
53374 1407998 1436768 1464422 1490501 1514870 1537628 1558741 1577962 1595067 1609974 1622659 1633106
53363 1633106 1641353 1647428 1651189 1652224 1649991 1644042 1634134 1620232 1602543 1581580 1558044 1532527 1505337
53350 1505337 1476653 1446776 1416158 1385269 1354591 1324662 1295937 1268581 1242530 1217747 1194216
53339 1194216 1171666 1149533 1127305 1104735 1081672 1057913 1033363 1008292 983391 959685 938173
53328 938173 919118 901630 884471 867531 852097 839333 828920 819570 810450 801563 793032 784733
53316 784733 776522 768177 759131 748864 737658 726420 715724 705523 695827 686911 678692 670608 662532
53303 662532 655248 649594 645608 642943 641601 641646 642601 643821 645382 647998 652095 657399 663368 669653 676219
53288 676219 683421 691936 702215 714038 726900 740671 755419 770740 785880 800582 815253 830131
53276 830131 844718 858231 870228 880599 889408 897074 904313 911490 918174 923612 927425 929554 929771
53263 929771 927762 923667 918146 911742 904514 896354 887339 877457 866225 853066 838164 822564 807199
53250 807199 792000 776292 759886 743385 727421 712018 696923 682179 668033 654506 641383
53239 641383 628502 615794 603116 590322 577369 564114 550218 535633 521050 507406 494976
53228 494976 483319 472067 461261 450882 440669 430718 421794 414591 408937 404070 399520 395353 391621
53215 391621 387986 383948 379214 373654 367057 359125 349925 340191 330839 321984 312765 302503 291794 281997
53201 281997 273763 266721 260490 255169 250559 245753 240149 234284 229050 224459 219862 215034 210270 205616
53187 205616 200873 196338 192671 189802 186700 182636 178081 173888 170093 166162 162172 159055 157553 157344
53173 157344 157432 157142 156524 155859 155067 153797 152015 150239 148987 148260 147789 147592 147843 148200 147794 146128 143662
53156 143662 141289 139514 138376 137810 137631 137381 136675 135707 135029 134763 134436 133666 132647 131748 131000 130290 129791
53139 129791 129754 129962 129832 129154 128357 127874 127564 127025 126239 125576 125245 125046 124638 123762 122252 120186 118094 116618
53121 116618 115772 114831 113210 111168 109362 107990 106821 105871 105508 105784 106121 105820 104666 102923 101045 99456
53105 99456 98319 97355 96142 94740 93743 93559 93944 94448 94899 95119 94570 92934 90917 89815 90125 91072 91648
53088 91648 91644 91346 90772 89705 88269 86932 85982 85460 85587 86720 88642 90325 90834 90313 89728 89672 89842 89753
53070 89753 89571 89855 90662 91337 91313 90789 90358 90161 89820 89198 88810 89242 90379 91515 92112 92160 91808 91049 89926
53051 89926 88779 88009 87648 87376 86926 86328 85811 85594 85810 86495 87548 88711 89704 90470 91363 92909 95233
53034 95233 97770 99769 101060 102041 102970 103693 104190 104845 105818 106557 106546 106242 106634 107955 109520 110832 112127
53017 112127 113627 114896 115375 115085 114423 113638 112912 112571 112749 113105 113301 113515 114065 114784 115267 115513 115804 116107
52999 116107 116178 116178 116539 117211 117647 117643 117597 117740 117703 117179 116461 115927 115416 114594 113624 113004 112920 113196 113696 114321 114763
52978 114763 114737 114454 114445 114866 115390 115848 116475 117395 118244 118665 118934 119703 121220 123088 124781 126109 127091 127630
52960 127630 127513 126716 125548 124531 124143 124596 125680 126790 127327 127248 127151 127646 128715 129880 130973 132367 134279
52943 134279 136143 137048 136724 135763 134816 133878 132533 130720 128990 127970 127686 127461 126509 124694 122667 121226
52927 121226 120585 120425 120524 121029 121925 122625 122451 121445 120402 120103 120712 121868 122981 123415 122793 121386 119974
52910 119974 119063 118468 117817 117175 116810 116635 116323 115901 115735 115903 116019 115750 115107 114166 112949 111792 111295 111574
52892 111574 111907 111565 110757 110326 110655 111308 111620 111284 110395 109361 108813 109229 110497 112026 113312 114177 114589
52875 114589 114618 114662 115305 116776 118738 120736 122605 124336 125744 126495 126326 125169 123214 120933 118892 117391
52859 117391 116351 115540 114757 113718 112061 109669 106897 104310 102261 100762 99689 98996 98773 99073 99596 99632
52843 99632 98553 96505 94392 93015 92331 91696 90713 89663 89122 89327 89951 90464 90617 90532 90352 89998 89362 88562
52825 88562 87760 86861 85666 84248 82842 81373 79501 77313 75565 74956 75344 75931 76075 75729 75184 74687 74327
52808 74327 74151 74306 74971 76077 77200 77918 78233 78474 78817 79173 79477 79775 80041 80241 80574 81250 82074 82699
52790 82699 83332 84516 86048 86867 86474 85818 86148 87415 88535 88887 88828 88883 89146 89472 89666 89406 88533 87427
52772 87427 86720 86649 87081 87995 89357 90645 91253 91471 92305 94075 95820 96450 95954 95134 94654 94797 95687 97169
52754 97169 98596 99235 98997 98542 98685 99725 101183 102112 101942 101183 101050 102235 104194 105747 106092 105176 103499
52737 103499 101853 100891 100635 100508 100094 99624 99552 99952 100597 101289 101724 101432 100381 99433 99619 100980 102656 104090
52719 104090 105617 107674 109973 111849 113156 114409 116047 117812 119026 119393 119407 119847 120931 122131 122811
52704 122811 122789 122251 121425 120594 120167 120399 121145 122078 122961 123519 123348 122411 121443 121292 121906 122451 122432 122155 121996
52685 121996 121854 121637 121779 122726 124136 125084 125042 124344 123715 123568 123780 123892 123510 122646 121713 121094 120704 120030 118567
52666 118567 116198 113268 110378 108060 106501 105555 104987 104634 104360 103997 103423 102600 101530 100339 99389 99050
52650 99050 99264 99545 99547 99358 99094 98552 97659 97018 97483 99254 101810 104682 107687 110271 111340 110336 108200
52633 108200 106653 106508 107066 107181 106463 105344 104435 104081 104262 104580 104494 103916 103470 103794 104626 104985 104364 103361
52615 103361 102917 103247 103840 104264 104558 104938 105550 106566 108130 110030 111670 112576 112768 112595 112408 112500 113106 114210
52597 114210 115518 116734 117756 118523 118945 119137 119439 119963 120373 120416 120384 120658 121037 120981 120395 119600 118657 117336
52579 117336 115837 114780 114207 113265 111355 109058 107341 106238 105018 103463 102234 101883 102119 102283 102084 101602
52563 101602 100856 99732 98246 96654 95276 94221 93241 91952 90310 88814 88032 87973 88101 87926 87364 86624
52547 86624 86082 86250 87460 89375 91120 92098 92468 92708 92976 93133 93131 93088 93085 93166 93472 94105 94920 95591 95928 95953
52527 95953 95749 95380 94905 94327 93535 92440 91217 90243 89747 89512 88991 87760 85918 84015 82494 81302 80167
52510 80167 79145 78557 78437 78389 78151 77944 78047 78311 78384 78195 77885 77489 77032 76848 77409 78829 80746 82597
52492 82597 83791 83857 82867 81675 81203 81408 81351 80431 79222 78764 79339 80204 80468 80043 79692 80176 81337 82143
52474 82143 81745 80354 78883 77905 77372 77195 77488 78152 78780 79311 80284 82018 83844 84646 84068 82795 81780
52457 81780 81475 81705 81933 81704 81146 80991 81783 83071 83738 83170 81834 80651 80078 79926 79737 79178 78300 77618
52439 77618 77752 78724 79730 79907 79325 78941 79491 80616 81286 80976 80173 79685 79705 79827 79875 80290 81463 82922
52421 82922 83624 83171 82397 82463 83481 84434 84469 83960 84048 85322 87322 89234 90652 91441 91315 90041 88037 86355
52403 86355 85884 86681 88099 89412 90236 90570 90601 90531 90528 90778 91439 92473 93651 94824 96038 97207 97903 97864
52385 97864 97589 97966 99227 100665 101490 101615 101398 101075 100727 100545 100742 101336 102200 103169 103937 104160 103974 104149
52367 104149 105352 107387 109520 111373 113128 114990 116892 118768 120649 122437 123936 125195 126500 127907
52353 127907 129095 129841 130353 130960 131695 132425 133198 134218 135479 136648 137441 138075 139242 141473 144466 147240
52337 147240 149112 150426 152111 154675 157856 161126 164226 167245 170545 174627 179764 185652 191659 197503
52323 197503 203492 210152 217913 227044 237380 248060 258081 267423 277228 288599 301558 315436 329816
52310 329816 344553 359208 373132 386180 398904 411953 425541 439490 453527 467489 481373
52299 481373 495099 508123 519554 529046 537351 545530 553645 560699 565858 569247 571523 573210 574667
52286 574667 576157 577450 577710 576226 573206 569552 566055 563033 560517 558306 555947 553155 550334 548301
52272 548301 547373 547060 546809 546744 547428 549138 551668 554785 558602 563487 569751 577393 586117 595623 605940
52257 605940 617297 629503 641681 652946 663303 673485 683877 693972 703124 711446 719586 727780
52245 727780 735491 741971 746856 750219 752390 753888 755199 756371 756858 755934 753221 748814 743085 736566 729865
52230 729865 723427 717279 711185 705050 699057 693393 688012 682808 677923 673690 670215 667184 664184 661118
52216 661118 658126 655150 651930 648553 645745 644275 644172 644823 645825 647392 649787 652690 655357 657252 658388
52201 658388 659217 660356 662195 664587 666988 669066 670935 672673 673964 674565 674802 675059 674966 673796 671748 670121
52185 670121 669866 670523 670992 670914 670700 670478 669792 668368 666564 664800 662975 660784 658297 655796 653160 649799
52169 649799 645365 640316 635594 631812 628890 626389 623933 621231 617988 614166 610221 606750 603827 601086
52155 601086 598521 596665 595623 594401 591848 588143 584670 582350 580748 578971 576812 574555 572210 569562
52141 569562 566732 564031 561352 558310 555069 552502 551300 551286 551847 552727 554076 555923 557970 559912 561769
52126 561769 563817 566306 569276 572634 576469 581254 587578 595620 605013 615317 626415 638383 651201
52113 651201 664874 679647 695727 712753 729910 746725 763545 780998 799095 816996 833582
52102 833582 848143 860673 871793 882364 892852 902848 911364 917744 922230 925490 927701 928408 927333
52089 927333 924976 922137 919002 914999 909586 902935 895779 888796 882250 876050 869908 863530 856852 850262
52075 850262 844528 840398 838107 837175 836745 836269 835971 836587 838647 842051 846357 851268 856702 862572 868698
52060 868698 875007 881622 888679 896064 903379 910177 916303 922035 927853 933939 939911 944996 948492 950138
52046 950138 950189 949203 947619 945391 942106 937431 931354 923919 914988 904475 892719 880385 868062 856083
52032 856083 844598 833484 822181 809994 796741 782980 769436 756330 743364 730270 717193
52021 717193 704547 692539 680840 668822 656212 643442 631148 619396 607707 595831 584108
52010 584108 572858 561745 550079 537575 524477 511050 497323 483354 469407 455723 442308
51999 442308 429030 415737 402174 388009 373159 358090 343597 330161 317598 305370 293308
51988 293308 281905 271806 263075 255205 247823 241071 235071 229411 223610 217870 212801 208374 203735 198253
51974 198253 192266 186506 181225 176268 171624 167402 163460 159651 156293 153888 152331 150921 149176 147198
51960 147198 145157 143011 140969 139677 139482 139844 139831 139000 137485 135536 133419 131525 130072 128805 127338
51945 127338 125667 123961 122078 119846 117736 116605 116657 117209 117627 117918 118169 118057 117365 116536 116171 116208 116061
51928 116061 115407 114410 113382 112668 112685 113481 114313 114236 113232 112272 112068 112230 111983 111239 110520 110019 109288 107914
51910 107914 106112 104439 103133 101960 100672 99361 98291 97517 96844 96174 95704 95710 96207 96957 97772 98624 99463
51893 99463 100056 100133 99700 99111 98737 98581 98329 97866 97595 97995 98946 99776 100089 100276 101015 102474 104212 105735
51875 105735 106895 107829 108726 109633 110368 110752 111046 111926 113799 116325 118907 121529 124727 128819 133606 138860
51859 138860 144711 151455 159325 168598 179639 192592 207191 222962 239352 255486 270024 281569
51847 281569 289165 292418 291385 286547 278714 268626 256735 243546 230077 217602 206806 197327 188325
51834 188325 179423 171021 163703 157533 152059 146952 142437 139014 136835 135447 134072 132183 129909 127979
51820 127979 127067 127073 127226 126943 126363 125842 125274 124317 123090 122132 121687 121435 121033 120581 120432 120752 121320 121620 121254
51801 121254 120431 119893 120030 120317 120095 119690 120023 121191 122207 122368 122143 122372 123213 124322 125510 126680 127474
51784 127474 127534 126949 126133 125453 125143 125202 125130 124292 122871 121939 122159 122930 123387 123688 124618 126300 128074 129398
51766 129398 130186 130473 130484 130812 131762 132654 132546 131528 130448 129514 128212 126696 126131 127150 128925 130291 131134
51749 131134 131999 132963 133627 133915 134204 134774 135552 136306 136797 136884 136647 136245 135608 134651 133829 133844 134567 134920 134291
51730 134291 133401 133168 133348 133122 132569 132527 133147 133615 133470 133289 133688 134316 134268 133093 131014 128499 125935 123492
51712 123492 121042 118386 115738 113673 112442 111611 110601 109357 108254 107611 107486 107703 107794 107212 105916 104596
51696 104596 103966 104048 104515 105457 107173 109257 110657 110915 110756 111012 111406 110965 109355 107186 105130 103420 102260
51679 102260 102023 102675 103468 103660 103270 102796 102450 102157 102076 102542 103460 104228 104427 104167 103658 102852 101814 101116 101375
51660 101375 102444 103426 103604 103179 103021 103798 105441 107375 109135 110676 112121 113351 114007 113947 113572 113596 114453
51643 114453 115898 117168 117581 117086 116252 115705 115664 116003 116535 117001 116993 116294 115303 114709 114640 114515 113927 113236 112960
51624 112960 112896 112438 111596 111036 111032 110986 110348 109553 109504 110284 110919 110516 109218 107891 107182 107143 107533 108115 108692 109144
51604 109144 109516 109861 109941 109334 107959 106345 105193 104781 104907 105310 105921 106747 107773 109018 110495 111999 113102
51587 113102 113548 113681 114248 115607 117157 117797 117087 115801 115077 115181 115423 115279 115029 115124 115411 115473 115362 115431 115582
51568 115582 115349 114786 114670 115582 117251 119094 120953 122956 124952 126630 128068 129702 131728 133860 135795
51553 135795 137618 139606 141806 143988 145923 147581 149106 150649 152211 153575 154445 154733 154703 154722 154850 154888
51537 154888 154849 155189 156292 157832 158990 159315 159060 158625 158046 157247 156406 155735 155136 154386 153455 152292 150578
51520 150578 148192 145782 144310 143999 144132 143911 143064 141613 139619 137397 135520 134286 133413 132450 131246 129914
51504 129914 128604 127457 126507 125535 124336 123219 122768 122963 123019 122439 121747 121746 122406 122951 122829 122103 121070 120005
51486 120005 119222 118898 118785 118403 117620 116807 116437 116687 117371 117994 117947 116952 115309 113532 111806 110055 108449
51469 108449 107449 107231 107376 107295 106838 106324 106086 106119 106175 106044 105654 104984 104162 103651 103991 105039 105787 105408 104390
51450 104390 104023 104747 105650 105755 105170 104595 104373 104583 105502 107230 109099 110179 110230 109658 108706 107353 105905
51433 105905 104948 104602 104353 103784 103001 102253 101620 101214 101232 101590 101874 101899 101941 102245 102601 102634 102231 101451 100228 98466
51413 98466 96335 94245 92534 91276 90312 89490 88899 88836 89407 90251 90822 90903 90695 90472 90388 90469 90506 89972 88402
51394 88402 85913 83141 80717 78996 78123 77947 77906 77488 76878 76778 77483 78502 79223 79578 79873 80282 80750 81147
51376 81147 81344 81308 81215 81260 81257 80770 79754 78753 78238 78047 77756 77363 77286 77729 78335 78503 78007 77300 77123 77654
51356 77654 78077 77289 75137 72729 71425 71635 72639 73338 73127 72271 71567 71523 71878 72107 72269 72910 74120 75199
51338 75199 75480 75085 74587 74261 74026 73855 73846 73982 74157 74440 75055 76041 77017 77361 76664 75206 73964 73929 75289
51319 75289 77348 79250 80585 81361 81699 81633 81055 79821 78133 76761 76509 77416 78792 80008 80873 81268 81040
51302 81040 80469 80240 80633 81149 81287 81218 81281 81292 80872 80138 79511 79037 78413 77601 76936 76652 76699 77028 77714 78765
51282 78765 80041 81346 82396 82871 82737 82422 82375 82546 82568 82348 82233 82616 83651 85320 87562 90236 93060
51265 93060 95614 97557 98996 100515 102441 104100 104304 102751 100453 98545 97139 95719 94151 92782 91819
51250 91819 91141 90577 90037 89506 89178 89308 89717 89800 89296 88586 87959 87193 86348 86247 87457 89274 90577 91222
51232 91222 91724 92054 91848 91556 92126 93559 94884 95684 96563 97875 99087 99729 99978 99891 99040 97542 96497
51215 96497 96696 97549 98017 97938 97770 97589 97243 97112 97795 99189 100539 101365 101741 101758 101285 100368 99411 98836 98676
51196 98676 98491 97604 95641 93021 90666 89114 88200 87657 87518 87616 87260 85959 84147 82708 81996 81750 81686
51179 81686 81650 81476 81197 81212 81724 82242 82184 81864 82283 84002 86709 89776 92655 94773 95741 95840 95774 95769 95371 94258
51159 94258 92768 91378 90135 88926 87969 87659 88048 88772 89438 89925 90353 90843 91283 91359 90913 90199 89619 89272
51141 89272 88990 88783 88987 89900 91511 93519 95382 96421 96335 95701 95586 96453 97761 98811 99608 100536 101460
51124 101460 101717 100985 99759 98770 98206 97742 97198 96880 97223 98319 99947 101945 104300 106899 109419 111543
51108 111543 113104 114000 114211 114045 114072 114564 115169 115382 115140 114664 113926 112722 111208 109915 109149 108711 108338 108047
51090 108047 107936 107923 107889 107890 108074 108502 109136 109858 110463 110855 111301 112259 113772 115250 116085 116421 117087 118701 120960
51071 120960 122906 123901 124169 124282 124266 123642 122342 121036 120227 119513 118289 116826 115913 115623 115281 114670 114396
51054 114396 114827 115515 116120 117079 118685 120183 120673 120560 121143 122780 124365 124827 124447 124272 124641 124826 124113
51037 124113 122903 122515 123859 126419 128749 129955 130310 130407 130262 129682 129054 129128 130182 131990 134470 137703
51021 137703 141280 144298 146260 147554 148817 150188 151391 152172 152480 152541 152946 154348 156877 160178 164067
51006 164067 168700 173900 178824 182780 186057 189551 193813 198901 204879 211874 219657 227617 235293 242756
50992 242756 250487 259124 269120 280360 292099 303644 315191 327801 342576 359990 379949 402159
50980 402159 426449 452938 481995 513899 548503 585330 623957 664243 706330 750514 796849
50969 796849 844612 892414 939177 984740 1029091 1071248 1109562 1143144 1172346 1197665 1218859
50958 1218859 1235533 1248064 1257369 1263975 1267818 1269011 1268444 1267541 1267531 1268986 1271924 1276168 1281392 1286812
50944 1286812 1291191 1293545 1293674 1291566 1286465 1277076 1262656 1243201 1218513 1187974 1151655 1110857 1066979
50931 1066979 1020430 971336 920695 869979 819959 770874 723516 679153 638296 600433 565167
50920 565167 532911 504233 479178 457508 439019 423354 409964 398483 388631 379680 370709 361696
50908 361696 353683 347413 342368 337654 333235 329674 327111 325261 324158 324156 325233 326847 328488 329932 331099
50893 331099 332148 333586 335779 338408 340937 343557 347090 351909 357550 363510 369882 376926 384516 392381
50879 392381 400619 409650 419832 431311 444134 458349 474104 491654 511095 532127 554480 578621
50867 578621 605693 636620 671653 711002 755474 806135 863591 927923 999087 1077014 1161445
50856 1161445 1252073 1348796 1451554 1559850 1672578 1788189 1904768 2020000 2131293 2236007
50846 2236007 2331578 2415671 2486546 2543326 2585883 2614718 2631141 2637283 2635476 2627618 2615445 2601266
50834 2601266 2587950 2578077 2573367 2574804 2582693 2596285 2613732 2632639 2650403 2663892 2669386 2663537
50822 2663537 2644391 2611260 2563843 2501892 2425675 2336291 2235512 2125642 2009463 1889810
50812 1889810 1768987 1648851 1531477 1419285 1314285 1217503 1129357 1050163 979899 917827
50802 917827 862960 814871 773578 738674 709087 683838 662624 645428 631834 620939 611715 603301
50790 603301 595198 587447 580410 574160 568215 562099 555897 549959 544301 538703 533262 528312 523693 518580
50776 518580 512284 504935 497188 489514 482048 474943 468559 463312 459398 456597 454331 452172 450420 449920
50762 449920 451072 453291 455774 458612 462741 468911 477116 487047 498606 511843 526817 543791 563260
50749 563260 585534 610539 638315 669495 704874 744681 788661 836792 889380 946312 1006647
50738 1006647 1069287 1133802 1200221 1268136 1336372 1403529 1468532 1530442 1587885 1638878 1681254
50727 1681254 1713267 1733994 1743389 1742113 1731304 1712534 1687953 1660301 1632443 1606693 1584547 1567046
50715 1567046 1555156 1549523 1549881 1554962 1563141 1572943 1582849 1590809 1594270 1590737 1578255 1555649 1522755
50702 1522755 1480463 1430168 1372950 1309519 1241108 1170118 1099571 1031922 968566 910158 857021
50691 857021 809160 766282 727998 694012 664238 638973 618834 604110 594087 587395 583153 581444
50679 581444 582491 585817 590678 596932 604875 614230 623931 633078 641587 649650 657006 663205 668312 672811
50665 672811 676848 680137 682761 685638 689824 695569 702369 709797 717956 727201 737916 750762 766688
50652 766688 786248 808963 833760 860056 888130 918402 950716 984472 1019098 1053967 1088027
50641 1088027 1119956 1148825 1174409 1196830 1216141 1232310 1245291 1254914 1260831 1262787 1260894 1255559
50629 1255559 1247273 1236531 1223847 1209685 1194547 1179267 1164979 1152473 1141649 1132010 1123691 1117566
50617 1117566 1114122 1112597 1111620 1110515 1109675 1109781 1111050 1113165 1115442 1116814 1115942 1111656 1103256 1090283 1072214
50602 1072214 1048613 1019563 985774 948386 908806 868624 829282 791651 755996 722432 691300
50591 691300 662959 637339 613905 592234 572543 555499 541527 530474 522035 516216 513035 511903
50579 511903 511795 512199 513546 516452 520818 525921 531099 535984 540320 544091 547796 552150 557466 563649 570740
50564 570740 578981 588298 598309 609066 621264 635342 650730 666409 681899 697270 712452 727084
50552 727084 741075 754851 768972 783768 799421 816126 834151 853930 876119 901308 929688
50541 929688 961197 995997 1034634 1077768 1125945 1179567 1238703 1302915 1371582 1444425 1521361
50530 1521361 1601663 1683584 1765035 1844438 1920671 1992427 2057934 2115252 2162607 2198557 2222138
50519 2222138 2232959 2230997 2216309 2189120 2150234 2101137 2043570 1979124 1909471 1836888 1764212
50508 1764212 1693946 1627527 1565674 1509353 1460001 1418606 1384972 1358341 1338687 1326984 1324155
50497 1324155 1330123 1344005 1364813 1391568 1422821 1456346 1489309 1518529 1540704 1552807 1552653 1539307
50485 1539307 1513035 1474975 1426821 1370658 1308828 1243733 1177580 1112188 1048888 988501 931391
50474 931391 877653 827387 780823 738245 699932 666151 636956 611830 589829 570410 554010
50463 554010 541455 532794 527065 523227 520917 520213 521122 523642 527993 534360 542490 551773 561617 571529
50449 571529 581070 590104 598967 607997 616865 624793 631500 637546 643495 649138 653909 657963 662322 667861
50435 667861 674503 681639 689066 697113 705916 715063 724235 733930 745235 758943 775151 793571 813857
50422 813857 835710 859200 885213 915117 949537 987662 1028026 1069795 1112885 1157024 1201235
50411 1201235 1244348 1285571 1324291 1359574 1390129 1414726 1432425 1442478 1444164 1436858 1420317 1394990
50399 1394990 1361943 1322377 1277163 1226995 1172951 1116725 1060197 1004929 952071 902579 857289
50388 857289 816867 781783 752345 728649 710628 698219 691463 690291 694286 702806 715272 731097
50376 731097 749227 767972 785540 800671 812579 820345 822717 818705 808249 792158 771549 747471
50364 747471 720918 692806 663869 634766 606301 579341 554371 531309 509833 489772 471177
50353 471177 454257 439334 426601 415747 406112 397369 389811 383659 378455 373635 369515 367086 366713
50340 366713 367612 368802 370200 372412 375788 380053 384715 389523 394569 400216 406849 414475 422560 430483
50326 430483 438101 445680 453313 460667 467416 473680 479850 486027 491796 496570 500106 502648 504668 506525
50312 506525 508384 510319 512350 514414 516473 518760 521719 525554 529857 533824 536826 538726 539807 540674
50298 540674 542262 545620 551453 559896 570795 583960 598705 613012 623580 627276 622962 612009 597194
50285 597194 581171 565770 552100 540725 531694 524749 519753 516800 515809 516162 516950 517608 518195 519087 520488
50270 520488 522259 524118 525859 527422 528827 530170 531582 532999 533887 533420 531210 527841 524500 521972 520110
50255 520110 518210 515687 512350 508384 504251 500394 496793 492970 488675 484404 480933 478499 476781 475599
50241 475599 475113 475255 475481 475438 475577 476660 478809 481429 484085 487024 490650 494671 498113 500269 501518 502954
50225 502954 505059 506933 507170 505446 502761 500004 496826 492396 486749 480708 474701 468512 462255 456725
50211 456725 452388 448697 444935 441213 438067 435500 433085 430746 428750 427151 425979 425935 428060 432582 438732
50196 438732 445915 454456 464955 477512 491902 507902 524934 541894 557878 572784 586773 599504
50184 599504 610434 619531 627128 633336 638207 642190 645697 648274 648875 646865 642075 633838 620958 603016
50170 603016 581117 556970 531705 505972 480612 456619 434500 414077 394864 376568 359461
50159 359461 344330 331772 321426 312326 304047 296971 291223 286083 280978 276422 273232 271223 269410
50146 269410 267207 264674 261825 258626 255680 253981 253695 253861 253589 252946 252370 251837 251102 250293 249756 249578 249691
50129 249691 250225 251355 252985 254971 257491 260825 264822 268912 272680 276182 279762 283749 288363 293696
50115 293696 299756 306530 313926 321612 329090 336175 343248 350879 359143 367425 374855 380972 386087 391045
50101 391045 396499 402333 407960 413150 418298 423839 429803 436103 442849 450042 457283 464184 470924 478075
50087 478075 486089 495320 506314 519527 534870 552033 571297 593598 619652 649342 682006 717002
50075 717002 753960 792801 833567 875849 918338 959293 997598 1033061 1065737 1095488 1122374
50064 1122374 1146907 1169490 1189868 1207418 1221647 1232053 1237732 1237585 1230824 1217053 1196153 1168612
50052 1168612 1135893 1099902 1061835 1021795 979697 936363 893554 853091 816113 783081 754102
50041 754102 729025 707405 688780 673113 660643 651108 643465 636774 631029 626611 623111 619489 615460
50028 615460 611855 609264 607012 604071 600340 596326 591956 586570 579926 572389 564076 554565 543689 532039
50014 532039 520359 508801 497081 485128 473276 461915 451137 440737 430584 420957 412378 405027
50002 405027 398596 392883 388171 384626 381655 378437 374935 371813 369462 367688 366311 365269 364045 361742
49988 361742 358200 354459 351667 349928 348585 347170 345583 343679 341264 338427 335492 332693 330139 327923
49974 327923 325982 323959 321507 318620 315490 312260 309213 307032 306533 308089 311441 315947 320967 326291
49960 326291 332445 340386 350660 363018 377016 392588 409803 428298 447366 466380 484877 502401
49948 502401 518610 533370 546498 557737 567356 576411 585858 595535 604485 611992 617695 620811 620034
49935 620034 614353 603551 587889 567940 544862 520188 495031 469831 445007 421325 399346 379058
49923 379058 360460 344076 330421 319204 309612 301242 294337 289095 285129 281726 278389 275003 271623
49910 271623 268258 264850 261354 257730 253877 249764 245707 242271 239602 237027 233761 229980 226777 224911
49896 224911 223991 223057 221616 219791 217824 215852 214090 212835 212226 212158 212469 212984 213371 213160 212126 210663
49880 210663 209591 209434 209919 210294 210151 209699 209244 208786 208307 208108 208410 208922 209292 209804 211055 213021 215051
49863 215051 216838 218729 220914 222895 224090 224471 224376 224192 224489 225830 227971 229785 230511 230630 230970 231422
49847 231422 231300 230569 229838 229282 228491 227459 226821 226840 226909 226471 225853 225676 225902 226010 225816 225579 225407 225083 224557
49828 224557 224200 224388 225003 225534 225608 225348 225212 225547 226309 227193 227990 228778 229761 230994 232285 233316 233879 234037
49810 234037 234048 234114 234159 233848 232815 230957 228610 226449 225005 224207 223493 222439 221109 219752 218364 216730
49794 216730 214716 212421 210227 208862 209051 210704 212650 213663 213723 213837 214610 215504 215635 214840 213687 212822
49778 212822 212648 213321 214549 215544 215634 215019 214555 214702 214983 214660 213630 212418 211526 211177 211587 212986 215188
49761 215188 217512 219451 221206 223218 225346 226945 227716 228033 228295 228417 228223 227949 227984 228337 228730 229082 229502
49744 229502 229908 230049 229956 229987 230328 230709 230762 230436 229949 229509 229177 228951 228875 229164 230230 232445 235808 239883 244037
49725 244037 247630 250100 251103 250691 249203 246969 244202 241203 238458 236412 235216 234729 234716 235009 235526 236175
49709 236175 236740 236976 236889 236760 236778 236732 236297 235529 234813 234383 234159 234077 234187 234319 234031 233191 232449 232759 234448 236944
49689 236944 239461 241705 243879 246220 248752 251370 253905 256018 257289 257626 257489 257530 258034 258889 259958 261184
49673 261184 262384 263388 264404 265861 267661 269062 269530 269329 268926 268266 267152 266038 265759 266535 267835 269263
49657 269263 271102 273908 278042 283750 291381 301382 314189 329927 347738 365434 380243 390029 393724
49644 393724 391059 382714 370623 357224 343987 331174 319047 308453 299886 292775 286324 280502 275621
49631 275621 271523 267877 264908 263062 262209 261906 262225 263569 265637 267362 268063 268096 268145 268390 268638 268911 269549
49614 269549 270914 273149 276070 279123 281636 283319 284514 285885 287921 290687 293868 296936 299386 301004
49600 301004 302011 303008 304648 307213 310472 314005 317607 321204 324524 327265 329612 332146 335041 337750
49586 337750 339814 341609 343985 347383 351617 356204 360494 363800 366003 367945 370697 374415 378319 381743
49572 381743 384771 387800 390955 394108 397134 400000 402769 405565 408394 411039 413357 415561 417916 420334
49558 420334 422615 424953 427677 430523 432719 433913 434590 435456 436813 438697 441077 443587 445444 446081 445777
49543 445777 445429 445812 447162 449285 451877 454820 458259 462277 466520 470406 473779 477078 480764 484830 488995
49528 488995 493091 497058 500778 504141 507194 510120 513198 516820 521319 526713 532763 539279 546059 552497
49514 552497 557661 560982 562727 563675 564546 565670 566765 566889 565055 561225 556393 551497 546629 541541 536363
49499 536363 531283 525891 519576 512547 505816 500033 494778 489230 483248 477537 472890 469462 466758 464154
49485 464154 461342 458257 454817 450981 446993 443299 440122 437337 434707 431978 428761 424828 420598 416855
49471 416855 413754 410649 407137 403722 400989 398732 396511 394565 393339 392395 390750 388299 386020 384638
49457 384638 383836 383019 382128 381352 380675 380164 380227 381021 381900 382007 381321 380706 380931 381937 383068 383814 384290 385101
49439 385101 386869 389938 394494 400627 407971 415377 421383 425103 426448 425577 422664 418363 413941 410473
49425 410473 408069 406179 404497 403263 402839 403313 404538 406355 408747 411836 415706 420251 425332 430985 437232
49410 437232 443692 449799 455566 461738 468977 477174 485842 494836 504260 513942 523460 532610 541418 549726
49396 549726 557194 563712 569456 574470 578591 581888 584887 588097 591467 594444 596425 597095 596511 595072 593361
49381 593361 591859 590746 589966 589400 588953 588498 587866 586991 586116 585751 586249 587412 588670 589645 590388 591087 591839
49364 591839 592814 594345 596565 599174 601808 604437 607243 610310 613689 617469 621454 625059 628037 631088
49350 631088 635129 640120 645295 650535 656618 663776 670881 676709 681447 686235 691530 696733 701345 705699
49336 705699 710402 715600 721082 726676 732222 737369 741703 745050 747607 749872 752466 755769 759616 763481
49322 763481 767047 770458 773962 777539 780955 784030 786707 789061 791364 793935 796736 799233 800887 801691
49308 801691 802101 802567 803351 804559 806089 807593 808854 810130 811768 813584 815066 816241 817740 819807 821840
49293 821840 823347 824819 827006 829704 832052 833931 836219 839547 843488 847269 850680 853914 857085 860369
49279 860369 864172 868647 873313 877613 881479 884894 887294 888151 887930 887675 887626 886929 884799 881270 876685 871194
49263 871194 865183 859577 855115 851540 847893 843399 837906 831852 826128 821615 818358 815431 811929 807852
49249 807852 803648 799309 794501 789365 784476 780012 775571 770860 766003 760958 755169 748123 739963 731325
49235 731325 722847 715006 708150 702441 697891 694562 692569 691784 691765 692134 692783 693588 694236 694575 694946 695882 697634
49218 697634 700181 703535 707689 712324 716857 720812 724058 726766 729329 732227 735757 739902 744567 749789
49204 749789 755537 761451 767132 772654 778456 784722 791216 797871 805164 813624 823043 832447 840841 847891
49190 847891 853972 859728 865593 871644 877856 884419 891671 899679 908072 916433 924797 933589 943107 953211
49176 953211 963554 973986 984643 995672 1006966 1018246 1029396 1040601 1052032 1063511 1074742
49165 1074742 1085952 1098020 1111733 1127023 1143119 1159339 1175489 1191613 1207659 1223424 1238608
49154 1238608 1252930 1266499 1280053 1294458 1309862 1325695 1341612 1357997 1375245 1393008 1410599
49143 1410599 1427850 1444993 1461826 1477603 1491815 1504586 1516241 1527037 1537443 1548140 1559356
49132 1559356 1570569 1581253 1591636 1602399 1613918 1626170 1639216 1653283 1668437 1684622 1702120
49121 1702120 1721736 1744426 1770750 1800395 1831887 1862938 1891715 1918132 1943656 1969556 1995232
49110 1995232 2018136 2035072 2043619 2042909 2033798 2018545 1999951 1980094 1959439 1937179 1912700 1886814
49098 1886814 1861439 1838220 1817733 1800003 1785214 1773622 1765176 1759638 1756788 1756132 1756656 1757340 1757786
49085 1757786 1757975 1757708 1756917 1756264 1756547 1757423 1757515 1756002 1753431 1750661 1747747 1744371 1740673 1736962 1733061 1728646
49069 1728646 1723984 1719563 1715107 1709650 1702641 1694482 1685965 1677636 1669774 1662433 1655341 1648090 1640541 1632731
49055 1632731 1624447 1615380 1605849 1596776 1588592 1580525 1571462 1561282 1550978 1541594 1533453 1526346 1519983
49042 1519983 1514164 1508815 1504119 1500399 1497690 1495621 1493942 1492958 1493082 1493961 1494515 1494041 1492929 1491990 1491347 1490461
49026 1490461 1489099 1487703 1486752 1486276 1486201 1486622 1487388 1487882 1487777 1487779 1489007 1491685 1494970 1498096 1501274 1505307 1510685
49009 1510685 1517226 1524307 1531260 1537775 1544113 1550844 1558317 1566474 1575129 1584130 1593178 1601816 1609817 1617422
48995 1617422 1625004 1632589 1639843 1646446 1652294 1657369 1661548 1664597 1666389 1667153 1667426 1667596 1667537 1666870 1665627
48980 1665627 1664421 1663817 1663702 1663430 1662553 1661276 1660259 1660031 1660573 1661415 1662173 1663012 1664536 1667184 1670872 1675211
48964 1675211 1679974 1685274 1691350 1698327 1706172 1714812 1724156 1733953 1743763 1753347 1763044 1773462 1784619
48951 1784619 1795756 1806321 1816835 1828250 1840635 1853107 1865167 1877419 1890665 1904825 1919213
48940 1919213 1933544 1948127 1963292 1979217 1996400 2015760 2037960 2062804 2089500 2117410 2146397
48929 2146397 2176518 2207614 2239374 2271731 2304985 2339409 2374850 2410903 2447361 2484246 2521478
48918 2521478 2558803 2596054 2633115 2669573 2704889 2739114 2773014 2807016 2840305 2871397 2899520
48907 2899520 2925069 2948814 2971105 2991842 3010911 3028517 3045282 3061964 3078845 3095450 3111147
48896 3111147 3125936 3140334 3154609 3168547 3181894 3194483 3205848 3215381 3223237 3230493 3237881 3244715
48884 3244715 3249637 3252263 3253452 3253973 3253522 3251235 3246668 3239955 3231275 3220534 3207426 3191608 3172884
48871 3172884 3151456 3127924 3102821 3076116 3047327 3016155 2982959 2948558 2913587 2878047 2841511
48860 2841511 2803870 2765820 2728414 2692135 2656603 2621322 2586442 2552571 2520121 2489204 2460064
48849 2460064 2433141 2408668 2386542 2366756 2349612 2335377 2324023 2315448 2309640 2306394 2305196 2305702
48837 2305702 2308096 2312662 2319271 2327694 2338214 2351307 2366669 2383079 2399413 2415512 2431944 2449295
48825 2449295 2467857 2487655 2508421 2529667 2550993 2572273 2593506 2614689 2635962 2657541 2679282
48814 2679282 2700537 2720724 2739922 2758637 2777096 2795146 2812720 2829940 2846617 2862070 2875813
48803 2875813 2888279 2900433 2912601 2923967 2933500 2941232 2948372 2956166 2964925 2974206 2983600 2993044 3002552
48790 3002552 3011967 3021010 3029415 3037098 3044365 3051797 3059706 3067786 3075603 3083257 3091160 3099283 3107117 3114403
48776 3114403 3121366 3128133 3134487 3140412 3146267 3151995 3156646 3159165 3159313 3157309 3152992 3146058 3136925 3126564
48762 3126564 3115406 3103007 3088926 3073308 3056375 3037916 3017715 2996174 2974047 2951679 2928862
48751 2928862 2905379 2881424 2857487 2834107 2811719 2790513 2770298 2750638 2731352 2712938 2696410
48740 2696410 2682577 2671467 2662481 2655050 2649042 2644636 2642033 2641289 2642190 2644165 2646564 2649144 2652088 2655432
48726 2655432 2658704 2661340 2663183 2664370 2664960 2665051 2665034 2665245 2665433 2664984 2663786 2662502 2661966 2662543 2664057 2665854
48710 2665854 2666865 2666034 2663078 2658679 2653705 2648427 2642694 2636627 2630845 2626018 2622413 2619903 2618192 2616909
48696 2616909 2615668 2614189 2612473 2610750 2609160 2607529 2605645 2603786 2602784 2603430 2605962 2610319 2616792 2626280
48682 2626280 2639969 2658943 2684014 2715713 2754293 2799526 2850100 2902936 2953316 2996007 3026355
48671 3026355 3040591 3035978 3011616 2969176 2912437 2845953 2774139 2700906 2629195 2560665 2496277
48660 2496277 2437061 2383763 2335823 2291615 2250002 2211096 2175307 2142414 2111905 2083507 2056798
48649 2056798 2030843 2004892 1979053 1953737 1928813 1903978 1879567 1856271 1834177 1812835 1792202
48638 1792202 1772722 1754415 1736619 1718932 1701808 1685792 1670572 1655214 1639156 1622647 1606352
48627 1606352 1590847 1576432 1563149 1550862 1539421 1528781 1518942 1509814 1501176 1492843 1484929 1477881
48615 1477881 1472102 1467502 1463601 1460083 1457015 1454422 1452025 1449629 1447499 1445958 1444847 1443778 1442815 1442464
48601 1442464 1443040 1444398 1446199 1447999 1449167 1449317 1448924 1448968 1449776 1450697 1451068 1451009 1450952 1451006 1451198 1451851 1453107 1454423
48583 1454423 1455224 1455884 1457407 1460127 1463325 1466165 1468413 1470069 1470859 1470477 1468885 1466041 1461652 1455658 1448774
48568 1448774 1442083 1436083 1430434 1424707 1419061 1414018 1409768 1405878 1401703 1396968 1391863 1386693 1381605 1376743
48554 1376743 1372445 1368921 1365821 1362494 1358760 1355095 1351912 1349043 1346219 1343670 1341771 1340351 1338898 1337361
48540 1337361 1336162 1335346 1334319 1332661 1330740 1329215 1328259 1327619 1327152 1326907 1326822 1326656 1326242 1325589 1324745 1323632 1321960
48523 1321960 1319391 1316023 1312680 1310234 1308481 1306172 1302494 1298045 1293944 1290440 1287011 1283472 1280201 1277309
48509 1277309 1274370 1271003 1267134 1262633 1257362 1251749 1246637 1242255 1237946 1233218 1228501 1224460 1221080 1217964
48495 1217964 1215070 1212514 1209937 1206752 1202978 1199292 1196294 1194119 1192721 1192045 1191796 1191508 1190939 1190153 1189153
48480 1189153 1187825 1186351 1185298 1184985 1184944 1184285 1182535 1180013 1177478 1175599 1174629 1174329 1174115 1173439 1172197 1170707
48464 1170707 1169223 1167515 1165067 1161690 1157790 1154008 1150760 1148162 1146171 1144560 1142880 1140665 1137626 1133568
48450 1133568 1128358 1122263 1116111 1110637 1105729 1100721 1095301 1089608 1083464 1076284 1068026 1059585 1051788 1044442
48436 1044442 1036858 1028911 1021029 1013392 1005803 998264 991086 984377 977860 971220 964257 956679 948179 938980
48422 938980 929968 922016 915232 908964 902535 895886 889534 883926 878968 874282 869795 865754 862124 858453
48408 858453 854510 850732 847711 845515 843795 842262 840682 838715 836255 833815 832136 831424 831217 830839 829719
48393 829719 827566 824738 822251 820827 819949 818342 815441 812052 809550 808795 809646 811053 811646 810757 808953
48378 808953 807248 805918 804523 802882 801361 800196 799246 798558 798459 798873 799102 798585 797375 795711 793677 791527
48362 791527 789676 787972 785534 781739 776900 771651 766203 760663 755433 750629 745601 739802 733844 728888
48348 728888 725151 721723 717871 713803 710094 707002 704507 702518 700778 698927 696834 694623 692329 689867
48334 689867 687335 684965 682626 679786 676221 672484 669435 667404 666011 664617 662810 660571 658156 655837
48320 655837 653706 651767 650162 649055 648170 646669 643769 639559 635068 631452 629155 627820 626833 625796 624616
48305 624616 623459 622731 622809 623597 624510 625152 625808 626894 628107 628723 628842 629730 632556 637188 642603 648189 654205
48288 654205 661097 668881 677207 685751 694508 703911 714662 727217 741303 755974 770124 783025 794633
48275 794633 805492 816230 826982 837416 847345 857021 866760 876596 886528 896765 907494 918658
$$ [...]
##END NTUPLES=NMR SPECTRUM
##END=
