##TITLE=NES1066_159122.0006_002_9705126_dtTAlxomYf
##JCAMPDX= 6.0         $$ Bruker NMR JCAMP-DX V2.0
##DATA TYPE= NMR SPECTRUM
##DATA CLASS= NTUPLES
##ORIGIN= BRUKER
##OWNER= Administrator
$$ 1.72 TOPSPIN		Version 2.1
$$ 2016-05-01 15:07:21.224 -0700  Administrator@X
$$ Compression mode = diff/dup
##.OBSERVE FREQUENCY= 400.02188249412
##.OBSERVE NUCLEUS= ^1H
##.ACQUISITION MODE= SIMULTANEOUS (DQD)
##.ACQUISITION SCHEME= undefined
##.AVERAGES= 8
##.DIGITISER RES= 22
##SPECTROMETER/DATA SYSTEM= spect
##.PULSE SEQUENCE= zg30
##.SOLVENT NAME= COFFEE_meoh
##.SHIFT REFERENCE= INTERNAL, COFFEE_meoh, 1, 14.98509
##AUDIT TRAIL= $$ (NUMBER, WHEN, WHO, WHERE, PROCESS, VERSION, WHAT)
$$ ##TITLE= Audit trail, TOPSPIN		Version 2.1
$$ ##JCAMPDX= 5.01
$$ ##ORIGIN= Bruker BioSpin GmbH
$$ ##OWNER= Administrator
$$ $$ E:\/data/COFFEE/nmr/NES1066_159122.0006_002_9705126_dtTAlxomYf/20/pdata/1/auditp.txt
$$ ##AUDIT TRAIL=  $$ (NUMBER, WHEN, WHO, WHERE, PROCESS, VERSION, WHAT)
(   1,<2016-05-01 15:07:14.130 -0700>,<Administrator>,<X>,<go>,<TOPSPIN 2.1>,
      <created by zg
	started at 2016-05-01 15:06:08.255 -0700,
	POWCHK enabled, PULCHK disabled,
       configuration hash MD5:
       21 0F 79 D6 B3 7B B4 F6 88 20 88 DB 03 48 BD 9F
       data hash MD5: 64K
       31 6C 03 DD 04 E6 89 F2 ED CC F4 7A 50 9B 4C 8A>)
(   2,<2016-05-01 15:07:17.271 -0700>,<Administrator>,<X>,<proc1d>,<TOPSPIN 2.1>,
      <Start of raw data processing
       efp LB = 0 FT_mod = 6 PKNL = 1 PHC0 = 0 PHC1 = 0 SI = 32K 
       data hash MD5: 32K
       13 3B 50 3B F5 4E 51 F7 35 D2 2E D8 7E 73 3E 15>)
(   3,<2016-05-01 15:07:17.536 -0700>,<Administrator>,<X>,<proc1d>,<TOPSPIN 2.1>,
      <pk PHC0 = 96.39404 PHC1 = 0 
       data hash MD5: 32K
       E5 98 66 8F AC CB 89 34 E3 53 E8 43 4F CE 37 23>)
(   4,<2016-05-01 15:07:17.646 -0700>,<Administrator>,<X>,<proc1d>,<TOPSPIN 2.1>,
      <abs ABSG = 1 
       data hash MD5: 32K
       F4 CC 5B B7 91 56 1D 49 2A AE 3F 76 C2 F5 74 51>)
(   5,<2016-05-01 15:07:17.708 -0700>,<Administrator>,<X>,<proc1d>,<TOPSPIN 2.1>,
      <abs ABSG = 2 
       data hash MD5: 32K
       5E 7F C5 BF 61 2B DA E9 53 E6 0D EA 31 5C 83 73>)
(   6,<2016-05-01 15:07:17.755 -0700>,<Administrator>,<X>,<proc1d>,<TOPSPIN 2.1>,
      <abs ABSG = 3 
       data hash MD5: 32K
       FD 86 5D B7 CC E7 03 E9 BF 12 49 1C 2B 2B 80 89>)
(   7,<2016-05-01 15:07:17.817 -0700>,<Administrator>,<X>,<proc1d>,<TOPSPIN 2.1>,
      <abs ABSG = 4 
       data hash MD5: 32K
       AD AD 77 74 AB 18 B4 AC AC E8 5C E9 4C FC DF C2>)
(   8,<2016-05-01 15:07:17.880 -0700>,<Administrator>,<X>,<proc1d>,<TOPSPIN 2.1>,
      <abs ABSG = 5 
       data hash MD5: 32K
       39 51 9A 8C C2 40 78 69 D2 43 2A D8 CD D3 9D 33>)
$$ ##END=
$$ 
$$ $$ hash MD5
$$ $$ 73 B8 F0 8B F7 CE 63 89 08 7B DE 52 00 A3 00 8F
##$RELAX= 
##$RELAX= 
##$RELAX= 
##$RELAX= 
##$RELAX= 
##$RELAX= 
##$RELAX= 
$$ Bruker specific parameters
$$ --------------------------
##$DU= <E:\>
##$EXPNO= 20
$$ [...]
150 150 150 150 150 150 150 150
##$TP07= 0
##$TPNAME0= <>
##$TPNAME1= <>
##$TPNAME2= <>
##$TPNAME3= <>
##$TPNAME4= <>
##$TPNAME5= <>
##$TPNAME6= <>
##$TPNAME7= <>
##$TPOAL= (0..7)
0.5 0.5 0.5 0.5 0.5 0.5 0.5 0.5
##$TPOFFS= (0..7)
0 0 0 0 0 0 0 0
##$TUNHIN= 0
##$TUNHOUT= 0
##$TUNXOUT= 0
##$USERA1= <user>
##$USERA2= <user>
##$USERA3= <user>
##$USERA4= <user>
##$USERA5= <user>
##$V9= 5
##$VALIST= <valist>
##$VCLIST= <CCCCCCCCCCCCCCC>
##$VD= 0
##$VDLIST= <DDDDDDDDDDDDDDD>
##$VPLIST= <PPPPPPPPPPPPPPP>
##$VTLIST= <TTTTTTTTTTTTTTT>
##$WBST= 2048
##$WBSW= 25
##$XGAIN= (0..3)
0 0 0 0
##$XL= 0
##$YL= 0
##$YMAX_a= 562036
##$YMIN_a= -473250
##$ZGOPTNS= <>
##$ZL1= 120
##$ZL2= 120
##$ZL3= 120
##$ZL4= 120
##$ABSF1= 14.98509
##$ABSF2= -5.573092
##$ABSG= 5
##$ABSL= 3
##$ALPHA= 0
##$AQORDER= 0
##$ASSFAC= 0
##$ASSFACI= 0
##$ASSFACX= 0
##$ASSWID= 0
##$AUNMP= <proc_prof1d_extract_pilot.lims>
##$AXLEFT= 0
##$AXNAME= <>
##$AXNUC= <1H>
##$AXRIGHT= 0
##$AXTYPE= 0
##$AXUNIT= <>
##$AZFE= 0.1
##$AZFW= 0.1
##$BCFW= 0
##$BC_mod= 0
##$BYTORDP= 0
##$COROFFS= 0
##$CY= 15
##$DATMOD= 1
##$DC= 0
##$DFILT= <>
##$DTYPP= 0
##$F1P= 0
##$F2P= 0
##$FCOR= 0.5
##$FTSIZE= 32768
##$FT_mod= 6
##$GAMMA= 0
##$GB= 0
##$INTBC= 1
##$INTSCL= 1
##$ISEN= 128
##$LB= 0
##$LEV0= 0
##$LPBIN= 0
##$MAXI= 10000
##$MC2= 0
##$MEAN= 0
##$ME_mod= 0
##$MI= 0
##$NCOEF= 0
##$NC_proc= -8
##$NLEV= 6
##$NOISF1= 0
##$NOISF2= 0
##$NSP= 0
##$NTH_PI= 0
##$NZP= 0
##$OFFSET= 14.98509
##$PC= 1
##$PHC0= 96.39404
##$PHC1= 0
##$PH_mod= 1
##$PKNL= yes
##$PPARMOD= 0
##$PPDIAG= 0
##$PPIPTYP= 0
##$PPMPNUM= 2147483647
##$PPRESOL= 1
##$PSCAL= 4
##$PSIGN= 0
##$PYNMP= <proc.py>
##$REVERSE= no
##$SF= 400.02
##$SI= 32768
##$SIGF1= 0
##$SIGF2= 0
##$SINO= 400
##$SIOLD= 32768
##$SPECTYP= <>
##$SREGLST= <1H.CDCl3>
##$SSB= 0
##$STSI= 32768
##$STSR= 0
##$SW_p= 8223.68421052631
##$SYMM= 0
##$S_DEV= 0
##$TDeff= 65536
##$TDoff= 0
##$TI= <>
##$TILT= no
##$TM1= 0
##$TM2= 0
##$TOPLEV= 0
##$USERP1= <user>
##$USERP2= <user>
##$USERP3= <user>
##$USERP4= <user>
##$USERP5= <user>
##$WDW= 1
##$XDIM= 32768
##$YMAX_p= 417904215
##$YMIN_p= -659243
##$CURPLOT= <Network HP LaserJet P1505>
##$CURPRIN= <$Network HP LaserJet P1505>
##$DFORMAT= <normdp>
##$LAYOUT= <+/1D_H.xwp>
##$LFORMAT= <normlp>
##$PFORMAT= <normpl>
##$SURQMSG= 1
$$ End of Bruker specific parameters
$$ ---------------------------------
##NTUPLES= NMR SPECTRUM
##VAR_NAME=  FREQUENCY,     SPECTRUM/REAL,   SPECTRUM/IMAG
##SYMBOL=    X,             R,               I
##VAR_TYPE=  INDEPENDENT,   DEPENDENT,       DEPENDENT
##VAR_FORM=  AFFN,          ASDF,            ASDF
##VAR_DIM=   32768,         32768,           32768
##UNITS=     HZ,            ARBITRARY UNITS, ARBITRARY UNITS
##FACTOR=    0.250966925370066, 1,           1
##FIRST=     8223.43324360094, -184578,      -17621
##LAST=      0,             -227997,         -130784
##MIN=       0,             -659243,         0
##MAX=       8223.43324360094, 417904215,    0
$$ Real data points
##PAGE= N=1
##DATA TABLE= (X++(R..R)), XYDATA
$$ [...]
23804 -113985 -25932 228022 -200089 -164491 -39923 -95879 -17517 99053 -35208 -34016 -62660
23793 -62660 56887 124990 65436 60495 21701 161996 263342 126606 96218 104348 -169803
23781 -223031 -4982 -122321 75814 -90894 341890 -76022 -89808 -437085 -112262 -116981 96340
23769 -230279 19116 -45346 -38434 133972 16405 92414 64558 9706 88510 4771 294369 32702
23756 -319489 -242699 -116722 165601 -197499 -125151 -170074 -316573 -149179 16377 -52745
23745 -20407 -81746 32452 117698 62143 -253258 -229100 -198386 -101793 140571 63235 -142518
23733 -79886 -231277 -40502 19060 -40777 -263105 42211 203612 -36612 228335 -50617 51627
23721 -59834 56944 -375338 124554 -212362 126439 -70966 -51724 -87905 14504 343390 -202319
23709 -92319 82914 40326 84559 178700 -104858 31556 94113 -26176 -309309 -154296 -71 64828
23696 -136770 -159600 -146083 -28885 -15239 -286307 -83367 -270363 -101079 -155297 157433 -82065
23684 178762 303411 118495 -143210 6142 -190016 246597 -24153 80664 243609 311871
23674 311871 57667 -71707 -192895 125768 -137783 -39414 -71408 125242 -91233 51771 -108531
23662 -193875 -336837 -13652 -160379 -281994 31214 -6294 -295815 196128 57401 93553 -23934
23650 -30622 259448 -180416 -183224 -134385 26975 -42412 91976 -254787 10089 -27134 88081
23638 171961 149815 250426 -187638 206996 -64155 -158731 11086 -249422 -374496 -193692
23628 -193692 -4768 24868 -64692 -58694 -172645 -8915 -88970 -207772 -133633 -225191 -255138 85447
23615 285759 -257794 -154091 -14436 -129695 -165762 -170640 -121841 85413 -17113 54331 137152
23604 137152 14698 197714 -282025 -170298 495623 23329 -194804 -92032 103425 185568
23594 185568 -263557 320175 148256 -27744 113479 -34018 109189 158222 -74878 307643
23583 13538 28600 157291 109009 122633 214695 -51711 170160 39280 -27354 -107254 -58255
23572 -58255 -225380 45022 -214306 107393 53353 346907 25043 -17908 -450005 -87492 122758
23560 -176213 187007 124920 50603 -80773 154653 2365 143787 125168 60457 95898 -211666
23548 207011 68186 4171 288788 87622 -519748 -177699 -110977 133486 -45786 -70463 239289
23536 91571 -150613 -132445 162998 -52656 -58794 14177 -26796 -187903 -145137 134957 -269695
23524 -352428 -122807 132516 -209401 224100 112653 -221592 25955 19979 -192736 -391039
23514 -391039 122052 232416 -290686 93754 38166 -15316 -37031 35356 -203531 296230
23503 4181 -56263 -215291 -434812 -47500 -221380 469434 -20042 42578 -118319 156778 -297990
23491 -7174 279831 -123805 137412 -198120 -45278 197639 -110061 347236 101564 -481681
23480 135152 23209 77734 -51544 -192417 191870 34200 -481183 -180064 -87072 -142066 -96107
23469 -96107 399112 146763 -43356 151276 7449 -369596 72925 -100594 61872 185747 62179
23457 -22589 156936 201804 -92201 -53656 75568 146344 106504 21985 -183450 86751 79196
23446 79196 -217423 34573 -244429 -175975 -268441 -126934 -97282 -42943 28208 -462883 -66354
23434 -174815 -93390 67958 -143944 281115 98517 -198462 -219517 48795 198720 -57399 -15456
23422 360553 -176464 107899 -104835 -224897 -251085 -297101 255844 127568 105141 -7688
23411 -64656 -95679 -179756 -217687 -122475 -158788 -420838 103662 -5935 155017 -208870 -73241
23399 -286513 -7929 345060 -307051 -279832 193126 -217694 152091 -255138 72541 -24463
23388 -78098 -42701 219716 246925 -176918 23740 28249 42699 337789 -76372 -243309 -356669
23377 -356669 38853 -102210 32677 -146649 140744 -238632 109029 176641 -348507 -165702
23366 30081 169846 -113117 72288 20679 -266607 -111097 -137619 -146006 -158830 -37718 -162624
23355 -162624 -174227 -94369 12789 -297533 69011 -43262 -29844 2332 225322 34124 -12949
23343 15883 -170516 13214 -272039 -122476 -161498 -162230 -135747 -33338 163546 -109934 78623
23331 -349952 245925 31473 -102938 152267 -79878 -109898 -59202 -85232 236379 239499 156713
23320 156713 -247254 -90424 44741 46339 208904 28172 112462 -150017 -183209 195238 -492914
23308 -54572 -246152 34915 -39691 30183 40057 -112242 -35836 329926 80118 -1181 221757
23296 135026 -104908 -202558 -500978 -240043 -11525 -14838 150240 -199511 138454 160550
23286 160550 42294 69127 169572 88351 428969 816 307180 -45803 -211878 257420 86246
23274 -56204 175126 -144136 11772 -141763 -79574 1463 129717 -340750 63030 -148316 171335
23262 -221181 158277 -87220 -103054 32585 241181 -130222 42157 -80493 -148992 -219332 -213683
23251 -213683 -88810 -115634 -159109 -262908 -50729 51501 -253592 137685 226022 -104687 -96266
23240 -96266 -145931 28352 -365936 -8132 113280 343337 142577 -130507 114334 -11063 -138820
23229 -138820 -141015 -5122 88280 -219571 218741 83835 163297 -9771 -25851 -213221 115214
23217 -18944 -92337 14257 -993 -68632 -48038 2865 233020 -200773 -88354 -84532 16084 72148
23205 72148 -209196 -70090 51281 277242 52710 -70392 -162938 102165 6511 -23537 -93627
23194 -93627 47088 52742 100446 98414 -109255 225846 -288832 -41561 55164 163121 323491
23183 323491 -55114 26473 30063 -102486 -110227 92528 238542 -60084 -46298 100088 34216
23171 -25528 -204225 -12523 124575 -273391 -307757 -172804 -88148 -13301 -45341 -130006 19703
23159 93104 -46173 -9460 164274 -74908 -138902 -27438 -157928 165738 -33670 414623 -71144
23147 -177121 82435 -43448 -73356 6580 -82826 369591 -206112 9642 -242320 -26167 -87149
23136 -87149 -122840 -220107 201727 -105938 -185666 43913 186407 -40990 40857 -50164 94542
23124 -240122 520910 49150 -113161 59667 -77888 50522 -96758 -17058 41375 140102 20552
23112 -200421 296415 205749 -24314 -60745 -259603 -307528 196129 -104698 68412 -1013 87818
23100 -113458 178098 153925 -219989 22699 272243 24033 -47963 226248 -367196 137106
23089 -267379 54422 63440 -277358 -23857 -52698 81641 197847 -32035 -58123 -88543 12236
23077 26267 -96937 134910 202288 -288556 -86911 91087 71056 -154467 -17051 -136815 -17107
23065 -109754 352725 -267446 143320 -249490 -186800 201293 -53211 97556 -174698 186398
23054 -24532 22290 -16097 -19627 207029 52150 108667 238227 -166564 338155 -78062 -43074
23043 -43074 -52031 135783 -248370 192694 -99022 13172 15923 -29397 -85367 -111865 69687
23031 278611 -255484 90343 87538 -40647 257273 -183106 -279595 251841 -49605 246925 -255348
23019 104027 -190805 177116 -204125 117087 38144 13492 1789 -82190 -41116 -720 84627
23007 86484 -29807 -143101 -175804 237768 -366722 -316189 27523 98936 95897 -93502 158122
22995 -113685 -44508 170989 -247983 -496831 16371 -201149 -145697 -22680 34555 62848 149611
22984 149611 -226181 58208 64348 -115840 -67813 -172084 75398 -79534 -119790 -80238 95463
22972 -334073 218259 140801 -16982 -201843 -72542 -19190 -140636 35873 33006 81821 8221
22960 196853 25930 -258923 -26895 4235 -182168 -3790 -13499 -366354 -137161 -73189 -426366
22949 -426366 95470 -40757 -71529 -52035 8746 79844 -206048 -139923 130507 333620 83917
22937 16301 -51642 159088 264921 49875 -28184 -165691 129224 56167 -230765 155257
22926 139787 -46126 -72009 62526 236845 -100040 60376 -163179 -23976 -183434 50866 -118111
22914 -10796 -281825 -353026 -3720 -63253 -123269 -56750 136869 209139 126800 167545 35936
22902 -154101 -75825 32504 2702 201889 10886 -192293 14976 -81892 -150313 227671 -124797
22890 272504 9446 -123836 -181755 -112619 17808 -53711 161442 -22742 -366619 -12479 261742
22878 201448 109647 76254 -359722 210752 -30558 -221304 34594 -113700 -85414 78423 -16689
22866 199991 -46224 -209822 -80789 -361966 -143067 -42468 -100948 -250030 84431 -310849
22855 44041 105680 -243695 64188 -116825 -261708 -89766 -166370 43616 -107566 48131 17458
22843 -127612 -23999 235111 4867 13392 -196556 104101 -77857 81389 -168038 -221587 322832
22831 -295258 -184693 -207965 -33639 -160355 70417 -91638 223573 144599 106249 -136360 76765
22819 264245 17684 113066 -128310 -248977 71533 -415374 61081 -210662 118601 -195303
22808 -5373 -277288 -155495 -40908 -290908 -204014 -80149 81212 -94942 -61847 -107999 121912
22796 -53417 -105990 -185930 -37390 -86485 233604 -2732 -94770 -157744 -161010 -97591 9903 -22436
22783 119808 1729 -412627 -11906 -242213 -15094 215880 -62688 133122 87717 -105208 -123618
22772 -123618 221558 -128390 -109693 -242021 -172055 -103361 224631 46920 53405 -34588 -44150
22761 -44150 -79168 -144233 -216942 -273717 -58390 -75444 -139656 -132274 -188838 101007 76438 -238319
22748 182311 -2908 990 -69093 -184072 -50698 -322535 -2203 -200294 -154817 -48413 192247
22736 -179903 -90790 -1317 60474 171221 -257447 206004 -59112 161755 -26118 -159885 -108421
22725 -108421 -104247 -341210 82160 144491 254023 -46385 190784 -69097 -8658 -51238 -49682
22714 -49682 157251 -54889 -248732 -70822 204263 -234813 -2196 -27383 11871 46902 -102573
22702 -121283 -11899 -37030 -143658 -6667 139051 -89436 -69179 -108155 -196405 -84697 -153124
22691 -153124 -106920 20642 -331862 -120786 27654 -290112 -149114 394774 -189731 326285
22680 331149 193940 -163136 -212320 -323197 115549 -40657 -12909 107118 55193 -4761 29310
22668 301324 216184 62290 28809 46675 -128992 19265 -123119 -175811 197714 18647 -135984
22656 -46119 25612 52989 -41636 -83403 -200804 -257778 183604 151383 194765 127170 321956
22645 321956 234171 -209860 52302 -225466 184311 -11096 123031 -122249 -35828 -18623
22635 -18623 -141196 27147 135580 59759 49524 -5547 -93505 -173316 226129 -183087 -29620
22623 -206493 -12563 -158213 290891 174193 51053 -22998 20170 36010 -57299 -235232 103224
22611 87274 18241 -60069 -219163 60206 -120676 25413 -107789 73339 -820 -152037 -218568
22600 -218568 -163841 -168881 130943 52432 -311157 408444 -90513 -3093 -217662 -108446 46526
22588 -224621 -280040 -107034 20739 62335 99617 -100561 129960 -123663 -303457 -74281
22577 -126859 -15648 -243711 -84589 -381672 -126480 -60289 -180318 -260711 -60996 -112870 -137507
22566 -137507 34363 2736 17711 182607 -172224 -99229 -12108 151916 -91249 250336 41684
22554 -153360 -7882 -11776 14867 55719 -2985 -51058 -300658 104270 -291936 -285 354787 -102224
22541 213526 7089 -176015 -353445 -133555 -4629 -151274 226748 172032 -184438 -204083 199571
22529 118779 222045 -263695 -314920 -28387 -82990 -83741 -134843 -157889 -39951 -39993 -101809 -227096
22517 -227096 2149 108854 -114407 -107647 -237025 -426353 14224 -15232 5049 120864 76628
22506 76628 13473 211252 515911 -326100 -165215 -316484 71926 22225 -155925 -114321
22496 -114321 4312 -216681 9619 317254 29739 289694 -135350 -132382 135127 -19827 -53511
22485 -53511 -495505 22892 -38114 -51553 188301 55112 -60522 -319257 -131499 -15334 -44547
22474 -44547 -284478 -210619 167263 43282 -220465 169438 -226831 -395237 -102866 -104998
22464 -104998 -53474 -39077 46483 -66032 185165 -110175 -235387 -77444 -124309 90010 245640
22453 245640 -8908 234644 -9745 -146424 -443121 -162669 -74912 39094 18187 339910 75811
22441 215934 -136544 -41927 -271513 67013 184278 145763 -426855 -57489 194920 -270715
22430 -97663 290936 -96106 -91410 148027 -134259 -625 -103675 -46626 -213847 17931 -211049
22418 176144 32405 -105062 -153662 -184322 -55716 -278904 -144094 -39564 101072 -147289
22407 93250 61680 262960 -164503 -28141 170920 -169119 -294184 58196 190205 71125
22396 13544 -459947 -320379 -29713 -271311 -15591 -217057 -117434 35440 55953 -40384 -154432
22385 -154432 97411 14775 66871 81145 -26607 223668 112578 30989 -346006 -56832 -58339
22374 -58339 -203830 -118175 -96810 -239098 29650 -19256 -15508 -57876 -149436 59591 -107053
22362 -11080 16342 -104018 -13500 13969 -171550 209966 -67427 -76164 91013 128502 -48310
22350 -160734 6673 -98485 -50469 -179655 44732 -12587 -129627 124417 -148788 -322011 299708
22338 -144197 29621 -115429 -309515 -281887 -93558 -26282 -103312 -118645 189772 1162 -33821
22326 134087 -98415 19672 -20204 -102157 61177 224224 32509 78034 4199 200009 -23432
22314 136582 -316533 31974 130786 -115526 -49517 440280 -144680 -66012 -215696 -59047
22303 -210143 189511 160086 7247 -28075 -226639 57948 -58368 -65245 222292 -78760 -412821
22292 -412821 -137140 -124489 88194 157983 -57130 -133280 -259394 252582 13870 -45408 162724
22280 -125724 152785 243175 31887 -59617 -202256 245186 35940 65522 2874 -11363 58328
22268 -166427 115524 -117980 -346233 -14080 -81383 -489782 462 1353 -47304 26042 154379
22257 154379 108794 91865 51497 -302052 -12789 -128684 59970 -262311 57977 -5185 -270555
22246 -270555 -243810 -466716 -147139 85460 -192404 127353 -88179 254341 -98871 -54600
22236 -54600 81397 274149 155987 -71112 -117247 -89183 -232642 132809 -261979 -243611 -146995
22225 -146995 60797 38385 193896 -219921 152332 13613 94914 -63432 -160613 -173447 179574
22213 -293035 62366 -203547 -163499 -40828 -136476 -180370 -104139 78483 -102571 -55704 -112759
22202 -112759 -98711 147642 256593 -127127 -256308 -67369 279583 366618 100661 143695
22192 143695 -74092 -138037 -3658 -193505 203106 -21139 -63610 33046 -256401 -38619 -133668
22181 -133668 86196 -267116 148245 -59077 34876 -204315 5233 65642 33248 -11022 79785
22169 56099 -217811 -421126 97676 272545 -192158 12993 10944 -278762 -116763 -277694
22159 -277694 250857 14085 88134 187864 26573 -8428 91439 -38770 92840 39505 38740 -12199
22146 -226952 -321091 108745 50576 -156879 253485 -88630 90152 132491 310575 -9098 -302342
22135 -302342 56389 -62619 -502703 -105908 -287184 -225262 -293310 368240 -252544 -248855 263698
22123 4999 -121067 23958 -68664 45487 41074 45547 7815 -142913 -19082 -139143 80137 -124995
22110 -129480 -217697 38732 36418 22896 -303369 -118257 118903 225986 -545968 213030
22099 -77555 193042 -123096 -97777 -5955 -74927 8861 -221518 -133717 -13269 -103784 14842
22087 -44127 140677 -59641 147596 -13066 -207113 216887 190172 -110900 34481 -78906 -133941
22076 -133941 -296765 -283137 333397 -222470 -201478 74686 285769 61362 -96310 387490
22065 -269159 -228339 131186 186710 -123512 -236530 -52166 -105633 -298996 265998 -140802
22054 -158107 -98352 -184707 -422710 -190939 76313 -26261 325988 204278 -73288 -277603
22044 -277603 -142417 -358679 -52944 -74504 216535 -17937 73051 -244292 -194293 -124123 151417
22032 -157517 80882 -40631 175636 -210833 191209 4245 87020 -282010 -7788 -87754 254908
22020 160255 -138471 52215 -308332 -205408 8411 -321358 -201493 216742 167406 -99982
22009 -67329 -112716 7850 109102 -480824 33097 283224 39693 125500 121290 230303 -131931
21997 -9717 24286 -93908 -110525 21385 -186234 -74115 25215 67672 -131674 47234 -357141
21985 12869 -193132 -80286 147271 -147219 7306 266095 -370614 -92686 -7266 89800 49451
21974 49451 6925 -116434 -155418 65068 -86633 -88410 -72599 -13637 -100583 460931 -120450
21962 -54190 -340330 396861 89479 -93647 358946 -81975 -106952 309734 -116891 -204746 -58323
21950 -400617 -30029 -64122 33545 -76051 12605 -29956 62736 37832 -111917 -138358 -225579
21939 -225579 902 21668 -83977 -93350 -183823 52721 -167086 52326 -50226 123661 -102684
21927 -41036 33827 -262462 -38812 -62349 193652 -285732 18436 47970 -75472 50178 84617
21916 84617 -1683 -137984 -123760 -109734 -403223 -171101 223603 -73568 -83426 -135122 60822
21904 14393 -11063 331472 316074 227449 132570 -82151 -122034 -36397 135194 176434 -219724
21892 -86936 -337205 167430 29365 -15759 140066 -260689 -172955 -204106 297548 -121673
21881 -176415 37044 86653 -245469 -279308 66458 -10226 -362547 49122 -140141 -57211 -133640
21870 -133640 58795 -14427 38741 -42587 -117310 -126133 -315534 -86830 -13459 -263554 -150950
21859 -150950 -228697 -60955 156268 109958 -171162 31985 260 25709 -148975 316060 -32652
21847 -187603 -2307 11142 -11335 -17260 89625 15922 299407 24321 7209 57667 116629 -115537
21834 -1469 -158569 -38373 189870 48667 -399588 92545 89858 -353794 -5732 23031 -128626
21822 66422 -42879 72520 -57612 -87982 30760 29561 -43107 36873 -149911 -336464 -243599
21811 -243599 211715 -132569 -288142 -213650 -63346 175964 -67235 66379 -31843 -180657
21801 -180657 -32379 -141248 -271921 192401 -4939 9335 -86060 89724 15010 -345728 -83030
21789 -40218 -65635 49218 190023 -67857 -510596 -70194 -51851 81011 -177535 62752 -75604
21777 -216148 -188265 -96192 -124464 -70229 -116477 -71079 26040 87532 60360 -424265 26647
21765 -69028 185346 -29884 51807 365386 -224714 211726 296764 -136700 78585 24071 -245435
21753 148771 -51624 -53207 -327027 -45304 -183885 278621 -347847 31738 41717 36970 -147738
21741 -124807 -80224 47149 20861 18734 -310642 85232 -81772 -343689 -181162 -7844 -182848
21730 -182848 -230251 -153745 -24986 7990 -45842 85568 -28514 329178 38491 -537911 -185510
21718 281163 -138055 -57115 357512 -61833 365303 -215868 67498 -441378 9574 -302929
21707 2298 166200 -69310 -195408 -160300 -140322 -32446 176075 185596 47913 -207536 164677
21695 -7460 43728 -76694 140698 24066 -224384 -228376 105945 -85722 453008 -85524 -52715
21684 -52715 -224833 -102437 23340 56212 -119592 -319296 32034 -1058 -233005 -76500 -1787
21672 -219263 241545 169041 -62935 -90388 -127999 125254 117767 -38725 122547 -59577 18999
21660 229421 -217418 -53072 75604 -71524 36663 -179158 -169621 -123629 211123 -270745 -69207
21648 49778 24656 -35800 -121744 184860 -42010 -167556 -243957 -41562 104237 81336 -87407
21636 -31402 34138 -35350 81079 56822 -284027 155370 -104096 60510 -23000 -325204 38097
21624 -44647 27551 237510 7752 -97653 -155610 -30501 151269 -329334 -204000 -33758 254317
21612 -68840 -179541 82862 -376700 31387 117377 -408250 -185602 142054 -213911 -290281
21602 -290281 -338 164128 6317 -63796 -119885 -16911 140385 119154 -157090 -101445 -47025
21590 -34363 -270015 -32393 140078 195744 209390 -129541 -55023 117984 -104856 -75437 -91494
21579 -91494 -295469 -167305 -227870 276368 -103313 -108952 -455 89630 128619 -85745 -435331
21568 -435331 -193046 -147087 34508 21677 201295 26592 -156247 88342 84282 -32222 -15660
21556 -118873 -408019 180339 -251061 -14895 -464560 -124635 80988 -249582 -79685 22902
21545 -123780 -110692 294145 -122423 160350 -65110 -502843 54379 -5129 -119661 -289375
21535 -289375 32012 83133 -271905 -73053 -231958 51112 -101054 -61503 -202244 -65686 -45710
21524 -45710 -116606 -158093 296385 -196604 -343741 -255623 44469 -47572 26041 -421102 -65429
21512 184846 15725 99928 -122202 939 -276940 62821 -232246 -141009 89915 -191135 259363
21500 -2128 -101355 113732 -20876 200461 -182995 -8723 -85647 -28374 185741 131769 37667
21488 110224 -110029 -244 50675 31319 -119258 -201376 -259632 -323241 45933 215145 139679
21477 139679 113764 13402 -102974 -33486 22043 20496 -427578 195924 -31323 -76387 9161
21465 90518 134881 201846 -50289 34920 -29596 -353999 -197199 268451 -104621 -10266 64649
21453 106052 -148329 -151374 57168 -15818 -67683 166360 61453 192423 -232402 -108058 309395
21441 255691 498408 158281 275757 -196500 226115 -27288 231984 -87452 -5677 -81556
21431 -81556 162938 -245158 139196 67233 -70373 -131137 8044 -2857 -304838 106997 -70100
21419 102768 104129 -143892 285661 -123920 201274 -102073 164833 319676 -163298 -122296
21409 -122296 -113628 -218107 -27900 -249113 293288 -110008 -86574 -159181 -158662 -157075 -252429
21398 -252429 -251076 -43431 -113618 12377 -167916 9075 172741 67816 -60995 20295 -208998
21386 -181296 37970 90704 -24927 23137 -130722 126859 -111958 -438525 -262716 -208788
21376 -208788 -83792 -78255 -28759 77169 27050 -506858 -101785 -6825 -240023 127582 -253972
21364 -150867 -169101 -368941 177500 -117534 -105565 -142725 -25443 -22440 -102749 -51981 -94038
21353 -94038 -207573 -223067 -115456 -285658 58076 7880 -245717 -198125 138892 -103934 99836
21341 196462 -13750 -53557 -33314 -299236 -85355 117780 -120005 659 -92877 -185931 115664
21329 37493 -241703 134541 -93421 -4567 -147394 37541 154977 121310 -114756 -74797 31977
21317 -13701 -68865 -134760 -44229 57647 194402 19781 -158601 47680 17517 -32368 -257006
21306 -257006 77420 19262 29271 -140651 -208448 -115862 -206566 -42787 -236871 -46236 89488
21294 88985 -71956 -284041 -27541 -68684 -305466 -22573 207864 -112884 36735 -42966 -198022
21283 -198022 152578 -346197 -16009 -332381 -360255 131069 -32859 57745 -175176 -153504
21273 -153504 101965 23525 149272 -309025 246572 -162915 41966 52425 -183081 -122322
21263 -122322 -324698 786 143325 -237566 111256 184327 -237560 -39833 -49115 -17306 230492
21251 -239317 96668 106140 18768 -232156 -102408 241341 -75437 -217246 18191 29069 -242893
21239 -129952 -73470 47912 104526 -209566 -31644 -78881 35239 -301644 -300115 9723 134113
21228 134113 94558 -163837 -257627 -199395 69053 193583 84883 165837 27347 -256738 76262
21216 338502 -21783 -157610 81653 -188790 -112284 -189583 -211900 -197418 -190318 -131329 -53523
21204 14864 164957 -16032 138925 95587 174031 159340 -349582 93137 94172 -80344 -8276
21192 95444 70326 -520055 -13544 -128509 39993 -201828 -48157 177767 -147333 69791 331187
21181 331187 26567 53225 76115 4744 -173270 1973 -138636 38239 -157678 40686 -89146
21169 -17966 -109974 42508 -16186 206832 -347673 -289635 244033 167529 60175 -117164 83914
21157 -37198 -106583 -180690 52758 21942 231023 -78498 73920 -48933 6643 88317 -57090 -9748
21144 -48064 -38616 -76336 -94945 62247 143061 -48750 -48305 72611 37593 36855 35844 -75737 -69191
21131 -69191 -208765 -3472 -190706 -295413 -38991 -161349 -60437 -278897 -189082 96615 -331484
21119 39331 91995 -1879 -309360 -131927 -17458 -314957 -173608 -203626 -101844 115209 -135031
21107 193284 76255 373275 136535 -41290 -19729 -22712 -194775 140854 232248 -148431 -196991
21096 -196991 -17509 -14151 -81601 -17637 314488 -133256 -231541 13025 -250015 -106021 26476
21084 126090 154235 -214933 -74090 -317022 -27517 -1055 -27880 -98284 67415 82030 -214153
21072 73855 16385 29373 22532 101842 -48188 -112681 -207373 169100 -28091 -410903 149254
21060 -179087 140254 -118023 -169042 -119205 -16160 -260788 41506 73822 -117945 -266304
21050 -266304 -151499 -262106 -151925 200567 102490 -398939 97627 -364859 106609 38201
21039 -4988 223351 -65738 138687 416034 -312585 -138366 -96447 -340389 -348056 72398 118899
21028 118899 -78617 89877 -284811 -180952 -181283 -264325 -113288 -31847 -208598 -382661 -191441
21017 -191441 -52133 924 -83267 -173116 -6308 -232073 -29978 -208672 -163575 -177686 -93556 106384
21004 138171 346650 64163 362431 29791 -225338 17527 171774 -108309 235068 -358212
20993 -37768 50695 242256 -256945 339535 -220095 -17220 -65377 -495492 52399 -321008
20982 45004 -171002 -28050 274910 -29938 -157659 -22715 -303511 -345258 -256883 -13580 29103
20970 -64162 -190408 119303 -159134 248394 -21700 100824 -91168 87367 -57239 281973
20959 -84021 223305 13459 -226974 79004 -16805 -162483 -46705 38210 -144134 -81211 65080
20947 197764 218879 91495 130897 -18100 80329 -19700 28074 196132 35218 -64403 91561
20935 70384 -339237 -134068 -46105 251639 47639 144578 -64896 -109249 -19004 60990 167130
20924 167130 -687 -113132 -172843 -45202 -394050 -181983 97475 332941 -30182 -35751 -92763
20913 -92763 99964 -282912 -405910 -6247 -241346 -271616 -161011 -208635 -181525 -198518 -55445
20901 -204732 167278 -440359 -8906 -248337 88509 -258270 -47472 -568309 -15284 -166224
20891 -166224 -39527 12242 -276221 -331836 -148608 -198073 -62301 -165583 -118632 54711 -98505
20879 -137663 84263 -95911 -49010 -139579 245565 -118014 -12089 -3852 87501 -109898 160901
20867 -248073 -140977 -52181 -109142 -3313 304757 -67401 -33560 29016 207445 61887 181509
20856 181509 -167328 198893 -55423 -16668 -225281 -107638 -261457 -142636 -166760 -65810
20845 69712 -492121 -46070 -6816 -196353 -89236 -98047 3466 -245607 137586 -128327 -445729
20834 -445729 -33097 78870 104958 -20976 -68128 -86144 -30472 -25919 -242656 -69727 -318086
20823 -318086 79152 -392251 -318880 17080 -205841 -350775 285609 -55147 -314912 -43065
20812 -180606 -83971 -255889 -240387 -393359 -60987 -172088 116602 -26301 -237923 -61150
20801 -410625 -9387 -43823 -142992 114718 15865 68113 87436 236339 -132066 -108987 41917
20789 -211861 -132915 248701 -161858 -109289 -22543 116442 -195635 -50338 -2925 -287418 -35877
20777 -80724 214494 -168290 64065 -139303 -62541 86593 -286346 240863 212669 -40892 -473206
20766 -473206 -209306 -316575 212723 96684 -158894 256499 -236042 112848 224509 29827
20755 6863 -69491 -317251 20639 -48526 -331176 -151308 -6840 -123878 -106627 21765 -265842
20743 37483 227950 -163115 122683 92612 78594 -266286 -38143 295879 -278207 -87301
20732 93782 110166 -159126 -89604 -117463 5734 10988 -58625 -314984 -49707 -29815 80953 116237
20720 116237 -127609 -199893 -392807 -50133 157951 -219682 -13971 115271 -108736 -103913
20710 -103913 -76839 -212431 249027 -123713 -163690 -387095 8648 18409 36788 -85720 -178868
20699 -178868 -169594 -34544 15015 -241244 -165527 -351951 -55949 -277472 227750 -84183 115214
20687 -307183 -179774 -11187 153121 -254632 -14322 -57282 168018 -282899 16889 -132154
20676 -95326 -273307 52311 174463 241467 -118252 -157117 -94287 -215013 14985 287237 -26147
20664 178126 71822 -309414 196586 -367168 -124951 187192 -213694 -16089 -41195 91410
20653 -17174 -134416 273906 40169 216173 -24974 -403021 -411524 -201085 -199475 84374 118189
20642 118189 -270101 -63195 -251614 -55339 -45877 35455 -349654 -72573 -53137 -60286 -248831
20631 -248831 239338 -190963 227764 -270915 147674 45845 -193886 -45804 117459 -303267
20620 -30795 -90347 -317725 -13800 52269 -13503 135112 134842 172096 -47546 -249396 47573
20608 -100346 -30220 327329 -100641 92550 -241761 19287 9025 -80195 -295152 229618 -50948
20596 215292 190442 -131689 24891 -29134 88941 -23246 -71225 -60242 104863 172466 127410
20585 127410 -243875 166637 -282504 -127815 -38163 32709 248802 -4385 62885 -339746
20574 122277 -30975 123133 -66594 -106245 -64648 -92579 -375785 203231 -62435 39353 -140087
20562 -256903 -102262 -198472 -63693 -124845 -514990 -12448 58920 -225482 -109629 -205656 14636
20550 285563 -7300 147586 -272278 -293329 -71377 -43264 25635 -139739 -255060 -293570 -140890
20538 -91766 -385531 17181 93060 377321 -14475 -207707 24760 166160 -143882 -168336 -179472
20527 -179472 142654 -147100 153140 31109 46573 -13084 -57924 87413 6419 -60843 -330937
20516 -330937 -61203 -58962 -4210 -366418 39713 -89937 -157294 -123264 -106778 -27694 7938 86351
20504 86351 -47159 -338765 -206784 264072 110987 -331806 455223 220004 -49910 -447573
20494 -447573 -182900 185188 -43393 48565 264542 -102235 -25800 -254551 160516 -154485
20483 -316469 53333 -164461 -66562 -218 271755 -153369 -111587 -13856 398689 12246 -203371
20471 35177 -98436 -130188 -80654 -88918 124427 126446 16550 -335396 -148436 6427 -190991
20459 -44978 -54793 64359 -50051 227514 195260 -312504 180221 -399466 229199 -29942 52427
20447 -405608 -131828 21145 51071 15209 -157815 -18179 -209844 -234613 93638 79380 25363
20435 -128360 74665 62195 180351 -47059 137597 169521 -259439 -71935 -171686 -31993 -442334
20424 -442334 -139661 -77663 154657 -396240 -71925 1949 -28848 -101927 -340095 -267566 -24200
20412 -206611 -9888 -270338 -354478 247447 -251607 -188697 -20812 -50407 -205395 -498205 -179581
20400 -107508 -37457 -167542 122769 -123919 -306480 -338474 18680 -221211 32820 -107938
20389 143609 261907 -114529 -281471 69653 -310674 35411 81191 -185273 -15281 216491
20378 -19372 22663 -93548 -5020 -45960 10695 105724 -46948 -116536 68653 66918 -72635 -96829
20366 -96829 -77677 -186726 29910 407868 103105 -152478 -83860 160682 -159250 -153412 -144194
20355 -144194 -170161 -114699 -39073 -24482 -48380 72636 -63603 56910 133043 158965 115136
20344 115136 -285583 -489991 -57911 -3749 -172267 -161774 -38851 -233031 -19533 -84508 -211743
20333 -211743 -198955 -38029 -49333 -259565 -211182 -337151 -98579 -8984 -75303 146730 -221652
20321 21217 90214 -26345 -103209 -80323 155490 106358 88842 -173515 -284370 -220487 -38492
20309 -3062 311357 -116699 -304900 116609 -84448 32431 -16419 73117 -140909 -63740 167091
20297 99900 -102507 34475 253082 42371 176468 -88507 -2792 -2873 338315 -47217 145394
20285 -112152 -106940 -147506 -271180 36711 -45418 -35896 -149758 -52176 -493 -220332 -78589 -136497
20273 -136497 -111077 384549 -162354 123766 118342 8589 -55363 19316 22059 -256571 36617
20261 -60295 -61088 -246637 -153077 79873 -297244 -334642 -357682 112462 -94250 15543 203537
20250 203537 41492 -28569 -392060 149394 -306971 250649 194469 193469 -296280 -4901 -13749
20239 -13749 -89085 41657 17874 -300433 -205447 74137 -33762 -22213 -210377 -104642 -74119
20228 -74119 144447 -113462 151197 431637 -137710 209006 -110657 -20789 -76041 19633
20217 -27041 54548 -420455 129470 224335 141296 -46100 -251960 -44896 47124 -47227 -36007
20206 -36007 3658 81649 -282540 -8673 190780 -230161 2676 -222107 203028 -143016 -265793
20195 -265793 -262215 -220616 -187250 -169502 10539 -174159 -35579 -132308 -2047 -59421 214094
20183 134104 -28756 -127785 -156126 -282020 -60207 19067 -15025 -243761 168639 -206561 115092
20171 327448 -126322 -187301 -107134 -219080 -52609 -59617 -163726 -92773 52649 63235 158856
20160 158856 -455724 113317 -56055 211369 -24710 -297407 44436 83211 71862 -95588 -80293
20149 -80293 -131346 -112776 117513 -138025 -118974 -29190 257600 -241887 27482 -66694 -231486
20138 -231486 -109049 -120410 12653 -475668 26369 62920 -130981 113599 -65440 -44753 -353237
20127 -353237 140841 -138464 145234 27074 27031 -63683 -238133 7191 82947 -914 -4912 -19375
20115 -19375 -247573 118416 10232 76541 130498 160354 142739 -213471 55716 -45082 -191200
20104 -191200 48013 45672 -242057 222088 -235197 76773 148552 -5980 217890 -351363 -407037
20093 -407037 -46941 -62727 -1802 -119768 -99542 -53730 -168645 -232820 -90447 91872 327566
20082 327566 -33554 -275957 47867 -43738 120580 -232864 375901 -377168 -352543 34492
20071 -165907 -139249 -40319 -167935 -126025 87713 -146783 199590 109658 -49063 32163 -53106
20059 76570 159798 181482 -40622 210353 177473 -71341 179135 -145543 -47297 5696 1288
20047 -167757 -227135 -45608 153370 84471 -80836 -129240 -198172 -157958 -20953 -1550 -221276
20036 -221276 -11287 -163988 -53483 -401873 -56600 -358188 27817 -149081 -299205 -28370
20025 6947 -239300 -86578 317459 -121444 128262 174326 143925 38285 -183554 -26913 -6093
20013 -279061 -68376 -183564 -303012 -637031 -129774 -48158 -38490 413872 -108879 -81747
20003 -81747 -302125 348556 -89370 233014 15657 125900 -163672 215615 -78760 108799
19992 295308 46786 150172 -112389 -166542 19861 139112 61911 -83382 -101911 203451 -14296
19980 -240699 -283522 -74828 -86507 -21640 -338068 -287931 -59759 -145228 99300 -126545 25398
19968 -316260 116128 -78563 -442313 -31928 110002 -20311 -144735 -110837 129124 257124
19958 257124 -73859 -203868 -69840 -316862 -65338 -111738 82733 -58795 116665 233596 -260402
19946 283994 160961 58941 -211294 -284720 32742 -192149 -33369 -294625 -238325 -35990 -8098
19934 -16431 -37165 -218222 -215486 19431 -103860 144820 -13603 -49709 18783 18546 -314803
19922 35928 131853 -29006 45782 -45668 42873 -31580 -49966 -112051 -166281 -392602 -296943
19911 -296943 -144023 -412326 -49973 -331506 -69724 -1308 82438 -152335 -55572 -45246 -190634
19900 -190634 -319929 -368562 -7940 181831 205558 139059 243137 370467 -165831 -130937 -350275
19889 -350275 170013 57033 61111 36147 -135609 98200 263838 128990 -182039 76004 -59042
19877 -28746 49700 32803 -68212 81579 -101058 237082 114511 84641 114016 -110399 -90943
19866 -90943 31298 223450 99706 -123831 -52184 72690 108377 -172727 -315609 187372 -113485
19854 53961 34605 218083 76739 -59079 66567 -63220 -261978 -39051 282140 198285 -246142
19842 251674 166652 68672 -136931 -149902 -232715 -135096 -113749 4803 37202 -319381 -232720
19831 -232720 -52089 -107620 -200432 -107677 -142975 18757 41564 -247139 -115102 -136468 238099
19819 -139185 82249 -296156 122279 -137272 -110857 223261 -39887 148190 50940 -100560
19808 68499 198092 -76548 84322 66625 -219008 -238302 140809 -195691 283799 -114062
19797 -93135 -83927 307093 -172485 330600 -192664 -203141 -92977 -117805 -224423 -149942 -191906
19786 -191906 -71441 -60354 55536 -13046 -330198 -236401 -32285 -179066 -324436 37820 -271230
19774 110876 -42008 124985 -368878 -150150 -10693 -93521 -37754 -89640 -315680 71855 156421
19763 156421 -123587 -266701 -231186 -255235 -68357 -86855 -343526 169091 155517 50326 -122676
19751 -237544 -345077 -121896 82770 24411 169415 -83057 4861 -166251 -190743 13351 186873
19740 186873 38735 -37657 -22183 33731 33451 -95423 227846 172919 -22647 -84645 -73921 -2984
19727 83529 -288573 -211605 178863 -153711 -30199 -29951 246149 -48344 -319162 -311533 -169385
19716 -169385 -185253 -181640 -221081 -69449 -117544 -245639 -801 187432 -190695 -120937 2244 -157344
19703 -217922 -206491 -204382 -3536 -130005 -70310 -235187 220548 19936 -298807 -370218 157666
19691 137835 96859 -363037 249214 61591 161386 -247059 175415 42268 -69227 -274287
19681 -274287 -146280 -286591 182846 391349 -119279 -226103 58254 -247967 313049 -89205
19670 -143528 55996 -352601 128004 -261698 -64587 -274876 -263339 -309005 53228 154370
19660 154370 180594 285487 -44393 -89474 10303 82748 -150876 -342859 -239919 -325504 11489
19648 -123677 -157330 48189 -176006 -459928 -72926 -73827 63621 -52966 -118512 109247 -635731
19636 159888 29905 -101297 -258715 -17536 -356150 34479 -216168 14758 -5401 -35553 -145858
19625 -145858 453473 -140054 -74789 8288 -72553 -104802 137452 198060 -117477 -68928 3368
19613 -106953 218712 161573 -13890 -153043 38506 -118284 -26057 147158 -140982 100719
19602 -269515 -322465 -32004 142351 -167163 -91397 188727 147739 -362499 179304 -250690
19591 117672 -286358 -183646 188988 28422 -146787 -395984 -45395 -98137 123431 167 -106297
19579 -123889 -141617 -84179 138777 -135599 27276 -134067 -340377 -248046 -15075 -225893
19569 -225893 127234 61554 254754 141413 -80904 328004 82808 -577 -68909 -83335 -38080
19557 -268259 240914 -189997 376920 128166 -68259 110830 -54884 -275459 -88689 -274788
19547 -274788 60026 196466 -114578 166184 38747 -110988 -43819 485601 -142973 -74309
19537 -74309 225192 -48753 -146252 -328070 -135128 95708 -2176 -128339 -39241 -138274 -73587
19526 -73587 26609 -12714 -268782 -133230 -142490 -71891 -161279 102472 103042 246719 -17812
19514 -198007 -68389 -125066 -229495 206540 -143568 92418 281815 -154044 -69046 2858 191821
19503 191821 99573 -102185 -6665 262993 -21761 -47851 141681 -37209 97646 -36113 71093
19491 -149905 -76733 -381450 23254 -149976 -352046 -400164 -117384 37520 -22867 -183084
19481 -183084 -208082 -120869 -374593 -81872 -160580 76587 -144980 -92737 -22861 279626 -72851
19469 202688 -183734 23985 17191 70796 -233409 6807 -228147 -197368 -7230 -46892 -161904
19458 -161904 -33090 -223502 -296384 -150865 164230 121458 -128882 -19192 -215443 -167413
19448 -167413 -123936 69333 87414 -336663 164763 -149749 64657 -75258 -20132 -188619 -110961
19437 -110961 -60816 -74085 -108532 -36572 -164814 -69477 42293 -160111 29249 -136673 27654
19425 -130207 127794 293109 -30946 177975 90191 -66602 91819 -12348 57957 -223564 -58499
19413 -107958 204494 -359072 67532 -92789 -324741 -157708 -168385 -72769 -68010 -142250 -223226
19402 -223226 -67675 36579 -18516 -50704 26296 -97311 -178517 -51750 -158751 42166 -53287
19390 184126 33398 -15290 -103505 -45501 89331 -246400 171664 -185189 -273515 -168529 -46419
19378 -83868 -424086 178141 -203558 139935 201659 -331002 -219412 -125306 -51062 237302
19367 48823 -31020 96055 172841 5645 80472 -239723 -260836 -355695 -132677 28863 167607
19356 167607 -98417 -46523 -30166 52413 -149526 151663 -61550 28967 -130709 250757 41987
19344 -148930 -84537 -64423 107979 252564 -123530 -66071 139871 -41957 -91588 76446 -229698
19332 -120710 -15929 -162035 -118544 279724 20241 78548 -49508 -21195 145689 -250276 244746
19320 77648 -22351 -30970 -260649 56389 6099 -370182 -149881 -141582 -2916 108838 -339085
19308 -196105 12961 126650 -226374 -189739 -343755 -141822 -132256 -122548 181250 67247 -28469
19296 110172 -12074 92911 131402 90323 190735 156784 -57760 -328940 -58145 351379 343887
19285 343887 -171402 -214327 -237706 67807 -289781 105710 25723 -164730 136873 82491
19275 82491 -127345 -5021 -96609 -47103 237204 -256945 -426592 -277452 -130597 -46268 85028
19263 132045 -195858 -167958 -25699 62041 -259605 -207911 128474 -183713 -244834 -226061 -64410
19251 -153434 42969 -68298 83472 29631 -49237 387633 40669 -119513 -223111 -16185 9009
19239 -23214 -44989 -53219 -29433 -207500 120058 92160 -73785 -68785 -85004 -276929 -105739
19227 -26146 -66917 -119681 -123982 -189886 -302668 180755 -48566 -101292 293067 -76074 -203483
19216 -203483 217923 350192 -300994 115547 32490 -25057 110221 180156 -325296 -113720
19205 -153215 -121659 -278046 189181 -183517 268017 -485742 184470 -463687 -108362 84642
19194 -280288 -164782 87541 -72538 -46845 -342211 -153658 130255 113395 -285002 -97117
19183 98763 -71208 -46217 -11752 -131906 -5978 -60020 -301134 36328 -165722 -277816 -42850
19171 -15529 -332380 138931 -217206 -72909 10895 -289961 -207568 -19182 -159488 -315010
19161 -315010 -24178 121705 -176317 -51463 -71610 -68428 -127409 -150587 -139029 33245 18258
19150 18258 115896 15524 -6690 210152 -1788 12361 -90235 31328 150094 41580 -291850
19138 -112641 116 -240617 48095 -139596 -86837 75572 109955 -308456 51335 -370999 -33930
19126 -269364 -14036 133556 -117382 106198 -291864 -135504 -220985 -24920 24307 186462
19116 186462 -80741 131345 -34841 -244175 61552 43411 292686 131538 34170 -115356
19105 -133064 39676 -144054 -39590 22835 -210947 -25019 100851 74842 -143728 -179993 -108496
19094 -108496 -14626 306817 -46564 100838 -142239 53974 -104545 -99103 -172595 -133321 -32576
19082 143738 -191886 250659 -659243 212544 -261020 362729 278075 24115 -177585 -430809
19072 -430809 -245565 -163343 -116790 99532 -91385 -2376 -107075 62436 -17406 68827 49098
19061 49098 242130 -346126 23132 97758 -244549 52 27291 28915 -161761 -18509 -80682 183624
19048 -155039 29927 -71213 -219997 -230747 -83643 -125461 62561 293372 35242 -95692 -82125
19037 -82125 165312 87109 -60398 38643 -161838 -90192 -122577 25263 215840 55205 2704
19025 297338 78761 270620 351872 -165029 -336346 -2148 0 -132163 -69708 73947 -111204
19013 135936 -181464 97582 -178607 -293832 -330431 21243 11047 -102607 298800 -202536
19002 189944 -99495 -60741 -93726 -4829 120748 314322 -274096 -208646 45942 63834 -65666
18990 -124626 -296413 176385 -53595 -203935 -78894 60475 -232646 -93551 -12324 -6965 -220626
18979 -220626 252443 -29406 162126 13808 126398 62031 185539 122244 77700 -79025 191532
18967 -179968 -42849 -271431 -55678 -161426 109412 -116098 -2467 239329 -370014 129548
18956 30122 137642 -19467 245908 -198130 5641 51335 8528 -93689 -240498 -117036 -234504
18945 -234504 -149033 -170491 80247 224268 -413083 -93295 -74954 -150319 -58905 -45268 -103063
18934 -103063 -306102 120855 86921 -209021 -36215 -215957 119921 143916 -44565 -142843
18924 -142843 114579 72985 619 19853 -208427 -33139 48536 -122401 -206202 61616 15343
18912 -165759 220325 -192275 31682 -36097 98048 -4351 -99858 -48298 -199288 120244 -201719
18900 103311 140877 35942 -113322 -159330 84044 -89700 225007 140671 -2621 88870 -331154
18888 -83839 -325418 -112060 75469 9933 -22105 137993 188220 69366 67517 -69542 67185
18876 -11735 -24833 -152521 206112 -336826 -104698 304468 39646 209797 9765 -233372
18865 -198362 -52127 95652 214064 -285888 -33708 36200 -51806 51491 -76848 -106722 102500
18853 -155841 137108 -18519 -109412 -294126 38512 157386 157934 -76041 22085 100882 -266558
18841 -81858 131308 -442084 -208297 -76257 -95798 -61665 46815 -167902 -87306 242261 162334
18830 162334 -111652 -145512 -104903 86994 -63903 155375 13611 62619 -20981 -154882 212194
18818 240126 -8894 -173307 -33702 -221571 -198454 -81290 -56404 -180885 13207 -87160 -149498
18807 -149498 -256782 -8504 93237 -233848 -5627 -18894 -145353 -60435 175425 -597289 -150050
18795 -316534 -122620 211534 -187269 89440 -97954 -78108 -119562 -436346 -9185 -95391 -343488
18784 -343488 82474 174478 125448 166351 -40139 -112393 -413465 -99006 38217 -230681 -209017
18773 -209017 -106500 -254588 -100937 -146879 -264572 40168 -126868 -30801 -136822 -177562
18763 -177562 -231336 -273805 -196567 -70196 -20539 -142776 -112466 -157420 234324 45670 414166
18752 414166 -76593 -56661 -58539 80105 -102041 -122516 -6168 290796 -9013 -58150 -1572 20058
18739 -24941 -397426 -102540 60022 -138947 -49367 203009 8773 -444464 -224107 -248838 196495
18727 63172 257551 -113816 -288883 -334613 61949 -287472 -68811 -100303 -57027 168448 -21064
18715 60833 -24492 281247 150009 17100 -191922 -222342 130311 -124760 -110982 -200501 -245388
18704 -245388 -382151 69352 -45113 -129788 -53479 88129 6384 -142346 -83459 -3784 -347463
18693 -347463 -76694 82912 -200639 -117016 109052 78046 88240 146909 81662 -469341 -23285
18681 -55624 -9327 -153970 206423 75254 -193429 148183 -82709 -198347 -83818 29871 -45231
18669 89220 226070 26265 25505 66325 147216 28800 112335 -62388 135579 2901 22287 55
18656 -4421 -106550 280819 30231 -95010 23586 -17870 -79942 41679 300160 -23882 31540
18644 -136249 -233687 159214 -180293 -210787 -82749 156775 58112 -2097 149368 126992 11644
18632 15640 36242 -172555 -168180 1474 -383140 -20140 77800 -57496 89603 -278986 -212916
18621 -212916 75469 254511 -3151 -85380 -314156 -67348 -455299 -154952 -361454 134351
18610 150899 -234269 -147643 52274 -4356 -302819 -201422 -106427 -184666 -44483 9579 -95495
18598 -164047 60595 -389472 -245469 122595 9002 -275855 74100 -113967 -296540 69874
18587 -286050 90632 -361495 135548 -132313 53908 179757 105990 -13757 -326535 -180671
18577 -180671 -159171 75672 -143706 110560 -334092 37192 -138567 13870 -151356 25231
18566 -18582 -68028 -76531 -86403 -67881 -302056 -91226 -300713 -437719 229093 220070 -100085
18554 -463244 180085 58465 -162382 335595 -44872 -210854 -226182 -139992 -13030 -127262
18544 -127262 -98949 212736 -246054 125931 -81643 -43302 90889 189807 -128929 -269506
18534 -269506 -142297 -103955 53168 -161850 -21576 -151153 184745 27204 -122333 320081
18523 -165356 -277414 -114904 137155 274634 262149 449093 -96008 -12121 7786 -133536
18512 -64120 -146547 141016 28466 -39092 188882 47213 34966 124292 -2964 109558 81697
18501 81697 -107527 -6500 -152453 205445 -116922 44466 -83797 -143648 -359011 94065 -184389
18489 191965 -222442 -33061 70471 -162615 148725 -356794 79798 87776 -82226 -44604 112495
18477 140747 -196034 -8677 76302 -110287 -5023 7473 -152688 245728 50148 56088 -93739
18465 -186826 -264089 -342013 -188605 -436575 -169434 -124083 -170553 -87757 -5688 20584 13921
18454 13921 -246551 -432631 1566 -117101 -110306 57213 -184356 -263109 -104606 82507 44850
18443 44850 63570 69639 22521 34754 -183275 -9759 -292368 246967 56766 -37602 -342885
18432 -342885 -524869 127210 64634 -107431 -133252 81983 -285747 -83286 -263704 -237907
18422 -237907 17254 -364112 379485 53657 194046 331837 74090 1334 63924 109973 -62229
18410 -125866 274244 157481 68663 -126903 36807 -50317 78201 150446 60739 -114340 125908
18398 -212874 114643 -59807 -52371 -152071 65963 -181889 196510 -238265 218124 -74203 168805
18386 -227294 138883 218069 -21843 -112036 55713 8651 114431 -149389 21061 -148135 -222832
18375 -222832 -326992 79395 109344 -285324 14829 288895 -180284 -19740 5062 113612 -430666
18363 -23049 113473 -235296 233314 -170714 70834 51517 87433 -191677 18621 205346
18353 205346 -133963 140134 -31849 -271545 224504 71575 -27650 -265913 85414 77449 40112
18342 40112 -225087 -12239 -54369 24179 -151940 45615 16428 21757 26283 84498 -110440
18330 -154614 157546 -164142 332084 -281662 -54471 234166 48921 39917 -154867 30675
18319 103510 58686 -198446 -203816 -95759 -242870 -10958 -94571 215540 -163732 209469 353149
18308 353149 -269956 -31769 230634 -13920 -63489 -100323 58758 -27006 -170533 21973 167
18296 -255870 -29452 -82518 55956 338280 114420 99332 97371 -174266 -286068 177006 158386
18285 158386 -40552 -189880 137833 73807 78126 -51003 152577 -217204 -6077 60692 18588
18273 -363441 20042 140614 -40542 -32465 99574 191188 -537642 30354 146012 20971 -321593
18261 73440 89514 130810 269617 44743 198128 271055 -241176 156726 -248275 57353 4080
18249 -176025 -66682 181746 -333055 -121011 -81986 182340 -34388 -162916 142913 -142251
18238 64541 375108 -314126 -387336 -166988 -104148 78017 -53908 -254979 1959 -157047 317768
18226 42426 110957 145344 21450 58247 -57526 34191 -18652 335759 -133644 132850 65924
18214 127799 -233373 -157409 -127251 -165208 96711 -105904 -118702 -435663 146033 -76548 -85403
18203 -85403 -185747 137553 -178752 13395 250864 36204 102935 -219977 -71958 82946 -88288
18191 174197 166193 30274 128701 -229029 -122439 223298 -60399 226826 -34904 135381 -142235
18179 -77361 108431 303622 -255906 239756 -95468 71156 39929 -40375 -83565 -228067 -286575
18168 -286575 90882 -58377 -344583 -63694 -14120 -64433 16826 215213 180275 -86705 223257
18156 95987 -23098 -80805 -238773 55357 -155721 -188265 -181290 125823 -55613 294053 12996
18144 -143281 36943 303131 -117790 -9671 -187695 48152 -9067 -42614 -200301 209393 -507417
18132 -230733 65221 -206935 133767 114824 -115386 -284003 -187813 -230659 107643 162783
18122 162783 -13285 -158327 135788 208466 25399 -329640 -107233 -57900 -441011 -98781
18111 -110467 -17621 -133677 35752 168304 -163419 6982 -77876 -88552 22740 262227 -60472
18099 107005 95703 -37501 -117063 15826 116263 -60808 -26650 90880 -201257 -249399 -136746
18088 -136746 51293 177436 413119 -209760 39779 78007 -164014 91292 -86353 91721 -330886
18076 135760 -24003 -36233 16317 84198 138021 55610 150677 -20459 -74350 -75125 166382 -49748
18063 25276 97539 -22139 -173821 -6690 164379 243965 -136500 -205584 -171815 -120122 198401
18051 69848 -137565 -224770 -310393 147676 -82284 -154226 -188121 100874 -123422 -154758 -43464
18039 18950 -80322 24742 -12798 144874 -91210 136450 192085 48636 -5198 -79486 265967
18027 97254 110334 -77674 38761 128942 -87606 305631 188358 200956 -208323 57383 301851
18016 301851 313546 -9666 -100696 -174009 -1759 -19895 153648 267020 -209515 110210 -261215
18004 248973 -135517 -139135 357721 32093 -292861 43859 -188453 -21051 -132799 -289024
17994 -289024 17701 22576 76059 -60080 80078 -237909 -197014 -35513 -58540 -204747 -105247
17983 -105247 331815 -123975 6610 -214204 -11719 2837 180832 -159320 243112 -48698 191921
17971 164545 -21111 374004 90681 -107876 -13924 92088 -27013 23333 -154567 -80036 19092
17959 73333 109885 18376 -111081 -309947 -135206 -178567 -61043 -86711 -219926 80606 -197082
17947 145248 171249 -187409 -170648 -33746 151888 -424841 178816 -115514 -159957 -206538
17937 -206538 85696 -178953 250235 129694 -42197 79518 33348 154934 -45415 -4602 52885
17925 -87180 64911 44668 225772 -90181 -20526 337220 427776 -87244 -296847 -289352 -788 93052
17912 75066 -88663 88657 -101421 63424 73200 -239149 93177 170631 274697 145085 64622
17900 247073 -158177 332589 -243096 42353 200753 319400 52483 -116688 -27266 7556
17889 258589 95495 231971 46391 27209 103385 18325 -93940 -42918 158326 -53886 230611
17877 -87802 109760 43310 -319714 193224 -101858 -283758 231302 -401434 102471 -183140
17866 -77976 25011 173583 130793 -373109 -134954 326749 137697 -26121 346484 71611
17855 99120 189712 -374534 221565 -92339 121332 -164071 -86685 149797 -4353 56765 481024
17844 481024 -159301 113916 -87886 -1089 104356 130233 251215 -9122 119585 110631 195225
17833 195225 -70922 107663 32999 298575 -319289 43766 209184 -4322 -48288 83426 31291
17821 -318894 107336 -350044 195683 37009 -67770 82903 78474 252198 -314061 -109410
17810 140376 429364 51365 -147960 163826 -8937 345357 191548 -94644 -111720 86546 -27401
17798 -127814 -40874 171217 55693 -204388 -108902 -43092 -39467 -5840 75719 54147 -18432
17786 26035 -29183 71864 82872 -241985 51599 173444 75018 219269 253846 204384 -36788
17774 -150892 58398 138160 36232 16423 5714 -99353 317301 220946 -126160 238774 4014
17762 -83323 70900 122190 -71498 -3184 -427707 -238660 -82254 75450 62780 273639 -15096
17750 104187 -54995 483992 -183181 83641 92194 -77059 -15776 12323 218716 325524 -7930
17738 481197 -167574 85281 35292 172407 13264 205680 -43910 345666 434725 215511
17727 140304 -95126 398617 -152887 80576 297602 106622 125483 216927 -259084 -25165
17716 199633 -57464 28555 163866 -120371 128392 112114 -12849 415186 -189979 -175543
17706 -175543 49270 -255608 -193962 115186 129733 -18379 -31331 51881 -39005 -9296 -106993
17695 -106993 265528 131122 -272212 50898 161761 28666 79990 -98103 250047 -95933
17684 -33959 98974 290682 -40423 -42992 257434 -5639 392688 -43608 150312 279938 261432
17673 261432 170492 178235 169375 237530 71500 -89755 -13729 108882 -155625 -90677 -86799 445648
17660 24274 39016 17436 54200 85331 323239 -33164 -473772 231267 -94109 333961 -4657
17648 86132 303587 376611 79475 22321 226728 279371 -247166 -119925 304643 200245
17638 200245 149708 302179 172037 68525 -401715 -124758 -228997 222495 -210796 296611
17627 248031 -169183 61325 4027 56756 -141004 -100733 -193301 98425 172219 200602 -178143
17615 175012 56290 216693 -110892 -257909 -23547 26873 243075 100234 122099 56737
17604 50534 -274775 504026 -38583 398176 17604 37021 239455 2877 -100123 -25343 98573
17592 124582 -36417 65697 139699 102541 -2827 7370 420238 24099 -39230 240885 189808
17581 189808 240718 79630 231310 145287 346900 77519 122796 181626 -126695 50295 375381
17570 375381 4436 9633 -134782 91847 88845 109705 46620 232030 3337 -119489 379238
17558 453152 84843 76218 -145067 69829 45935 16917 89009 175919 128399 -91162 95178
17546 -28237 153041 -212059 80029 -103491 233304 354982 79529 118180 163938 16343 -54060
17534 196735 -25342 143738 155758 129227 122230 151688 319161 1874 54150 -212831 28480
17522 161043 43187 87503 231120 360318 108696 131692 62145 101121 104057 219436 298696
17511 298696 44201 379239 76153 193682 121293 144132 321007 191970 355442 62013
17500 274042 34267 110185 45174 103052 14871 456316 139111 -55236 206242 120888 115623
17489 115623 56807 472246 175034 165661 -96704 354472 288363 218820 69400 437104 149441
17477 293328 180076 230046 -20876 -5928 344177 197911 71529 118267 -194182 127265 36271
17465 68325 210053 469425 187279 64132 88086 170960 265443 151312 303391 420207
17455 420207 2846 129643 265554 311513 132259 492347 391229 176389 372377 -9972
17444 363294 202085 209033 358256 351678 310167 217424 279212 121571 -176255 195508 267277
17433 267277 52511 156733 251987 196624 43102 418157 383476 229766 51297 317723 19326
17421 353545 -154192 18575 101139 164500 213677 353186 278014 469711 17801 317955 33621
17409 253413 262593 54322 359512 412681 168523 2976 218658 325950 66145 381470 419424
17398 419424 359642 240198 -14113 229669 37630 494979 134088 43768 214242 275607
17388 275607 -71117 444102 294289 190144 77982 251597 255990 275864 285108 96659 254683
17377 254683 128401 119957 224894 371721 255670 71572 182618 205373 -23871 110852
17366 160192 219107 209486 -6934 298640 337407 499797 362249 287804 -52348 416820 171714
17354 -112503 95002 463248 199886 106168 352876 155161 128618 335910 133590 11325
17343 261703 122720 -42306 -64232 166962 258697 108090 37517 257597 229855 83446 357971
17332 357971 328209 282453 113020 275107 246500 -70069 212537 133443 107827 69636 459828
17321 459828 255020 50000 192119 289981 154404 240673 3154 253277 -57075 400900 230613
17310 230613 293734 55407 132683 -16892 188298 -95646 347982 247482 346536 271739 364014
17299 364014 245402 -127277 165512 193057 461793 472423 369364 139672 23759 282313
17289 282313 513167 98684 15841 184896 306395 173243 372014 -173753 476537 123563
17278 178054 380926 236492 485962 218483 94096 507535 188935 154276 729581 363098
17267 570259 488565 463905 40837 293520 220181 16434 -38633 26184 435071 230553 125567
17256 125567 193197 74803 324308 334846 227786 458382 70575 -36727 345116 76991 225972
17245 225972 778852 293425 422641 -22456 702705 69355 343973 190928 355901 310841
17235 310841 441767 98705 78260 255998 465903 242982 231578 158977 257637 493697
17225 493697 279926 247505 251511 317597 126241 213137 220508 404805 272963 359713 436785
17214 436785 101903 564778 169045 22851 691175 521409 670462 361195 140455 345884
17204 345884 281927 577836 59344 3473 299842 595471 387790 279705 409743 341690
17194 341690 320540 404442 361948 540680 139053 230326 30363 525677 367697 390678 337875
17183 337875 406619 392794 199738 440077 313892 301986 617294 620317 282613 493223
17173 493223 495048 312979 503185 270355 332458 536537 250431 216719 102683 378316
17163 378316 707410 193874 328697 515959 400696 583337 485552 461112 431706 234310
17153 234310 163521 443674 595650 327105 380471 530075 286173 435690 600823 655275
17143 655275 381291 30923 749395 694411 313286 576744 438561 245692 586646 272818
17132 297082 203780 262678 670402 287925 193698 573900 217134 277769 366700 559927
17122 559927 565499 282934 652414 292840 341164 343708 516840 499035 860017 433235 475996
17111 475996 460754 730202 448320 560430 734983 734911 652149 588909 601978 876249 493275
17100 493275 737890 495437 614970 772803 570326 595203 574361 591205 334951 312105
17090 312105 272584 484284 725106 677147 639726 788589 531228 838508 485195 561534
17080 561534 952681 757111 478047 617127 918967 811888 716552 647318 805021 675711
17070 675711 492461 732563 885474 616330 566499 502053 780187 973430 632890 870663
17060 870663 839620 643496 726689 809990 813511 956768 593042 828153 708587 562885
17050 562885 782260 783165 863151 927804 896884 517539 985740 775263 944455 563161 825344
17039 825344 849317 922148 828981 762083 729800 856854 722294 766534 577853 725046 1058917
17028 1058917 764065 616199 836591 589145 1017440 937871 1008590 598387 719556 958368
17018 958368 1071057 1347354 790383 842684 1156911 1155414 853915 583939 1003273 814960
17008 814960 1397001 807371 912547 1097840 986119 1020983 1024105 1217445 1015371 1252977
16998 1252977 1015942 1106526 883700 1134959 985122 797285 858627 888048 1021561 1156572
16988 1156572 1278669 1002572 1112576 1127114 1314173 1344273 1217865 1187642 1219883 1533307
16978 1533307 1443125 850886 984179 1491250 1442873 1298243 1544893 1315047 1399516 1062267
16968 1062267 1436840 1058299 1024552 1391634 1567661 1526753 1602715 1357420 1406727 1393208
16958 1393208 1565436 1769874 1555936 1517915 1576302 1640257 1452262 1444176 1666753 1590413
16948 1590413 1478435 1363234 1605392 1480101 1656856 1583653 1522829 1792193 1521386 1367896
16938 1367896 1756369 1968469 1832672 1821187 1794524 1836427 1902824 1630339 1942822 1753302
16928 1753302 1637521 1762634 1796769 1928415 1924288 1521058 1848134 1930497 1685547 2030190
16918 2030190 1949327 1943586 2252048 2293416 2156447 1958305 2166493 2169849 1968090 2187318
16908 2187318 2439348 2236847 2293552 2368036 2375750 2203882 2485717 2599009 2342786 2078491
16898 2078491 2381448 2340010 2581113 2484059 2546398 2748312 2658035 2867662 2624040 2610198
16888 2610198 2763558 2679578 2761265 2987058 2802264 2877765 2961044 2697467 3069060 3073518
16878 3073518 2950870 3307066 3116432 3153826 3263175 2998158 3288250 3558206 3486172 3235234
16868 3235234 3661002 3546423 3485445 3686707 3659929 3849601 3903454 3773070 3952536 3881947
16858 3881947 3848406 3773222 4138073 4541570 4194728 4398353 4145850 4502554 4398635 4860199
16848 4860199 4481753 4473899 4954017 4924711 4786479 4863722 4713398 5345243 5307340 5464194
16838 5464194 5145900 5421518 5157591 5468517 5613063 5945984 5957688 5858961 6019385 5927727
16828 5927727 6289842 6008897 6531673 6247254 6857862 6569116 6792741 6997424 7187291
16819 7187291 7117676 7416344 7297438 8120612 7893764 8229320 8198327 8223316 8545177 8748296
16809 8748296 8859107 9072070 9119086 9178079 9518075 9795264 10409959 10300410 10615048 10802515
16799 10802515 10824471 11302815 11241961 12199772 12026362 12432810 12537562 13077962 13164890 13460684
16789 13460684 14176032 14255250 14719459 15006624 15712207 15774841 16229728 16769769 17133183 17709519
16779 17709519 18307766 18583107 19178423 19669128 20711927 21278825 22026300 22512405 23192989
16770 23192989 23944901 24980975 25652912 26397631 27444586 28080948 29434590 30264606 31202546
16761 31202546 32366142 33882980 35129088 36362391 37820449 39064603 40426251 42165743
16753 42165743 44002778 45709915 47511727 49454816 51901356 53818413 56027383 58463842
16745 58463842 60910078 63432266 66011317 68489121 71576700 74448355 77205270 80872582
16737 80872582 83584813 86652361 89762797 92766741 95886044 99116756 101785222 104538339
16729 104538339 107272103 109442691 111588410 113040846 114572621 115516628 116157029 116694363
16721 116694363 116580102 116081414 115093448 113808288 112195026 110140496 108246228 105891441
16713 105891441 103087267 100490268 97553983 94670700 91539099 88240929 85180553 82108815
16705 82108815 78943914 75869621 73282232 70421521 67379309 64932058 62143134 59678432
16697 59678432 57161708 54677520 53115797 50707906 48500948 46589133 44613859 43149431
16689 43149431 41246528 39944897 38093617 36340131 35201390 34290766 33049474 31513842
16681 31513842 30665895 29451233 28176216 27376870 26590812 25841438 24710814 23941850 23221265
16672 23221265 22300177 21763215 21140721 20676935 19721776 19379826 18568864 17857731 17640202
16663 17640202 16758223 16425939 16074719 15749773 15383878 14868351 14206835 14255807 13880143
16654 13880143 13700000 13008135 12730124 12286118 12263143 12005105 11320427 11158374 10894425
16645 10894425 10743488 10553462 10382713 10015663 9778737 9419546 9197999 9185627 8865702
16636 8865702 8947359 8808687 8525235 8386907 8115729 7548893 7815633 7758701 7543436 6997242
16626 6997242 6765032 6793156 7235866 6470733 6763118 6333869 6384855 6255553 5918706 6276784
16616 6276784 5943860 6044891 5829252 5575491 5470387 5790994 5193050 5235798 5117809 4932264
16606 4932264 5046828 4796446 4496158 4603170 4556752 4500147 4525838 4741640 4525380 4598997
16596 4598997 4222954 4440933 4028079 4254557 3963074 3652317 4187556 3674112 3550097
16587 3550097 3607808 3542618 3670215 3490561 3492179 3359580 3351178 3435819 3222449 3206097 3391602
16576 3391602 3208087 2933034 3078619 3133383 3225091 3234287 3224662 2835095 2933144 2968230 3233680
16565 3233680 2711937 2811327 2793306 2811570 2905585 2658809 2819474 2566691 2419812 2532187
16555 2532187 2483498 2548645 2363048 2430513 2352340 2328876 2240768 2341583 2169181 2125676 2166312
16544 2166312 2184315 2146649 2027488 1972973 2145065 2043504 1994679 1716679 1909244 2065132
16534 2065132 1898033 2054833 1974477 2253351 1938758 1872639 2130568 1816991 1814769 1841738
16524 1841738 1859331 1902717 2012911 1665401 1854093 1790164 1662541 1898812 1481735 1561743
16514 1561743 1841771 1542666 2023229 1634913 1624150 1371188 1611675 1391084 1468571 1573404
16504 1573404 1531127 1438680 1451677 1646452 1654364 1564003 1505772 1555106 1353255 1542100 1215665
16493 1215665 1390345 1433184 1472218 1568627 1422398 1408745 1538870 1032350 1474077 1385018
16483 1385018 1331621 1556724 1358967 1205590 1226255 1281888 1089632 1515158 1288741 1042415
16473 1042415 1265237 1285550 989329 807792 1502058 1304795 996804 1192174 1082216 1222810
16463 1222810 1244476 972530 1125161 1179848 904747 951575 1137369 1019410 1454888 1371392
16453 1371392 1032986 898457 1173959 877769 944454 1036238 966887 1055348 1062247 1004324 1060386
16442 1060386 940495 1075883 1098695 789326 869188 1019889 1148665 1413729 854852 1086230
16432 1086230 1050444 1251328 937286 898662 1135173 806522 888718 1003404 1115792 1062240
16422 1062240 858355 908617 990260 803695 835341 939048 1014519 928021 951809 880932 895922
16411 895922 916158 857954 879048 737913 677978 665235 750525 946554 900341 896346 776621
16400 776621 868357 776451 831708 848547 633675 756579 503880 754650 732144 726660 730025
16389 730025 855372 896441 838236 335107 866855 533544 550109 744752 974203 935912
16379 935912 671537 829493 811347 664292 619791 486577 871362 1023904 732123 378157
16369 378157 607093 841471 688476 497521 861619 956456 676437 641178 920882 783624
16359 783624 635484 805335 396017 888179 596231 753839 685772 634733 644603 350194
16349 350194 846453 466917 548370 571300 622776 715380 675685 670730 824420 478259 428515
16338 428515 518953 366673 795895 581458 601482 719885 809419 508871 734962 639151
16328 639151 566320 676546 438433 381534 817579 982650 616324 789988 432187 355845
16318 355845 491840 659125 596266 443729 837764 812168 583077 538706 314186 402191
16308 402191 634831 597741 407047 622520 870070 511951 230816 435773 637153 698435
16298 698435 632276 715713 470051 545788 277555 319403 715030 614886 457973 481934
16288 481934 309750 128090 509220 541815 664472 498452 273771 551522 595328 379545
16278 379545 320186 331058 557198 459304 666283 332637 440001 534625 464712 665689
16268 665689 497442 216593 701143 580127 475779 502466 738051 588751 710912 386022
16258 386022 430808 388157 621982 421285 512905 402034 405562 498551 241887 661406 610489
16247 610489 645497 315444 818372 595415 477009 295012 18183 397914 290046 389837
16237 389837 411764 373387 421213 587062 411361 339763 154514 196556 481842 355066
16227 355066 564251 338435 353450 378472 277741 268328 451381 518349 430024 361199 404415
16216 404415 332182 308844 471674 260452 261589 495824 402126 456079 81149 308403 664059
16205 664059 18622 464393 526115 235250 358961 -96908 314802 457810 447797 686688
16195 686688 504420 403679 583191 527770 307038 222386 251101 140114 499624 471891
16185 471891 34929 404389 454281 37344 331821 112292 473223 378397 314222 320560 316668
16174 316668 290288 491045 -133855 575698 143713 444759 163189 437058 256862 412652
16164 412652 -10787 308171 8643 279067 316360 209061 291001 218712 316991 90832 411023
16153 411023 169084 395310 420945 262168 412179 137530 190079 301639 468016 102239
16142 266279 415040 184563 738168 174668 -11239 309409 278931 42121 81757 311209
16132 311209 295682 249172 307030 25810 192905 276384 109871 186991 14767 -38360 167166
16120 169794 -153347 515628 273188 -19251 140002 229310 176380 495511 294508 -78849
16109 116898 108676 279279 122220 36259 -32229 124331 102171 -81959 194738 263423 277977
16098 277977 88087 218500 -88867 254867 243416 447502 323378 181128 321360 107431
16087 489671 -14586 284266 -163991 283803 125194 -163740 391123 334751 186758 114608
16077 114608 404885 156180 358591 47677 127414 84499 -147363 78917 154246 287453
16067 287453 -112101 20455 181158 310025 388358 -104163 -139188 135988 144516 146727 47728
16055 -155913 -172688 -111880 37365 40391 -184694 148666 -146663 66359 -9838 211317 -3650
16043 196077 237668 -162411 122472 230788 338789 64059 99097 -243748 137114 333955
16033 333955 -200245 -3734 13674 121283 171797 -25391 52344 161075 -39354 -143899 -164397
16022 -164397 203750 58928 181369 -53684 424894 134404 210729 550973 -1650 193348
16011 391816 -168331 18302 270639 285725 -55651 -153011 134793 220704 355189 -122879
16000 114804 -99007 6571 -137676 191772 -215016 -52919 -103320 207247 240760 19628 -205079
15988 -41693 299695 447134 97112 438128 108442 401804 498412 113344 469287 276294
15978 276294 278549 -3848 -57581 -55967 43283 231580 276727 -97739 203293 43558 69075 60731
15966 60731 11771 42502 -24518 248304 310116 -26626 142838 506517 146672 -68979 203144
15954 -34170 399286 -9608 77366 -109168 -5549 81782 -323291 -111038 -172512 -48667 62713
15942 57331 37466 141670 27238 171556 -86989 82605 167601 -256494 13426 78405 -207775
15930 100114 190107 130861 -52926 59664 -276405 -112147 147011 203569 14372 -119946 155480
15918 -200196 169423 77150 -31292 -77751 182650 -104578 77315 170145 81636 54938 36323
15907 36323 -19981 168997 408754 -168038 12656 249322 -11515 201292 -49618 150821
15896 6819 110659 -131682 9389 -5462 313563 -222560 34162 186321 45953 397802 -34442
15884 95190 -178614 -142109 348929 -278039 173163 107321 -16554 122348 -49147 78620 181340
15873 181340 -125344 -32982 22153 220811 111947 -103214 -162314 -118141 83805 -360902
15862 59504 -227516 -186423 -181766 60327 -32407 114531 -149335 -45721 236784 38030 -315102
15850 -142862 177702 165200 123923 -241169 -120595 120062 -120323 -105163 413936 2361
15839 195013 70084 -81869 -158605 202208 57635 38709 118160 -101844 205834 -390446 -1648
15827 300050 156284 46027 -129104 -162767 -30718 -245966 23630 -153159 215044 10075
15816 8502 -158501 -171309 86841 -52979 314086 136771 276821 214165 -166791 15341 -144702
15804 30168 256841 -113413 -27584 185251 -49980 128432 -143015 80919 156873 -110139
15793 126764 264727 -25732 91103 -192424 18238 90700 19001 -27860 -29076 -193068 10401
15781 37633 -118145 105638 134767 -118163 143667 77168 5378 -144450 123947 -323523
15770 9324 6076 -384729 -248287 39301 18861 -74714 320669 -113434 129221 -152122 8556
15758 149489 33458 216792 -150614 -174911 301148 99579 159414 -15128 -72059 -235103 -105918
15746 306826 88504 125619 304511 -157067 -104362 -33775 53114 -87945 -10909 -129187 34177
15734 54725 330224 204252 279384 40392 -241007 -197431 -236332 123565 152119 189302 -205876
15722 -68518 -171397 272158 -173736 -18420 243967 -250256 -84790 -207260 -102456 -396989
15712 -396989 -77318 -1569 -140570 -226117 -275859 -199379 107441 -113273 183099 174653 -104447
15700 74918 -372608 60024 -229153 -245463 58565 2167 -92378 -238264 243900 109996 240130
15689 240130 -10736 143296 124933 -57382 -229672 196950 94530 787 -23911 -103406 29231
15677 -197672 46312 -283427 -8790 80510 -55391 171562 179019 135939 -105049 22779 55726
15666 55726 272864 -167745 -13569 -47907 390348 118453 373560 109545 -128441 -213888
15656 -213888 63094 -119839 -53933 -55601 -65465 -93678 242727 32228 295373 172799 -94985
15644 127028 -142187 29526 -112178 -133684 97268 -29799 173287 -27861 350869 166467
15633 217499 -90465 -67879 -169057 -90702 16609 -44749 -218474 -158977 -5617 235212 298667
15622 298667 -58950 58082 231381 -89899 -99393 78438 -65760 -17077 -102813 177185 -120138
15610 -57802 48449 -194185 -128373 -23099 -90812 132805 5258 288482 138871 180104 273908
15599 273908 49860 57117 92447 317353 -165361 19505 -128322 170949 291350 354203 343822
15588 343822 179541 35657 111349 292017 -136597 133998 425321 -118002 -11253 50158
15577 128874 -63088 -333245 392084 240230 66659 -13459 -29344 83400 -6708 -98624 21550
15565 -403715 316501 -168637 -56061 286145 -184632 99317 -128791 186872 2011 321640
15555 321640 356815 97920 -1645 80520 149124 16966 36181 83833 107123 -27911 299393
15543 147083 65532 106568 32730 -40277 -137431 -93033 -51814 158824 169096 -39564 -52292
15532 -52292 -276797 254518 24638 107420 -122819 109035 -155165 191240 -197844 69751
15521 406732 -76867 303050 83961 -102361 126398 254143 -129496 13235 422118 66449
15510 -128105 -194011 1502 105064 79434 376766 -36582 29431 -30621 101785 -326166 -178670
15499 -178670 88029 -117389 -199057 171510 -43843 271043 -128695 329005 333244 257274 149567
15488 149567 -118268 128396 -25892 52819 156685 -45266 -37664 129108 37443 143487 48084
15476 -256013 35051 -173069 134623 23003 -132851 53274 400873 -51331 -46414 173360 -249559
15464 -27711 -19368 46020 41620 -162139 -76488 425255 74161 -133672 -73452 -5637 157153
15452 282798 223370 272612 -198478 23652 119824 210589 -3666 -352008 209884 304964 84640
15440 366394 225081 159622 29770 164449 193987 144491 189026 96105 -87087 270983 61429
15428 131279 210274 -54514 115334 -183781 -234310 137669 -276322 141690 286217 -83068
15417 15591 176081 28484 183665 -53534 122415 -141021 451512 61766 -116796 -73056
15407 -73056 327261 -50673 -20239 297949 -111688 144302 249645 42307 -140715 -282462
15397 -282462 131541 -71599 181215 114074 -71401 23909 50864 -449461 267163 60830 83381
15386 83381 185461 332694 -110435 -3374 101956 -19587 531762 398056 64080 -40862 134781
15374 407203 24962 -175596 124639 2644 -15685 109773 354061 5120 -26172 47907 -12676
15362 121155 -234187 160105 138080 -26535 -10682 313119 311919 152096 280124 232862 -68228
15350 171046 114303 -14318 130127 170133 456743 -178630 -75024 233866 38270 336828
15340 336828 201980 99437 -259303 185479 -11390 153084 -160332 154631 300297 171178
15330 171178 42679 58745 -103813 237017 -60812 13880 356440 72954 -226652 209174
15319 -10766 -137329 49858 -129083 -145690 455026 395599 -14134 255259 -152353 441722
15308 -76490 -103245 137348 -104921 190499 297608 60588 351414 166164 403076 -99526
15297 76117 -164712 28633 -213574 -40755 -70768 534176 106068 -12217 403329 96264 81172
15286 81172 27908 34800 154882 366556 -7496 144268 215730 -240400 -36039 84282 180142
15275 180142 218227 16644 231644 115593 172429 217767 -141914 88745 140241 49389 261813
15264 261813 181337 440184 147866 284749 59282 -145359 -148977 -127108 205834 320251
15254 320251 250956 315297 653568 796857 780976 527840 328852 525115 295619 140042
15243 359338 -22549 301450 255279 455581 -81515 397589 103952 1003 53821 -108531 206990
15231 102308 202583 75824 89050 105496 59755 125592 -202906 254653 361728 6594 460643
15220 460643 377849 300649 156814 226052 449591 141833 -59120 3668 120074 235663 82947
15208 223168 98792 -175461 -11183 176635 392137 -68101 471424 31454 186875 -1223 208971
15196 196450 219002 249619 46142 224697 250392 1774 365208 -87325 103027 124012 -53228
15184 213764 -101125 369733 -35588 31539 -81096 13903 181571 37354 98581 -20747 440140
15172 485796 31023 141342 415139 107491 175170 417545 194291 247936 230216 87577
15161 101734 406098 312604 174992 146409 50330 497502 340510 -17441 251848 35715
15150 265927 343750 418817 189433 418390 55117 97537 226280 594262 488999 398890
15140 398890 340487 222138 131040 285847 156881 235711 374765 17422 244025 417088
15130 417088 195795 264881 282340 230902 393719 255269 337411 314674 219888 66807 214043
15119 214043 325351 124993 79681 145216 281992 -33425 197399 421332 241704 253848
15109 253848 168203 332601 63615 214901 155739 161478 401036 97881 91124 528627 162525
15097 186477 319159 370291 142465 67533 104450 110749 124343 158121 388642 21216 215375
15086 215375 424644 59198 95963 216624 426304 277833 310681 306578 333248 214822 131966
15075 131966 191863 151583 -58776 307714 173252 346925 200268 549386 305024 270239
15065 270239 447246 360207 433724 178130 380747 359986 282534 52149 238072 387639
15055 387639 306852 212567 361628 246610 122387 396441 327558 125822 348796 359931
15045 359931 253357 520042 286840 443684 229968 269626 -53507 367137 334722 315921
15035 315921 126779 176042 508135 29912 65656 292295 365520 526778 590964 456286
15025 456286 304960 177358 -159624 299561 137372 563285 670740 243236 386728 234461
15015 234461 441911 389332 56861 441520 258080 488970 205855 518476 456434 401443
15005 401443 230248 296512 521881 135661 262912 304057 421782 241380 227386 92048
14994 571039 191548 314416 583514 550245 332153 386893 375358 253769 555768 170372
14983 407841 563807 484409 233406 452456 40556 511629 142878 402181 584351 599259
14973 599259 693913 442700 341881 242197 678568 447503 329527 663787 543061 271311
14962 717165 425971 651796 266225 378519 507291 299809 536417 386127 585159 479877
14952 479877 387977 389234 287612 514774 269086 376202 311092 418252 307026 374185
14942 374185 267701 597304 628246 733123 505104 161206 566847 695839 501418 753548
14932 753548 234463 375963 447624 413201 320250 663220 577061 737433 681229 373698
14922 373698 411234 619703 650698 848007 490979 374385 92156 558363 486666 586860
14912 586860 914559 741371 546562 734937 882001 779423 464339 210408 750271 536365
14902 536365 558018 385731 455265 483256 240548 581419 232816 778038 446206 515989
14892 515989 379632 439694 552338 857877 364687 830435 687976 472692 681991 628375
14882 628375 561056 625480 463126 363741 227926 298408 289352 602098 461788 236183 558654
14871 558654 264901 550628 564010 715723 733617 519260 648788 416386 592297 587679
14861 587679 556333 489875 721577 621393 622942 751809 559230 587695 530601 633455 608203
14850 608203 775493 250314 353929 442089 701246 990599 978962 1073200 382885 1047950
14840 1047950 780995 653286 664892 490854 1001939 518647 619031 753350 791160 612171
14830 612171 791194 688497 547652 737123 638846 414357 409409 776204 467790 614461
14820 614461 905406 737986 430565 1039008 824573 757514 636118 722647 513114 665254
14810 665254 874569 717280 665946 689348 594614 542866 554031 912926 947208 929497 1211155
14799 1211155 1073458 895039 717521 279577 808113 897185 697932 748384 762202 1043060
14789 1043060 717860 911985 770952 524502 898596 704837 764352 820256 460411 1056461
14779 1056461 604466 1156174 498103 716783 874411 855624 800788 642633 677425 802244
14769 802244 870973 719006 779032 874611 769328 673406 821707 714902 820879 1100343
14759 1100343 1181762 928248 968149 1008780 822558 1102376 1115053 910874 998882 1208211
14749 1208211 990391 1067911 847426 865387 1249040 884116 816544 991346 975800 1241222
14739 1241222 1044044 1026979 1136506 924774 924037 963620 914380 1018697 1103738 1006565 1333909
14728 1333909 953863 1488915 866348 1447202 1014011 1174974 970965 1167104 1043132
14719 1043132 1340060 1231459 1245158 1015111 1106625 1254868 1338266 1318881 1153834 1044508
14709 1044508 1054701 1171417 1066341 1470065 1153641 1026530 1140526 1092356 1164195 1040492
14699 1040492 954859 1193400 1120711 1356219 1171264 1148912 1334957 1266706 1444453 1362464
14689 1362464 1029236 1094729 1082702 1077140 1389153 1517030 1470633 1270482 1343370 1151330
14679 1151330 1324981 1288429 1319162 1231453 1424104 1186076 1195966 1415204 1016046 1196886
14669 1196886 1393112 1711905 1362380 1381898 1751329 1333191 1131753 1395060 1555375 1376467
14659 1376467 1488837 1356220 1602489 1290644 1428107 1585806 1533036 1501720 1728837 1417182
14649 1417182 1491382 1365246 1212659 1726172 1386405 1663235 1692406 1386811 1734549 1417717
14639 1417717 1553212 1956306 1796405 1520500 1468839 1613950 1792585 1617381 1675839 1771290
14629 1771290 1804169 2039313 1952750 1700243 1751341 1464474 1605005 1963182 1649884 1526829
14619 1526829 1812684 1836202 2117195 1724580 1920450 2092207 1751888 2179454 1872672 1607502
14609 1607502 2027296 1864602 1995953 1983906 2063763 2100461 2213382 2133903 2285286 2312854
14599 2312854 2004306 2115096 2016788 2259520 2164958 2328338 2350435 2274137 2333140 2403381
14589 2403381 2587644 2422870 2531275 2503568 2545072 2248206 2499812 2259039 2557131 2369267
14579 2369267 2476179 2661628 2443353 2372253 2742319 2624641 2526123 2582497 2802929 2712843
14569 2712843 2817870 2894454 2588658 3017356 2841365 2798292 2951478 3286316 3387630 3434008
14559 3434008 3294856 3659114 3144796 3855923 3633683 3896860 4431295 4799544 5460125
14550 5460125 6777109 9355381 13316222 19168842 24978497 23987001 15909307 9397575
14542 9397575 6233481 4727805 3754583 3893488 3520016 3240290 3148650 3151663 3382591 3211302
14532 3211302 3187084 3248687 3031873 2864811 2968247 2923338 3030719 3174138 3284519 3311872
14522 3311872 3295344 3381648 3211483 3251933 3042631 3495248 3318886 3642718 3418984 3352704
14512 3352704 3294395 3467850 3404543 3380739 3327401 3641738 3686536 3188692 3591798 3894107
14502 3894107 3714163 3659008 4055496 3659913 3910660 3640742 4109147 4026318 3862944 4060826
14492 4060826 4065721 4299538 4371384 4502215 4110306 4671157 4062953 4574978 4465075 4391778
14482 4391778 4357347 4558931 4705243 4513835 4694254 4695441 4870373 4669312 4600994 4812242
14472 4812242 5235314 4880992 5206778 4737575 5156534 5174111 5440626 5131666 5390846 5421554
14462 5421554 5272964 5396318 5463834 5615797 5799051 5573571 5741320 5802412 5495564 5943363
14452 5943363 6190953 6139222 6336275 6219031 6121883 6196347 6307841 6436664 6475126 6625143
14442 6625143 6672267 6525830 7095399 6630710 6522280 7015023 6999151 7268781 7220302 7033018
14432 7033018 7453445 7717334 7566640 7419134 7719952 7755759 7915774 8048298 8002735 8206166
14422 8206166 8042091 8490155 8255727 8803777 8465957 8852500 8983384 8909455 9181522 9398414
14412 9398414 9179837 9551645 9663219 9887947 9769051 9944730 10099014 10214037 10793519
14403 10793519 10154191 10948559 10777381 10763595 11286782 11176391 11697729 11678569 11496490 11834227
14393 11834227 11715931 12180150 12376263 12477857 12801291 12791600 12777801 13519366 13385477 13982812
14383 13982812 13835474 14249885 14290446 14823119 14908251 14881483 15581313 15724216 15647244 16137823
14373 16137823 16323404 16807597 16931558 17443106 17760309 17964679 18188682 18229268 18646782
14364 18646782 18854741 19523756 19947523 20213861 20617526 21304163 21877210 21882963 22292683 23211307
14354 23211307 23432278 23890961 24230340 25130807 25161428 25748879 26152179 26915880 27693138
14345 27693138 27839478 28718386 29305886 29987177 30778006 31542668 32405759 33269907 34200486
14336 34200486 34989772 35595211 36337475 37699776 38416748 39358150 40558446 42009784 43042750
14327 43042750 44174919 45276205 46946927 48536790 49769025 51419960 52962565 54439435
14319 54439435 56507908 58227489 60354747 62682594 64716231 66719230 69580998 72167691
14311 72167691 74565205 77379887 80488527 83846186 86838344 90464048 94102619 98213647
14303 98213647 102628995 107034297 111678096 116508136 122184875 127720819 134203955 140624709
14295 140624709 147449724 154741803 162556785 171112380 180069940 189409815 199425919 210578897
14287 210578897 221547495 233436540 246370184 259997412 274033580 288800038 304042182
14280 304042182 319210653 334778561 350408125 365498504 380250659 393917058 405472242
14273 405472242 412673605 416476464 417904215 417228681 414162501 412912033 409876702 403548413
14265 403548413 393025223 380747556 367796736 354495839 340645802 326775434 313151924
14258 313151924 299750210 286210544 273443846 260503914 247691233 235214713 223509519
14251 223509519 211656561 200992415 190342948 180390740 170819336 161752406 153414340
14244 153414340 145414678 137556529 130339399 123512480 117444155 111642397 106770471 101713883
14236 101713883 96970688 92440794 88353850 84460827 81077749 77710912 74446057 71343082
14228 71343082 68665164 65684977 63236920 60947963 58521216 56113928 54328029 52713616
14220 52713616 50768782 48983177 47195128 45577580 44164728 42943123 41896540 40286396
14212 40286396 39091774 37710193 36353474 35907952 34781308 34210312 32868458 31803481
14204 31803481 30670389 30006532 29344270 28468877 27692748 27040535 26032102 25488243 24957501
14195 24957501 24044014 23622334 23126636 22556591 21860653 21425716 20486588 20200570 19716087
14186 19716087 19416301 18956045 18516669 18077700 17673091 17189542 17009634 16427083 15967280
14177 15967280 15942928 15194026 15234188 15003193 14532395 14228691 14388438 13804701 13316804 13242718
14167 13242718 13111632 12863553 12263604 12465375 12143700 12043420 11424292 11637134 11110423
14158 11110423 10766630 10663723 10423209 10389541 10012987 9700468 9720703 9787295 9431310 9094433
14148 9094433 9376700 9334449 8818411 8491447 8779899 8543201 8375584 8175872 8114225 7766396
14138 7766396 7750193 7711375 7634357 7742290 7411464 7598899 7152632 6970940 6965119 7061595
14128 7061595 6957996 6668896 6561369 6445010 6151992 6268764 6122762 6111716 6276683 6221060
14118 6221060 5897974 5591834 6065468 5794820 5771178 5502934 5506673 5475217 5401462 5366769
14108 5366769 5135486 5140651 5034425 5260518 5173712 4838999 4669503 4853691 4799871 4541327
14098 4541327 4762882 4444521 4584598 4676261 4431228 4096972 4333518 4147656 4138991 4096710
14088 4096710 4217917 4171603 3994429 4042693 3728917 3612061 3917933 3829330 3475967 3817666
14078 3817666 3803962 3900032 3481082 3447290 3353211 3752432 3564351 3453673 3595953 3255081
14068 3255081 3410525 3302981 3287544 3327366 3438141 3121878 3379569 3220811 3350089 3135664
14058 3135664 3019941 3250038 2966251 2738440 2769165 2854950 2999787 2918932 2962494 2655762
14048 2655762 2717424 2351005 2580202 2666193 2446765 2458492 2872048 2488408 2509708 2529735
14038 2529735 2423102 2750704 2326513 2513899 2371694 2418614 2148236 2294522 2462387 2523857
14028 2523857 2372244 2274356 2199089 2344195 2271829 2274754 2613564 1956318 2263014 1988543
14018 1988543 2208473 2634435 2106214 2186358 1847701 2067868 1757172 2059419 2068681 1856325
14008 1856325 1999784 2003075 1819988 1593441 1795115 1730468 2012273 1702149 1877250 1622627
13998 1622627 2041365 1674078 1985401 1871554 1821446 1822261 2000004 2628983 2952916 4721116
13988 4721116 7870440 13673548 22153705 23957833 18313245 11592703 7877418 5684485
13980 5684485 4854850 3609491 3641870 3283128 2756067 2462810 2815057 2530204 2437111 2402479
13970 2402479 2184955 2220921 1672830 1888768 1722237 1745350 1819670 1747185 1676279 1755487
13960 1755487 1855584 1590189 1582292 1639732 1684224 1780245 1545592 1617397 1805122 1462479
13950 1462479 1476525 1186885 1333668 1298582 1319085 1329155 1007343 1416522 1285896 1221844
13940 1221844 1536675 1503513 1351491 1101413 1086656 1296753 1477592 1504888 1448757 1266098
13930 1266098 1470408 1463652 1206363 1223083 1303846 1287588 982139 1207054 1208931 1015446 1317052
13919 1317052 1331770 1094091 831024 1383500 1262414 1068222 1122082 902812 1088085 1058610
13909 1058610 1228548 971223 806093 1207005 943989 990789 892605 953191 1192641 885447
13899 885447 732846 996966 1191807 978680 1240875 1227475 971067 974955 1252924 1125379
13889 1125379 1059710 878386 972388 861672 749854 857484 996609 1074769 1189434 913988
13879 913988 707626 809284 952753 869554 907792 855344 1330777 649415 923558 1004757
13869 1004757 714614 1089267 1184795 936599 1430059 901352 964020 753395 790358 686688
13859 686688 655358 1005368 776491 846201 743643 812281 622021 453919 985954 680743
13849 680743 962605 800547 634508 949971 524646 937118 809531 719998 445227 814663
13839 814663 1038278 549162 887300 812508 749628 736638 541999 907943 623429 810586
13829 810586 830852 737778 884994 578690 550067 733640 626818 651643 641878 1001756 786031
13818 786031 548712 819394 585947 716547 773367 698382 944608 712223 407355 637228
13808 637228 612229 739258 743145 309763 766431 631918 593978 397501 582490 517464
13798 517464 578243 408201 662683 632607 163459 758021 230205 708790 615478 656472
13788 656472 644360 850399 364645 576259 548766 241236 916006 772261 357400 622402
13778 622402 493523 824584 541387 858699 636277 361894 660020 702955 313472 671777
13768 671777 846049 388845 267948 492829 657120 610427 603549 429778 736702 348483
13757 743799 667578 471008 560528 328787 394734 428705 456745 122559 471455 532236 462093
13746 462093 363631 431468 95841 369338 392904 773203 269607 432848 647809 532994
13736 532994 620317 646935 265130 698879 348334 419286 454547 375186 346130 366887 570756
13725 570756 10270 381290 86943 367556 581160 687580 256714 350831 146858 550891
13715 550891 398669 456894 99249 264430 736274 374307 589352 527874 390013 260485
13705 260485 627266 323455 310489 305086 376034 301049 747139 850904 666942 348672
13695 348672 351842 574120 402096 130748 439932 344850 359315 515925 141545 259072
13685 259072 320556 468941 279714 307234 103848 259755 260773 414307 -31224 338436
13674 586884 375639 534915 128021 209146 525928 298027 221532 295221 392795 300264
13664 300264 501513 398576 345524 251049 350184 187437 302574 345647 333062 458427
13654 458427 367317 -31723 291911 342273 209034 361667 90901 389460 179331 330611
13644 330611 314015 243692 222800 540068 426255 166958 335408 194580 472610 437454
13634 437454 414603 580151 478944 232759 366475 26684 192758 418478 136783 181939
13624 181939 153637 494451 98869 307492 207896 236701 184600 191173 356693 390088 277918
13613 277918 296126 152624 430985 464576 70019 333595 12083 367540 310084 308571 245280
13602 245280 291276 332370 287399 444048 -110076 295300 168689 165300 219272 441635 310363
13591 310363 186907 137663 302784 430783 553981 141708 373240 220495 341022 590645
13581 590645 -19273 328650 480689 82077 17245 192832 204348 132546 186987 308601 186078
13570 186078 50087 194807 212255 13366 129827 135712 318245 286589 419027 153319 190979
13559 190979 142561 135322 222237 144937 313231 337643 -45697 392645 322216 -4859 197861
13547 148944 186537 159570 506420 242777 86259 252108 113121 223332 -229396 -1733
13536 -7918 275738 456730 177279 184405 -327443 -231898 96397 472904 379714 69121 297817
13525 297817 289377 4869 36011 169260 231862 57877 333718 321068 99252 -128968 357577
13513 445003 99430 -14841 207670 139933 123709 145744 11341 141421 231875 209800 371833
13502 371833 345608 378340 105667 254548 288111 291827 443962 106524 422172 199075
13491 52756 211087 364824 209289 292170 287304 99624 -31435 48703 406029 186537 243021
13480 243021 109860 374215 226198 308842 226705 234251 197079 493450 348923 388701 -170449
13468 289746 361313 353284 292082 390099 218690 262029 28742 109899 306196 346446 186902
13457 186902 175363 -18403 123722 213043 155677 142946 -141568 71931 195455 -112788 -91017
13446 -91017 148387 218290 80319 74137 27714 -161365 214914 199055 248145 245067 309433
13435 309433 385838 252455 333635 -220001 -128713 203345 31199 256780 247291 447808 35065
13423 96508 -284562 188246 173137 107544 33615 -19935 351384 345967 -108793 275102 37614
13411 20673 -132516 115220 272131 59555 182670 -73990 39981 46269 -142683 293938 361585
13400 361585 237578 288689 102704 -144481 -5962 23201 220684 -75028 -268322 112096
13389 -47891 -141731 258816 186707 -146711 118863 1590 -48944 135694 166301 -46507 273940
13377 298228 159425 340360 192101 108690 280131 53284 152536 253647 101604 92129
13367 92129 -7703 -70004 139048 379180 296779 75010 -124046 159583 19352 48947 352839
13356 352839 53435 97252 202905 66323 422882 82288 190854 192130 330521 164587 582914
13345 582914 66971 51878 137455 296313 36468 446265 293095 155546 87538 233660
13335 233660 4697 218679 37372 191642 -143073 102854 123522 -46828 -167456 50128 252127
13324 252127 130928 57698 170001 -356198 202584 91865 260168 267830 261440 -197327 62526
13312 4781 6037 199912 159723 -29800 -38705 -175755 236774 414674 -117524 -93669 130448
13300 -53252 -78359 118972 219922 206893 24594 18370 137591 22496 226767 119174 132374
13289 132374 63931 216603 336080 20141 303967 52589 233697 151133 -46227 300401
13278 27212 -175736 -53291 -115407 389040 202701 174823 94949 417055 22330 69147 113856
13267 113856 -36137 328020 -133594 -48882 31075 2566 46392 271 91663 -161994 132776
13255 265611 27220 236995 235793 -6738 137290 321844 -105851 -126282 -10096 200750 137777
13244 137777 226029 -45030 -176621 109315 -54060 -56316 193807 31615 -16556 -145160 84414
13232 282287 243609 53014 -141404 -157940 132655 22942 -56920 420696 253197 348573 -127197
13220 408835 -112643 126783 -158501 169709 -45613 151503 -29580 63040 553152 291663
13210 291663 154666 303718 -61708 -1681 103805 96186 206816 232188 45977 319088 206605
13199 206605 66458 307911 195043 80205 -76197 -31514 69001 -301963 107371 27698 -124209
13187 118934 19760 -204399 -200820 107004 -277652 115185 -15401 133567 459365 106114
13176 -205483 -196132 -143067 -37608 -22098 -94334 94793 149988 101626 28844 287341 114314
13164 -62720 -3187 -71517 -59870 76588 30815 226776 -16825 209917 -30290 274249 -22439
13152 -53835 20760 -2504 -65616 201061 -82770 -37046 -142454 79969 -67487 -91074 191121
13140 287823 13353 314466 127953 93007 198569 134813 -140745 -99083 -47058 -63452 -139120
13129 -139120 -12565 61908 118095 -155839 175403 -18238 229863 -43578 205269 -67890 340037
13117 8407 -38668 115950 103769 -55495 80667 -78208 154653 120615 -9446 -28249 9770 15210
13105 15210 -178636 -18990 -298868 278864 235487 210770 -94995 -159824 23392 74999 194980
13094 194980 -37961 136852 221376 63089 37171 25168 -95187 -6728 122611 280728 98576
13082 218315 115251 -173718 198980 -92244 15705 -1398 215994 73769 95863 146557 152181
13071 152181 386176 -41118 44085 -58143 18109 -49474 196955 -15398 230782 -98312 120817
13059 26383 78320 -125690 206403 -14596 114826 195170 125832 -86892 269359 203676 5775
13047 85085 -100670 88056 216370 287455 202516 51368 -119984 -79595 163931 -124734 -120032
13036 -120032 -6759 -166469 96441 373499 -49953 403639 322376 -17722 19264 8101 129448
13025 129448 -122073 -161581 -187819 -60764 -126366 54799 156051 -31131 -212136 46261 -183860
13013 79009 413298 40920 -99308 115467 282637 121286 85888 92690 -9728 75376 -76145
13001 -162069 -315643 102055 67840 74771 -211057 -319032 145436 170829 214024 128310 -258059
12989 181216 -181548 213290 19766 142550 -141408 8416 2144 320393 344469 -86880 -50816
12978 -50816 358507 93299 -110481 106561 -52754 -381753 15074 146768 -230724 -377482
12968 -377482 660307 130345 143514 322520 111249 304235 74659 215099 -151270 -114825
12958 -114825 -41939 -20598 -9043 -87969 40156 152727 202048 -80265 -53265 11564 -109024
12946 -244069 116356 -36285 -139707 145117 -12620 91983 -57349 121981 180341 57204 -33409
12934 87777 129817 -42769 -127737 265926 -132114 -276585 -41020 -125378 -124665 113687 -112390
12922 -149619 117836 -54359 82492 -277471 21354 -476468 174420 82383 192183 -85719
12911 -129634 -75876 -355371 231118 238297 36581 -327407 -82200 66669 108622 228153 220037
12900 220037 -94748 143284 235125 -6125 -94758 -153739 403884 -66992 -155279 -133073 392935
12888 -337042 -40381 324745 467334 -4720 -116101 -64135 2735 -111435 -47880 205886 -215791
12876 97086 214848 -118737 -27509 317377 -115565 181889 -79657 -160619 336469 -229131
12865 -52550 452382 -128666 -217543 31773 277157 -22255 -43925 -276122 154897 94090 -12819
12853 120165 32608 -196178 165517 138463 -51981 166670 -226524 -91688 37868 136974 -39093
12841 -265013 279567 -244052 224663 11113 -325859 79293 219332 -186393 159279 -157836
12830 -38977 -104254 -368992 -309045 -160156 -34876 171819 192078 189108 85374 24191 117774
12819 117774 -297656 -67878 110233 50358 34352 -209888 -43816 -92566 -244610 122461
12808 -52521 30599 23922 210218 38199 10311 183921 57581 116462 -73200 28450 -171586
12796 306767 -23836 -26336 -241270 -236946 256608 -57219 -109966 258165 182770 7966 -95882
12784 -57101 72498 -114460 191513 311105 209312 -124137 -55060 83314 111639 -72879 13855
12772 -4086 -3311 -294761 144133 -169041 -234523 181013 -28051 -19765 130790 110435 -145604
12760 -206969 -97526 -254852 91853 109624 103901 -421519 43586 -6452 -22118 -154695 -225461
12749 -225461 257690 -342041 17928 -101668 184532 -1535 -182721 -92475 199511 -201756
12738 178418 91863 -21366 51096 68917 -221786 12188 130697 -111019 -73300 130602 -38359
12726 43508 -102690 74105 88571 358789 -71069 -69951 206074 193998 -133058 28383 70782
12715 70782 -97470 -42901 -278109 93808 141102 157784 -68522 59219 58325 114105 205258 66499
12702 246241 93765 -142073 218658 -135415 113416 210124 64141 36286 -27866 29310 194640
12691 194640 -86082 15848 -46299 215899 71702 75375 -287408 -76090 104251 23227 240244
12680 240244 348930 -176276 -11836 -2185 180474 -25767 -39548 -19877 121025 -264966 -114601
12668 -14110 -311391 -148624 -165567 -88659 -168023 -117779 99863 397399 -16253 106735 56451
12657 56451 355372 -18012 148074 268459 -97751 16120 -181569 64583 -74881 -185412 151628
12645 223492 -184141 -162492 262858 26979 -36920 -246771 -173484 55074 -56719 -43658 187181
12633 -13632 -97012 78421 29008 98863 253735 -34886 12351 133723 -4153 201687 -87610
12621 63147 43715 -205699 122081 -200420 98377 -34809 -158494 204542 67705 27704 -134534
12609 179904 -30682 14105 53977 421734 55986 172791 -19389 128118 8815 27085 50749
12598 50749 181004 75074 -124226 31349 149612 2915 151082 -127748 43486 -8434 -244092
12587 -244092 19322 11491 -266061 3134 218263 -472 75607 -265825 25219 -41078 -78080 208438
12574 253039 259 67633 147218 -290268 -107577 166761 -140759 -23258 142876 -252740 51283
12562 -83660 182783 85803 -46408 120528 -112654 -77716 -453335 -112852 -79711 -181441
12552 -181441 -352988 -112942 -40933 96787 82086 -8237 63628 -33340 -186397 -38539 -104772
12541 -104772 76493 -146001 30822 112989 -38010 -150034 261737 265012 -114808 -126493 215071
12529 -6756 302339 213376 199365 -47854 -228126 -288760 180965 32390 -33072 134602 -290773
12517 -157198 -399850 135865 104115 78354 -212046 -150937 -383350 -248999 211388 -82524
12506 -285270 -98628 65203 -20294 15282 -136969 180349 305511 43604 -195093 -11023 96572
12494 26713 -45581 -198231 -90293 174725 -279538 72358 68743 -112250 -139728 -6185 112935
12482 206713 -223314 327312 10759 113135 -322421 -251323 -188200 -177725 -178044 -101182 -92670
12471 -92670 282549 109168 124307 -286264 196567 -3607 -83935 -122886 1402 315285 -145391
12459 -49995 -236 -50196 -66120 -540099 75893 -86215 -179549 38433 -80916 68895 98188 -47063
12446 -99608 95838 -209112 64796 -205070 -93094 -167363 -140797 -441125 -306499 -172098 31850
12434 -152062 -245633 -258630 131943 20845 174175 519156 -130419 141891 -130391 377398
12423 209364 -172290 -49561 -63529 -184656 -68563 -155488 -104835 -1370 245775 199487 56637
12411 -188291 68384 -256317 60730 -43462 80282 190718 -149182 30291 243634 -362232
12400 -6241 -231228 -30643 -18718 -124666 73508 6369 -75913 -147493 -85904 196580 -126080
12388 207874 -11157 27458 11038 -109290 -128126 -125758 -73527 96843 -57997 -56636 -103490 -108820
12376 -108820 177236 42931 172290 -144371 290563 -53742 -283081 170061 -95742 -9198
12365 138372 4144 -62784 -6227 -68081 212618 419971 -130553 -347938 4129 57437 -172645
12353 75441 208067 15462 -36641 -13342 100757 -255490 426668 238853 96323 75328 -87904
12341 -117543 33286 -79927 159707 99208 -76480 183456 -93813 -251621 -16870 20681 -509059
12329 -73548 -389918 -81213 -199293 -189956 -27637 -76984 -36639 55049 -273089 66512 -85882
12317 63351 -2352 97568 -302423 -22417 -86916 -38036 -242800 52549 -220615 -90736 266251
12305 -50094 43074 -299633 -266284 428833 75119 223338 295275 286054 -214004 -129450 -248462
12294 -248462 -146313 62315 78279 183307 -39814 -247735 -40632 -116177 86659 -182368 -144397
12283 -144397 109250 -274418 -212900 -16616 79513 218329 -4409 -13931 165080 187928 -3103
12271 -68286 -213410 135101 310430 152953 11886 154034 -87654 223364 131108 -54548
12260 208362 -283668 142970 -208380 -100187 -292943 166473 -98065 -113312 35050 -209320
12249 -344617 14670 124821 126947 260539 -44855 -6370 148821 159959 93192 251046 -149188
12237 -10798 -120372 -175649 156041 68058 -83823 -88427 134965 265483 33810 196453 101561
12226 101561 114928 171456 676 -115186 286623 95085 9938 190642 159624 304897 143801
12214 247639 111698 386942 26318 168159 -26100 30700 47193 173145 -14428 360340
12203 193282 -220895 -44841 247927 475746 238506 173744 22781 31052 200342 -118105
12192 -47613 252135 199875 -186612 165122 -35683 -85366 -33330 -51285 220682 161683 86298
12181 86298 199865 138094 66159 -223882 332129 -116446 429361 13703 32028 162322
12171 162322 -40191 379302 -229111 391847 123788 156719 95744 -187202 -25136 62655
12160 58379 47509 -64438 -37522 30179 -318970 68485 341508 60123 138827 -23433 174387
12148 119532 67855 198455 45998 92513 1358 59472 -311864 -190178 263610 -73325 239140
12136 -89173 235731 -127646 174573 204734 204470 77891 95580 242210 16739 -215613 -25851
12124 -123164 -77926 10010 -232857 -79581 -321125 -9298 -155155 -578289 43257 -152745 157158
12112 -1565 406386 38590 -131561 -19576 -155083 -133219 -122278 -193715 38302 175155 -14410
12100 -188539 -189832 -75668 -134956 185227 -91948 -53798 65697 -178236 155885 92640 -191338
12088 38217 180627 -68391 49565 -165882 179280 -30774 -324576 -349149 -152138 -211239 53095
12076 -45342 -170887 -49881 249990 -38026 97894 193334 59413 323275 118700 59001 -179600
12064 175887 109692 -344797 92667 204912 199001 36559 103020 -132095 -76334 -87840 -98088
12053 -98088 -77494 119788 -108414 205768 -20433 -307048 25076 -160688 230703 -216592
12042 13309 89732 154428 309463 6086 -258565 -135323 -193256 77980 159078 -142215 200342
12030 -32319 58144 -93303 -21039 -195960 -375910 -186704 -499844 -96181 249043 24880 -43480
12018 10443 36446 181229 5494 142074 184788 -253200 -244271 212690 -271207 -36175 -168322
12007 -168322 -267307 -50762 -304876 15940 186052 178102 -137189 -104057 82788 274913 142208
11996 142208 -82255 298203 126488 78997 -236928 -330041 -270454 -54074 -225669 36088 96328
11985 96328 -147566 -77942 141701 47215 17010 207015 -39122 -103064 -66564 -144605 -302853
11974 -302853 -326046 300712 280650 -129586 -347027 -90553 -220386 -85946 114276 96538
11964 96538 213809 -241433 201332 -190866 67872 -149190 347724 69088 -103292 188126
11953 42728 -79315 -11388 -72107 -1465 50068 36382 -59411 -76529 -96534 -380181 -64644 55205
11940 -129858 -106177 -199354 -89417 -119360 -30624 -24516 -268255 91424 -126604 -7127 -134688
11929 -134688 249447 109905 7610 -130032 157325 135998 -38215 -12568 380231 -77998 297212
11917 -1391 -24392 89811 -58346 108976 -11972 -194843 -255102 59011 -11612 -141407 69722
11905 58759 -124520 -205022 -90183 -123745 -92871 -50307 -56356 -96136 -108460 -227668 -241430
11894 -241430 242026 -129297 23840 63766 264577 -209298 -145741 428789 -55276 220658
11883 -278859 -242539 -33472 100728 -87156 -303651 152336 -47562 -19149 133706 -366385
11872 62471 28500 -127023 -294173 -439744 -48373 -50363 -76832 -44967 -27385 112209 -83621
11860 -79872 71385 -43859 15919 99439 453 159397 209377 29499 -294161 113080 63652
11849 63652 -107358 34165 61212 27784 198338 79877 4848 291338 79673 -223580 -275311
11838 -275311 -59770 -38544 -131512 -66834 6226 -125069 -16984 173024 13165 -118111 -125285
11827 -125285 -174875 -52361 -62357 149123 -182601 31101 85789 63971 -7039 135287 -116335
11815 1349 -103049 -163128 -120016 65049 -200047 109817 104278 83777 133994 -326414 99751
11803 29810 332199 -33994 -278553 -256382 31611 57223 -97721 -30428 274878 -239823 92199
11791 212819 -126359 -201735 -241890 -6067 7211 -251930 -20773 -91165 -24042 -48929 100852
11779 68010 77307 -101219 -63681 -158741 -187946 38094 -37898 -87710 -423116 160496 -73497
11767 133765 129949 -177364 -261322 25032 -195648 -261889 179077 142183 -45376 139240 -438066
11755 117764 -165812 -284626 40065 22338 4833 -38447 -72806 -194722 -52774 -58251 -59946
11744 -59946 -312741 112287 86693 -194894 -181097 -149727 -17489 29465 -99017 -22127 78767
11732 -145872 -106670 -25739 174298 47010 -148333 -3695 -8033 -330320 89165 -198564 -144705
11721 -144705 -45656 -69363 -289995 -165754 235773 -110160 -108495 277934 -328036 -6281 155202
11709 34041 1248 297003 75732 -35385 -95612 228074 198686 1820 -6697 113245 26187 -35129
11696 55351 -198173 56244 348866 13394 182909 -223412 118159 264478 -5287 -84594 321227
11684 266806 -196312 404224 160241 104583 210884 73972 -59496 226917 52510 365407
11674 365407 465787 -38827 -77736 231128 -195150 126128 -31982 -91879 -55136 53245 274208
11663 274208 269564 178130 -23294 -52610 86224 -400339 -46744 17324 -94732 76328 220468
11652 220468 5484 149202 156928 349236 70562 -90104 48484 -175917 180531 37223 -365465
11640 150344 -69765 137119 43482 39656 63269 341479 -122496 140640 -397683 288715
11629 -100754 44326 -39841 -41329 -153284 156258 28425 262100 73802 174003 -113874 -7749
11617 -51408 -216803 -77177 -6066 -50274 -148209 -174587 189801 -72832 176579 244408 -6530
11605 -60606 43134 42682 -123014 -67248 28934 -329123 -299710 146394 89185 95387 -332446
11593 58308 -251381 -76715 -142290 81079 -200126 -48946 86720 330456 -95283 148399 -261427
11581 146423 26338 -100985 259786 -140938 -78298 -64765 -171372 -184851 350492 -115628
11570 48433 -81944 13737 42524 188789 209665 303549 -341692 442042 244635 -110675 116779
11558 288317 128008 106378 -51952 36553 95118 -262987 100501 -148889 288831 -255 -69867
11547 -69867 -56735 -296234 -49652 -228181 252661 21950 20135 -48454 315237 -249460 107198
11535 -96162 -16115 -163584 276044 99443 121079 284761 -73388 -117665 28037 -187505 -733
11523 -154467 -150092 6173 -54034 284951 340769 -21004 -23472 87861 249832 247372 -263276 133733
11510 97653 -13276 10391 5361 19268 213459 -17535 -80117 254348 80639 -32764 127855
11498 114169 -76099 165632 202325 -42333 75701 221189 244385 -120859 287459 27745 -143676
11486 -68057 -20514 252730 145550 -502775 29642 77688 -153844 -104938 387261 -73943 -162043
11475 -162043 -272322 -42256 134605 -16371 20081 193514 159013 60089 203781 -2934 -15062
11464 -15062 -160678 -89018 106559 -87349 188755 129601 -38898 39685 14180 -248328 -191093
11453 -191093 295028 28003 -196486 -44869 15351 -25535 99583 -38371 -17572 56023 36087
11442 36087 112482 -33108 -186650 -214672 -103412 -89731 -437744 127307 261738 160034
11432 160034 -180347 -42278 190047 119925 -149332 178963 284896 42890 124588 -2517 -242592
11421 -242592 -167669 8904 20169 -117235 -42910 -288406 -59693 -50881 60824 267707 7214
11409 -59281 140107 -130428 -172263 -321064 132510 -197795 71697 38834 -110676 -150452
11399 -150452 111234 12888 -10244 -132792 -196785 183519 -386384 -289982 -254837 -282340 13517
11387 -130888 221591 33174 -28588 -70665 131184 -206943 114562 170349 216799 -76202 -114523
11376 -114523 214002 -267666 415997 -10382 -48392 -143084 73561 -199113 -33768 -12828 124314
11364 -155483 149548 -214688 -83887 21965 25454 -202328 -128552 -196164 90418 90948 199626
11353 199626 163481 -323944 18538 -165612 -39032 -218747 -239056 -90415 -202118 10516 154244
11342 154244 -254521 87190 -39658 -76154 -268140 -120093 85856 -53969 -108716 -57514 87612
11330 -102393 -193356 39716 -235772 44562 116716 -71237 -80347 122268 109668 61191 144011
11319 144011 -193870 296702 -81193 -179709 -42724 -334535 145742 -141287 -148392 -52575 -114679
11308 -114679 -190365 -306405 -92735 -11982 102333 -326620 -190617 -197604 125846 14950 268685
11297 268685 -47282 258459 -43274 -38758 -11582 -69130 44818 29681 183945 -179504 -72259
11285 -297180 17868 -235902 37702 -89741 -47088 -116046 -88170 -70307 -366858 4937 -355285
11273 64468 137992 -32655 29228 -86526 -249013 -175847 -77869 13013 -156756 17412 47951
11262 47951 -348829 75745 7453 376556 -109007 -121842 207988 1470 -357976 106426 122777
11251 122777 -14780 -44509 -212073 -389437 -94237 -109334 33309 152999 -164217 127842
11240 -35930 81890 174261 -293217 -208008 -57386 -221498 -112885 -156959 -97477 -98314 -110199
11229 -110199 64223 -234290 -204084 -50754 -349781 -12610 108416 144623 -25456 -80995 -4482
11217 -156934 145998 86073 -146215 27596 1912 83357 65583 -9431 114471 -75913 -44988
11206 -44988 -176160 -86018 -32261 -149441 -134723 38596 220156 14851 -208506 179407 -108011
11194 -241696 285307 -93209 -3336 -59480 148993 -101551 -74405 -133209 -267666 -66879 -195551
11183 -195551 -85525 27719 58501 -252632 -105097 -7625 -79110 141458 -240038 215302 -128568
11171 144895 -21971 118726 -229044 -214124 -233548 -100812 -32537 144253 102928 32191 -359257
11159 47024 -272701 -47414 -113561 -332086 -114104 -126382 -282841 79971 56609 114773 -167869
11147 -139046 109890 -39111 -219993 -5627 -35114 36922 275968 -193368 56383 -75724 -70343
11136 -70343 17361 -97479 36791 80369 -86180 17340 35512 -40693 -28953 102894 -213270
11124 42620 184725 17003 -49463 84050 59926 -32397 120359 -104650 -115913 72291 244497
11113 244497 255608 195639 14564 61847 329370 193935 182848 -9265 107843 13936 12374
11102 12374 53198 96461 204728 78741 11757 251238 195168 39692 -26787 394490 13787
11090 -79879 8927 697041 96724 -104512 242108 166085 -10124 200665 103711 100463 -72613
11078 47610 -68936 -314686 153798 38120 -78686 26031 293436 174546 305385 56152 129248
11067 129248 248111 191615 273947 150573 234396 398688 106472 43681 230684 96686
11056 412074 -3833 438116 343043 272526 352928 259062 373937 386437 247101 598157 530506
11045 530506 610075 306231 391648 521692 524991 393565 408391 316053 614904 436249 362648
11034 362648 406168 171372 747843 315237 194501 499266 297696 453104 491266 222679
11023 531003 201979 345479 276145 445163 337447 344898 347359 371122 128410 323357 616339
11012 616339 260720 361667 463381 340970 410541 297934 152100 488692 400943 120371
11001 233381 384693 338855 505190 617421 620993 517229 635807 294444 414663 446219
10991 446219 785107 611489 544463 698280 430216 805231 307214 488416 630282 455316
10981 455316 652895 654972 932060 690086 955185 869590 1502744 1479761 1397242 1700487
10971 1700487 1651083 1381840 1620577 1480495 1350552 1202003 1279231 1129924 888287 1043271
10961 1043271 1330034 1112674 1099254 1016914 1173424 956192 1275966 1232698 1276308 1138706
10951 1138706 1020379 444544 425165 423877 72634 666744 87584 -57385 276172 448667
10941 448667 433405 -122953 92760 419083 17789 133675 -290414 -282094 302674 2250 -92130
10929 336429 29729 -18795 390844 -149300 -143715 -122437 73627 -190761 -61946 62914 164062
10918 164062 -440131 -339562 129720 150916 -163664 -151302 10259 -47843 195737 -336135
10907 -126080 -31044 139790 15464 -152698 -82919 -216469 16408 -94306 88577 16175 -219375
10895 177703 -211150 169342 174976 91831 158237 235558 -3162 -69724 -262160 11721 -36861
10883 -223300 13056 81582 31520 32500 -37493 -258267 111630 -134449 -201953 -78983 -264875
10872 -264875 41716 -84080 -94411 -16062 -70382 77356 68345 -49845 -166986 137319 197786
10861 197786 -180143 -133629 -101092 3671 177428 69834 98816 55953 -86775 252563 25658
10849 212118 285307 -464673 -237208 57443 6540 -20955 103799 -247094 -242739 52983 27178
10838 27178 -469592 65187 91095 87575 -207471 73076 -122815 179114 -13899 107401 122948
10827 122948 56795 -70286 54644 -70840 -21988 -112735 -142551 -210354 -284182 124573 88309
10816 88309 -30598 -373858 -180699 28765 -218811 136487 15961 -83258 -124937 94631 -265783
10804 241829 -165553 -228792 -26601 -31065 -141083 581207 -93448 72570 -66642 251436 -26331
10792 -134782 19040 116439 -113267 186868 169399 -222946 -219493 -91036 98284 -261860 164153
10780 230319 -87438 -34134 258098 -116642 -74894 233074 -444819 57978 -298659 -89701
10769 -114608 106358 -318113 186603 -93895 -46559 -81176 -133995 -337041 25798 -307036
10758 42210 -233536 205733 242109 -80053 -31430 95401 297581 -266606 89353 40614 -129706
10746 -184527 -132034 -64323 -299310 -188081 -256244 -253465 -38744 -122945 -264493 194053 126587
10735 126587 -45273 -169268 163678 -282938 -48125 -318173 46672 -445370 -79301 128019
10724 -29263 14966 68640 -264024 123493 -152562 54020 150836 -1768 -72395 82478 -208745
10712 70997 -326854 196428 -125791 -230780 701 142681 -65820 -100962 -195299 -79576 288477
10700 -252760 -57348 -383235 -98889 -69538 215462 -65263 -206699 -130038 73720 19618 -53387
10688 -245147 -43358 44936 125372 21154 -90326 144958 88433 154416 -300168 225489 205423
10677 205423 75053 130698 102140 101318 52158 -8052 -43261 7211 -124228 -84150 -4419 -159429
10665 -159429 -151538 43652 -138292 46035 106727 5627 -340013 -48516 118448 -60343 -49234
10654 -49234 -159681 -169983 -76008 -105062 -332864 -99821 43130 40110 61445 -69432 -272846
10643 -272846 144922 -367804 61063 -293068 117612 101162 51962 -176504 -132297 -185162
10633 -185162 -208900 -203830 -33525 13336 -130438 -161370 35541 -280525 -104507 -216737 -182570
10622 -182570 -315198 -220570 -392800 -228988 70597 56169 258238 -158888 -32340 -118062
10612 -118062 -161447 23298 -320785 -71737 -110775 63064 157553 -35397 -268780 -145421 -194255
10601 -194255 185913 121671 -15892 -98366 -409431 -9067 -168944 -107669 -60247 -88421 189720
10589 235740 127251 -329021 -223588 -37012 78715 -8037 155699 17209 38565 -120716 -193881
10578 -193881 -127950 -16071 23518 174112 -3164 -129810 -19285 165969 -88258 42593 -578
10566 73148 -57408 -38394 66171 -266390 149365 -105019 -142716 69290 -12582 -113479 -237975
10555 -237975 -179077 -97307 267655 -308068 -266144 -99951 -178169 95617 -57785 19580 -191677
10543 10661 76864 -38802 -179586 -228106 59122 8205 -220064 135088 29940 -279829 12399
10531 -97368 -45747 -182694 -6296 -271378 -72343 -70322 304015 -211573 -50190 37362 -322870
10519 -138327 297011 -192358 336802 -305375 42849 151712 -128531 194733 -186617 -24947
10508 -147899 -188405 15405 -62810 192122 112953 -31742 -66351 -271194 -296721 -141881 149081
10496 -531498 12706 -161385 -212731 200896 102082 -19829 -146245 -46292 -106089 -69968 234247
10484 -89489 102432 248503 423156 108533 288975 31409 19526 -70035 355286 207683
10474 207683 145678 -295432 -217247 103261 72906 200010 110804 293622 98633 309052
10464 309052 -134742 315659 6603 31271 -58602 92104 -71658 -341865 -34516 -180849 97684
10452 -79585 -249356 504191 -44830 193913 24744 -218835 -179169 117215 -134956 -145357
10442 -145357 -96568 -199641 96571 -27746 -986 -83672 -240230 35505 16283 -1486 -150533
10431 -150533 -124489 -308491 120448 215420 40040 195 -250074 62683 225786 44024 48609
10420 48609 -236037 -6492 -23107 -40525 173270 -151790 -227318 -45383 -1893 -34504 1852 3471
10408 3471 -102382 -235274 364827 3809 64516 -378665 -4338 -165293 -81023 -272474 -148076
10397 -148076 8664 -164204 7914 46456 -28055 -42810 -278055 216393 -150559 -58079 -59237
10386 -59237 -63095 205969 -39568 -134752 51687 259033 94339 -63368 218434 -5262 207865
10374 303844 68025 27803 9268 108953 -69687 185237 73124 182957 227089 292935 259219
10363 259219 -101257 305828 304250 288885 -205282 156485 -45815 77270 16777 365808 -117993
10351 133957 307008 396356 -51865 159390 35420 -17136 265666 301437 239540 147210 100684
10340 100684 -79005 -18 -165696 176575 133477 102619 278865 -146240 7927 168183 -181053
10328 -152120 186570 82316 -63877 145297 47153 66531 -72621 208883 260186 197024 249197
10317 249197 -147536 -108822 97056 -46557 -219157 2503 -162536 -402808 15164 77240 -127788
10305 -243157 -77125 -75530 -56838 76762 167578 11323 -117567 -16142 154474 269336 -136528
10293 -18610 -126688 39534 27311 -72109 -54026 173955 30170 -214500 -12524 -254717 -352573
10282 -352573 85762 -18232 -121243 137115 -194339 -218250 -99371 -135378 -184538 -78508 -112407
10271 -112407 9338 -31360 -316802 31308 -9267 -176542 -190986 34667 274680 -28568 81531
10259 288966 287328 234121 132720 207512 -158691 1685 95594 102591 115152 -191914 126562
10247 -252848 -91162 212111 -61902 112302 -326723 -59772 47491 -268748 -47265 -39026 131540
10235 248611 -182578 -161202 -4632 -14961 -175697 -64568 -115023 -143797 -84069 -261956 167400
10223 -392268 66324 -93307 26129 20186 58319 -194231 -59077 32053 68545 -8240 65064 64805
10211 64805 -116089 177080 30923 161965 28626 -68459 763 -53935 -3628 -61814 229467
10199 -346203 241751 -124867 78819 -106986 -151001 42625 -32002 -247582 -69766 15047 -27177
10187 -241793 58847 37386 31783 -67614 -136142 -123313 36744 52090 -94172 144287 164468
10176 164468 -464207 -245047 -23661 147733 221279 186419 -171427 -68947 -127952 -210848 -521480
10165 -521480 -289123 -181686 -71502 -224868 6070 -89815 -319410 -149266 -70892 166328
10154 91965 -29014 -17802 -630201 -242106 64675 54645 -58782 -272718 -28950 62360 112799
10143 112799 -34108 -180556 8503 -203067 230907 -18446 152464 24169 21690 -46571 -189967
10132 -189967 -169080 -123111 199170 -219799 -298933 -92204 48325 -56887 94549 46166 12332
10120 8986 -40188 -205629 87978 12528 54108 -158336 -238715 166612 5807 -84430 64680
10108 -362313 -109728 -145214 -135616 92333 -162025 -85668 -141465 30995 -98427 180792 264795
10097 264795 65016 -228605 208093 -415444 -98636 -147885 158147 227075 33253 -73477 -12623
10085 -93230 -85761 -181821 -100072 -55958 -146248 -130283 72330 37399 -96063 191860 53633 -211555
10072 115874 -9515 21311 -144664 -321829 26457 -301814 14537 81528 225475 -248998 274367
10060 -89309 -2999 -144561 209249 -115085 -302032 -159583 33678 -162972 -45351 -516 81938
10048 105419 198938 -41962 -118032 246668 -510122 69068 -104843 -181998 9940 12746 -79640
10036 -270073 12079 -273392 126891 71031 -158775 210056 47167 -58329 -352333 -200470
10026 -200470 -361914 -187265 206870 142007 140616 -44428 -149878 -73551 28553 -57900 -118905
10015 -118905 134068 49029 -199244 74135 -145001 -73015 -97062 -21080 -138682 -196694 138606
10003 -139925 -84270 -44079 32434 67802 -103076 -2290 -108602 -260916 -130411 -149908 244199
9991 161124 -175317 -140733 -302337 -207634 -112735 -172457 -235050 -74876 -6566 -107769 -75332
9980 -75332 -209642 -306644 -189941 -10120 -173302 112606 149940 -258702 -202862 -62304 249681
9968 -215134 76564 10973 -191986 33982 -52631 -86065 -153709 -117376 301510 -159264 244068
9956 68946 -8619 -79348 89496 -253961 -29935 -167042 -203562 -260796 -252876 -101776 -251727
9945 -251727 -33933 6957 90280 -1609 -5577 40206 -97659 -59726 -45752 -42354 -70337 130041
9932 49541 11673 14278 -152446 -67081 -104445 100841 -245508 -117135 175027 319262 -212614
9920 -307179 -51464 -333987 123585 -159443 60533 591326 -128069 15970 -100859 166086
9909 -169257 -218382 -294348 -133925 6600 -355470 72027 -358984 -365975 -5417 -63325 -172379
9898 -172379 -181744 -349560 -183958 -237962 56486 -31355 -311290 29047 -9908 -44174 -247549
9887 -247549 240405 199195 -241287 -60355 -147750 -1355 -239157 -230715 96726 -119647 65509
9875 -101045 51878 71102 -86823 -20982 -21125 -344663 149938 19816 -244786 -429769 -206032
9863 -104541 143439 -93335 -247530 98274 49106 -96788 176013 159779 -2273 -89827 -400344
9852 -400344 -95009 66257 199163 -199695 -97307 159194 -71095 -24020 15247 235854 84010
9840 -44870 70079 -91652 -167841 145558 -194457 -125862 -292116 -165584 -290160 -17755 39786
9828 -235626 183859 -122637 -80660 -218713 -204557 -86753 -87773 -196147 -222272 381423 -263791
9816 224104 -256780 -168480 111025 -158525 229017 -135188 -38506 -226025 -105370 -134940
9806 -134940 249917 -162904 -116622 10395 132311 -52906 264324 -67719 30640 107836 -16198
9794 -230365 101992 -89537 8478 -6945 -21054 -209740 -81931 -53361 -142030 -1002 -141740 -172721
9782 -172721 156523 -49529 -266628 15000 -27242 160586 -106017 51644 -117635 -54280 176017
9770 -116177 -245377 -27729 -388767 -161141 -111175 -2781 125085 189954 -32665 167426 -146590
9758 106105 -637306 -303284 -60496 22017 -168806 162220 198641 -83865 -380107 -127585
9747 -293985 -47896 33279 125774 29706 -151720 -367561 -312945 -117957 286993 -209263 -83352
9735 -64557 -139290 -333678 -86664 -245717 59179 157880 127548 -376110 -164865 97584 -244901
9723 22559 -183248 -128558 72593 -53708 189081 -289530 117103 -153680 -304562 -74868 11408
9711 41982 -216160 -379973 1193 -51835 142186 -66320 -4456 -221726 80016 -298326 108540
9699 87162 283418 17643 -267881 -174640 -141509 289217 166740 -131799 -255013 -26050 -199907
9688 -199907 140626 -86300 -57791 -64865 81890 -308961 -206285 -209668 -74198 -196044 20601
9676 132775 -116271 -369795 -349319 -192611 -39665 -146791 -249266 -6616 11464 181162 -134999
9664 -41917 157110 16188 -134629 166983 142456 -26335 -199263 31352 156032 -57984 283531
9652 -64059 -212886 34930 149680 -71013 -53006 127318 -122816 121385 70417 -248826 -214603
9641 -214603 22990 232079 209195 -78723 -282378 -446898 -83758 -222045 -188697 118394 52582
9629 76656 163297 -157412 -159077 166356 -249196 333089 299325 -119892 -197351 -248893 389145
9617 -147348 -130606 79117 -102370 -51035 -422064 124176 36718 -127351 45240 22382 -181733
9605 -129512 -73423 72626 -130451 -10916 -262909 -15677 17641 106182 -2152 -135568 -75965
9594 -75965 -249811 104907 -241715 140587 -129639 -156063 28468 137577 -131368 -205910
9584 -205910 -212800 96098 319565 191204 -117970 -336421 102339 136728 -96822 -351952 65020
9572 -3113 -307264 253368 -212872 -179961 -133168 -187156 -161790 -191460 145514 -79550 277585
9560 1757 -215304 -26675 -265765 358568 -3851 181562 -43568 -619669 -98416 -15100 143757
9548 115487 -27427 92418 -154976 -205326 -411047 100678 -259200 -219196 -210732 -39889 60820
9536 1113 -448591 139490 130194 -138073 -511872 -26293 -185596 -13549 -200019 -174286 -310622
9525 -310622 -276959 137640 245997 60232 -60468 -191642 28721 52588 -226422 10367 1950
9513 -107213 204768 215117 -172867 -133395 -298419 100549 207788 -230049 28171 -58527
9502 -203231 -20907 -415444 88429 279295 -119104 -17734 -236249 267547 -172308 -63265
9491 -72810 -333435 83524 -36793 -87755 -245485 -43017 -11483 -248241 64431 324352 -91176
9479 -1705 -103629 221616 -13622 -26982 91212 -345926 395835 -19062 -181587 30085 -168858
9467 325648 5976 -311450 179595 267308 -335062 -357315 -37612 -108723 -153424 -220349 42790
9455 -110661 54561 216353 -115271 -162989 23371 28387 -216111 55881 -192749 -146603 -50600
9443 -224515 -58781 -112306 -126773 58011 -112004 296615 26852 57477 -129005 82284 -104287
9431 83521 -223804 -339266 224010 -33861 -45792 176797 31269 -42976 89034 -367246 -80463
9419 -125237 -176656 175279 173257 55842 -180719 340815 -95771 27935 30989 256568 -172890
9407 152514 -447717 -14154 84969 77177 190916 -185672 46813 -58344 -288128 -156278 249301
9395 -221218 52762 -225695 -145518 -37107 -1745 -379420 -140320 128923 -45066 291534 163911
9384 163911 157867 -13699 -96986 -3128 28279 10849 -42245 -66770 -108561 -95135 153584 -210796
9371 274315 -306779 -157760 78423 -12977 -236671 297564 -241974 -468931 -386593 -210535
9361 -210535 -91217 96334 -217132 -345622 -288071 -111111 -108443 -292872 -411805 -55571 -251021
9350 -251021 80408 -273180 -86145 -45364 179352 -272466 -97887 14433 -318778 -54849 116457
9338 -428816 303181 -194476 34853 120330 -174345 12252 -191836 74900 6782 -57403 173993
9326 -4899 -267092 -44832 12100 -28308 -128430 -28362 507327 61330 -241591 -87554 -74125
9315 -74125 -184166 -99732 -102833 154494 -228929 95120 -377991 -157858 -305303 -42820 -443558
9304 -443558 -168705 -42311 48781 13131 -6512 61908 67501 27237 -261636 -109537 28792
9292 -37609 -130546 -355601 -134819 -25739 -40373 -323075 -156494 -89669 -81427 -116112 -52128
9280 -96247 150727 -106529 70424 -97858 -48889 -129482 -201980 294389 227032 213807 199541
9269 199541 132837 53884 -23691 25095 42264 295201 -95804 -158416 8460 -255074 -218657
9258 -218657 -194824 -92800 204121 -115516 43394 -202936 -25981 93046 69140 -150338 291101
9246 174426 -34629 -220898 -235879 -215062 -83168 261743 -161050 -58366 3837 -298944 141931
9234 273334 -4090 -216802 -28450 -15819 12745 247642 55879 28756 -101339 157364 -68232
9222 -5026 102649 -185257 58773 34278 196552 -147166 88302 -179828 218664 -227891 -148780
9211 -148780 136066 60896 -158309 2163 240778 -27141 -81585 225170 88625 -55543 37298
9199 -26885 142762 92714 31499 114920 -190718 225768 75250 -157816 78705 63786 -248241
9187 -134032 -17014 -208321 -71541 132281 57502 -123211 16401 -330134 62214 -111172 36434
9175 -143003 -9084 36946 -66956 104114 -54070 79790 -167324 20210 -64708 -103562 38251
9163 -216304 -169306 28493 -18694 -48790 -249107 95440 -284889 -125953 192723 6255 271128
9152 271128 11670 49869 4903 -110868 -77729 -163637 -50470 114248 -46298 33755 39099 -225823
9139 -19169 71941 83396 -71522 -473525 9445 -93336 -33349 47470 93762 -68765 -103721 -494680
9127 -494680 254834 68207 409318 -40591 -50471 -39195 -162849 68339 35098 -92505 26053
9115 -276590 -134049 157201 -26393 -188561 100729 -107920 -163892 -176989 -1049 -175431 337180
9103 -224455 -78920 222427 -281382 -135138 -27402 -226075 129835 -307674 -346278 -89298
9092 117144 -20450 -4292 11007 91590 -117500 84168 13297 -98794 21844 158696 16360
9080 -208706 -232587 -129576 -189673 -89562 -291680 204593 -194654 9096 -68974 -278155 29174
9068 -68628 -231789 -47893 114543 35307 -4064 -231878 -338530 -474298 -24086 40199 115799
9057 115799 -111665 30220 -82894 -102968 27690 257235 47041 -80155 -350081 59156 -276997
9045 -133367 -212006 72808 -148092 15608 -36673 57791 -38111 52992 189369 -11661 -50453
9034 -50453 180258 -197322 264917 -67415 -346682 39153 12556 -270059 -43844 -106181 191876
9022 -103367 -48275 -28280 -220218 38553 18484 -101760 -190714 63822 30432 57337 137844
9011 137844 67819 267013 -32088 -13571 -553919 -76265 -271764 -53998 -77626 -143362 97666
8999 -161007 193987 -109581 -150283 -127848 -117820 182880 -116575 -173846 658124 96575 -202631
8987 230740 -105234 119204 27528 -100832 93956 272114 122890 152256 117146 -105197
8976 -24018 246879 102117 -151029 -307834 -73409 -25530 -277027 63101 159621 167327 -226029
8964 -169464 107974 19096 -45519 43035 80240 -234206 -61565 11622 102504 118917 -229156
8952 -36184 -118632 -187955 -66133 -29081 71451 76291 -95521 12494 -3206 2857 4843 -410124
8939 -72219 321822 -22452 -117955 137310 216343 286426 282441 88399 -12839 227742 -170417
8927 -23336 155454 135626 425119 795143 1804618 5182072 8167168 6460209 2208936
8917 1122080 584179 538756 450994 -160325 191262 49323 117789 235979 -2344 -163082 26601
8905 267779 168421 32478 127476 197222 35281 -124577 -228281 -88516 329673 2874 44307
8894 44307 139790 -215909 -174512 30388 221845 -27709 44839 -147634 -259639 44395 21470
8882 -339787 -198335 338241 -39369 50447 118905 -11674 15742 116464 203569 -299719 -340071
8871 -340071 87161 -46338 301456 -346492 -64666 70138 88064 -367370 -66236 -172912 122046
8859 47456 67139 -219990 -67179 285581 -28964 -176476 44180 -45917 -81024 6290 -159673
8847 5017 -412999 -65761 103069 -54314 -233764 -250365 -54686 -184313 -339661 270522 28270
8835 -252024 -278231 143810 289084 133801 -41789 -176948 32547 132092 -158302 171946
8824 -376956 -141592 -56503 -33265 -24046 13004 -68891 -168256 51586 -156225 -239175 -164270
8813 -164270 1970 220241 -20314 -56679 -80681 -24844 -164320 -174958 40640 -89672 144862
8801 -87654 20691 -147831 119002 -310164 -243250 251166 -171478 22161 230173 -199207
8790 -58769 -72785 27403 -3050 188841 -210613 129981 -146490 200642 207933 -312861 -261062
8779 -261062 -48969 28710 -58691 42005 135061 37422 -97867 201380 -213680 -284044 374878
8767 -106079 -102605 -357861 128065 -133939 -29936 -56811 -171189 405600 123857 149077 -47641
8755 -167055 -1118 -31310 177593 -120780 -94474 -177771 165714 -223109 -262094 -119391 -156292
8744 -156292 -296127 -73019 206073 -4609 39713 -30408 171425 -42974 33479 -216122 104994
8732 -76 7799 -30805 -304785 138475 -35810 412564 96100 182653 -46673 -47768 -29056 -244361
8720 -244361 4332 155633 112855 83931 -42292 -273060 -293919 -408089 74894 -114405 -75191
8709 -75191 -111156 -336071 -176765 -247484 -104999 -60585 -101107 -188133 162504 289450 -28531
8697 184931 -173855 176797 -221908 -41785 317754 -122717 -213933 16309 -17641 -258039
8687 -258039 304023 134250 -43405 3264 -238885 157241 108968 183 22993 -278004 -78556
8675 -67638 -203592 -19314 146067 -161114 -40430 -80541 130927 -42432 79729 59352 22968
8663 -98454 111943 -100042 163262 130467 98617 -271083 12397 -179299 -62200 -127050 -271470
8652 -271470 -160006 -136297 -340001 200257 12614 -91029 -136169 78125 56241 -223881 -239980
8641 -239980 -289984 -15270 -56291 -56162 -301205 247161 -196707 88084 179937 -116627 -131392
8630 -131392 -11110 -123389 97498 195151 -41753 -142921 149517 -54777 -235559 -78744 451653
8618 174539 -109880 50333 -169372 -203888 -64354 56372 108489 -82237 32074 16865 249475
8607 249475 -134819 -272567 237955 -22718 7932 -165414 36895 16741 374023 -146417 19151
8595 -136122 7666 196899 126435 135403 -462112 -181850 -223772 86711 -202065 34209 -88589
8583 53663 -24215 98388 10967 146784 5205 -371925 -32359 222500 130808 -6506 -38231 59922
8570 -151203 -88481 109546 -63671 152111 -96232 -12894 139440 -139676 -12164 225332 34905
8558 -136895 -3740 116247 -30220 -35169 164675 -302701 189532 31612 87126 -82864 -277849
8547 -277849 118867 -43237 -80730 161415 -96943 194284 -29841 -22638 100206 45889 -88598
8535 20959 71450 105732 110506 -152461 -206645 28717 -415274 -26589 -159616 -91230 -121494
8524 -121494 2894 -8209 305097 -353795 54063 -236351 159240 299812 -112185 127982 24062
8512 -81786 178563 110446 -175437 -201682 -78565 -200058 -106226 -69470 226410 179341 241494
8501 241494 -268648 211222 76149 -294734 -311133 -186119 -258465 -24519 -36910 1080 -59172
8489 -201666 6872 12509 -227631 -14556 109605 12619 -169494 115979 11743 -108234 23494
8477 -143660 200044 175339 -7067 -100175 -18720 -124444 -121975 41483 -194670 175423 153655
8466 153655 -10427 79702 -175089 159021 -258064 -122661 -18137 -322313 -306350 -169387
8456 -169387 180100 -223705 -43176 -24785 -308059 2207 127006 -2096 -209983 -238260 825
8444 18927 146449 -211409 -9985 -269276 12383 185346 -56633 68446 108482 61999 19338
8432 -85712 21323 109010 105790 383997 95147 133119 164320 120952 -180391 5546 -121909 -403186
8420 -403186 -119126 49215 -45128 94189 -95004 149315 -201 241369 -282620 255375 -80061
8408 26286 191119 217003 19548 -38844 -126920 87979 -128106 236492 73362 88890 -18918
8396 127349 -100827 309094 -280563 137405 -17177 -148617 -303061 -52506 -213820 -5168
8385 -61022 64220 55246 288909 -184877 49288 -163578 -79265 3433 -10403 -114623 33114
8373 -244260 -81625 -11569 25143 -69938 -272705 -285708 65957 -367041 143485 147522 -85039
8361 78766 -59243 -314377 120793 -282748 -66686 -67563 -148327 -43182 332050 228859 81284
8349 -121952 -102491 -14415 -7274 -105227 229050 -67100 187713 56311 -99895 65299 120808
8338 120808 69427 -104281 -90012 -395155 -313893 96581 88881 -103456 -259227 -87247 -86793
8327 -86793 -31033 -196392 -41764 -34377 -159363 -162159 -108622 -16407 -213920 8616 -169846 30580
8314 -159548 33033 -140757 -367964 190704 -128003 -51273 101544 -116997 -364358 62063
8303 -94811 112018 -19495 27050 67780 152705 150315 -39065 72641 227084 12761 -72895 -62064
8291 -62064 15363 83297 -225284 285031 -97984 48566 -203348 109814 -105325 -47839 -269689
8280 -269689 -499522 70033 176264 -106008 -167557 3576 -132749 67290 266753 256650 -238209
8268 -15956 -186714 117193 96192 147470 -75276 -65511 -16674 -44807 -198123 171826 -194921
8256 -175400 84321 -123345 -223822 -136217 71041 188210 39343 144424 -67876 -157939 108399
8244 -53454 -290719 110935 -24899 49574 -153087 -168058 -122488 -212578 273593 -218123 -201187
8233 -201187 -124219 -201959 -55967 -190609 -158506 -30863 -12847 -480958 -194952 -53219 -352927
8222 -352927 96911 -122901 -29660 -196907 75543 26829 4939 14220 -296985 83669 275128
8211 275128 -68987 12747 -221771 -212060 35009 83155 -66330 -11497 -198894 -44847 214032
8199 293084 -226388 -233134 144942 148489 -208089 -145018 82776 -238903 -301896 -84182 -68793
8188 -68793 66998 98999 57406 211837 225063 15556 120847 -83798 -22836 18006 147392
8177 147392 -86276 -124329 -304652 123859 53893 -335395 -96143 -83210 170074 -115656 -135230
8166 -135230 333890 -172127 92284 -70281 32410 -161439 93554 -116462 85153 -400835 -431457
8155 -431457 -24725 -113966 -52197 -278917 79596 -82495 -235103 -111066 25205 -263276 -103142
8143 -77864 -1456 -225662 7010 -36655 -295114 -48501 147821 135161 7932 232556 -176246
8131 -38086 19920 -116274 88693 -74464 -176424 -63258 -551879 -56797 -165306 -616826 8276
8119 16949 -386240 -43921 150158 -48440 -399984 -102876 10084 -105779 -95469 140741 -55142
8107 -55809 -135455 -27290 -31449 -86073 -150201 81310 54988 -339376 -116578 106473 -367611
8095 23875 13463 -201500 -181184 -270405 -113332 134306 96888 -242976 -50974 -175211 -54018
8083 91347 -134802 -182738 353876 -269373 76211 -109316 41413 119922 -28519 158757 -30856
8071 -96034 213638 -169694 197061 -125196 272600 -255473 -24427 235395 -35605 293087
8060 -297601 -134724 8245 -326568 -10130 29994 -74023 71361 -417828 165638 -222668 9413
8048 40933 -147023 378825 -45669 -277477 -178225 103250 -107079 -15815 -35875 48306 -16984
8036 -164340 -342944 144908 -445868 299809 -396574 78893 -30705 -80520 5000 55328 339937
8025 339937 -1852 -76708 142598 -6983 -132194 64233 87257 -108081 71097 11475 -260814
8013 -112027 4799 96866 -118874 55471 11365 -64385 144670 -20894 23026 -224954 -71529
8001 229681 -164493 -28680 133564 180773 184086 -254120 64402 -116428 72470 -107177 -142519
7990 -142519 -27854 -156600 -107789 15495 184402 -105299 183377 -83371 77362 -3231 -145580
7979 -145580 -113819 -160169 -120282 10314 -52970 -53719 -294098 244874 136947 38079 -267500
7967 -9951 -45131 20243 -237554 158956 -26545 227786 -35583 -145557 143305 69042 -133574
7955 73965 89069 -208269 34129 -92505 22982 -127420 -100919 17937 -64119 96290 125370
7944 125370 -285805 -371466 -187408 -38239 -96197 -158789 555 -261334 -29322 98701 -331901
7932 63524 78179 -37067 288207 -195786 168795 -159567 -100513 212764 -166688 50669 74627
7921 74627 -46979 27791 -201704 -158503 166637 145620 -336615 122399 26122 3136 -104951
7909 41727 85748 -113924 172391 -170968 -130430 -196645 71076 61382 78463 -109918 -236110
7898 -236110 22702 23481 21018 -197662 -111805 -101875 52913 69093 125267 -267234 152002 -170448
7885 -334251 -112415 -37611 22901 173458 -170542 -171242 -122589 -179482 -27708 -91207 -27572
7873 -325075 -253564 -63257 125417 211561 57006 63318 -302212 -62146 -63792 -280440 -282380 240730
7860 -134682 -41678 135859 -199342 -122261 147940 -86564 186563 -113954 -155010 -42226 -51849
7849 -51849 -121910 -149567 120979 -241429 116191 -35072 29282 -25007 145673 11643 -37113
7837 -406364 20248 -56471 -64548 -165025 -80559 -58912 388330 -121182 -120920 -24587 300172
7825 44654 23013 -265907 167215 -65853 161855 -158027 88787 -99731 -26543 66194 -192224
7813 69444 -215575 -78408 -127253 -216102 -255235 -222506 -22637 -247698 34381 -24947 -10390
7801 14273 73671 139537 -101882 -66466 39650 -3635 57905 242247 -247591 141744 57093
7789 -12939 133895 165348 254807 -66445 57244 -168703 -257443 -83564 -198625 -127830 156474
7777 107737 -256967 -128084 -71168 -36225 217641 217049 -148459 -217972 -21139 -12951 -138883
7766 -138883 -239454 -299815 219313 136947 -310254 205372 -43900 -99690 -50592 -139452 1999
7754 -95768 270795 71438 -289238 -161046 251172 -146986 -47549 -162593 111053 50650
7743 -291884 -8149 -105187 -144591 192930 -211028 184766 124205 -108028 -53992 6080 147232
7732 147232 13468 -92391 -212882 11359 -146322 65041 16482 -304851 36401 -108259 -16082
7720 -271647 228853 -78952 -337658 146392 -10667 -1798 -135889 -46308 28965 -1561 117327
7708 161389 132398 -207786 169422 115669 15574 -81261 -157859 -165411 -460138 -114099 -192167
7697 -192167 -128548 -71268 97371 166738 224440 -28688 -294849 -79034 174849 -1450 56982
7685 15873 240718 -247415 -189844 -168583 17584 50044 -48718 -61852 77271 148181 27480
7673 -1590 161353 -126641 -156684 89135 -63779 -18546 -493710 210864 -201421 65830 -78819
7661 262461 -47350 172772 34753 21726 -17334 -58999 402 132386 -308538 -146848 -52039
7649 67885 -186690 181214 -8903 26373 9065 -77514 -203432 -318545 -23497 238874 -206230
7637 239209 345861 -253579 179555 -19370 35019 222455 198439 -225385 -67779 -156607 16412
7625 -220104 -178414 -172301 -172465 -594536 67574 -19375 326431 -62880 -44802 129878 283161
7614 283161 -106806 96909 -2866 20335 -77767 91398 121338 18823 -307635 4188 -120574
7602 314659 -154119 -257819 -17568 -195748 -363455 106351 110439 -36912 -135134 125518 -63545
7590 90479 -4502 113923 -108196 -136929 -8173 -146557 -226956 -275207 -12566 211113 -161911
7578 -40469 207197 30226 41104 71628 -19129 4881 93706 -52691 -135892 -14624 141425 301009
7566 301009 215643 -85863 133730 -182598 153445 184793 -158640 85692 17948 -207821 38838
7554 -182680 -145375 -232518 -272876 191230 -6478 84081 101536 233725 -75174 -24189 -309341
7543 -309341 -1035 319872 71937 -35644 195425 -270828 -160136 -152292 377211 -62159 90499
7531 24294 77660 45667 306930 -38001 -72805 136862 175847 77496 -81745 110374 -183633
7519 -38102 -292248 58242 63520 167775 144940 87770 -168683 -121444 -4265 24595 -1304 -146078
7507 -146078 -68268 -192177 7163 -371018 92868 62907 -104544 25620 -224854 -256064 -78291
7495 -73416 117253 31900 179236 60700 -104801 -57642 -137979 225789 4044 -308304 -105485
7483 -196130 234768 -74242 -205145 -106622 -70390 147572 -43243 -355993 204983 89820 -140360
7471 294405 -184642 -230425 157934 -54166 -117952 -193603 12850 -108130 -181369 -78834 -121231
7460 -121231 -112916 51849 6148 -297042 94192 7711 -10953 106361 163430 164026 169336 100314
7448 100314 1546 245286 -77979 -224952 79139 -57905 81218 -236889 18499 -166730 3362
7436 105654 -34790 -83941 81310 124345 199796 -155423 -136295 -42378 59564 4441 52412 264703
7424 264703 -14766 68717 -89633 -150750 -4309 56354 -30868 -252846 315547 -222969 -43166
7412 -258175 48432 -45245 -199359 -176783 -216031 31730 -14126 4569 -84970 77141 206448
7401 206448 -168718 57386 -81469 -403420 -71172 -37913 -66236 245155 -49405 15518 -207563
7389 361836 -228476 -64185 260876 -147604 -126698 -101146 -213390 35559 -246157 8249 264553
7378 264553 -260676 55247 -144207 3797 187299 -223719 -168055 -223398 -95760 116802 -169827
7366 34992 -119702 -208705 78401 -199346 -46236 -65840 -78981 -210226 172718 -134716 -99806
7355 -99806 196466 -369216 -10218 -123646 93287 -51266 152993 9447 -67287 65281 -115035
7343 -9091 -164031 -234800 -167450 27923 -109819 39644 9664 -74889 -75630 -94165 -65221 -387284
7331 -387284 9259 110761 60182 10723 349733 27094 276921 -14042 -26291 -74144 -179864
7320 -179864 140176 -69704 -92923 -20092 -110936 30558 130724 54368 -172420 112914 335530
7309 335530 161831 203732 -219329 -80347 -160189 372698 -228393 28488 50068 -6204 389507
7297 -332880 30035 -31337 -195687 -58546 -214678 -60615 -420785 -13707 -148177 -96062 -116550
7286 -116550 -159082 409260 -240566 283 130101 59359 4595 -328507 -118171 387573 154799
7274 -114060 -101774 -5473 -24207 173034 -170950 -362158 11824 53452 383658 -85010 -115233
7263 -115233 -142182 25389 -123574 480984 -169779 54276 -106981 -283154 101954 -88683
7252 -393055 76123 -106442 -90479 -75145 -149300 -284951 -9855 157785 -122362 -42066 -93614
7241 -93614 -46833 246484 100928 -67610 182075 -47209 60525 -86295 257880 132051 -76351
7229 -144124 -13493 -174996 -137379 -375954 -98843 141681 -79718 244161 -83265 -145755 -157137
7218 -157137 248079 -80984 -223465 176316 91617 305388 -8995 -92083 -214893 210464 135568
7207 135568 224096 -264384 32657 -172007 4671 -4221 -259566 168560 251829 38584 87684
7196 87684 -70686 -205938 -88324 -98479 164515 97940 -390501 11957 97050 -188029 -270773
7185 -270773 -151994 -193957 202767 -51896 118352 198631 -132148 -566 -38832 -85211 136447
7173 143064 -127850 -439221 155222 97011 -335154 102629 -68720 -75241 48555 186375 73038
7161 103355 -114499 -47533 165453 -40628 99394 -181489 -26454 -97025 -99705 -241465 25390
7149 -109312 -31829 -400383 -373790 -67125 51694 90945 -2515 -174559 260140 -154896 -183343
7138 -183343 -100601 126390 -125636 16131 -317886 -155828 -103264 95856 -159367 90645 -371641
7126 -102351 182538 -91904 -47347 -137957 -346950 260469 -138221 59861 -330482 109715
7115 102573 -255003 -128424 -83117 -162378 -175088 -135089 164375 2712 143251 -7959 -188320
7104 -188320 126490 52326 176333 -150206 -79463 -182730 -274220 56133 -262889 212222
7093 359062 248289 -14280 -132853 36704 -378229 -73275 -84504 72290 102912 74003 139138
7082 139138 193903 51626 -256115 199914 163928 105960 75927 3063 17816 295023 60337
7070 -384092 197830 -78828 5289 -107032 -473427 -140465 -14638 -167668 12804 -62143 -52675
7059 -52675 -79838 -113975 -68975 -109448 171889 -365531 -388648 150911 -274283 1048 -42902
7047 -83653 201355 -77270 48596 -178620 182645 285219 -333853 -57570 -31930 24165 400504
7036 400504 169004 173798 -100644 -115418 23036 -153511 209986 -80770 -308795 -67162 -304157
7025 -304157 119409 -29033 -31776 55998 -44899 107934 -108192 -42850 -64310 28382 -39589
7013 -275815 -212771 324049 -43895 120970 202327 -217541 46614 -266774 -393910 201453
7002 138957 -69137 -1642 -150751 141443 -47278 -69525 -28768 -46608 15621 -40756 -142941
6991 -142941 45244 -388497 16158 -208652 43271 118383 121030 188427 -6728 -123684 355804
6979 -308668 324024 -252511 -361548 -98661 -167267 -326636 -1206 -244905 -177509 93484 124022
6968 124022 154091 102888 -247515 134424 124822 127650 16497 93863 -126101 -421375 -160643
6956 -50750 31610 26130 88016 -333718 -222614 24272 7041 210504 -50596 -55912 192967 158852
6944 158852 -32705 251500 -30787 4948 191870 170403 474595 -2581 209643 123219 -26691
6932 -82794 241224 -245740 -460391 19962 51872 64469 -82374 -75100 32992 56609 -131038
6920 64520 84073 -267968 128391 -40413 198818 -9521 218502 -102046 182010 148788 -109241
6908 138066 -30666 182584 -88436 -82564 -155155 35490 -245105 44366 -53379 -167216 153138
6896 -164508 -22139 -67958 -102964 244552 -88530 -272150 78260 99801 47405 31564 373325
6885 373325 -16034 115293 -41304 -18924 108808 -326355 246627 -8084 -167582 -241667 -265843
6874 -265843 -167540 164077 -71581 43543 44645 -115479 -234253 227673 -187653 145012 -110285
6862 -49014 63965 205181 -395285 52113 243021 -80615 -35383 -221295 -82764 211374 22534
6850 -153234 553215 -239343 55392 -118597 204931 33884 98848 213967 -181944 -198621
6840 -198621 -44440 48246 -56418 -159957 70242 -255356 -180279 -185857 -45350 -78203 -125671
6829 -125671 -55098 -56598 -111893 -272795 -192666 -148072 -254411 13714 96447 79231 -34227
6817 147365 55903 -88142 20903 -204851 -186500 26767 -6603 -41802 -18020 -78036 -154261 -260794
6805 -260794 -17534 -67366 277736 32314 -27065 -231635 157452 -207713 -31214 -28924 65017
6793 164944 286811 -248190 -66713 -244481 -49342 56762 57921 -53161 15952 32214 80140
6782 80140 -14479 -85604 -134271 88448 160688 224992 -162014 -94336 104065 143461 -133524
6770 -199418 -7376 35393 423855 133991 -182338 -186137 -205708 -115720 331635 79538 -98754
6758 166031 426886 104189 -186370 -24617 262469 100439 233513 -147411 -344325 176601
6747 3348 -231778 -32627 267338 -24898 -201835 -158877 -121525 -256807 160133 -74880 -84016
6736 -84016 89740 113535 -84681 214510 -17538 -397735 315438 -260681 175954 -162507 189716
6724 -16981 -230345 14135 327298 -259807 165846 64403 152026 -133004 -11299 -12306 65543
6712 -266578 -37380 -311 150360 -57998 -85190 248856 -105403 87840 -2113 -173827 168887
6700 -124550 -43756 -3640 -196824 244445 -278618 330841 92623 198218 -109490 -176984 238814
6688 -134914 77730 154747 217091 157624 -11785 -103125 91932 -97068 90843 171567 -53166 -115064
6676 -115064 37687 213582 -150867 166602 159217 17775 19417 -26115 -80549 -69688 -34775
6664 12070 -353782 240026 -107466 98466 -29210 -49567 -128346 -353721 -251265 191344 253076
6653 253076 -185694 -168981 86968 -114516 -49826 -79736 324335 -91961 -60961 43856 -92956
6641 57635 -172007 -60457 -146310 -8047 384330 -128952 66815 -13578 -170963 -217973 -127833
6630 -127833 66134 33757 313251 -181111 85869 -37429 71737 -212547 237020 -124512 216367
6618 -29747 210825 -129710 17517 -271872 81315 -184360 88677 62886 210357 -89519 9951
6606 155458 -145720 -40630 -143111 -63349 139530 -58473 28318 25357 -47570 -200884 -212239
6595 -212239 -65049 -156896 253720 -60265 -214829 -215245 319491 54961 -17079 -66845 -244610
6584 -244610 -26769 -177354 36536 -96580 70228 -37737 -86474 -80316 -55273 13527 4714 -96555
6571 435480 11202 -167993 -70298 -72325 -238224 270456 -131504 69183 -139963 -205392 296883
6559 -310821 82321 -343289 -119573 27595 -10072 -69934 -9850 215821 -158115 13535 -15954
6547 20718 -57594 -40353 -128638 51669 -237222 -138419 -179867 97604 217420 -110185 3567
6535 71010 -201646 -36081 7104 205208 -166567 -91018 -25642 7388 -28814 -11161 -27067 -23350
6523 -23350 193450 102859 -313880 19881 -30726 197148 -63528 -127344 12934 -28965 302091
6511 297646 79963 373850 -100261 -59940 106063 -226590 41888 -201392 -575758 803 75666
6500 75666 -133471 -225443 181969 -122061 96744 -6844 89408 -270430 -55459 82896 166449
6489 166449 -92946 74435 -231956 -196867 292634 -198225 126097 20016 -222741 -27769 159979
6477 -139390 115259 -76311 29667 271618 89969 81949 258143 -11328 385619 -215083 67960
6465 -106653 1628 -49379 -250626 90298 -79928 231620 -27019 -272499 -245899 40561 -1399
6453 -224401 92370 156796 -199420 -388181 -41357 75241 51469 156409 -329675 -44691 54493
6441 -74477 192666 -144975 -159546 134483 -5202 5475 297336 -68001 69555 203308 -87204
6429 -239883 282521 45333 -75210 -259235 48117 -58349 -163660 -123727 188173 171741 503202
6418 503202 -45888 -131372 386929 -301801 233471 60291 273036 -44946 133241 -31203 -85838
6407 -85838 5950 -9311 118166 -150202 7538 -168754 -159955 -25565 -161430 264103 -33078 -110669
6395 -110669 -133100 -130605 19926 372736 219644 53594 -5636 -10946 371027 105401 71671
6384 71671 -79171 -195644 185758 198096 82473 -23621 -197232 -44294 150452 -93837 37861
6372 -59591 -303241 -262698 161010 73121 -1594 -98246 88965 -47832 182481 102800 -125691
6360 -28902 81350 -324220 -170637 178855 107091 44363 -339773 -251841 -138909 107322 410042
6349 410042 88137 -235366 61546 -142280 -57425 -379177 -75854 -82940 -136603 -151275 -124987
6338 -124987 -321276 147814 36230 26031 99719 176650 28526 -112453 -274422 -197100 -258297
6327 -258297 -106976 42854 289440 58367 96509 127962 -103500 -25198 -228829 -542704 126724
6315 96241 -49259 60383 167619 317768 -35646 -159638 -87892 -71756 -186 -100591 137984
6303 -4503 -208790 65155 300938 -50118 -50810 171695 96455 16899 95132 -215271 -26308 -151020
6291 -151020 25759 -109511 202011 -172118 -4042 15491 25308 -285895 -95460 265921 884
6279 320492 -42315 208384 -172381 122091 7157 -93923 5506 -109944 -127426 -72693 113807
6267 -220065 -23016 127705 77368 110684 94397 297918 94082 -101755 -68216 63290 136362
6256 136362 -57029 17629 166412 52207 -5797 -2326 174768 47821 -71046 -2012 -189719 -23387
6243 104483 -234180 315639 167331 190797 -11748 -255231 -112850 -170579 12614 -4219 -133969
6232 -133969 83447 60291 -359599 -254399 98955 38149 -170714 76653 368350 101378 211879
6221 211879 -238233 -165269 -171357 423015 -112551 22799 -207466 186591 -2353 -51136 -74027
6210 -74027 13894 -58380 -135135 -63484 -27285 -358760 199865 141937 356226 -124812 -151753
6199 -151753 -3879 52442 -150002 33974 -36187 -147246 413214 20843 6703 382142 -255646
6187 251111 106354 88853 191942 44903 100231 167680 141580 -37295 120787 -209789 40266
6175 -158162 448477 -91329 -8282 -227661 24144 68876 182706 101050 -154096 -386156 -177894
6163 33608 175944 373511 118091 -17741 -1233 155873 -218956 -152516 -57697 -124746 72872
6151 -246818 -211909 312944 331726 119220 -156822 145574 -260994 -47470 -48293 47483 7884
6139 -46907 -140452 147973 -146427 -141850 -84161 -233623 15231 87880 -115810 -161649 -96587
6128 -96587 167120 -101088 -83532 -913 29592 -52619 269217 190415 -217119 17039 -268934
6116 91529 -357876 122588 9078 89103 55310 143655 -178004 -32314 -133124 51823 86570
6105 86570 277265 149826 311233 119400 123295 216052 100957 -63804 38935 89808 -26985
6093 -210220 -222122 -133704 -114193 -4162 237845 -26870 -63907 5410 305817 -90736 -376055
6082 -376055 67294 292179 94709 -99122 -107572 -98456 141729 134013 46554 -5852 59714 142547
6070 142547 -132868 -4194 -39736 -122406 23874 -155825 -184752 -299611 161190 -49119 101239
6058 -274303 147100 -65638 179820 -68101 -76151 -162925 277257 -88881 -21652 -238426 -168145
6047 -168145 47362 322924 -90491 64704 -98175 38685 21766 -211687 -91981 321784 -148758
6035 36510 -254397 -25392 -165227 133447 -263833 -51215 64353 294356 56545 -70764 108667
6023 153048 339529 -82610 244985 3179 -41724 -198314 227227 -15409 110301 -118561 -183843
6012 -183843 146201 -77448 -219076 -36251 131857 34434 -5232 -114471 94862 -62172 27740
6000 214442 -16103 79431 110403 4061 -64474 37740 -102887 105990 292114 -153978 -472274
5989 -472274 61244 -85629 19783 -315387 -18765 163189 97603 34083 -239807 -86357 113567
5977 264204 132132 5117 -54513 30092 -111200 89491 -143618 -17567 136621 -102922 -10045
5965 -116770 -238445 -273945 -93198 146452 -130578 -218804 -56483 -37345 153171 39908 16357
5953 176990 96531 -35930 -81010 119267 155102 127344 -72203 7496 -103546 195654 196997
5942 196997 -448404 -180301 -368571 142289 -191484 411111 -303161 53132 122315 -25388
5931 -184416 -106535 122413 -155668 10352 4341 277890 -142868 135768 -106701 82677 161779
5920 161779 -47319 99349 45036 298734 82203 39399 315475 75623 60074 -137194 -6009
5908 67848 -101141 -33457 229028 -8766 397946 -90796 -241131 -162714 -112659 -113925 -251103
5897 -251103 253110 -236365 129776 -124949 -221810 254318 15297 -57214 133102 -15437
5886 -229484 117862 80024 -5718 35474 208729 -3074 -60189 129052 27126 56726 17135
5874 71185 106202 222969 102696 -188912 350472 -78100 -13397 70631 2335 247144 -4229
5862 46086 -51248 -101612 -183063 87960 -117924 -219131 -16932 -40014 -72471 13394 119522
5851 119522 158444 -33610 120922 131354 224550 -11337 90281 62809 2637 -115085 88897
5839 20119 109396 222890 -313270 235317 -123635 41494 29682 108847 -54013 -139036 145583
5827 -77081 -349423 -140033 201367 -240999 66520 165780 241099 -17571 -37752 200012 425970
5816 425970 -130587 33352 47211 -140878 -110173 14006 -70483 353495 -145790 90436 10566
5804 -115249 182950 -317837 122260 140254 30911 -44742 -130175 -98475 -162954 265918 303721
5793 303721 183794 124431 329335 230270 105806 108651 -392150 27867 -123043 115105 172953
5782 172953 -96183 -14945 54415 108811 99986 40030 11065 31267 -167265 -282329 94910
5770 364593 -35723 -296720 158487 72898 -457138 416609 -220411 2037 84259 -209817 123916
5758 -130093 -156198 362042 -25988 182312 42494 -42050 -145256 -211426 285037 105485 24977
5746 -36991 61949 43464 -285661 -125010 -39962 -84901 -24704 -106041 -7011 -240320 -355777
5735 -355777 155726 -247972 6452 -103356 -161801 -215001 -82978 -82504 207349 96048 166556
5724 166556 266238 -171589 76656 -112899 148574 60885 4135 -134690 -324033 46532 260540
5713 260540 -95792 43141 -138497 -164200 -234816 368462 -74836 -140019 -41188 262106 93505
5701 -212017 -19846 33603 -307016 -20523 -115574 -126263 -36670 -186445 -155195 -206806 -221826
5690 -221826 -51097 180587 60348 -84990 285662 -69984 -68272 -246297 -103133 -282397 -128353
5678 118274 -113845 376214 -122189 6341 -174067 120646 44023 -137644 23299 -26418 -200628
5667 -200628 108462 309802 -8746 -181105 -178198 -61204 1813 -299310 -89423 -302117 -145622
5655 124428 178535 -296134 -168469 291352 59439 -15951 200473 413425 122437 88934
5645 88934 105402 -14583 -190750 -192148 108040 -102561 171035 -118513 -7953 161315 59179
5633 146350 -213207 -5791 145701 -65414 42546 -153040 -47133 -64084 252533 -124318 -62463
5622 -62463 -239737 -277111 -33654 46371 162348 -189727 152374 19226 35895 -64296 29696
5610 39108 -113452 -165309 6718 -24929 372275 234174 295661 79505 142739 79735 -89095
5598 -428373 137437 -33225 -316922 122103 1651 -5000 124602 69450 -274816 -16784 -24852
5587 -24852 89956 -105794 140560 -54181 -30443 69948 253802 87083 85831 221473 227068
5576 227068 38427 96603 -290228 63498 -169655 280604 122233 -73365 -200631 12231 922
5564 96917 133483 206186 -308470 -84577 172452 97771 -100497 110243 43758 -7225 -90312
5553 -90312 216773 -72130 79885 -170 123914 -456429 35561 -146927 -94214 250951 21940
5541 319943 -295492 -86761 46473 94280 -87475 -8379 172259 -150485 -301750 -111788 136615
5529 -151000 -94030 -59848 48152 63769 6517 -11241 120419 58637 108162 -118514 -207011
5518 -207011 66387 275424 26934 -20456 -36814 395712 53499 124282 -156760 -33220 126391
5506 -197526 128085 163997 177704 45515 -506277 -72227 -274641 58721 -83450 32679 227477
5495 227477 61188 -426482 251049 -149589 183849 -118734 245534 277663 -22226 -182697
5485 -182697 14049 -106197 146587 120215 12418 110395 34458 143983 -278788 -102885 -243019
5474 -243019 -201005 20635 171803 -336354 -22298 47474 105748 4168 2406 1668 110289 -56171
5461 -130851 -166255 88773 -284560 106210 29289 94228 149824 53223 -74022 -140027 -12875
5449 -31790 76793 249083 159887 -83696 -29775 7705 31140 263912 -254602 -15387 -318791
5438 -318791 -300909 86121 -388780 -77013 -40508 -126843 167182 265864 259708 -68912 48307
5426 -74761 81880 -240057 -32301 267955 7900 242888 293399 90416 154997 28357 -376691
5414 -265118 -246417 -47882 84919 -62191 -82325 -11121 -187611 153004 32451 58360 -75937
5402 86304 -55855 42427 16837 61328 197639 123465 7605 -315816 313001 375709 278848
5391 278848 52890 38227 -418218 195334 -75594 6391 -260913 244946 -179515 -184944 102276
5379 28242 135349 19525 -154012 480084 -59151 27785 14874 -93720 160169 82505 -116452
5367 -89109 43365 12272 -153952 -128615 -171372 204544 31812 -78279 74932 -419 -121169 -99334
5355 -99334 41853 79179 -147285 -73431 41388 -91032 -389753 205998 1102 76836 -87108
5343 54999 135738 -164387 134648 -56160 -400560 -41934 304326 -52287 -80534 58480 -185585
5331 71133 -7710 -112520 -429710 -175317 89908 -55387 -176353 -275033 78688 144713 -38585
5319 -125902 -138428 115373 366252 92450 -54760 -171618 181649 -147714 247494 17329
5308 -26213 113997 -3262 -144581 102593 98140 159759 133199 100344 -36201 136669 108335
5297 108335 -55548 205525 194950 -32542 -341773 133155 -20337 -1804 -250725 -54786 188229
5285 2324 101833 86539 -52075 -88309 -50559 -13178 -180411 101079 -49551 -119945 322720
5273 -316485 -302634 16567 -53131 -174541 184854 113664 187852 67437 -150421 -70347 13899
5261 167271 -120451 330896 -118241 100546 172827 -317288 -155925 97372 54201 -109489
5250 171751 11821 -76111 281537 -5547 129289 -410141 15438 -294585 50894 252422 -99418
5238 -33627 137443 -20965 213604 -3857 117600 19826 53769 -38644 82058 114962 130592
5227 130592 -87166 191217 469517 217100 213784 -307804 75999 158885 50527 -125658 112304
5215 109237 -153251 208235 208474 -388077 -5202 -138707 -19043 -210522 151445 -157702 237544
5203 -109006 -21762 -156466 103507 -55924 114456 87004 282562 143615 -33981 -20267 163738
5191 6609 -105161 260935 28214 30601 -57439 59367 286175 185644 -12239 -118475 291932
5179 363275 -115201 -524 38098 198311 50355 -307146 135387 102444 46169 -52377 -70131
5168 -70131 -3143 81123 39571 -50884 122001 -12832 -26302 -228728 -3563 149254 128802 289773
5156 289773 28722 119004 -9532 -38752 166951 248005 227074 16324 148627 59954 247692
5145 247692 -186537 71748 -255309 8241 299279 31649 125760 12228 -210058 -260463 -143294
5134 -143294 -113524 -450179 46326 -120006 68438 -198743 180013 51148 274013 -7567 341817
5122 58865 -74015 -25292 107142 -243679 -128678 252237 -159300 8490 -153016 -20839 192941
5110 204666 22515 219348 -200850 10742 -87114 -153141 177647 13969 -76524 89851 15637
5098 111877 -102910 21848 -166101 -263634 -363783 14031 -151643 18536 -174346 -84652 57976
5086 242166 171841 146769 -389660 -99761 249732 260782 1017 10035 40442 110803 353248
5075 353248 -132143 94747 -1046 -82820 -260268 143913 -347198 -369717 -35141 277625 30766
5063 23586 144789 41725 -150743 -191349 95861 -93808 19477 110464 -126371 -15113 -155781
5052 -155781 -118415 -6981 -185395 -86424 -25512 138862 -182662 136597 -241489 -48689 43438
5040 -273536 -94508 -74454 -254582 156481 -96729 -270079 122321 -216669 -29599 36722 -299419
5028 -10918 201175 136194 179389 57595 45719 358539 -97733 16415 175885 -61112 -177558
5017 -177558 -212075 78270 21297 435064 131464 366404 -158787 -51594 149090 47812 28231
5006 28231 -63307 -90997 387413 278014 79602 120629 228821 2089 -41663 -67047 135822
4994 -234458 -33102 -88142 -147867 114889 -106439 -140479 -61172 332526 -82275 13782 86790
4983 86790 169369 91339 -27863 94530 -200531 54361 -280890 -138540 -166763 60944 181681
4972 181681 177219 -286391 -218027 167540 -100964 59881 -31701 -10687 -187266 36880 99844
4961 99844 84191 293987 -83245 -30272 -168187 -24476 -16071 130575 149729 8847 43893 -40444
4948 -198484 117566 -73900 266964 -86487 269271 -200969 164954 190404 -156011 141349
4937 143618 18009 189951 -13600 121255 20293 97846 20156 233125 23783 -124497 259047
4925 -161963 -81651 104509 -73223 -63829 -3858 12147 91777 305683 27864 188382 222814
4914 222814 -2901 -12946 67329 -220426 -220992 -108283 299669 -40990 67944 -50290 27139 188455
4902 188455 34924 131793 -9325 -22726 30586 27847 27650 154177 146992 -159215 33476 -52433
4889 -181192 -248829 -116295 -208678 110819 139101 -156766 -28276 168856 -57345 -15463 124189
4877 429484 -244171 295389 36677 -85854 78803 -164374 70900 -33961 99316 336660 60131
4865 -78844 -383787 -107795 1277 -90552 -219402 -205678 -102456 12967 68972 18815 211164
4854 211164 143459 302971 -113147 108680 34853 241110 -20540 -101926 95549 89577 -220916
4842 -48674 240002 390588 -136842 -197769 319913 13804 427468 139639 -224603 65850
4831 -155791 49124 -51027 -202720 -93115 64705 305366 270864 213342 18311 -50570 45005
4819 -91688 -451195 -16253 -24887 140555 -37916 5718 -140172 135263 86356 -164627 290733
4807 -14909 -272454 -85068 -106629 -133255 73378 184751 440071 68591 88086 -42534 38171
4795 184811 -69558 77186 45717 26702 62900 -41226 64397 -267559 114952 -69418 -65719
4784 -65719 -5320 232977 41361 196676 5152 182574 6749 50868 159152 -225886 -121999
4773 -121999 -156140 -6196 -18829 310071 -199046 314244 -177494 -141775 186897 155186 -1551
4761 -106236 -333103 -169798 71140 20178 -378434 44972 384440 325015 2353 -196126 -221569
4750 -221569 -64112 308992 313458 -65363 39151 301713 43796 77743 85082 233588 346842
4739 346842 87828 -289202 324292 -129896 -22022 194389 126181 -5978 52454 297562 -38
4727 381558 -20521 -88365 51650 257292 -21306 295728 180943 -184588 -67776 -152582 -203228
4716 -203228 45633 274309 161095 -205982 -114779 206526 -366864 -23709 124623 44752
4705 203373 -381076 40460 -217579 124661 -78387 1245 200375 221178 -187705 -53276 183201
4693 -40449 -372374 -317019 254535 -21960 -201034 200534 33616 -69856 118492 74427 -61426
4681 73014 -111895 100458 -8791 92451 -137939 2219 173978 -64563 -99211 -302781 -169757
4670 -169757 192126 180894 -113624 517850 -136045 121497 -150752 218339 -119717 69553
4659 92430 -106098 240420 -152348 285203 -138414 -212263 35136 -2976 -134816 -4998 -190442
4648 -190442 221525 117478 323768 230761 133466 310492 484560 -213862 20309 161311
4638 161311 316250 87861 134210 42485 299869 115389 259613 -87617 -194243 -40950 206293
4626 -172877 403 72994 -97963 -53169 -105934 -208124 -139857 -403189 7305 -117274 -113269 -11565
4613 23868 303081 -41494 173489 144053 -53518 297076 120409 -119141 316793 91025 -56024
4601 -43746 -34214 -111213 222674 50830 -211940 184839 187306 4738 -98693 -5163 292001 8901
4588 -185583 255423 -50172 -127853 49055 50070 34183 -106830 295081 -9051 117912 94770
4577 94770 -400135 134687 253487 80267 58869 123972 86785 -39503 236422 38461 159925
4566 159925 285050 -341569 -269673 18525 22290 -275104 -77778 34319 52054 47228 -154672
4554 93790 288478 71507 -208994 17934 -255081 241057 -97373 222770 54019 152919 11943
4542 -210683 -130735 289895 84749 -14600 261072 70154 142 -86266 -59423 25577 -70598 115550
4529 -199592 -184060 -29646 112141 -114032 273199 103756 55822 335085 68066 -341876
4518 168462 86908 109766 -210407 -285369 95574 -30660 -47672 15551 -103369 -143998 -60204
4506 -96279 125107 147798 -75213 116258 192071 -22387 85224 32646 30065 -93325 -273717
4495 -273717 193711 -98164 -130379 98784 -191901 -43414 -341964 109685 129832 -110531 -8330
4483 -28147 26763 105268 40025 109407 134492 16707 -108935 141753 -297811 270157 128360
4471 83765 224634 -52833 333209 -5144 215964 -123984 178439 -196651 -1967 152367 -173254
4459 183647 167928 -264877 91506 -68503 -112209 -146632 243809 -94598 -47080 202999 144463
$$ [...]
##END NTUPLES=NMR SPECTRUM
##END=
