##TITLE=NES1068_159122.0013_001_9705792_3LNsZ8qjEM
##JCAMPDX= 6.0         $$ Bruker NMR JCAMP-DX V2.0
##DATA TYPE= NMR SPECTRUM
##DATA CLASS= NTUPLES
##ORIGIN= BRUKER
##OWNER= Administrator
$$ 1.72 TOPSPIN		Version 2.1
$$ 2016-04-30 21:12:50.817 -0700  Administrator@X
$$ Compression mode = diff/dup
##.OBSERVE FREQUENCY= 400.02188249412
##.OBSERVE NUCLEUS= ^1H
##.ACQUISITION MODE= SIMULTANEOUS (DQD)
##.ACQUISITION SCHEME= undefined
##.AVERAGES= 8
##.DIGITISER RES= 22
##SPECTROMETER/DATA SYSTEM= spect
##.PULSE SEQUENCE= zg30
##.SOLVENT NAME= COFFEE_meoh
##.SHIFT REFERENCE= INTERNAL, COFFEE_meoh, 1, 14.98509
##AUDIT TRAIL= $$ (NUMBER, WHEN, WHO, WHERE, PROCESS, VERSION, WHAT)
$$ ##TITLE= Audit trail, TOPSPIN		Version 2.1
$$ ##JCAMPDX= 5.01
$$ ##ORIGIN= Bruker BioSpin GmbH
$$ ##OWNER= Administrator
$$ $$ E:\/data/COFFEE/nmr/NES1068_159122.0013_001_9705792_3LNsZ8qjEM/20/pdata/1/auditp.txt
$$ ##AUDIT TRAIL=  $$ (NUMBER, WHEN, WHO, WHERE, PROCESS, VERSION, WHAT)
(   1,<2016-04-30 21:12:43.646 -0700>,<Administrator>,<X>,<go>,<TOPSPIN 2.1>,
      <created by zg
	started at 2016-04-30 21:11:37.661 -0700,
	POWCHK enabled, PULCHK disabled,
       configuration hash MD5:
       21 0F 79 D6 B3 7B B4 F6 88 20 88 DB 03 48 BD 9F
       data hash MD5: 64K
       86 D4 41 01 E7 DE 8B 1B 12 75 89 BD DF 39 C3 E6>)
(   2,<2016-04-30 21:12:46.771 -0700>,<Administrator>,<X>,<proc1d>,<TOPSPIN 2.1>,
      <Start of raw data processing
       efp LB = 0 FT_mod = 6 PKNL = 1 PHC0 = 0 PHC1 = 0 SI = 32K 
       data hash MD5: 32K
       AA CD F8 27 28 16 0B 43 17 D3 FA 9D B4 4E F9 DE>)
(   3,<2016-04-30 21:12:47.052 -0700>,<Administrator>,<X>,<proc1d>,<TOPSPIN 2.1>,
      <pk PHC0 = 92.18628 PHC1 = 0 
       data hash MD5: 32K
       C4 BA D3 ED 6A 28 B0 0A 7A 18 C8 12 5D A5 AC B6>)
(   4,<2016-04-30 21:12:47.161 -0700>,<Administrator>,<X>,<proc1d>,<TOPSPIN 2.1>,
      <abs ABSG = 1 
       data hash MD5: 32K
       23 1A 2A 52 0A 7D 07 07 31 2D F3 BD 98 AC F1 1F>)
(   5,<2016-04-30 21:12:47.239 -0700>,<Administrator>,<X>,<proc1d>,<TOPSPIN 2.1>,
      <abs ABSG = 2 
       data hash MD5: 32K
       6B 7B E7 DC E2 6A A5 C0 91 C8 5F D9 FB A2 D7 55>)
(   6,<2016-04-30 21:12:47.302 -0700>,<Administrator>,<X>,<proc1d>,<TOPSPIN 2.1>,
      <abs ABSG = 3 
       data hash MD5: 32K
       4D 1D A1 6A 9B 13 48 73 8F E4 9B 40 06 23 5A 9E>)
(   7,<2016-04-30 21:12:47.364 -0700>,<Administrator>,<X>,<proc1d>,<TOPSPIN 2.1>,
      <abs ABSG = 4 
       data hash MD5: 32K
       8A F0 D0 EF 09 F2 90 52 17 AF 7B 26 75 75 13 98>)
(   8,<2016-04-30 21:12:47.427 -0700>,<Administrator>,<X>,<proc1d>,<TOPSPIN 2.1>,
      <abs ABSG = 5 
       data hash MD5: 32K
       17 25 B1 58 A3 39 BC C3 67 8C 0F 4F 11 13 89 4E>)
$$ ##END=
$$ 
$$ $$ hash MD5
$$ $$ 5E FE 75 DC 4D A0 C1 DE 74 26 F3 A9 20 CF BA B9
##$RELAX= 
##$RELAX= 
##$RELAX= 
##$RELAX= 
##$RELAX= 
##$RELAX= 
##$RELAX= 
$$ Bruker specific parameters
$$ --------------------------
##$DU= <E:\>
##$EXPNO= 20
$$ [...]
150 150 150 150 150 150 150 150
##$TP07= 0
##$TPNAME0= <>
##$TPNAME1= <>
##$TPNAME2= <>
##$TPNAME3= <>
##$TPNAME4= <>
##$TPNAME5= <>
##$TPNAME6= <>
##$TPNAME7= <>
##$TPOAL= (0..7)
0.5 0.5 0.5 0.5 0.5 0.5 0.5 0.5
##$TPOFFS= (0..7)
0 0 0 0 0 0 0 0
##$TUNHIN= 0
##$TUNHOUT= 0
##$TUNXOUT= 0
##$USERA1= <user>
##$USERA2= <user>
##$USERA3= <user>
##$USERA4= <user>
##$USERA5= <user>
##$V9= 5
##$VALIST= <valist>
##$VCLIST= <CCCCCCCCCCCCCCC>
##$VD= 0
##$VDLIST= <DDDDDDDDDDDDDDD>
##$VPLIST= <PPPPPPPPPPPPPPP>
##$VTLIST= <TTTTTTTTTTTTTTT>
##$WBST= 2048
##$WBSW= 25
##$XGAIN= (0..3)
0 0 0 0
##$XL= 0
##$YL= 0
##$YMAX_a= 613859
##$YMIN_a= -521796
##$ZGOPTNS= <>
##$ZL1= 120
##$ZL2= 120
##$ZL3= 120
##$ZL4= 120
##$ABSF1= 14.98509
##$ABSF2= -5.573092
##$ABSG= 5
##$ABSL= 3
##$ALPHA= 0
##$AQORDER= 0
##$ASSFAC= 0
##$ASSFACI= 0
##$ASSFACX= 0
##$ASSWID= 0
##$AUNMP= <proc_prof1d_extract_pilot.lims>
##$AXLEFT= 0
##$AXNAME= <>
##$AXNUC= <1H>
##$AXRIGHT= 0
##$AXTYPE= 0
##$AXUNIT= <>
##$AZFE= 0.1
##$AZFW= 0.1
##$BCFW= 0
##$BC_mod= 0
##$BYTORDP= 0
##$COROFFS= 0
##$CY= 15
##$DATMOD= 1
##$DC= 0
##$DFILT= <>
##$DTYPP= 0
##$F1P= 0
##$F2P= 0
##$FCOR= 0.5
##$FTSIZE= 32768
##$FT_mod= 6
##$GAMMA= 0
##$GB= 0
##$INTBC= 1
##$INTSCL= 1
##$ISEN= 128
##$LB= 0
##$LEV0= 0
##$LPBIN= 0
##$MAXI= 10000
##$MC2= 0
##$MEAN= 0
##$ME_mod= 0
##$MI= 0
##$NCOEF= 0
##$NC_proc= -8
##$NLEV= 6
##$NOISF1= 0
##$NOISF2= 0
##$NSP= 0
##$NTH_PI= 0
##$NZP= 0
##$OFFSET= 14.98509
##$PC= 1
##$PHC0= 92.18628
##$PHC1= 0
##$PH_mod= 1
##$PKNL= yes
##$PPARMOD= 0
##$PPDIAG= 0
##$PPIPTYP= 0
##$PPMPNUM= 2147483647
##$PPRESOL= 1
##$PSCAL= 4
##$PSIGN= 0
##$PYNMP= <proc.py>
##$REVERSE= no
##$SF= 400.02
##$SI= 32768
##$SIGF1= 0
##$SIGF2= 0
##$SINO= 400
##$SIOLD= 32768
##$SPECTYP= <>
##$SREGLST= <1H.CDCl3>
##$SSB= 0
##$STSI= 32768
##$STSR= 0
##$SW_p= 8223.68421052631
##$SYMM= 0
##$S_DEV= 0
##$TDeff= 65536
##$TDoff= 0
##$TI= <>
##$TILT= no
##$TM1= 0
##$TM2= 0
##$TOPLEV= 0
##$USERP1= <user>
##$USERP2= <user>
##$USERP3= <user>
##$USERP4= <user>
##$USERP5= <user>
##$WDW= 1
##$XDIM= 32768
##$YMAX_p= 451145105
##$YMIN_p= -676259
##$CURPLOT= <Network HP LaserJet P1505>
##$CURPRIN= <$Network HP LaserJet P1505>
##$DFORMAT= <normdp>
##$LAYOUT= <+/1D_H.xwp>
##$LFORMAT= <normlp>
##$PFORMAT= <normpl>
##$SURQMSG= 1
$$ End of Bruker specific parameters
$$ ---------------------------------
##NTUPLES= NMR SPECTRUM
##VAR_NAME=  FREQUENCY,     SPECTRUM/REAL,   SPECTRUM/IMAG
##SYMBOL=    X,             R,               I
##VAR_TYPE=  INDEPENDENT,   DEPENDENT,       DEPENDENT
##VAR_FORM=  AFFN,          ASDF,            ASDF
##VAR_DIM=   32768,         32768,           32768
##UNITS=     HZ,            ARBITRARY UNITS, ARBITRARY UNITS
##FACTOR=    0.250966925370066, 1,           1
##FIRST=     8223.43324360094, 30738,        178240
##LAST=      0,             6373,            -208167
##MIN=       0,             -676259,         0
##MAX=       8223.43324360094, 451145105,    0
$$ Real data points
##PAGE= N=1
##DATA TABLE= (X++(R..R)), XYDATA
$$ [...]
$$ plain form
19561 -186190 185428 -37894 -111731 -12995 -393558 312785 260367 68722 354664 -76464 -135208
19550 -135208 -197040 -9633 -296818 70269 -96373 62053 -160106 -55881 -293235 147734 -273913
19538 109025 -87190 28531 48121 261580 23903 201462 -53957 87612 326292 133970 -139804
19526 -430957 186911 -45874 123414 42448 94663 41032 -379395 -80804 -314136 -91963 141893
19514 -179620 -194524 -957 -198942 -57895 106833 -3038 -243954 -207340 -132212 128067 69513
19503 69513 -157027 286764 3033 -156354 -110845 42964 -62019 172421 -293719 76557 -8496
19491 -9627 -34802 -134287 -175873 -271962 -303946 -18347 -214100 -83414 62627 -9321 88117 199277
19479 199277 -331251 -83898 -75514 300043 -188248 198284 -167574 -128271 -423682 106048
$$ packed form
19561a86190A85428c7894p3837a2995l80563C12785n2418F8722K85942g6464n8744
19550a35208o1832i633k87185G0269i6373F2053a60106e5881k37354A47734b73913
19538A09025h7190B8531J9590K13459B3903J77559e3957H7612K38680A33970a39804
19526d30957A86911d5874A23414D2448N2215D1032c79395h0804k33332i1963A41893
19514a79620j4904i57j97985e7895A06833c038k40916L6614P5128A28067n8554
19503F9513a57027B86764C033a56354M5509D2964f2019A72421b93719G6557h496
19491i627k5175r9485m1586r6089l1984a8347j95753h3414F2627i321H8117J11160
19479A99277c31251h3898Q384C00043a88248A98284a67574L9303k95411A06048
$$ plain form
19468 -239993 54756 -171083 -39401 -112147 -106240 -203521 111105 -77840 -210881 -297046 50440
19456 90085 230611 -97716 -398610 -33526 18249 361943 -276155 -155841 -493621 -195145
19445 -234988 -69360 -56769 -61385 62846 -177551 127506 -6208 265544 -63298 -112718 -153109
19434 -153109 -103365 -13579 -271215 -112203 27135 -27013 -101793 -83176 -245580 -102461 -313355
19423 -313355 -136672 -180325 -212401 63618 87216 -287087 -157889 35372 43067 -15448 -92362
19412 -92362 279982 -28423 313576 -48624 -120417 -141003 375219 262050 219716 -281729 -4732
19400 -96731 100568 -209310 317816 7644 -146592 -57959 -138660 -74189 -46399 43167 -337209
19388 -72285 167266 -1967 130625 -199488 -15373 -259049 -107655 -96220 36260 -255770 226750
$$ packed form
19468b39993E4756a71083c9401p2746N907r7281A11105g7840j33041q6165E0440
19456I0085J40526i7716l00894c3526A8249L43694b76155J20314l37780a95145
19445b34988f9360J2591m616F2846a77551A27506f208B65544f3298m9420m0391
19434a53109M9744a3579k57636a12203B7135b7013p4780J8617j62404a02461k10894
19423c13355a36672m3653l2076F3618K3598b87087J29198C5372P695a5448p6914
19412i2362B79982b8423C13576d8624p1793k0586C75219j13169m2334b81729d732
19400i6731A00568b09310C17816G644a46592e7959q0701O4471K7790D3167c37209
19388g2285A67266a967A30625a99488a5373k43676a07655J1435C6260b55770B26750
$$ plain form
19376 -226754 58698 -218675 -82396 93456 -35264 -102366 -177471 115476 -306937 -82374 -133697
19365 -133697 300732 -336563 -3691 12075 -67726 322437 -444680 250858 -230798 -204431
19355 -204431 28048 124457 -52671 132884 139087 80122 25526 -143763 -326014 964 -1299 21592
19342 102049 -189712 -36748 20626 -44437 23800 23404 83719 -46501 -446963 -130320 -134231
19331 -134231 -28544 -205080 366794 -63481 265535 -346718 -65613 -14007 -24024 191187
19320 -103178 -232364 -62281 -190056 -112432 -266773 -222159 -52154 15961 3862 333 98618
19309 98618 -22364 -282624 -57559 14935 -93233 135992 -252267 -218059 -82420 3287 116965
19298 116965 54654 -390397 8509 155186 -169963 -26574 -69393 343127 -291482 30483 -6905
$$ packed form
19376b26754E8698b18675h2396I3456c5264o7102p5105A15476c06937h2374n1323
19365a33697C00732c36563c691A2075f7726C22437d44680B50858b30798K6367
19355b04431B8048R6409e2671A32884O203n8965B5526a43763j82251I64a299B1592
19342A02049a89712c6748B0626d4437B3800l96O0315d6501m00462a30320l911
19331a34231b8544j76536C66794f3481B65535c46718f5613a4007j0017A91187
19320a03178j29186f2281j27775P7624j54341M4614e2154A5961C862C33R8285
19309I8618b2364k60260e7559A4935i3233A35992b52267L4208h2420C287J13678
19298A16965E4654c90397H509J46677a69963b6574m2819C43127b91482C0483f905
$$ plain form
19286 -3752 -60288 -128043 -188811 8520 44203 2602 -26804 77402 -83685 -43772 236277 -401755
19273 12497 55798 12887 -233968 -6595 -159052 -51735 208909 781 13715 -70005 177144
19261 103637 149023 -278910 -167919 68985 153264 158576 -251326 -441031 199000 328360
19251 328360 -228897 237220 -38332 -259351 -319625 -104933 -411126 -156451 -126153 219401
19240 -163877 -165306 -256967 10031 -236981 -52161 -37192 -195281 -288874 -72973 90124 -155356
19228 -410591 -96972 55877 369150 -111753 -14766 86643 -126405 -113902 -40721 -140327 -166815
19217 -166815 149194 -7623 51710 -14846 34819 228278 65594 235772 96384 -160606 253375
19205 59103 -301538 19023 -87452 -112549 38115 211643 -224611 14174 246228 104358 237238
$$ packed form
19286c752n6536o7755o0768H520L5683B602b6804G7402h3685L9913B36277d01755
19273A2497M3301A2887b33968f595j52457e1735B08909G81J2934g0005A77144
19261A03637M5386b78910J10991F8985Q4279N312b51326j89705A99000J29360
19251C28360b28897B37220c8332k21019o0274a04933l06193a56451L0298B19401
19240a63877j429r1661A0031b36981e2161J4969j58089r3593g2973I0124a55356
19228d10591i6972E5877L13273a11753a4766H6643a26405J2503d0721r9606k6488
19217a66815A49194g623E1710a4846C4819J93459F5594J70178I6384a60606B53375
19205E9103c01538A9023h7452k5097C8115J73528b24611A4174K32054A04358J32880
$$ plain form
19194 237238 -134690 152321 34301 -11062 10034 59737 157048 -128477 -221481 109702 -318588
19182 -103717 43070 -185721 -156782 -256778 -46373 335 -250188 69798 -141128 -273302 76824
19170 27208 -264146 -161020 -182386 -264892 -51950 -230159 -126814 -499909 -313207 -49979
19159 -48288 -145918 -125477 -119364 3709 86718 5430 -67838 -457236 -27147 -202055 238579 -302689
19146 -6943 -112799 40706 112753 -86463 3946 71035 27445 -95937 -189320 -10391 -150399 -154308
19134 -154308 8432 31132 -102282 -41080 -305624 -97297 -265941 -72063 87917 293503 -30302
19122 -151046 -63646 -113286 -179289 22343 -154977 -118875 -262866 -11148 -184173 -220815 225044
19110 131934 -134305 -172168 -154931 -96450 -224873 -165 -247821 89575 9786 -56481 167323
$$ packed form
19194B37238a34690A52321C4301a1062A0034M9703R7311a28477r3004A09702c18588
19182a03717D3070a85721K8939r9996d6373C35b50188F9798a41128j32174G6824
19170B7208b64146J03126k1366q2506e1950j78209J03345l73095J86702d9979
19159d8288r7630K0441O113C709Q3009E430f7838l89398b7147j74908B38579c02689
19146f943j05856D0706P2047h6463C946O7089B7445i5937r3383a0391j40008l909
19134a54308H432K2700a02282d1080k64544i7297j68644g2063H7917K05586c0302
19122a51046f3646m9640o6003B2343a54977L6102j43991a1148j73025l6642B25044
19110A31934a34305l7863J7237N8481j28423a65k47656H9575I786e6481A67323
$$ plain form
19098 -63438 -98011 128053 -256222 -171491 -91529 -140595 82396 102811 -102074 92060 65297
19087 65297 -10725 194563 -499836 -319154 -134694 178775 235259 55008 -388246 5846 81081
19076 81081 -161494 225114 -3026 -161927 -380466 -16364 -100088 -128506 101182 -49818 -336202
19065 -336202 -68623 9345 -165419 -24352 101846 -170963 -40522 -230427 -20286 137082 267345
19054 267345 -74423 -289968 164020 -137965 235660 -380664 -148690 -119173 -246058 112484
19043 -329910 53612 -173640 92416 42451 91236 -74861 -199367 -158207 189994 21339 23127
19032 23127 134681 160573 -131661 339129 -50600 109652 -119268 251506 -43104 -173600
19022 -173600 38611 13586 -217312 404092 237987 -186652 44473 52975 381031 178086
$$ packed form
19098f3438l4573A28053b56222Q4731P9962m9066H2396K0415a02074I2060k6763
19087F5297a0725A94563d99836J80682a34694A78775N6484E5008c88246E846P5235
19076H1081a61494B25114c026j58901k18539a6364q3724k8418A01182d9818k86384
19065c36202f8623I345a65419b4352A01846a70963d0522j89905b0286A37082J30263
19054B67345g4423k15545A64020a37965B35660c80664a48690K9517j26885A12484
19043c29910E3612a73640I2416D2451M8785g4861j24506M1160A89994B1339J788
19032B3127J11554K5892a31661C39129e0600A09652a19268B51506d3104j30496
19022a73600C8611A3586b17312D04092j66105a86652D4473Q502L28056A78086
$$ plain form
19011 94482 -191060 -27872 -65729 -115472 -220650 65363 235333 150000 183287 -180413 168252
18999 94479 -273176 -41815 162093 -159519 -185197 -88724 -187692 94247 98232 63562 220401
18988 220401 301017 -125332 -68568 194858 25209 74566 -162186 -340969 -57154 151797
18977 71850 -65767 -41658 -64707 105012 -15782 -278991 175645 79677 -75554 -118952 -53300
18965 -207535 -2563 29843 164546 -261945 -91952 -142090 349504 141456 -40010 30445 146391
18954 146391 86075 79972 -122420 97308 294879 -92231 173815 -28456 -16689 -254264 -8097
18942 120699 163770 38302 342103 -282497 -132646 -52884 -161902 -430333 -279267 38571
18931 186228 -56780 -22652 -119722 -246950 67899 -44017 -49035 -53317 10237 257610 267285 22265
$$ packed form
19011I4482a91060b7872l7857m9743j05178F5363J69970q5333L3287a80413A68252
18999I4479b73176d1815A62093a59519k5678h8724r8968I4247L985l4670J56839
18988B20401Q0616a25332N6764A94858B5209M9357a62186j78783e7154A51797
18977G1850f5767K4109k3049A05012a5782k63209A75645G9677g5554m3398e3300
18965b07535b563B9843J34703b61945i1952n0138C49504A41456d0010C0445J15946
18954A46391o0316o103a22420I7308J97571i2231A73815b8456J1767k37575h097
18942A20699M3071C8302L03801b82497a32646e2884j09018k68431J51066C8571
18931A86228e6780b2652r7070j27228F7899d4017n018m282A0237K47373R675B2265
$$ plain form
18918 -24217 100275 -345628 61092 -56396 -286335 -235393 80639 -111724 -287292 -49387 -104542
18907 -104542 -171354 -219978 158645 -72406 117118 141144 -163308 -404558 -115058 -80356
18897 -80356 -28518 -144171 8784 -64070 -133430 -138692 -68752 -122371 -418327 -115955 -264217
18886 -264217 -165472 -533715 -120270 -223408 -116344 19008 -91798 -23168 -195382 -101077
18876 -101077 79660 15100 93577 103043 89852 -74760 -67262 -208437 -143422 -23161 95184 -158608
18863 -39942 97433 -150012 -98395 -57533 17469 170845 223174 -224838 128276 99125 -133738
18851 68859 -233182 -59379 -154718 100801 -163442 -216294 -119366 300561 -163947 -164075 -123347
18840 -123347 439 -128234 -187483 -188654 -336954 51923 202567 -7556 100247 -205897 -367356
$$ packed form
18918b4217A00275c45628F1092e6396k29939N0942H0639a11724j75568d9387n5155
18907a04542o6812m8624A58645g2406A17118K4026a63308k41250a15058L4702
18897h0356b8518j15653H784f4070o9360n262f8752n3619k95956a15955j48262
18886b64217R8745l68243a20270j03138J07064A9008i1798b3168j72214R4305
18876a01077G9660A5100P8477R466j3191g4760P498j41175O5015b3161I5184a58608
18863c9942I7433a50012N1617M0862A7469J53376N2329b24838A28276k9151a33738
18851F8859b33182e9379r5339A00801a63442n2852R6928C00561a63947j28M0728
18840a23347D39a28234n9249j171j48300E1923J50644g556A00247b05897j61459
$$ plain form
18829 -367356 -174473 97927 -123289 -16045 -8171 181061 -110257 -103634 86495 51008 -143743
18817 -172336 35635 262465 176495 392108 -376873 75711 147725 -190932 -107089 61423 42936
18806 42936 268291 -1529 -108449 -195508 -66471 -107129 -251475 44314 -169339 -94409 -29828
18794 -169288 -26692 50575 -33612 -69184 264535 105072 -25000 -44602 -70665 -268201 152841
18782 -189475 1740 -122806 48693 136633 -379769 -58674 -277288 -171141 -250323 -352562 -238528
18771 -238528 -240529 33295 120080 45825 -105135 88778 160458 135647 -114174 22279 94284
18760 94284 -214773 205872 -247709 -160550 -251473 207754 45415 116485 -265760 -148719
18750 -148719 -226774 -140189 -169891 -23096 -21230 -28823 -90990 42156 187670 -62374 -45583 -51023
$$ packed form
18829c67356a74473I7927a23289a6045P874A81061a10257O623H6495l5487a43743
18817a72336C5635K26830q5970K15613c76873G5711P2014a90932Q3843F1423j8487
18806D2936K25355a529j06920q7059f6471m0658j44346D4314a69339P4930b9828
18794a69288b6692E0575c3612l5572B64535A05072b5000j9602k6063j97536A52841
18782a89475A740a22806D8693Q7940c79769e8674k18614J06147p9182j02239J14034
18771b38528k001C3295Q6785D5825a05135H8778P1680k4811a14174B2279P2005
18760I4284b14773B05872b47709Q7159r0923B07754D5415P1070b65760J17041
18750a48719p8055Q6585k9702b3096J866p593o2167D2156J45514f2374J6791n440
$$ plain form
18738 -51023 -248789 -66251 173342 26409 120221 12523 -8571 -218189 -523700 55676 -245762
18726 101353 185237 194965 -175414 -30026 -143198 -309155 -255294 -79307 215328 -18188 20204
18714 -23597 102564 190092 37886 -101102 62403 61954 -261076 68672 18886 -107382 34126
18702 -49912 75137 117335 -77042 -177416 -140764 -269482 259766 178187 148636 28693 488649
18691 488649 -365799 66966 53668 -188497 -367627 267443 -68931 -11095 -64241 -7998 32254
18679 -207630 279656 -4021 149985 -14659 7009 335430 -173911 -191417 294215 16389 -273991
18667 58963 -74151 -83410 7116 -88716 -71579 163732 -169164 180248 -110612 -128059 62634
18655 -202855 19784 -33183 -122681 -135156 -200549 251734 40311 36737 -190966 -31523 -156617
$$ packed form
18738e1023j97766f6251A73342B6409R3812A2523h571k09618l05511E5676b45762
18726A01353Q3884R728a75414c0026j13172j65957N3861g9307B15328a8188B0204
18714b3597A02564Q7528C7886a01102F2403m49b61076F8672A8886a07382C4126
18702d9912G5137M2198g7042j00374L6652j28718B59766q1579k9551B8693M59956
18691D88649c65799F6966j3298a88497j79130B67443f8931a1095n3146g998C2254
18679b07630B79656d021A49985a4659G009L28421a73911j7506B94215A6389b73991
18667E8963g4151r259G116h8716J7137A63732a69164A80248a10612j7447F2634
18655b02855A9784c3183q9498j2475o5393B51734D0311l574a90966c1523j25094
$$ plain form
18644 -156617 -96626 -27199 -20080 -70394 155346 -166355 -173136 -179778 255916 155671 -416353
18632 -276786 -225008 -289768 -40744 -499657 -80351 -58866 -98028 -101451 2776 141324 -295262
18620 -424894 -132311 51919 162276 -142706 -452735 -108468 -403712 -101514 -221388 -192769
18610 -192769 -162485 -266519 4754 95758 -169799 -150452 -48584 81174 -91000 -74225 -2018
18598 -475791 -64859 24028 172278 -428024 194663 81423 -286042 -139874 -136518 217443
18587 1221 -208979 -141485 -50125 -118661 282447 -144761 -243696 464955 197905 -244072 -8153
18575 36500 -332263 -30449 -191530 -118263 157398 -115859 110629 82626 -43180 28007 -212579
18563 -252630 74515 -41961 238012 23209 -203334 140284 -167179 -69626 -310112 -77093
$$ packed form
18644a56617N9991b7199P119n0314A55346a66355o781o642B55916j00245d16353
18632b76786N1778o4760d0744m58913h0351K1485l9162l423B776J38548b95262
18620d24894a32311E1919J10357a42706l10029a08468k95244a01514j19874K8619
18610a92769L0284j04034D754R1004a69799J9347d8584H1174i1000J6775b018
18598d75791f4859B4028J48250d28024A94663H1423b86042a39874L356B17443
18587A221b08979O7494e0125o8536B82447a44761r8935D64955A97905b44072h153
18575C6500c32263c0449j61081P3267A57398a15859A10629k8003d3180B8007b12579
18563b52630G4515d1961B38012B3209b03334A40284a67179f9626k40486g7093
$$ plain form
18552 28109 151324 -250081 43700 -109707 16920 4240 68161 -222959 82401 236549 128515
18541 128515 166437 -132798 -245619 -155241 395367 -57583 -236859 7619 -302074 189240
18530 112803 -108752 10472 96859 -88395 5252 -35475 115607 34755 160382 66168 19020
18518 -28102 -82660 -173247 -60440 -436897 -286134 -347342 45505 103175 -216296 160374 137498
18507 137498 66790 -189218 238021 -177993 32120 -146275 94 53258 -89241 -61381 -82889
18496 -82889 -358266 -198011 37950 81911 31265 -71389 60441 217959 -23583 -63308 -32505
18485 -32505 -211186 108894 133070 -148 124541 -254564 -201907 22621 -366351 54509 -270100
18473 -71308 96524 -329955 -114596 -245265 -2333 -162603 82120 -409530 153980 -228858
$$ packed form
18552B8109J23215b50081D3700a09707A6920D240O3921b22959H2401J54148j08034
18541A28515L7922a32798j12821R0378C95367e7583j79276G619c02074A89240
18530A12803a08752A0472Q6387h8395E252c5475A15607C4755J25627F6168A9020
18518b8102n4558r0587f0440l76457J50763o1208D5505N7670b16296A60374k2876
18507A37498F6790a89218B38021a77993C2120a46275I4N3164h9241K7860k1508
18496h2889k75377J60255C7950M3961C1265g1389F0441J57518b3583l9725L0803
18485c2505j78681A08894K4176a48A24541b54564N2657B2621c66351E4509b70100
18473g1308I6524c29955a14596j30669b333j60270H2120d09530A53980b28858
$$ plain form
18462 63042 76436 9789 73197 212045 -132519 -279615 111568 -226317 -111468 -248100
18452 -248100 288883 22330 -295993 -118456 9956 41028 -79155 -212516 -57500 -72080 60681
18440 -10257 -163444 88198 -128159 -47292 -271773 154483 95831 -106312 115506 28880
18429 -16975 43200 41474 -43149 -238943 -260339 -189647 -61084 -86408 25505 -212751 206919
18417 -93448 61886 35762 -30299 -79876 75035 -43545 -109228 47475 -83156 79742 14147 62341
18405 62341 -22267 -120181 -48204 181135 174439 -420668 -31322 -84317 -85312 101664 -98662 -16347
18392 77355 125806 -78114 -29085 -228958 55496 112329 188857 -22383 -530569 239413 143664
18381 143664 -100314 150058 76539 336803 -228098 -36143 -133666 296919 -228575 -115075
$$ packed form
18462F3042J3394I789O3408J38848a32519j47096A11568b26317a11468j36632
18452b48100B88883B2330b95993a18456I956L1072g9155j33361e7500j4580F0681
18440a0257j53187H8198a28159d7292k24481A54483n8652a06312A15506B8880
18429a6975D3200j726d3149j95794k1396P0692f1084k5324B5505b12751B06919
18417i3448F1886k6124c0299m9577G5035d3545o5683D7475h3156G9742A4147M8194
18405F2341b2267r7914d8204A81135o696d20668c1322n2995r95A01664i8662a6347
18392G7355M8451g8114b9085j99873E5496N6833P6528b2383n08186B39413r5749
18381A43664a00314A50058p3519K60264b28098c6143r7523B96919b28575J13500
$$ plain form
18371 -115075 195098 49406 49781 50315 -38513 35361 39526 -91323 44174 376046 -157378 -241693
18359 -241693 -28850 118110 69051 168928 -85245 -173447 -101113 -46592 -162610 102766 128249
18348 128249 -281166 91081 159176 -68767 -23287 225630 -66572 148072 -97185 15928 -306876
18336 -50529 -95436 -251163 -171852 -121777 -79736 -95569 -103388 -26578 115392 -113263 -127069
18325 -127069 52679 279837 -253244 -103065 77818 -244183 81732 71037 -13895 132687
18314 -84049 -31844 336991 -166313 -49708 -30500 112320 -132329 208826 -250197 -247901 3171
18302 -214328 260445 -140594 -225273 -159444 -161325 -80935 149776 53868 380423 -229721 -57891
18290 208601 -107421 73745 145107 -132538 -99329 -25772 14020 55576 37002 -344337 -85307
$$ packed form
18371a15075A95098D9406L75N34c8513C5361M165i1323D4174L31872a57378q4315
18359b41693b8850A18110m9059R9877h5245q8202P2334d6592j16018A02766K5483
18348A28249b81166I1081O8095f8767b3287B25630f6572A48072i7185A5928c06876
18336e0529m4907j55727P9311N0075M2041j5833p819b6578A15392a13263j3806
18325a27069E2679K27158b53244a03065G7818b44183H1732j0695a3895A32687
18314h4049c1844C36991a66313d9708J9208A12320a32329B08826b50197K296C171
18302b14328B60445a40594q4679O5829j881Q0390A49776E3868L26555b29721e7891
18290B08601a07421G3745P1362a32538L3209b5772A4020M1556j8574c44337h5307
$$ plain form
18278 -193307 1173 -35857 -313862 120191 129212 7933 10882 -268052 -65739 -40189 -19422 94158
18265 -124862 78847 107038 -34618 -93483 1770 121255 -178158 52062 13711 -126674 69386
18253 -286977 -214584 -125215 -226518 -201921 -197829 35839 -38746 -63846 -30214 -215119 317825
18241 129883 -49157 -278508 -84918 -7263 -323448 136398 -283311 -47856 157501 125179 -201235
18229 -37613 58684 305816 13501 127610 39626 -324152 162887 132251 308637 25888 309470
18218 309470 -160348 82540 181703 -279166 -36459 -121708 33416 -449313 -28804 236825 -342308
18206 17127 281878 -89045 54164 -45972 -230645 -24675 38176 55877 -365653 -16047 -74211
18195 -74211 -162323 -354695 -5971 145031 -209571 4933 -277877 -141043 -327031 -211993 62755
$$ packed form
18278a93307A173c5857k78005A20191R021G933K949b68052f5739K5550a9422I4158
18265a24862G8847K8191c4618n8865A770J19485a78158E2062A3711a26674F9386
18253b86977P2393Q9369j01303K4597M092C5839c8746k5100c0214j84905C17825
18241A29883d9157k29351h4918g263l16185A36398b83311d7856A57501l2322b01235
18229c7613E8684K47132A3501J14109C9626c24152A62887l0636J76386B5888K83582
18218C09470a60348H2540R9163b79166c6459q5249C3416d49313b8804B36825c42308
18206A7127K64751h9045E4164d5972j84673b4675C8176J7701c65653a6047n8164
18195g4211q8112j92372e971A45031b09571D933b77877J36834j85988J15038F2755
$$ plain form
18183 -96661 -114029 -221106 143978 -222549 -36593 -269568 164705 206735 -53932 -57123 103588
18171 409013 -111636 278098 -286443 -229527 31943 -189976 29677 -25022 -377629 214019
18160 1803 -247964 -87729 5457 238933 -265903 58343 -49274 14128 36240 8080 247999
18149 247999 -143891 219910 -214746 -9524 -47401 100857 -5820 182738 -13225 170903 -157393
18137 56499 86645 -72470 -146834 -147076 -279137 -119095 -214415 -49760 41577 -221432 164406
18125 240585 -146894 -311692 -115409 266870 -193329 221510 -131629 -35154 38302 108314
18115 108314 -145763 62739 -305788 -173488 169488 -137982 149705 -111744 50402 -196979
18104 -44295 -123589 -122030 71462 -31333 146659 269307 -77711 249019 -109431 204212 -55790
$$ packed form
18183i6661j7368j07077A43978b22549c6593k32975A64705M2030e3932l191A03588
18171D09013a11636B78098b86443N6916C1943a89976B9677b5022l52607B14019
18160A803b47964h7729E457K33476b65903E8343d9274A4128K2112H080K39919
18149B47999a43891B19910b14746i524l7877A00857e820A82738a3225A70903a57393
18137E6499L0146g2470p4364k42j32061a19095r5320d9760D1577b21432A64406
18125B40585a46894j64798a15409B66870a93329B21510a31629c5154C8302P0012
18115A08314a45763F2739c05788J32300A69488a37982A49705a11744E0402a96979
18104d4295p9294J559G1462c1333A46659J22648g7711B49019a09431B04212e5790
$$ plain form
18092 -326176 -189736 287645 -157437 61365 -47956 -1303 -249107 -12247 -129396 -6805 -24366
18081 -24366 102447 -308549 225203 448797 37604 -247883 -346431 146322 138 -19616 -42159
18070 -42159 -216317 -39227 51838 -44729 20013 -50689 -90501 -256083 34726 -256228 -59804
18058 56669 252769 -340180 128900 215002 -154024 -143525 -464247 -211109 9906 89715 -1984
18046 -452674 -309374 127903 114519 209689 -175462 137001 245866 -55512 -54040 139779
18035 -220366 76316 -53062 -250293 -18069 2290 -106022 49858 -135626 -119238 16791 310013
18024 310013 156770 -29771 356325 138403 56821 -374968 -103600 84906 -330254 -162350
18013 -22132 -7418 -75460 35052 -166904 50999 -203424 -152846 -170120 -105080 150109 -175114
$$ packed form
18092c26176J36440B87645a57437F1365d7956a303k47804a2247j17149f805j7561
18081b4366A02447c08549B25203K23594C7604b47883r8548A46322A38a9616k2543
18070d2159j74158c9227E1838d4729B0013e0689l9812j65582C4726b56228e9804
18058E6669J96100c40180A28900Q6102a54024J0499l20722b11109I906P9809a984
18046d52674J43300A27903j3384R5170a75462A37001J08865e5512J472A39779
18035b20366G6316e3062j97231a8069B290a06022D9858a35626J6388A6791K93222
18024C10013j53243b9771C56325A38403E6821c74968a03600H4906c30254a62350
18013b2132g418o8042C5052a66904E0999b03424N0578j7274O5040A50109a75114
$$ plain form
18001 202222 -13218 248433 240129 -64360 -452636 -207039 -133705 14853 -401043 82992 67724
17990 67724 -2339 -154134 -319942 -21917 -152595 134966 267412 90206 -158606 229774
17979 -188257 306482 15164 -148062 336419 -204877 -97442 255669 -182191 321417 156008
17968 167120 -148430 -127948 215754 9191 -31264 -130453 71069 179075 -97549 102415 238734
17957 238734 163664 -300282 27529 -114535 -156960 205111 14127 449103 148311 205454
17947 205454 52977 -154317 -19151 30281 137892 -40476 583 126770 43960 172016 79038
17935 15614 169367 -87242 218357 144441 72325 88535 275798 -66027 -2954 131268 -38287
17923 -291227 29533 168228 -160467 -227462 69456 -72309 -130169 -80302 -90664 55339 136471
$$ packed form
18001B02222a3218B48433q304f4360l88276b07039P3334A4853d01043H2992j5268
17990F7724b339j51795j65808b1917j30678A34966J32446I0206a58606B29774
17979a88257C06482A5164a48062C36419b04877i7442B55669a82191C21417A56008
17968A67120a48430K0482B15754I191c1264r9189G1069J08006i7549A02415J36319
17957B38734p5070c00282B7529a14535m2425B05111A4127M34976A48311N7143
17947B05454E2977a54317a9151C0281J07611d0476E83J26187D3960J28056G9038
17935A5614J53753h7242B18357p3916p2116J6210J87263f6027b954A31268c8287
17923b91227B9533J38695a60467o6995F9456g2309n7860M9867j0362E5339Q1132
$$ plain form
17912 136471 -139683 -296078 112101 204147 -71275 89945 -49793 -71304 -111326 -105917 -292201
17901 -292201 -87492 392145 -174755 116299 36273 166372 144253 26277 162724 -206867
17890 -120096 45048 245641 -154033 -96569 67859 -78497 -12836 -71276 -200989 -64684 118620
17878 -265765 39850 8058 -116478 204213 34035 -204644 -333757 -23970 -52188 -45364 175936
17866 -141534 50183 -32606 -183372 205240 177624 24661 -425622 63871 46406 -62394 6114
17854 205339 -109662 126894 -175212 -75557 -276218 40526 143801 118209 363823 42328
17843 -56638 63517 -111270 61176 205181 198503 -126119 -122469 -186642 -29815 -33019 293789
17831 189 224709 72912 1198 185061 57094 -13973 -91783 110516 -23800 -69473 -28486 142081
$$ packed form
17912A36471a39683j56395A12101R2046g1275H9945d9793k1511m0022N409j86284
17901b92201h7492C92145a74755A16299C6273J30099k2119B6277J36447b06867
17890a20096D5048K00593a54033N7464F7859g8497a2836n8440j29713f4684A18620
17878b65765C9850H058a16478B04213C4035b04644j29113b3970k8218O824A75936
17866a41534E0183c2606j50766B05240k7616B4661d25622F3871j7465f2394F114
17854B05339a09662A26894a75212g5557k00661D0526J03275k5592K45614D2328
17843e6638F3517a11270F1176J44005o678a26119L650o4173b9815l204B93789
17831A89K24520G2912A198J83863E7094a3973p7810A10516b3800m5673b8486A42081
$$ plain form
17818 -2922 -266040 -127990 39617 219799 -154632 134561 -71168 -83213 57482 -45113 -104871
17807 -104871 -149034 -211895 -210463 181297 87836 107653 21004 -47312 85030 -4361 -88659 97258
17794 -161822 -24042 -78080 -41294 263876 -196208 -153826 345853 -137859 -87907 177969
17783 363537 -255360 -413799 -198636 -223803 -20335 -162196 -4477 -122562 43053 -266899
17772 -175480 -44583 -22638 -63768 169442 -19351 114086 -102265 129342 63111 55223 79909
17761 79909 -113954 -13491 -60370 273767 26428 226289 68534 -187240 71514 16161 -11348
17749 -199454 -106297 -78896 410372 -134531 76260 58604 41378 189533 307655 -32942 -178882
17738 -178882 408970 56608 21491 9669 121312 118971 129119 31919 87485 1505 92662 177638
$$ packed form
17818b922k63118a27990C9617J80182a54632A34561g1168j2045E7482d5113n9758
17807a04871m4163o2861J432A81297H7836J9817B1004d7312H5030d361q4298I7258
17794a61822b4042n4038L6786B63876a96208M2382C45853a37859M9952A77969
17783C63537b55360j58439a98636k5167b0335j41861d477j18085D3053b66899
17772a75480d4583K1945m1130A69442a9351A14086a02265A29342F3111p888K4686
17761G9909a13954a3491m6879B73767B6428J99861F8534a87240G1514A6161a1348
17749a99454R3157K7401D10372a34531G6260j7656j7226J48155J18122c2942j45940
17738a78882D08970E6608B1491I669J11643k341J0148C1919N5566A505R1157Q4976
$$ plain form
17726 177638 -35769 -23616 -939 22656 -32401 264753 182529 75878 18929 20399 -2177 -5582
17714 -5582 -263152 -148946 33705 55470 -23349 86465 -98530 72486 -230891 55831 166854
17703 166854 -186057 -132363 190988 116558 -75577 46417 -124891 300346 120936 -49425
17692 110498 -165368 -93855 146656 -344689 228264 -220179 -138634 -87751 192062 69343
17681 -130223 -18587 272575 99051 52145 -28846 232880 71427 -25442 193329 -29382 53199
17669 -58959 -67193 -67501 -201736 -223156 -70465 18782 351419 183844 180722 -98087 24668 -175778
17656 77364 286224 26650 156196 -5733 181175 154118 113415 15526 80667 51274 -29589
17644 83216 -144909 -242901 -216996 -68401 96472 118893 240543 47579 -129542 203763 -193316
$$ packed form
17726A77638c5769J2153i39B2656c2401B64753q2224G5878A8929J470b177l405
17714e582k57570J14206C3705K1765b3349H6465i8530G2486b30891E5831J11023
17703A66854a86057N3694A90988p4430g5577D6417a24891C00346A20936d9425
17692A10498a65368P1513A46656c44689B28264b20179Q1545N0883A92062F9343
17681a30223a8587B72575I9051m6906b8846B32880G1427b5442A93329b9382E3199
17669e8959q234l08j34235k1420g0465A8782L32637j67575l122i8087B4668a75778
17656G7364K08860B6650J29546e733A81175k7057m0703A5526O5141k9393b9589
17644H3216a44909r7992K5905f8401I6472K2421J21650D7579a29542B03763a93316
$$ plain form
17632 -47976 -132159 -158616 378288 -154360 -158592 176271 110978 71634 110800 58670 155887
17621 155887 -186944 164786 139999 137973 301273 -29141 261574 133722 -109535 295277
17610 -125551 83875 199348 1469 -13314 113425 293044 182060 -74366 578936 -113965
17599 122912 335332 108510 201055 29612 5031 153822 -1830 143805 -117627 3208 -101843
17587 138534 167817 95651 -12630 176473 105362 129234 -209243 117723 148382 88977 133491
17576 133491 -83541 129194 396499 -122295 198060 -45248 -78570 177763 -6651 -15274 -113973
17565 -113973 119626 37590 94159 64616 39646 24446 -161315 486962 -31208 -34498 95247
17553 3920 95153 90105 -36068 170900 193880 113996 -85165 124993 302436 132200 155155
$$ packed form
17632d7976q4183k6457C78288a54360m232A76271o5293l9344L9166n2130R7217
17621A55887a86944A64786k4787k026J63300b9141B61574j27852a09535B95277
17610a25551H3875J15473A469a3314A13425J79619j10984g4366E78936a13965
17599A22912K12420A08510R2545B9612E031J48791a830A43805a17627C208a01843
17587A38534K9283p2166a2630A76473p1111K3872b09243A17723L0659n9405M4514
17576A33491h3541A29194K67305a22295A98060d5248l3322A77763f651q623r8699
17565a13973A19626C7590N6569k9543k4970j5200a61315D86962c1208l290I5247
17553C920R1233n048c6068A70900K2980p9884h5165A24993J77443A32200K2955
$$ plain form
17542 155155 -242015 -9330 -43340 226022 258265 -140431 100801 43665 522299 175577
17531 90021 267017 350697 51555 102478 105103 127762 234881 -83104 -12931 -135332 194805
17519 221184 50647 -55117 68817 -52117 87090 434649 -165037 2669 457244 136577 -75679
17507 153531 321972 -60759 -166166 -113756 21236 -78763 199336 109474 309010 227578 17706
17495 -18850 -67904 85106 95391 122158 196567 300328 98323 146051 22038 231625 383932
17484 383932 561479 329280 306495 185501 131582 291780 -30220 -106696 549733 269483
17473 279447 189578 36739 179084 381914 3480 -65512 114717 437204 -87257 136342 281565
17462 281565 327111 119471 406960 -20529 250834 140915 299141 -7463 392191 276713
$$ packed form
17542A55155b42015i330l4010B26022L2243a40431A00801D3665M78634A75577
17531I0021J76996Q3680E1555N0923K625K2659J07119h3104a2931j22401A94805
17519B21184E0647e5117F8817e2117H7090L47559a65037B669M54575A36577g5679
17507A53531J68441f0759j05407N2410B1236g8763A99336q9862J99536q1432A7706
17495a8850m9054H5106J0285K6767P4409J03761I8323M7728B2038K09587J52307
17484C83932J77547k32199k2785j20994n3919J60198c0220p6476E49733B69483
17473B79447q9869C6739J42345K02830C480f5512A14717L22487h7257A36342J45223
17462B81565M5546A19471K87489b0529B50834j09919J58226g463C92191j15478
$$ plain form
17452 276713 241175 430772 77418 115859 213754 378092 529658 369687 6024 257199 287252
17441 287252 170328 214472 439177 240282 103791 287948 95240 192528 453419 127773
17430 302884 235677 67359 -99273 164579 389204 327120 343426 141342 -88562 225585 374230
17419 374230 343137 413450 327917 350264 -83134 404311 46006 84083 336184 -187747 252278
17407 -38380 78713 226599 -73087 -10194 362248 172462 561476 -84352 -231941 -16113 38904
17395 492792 -34075 118222 436060 -74184 -38505 242050 128652 146820 168607 -10572 211220
17383 114615 195115 213733 29640 282972 228953 351160 40800 207684 145518 199581 -321877
17371 210541 47929 106090 410256 19980 393069 451354 -41969 247908 113176 251247
$$ packed form
17452B76713l5538J89597G7418L8441R7895J64338J51566j59971F024K51175L0053
17441B87252j16924M4144K24705j98895A03791J84157I5240R7288K60891A27773
17430C02884o7207F7359i9273A64579K24625o2084J6306A41342h8562B25585J48645
17419C74230l1093P0313q5533K2347h3134D04311D6006L8077K52101a87747B52278
17407c8380G8713J47886g3087a0194C62248A72462L89014h4352j47589a6113C8904
17395D92792c4075A18222L17838g4184L5679B42050j13398J8168K1787a0572B11220
17383A14615Q0500J8618B9640K53332n4019J22207D0800J66884o2166N4063c21877
17371B10541D7929N8161L04166A9980L73089N8285d1969B47908A13176J38071
$$ plain form
17361 251247 336669 10329 380284 -35280 -257224 376442 -205502 52368 -153198 110415
17350 289448 128253 189366 712783 -128082 397981 414357 483997 -51771 -232745 417160
17339 240729 -11439 91005 258174 -122283 419607 217788 206250 58410 153033 240598 275917
17328 275917 50638 315328 522182 -102661 161260 11804 -23674 130925 53471 177755
17318 177755 173292 14778 2729 68646 344076 -158329 231574 81950 367727 286979 128987
17306 357770 303465 392982 12043 304670 191943 676433 135033 266770 9480 424526
17296 424526 176783 112973 340577 84123 107272 104486 -225261 66210 248981 371468 -3153
17284 485431 223 429627 400364 379809 28142 336577 183216 410268 325166 391940 336230
$$ packed form
17361B51247Q5422A0329L69955c5280k21944C76442b05502E2368a53198A10415
17350B89448A28253O1113N23417a28082C97981J6376O9640e1771j80974D17160
17339B40729a1439I1005J67169a22283D19607k01819j1538E8410R4623Q7565L5319
17328B75917E0638K64690K06854a02661A61260A1804b3674A30925E3471J24284
17318A77755m463A4778B729O5917K75430a58329B31574H1950K85777q0748A28987
17306C57770n4305Q9517A2043K92627j12727M84490A35033J31737I480M15046
17296D24526A76783o3810K27604H4123K3149k786b25261F6210J82771J22487c153
17284D85431B23M29404k9263k0555B8142L08435j53361K27052q5102O6774n5710
$$ plain form
17273 336230 25074 149519 196425 112779 312737 484800 -129837 427192 331477 116711
17262 240747 471401 588806 229083 101290 110967 320392 336688 146750 217252 -50056
17251 270467 285311 459759 213387 222960 257485 311648 426344 -30356 409265 -150950 151767
17239 270191 415532 540337 387105 409097 185630 289425 215121 397243 559817 59716
17228 156272 330751 216898 497822 -65294 438591 255518 61267 187741 533031 197017
17217 141080 285811 732037 450244 249290 194904 365707 105924 463203 383370 269560
17207 269560 183720 182899 376240 148656 51352 -8384 550039 423433 414874 393854 247575
17196 247575 69973 477217 372736 415824 623425 310739 342919 426536 387520 384339 346640
$$ packed form
17273C36230B5074J24445M6906q3646J99958J72063a29837D27192r5715A16711
17262B40747K30654J17405B29083A01290R677K09425J6296A46750P0502e0056
17251B70467J4844J74448B13387R573L4525N4163J14696c0356D09265a50950A51767
17239B70191J45341J24805j53232K1992A85630J03795p4304J82122J62574E9716
17228A56272J74479j13853K80924f5294D38591j83073F1267J26474L45290A97017
17217A41080J44731M46226k81793k00954n4386J70803A05924L57279p9833j13810
17207B69560q5840q21J93341A48656E1352h384E50039j26606q559k1020j46279
17196B47575F9973M07244j04481M3088K07601C10739L2180Q3617l9016l181l7699
$$ plain form
17185 346640 143413 294995 446851 423601 211572 365793 344404 277310 483630 364024
17175 364024 371979 275216 234524 182266 455786 421153 367602 478768 313206 214870 184406
17164 184406 502754 455475 502745 594549 118172 342718 337096 771799 424377 105235
17153 464585 348117 436866 -121367 219905 193092 226187 359706 590070 334355 644282
17143 644282 445097 767041 434697 440193 326101 348437 642476 493466 250220 289079
17133 289079 393578 312996 530561 370347 581226 558719 186521 629061 421708 333781
17123 333781 247958 346679 359673 457086 286759 296401 242775 487813 596389 387758 388117
17112 388117 387399 513325 688395 445382 475354 563426 475114 467923 412578 413531 824525 619121
$$ packed form
17185C46640A43413J51582J51856k3250B11572J54221k1389o7094K06320j19606
17175C64024P955r6763m0692n2258K73520l4633n3551J11166j65562r8336l0464
17164A84406L18348m7279M7270R1804A18172K24546n622M34703l47422A05235
17153D64585j16468Q8749a21367B19905k6813L3095J33519K30364k55715L09927
17143F44282j99185L21944l32344N496j14092K2336K94039j49010k43246L8859
17133B89079J04499q0582K17565j60214K10879k2507A86521M42540k07353q7927
17123C33781q5823R8721J2994R7413j70327R642n3626K45038J08576k08631L59
17112C88117p18J25926J75070k43013K9972Q8072q8312p191n5345R53M10994k05404
$$ plain form
17100 619121 337682 837576 386440 621853 665792 406996 148784 452140 307068 723856
17090 723856 679255 674606 403990 632101 273554 720840 634748 765184 731902 692169 519729
17079 519729 770797 486727 458678 254440 669242 509788 608725 767407 653467 468411
17069 468411 396248 518812 566003 681570 723916 623353 597841 333175 713021 576066
17059 576066 506207 905500 492990 540796 429299 664681 494852 550490 606742 535790
17049 535790 622249 639346 642573 255211 997389 725946 563499 611370 808447 896172 546434
17038 546434 624500 660412 758625 844666 483605 578653 458018 603383 705183 680412 584711
17027 584711 762164 432328 666035 748795 718222 914281 632568 969668 685521 816223
$$ packed form
17100F19121k81439M99894C86440K35413M3939k58796A48784L03356j45072M16788
17090G23856m4601m649k70616K28111B73554M47286q6092J30436l3282l9733j72440
17079E19729K51068k84070k8049k04238M14802j59454R8937J58682j13940j85056
17069D68411p2163J22564M7191J15567M2346j00563k5512k64666L79846j36955
17059E76066o9859L99293m12510M7806j11497K35382j69829N5638N6252p0952
17049E35790Q6459J7097L227B55211P42178k71443j62447M7871J97077Q7725l49738
17038E46434P8066L5912R8213Q6041l61061R5048j20635J45365J01800k4771r5701
17027E84711J77453l29836K33707Q2760l0573J96059k81713L37100k84147J30702
$$ plain form
17017 816223 749022 655472 683388 900033 769050 568224 663958 955953 967619 888689 567480
17006 567480 938726 952159 878430 836729 822081 1167841 681296 1219160 931663 979087
16996 979087 941845 1037806 754866 1135364 903313 976807 937153 839173 832539 914884 1138544
16985 1138544 1104505 998662 1236388 1127072 1040610 698390 1060682 839476 1133011 837380
16975 837380 1314452 1323728 941293 827621 981669 712854 1186801 894324 1054187 1382528
16965 1382528 1001778 972786 1038787 1186789 1346433 1277648 1306868 1564239 1093047 1247499
16955 1247499 1435227 1203987 1174596 1410291 1006306 1578191 1347008 1442931 1478845 1510046
16945 1510046 1568233 1381192 1562188 1198091 1289907 1478584 1494042 1493060 1682991 1887091
$$ packed form
17017H16223o7201r3550K7916K16645j30983k00826R5734K91995J1666p8930l21209
17006E67480L71246J3433p3729m1701j4648L45760m86545N37864k87497M7424
16996I79087l7242R5961k82940L80498k32051P3494l9654r7980o634Q2345K23660
16985A138544l4039j05843K37726j09316q6462l42220L62292k21206K93535k95631
16975H37380M77072R276l82435j13672J54048k68815M73947k92477J59863L28341
16965A382528l80750k8992O6001J48002J59644o8785K9220K57371m71192J54452
16955A247499J87728k31240k9391K35695m03985N71885k31183R5923L5914L1201
16945A510046N8187j87041J80996l64097R1816J88677J5458r82J89931K04100
$$ plain form
16935 1887091 1549230 1625197 1517692 1664599 1589284 1450690 1718415 1931447 1626140 1583443
16925 1583443 1446980 1458916 1574945 1608046 1587046 1768088 1887684 1767779 2048565 1794450
16915 1794450 1662723 1600797 1652141 2038364 1878895 2074837 1531138 1869252 2318526 2039808
16905 2039808 2160735 2047873 2111472 2113592 2051219 2080368 2206336 2279658 1762028 2193000
16895 2193000 2167859 2153748 2282362 2322829 2078331 2259151 2309499 2077440 2242939 2527888
16885 2527888 2367686 2438146 2499936 2356746 2580973 2434418 2686117 2794293 2779314 2497424
16875 2497424 2711037 2461121 2982732 2960019 2712748 2923546 3133050 2878152 2830981 2858404
16865 2858404 3090142 3335623 3272578 3112105 3120618 3332480 3413828 3592167 3166206 3680343
$$ packed form
16935A887091l37861P5967j07505J46907p5315j38594K67725K13032l05307m2697
16925A583443j36463J1936J16029L3101k1000J81042J19596j19905K80786k54115
16915A794450j31727o1926N1344L86223j59469J95942n43699L38114M49274k78718
16905B039808J20927j12862O3599K120o2373K9149J25968P3322n17630M30972
16895B193000k5141j4111J28614M0467k44498J80820N0348k32059J65499K84949
16885B527888j60202P0460O1790j43190K24227j46555K51699J08176j4979k81890
16875B497424K13613k49916N21611k2713k47271K10798K09504k54898m7171K7423
16865B858404K31738K45481o3045j60473Q513K11862Q1348J78339m25961N14137
$$ plain form
16855 3680343 3141824 3814886 3645028 3577381 3560447 3588423 4093660 3990059 4117899 4322277
16845 4322277 4115996 4041469 4066317 4380822 4129925 4406246 4694366 4485720 4709681 4784376
16835 4784376 4979024 4653803 4974416 4797629 5086563 5046510 5508675 5239336 5448652 5878825
16825 5878825 5667556 5578423 5854772 5643165 6170577 6308829 6231883 6042438 6447299 6308150
16815 6308150 6734751 6922059 7150145 6880683 7200424 7184182 7490595 7483674 7883039 7936941
16805 7936941 7877682 8582010 8419845 8437569 8840136 8827919 9198737 9281084 9446498 9811184
16795 9811184 10034278 9977595 10313583 10521926 10576230 11128090 11483670 11684044 12079625 12474947
16785 12474947 12842497 12817463 12988378 13491559 14271118 14518333 14869877 15193071 15449154
$$ packed form
16855C680343n38519O73062j69858o7647j6934K7976N05237j03601J27840K04378
16845D322277k06281p4527K4848L14505k50897K76321K88120k08646K23961P4695
16835D784376J94648l25221L20613j76787K88934m0053M62165k69339K09316M30173
16825E878825k11269q9133K76349k11607N27412J38252p6946j89445M04861j39149
16815F308150M26601J87308K28086k69462L19741j6242L06413o921L99365N3902
16805G936941n9259P04328j62165J7724M02567j2217L70818Q2347J65414L64686
16795I811184K23094n6683L35988K08343N4304N51860L55580K00374L95581L95322
16785A2474947L67550k5034J70915N03181P79559K47215L51544L23194K56083
$$ plain form
16776 15449154 16059449 16562799 16956209 17588021 18289198 18542559 19408802 20006935 20660644
16767 20660644 21276657 21681773 22676999 23753058 24434419 25004697 26056896 26888688 28101194
16758 28101194 29159739 30263767 31396626 32603443 33744176 35144048 36986129 38337020
16750 38337020 39948518 41638249 43731095 45680341 47496401 49508786 51995976 54804599
16742 54804599 57040770 59951453 63045994 66440895 69377322 73094187 76812115 80780466
16734 80780466 84932380 89180121 93878201 98536068 103695080 108678773 114003289 119362216
16726 119362216 124683995 130231109 135894051 141100220 146142577 150515308 154915389 158693042
16718 158693042 161981445 164367644 166131284 167035590 167121245 166144237 164554252 162034905
$$ packed form
16776A5449154O10295N03350L93410O31812P01177K53361Q66243N98133O53709
16767B0660644O16013M05116R95226J076059O81361N70278J052199Q31792J212506
16758B8101194J058545J104028J132859J206817J140733J399872J842081J350891
16750C8337020J611498J689731K092846J949246J816060K012385K487190K808623
16742E4804599K236171K910683L094541L394901K936427L716865L717928L968351
16734H0780466M151914M247741M698080M657867N159012M983693N324516N358927
16726A19362216N321779N547114N662942N206169N042357M372731M400081L777653
16718A58693042L288403K386199J763640R04306Q5655r77008j589985k519347
$$ plain form
16710 162034905 158803042 155387132 150876341 145793773 140994661 135483331 129972709 124265773
16702 124265773 118634649 113020084 107745710 102526275 97415317 92248272 87453750 83390312
16694 83390312 79021359 74668821 70819105 67521777 64027876 60609603 57508830 54911013
16686 54911013 52229856 49832457 47237835 45201026 43292400 41000601 39532133 37753487
16678 37753487 36082519 34086243 33004251 31455462 30134365 28839905 27817608 26839051
16670 26839051 25841176 24606373 23733855 22850007 21962473 21233293 20272674 19924423 19098758
16661 19098758 18503534 17944340 17223208 16472406 16080356 15560892 15210138 14599172 14110486
16652 14110486 13673770 13367979 12529819 12557696 12094433 11960545 11649603 11318297 10595028
$$ packed form
16710A62034905l231863l415910m510791n082568m799112n511330n510622n706936
16702A24265773n631124n614565n274374n219435n110958n167045m794522m063438
16694H3390312m368953m352538l849716l297328l493901l418273l100773k597817
16686E4911013k681157k397399k594622k036809j908626k291799j468468j778646
16678C7753487j670968j996276j081992j548789j321097j294460j022297r78557
16670B6839051r97875j234803q72518q83848q87534p29180r60619l48251q25665
16661A9098758n95224n59194p21132p50802l92050n19464l50754o10966m88686
16652A4110486m36716l05791q38160K7877m63263j33888l10942l31306p23269
$$ plain form
16643 10595028 10593329 10461890 10156837 10105871 9253895 9452095 9034061 8556576 8574801 8368267
16633 8368267 8049445 7963419 7612617 7572220 7297111 7100478 6944738 6885577 6495209 6400192
16623 6400192 6054662 6328672 6059808 6082827 5904848 5776639 5356267 5582008 5707887 5267596
16613 5267596 5314670 4938692 4933695 4691145 4837794 4648822 4302649 4243963 3976302 4420163
16603 4420163 4167586 4283888 3725976 3913179 3713140 3662632 3445402 3651188 3700230 3350717
16593 3350717 3111714 3310368 3517500 3432407 3132515 2868770 2981457 3381287 2926956 2819892
16583 2819892 3080666 2807612 2897101 2552117 2875044 2691594 2579115 2676261 2745914 2322213
16573 2322213 2465770 2357331 2749256 2452849 2246510 2147086 2088079 2299177 2454199 2051411
$$ packed form
16643A0595028j699j31439l05053n0966q51976J98200m18034m77485J8225k06534
16633H368267l18822q6026l50802m0397k75109j96633j55740n9161l90368r5017
16623F400192l45530K74010k68864K3019j77979j28209m20372K25741J25879m40291
16613E267596M7074l75978m997k42550J46649j88972l46173n8686k67661M43861
16603D420163k52577J16302n57912J87203k00039n0508k17230K05786M9042l49513
16593C350717k39003J98654K07132q5093k99892k63745J12687L99830m54331j07064
16583B819892K60774k73054Q9489l44984L22927j83450j12479R7146O9653m23701
16573B322213J43557j08439L91925k96407k06339r9424n9007K11098J55022m02788
$$ plain form
16563 2051411 2300004 2099089 1825188 1941665 1977607 2027419 1708550 2193446 1669493 2222676
16553 2222676 1930289 2047962 2037914 1916047 1584480 1661082 1790423 1835039 1724763 1929491
16543 1929491 1700028 1601672 1899273 1459057 1557053 1869361 1473397 1439166 1325281 1351371
16533 1351371 1483835 1494018 1482062 1319502 1326207 1375626 1341159 1207430 1216341 1020329 1186225
16522 1186225 1334259 1293998 1263165 1082685 1307686 1129077 1016558 1216407 1080082 833926
16512 833926 1028434 1016020 1401201 1266701 820747 1176295 1200375 1083666 1257248 1050533
16502 1050533 1089774 844037 1085796 959545 990365 761927 654833 1013661 650956 703513
16492 703513 1076549 984127 744724 811506 1124250 560761 745841 591172 607285 1074558
$$ packed form
16563B051411K48593k00915k73901J16477L5942M9812l18869M84896n23953N53183
16553B222676k92387J17673j0048j21867l31567P6602J29341M4616j10276K04728
16543A929491k29463r8356K97601m40216R7996L12308l95964l4231j13885K6090
16533A351371J32464J0183j1956j62560O705M9419l4467j33729Q911j96012J65896
16522A186225J48034m0261l0833j80480K25001j78609j12519J99849j36325k46156
16512H33926J94508j2414L85181j34500m45954L55548K4080j16709J73582k06715
16502A050533L9241k45737K41759j26251L0820k28438j07094L58828l62705N2557
16492G03513L73036r2422k39403O6782L12744E60761J85080j54669J6113M67273
$$ plain form
16482 1074558 707469 802658 625303 1040412 768377 662783 520279 545822 473564 502572
16472 502572 626119 569301 697355 275083 682291 561126 1096400 573795 627703 716023
16462 716023 708183 814792 645172 511587 689566 513289 450716 635812 380702 505952
16452 505952 473585 483102 706198 502912 208500 340603 796716 385887 528815 671640
16442 671640 715701 505588 496669 479110 639163 396651 568158 479365 550760 471355 423851
16431 423851 417826 534101 520631 321347 475735 207437 284460 400959 530831 365942
16421 365942 423099 457324 615571 629305 327898 233417 371929 502781 581148 354028
16411 354028 404083 293238 -27401 449457 380344 371986 385924 545720 438471 353964 566771
$$ packed form
16482A074558l67089R5189j77355M15109k72035j05594j42504K5543p2258K9008
16472E02572J23547n6818J28054B75083M07208j21165N35274n22605N3908Q8320
16462G16023p840J06609j69620j33585J77979j76277o2573J85096k55110J25250
16452E05952l2367R517K23096k03286B08500J32103M56113C85887J42928J42825
16442F71640M4061k10113q919j7559J60053k42512J71507q8793P1395p9405m7504
16431D23851o025J16275j3470j99284J54388B07437P7023J16499J29872j64889
16421C65942N7157L4225J58247J3734l01407r4481J38512J30852P8367k27120
16411C54028N0055j10845b7401D49457o9113q358J3938J59796j07249q4507K12807
$$ plain form
16400 566771 460914 355181 517469 389960 330676 348164 537312 454892 79855 397989
16390 397989 343926 219404 296315 220568 176194 48245 280139 483637 332868 12666 115766
16379 115766 509940 544178 169651 399579 542040 -212950 219477 154901 218103 280111
16369 280111 215644 206373 422863 348253 197494 15351 41035 516996 309624 442316 103931
16357 362171 407595 366595 137667 125133 181954 110546 389313 518296 141249 135409 186390
16346 186390 440172 116042 -51037 273217 66964 160933 -61233 344305 -79009 -168583 549912
16334 -17209 271471 403804 366700 -17327 100159 85831 65715 341895 476880 -23436 377852
16322 108653 108054 129054 492322 112713 74791 197639 11422 -61818 280839 212033 -104543
$$ packed form
16400E66771j05857j05733J62288j27509n9284J7488J89148q2420G9855L18134
16390C97989n4063j24522P6911p5747m4374D8245K31894K03498j50769A2666J03100
16379A15766L94174L4238A69651K29928J42461b12950B19477o4576O3202O2008
16369B80111o4467r271K16490p4610j50759A5351K5684M75961k07372J32692A03931
16357C62171M5424m1000A37667j2534N6821p1408K78767J28983A41249n840N0981
16346A86390K53782A16042e1037B73217F6964R3969f1233C44305g9009q9574E49912
16334a7209B71471J32333l7104a7327A00159j4328k0116K76180J34985b3436C77852
16322A08653n99K1000L63268A12713l7922J22848A1422f1818B80839o8806a04543
$$ plain form
16310 65809 35116 523220 10153 -9464 590360 79307 269989 11609 12689 311416 -58937
16298 55794 360155 -321155 127069 249829 239055 -23393 15161 206091 228384 5 38897
16287 38897 84843 146744 52668 196793 187764 -159312 623775 148023 129978 101484 304108
16276 304108 232160 268167 228653 190927 205079 -57052 -168069 167012 -247038 97734 74485
16265 74485 150482 320976 57581 109681 -12597 288473 49069 99749 -39330 48948 149395
16254 149395 172881 -59281 32238 48328 -41110 190622 58565 130837 48892 114093 6172
16242 105379 324212 11740 222648 289182 19654 137357 33420 290744 183090 108222
16232 108222 158610 197126 343220 -21445 118161 148301 530434 7263 149623 -183289 142578
$$ packed form
16310F5809l0693M88104A0153i464E90360G9307J90682A1609J080K98727e8937
16298E5794L04361c21155A27069J22760j0774b3393A5161J90930K2293EL8892
16287C8897M5946O1901E2668J44125r029a59312F23775A48023j8045k8494K02624
16276C04108p1948L6007l9514l7726J4152e7052j11017A67012b47038I7734k3249
16265G4485P5997J70494E7581N2100a2597B88473D9069N0680c9330D8948J00447
16254A49395K3486e9281C2238J6090d1110A90622E8565P2272D8892O5201F172
16242A05379K18833A1740K10908O6534A9654J17703C3420K57324j07654p4868
16232A08222N0388L8516J46094b1445A18161L0140L82133G263J42360a83289A42578
$$ plain form
16220 218079 -40079 -242613 269513 -191384 18312 -173063 239159 -87708 108451 69206
16210 69206 291629 15272 122585 359212 29112 300037 77556 -1123 474855 -32936 34090
16198 -101354 27413 -29111 -71067 292531 93062 -65503 254604 -36559 120999 21018 -157242
16186 -140052 113324 72587 63096 390795 84988 -46553 177411 274721 -262677 -147746 -53330
16174 -227382 -97943 99929 66837 -41475 -39306 -168550 330045 212935 264553 -144940 -161269
16163 -161269 -27856 76679 267929 -19403 -170230 155183 -39485 248631 -64467 193152
16152 10563 138731 -19656 -6449 -97466 -25860 333927 -1906 -225079 24690 107292 -552873
16140 169335 377006 -269702 -45180 82550 157403 240947 -50849 142729 -15740 87976 223959
$$ packed form
16220B18079d0079k02534B69513a91384A8312a73063B39159h7708A08451l9245
16210F9206K22423A5272J07313K36627B9112K70925G7556a123D74855c2936C4090
16198a01354B7413b9111m1956B92531I3062f5503B54604c6559A20999B1018a57242
16186a40052A13324m0737r491L27699H4988d6553A77411R7310b62677J14931e3330
16174b27382i7943I9929l3092d1475K169j29244C30045j17110N1618a44940j6329
16163a61269b7856G6679J91250a9403j50827A55183c9485B48631f4467A93152
16152A0563J28168a9656f449r1017b5860C33927a906k23173B4690Q2602e52873
16140A69335K07671b69702d5180H2550P4853Q3544e0849A42729a5740H7976J35983
$$ plain form
16129 223959 107081 -56087 233473 32450 130845 134024 -222123 -19494 219218 136556 35284
16117 185588 -15488 203865 -245137 214294 23841 -4812 141147 -13233 -230866 293643
16106 -39588 -137346 275212 139438 128830 271935 387830 176463 -66706 -104466 -78546 135631
16094 62551 -108844 -254593 -51276 -148895 131368 -259979 149111 -313195 -10995 120388
16083 -25871 -120339 -46975 -87689 -134896 124509 54032 209304 111828 -141247 163539 -166864
16071 -32280 198321 -44958 6463 55617 116744 -94255 -111275 34867 -477777 -35202 -182327
16060 -182327 52335 126366 -136975 -240607 -223398 -169477 73193 -66343 -116563 309 37400
16049 37400 29241 95676 -10486 145807 -96211 53820 -286234 -54590 -170908 -84335 7441
$$ packed form
16129B23959A07081e6087B33473C2450R8395L179b22123a9494B19218q2662C5284
16117A85588a5488B03865b45137B14294B3841d812A41147a3233k17633B93643
16106c9588r7758B75212j35774j0608J43105J15895A76463f6706l7760K5920A35631
16094F2551a08844j45749e1276r7619A31368b59979A49111c13195a0995A20388
16083b5871r4468d6975m0714m7207A24509E4032J55272r7476a41247A63539a66864
16071c2280A98321d4958F463M9154O1127i4255j7020C4867d77777c5202j47125
16060a82327E2335P4031a36975j03632J7209N3921G3193f6343n0220C09L7091
16049C7400q159O6435a0486A45807i6211E3820b86234e4590j16318h4335G441
$$ plain form
16037 -104393 -60782 60662 52256 106808 -186330 110440 98838 -136288 -346638 -45635 136466
16025 -62425 -167116 -103748 154541 -12619 150176 -189179 -74534 -68129 108892 5665 24782
16014 24782 242310 -230705 -113465 166191 149692 138739 97804 -184929 -78708 36301 -115304
16002 -5454 -141067 -163974 37065 105373 -335455 -184215 76754 -168535 -185718 -144531 -238789
15991 -238789 -679 64364 -224849 -25753 476505 323477 299451 717181 479731 150136 226088
15980 226088 81757 267007 303186 175414 -147265 -72796 -266577 133117 -285191 -35265
15969 -66376 100982 78152 -49409 17520 -94279 65709 39641 65640 -147236 44000 307914
15958 307914 -142309 -57353 -115509 -47353 -259478 -31891 -69633 3350 70579 282142 -132250
$$ packed form
16037a04393M3611F0662q406N4552a86330A10440j1602a36288k10350d5635A36466
16025f2425j04691O3368A54541a2619A50176a89179g4534O405A08892E665J9117
16014B4782K17528b30705a13465A66191j6499j0953m0935a84929g8708C6301a15304
16002e454j35613k2907C7065O8308c35455J51240G6754a68535j7183M1187r4258
15991b38789f79F4364b24849b5753D76505j53028k4026M17730k37450A50136P5952
15980B26088H1757J85250L6179j27772a47265g2796j93781A33117b85191c5265
15969f6376A00982k2830d9409A7520i4279F5709k6068K5999a47236D4000K63914
15958C07914a42309e7353n8156d7353k12125c1891l7742C350O7229K11563a32250
$$ plain form
15946 -243152 152499 123847 296354 31099 -96931 -336050 -24418 -178705 -12841 -276161
15936 -276161 -21400 -233298 367682 -221627 -152926 -188869 3908 102335 92245 -115442 134952
15924 -96330 -146420 166595 -361280 64373 53526 -58716 -106504 33706 69667 -81296 186017
15912 6887 186508 269171 69784 -230017 160619 -165369 20184 -77975 363654 -119978 10058
15900 -19543 98872 230571 213320 -133153 -86816 -241257 118801 -184573 -37894 -113500 -1095
15888 16039 52832 -223321 27065 189139 67052 -40983 -30925 78567 148712 -16633 -420691
15877 -420691 -52416 -77898 -24039 -38045 -307126 98695 265569 154629 130552 -72983 29568
15865 74821 189233 61376 -117044 19510 -169894 -73389 89447 88962 78634 -171482 -270876
$$ packed form
15946b43152A52499k8652J72507C1099i6931k39119b4418j54287a2841k63320
15936b76161b1400k11898C67682b21627O8701l5943C908R8427j0090a15442A34952
15924i6330n0090A66595c61280F4373j0847e8716m7788C3706L5961h1296A86017
15912F887J79621Q2663F9784b30017A60619a65369B0184g7975C63654a19978A0058
15900a9543I8872J31699j7251a33153M6337j54441A18801a84573c7894p5606a095
15888A6039L6793b23321B7065J62074F7052d0983J0058G8567P0145a6633m04058
15877d20691e2416k5482b4039j4006k69081I8695J66874j10940k4077g2983B9568
15865G4821J14412F1376a17044A9510a69894g3389H9447m85j0328a71482r9394
$$ plain form
15854 -270876 178757 336330 -213017 -121945 -263924 29747 135906 46069 -397797 255517
15843 343950 -140735 58743 133306 190664 24773 -430772 189029 -193607 202911 -56177
15832 24342 -233938 -71108 -302307 18039 -220842 213107 103443 67899 -61560 -172165
15822 -172165 186021 168948 -39630 100623 -247290 43677 425536 -52239 160753 -79765
15811 96905 -106189 -66957 -28141 -151013 -115663 280393 84690 96804 136354 -98692 -160461
15800 -160461 226784 -120752 36724 -63931 226529 78580 -113883 207544 -49310 147819
15789 13816 -226777 -153915 151524 -224401 -75118 -68590 -112918 -76437 -139043 -77213 7407
15777 153012 61531 143403 193683 -103165 178582 148099 119911 -39128 -13150 -69271 112124
$$ packed form
15854b70876A78757J57573b13017R1072j41979B9747J06159D6069c97797B55517
15843C43950a40735E8743P4563N7358B4773d30772A89029a93607B02911e6177
15832B4342b33938g1108k31199A8039b20842B13107A03443l5544f1560j10605
15822a72165A86021j7073c9630A00623b47290D3677L81859e2239A60753g9765
15811I6905a06189L9232b8141j22872L5350B80393H4690J2114L9550i8692o1769
15800a60461B26784a20752C6724f3931B26529G8580a13883B07544d9310A47819
15789A3816b26777P2862A51524b24401g5118O528m4328L6481o2606O1830G407
15777A53012F1531Q1872N0280a03165A78582l0483k8188c9128a3150n6121A12124
$$ plain form
15765 -121597 -153035 -294062 -161285 -47804 -5476 13567 -121719 66781 -132816 188673 42381
15753 -103344 78010 -5266 -156095 3432 85898 130961 115537 94034 210058 156189 -86813
15741 -169466 -176156 456410 -242988 136985 92071 121427 -353817 210827 27312 -76033 33850
15729 -78585 -30347 14833 63083 -27797 83100 -165855 208514 -14541 17756 35698 148166
15718 148166 -544329 -227799 -229054 -302565 16155 378415 -216401 -89524 -55213 -111338 -394233
15707 -394233 123170 -190159 -50785 66112 163567 -425115 112524 -205820 -179606 230576
15696 -248172 -135778 28626 -336538 61934 198236 80839 -10176 168778 -127428 -65689
15686 -65689 -51815 -128957 -23490 74808 237852 -131858 -153903 69582 30475 -342740 236778
$$ packed form
15765a21597l1438j41027J32777d7804e476A3567a21719F6781a32816A88673D2381
15753a03344G8010e266j50829C432Q2466M5063j5424k1503J16024n3869h6813
15741a69466o690D56410b42988A36985m4914K9356c53817B10827B7312g6033C3850
15729g8585c0347A4833M8250b7797H3100a65855B08514a4541A7756J7942J12468
15718A48166e44329b27799j255p3511A6155L62260b16401h9524L4311n6125k82895
15707c94233A23170a90159e0785F6112R7455d25115A12524b05820K6214B30576
15696b48172J12394B8626c36538F1934J36302H0839a0176A68778a27428O1739
15686f5689J3874p7142b3490G4808J63044a31858k2045F9582C0475c42740B36778
$$ plain form
15674 228517 10643 -12420 79726 309185 -84452 -2403 59792 31086 61720 171792 -396272
15662 87332 32450 55681 -24212 -3142 -32363 -359526 -186257 -226648 24125 81246 -316800
15650 202611 71641 -251344 -203250 -109075 -234681 89931 60590 138715 -6692 -310318 -147422
15638 213178 64655 -46865 -229174 239255 -443461 -80830 4419 -14177 14582 170833 -18220
15626 111400 -1117 -36037 250034 -193446 232245 146858 62088 -347825 102622 -237942
15615 -167946 31988 -64677 -111026 16537 -75972 -75420 154504 147518 410996 -226875 -64137
15603 -255681 -44457 151772 113040 99466 -104711 -196693 -325603 -20682 -88775 -201439 -87001
15591 -64715 465990 20412 310471 -382090 19136 113645 -80871 -145465 306375 -54107 52713
$$ packed form
15674B28517A0643a2420G9726K29459h4452b403E9792k8706L0634J10072c96272
15662H7332C2450K3231b4212c142k9221l27163J73269m0391B4125N7121c16800
15650B02611G1641b51344M8094R4175j25606H9931k9341P8125f692l03626a47422
15638B13178F4655d6865j82309B39255d43461h0830D419a4177A4582J56251a8220
15626A11400a117l4920B50034a93446B32245q5387F2088c47825A02622b37942
15615a67946C1988f4677m6349A6537g5972N52A54504o986K63478b26875f4137
15603b55681d4457A51772l8732j3574a04711r1982j28910b0682o8093j12664h7001
15591f4715D65990B0412K90059c82090A9136R4509h0871o4594C06375e4107E2713
$$ plain form
15579 113877 102553 -62896 237382 42601 -69611 45699 142406 100352 -74913 -163240 152871
15567 -305292 -211775 107193 67184 -124763 147022 -191250 -255559 -262227 -205414 -482 132424
15555 -137176 -80121 -68873 149079 158318 -113265 -309036 115981 59884 -207115 -44682 112625
15543 71601 -184596 -159538 201323 24399 1986 -66255 559 -14611 -27058 228821 -98607 199239
15530 163492 208495 150145 238038 -241399 -72636 -276882 24672 352208 -6415 232947 -216495
15518 -62726 -59734 229 206718 -180872 155141 30760 350275 -164949 -99392 3613 52941
15507 52941 -183169 87153 64431 -106020 -95180 -119300 -95466 -126831 12473 -131731 -218059
15496 -218059 -162482 80011 117815 163470 -119971 186137 -19271 273762 -41629 -53409 233411
$$ packed form
15579A13877j1324f2896B37382D2601f9611D5699R6707m2054g4913q8327A52871
15567c05292R3517A07193m0009a24763A47022a91250o4309o668N6813d82A32424
15555a37176N7055J1248A49079R239a13265j95771A15981n6097b07115d4682A12625
15543G1601a84596K5058B01323B4399A986f6255E59a4611j2447B28821i8607A99239
15530A63492M5003n8350Q7893b41399g2636k04246B4672L27536f415B32947b16495
15518f2726K992B29K06489a80872A55141C0760L19515a64949O5557C613M9328
15507E2941a83169H7153k2722a06020J0840k4120K3834l1365A2473a31731q6328
15496b18059N5577H0011L7804M5655a19971A86137a9271B73762d1629j1780B33411
$$ plain form
15484 -135724 -22589 -66732 -74045 -179156 231632 195324 238290 21222 59479 15067 13061
15473 13061 -64028 -1604 -58427 -15018 193662 68002 -171576 125992 134870 -313253 112250
15461 -71688 267961 110558 217672 196122 -352783 -80184 213320 -276776 -263254 -33012
15450 -71391 -153393 -25512 105873 -221524 -325998 -44143 332270 -16842 -261976 47576 83424
15439 83424 -136480 191886 278324 159213 -49213 89887 -201349 106957 -14503 268177
15428 245698 -26616 99007 -27223 49355 -48673 35216 15748 -151400 -261940 -121087 -251145
15417 -251145 27456 -100723 -119578 -196890 -366025 -161732 -14924 74571 -114066 172828
15406 157781 214621 -248836 -59596 33036 27649 -77547 190723 -131587 248216 -82711 84032
$$ packed form
15484a35724b2589m4143p313j05111B31632l6308M2966B1222L8257A5067k006
15473A3061f4028a604n6823a5018A93662F8002a71576A25992Q878c13253A12250
15461g1688B67961A10558J07114k1550c52783h0184B13320b76776J3522c3012
15450g1391q2002b5512A05873b21524j04474d4143C32270a6842k45134D7576L5848
15439H3424a36480A91886Q6438j19111d9213H9887b01349A06957a4503B68177
15428B45698b6616I9007b7223D9355d8673C5216A5748a51400j10540a21087j30058
15417b51145B7456a00723j8855p7312j69135a61732a4924G4571a14066A72828
15406A57781N6840b48836e9596C3036n387g7547A90723a31587B48216h2711H4032
$$ plain form
15394 434731 108529 -371007 195706 253776 -294889 -75730 -63541 -262548 192645 243502
15384 243502 381250 -139503 107826 152908 85731 -26752 188441 67186 7359 -4247 91575
15372 202310 -105777 -373965 46719 43741 484120 61193 220956 121831 27583 -309954 127658
15360 144936 450721 -64770 6113 317753 -169437 192083 102740 260481 239292 -4684 90561
15348 -182396 117633 281441 143337 -77282 -33414 206040 -91672 -287011 -116600 -197371
15338 -197371 -313882 -86030 53956 201761 52191 -30788 206790 -57668 -129040 146574 83317
15327 83317 -302453 -132861 64361 100270 -131005 -69817 330962 8437 -100698 7524 -351364
15315 314960 118440 111400 140847 27110 -85260 -70172 -73118 86003 271722 110819 484484
$$ packed form
15394D34731A08529c71007A95706N8070b94889g5730J2189j99007A92645N0857
15384B43502J37748a39503A07826M5082o7177b6752A88441F7186G359d247I1575
15372B02310a05777k68188D6719k978M40379F1193J59763r9125B7583c09954A27658
15360A44936L05785f4770F113L11640a69437A92083q9343J57741k1189d684I0561
15348a82396A17633J63808j38104g7282c3414B06040i1672j95339a16600q0771
15338a97371j16511h6030E3956J47805E2191c0788B06790e7668p1372A46574o3257
15327H3317c02453a32861F4361L5909a31005O1188C30962H437a00698G524c51364
15315C14960A18440p040K9447B7110h5260J5088k946H6003J85719A10819L73665
$$ plain form
15304 484484 -49235 -20692 138660 230874 -190216 -51285 -99486 165939 -72732 52060 145205
15293 145205 -129673 246619 88182 116030 61248 132623 -86139 188315 149192 -84511 -12819
15281 -190558 341125 124955 -69797 6332 210459 73065 232490 222507 -29396 63751 -217746
15269 -119868 -253187 135277 -218342 -40790 225301 63407 14286 296049 32759 -14991
15258 302217 -23425 102764 -306579 -145334 236011 119944 284629 125627 467671 1494189
15248 1494189 1034847 1111134 1317102 689235 89296 318618 197438 170797 337857 -19776
15237 -182565 156946 59203 75531 47593 165391 60684 117606 -256486 -80579 120888 61320
15226 61320 -53524 -55227 260072 98661 -51254 384835 58696 -115478 16941 132097 -27483
$$ packed form
15304D84484d9235b0692A38660R2214a90216e1285m8201A65939g2732E2060R3145
15293A45205a29673B46619H8182K7848n4782P1375h6139A88315l9123h4511a2819
15281a90558C41125A24955f9797F332K04127G3065J59425r983b9396F3751b17746
15269a19868j33319A35277b18342d0790B25301F3407A4286K81763C2759a4991
15258C02217b3425A02764c06579a45334B36011j16067J64685A25627L42044J026518
15248A494189m59342P6287K05968o27867H9296K29322j21180k6641J67060a9776
15237a82565A56946E9203J6328k7938J17798F0684N6922b56486h0579A20888n9568
15226F1320e3524j703B60072I8661e1254C84835E8696a15478A6941J15156b7483
$$ plain form
15214 -37624 26519 -41394 -89933 267296 -16944 193262 307481 217608 203417 -33352 393204
15202 171130 -30003 -105783 -152194 -199524 -212081 91490 -12755 95306 143386 334713 363372
15191 363372 46912 50878 -22724 12830 142100 -104012 -53786 175181 64146 -156001 39166
15179 94830 306810 297912 -13862 -90313 -8882 165730 -132350 85940 48011 337139 168965
15168 168965 68502 242749 -112719 300851 46904 312942 161718 79622 229927 -60048
15157 330881 -93854 251787 174152 142578 260857 275599 186916 522 70454 47752 234157
15146 234157 4362 218372 167627 158873 131030 -22503 75069 -109143 130111 -117271 167177
15134 252156 59976 336010 68211 -10032 126503 175910 133373 199851 85093 216505 448755
$$ packed form
15214c7624B6519d1394m8539B67296a6944A93262J14219q9873j4191c3352C93204
15202A71130c0003p5780m6411m7330j2557I1490a2755I5306M8080J91327K8659
15191C63372D6912L966b2724A2830J29270a04012N0226A75181F4146a56001C9166
15179I4830K11980q898a3862p6451h882A65730a32350H5940l7929K89128j68174
15168A68965F8502J74247a12719C00851D6904K66038j51224G9622J50305f0048
15157C30881i3854B51787p7635l1574J18279J4742q8683E22O9932k2702J86405
15146B34157D362K14010n0745q754k7843b2503G5069a09143A30111a17271A67177
15134B52156E9976K76034F8211a0032A26503M9407m2537O6478H5093J31412K32250
$$ plain form
15123 448755 217922 70652 180967 195402 170189 -109197 111499 63723 71291 -113049 166183
15111 131610 191161 -72704 295054 -33726 205270 170173 217465 70099 163208 68958 215702
15100 215702 171964 180990 -112815 244823 470396 202604 -131613 105948 109608 262954
15090 262954 -49571 310501 244171 231453 -54158 233507 206831 141161 329080 -30409 34159
15078 -317733 -133154 133813 265366 80537 -163537 570833 116159 32844 -54635 -75719
15068 -75719 247361 153560 488430 252929 455320 260766 102638 83421 68796 149635
15058 149635 177471 88167 235955 299250 69709 183506 110767 -107589 451170 351136
15048 351136 85287 296706 52329 265963 283073 129799 441987 47799 217131 357086
$$ packed form
15123D48755B17922G0652J10315J4435k5213a09197A11499m7776P568a13049A66183
15111A31610N9551g2704B95054c3726B05270l5097M7292G0099R3109F8958J46744
15100B15702m3738R026a12815B44823K25573B02604a31613A05948L660J53346
15090B62954d9571C10501o6330j2718e4158B33507k6676o5670J87919c0409C4159
15078c17733a33154A33813J31553H0537a63537E70833A16159C2844e4635k1084
15068g5719B47361r3801L34870k35501K02391j94554A02638j9217j4625Q0839
15058A49635K7836H8167J47788O3295F9709J13797p2739a07589D51170j00034
15048C51136H5287K11419E2329K13634J7110A29799L12188D7799J69332J39955
$$ plain form
15038 357086 399026 400421 149469 92552 39580 259702 6837 129508 279796 164558 416933
15027 416933 57067 184561 113503 367704 220398 318032 317600 119624 170906 256581 115179
15015 5447 86382 393206 503691 397592 157554 203801 221273 228839 134790 34544 20791
15004 20791 428176 161659 214318 351513 133401 330180 402213 2996 222992 190304 203013
14993 203013 146572 536067 288322 142570 590129 273658 264259 220838 47230 136285 418705
14982 418705 -46792 -45807 240180 363144 232247 493855 55284 273136 339206 256668 55920
14970 394171 -161302 245864 496408 338798 337331 303372 294237 309809 465740 481872 433504
14959 433504 22586 513850 350357 550196 363964 162844 -15531 51195 -20727 269679
$$ packed form
15038C57086M1940J395A49469n6917C9580K20122F837J22671J50288j15238K52375
15027D16933E7067J27494p1058K54201j47306R7634m32A19624N1282Q5675A15179
15015E447Q0935L06824J10485j06099A57554M6247J7472P566r4049C4544j3753
15004B0791M07385A61659N2659J37195A33401J96779P2033B996K19996l2688J2709
14993B03013n6441L89495k47745A42570M47559B73658r399m3421D7230Q9055K82420
14982D18705d6792R85B40180J22964j30897K61608E5284K17852O6070q2538E5920
14970C94171a61302B45864K50544j57610j467l3959r135J5572J55931J6132m8368
14959D33504B2586M91264j63493J99839j86232A62844a5531E1195b0727B69679
$$ plain form
14948 268947 193198 416312 441903 338389 426187 124020 514725 87669 253158 6793 247017
14937 247017 110311 1638 278874 511260 290733 361522 519911 545671 324175 404530
14927 404530 194024 362513 175039 103222 367518 31685 148203 644656 346695 614620
14917 614620 285312 412306 811385 288043 220898 473749 156217 298168 374195 564126
14907 564126 321804 561702 431471 279548 152954 178159 396243 245928 466877 191329
14896 495726 -23366 474810 280119 112958 324196 315976 116797 312955 88422 205516
14886 205516 354539 294235 416358 402129 350392 338265 141089 146235 340295 334157 215721
14875 215721 345664 291688 564756 464216 763085 -21844 520935 547326 413485 569393
$$ packed form
14948B68947p5749K23114K5591j03514Q7798A24020L90705H7669J65489F793K40224
14937B47017A10311A638K77236K32386k20527P0789J58389K5760k21496Q0355
14927D04530A94024J68489A75039p1817K64296C1685J16518M96453k97961K67925
14917F14620B85312J26994L99079B88043o7145K52851A56217J41951P6027J89931
14907E64126k42322K39898j30231j51923j26594K5205K18084j50315K20949A91329
14896D95726b3366D74810j94691A12958K11238q220A16797J96158H8422J17094
14886B05516J49023o0304J22123j4229n1737j2127A41089N146J94060o138j18436
14875B15721J29943n3976K73068j00540K98869b1844E20935K6391j33841J55908
$$ plain form
14865 569393 723830 448127 333244 300400 590275 508136 185466 520320 444446 291125
14855 291125 326946 452338 550256 102220 559041 65906 574607 103356 550295 384133
14845 384133 546409 328304 398252 429685 570878 543684 143527 482649 483093 674672 671107
14834 671107 303282 667570 602483 548416 383722 522529 463130 392915 641336 427048
14824 427048 342437 790063 434560 713267 515973 245294 747497 370719 426107 510229
14814 510229 634923 311762 403584 552629 395250 569337 461130 398322 455763 214217
14803 508238 354233 428744 818748 229661 525584 176564 614326 535156 725085 498381
14793 498381 71156 269703 384713 352619 477332 520532 560117 761431 650635 466240
$$ packed form
14865E69393J54437k75703j14883l2844K89875q2139A85466L34854p5874j53321
14855B91125L5821J25392R7918A02220M56821F5906N08701A03356M46939j66162
14845C84133J62276k18105O9948L1433J41193k7194A43527L39122M44J91579l565
14834F71107C03282L64288o5087n4067j64694J38807n9399p0215K48421k14288
14824D27048q4611M47626l55503K78707j97294B45294N02203C70719N5388Q4122
14814E10229J24694C11762R1822J49045j57379J74087j08207o2808N7441B14217
14803E08238j54005P4511L90004B29661K95923A76564M37762p9170J89929k26704
14793D98381G1156J98547J15010l2094J24713M3200L9585K01314j10796j84395
$$ plain form
14783 466240 613027 681051 531432 142714 525104 478672 675011 607440 404851 532870
14773 532870 710765 668329 267693 722905 500662 367497 595602 902800 450347 675090
14763 675090 489477 568647 511914 328330 707947 552773 489291 737180 539069 319854
14753 319854 792194 774076 466047 565748 592415 848349 718047 555874 465714 531287
14743 531287 594255 652332 614529 657829 413552 725563 493161 738573 683507 712634 877311
14732 877311 656962 762984 563690 529793 1085573 614735 564591 677545 747020 714267
14722 714267 820503 1015981 691391 627232 666606 827548 798817 405206 581634 731965
14712 731965 635876 519414 916515 878347 922856 553128 907119 1070900 767893 1026981
$$ packed form
14783D66240J46787O8024j49619A42714L82390m6432J96339o7571k02589J28019
14773E32870J77895m2436B67693M55212k22243j33165K28105L07198D50347K24743
14763F75090j85613P9170n6733j83584L79617j55174o3482K47889j98111k19215
14753C19854M72340j8118l08029R9701K6667K55934j30302j62173r0160O5573
14743E31287O2968N8077l7803M3300k44277L12011k32402K45412n5066K9127J64677
14732H77311k20349J06022j99294l3897N55780m70838n0144J12954O9475l2753
14722G14267J06236J95478l24590o4159L9374J60942k8731l93611J76428J50331
14712G31965r6089j16462L97101l8168M4509l69728L53991J63781l03007K59088
$$ plain form
14702 1026981 628703 1343170 830165 829253 758406 853234 730573 812824 956762 1163621
14692 1163621 845230 865176 908195 764204 896134 770675 777651 784142 1000566 779149
14682 779149 833751 912241 928743 978213 651003 989681 927087 910219 1098801 1117848 1132865
14671 1132865 841857 828255 759922 910239 888182 796805 1488326 1079162 1038738 1229689
14661 1229689 846910 971979 1032663 1273150 1135147 1124610 1078645 1345174 1211544 949355
14651 949355 715804 1122308 1120411 952414 878557 1037555 950684 1235205 1212669 968144
14641 968144 1114064 1259458 1351506 1219655 1116636 1287212 1167025 1420779 1088211 1442533
14631 1442533 1222896 1264136 1621205 1395673 1225880 1219543 1219571 1387840 1252396 1070528 1240615
$$ packed form
14702A026981l98278P14467n13005r12p0847R4828j22661Q2251J43938K06859
14692A163621l18391J9946M3019j43991J31930j25459O976O491K16424k21417
14682G79149N4602P8490J6502M9470l27210L38678o2594j6868J88582J9047J5017
14671A132865k91008j3602o8333J50317k2057r1377O91521m09164m0424J90951
14661A229689l82779J25069O0684K40487j38003j0537m5965K66529j33630k62189
14651I49355k33551M06504j897j67997p3857J58998q6871K84521k2536k44525
14641I68144J45920J45394R2048j31851j03019J70576j20187K53754l32568L54322
14631A442533k19637M1240L57069k25532j69793o337K8J68269j35444j81868J70087
$$ plain form
14620 1240615 977650 1309709 1599384 1386273 1138918 1660699 1382109 1466270 1381058 1401285
14610 1401285 1447811 1022045 1403151 1717179 1575299 1521776 1471704 1495260 1589174 1689681
14600 1689681 1596469 1415039 1338678 1726963 1476625 1755608 1543128 1769965 1513431 1499103
14590 1499103 1694840 1831026 1781506 1525264 1746022 1910843 1786187 1805920 1959293 2072180
14580 2072180 2193314 1879774 1785076 2034911 1940701 2007194 1828843 1911182 2066529 1910427
14570 1910427 2006598 2096618 2489634 2020272 2028826 2556413 2379273 2394486 2451551 2772457
14560 2772457 2500179 2416298 2635228 2746414 3177752 2840086 3229325 3440946 3540357 4059778
14550 4059778 5250265 7079858 10664562 22919773 52602354 38851118 15499032 6534556
$$ packed form
14620A240615k62965L32059K89675k13111k47355N21781k78590Q4161q5212K0227
14610A401285M6526m25766L81106L14028j41880n3523n0072K3556R3914J00507
14600A689681r3212j81430p6361L88285k50338K78983k12480K26837k56534j4328
14590A499103J95737J36186m9520k56242K20758J64821j24656J9733J53373J12887
14580B072180J21134l13540r4698K49835r4210O6493j78351Q2339J55347j56102
14570A910427R6171R0020L93016m69362Q554N27587j77140J5213N7065L20906
14560B772457k72278q3881K18930J11186M31338l37666L89239K11621R9411N19421
14550D059778J190487J829593L584704J2255211K9682581j3751236A5499032F534556
$$ plain form
14541 3576991 2587755 2037040 1776292 1729045 1693313 1748057 1732853 1547860 1884984 1737514
14531 1737514 2043961 1962373 2252145 1905939 2144225 2162179 1789347 2586598 2288324 2387838
14521 2387838 2517376 2238685 1962072 2208701 2688791 2428561 2690875 2610328 2711468 2882161
14511 2882161 2734629 2926029 2754621 2775404 2935042 2834190 3039694 2869222 2964104 3265842
14501 3265842 2838258 2733771 3007107 3035043 2765616 2893895 2838129 3311909 3402932 3444875
14491 3444875 3305202 3175628 3040296 3363511 3584236 3507811 3550672 3640678 3587987 4018496
14481 4018496 3847690 3596425 3344968 3839629 3588479 3461679 3606981 3840459 3864066 3811109
14471 3811109 4028130 3975301 4034872 3910357 4039516 4181033 4063719 4412314 4332702 4337725
$$ packed form
14541C576991r89236n50715k60748m7247l5732N4744j5204j84993L37124j47470
14531A737514L06447q1588K89772l46206K38286J7954l72832P97251k98274R9514
14521B387838J29538k78691k76613K46629M80090k60230K62314q0547J01140J70693
14511B882161j47532J91400j71408K0783J59638j00852K05504j70472R4882L01738
14501C265842m27584j04487K73336K7936k69427J28279n5766M73780R1023M1943
14491C444875j39673j29574j35332L23215K20725p6425M2861R0006n2691M30509
14481D018496j70806k51265k51457M94661k51150j26800J45302K33478K3607n2957
14471C811109K17021n2829N9571j24515J29159J41517j17314L48595p9612N023
$$ plain form
14461 4337725 4351270 4617369 4744105 4847409 4752032 4886566 5049100 4898010 4869035 5090580
14451 5090580 4952155 5123496 5332301 5163115 5324892 5361657 5385468 5483538 5832127 5791227
14441 5791227 5678478 6030332 5885348 5774510 5990533 5868040 6190981 6409224 6184278
14432 6184278 6131290 6370486 6261678 6559527 6862294 6782036 6828172 7115653 7255440 7402551
14422 7402551 7388834 7380771 7766651 7449695 7710211 7674584 7976091 8178815 8152733 8105088
14412 8105088 8236010 8470115 8628659 8983588 8855889 9094120 9442931 9480149 9439181 9823334
14402 9823334 9934974 10222155 10190348 10195504 10435493 10724831 10999747 10930080 11170002 11245475
14392 11245475 11521282 11787177 11707490 12319516 12438798 12529474 12793241 13048981 13141782 13237994
$$ packed form
14461D337725J3545K66099J26736J03304r5377J34534J62534j51090k8975K21545
14451E090580j38425J71341K08805j69186J61777L6765K3811R8070L48589m0900
14441E791227j12749L51854j44984j10838K16023j22493L22941K18243k24946
14432F184278n2988K39196j08808K97849L02767q0258M6136K87481J39787J47111
14422G402551j3717q063L85880l16956K60516l5627L01507K02724k6082m7645
14412H105088J30922K34105J58544L54929j27699K38231L48811L7218m0968L84153
14402I823334J11640K87181l1807N156K39989K89338K74916o9667K39922P5473
14392A1245475K75807K65895p9687O12026J19282R0676K63767K55740R2801R6212
$$ plain form
14382 13237994 13500510 13742163 14075728 14204886 14781634 15000789 15158014 15119586 15695089
14373 15695089 15908442 16354545 16529063 17247150 17112598 17591777 18092376 18415349 18593200
14364 18593200 19239444 19581548 20022524 20330352 20653031 21085949 21911178 22163537 22707027
14355 22707027 23164975 23922051 24093970 24880583 25128508 26433600 27098285 27142482 28109434
14346 28109434 28927013 29589304 30319456 30931853 31935995 33004670 33550907 34874666 35669866
14337 35669866 36384206 37735595 39158603 40074210 40985720 42373823 43742710 44609156 46512525
14328 46512525 47866005 49610225 51219376 52696958 54528936 56502103 58247034 60673885
14320 60673885 62645497 65128447 67268435 70140060 72612798 75430800 78232364 81390734
$$ packed form
14382A3237994K62516K41653L33565J29158N76748K19155J57225l8428N75503
14373A5695089K13353M46103J74518P18087j34552M79179N00599L22973J77851
14364A8593200O46244L42104M40976L07828L22679M32918Q25229K52359N43490
14355B2707027M57948P57076J71919P86613K47925J305092O64685M4197R66952
14346B8109434Q17579O62291P30152O12397J004142J068675N46237J323759P95200
14337C5669866P14340J351389J423008R15607R11510J388103J368887Q66446J903369
14328D6512525J353480J744220J609151J477582J831978J973167J744931K426851
14320F0673885J971612K482950K139988K871625K472738K818002K801564L158370
$$ plain form
14312 81390734 84570932 88118384 91991172 95767781 100125097 104272019 109145396 113957943
14304 113957943 119245259 124884006 130381405 137010247 143446594 150633553 158052632 165682697
14296 165682697 174380470 183202688 192584679 202773761 213539725 224525040 236287940
14289 236287940 248505926 261306831 275017013 288668997 302892188 317407707 332292195
14282 332292195 347005802 361928544 376310456 390225443 403497957 415875299 427061973
14275 427061973 436515156 443983408 449365540 451145105 450048265 446637561 441510114 437419068
14267 437419068 430558949 424132259 416704341 405989545 393270050 379328078 364597067
14260 364597067 349423314 333719403 318324998 302947781 288616097 274901642 261168070
$$ packed form
14312H1390734L180198L547452L872788L776609M357316M146922M873377M812547
14304A13957943N287316N638747N497399O628842O436347P186959P419079P630065
14296A65682697Q697773Q822218R381991J0189082J0765964J0985315J1762900
14289B36287940J2217986J2800905J3710182J3651984J4223191J4515519J4884488
14282C32292195J4713607J4922742J4381912J3914987J3272514J2377342J1186674
14275D27061973R453183P468252N382132J779565j096840l410704n127447m091046
14267D37419068o860119o426690p427918j0714796j2719495j3941972j4731011
14260C64597067j5173753j5703911j5394405j5377217j4331684j3714455j3733572
$$ plain form
14253 261168070 248048389 235509982 223616335 212404593 201395676 191575273 181855372
14246 181855372 172902255 164614564 157313931 149602432 142248513 135740037 129354523 123472248
14238 123472248 118383216 113578590 108250057 103616236 98909989 95081981 91377163 88000950
14230 88000950 84359885 80824813 77988568 74919239 71967173 69324462 66720230 64192716
14222 64192716 62001103 59959733 58150919 55680537 54113230 52336455 50688964 49472433
14214 49472433 48045620 46530830 44822567 43480907 42076497 40975464 39955602 39431654
14206 39431654 37774290 36411136 35119659 34613041 33205630 33119858 32503160 31422281 30494257
14197 30494257 29527249 28660477 28200988 27580420 26869334 26162171 25245306 25004054 23930365
$$ packed form
14253B61168070j3119681j2538407j1893647j1211742j1008917r820403r719901
14246A81855372q953117q287691p300633p711499p353919o508476o385514n882275
14238A23472248n089032m804626n328533m633821m706247l828008l704818l376213
14230H8000950l641065l535072k836245l069329k952066k642711k604232k527514
14222F4192716k191613k041370j808814k470382j567307j776775j647491j216531
14214D9472433j426813j514790j708263j341660j404410j101033j019862n23948
14206C9431654j657364j363154j291477n06618j407411q5772o16698j080879r28024
14197C0494257r67008q66772m59489o20568p11086p07163r16865k41252j073689
$$ plain form
14188 23930365 23833836 23184557 22499548 21877299 21336252 21028408 20227903 20180874 19808874 19172093
14178 19172093 19066291 18453166 18008509 17664502 17647185 16762349 16598037 16303768 16143663
14169 16143663 15839928 15333131 15162912 15347950 14759132 14405284 13743822 13832884 13378746
14160 13378746 13249134 13165845 12969873 12475083 12452349 12189701 12164792 11779662 11307152 11501585
14150 11501585 11125900 10674724 10950869 10730136 10654653 10335107 10029149 9948724 10133018 9850318
14140 9850318 9336846 9250629 9392956 9336553 9081830 8798869 8690554 8206359 8352325 8463215
14130 8463215 8062268 8053253 8495505 8010263 7727336 7591785 7657649 7504627 7447211 7434752
14120 7434752 7101271 6888284 7048279 7128589 6816925 6644567 6651379 6537846 6599681 6359740
$$ packed form
14188B3930365r6529o49279o85009o22249n41047l07844q00505m7029l72000o36781
14178A9172093j05802o13125m44657l44007j7317q84836j64312k94269j60105
14169A6143663l03735n06797j70219J85038n88818l53848o61462Q9062m54138
14160A3378746j29612q3289j95972m94790k2734k62648k4909l85130m72510J94433
14150A1501585l75685m51176K76145k20733p5483l19546l05958q0425J84294k82700
14140I850318n13472q6217J42327n6403k54723k82961j08315m84195J45966J10890
14130H463215m00947r015M42252m85242k82927j35551O5864j53022n7416j2459
14120G434752l33481k12987J59995Q0310l11664j72358O812j13533O1835k39941
$$ plain form
14110 6359740 6615965 6185252 6298546 6157408 6110243 6061059 5606923 5937983 5852019 5816513
14100 5816513 5683414 5424749 5546631 5232798 5651887 5537325 5310610 5297543 5407138 5170157
14090 5170157 4994939 4969629 5063707 4668910 5119114 4972572 4834254 4669622 4734727 4859177
14080 4859177 4791931 4409242 4554894 3927975 4616364 4472015 4287904 4216129 4258219 4074345
14070 4074345 4047259 4159375 4043351 3979236 4008189 4004976 3991573 3767633 3597747 3823086
14060 3823086 3876624 3744783 3693914 3967266 3739159 3748593 3393427 3492332 3757290 3347884
14050 3347884 3209356 3281683 3283385 3276777 3223785 3134635 3388274 3311392 2909920 3225230 3166215
14039 3166215 3028160 3068814 2922749 2709416 3020067 2952849 3104049 2853075 2943427 2866186
$$ packed form
14110F359740K56225m30713J13294j41138m7165m9184m54136L31060q5964l5506
14100E816513j33099k58665J21882l13833M19089j14562k26715j3067J09595k36981
14090E170157j75218k5310R4078l94797M50204j46542j38318j64632O5105J24450
14080D859177o7246l82689J45652o26919O88389j44349j84111p1775M2090j83874
14070D074345k7086J12116j16024o4115K8953l213j3403k23940j69886K25339
14060C823086N3538j31841n0869K73352k28107R434l55166R8905K64958m09406
14050C347884j38528P2327J702o608n2992q9150K53639p6882m01472L15310n9015
14039C166215j38055M0654j46065k13333L10651o7218J51200k50974R0352p7241
$$ plain form
14029 2866186 2916220 2798018 2898259 2634793 2689786 3103397 2483101 2482163 2691874 2507534
14019 2507534 2537967 2312232 2197017 2492832 2265685 2243791 2207120 2659280 2188286 2303975
14009 2303975 2077014 2226409 2662567 2100694 2236635 1911331 1898795 2185838 1943218 1864699
13999 1864699 1792466 2049284 2062637 1762949 2007860 1866285 1794083 1946360 2085139 2126589
13989 2126589 2531355 4755116 12347214 40591267 44790641 22729626 11366709 7661330
13981 7661330 5570146 4472890 3748485 3288209 3132020 2988355 2855347 2638673 2390187
13972 2390187 2329349 2398252 2460153 2340557 2424183 2198698 2364611 1980399 2022763 1986529
13962 1986529 2046149 2163245 2065815 2071637 2117843 1830441 1941053 1897331 1947514 1861915 1537313
$$ packed form
14029B866186N0034j18202J00241k63466N4993M13611o20296r38K09711j84340
14019B507534L0433k25735j15215K95815k27147k1894l6671M52160m70994J15689
14009B303975k26961J49395M36158n61873J35941l25304j2536K87043k42620p8519
13999A864699p2233K56818J3353k99688K44911j41575p2202J52277J38779M1450
13989B126589M04766K223761P592098K8244053M199374k2061015j1362917l705379
13981G661330k091184j097256p24405m60276j56189j43665j33008k16674k48486
13972B390187o0838O8903O1901j19596Q3626k25485J65913l84212M2364l6234
13962A986529N9620J17096r7430N822M6206k87402J10612m3722N0183q5599l24602
$$ plain form
13951 1537313 1672139 2046728 1740916 1808243 1901311 1525466 1824414 1362920 1880265 1581023
13941 1581023 1745271 1597194 1796204 1792727 2004494 1503506 1800845 1764109 1546914 1569138
13931 1569138 1584318 1327655 1593692 1495055 1523857 948714 1529587 1586074 1288021 1668045
13921 1668045 1390849 1266666 1487299 1484528 1377602 1263122 1735903 1485131 1617217 1414461
13911 1414461 1382107 1235259 1218838 1484934 1377668 992991 1259685 1377155 1556692 1587886
13901 1587886 1303232 1517115 1164805 1477072 1098797 1321037 1267936 1490653 1154168 1016682
13891 1016682 1258187 1283040 1119301 1281884 1263344 1239350 1262746 906474 1045563 944759
13881 944759 1173600 1119770 1151125 1153236 1307023 1022848 1275314 944293 981304 1331482
$$ packed form
13951A537313J34826L74589l05812O7327R3068l75845K98948m61494N17345k99242
13941A581023J64248j48077J99010l477K11767n00988K97339l6736k17195K2224
13931A569138J5180k56663K66037r8637K8802n75143N80873N6487k98053L80024
13921A668045k77196j24183K20633k771j06926j14480M72781k50772J32086k02756
13911A414461l2354j46848j6421K66096j07266l84677K66694J17470J79537L1194
13901A587886k84654K13883l52310L12267l78275K22240n3101K22717l36485j37486
13891A016682K41505K4853j63739J62583j8540k3994K3396l56272J39089j00804
13881I44759K28841n3830L1355K111J53787k84175K52466l31021L7011L50178
$$ plain form
13871 1331482 877787 777922 858113 1182467 901719 1011869 1085466 1067147 1159952 1039194
13861 1039194 1266482 822248 1162098 1001261 698867 1360655 1035423 888195 968514 740264
13851 740264 796922 1013163 943336 956527 1105310 812108 1079136 819104 783036 952233
13841 952233 945989 1139073 759126 796750 1114163 953422 702296 1094444 775494 954737
13831 954737 1276872 814978 937775 843395 768295 892393 888653 986657 1140277 809330
13821 809330 466117 1069182 588153 1022570 803398 850368 967270 960726 834346 954227
13811 954227 826243 880019 578036 720239 797006 943204 1067160 817722 668230 678680
13801 678680 866337 706530 694248 770236 1012486 758576 544588 737597 672603 615999
$$ packed form
13871A331482m53695r9865Q0191L24354k80748J10150P3597j8319R2805j20758
13861A039194K27288m44234L39850j60837l02394O61788l25232j47228Q0319k28250
13851G40264N6658K16241o9827J3191J48783k93202K67028k60032l6068J69197
13841I52233o244J93084l79947L7624L17413j60741k51126L92148l18950J79243
13831I54737L22135m61894J22797r4380p5100J24098l740R8004J53620l30947
13821H09330l43213O03065m81029M34417k19172M6970J16902o544j26380J19881
13811I54227j27984N3776l01983J42203P6767J46198J23956k49438j49492J0450
13801F78680J87657j59807j2282P5988K42250k53910k13988J93009o4994n6604
$$ plain form
13791 615999 639527 821531 716758 963588 646091 874536 1056048 836515 735518 777082
13781 777082 795935 574161 465409 418711 870536 1089987 559048 604210 578060 847081
13771 847081 774593 959803 849773 556181 653743 529526 854843 692238 811729 856873
13761 856873 853655 343536 562366 646417 726922 548169 526339 495717 694274 604969 1048917
13750 1048917 656820 326679 319820 857928 531551 543099 552794 764248 565375 625695
13740 625695 629213 637680 576267 619107 635904 652695 422995 624095 838985 291198 572130
13729 572130 730047 788940 675372 884101 492539 642826 559447 580994 655004 313152
13718 482197 337002 547290 619674 397396 529793 363761 810124 668952 794470 561395
$$ packed form
13791F15999K3528J82004j04773K46830l17497K28445J81512k19533j00997M1564
13781G77082J8853k21774j08752m6698M51825K19451n30939M5162k6150K69021
13771H47081p2488J85210j10030k93592R7562j24217L25317j62605J19491M5144
13761H56873l218C43536K18830Q4051Q0505j78753k1830l0622J98557q9305M43948
13750A048917l92097C26679o859N38108l26377J1548R695K11454j98873O0320
13740F25695L518Q467o1413M2840J6797J6791k29700K01100K14890B91198K80932
13729E72130J57917N8893j13568K08729l91562J50287q3379K1547P4010C13152
13718D82197j45195K10288P2384k22278J32397j66032M46363j41172J25518k33075
$$ plain form
13708 561395 618604 590871 529053 380251 590681 248452 232881 763860 387210 528610
13698 528610 130335 383071 576821 475723 527717 323781 555797 759826 650236 558785
13688 558785 304675 263151 311933 542299 806072 327126 511155 440247 168667 524356
13678 524356 237164 361877 808767 191848 19929 564445 407174 515160 545593 282109
13668 282109 435905 416340 329128 219917 348768 534941 195534 481844 339198 533067
13658 533067 385414 464073 605225 325266 765422 594439 621306 274244 631314 271346
13647 349323 252874 433305 341387 590100 304361 477438 509435 448237 184604 517432
13637 517432 642691 361410 390026 319323 510972 689338 508080 328598 77072 240576
$$ packed form
13708E61395N7209k7733o1818j48802K10430B48452j5571N30979l76650J41400
13698E28610A30335K52736J93750j01098N1994k03936K32016K04029j09590r1451
13688E58785k54110m1524M8782K30366K63773C27126J84029p0908A68667L55689
13678E24356B37164J24713M46890A91848A9929N44516j57271J07986L0433k63484
13668B82109J53796j9565q7212j09211J28851J86173A95534K86310j42646J93869
13658E33067j47653P8659J41152k79959M40156j70983K6867B74244L57070B71346
13647C49323r6449J80431r1918K48713k85739J73077L1997o1198A84604L32828
13637E17432J25259k81281K8616p0703J91649J78366j81258j79482G7072J63504
$$ plain form
13627 240576 378852 147102 228138 278250 361405 489201 260018 486283 508394 314793
13617 314793 9515 313130 294352 364076 446976 308439 475428 319975 100197 366556
13607 366556 496065 176403 195423 376009 184277 488501 361643 354750 344628 616068
13597 616068 456972 200226 469358 276329 394676 228323 188447 416566 391572 227625
13587 227625 699910 242864 454904 220846 498394 549650 406697 359851 529420 234426
13576 141786 330759 174896 276877 337813 590056 332806 322379 350825 41705 560014
13566 560014 472434 136538 285968 400409 293336 454618 515728 403266 488037 323268
13556 323268 610950 371011 178014 136208 305265 170014 607103 343301 411107 64805
$$ packed form
13627B40576J38276A47102Q1036N0112Q3155J27796k29183K26265K2111j93601
13617C14793I515L03615j8778O9724Q2900j38537J66989j55453A00197K66359
13607C66556J29509A76403J9020J80586A84277L04224j26858o893j0122K71440
13597F16068j59096B00226K69132j93029J18347j66353l9876K28119k4994j63947
13587B27625M72285B42864K12040B20846K77548N1256j42953m6846J69569B34426
13576A41786J88973j55863J01981O0936K52243k57250j0427K8446D1705N18309
13566E60014q7580A36538J49430J14441j07073J61282O1110j12462Q4771j64769
13556C23268K87682k39939A78014m1806J69057j35251M37089k63802O7806F4805
$$ plain form
13545 15740 32491 -24599 118907 628016 -21997 430318 354007 2046 599019 560732 399200
13534 399200 257381 340611 317833 -35411 373525 473862 19034 71944 22065 408438 32997
13522 347609 506489 54255 318210 261936 54161 240147 188476 -17023 492989 379493
13512 379493 575221 143147 290023 415761 136183 307551 417157 -70011 440848 -195613
13501 149462 103906 145296 247744 389651 265815 -26515 30121 225189 159461 161916 231059
13490 231059 367558 289663 101768 216510 299240 28016 571605 272901 188604 312490
13480 312490 161722 31542 92724 210848 190954 171156 219158 298419 221661 -37492 57528
13468 205076 161223 237254 322333 78481 326242 307363 280448 28665 201686 303839 461499
$$ packed form
13545A5740J6751b4599A18907N09109b1997D30318p6311B046N96973l8287j61532
13534C99200j41819Q3230k2778c5411C73525J00337A9034N2910B2065L86373C2997
13522C47609J58880E4255K63955n6274E4161J85986n1671a7023D92989j13496
13512C79493J95728A43147J46876J25738A36183J71368J09606g0011D40848a95613
13501A49462m5556M1390J02448J41907j23836b6515C0121J95068o5728K455O9143
13490B31059J36499p7895A01768J14742Q2730B8016N43589B72901q4297J23886
13480C12490j50768C1542O1182J18124j9894j9798M8002P9261p6758c7492E7528
13468B05076m3853P6031Q5079G8481K47761j8879k6915B8665J73021J02153J57660
$$ plain form
13457 461499 272371 100023 85201 99840 249571 528143 310052 55916 172500 195838
13447 195838 257047 254541 472961 287379 49732 90134 268830 103998 -42267 285238 278278
13436 278278 239355 208167 -4500 367653 200974 -24984 517916 73054 529994 396182 224448
13425 224448 21836 163220 55498 200801 144391 174020 254779 15483 -42250 295964 48932
13413 51179 380872 407524 425739 229647 244806 109202 437839 99598 426845 203607
13402 35894 4600 -121120 237981 267638 192009 21301 -68255 203289 -88510 74078 106076
13391 106076 307249 435773 311628 310840 343969 45381 248844 172315 55132 553405 381360
13380 381360 85296 67776 105137 -196281 9211 346744 -176464 356408 144314 124627 175485
$$ packed form
13457D61499j89128A00023j4822J4639J49731K78572k18091E5916J16584K3338
13447A95838O1209k506K18420j85582D9732M0402J78696A03998d2267B85238o960
13436B78278l8923l1188d500C67653j66679b4984E17916G3054M56940j33812j71734
13425B24448B1836J41384E5498J45303n6410K9629Q0759A5483d2250B95964D8932
13413E1179L29693K6652J8215j96092J5159A09202L28637I9598L27247B03607
13402C5894D600a21120B37981K9657p5629B1301f8255B03289h8510G4078L1998
13391A06076K01173J28524j24145p88L3129D5381K03463p6529E5132M98273j72045
13380C81360H5296j7520L7361a96281I211L37533a76464C56408A44314j9687N0858
$$ plain form
13369 175485 199962 144260 432364 213305 -24194 412897 -62435 105983 298134 224490
13359 224490 -120251 337881 433219 406605 123333 127903 350668 71994 401335 274879
13349 274879 255295 456280 572765 -128668 266555 80234 251260 544881 313489 573442
13339 573442 546188 -193268 247865 232720 438642 443924 30448 190090 141417 -165517 532637
13327 94132 -18734 380055 379261 228581 255599 659885 240346 138245 286463 -37616 91293
13315 259586 119584 276878 -201876 -162184 188786 162397 80850 -16260 103216 83075
13305 83075 -158204 420838 -49110 196547 -5636 289340 78481 -132987 -13928 113381 198310
13294 198310 -85294 46149 5007 106190 443483 325680 -198787 201170 214334 76905 437790
$$ packed form
13369A75485K4477n5702K88104B13305b4194D12897f2435A05983J92151p3644
13359B24490a20251C37881R5338k6614A23333M570K22765G1994L29341j26456
13349B74879j9584K00985J16485a28668B66555H0234J71026K93621k31392K59953
13339E73442k7254a93268B47865j5145K05922N282C0448J59642m8673a65517E32637
13327I4132a8734C80055p94j50680K7018M04286B40346j02101J48218c7616I1293
13315B59586A19584J57294b01876L9692A88786k6389H0850a6260A03216k0141
13305H3075a58204D20838d9110A96547e636B89340G8481a32987a3928A13381Q4929
13294A98310h5294D6149E007J01183L37293j17803a98787B01170J3164G6905L60885
$$ plain form
13283 437790 -19648 -59270 260736 -7331 253735 169548 121337 426797 359935 25 -1462 -100178
13271 -100178 283299 211980 -303058 324001 -64805 233966 66842 475966 35433 185655
13261 185655 51275 334392 341988 216869 -71649 311599 120844 245273 126035 156561
13251 156561 154824 255193 303831 325041 80265 -278814 -17080 275850 131962 262160 -211630
13239 278636 147883 344238 86544 303803 121490 102438 111714 -45460 236549 -218514
13228 -18799 247599 -111463 58801 134712 32568 -50493 -4781 83893 -87695 -243218 -260118
13217 -260118 120874 -151613 223080 13296 287282 305763 123608 61582 -41707 163856
13206 63358 229326 88889 -101321 204575 156752 -155536 39021 -134799 202203 349200
$$ packed form
13283D37790a9648l9622B60736g331B53735q4187m8211L05460o6862B5a462r8716
13271a00178B83299p1319c03058C24001f4805B33966F6842M09124C5433J50222
13261A85655E1275K83117P596j25119g1649C11599A20844J24429j19238L0526
13251A56561j737J00369M8638K1210H0265b78814a7080B75850A31962J30198b11630
13239B78636j30753J96355H6544K17259A21490j9052R276d5460B36549b18514
13228a8799B47599a11463E8801P5911C2568e0493d781H3893h7695j55523j6900
13217b60118A20874a51613B23080A3296K73986J8481A23608F1582d1707A63856
13206F3358J65968H8889a01321B04575m7823a55536C9021a34799B02203J46997
$$ plain form
13196 349200 119558 -55711 262523 -72853 374411 42880 -241298 129519 289905 353718
13186 353718 58809 -69252 110729 214455 -87960 -37081 -25755 97148 49127 15697 206386
13175 206386 40271 122151 -15693 129943 344145 -73520 -281962 -42850 167568 -80517 133254
13163 43291 286330 414985 42766 58269 137542 -138435 -131734 31908 -191696 158555 86967
13152 86967 146346 -49949 37414 71520 175395 126627 255003 151485 32267 -30895 247655
13140 133477 -58040 -10896 569198 228829 -61720 104370 96409 48576 515984 28289 89733
13129 89733 -30443 77048 274721 -21954 38821 231303 293851 348834 104120 289603 -59759
13117 -293150 91440 101469 75818 -154236 -135157 -46256 -150759 -96234 -35441 115619 6593
$$ packed form
13196C49200A19558e5711B62523g2853C74411D2880b41298A29519J60386O3813
13186C53718E8809f9252A10729J03726h7960c7081J1326I7148m8021A5697J90689
13175B06386D0271Q1880a5693A29943K14202g3520k08442d2850A67568h0517A33254
13163D3291K43039J28655D2766J5503P9273a38435O701C1908a91696A58555p1588
13152H6967N9379d9949C7414L4106J03875m8768J28376j03518C2267c0895B47655
13140A33477e8040a0896E69198B28829f1720A04370p961m7833M67408B8289O1444
13129H9733c0443G7048J97673b1954C8821J92482O2548N4983A04120J85483e9759
13117b93150I1440J0029k5651a54236J9079d6256j04503N4525c5441A15619F593
$$ plain form
13105 -181405 200212 347795 76570 225294 92739 5168 50617 256200 -6833 63772 488422
13094 488422 119628 60968 -43988 -308770 208311 -124188 228647 25381 -380919 -68300
13083 214130 180948 -126359 54143 -299444 215191 64339 222175 36901 2592 -5539 110724
13071 -66231 -208639 -92926 -283594 305329 -49595 -88894 110814 -165247 381377 -24768
13060 145635 530643 -111609 170173 -72047 -34142 417739 291797 128327 209897 199400
13050 199400 306835 66074 166879 -57093 -143201 -15537 403772 33058 372191 -89849 213504
13038 -57754 276509 69635 -89114 148456 -94395 -63840 222767 48925 259620 -45107 60095
13026 -62123 113905 -314608 272398 176985 246511 178078 220925 140572 -11304 197086 203233
$$ packed form
13105a81405B00212J47583G6570J48724I2739E168M5449K05583f833F3772M24650
13094D88422A19628n8660d3988k64782B08311a24188B28647B5381c80919f8300
13083B14130l3182a26359E4143b99444B15191F4339J57836C6901B592e539A10724
13071f6231j42408i2926j90668C05329d9595l9299A10814a65247C81377b4768
13060A45635L85008a11609A70173g2047c4142D17739j25942A28327Q1570j0497
13050A99400J07435F6074J00805e7093q6108a5537D03772C3058L39133h9849B13504
13038e7754B76509F9635h9114A48456i4395L0555B22767D8925K10695d5107F0095
13026f2123A13905c14608B72398r5413O9526o8433M2847q0353a1304A97086O147
$$ plain form
13015 203233 211049 76506 178451 69353 347207 202372 -37464 264931 249927 172729 279233
13004 279233 101745 330659 -201221 -132454 -28089 479546 11950 292848 42251 110148
12994 110148 111133 -305006 -181209 -113158 -239054 -96932 419416 -207076 266407 21417 -54128
12982 336086 30 293737 107236 96147 -27318 319920 -49909 314767 -37833 -180616 218857
12970 247394 44822 15167 -51185 -53672 204015 189342 -71692 -259133 -39119 -185433 24009
12958 -116287 -27634 119054 -1885 -119526 90375 114858 -120594 151686 -224574 -100758
12947 -41303 262120 16437 183835 306761 9467 20552 -140160 201988 64532 -109125 38911
12935 393763 -84491 -281890 -128713 118290 124321 -220423 -288585 215696 -117054 -131661
$$ packed form
13015B03233P816G6506J01945F9353K77854j44835c7464B64931j5004p7198J06504
13004B79233A01745K28914b01221O8767b8089D79546A1950K80898D2251O7897
12994A10148R85c05006J23797O8051j25896i6932D19416b07076B66407B1417e4128
12982C36086C0K93707A07236j1089b7318C19920d9909C14767c7833j42783B18857
12970B47394D4822A5167e1185k487B04015j4673g1692j87441c9119j46314B4009
12958a16287b7634A19054a885j17641I0375K4483a20594A51686b24574a00758
12947d1303B62120A6437J67398J22926I467J1085a40160B01988F4532a09125C8911
12935C93763h4491j97399a28713A18290O031b20423o8162B15696a17054j4607
$$ plain form
12925 -131661 207240 -242121 -229378 176548 10456 72122 -22061 8124 -49823 -11970 60724
12913 30131 143679 11850 284367 81540 58062 -174466 -243366 76231 -17554 30829 74561
12902 74561 -380427 -121643 29347 58043 -230326 -64396 -71113 42 170931 -48105 129912
12890 216628 136958 12455 155670 -305522 76076 -32569 57240 -156358 -312868 17028 -225441
12878 -134490 167026 30812 -129360 33703 286472 128679 51342 164868 -92661 -120933
12868 -120933 64051 -169437 41511 -133010 174672 -100542 104054 103308 4318 50143 -209404
12856 -94149 51613 107295 145967 194174 18415 65333 51875 -55373 -97038 -44849 144538
12844 -144283 -132044 -231891 -67397 174797 -176869 -51096 -49708 -32907 -267083 -24286 -32548
$$ packed form
12925a31661B07240b42121J2743A76548A0456O1666b2061H124d9823a1970F0724
12913C0131J13548A1850K72517H1540k3478a74466o8900G6231a7554C0829M3732
12902G4561c80427a21643B9347K8696b30326f4396o717D2J70889d8105A29912
12890B16628p9670A2455J43215c05522G6076c2569E7240a56358j56510A7028b25441
12878a34490A67026C0812a29360C3703K52769A28679E1342J13526i2661k8272
12868a20933F4051a69437D1511a33010A74672a00542A04054p46D318M5825b09404
12856i4149E1613N5682L8672M8207A8415M6918j3458e5373m1665d4849A44538
12844a44283J2239r9847f7397A74797a76869e1096J388J6801k34176b4286q262
$$ plain form
12833 -32548 157971 112633 -18982 80376 342895 393452 -59604 223759 -31582 -32795 220484
12821 -15454 116132 -449925 -47196 -945 -2380 164761 132140 -313183 299854 -21215 165533
12809 188352 131868 -281202 -62465 147894 -95956 -119028 -30307 123701 289788 -137278
12798 -175811 290924 -80368 85235 53098 -227777 -95412 -147270 -15911 -80344 -90807 -61202
12787 -61202 -108972 -126847 131681 68818 -96954 -25859 8774 -61422 27813 -48 153675 229351
12775 229351 -91100 89753 92034 -2591 101000 -40916 109088 67345 151370 129200 -4098 65326
12762 -201524 -187906 257783 4563 201874 344694 -16577 310289 -43959 -122733 -19467 128834
12750 169348 99050 -155376 131421 164025 -143911 -67189 267472 1571 -478094 243161
$$ packed form
12833c2548A57971m5338a8982H0376K62519N0557e9604B23759c1582j213B20484
12821a5454A16132d49925d7196i45j435A64761l2621c13183B99854b1215A65533
12809A88352n6484b81202f2465A47894i5956k3072c0307A23701J66087a37278
12798a75811B90924h0368H5235l2137b27777i5412n1858a5911o4433j0463K9605
12787f1202m7770j7875A31681o2863i6954b5859H774f1422B7813d8A53675P5676
12775B29351i1100H9753K281b591A01000d0916A09088m1743Q4025k2170d098F5326
12762b01524J3618B57783D563J97311J42820a6577C10289d3959p8774a9467A28834
12750A69348p0298a55376A31421L2604a43911f7189B67472A571d78094B43161
$$ plain form
12739 32301 42298 121644 -215222 -342567 24972 333034 -305089 22513 32634 -4068 62808
12727 287272 -110647 2019 45021 -96440 137798 293728 -49330 117321 -97059 185216 -32394
12715 -208630 228207 -85120 47855 450919 319556 369287 504211 289574 -99414 -67237
12705 -67237 213557 135964 278241 123048 32580 191588 149646 230419 112766 -71396 7148
12693 -2882 64065 71886 317272 258582 -280688 114334 -48023 7974 155427 -8845 -181888
12682 -181888 270579 49652 -27863 94444 52717 -79488 62384 -5550 299112 -38667 80998
12670 115546 40017 170878 -174735 31071 155145 -80673 58761 -197800 -82161 232654
12659 100738 160148 -27028 41568 -376480 90139 -61179 329643 -351273 -199712 -6085 144327
$$ packed form
12739C2301R997P9346b15222j27345B4972L08062c05089B2513J0121d068F2808
12727B87272a10647B019M3002i6440A37798J55930d9330A17321i7059A85216c2394
12715b08630B28207h5120D7855M03064j31363M9731J34924k14637i9414L2177
12705f7237B13557p7593J42277A23048C2580J59008m1942Q0773A12766g1396G148
12693b882F4065P821K45386n8690b80688A14334d8023G974J47453h845j73043
12682a81888B70579D9652b7863I4444m1727g9488F2384e550B99112c8667H0998
12670A15546D0017J30861a74735C1071J24074h0673E8761a97800h2161B32654
12659A00738N9410b7028D1568c76480I0139f1179C29643c51273J51561f085A44327
$$ plain form
12647 -102919 153751 96642 -209562 -93033 224373 -12081 21260 -97082 90729 117415 170185
12636 170185 5525 154517 93627 -78137 84638 188198 -132092 -84153 220079 213197 69743
12624 238839 -68381 -231292 313294 22579 -83364 -76629 368158 126817 211587 37175 -71174
12612 -172910 -38777 126957 -95480 371169 -51044 17532 165702 -138907 -20498 -154048
12602 -154048 -115364 190355 106914 -176872 -21650 302096 -298855 -322548 82314 -254589
12591 240933 205976 31076 78411 102650 209033 -719 -35858 247003 146581 -240014 -133538
12580 -133538 -377447 183849 -153130 115225 -28582 -317 10436 252618 -212300 -4431 -188494
12569 -188494 -101342 113571 169949 308810 -25332 -209788 41084 -15620 -175758 133510
$$ packed form
12647a02919A53751n7109b09562i3033B24373a2081B1260i7082I0729K6686N2770
12636A70185E525J48992o0890g8137H4638J03560a32092M7939B20079o882F9743
12624B38839f8381j62911C13294B2579h3364O735C68158A26817Q4770C7175g1174
12612a72910c8777A26957i5480C71169e1044A7532J48170a38907b0498j33550
12602a54048L8684A90355q3441a76872b1650C02096b98855k3693H2314b54589
12591B40933l4957C1076M7335K4239J06383g19l5139B47003j00422b40014J06476
12580a33538k43909A83849a53130A15225b8582c17A0436K42182b12300d431j84063
12569a88494Q7152A13571N6378J38861b5332j84456D1084a5620j60138A33510
$$ plain form
12558 131462 166213 34496 286430 44314 -12371 -51182 82882 94845 -59623 -33199 43559
12546 68634 -102024 -337552 -409654 163345 -53752 169274 57334 53374 146653 98146 -54248
12534 -118476 177172 -121056 -302800 425287 -21154 -54926 -105322 -23874 87082 72287 27334
12522 402488 389663 47013 168196 -47252 -278320 -31396 57378 75664 -140778 250998 -84985
12510 89938 44465 215182 242203 422819 -15456 53126 48034 -43801 41271 -540 194972 203014
12498 203014 -71434 -429722 -4558 407596 83878 41409 125405 68210 -27393 -70043 -198624
12487 -198624 -161076 249717 27992 -39883 -61135 21836 -118772 -426483 -122849 227719
12476 364569 -44717 -470900 102711 -177779 295213 223889 58829 -62514 -120791 -283666
$$ packed form
12558A31462L4751C4496K51934D4314a2371l8811H2882J1963e9623K6424D3559
12546F8634a02024k35528p2102A63345e3752A69274E7334l960R3279m8507e4248
12534a18476A77172a21056j81744D25287b1154l3772n0396b3874H7082j4795B7334
12522D02488j2825D7013J21183d7252k31068c1396E7378J8286a40778B50998h4985
12510H9938D4465J70717K7021J80616a5456E3126n092d3801D1271e40A94972Q042
12498B03014g1434l58288d558D07596H3878D1409Q3996n7195b7393m2650j28581
12487a98624L7548B49717B7992c9883k1252B1836a18772l07711a22849B27719
12476C64569d4717m26183A02711a77779B95213p1324E8829f2514n8277j62875
$$ plain form
12466 -283666 -8688 -294399 177289 241963 -71180 -70436 332059 -49939 -78154 155502 -256368
12454 -144637 -137100 -368585 243235 -23071 -39561 22723 210564 73058 122743 2385 -147057
12442 -36301 -255065 -202283 -35207 51639 -49469 -209261 4835 141160 -47429 -143223 211038
12430 99187 100530 -191647 114938 131175 37535 -66523 241992 63083 91725 -1853 -3842 203955
12417 -69743 220487 183505 29536 194901 -56099 -74969 -116946 -375221 -90051 -30030 184317
12405 -22772 59545 58520 68335 52741 41973 71148 -168247 65281 -252743 277687 81517
12393 -298136 165925 235832 83132 -144179 -37478 -300973 50289 -109166 -138536 -234330 -213405
12382 -213405 -120453 83839 -195544 -62419 269168 -175432 186606 -84485 291474 11318
$$ packed form
12466b83666h688k85711A77289O4674g1180P44C32059d9939k8215A55502b56368
12454a44637P537k31485B43235b3071j6490B2723J87841G3058M9685B385a47057
12442c6301k18764N2782c5207E1639d9469j59792D835J36325d7429r5794B11038
12430I9187J343a91647A14938J6237C7535f6523B41992F3083K8642a853j989B03955
12417f9743B20487l6982B9536J65365e6099j8870m1977k58275i0051c0030A84317
12405b2772E9545j025R815j5594j0768K9175a68247F5281b52743B77687H1517
12393b98136A65925O9907H3132a44179c7478k63495E0289a09166k9370r5794K0925
12382b13405R2952H3839a95544f2419B69168a75432A86606h4485B91474A1318
$$ plain form
12371 -9015 -26831 57122 76854 129618 61847 -307455 -34673 38094 50504 -7348 -427775 306954
12358 150623 -92186 -8697 210327 145455 194969 -322411 330 41844 40308 42002 27176 116896
12346 116896 116321 -242240 416136 -58292 82069 -67439 229403 -114009 108290 -90628 190139
12334 -195348 -236140 -177313 -221945 -50867 195634 958 -102714 75328 116275 -122001 -53136
12322 -1818 -34424 246300 -182204 40949 188121 -144829 29617 -10820 -256738 15621 -48739
12310 -44228 185663 17859 -118747 -307277 -113651 35751 269066 357189 175829 149929
12300 149929 -300239 -183519 183141 -111429 384232 46996 271633 -426 -49153 109106
12289 -34393 -108722 111725 -50810 36519 96161 92581 75664 -239815 76950 51288 182042
$$ packed form
12371i015j7816E7122J9732N2764F1847c07455c4673C8094J2410g348m20427C06954
12358A50623i2186h697B10327o4872M9514c22411C30M1514j536J694j4826Q9720
12346A16896n75b42240D16136e8292H2069f7439B29403a14009A08290i0628A90139
12334a95348m0792N8827m4632e0867A95634I58a02714G5328M0947a22001e3136
12322a818l2606B46300a82204D0949J47172a44829B9617a0820k45918A5621d8739
12310d4228A85663A7859a18747j88530a13651C5751K33315Q8123A75829k5900
12300A49929c00239J16720A83141a11429C84232D6996K24637d26m8727A09106
12289c4393p4329A11725e0810C6519N9642l580j6917b39815G6950k5662J30754
$$ plain form
12278 182042 38643 -44573 -24039 410708 164576 17114 -362577 93038 -108980 -18640 312340
12266 164635 191316 -77828 121667 242340 61653 -22364 130502 224507 -202635 64459 144463
12255 144463 -104974 63238 33289 349049 164838 75077 -63427 287861 41854 375749
12245 375749 182531 -159721 130285 -9130 36299 151695 -222486 182517 277603 10665
12234 203184 245988 240891 -258976 7373 -15778 -66678 223005 265880 -14483 12607 3073 529530
12222 529530 -15808 90197 141705 256476 167642 155839 563692 111417 110021 208486 342594
12211 342594 122460 47845 -231687 -121166 -281665 123142 -88485 -106597 -16964 -11606 147527
12199 450695 263170 213100 410162 39096 -67300 -109156 -142047 169783 180233 -25193 52800
$$ packed form
12278A82042C8643d4573K0534D10708A64576A7114c62577I3038a08980a8640C12340
12266A64635K6681g7828A21667J20673F1653b2364A30502R4005b02635F4459Q0004
12255A44463a04974F3238k9949L15760A64838G5077f3427B87861D1854L33895
12245C75749A82531a59721A30285i130C6299J15396b22486A82517R5086A0665
12234B03184M2804n097b58976G373a5778n0900B23005M2875a4483A2607C073N26457
12222E29530a5808I0197N1508J14771q8834j1803M07853A11417j396R8465J34108
12211C42594A22460D7845b31687J10521j60499A23142h8485j8112a6964N358A47527
12199D50695j87525n0070J97062C9096f7300m1856l2891A69783J0450b5193E2800
$$ plain form
12187 144714 2067 15205 -63841 -85098 67337 -144380 -24638 -108371 218321 -42564 334039
12175 47285 297230 200813 363212 -52577 159246 195849 143748 509714 392178 429252 40818
12163 166023 156589 -115328 37942 140501 155686 215969 110484 -56919 70739 -49984 29783
12151 226510 164342 -23063 263500 372805 129374 -6277 79967 -93274 206216 -118721 -246447
12140 -246447 274188 145012 47726 92439 28591 -4784 -16574 -9156 111926 44954 27998
12129 27998 48692 -65750 -38712 -32907 342055 -172501 69452 -148440 -25684 73892 -24687
12117 -40785 -41566 95636 8413 56833 1176 -4267 132421 59724 -239716 -4539 66840 106842
12105 106842 12376 -86523 180788 -21209 99431 155519 -105553 -42967 -241076 22214 151700
$$ packed form
12187A44714B067J3138f3841k1257F7337a44380b4638q3733B18321d2564C34039
12175D7285K49945r6417J62399e2577A59246L6603n2101L65966j17536L7074D0818
12163A66023r434a15328C7942J02559J5185O0283j05485e6919G0739d9984B9783
12151B26510o2168b3063B63500J09305A29374f277G9967i3274B06216a18721j27726
12140b46447B74188j29176D7726M4713B8591d784j1790P418A11926D4954j6956
12129B7998K0694f5750K7038N805C42055a72501F9452a48440b5684G3892b4687
12117d0785p81I5636H413M8420A176d267A32421E9724b39716d539F6840M0002
12105A06842A2376h6523A80788b1209I9431N6088a05553d2967j98109B2214J29486
$$ plain form
12094 151700 176898 5492 -50041 21568 80344 127094 151860 78104 312536 649124 1645263
12083 1645263 822808 381361 62137 -122192 -227165 -271323 -170151 -261509 141542 150090
12073 150090 34159 49543 147656 -21194 251554 -214168 -180478 -336373 -143464 -227054 82841
12061 -129343 -91134 -13125 -120519 145844 52770 192924 -70139 -340357 126548 -303558
12050 120409 34177 -143482 -92000 -96032 -214342 69186 -206244 -121886 -149014 -195529 420402
12038 -168250 181998 53580 -73556 87669 -43918 -147622 186106 223316 120561 197620 -161816
12026 130792 23613 -212815 -67088 -285349 132571 -49720 551764 137434 75363 56079
12016 56079 191986 71101 320531 -98864 163323 281019 123336 -57664 -193178 123958
$$ packed form
12094A51700K5198E492e0041B1568N8776M6750K4766p3756K34432L36588R96139
12083A645263q22455C81361F2137a22192j04973m4158J01172r1358A41542Q548
12073A50090C4159J5384R8113b1194B51554b14168L3690j55895a43464q3590H2841
12061a29343L8209a3125j07394A45844E2770J40154g0139k70218A26548c03558
12050A20409C4177a43482N1482m032j18310F9186b06244Q4358k7128m6515D20402
12038a68250A81998E3580g3556H7669d3918j03704A86106L7210j02755P7059a61816
12026A30792B3613b12815f7088k18261A32571d9720E51764A37434o2071j9284
12016E6079J35907G1101K49430i8864A63323J17696A23336e7664j35514A23958
$$ plain form
12005 -240189 330154 95595 6527 114126 -20176 -263761 -211698 -68023 -7206 -115330 33761
11993 414626 -91642 51810 -9494 -62303 -187683 32286 -18553 369725 282580 -112516 -2001
11981 269079 95848 100854 -42915 -205577 23880 -6645 -73633 102742 -38467 48188 151664
11970 151664 -14123 -22815 93283 105465 167279 80086 134715 -295249 -114001 158723 221756
11959 221756 -131641 -1501 -89619 -74404 -32558 -154037 34634 76549 67896 -165705 -146318
11948 -146318 -55499 204701 34802 195074 -178222 373117 49026 4531 -109129 -85903 -147086
11937 -147086 37922 -29450 69446 18010 -57108 -216666 -134955 -190950 -193072 152417 -37354
11925 -103249 14223 473121 171445 -268615 67811 69189 -83423 -53928 -119541 78973 174257
$$ packed form
12005b40189C30154I5595F527J07599b0176k43585N2063f8023g206j08124C3761
11993D14626i1642E1810i494n2809j25380C2286a8553C69725q7145a12516b001
11981B69079I5848N006d2915j62662B3880f645o6988A02742c8467D8188J03476
11970A51664a4123q692I3283J2182O1814H0086N4629b95249a14001A58723O3033
11959B21756a31641a501q8118J5215c2558j21479C4634M1915q653a65705J9387
11948a46318e5499B04701C4802J60272a78222C73117D9026D531a09129K3226o1183
11937a47086C7922b9450F9446A8010e7108j59558Q1711n5995k122A52417c7354
11925a03249A4223M58898A71445b68615F7811J378h3423K9495o5613G8973R5284
$$ plain form
11914 174257 73868 84351 137674 -42136 54119 -17846 -107440 72808 37372 -18244 -623 86037
11901 103212 453936 52607 -199843 -53638 133983 30763 -228448 -47814 7876 -96300 151144
11889 69546 -47113 -697 -78445 -166001 -346029 179066 346759 -118261 -301393 -180126 -161737
11878 -161737 104570 -174246 -492967 155685 -83618 207421 -205450 -87591 -137007 -132141
11868 -132141 250466 -36544 188868 35711 -49660 -422258 -65632 -98151 -303065 -46063 123369
11856 -97224 -4072 -57045 -97869 -97354 -163054 251280 -216628 288677 47152 -20774 42947 -50431
11843 -153968 -125253 -419430 152477 -66220 -105421 -93797 106451 57776 -204841 -26623 -147892
11832 -147892 136230 222706 -49117 -5538 -35920 -39568 -288206 58693 -93704 80400 38265
$$ packed form
11914A74257G3868J0483N3323d2136E4119a7846q9594G2808l5436a8244f23H6037
11901A03212L50724E2607a99843e3638A33983C0763b28448d7814G876i6300A51144
11889F9546d7113f97p7748q7556j80028A79066J67693a18261j83132J21267J8389
11878a61737A04570a74246l18721A55685h3618B07421b05450h7591m9416M866
11868a32141B50466c6544A88868C5711d9660l72598f5632l2519k04914d6063A23369
11856i7224d072n2973m0824N15o5700B51280b16628B88677D7152b0774D2947e0431
11843a53968K8715k94177A52477f6220l9201J1624A06451m8675b04841b6623j21269
11832a47892A36230Q6476d9117e538l0382l648k48638E8693i3704H0400C8265
$$ plain form
11820 -129257 1558 -145393 7791 -188052 259576 -10845 85696 -329063 -80443 -518884 46326
11808 -328991 -11731 137312 -143948 -193606 89324 44438 40985 -142113 -360679 -10737 -198703
11797 -198703 113549 -164372 105751 82165 -76513 6868 140515 17354 -439057 -185483
11786 44770 133451 248597 -184 -336303 64081 -169208 -3585 -25028 191883 -28229 -39781
11775 -39781 159587 -422489 -80718 128992 222532 10250 -243408 50361 141045 -103111 -29504
11763 -132390 175479 186067 -40561 -15513 128731 -193685 179001 54296 -46229 -53606 172575
11751 195446 -18384 315211 7584 -159121 -145052 -73106 20166 40408 -133047 -268518 105250
11739 -168372 -62909 141059 307401 -210108 97042 21888 -83173 -72333 19621 -464731 -19798
$$ packed form
11820a29257A558a45393G791a88052B59576a0845H5696c29063h0443m38441D6326
11808c28991a1731A37312a43948m9658H9324D4438l453a42113k18566a0737j87966
11797a98703A13549a64372A05751k3586g6513F868J33647A7354d39057a85483
11786D4770Q8681J15146a84l36119F4081a69208c585k1443A91883b8229j1552
11775c9781A59587d22489h0718A28992R3540A0250b43408E0361R0684a03111b9504
11763a32390A75479J0588d0561a5513A28731a93685A79001E4296d6229p377A72575
11751A95446a8384C15211G584a59121J4069P1946B0166K0242a33047j35471A05250
11739a68372f2909A41059J66342b10108I7042B1888h3173J0840A9621d64731a9798
$$ plain form
11727 -125534 -143995 -18090 -158795 -58199 -6009 -181854 -332582 -98348 19164 -154706 -45835
11715 -319891 -29699 25017 83532 95306 205643 -3707 -177317 60372 -37288 -28084 18925
11703 116164 44944 48473 164742 225001 -212774 158246 -130248 20028 -228081 -216719 201055
11691 142458 -61656 -258433 -90834 336588 63986 312044 112504 99769 163886 137770 -288352
11679 316877 -159076 116974 177465 -114759 291733 -252827 -356 65165 -169959 29060 -32953
11667 37235 51445 -15459 558 -199696 378957 -113897 -214057 292786 197594 -44144 2231
11655 573375 -64333 358544 -132851 57150 20920 27651 -15254 232577 325880 91731 -115390
11643 318800 58316 -312 -144538 106582 -25647 -212759 306439 -207138 177246 -35042 252946
$$ packed form
11727a25534j8461a8090j40705e8199f009j75845j50728i8348A9164a54706d5835
11715c19891b9699B5017N8515J1774J10337c707j73610F0372c7288R204A8925
11703A16164D4944L529J16269O0259b12774A58246a30248B0028b28081J1362B01055
11691A42458f1656j96777i0834C36588F3986K48058A12504j2735O4117k6116b88352
11679C16877a59076A16974O0491a14759B91733b52827c56F5165a69959B9060c2953
11667C7235J4210a5459E58a99696C78957a13897j00160B92786r5192d4144B231
11655E73375f4333C58544a32851E7150B0920O731a5254B32577R3303I1731a15390
11643C18800E8316c12j44226A06582b5647j87112C06439b07138A77246c5042B52946
$$ plain form
11631 60480 134013 -67540 -128523 -74289 6345 298890 36427 -36721 57282 115130 -71655 -144836
11619 -144836 -47932 -153084 204989 132403 176318 116265 -103233 270635 -174386 20478
11608 -362844 -182834 215874 -341118 -69909 147165 -126 29397 151143 211267 163965 217370
11597 217370 170194 140295 89290 235233 -268580 -53542 49401 171900 -255005 108882
11586 -167992 5155 -7654 139108 67887 -10516 485860 -82300 185002 -189853 -71252 -99680
11575 -99680 7423 21989 -228292 -68226 107689 10327 365370 76487 -243615 131383 151158
11564 151158 60578 -51747 -199960 113164 114059 34294 -127702 -43056 -6562 -135612 -39668
11552 185649 -120900 446140 84977 156608 -298424 238118 -234647 9292 -427312 50120
$$ packed form
11631F0480P3533f7540o0983N4234F345K92545C6427c6721E7282N7848g1655p3181
11619a44836d7932j05152B04989p2586M3915o0053a03233B70635a74386B0478
11608c62844J80010B15874c41118f9909A47165a26B9397J21746O0124m7302N3405
11597B17370m7176k9899n1005J45943b68580e3542D9401J22499b55005A08882
11586a67992E155g654A39108F7887a0516D85860h2300A85002a89853g1252k8428
11575i9680G423J4566b28292f8226A07689A0327L55043G6487b43615A31383J9775
11564A51158F0578e1747j48213A13164Q95C4294a27702d3056f562j29050c9668
11552A85649a20900D46140H4977P1631b98424B38118b34647I292d27312E0120
$$ plain form
11541 -347953 51310 74372 -203072 -175332 244925 111543 9499 -4042 -60963 -129881 -47305
11529 -54927 38763 367785 87641 -86236 25702 -80506 -212155 -8238 205741 -93102 49921
11517 94355 69990 139982 466468 335138 -119590 400248 -261635 -187051 188240 -24881
11506 401453 12669 123367 107219 329230 114103 192493 245977 -103690 444 152806 -17746
11494 124002 27596 372727 -120045 -66945 -88574 207864 212543 239812 -133734 -135536 147780
11482 -131010 164159 -2367 179884 173380 348231 89429 324754 148434 147542 59901 96896
11471 96896 6675 -286027 403244 141840 31476 192924 155467 278911 -8895 -21288 183529
11459 29911 -188230 51239 -129014 64143 136450 -117096 -62638 -309112 -252201 -170356 4969
$$ packed form
11541c47953E1310K3062b03072K7740B44925A11543I499d042n6921o8918d7305
11529e4927C8763L29022H7641h6236B5702h0506j31649h238B05741i3102D9921
11517I4355k4365O9992L26486j31330a19590D00248b61635P4584A88240b4881
11506D01453A2669J10698j6148K22011A14103P8390N3484a03690D44J52362a7746
11494A24002B7596L45131a20045N3100k1629B07864M679K7269a33734j802A47780
11482a31010A64159b367A79884o504J74851H9429K35325A48434q92E9901L6995
11471I6896F675b86027D03244A41840C1476J61448l7457J23444h895j2393A83529
11459B9911a88230E1239a29014F4143P2307a17096N4458k46474N6911Q1845D969
$$ plain form
11447 44817 229095 -11591 94316 37505 -11623 -59753 -183763 -96871 7881 211184 78731
11435 106810 176917 132277 199676 -87240 -126494 -65461 -127569 -5650 -35445 158659 -43681
11423 -235497 63191 151017 -408688 -201818 48796 -204258 44205 -41777 -33230 -53514 123100
11411 -772 -87841 66361 -83991 -137463 246641 92851 22771 -287648 -30483 152939 -171832
11399 -70970 89625 -424849 70498 -388153 -43303 -43561 -192976 -291415 -207198 -410553 -194294
11387 199246 4051 9581 7532 109072 -123570 -126967 198087 -35394 -90515 -905 192161 -13108
11374 133601 69689 111172 -154857 228817 -178489 12903 -39272 53155 316775 231049 125704
11363 125704 169207 -70408 -206143 30707 -91350 196288 -81099 -274347 -165392 253671
$$ packed form
11447D4817J84278a1591I4316C7505a1623m8130j24010Q6892G881K03303G8731
11435A06810P0107m4640O7399h7240l9254O1033o2108e650k9795A58659d3681
11423b35497F3191Q7826d08688b01818D8796b04258D4205d1777Q547k0284A23100
11411g72q7069F6361h3991n3472B46641I2851B2771b87648c0483A52939a71832
11399g0970H9625d24849G0498c88153d3303k58j49415r8439Q4217k03355a94294
11387A99246D051N530k049J01540a23570l397A98087c5394n5121i05A92161a3108
11374A33601o3912M1483a54857B28817a78489A2903c9272E3155K63620q5726j05345
11363A25704M3503g0408j35735C0707i1350A96288h1099j93248J08955B53671
$$ plain form
11352 -45750 -14792 110706 -297258 -169060 -41026 -116276 -366896 25809 -78758 -182406 484559
11340 -17453 264986 46709 -181002 -39214 -247273 -56181 105938 171589 116069 -7325 -1160
11328 2599 286369 23053 41414 -170065 231464 71538 55994 -129981 143617 -137040 21804
11316 58354 -48308 292899 -29784 -205735 -62529 -42048 -287441 293864 25704 -21425 105232
11304 71000 234661 183838 -104950 344460 11499 108757 -24241 -51855 -43213 39541 -70033
11292 17382 -237241 176283 -24727 -57855 -319752 -135584 -7637 88994 114274 62361 -192019
11280 -43610 -94279 -197543 -119004 103604 157175 -90459 296421 -4871 257314 -14760 -129214
11269 -129214 12333 -317777 -177883 23791 -91055 -43590 39396 -151207 -25569 296621 12031
$$ packed form
11352d5750a4792A10706b97258J28198d1026p5250k50620B5809g8758j03648D84559
11340a7453B64986D6709a81002c9214k08059e6181A05938O5651n5520g325a160
11328B599K83770B3053J8361a70065B31464G1538j5544a29981A43617a37040B1804
11316E8354d8308B92899b9784j75951f2529K0481k45393B93864B5704b1425A05232
11304G1000J63661n0823a04950C44460A1499R7258b4241k7614Q642C9541g0033
11292A7382b37241A76283b4727l3128k61897a35584g637H8994K5280n1913a92019
11280d3610n0669j03264P8539A03604N3571i0459B96421d871B57314a4760j14454
11269a29214A2333c17777J39894B3791i1055d3590C9396a51207b5569B96621A2031
$$ plain form
11257 -45989 141700 -57425 -515423 -222721 459420 -266768 -37635 -113481 -19529 102232
11246 -104629 -214016 107088 41721 110122 -16153 -186439 -205937 68567 86044 -23191 143896
11234 62215 45473 98886 240460 101726 157007 -125495 -54176 264969 225538 195366 90075
11222 -82275 -87745 -246038 -132129 -37016 -170840 6752 -67124 -346483 -94255 79193 55088
11211 55088 -347012 -114839 -258734 -164869 206008 -380896 -102851 -74988 208640 -127568
11200 -169146 -391818 -120429 128751 182097 104905 -141649 -152345 69422 -100672 -321019
11190 -321019 -70160 82372 126661 -111301 -93067 -38073 50990 51135 18931 335285 141531
11178 -238871 -155634 -195132 21939 38615 -130930 -366243 24482 124663 -85021 -22933 -365598
$$ packed form
11257d5989A41700e7425m57998b22721D59420b66768c7635p5846a9529A02232
11246a04629j09387A07088D1721O8401a6153j70286j9498F8567J7477b3191A43896
11234F2215j6742N3413J41574A01726N5281a25495e4176B64969l9431l0172I0075
11222h2275n470j58293J13909c7016j33824F752f7124k79359i4255G9193k4105
11211E5088c47012a14839j43895R3865B06008c80896a02851K7863B08640a27568
11200a69146k22672a20429A28751N3346p7192a41649j0696F9422a00672k20347
11190c21019g0160H2372M4289a11301J8234c8073E0990J45A8931L16354A41531
11178b38871Q3237l9498B1939J6676a30930k35313B4482J00181h5021b2933l42665
$$ plain form
11167 -365598 -330138 -171237 60248 95708 -324982 258106 142613 -16650 281796 -114738
11156 -219242 -54125 270903 -177198 -146170 241015 -436 -184058 -313311 65360 -98759 -213016
11145 -213016 -64257 -234353 82015 -216783 -148656 48639 151956 -84353 -63776 -47090 66190
11133 240784 27823 130064 -190478 -298511 -193143 233889 -4936 46006 -157571 -96104
11123 -96104 -109773 415481 -11707 317329 102834 75683 321528 -29219 -288757 -59473 66322
11111 55410 194270 -213054 28785 343608 -182104 -126338 -56183 133857 1791 147069 702
11099 -7725 351936 -33049 375518 274905 460176 87491 -28633 -35666 131538 -169213 326279
11087 111534 362198 85485 153013 53236 11284 5965 352537 269908 -8827 240279 127626
$$ packed form
11167c65598L5460J58901F0248L5460c24982B58106j15493a6650B81796a14738
11156b19242e4125B70903a77198L1028B41015d36j83622j29253F5360i8759j14257
11145b13016f4257j70096H2015b16783O8127D8639J03317h4353K0577J6686F6190
11133B40784B7823J02241a90478j08033J05368B33889d936D6006a57571O1467
11123i6104j3669D15481a1707C17329A02834k7151K45845b9219k59538e9473F6322
11111E5410J38860b13054B8785L14823a82104N5766e6183A33857A791J45278G02
11099g725C51936c3049C75518j00613J85271H7491b8633p033A31538a69213C26279
11087A11534K50664H5485O7528E3236A1284n319L46572q2629h827B40279j12653
$$ plain form
11076 127626 277682 1428 254953 152244 488378 171809 94451 213853 108896 234390
11066 234390 228116 229928 174419 617447 305688 257717 233491 405832 254696 574391 320851
11055 320851 399375 540588 635650 661709 660433 460945 694915 896827 694366 339262
11044 956576 544527 505013 415274 449391 569683 678747 445924 308089 278958 523815
11034 523815 386341 399020 759536 66967 478187 419484 451921 537764 341965 338310 608991
11023 608991 272418 628664 461680 465439 414543 162520 221880 349533 223864 456747
11013 456747 503118 229654 467458 143080 419030 387396 598155 426768 501547 582940
11003 582940 510311 600656 567646 492438 222232 487433 544409 164539 543214 439316
$$ packed form
11076A27626J50056A428K53525j02709L36134A71809p7358J19402j04957J25494
11066B34390o274J812n5509M43028C05688m7971k4226J72341j51136L19695k53540
11055C20851P8524J41213R5062K6059j276j99488K33970K01912k02461C39262
11044I56576m12049l9514q9739L4117J20292J09064k32823j37835k9131K44857
11034E23815j37474J2679L60516F6967M11220n8703L2437Q5843j95799l655K70681
11023F08991B72418L56246j66984L759n0896A62520N9360J27653j25669K32883
11013D56747M6371B29654K37804A43080K75950l1634K10759j71387P4779Q1393
11003E82940p2629R0345l3010p5208B22232K65201N6976A64539L78675j03898
$$ plain form
10993 439316 439814 407027 503386 217572 618311 452517 509984 234882 554942 588263 560553
10982 560553 929062 366592 398495 722537 1058978 845275 704900 991712 991564 1518799
10972 1518799 1774221 1739746 2201661 2025204 2204690 1751483 1846658 1652558 1740532 1130385
10962 1130385 1511193 1064022 1029667 1230639 1150531 1203390 1125436 1598166 1446324 1221394
10952 1221394 1301094 922829 1052055 519395 651400 356213 420545 399948 235500 324873
10942 324873 272235 627054 342839 -115091 -113076 451099 153410 -319705 8405 503380
10932 503380 124662 61069 -281790 30110 149127 -132416 -139377 16227 30416 -95916 -68675
10921 -68675 -169538 50757 10544 -11658 237966 -101101 107745 -139621 -13547 66203 -44105
$$ packed form
10993D39316M98l2787R6359B17572M00739j65794N7467B34882L20060L3321k7710
10982E60553L68509C66592L1903L24042L36441k13703j40375K86812j48N27235
10972A518799K55422l4475M61915j76457J79486m53207R5175j94100Q7974o10147
10962A130385L80808m47171l4355K00972q0108N2859p7954M72730j51842k24930
10952A221394P9700l78265J29226E19395J32005k95187O4332k0597j64448Q9373
10942C24873n2638L54819k84215a15091K015D51099A53410c19705H405M94975
10932E03380A24662F1069b81790C0110J19017a32416o961A6227J4189i5916K7241
10921f8675j00863E0757A0544a1658B37966a01101A07745a39621a3547F6203d4105
$$ plain form
10909 -304575 -108437 45312 -29500 -103701 -302469 -67473 -255377 114860 140931 -88684 -405543
10898 -405543 -6726 174301 -369512 -21238 120548 10257 -199607 207960 -250183 240783
10887 122561 -476917 103357 -255088 -77346 -98088 -124059 -73406 36510 214043 231853 -196891
10875 189783 243658 158847 -164959 347584 111166 183011 -58191 104448 -297660 -119764
10864 89693 212641 129433 -46861 -73078 83064 -51953 100349 41121 243314 349475 -103285
10852 82592 -235505 -103767 168271 125558 102695 231542 181403 16513 -86903 -146156 66494
10840 -7685 -87414 -77978 -103455 -389442 226225 243933 47835 -24048 216929 15431 3335 10651
10828 10651 -53468 3784 -547231 -262656 -26652 -50553 -106786 70593 -171744 316536 -277617
$$ packed form
10909c04575a08437D5312b9500p4201j98768f7473j87904A14860K6071h8684l16859
10898d05543f726A74301c69512b1238A20548A0257a99607B07960b50183B40783
10887A22561d76917A03357b55088g7346k0742k5971N0653C6510J77533J7810a96891
10875A89783N3875q4811a64959C47584A11166P1845e8191A04448b97660a19764
10864H9693J22948q3208d6861k6217H3064e1953A00349D1121K02193J06161a03285
10852H2592b35505a03767A68271m2713k2863J28847n0139A6513h6903n9253F6494
10840g685p9729R436k5477k85987B26225J7708D7835b4048B16929A5431C335P316
10828A0651e3468C784e47231b62656b6652k3901n6233G0593a71744C16536b77617
$$ plain form
10816 -23820 324630 116187 -152379 279870 16418 -336903 -78117 -11771 90697 106104 -1597
10804 264208 -132110 -151321 127216 -55053 86048 150144 -134960 316471 109066 66736
10794 66736 123674 -154727 134062 77987 263920 -18655 -292347 191334 -217785 -388 131841
10782 -52465 -22392 -167296 79209 -253032 -208535 -138019 -67124 -62728 -21383 -116648 48664
10770 33372 -6137 323462 -67245 -309284 -63576 -230769 -127974 192400 209340 -268906 -205884
10759 -205884 -270647 124435 10366 11644 92333 38731 -61139 148315 -307699 -114063 -29805
10747 -8613 -101551 -95133 37968 294991 -71014 -295539 -396939 -24418 -136380 179036 258041
10736 258041 244671 57371 -258949 26374 -169121 -122673 -209778 -222896 -160201 69215 98709
$$ packed form
10816b3820C24630A16187a52379B79870A6418c36903g8117a1771I0697J5407a597
10804B64208a32110j9211A27216e5053H6048O4096a34960C16471A09066m2330
10794F6736N6938a54727A34062n6075J85933a8655k73692A91334b17785c88A31841
10782e2465b2392j44904G9209b53032M4497P0516f7124M396b1383r5265D8664
10770C3372f137C23462f7245k42039f3576j67193J02795A92400J6940b68906O3022
10759b05884o4763A24435A0366J278Q0689C8731f1139A48315c07699a14063b9805
10747h613r2938O418C7968K57023g1014k24525j01400b4418j11962A79036P9005
10736B58041j3370E7371b58949B6374a69121M6448q7105j3118O2695F9215K9494
$$ plain form
10725 98709 -199900 -142550 5820 4001 83325 -265225 205654 -35679 2335 50046 -156627
10713 -233013 -333813 -274650 62993 105734 -176433 47845 -24773 240928 -299564 64711 -21952
10701 -78228 -50689 114469 -161175 12974 -537784 -223888 -48757 -29742 -34953 -312171 -68234
10689 61025 -92154 -158774 -283017 -66291 109446 -205489 -149227 -229621 -11413 -106018 -75030
10678 -75030 -55577 -79936 -160540 -105609 -319909 90498 -192360 19838 46014 -1737 -6891 -83750
10666 -83750 -352904 295291 72402 -288904 -233681 -54596 10914 111945 40337 -102798 -210509
10655 -210509 -66562 34736 -63092 -31445 53219 -119634 -128158 138596 55336 -134610 251131
10643 -149268 -263187 169382 57412 36348 -11225 -237332 -60876 -225564 -92488 -149843 -306272
$$ packed form
10725I8709a99900N7350E820j819P9324b65225B05654c5679B335M7711a56627
10713b33013j00800N9163F2993M2741a76433D7845b4773B40928b99564F4711b1952
10701g8228K7539A14469a61175A2974e37784b23888d8757J9015n211k77218f8234
10689F1025i2154o6620j24243f6291A09446b05489N6262q0394a1413r4605L0988
10678g5030J9453k4359q0604N4931k14300I0498a92360A9838K6176a737n154p6859
10666h3750k69154B95291G2402b88904N5223e4596A0914J01031D0337a02798j07711
10655b10509f6562C4736f3092c1445E3219a19634q524A38596E5336a34610B51131
10643a49268j13919A69382E7412k1064a1225k26107f0876j64688i2488n7355j56429
$$ plain form
10632 -306272 -407042 6148 282986 41025 -253127 -139974 147505 -170792 -84658 -69152
10622 -69152 268536 -270003 -12148 -129442 -126617 35306 -227648 -249986 89871 -155045 11449
10610 34990 72937 -188759 13359 82637 -290637 -39658 -155061 6021 -46178 -340032 325616
10598 -329731 -159629 -195204 835 -226396 153350 130370 -393170 -34769 -35042 -19675 17079
10586 -217192 -94523 126883 166888 -113128 205 105981 -29486 17069 -136640 -273311 -87517
10574 161438 191508 46009 174256 -132864 -182259 -109138 -98203 -174110 91921 -104533 -114184
10563 -114184 82723 -183469 74556 -19054 -16430 82887 -17648 -410754 -149254 3773 34782
10552 34782 45705 120949 -320693 112447 84775 57588 -79776 154481 -202185 6013 45943
$$ packed form
10632c06272j00770F148K76838D1025b53127J13153A47505a70792h4658J5506
10622f9152B68536b70003a2148j17294K825C5306b27648k2338H9871a55045A1449
10610C4990L7947a88759A3359O9278b90637c9658j15403F021d6178k93854C25616
10598c29731a59629l5575H35b26396A53350k2980c93170c4769k73J5367A7079
10586b17192i4523A26883M0005a13128B05J05776b9486A7069a36640j36671h7517
10574A61438L0070D6009J28247a32864m9395P3121J0935p5907I1921a04533r651
10563a14184H2723a83469G4556a9054K624H2887a7648l93106a49254C773L1009
10552C4782J0923P5244c20693A12447k7672k7187g9776A54481b02185F013L9930
$$ plain form
10541 45943 -179254 154260 48476 -53329 4986 49063 55545 -235960 117484 -166050 302024
10529 183215 -367774 -174658 -59279 97704 -72520 89009 -83884 -239558 75927 -46943 -171263
10518 -171263 15653 220289 7998 -124788 137624 94119 -139444 -22976 -15534 -155469 -48228
10506 -166382 79226 54511 -217736 62015 -142501 -212253 112985 26274 -257000 136584
10495 -20061 -76379 -240250 67116 69160 201251 5840 -35443 -454605 51075 -163278 288454
10483 -287065 176103 -46740 370896 233554 334746 347242 121422 142957 -68878 228136
10472 154306 -146505 -74897 39676 46495 97879 468894 -38336 59426 -9955 117921 -3982
10460 99573 14660 293919 -247100 -1503 38552 -330150 -380902 164778 -94371 -13353 -167883
$$ packed form
10541D5943a79254A54260D8476e3329D986M4077O482b35960A17484a66050C02024
10529A83215c67774a74658e9279I7704g2520H9009h3884j55674G5927d6943j24320
10518a71263A5653K04636G998a24788A37624m3505a39444b2976P442j39935d8228
10506a66382G9226k4715b17736F2015a42501o9752A12985B6274b57000A36584
10495b0061n6318j63871F7116K044J32091E840c5443m19162E1075a63278B88454
10483b87065A76103d6740C70896j37342J01192J2496A21422K1535f8878B28136
10472A54306a46505P1608C9676O819N1384L71015c8336E9426i955A17921c982
10460I9573A4660K79259b47100a503C8552c30150n0752A64778i4371a3353j54530
$$ plain form
10449 -167883 -74294 295694 118310 -65297 393492 213824 -142899 -191733 2524 200339
10439 200339 -119344 -74551 121823 31751 51441 224651 -738 63174 -11609 -8 -54064 -243732
10427 -243732 -33426 -241874 -13500 -55279 -314764 -301475 -44275 206257 197934 128889 -338033
10415 -16889 -84403 -218516 95311 -16426 53438 145009 -54530 106565 -155532 -82569 180868
10403 116825 42212 -80293 -68594 104813 -104568 13086 -169369 -9167 96247 -126109 47357
10391 122192 -224618 295577 -125283 -30963 196122 1411 257737 -48009 200453 150990
10381 150990 -41811 -148505 -460687 115479 80564 257081 99208 264166 342790 -19914
10370 491310 -73287 109082 369617 463174 125071 435633 147661 -22948 28865 204548
$$ packed form
10449a67883g4294B95694A18310f5297C93492j79668a42899m8834B524J97815
10439B00339a19344M4793A21823C1751J9690J73210g38F3174a1609hn4056j89668
10427b43732c3426k08448a3500m1779k59485J3289d4275B06257q323o9045c38033
10415a6889o7514j34113I5311a6426E3438R1571e4530A06565a55532P2963A80868
10403A16825D2212h0293J1699A04813a04568A3086a69369i167I6247a26109D7357
10391A22192b24618B95577a25283c0963A96122A411K56326d8009B00453m9463
10381A50990d1811j06694l12182A15479l4915J76517I9208J64958P8624a9914
10370D91310g3287A09082K60535R3557A25071L10562A47661b2948B8865J75683
$$ plain form
10360 204548 416279 142846 11617 139436 239781 35587 183272 294641 75760 23162
10349 375146 51233 346412 495072 583131 333084 83043 559287 573679 379271 125512
10338 363339 176894 322462 372543 206536 70463 -124777 126441 52674 397264 212170
10328 212170 -101604 -30264 -53397 107362 -92776 -36307 301752 298753 -67841 172886 151013
10317 151013 126296 -153552 8374 70397 -89500 175674 107777 -162523 224161 -288972 -28967
10305 115241 25918 -172300 -81864 248080 -202862 253096 75492 -31981 -54843 -85382 179693
10293 -50053 -56138 -128110 104830 257470 -188542 -57044 -148758 -97880 182824 19996 -127326
10281 -386717 46014 35235 -34958 4138 -84625 101193 54027 -60608 646 -271414 -83389 101973
$$ packed form
10360B04548K11731A42846A1617J27819J00345C5587J47685J11369G5760B3162
10349C75146E1233K95179J48660Q8059k50047H3043M76244J4392j94408A25512
10338C63339A76894J45568N0081j66007G0463a24777A26441E2674L44590j85094
10328B12170a01604c0264k3133A07362i2776c6307C01752k999f7841A72886k1873
10317A51013k4717a53552H374O2023h9500A75674o7897a62523B24161b88972b8967
10305A15241B5918a72300h1864B48080b02862B53096G5492c1981k2862l0539A79693
10293e0053o085p1972A04830J52640a88542e7044r1714N0878A82824A9996a27326
10281c86717D6014j0779c4958D138h4625A01193m7166f0608F46b71414h3389A01973
$$ plain form
10268 105272 153103 161080 -60905 -215852 245488 17756 7537 108343 143887 91120 448069
10257 448069 201842 100193 739993 82108 274830 -29093 164416 278187 20836 -116160
10246 -138862 -110628 -292272 88593 -173611 -36355 158835 112610 229717 -152002 -143289 106457
10234 -53985 -330890 -121576 -341010 47051 -180344 9768 42329 -26032 -169696 -170880 -12572
10222 12234 21344 -50651 -219799 -262212 -18466 -85510 -27074 135598 -23224 -72899 -189357
10211 -189357 -164986 -48945 -115632 74204 6693 30752 -319517 -173130 104267 123274 -186232
10199 -170565 25984 -356477 -145296 -87697 51212 93051 -86926 22084 -29920 160994 -72774
10187 194799 -98551 90543 29773 103145 134574 373 261001 123300 -230538 -256985 242006
$$ packed form
10268A05272M7831P977f0905j54947B45488A7756G537J00806L5544n2767L56949
10257D48069B01842A00193O39800H2108J92722b9093A64416J13771B0836a16160
10246a38862K8234j81644H8593a73611c6355A58835m6225J17107a52002Q713A06457
10234e3985k76905a21576k19434D7051a80344I768L2561b6032j43664j184a2572
10222A2234R110e0651j69148m2413a8466o7044b7074A35598b3224m9675j16458
10211a89357K4371d8945o6687G4204F693K4059c19517J46387A04267J9007a86232
10199a70565B5984c56477a45296N7599E1212M1839h6926B2084b9920A60994g2774
10187A94799i8551I0543B9773P3372L1429C73K60628A23300b30538k6447B42006
$$ plain form
10175 -203729 168706 -90860 248507 -99456 -301601 -146168 -50141 67432 220345 -407873
10164 152949 -11309 -271612 227736 23388 -22914 -294988 35629 164541 -211376 -148728
10154 -148728 -251386 10114 27800 -288317 -54429 -197563 -106220 -15360 -138146 -148133 1284
10142 -73674 -25171 13374 72400 3849 -14724 -92159 -102150 -71547 106123 -69809 132731 62706
10129 183087 -112830 -48945 -147201 45857 114229 90812 123298 30730 -159637 19144 11652
10118 11652 -2373 -293205 -13520 -35436 -322007 199203 -123362 200598 -46202 -142374 259584
10106 -185964 88022 -286265 -74446 -131712 224464 85440 -32488 182067 -282402 62827 35411
10095 35411 10559 -346247 156630 -71468 33842 3993 -131842 126756 -64954 320651 18861
$$ packed form
10175b03729A68706i0860B48507i9456k02145a46168e0141F7432J52913d07873
10164A52949a1309k60303B27736B3388b2914k72074C5629J28912b11376O2648
10154a48728j02658A0114J7686b88317e4429j43134R1343a5360j22786r987A284
10142g3674b5171A3374N9026C849a4724p7435r991L0603A06123f9809A32731F2706
10129A83087a12830d8945r8256D5857O8372k3417L2486C0730a59637A9144p492
10118A1652b373k90832a3520k1916k86571A99203a23362B00598d6202r6172B59584
10106a85964H8022b86265g4446n7266B24464H5440c2488A82067b82402F2827k7416
10095C5411A0559c46247A56630g1468C3842C993a31842A26756f4954C20651A8861
$$ plain form
10083 55720 -20209 -189608 135155 45192 -110289 -95191 -176390 -244237 -75586 -278034 -329386
10072 -329386 27900 -309911 -303733 -215316 -150909 -34553 18074 -115813 -26931 -34503 -95688
10061 -95688 -59905 -111314 -71677 199919 -170503 -180963 -85885 -5131 77510 -73301 141101
10049 200920 -39358 -159608 -162827 50998 296687 -9852 70890 -184621 -121783 -199808 87826
10037 -196462 -99597 87151 -199917 -304228 -72268 -355207 74477 -130933 -342049 -77259
10026 56590 -353738 -198653 19164 -168222 -32427 -262175 11747 -302830 -181140 -166810
10016 -166810 3607 483658 -217117 329420 7826 31509 -525601 -268359 -130256 531 -354162
10004 -105410 -23417 -83179 -188152 179848 83802 -19158 15530 56948 -234538 -423850 80629
$$ packed form
10083E5720b0209j69399A35155D5192a10289J5098q1199o7847g5586k02448n1352
10072c29386B7900c09911O178Q8417O4407c4553A8074a15813b6931p572o1185
10061i5688L5783n1409L9637A99919a70503j0460h5885e131G7510g3301A41101
10049B00920c9358j20250l219E0998K45689i852G0890a84621O2838p8025H7826
10037a96462R6865H7151a99917j04311g2268k82939G4477a30933k11116g7259
10026E6590c53738J55085A9164a68222c2427k29748A1747c02830J21690J4330
10016a66810C607M80051b17117C29420G826K3683e25601K57242a30256E31c54162
10004a05410b3417n9762j04973A79848H3802a9158A5530M1418b34538j89312H0629
$$ plain form
9992 -10896 -328723 90254 -167340 56964 -71354 -344048 -99899 46930 10153 149343 177307
9981 177307 -132753 -18947 -249023 -140567 68083 -48720 31205 74999 -195510 -260905 -231924
9970 -231924 -99669 -181774 -384316 57104 -364586 -136880 -68052 174767 -199842 -24363 -127165
9959 -127165 -153198 -36208 -112975 89228 -69999 -839 190018 214423 167984 -33340 160186 -167941
9946 -57490 10995 -75331 28272 170880 -6205 -301819 -45565 90041 64742 111399 31537 64296
9934 64296 96400 -66458 -292221 -125554 122603 -14990 117671 -146851 -346498 -250611 46876
9922 -20777 -132641 13950 -354204 -46375 71127 178072 -104988 -103049 150191 -67044 -308170
9911 -308170 38499 -141375 -11093 -17491 143656 -160071 -81594 70821 -73642 -27843 -157019
$$ packed form
9992a0896l17827I0254a67340E6964g1354k72694i9899D6930A0153J39190K7964
9981A77307a32753a8947k30076J08456F8083d8720C1205M3794a95510o5395K8981
9970b31924i9669q2105k02542E7104c64586a36880f8052A74767a99842b4363j02802
9959a27165k6033c6208p6767H9228f9999h39A90018K4405m6439c3340A60186a67941
9946e7490A0995g5331B8272J42608f205k95614d5565I0041k5299M6657C1537L2759
9934F4296L2104f6458k25763a25554A22603a4990A17671a46851j99647R5887D6876
9922b0777j11864A3950c54204d6375G1127J06945a04988J939A50191f7044k41126
9911c08170C8499a41375a1093o398A43656a60071P8477G0821g3642b7843j29176
$$ plain form
9900 -157019 -54029 -155394 -191327 84547 -28916 56079 -233115 179549 -44629 -151387 -77605
9889 -77605 87567 -35694 -105880 -317616 41938 -451384 115533 -100782 -195192 -46978 -47804
9878 -47804 49271 -250359 -261887 -85496 -136513 -60991 134743 -156523 -137346 -148147 -6425
9866 -181176 176937 53848 168065 19805 54783 -55014 -33382 -23065 -232132 135629 -91910
9854 156580 -176736 -178703 -181686 -167844 224608 175268 -44440 211906 -57114 110392 -142061
9842 123684 3594 -228565 -10785 119101 -231988 149109 -172004 -71187 -152469 -6158 -37025
9831 -37025 -251930 -98956 -130788 153019 135748 -81736 -160103 -209631 120421 -431118 63780
9819 25539 -195505 -411962 -134322 -13815 -126425 -49479 -222028 -77119 -2483 72637 195634
$$ packed form
9900a57019e4029j01365l5933H4547b8916E6079b33115A79549d4629j06758P3782
9889g7605H7567c5694p0186k11736D1938d51384A15533a00782r4410d6978q26
9878d7804D9271b50359j1528h5496n1017f0991A34743a56523J9177j0801f425
9866a81176A76937E3848J14217A9805L4978e5014K1632J0317k09067A35629i1910
9854A56580a76736j967k983J3842B24608m9340d4440B11906e7114A10392a42061
9842A23684C594b28565a0785A19101b31988A49109a72004g1187q1282f158l0867
9831c7025k14905i8956l1832A53019j7271h1736p8367m9528A20421d31118F3780
9819B5539a95505k16457a34322a3815j12610d9479j72549g7119b483G2637J22997
$$ plain form
9808 195634 121538 51602 40261 9727 195070 208575 -69020 -9233 100186 -5288 -229995 -145464
9796 -145464 119891 -149192 44777 -104614 -217699 379016 -200580 52452 -35404 105725
9785 126480 -59982 58119 218878 -107228 56704 -75350 49587 135946 -50259 163948 -44410
9773 -2379 -173092 142520 89213 -205643 -293546 -19602 59344 -37901 -195534 -128877 -125623
9762 -125623 63244 -200549 103579 -79479 -13931 73927 -27132 -68392 71330 -64585 -45166
9751 -45166 -234338 -64081 183370 -638641 220215 101853 52394 -9545 36297 -63354 -226856
9740 -226856 -163778 373622 -183474 -168257 33266 43690 339317 67507 -117505 -208937 -142448
9729 -142448 230969 87773 71947 92245 -160646 -269556 -154212 -159484 54789 -268271 80405
$$ packed form
9808A95634p4096E1602j1341I727J85343J3505f9020i233A00186e288k24707Q4531
9796a45464A19891a49192D4777a04614j13085C79016b00580E2452c5404A05725
9785A26480e9982E8119J60759a07228E6704g5350D9587Q6359e0259A63948d4410
9773b379j70713A42520n3307b05643q7903a9602E9344c7901j57633O6657L254
9762a25623F3244b00549A03579g9479a3931G3927b7132m1260G1330f4585J9419
9751d5166j89172f4081A83370f38641B20215A01853m9459i545C6297f3354j63502
9740b26856O3078C73622a83474J5217C3266J0424K95627F7507a17505r1432O6489
9729a42448B30969H7773j5826K0298a60646j08910J15344n272E4789b68271H0405
$$ plain form
9717 -160550 -187647 75808 -170604 2799 23515 33560 -107588 -257135 -131061 122513 -210156
9705 7713 -154372 -12333 206835 -264780 -172921 70571 -170698 -290814 -206058 -48904 102570
9693 221959 -146437 -9841 179552 -276496 -440671 31849 4809 -163017 -2352 -245329 -110113
9681 -169724 -129595 -74897 -31018 10963 -22425 -4421 107609 15031 -219594 -182381 46871
9669 -52266 -104817 -225804 62378 -117063 127950 -245943 69481 -15427 -279819 -12052 258466
9657 76926 288626 116040 -160253 -1080 -150311 -231010 6281 -390772 -168228 -41700 45075
9645 75694 -266149 -92558 -359857 3962 152050 56507 -308342 -75548 278052 -47706 129057
9633 -32379 117850 83704 -51993 178723 -155351 99367 -42126 50673 261547 -1283 -321794
$$ packed form
9717a60550k7097G5808a70604B799K0716J0045a07588j49547J26074A22513b10156
9705G713a54372a2333B06835b64780R1859G0571a70698j20116Q4756d8904A02570
9693B21959a46437i841A79552b76496j64175C1849D809a63017b352k42977a10113
9681a69724M0129N4698c1018A0963b2425d421A07609A5031b19594L7213D6871
9669e2266n2551j20987F2378a17063A27950b45943F9481a5427k64392a2052B58466
9657G6926K11700A16040a60253a080j49231q0699F281c90772a68228d1700D5075
9645G5694b66149i2558k67299C962J48088E6507c08342g5548B78052d7706A29057
9633c2379A17850l4146e1993A78723a55351I9367d2126E0673K10874a283l20511
$$ plain form
9622 -321794 29016 -140160 -276982 39367 6011 -150761 -187422 24672 223412 -114089 28420
9610 142402 268794 -23430 -12741 -222499 -178329 -99129 38337 -10282 -505 -78366 6174 229229
9598 229229 -300802 149791 -20761 361359 -85448 -278777 -146864 64532 -243395 189455
9587 -256259 -212317 -36110 -33428 -96671 -317473 -386201 347610 -329352 136997 65751 -56678
9575 -127257 -56767 -19287 95544 -7911 291945 -140826 9222 -220641 -165636 53242 -70468
9563 -292355 73447 -127322 -37467 57320 -51255 186930 -16138 -95397 -234596 -180448 -180281
9552 -180281 -251974 -85437 64464 -132334 -227036 62101 -98782 -38304 -270245 69262 -284138
9540 -38796 -56647 -410880 -243544 -173876 100571 96935 -381060 -112134 -220429 36931 -140547
$$ packed form
9622c21794B9016a40160j36822C9367F011a50761l6661B4672J98740a14089B8420
9610A42402J26392b3430J0689k09758M4170P9200C8337a0282e05p7861F174K23055
9598B29229c00802A49791b0761C61359h5448j93329J31913F4532b43395A89455
9587b56259M3942c6110K682o3243k20802o8728C47610c29352A36997F5751e6678
9575a27257e6767a9287I5544g911B91945a40826I222b20641N5005E3242g0468
9563b92355G3447a27322c7467E7320e1255A86930a6138p9259j39199N4148J67
9552a80281p1693h5437F4464a32334r4702F2101i8782c8304k31941F9262b84138
9540c8796j7851l54233J67336O9668A00571l636c81060a12134j08295C6931a40547
$$ plain form
9528 -95259 -115961 26524 -234034 14019 -167018 -217875 -133593 -11631 -115937 102145 -10421
9516 116999 -105714 -141058 74842 53953 -62873 -181557 -199521 361494 62627 -89306 85340
9504 562131 228409 151441 -218391 -131310 -225376 140448 -268976 154487 217241 149027 483450
9493 483450 32533 -485056 75237 56397 -78341 -115914 -28447 -278232 -331724 -51862 79985
9481 -207906 35766 -66169 -243514 82613 -119524 -283707 -35801 -9543 737 -17024 -27896 44179
9468 175838 -211185 -257535 109397 -398979 -151281 88170 -80569 -233383 -51508 53942 19461
9456 8607 6700 -178657 134620 43031 -46871 -25650 -6956 80085 -92479 55409 -446220 -296123
9444 -296123 48152 -71523 -95476 56105 -58968 -177325 53835 -320134 62079 113419 -181058
$$ packed form
9528i5259k0702B6524b34034A4019a67018n0857Q4282a1631j04306A02145a0421
9516A16999a05714l5344G4842k0889f2873j18684j7964C61494F2627h9306H5340
9504E62131B28409p6968b18391Q7081r4066A40448b68976A54487O2754o8214L34423
9493D83450C2533d85056G5237j8840g8341l7573b8447k49785n3492e1862G9985
9481b07906C5766f6169j77345H2613a19524j64183c5801i543G37a7024j0872D4179
9468A75838b11185m6350A09397c98979a51281H8170h0569j52814e1508E3942A9461
9456H607j907a78657A34620D3031d6871K1221f956H0085i2479E5409d46220J50097
9444b96123D8152g1523k3953E6105e8968j18357E3835c20134F2079N1340a81058
$$ plain form
9432 -10286 -1412 -62008 24370 -186815 -44278 271232 103512 99389 14249 -218411 39767
9420 112860 101272 -46081 -228482 -69333 -141859 -28986 -354223 -267160 -54390 -380140 56285
9408 -193891 -276010 -51402 6612 -129827 -166162 -103202 116619 177916 279323 -353 -121712
9397 -121712 -409518 -265070 -251695 -44193 -85400 -60349 126719 -231404 -168380 294815 29528
9385 89485 295545 -32540 -147066 180897 94196 -268090 -197013 -195326 257735 -122449 -149987
9374 -149987 153853 -96357 -152874 104045 -163463 76044 -45277 -32645 -245739 38492 85445
9363 85445 84239 -129894 51468 231571 -93375 69621 146797 -159606 -11238 -13602 -101195 -125696
9351 -125696 -12893 -135868 93212 -213727 -65961 -254313 133377 -256225 91791 106992 -37258
$$ packed form
9432a0286a412o0596B4370a86815d4278B71232A03512m123A4249b18411C9767
9420A12860j1588d6081j82401f9333p2526b8986l25237Q7063e4390l25750E6285
9408a93891q2119e1402F612a29827l6335O2960A16619O1297J01407c53j21359
9397a21712k87806J44448J3375d4193m1207K5051A26719b31404O3024B94815B9528
9385H9485K06060c2540j14526A80897q6701b68090P1077J687B57735a22449k7538
9374a49987A53853i6357n6517A04045a63463G6044d5277J2632k13094C8492M6953
9363H5445j206a29894E1468J80103i3375F9621P7176a59606a1238k364q7593k4501
9351a25696a2893j22975I3212b13727f5961j88352A33377b56225I1791J5201c7258
$$ plain form
9339 262121 -76075 -268052 -173944 -21895 -203567 -136633 58707 -238653 218951 50561 -105674
9327 40553 105490 10741 -145012 -138607 -43339 48128 -88553 -302 -162846 -208230 -88386 83208
9314 -156676 -48358 -161484 -383915 -103361 96976 -172742 -65937 85836 -406428 -125444
9303 -230174 153141 -85580 -85356 -260119 -59840 21018 -134635 -11862 -256443 -84011 17518
9291 138782 -52373 -169934 95632 -108254 7362 -304468 -88183 420379 1611 47299 -116893
9279 -153145 -181674 -224464 -57733 17267 -365 120204 -262771 -180326 -138360 -322537 79107
9267 -176826 124912 253169 116728 -235875 -248748 -108527 -195046 147596 23595 -270642
9256 -207434 -75402 149591 -293711 45120 6053 -5155 33036 126739 -136222 61341 -36831
$$ packed form
9339B62121g6075j91977R4108b1895j81672O6934E8707b38653B18951E0561a05674
9327D0553O4937A0741a45012O405d3339D8128h8553c02j62544m5384h8386H3208
9314a56676d8358j13126k22431a03361I6976a72742f5937H5836d06428a25444
9303b30174A53141h5580K24j74763e9840B1018a34635a1862k44581h4011A7518
9291A38782e2373j17561I5632a08254G362c04468h8183D20379A611M5688a16893
9279a53145k8529m2790e7733A7267c65A20204b62771Q2445M1966j84177G9107
9267a76826A24912J28257A16728b35875j2873a08527q6519A47596B3595b70642
9256b07434g5402A49591b93711D5120F053e155C3036R3703a36222F1341c6831
$$ plain form
9244 170158 -132389 -161465 37866 43674 88842 62250 31030 77799 -255700 52799 -175681
9232 197219 -139043 -160850 89268 140940 -81557 -258648 120007 -201033 -15276 -113159 35875
9220 -28856 -436028 -141999 -15606 85316 34272 -157343 -68891 193833 -322896 -26846 -299900
9209 -299900 116635 434222 104077 -26405 61100 -49602 230880 -99955 -271596 -215726 -152231
9198 -152231 -264593 -207379 -234975 -1916 136006 163865 -230398 76840 -143197 164276 36292
9186 -83701 141568 -396703 -259943 78108 -35475 -94245 169084 118258 35872 32632 -297380
9174 -187890 -188666 -324283 223276 -227654 -132058 -6014 55650 -65381 -119232 -54640 175455
9162 222593 -227504 -291958 -133395 -116626 -257208 154044 -100767 192397 159831 -88143
$$ packed form
9244A70158a32389k9076C7866N808M5168k6592C1030M6769b55700E2799a75681
9232A97219a39043k1807H9268N1672h1557j77091A20007b01033a5276r7883C5875
9220b8856m07172a41999a5606H5316C4272a57343f8891A93833c22896b6846k73054
9209b99900A16635L17587A04077b6405F1100d9602B30880i9955j71641N5870O3495
9198a52231j12362N7214k7596a916A36006K7859b30398G6840a43197A64276C6292
9186h3701A41568c96703J36760G8108c5475n8770A69084n0826C5872l240b97380
9174a87890p76j35617B23276b27654R5596f014E5650f5381n3851e4640A75455
9162B22593b27504o4454a33395J6769j40582A54044a00767A92397l2566h8143
$$ plain form
9151 -31227 -97836 199297 70737 -49355 -471471 -278136 25506 11072 52035 -73956 -69611
9140 -69611 -125614 186244 108644 260496 -162793 -39718 -24736 -324393 -205416 186348 -4949
9128 -315487 -20372 70580 -169662 -335720 -102293 64114 200236 153707 128937 -214604 -149905
9117 -149905 -160710 -348779 -70909 -75073 -300136 14200 -48363 -70331 192321 -257521 -225559
9106 -225559 -69032 -275081 -559868 -105794 -108585 26018 -197948 -48544 -314021 -402544 223801
9094 -324975 -141999 -165620 73302 40918 -36325 -233503 -226295 -200665 -75630 393257 122952
9082 35559 -1045 -216003 21427 -210711 -31178 183346 -3979 12705 -175291 -266917 -277800
9071 -277800 131938 41832 -133941 -92057 -258389 -113707 147721 -48169 -176698 -146004
$$ packed form
9151c1227o6609A99297G0737d9355m22116J93335B5506A1072M0963g3956M345
9140f9611n6003A86244p7600J51852a62793c9718J4982k99657J18977A86348d949
9128c15487b0372G0580a69662j66058a02293F4114J36122m6529k4770b14604O4699
9117a49905j0805j88069g0909m164k25063A4200d8363k1968A92321b57521L1962
9106b25559f9032k06049k84787a05794k791B6018a97948d8544k65477q8523B23801
9094c24975a41999k3621G3302l2384c6325j97178P208K5630g5630C93257A22952
9082C5559a045k14958B1427b10711c1178A83346c979A2705a75291r1626j0883
9071b77800A31938D1832a33941M1884j66332a13707A47721d8169j28529L0694
$$ plain form
9061 -146004 -128094 20852 -223472 -252761 302736 -166915 -23096 -175723 -302197 -290719 64982
9049 -44753 10086 16724 -261244 15380 32932 -381569 -54381 1620 63771 -19671 -23459 57902
9036 11014 -77485 171849 -41912 295749 -323411 -225091 121504 209667 -92540 -436422 90490
9024 -139001 -57653 -118247 -58330 92814 -115821 110913 37404 -225345 58704 -81435 -118555
9013 -118555 51271 222595 -152323 323962 -117427 -205542 -270437 91877 -129487 -119407 -23682
9001 -68661 213584 73910 -158211 -214011 -147102 -153840 -60350 289106 138172 -128097 -187187
8990 -187187 50460 -29556 78710 -157964 108376 45089 -1226 -164444 -326208 -270159 -19065
8978 -27538 -81116 -244790 -332230 191769 7755 -385058 -143945 -29478 -40852 93864 -330688
$$ packed form
9061a46004J7910B0852b23472k9289C02736a66915b3096j52627j26474J1478F4982
9049d4753A0086O638b61244A5380J7552c81569e4381A620O2151a9671l788E7902
9036A1014g7485A71849d1912B95749c23411R8320A21504Q8163i2540l43882I0490
9024a39001e7653o0594e8330I2814a15821A10913C7404b25345E8704h1435l7120
9013a18555E1271J71324a52323C23962a17427q8115o4895I1877a29487J0080b3682
9001f8661B13584G3910a58211n5800O6909o738f0350B89106A38172a28097n9090
8990a87187E0460b9556G8710a57964A08376D5089a226j63218j61764N6049a9065
8978b7538n3578j63674q7440A91769G755c85058a43945b9478j1374I3864c30688
$$ plain form
8966 108899 -42752 93125 3380 -97099 184094 -32236 188242 -142517 161991 -120006 -49673
8954 -106427 -220302 -398043 226922 -288348 6599 55493 132599 -322907 307398 -557569
8943 -123484 89745 37595 -37849 -82694 4776 86468 201335 23750 204601 61581 11318
8931 228824 107774 124485 112994 -174959 236311 -62062 371089 379300 687120 1626459 6252004
8920 6252004 15318201 6346719 1906024 731055 457877 442543 261140 68689 161705 103135
8910 103135 62304 -329544 109430 566035 260858 160937 -164976 318375 -126301 -71566
8900 -71566 5010 -183501 105 80075 -332595 -165462 -148493 -116804 278904 -116051 58770
8888 -25673 -191905 61546 -191147 -78785 227829 21826 -192758 -77439 -79559 -183454 157843
$$ packed form
8966A08899d2752I3125C380i7099A84094c2236A88242a42517A61991a20006d9673
8954a06427j13875j77741B26922b88348F599M8894P7106c22907C07398e57569
8943a23484H9745C7595c7849m4845D776Q1692J14867B3750J80851F1581A1318
8931B28824A07774J6711j1491a74959B36311f2062C71089Q211L07820R39339M625545
8920F252004R066197F346719A906024G31055k73178j5334j81403F8689R3016n8570
8910A03135m0831c29544A09430M56605B60858r9921a64976C18375a26301N4735
8900g1566E010a83501A05P9970c32595a65462J6969L1689B78904a16051E8770
8888b5673j66232F1546a91147g8785B27829B1826a92758g7439k120j03895A57843
$$ plain form
8876 69643 175925 -320110 218371 75698 241772 -17897 72723 -196539 -16488 -260173 -194138
8865 -194138 204005 -51108 -155244 -80211 160479 128369 191688 87613 71969 80063 -214062
8853 -192779 -74980 -116360 -383166 22484 10237 -121383 -209514 -412157 -23383 109071 -206808
8841 -168938 -103990 -57311 -231676 101184 -34113 -167667 48569 50014 160020 -339061 -28515
8829 228257 -109146 -199390 -85677 198556 21388 -120470 -281575 -191409 388869 -61354 41592
$$ packed form
8876F9643J06282c20110B18371G5698J66074a7897G2723a96539a6488k43685O6035
8865a94138B04005e1108j04136P5033A60479l2110O3319H7613j5644Q094b14062
8853a92779g4980m1380k66806B2484A0237a21383q8131k02643b3383A09071b06808
8841a68938O4948M6679j74365A01184c4113j33554D8569J445J10006c39061b8515
8829B28257a09146r0244h5677A98556B1388a20470j61105R0166C88869f1354D1592
$$ [...]
##END NTUPLES=NMR SPECTRUM
##END=
