##TITLE=NES1071_159122.0002_001_9705654_qWYHiq8yM4
##JCAMPDX= 6.0         $$ Bruker NMR JCAMP-DX V2.0
##DATA TYPE= NMR SPECTRUM
##DATA CLASS= NTUPLES
##ORIGIN= BRUKER
##OWNER= Administrator
$$ 1.72 TOPSPIN		Version 2.1
$$ 2016-04-30 19:16:32.864 -0700  Administrator@X
$$ Compression mode = diff/dup
##.OBSERVE FREQUENCY= 400.02188249412
##.OBSERVE NUCLEUS= ^1H
##.ACQUISITION MODE= SIMULTANEOUS (DQD)
##.ACQUISITION SCHEME= undefined
##.AVERAGES= 64
##.DIGITISER RES= 22
##SPECTROMETER/DATA SYSTEM= spect
##.PULSE SEQUENCE= noesygpps1d.comp
##.SOLVENT NAME= COFFEE_meoh
##.SHIFT REFERENCE= INTERNAL, COFFEE_meoh, 1, 14.96181
##AUDIT TRAIL= $$ (NUMBER, WHEN, WHO, WHERE, PROCESS, VERSION, WHAT)
$$ ##TITLE= Audit trail, TOPSPIN		Version 2.1
$$ ##JCAMPDX= 5.01
$$ ##ORIGIN= Bruker BioSpin GmbH
$$ ##OWNER= Administrator
$$ $$ E:\/data/COFFEE/nmr/NES1071_159122.0002_001_9705654_qWYHiq8yM4/12/pdata/1/auditp.txt
$$ ##AUDIT TRAIL=  $$ (NUMBER, WHEN, WHO, WHERE, PROCESS, VERSION, WHAT)
(   1,<2016-04-30 19:16:27.411 -0700>,<Administrator>,<X>,<go>,<TOPSPIN 2.1>,
      <created by zg
	started at 2016-04-30 19:04:58.021 -0700,
	POWCHK enabled, PULCHK disabled,
       configuration hash MD5:
       21 0F 79 D6 B3 7B B4 F6 88 20 88 DB 03 48 BD 9F
       data hash MD5: 64K
       C3 0A 04 67 96 5B 49 5C 8A 8D 90 96 02 10 8B B1>)
(   2,<2016-04-30 19:16:30.833 -0700>,<Administrator>,<X>,<proc1d>,<TOPSPIN 2.1>,
      <Start of raw data processing
       efp LB = 0.3 FT_mod = 6 PKNL = 1 PHC0 = 0 PHC1 = 0 SI = 128K 
       data hash MD5: 128K
       39 29 70 9F 5B C1 0F 44 14 6E 02 5D B8 EF 85 80>)
(   3,<2016-04-30 19:16:31.724 -0700>,<Administrator>,<X>,<proc1d>,<TOPSPIN 2.1>,
      <pk PHC0 = -84.18823 PHC1 = 0 
       data hash MD5: 128K
       81 FB A7 A9 F5 0A 6B 43 7B EE D9 B3 EC 7D C6 87>)
(   4,<2016-04-30 19:16:32.099 -0700>,<Administrator>,<X>,<proc1d>,<TOPSPIN 2.1>,
      <abs ABSG = 1 
       data hash MD5: 128K
       F0 7C 5B BA 3F 88 FC 44 5B 9D 84 11 CD 83 C8 D1>)
(   5,<2016-04-30 19:16:32.208 -0700>,<Administrator>,<X>,<proc1d>,<TOPSPIN 2.1>,
      <abs ABSG = 2 
       data hash MD5: 128K
       B8 D9 4C D9 94 D5 F1 1E 4F D6 A7 2E D6 51 B6 DB>)
(   6,<2016-04-30 19:16:32.286 -0700>,<Administrator>,<X>,<proc1d>,<TOPSPIN 2.1>,
      <abs ABSG = 3 
       data hash MD5: 128K
       43 9B 2C 5E 1C 99 AA DB 9F B9 5C AD 71 BA 23 70>)
(   7,<2016-04-30 19:16:32.380 -0700>,<Administrator>,<X>,<proc1d>,<TOPSPIN 2.1>,
      <abs ABSG = 4 
       data hash MD5: 128K
       9E CA DA 62 8A 24 09 74 1D 23 5F 0E AC A0 F7 F8>)
(   8,<2016-04-30 19:16:32.474 -0700>,<Administrator>,<X>,<proc1d>,<TOPSPIN 2.1>,
      <abs ABSG = 5 
       data hash MD5: 128K
       6A 33 A6 1B 74 AA FA F5 D5 A8 AF 23 A7 BC 66 B4>)
$$ ##END=
$$ 
$$ $$ hash MD5
$$ $$ D3 56 A2 80 F5 62 D6 E6 B5 13 29 4A C8 98 64 54
##$RELAX= 
##$RELAX= 
##$RELAX= 
##$RELAX= 
##$RELAX= 
##$RELAX= 
##$RELAX= 
##$RELAX= 
$$ Bruker specific parameters
$$ --------------------------
##$DU= <E:\>
##$EXPNO= 12
$$ [...]
##$TP07= 0
##$TPNAME0= <>
##$TPNAME1= <>
##$TPNAME2= <>
##$TPNAME3= <>
##$TPNAME4= <>
##$TPNAME5= <>
##$TPNAME6= <>
##$TPNAME7= <>
##$TPOAL= (0..7)
0.5 0.5 0.5 0.5 0.5 0.5 0.5 0.5
##$TPOFFS= (0..7)
0 0 0 0 0 0 0 0
##$TUNHIN= 0
##$TUNHOUT= 0
##$TUNXOUT= 0
##$USERA1= <user>
##$USERA2= <user>
##$USERA3= <user>
##$USERA4= <user>
##$USERA5= <user>
##$V9= 5
##$VALIST= <valist>
##$VCLIST= <CCCCCCCCCCCCCCC>
##$VD= 0
##$VDLIST= <DDDDDDDDDDDDDDD>
##$VPLIST= <PPPPPPPPPPPPPPP>
##$VTLIST= <TTTTTTTTTTTTTTT>
##$WBST= 2048
##$WBSW= 25
##$XGAIN= (0..3)
0 0 0 0
##$XL= 0
##$YL= 0
##$YMAX_a= 5192691
##$YMIN_a= -10195112
##$ZGOPTNS= <>
##$ZL1= 120
##$ZL2= 120
##$ZL3= 120
##$ZL4= 120
##$ABSF1= 14.96181
##$ABSF2= -5.596372
##$ABSG= 5
##$ABSL= 3
##$ALPHA= 0
##$AQORDER= 0
##$ASSFAC= 0
##$ASSFACI= 0
##$ASSFACX= 0
##$ASSWID= 0
##$AUNMP= <proc_prof1d_extract.lims>
##$AXLEFT= 0
##$AXNAME= <>
##$AXNUC= <1H>
##$AXRIGHT= 0
##$AXTYPE= 0
##$AXUNIT= <>
##$AZFE= 0.1
##$AZFW= 0.1
##$BCFW= 0
##$BC_mod= 0
##$BYTORDP= 0
##$COROFFS= 0
##$CY= 15
##$DATMOD= 1
##$DC= 0
##$DFILT= <>
##$DTYPP= 0
##$F1P= 0
##$F2P= 0
##$FCOR= 0.5
##$FTSIZE= 131072
##$FT_mod= 6
##$GAMMA= 0
##$GB= 0
##$INTBC= 1
##$INTSCL= 1
##$ISEN= 128
##$LB= 0.3
##$LEV0= 0
##$LPBIN= 0
##$MAXI= 10000
##$MC2= 0
##$MEAN= 0
##$ME_mod= 0
##$MI= 0
##$NCOEF= 0
##$NC_proc= -2
##$NLEV= 6
##$NOISF1= 0
##$NOISF2= 0
##$NSP= 0
##$NTH_PI= 0
##$NZP= 0
##$OFFSET= 14.96181
##$PC= 1
##$PHC0= -84.18823
##$PHC1= 0
##$PH_mod= 1
##$PKNL= yes
##$PPARMOD= 0
##$PPDIAG= 0
##$PPIPTYP= 0
##$PPMPNUM= 2147483647
##$PPRESOL= 1
##$PSCAL= 4
##$PSIGN= 0
##$PYNMP= <proc.py>
##$REVERSE= no
##$SF= 400.020009313712
##$SI= 131072
##$SIGF1= 0
##$SIGF2= 0
##$SINO= 400
##$SIOLD= 131072
##$SPECTYP= <>
##$SREGLST= <1H.CDCl3>
##$SSB= 0
##$STSI= 131072
##$STSR= 0
##$SW_p= 8223.68421052631
##$SYMM= 0
##$S_DEV= 0
##$TDeff= 65536
##$TDoff= 0
##$TI= <>
##$TILT= no
##$TM1= 0
##$TM2= 0
##$TOPLEV= 0
##$USERP1= <user>
##$USERP2= <user>
##$USERP3= <user>
##$USERP4= <user>
##$USERP5= <user>
##$WDW= 1
##$XDIM= 131072
##$YMAX_p= 284183721
##$YMIN_p= -10412
##$CURPLOT= <Network HP LaserJet P1505>
##$CURPRIN= <$Network HP LaserJet P1505>
##$DFORMAT= <normdp>
##$LAYOUT= <+/1D_H.xwp>
##$LFORMAT= <normlp>
##$PFORMAT= <normpl>
##$SURQMSG= 1
$$ End of Bruker specific parameters
$$ ---------------------------------
##NTUPLES= NMR SPECTRUM
##VAR_NAME=  FREQUENCY,     SPECTRUM/REAL,   SPECTRUM/IMAG
##SYMBOL=    X,             R,               I
##VAR_TYPE=  INDEPENDENT,   DEPENDENT,       DEPENDENT
##VAR_FORM=  AFFN,          ASDF,            ASDF
##VAR_DIM=   131072,        131072,          131072
##UNITS=     HZ,            ARBITRARY UNITS, ARBITRARY UNITS
##FACTOR=    0.0627417313425164, 1,          1
##FIRST=     8223.62146879497, -265,         -47584
##LAST=      0,             1442,            -47873
##MIN=       0,             -10412,          0
##MAX=       8223.62146879497, 284183721,    0
$$ Real data points
##PAGE= N=1
##DATA TABLE= (X++(R..R)), XYDATA
$$ [...]
67870 36087 36467 36689 37039 37937 39332 40491 40681 40035 39452 39650 40466 41128 41065 40409 39870 40147 41347 42856
67852 42856 43886 44133 43869 43452 42981 42443 41883 41261 40407 39357 38554 38471 39090 40018 40921 41535 41432 40318
67834 40318 38686 37696 38082 39425 40674 41138 40745 39685 38244 36861 35895 35271 34605 33750 32987 32626 32620 32705
67816 32705 32763 32944 33461 34315 35234 35835 35900 35556 35200 35240 35788 36542 37055 37246 37485 38009 38405 38078 37179 36562
67796 36562 36733 37308 37729 37940 37994 37575 36533 35489 35176 35426 35526 35350 35306 35284 34704 33779 33660 34815 36127
67777 36127 36327 35633 35154 35167 34949 34172 33571 34024 35502 37121 37937 37660 36848 36371 36461 36482 35942 35434 36026
67758 36026 37799 39577 40169 39496 38428 37934 38441 39662 40911 41840 42822 44300 45881 46582 45960 44474
67742 44474 42723 40894 39103 37654 36671 36031 35860 36513 37657 38052 36886 34902 33560 33401 33852 34374
67726 34374 35032 35982 37110 38318 39625 40840 41583 41761 41642 41370 40803 39939 39064 38377 37843 37551 37793 38564
67708 38564 39364 39750 39822 39887 39986 40049 40250 40811 41599 42186 42285 41937 41484 41480 42353 43824 44903 44883 44208 43966 44614
67687 44614 45622 46358 46811 47305 47965 48763 49801 51201 52861 54541 56121 57554 58664 59236 59320 59234 59148
67670 59148 58805 57813 56201 54551 53445 52923 52611 52326 52285 52641 53078 53075 52405 51210 49767 48437 47613 47313
67652 47313 46962 46010 44758 44075 44246 44626 44661 44712 45476 46984 48603 49815 50603 51259 52219 53856 56042 58030
67634 58030 59182 59736 60403 61402 62372 63128 63856 64472 64490 63816 63157 63254 64072 65057 65885 66592 67292 68134 69367
67615 69367 71049 72760 73886 74082 73343 71868 70078 68457 66995 65084 62358 59427 57270 56064 55178
67600 55178 54163 53113 52020 50574 48907 47843 47885 48374 48194 47116 45919 45318 45296 45536 46016 46844 47752
67583 47752 48151 47782 47167 47198 48250 49836 51242 52292 53186 53762 53428 51993 50154 48862 48450 48613 48947
67566 48947 49123 48773 47704 46302 45317 45179 45763 46796 48110 49388 50001 49457 47931 46182 44978 44613
67550 44613 44819 45020 44768 44087 43448 43373 44055 45291 46632 47588 47837 47387 46568 45853 45653 46070 46737 46999 46540
67531 46540 45768 45338 45344 45305 44998 44880 45415 46306 46783 46485 45735 45009 44499 44276 44588 45770 47853 50309 52187
67512 52187 52745 52099 51112 50452 49944 49153 48348 48294 49086 49841 49896 49754 50344 51656 52756 53026 52794 52633 52559
67493 52559 52201 51408 50373 49329 48360 47407 46305 44961 43637 42906 43109 43988 45013 45895 46559 46833 46558
67476 46558 45988 45706 46067 46991 48276 49809 51386 52653 53449 53942 54357 54791 55397 56365 57471 58054 57810
67459 57810 57301 57205 57354 57060 56225 55411 54901 54410 53925 54045 55070 56390 57285 57868 58626 59448 59849 59879 60041
67440 60041 60286 59935 58722 57289 56302 55655 54936 54188 53713 53420 52955 52343 52044 52308 52838 53133 52977 52510
67422 52510 52050 51889 52109 52499 52763 52820 52799 52758 52545 51983 51112 50176 49443 49086 49231 49987 51310 52884 54316
67403 54316 55543 56858 58374 59678 60297 60388 60519 60819 60811 60180 59242 58391 57573 56627 55786 55404 55463 55748 56223
67384 56223 56885 57497 57928 58448 59175 59561 59122 58486 58823 60252 61641 62191 62357 62810 63280 63037 62037 60952
67366 60952 60313 60155 60318 60691 61253 62119 63336 64438 64633 63753 62613 61971 61541 60617 59423 59097 60290
67349 60290 62365 64099 64818 64715 64358 64058 63644 62901 62176 62232 63257 64471 65075 65230 65574 66151 66510 66621
67331 66621 66929 67509 67976 68242 68628 69099 69178 68890 69005 69952 71119 71726 71808 71801 71708 71292 70732 70388 70192 69911
67311 69911 69879 70756 72512 74199 74947 74772 74275 73877 73570 73190 72683 72142 71705 71465 71536 72145 73497 75449
67293 75449 77472 79046 80002 80436 80495 80365 80241 80163 80024 79857 79850 79931 79693 79004 78426 78614 79454 80172 80208 79662
67273 79662 78982 78623 78987 80293 82321 84482 86260 87484 88247 88771 89356 90258 91518 92992 94490 95792
67257 95792 96644 96896 96580 95786 94638 93517 93000 93266 93741 93734 93293 93051 93307 93727 94013 94386 95189 96347 97511
67238 97511 98533 99575 100790 102109 103349 104406 105259 105800 105791 105181 104431 104258 104890 105825 106457 106745 107067 107705
67220 107705 108720 110033 111291 111930 111777 111409 111491 111994 112528 113210 114514 116314 117769 118309 118195 118020 118139
67203 118139 118724 119767 120814 121203 120872 120571 121063 122452 124426 126711 129132 131684 134655 138126 141222
67188 141222 142611 142158 141377 141699 142873 143695 143749 143607 143692 143841 143905 143994 144134 144296 144754 145824 147295 148757
67170 148757 150415 152830 155787 158185 159368 159878 160555 161465 162222 162858 163743 164856 165745 166198 166495 166959 167592
67153 167592 168283 169195 170724 173041 175695 177744 178504 178283 178264 179498 182016 184996 187670 189899 191933 193822
67137 193822 195265 196025 196368 196925 198082 199670 201359 203239 205698 208718 211591 213563 214614 215396 216458
67122 216458 217774 219069 220351 221913 223877 225996 227987 229903 232022 234472 237139 239872 242577 245128
67108 245128 247403 249492 251665 254016 256311 258244 259728 260819 261605 262370 263702 266123 269591 273472 277018
67093 277018 279863 282234 284797 288137 292187 296213 299562 302362 305337 308960 312976 316688 319630 321980
67079 321980 324424 327552 331349 335372 339393 343522 347671 351382 354525 357732 361661 366095 370352 374376
67065 374376 378699 383386 387758 391396 394731 398305 402019 405601 409365 413939 419434 425386 431432 437579
67051 437579 443825 449895 455441 460305 464568 468591 473006 478385 484771 491653 498464 505016 511447 517921
67037 517921 524463 531002 537469 543842 550142 556396 562689 569252 576425 584362 592775 601117 609049 616696
67023 616696 624393 632283 640314 648517 657097 666150 675424 684561 693503 702516 711878 721726 732189 743324
67009 743324 754851 766218 777104 787657 798066 808247 818271 828824 840692 853835 867448
66998 867448 880968 894558 908385 921914 934396 945905 957513 970346 984629 999677 1014692
66987 1014692 1029420 1044068 1058741 1073244 1087472 1101732 1116430 1131645 1147303 1163644 1181068
66976 1181068 1199506 1218271 1236693 1254618 1272208 1289560 1306736 1323949 1341529 1359738 1378636
66965 1378636 1397946 1417131 1435910 1454766 1474539 1495324 1516111 1535782 1554240 1572303 1590769
66954 1590769 1609911 1629654 1649731 1669652 1688942 1707596 1726118 1744955 1764010 1782784 1800947
66943 1800947 1818640 1836248 1853967 1871688 1889230 1906493 1923317 1939455 1954921 1970185 1985704
66932 1985704 2001377 2016830 2032063 2047317 2062314 2076252 2088678 2099863 2110095 2119212 2127217 2134698
66920 2134698 2142083 2148917 2154556 2159264 2163854 2168417 2172140 2174480 2175830 2176853 2177680 2177975 2177339 2175400 2171913
66905 2171913 2167096 2161619 2155996 2150072 2143274 2135225 2126008 2116006 2105572 2094776 2083460 2071655 2059814
66892 2059814 2048282 2036612 2023793 2009279 1993440 1976935 1960126 1943315 1927017 1911466 1896149
66881 1896149 1880404 1864305 1848347 1832311 1815127 1796224 1776496 1757446 1739589 1722137 1704154
66870 1704154 1685497 1666523 1647378 1628003 1608618 1589737 1571569 1553714 1535617 1517167 1498736
66859 1498736 1480697 1463109 1445836 1428807 1412027 1395377 1378478 1360906 1342597 1324000 1305744
66848 1305744 1288170 1271302 1255194 1240076 1226007 1212533 1198816 1184177 1168592 1152812 1137890
66837 1137890 1124319 1111535 1098465 1084641 1070602 1057193 1044739 1032978 1021422 1009544 997012
66826 997012 984118 971747 960431 949528 937742 924497 910488 896927 884582 873509 863283
66815 863283 853347 843446 833829 824783 815900 806235 795388 784143 773730 764641 756406 748310 740028
66802 740028 731651 723510 715975 709104 702313 694675 685829 676442 667557 659522 651795 643767 635513 627617
66788 627617 620525 614219 608315 602270 595689 588677 581752 575140 568363 560976 553498 547025 541891 537314
66774 537314 532474 527350 522202 516918 511379 505938 500975 496268 491405 486523 482054 477978 473942 469943
66760 469943 466222 462588 458538 454114 449909 446076 441942 436908 431255 425805 421139 417351 414216 411328
66746 411328 408341 405249 402188 398945 395020 390316 385377 380748 376430 372175 367994 364093 360573 357358
66732 357358 354261 351021 347572 344406 342270 341266 340503 338905 336176 332837 329568 326703 324157 321593
66718 321593 318793 315934 313354 311021 308569 305879 303202 300643 297986 295254 292890 290985 288773 285440
66704 285440 281180 277009 273685 271267 269557 268428 267634 266701 265237 263251 261118 259249 257746 256296 254529
66689 254529 252454 250424 248698 247318 246316 245599 244597 242613 239792 237239 235845 235405 235219 234961 234521
66674 234521 233513 231690 229495 227524 225653 223451 221247 219979 219902 220193 220005 219341 218621 217896 216819 215105
66658 215105 212826 210438 208521 207239 206071 204410 202359 200559 199249 198033 196603 195181 194070 193162
66644 193162 192161 190878 189158 186877 184313 182200 181050 180588 180106 179258 178277 177549 177130 176694 175873 174700
66628 174700 173620 172940 172406 171579 170540 169816 169587 169431 168967 168311 167697 166976 165815 164177 162353 160658 159275
66611 159275 158206 157255 156223 155226 154551 154135 153542 152610 151692 150984 150066 148569 146902 145715 144899 143778 142278
66594 142278 141117 140656 140235 139119 137617 136673 136596 136836 136986 137347 138228 139166 139309 138418 137094 136027 135370
66577 135370 134858 134255 133522 132717 131904 131130 130496 130244 130603 131341 131678 131088 130110 129836 130457 130907 130203 128567
66559 128567 126824 125240 123595 121955 120581 119258 117540 115650 114425 114258 114699 115207 115633 115802 115324 114190
66543 114190 113024 112338 111955 111494 111012 110756 110641 110408 110026 109618 109202 108853 108822 109156 109393 108955 107683 105791
66525 105791 103600 101678 100826 101387 102668 103558 103695 103631 103911 104416 104672 104453 103943 103552 103612 104059 104381 104085
66507 104085 103191 102120 101132 100139 99083 98190 97734 97670 97672 97477 97144 96950 97072 97403 97694 97763 97455 96539 94964
66488 94964 93128 91555 90288 89040 88029 88039 89336 91008 91911 91883 91502 90951 89894 88352 86986 86341
66472 86341 86318 86551 86829 86977 86751 86164 85635 85537 85751 85867 85686 85353 85097 84958 84764 84380 83981 83951 84371 84783
66452 84783 84679 84102 83492 83107 82943 83063 83491 83799 83347 82098 80747 79885 79438 79148 79138 79668 80604 81499 81971
66433 81971 81797 80922 79716 78960 79210 80212 81217 81682 81455 80534 79119 77788 77141 77197 77455 77601 77814 78308
66415 78308 78914 79256 79093 78371 77195 75966 75328 75656 76625 77457 77667 77395 77052 76777 76386 75772 75140 74742
66397 74742 74475 73957 73041 72064 71483 71365 71414 71362 71118 70599 69749 68824 68357 68653 69466 70304 70925 71335 71519 71496
66377 71496 71498 71713 71806 71137 69621 68037 67185 67009 66918 66755 66960 67724 68514 68623 67929 66883 65995 65554 65609 65949
66357 65949 66196 66164 66093 66359 67018 67801 68411 68606 68167 67149 66106 65688 65891 66038 65594 64687 63690 62699 61786
66338 61786 61468 62333 64157 65834 66377 65729 64449 62968 61480 60334 60018 60662 61880 63265 64701 66008
66322 66008 66607 65939 64147 62015 60232 59036 58515 58791 59707 60653 60995 60523 59340 57640 55929 55100 55726
66305 55726 57250 58374 58407 57870 57605 57709 57695 57424 57330 57722 58262 58385 58031 57743 58078 59062 60130 60503 59774
66286 59774 58372 57371 57499 58302 58621 58041 57450 57858 59049 59946 60070 59964 60167 60521 60728 60932 61262 61330
66268 61330 60712 59648 58675 57783 56546 55022 53938 53862 54583 55489 56228 56857 57551 58311 58895 58978 58455 57509
66250 57509 56347 55107 54102 53788 54124 54308 53640 52488 51869 52213 53056 53866 54490 54740 54307 53337 52514 52263
66232 52263 52307 52309 52356 52447 52079 50966 49808 49662 50651 51854 52443 52462 52400 52456 52419 52094 51641 51492 51943 52831 53751
66211 53751 54536 55293 55934 56014 55249 53959 52776 52138 52194 52851 53641 53898 53509 53269 54041 55738 57524 58799
66193 58799 59477 59462 58579 57151 56050 55844 56220 56489 56344 55957 55633 55594 55867 56151 56008 55428 54959 54994 55148
66174 55148 54718 53742 53164 53799 55360 56758 57217 56880 56388 56137 56051 55851 55345 54539 53714 53341 53653 54266 54475
66155 54475 54050 53482 53302 53390 53180 52341 51045 49727 48840 48717 49365 50419 51560 52909 54716 56681 57943
66138 57943 57859 56611 54932 53450 52409 51839 51778 52244 53054 53733 53769 53056 51991 51025 50242 49495 48792 48292
66120 48292 48009 47771 47503 47358 47574 48340 49685 51309 52618 53245 53423 53575 53655 53319 52790 52939 54269 56149
66102 56149 57415 57503 56743 55754 54888 54134 53286 52169 50893 49865 49468 49702 50267 50902 51541 52197 52814 53278
66084 53278 53488 53442 53244 53028 52895 52925 53127 53287 53058 52382 51720 51542 51725 51776 51598 51580 51876 52128 52063 51876 51697
66063 51697 51174 50059 48851 48269 48276 48221 47849 47585 47718 47847 47468 46717 46236 46465 47309 48402 49475 50469 51402
66044 51402 52198 52685 52775 52593 52369 52301 52558 53234 54108 54668 54674 54551 54871 55511 55722 55094 54037 53197 52785 52680
66024 52680 52809 53117 53403 53558 53785 54300 54947 55370 55451 55288 54841 54006 53085 52850 53822 55519 56615 56067 54238
66005 54238 52768 52986 54414 55213 54233 52175 50454 49532 49015 48873 49524 50735 51525 51481 51296 51521 51590 50859
65987 50859 49886 49790 50655 51526 51848 51964 52150 52107 51646 51140 50873 50559 49932 49296 49053 49090 49077 49019 49091 49251 49436
65966 49436 49841 50537 51098 51101 50765 50530 50240 49434 48362 47944 48536 49393 49725 49739 50153 50983 51335 50408 48404
65947 48404 46366 45346 45734 47232 49203 50870 51375 50139 47566 45101 44085 44527 45320 45603 45470 45381
65931 45381 45445 45537 45648 45840 46107 46544 47255 47876 47572 45967 43847 42523 42623 43783 45293 46590 47259 47081
65913 47081 46223 45115 44088 43351 43155 43645 44508 45191 45541 45931 46605 47228 47250 46556 45594 44957 44940 45343 45606
65894 45606 45257 44359 43453 43012 43120 43647 44509 45555 46372 46486 45767 44545 43317 42484 42279 42763 43760 44885
65876 44885 45737 46105 45961 45331 44231 42800 41393 40465 40360 41155 42634 44325 45749 46805 47834 49077
65860 49077 50138 50332 49610 48726 48327 48239 47982 47609 47519 47668 47539 46962 46410 46326 46566 46685 46420 45708 44641
65841 44641 43685 43584 44598 46022 46813 46691 46284 46267 46678 47112 47301 47425 47943 49111 50543 51395 51224 50567
65823 50567 50332 50679 50913 50581 50178 50463 51385 52116 52012 51199 50283 49796 49960 50616 51285 51543 51493 51647 52247
65804 52247 52912 53185 53198 53485 54164 54656 54375 53531 52995 53368 54270 54669 53897 52347 51124 51044 51958 53017 53437
65785 53437 53025 52177 51509 51412 51762 52066 51972 51598 51274 51107 50990 50916 50954 50944 50535 49690 48867 48528 48672 49055 49699
65764 49699 50826 52384 53897 54841 55016 54544 53703 52843 52287 52144 52234 52239 51988 51591 51314 51264 51241 50960 50446 50039
65744 50039 49985 50103 49985 49431 48614 47889 47558 47685 47991 47955 47232 45997 44782 43993 43623 43438 43301 43301 43570 44030
65724 44030 44368 44345 44067 43815 43629 43278 42664 42022 41614 41496 41677 42218 43009 43704 44115 44371 44438 43878 42535
65705 42535 41156 40786 41647 43073 44377 45232 45403 44888 44377 44795 46109 47207 47288 46817 46738 47300 48055 48536
65687 48536 48416 47406 45586 43674 42518 42435 43251 44600 45803 45994 45057 44139 44544 46236 48071 49290
65671 49290 50024 50400 50084 48963 47516 46183 45008 44238 44578 46325 48728 50766 52201 53340 54132 54235
65655 54235 53800 53502 53721 54201 54600 54856 54860 54238 52787 50861 49053 47681 46818 46683 47625 49623 51975 53667
65637 53667 54117 53569 52765 52218 51831 51207 50206 49109 48301 47924 47836 47784 47585 47243 46943 46868 46945 46836 46280 45417
65617 45417 44701 44409 44328 44006 43321 42668 42501 42785 43076 43079 42889 42647 42288 41855 41858 42900 44868 46787 47627 47181
65597 47181 46095 45206 44972 45341 45908 46215 46104 45924 46284 47491 49177 50536 50949 50430 49506 48695 48094 47488
65579 47488 46815 46448 46932 48461 50671 52917 54660 55544 55332 54050 52253 50905 50745 51747 53229 54419
65563 54419 54820 54195 52603 50569 48947 48274 48309 48369 48050 47417 46612 45656 44722 44244 44477 45145 45751 46135 46489
65544 46489 46972 47629 48585 49893 51144 51640 51211 50533 50408 50870 51285 51144 50528 49899 49712 50103 50705 50828
65526 50828 50152 49164 48668 48914 49484 49947 50131 49850 48941 47759 47060 47075 47143 46670 45962 45618 45496 45020 44300
65507 44300 44148 44893 45854 46288 46309 46553 47324 48400 49370 49799 49334 48079 46790 46364 47063 48337 49336 49563
65489 49563 49186 48920 49477 50917 52564 53660 53966 53723 53274 52902 52789 52784 52339 51010 49081 47521 47254 48464
65471 48464 50416 51878 51980 50955 49887 49495 49408 48937 48256 48210 49081 50200 50923 51348 51794 52117 52023 51680
65453 51680 51499 51516 51528 51682 52448 53853 55195 55723 55414 54914 54885 55492 56403 57129 57374 57074 56185 54586 52383
65434 52383 50196 48841 48640 49193 49885 50408 50742 50901 50968 51214 51805 52407 52414 51700 50839 50413 50384 50506 51067 52667
65414 52667 55169 57444 58479 58409 58072 57894 57732 57632 57980 58764 59295 59052 58424 58201 58627 59335 59951 60294
65396 60294 60191 59616 59046 59127 59870 60606 60911 61169 61932 63076 63964 64309 64488 65036 66090 67389 68584 69493
65378 69493 70173 70860 71794 73083 74757 76869 79465 82429 85430 87996 89745 90715 91540 93102 95720 98745
65362 98745 101143 102489 103207 103876 104600 105130 105348 105374 105319 105191 105038 104936 104841 104575 104068 103420 102652 101516 99778
65343 99778 97595 95376 93234 90820 87873 84765 82208 80441 78977 77227 75143 73031 70930 68507
65329 68507 65649 62877 60985 60369 60861 62102 63817 65695 67307 68416 69260 70218 71138 71277 70060 67735
65313 67735 65101 62745 60797 59304 58398 58029 57863 57662 57531 57536 57314 56427 55096 54252 54696 56289 58049
65296 58049 58928 58476 56941 54952 53134 51904 51444 51691 52310 52844 53056 53120 53356 53799 54186 54335 54318 54154
65278 54154 53521 52019 49788 47686 46686 47031 48030 48771 49008 49282 50197 51709 53167 53918 53854 53495 53582 54431
65260 54431 55552 56126 55956 55724 56063 56647 56605 55636 54234 52876 51535 50136 48954 48238 47798 47296 46665
65243 46665 45967 45103 44021 43050 42695 43127 44052 44942 45304 44989 44482 44624 45704 47051 47839 48033 48144 48349
65225 48349 48415 48325 48309 48283 47906 47307 47154 47802 48878 49923 50904 51815 52317 52163 51581 50855 49971 49073 48776 49378
65205 49378 50078 49753 48496 47682 48324 49872 50896 50599 49441 48458 48231 48459 48493 48235 48338 49394 51153
65188 51153 52843 54072 55024 55836 56277 56132 55537 54789 54057 53390 52729 51894 50839 49950 49709 49988 50039 49340
65170 49340 48112 46876 45969 45730 46641 48706 50960 52168 51959 50908 49647 48390 47313 46748 46745 46830 46606
65153 46606 46361 46717 47708 48606 48746 48274 47859 47825 47912 47889 48051 48822 50080 51271 52147 52997 54100 55293 56237
65134 56237 56782 56873 56423 55539 54614 53902 53217 52410 51920 52459 54124 56188 57737 58281 57835 56825 55903 55495
65116 55495 55370 54885 53778 52535 51986 52628 54279 56133 57244 57304 56956 57068 57753 58410 58598 58378 57879 57166
65098 57166 56700 57228 58865 60778 62151 62994 63641 64015 63997 64091 64981 66605 68370 70129 72191 74445 76283
65081 76283 77564 78891 80612 82187 82968 83096 83146 83273 83216 82846 82209 81205 79745 78089 76557 74922 72644
65064 72644 69738 66931 64743 62846 60667 58347 56685 56201 56575 57049 57126 56753 56041 55101 54163 53556 53358
65047 53358 53144 52365 51047 49923 49699 50287 50881 50679 49449 47597 45941 45287 45878 47138 48187 48680 48953
65030 48953 49358 49736 49712 49215 48465 47636 46762 45901 45145 44534 44190 44426 45462 47013 48458 49424 49980 50233
65012 50233 50070 49451 48660 47983 47356 46621 46026 46091 46936 48023 48716 48962 49274 50094 51337 52544 53383 53883
64994 53883 54199 54285 53983 53380 52868 52748 52900 53009 53016 53150 53529 53874 53686 52704 51196 49818 49088 48983 49113
64975 49113 49277 49585 49998 50146 49866 49586 49707 49821 49190 47969 47320 48041 49633 51060 51969 52698 53407 53788
64957 53788 53586 52946 52173 51485 51011 50798 50812 51087 51833 53142 54622 55599 55676 54953 53754 52438 51435 51066
64939 51066 51166 51139 50518 49405 48272 47485 47049 46684 46115 45433 45125 45543 46374 46949 47092 47297 47924 48621 48822
64920 48822 48587 48578 49277 50492 51593 52019 51647 50878 50358 50429 50842 51133 51199 51251 51306 51069 50429 49781 49616 49951
64900 49951 50391 50661 50777 50653 49881 48201 46141 44869 45222 46939 48929 50248 50741 50918 51368 52264 53221
64883 53221 53597 53095 52138 51537 51688 52215 52428 52031 51275 50551 50000 49544 49163 49010 49171 49357 48986 47771 46157
64864 46157 44991 44710 45038 45551 46242 47328 48636 49542 49627 49191 48938 49200 49631 49715 49417 49172 49282 49603 49871
64845 49871 50045 50072 49633 48489 46965 45678 44832 44181 43657 43500 43736 44051 44411 45181 46293 46885 46332 45184
64827 45184 44419 44128 43711 43151 43179 44057 45082 45648 46083 46936 47958 48477 48443 48437 48657 48531 47533 46033 44996
64808 44996 44960 45515 45833 45592 45268 45515 46444 47667 48870 50007 50898 51080 50348 49243 48718 49325 50830 52465
64790 52465 53393 53158 51984 50639 49753 49272 48737 48013 47435 47245 47255 47196 47164 47465 48162 48998 49736 50355 50917
64771 50917 51425 51857 52244 52617 52935 53141 53219 53169 52943 52481 51808 51070 50476 50227 50390 50740 50753 49997 48649 47532
64751 47532 47426 48294 49291 49632 49381 49268 49694 50063 49358 47371 45148 43986 44181 44982 45658 46176 46806 47577
64733 47577 48393 49246 49942 49898 48739 47029 45891 45892 46640 47478 48123 48536 48675 48664 48884 49594 50626 51652 52478
64714 52478 52891 52547 51383 49930 48848 48245 47784 47360 47275 47710 48442 49174 49881 50654 51403 51897 51979 51638 50984
64695 50984 50275 49861 49938 50370 50842 51188 51489 51862 52261 52532 52584 52386 51833 50797 49419 48212 47652 47679 47803
64676 47803 47654 47218 46544 45586 44542 43999 44427 45605 46811 47549 47848 47970 48087 48282 48582 48882 49002 48912
64658 48912 48816 48941 49290 49601 49468 48606 47119 45539 44499 44313 44861 45747 46468 46646 46325 45981 46008 46241 46229
64639 46229 45895 45626 45750 46252 47067 48228 49598 50783 51525 51931 52081 51711 50646 49314 48413 48093 47903
64622 47903 47587 47517 48138 49212 49980 50004 49551 49166 49136 49548 50585 52346 54339 55602 55611 54862 54288 54264 54468
64603 54468 54580 54656 54856 55224 55780 56434 56700 56024 54658 53685 53799 54430 54540 53952 53363 53271 53513 53761 53840 53521
64583 53521 52636 51624 51457 52701 54917 57168 58791 59558 59510 58934 58219 57444 56390 55185 54548 54972 55944
64566 55944 56470 56270 55981 56192 56730 57011 56709 55892 54762 53512 52385 51666 51557 52049 52921 53906 54879 55842
64548 55842 56786 57712 58778 60097 61344 61895 61589 60991 60611 60200 59267 57986 56971 56316 55482 54129 52449
64531 52449 50710 49093 48121 48466 49997 51658 52704 53477 54507 55411 55374 54334 52984 51804 50823 50224
64515 50224 50450 51526 52766 53333 52870 51635 50401 50137 51316 53400 55322 56420 56580 55767 54070 52204
64499 52204 51214 51409 52110 52648 52980 53069 52403 50746 48857 47750 47510 47482 47420 47741 48639 49651 50307 50704 51145
64480 51145 51574 51715 51585 51542 51898 52687 53750 54830 55567 55590 54802 53524 52224 51101 50092 49281 48980 49225
64462 49225 49455 49113 48444 48255 48901 49974 51028 52066 53101 53774 53814 53485 53182 52926 52665 52732 53434 54418
64444 54418 55039 55226 55434 55770 55812 55404 55029 55131 55518 55737 55730 55884 56588 57933 59648 61197 62132 62457 62531
64425 62531 62580 62525 62275 61886 61400 60878 60699 61387 62896 64422 65243 65506 65845 66486 67099 67417 67552 67710 67953
64406 67953 68314 68784 69101 68864 68116 67597 68079 69407 70535 70605 69758 68678 67606 66282 64765 63664 63182
64389 63182 62497 60717 58234 56418 55999 56405 56820 57188 57766 58227 57836 56338 54229 52225 50772 49944 49511
64372 49511 49161 48955 49461 51155 53712 56147 57643 58080 57902 57708 57927 58578 59378 60243 61505 63324 65051
64355 65051 65687 65094 64252 64092 64448 64503 63974 63377 63199 63321 63416 63557 64103 65131 66347 67588 69053 70868
64337 70868 72692 74064 74987 75801 76507 76687 76231 75765 76045 77135 78457 79458 79930 79839 79318 78809 78815 79358
64319 79358 79935 80204 80497 81505 83575 86490 89797 93152 96380 99446 102489 105761 109408 113325 117403
64304 117403 121941 127605 134777 143032 151500 159750 168046 176728 185644 194317 202389 209589 215466 219513
64290 219513 221551 221804 220633 218329 215049 210721 205028 197791 189395 180689 172436 164948 158167 151818
64276 151818 145484 138829 131961 125470 119979 115664 112192 109035 105846 102645 99759 97569 96216 95413
64262 95413 94465 92627 89775 86746 84731 84172 84404 84474 83981 83014 81747 80499 79866 80238 81282 82312 83018
64245 83018 83449 83573 83487 83864 85356 87479 88874 89023 89027 90202 92446 94453 95173 94548 93193 91897 91284
64228 91284 91420 91703 91454 90551 89347 88212 87387 87054 87173 87428 87622 87866 88092 87736 86490 85085 84632 85232
64210 85232 85925 86111 86351 87461 89394 91508 93551 95842 98522 101029 102488 102504 101550 100622 100481 101264 102785
64193 102785 104939 107595 110265 112395 113961 115419 117048 118791 120800 123530 127007 130643 134267 138870
64179 138870 145562 153988 162551 170233 177506 185250 193442 201352 208542 215066 220903 225751 229370 231652
64165 231652 232272 230724 226938 221605 215576 209093 201887 193925 185699 177766 170323 163442 157412 152453
64151 152453 148197 143885 139273 135044 132039 130179 128419 125784 122282 118788 116200 114723 113834 112816
64137 112816 111376 109806 108617 108051 107986 108125 108149 107801 107129 106626 106855 107804 108863 109560 110025 110617 111432 112469
64119 112469 113966 116078 118395 120290 121745 123402 125720 128521 131416 134186 136581 138272 139263 139943 140403
64104 140403 140215 139327 138703 139444 141511 143972 146414 149418 153586 158739 164195 169249 173183 175380 175874
64089 175874 175477 175021 174756 174629 174751 175175 175505 175172 174035 172437 170797 169428 168626 168658 169670 171715 174748
64072 174748 178434 182206 185725 189150 192710 196229 199303 201752 203564 204583 204612 203721 202156 200047 197539
64057 197539 195034 192849 190742 188219 185339 182717 180753 179389 178763 179441 181627 184644 187621 190443 193468
64042 193468 196535 198797 199619 199273 198580 198063 197554 196480 194404 191344 187630 183548 179257 175006 171175
64027 171175 167978 165264 162817 160730 159309 158702 158849 159683 161070 162589 163736 164502 165531 167472 170282
64012 170282 173322 175969 178012 179587 181063 183019 185983 189983 194432 198631 202389 206081 210118 214488
63998 214488 218815 222820 226680 230940 236064 242109 248893 256396 264728 273646 282473 290762 298834 307313
63984 307313 316265 325300 334407 344163 354955 366587 378906 392303 407198 423472 440888 459783
63972 459783 480729 503778 528661 555610 585333 618231 654357 694363 739839 792423 853167
63961 853167 923181 1004431 1099384 1210091 1338098 1485023 1652704 1842648 2055548 2291199
63951 2291199 2548511 2825519 3119627 3427929 3747217 4073573 4401896 4725617 5036777
63942 5036777 5326692 5587132 5811330 5994249 6132240 6222703 6263969 6255301 6196906 6089937
63932 6089937 5936530 5740008 5505263 5238846 4948209 4640524 4322191 3999298 3677992
63923 3677992 3363973 3061771 2774692 2505258 2255428 2026543 1819325 1633897 1469670
63914 1469670 1325390 1199536 1090573 996743 915948 846193 785943 733835 688350 648164 612598
63903 612598 581203 553104 527298 503475 481801 461829 442328 422526 402938 384542 367529
63892 367529 351291 335363 319854 305134 291533 279262 268190 257648 246862 235751 225047
63881 225047 215435 206766 198372 190124 182821 177363 173656 170602 167205 163403 159711 156367 153244 150422
63867 150422 148328 147157 146464 145563 144141 142348 140560 139209 138682 139067 140067 141341 142811 144481 146117
63852 146117 147396 148324 149211 150152 150811 150776 149926 148296 145858 142766 139667 137290 135587 133685 130932 127676
63836 127676 124629 121785 118606 115190 112451 110843 109612 107808 105451 103062 100533 97356 93767 90696
63822 90696 88488 86556 84528 82880 82013 81438 80509 79416 78772 78593 78375 77961 77674 77667 77705 77623 77498 77354 77137
63803 77137 76981 77105 77345 77234 76614 75803 75099 74437 73669 72848 72096 71486 71153 71203 71342 70988 70017 69110 69000
63784 69000 69560 69969 69735 69162 68772 68633 68489 68328 68459 68975 69426 69226 68315 67218 66524 66433 66819 67472 68179
63765 68179 68725 68983 68975 68799 68631 68768 69423 70337 70892 70785 70367 70136 70123 70092 70076 70297 70703 71031 71311 71895 72928
63744 72928 74114 75061 75658 76123 76932 78582 81045 83570 85487 87164 89640 93307 97591 102045 107008
63729 107008 112765 118726 124059 128745 133291 137606 140874 142535 142805 142110 140559 138213 135492 132910 130483
63714 130483 127669 123986 119613 115339 111889 109314 107161 105201 103753 103177 103257 103383 103247 103122 103435 104248
63698 104248 105228 106061 106847 108024 109795 111664 112784 112817 112218 111594 111076 110522 109996 109747 109989 110985 113111
63681 113111 116385 120100 123357 125957 128396 131119 134190 137610 141392 145235 148623 151441 154066 156617
63667 156617 158522 159085 158196 156197 153348 149768 145716 141528 137289 132832 128078 123203 118512 114371 111248
63652 111248 109578 109347 109844 110042 109402 108341 107787 108255 109493 111035 112797 114905 117304 119926 123061 127013
63636 127013 131430 135514 139030 142653 147198 152956 159945 168263 177827 188169 198948 210415 223016
63623 223016 236805 251591 267382 284273 302104 320621 339740 359081 377382 392916 404626
63612 404626 412544 417230 419275 419318 417990 415593 412177 408081 404086 400804 398101 395220 391303 385744 378376
63597 378376 369454 359304 347915 335034 320731 305663 290789 276983 264809 254280 244861 236083
63585 236083 228217 221918 217189 213251 209611 206680 204978 204353 204544 206071 209717 215197 221036 226019 230325
63570 230325 235093 241203 248642 256821 265266 274053 283628 294247 305748 318010 331384 346415 363235
63557 363235 381468 400452 419102 435739 448697 457387 462459 464872 465195 463809 461255 458085 454758
63544 454758 451934 450447 450604 451759 452914 453490 453239 451801 448848 444377 438311 429985 418689 404724
63530 404724 389305 373307 356712 339440 322063 305305 289343 274168 260225 248058 237415
63519 237415 227295 217019 206887 197737 190101 183841 178271 172604 166598 160891 156423 153384 150984
63506 150984 148366 145502 142975 141133 139776 138585 137555 136980 137125 137918 138873 139460 139670 140132 141506 143857
63490 143857 146790 150072 153817 158146 162981 168266 174051 180168 186072 191259 195696 199593 202770 204523
63476 204523 204189 201735 197740 192957 188010 183391 179413 175969 172482 168431 164000 159974 156889 154558
63462 154558 152645 151376 151194 151811 152204 151791 151243 151834 154220 158059 162500 166782 170565 174117 178124 183011
63446 183011 188467 193868 199105 204752 211415 219204 227790 236772 246000 255809 266945 280012 294994
63433 294994 311559 329810 350278 373042 397156 421302 444898 468359 492297 516516 539662
63422 539662 559817 575537 586437 592795 594869 592981 588164 582132 576308 571140 566443 561953 557185
63409 557185 551253 543404 533576 521968 508300 492105 473697 454189 434449 414592 394720 375609
63397 375609 358162 342508 328073 314449 301857 290836 281771 274703 269345 265264 262200 260223 259465
63384 259465 259779 260899 262924 266449 272048 279677 288658 298245 308170 318676 330146 342779 356665
63371 356665 371992 388982 407565 427298 447690 468498 489543 510245 529493 546062 559174
63360 559174 568652 574595 577021 575965 571942 566130 559902 554160 549139 544656 540274 535249 528746 520330
63346 520330 510159 498570 485584 470946 454454 436163 416461 396199 376551 358353 341546
63335 341546 325548 310269 296479 284956 275409 266545 257331 248043 239944 233910 229493 225441 220999
63322 220999 216472 212518 209252 206291 203444 200902 198726 196533 193930 191104 188764 187518 187466 188291 189526
63307 189526 190724 191605 192256 193098 194441 195985 196972 196948 196267 195646 195319 194917 194203 193555 193400 193448 192881 191325
63289 191325 189241 187280 185600 184089 182914 182408 182440 182352 181694 180749 180145 180127 180487 181013 181657 182284 182677 182934
63271 182934 183523 184639 185699 185848 184930 183672 182900 182792 182958 183044 183158 183809 185450 187993 190812 193406 195981
63254 195981 199141 203099 207478 211824 215899 219536 222775 226364 231502 238611 246698 254400 261391 268365
63240 268365 276034 284795 295125 307424 321311 335712 349974 364479 379950 396534 413807 431183
63228 431183 447978 463423 477143 489591 501753 514481 528195 542971 558541 574365 590051
63217 590051 605721 621680 637678 652663 665311 674680 680398 682454 680930 675879 667403 655792 641490
63204 641490 624864 606141 585781 564763 544292 525137 507470 491380 477262 465494 455961 448283
63192 448283 442529 439279 438866 440947 445087 451366 459866 469885 480477 491850 505356 521636 539429
63179 539429 556817 573183 589316 605994 623315 641164 659390 677427 694529 710478 725362
63168 725362 738591 749035 756350 761202 763735 762767 757257 747763 735492 720494 701951 680002 656117
63155 656117 631561 606489 580866 555382 530966 507986 486515 466948 449760 434840 421592
63144 421592 409665 399233 390450 382976 376207 369871 364184 359433 355591 352415 349786 347718 346144 344940
63130 344940 344197 344119 344612 345250 345754 346145 346255 345578 343942 341912 340021 337923 334968 331484 328839 328085 328928
63113 328928 330146 330666 330216 329316 328805 329128 330012 330958 331908 333144 334684 336198 337443 338339 338696 338413 338018
63096 338018 338504 340413 343431 346987 350804 354741 358599 362413 366550 371194 375972 380370 384275 387877
63082 387877 391278 394497 397739 401360 405551 410107 414474 418086 420922 423709 427386 432355 438466 445583
63068 445583 453752 462793 472254 481907 491947 502653 514256 527202 542019 558695 576652 595557
63056 595557 615767 637800 661829 687848 715754 744977 774603 804279 834560 866023 898473
63045 898473 931311 964045 996072 1026751 1056388 1086503 1118235 1150950 1183300 1215223 1247775
63034 1247775 1281157 1314014 1344720 1372284 1395702 1413436 1424186 1427605 1423811 1412656 1393958 1368160
63022 1368160 1336383 1299946 1260043 1217692 1173878 1129842 1087106 1046887 1009581 975267 944648
63011 944648 918937 898792 883929 873929 868811 868596 872921 881454 894178 910859 930642 952629
62999 952629 976551 1002442 1029954 1058417 1087417 1116831 1146402 1175651 1204236 1232201 1259858
62988 1259858 1287457 1314757 1340682 1363558 1381914 1394986 1402397 1403599 1397845 1384558 1363568 1335163
62976 1335163 1300081 1259252 1213454 1163410 1110308 1055821 1001325 947388 894299 842799 793870
62965 793870 748073 705509 666303 630610 598210 568563 541388 516803 494785 474788 456077
62954 456077 438287 421531 406041 391800 378518 365960 354334 344138 335481 327734 320159 312766
62942 312766 306186 300694 295754 290735 285755 281532 278511 276411 274612 272746 270820 268931 267022 264927
62928 264927 262517 259811 257042 254656 253054 252173 251385 250026 248025 245856 243912 242113 240178 238060 236002
62913 236002 234312 233158 232497 232151 232008 232091 232230 231824 230300 227904 225650 224293 223616 222941 222004 221063 220422
62896 220422 220179 220297 220612 220874 220976 220976 220737 219880 218457 217313 217224 217831 218071 217637 217346 217880 218793 219210 219055
62877 219055 219008 219396 219667 219104 217694 216072 214779 213856 213141 212690 212721 213192 213716 213953 213919 213829 213768 213673 213508 213337
62857 213337 213279 213477 214028 214823 215506 215708 215227 214068 212517 211198 210712 210988 211247 210799 209651 208181 206669
62840 206669 205474 205188 206006 207209 207916 208187 208724 209595 210090 209926 209801 210437 211780 213554 215908 218950 222135
62823 222135 224808 227076 229485 232016 234040 235307 236357 237788 239546 241215 242805 244912 248118 252299
62809 252299 256620 260297 263339 266378 269782 273231 276384 279666 284016 289945 297151 305029 313273 321983
62795 321983 331516 342375 355055 369830 386752 405951 427886 453209 482307 514941 550415 588328
62783 588328 629167 673974 723335 776830 833452 892173 951955 1011684 1070556 1128175 1183651
62772 1183651 1234734 1278505 1313088 1338199 1353959 1359871 1355382 1340940 1317865 1287261 1249539 1205018
62760 1205018 1154659 1100169 1043543 986506 930168 875169 822107 771633 724000 678852 635881
62749 635881 595568 558798 525775 495823 468386 443714 422177 403339 386275 370677 357101
62738 357101 346000 336942 329004 321619 314787 308635 303088 297972 293255 289168 286150 284649 284828 286461
62724 286461 289084 292222 295498 298780 302341 306717 312185 318492 325316 332895 341935 352909 365787 380499
62710 380499 397324 416655 438642 463311 490901 521804 556232 594168 635662 680983 730420
62699 730420 783988 841362 901967 964981 1029137 1092552 1152915 1208098 1256665 1297745 1330469
62688 1330469 1353740 1366559 1368425 1359362 1339836 1310786 1273497 1229244 1179119 1124266 1066072 1006000
62676 1006000 945419 885763 828497 774586 724172 677138 633771 594451 558847 526093 495873
62665 495873 468775 445291 424849 406223 388639 372136 357033 343384 330937 319383 308624
62654 308624 298858 290226 282334 274418 266209 258352 251577 245717 240010 234278 229211 225353 222346 219477
62640 219477 216583 214044 212115 210684 209614 208918 208540 208244 207828 207320 206887 206662 206652 206673 206344 205354 203904
62623 203904 202760 202732 204082 206464 209337 212300 215113 217642 219925 222208 224823 228007 231891 236580 242112
62608 242112 248373 255222 262800 271589 281994 293964 307233 321966 338908 358712 381306 406117
62596 406117 432803 461413 491843 523504 555652 587678 618801 647713 672937 693513 709073
62585 709073 719334 723956 722973 716988 706636 692053 673123 650186 624310 596834 568762 540546
62573 540546 512352 484550 457918 433272 410841 390180 370751 352392 335230 319532 305859
62562 305859 294907 286638 279810 273038 266314 260809 257034 253908 250041 245369 240927 237418 234673 232313
62548 232313 230206 228170 225853 223166 220405 217798 215249 212737 210556 208919 207652 206608 206122 206701 208443
62533 208443 211072 214391 218377 222967 228170 234379 242169 251702 262635 274700 288086 303161 320085
62520 320085 338880 359608 382311 406923 433417 461837 491981 523216 554824 586360 617438
62509 617438 647231 674511 698203 717666 732407 741802 745318 742865 734755 721406 703260 681040
62497 681040 655888 629053 601384 573199 544742 516693 490116 465835 443908 423777 404878
62486 404878 387087 370675 355903 342723 330854 320183 310921 303182 296466 289868 282927 276008 269717
62473 269717 264232 259420 255282 251806 248561 245000 241192 237818 235338 233575 232212 231222 230557 229909 229168
62458 229168 228765 229108 229965 230902 232103 234120 236878 239660 242268 245509 250093 255499 260518 264703 268666
62443 268666 272991 277408 281237 284177 286300 287530 287575 286329 284022 280854 276784 271860 266532 261337 256294
62428 256294 250937 245036 239074 233785 229376 225435 221561 217772 214249 210993 208010 205623 204222 203695
62414 203695 203419 202957 202482 202313 202289 201979 201434 201328 202230 204008 206111 208233 210494 213156 216391 220186 224210
62397 224210 227839 230691 233183 236253 240327 244707 248207 250324 251711 253530 256426 260071 263579 266314
62383 266314 268300 270011 271938 274413 277577 281270 285119 289005 293394 298914 305718 313657 322993 334422
62369 334422 348238 364070 381735 401913 425502 452707 483156 516552 552559 590199 628045
62358 628045 665017 700476 733526 762863 787490 807109 821677 831074 835444 835379 831404 823635 812192
62345 812192 797542 780079 759736 736514 711131 684706 657943 631102 604635 579331 555749
62334 555749 533966 513970 495977 480127 466135 453329 440937 428344 415403 402647 390934
62323 390934 380695 371585 362931 354304 345663 337156 329037 321580 314890 308855 303398 298704 295008 292267
62309 292267 290162 288425 287014 286051 285711 286154 287369 289033 290601 291683 292321 292882 293665 294596 295375 295971
62293 295971 296894 298793 301722 304997 307882 310277 312565 314955 317298 319506 321815 324477 327484 330780
62279 330780 334537 338921 343718 348468 352982 357549 362699 369010 377092 387387 399839 414032 429852
62266 429852 447766 468263 491277 516522 544223 575067 609368 646545 685408 724592 762636
62255 762636 798026 829498 856203 877551 893110 902851 907179 906509 900929 890479 875551 856739
62243 856739 834448 808925 780542 749844 717462 684337 651866 621379 593363 567505 543530
62232 543530 521666 502270 485352 470597 457641 446247 436439 428452 422256 417173 412444 408187 405206
62219 405206 403626 402330 400232 397642 395799 395404 396168 397579 399395 401454 403648 406198 409444 413307 417419
62204 417419 421837 427050 433163 439590 445802 451919 458337 465278 473011 481983 492202 502860 513103
62191 513103 523054 533621 545437 558439 572271 586533 600544 613342 624172 632833 639581 644959
62179 644959 649663 654319 659330 665158 672569 682250 694261 708322 724688 744189 767145 792616 818995
62166 818995 845022 869898 892683 912128 927199 937577 943635 946138 945894 943432 938820 931788 922039
62153 922039 909499 894354 876990 857899 837647 816907 796436 776887 758651 742006 727356
62142 727356 715084 705110 696814 689545 683135 677833 673917 671435 670217 670024 670772 672612 675661 679715
62128 679715 684463 689952 696459 703778 711076 717740 724010 730378 736655 742162 746734 751047 755856 761328
62114 761328 767191 773132 778841 783862 787665 789859 790394 789659 788321 786870 785398 784042 783476 784551 787367
62099 787367 791126 795080 799362 804653 811267 818753 826247 833050 839044 844811 851301 859214 868661 879394
62085 879394 891230 904219 918602 934589 952004 970109 988088 1005828 1023929 1042782 1062000
62074 1062000 1080995 1099744 1118550 1137372 1155957 1174515 1193570 1212956 1231441 1247664 1261086
62063 1261086 1271747 1279434 1283607 1284130 1281653 1277051 1270581 1261745 1249894 1234849 1216905 1196421 1173652
62050 1173652 1149016 1123241 1096963 1070330 1043311 1016421 990817 967482 946566 927688 910636
62039 910636 895439 881901 869446 857605 846405 836194 827241 819623 813335 808245 803981 800029 796004
62026 796004 791733 787119 782095 776808 771723 767288 763501 759933 756243 752549 749221 746403 743876 741339
62012 741339 738718 736216 734220 733140 733128 733833 734586 735016 735432 736485 738511 741339 744615 748064 751408 754311
61996 754311 756459 757519 756952 754218 749314 742825 735199 726334 716233 705685 695650 686071 676079 665503
61982 665503 655454 646961 639613 632162 624140 616266 609385 603618 598549 593723 588859 583942 579234 574911
61968 574911 570745 566439 562262 558880 556504 554626 552741 550905 549401 548281 547460 546852 546140 544832 543004
61953 543004 541686 542000 544053 547032 550285 553915 558377 563872 570144 576664 583047 589591 597218 606556
61939 606556 617176 628134 639140 650689 663023 675668 688272 701298 715337 730029 744320
61928 744320 757715 770786 784343 798572 813241 828493 845003 863367 883632 905599 929444
61917 929444 955795 985179 1017573 1052692 1090672 1132261 1178215 1228597 1282854 1340577 1402064
61906 1402064 1468013 1538714 1613727 1692342 1774146 1858954 1946294 2035245 2124788 2214054 2302088
61895 2302088 2387474 2468250 2542115 2606747 2660216 2701252 2729012 2742533 2740727 2723092 2690172
61884 2690172 2643088 2582918 2510935 2429271 2340788 2248114 2153070 2057031 1961486 1868046 1778046
61873 1778046 1692257 1610850 1533630 1460495 1391780 1328042 1269529 1215925 1166563 1120747 1078053
61862 1078053 1038696 1003530 973234 947334 924379 903240 883966 867164 852991 841106 831387
61851 831387 824103 819319 816469 814672 813262 811795 809734 806468 801799 796239 790578 785157 779793 774400
61837 774400 769302 764804 760873 757631 755785 756024 758143 761316 765131 769701 774835 779876 784581 789414
61823 789414 794642 799730 804001 807202 808989 808691 806314 803185 800624 798367 795312 791555 788633 787747 788786
61808 788786 791286 795337 801120 808452 817375 828514 842235 857933 874796 892887 912886 935147
61796 935147 959584 986199 1015013 1045632 1077696 1111782 1149216 1190714 1235708 1283300 1333497
61785 1333497 1387182 1445160 1507698 1574937 1647363 1725743 1810715 1902582 2001443 2107353 2220356
61774 2220356 2340524 2468118 2603627 2747345 2898749 3056360 3218197 3382183 3546077
61765 3546077 3707300 3863013 4010100 4144849 4262914 4360145 4433642 4481887 4504016 4499303
61755 4499303 4467445 4409067 4325908 4220716 4097021 3958622 3809018 3651329 3488659 3324172
61745 3324172 3160589 2999799 2843135 2691806 2546828 2408749 2277811 2154349 2038809
61736 2038809 1931374 1831833 1739784 1654759 1576115 1503120 1435233 1372171 1313638 1259236 1208709
61725 1208709 1162035 1119112 1079607 1043294 1010282 980569 953542 928311 904458 882032 860832
61714 860832 840162 819550 799305 780078 762095 745095 728785 712992 697529 682266 667310
61703 667310 652830 638808 625286 612785 601964 592725 584012 574785 564991 555400 546709 538983 531809
61690 531809 524685 517279 509486 501348 492969 484634 476919 470345 464781 459451 453801 448157 443282 439416
61676 439416 436045 432540 428721 424752 420780 416793 412727 408583 404495 400696 397324 394286 391328 388220
61662 388220 384863 381355 378044 375370 373480 372085 370824 369652 368725 368014 367346 366714 366307 366221 366382 366789
61646 366789 367651 369172 371288 373552 375230 375669 374772 373023 370884 368423 365713 363261 361505 360086 358203
61631 358203 355675 353060 350713 348490 346543 345675 346401 348236 350377 352556 354641 355968 355918 354983 354465 355017
61615 355017 356093 356796 356648 355398 352825 349122 345086 341490 338409 335373 331977 328173 324138 320080 316154
61600 316154 312485 309270 306739 304846 303130 301226 299405 298265 297892 297771 297559 297446 297634 297957 298288 298875
61584 298875 299909 301138 302333 303762 305763 308156 310624 313458 317298 322187 327522 332967 338825 345255
61570 345255 351713 357553 362860 368301 374463 381689 390290 400375 411493 422917 434361 446049 457965
61557 457965 469403 479545 488248 496011 503325 510366 517186 523788 529949 535311 539830 543962 548245 552858
61543 552858 557657 562354 566483 569459 571046 571670 571977 572128 571867 571154 570338 569618 568707 567190 564970 562258
61527 562258 559444 557106 555811 555664 556281 557377 559132 561762 565070 568871 573646 580290 589182 599820
61513 599820 611434 623752 637201 652630 670831 692017 715719 741464 769540 800766 835393
61502 835393 872636 911591 952385 996011 1043088 1093143 1145161 1198443 1252637 1307092 1360599
61491 1360599 1411770 1459344 1501983 1538210 1567061 1588657 1603623 1611911 1612649 1605352 1590900 1571120
61479 1571120 1547768 1522119 1495078 1467171 1438712 1410465 1383916 1360323 1339531 1320277 1301686
61468 1301686 1284021 1267907 1253387 1239986 1227277 1215078 1203339 1192150 1181721 1172244 1163883 1156934
61456 1156934 1151745 1148363 1146501 1145998 1147069 1149998 1154746 1161071 1168835 1178127 1189291 1202894 1219384
61443 1219384 1238540 1259385 1280740 1301763 1321989 1341209 1359428 1376587 1392108 1405015 1414735
61432 1414735 1421480 1425670 1427386 1426799 1424786 1422536 1420649 1419070 1417825 1417321 1417900 1419526 1421995 1425117 1428540
61417 1428540 1431663 1433816 1434326 1432421 1427414 1419140 1408014 1394557 1379096 1362017 1344021 1325897 1308190
61404 1308190 1291256 1275450 1261068 1248139 1236447 1225762 1216019 1207350 1199954 1193837 1188677 1184161
61392 1184161 1180568 1178781 1179499 1182629 1187764 1195113 1205501 1219349 1236109 1255028 1276245 1300701 1329124
61379 1329124 1361490 1397463 1436850 1479409 1524652 1572217 1622113 1674099 1726932 1778700 1827958
61368 1827958 1874104 1916608 1954392 1986233 2011440 2029801 2041110 2045120 2041863 2031688 2014946 1991765
61356 1991765 1962156 1926311 1884926 1839296 1790864 1740528 1688514 1635078 1581111 1527881 1476321
61345 1476321 1426742 1379053 1333089 1288951 1247295 1209101 1174834 1144002 1115859 1090372 1068086
61334 1068086 1049145 1032954 1018883 1006859 997113 989670 984327 980960 979639 980516 983609 988560 994633
61321 994633 1001178 1008191 1016287 1026102 1037827 1051230 1065860 1081195 1096802 1112360 1127368 1140941
61309 1140941 1152243 1161211 1168511 1174694 1179639 1182917 1184391 1184276 1182891 1180617 1177979 1175504 1173407 1171369
61295 1171369 1168539 1163870 1156759 1147528 1137107 1126206 1114971 1103362 1091480 1079405 1067110 1054775
61283 1054775 1042952 1032172 1022541 1013905 1006132 998983 991938 984534 976813 969236 962214 955957 950639
61270 950639 946414 943209 940667 938277 935466 931721 926882 921322 915657 910265 905256 900874 897720 896472
61256 896472 897473 900673 905899 913163 922724 934918 950041 968430 990516 1016556 1046329 1079303
61244 1079303 1115045 1153080 1192233 1230450 1265623 1296470 1322503 1343397 1358713 1368042 1371098 1367776
61232 1367776 1358453 1344163 1326147 1305212 1281774 1256543 1230782 1205765 1182222 1160479 1140955
61221 1140955 1124155 1110052 1097596 1085023 1070797 1054387 1036128 1016542 995911 974447 952570
61210 952570 930959 910507 892173 876473 862985 850736 839305 829182 820767 813466 806255 798807
61198 798807 791495 784511 777637 770820 764246 757727 750643 742763 734654 726995 719837 712774 705473 697783
61184 697783 689658 681257 672844 664332 655226 645254 634807 624450 614303 604220 594310 584889 576092
61171 576092 567952 560707 554555 549174 543938 538713 534108 530827 529015 528346 528412 528877 529442 529890 530131 530108
61155 530108 529690 528625 526550 523075 518061 511811 504928 497955 491261 485185 479988 475605 471648 467769
61141 467769 463959 460442 457450 455110 453400 452092 450890 449695 448590 447522 446165 444281 442077 440042
61127 440042 438536 437668 437453 437897 438941 440494 442518 444987 447870 451296 455586 460883 466805 472703 478169
61112 478169 482993 486669 488474 488206 486478 483975 480695 476245 470619 464267 457554 450617 443686 437060
61098 437060 430679 424167 417491 411161 405533 400267 394830 389288 384182 379760 375675 371527 367399 363792
61084 363792 361191 359673 358758 357722 356236 354756 354095 354643 356164 358286 360818 363532 365988 367903 369520
61069 369520 371350 373620 376200 379074 382640 387338 393117 399377 405499 411374 417420 424124 431616 439599
61055 439599 447576 455152 462287 469357 476876 485035 493551 502087 510705 519773 529487 539679 550185 561195
61041 561195 573191 586596 601608 618284 636655 656623 677767 699445 721379 744151 768844
61030 768844 796040 825502 857160 892168 932428 979041 1031671 1089590 1152986 1223152 1301931
61019 1301931 1391679 1496038 1620730 1773572 1963644 2200364 2493428 2853603 3293281 3826694
61009 3826694 4471610 5252415 6197939 7325695 8615610 9992041 11333203 12507119 13412762
61000 13412762 14005738 14304602 14384261 14357855 14343419 14420512 14596595 14803340 14925474 14845617
60990 14845617 14483517 13816509 12879106 11746699 10511812 9262053 8066206 6969591
60982 6969591 5995749 5151034 4430253 3822304 3314480 2894331 2549519 2267378 2035528
60973 2035528 1843265 1682435 1547059 1432294 1333816 1247970 1172139 1104756 1044966 992262
60963 992262 946173 905998 870751 839371 810987 784926 760530 737121 714100 691006 667565
60952 667565 643850 620428 598133 577513 558513 540683 523597 507045 490952 475221 459686
60941 459686 444218 428991 414624 401842 390882 381286 372397 363961 356205 349463 343867 339305 335530
60928 335530 332329 329726 327943 327011 326446 325541 323987 322096 320362 319019 318040 317357 316929 316664 316445 316232
60912 316232 316073 316009 316033 316094 316119 316064 315965 315899 315841 315619 315059 314127 312891 311457 310002 308752 307773 306871 305877 304943
60892 304943 304360 304092 303792 303319 302900 302593 301943 300541 298721 297207 296145 294986 293434 291916 290813 289713
60876 289713 287953 285618 283399 281588 279891 278326 277660 278547 280604 282833 284743 286634 288794 290806 291828
60861 291828 291420 290033 288723 288393 289190 290634 292309 294258 296628 299150 301271 302727 303769 304787 305981
60846 305981 307421 309216 311447 313998 316538 318610 319712 319520 318226 316627 315634 315582 316001 316122 315542 314419
60830 314419 313170 312149 311593 311608 311972 312058 311299 309778 308174 306992 306006 304566 302262 299157 295553 291801
60814 291801 288258 285174 282597 280513 278973 277885 276807 275276 273338 271476 269939 268478 266853 265295
60800 265295 264197 263531 262870 261967 261099 260755 261076 261663 261985 262019 262368 263619 265681 267982 270215 272515 274860
60783 274860 276817 278136 279212 280532 281945 282932 283438 283990 285046 286680 288811 291253 293511 295082 296106
60768 296106 297263 298839 300404 301681 303185 305425 307905 309618 310442 311370 313247 315848 318458 320854 323327
60753 323327 325956 328281 329679 329866 329037 327687 326298 325075 323911 322602 321004 318982 316346 312993 309109
60738 309109 305150 301527 298276 295046 291460 287563 283864 280917 278937 277801 277193 276580 275330 273297 271245
60723 271245 270210 270375 270914 271036 270685 270029 268909 267335 266125 266278 267799 269754 271432 272872 274184 275101
60707 275101 275548 276003 276723 277008 275915 273606 271408 270438 270540 270696 270121 268774 267037 265191 263216 260933
60691 260933 258279 255437 252747 250494 248758 247364 245959 244279 242395 240609 239073 237708 236611 236260
60677 236260 237015 238576 240241 241652 242885 243876 244244 243930 243584 243948 245063 246413 247616 248566 249034 248731
60661 248731 247936 247620 248625 250907 253779 256687 259465 262088 264629 267428 270914 275059 279307 283175 286699
60646 286699 290117 293362 296109 298189 299645 300528 300983 301593 303221 306263 310165 313881 316750 318816 320442
60631 320442 321820 322931 323818 324730 325921 327322 328533 329255 329662 330167 330817 331112 330569 329266 327645 325908
60615 325908 323897 321558 319200 317143 315308 313405 311505 310144 309669 309558 308576 305772 301320 296377 292077
60600 292077 288728 285942 283379 281148 279515 278414 277458 276343 275056 273684 272299 271144 270689 271185 272221
60585 272221 273049 273390 273640 274228 275105 276066 277244 278934 281108 283418 285583 287435 288722 289256 289305 289485 290163
60568 290163 291236 292480 293801 295050 296017 296763 297698 299102 300840 302683 304567 306368 307756 308693 309882
60553 309882 312319 316426 321833 327942 334492 341792 350619 361802 375684 392114 411126 433231 458632
60540 458632 486319 514459 541606 566997 589726 608269 621120 627468 627020 619644 605641 586252
60528 586252 563486 539422 515699 493407 473074 454753 438347 423954 411831 402070 394515 388938
60516 388938 385146 382855 381620 381106 381494 383523 388024 395387 405484 418093 433236 451131 471947
60503 471947 495706 522180 550596 579406 606576 630310 649586 664175 674287 680290 682758 682838
60491 682838 682445 683881 689156 699831 717443 743627 779478 825061 879828 943169 1014011 1089893
60479 1089893 1166850 1240146 1304835 1355931 1388976 1401023 1391079 1359804 1309347 1243563 1167593
60468 1167593 1086548 1004450 924245 848202 777810 713641 655760 604236 559121 520173 486893
60457 486893 458635 434513 413491 394918 378752 364987 353056 342194 332198 323413 315989 309579
60445 309579 303799 298679 294506 291390 289044 286945 284678 282222 279856 277783 276005 274666 274180 274771 276006
60430 276006 277129 277775 278194 278808 279756 280791 281430 281286 280472 279572 279033 278711 278201 277464 276862 276682 276923 277456
60412 277456 278138 278840 279595 280664 282190 283921 285582 287365 289674 292483 295398 298367 301810 305929 310251
60397 310251 314091 317219 319934 322747 326080 330065 334465 338918 343306 347676 351874 355560 358623 361241
60383 361241 363512 365410 367181 369312 371892 374402 376405 378104 379881 381644 383004 383911 384690 385607 386693
60368 386693 387880 389002 389786 390149 390338 390473 390117 388762 386692 384922 384176 384281 384724 385450 386841 389028
60352 389028 391473 393308 394065 394046 393898 393802 393307 392088 390556 389323 388260 386605 384079 381362 379223 377590
60336 377590 375866 373832 371871 370401 369454 368752 367909 366540 364457 361811 358901 355854 352638 349288 345902
60321 345902 342423 338732 334944 331393 328267 325577 323469 322200 321597 320946 319797 318645 318425 319464 321304
60306 321304 323462 325823 328209 330100 331177 331814 332615 333515 333714 332531 330045 326761 322923 318425 313441
60291 313441 308777 305327 303182 301590 299965 298685 298631 300056 302263 304345 305905 306953 307528 307710 307767 307973
60275 307973 308311 308504 308302 307723 307188 307452 309093 311869 314802 317155 319156 321600 324947 329033 333396 337557
60259 337557 341183 344361 347574 351084 354443 357011 358837 360589 362682 364910 366988 369008 371265 373970
60245 373970 377239 381028 385063 389159 393652 399100 405548 412533 420013 428730 439401 451925 465778
60232 465778 480797 497174 514935 533910 554122 575903 599651 625725 654472 686061 720301
60221 720301 756818 795375 835881 878141 921687 965745 1009295 1051300 1091029 1128003 1161616
60210 1161616 1191113 1216048 1236419 1252109 1262566 1267353 1266805 1261805 1253177 1241647 1228143 1213615
60198 1213615 1198617 1183505 1168962 1155876 1144718 1135566 1128892 1125941 1128099 1136106 1149974 1169402
60186 1169402 1194076 1223800 1258503 1298025 1341812 1388885 1438129 1488485 1538836 1587930 1634556
60175 1634556 1677738 1716659 1750359 1777507 1796549 1806342 1806755 1798560 1782681 1759762 1730553 1696357
60163 1696357 1658751 1619028 1578192 1537253 1497198 1458882 1423319 1391840 1365356 1343617 1325844
60152 1325844 1312159 1303792 1301750 1305842 1315225 1329259 1347360 1368477 1391264 1414584 1437485 1458828
60140 1458828 1477363 1492199 1503017 1509847 1512806 1511956 1507401 1499616 1489643 1478671 1467327 1455696 1444186
60127 1444186 1434079 1427071 1424582 1427570 1436518 1451291 1471514 1497578 1530908 1572670 1622473 1679030
60115 1679030 1741958 1812253 1890912 1977745 2071703 2171763 2276987 2386043 2497138 2608411
60105 2608411 2718097 2824291 2924751 3017010 3098777 3168288 3224306 3265773 3291589 3300912 3293601
60094 3293601 3270210 3231643 3179136 3114551 3040298 2958680 2871411 2779837 2685533 2590607 2497536
60083 2497536 2408689 2325736 2249335 2179496 2116428 2060944 2013923 1975474 1944736 1920527 1902126
60072 1902126 1889525 1883052 1882698 1887697 1896734 1908541 1922303 1937511 1953577 1969734 1985232 1999436
60060 1999436 2011642 2020914 2026238 2026881 2022568 2013325 1999279 1980626 1957641 1930553 1899489 1864733
60048 1864733 1827003 1787229 1746021 1703647 1660662 1618270 1577783 1540016 1505588 1475610 1451428
60037 1451428 1433474 1420853 1412509 1408647 1410656 1419669 1435610 1457812 1486195 1521359 1563443 1611294
60025 1611294 1663066 1717346 1773238 1829389 1883623 1933853 1978918 2018063 2049921 2072652 2085043
60014 2085043 2086998 2078898 2061051 2033899 1998279 1955220 1905866 1851867 1795443 1738667 1682825 1628752
60002 1628752 1577505 1530304 1487981 1450952 1419711 1394909 1376795 1364872 1358410 1357261 1362107 1373936
59990 1373936 1393317 1420141 1453984 1494601 1541949 1595789 1655473 1720072 1788411 1858743 1928689
59979 1928689 1995786 2058035 2113807 2161543 2199988 2228592 2247290 2255890 2253999 2241498 2218684 2185998
59967 2185998 2144159 2094783 2040416 1983597 1926110 1869291 1814678 1763927 1718275 1678497 1645316
59956 1645316 1619455 1601279 1590705 1587534 1591642 1602843 1620814 1645213 1675655 1711528 1751991 1796160
59944 1796160 1843011 1891136 1938963 1985438 2030189 2072755 2111936 2146355 2175584 2200300 2221227
59933 2221227 2238303 2251110 2259866 2265676 2269863 2273347 2276736 2280951 2287644 2298974 2316860 2342276 2375210
59920 2375210 2415315 2462548 2517098 2578826 2646998 2720588 2798496 2879222 2960418 3039122 3112547
59909 3112547 3178555 3235351 3280982 3313386 3330939 3332941 3319684 3292245 3252159 3201065 3140568
59898 3140568 3072440 2998878 2922378 2845291 2769574 2696886 2628582 2565443 2507672 2455509 2409800
59887 2409800 2371690 2341737 2319559 2304428 2295981 2294322 2299627 2311726 2329840 2352616 2378655 2407260
59875 2407260 2438405 2471757 2505867 2538630 2568360 2594082 2614879 2629434 2636376 2634788 2624277 2604936
59863 2604936 2577436 2542915 2502500 2457049 2407457 2354918 2300634 2245429 2189892 2134820 2081220
59852 2081220 2029914 1981286 1935348 1891898 1850795 1812287 1776899 1744693 1714856 1686332 1658733
59841 1658733 1632157 1606306 1580449 1554417 1528997 1505015 1482529 1461319 1441763 1424696 1410578
59830 1410578 1399244 1390310 1383423 1378216 1374446 1372127 1371213 1371314 1372111 1373828 1376702 1380011 1382315 1382862 1382180
59815 1382180 1381049 1379484 1377129 1374177 1371292 1368847 1366743 1364828 1363066 1361366 1359692 1358342 1357780 1358225
59801 1358225 1359638 1362013 1365303 1369149 1373082 1377012 1381133 1385355 1389210 1392358 1394731 1396145 1396297 1395373
59787 1395373 1394163 1393246 1392436 1391461 1390870 1391826 1395186 1401245 1410317 1423101 1440390 1462745 1490605 1524458
59773 1524458 1564839 1612332 1667706 1731946 1806095 1891066 1987437 2095099 2212872 2338251 2467180
59762 2467180 2593782 2710514 2809234 2882813 2926363 2937716 2917476 2868879 2797255 2709108 2611226
59751 2611226 2509954 2410514 2316468 2229831 2151815 2083468 2025601 1978320 1940942 1912482 1892173
59740 1892173 1879403 1873276 1872602 1876603 1885462 1899799 1919660 1944491 1974167 2009372 2050557 2097144
59728 2097144 2148492 2205350 2269506 2341996 2422454 2510376 2606356 2711754 2827719 2954868 3093421
59717 3093421 3243245 3404149 3576432 3760687 3956588 4162144 4374456 4590722 4807959
59708 4807959 5022200 5228897 5424306 5606066 5772521 5922206 6054329 6169396 6269078 6355572
59698 6355572 6431103 6497663 6556907 6610192 6658681 6703234 6744232 6781666 6815419 6845364 6871244
59687 6871244 6892613 6908980 6920055 6926059 6927958 6927253 6925465 6924015 6924680 6929673 6940850 6959120 6985112
59674 6985112 7020196 7066319 7124944 7196746 7282248 7382024 7496089 7623670 7763777 7915303
59664 7915303 8076041 8242022 8408350 8570517 8724495 8865824 8989148 9088711 9159079 9195590
59654 9195590 9194817 9155139 9076945 8962251 8814145 8636650 8434998 8215753 7986224 7753359
59644 7753359 7522978 7299884 7088174 6890795 6708463 6539019 6377766 6218336 6053616
59635 6053616 5876862 5683142 5470541 5240498 4997172 4746171 4493277 4243784 4002507
59626 4002507 3773680 3560331 3363783 3184121 3021036 2873991 2741967 2623725 2518325
59617 2518325 2424832 2341585 2266563 2198627 2137653 2083198 2033848 1988350 1946641 1909079 1875242
59606 1875242 1844241 1815807 1790193 1767173 1745911 1725796 1706729 1688531 1670647 1652573 1634123
59595 1634123 1615191 1595662 1575664 1555612 1535844 1516468 1497531 1479149 1461477 1444740 1429155
59584 1429155 1414642 1400858 1387755 1375799 1365250 1355528 1345857 1336397 1328169 1321952 1317821 1315628 1315277
59571 1315277 1316462 1318728 1321949 1326285 1331622 1337650 1344520 1352822 1362760 1373989 1386503 1401034 1418144
59558 1418144 1437436 1458083 1479746 1502607 1526951 1553202 1582101 1614326 1649944 1688470 1729384
59547 1729384 1772532 1818357 1867894 1922155 1981140 2043554 2107425 2170528 2230195 2283672 2329547
59536 2329547 2368619 2402832 2433501 2460889 2484936 2505486 2521873 2533092 2538720 2539280 2535556 2527916
59524 2527916 2516315 2500544 2480252 2455153 2425582 2392764 2358271 2323173 2287686 2251669 2215481
59513 2215481 2180488 2148678 2121650 2099898 2083041 2070659 2062939 2060737 2065172 2077137 2097136 2125651
59501 2125651 2163469 2211201 2268419 2333674 2405573 2483437 2566614 2653548 2741843 2828888 2911919
59490 2911919 2987856 3053735 3107338 3147059 3171419 3179305 3170633 3146241 3107183 3054710 2990972 2919097
59478 2919097 2842283 2763058 2683442 2605331 2530576 2461065 2398771 2345173 2300434 2263623 2234034
59467 2234034 2211881 2197442 2190049 2188336 2191098 2197389 2206073 2215918 2226046 2235801 2244151 2249701 2251447
59454 2251447 2249135 2242668 2231371 2214099 2190000 2159053 2121918 2079498 2032720 1982560 1929924 1875346
59442 1875346 1819019 1761366 1703474 1646667 1591636 1538284 1486439 1436375 1388565 1343338 1301019
59431 1301019 1262029 1226445 1193712 1163195 1134942 1109536 1087285 1067964 1051353 1037628 1027198
59420 1027198 1020521 1018218 1020811 1027860 1037400 1046646 1053394 1056771 1056923 1054402 1049978 1044723 1039962 1037070
59406 1037070 1037349 1041852 1050912 1063529 1077233 1088803 1095435 1095626 1089361 1077745 1062483 1045485 1028571
59393 1028571 1013238 1000469 990736 984223 981104 981544 985470 992489 1002144 1014234 1028774 1045681 1064677
59380 1064677 1085561 1108541 1134128 1162672 1194006 1227588 1263017 1300345 1339907 1381898 1426221
59369 1426221 1472762 1521732 1573726 1629499 1689672 1754612 1824701 1900826 1984571 2077680 2181239
59358 2181239 2295446 2420130 2555318 2701332 2858532 3026934 3205674 3392630 3584770
59349 3584770 3779043 3972791 4163301 4347463 4522279 4685504 4835485 4970558 5088953
59340 5088953 5189197 5270368 5332187 5375123 5400095 5407531 5396779 5366779 5317080 5247805 5158997
59329 5158997 5050897 4924915 4783544 4629124 4463426 4288748 4108684 3927174 3747128
59320 3747128 3570455 3399025 3234920 3079802 2934496 2799243 2674135 2559375 2455287
59311 2455287 2361996 2278973 2205021 2138722 2078608 2022893 1969706 1918027 1868026 1820091 1773981
59300 1773981 1729500 1687598 1649911 1617196 1588922 1564432 1543794 1527161 1513935 1503064 1493930
59289 1493930 1486647 1481647 1479201 1479152 1480936 1484044 1488591 1495218 1504304 1515535 1528445 1543023 1559468
59276 1559468 1577539 1596666 1616701 1638109 1661243 1685637 1710189 1733876 1756070 1776287 1793873
59265 1793873 1808063 1818261 1824176 1825679 1822553 1814379 1800731 1781525 1757183 1728475 1696237 1661285
59253 1661285 1624444 1586414 1547579 1508140 1468575 1429757 1392365 1356302 1320985 1286211 1252492
59242 1252492 1220522 1190606 1162703 1136780 1112941 1091341 1072082 1055026 1039685 1025526 1012592
59231 1012592 1001581 993130 987164 983166 980858 980317 981549 984307 988361 993697 1000389 1008478 1018015 1029121
59217 1029121 1041991 1056999 1074758 1095844 1120346 1147870 1178129 1211571 1249330 1292543 1341708
59206 1341708 1396773 1457901 1525963 1602008 1686276 1778154 1877176 1983538 2097155 2216540 2339144
59195 2339144 2462641 2585176 2704277 2816260 2917128 3003688 3073470 3124079 3153406 3160574
59185 3160574 3146177 3111398 3057254 2985102 2897635 2798915 2693138 2583492 2472193 2361329
59175 2361329 2253201 2149857 2052606 1962187 1879192 1804105 1737010 1677423 1624405 1576876 1534080
59164 1534080 1495951 1462834 1434636 1410373 1388752 1369050 1351189 1335165 1320798 1307903 1296178
59153 1296178 1284840 1272862 1259793 1246088 1232377 1218693 1204605 1189898 1174793 1159699 1145049
59142 1145049 1131362 1119106 1108412 1099044 1090796 1083835 1078596 1075324 1073783 1073418 1073852 1075201 1077882 1082144
59128 1082144 1087840 1094651 1102391 1111075 1120725 1131219 1142328 1153873 1165774 1177874 1189764 1200981
59116 1200981 1211391 1221226 1230643 1239479 1247606 1255265 1262775 1270012 1276506 1281959 1286277 1289199 1290373 1289932
59102 1289932 1288600 1286951 1284866 1281968 1278356 1274570 1270958 1267471 1264139 1261525 1260481 1261444 1263989 1267127
59088 1267127 1270112 1273063 1276760 1281875 1288391 1295765 1303514 1311639 1320436 1329937 1339575 1348569 1356626 1364023
59074 1364023 1370826 1376352 1379705 1380621 1379350 1375824 1369505 1360138 1348167 1334245 1318689 1301536 1282674
59061 1282674 1261704 1238211 1212598 1186278 1160583 1135680 1111002 1086450 1062598 1039792 1017674
59050 1017674 995768 974076 952863 932262 912406 893733 876732 861301 846606 831739 816563
59039 816563 801873 788674 777305 767234 757715 748581 740432 734168 730275 728328 727110 725444 723173
59026 723173 721284 720899 722215 724499 726893 728952 730558 731764 732810 733929 734865 734822 733210 730453 727762
59011 727762 726038 725093 724047 722317 720085 717888 716012 714389 712917 711659 710708 710021 709471 709099 709214 710131
58995 710131 711650 712924 713169 712673 712808 714816 718767 723907 729753 736392 743918 752138 760907 770294 780332
58980 780332 791012 802591 815405 829155 842757 855079 865481 873558 878997 882048 883604 884351 884153
58967 884153 882660 880014 876420 871570 865266 858320 852003 846674 841756 836980 832765 829217 825711 821899
58953 821899 818383 815839 814022 812251 810471 809254 809042 810013 812440 816504 821766 827476 833547 840689 849321
58938 849321 858795 868072 876912 886062 896394 908195 921239 935169 949678 964610 980157 996880
58926 996880 1015325 1035593 1057357 1080226 1103995 1128715 1154873 1183495 1215640 1251532 1290370
58915 1290370 1331076 1373020 1415825 1458915 1501675 1543905 1585700 1627079 1668221 1709983 1753571
58904 1753571 1799546 1847661 1897857 1950915 2007761 2068502 2132597 2199758 2270284 2344608 2422955
58893 2422955 2505423 2592046 2682681 2777035 2874811 2975651 3078923 3183734 3289089 3393827
58883 3393827 3496405 3594958 3687711 3773245 3850485 3918679 3977375 4026136 4064216 4090866 4106090
58872 4106090 4110714 4105390 4089796 4063310 4026306 3980243 3926418 3865144 3796359 3720488 3638321 3550503
58860 3550503 3457830 3361918 3264885 3168256 3072603 2978326 2886144 2796508 2709056 2623155 2538806
58849 2538806 2456689 2377594 2302191 2231088 2164513 2101976 2042746 1986743 1934572 1886622 1842551
58838 1842551 1801838 1764463 1730769 1700879 1674509 1651201 1630540 1612229 1596110 1582130 1570244
58827 1570244 1560464 1552985 1548048 1545553 1545012 1545992 1548492 1552800 1559140 1567621 1578339 1591267 1606098 1622336
58813 1622336 1639592 1657752 1677021 1697942 1721259 1747506 1776679 1808362 1842216 1878249 1916755
58802 1916755 1958153 2002922 2051523 2104217 2160993 2221742 2286557 2355871 2430238 2509937 2594685
58791 2594685 2683746 2776356 2872061 2970640 3071706 3174494 3278090 3381694 3484366 3584480
58781 3584480 3679792 3768362 3849217 3921737 3984521 4035356 4072384 4094856 4102536 4094900 4071360 4032030
58769 4032030 3977882 3910399 3831434 3743161 3647574 3546015 3439511 3329534 3218001 3106558
58759 3106558 2996143 2887241 2780213 2675490 2573802 2476165 2383268 2294932 2210588 2130164
58749 2130164 2053999 1982039 1913797 1849109 1788167 1730640 1675621 1622891 1573556 1528821 1488506
58738 1488506 1451227 1415694 1381400 1348446 1317233 1288128 1261020 1235359 1210867 1187916 1166927
58727 1166927 1147842 1130569 1115468 1102871 1092505 1083973 1077451 1073195 1070636 1068627 1066418 1063692 1059747
58714 1059747 1053396 1043717 1030376 1013275 992579 969102 943972 917813 890809 863540 837037 811875
58702 811875 787954 765331 744493 725502 707752 691084 676461 664846 655942 648749 642961 639049
58690 639049 637176 636780 637238 638320 639774 640845 640422 637552 631955 624231 615423 606104 596022 584964
58676 584964 573769 564021 556665 551324 547058 543508 541162 540691 542243 545298 549093 553104 557053 560494
58662 560494 562674 563004 561562 558940 555634 551688 546787 540539 532776 523820 514418 505238 496530 488418
58648 488418 481304 475655 471441 468154 465462 463617 463173 464433 467181 470817 474782 479005 483843 489435
58634 489435 495265 500593 505142 509003 512041 513967 515049 516152 517761 519320 519923 519445 518761 519069 521191
58619 521191 525181 530281 535433 540189 545010 550522 556729 563369 570680 579214 588997 599514 610624 622851
58605 622851 636565 651406 666897 683125 700397 718608 737548 757573 779352 802958 827764
58594 827764 853277 879560 906749 934656 963141 992408 1022509 1052764 1082003 1109324 1134348
58583 1134348 1156903 1176745 1193586 1207100 1216878 1222521 1223797 1220673 1213299 1202111 1187875 1171455
58571 1171455 1153520 1134514 1114792 1094630 1074203 1053690 1033329 1013256 993441 973885 954731
58560 954731 936059 917842 900291 883943 869035 855088 841522 828426 816066 803805 790375
58549 790375 775391 759854 744843 730346 715901 701686 688292 675741 663561 651695 640646
58538 640646 630689 621551 612987 605114 597954 591115 584250 577553 571544 566578 562768 560122 558446 557210
58524 557210 555827 554123 552413 551108 550297 549637 548539 546534 543576 540000 536089 531746 526698 520990 515126
58509 515126 509686 504872 500519 496442 492650 489260 486384 484200 482935 482625 483002 483792 485063 487018 489527
58494 489527 492206 494980 498161 501823 505466 508607 511346 513997 516425 518248 519541 520856 522522 524335
58480 524335 525922 526974 527153 526333 525104 524549 525208 526634 528158 529689 531366 532865 533596 533455 532904 532347
58464 532347 531839 531397 531182 531225 531270 531021 530411 529608 528895 528488 528266 527747 526601 525194 524314 524337 524919 525565 526152
58445 526152 526766 527424 528215 529442 531286 533482 535669 537932 540643 543801 546941 549764 552501 555529 558933
58430 558933 562688 566977 571922 577076 581572 584965 587737 590794 594511 598419 601826 604656 607614 611494
58416 611494 616389 621607 626378 630570 634697 639319 644589 650280 656098 661868 667562 673251 678973 684530
58402 684530 689474 693382 696243 698554 701020 704137 707988 712320 716691 720574 723531 725548 727202 729212
58388 729212 731713 734177 736266 738486 741656 745879 750521 755156 759972 765054 769857 773854 777415 781562
58374 781562 786973 793493 800413 806852 812148 816425 820718 826047 832388 838958 845442 852225 859355 866047
58360 866047 871757 877253 883986 892546 902239 912086 921727 931268 940682 949704 958226 966605 975457 985212
58346 985212 995939 1007624 1020386 1034180 1048352 1061925 1074438 1086285 1098078 1109939 1121563
58335 1121563 1132729 1143521 1154252 1165364 1177192 1189587 1201957 1213873 1225512 1237336 1249581
58324 1249581 1262335 1275812 1290197 1305292 1320710 1336373 1352535 1369370 1386865 1405111 1424348
58313 1424348 1444592 1465447 1486438 1507448 1528764 1550755 1573499 1596731 1620173 1643881 1668088
58302 1668088 1692713 1717370 1741900 1766564 1791498 1816386 1840935 1865360 1890040 1915099 1940750
58291 1940750 1967666 1996366 2026415 2056895 2087601 2119211 2152348 2187018 2222957 2259888 2297386
58280 2297386 2335155 2373649 2413929 2456700 2501860 2549010 2597912 2648366 2700312 2754303 2811325
58269 2811325 2871831 2935367 3001354 3069684 3140292 3212694 3286447 3361635 3438510 3517047 3597374
58258 3597374 3680257 3766583 3856473 3949400 4045153 4144321 4247814 4356199 4469549 4587766
58248 4587766 4710994 4839706 4974395 5115370 5263044 5418225 5581738 5753945 5935077
58239 5935077 6125908 6327487 6540278 6764293 7000168 7249371 7513172 7792197 8087274
58230 8087274 8400015 8732227 9085532 9461978 9864376 10295571 10757973 11254142 11787200
58221 11787200 12360434 12977449 13643217 14364146 15146664 15996658 16920765 17927117 19024239
58212 19024239 20220734 21527567 22960321 24539019 26287535 28234835 30416444 32874668
58204 32874668 35659983 38834631 42474470 46667249 51512541 57126564 63645938 71226011
58196 71226011 80040137 90281311 102145388 115774576 131180144 148198337 166508942
58189 166508942 185682709 205197715 224406566 242495754 258495486 271368446 280162855
58182 280162855 284183721 283125158 277121258 266707376 252715310 236137134 217988646
58175 217988646 199197266 180530920 162569979 145711121 130189786 116112418 103491436
58168 103491436 92275725 82373485 73669717 66040388 59362121 53517109 48396116 43901419
58160 43901419 39948115 36462703 33381165 30648562 28218744 26052580 24116024 22379724
58152 22379724 20819151 19413496 18144022 16993510 15946646 14990184 14112821 13305299
58144 13305299 12560332 11871930 11234722 10643895 10095278 9585168 9110263 8667835 8255517
58135 8255517 7870760 7510863 7173720 6858055 6562714 6286115 6026518 5782359 5552194
58126 5552194 5334812 5129599 4936181 4753539 4580076 4414817 4257892 4109486 3969021
58117 3969021 3835776 3709599 3590361 3477221 3369094 3265458 3166128 3070699 2978844 2890830
58107 2890830 2806978 2726787 2649252 2574037 2501751 2433038 2367827 2305466 2245224 2186712 2130098
58096 2130098 2075921 2024443 1975218 1927436 1880576 1834595 1789817 1746849 1706278 1668103 1631648
58085 1631648 1596271 1561879 1528492 1495751 1463295 1431319 1400245 1369992 1340055 1310227 1280858
58074 1280858 1252484 1225473 1199883 1175396 1151598 1128606 1107065 1087146 1067922 1048328 1028529
58063 1028529 1009707 992566 976617 960895 944829 928389 911958 896257 881944 868966 856460
58052 856460 843425 829445 814857 800465 787015 774684 763050 751626 740213 728648 716683
58041 716683 704558 693285 683706 675490 667664 659983 653001 646826 640653 633788 626526 619635 613437 607633
58027 607633 601652 594952 587407 579623 572467 566093 559871 553430 547227 541761 536858 532200 528002 524507
58013 524507 521229 517504 513651 510724 508981 507306 504458 500386 495966 491887 488278 485221 483007 481740
57999 481740 481000 480137 478838 477335 476123 475586 475757 476292 476680 476646 476437 476635 477658 479500 481996 485133 489024
57982 489024 493686 499030 504948 511276 517751 524294 531278 539297 548547 558598 568726 578273 586580 592878
57968 592878 596530 597382 595688 591694 585421 576918 566564 554994 542683 529743 516178 502262 488545
57955 488545 475499 463265 451753 440898 430814 421828 414303 408288 403327 398873 394904 391893 390110
57942 390110 389291 389098 389494 390249 390421 388934 385735 381952 378754 376229 373465 369492 364108 357942 351839
57927 351839 346117 340491 334761 329387 325164 322403 320785 320007 320256 321845 324607 327834 330868 333654 336640
57912 336640 340033 343178 344925 344734 343248 341565 340096 338328 335514 331347 326126 320571 315453 311055
57898 311055 307026 302943 298897 295270 292105 289057 285897 282720 279669 276790 274092 271454 268544 265193
57884 265193 261713 258423 255020 251001 246648 242853 239880 237015 233781 230831 229124 228673 228637 228346 227807
57869 227807 227408 227574 228572 230311 232425 234753 237504 240769 244212 247525 250781 253922 256268 257113 256619
57854 256619 255551 254233 252282 249335 245512 241146 236586 232372 229099 226860 225147 223520 222126 221391
57840 221391 221448 222039 222766 223307 223613 224035 225028 226577 228162 229472 230891 232983 235674 238286 240339 242016
57824 242016 243768 245640 247061 247189 245466 242013 237491 232455 226828 220192 212618 205024 198585 193880
57810 193880 190670 188289 186121 183902 181912 180854 181300 183186 185966 189233 193007 197459 202644 208608
57796 208608 215389 222775 230240 237346 244048 250487 256663 262407 267391 270971 272360 271376 268897 266178
57782 266178 263739 261103 257515 252633 246715 240509 234849 229947 225071 219233 212129 204159 195776 187382
57768 187382 179771 173867 169773 166598 163497 160470 157912 155858 153997 152059 149861 147361 145022 143767
57754 143767 144117 145574 147172 148452 149558 150686 151872 153202 154787 156536 158238 159803 161207 162368
57740 162368 163373 164643 166530 168857 171220 173581 176164 178862 181254 183250 185300 187806 190671 193566
57726 193566 196350 199017 201492 203708 205802 208030 210485 212992 215259 217089 218421 219190 219250 218559 217486
57711 217486 216717 216742 217527 218748 220176 221691 223193 224737 226677 229400 232971 237151 241595 245861 249476
57696 249476 252287 254648 256963 259192 261152 263118 265673 268985 272767 277021 282289 288929 296588 304785
57682 304785 313758 324354 337210 352467 370268 391155 415777 444494 477607 515960 561071 614469
57670 614469 676896 748083 826857 910761 995350 1074297 1140971 1190521 1220959 1232969 1229256 1213978
57658 1213978 1192025 1167929 1144823 1124028 1105491 1088693 1073345 1059254 1045673 1031158 1014414
57647 1014414 995180 974037 951392 927081 900995 873730 846289 819297 792821 766974 742353
57636 742353 719602 698630 678623 659035 640337 623474 608710 595419 583020 571637 561606
57625 561606 552793 544785 537512 531282 526367 522936 521227 521330 522840 525128 528060 532115 537754 544910
57611 544910 553236 562664 573610 586668 602091 619507 638248 657992 678894 700996 723849 746938
57599 746938 770144 793398 816179 837889 858451 877862 895178 908637 916997 920292 919195 914208
57587 914208 905662 893933 879187 861184 839675 814873 787416 758212 728365 698832 669867 641138
57575 641138 612679 585366 560062 536646 514322 492714 472219 453340 436099 420156 405214
57564 405214 391225 378301 366458 355412 344781 334584 325315 317340 310419 304052 298129 292951 288747
57551 288747 285463 282902 280740 278485 275829 273113 271090 270059 269529 268932 268449 268818 270403 272728 274926
57536 274926 276472 277410 278130 279157 281036 284108 288252 292995 297993 303273 308877 314536 320045 325876 332977
57521 332977 341744 351457 361006 370126 379709 390916 404140 418848 434283 450222 467085 485425
57509 485425 505350 526358 547612 568433 588660 608581 628314 647261 664376 679090 691664
57498 691664 702463 711161 717026 719688 719153 715264 707756 696878 683359 667602 649502 629329 608300
57485 608300 587737 567938 548343 528685 509504 491485 474675 458571 442888 428062 414906
57474 414906 403746 394018 384901 376253 368644 362443 357278 352618 348625 346096 345614 346979 349427 352260
57460 352260 355317 358957 363631 369475 376383 384420 393889 404906 417140 430130 443730 458122 473538
57447 473538 490066 507604 525861 544455 563076 581497 599466 616697 632846 647199 658516
57436 658516 665638 668416 667727 664438 658706 650349 639347 625648 608964 589344 567753 545583 523585
57423 523585 501621 479384 457019 434992 413649 393029 373106 354209 337070 322125 308745
57412 308745 295657 282420 270029 259650 251124 243303 235551 228194 221511 215107 208541 202051 196236
57399 196236 191334 187142 183441 180164 177198 174267 171088 167560 163807 160052 156433 152958 149647 146636
57385 146636 144060 141920 140190 138992 138457 138377 138116 136957 134636 131670 129122 127837 127727 127965 127925 127751
57369 127751 127845 128125 128111 127588 126832 126186 125725 125359 125102 125149 125793 127121 128651 129461 128996 127725 126753 126805 127815
57350 127815 129392 131286 133266 134911 135811 135926 135604 135241 134968 134631 134073 133410 133015 133195 133974 135209 136763
57333 136763 138497 140220 141756 142945 143529 143217 142067 140655 139771 139955 141238 143089 144613 145184 145091 145237
57317 145237 146113 147419 148773 150245 151839 153100 153820 154688 156515 159101 161601 163876 166655 170324 174249
57302 174249 177504 179767 181405 183217 186203 190916 196732 202161 206224 209252 212232 215775 219885 224283
57288 224283 228655 232868 237245 242313 248057 253637 258127 261341 263761 265859 267704 269104 269917 270254 270366
57273 270366 270238 269348 267115 263547 259156 254258 248749 242669 236542 230943 225977 221404 217013 212711 208474
57258 208474 204354 200365 196301 191983 187792 184576 182835 182225 182046 181933 181896 181979 182199 182586 183064 183387 183420
57241 183420 183368 183592 184337 185662 187467 189455 191257 192698 193809 194541 194765 194643 194754 195687 197607 200244
57225 200244 203116 205780 208115 210369 212656 214555 215567 215969 216732 218516 221167 224191 227236 230091 232794
57210 232794 235896 239953 244586 248639 251593 254211 257500 261693 266571 272062 277819 282860 286461 289160
57196 289160 292271 296580 301912 307560 312618 316328 318818 321281 324844 329520 334709 340275 346397 352738
57182 352738 358693 364319 370206 376480 382705 388791 395266 402580 410761 419764 429538 439701 449797 459873
57168 459873 470237 480753 491026 501247 511994 523268 534582 546141 558920 573345 588839
57157 588839 605066 622571 641552 660931 679516 697486 715839 734876 754083 773205 792464
57146 792464 811851 831058 850247 870199 891520 914155 937732 961902 986249 1010367 1034318
57135 1034318 1058747 1084359 1111455 1140055 1170222 1202068 1235582 1270681 1307403 1345962 1386566
57124 1386566 1429243 1474007 1521248 1571812 1626497 1685495 1748561 1815704 1887368 1963950 2045591
57113 2045591 2132773 2226837 2329553 2442283 2565831 2701000 2849127 3012197 3192736 3393690
57103 3393690 3618387 3870773 4155764 4479193 4847361 5266998 5745908 6293298 6918964
57094 6918964 7632027 8440415 9350859 10368274 11494432 12726926 14058900 15478916 16970580
57085 16970580 18512354 20078015 21637497 23157781 24603950 25940678 27133924 28152376
57077 28152376 28968481 29559242 29907107 30000923 29836664 29417697 28754963 27867370 26781802
57068 26781802 25531663 24154002 22686618 21166243 19627360 18100923 16613249 15185811
57060 15185811 13835560 12574883 11411230 10347337 9382264 8512538 7732879 7036772 6417134
57051 6417134 5866798 5378672 4945792 4561579 4220217 3916890 3647645 3408888 3197029
57042 3197029 3008771 2841821 2695034 2567768 2459402 2369651 2298611 2245365 2205999 2173317
57032 2173317 2138882 2095672 2039516 1969173 1885842 1792563 1693570 1593613 1497121 1407151 1324794
57021 1324794 1249762 1181644 1120328 1065377 1015724 970514 929879 894296 863266 835226 808859
57010 808859 784034 761254 740498 720974 701909 683241 665419 648760 633207 618631 605095
56999 605095 592708 581398 570965 561191 551743 542166 532294 522595 513775 506010 498921 492333 486651
56986 486651 482265 478927 475954 472769 469011 464407 458964 453053 446933 440265 432434 423242 413006 402164
56972 402164 391261 381183 372839 366400 361235 356747 352916 349929 347777 346539 346719 348863 352953 358397
56958 358397 364509 370752 376664 381868 386140 389248 390765 390236 387579 383168 377522 371042 364047 356944
56944 356944 350267 344473 339693 335785 332774 331078 331013 332206 334000 336560 340941 347704 355961 364309 372237
56929 372237 379913 386861 391756 393587 392236 387799 380207 369931 358325 346623 334962 322940 310682
56916 310682 298776 287477 276754 266994 258874 252380 246639 241012 235866 231935 229276 227274 225426
56903 225426 223765 222578 222009 221930 222046 222199 222699 224176 226835 229995 232778 235269 238584 243555 249724 255963
56887 255963 261850 267912 274518 281073 286520 290239 292095 291972 289817 286068 281500 276565 271245 265639
56873 265639 260299 255805 252407 250292 249814 251131 253880 257678 262809 270042 279803 291778 305213 319307
56859 319307 333375 346952 359745 371250 380525 386655 389359 388852 385257 378693 369984 360728 352350
56846 352350 345427 340091 336647 335491 336767 340589 347397 357683 371431 388176 407543 429349 453096
56833 453096 477696 501702 523592 541759 554567 560776 559992 552768 540356 524296 505935 486136
56821 486136 465456 444659 424918 407447 393057 382130 374859 371269 371082 373874 379502 388207 400125
56808 400125 414783 431154 448046 464169 477922 487535 491728 490250 483746 473209 459601 443740
56796 443740 426317 408023 389805 372830 357961 345293 334401 325085 317660 312527 309626 308476
56784 308476 308702 310448 314209 320103 327231 333960 339013 342150 343533 342673 338507 330609 319844 307591
56770 307591 294607 280923 266599 252220 238674 226649 216358 207600 200071 193551 187714 181927
56758 181927 175608 168950 162953 158498 155544 153395 151461 149460 147191 144567 141879 139634 138040 136877
56744 136877 135848 134870 133998 133302 132784 132279 131575 130821 130609 131219 131949 131769 130671 129779 129912 130620 131021 131037
56726 131037 131210 131656 131954 131989 132161 132621 132920 132723 132334 132136 131930 131361 130736 130790 131699 132866 133722 134237 134527
56707 134527 134493 134157 133869 133732 133170 131605 129418 127665 126909 126807 126906 127199 127709 128091 128069 127931 128176 128855 129671
56688 129671 130484 131374 132340 133412 134935 137219 139877 141987 143110 143741 144570 145698 146851 147974 149166
56673 149166 150216 150713 150641 150511 150859 151838 153303 154978 156456 157399 157983 158907 160693 163053 165164 166467
56657 166467 167006 167114 167064 166970 166757 166208 165308 164582 164696 165596 166317 165941 164521 162880 161685 161010 160560 159967
56639 159967 158966 157624 156342 155333 154197 152421 150195 148274 147021 146067 144972 143716 142340 140665
56625 140665 138706 136960 135932 135689 136180 137499 139377 140843 141040 140188 139172 138356 137458 136447 135847 135951
56609 135951 136408 136810 137183 137634 137968 137912 137388 136347 134744 132905 131495 130748 130137 129211 128392 128370 128941 129142
56591 129142 128576 128042 128580 130274 132233 133581 134216 134727 135739 137356 139140 140602 141615 142361 143018 143654
56575 143654 144347 145197 146203 147302 148473 149687 150812 151766 152756 154140 156024 158158 160246 162106 163538
56560 163538 164410 165033 166139 168130 170530 172511 173875 175163 176801 178607 180288 182058 184359 187105 189573
56545 189573 191051 191319 190499 188786 186516 184267 182497 181044 179193 176370 172698 168824 165269 161998 158568
56530 158568 154674 150539 146801 144028 142344 141521 141245 141176 140838 139731 137736 135302 133137 131722 131133 131194
56514 131194 131627 132077 132217 131906 131207 130268 129233 128294 127683 127484 127476 127273 126688 125949 125555 125879 126848 127979 128793
56495 128793 129287 129992 131475 133729 136072 137620 137836 136720 134780 132919 132073 132545 133663 134446 134693 135114
56479 135114 136212 137413 137731 137044 136219 135950 136038 135998 135875 136088 136790 137859 139300 141167 143106 144530 145356
56462 145356 146207 147729 150048 153007 156441 159916 162638 164161 164921 165546 165868 165218 163683 162289 161761 161735
56446 161735 161538 161114 160700 160108 159064 157991 157624 157912 157926 157038 155602 154337 153553 153213 153233 153373 153181 152465
56428 152465 151557 150827 150188 149394 148556 147983 147661 147269 146607 145749 144841 144054 143621 143617 143788 143854 143904 144185 144692 145315
56408 145315 146250 147790 149701 151259 151997 152086 151960 151948 152338 153261 154287 154553 153655 152152 150962 150480 150560 151039
56390 151039 151873 152910 153945 154982 156197 157627 159093 160404 161470 162338 163292 164778 166936 169282 171199
56375 171199 172737 174550 176897 179080 180181 180184 179944 180053 180114 179384 177913 176654 176453 177232 178277 179050 179448
56358 179448 179539 179410 179349 179780 180909 182594 184592 186689 188562 189858 190631 191410 192600 193974 195041 195798
56342 195798 196793 198427 200478 202386 203909 205302 206858 208380 209376 209846 210581 212294 214587 216341 217195
56327 217195 218014 219609 221587 223033 223882 224877 226416 228213 230147 232609 235687 238643 240689 241908 242951
56312 242951 244109 245191 246231 247801 250461 254173 258425 262745 266893 270644 273715 276109 278356 281082
56298 281082 284291 287439 290398 293949 298884 304834 310528 315147 318897 322249 325353 328470 332260 336957
56284 336957 341670 345209 347549 349886 353297 357899 363486 370270 378514 387709 396724 404885 412644 421041
56270 421041 430698 441550 453480 466886 482425 500426 520918 544149 570657 600664 633862 670095
56258 670095 709942 754198 803059 856301 914153 977284 1045832 1118944 1195483 1274656 1355552
56247 1355552 1436487 1515321 1590338 1660406 1724336 1780489 1827143 1863067 1887748 1901243 1903917
56236 1903917 1896219 1878700 1852335 1818717 1779689 1736646 1690191 1640375 1587205 1531041 1472802
56225 1472802 1413777 1355091 1297262 1240403 1184774 1130904 1079134 1029324 981232 935061 891392
56214 891392 850570 812358 776312 742432 711261 683290 658368 635906 615580 597589 582110
56203 582110 568795 557065 546708 537860 530518 524409 519293 515000 511116 507082 502833 499002 496251
56190 496251 494638 493874 493880 494669 495862 496789 497097 496973 496800 496903 497637 499352 502111 505634 509624 513936 518354
56173 518354 522503 526215 529851 534010 538976 544592 550648 557227 564616 572994 582244 592036 601989 611780
56159 611780 621300 630895 641474 654118 669463 687556 708407 732489 760476 792723 829448 871450
56147 871450 920226 977115 1042520 1116083 1197140 1284445 1375351 1465805 1551616 1629971 1699819
56136 1699819 1761205 1814708 1861581 1903763 1942883 1978927 2010146 2034517 2051124 2060155 2062196 2058028
56124 2058028 2048683 2034787 2015595 1989161 1953684 1908394 1853167 1788116 1714163 1633824 1550925
56113 1550925 1469447 1392556 1322213 1259217 1203677 1155707 1115563 1082993 1056853 1035844 1019424
56102 1019424 1007546 999670 994624 991483 990047 990274 991661 993532 995702 998611 1002855 1008676 1015744 1023356
56088 1023356 1031042 1039046 1048063 1058491 1070139 1082681 1096049 1110226 1124954 1139938 1155159 1170757
56076 1170757 1186729 1202933 1219289 1235774 1252322 1268921 1285667 1302535 1319201 1335357 1351112
56065 1351112 1366849 1382769 1398928 1415605 1433230 1451895 1471318 1491478 1512819 1535560 1559099
56054 1559099 1582547 1605728 1629286 1653948 1680057 1707751 1737068 1767690 1798970 1830527 1862548
56043 1862548 1895345 1928861 1962924 1997743 2033750 2071068 2109526 2149172 2190344 2233165 2277339
56032 2277339 2322679 2369559 2418595 2470102 2524067 2580496 2639411 2700604 2763735 2828809 2896304
56021 2896304 2966647 3039717 3115021 3192332 3272000 3354688 3440997 3531423 3626461 3726458 3831404
56010 3831404 3941053 4055294 4174212 4297823 4426152 4559754 4699816 4847315 5002303
56001 5002303 5164429 5333998 5512003 5699145 5895466 6101096 6316833 6543697 6782447
55992 6782447 7033973 7299823 7581860 7881633 8200460 8539905 8901677 9287317 9698602
55983 9698602 10138295 10610032 11117397 11663529 12251682 12885805 13570572 14311482 15115333
55974 15115333 15990424 16946110 17992442 19140512 20403138 21795366 23335029 25043601
55966 25043601 26946886 29075368 31464987 34159025 37210393 40683085 44652876 49208486
55958 49208486 54453528 60507619 67504677 75588139 84904407 95595382 107788622 121581550
55950 121581550 137015014 154031135 172413057 191714452 211204424 229867037 246486899
55943 246486899 259818901 268799129 272732103 271399516 265067845 254406469 240349769
55936 240349769 223942847 206204591 188029023 170131440 153034008 137079100 122457989
55929 122457989 109245252 97432328 86956017 77720014 69610194 62505784 56287745
55922 56287745 50844315 46073637 41884555 38196811 34941018 32058051 29497732 27217174
55914 27217174 25179359 23352388 21709288 20227568 18888036 17673590 16569077 15561870
55906 15561870 14641717 13799578 13026835 12315724 11659937 11054298 10494087 9975038 9493588
55897 9493588 9046525 8630586 8242932 7881832 7546160 7234067 6942605 6668651 6409679
55888 6409679 6163574 5928450 5703159 5487603 5282116 5086726 4901271 4725825 4560443
55879 4560443 4404554 4256986 4116584 3982494 3853913 3729979 3610175 3494702 3384314
55870 3384314 3279721 3181001 3087474 2998184 2912576 2830624 2752281 2677108 2604649 2534895 2467996
55859 2467996 2403654 2341283 2280741 2222459 2166757 2113483 2062459 2013815 1967511 1922890 1879119
55848 1879119 1835953 1793699 1752612 1712650 1673724 1635819 1598911 1563031 1528348 1494917 1462488
55837 1462488 1430953 1400795 1372641 1346397 1321393 1297325 1274388 1252390 1230535 1208568 1187456
55826 1187456 1168264 1150805 1134048 1117505 1101442 1085949 1070657 1055457 1040759 1026795 1013292
55815 1013292 1000059 987409 975629 964468 953505 942753 932598 923276 914574 905866 896377 885648
55803 885648 873925 861847 849752 837611 825620 814264 803550 792774 781541 770600 761142 753602
55791 753602 747604 742746 738701 734710 729714 723136 715078 705749 695258 684053 672977 662629 653161
55778 653161 644964 639037 636155 635790 636219 635567 632578 626734 618153 607513 595705 583393 570878 558430
55764 558430 546617 536256 527969 521678 516583 511847 507353 503571 500561 497476 493324 487990 482117 476109
55750 476109 469676 462376 454120 445017 435209 425102 415398 406494 398062 389577 381024 372705 364656 356862
55736 356862 349902 344527 340434 336261 331260 326265 322375 319276 315757 311524 307352 303463 298957 293298
55722 293298 287418 282582 278745 274837 270358 265912 262242 259410 257004 254674 252315 250060 248183 246798
55708 246798 245632 244316 242773 241052 238951 236244 233289 230910 229548 228831 228125 227147 225899 224266 222053
55693 222053 219302 216409 213913 212167 211074 210141 208973 207679 206644 205955 205371 204851 204723 205182 205940 206634
55677 206634 207325 208356 209850 211589 213278 214662 215501 215703 215513 215429 215809 216626 217594 218533 219595 221070 222946
55660 222946 224741 225883 226133 225472 223802 221160 218152 215613 213652 211526 208740 205847 203732 202534 201804
55645 201804 201494 202045 203516 205262 206675 207781 208906 210202 211813 214099 217263 220971 224683 228166 231341
55630 231341 233831 235137 235247 234671 233789 232581 231024 229325 227534 225345 222634 219894 217673 215791 213574
55615 213574 210856 208289 206533 205536 204711 203468 201396 198296 194363 190093 185704 180810 174959 168393 161979
55600 161979 156426 151802 147762 143982 140336 136865 133598 130380 126995 123582 120684 118557 116655 114232
55586 114232 111422 109233 108370 108470 108667 108541 108270 108187 108585 109872 112477 116466 121318 126223 130622 134465
55570 134465 137876 140642 142281 142670 142287 141491 139843 136645 131979 126665 121216 115544 109836 104928 101355
55555 101355 98598 95904 93404 91766 90931 89967 88228 86072 84291 83322 83206 83849 84963 85944 86234 85811
55539 85811 85209 85003 85365 86059 86766 87314 87639 87671 87377 86760 85676 83798 81107 78346 76545 75972 75945 75804
55521 75804 75601 75547 75298 74308 72617 70754 69034 67456 66141 65358 65097 65124 65408 66102 67137 68323 69757
55504 69757 71568 73245 73937 73693 73780 75368 78298 81509 84273 86599 88793 91140 93845 96827 99600
55489 99600 101723 103303 104752 106128 107018 107023 106084 104349 102020 99301 96263 92709 88438 83664 78970 74760
55473 74760 70928 67135 63263 59506 56129 53215 50593 48010 45447 43254 41825 41191 41088 41432 42431
55458 42431 44018 45386 45516 44201 42283 40736 39786 39074 38381 37747 36999 35696 33739 31656 30025 28940
55442 28940 28314 28356 29366 31219 33452 35707 37645 38653 38221 36708 35180 34352 34074 33968 34034 34367 34722
55425 34722 34765 34459 33921 33218 32600 32621 33576 35014 36122 36475 36151 35357 34310 33326 32593 31925 31023 29900
55407 29900 28795 27820 27027 26632 26752 27007 26843 26212 25564 25162 24818 24352 23945 23878 24231 24892 25579 25861 25489
55388 25489 24749 24186 23952 23781 23629 23842 24514 25123 25110 24532 23891 23537 23497 23667 23934 24257 24781 25677 26698
55369 26698 27179 26749 25854 25257 25153 25101 24714 24091 23472 22767 21652 20095 18627 17891 17958 18256 18334 18444 19021
55350 19021 19775 19830 18858 17544 16711 16420 16317 16457 17230 18652 20200 21374 22024 22124 21616 20632 19585 18820
55332 18820 18233 17386 16012 14409 13241 12961 13522 14741 16669 19192 21472 22422 21887 20792 19881 18911
55316 18911 17471 15965 15071 14680 14184 13648 13850 15122 16865 18344 19396 20119 20426 20233 19666 18882 17966
55299 17966 17186 16942 17199 17303 16675 15532 14655 14517 14854 15019 14702 14260 14314 14946 15526 15520 15188 15166 15556 15957
55279 15957 16189 16393 16471 16116 15502 15244 15506 15796 15915 16400 17580 18864 19473 19364 18872 18004 16797 15990
55261 15990 16443 17928 19167 19177 18106 16795 16021 16184 17229 18640 19691 19826 18844 17020 15218 14487
55245 14487 15129 16396 17440 18227 19027 19442 18809 17413 16443 16580 17313 17809 17779 17287 16369 15281 14615 14701
55227 14701 15188 15498 15465 15277 15200 15662 17196 19786 22443 23911 23794 22708 21436 20252 19067 17898 17010
55210 17010 16647 16722 16796 16476 15848 15402 15470 15824 15939 15575 15047 14957 15671 16949 18077 18456 18090 17463 17030 16938
55190 16938 17116 17388 17582 17715 18015 18528 18870 18732 18514 18922 19910 20587 20387 19805 19606 19731 19465 18449 17051
55171 17051 15808 14976 14698 15229 16705 18738 20435 20999 20411 19426 18750 18293 17437 15959 14364 13277 12883
55154 12883 13011 13346 13415 12772 11592 10819 11346 13145 15358 17087 17932 17977 17573 17047 16459 15787 15410 16008
55136 16008 17687 19505 20316 19968 19340 19262 19772 20327 20412 19875 18941 17961 17021 15857 14360 13016 12560 13197
55118 13197 14352 15228 15435 15111 14663 14494 14828 15728 17113 18681 19884 20314 20201 20159 20340 20206 19420 18586
55100 18586 18671 19929 21855 23984 26209 28357 30017 31012 31695 32541 33592 34395 34433 33643 32606 32122 32481
55083 32481 33189 33499 33036 31810 29973 27872 26086 25008 24488 24167 23985 24045 24155 23949 23344 22580 21909 21581
55065 21581 21838 22458 22549 21429 19602 18273 17915 17958 17816 17512 17146 16556 15836 15623 16366 17742 19107 20156
55047 20156 20817 20902 20323 19421 18679 18256 18041 17986 18138 18465 18889 19380 19912 20456 21043 21658 22088 22240 22583 23787
55027 23787 25759 27441 27842 26942 25433 23996 23072 22856 23093 23199 22949 22805 23263 24180 25057 25638 25882 25710
55009 25710 25266 25150 25883 27274 28706 29842 30649 30993 30781 30368 30306 30713 31329 32090 33136 34303 35158 35620
54991 35620 36049 36615 37030 37115 37184 37601 38239 38634 38504 37939 37252 36770 36610 36538 36138 35266 34238 33526 33347 33584
54971 33584 34002 34467 35010 35627 36059 35910 35093 34008 33129 32574 32233 32123 32349 32858 33438 33900 34079 33861 33406
54952 33406 33115 33040 32611 31379 29829 28987 29362 30761 32942 35756 38671 40950 42525 44147 46479 49611
54936 49611 53615 58837 65218 71967 78449 84839 91303 97062 101039 103138 104071 104018 102304 98556 93486
54921 93486 88253 83481 79126 74885 70493 65936 61609 58067 55375 52973 50348 47631 45323 43669
54907 43669 42532 41726 41154 40695 40214 39693 39219 38857 38705 39023 40167 42344 45505 49405 53660 57898 62061
54890 62061 66514 71615 77165 82465 86913 90335 92720 93971 94059 93095 91017 87438 82200 75945 69800
54875 69800 64450 59754 55245 50664 46038 41562 37630 34675 32774 31562 30682 30117 29954 30053 30207 30374
54859 30374 30526 30451 30063 29737 29963 30661 31226 31287 31062 30896 30780 30555 30298 30255 30519 31001 31577 32111 32377 32233
54839 32233 31791 31339 31028 30750 30313 29632 28790 27934 27123 26286 25403 24699 24472 24684 24898 24786 24522 24486 24695
54820 24695 24851 24878 25068 25546 25947 25846 25312 24775 24482 24440 24789 25795 27346 28785 29497 29461 28974 28118 26845
54801 26845 25486 24724 24936 25859 26986 28037 28904 29451 29622 29628 29797 30308 31236 32732 34917 37628 40475
54784 40475 43232 46077 49371 53278 57677 62459 67812 74038 80993 87843 93535 97447 99426 99454 97656
54769 97656 94575 90938 87034 82749 78368 74788 72577 71199 69608 67328 64551 61530 58449 55724
54755 55724 53756 52395 51143 49970 49462 50099 51783 54045 56237 57515 57321 56174 55537 56601 59486
54740 59486 63721 68968 74983 81369 87852 94540 101473 108209 114253 119532 123872 126247 125343 121048 114819
54725 114819 108287 101895 95177 87935 80631 73735 67260 61141 55732 51577 48757 46756 45007 43296
54711 43296 41551 39554 37160 34695 32769 31700 31376 31564 32063 32567 32770 32726 32753 32883 32744 32177 31579 31349
54693 31349 31329 31169 30953 31045 31415 31600 31310 30762 30374 30421 31022 32145 33537 34878 36096 37407 39019 40916
54675 40916 42920 44753 46014 46374 45843 44783 43599 42542 41777 41397 41283 41167 40926 40735 40819 41228 41915
54658 41915 42856 43907 44618 44448 43286 41646 40263 39475 39035 38560 38087 38123 39128 41025 43265 45299 46902
54641 46902 48098 48966 49590 50115 50659 51220 51729 52292 53310 55251 58341 62571 67947 74460 81717 88918
54625 88918 95479 101570 107660 113585 118427 121354 122169 120976 117795 112882 107067 101305 95984 91010 86435
54610 86435 82539 79241 75882 71841 67170 62482 58366 55072 52595 50833 49583 48520 47331 45922
54596 45922 44439 43018 41621 40236 39178 38858 39152 39319 38830 38069 37889 38571 39558 40171 40222 39872 39302 38702
54578 38702 38363 38473 38911 39346 39506 39247 38505 37363 36111 35090 34433 34019 33625 33059 32156 30852 29364
54561 29364 28225 27940 28522 29459 30204 30624 30905 31173 31410 31617 31790 31774 31462 31156 31389 32244 33231 33986 34679
54542 34679 35402 35608 34773 33391 32649 33024 33769 33956 33576 33339 33776 34902 36497 38334 40113 41496 42351
54525 42351 42832 43196 43592 44096 44937 46520 49056 52116 54830 56701 58102 59745 61795 63799 65343 66412
54509 66412 67074 67183 66595 65442 64045 62694 61507 60262 58385 55417 51647 47987 45053 42681 40490
54494 40490 38619 37551 37490 38241 39546 41123 42470 43100 43119 43206 43820 44662 45162 45287 45553 46237 46950 47165
54476 47165 46951 46924 47507 48493 49334 49649 49379 48683 47830 47011 46158 45069 43802 42764 42216 41954 41607 41080
54458 41080 40476 39898 39529 39610 39939 39803 38938 38245 38889 40796 42701 43617 43535 42792 41656 40716 40727 41644 42567
54439 42567 43064 43699 44710 45098 43922 41857 40452 40228 40524 40896 41552 42387 42671 41995 40784 39673 39005
54422 39005 39113 40305 42254 43970 44807 45080 45454 46186 47205 48436 49668 50529 50966 51459 52463 53919
54406 53919 55556 57297 59070 60554 61485 62023 62501 63058 63699 64435 65072 65220 64796 64237 63832 63200 61862
54389 61862 60071 58572 57719 57221 56634 55651 54063 51999 50138 49156 48947 48806 48429 48170 48272 48370 48092 47768
54371 47768 48175 49729 52094 54485 56193 57022 57328 57553 57749 57706 57464 57295 57128 56470 55172 53928 53660
54354 53660 54620 56373 58438 60537 62337 63456 63835 63852 63843 63709 63111 61955 60574 59426 58684 58064 57059
54337 57059 55445 53610 52281 51786 51567 50572 48295 45387 43058 41871 41291 40536 39586 39079 39336 39900 40158
54320 40158 40094 40206 40832 41791 42676 43314 43896 44616 45304 45598 45543 45734 46543 47367 47102 45424 43224 41680 41247
54301 41247 41634 42254 42457 41790 40471 39306 38791 38612 38399 38494 39348 40516 41067 40923 40976 41723 42578 42864 42827
54282 42827 43139 43839 44306 44101 43411 42792 42758 43521 44835 46086 46725 46576 45737 44397 42875 41572 40749 40460
54264 40460 40729 41452 42055 41762 40564 39517 39655 40850 42065 42509 42128 41289 40505 40311 40833 41483 41542 41072
54246 41072 40821 41248 42073 42769 43072 42971 42685 42684 43284 44070 44209 43453 42404 41625 40976 40098 39062 38170 37472
54227 37472 36896 36563 36559 36628 36460 36129 35926 35937 36106 36554 37434 38548 39413 39682 39297 38400 37353 36656 36486 36465
54207 36465 36199 35854 35816 35958 35802 35379 35275 35692 35982 35473 34402 33647 33761 34507 35234 35466 35197 34754 34390
54188 34390 34038 33597 33326 33576 34138 34327 33933 33598 33919 34544 34703 34362 34194 34459 34578 34015 33061 32372 32107
54169 32107 31938 31682 31444 31224 30865 30488 30592 31418 32469 33007 32923 32757 32846 32850 32309 31402 30813 31017 31996 33515
54149 33515 35259 36685 37235 36924 36400 36154 35977 35478 34828 34535 34658 34782 34726 34750 34874 34494 33069 30989
54131 30989 29378 29034 29729 30540 30795 30711 31134 32573 34559 36132 36866 37095 37204 37225 37220 37473 37894 37791 36802
54112 36802 35684 35496 36243 37049 37511 38008 38662 38908 38487 38051 38224 38698 38836 38692 38725 38885 38725 38269 38053
54093 38053 38285 38589 38653 38597 38613 38688 38867 39356 40242 41365 42606 44018 45556 47004 48212 49152 49704 49728 49408
54074 49408 49177 49187 49231 49304 49808 50959 52304 53155 53305 53076 52862 52831 52917 52881 52540 52072 51917 52289 52987 53789
54054 53789 54693 55660 56468 57116 58057 59772 62354 65726 69863 74439 78651 81913 84557 87379 90659 94115
54038 94115 97639 101480 105647 109717 113430 117042 120882 124813 128336 131047 132922 134301 135628 137061
54024 137061 138372 139352 140126 140823 141074 140252 138157 135139 131682 128252 125391 123299 121262 118124 113599
54009 113599 108645 104331 100843 97877 95438 93685 92289 90510 87854 84370 80465 76757 73889 72104
53995 72104 71027 70162 69491 69272 69383 69245 68450 67163 65900 65103 64884 64971 64911 64558 64345 64841 66048 67369
53977 67369 68241 68545 68413 68021 67704 67928 68795 69703 69835 69073 68189 68023 68600 69279 69663 69989 70525 70971 70848
53958 70848 70307 70084 70637 71777 73148 74574 75762 76249 76055 75938 76528 77543 78349 78978 79952 81339 82745
53941 82745 84247 86540 89958 93999 98081 102198 106500 110814 115047 119609 124842 130357 135498 140275
53927 140275 145195 150280 154921 158888 162859 167596 172905 177825 181754 185106 188843 193534 198875 204083
53913 204083 208644 212599 216100 218927 220653 221180 220802 219758 218059 215837 213545 211555 209735 207658 205107
53898 205107 202176 198963 195444 191620 187568 183288 178701 173884 169115 164578 160113 155381 150281 145115
53884 145115 140369 136333 132903 129709 126437 123080 119869 117022 114558 112280 109916 107383 104967 103090
53870 103090 101689 99955 97032 93084 89344 86900 85645 84675 83460 82265 81510 81150 80816 80245 79386 78313
53854 78313 77218 76361 75831 75465 75155 75088 75456 75981 76011 75184 73790 72389 71248 70301 69566 69325 69832 70974
53836 70974 72372 73701 74781 75379 75194 74225 73055 72528 73046 74241 75377 75948 75886 75379 74762 74535 75182
53819 75182 76715 78524 79911 80814 81795 83291 85138 86962 88736 90649 92637 94545 96729 99918 104271
53804 104271 109012 113313 117174 121039 124905 128324 131159 133742 136285 138583 140372 141635 142448 142910 143222
53789 143222 143490 143420 142600 141098 139352 137425 134961 132008 129215 126871 124398 121248 117715 114303 110882
53774 110882 107261 104139 102420 101708 100497 98005 94954 92210 89550 86400 83119 80761 79743 79440 79101
53759 79101 78663 78462 78465 78099 76841 74853 72884 71524 70686 69969 69262 68721 68297 67760 67218 67102 67464 67748
53741 67748 67524 67116 67171 67825 68642 69208 69476 69615 69758 69847 69582 68707 67472 66628 66747 67686 68870 69849 70386
53722 70386 70341 69861 69463 69512 69753 69781 69816 70416 71494 72220 72193 72182 73335 75866 78854 81222 82689 83792 85135
53703 85135 86653 87629 87453 86364 85328 85241 86309 88110 89981 91474 92724 94414 97073 100408 103588
53688 103588 106196 108557 111010 113285 114834 115503 115640 115722 116074 116672 117089 116859 116099 115505 115495 115686 115517 115017
53670 115017 114526 113931 112830 111351 110195 109763 109782 109936 110355 111190 112106 112557 112361 111731 110984 110492 110677 111628
53652 111628 112803 113486 113579 113648 114118 114708 114852 114439 113885 113560 113437 113389 113515 113935 114412 114569 114549 115048 116443
53633 116443 118196 119464 120086 120531 121015 121263 121230 121425 122200 123171 123728 123856 124040 124606 125515 126645 127881 129071
53615 129071 130315 132169 135082 138668 141996 144645 146979 149335 151511 153264 154816 156475 158171 159749
53601 159749 161422 163476 165761 167961 170264 173195 176717 179973 182088 182976 183215 183436 184002 184991 186180
53586 186180 187083 187257 186601 185374 183983 182775 181944 181516 181457 181746 182238 182575 182475 182159 182148 182471 182353 180986
53568 180986 178438 175497 172802 170535 168920 168365 168830 169455 169337 168536 167940 168110 168658 168851 168532 168203 168380
53551 168380 169103 170018 170736 171052 170997 170731 170357 169823 169084 168400 168279 169013 170342 171676 172669 173463 174402 175779
53533 175779 177943 181334 186047 191399 196376 200648 204874 209768 215196 220548 225771 231472 237959 244758
53519 244758 251338 257945 265300 273672 282647 291715 300752 309958 319616 329973 341136 353037 365655
53506 365655 379233 393986 409575 425187 440289 455107 470263 486137 502714 519813 537151
53495 537151 554283 570747 586396 601521 616648 632164 648061 663989 679668 695265 711189
53484 711189 727448 743460 758689 773303 787902 802657 817082 830768 844090 857908 872569
53473 872569 887431 901484 914315 926240 937498 947731 956523 964151 971203 977450 981750 983333 982686
53460 982686 980696 977343 971864 964058 954774 945052 935290 925413 915403 905357 895248 884821 873659
53447 873659 861322 847694 833206 818486 803752 788855 773903 759432 745787 732713 719799
53436 719799 707038 694723 683132 672603 663590 656283 650423 645804 642640 640980 640033 638762 637110
53423 637110 636060 636427 638118 640692 644082 648409 653599 659615 666774 675342 684929 694686 704154 713635
53409 713635 723775 735013 747510 761357 776730 793852 812850 833582 855632 878535 901954
53398 901954 925710 949824 974703 1001110 1029691 1060468 1092923 1126539 1161127 1196706 1233297
53387 1233297 1270842 1309192 1348099 1387362 1427007 1467196 1507849 1548428 1588113 1626206 1662424
53376 1662424 1696939 1730070 1761810 1791657 1819022 1843726 1865865 1885273 1901532 1914635 1925254
53365 1925254 1934025 1940747 1944591 1944954 1941765 1934931 1923883 1907872 1886661 1860839 1831541 1799872 1766433
53352 1766433 1731285 1694279 1655490 1615445 1575106 1535592 1497683 1461435 1426400 1392328 1359421
53341 1359421 1327696 1296435 1264706 1232356 1200058 1168353 1137104 1106026 1075332 1045570 1017123
53330 1017123 990168 964927 941620 920269 900778 883168 867473 853465 840700 828828 817727
53319 817727 807360 797602 788200 778759 768879 758461 747882 737746 728480 720214 712904 706403 700524
53306 700524 695236 690836 687779 686340 686482 687957 690328 693015 695597 698217 701543 706292 712825 721150
53292 721150 731103 742460 754954 768357 782638 798059 814994 833499 852993 872516 891394 909578
53280 909578 927303 944592 961184 976791 991308 1004959 1018203 1031152 1042929 1052088 1058040 1061731
53268 1061731 1064450 1066276 1066245 1063794 1059350 1053549 1046585 1038516 1029520 1019540 1008112 994840 979738 963002
53254 963002 944837 925653 905951 885819 865018 843728 822658 802089 781414 760087 738548
53243 738548 717683 697847 678972 661171 644509 628411 612110 595604 579541 564201 549243
53232 549243 534377 519643 504975 490193 475546 461631 448574 435898 423497 412148 402695 395127
53220 395127 388810 383187 377926 372754 367597 362624 357764 352344 345546 337081 327218 316504 305770 296043
53206 296043 287870 280754 273689 266186 258469 250826 243276 235911 229053 222907 217354 212211 207441 202924
53192 202924 198341 193487 188628 184340 181011 178514 176296 173810 170973 168209 165975 164259 162669 160908
53178 160908 158936 156745 154307 151815 149666 148037 146695 145431 144453 144146 144560 145342 146048 146387 146314 146123
53162 146123 146267 146791 147092 146600 145648 145237 145885 147109 148182 148997 149852 150762 151367 151379 150748 149577 148266 147616
53144 147616 148213 149597 150512 150156 148890 147573 146670 146223 146259 146642 146814 146225 145032 143928 143215 142545 141663
53127 141663 140972 141026 141694 142179 141828 140703 139381 138362 137701 137106 136281 135118 133586 131603 129130 126301
53111 126301 123366 120583 118331 117127 117173 117886 118229 117646 116385 114852 113086 111084 109257 108048 107265 106223
53095 106223 104575 102651 100953 99641 98643 97975 97684 97567 97196 96274 94937 93647 92769 92248 91703 90853 89782
53078 89782 88857 88542 89237 91008 93266 94954 95368 94780 94059 93751 93765 93877 94168 94777 95444 95543 94641 93007
53060 93007 91496 90736 90433 89643 87875 85643 83713 82155 80602 79183 78547 78920 79804 80761 81893 83183
53044 83183 83987 83724 82750 82015 81999 82402 82712 82595 81918 80899 80187 80306 80958 81304 80979 80441 80273 80563 81059
53025 81059 81523 81728 81521 81067 80791 80897 81229 81692 82388 83153 83446 83051 82561 82734 83645 84869 86229 87869
53007 87869 89741 91564 93285 95087 96909 98400 99452 100439 101732 103265 104671 105609 105918 105730 105499 105575
52991 105575 105669 105124 103838 102549 101962 101985 102129 102272 102537 102724 102466 101931 101799 102349 102961 102721 101327 99306
52973 99306 97562 96792 97007 97491 97444 96829 96299 96185 95959 95063 93931 93578 94270 95169 95431 95129 94786 94508 94045
52954 94045 93451 93128 93182 93239 93038 92866 93235 94301 95721 96922 97432 97203 96788 97002 98164 99713 100692 100550
52936 100550 99432 97920 96698 96305 96877 98043 99155 99668 99423 98787 98543 99247 100517 101282 101035 100456 100410
52919 100410 100653 100197 98755 97123 96093 95699 95703 96087 96707 97029 96715 96113 95737 95587 95413 95287 95428 95666
52901 95666 95615 95250 94841 94455 93980 93588 93608 93915 93941 93444 92812 92435 92171 91697 91087 90682 90591 90599 90540 90504 90604 90737
52879 90737 90712 90551 90539 90856 91255 91320 91046 90978 91702 93344 95633 98162 100485 102312 103868 105749 108045 109897
52861 109897 110360 109516 108248 107108 105956 104636 103390 102500 102072 102239 102990 103662 103260 101687 100123 99736
52845 99736 100416 101136 101147 100279 98487 95867 93105 91184 90423 90120 89336 87788 85883 84194 83063 82498 82196
52828 82196 81703 80728 79379 78059 77070 76341 75618 74921 74563 74555 74224 72870 70791 69158 68700 68898 68752 67959
52810 67959 66968 66189 65630 65248 65111 65119 64893 64148 63075 62241 62147 62875 64074 65286 66293 67057 67440 67288 66855
52791 66855 66747 67156 67478 67078 66200 65712 66025 66749 67296 67380 66931 66030 65079 64598 64665 64907 65164 65790 67005
52772 67005 68263 68662 67872 66447 65322 65148 65914 66962 67460 67112 66396 65971 66024 66385 67088 68358 70017
52755 70017 71355 71843 71726 71592 71538 71147 70270 69401 69093 69302 69628 70027 70885 72360 74007 75230 75950 76580
52737 76580 77461 78471 79252 79701 80195 81266 83010 84904 86328 87186 87786 88218 88189 87504 86383 85124 83809
52720 83809 82518 81505 80817 79987 78480 76327 74060 72201 71119 71145 72250 73696 74499 74445 74296 74843 76047
52703 76047 77250 78033 78646 79703 81503 83620 85141 85421 84572 83247 82141 81787 82434 83726 84734 84800
52687 84800 84267 83927 83911 83710 83232 83096 83660 84454 84948 85355 86178 87365 88370 88825 88698 88057 87103 86309 86087
52668 86087 86381 86935 87815 89265 91035 92348 92624 91996 91015 90095 89332 88651 87938 87068 86021 84975 84263
52651 84263 84063 84130 83922 83156 82122 81282 80688 80095 79524 79299 79476 79660 79564 79343 79147 78740 77849 76569 75178
52632 75178 73859 72865 72600 73158 74093 74953 75665 76106 75827 74837 74104 74525 75638 76218 75979 75797 76286 77125
52614 77125 77943 78895 79982 80659 80667 80567 80900 81426 81788 82330 83509 84956 85929 86423 87032 87842 88305 88279 88391
52595 88391 89144 90229 91081 91655 92333 93349 94667 96225 98002 99870 101591 103005 104229 105622 107450
52580 107450 109466 110978 111569 111591 111669 111863 111737 111187 110611 110173 109427 108029 106383 105160 104433 103749 102872 101967
52562 101967 101096 99989 98451 96700 95116 93878 92971 92443 92435 92890 93322 93015 91665 89792 88313 87593 87124
52545 87124 86283 85130 84208 83785 83676 83680 83785 83984 84263 84809 85818 87022 87805 87963 87999 88459 89267 89927 90105
52526 90105 89778 89060 88204 87564 87270 87057 86608 85890 85008 83957 82821 81966 81667 81676 81506 81004 80358 79665 78859
52507 78859 77936 76907 75648 74242 73308 73463 74432 75232 75305 74980 74709 74437 73953 73379 72916 72501 72058 71799
52489 71799 71918 72269 72629 73097 73882 74881 75765 76355 76692 76893 77059 77207 77151 76705 76089 75778 75808 75652 75062 74532
52469 74532 74541 74852 75046 75301 75922 76474 76219 75260 74428 74068 73749 73257 73036 73339 73742 73875 74065 74756 75856
52450 75856 77076 78441 79924 81005 81191 80725 80255 80029 79908 79983 80545 81524 82491 83293 84138 84986 85399 85233
52432 85233 85027 85322 85919 86226 86155 86217 86696 87173 87099 86575 86242 86453 86866 86988 86854 86992 87774 89077 90535
52413 90535 91884 92997 93831 94474 95123 95852 96459 96678 96495 96180 96043 96225 96659 97113 97311 97077 96443 95637
52395 95637 94967 94597 94358 93884 93101 92496 92642 93415 94007 93820 93126 92619 92556 92680 92877 93495 94838 96608 98144
52376 98144 99164 100075 101427 103273 105222 107030 108773 110424 111638 112287 112869 113977 115501 116863 117992
52361 117992 119471 121570 123693 125113 125857 126476 127225 127936 128550 129309 130418 131866 133600 135665 138082 140724
52345 140724 143312 145480 146994 148014 149093 150696 152832 155202 157543 159739 161871 164373 167829 172376
52331 172376 177474 182555 187675 193246 199422 206135 213496 221670 230507 239819 249867 261006 272929
52318 272929 284926 296989 309995 324509 339933 355175 369709 383597 396862 409336 420976
52307 420976 432031 442932 454139 465887 477884 489468 500170 509924 518667 526158 532377 537645
52295 537645 542039 545097 546475 546553 545947 544742 542701 539953 536863 533361 529064 524071 519073 514599 510631
52280 510631 507029 503867 501255 499287 498284 498564 499815 501275 502863 505608 510546 517535 525623 534215
52266 534215 543282 552679 562011 571282 581112 591954 603434 614703 625332 635668 646347 657504
52254 657504 668403 677927 685483 691418 696418 700681 703962 706248 707940 709258 709871 709293 707338 703984
52240 703984 699140 692863 685657 678212 670883 663585 656047 648006 639384 630632 622732 616434 611457 606747
52226 606747 601535 595924 590552 586112 583163 581790 581258 580399 578691 576680 575192 574578 574958 576636 579665
52211 579665 583293 586486 588880 590768 592391 593883 595813 598925 603076 607088 610028 612175 614373 616896
52197 616896 619393 621565 623382 624814 625807 626450 626795 626654 625910 624926 624276 624062 623866 623317 622387 621130 619521
52180 619521 617624 615607 613449 610909 607916 604780 601859 599167 596405 593281 589761 586163 583013 580621
52166 580621 578720 576654 573956 570657 567112 563730 560857 558569 556530 554337 552123 550504 549782 549480 548875
52151 548875 547716 546197 544519 542822 541352 540262 539324 538193 536916 535820 534900 533768 532359 531313 531381
52136 531381 532624 534408 536047 537292 538323 539544 541345 543889 547083 550893 555648 561854 569650 578608
52122 578608 588199 598296 609027 620235 631474 642722 654838 668836 684660 700998 716504 730947
52110 730947 744940 758803 772174 784692 796570 808182 819334 829255 837307 843507 848400 852529
52098 852529 855998 858396 859102 857804 854799 850725 845987 840508 834100 826993 819866 813256 807047 800648
52084 800648 793698 786491 779672 773688 768630 764501 761394 759384 758394 758259 758879 760372 763144 767654 773859
52069 773859 781004 788318 795915 804627 814749 825426 835620 845285 855064 865035 874415 882592 889852
52056 889852 896812 903515 909444 914088 917179 918519 917996 915766 912159 907372 901399 894203 885755 876012
52042 876012 865034 853156 840752 827842 814151 799596 784522 769400 754495 739923 725783
52031 725783 712040 698445 684797 671211 657949 645123 632754 621065 610417 600872 592025 583375
52019 583375 574691 565941 557098 548157 539188 530185 520965 511420 501729 492014 481949 471110 459758
52006 459758 448738 438373 427900 416439 404183 392088 380513 368874 356711 344432 332685
51995 332685 321476 310355 299087 287761 276495 265585 255726 247456 240327 233186 225367 217247 209537
51982 209537 202582 196464 191268 186856 182804 178950 175671 173182 170886 167999 164600 161443 158768 156013
51968 156013 152860 149878 147679 145901 143633 140644 137712 135666 134501 133500 131980 129791 127244 124693
51954 124693 122234 119805 117508 115645 114301 113134 111803 110478 109601 109207 108819 108121 107387 107048 107071 107003 106537
51937 106537 105833 105305 105223 105464 105566 105152 104351 103674 103317 102813 101641 100087 99130 99377 100344 100920 100376 98833
51919 98833 96973 95487 94645 94194 93599 92498 90961 89346 87969 86946 86278 85961 85970 86141 86116 85522 84308
51902 84308 82839 81545 80550 79768 79162 78606 77698 76224 74897 74928 76500 78153 78269 76868 75372 74857 75207
51885 75207 75902 76752 77635 78214 78380 78513 78854 78997 78450 77422 76583 76184 75900 75422 74745 73913 72937 72035 71591
51866 71591 71730 72163 72567 72880 73156 73368 73474 73567 73871 74652 76066 77908 79566 80511 80857 81207 81889 82631
51848 82631 83074 83303 83644 84198 84789 85278 85674 85995 86215 86348 86497 86869 87793 89583 92223 95215 97920 100075
51830 100075 101880 103640 105460 107382 109668 112767 116956 122109 127900 134125 140632 147022 152759 157689
51816 157689 162074 165867 168293 168638 167172 164690 161275 156295 149803 143128 137581 133200 129318 125813
51802 125813 123019 120732 118256 115470 113114 111757 111105 110569 109994 109503 109014 108288 107231 105894 104425 103220
51786 103220 102787 103131 103542 103356 102739 102340 102315 102174 101620 101078 101169 101957 102934 103582 103753 103565 103171 102660 102089
51767 102089 101564 101249 101286 101661 102195 102741 103392 104419 105895 107401 108185 107754 106338 104725 103700 103667 104685
51750 104685 106549 108721 110397 110928 110291 109086 108122 108013 109016 110957 113250 115169 116353 117065 117846 118899
51734 118899 119940 120669 121245 122104 123366 124656 125589 126201 126736 127152 127150 126666 126102 125960 126372 127057 127603 127701 127261
51715 127261 126460 125692 125343 125473 125679 125294 123927 121890 119961 118613 117565 116276 114726 113402 112595 112118
51699 112118 111728 111476 111436 111455 111364 111191 110953 110493 109820 109358 109516 110127 110692 111081 111639 112532 113330 113306 112023 109603
51679 109603 106632 103855 101780 100496 99869 99812 100194 100611 100583 100080 99586 99486 99507 98937 97393 95303 93606
51662 93606 92955 93240 93907 94597 95283 95813 95779 95061 94182 93736 93687 93589 93382 93468 94051 94836 95484 95978 96371 96536
51642 96536 96386 96140 96193 96777 97774 98723 99112 98929 98862 99646 101225 102934 104404 105794 107104 107933 108212 108592
51624 108592 109650 111078 112056 112092 111190 109630 108100 107694 109054 111569 113907 115315 116057 116675 117345 117934
51608 117934 118233 118089 117605 117188 117114 117126 116817 116247 115730 115148 114045 112409 110714 109122 107296 105246 103719
51591 103719 103275 103460 103344 102604 101663 101011 100855 101238 101987 102545 102218 100798 98825 97269 96897 97713 98867
51574 98867 99343 98908 98236 97971 97977 97759 97224 96615 95953 95088 94217 93835 94116 94768 95532 96412 97322 97936 98091 97989
51554 97989 97809 97510 97228 97517 98753 100511 101980 102926 103869 105276 106950 108406 109561 110752 112145 113396
51538 113396 114021 114019 113992 114562 115734 116933 117701 118138 118546 118838 118623 117879 117187 117111 117605 118274 119004 119952 121003
51519 121003 121734 122056 122528 123745 125687 127937 130301 132816 135207 136842 137368 137109 136711 136536 136483 136264 135734
51502 135734 135080 134701 134747 134802 134241 132948 131412 130103 129058 128177 127546 127190 126863 126389 125978 125793 125429 124316
51484 124316 122608 121228 120922 121619 122783 124036 125199 126022 126164 125456 124034 122204 120209 118099 115860
51469 115860 113701 112028 110994 110251 109444 108800 108786 109210 109168 108097 106488 105177 104274 103233 101857 100688
51453 100688 100264 100362 100275 99697 99023 98765 98874 98846 98400 97791 97410 97304 97289 97301 97351 97300 97019 96759 96941 97503 97827
51432 97827 97476 96693 95976 95464 94969 94362 93568 92407 90774 88932 87361 86407 86199 86700 87563 88139 88035 87587
51414 87587 87450 87737 87952 87735 87225 86638 85928 85136 84721 85168 86362 87567 87978 87273 85848 84655 84573 85648
51396 85648 87024 87838 88125 88620 89731 90998 91689 91679 91572 92019 93125 94523 95758 96440 96206 94917 92992
51379 92992 91220 90016 89004 87561 85623 83667 82033 80685 79606 78950 78601 78000 76769 75231 74008
51364 74008 73285 72810 72475 72455 72712 72786 72209 70943 69264 67490 66007 65296 65574 66424 67104 67349 67630 68424
51346 68424 69400 69666 68802 67361 66204 65653 65555 65904 66893 68333 69509 69871 69597 69150 68574 67646 66662 66469
51328 66469 67426 68658 68785 67405 65582 64747 65316 66501 67233 67002 65934 64519 63408 63117 63590 64217 64533
51311 64533 64785 65520 66756 67939 68672 69084 69415 69628 69598 69338 68898 68312 67809 67734 68078 68374 68299 68023 67741
51292 67741 67182 66059 64732 64019 64406 65715 67383 68737 69260 69033 68751 68898 69065 68597 67708 67339 67928
51275 67928 68958 69761 70084 69698 68256 65988 63987 63248 63703 64514 64993 64864 64083 62975 62306 62652 63790
51258 63790 65099 66415 68014 69863 71464 72498 73194 73956 75000 76415 78234 80247 82001 83160 83724
51243 83724 83849 83653 83250 82725 81974 80795 79270 77888 77156 77164 77606 78051 78105 77500 76209 74504 72853 71736
51225 71736 71467 71996 72897 73752 74630 76009 78144 80695 83083 85020 86486 87380 87533 87081 86566 86470 86717
51208 86717 86746 86099 84932 83937 83746 84356 85137 85454 85238 84891 84641 84181 83095 81490 79961 78871 77934 76757
51190 76757 75589 75162 75734 76623 76904 76411 75818 75781 76220 76458 75986 75004 74239 74225 74801 75366 75550 75437 75192
51171 75192 74741 74005 73205 72724 72738 73152 73732 74198 74320 74120 73909 73948 74225 74713 75618 77023 78437 79092 78798
51152 78798 78205 78151 78918 80143 81245 81874 82090 82184 82259 82129 81669 81072 80503 79735 78542 77275 76608 76699 77072
51133 77072 77321 77481 77649 77771 77985 78655 79789 80888 81634 82283 83004 83295 82615 81284 80190 79779 79809 79986
51115 79986 80239 80405 80238 79869 79807 80240 80735 80912 81092 81916 83477 85184 86529 87670 89087 90781 92158
51098 92158 92783 93005 93533 94508 95384 95787 96047 96647 97479 98064 98275 98398 98564 98593 98477 98624 99389 100560 101458
51079 101458 101538 100884 100201 100297 101391 102959 104313 105239 105895 106312 106291 105751 104839 103730 102603 101809 101713 102232
51061 102232 102797 102893 102485 101872 101325 100930 100561 100031 99458 99391 100161 101124 101077 99658 97893 97003 97093 97407 97574
51042 97574 97992 99082 100676 102276 103540 104441 105192 106120 107391 108810 110132 111573 113632 116252 118465
51027 118465 119265 118782 118309 119099 121276 123904 125904 126760 126608 125996 125668 126256 127859 129936 131812 133330
51011 133330 134926 137050 139671 142339 144557 146040 146888 147672 149151 151714 155130 158996 163267 168134 173472
50996 173472 178743 183484 187692 191658 195623 199752 204319 209730 216373 224479 234085 244956 256635 268697
50982 268697 281139 294503 309500 326497 345428 366263 389389 415332 444138 475342 508632
50971 508632 544300 582849 624338 668308 714150 761232 808786 856057 902601 948043 991504
50960 991504 1031663 1067648 1099512 1127498 1151140 1169577 1182676 1191363 1196725 1199244 1199156 1197247 1194862
50947 1194862 1193123 1192374 1192413 1193063 1194369 1196261 1198144 1198944 1197646 1193776 1187214 1177644 1164424 1147074 1125557
50932 1125557 1099840 1069519 1034312 994844 952520 908589 863759 818751 774618 732089 690986
50921 690986 650791 611698 574716 540860 510611 484016 460792 440247 421648 404897 390519
50910 390519 378742 368885 359969 351651 344248 338052 333039 329174 326532 325025 324349 324370 325235 326864 328550
50895 328550 329454 329515 329555 330377 331956 333750 335567 337781 340636 343757 346620 349261 352162 355540 359227 363328
50879 363328 368520 375386 383685 392622 401711 411073 421011 431678 443226 455911 469893 485135 501683
50866 501683 519958 540617 564202 591078 621701 656834 697402 744073 796923 855514 919461
50855 919461 988978 1064803 1147488 1236755 1331568 1430769 1533550 1639276 1746856 1854297 1958891
50844 1958891 2057874 2148981 2230480 2300953 2359241 2404634 2437022 2456953 2465738 2465483 2458712 2447715
50832 2447715 2434373 2420649 2408962 2401696 2400244 2404583 2413679 2426009 2439697 2452532 2462112 2466022
50820 2466022 2461923 2447739 2421997 2383961 2333376 2270238 2194980 2108809 2013649 1911748 1805361
50809 1805361 1696693 1587897 1481089 1378374 1281688 1192372 1110887 1037136 971046 912676
50799 912676 861870 818162 781084 750264 725108 704738 688421 675793 666388 659266 653469 648756
50787 648756 645482 643735 642828 641632 639186 635065 629509 623249 616909 610469 603423 595458 586766 577690
50773 577690 568376 558884 549380 540082 531052 522162 513160 503854 494454 485712 478441 472836 468542 465369
50759 465369 463532 463075 463542 464635 466867 471103 477572 485772 495286 506352 519558 535331 553832 575109
50745 575109 599241 626467 657242 692030 730961 773768 820119 869901 923146 979735 1039206
50734 1039206 1100787 1163564 1226606 1288881 1349140 1406057 1458553 1505856 1547186 1581524 1607797
50723 1607797 1625188 1633251 1632055 1622452 1606088 1584897 1560692 1535338 1511013 1489835 1473243 1461895
50711 1461895 1455942 1455030 1458185 1464204 1472156 1481073 1489161 1493887 1493055 1485409 1470030 1445812 1412070 1369439
50697 1369439 1319697 1264819 1206497 1146415 1086417 1028242 973228 922194 875388 832648 793972
50686 793972 759950 731306 707986 689055 673662 661788 653823 649652 648514 649717 653122 658871 666862
50673 666862 676592 687318 698222 708581 718024 726621 734621 742108 749031 755463 761576 767375 772687
50660 772687 777528 782297 787482 793353 800129 808232 818199 830484 845537 863853 885589 910252 937107
50647 937107 966000 997418 1031629 1067983 1105160 1141919 1177515 1211595 1243867 1273849 1300894
50636 1300894 1324517 1344574 1360893 1372925 1380114 1382675 1381614 1377868 1371790 1363574 1353739 1342944 1331713
50623 1331713 1320696 1310925 1303362 1298317 1295555 1294763 1295586 1297501 1300053 1303126 1306599 1309907 1312375 1313865
50609 1313865 1314573 1314239 1312005 1307007 1298534 1285570 1266861 1241845 1211098 1175571 1135825 1092343 1046201
50596 1046201 998900 951690 905414 860845 818689 779298 742716 709043 678501 651165 626911
50585 626911 605572 586930 570622 556409 544528 535380 528815 524087 520721 519077 519757 522682 527081
50572 527081 532259 538042 544478 551452 558744 566200 573649 580843 587750 594888 603038 612515 622916 633789
50558 633789 645372 658342 672881 688438 704559 721516 739734 758886 778152 797319 817032
50547 817032 837818 859455 881675 905028 930522 958697 989641 1023769 1061918 1104567 1151587
50536 1151587 1203066 1259814 1322646 1391465 1465531 1544346 1627728 1715036 1804857 1895567 1985851
50525 1985851 2074498 2160040 2240738 2314700 2379856 2434104 2475826 2504199 2518883 2519522 2505807 2477947
50513 2477947 2436879 2384039 2321123 2250090 2173198 2092953 2011991 1932946 1858191 1789599 1728562
50502 1728562 1676233 1633591 1601181 1578851 1565935 1561797 1566189 1578975 1599482 1626182 1657032 1689890
50490 1689890 1722353 1751285 1772959 1783980 1782079 1766124 1735840 1691872 1635906 1570311 1497598
50479 1497598 1420302 1341019 1262015 1184770 1110297 1039852 974765 915431 861075 810910 765179
50468 765179 724683 689597 659235 632738 609537 589281 571895 557724 547077 539529 534102 530215
50456 530215 528006 527622 528735 531050 534718 539807 545757 551932 558421 565628 573258 580459 587123 594317
50442 594317 603036 612992 623025 632425 641442 650677 660475 670871 681757 692905 704126 715614 728117
50429 728117 742577 759502 778656 799378 821245 844371 869112 895698 924344 955530 989734
50418 989734 1026828 1066121 1107195 1150308 1195713 1242886 1290802 1338685 1386012 1431859 1474803
50407 1474803 1513552 1547308 1575413 1597070 1611571 1618472 1617347 1607624 1588955 1561581 1526194 1483615
50395 1483615 1434713 1380506 1322211 1261393 1200076 1140344 1083539 1030040 979990 934052 893323
50384 893323 858794 831151 810736 797309 790074 788404 792350 801945 816184 833287 851857 871017
50372 871017 889284 904158 913419 916330 913063 903436 886943 863880 835698 804126 770454 735676
50360 735676 700680 665996 631830 598760 568019 540584 516178 493672 472493 453192 436521
50349 436521 422436 410369 400106 391890 385618 380470 375672 371372 368366 367017 366872 367469 369094 372279
50335 372279 376731 381312 385262 389087 393947 400416 408138 416512 425311 434578 444253 454040 463497 472219
50321 472219 480142 487710 495478 503486 511215 518265 524752 530884 536507 541447 546070 551005 556349 561565
50307 561565 566228 570466 574547 578348 581503 583843 585500 586736 587812 588847 589610 589602 588534 586673 584500
50292 584500 582119 579241 575713 571864 568320 565606 563957 563253 563035 562678 561747 560193 558181 555775 552925
50277 552925 549766 546718 544086 541582 538535 534709 530683 527181 524177 520949 516951 512231 506985 501116
50263 501116 494505 487448 480546 474256 468681 463598 458490 452848 446819 441416 437679 435614 434258 432830
50249 432830 431461 430708 430789 431604 433272 436159 440257 444815 448858 452075 454980 458167 461532 464394 466300
50234 466300 467514 468662 470035 471288 471723 470778 468343 464633 459807 453870 447102 440312 434207 428485 422053
50219 422053 414312 405821 397502 389665 382211 375309 369283 364021 359059 354185 349506 345018 340615 336520
50205 336520 333176 330663 328658 327041 326045 325657 325320 324488 323124 321454 319521 317270 314856 312575 310607
50190 310607 308956 307536 306247 305049 303959 302848 301320 299078 296285 293293 290152 286870 283992 282178
50176 282178 281105 279544 276901 274050 272146 271205 270438 269502 268664 268034 267490 267379 268546 271437 275632 280507
50160 280507 286047 292812 301364 311852 324090 337910 353520 371391 391691 413984 437710 462731
50148 462731 489027 515945 542171 566534 588626 608551 626372 642059 655891 668700 681410
50137 681410 694164 706043 715944 723524 728751 730626 727324 718096 704243 687486 668055 645403 620288
50124 620288 594796 570250 546380 522935 500968 481820 465604 451531 439210 428871 420572 413946
50112 413946 408626 404373 400765 397198 393289 389102 385036 381622 379272 377941 377122 376311 375393 374548 374028
50097 374028 374127 375038 376583 378451 380879 384660 390109 396438 402674 408878 415905 424125 432976 441810 450648
50082 450648 459973 470116 480945 491940 502544 512583 522307 531863 540950 549271 557075 564772 572147
50069 572147 578462 583291 586784 589003 589614 588504 586310 583997 582127 580743 579746 579110 578786 578607 578334 577897
50053 577897 577657 578319 580308 583355 587032 591675 598282 607386 618459 630699 644145 659698 678273
50040 678273 700199 725368 753698 785335 820392 858458 898538 939760 982025 1025512 1069442
50029 1069442 1111866 1150926 1185990 1217364 1245402 1270412 1292952 1313551 1332126 1348194 1361558
50018 1361558 1372223 1379542 1381949 1377781 1366122 1346775 1319848 1285743 1245407 1200256 1151773 1101203
50006 1101203 1049529 997614 946318 896443 848528 802788 759362 718579 680876 646518 615526
49995 615526 587749 562813 540101 519086 499743 482416 467232 453868 441909 431102 421130 411484
49983 411484 401857 392524 383986 376253 368702 360682 352076 343224 334419 325655 316802 307936 299430 291784
49969 291784 285378 280271 276075 272042 267498 262369 257195 252528 248450 244811 241694 239330 237648 236318
49955 236318 235220 234489 233983 233113 231496 229500 227828 226713 225771 224577 223136 221901 221502 222338 224186 226285
49939 226285 228017 229437 230963 232726 234575 236618 239281 242681 246352 249802 253128 256822 261198 266250
49925 266250 271935 278330 285538 293705 303098 313982 326374 340099 355139 371819 390604 411824
49913 411824 435542 461583 489526 518687 548105 576541 602660 625482 644790 661044 674919
49902 674919 687069 698233 709175 720160 730563 739270 745373 748282 747281 741416 729994 712932
49890 712932 690505 663048 631318 596944 562052 528215 495925 465198 436416 410337 387299
49879 387299 366757 347817 330208 314464 301051 289573 279162 269568 261368 254941 249714 244845
49867 244845 240291 236596 233758 230998 227843 224812 222674 221471 220741 220351 220545 221260 221993 222445 222900 223761
49851 223761 224964 226030 226551 226443 225799 224640 222919 220788 218754 217326 216388 215162 213058 210442 208226
49836 208226 206818 205879 205093 204657 204757 204999 204819 204249 203844 203915 204264 204671 205223 205909 206295 205983 205292 205095 205896
49817 205896 207299 208522 209157 209254 208883 208044 207022 206494 206968 208226 209480 210080 209954 209413 208710 207879 206932
49800 206932 206075 205587 205487 205386 204814 203619 201976 200111 198260 196837 196215 196260 196410 196420 196657 197348 197894 197479
49782 197479 196253 195341 195567 196594 197461 197613 197218 196755 196593 196892 197668 198908 200570 202393 203850 204516 204460
49765 204460 204059 203496 202738 202000 201758 202174 202874 203516 204299 205618 207430 209226 210520 211205 211589 212204 213421
49748 213421 215066 216536 217390 217625 217363 216706 216124 216522 218371 220970 223028 223963 224264 224680 225481 226522 227552
49731 227552 228299 228542 228315 227939 227769 228000 228708 229850 231195 232362 232966 232730 231635 230111 228896 228407 228315
49714 228315 227986 227245 226437 225915 225863 226537 228094 230039 231252 230911 229231 227127 225371 224218 223577 223254 223114
49697 223114 223138 223293 223328 222935 222179 221592 221691 222561 224001 225795 227639 229047 229693 229839 230175 231175 232672 234074
49679 234074 234892 235098 235077 235208 235435 235253 234182 232325 230494 229724 230418 231847 232701 232390 231607 231329 231506 231346
49661 231346 230771 230817 232189 234086 235015 234466 233193 232131 231657 231873 232940 234940 237777 241359 245601 250133
49645 250133 254359 257930 260842 262956 263785 263084 261344 259343 257260 254628 251180 247435 244267 242086 240659
49630 240659 239676 239231 239594 240696 242028 243087 243744 244133 244368 244554 244940 245809 247096 248263 248716 248439 248188
49613 248188 248912 250849 253219 254922 255582 255807 256461 257866 259747 261729 263720 265926 268629 271889 275369
49598 275369 278643 281732 285100 288980 292984 296657 300152 303948 308087 312154 315934 319662 323581 327692
49584 327692 332031 336733 341652 346265 350228 353793 357552 362008 367520 374244 381864 389625 396962 403980
49570 403980 411114 418574 426306 434201 442010 449270 455720 461662 467600 473667 479737 485872 492221 498597
49556 498597 504655 510448 516316 522223 527756 532842 537886 542936 547281 550298 552339 554383 557063 560313
49542 560313 563638 566322 567648 567506 566742 566493 567222 568663 570525 572753 575171 577420 579369 581251 583301
49527 583301 585586 588260 591556 595424 599505 603582 607675 611608 614945 617725 620873 625449 631644 638791
49513 638791 646165 653452 660603 667571 674157 679938 684468 687677 689844 691054 691050 689910 688348 686788 684504
49498 684504 680449 674818 668906 663385 657580 650782 643470 636648 630541 624619 618586 612614 606712 600521
49484 600521 593819 586793 579679 572495 565288 558339 551911 545929 540090 534289 528804 523997 519786 515594
49470 515594 510997 506349 502447 499497 496855 493890 490694 487573 484326 480585 476649 473283 470769 468696
49456 468696 466734 464971 463386 461654 459759 458275 457576 457183 456343 454957 453488 452257 451336 450934 451270 452097
49440 452097 452893 453616 454742 456440 458196 459616 461189 463827 467849 472814 478206 483811 489320 493986 496905
49425 496905 497535 495879 492445 488180 484235 481398 479758 478996 478939 479602 480808 482193 483695 485794 489041
49410 489041 493538 499026 505244 511951 518789 525525 532360 539676 547478 555433 563453 571803 580489 589004
49396 589004 596949 604545 612095 619265 625418 630545 635330 640183 644708 648295 650861 652768 654280 655379
49382 655379 655871 655458 653933 651597 649287 647624 646331 644668 642475 640334 638685 637232 635496 633573 631991
49367 631991 631044 630623 630559 630778 631171 631674 632462 633730 635228 636394 637057 637658 638600 639761 640981 642681 645474
49350 645474 649272 653323 657241 661536 666874 673165 679682 685925 692064 698604 705875 713869 722356 731126
49336 731126 740146 749516 759174 768772 777934 786602 795029 803574 812599 822380 832755 842913 851926 859693
49322 859693 867123 875186 883945 892747 901165 909402 917712 925693 932436 937299 940485 942819 945044 947297
49308 947297 949259 950745 952107 954020 956904 960568 964333 967501 969782 971477 973270 975728 978864 982179
49294 982179 985208 987975 990856 993961 996908 999354 1001691 1004880 1009460 1014965 1020534 1025922 1031541 1037614
49280 1037614 1043808 1049806 1055832 1062306 1069278 1076504 1083804 1090975 1097580 1103271 1108205 1112677 1116437 1118902
49266 1118902 1120068 1120579 1120757 1120094 1118045 1114817 1110985 1106747 1102060 1097163 1092355 1087368 1081562 1074795 1067696
49251 1067696 1061049 1055229 1050164 1045437 1040348 1034314 1027362 1019978 1012460 1004780 997061 989747 983097 976921
49237 976921 971028 965606 960883 956697 952687 948663 944595 940488 936559 933298 931017 929525 928548 928233 928832
49222 928832 930040 931145 931870 932691 934166 936280 938556 940638 942554 944565 946808 949049 950764 951574 951604
49207 951604 951337 951170 951299 951933 953355 955654 958592 961844 965236 968704 972221 975877 979911 984478 989424
49192 989424 994412 999235 1004021 1009088 1014628 1020479 1026194 1031459 1036447 1041693 1047495 1053551 1059293 1064606
49178 1064606 1070095 1076527 1084059 1092123 1100105 1107952 1115947 1123998 1131529 1138179 1144294 1150500 1156998 1163535
49164 1163535 1169939 1176338 1182911 1189749 1197040 1205055 1213847 1223145 1232688 1242412 1252209 1261731 1270713 1279342
49150 1279342 1288079 1297178 1306609 1316397 1326828 1338218 1350595 1363630 1376782 1389568 1401892 1414210
49138 1414210 1427163 1440949 1455169 1469375 1483504 1497578 1511263 1524185 1536619 1549261 1562100
49127 1562100 1574030 1584071 1592673 1601223 1610401 1619567 1627803 1634968 1641549 1647947 1654285 1660629 1667073
49114 1667073 1673726 1680668 1687618 1693605 1697515 1699271 1700065 1700999 1701944 1702163 1701536 1700426 1698604 1695286 1690328
49099 1690328 1684603 1679055 1673981 1669455 1665731 1662825 1660367 1658420 1657920 1659616 1662846 1666057 1668488 1670769
49085 1670769 1673804 1677653 1681740 1685652 1689310 1692526 1694902 1696284 1697036 1697630 1697992 1697561 1696082 1694081 1692299
49070 1692299 1690728 1688540 1684946 1679853 1673599 1666450 1658629 1650581 1642787 1635254 1627417 1618694 1609122 1599453
49056 1599453 1590569 1582709 1575220 1567167 1558255 1549111 1540655 1533319 1526913 1521075 1515702 1510960 1506939 1503362
49042 1503362 1499794 1496214 1493182 1491180 1489898 1488556 1486876 1485332 1484309 1483503 1482435 1481192 1480215 1479555 1478828
49027 1478828 1477872 1477032 1476699 1476793 1476946 1477052 1477424 1478379 1479842 1481536 1483475 1485979 1489146 1492709 1496679 1501652
49011 1501652 1507929 1514628 1520502 1525628 1531442 1538859 1547169 1555198 1562755 1570256 1577560 1584032 1589483 1594238
48997 1594238 1598476 1602215 1605776 1609470 1612912 1615415 1617090 1618753 1620616 1621842 1621696 1620425 1618665 1616571
48983 1616571 1613993 1611002 1607779 1604401 1601236 1599112 1598482 1598683 1598628 1598114 1597869 1598336 1599077 1599576 1600130 1601564
48967 1601564 1604295 1607970 1611949 1615837 1619562 1623180 1626797 1630614 1634858 1639533 1644296 1648706 1652655 1656481
48953 1656481 1660601 1665142 1670013 1675238 1681052 1687572 1694517 1701452 1708421 1716202 1725705 1737182 1750244
48940 1750244 1764680 1780905 1799453 1820368 1843498 1869080 1897530 1928679 1961684 1995795 2030872
48929 2030872 2067171 2105008 2144689 2186231 2228953 2271766 2314161 2356579 2399588 2443106 2486801
48918 2486801 2530750 2575056 2619048 2661571 2702201 2741628 2780689 2819358 2856874 2892514 2926119
48907 2926119 2958190 2989720 3021587 3053792 3085404 3115517 3144173 3172084 3199547 3225968 3250528
48896 3250528 3273087 3294295 3314985 3335546 3355750 3374935 3392386 3407761 3421213 3433030 3443059
48885 3443059 3450655 3455294 3457089 3456521 3453743 3448407 3440186 3429174 3415589 3399294 3379880 3357159 3331297
48872 3331297 3302526 3270942 3236739 3200371 3162274 3122504 3080906 3037648 2993316 2948360 2902684
48861 2902684 2856043 2808799 2761977 2716479 2672415 2629313 2586847 2545264 2505305 2467880 2433626
48850 2433626 2402478 2373705 2346601 2321179 2298042 2277700 2260327 2246111 2235345 2227964 2223346 2220832
48838 2220832 2220177 2221170 2223105 2225162 2227304 2230373 2235150 2241594 2249139 2257456 2266668 2277014 2288541 2301081
48824 2301081 2314373 2328213 2342601 2357616 2373019 2388125 2402359 2415951 2429792 2444559 2460200
48813 2460200 2476289 2492607 2509167 2525953 2542981 2560489 2578804 2598052 2618151 2638915 2659909
48802 2659909 2680450 2700277 2720118 2741054 2763233 2785763 2807971 2830067 2852234 2873840 2894250
48791 2894250 2913970 2934102 2954796 2975078 2994235 3012648 3031059 3049624 3067925 3085402 3101491
48780 3101491 3115789 3128422 3139906 3150337 3159075 3165512 3169761 3172197 3172541 3169950 3163921 3154716 3142839
48767 3142839 3128408 3111176 3091043 3068473 3044297 3019055 2992558 2964324 2934436 2903633 2872496
48756 2872496 2840948 2808786 2776356 2744291 2712796 2681616 2650707 2620614 2592116 2565675 2541246
48745 2541246 2518505 2497299 2477844 2460356 2444534 2429816 2416221 2404530 2395370 2388553 2383684 2380905
48733 2380905 2380494 2381931 2384061 2386077 2387868 2389542 2391251 2393485 2396857 2401377 2406405 2411419 2416420 2421565
48719 2421565 2426998 2433180 2440741 2449645 2459025 2468197 2477361 2486944 2496768 2506355 2515634 2524676 2533017 2539989
48705 2539989 2545724 2551278 2557542 2564414 2571115 2577030 2582201 2587293 2593096 2599753 2606411 2611912 2615868 2618860
48691 2618860 2621571 2624080 2626047 2627251 2627737 2627731 2627574 2627573 2627744 2627840 2627864 2628383 2630197 2633768 2639064 2645782 2653538
48674 2653538 2661931 2670595 2679056 2686387 2691051 2691398 2686356 2675653 2659481 2638203 2612363 2582724 2550107
48661 2550107 2515234 2478723 2441149 2403103 2365234 2328195 2292452 2258076 2224833 2192493 2160966
48650 2160966 2130173 2099924 2069990 2040265 2010837 1981953 1953816 1926280 1898815 1870998 1843064
48639 1843064 1815747 1789519 1764233 1739608 1715776 1693058 1671424 1650440 1629725 1609226 1589094
48628 1589094 1569501 1550568 1532277 1514460 1497042 1480220 1464252 1449148 1434767 1421138 1408366
48617 1408366 1396264 1384519 1373317 1363488 1355733 1349853 1344913 1340096 1335283 1330923 1327417 1324535 1321495
48604 1321495 1317740 1313617 1310026 1307423 1305519 1303967 1302823 1302069 1301219 1299844 1298226 1296976 1296213 1295582 1294961
48589 1294961 1294583 1294531 1294649 1295069 1296247 1298267 1300482 1302219 1303585 1305377 1308300 1312436 1317281 1322150 1326662
48574 1326662 1331009 1335595 1340385 1344777 1348143 1350246 1351058 1350562 1348948 1346663 1343928 1340445 1335965 1330939
48560 1330939 1326185 1321993 1318032 1314154 1310731 1308004 1305536 1302697 1299413 1296065 1292823 1289502 1286145 1283284
48546 1283284 1281373 1280153 1278858 1276997 1274718 1272382 1270058 1267643 1265281 1263338 1261853 1260353 1258437 1256444
48532 1256444 1255251 1255350 1256358 1257502 1258380 1259136 1260063 1261316 1262918 1264806 1266849 1269008 1271480 1274499 1277953
48517 1277953 1281477 1285005 1288904 1293341 1297755 1301344 1303970 1306248 1308710 1311239 1313433 1315200 1316811 1318542
48503 1318542 1320442 1322319 1323815 1324640 1324856 1324836 1324884 1325067 1325438 1326075 1326696 1326591 1325393 1323753 1322785 1322819 1323069 1322631
48485 1322631 1321428 1320003 1318682 1317237 1315287 1312780 1310036 1307364 1304625 1301235 1296807 1291761 1287104 1283415
48471 1283415 1280215 1276476 1271660 1266089 1260396 1254882 1249505 1244287 1239479 1235249 1231331 1227137 1222283 1216956
48457 1216956 1211739 1207128 1203214 1199696 1196099 1192115 1187904 1184023 1180912 1178517 1176508 1174684 1172910 1170820
48443 1170820 1167986 1164464 1160817 1157440 1154163 1150659 1146973 1143345 1139781 1136105 1132324 1128655 1125216 1121946
48429 1121946 1118815 1115847 1112942 1109826 1106238 1102025 1097105 1091606 1086019 1080921 1076388 1071836 1066637 1060816
48415 1060816 1055006 1049779 1045142 1040633 1035763 1030322 1024383 1018111 1011636 1005079 998595 992295 986153 980081
48401 980081 974112 968368 962807 957115 951004 944551 938108 931905 925855 919751 913476 906969 900144 893008
48387 893008 885788 878771 872077 865720 859873 854817 850555 846642 842544 838053 833253 828245 823187 818508
48373 818508 814747 812015 809862 807877 806241 805418 805393 805578 805534 805490 805870 806490 806561 805497 803452 800996 798532
48356 798532 796160 793868 791577 789145 786571 784144 782132 780403 778632 776853 775421 774350 773059 771000
48342 771000 768289 765485 762994 760938 759348 758137 757000 755724 754595 754157 754564 755394 756130 756589 756806 756779
48326 756779 756469 755955 755441 755124 755045 755022 754866 754743 755132 756233 757531 758312 758485 758535 758646 758356 757284 755800
48308 755800 754674 754244 754219 754158 753900 753549 753270 753122 752987 752625 751871 750840 749964 749780 750479 751581 752273 752288 752281
48289 752281 753047 754517 756038 757492 759531 762518 765869 768882 771724 775093 779163 783415 787408 791184
48275 791184 794961 798873 803118 807960 813402 818998 824116 828296 831389 833539 835056 836205 837116 837935 838908
48260 838908 840172 841653 843349 845464 847913 849960 850874 850968 851404 852860 854861 856646 858159 859745 861255
48245 861255 862091 862102 861856 861911 862145 862029 861278 860008 858398 856490 854301 851879 849167 845953 842040 837475
$$ [...]
##END NTUPLES=NMR SPECTRUM
##END=
