##TITLE=NES1072_159122.0001_001_9705742_Jn1s7h4oia
##JCAMPDX= 6.0         $$ Bruker NMR JCAMP-DX V2.0
##DATA TYPE= NMR SPECTRUM
##DATA CLASS= NTUPLES
##ORIGIN= BRUKER
##OWNER= Administrator
$$ 1.72 TOPSPIN		Version 2.1
$$ 2016-04-30 20:08:09.271 -0700  Administrator@X
$$ Compression mode = diff/dup
##.OBSERVE FREQUENCY= 400.02188249412
##.OBSERVE NUCLEUS= ^1H
##.ACQUISITION MODE= SIMULTANEOUS (DQD)
##.ACQUISITION SCHEME= undefined
##.AVERAGES= 8
##.DIGITISER RES= 22
##SPECTROMETER/DATA SYSTEM= spect
##.PULSE SEQUENCE= zg30
##.SOLVENT NAME= COFFEE_meoh
##.SHIFT REFERENCE= INTERNAL, COFFEE_meoh, 1, 14.98509
##AUDIT TRAIL= $$ (NUMBER, WHEN, WHO, WHERE, PROCESS, VERSION, WHAT)
$$ ##TITLE= Audit trail, TOPSPIN		Version 2.1
$$ ##JCAMPDX= 5.01
$$ ##ORIGIN= Bruker BioSpin GmbH
$$ ##OWNER= Administrator
$$ $$ E:\/data/COFFEE/nmr/NES1072_159122.0001_001_9705742_Jn1s7h4oia/10/pdata/1/auditp.txt
$$ ##AUDIT TRAIL=  $$ (NUMBER, WHEN, WHO, WHERE, PROCESS, VERSION, WHAT)
(   1,<2016-04-30 20:08:02.114 -0700>,<Administrator>,<X>,<go>,<TOPSPIN 2.1>,
      <created by zg
	started at 2016-04-30 20:06:56.161 -0700,
	POWCHK enabled, PULCHK disabled,
       configuration hash MD5:
       21 0F 79 D6 B3 7B B4 F6 88 20 88 DB 03 48 BD 9F
       data hash MD5: 64K
       AC F4 A8 7D 6F 2E D5 A2 CE E4 24 4A 43 A7 F6 36>)
(   2,<2016-04-30 20:08:05.224 -0700>,<Administrator>,<X>,<proc1d>,<TOPSPIN 2.1>,
      <Start of raw data processing
       efp LB = 0 FT_mod = 6 PKNL = 1 PHC0 = 0 PHC1 = 0 SI = 32K 
       data hash MD5: 32K
       08 93 7D 88 3D 95 8B D9 C8 DE B1 85 A1 E5 F7 C4>)
(   3,<2016-04-30 20:08:05.505 -0700>,<Administrator>,<X>,<proc1d>,<TOPSPIN 2.1>,
      <pk PHC0 = 91.66992 PHC1 = 0 
       data hash MD5: 32K
       8C A3 1D B9 C1 2D 87 6B E5 16 CD 9C 39 0C 29 BC>)
(   4,<2016-04-30 20:08:05.614 -0700>,<Administrator>,<X>,<proc1d>,<TOPSPIN 2.1>,
      <abs ABSG = 1 
       data hash MD5: 32K
       D7 77 0B 7C 0C 71 BC 9D A2 8F 05 D3 C5 19 D1 7F>)
(   5,<2016-04-30 20:08:05.661 -0700>,<Administrator>,<X>,<proc1d>,<TOPSPIN 2.1>,
      <abs ABSG = 2 
       data hash MD5: 32K
       10 46 89 EA EB A3 E1 D9 B6 BF DA 3B CF EB 02 D5>)
(   6,<2016-04-30 20:08:05.739 -0700>,<Administrator>,<X>,<proc1d>,<TOPSPIN 2.1>,
      <abs ABSG = 3 
       data hash MD5: 32K
       82 BD 79 7B 45 73 CD 69 5C 1F 5D 4D 75 09 36 D9>)
(   7,<2016-04-30 20:08:05.786 -0700>,<Administrator>,<X>,<proc1d>,<TOPSPIN 2.1>,
      <abs ABSG = 4 
       data hash MD5: 32K
       DC 6E 0C 70 0F D3 03 CB 1D EA E1 8A 7D DC 79 5A>)
(   8,<2016-04-30 20:08:05.849 -0700>,<Administrator>,<X>,<proc1d>,<TOPSPIN 2.1>,
      <abs ABSG = 5 
       data hash MD5: 32K
       C6 DD 47 7B BB 1D FA 16 42 40 FC C0 FF EC 28 67>)
$$ ##END=
$$ 
$$ $$ hash MD5
$$ $$ 19 A0 E7 7D 85 7A 33 EB 59 3F B4 9B CA 03 D2 AB
##$RELAX= 
##$RELAX= 
##$RELAX= 
##$RELAX= 
##$RELAX= 
##$RELAX= 
##$RELAX= 
$$ Bruker specific parameters
$$ --------------------------
##$DU= <E:\>
##$EXPNO= 10
$$ [...]
150 150 150 150 150 150 150 150
##$TP07= 0
##$TPNAME0= <>
##$TPNAME1= <>
##$TPNAME2= <>
##$TPNAME3= <>
##$TPNAME4= <>
##$TPNAME5= <>
##$TPNAME6= <>
##$TPNAME7= <>
##$TPOAL= (0..7)
0.5 0.5 0.5 0.5 0.5 0.5 0.5 0.5
##$TPOFFS= (0..7)
0 0 0 0 0 0 0 0
##$TUNHIN= 0
##$TUNHOUT= 0
##$TUNXOUT= 0
##$USERA1= <user>
##$USERA2= <user>
##$USERA3= <user>
##$USERA4= <user>
##$USERA5= <user>
##$V9= 5
##$VALIST= <valist>
##$VCLIST= <CCCCCCCCCCCCCCC>
##$VD= 0
##$VDLIST= <DDDDDDDDDDDDDDD>
##$VPLIST= <PPPPPPPPPPPPPPP>
##$VTLIST= <TTTTTTTTTTTTTTT>
##$WBST= 2048
##$WBSW= 25
##$XGAIN= (0..3)
0 0 0 0
##$XL= 0
##$YL= 0
##$YMAX_a= 576248
##$YMIN_a= -483215
##$ZGOPTNS= <>
##$ZL1= 120
##$ZL2= 120
##$ZL3= 120
##$ZL4= 120
##$ABSF1= 14.98509
##$ABSF2= -5.573092
##$ABSG= 5
##$ABSL= 3
##$ALPHA= 0
##$AQORDER= 0
##$ASSFAC= 0
##$ASSFACI= 0
##$ASSFACX= 0
##$ASSWID= 0
##$AUNMP= <proc_prof1d_extract_pilot.lims>
##$AXLEFT= 0
##$AXNAME= <>
##$AXNUC= <1H>
##$AXRIGHT= 0
##$AXTYPE= 0
##$AXUNIT= <>
##$AZFE= 0.1
##$AZFW= 0.1
##$BCFW= 0
##$BC_mod= 0
##$BYTORDP= 0
##$COROFFS= 0
##$CY= 15
##$DATMOD= 1
##$DC= 0
##$DFILT= <>
##$DTYPP= 0
##$F1P= 0
##$F2P= 0
##$FCOR= 0.5
##$FTSIZE= 32768
##$FT_mod= 6
##$GAMMA= 0
##$GB= 0
##$INTBC= 1
##$INTSCL= 1
##$ISEN= 128
##$LB= 0
##$LEV0= 0
##$LPBIN= 0
##$MAXI= 10000
##$MC2= 0
##$MEAN= 0
##$ME_mod= 0
##$MI= 0
##$NCOEF= 0
##$NC_proc= -8
##$NLEV= 6
##$NOISF1= 0
##$NOISF2= 0
##$NSP= 0
##$NTH_PI= 0
##$NZP= 0
##$OFFSET= 14.98509
##$PC= 1
##$PHC0= 91.66992
##$PHC1= 0
##$PH_mod= 1
##$PKNL= yes
##$PPARMOD= 0
##$PPDIAG= 0
##$PPIPTYP= 0
##$PPMPNUM= 2147483647
##$PPRESOL= 1
##$PSCAL= 4
##$PSIGN= 0
##$PYNMP= <proc.py>
##$REVERSE= no
##$SF= 400.02
##$SI= 32768
##$SIGF1= 0
##$SIGF2= 0
##$SINO= 400
##$SIOLD= 32768
##$SPECTYP= <>
##$SREGLST= <1H.CDCl3>
##$SSB= 0
##$STSI= 32768
##$STSR= 0
##$SW_p= 8223.68421052631
##$SYMM= 0
##$S_DEV= 0
##$TDeff= 65536
##$TDoff= 0
##$TI= <>
##$TILT= no
##$TM1= 0
##$TM2= 0
##$TOPLEV= 0
##$USERP1= <user>
##$USERP2= <user>
##$USERP3= <user>
##$USERP4= <user>
##$USERP5= <user>
##$WDW= 1
##$XDIM= 32768
##$YMAX_p= 437803170
##$YMIN_p= -695196
##$CURPLOT= <Network HP LaserJet P1505>
##$CURPRIN= <$Network HP LaserJet P1505>
##$DFORMAT= <normdp>
##$LAYOUT= <+/1D_H.xwp>
##$LFORMAT= <normlp>
##$PFORMAT= <normpl>
##$SURQMSG= 1
$$ End of Bruker specific parameters
$$ ---------------------------------
##NTUPLES= NMR SPECTRUM
##VAR_NAME=  FREQUENCY,     SPECTRUM/REAL,   SPECTRUM/IMAG
##SYMBOL=    X,             R,               I
##VAR_TYPE=  INDEPENDENT,   DEPENDENT,       DEPENDENT
##VAR_FORM=  AFFN,          ASDF,            ASDF
##VAR_DIM=   32768,         32768,           32768
##UNITS=     HZ,            ARBITRARY UNITS, ARBITRARY UNITS
##FACTOR=    0.250966925370066, 1,           1
##FIRST=     8223.43324360094, -111884,      -46999
##LAST=      0,             -203870,         -186459
##MIN=       0,             -695196,         0
##MAX=       8223.43324360094, 437803170,    0
$$ Real data points
##PAGE= N=1
##DATA TABLE= (X++(R..R)), XYDATA
$$ [...]
19475a70229g3895I9993a01268I7693B6174K1514J0292b40609A337h9333c6639
19463a87193p439G12b36405a916l12752m1642J40584B9883i3901C8380K29960
19452B68340m9722f1499q1337n5676P9806I877L5753K703A251a61621E392i9041
19439E8049a01478m4790k19864d5852j77928G5167d67054a20313a8211l7620m4137
19428i9968B18931a40319O9333A070M7595a12401j3646A07375J23690O2974c30710
19416a88996r984k3176P3705a6146k5094j01139A09522n4629A2458J72375b29727
19404C7760Q4285L9504a39216M1117D0739J47320H9331a34976j1228N1646K1118
19393g3440I1747a78496h2841G823a99816H6721d11126J65768f5690A48162l4705
$$ y = [-170229, -73895, 99993, -101268, 97693, 26174, 47688, 57980, -240609, 1337, -89333, -36639, -187193, -194632, 712, -236405, -1916, -314668, -356310, -215726, 29883, -93901, 38380, 268340, 218618, -61499, -142836, -198512, -118706, 9877, 45630, 48333, 1251, -161621, 5392, -99041, 58049, -101478, -146268, -366132, -45852, -223780, 75167, -467054, -120313, -18211, -55831, -99968, 218931, -140319, -70986, 1070, 48665, -112401, -126047, 107375, 231065, 294039, -330710, -188996, -198980, -222156, -148451, -16146, -41240, -142379, 109522, 54893, 12458, 184833, -229727, 37760, 122045, 161549, -139216, -98099, 40739, 188059, 89331, -134976, -146204, -94558, -73440, 91747, -178496, -82841, 7823, -199816, 86721, -411126, -245358, -65690, 148162, 113457]
19382A13457c71149a64437G4266a24746B88580a7009j1418k86316a11719C3826
19371H4903a47681L5202D337c9609j57647A64561d6276l83015q8708A45422N2502
19360A97924b70905D8118d1716j15075A89607b10101I0926i8335k70601D4815
19349A18839f4836Q141j24872j88270E117J55469c5197k72755C0781K5966c4844
19337a66013A55567a8995n7588I7501c86202f1351K8269A36278k1108h9954d1354
19325g0591k88473h3253j20973P9327M3615A69392h1697n2856f3471J444j15205
19314a77232l3226P2129A48014J39735a63041l0055E7539a44623C12359B4594
19303A13558b98507a22752k45666D0026i9604j13150M8797N4022L2956o9718m3902
$$ y = [113457, -371149, -164437, 74266, -124746, 288580, -17009, -28427, -314743, -111719, 33826, 84903, -147681, -112479, 4337, -39609, -197256, 164561, -46276, -429291, -517999, 145422, 197924, -270905, 48118, -41716, -156791, 189607, -210101, 90926, -98335, -368936, 44815, 118839, -64836, -56695, -181567, -369837, 5117, 160586, -35197, -307952, 30781, 56747, -34844, -166013, 155567, -18995, -76583, 97501, -386202, -61351, -33082, 136278, 115170, -89954, -41354, -70591, -359064, -83253, -204226, -124899, -81284, 169392, -81697, -134553, -63471, -62027, -177232, -210458, -138329, 148014, 287749, -163041, -193096, 57539, -144623, 312359, 24594, 113558, -298507, -122752, -368418, 40026, -99604, -212754, -163957, -109935, -76979, -146697, -190599]
19292a90599k25280J37079B7163a339j74373B979b128k88228A60641o8701J26863
19281B18803k4235b97288B46984a8872k141l55706J67284N3484K2359A87455a64522
19269d0675D6396c53702c997D1277a08943A5620K5324Q2500d4840B1476b61446
19257b76778q4784a3576n8674j28762k5218E1952d1289A16260h3081D7356a44562
19245A78541B9316J51488b54307f0073j11384B1617O8034h4262r4316j44908A11473
19233b62717H0251b51301D5220J88399a36054C2338a63600M0519p4187k22680
19223d19948a88691A07041J09994A5287a08140p0123C8392b21445o0226J22298
19213a59373F2599b27077b0599E4024b95907c7141F9238c51037a1868j28659l3874
$$ y = [-190599, -415879, -278800, 27163, -1339, -175712, 2979, -2128, -290356, 160641, 91940, 218803, 194568, -297288, 246984, -18872, -21013, -376719, -209435, -155951, -133592, 187455, -164522, -40675, 46396, -353702, -3997, 41277, -108943, 15620, 40944, 123444, -44840, 21476, -261446, -276778, -361562, -13576, -72250, -201012, -226230, 51952, -41289, 116260, -83081, 47356, -144562, 178541, 29316, 180804, -254307, -60073, -171457, 21617, 89651, -84262, -178578, -323486, 111473, -262717, 80251, -251301, 45220, 233619, -136054, 32338, -163600, -123081, -197268, -419948, -188691, 107041, 217035, 15287, -108140, -178263, 38392, -221445, -281671, -159373, 62599, -227077, -20599, 54024, -295907, -37141, 69238, -351037, -11868, -140527, -174401]
19202a74401e1432E6501k0332a60250C0444b60164c6087m7549j75297m6106f1566
19190g7500n6973H36e02056K41082D1032a4963B8300a6233p3580A97854c57987
19178a77492o2645B50814f3619a0178p9564L4224k38905A5738a47616E1180K56914
19167C08094D3241J90551H3232e3578j44900o087Q3303B46239A07737a21075I7583
19155C8383b31086A49122N0803q4015l179L0123F8556R492a6627A7839i3013n9479
19143a52492F1680i3078o0709e1832j80272b3066k4491j5838l1122A900c8344
19131F4820J6566J31015A6148M1506J87726a66082k0906m0122A07585P4871R7664
19120B80120b48167e4647B14160j04402g4789a9449k59065A79202b33071E7507
$$ y = [-174401, -51432, 56501, 36169, -160250, 30444, -260164, -36087, -83636, -258933, -305039, -61566, -77500, -134473, 836, -502056, -260974, 41032, -14963, 28300, -16233, -89813, 197854, -357987, -177492, -240137, 250814, -63619, -10178, -89742, -55518, -294423, 15738, -147616, 51180, 308094, 43241, 233792, 83232, -53578, -198478, -204565, -121262, 246239, 107737, -121075, 97583, 38383, -231086, 149122, 199925, 115910, 112731, 142854, 68556, 78048, -16627, 17839, -93013, -152492, 61680, -93078, -153787, -51832, -232104, -23066, -47557, -63395, -94517, 1900, -38344, 64820, 81386, 212401, 16148, 57654, 245380, -166082, -186988, -227110, 107585, 182456, 280120, -248167, -54647, 214160, 109758, -74789, -19449, -278514, 179202, -233071, 57507]
19109A11157e2233q785B9658j3074h0728I6026B2533d31555B0779b74365c1765
19097F8546b0672k24045p6936e0203A30440m1796g445j74934M5210k1047A03167
19085f748j55727p5149K7803P9932o6602J4624l1253A83254h7771A89194L4058
19074B23252dA24560c6334J0968j3701j33478K4896A1777i7135A23644c27013
19062a53044k6422l4551C11681a84857E917a50262F2950b59534i8359l5515G5017
19050a66796A25560b83458B06022A5990b02402C4967g1990A25923b22211d6495
19039a56802b8263A23747E6948a50352C1682i9304A31775L18244A46199M5039
19029A91238a90160e4247j41026A8442K653L15979f6274j42434B24070a25873
$$ y = [111157, -52233, -61018, 29658, 16584, -80728, 96026, 22533, -431555, 20779, -274365, -31765, 68546, -20672, -244717, -321653, -50203, 130440, 88644, -7445, -182379, -137169, -158216, 103167, -6748, -162475, -237624, -209821, -129889, -196491, -181867, -213120, 183254, -87771, 189194, 223252, -4, 124560, -36334, -25366, -39067, -172545, -147649, 11777, -97135, 123644, -327013, -153044, -179466, -214017, 311681, -184857, 5917, -150262, 62950, -259534, -98359, -133874, 75017, -166796, 125560, -283458, 206022, 15990, -202402, 34967, -71990, 125923, -222211, -46495, -156802, -28263, 123747, 56948, -150352, 31682, -99304, 131775, 450019, 146199, 191238, -190160, -54247, -195273, 18442, 21095, 337074, -66274, -208708, 224070, -125873]
19018h9857d3111A589R4072R5660n0937l5788a55186n6098e5220j4138A12972
19006D8128L8468a67309g9074E3839B2075i1532H9718a2943E9118h2174o5761
18995a47935g0629G2362e0655j40535L0323C35590e07688f6335a3299H434N8993
18984F7427M4181c180A95547a12055L1649k5270b3788H7348k2798a82499D46216
18972B78262J94860k19006A11031J08818B685b28514l0458N1110A94611p1337
18962A23274l5592a58763n923B70718J9371m325a93243j8095A7576b06411j07292
18951c13703e1998k5778p8600k99421O6080J37264I7343a097F0878k1506Q5301
18940A24673B6643c33780C93125A0010b15978R7623B1443J1546d7571j39049M3825
$$ y = [-89857, -43111, 1589, 95661, 191321, 140384, 104596, -155186, -211284, -55220, -69358, 112972, 48128, 86596, -167309, -79074, 53839, 22075, -91532, 89718, -12943, 59118, -82174, -147935, -70629, 72362, -50655, -191190, -160867, 335590, -507688, -66335, -13299, 8434, 67427, 111608, -3180, 195547, -112055, -80406, -105676, -23788, 87348, 64550, -182499, 446216, 278262, 473122, 254116, 111031, 219849, 2685, -228514, -258972, -207862, 194611, 123274, 87682, -158763, -164686, 270718, 290089, 285764, -193243, -211338, 17576, -206411, -313703, -51998, -77776, -156376, -455797, -389717, -252453, 97343, -1097, 60878, 39372, 124673, 26643, -333780, 393125, 10010, -215978, -118355, 21443, 32989, -47571, -186620, -142795]
18929a42795f7582j46425b634A72539n3568j0435b2316k26360J20454j0998l67128
18918e06348B211e7294j7689j4652A23803C1456A1498K50237A02295J79372j22399
18907A59268A6601b60663k13393f9061j08761A14819C0909f5314K1510a6236D6501
18895c0816q5439A52839b51797d044B8465Q8117b35489f6350r3948b8979k35133
18884b64112b2952k83868g4902h451q1368K4632A79246a37589N6755G7493a68600
18872b5178p6900c2242k54567M8795A23340f0841m37936J42047a03588M5092F738
18860e74569I8175P2892p9275A8225g090l2851A22928a08873j14831a7615r9053
18849a16668M2719A94719i152q3354C42358A14295a92485A62221e1055G5944e8724
$$ y = [-142795, -67582, -214007, -2634, 172539, 118971, 108536, -22316, -248676, -128222, -139220, -506348, 2211, -57294, -74983, -89635, 123803, 31456, 11498, 261735, 102295, 281667, 159268, 16601, -260663, -474056, -69061, -177822, 114819, 30909, -65314, -43804, -16236, 46501, -30816, -116255, 152839, -251797, -4044, 28465, 116582, -235489, -66350, -160298, -28979, -264112, -22952, -306820, -74902, -8451, -89819, -65187, 179246, -137589, -80834, 77493, -168600, -25178, -102078, -32242, -286809, -238014, 123340, -60841, -498777, -356730, -103588, -58496, 6738, -574569, 98175, 171067, 91792, 18225, -7090, -39941, 122928, -108873, -223704, -17615, -116668, -73949, 194719, -9152, -92506, 342358, 114295, -192485, 162221, -51055, 75944, -58724]
18837b06312C4614K0651h273q469r917A78636a37534C05924b41749F8834d8491
18825b01783H7550d6868J0452A123d6705C4890e6444q9006a0637j2355G3798a71396
18812B1151G118K81638a22896C5718c36502A30696R693m5361h2787c1489j2283
18801d3772C14514a49017A90895a63166L0340M4269A957b65342B97796j04967
18791A92829E7555a06491p5181B67824j07659a43749B43890b39842d0977B51103
18780B00339b82602A8150J680m362b20265p9684a46665m3555A41279E0485J43233
18769A93718q5993N7105c9067k15611R0415L5058j66451J43981I4527a67986A37818
18757b60431B27874c24042a00898C494b58228f3868J8213p0224C3701d30434f8760
$$ y = [-206312, 34614, 55265, -8273, -16742, -26659, 178636, -137534, 305924, -241749, 68834, -48491, -201783, 87550, -46868, -36416, 1123, -46705, 34890, -56444, -145450, -10637, -22992, 73798, -171396, 21151, 7118, 288756, -122896, 35718, -336502, 130696, 140389, 95028, -82787, -31489, -43772, 314514, -149017, 190895, -163166, -132826, -88557, 1957, -265342, 297796, 192829, 57555, -106491, -181672, 267824, 160165, -143749, 243890, -239842, -40977, 251103, 200339, -282602, 18150, 19830, 15468, -220265, -299949, -146665, -190220, 141279, 50485, 193718, 107725, 164830, -39067, -254678, -164263, -129205, -295656, -151675, 94527, -167986, 137818, -260431, 227874, -324042, -100898, 3494, -258228, -63868, -45655, -115879, 33701, -430434, -68760]
18745a93068p2084J24731D5432C845b02814O6550j3833A37677E7917K3458f4369
18733a40092F5214K7577R418L6827a60035M159q901I4662m6632g3309a6531C24954
18720a53267A36221e3368j5715j2452A25358C263c1734j15842B07289r7220J9972
18709A30041a15851l7700H494a15169m6535E8655k5391c3825j9786A276a50278
18697a39541A25952h9779A12212c38409h9855j72618M8411H3722b10238I4479
18686e6677a6714A57697a32429g922j1684G7740a13217H9821N5838c6339j14675
18675a51014j8497k2751c9371h141m3278q1088O3849j09769L5435C6404j0805
18664B5599J04008d0084j42656O9595B4912c6454r8402b1719l5689a632k34388
$$ y = [-193068, -265152, -140421, 45432, 3845, -202814, -136264, -150097, 137677, 57917, 81375, -64369, -140092, 65214, 92791, 102209, 139036, -160035, -155876, -164777, 94662, 48030, -73309, -16531, 324954, -153267, 136221, -53368, -69083, -81535, 125358, 3263, -31734, -147576, 207289, 110069, 130041, -115851, -153551, 8494, -115169, -161704, 58655, 33264, -33825, -53611, 1276, -150278, -139541, 125952, -89779, 112212, -338409, -89855, -262473, -214062, 83722, -210238, 94479, -56677, -16714, 157697, -132429, -7922, -19606, 77740, -113217, 89821, 145659, -36339, -151014, -169511, -192262, -39371, -8141, -51419, -132507, -68658, -178427, -142992, 36404, 25599, 129607, -40084, -182740, -113145, 24912, -36454, -134856, -21719, -57408, -1632, -236020]
18653b36020A71442B6375J08132b39177J11541N6295q8102E3180a41790A4188
18642b06832A90830F396K78550a42651D1878a21833D9768O9120a2446n904O25
18631a7725j46210H231d5468H017b03716e5735G180i2324j60852k599A06216a29875
18618A73128a21747d9666o4400C6823a93059n1656H7690j8413h955j02312j9393
18607a30660A43482I733d85836A27477G868i3067j4897A12918a3375J988m01175
18596d12562J09019q5767a43323j34536K5884c0335j29411K912h386j45697d0518
18584H687O706c83275g3246k34688J05660O9949M2394B0602a5270k61665J26839
18573a50096J1728m120J2789B04509J8605b67479B58025a81568A77660c1810j0854
$$ y = [-236020, 171442, 26375, 134507, -239177, -127636, -71341, -159443, 53180, -141790, 14188, -206832, 190830, 6396, 284946, -142651, 41878, -121833, 49768, 118888, -12446, -18350, -17725, -163935, 8231, -45468, 8017, -203716, -55735, 7180, -92324, -253176, -255775, 106216, -129875, 173128, -121747, -49666, -114066, 36823, -193059, -244715, 87690, 69277, -8955, -111267, -130660, 143482, 9733, -485836, 127477, 7868, -93067, -107964, 112918, -13375, -11387, -412562, -303543, -389310, -143323, -277859, -251975, -30335, -159746, -156834, -8386, -154083, -40518, 8687, 15393, -383275, -73246, -307934, -202274, -132325, -89931, 20602, -15270, -276935, -150096, -138368, -142488, -129699, 204509, 223114, -267479, 258025, -181568, 177660, -31810, -42664]
18562d2664m9805A9367P8676a40402c6143D9194e986C4098i0647n707l5901l6346
18550a68601e6120o5935B3784c9640m8368B43053i9790G0524J31127F529J77773
18539A84302d9353k322n7417j13894b7453A4451a61538e0881A17743d9377A86450
18527g7258H1140J25408q0348a44888l04516C35921a03876j31245B73195A22117
18516a20410K3761D0613b53617F3465P7768h1102B44952a41574e4105p3424L3956
18505i3573A30774E5339D320a55985G817i5669j64667D3555i3298A95096l6783
18494A58313a34437H8428a39363B74831c0123P349R013m4481k28910A7630b6693
18482b14764g9817C9425b84995A88631a85781b7288j66296B11734G2452a43594
$$ y = [-42664, -92469, 19367, 98043, -140402, -36143, 49194, -5986, 34098, -90647, -96354, -132255, -168601, -56120, -122055, 23784, -39640, -88008, 243053, -99790, 70524, 201651, 6529, 184302, -49353, -51675, -109092, -222986, -27453, 14451, -161538, -50881, 117743, -49377, 186450, -77258, 81140, 206548, 126200, -144888, -449404, 335921, -103876, -235121, 273195, 122117, -120410, -96649, 40613, -253617, 63465, 141233, -81102, 244952, -141574, -54105, -127529, -93573, 130774, 55339, 4320, -155985, 7817, -95669, -260336, 43555, -93298, 195096, 158313, -134437, 88428, -139363, 274831, -30123, -22774, -13761, -58242, -287152, 17630, -26693, -214764, -79817, 39425, -284995, 188631, -185781, -27288, -193584, 211734, 72452, -143594]
18471C24037b3864k34489A86493m8996E6391b38865J6371g745j49255D38798G5869
18459a82716q4619L7431d5714j18216c9971C2067K06983F4247J22714r0914J03370
18448A99417o6258b430D488M5726K85627i1741p3230m821g860j24555c8628q3901
18436a22529A33126a87466e1416A07772a05901p4998C221J17946l1848c24588
18425a21916j7289L5525B98240c6660I0821j1197f6043I5002b80452B18136Q4112
18414C02248e2369a3836k64987J04761H0983c4556j81942J07539D1008J63298
18404B04306h6963a4681C6339O6266C9464a81678A24667i5426L920r2335K6186
18393a57655C4836a91532B2797J95859L8274C2451a25482l13138c6931j79325
$$ y = [324037, -23864, -258353, 186493, 137497, 56391, -238865, -222494, -7745, -157000, 438798, 75869, -182716, -267335, -229904, -45714, -163930, -39971, 32067, 239050, 64247, 186961, 96047, 199417, 133159, -2430, 4488, 50214, 335841, -91741, -164971, -169792, -7860, -132415, -38628, -122529, 133126, -187466, -51416, 107772, -105901, -180899, 3221, 121167, 89319, -324588, -121916, -139205, -103680, 298240, -36660, 90821, 79624, -66043, 95002, -280452, 218136, 302248, -52369, -13836, -278823, -174062, 80983, -34556, -216498, -108959, 41008, 204306, -86963, -14681, 36339, 102605, 39464, -181678, 124667, -95426, -91506, -183841, -157655, 34836, -191532, 22797, 218656, 256930, 32451, -125482, -438620, -36931, -216256]
18383b16256D095J25806N5707a68685d1244j12984C52817j55427f1780n0882H4788
18371f9551A50702a89729e8167H107N4067J41794e351A62912b60070a29653a035
18359g1281p1165e9117k2323n5730l88447H1492C7300b27816A64345f2972k6216
18348h9188l86884g7111G6349j5037a24499d9457k07818d7524j87739A98363a13912
18336B9308a56887A47526k7168j9907b58374P74a14924N0800F0052h3566a245
18324g7564D3821J76803c23363e2804H2340b24796J01975C5020e0662k0112B33650
18312b78406J6968g4452j6299j40097C53560a0083A48657E4664f9815K0793j53949
18301b02971A45622e625k67081d4120B86524J25287a11178k09510o4605B16732
$$ y = [-216256, 4095, 129901, 185608, -168685, -41244, -154228, 352817, 197390, -61780, -112662, 84788, -69551, 150702, -189729, -58167, 8107, 62174, 203968, -5351, 162912, -260070, -129653, -1035, -71281, -142446, -59117, -81440, -137170, -525617, 81492, 37300, -227816, 164345, -62972, -89188, -476072, -77111, 76349, 61312, -124499, -49457, -257275, -47524, -235263, 198363, -113912, 29308, -156887, 147526, 120358, 100451, -258374, -257600, -114924, -64124, 60052, -83566, -1245, -77564, 43821, 220624, -323363, -52804, 82340, -224796, -122821, 35020, -50662, -70774, 233650, -278406, -261438, -74452, -90751, -230848, 353560, -10083, 148657, 54664, -69815, -49022, -202971, 145622, -5625, -272706, -44120, 286524, 411811, -111178, -320688, -385293, 216732]
18290D8262b08744e0771a4791A7840f0952E0472J07945o900J03758a65432B9276
18278G6448e0054q7212A6056M6150K12549A28329L3956l5933J26974A1208L29551
18267C40759B5224N0548K90710a10034B6290b58309j92138a26750l0888j2818
18257a70456f0771k31187a07297A93394G0759e5230j14072h0536a3853A02999
18246A7260f1629k31250H9202b93553a43113N9514D03700C523O1954M1775K81653
18235C88905A48843h5474j38003H3069b78311G1608j4427a36457L4246B60870
18224c82124a88660h3037f748j37890G913a2139A98609h7185H2596a62389A3618
18212G8925Q4362a64672B47416c56586A70679b60382A5070M3548A303a24754K8601
$$ y = [48262, -208744, -50771, -14791, 17840, -60952, 50472, 158417, 151517, 255275, -165432, 29276, 76448, -50054, -137266, 16056, 62206, 274755, 128329, 162285, 126352, 253326, 11208, 340759, 25224, 75772, 366482, -110034, 26290, -258309, -450447, -126750, -157638, -170456, -60771, -291958, -107297, 193394, 70759, -55230, -169302, -80536, -13853, 102999, 17260, -61629, -292879, 89202, -293553, -143113, -83599, 403700, 3523, 65477, 107252, 388905, 148843, -85474, -223477, 83069, -278311, 71608, 57181, -136457, -102211, 260870, -382124, -188660, -83037, -6748, -144638, 7913, -12139, 198609, -87185, 82596, -162389, 13618, 78925, 163287, -164672, 247416, -356586, 170679, -260382, 15070, 58618, 1303, -124754, -96153]
18201i6153j72666E1621a28926m4559A7215a6598j15738I5651B2084c66186d8728
18189c2801H173D53R5738k6833J427b50354A54327a38384A0185K5808L8399k9263
18177D5129J81671a18969k13079J52839r9897a29566M1990L7981b3009j05001
18167a28010N7057B96194b761j91406r7741B9626J65976d7290A54570R9807A04167
18155a91671f4405B17535a01264A63276A6270b42331J20584C5757a31171F4447
18144A54810D0455a72841C4748e3297n1754A76593a42857c9404F1889a37149j2595
18133a49744A29939a74106A77590L6352b1909j81271P8786C7893a29777J4457
18123a15320A51335e0720n0898E4977c56419e2291j71932D3636J77957a65876
$$ y = [-96153, -268819, 51621, -128926, -173485, 17215, -16598, -132336, 95651, 22084, -366186, -48728, -32801, 8173, 453, 96191, 69358, 70785, -250354, 154327, -138384, 10185, 35993, 74392, 45129, 226800, -118969, -332048, -179209, -279106, -129566, -87576, -49595, -23009, -128010, -70953, 296194, -2761, -194167, -291908, 29626, 195602, -47290, 154570, 254377, 104167, -191671, -64405, 217535, -101264, 163276, 16270, -242331, -121747, 35757, -131171, 64447, 154810, 40455, -172841, 34748, -53297, -105051, 176593, -142857, -39404, 61889, -137149, -149744, 129939, -174106, 177590, 213942, -21909, -203180, -124394, 37893, -129777, -115320, 151335, -50720, -101618, 54977, -356419, -52291, -224223, 43636, 221593, -165876]
18112f9208n8694B28117r4868B3893c5418I539b1954k27247a16753j13624J11841
18101a18536N931A56118f8785A65371E8762b53240m5851A56931e2295c6j33367
18090a33403p9565A3951M10383a58525O6559F7318M3568f0077a5261A11158a00886
18078D2010J6675O8937j8134i3158J0084c0025q4948A04776b26743H6829g899
18066c61024a5149o2582A42584i1388r064m8127E3085a24967k8602K2733a8943
18054A31414g925A24844k1248a42103m455A51724J08429b45393C95160e4297C03279
18042H9266L6130J81894L5679c8392j41857c239B20890f1839j08702d4431B97189
18030I8968g8901A77500E4506b04720K5467C83716a43258b3424j42654O4444o3390
$$ y = [-69208, -127902, 228117, 133249, 23893, -35418, 9539, -21954, -249201, -116753, -230377, -118536, -112605, 156118, -68785, 165371, 58762, -253240, -299091, 156931, -52295, -36, -133403, -212968, 13951, 424334, -158525, -91966, 67318, 110886, -60077, -15261, 111158, -100886, 42010, 58685, 127622, 109488, -93158, -83074, -30025, -114973, 104776, -226743, 86829, -7899, -361024, -15149, -77731, 142584, -91388, -100452, -148579, 53085, -124967, -153569, -130836, -18943, 131414, -7925, 124844, 103596, -142103, -146558, 151724, 260153, -245393, 395160, -54297, 303279, 89266, 125396, 307290, 342969, -38392, -180249, -3239, 220890, -61839, -170541, -44431, 297189, 98968, -78901, 177500, 54506, -204720, -179253, 383716, -143258, -23424, -166078, -101634, -165024]
18019a65024O5026D62289b70311A36615J67475J4335a58235E2322N1931a08142
18008a00410C53284c3717E1062f174B78300A17196a40498F128b45401D691J23608
17997A28299a41977A97427b42386A56704g3176I6185c7037E80191j72806G3296
17986g7477A21961b33349G6575R929K42098b71429b9707D0337c62196c5655A9882
17974a79027l1466F8198K47687b7509A62006f8346k83173J1636M503A23924h79
17962g6084A66774C9966e1662B66254A10148J39820b01755j72240A55244a16842
17951d1355J849j20476d0886C12885d5441A43291c03127D9184c9486A2895K49149
17940B62044a13237j7505G0244J05296n1620a57477g6720B32575a18337d3642
$$ y = [-165024, -99998, 462289, -270311, 136615, 304090, 318425, -158235, 52322, 104253, -108142, -100410, 353284, -33717, 51062, -6174, 278300, 117196, -140498, 6128, -245401, 4691, 128299, -141977, 197427, -242386, 156704, -73176, 96185, -37037, 580191, 407385, 73296, -77477, 121961, -233349, 76575, 86504, 328602, -271429, -29707, 40337, -362196, -35655, 19882, -179027, -210493, 68198, 315885, -27509, 162006, -68346, -351519, -339883, -335380, 123924, -879, -76084, 166774, 39966, -51662, 266254, 110148, 249968, -201755, -373995, 155244, -116842, -41355, -39506, -159982, -40886, 312885, -45441, 143291, -303127, 49184, -39486, 12895, 262044, -113237, -130742, 70244, 175540, 123920, -157477, -76720, 232575, -118337, -43642]
17929b5723D07683D7429N6325a98108C37746I8015K62982A73202c20595i3198
17918A80516a2655k67475h5991A98001I7231g5666A96388a02461M8832J9870C1559
17906G3490a85086B3977J73907C880M5976F224d0553p6066e6219E7740L893f9374
17893B18663I1620A5803a60677k63683D4949c33255A08304a46120D1687k0792
17883B0895b40372k0543b9904j72431G8703G051c65489h928r4648D05962A07950
17871a19995j6565A61043J42998A28158a4772A29372a00826B94641D9164i9195
17860B83074L9478b87907a43319b8177D20855h5078F0591a91899M4685D04198
17849a03675b9189I6520e4004k2084L3804k8910C0341J48831j2332Q1711d647
$$ y = [-25723, 407683, 47429, 103754, -198108, 337746, 98015, 360997, 173202, -320595, -93198, 180516, -12655, -280130, -85991, 198001, 97231, -75666, 196388, -102461, -53629, -33759, 31559, 73490, -185086, 23977, 197884, 3880, 49856, 6224, -40553, -116619, -56219, 57740, 61633, -69374, 218663, 91620, 15803, -160677, -424360, 44949, -333255, 108304, -146120, 41687, 20895, -240372, -260915, -29904, -202335, 78703, 7051, -365489, -8928, -103576, 405962, 107950, -119995, -136560, 161043, 304041, 128158, -14772, 129372, -100826, 294641, 49164, -99195, 283074, 322552, -287907, -143319, -28177, 420855, -85078, 60591, -191899, -147214, 404198, -103675, -29189, 96520, -54004, -76088, -42284, -71194, 30341, 179172, 166840, 248551, -4647]
17837b05588c1262I6071g8631c076m0318A36182a46317A73383m1245n1737J8398
17826I8799D7894Q8052j6430a48294H2043J41060N627c3133q1169A0960J9639
17815C0599J28936b215r4686J1493A79110a3321j24240F2971b36885e337j57096
17804a62433g9553c5436j76147C71366j44323a47006M671C89174d5719p5850A76224
17792A29883c4446J7214n1602k16720F5954a3422B01771A6504L2563K38530f6395
17780b6245B2166i9780k5616A41000J55709a01937C91261b31876D41311a24730
17769a51008D65495b5153A95713A3190l38P533a40581A68502g9629n4552H0502
17757e8734A45152e5831A54680f1751j55142A47905a21208j82333J20755A21176
$$ y = [-205588, -31262, 96071, -78631, -3076, -43394, 136182, -146317, 173383, 132138, 80401, 98799, 47894, 135946, 119516, -148294, 82043, 223103, 228730, -33133, -114302, 10960, 30599, 159535, -2215, -96901, -85408, 179110, -13321, -137561, 62971, -236885, -5337, -162433, -79553, -35436, -211583, 371366, 227043, -147006, -142335, 389174, -45719, -121569, 176224, 129883, -34446, -17232, -68834, -285554, 65954, -13422, 201771, 16504, 49067, 287597, -66395, -26245, 22166, -99780, -125396, 141000, 296709, -101937, 391261, -231876, 441311, -124730, -151008, 465495, -25153, 195713, 13190, 12852, 20385, -140581, 168502, -79629, -134181, 80502, -58734, 145152, -55831, 154680, -61751, -216893, 147905, -121208, -303541, -182786, 121176]
17746A20577c8975A53945k4077P7075j2395J85717D9464j5635J45539N847d452
17734A99543r4575g4309k6396o4407A42721N1985n8666M4298b776B5630K3089
17723D8719L0968l9468j1052M5824b6477E9249i0166A64085C4836L5015e0037
17711A12235Q4351B4180Q7890C3276M6670K35826l1292c99135D16974h3912o4499
17700a48411j2330B79487G0834K32401J87420A88901G060Q215J37412f7431p3316
17689a40747B40683g2564A5799K73391L2738a35008B76074a76132A90339e9640
17678D9230a08242A88064d5119j0048A81905O8731a00217J0624a2152A47274O9672
17667B16946c27467g947H6462k1705b2988E7799a02500B55561d7856j87310O5779
$$ y = [120577, -38975, 153945, 129868, 206943, 194548, 380265, 49464, 33829, 179368, 185215, -4452, 199543, 104968, -74309, -100705, -165112, 142721, 194706, 136040, 180338, -2776, 25630, 48719, 79687, 40219, 29167, 74991, -26477, 59249, -90166, 164085, 34836, 69851, -50037, 112235, 196586, 24180, 112070, 33276, 79946, 315772, 284480, -399135, 416974, -83912, -148411, -160741, 279487, 70834, 303235, 490655, 188901, 7060, 15275, 152687, -67431, -140747, 240683, -72564, 15799, 289190, 321928, -135008, 276074, -176132, 190339, -59640, 49230, -108242, 188064, -45119, -55167, 181905, 250636, -100217, -89593, -12152, 147274, 216946, -327467, -7947, 86462, 64757, -22988, 57799, -102500, 255561, -47856, -235166, -169387]
17656a69387Q929B53270E2295L83885k05529l4246n6644c3574C5186c0703r9533
17645a30236O3260E2940J33019f5819l5755A49540o4733a3424F2376J12507j4359
17634A60524A5699L48040a40180B43574k4030c765A39310C8921J72306a812j3331
17623a5143C33501q7774m627b9989D405a55427f782H1864J96046C8103N692J40062
17611A83857K34196i7920A24142l7346O6783J84731f2646B55520a32801F3118
17600B24763l9649l2906j1910b25597C75476b26457F2120J59143f1380A38264
17589B2112J62614a02996A54163o6950a260C27046a95955B11893K65505G3563
17578a13720A62804n6322K09171O9045O9477C5151P6457g5227E9082Q7372R0204
$$ y = [-169387, -160458, 253270, 52295, 436180, 230651, 196405, 139761, -33574, 35186, -30703, -130236, -66976, 52940, 185959, -65819, -101574, 149540, 84807, -13424, 62376, 174883, 160524, 15699, 363739, -140180, 243574, 219544, -3765, 139310, 38921, 211227, -1812, -15143, 333501, 245727, 241100, -29989, 4405, -155427, -6782, 81864, 277910, 38103, 43795, 183857, 418053, -97920, 124142, 86796, 153579, 338310, -62646, 255520, -132801, 63118, 224763, 185114, 152208, 140298, -225597, 375476, -226457, 62120, 221263, -61380, 138264, 22112, 184726, -102996, 154163, 87213, -1260, 327046, -195955, 211893, 477398, 73563, -113720, 162804, 106482, 315653, 384698, 454175, 35151, 111608, -75227, 59082, 146454, 236658]
17567B36658E7022J43156J4059o3005j0757J0810l3770P608J72098a64743B46846
17555B49337m7361q6508E3228L99100B05945J36882j30961d0891A87002m5619
17545A41383K66617G3010J39370P4838A06954J00085n6322l478F9258Q5837K06702
17534C61797c4376A8162R646K26861A08502K03091J48862A47625J45314q0182
17524B12757N72455l4777j09558K05337B94621N05119C74300J40839A67014L3086
17514B00100R3671L21745k45065M5349k938K73305l01535K52472P7756j79127
17504E35733O3344r3906j34115A0167J68070o4913K59068q6448J5405B56K63071
17493B63327H7024O7647J32328p4505q4207J25723G8016R3313J11673j40518J66636
$$ y = [236658, 57022, 200178, 214237, 151232, 140475, 151285, 117515, 125123, 297221, -164743, 246846, 249337, 201976, 115468, 53228, 452328, 205945, 342827, 211866, -40891, 187002, 141383, 408000, 73010, 212380, 287218, 106954, 207039, 150717, 147239, 69258, 155095, 361797, -34376, 18162, 27808, 254669, 108502, 311593, 460455, 147625, 292939, 212757, 785212, 750435, 640877, 846214, 294621, 799740, 374300, 515139, 167014, 200100, 293771, 615516, 370451, 415800, 412862, 686167, 384632, 637104, 714860, 535733, 599077, 505171, 371056, 10167, 178237, 113324, 372392, 285944, 301349, 256, 263327, 87024, 154671, 286999, 212494, 128287, 254010, 78016, 171329, 283002, 142484, 309120]
17482C09120K41662A70084K06376A72769K24562J83027j63183A34604J59337A34220
17471a5708o6250A82468K24692A86252F8188a45780j37089B11292J25515J32340
17461D69147b58042B90847H6032J48342R6216l0172K13575j88326M3870A24822
17450A27703K61101m5178J55207G7064J31493O0282K35964j59749L2514j44339
17440B33229j09714K80326O0638q5475j85414G4433J41675R379H9625J01427J17453
17429C08505j33565o0799L49337A32263N05664k61602j0359E7099K98594A01860
17418F4122J59882O9530K66277B21567n6110N6354b19644A403P08225l04884A64068
17406B07159I5689K46997G2727L39375A9083a09976a6669B54547A7487J78309
$$ y = [309120, 550782, 170084, 376460, 172769, 397331, 580358, 417175, 134604, 293941, 134220, -15708, -81958, 182468, 407160, 186252, 68188, -145780, -282869, 211292, 336807, 469147, -258042, 290847, 86032, 234374, 330590, 300418, 513993, 325667, 369537, 124822, 127703, 388804, 343626, 498833, 77064, 208557, 268839, 504803, 345054, 377568, 233229, 123515, 403841, 464479, 379004, 193590, 74433, 216108, 225487, 89625, 191052, 308505, 174940, 114141, 463478, 132263, 637927, 376325, 365966, 57099, 355693, 101860, 64122, 224004, 293534, 559811, 221567, 165457, 221811, -219644, 1403, 709628, 404744, 164068, 207159, 95689, 342686, 72727, 412102, 19083, -109976, -16669, 254547, 17487, 195796]
17396A95796M7727j2599M4431F7204J44349h5553B41281I0413K81418a6000A5513
17384B17001N4662K9531G3714J02016C0554K43012A18518J03199H8616J99855
17374B88471Q383J4506O0091L0788j39317L030J35284e1417B33248J1387N0108
17363B94743J26346B760L30215G2902K73793H5073J94298G3935l1298L33605b6577
17351a57350A87940J58077j46681K56260j02427j29660j09830O5148K83346O5663
17341E27836A85098R2312f0154E11536B40960r5059n9878K43943i0161E055K92215
17330B97270D6695K78802j53546J96897A72977J09569L083a0405A85806p368K34947
17319D13385A2265J69290O475p7386L19086j68669r4812l7137J32822j15493n0139
$$ y = [195796, 243523, 230924, 275355, 67204, 211553, -85553, 241281, 90413, 371831, -16000, 15513, 217001, 271663, 301194, 73714, 175730, 30554, 273566, 118518, 221717, 88616, 288471, 296854, 311360, 371451, 402239, 262922, 265952, 401236, -51417, 233248, 244635, 294743, 421089, 2760, 332975, 72902, 346695, 85073, 279371, 73935, 42637, 376242, -26577, -157350, 187940, 346017, 199336, 455596, 353169, 223509, 113679, 178827, 462173, 527836, 185098, 277410, -60154, 511536, 240960, 145901, 86023, 329966, -90161, 5055, 297270, 46695, 325497, 171951, 368848, 172977, 282546, 285629, -10405, 185806, 178438, 413385, 12265, 181555, 188030, 110644, 429730, 261061, 166249, 129112, 261934, 146441, 96302]
17308I6302M8221Q873J19146n4432g4018A21898b1312B79891J24328A77237k5743
17297A51494J03901n582A1459K16566b2396A74409D2792k0197K97380J28445h5592
17285A0005L30574J30967j52858a54486B48518p1803l9164k1231P9295N8689A22820
17273G3124L35453A92732J4951C459N73970B31033P5288K15131k20343J37132
17263D38241G6867J09977J94183A05221Q4910I4697N485L58241B26202J56R5348
17252C21706A43448J51193j20052O4514j70M31608B24717k7021R5182J31538m1418
17241C82998D9101L28497K44071A17183K92317b24721A67460J29216L8211l5611
17231B99276K21218B7807J88878J84272j30442a3700A57746L6326M16033B58847
$$ y = [96302, 144523, 153396, 272542, 218110, -74018, 121898, -21312, 279891, 404219, 177237, 151494, 255395, 249813, 11459, 228025, -22396, 174409, 42792, 22595, 319975, 448420, -85592, 10005, 340579, 471546, 318688, -154486, 248518, 176715, 137551, 116320, 195615, 254304, 122820, 73124, 408577, 192732, 207683, 3459, 577429, 231033, 306321, 521452, 301109, 438241, 76867, 186844, 381027, 105221, 190131, 94697, 100182, 458423, 226202, 226358, 321706, 143448, 294641, 174589, 239103, 238933, 670541, 224717, 197696, 292878, 424416, 382998, 49101, 377598, 621669, 117183, 409500, -224721, 167460, 296676, 334887, 299276, 520494, 27807, 216685, 400957, 270515, -13700, 157746, 194072, 610105, 258847]
17220D21093G8844J69478J00383A05502J59965p6893M92314A88457p4851j9672
17210I3934J25491L47921N6237j99950F4576K11480J14074n7146n6126M0684P1807
17199C89349M5497J16418J32339k74169j52037M0622A00485K35931O7674J88728
17189E92818j55854O0639k22518J82686j52442K8662o6422A16616J26794R7844
17179C41254J65045j88039j15566L42864j10501j69322l3373K26147J73313B05409
17168F05058j39896j63700J42036J46452j73804J43475j36885J26766P1449k51861
17158C69090K19205j39748l9604P7412M3804j25311J05260o2335m4476L03438
17148G06735B79456A15569K53653o6651K08492m962A83789K62310j38831J92012
$$ y = [421093, 78844, 248322, 348705, 105502, 265467, 188574, 680888, 188457, 113606, 93934, 219425, 567346, 623583, 423633, 64576, 276056, 390130, 332984, 276858, 317542, 389349, 434846, 551264, 683603, 409434, 257397, 298019, 100485, 336416, 404090, 592818, 436964, 497603, 275085, 457771, 305329, 333991, 267569, 116616, 243410, 341254, 506299, 318260, 202694, 545558, 435057, 265735, 232362, 458509, 631822, 205409, 605058, 465162, 301462, 443498, 589950, 416146, 559621, 422736, 549502, 620951, 369090, 588295, 448547, 408943, 486355, 530159, 404848, 510108, 447773, 403297, 706735, 279456, 115569, 369222, 302571, 511063, 506101, 183789, 446099, 307268, 499280]
17138D99280q0491j5364J07184A60619K93978j50194L56979C15078n2408J86786
17128D49456J89462B94754R3321J12706j70236M38314l10477N8089B44866N78049
17118H22915C98829K81280B31271j7072R9167L97130p317j71728k20077o725R1038
17107C95687L41718j38230j67751N07371k15693k66059j249Q9343J84845m4914
17097F85068J71190j9938C34303J30681j02931P9272J81968j45338n7197J52231
17087E72989j51517K4346M43279C74887K1487q9186O5120J41628M27924r1251
17077H50609k43339O504j60543K34676P6196K31728j55168l63253L29422k09434
17067E97398K26009k30471k2210K83242n1144j8662K8833j05549k49422M55262
$$ y = [499280, 418789, 403425, 510609, 160619, 454597, 304403, 661382, 315078, 262670, 449456, 638918, 294754, 388075, 500781, 330545, 768859, 458382, 516471, 244866, 822915, 398829, 680109, 231271, 214199, 313366, 710496, 703179, 531451, 311374, 304649, 395687, 737405, 599175, 431424, 938795, 723102, 457043, 455794, 545137, 729982, 685068, 856258, 836320, 334303, 464984, 362053, 441325, 623293, 477955, 420758, 572989, 421472, 445818, 889097, 374887, 396374, 307188, 372308, 513936, 941860, 850609, 607270, 613774, 453231, 687907, 764103, 995831, 840663, 477410, 806832, 597398, 823407, 592936, 570726, 853968, 802824, 784162, 812995, 707446, 458024, 913286]
17057I13286K9312l31753L17670j98485J8494j45429K03794L1285l08961L19383
17047H48596q5756j42950k83317L18937K5823K88197k8594n0040j67950J73738
17037H96684J80877l46626J09139J94649m00067N1851j42884L19281k16108O10980
17027A257776k90567j78448k96843N73545q2940R8096m24166L45236J78506j86805
17017I93390j626M9515L5872q4853j14559J66027k03886L126J20988O3293p5572
17006I51715K08839l09408L00148j64818k65756J80594L0143J71333k08614J43560
16996A037736K91722k84754J25323j78862N21341m57770O4560J28245q6886n0775
16986A109880M86713j95393l07189k74898M93494M526l11614O74250m46838j3902
$$ y = [913286, 942598, 610845, 928515, 730030, 748524, 603095, 806889, 838174, 529213, 848596, 762840, 619890, 336573, 655510, 681333, 969530, 940936, 890896, 722946, 896684, 1077561, 730935, 840074, 1034723, 634656, 686507, 543623, 862904, 646796, 1257776, 967209, 788761, 491918, 1065463, 982523, 1080619, 656453, 1001689, 1180195, 993390, 991764, 1041279, 1077151, 992298, 877739, 1043766, 839880, 843006, 963994, 1027287, 951715, 1160554, 851146, 1151294, 986476, 720720, 901314, 931457, 1102790, 894176, 1037736, 1329458, 1044704, 1170027, 991165, 1512506, 1054736, 1119296, 1247541, 1160655, 1109880, 1596593, 1401200, 1094011, 819113, 1312607, 1317133, 1005519, 1679769, 1232931, 1219029]
16976A219029J27408L9105J0683k0864j7686l0815J24101K91354o21695K56949
16966A377569J67358k76535J33026j42260O0880J69651J64712j05568m10589K47071
16956A385315J92911R3437j34816k66488L56331j51156J99883J39260k23510K6895
16946A618062j08977K85828J92817k29091l03413K31468J73217K523p8912J30621
16936A914143n7224l46313L45669o9098j2445R7353l9312J36997m9054j45571
16926A775145L17484j4985K35235P8619l83249J03250J91704q5912j07035L9489
16916B149745K78362k8031k53421K79447J3650L1861Q6360k01725J46651j08809
16906B394090J15560m2061K55489k24129k25875K23256O7355L89471p0108j36662
$$ y = [1219029, 1346437, 1385542, 1396225, 1375361, 1357675, 1326860, 1450961, 1742315, 1120620, 1377569, 1544927, 1268392, 1401418, 1259158, 1320038, 1489689, 1654401, 1548833, 1138244, 1385315, 1578226, 1671663, 1536847, 1270359, 1626690, 1475534, 1675417, 1814677, 1591167, 1618062, 1509085, 1794913, 1987730, 1758639, 1455226, 1686694, 1859911, 1862434, 1783522, 1914143, 1856919, 1510606, 1856275, 1787177, 1774732, 1872085, 1832773, 1969770, 1920716, 1775145, 2092629, 2077644, 2312879, 2391498, 2008249, 2111499, 2303203, 2217291, 2110256, 2149745, 2428107, 2400076, 2146655, 2426102, 2439752, 2471613, 2557973, 2356248, 2502899, 2394090, 2509650, 2467589, 2723078, 2498949, 2273074, 2496330, 2563685, 2953156, 2883048, 2746386]
16896B746386K8019j55830K57591K17480l44519M60462j35853k7452m6684M84556
16886C484156l36148J05311M89894m76407J0031K17940j77213Q2339r012N5705
16876C446596P4148K4667K94682l15508L66483j05570J69635j92265L13060j42539
16866C933389J28498p0463J38876J21846M4544m4898M48168m3752k50903L77123
16856D782428j58301J92364J94217J85826k57537j58959L79456p7036L32411O4952
16846E479821J20139K63174p2740K4764m0206K89963N6242K27149J51275O0766
16836F560347O6367L11545j65092L51742o3923K75469J66432k39650L90190j2029
16826G641398M07331l13096J41646K56798O47121k44267K25728P1412J7691O36439
$$ y = [2746386, 2774405, 2618575, 2876166, 3093646, 2749127, 3209589, 3073736, 3046284, 2999600, 3484156, 3148008, 3253319, 3743213, 3266806, 3276837, 3494777, 3317564, 3399903, 3390891, 3446596, 3520744, 3545411, 3840093, 3524585, 3891068, 3785498, 3955133, 3762868, 4075928, 3933389, 4061887, 3991424, 4130300, 4252146, 4296690, 4251792, 4699960, 4656208, 4405305, 4782428, 4624127, 4816491, 5010708, 5196534, 4938997, 4780038, 5159494, 5082458, 5414869, 5479821, 5599960, 5863134, 5790394, 5815158, 5774952, 6064915, 6121157, 6348306, 6499581, 6560347, 6626714, 6938259, 6773167, 7124909, 7060986, 7336455, 7502887, 7263237, 7653427, 7641398, 8048729, 7735633, 7877279, 8134077, 8781198, 8536931, 8762659, 8834071, 8851762, 9488201]
16816I488201M37049k674j85169L72178N24457q2296K97859J30700L09058L74364
16806A1663727M1170N95810Q8925J52419N02769K76218L27652J10170N20619L47689
16796A4627168M79567J73916N27989L55548M46773M95230N30737J95194N56127
16787A8388249M68230P51380M68609O80721N08759P45067N61138L25070O20522
16778B3517745P57307R95358N01268Q39974J082409Q37780P16311J133537R40101
16769C1321790P57262J274256R18222J155222J260100R67904J707160J274829
16761D0636745J214275J285301J673982J287775J751474J889125J765057J674081
16753E3177815J942211J899364J580477J954566K406532J825877K098066K340344
$$ y = [9488201, 9925250, 9922576, 9737407, 10109585, 10634042, 10551746, 10849605, 10980305, 11289363, 11663727, 11704897, 12300707, 12389632, 12542051, 13044820, 13321038, 13648690, 13758860, 14279479, 14627168, 15106735, 15280651, 15808640, 16164188, 16610961, 17106191, 17636928, 17832122, 18388249, 18856479, 19607859, 20076468, 20757189, 21265948, 22011015, 22572153, 22897223, 23517745, 24275052, 25270410, 25771678, 26611652, 27694061, 28531841, 29248152, 30381689, 31321790, 32079052, 33353308, 34271530, 35426752, 36686852, 37654756, 39361916, 40636745, 41851020, 43136321, 44810303, 46098078, 47849552, 49738677, 51503734, 53177815, 55120026, 57019390, 58599867, 60554433, 62960965, 64786842, 66884908, 69225252]
16745F9225252K019331K431662K160436K125838K056287K409019J872451K421616
16737H6721892J725713J997814J964093J606931J833057J359198J349317R91997
16729I9550012Q64967L08426N21284N3752k02662J20705q58333r3777j380164
16720I8884210r42561j349849j426262j400857j911648j750456j650242k204401
16712H6247934k234934j942575k281943k109647k436938j721866k612317j975255
16704F8932459j999669k058288k191631j839843k007247k093312j467891k140386
16696E3134192j925344j164264j943236j435565j439722j663622j479203j181740
16688D0901496j257019p86303j545872j230159p88159j216458j306605j036465
$$ y = [69225252, 71244583, 73676245, 75836681, 77962519, 80018806, 82427825, 84300276, 86721892, 88447605, 90445419, 92409512, 94016443, 95849500, 97208698, 98558015, 99550012, 100414979, 100723405, 101244689, 101298441, 101095779, 101216484, 100358151, 100264374, 98884210, 97941649, 96591800, 95165538, 93764681, 91853033, 90102577, 88452335, 86247934, 84013000, 82070425, 79788482, 77678835, 75241897, 73520031, 70907714, 68932459, 66932790, 64874502, 62682871, 60843028, 58835781, 56742469, 55274578, 53134192, 51208848, 50044584, 48101348, 46665783, 45226061, 43562439, 42083236, 40901496, 39644477, 38858174, 37312302, 36082143, 35293984, 34077526, 32770921, 31734456]
16680C1734456q82288n30145j306709o60451j230988k93529p71822o84824r00079
16671B4473621p06145p65419n45443n00951n66533l90487q57921k99889o50201
16662A9190632m33380k31586o32910k70069l06187o91466k68888m30225l36855
16653A5589066k12084k75093j72951r42584k4920o45463O6937k55303n27321k87605
16643A2312679K37609p10270m11768K23790o03717p758j883m26029j83597o3474
16633A0365582K5356r43885L2523l7113j12434N233l94791k61964P2763m01362
16623H349908J79255q7844k71869l79169K85609l35120k51076j61532R5198k82488
16613G140872n9821j80922q7750J58867k04868j21887k23723J64159m17760r815
$$ y = [31734456, 30852168, 30322023, 29015314, 28354863, 27123875, 26830346, 26058524, 25373700, 24473621, 23767476, 23002057, 22456614, 21955663, 21389130, 20998643, 20140722, 19840833, 19190632, 18757252, 18525666, 17892756, 17622687, 17316500, 16625034, 16356146, 15925921, 15589066, 15376982, 15101889, 14928938, 13986354, 13961434, 13315971, 13382908, 13127605, 12600284, 12312679, 12550288, 11840018, 11428250, 11652040, 11048323, 11040565, 11038682, 10612653, 10429056, 10365582, 10390938, 9447053, 9479576, 9442463, 9330029, 9335262, 8940471, 8678507, 8751270, 8349908, 8529163, 8441319, 8169450, 7790281, 8075890, 7740770, 7489694, 7328162, 7423360, 7140872, 7081051, 6900129, 6812379, 6971246, 6766378, 6644491, 6420768, 6584927, 6167167, 6157352]
16603F157352n0898K3969k86867J14292k22472q5590J19368q9447o5651j0656
16593E603400n10014J87761O5232l95271K54053l22517L61126n99332J14998k157
16583D757279q5295k32715j37039L66409l0982o24580M66182j16977J93433l60479
16573D195236j51001J30233j64820L43401n72252N15485k92624k40496R8464l77766
16563C483860K66575m6090n23925L78299q4479P7078p6243P2282r2468l33274
16553C121615K59758R5949j04737j42434O4949k96366L21934M9273L5867l02355
16543C103453l32821K09505K03189j38632j91169j4897K17580K4239j25013l86657
16533B568777m1536M3597l2565L51501l68820J0740K67818k7016L99457n87752
$$ y = [6157352, 6106454, 6130423, 5843556, 5957848, 5735376, 5649786, 5769154, 5679707, 5614056, 5603400, 5093386, 5281147, 5346379, 4951108, 5205161, 4882644, 5243770, 4644438, 4759436, 4757279, 4671984, 4439269, 4302230, 4668639, 4637657, 4013077, 4479259, 4362282, 4555715, 4195236, 4044235, 4174468, 4009648, 4353049, 3780797, 4296282, 4003658, 3763162, 3861626, 3483860, 3750435, 3704345, 3180420, 3558719, 3474240, 3551318, 3475075, 3547357, 3454889, 3121615, 3381373, 3477322, 3372585, 3230151, 3295100, 2998734, 3320668, 3369941, 3405808, 3103453, 2770632, 2980137, 3183326, 3044694, 2853525, 2838628, 3056208, 3080447, 2955434, 2568777, 2527241, 2570838, 2538273, 2889774, 2520954, 2531694, 2799512, 2772496, 3171953, 2584201]
16523B584201J00j78300K82595l7438l59372L06008k6447j26137j65887K04473
16513B483796l9821n0247n6137q4872j9356j76184R03j72939M84980r0389k89800
16502A989934J58953O5783k26030n0860L73535j35458k64542K78428k77399L26100
16492B238444l24107o058j07806L72205r7785j01921J99543l34992K15660r6201
16482A956982J900j4926j42279K27009l76029o1674J02325l17698N05006n2371
16472A828245M0843m04976K05129J60571J60139j63387n4619p0962k21924k56444
16462A222615N75110m92453M24553k78359M3978M1095J03906j24900R7199M54755
16452B067499p17929K51077j85008K62494j66333J05225J12301j68637k80077
$$ y = [2584201, 2584301, 2406001, 2688596, 2651158, 2291786, 2597794, 2571347, 2445210, 2279323, 2483796, 2443975, 2393728, 2337591, 2252719, 2233363, 2057179, 2058082, 1885143, 2370123, 2279734, 1989934, 2148887, 2214670, 1988640, 1937780, 2311315, 2175857, 1911315, 2189743, 1912344, 2238444, 1914337, 1908279, 1800473, 2172678, 2074893, 1972972, 2172515, 1837523, 2053183, 1956982, 1958882, 1943956, 1801677, 2028686, 1652657, 1590983, 1693308, 1375610, 1880616, 1828245, 1869088, 1464112, 1669241, 1829812, 1989951, 1826564, 1771945, 1700983, 1479059, 1222615, 1797725, 1305272, 1729825, 1451466, 1495444, 1536539, 1640445, 1515545, 1612744, 2067499, 1349570, 1600647, 1415639, 1678133, 1511800, 1617025, 1729326, 1560689, 1280612]
16443A280612O9221P0721k91766J11533M48624k19544p0681l80857K80466L34477
16433A632806j10161k68347L28181k03607q3731M02697m03237o6143K62192k28242
16423A262408J85658j35055J59700j81152l1628J7337K00780m43252K75827j87786
16413A122837L57885k33259J06923O7787k97669K04097l71123J77314J71415l56482
16403I49725J56757K16450m72098N22062j34449l19697M06867k23378k71388O07012
16393A437863j39017j3012M8743j88908K32249k81668j19560J79328k42928K39151
16383A152241j7042m981k1168Q11O2203k22375J21421K67041k05173K6913r4429
16372A065462m319K4485r9827k95684O35263j70739q360p1332k4395J41895k03148
$$ y = [1280612, 1349833, 1420554, 1128788, 1240321, 1688945, 1469401, 1398720, 1017863, 1298329, 1632806, 1522645, 1254298, 1582479, 1378872, 1295141, 1697838, 1294601, 1228458, 1490650, 1262408, 1448066, 1313011, 1472711, 1291559, 1259931, 1277268, 1478048, 1034796, 1310623, 1122837, 1480722, 1247463, 1354386, 1422173, 1124504, 1328601, 957478, 1134792, 1306207, 949725, 1106482, 1322932, 850834, 1372896, 1238447, 918750, 1325617, 1102239, 830851, 1437863, 1298846, 1285834, 1334577, 1145669, 1377918, 1096250, 976690, 1156018, 913090, 1152241, 1135199, 1130218, 1109050, 1109861, 1172064, 949689, 1071110, 1338151, 1132978, 1159891, 1065462, 1061143, 1085628, 985801, 690117, 1325380, 1154641, 1146281, 1074949, 1050554, 1192449, 989301]
16361I89301Q8345R1788q5091j36391K44876m17233K95524n900o9330l37583L65660
16350A023966m00274K32842R1726j4608K06678j3217n8527Q6563l36417K66909
16340A085641j46083N0200q7721p5386L51893j47407R662E14752L92730p7330
16330H30152j42921l6640J48686m5619B74160L69763K15938J57622m9167Q4576
16320A052892p1819j60351j48379L39022l26093o3512L94540k14663Q666j22752
16310F87551P6833O2118k30137m1821K30302n2073J65093l27623K14016L668j5937
16299G71990o1635Q7262J08804P7246M482L4854k09913k82670K48563O7073k47369
16288E98687K98088l89203M29189j67825P2250l5051j65497J8644p8562J36063
$$ y = [989301, 1077646, 1169434, 1084343, 947952, 1192828, 775595, 1071119, 1065219, 995889, 658306, 1023966, 623692, 856534, 948260, 933652, 1140330, 1127113, 1068586, 1155149, 818732, 1085641, 939558, 989758, 902037, 826651, 1178544, 1031137, 1040799, 514752, 907482, 830152, 687231, 650591, 799277, 753658, 274160, 643923, 859861, 1017483, 968316, 1052892, 981073, 820722, 672343, 1011365, 685272, 621760, 1016300, 801637, 810303, 687551, 764384, 826502, 596365, 554544, 784846, 732773, 897866, 570243, 784259, 787927, 771990, 710355, 797617, 906421, 983667, 988149, 1023003, 813090, 530420, 778983, 846056, 598687, 896775, 507572, 936761, 768936, 841186, 806135, 640638, 659282, 580720, 716783]
16278G16783N5186j54879N5411L3705j36030M568K99732j70845j19174j14253
16268D70204J21860J19157l6800P5340j12490J31894n0214j37522K081j07873
16258D75637J17348m8011k35394M20353R8284N1870l01527J34269k42755K53587
16248G23661k16719j31694K03819J7100J33158k15427l7644o765q9012J02534
16238D83011J60000p3574j96014M34127j90572m3865Q2877B34966J28851O0169
16228D23986B08486N49861l50585J88846k46043K95535N9317k61103l0201M57744
16218H71857D13759A41924K44429L70574k29277j93865o053L10567J07941k95351
16208D50889R2674Q7789k45590L92690B96136K45189j18329L78877J83886A27723
$$ y = [716783, 771969, 617090, 672501, 706206, 570176, 574744, 874476, 703631, 584457, 470204, 592064, 711221, 674421, 749761, 637271, 769165, 718951, 581429, 583510, 475637, 592985, 544974, 309580, 729933, 828217, 880087, 578560, 712829, 470074, 723661, 506942, 375248, 579067, 596167, 729325, 513898, 476254, 469489, 380477, 483011, 643011, 569437, 373423, 807550, 616978, 573113, 655990, 234966, 363817, 423986, 208486, 758347, 407762, 596608, 350565, 646100, 705417, 444314, 414113, 871857, 413759, 141924, 386353, 756927, 527650, 333785, 327732, 638299, 746240, 450889, 543563, 631352, 385762, 778452, 296136, 541325, 422996, 801873, 985759, 127723]
16197D13224R9852J15326B59340M38499k47580Q6713r8858l9705j79626L850L89164
16186F11797k75999n6380P9150q71K6562L59321I4165M83608E3607K71466K91482
16175F16555B96514J41674m5505r5628J88450j82824J64632A03242K55831O6966
16165D26039j66625L71056k06674J19306j02446R659p3797A45839J72498L19125
16155F37462k17436J638K68670j75268R810r2079J33915j13786j98283J13768
16145C68411B9341L50554N4601j17095O8209a5874A34603B8811J93075h6349B14638
16133B19112L69746B67048J53515b6698E41674A93255r5185B0023Q0144K55445
16123C55612K09184G0189N04867B41362o0830J45078q9247k6463N1003J11548
$$ y = [413224, 513076, 628402, 259340, 697839, 450259, 536972, 438114, 398409, 218783, 222633, 611797, 335798, 279418, 358568, 357697, 384259, 743580, 94165, 577773, 53607, 325073, 616555, 296514, 438188, 392683, 297055, 485505, 302681, 467313, 103242, 359073, 426039, 259414, 630470, 423796, 543102, 440656, 450315, 376518, 145839, 318337, 637462, 420026, 421664, 690334, 515066, 524876, 432797, 566712, 452926, 254643, 368411, 29341, 379895, 434496, 317401, 385610, -15874, 134603, 28811, 221886, -86349, 214638, 219112, 588858, 267048, 420563, -26698, 541674, 193255, 98070, 20023, 100167, 355612, 564796, 70189, 575056, 241362, 180532, 325610, 236363, 209900, 260903, 372451]
16113C72451j25359K20445B24749Q2363j00979J40866L91702B12994M75J57133
16103C70602B5029K29784l1736j5287P5305G1142L55642r2697I0590K89411p8898
16092C01103I6436M01546B48617l9205A1713L85607A04472Q091J16621Q886I1202
16080D10262A63342G5249J30195h8460B15766K22809A11241c648G7414K56706
16070C34120A01076L65978A13000J22317a25069K5575j01958A34401J71035j40115
16060A65321N4567l0858H0399J94204D9586d8708C33538A47837b7885C22176D0713
16048A72320J01732b0757F086N9551c422G0320K51429A57965K9395J75355b27394
16036B23170a78342A15966K8195n0015Q147O2570H624J91466H1760k5752M05777
$$ y = [372451, 247092, 467537, 224749, 307112, 206133, 346999, 738701, 212994, 213469, 370602, 25029, 254813, 223077, 207790, 283095, 71142, 426784, 334087, 90590, 380001, 301103, 96436, 497982, 248617, 209412, 11713, 397320, 104472, 112563, 229184, 238070, 91202, 410262, 163342, 75249, 205444, -88460, 215766, 438575, 111241, -3648, 77414, 334120, 101076, 467054, 113000, 235317, -125069, -99494, -201452, 134401, 305436, 165321, 219888, 189030, 80399, 274603, 49586, -48708, 333538, 147837, -27885, 322176, 40713, 172320, 274052, -20757, 6086, 65637, -3422, 70320, 321749, 157965, 187360, 362715, -227394, 223170, -178342, 115966, 144161, 94146, 102293, 164863, 8624, 200090, 81760, 56008, 461785]
16025D61785j76628a69635F00370A49153b71006A24141J68608e0384A68410D4446
16014B15632H3613f6157A3755b05418a5158D2302J51122I6279C8204J22675J63399
16003C24278f6092j00297D62235e6343F08523b5386n5047A18035m9714B7611J248
15992B8859J54713k4746l8350K10083J59192K78468J9227J60622j61778J36421
15982I22711C30698l5604A32673K45123j85295k5164E2476a35569m1295A36471
15971E1553h1130C89843A18457K86887a66812A28686J5698L93803a7191r8422
15961a15613C3993a588B58675F3384b48901d9148C57864A33972Q9962C8002a213
15949D4435G425L79724A27604j5373M095n0397J2178b47634J21847P160A26761
$$ y = [461785, 285157, -169635, 600370, 149153, -271006, 124141, 292749, -50384, 168410, 44446, 215632, 83613, -66157, 13755, -205418, -15158, 42302, 193424, 96279, 38204, 160879, 324278, -66092, -166389, 462235, -56343, 608523, -25386, -80433, 118035, 68321, 27611, 28859, 183572, 158826, 120476, 330559, 489751, 768219, 787446, 948068, 786290, 922711, 330698, 295094, 132673, 377796, 192501, 167337, 52476, -135569, -176864, 136471, 51553, -81130, 389843, 118457, 405344, -166812, 128686, 144384, 538187, -17191, -115613, 33993, -1588, 258675, 63384, -248901, -49148, 357864, 133972, 223934, 38002, -1213, 44435, 7425, 387149, 127604, 112231, 116326, 65929, 78107, -247634, -125787, -118627, 126761]
15937A73629a53607C8174J89419b30523B18367H5372p7D0451M4853L6569J8352
15926A40225b27649b0318A23314g546B48806r2036h7793I5879J64344G7751J43834
15915B21585H8274b24041A14649a93434c1425o0490A40530c29962Q0824D7846
15904a29381m4178A91218G8321N9532b65851j69490i2800A594c02284E05617g1815
15892a89152F4188A6611K82063A02508P6595b21078O9306j92121a06181J5904
15882i0277a6216A83704a65676D0312c0795B65832A04420J38658B4833a6080A57168
15870b1058A83092i6783M0829j4654c4154j90289e5853B5901P3596a94540B2387
15858c21462N5043E747L55772a32462G7759a67738j1908B94672j4800g6740c3885
$$ y = [173629, -153607, 38174, 227593, -230523, 218367, 85372, 85295, 40451, 85304, 121873, 140225, -227649, -20318, 123314, -7546, 248806, 156770, -87793, 95879, 260223, 77751, 221585, 88274, -224041, 114649, -193434, -31425, -91915, 140530, -329962, -249138, 47846, -129381, -173559, 191218, 78321, 137853, -265851, -435341, -92800, 1594, -302284, 505617, -71815, -189152, 64188, 16611, 298674, 102508, 179103, -221078, -151772, -343893, -106181, -90277, -16216, 183704, -165676, 40312, -30795, 265832, 104420, 243078, 24833, -16080, 157168, -21058, 183092, -96783, -55954, -70608, -34154, -224443, -55853, 25901, 99497, -194540, 22387, -321462, -266419, 5747, 361519, -132462, 77759, -167738, -179646, 294672, 279872, -76740, -33885]
15846a03634A49161b9409j42182K1A41857m379i8631E0585b7389n7681A43816
15834I5157a75107j73018a06513A40856r775a67468A37064a7610k74116a1863
15823B13327d3483I1636J47414p1460J83116A0975a52183b5592j24548C7086d59021
15811g8549N224B20315a22622b0308j19922C47796D8839J16863g8040A06954D4033
15799b42586j88889A6953a27114j0959j7150a1282j25449r2995A24104e1042A53550
15787b02721m5379i9320A00876L88856k15399a61006I6953d13793B06934M5886
15777B52820a79688b2383A78837M3746q0119L8610D3662J22725F9104h4711A5964
15765f6480J1834A22735h0415B06903a91459C56761b15502D21000c88962a00988
$$ y = [-103634, 149161, -29409, -171591, -171570, 141857, 137478, -98631, 50585, -27389, -85070, 143816, 95157, -175107, -348125, -106513, 140856, 131081, -167468, 137064, -17610, -291726, -11863, 213327, -43483, 91636, 239050, 167590, 350706, 10975, -152183, -25592, -150140, 37086, -459021, -78549, -73325, 220315, -122622, -20308, -140230, 347796, 48839, 165702, -78040, 106954, 44033, -242586, -431475, 16953, -127114, -138073, -155223, -11282, -136731, -229726, 124104, -51042, 153550, -202721, -248100, -99320, 100876, 489732, 274333, -161006, 96953, -413793, 206934, 252820, -179688, -22383, 178837, 222583, 142464, 181074, 43662, 166387, 69104, -84711, 15964, -66480, -54646, 122735, -80415, 206903, -191459, 356761, -215502, 421000, -388962, -100988]
15754i8629D85937G3865j1271d4066D4468a67557B49055A01202b9186G8033J18686
15743A96719e4570j28589B2902J5433a9182A26894J12426a22823L1100I944K5967
15732C5911a6130A95215P3132o9326o6502K9911c20731J58473h580D62J03282
15721A03744a90493B13999g4493k03088h1086A87576d5726m784j05857A3119e3059
15709d5953B63455l38b56004f8001l8122p7543A24214a93714j30026A24502a57454
15697D2269b65562a13667b6304k73395a28601p4627f7608k18179D8259J05620
15687A53879l2453a15519B20783a08367Q289C55728j72956B8239b50018J10270
15677a39748A09423a57200K3835f1952C21876a5855C4177c13017K601a35405r4610
$$ y = [-98629, 485937, 73865, 62594, -44066, 44468, -167557, 249055, 101202, -29186, 78033, 196719, -54570, -183159, 22902, 38335, -19182, 126894, 239320, -122823, -91723, 9944, 35911, -16130, 195215, 268347, 199021, 132519, 162430, -320731, -162258, -8580, 462, 103744, -190493, 213999, -74493, -277581, -81086, 187576, -45726, -50510, -156367, 13119, -53059, -45953, 263455, 263117, -256004, -68001, -106123, -183666, 124214, -193714, -323740, 124502, -157454, 42269, -265562, -113667, -26304, -299699, -128601, -203228, -67608, -285787, 48259, 153879, 121426, -115519, 220783, -108367, -100078, 355728, 182772, 28239, -250018, -139748, 109423, -157200, -133365, -61952, 321876, -15855, 34177, -313017, -310416, -135405, -230015]
15666b30015b4583r6829L4887n1074m03073B18371a07842E2094J04028J13567
15656B69689c9069E7096d2695A18611b16018A09851J10592A6413K20577E4737
15645b5544k82123B68546b51428B64036E1807b34665P5904A58935J31926B4166
15634a83842B62374b15568F6293K52877b18763E2120N878e7863H0440P7491a83450
15622B1838C835K22385d6905A61124c48756B4241c6392E5666R467A509P2581J37814
15610B11904c0173k96202a40588B88073D2544a07761A23319A4282a76198n9684
15600b35882A04915d6027R70A14159a2172l99C8393a84355d4064j53547f623k64311
15588b70934A1050J93297f3460A33405b11367I8569k5879C4453K20296a41157
$$ y = [-230015, -24583, -121412, -86525, -137599, -540672, 218371, -107842, 52094, 156122, 269689, -39069, 57096, -42695, 118611, -216018, 109851, 220443, 16413, 236990, 54737, -25544, -307667, 268546, -251428, 264036, 51807, -234665, -158761, 158935, 290861, 24166, -183842, 262374, -215568, 66293, 319170, -218763, 52120, 57998, -57863, 80440, 157931, -183450, 21838, 3835, 226220, -46905, 161124, -348756, 24241, -36392, 55666, 65133, 1509, 74090, 211904, -30173, -326375, -140588, 288073, 42544, -107761, 123319, 14282, -176198, -235882, 104915, -46027, -45057, 114159, -12172, -12571, 38393, -184355, -44064, -197611, -6623, -270934, 11050, 204347, -63460, 133405, -211367, 98569, 72690, 34453, 254749, -141157]
15577h8689n3291O8060j79426C2228a46788M3443j13459J01957P109j66814d2989
15565a93870I1927A7911a06393C2692b54449K613C1652i4886A04645O4324a95515
15553D4116i6735A45589i6742C6494a362l15820J27870B1076K72032A19481g5572
15541h7144A13099J31560J33017b11976h9122k54893c8488j66497H4642f6398
15530I3117a63057f0230B06347d907o0391o3493E8557N993C1253O1475L3014E8925
15517B20573q1223Q4924K22590b05872A20418m3423L4536b3421A61545C5452q247
15506B7205J49108Q7190A1167K23334e754A26610i2921C01089e742D3737P3911
15495A17648e8195C8620K50948i9227J7042j472L0977j82902B29670C5892d1655
$$ y = [-88689, -141980, -73920, -253346, 32228, -146788, -103345, -216804, -114847, -107738, -274552, -42989, -193870, 91927, 17911, -106393, 32692, -254449, -251836, 31652, -94886, 104645, 168969, -195515, 44116, -96735, 145589, -96742, 36494, -1362, -317182, -189312, 21076, 293108, 119481, -75572, -87144, 113099, 244659, 377676, -211976, -89122, -344015, -38488, -204985, 84642, -66398, 93117, -163057, -60230, 206347, -4907, -65298, -128791, 58557, 64550, 31253, 92728, 125742, 58925, 220573, 139350, 224274, 446864, -205872, 120418, 76995, 111531, -23421, 161545, 35452, 27205, 176313, 263503, 11167, 234501, -5754, 126610, -92921, 301089, -5742, 43737, 117648, -58195, 38620, 289568, -99227, -82185, -83657, -52680, -235582, 229670, 35892, -41655]
15483b3387n2204A01267a35737G8207J08313E1746M12276q9236L2073A41329K24410
15472C65739K7446n5628A30566L3740p1642c2311G8898l5867k0240a9130A07867
15460a2860k40066R8102A48091A0322J53826i0922D0684M2950K17265b83642d3565
15448h6904m6489B27738J22920A29055J67530L18910P7873N1988j78797j02338
15438D64221B29847I9730P9415C9623b8011A95356m8423a10396D04711b03944
15427A50878E6881E196a0882j10371G0396M8119i343A72197b771l91311a5337
15415A82334J0173g141B25621J2437h9369B04402C1748b13360a4907j64871f1084
15403C87489B7511b19898A03498a5202E4481a37535K230C6599f4633j5766r4929
$$ y = [-23387, -75591, 101267, -135737, 78207, 186520, 51746, 464022, 374786, 406859, 141329, 365739, 393185, 337557, 130566, 164306, 92664, -32311, 78898, 43031, 22791, -19130, 107867, -12860, -252926, -154824, 148091, 10322, 164148, -90922, 40684, 83634, 300899, -283642, -43565, -86904, -133393, 227738, 350658, 129055, 296585, 615495, 693368, 745356, 566559, 464221, 229847, 99730, 179145, 39623, -28011, 195356, 146933, -110396, 404711, -203944, 150878, 56881, 5196, -10882, -121253, 70396, 118515, -9343, 172197, -2771, -394082, -15337, 182334, 192507, -7141, 225621, 238058, -89369, 204402, 31748, -213360, -14907, -179778, -61084, 387489, 27511, -219898, 103498, -15202, 54481, -137535, -135305, 36599, -64633, -80399, -175328]
15392a75328A44199K3209c6125J0589H4189K3367J97419b8563D4648J01260a44627
15380a10922j27380i006n2730m5090J7668A01539c10715A04073K60171j61374
15370B02870J3001M7070O1942l9553b651B34747M3126F6668L2441K96i9628A70091
15357A82389J42916j46000d1569c439B40021j08095J80718g2146n0846D60422
15346a35948C21443J2913G1311k0086c5305D85468g8979B71362J50030h6343K5956
15335f0387A71413R507n8495L986d7655l3752A26995a20350q2613A46084F7238
15323B41833h8248A3207a06514a9982n2964I6002a6433j0578H3294i0380r6113
15312a86493m5765F8256J10729K1022E7871a57683A10031K15307A34256B9262
$$ y = [-175328, 144199, 167408, -36125, -25536, 84189, 107556, 304975, -28563, 44648, 145908, -144627, -110922, -238302, -9006, -61736, -106826, -89158, 101539, -310715, 104073, 364244, 202870, 215871, 262941, 324883, 285330, -2651, 234747, 277873, 66668, 99109, 99405, -99628, 170091, 182389, 325305, 179305, -41569, -3439, 240021, 131926, 312644, -72146, -122992, 460422, -135948, 321443, 334356, 71311, 51225, -35305, 485468, -78979, 271362, 421392, -86343, -60387, 171413, 180920, 122425, 126411, -47655, -81407, 126995, -120350, -202963, 146084, 67238, 241833, -88248, 13207, -106514, -19982, -72946, 96002, -16433, -27011, 83294, -90380, -186493, -232258, 68256, 178985, 200007, 57871, -157683, 110031, 325338, 134256, 29262]
15301a32259F5279N3344A1507P5157P5879D8979b9746A51185a45551B76533b88331
15289c5883p7394D2077A9841J24729d4040D46274H8419J60783n5947Q436a81446
15277A88598a71303A23K14112d6531j19847f2937A10349a3102N852A38369J08263
15266B46632a7863j5376k00737A54762J34714g0088j88090d0586j98403a07246
15255A12430D381K83412J7709M7563r979E2551O3476q317K20172N83644R02204
15244A813730H80733M91669M4999D73871m3244j89467f1104A4812K24854H0850
15233A65072B9345d5928B73242E7505J81586A07102b56263h7827F6845g9667C10006
15221C5388a38584N2128L0070A3480O4758e0760A44010L17314i1423I8094d1877
$$ y = [-132259, 65279, 118623, 11507, 86664, 162543, 48979, -29746, 151185, -145551, 276533, -288331, -35883, -113277, 42077, 19841, 144570, -44040, 446274, 88419, 249202, 193255, 201691, -181446, 188598, -171303, 123, 214235, -46531, -166378, -62937, 110349, -13102, -7250, 138369, 246632, -17863, -33239, -233976, 154762, 289476, -70088, -258178, -40586, -238989, -107246, 112430, 4381, 287793, 305502, 353065, 343086, 52551, 116027, 107710, 327882, 911526, 1813730, 880733, 1372402, 1417401, 473871, 430627, 241160, -61104, 14812, 239666, 80850, 165072, 29345, -45928, 273242, 57505, 239091, 107102, -256263, -87827, 66845, -79667, 310006, 35388, -138584, -86456, -56386, 13480, 78238, -50760, 144010, 461324, -91423, 98094, -41877]
15209G5881J09308N6052a5499B50545J08447p8080A6988J38286c12389E3522N7056
15198A10578D474K11801d3531m65576a55866O5313J4121E6730d9954j11754j201
15187a62909C1719J29458p5053a47483F4235a91428j07365C08387a02018e0976
15176B12324g528C9371M7886O6839K45177b6902j39424a8095B87160p9403B9744
15164B97912Q9780a52429A43949H993A666R6264R9653o6517l0669a458j73652
15153a75110C0202N8434d8769B03544R3740K7919A09670a07502N1481B25563d3475
15141f3983A21620a5823A9284J54723K13376o8045f6916C24137j27678b24055
15130a10926A36567D0401j1198K12623r9661l0688k1461M8464J97396A33213K21683
$$ y = [75881, 185189, 241241, -15499, 250545, 358992, 280912, 16988, 155274, -312389, 53522, 110578, 4474, 216275, -43531, -509107, -155866, -90553, -76432, 56730, -49954, -161708, -162909, 31719, 161177, 86124, -147483, 64235, -191428, -298793, 308387, -102018, -50976, 212324, -7528, 39371, 87257, 154096, 399273, -26902, -166326, -18095, 287160, 207757, 29744, 297912, 387692, -152429, 143949, 8993, 1666, 97930, 197583, 131066, 100397, -1458, -175110, 30202, 88636, -48769, 203544, 297284, 325203, 109670, -107502, -56021, 225563, -43475, -63983, 121620, -15823, 19284, 174007, 387383, 319338, -66916, 324137, 196459, -224055, -110926, 136567, 40401, 29203, 241826, 142165, 111477, 90016, 138480, 335876, 133213, 354896]
15119C54896R113J21300G1239l3153J28355J49307F7652b9111h563l492k1507
15108c3562C15888A43185J6044a54146B22607F8506J40910j3988F5752M39998
15098E05750b2429G9905a4886H1529k6974e1903B568J41763O1227c9695A73776
15086A77377J85736A41703Q0320n8885R2931I7197a24826j60994I7443k7875J19279
15075A88847a88533P0876A50705D2915R4689J50406c2330C57205A07816j6894
15065I0922J23120a33352C5986K35044I176J67853J50098i879D24100j46031l1162
15054B46907g483A96227O2853P0194j50686N07468g0616B98724R4456A61575p1847
15043H9728J30734F7050M03796j72381K0411A01224O9912a13211D34860j77834
$$ y = [354896, 364009, 485309, 71239, 38086, 166441, 315748, 67652, -29111, -8563, -12055, -33562, 315888, 143185, 159229, -154146, 222607, 68506, 209416, 195428, 65752, 505750, -22429, 79905, -14886, 81529, 54555, -51903, 2568, 144331, 205558, -39695, 173776, 177377, 363113, 141703, 222023, 163138, 256069, 97197, -124826, -285820, 97443, 69568, 188847, -188533, -117657, 150705, 42915, 137604, 288010, -32330, 357205, 107816, 90922, 214042, -133352, 35986, 271030, 9176, 177029, 327127, -9879, 424100, 278069, 246907, -7483, 196227, 259080, 329274, 178588, 686056, -70616, 298724, 393180, 161575, 89728, 220462, 67050, 470846, 298465, 318876, 101224, 171136, -113211, 434860, 257026]
15033B57026F4895J62191R1647L1360j68741L39681j25828P0326k2534m5565r8630
15022B98802r4869K14328J73454B09573J63264A02804M61539j97516J87837H0160
15011A84235H0967L19242J24925K30499A61314L36131k00184K4504K35076d026
15000A85048J59015P5453m4222P4081B24242M76114B53225O055K0514J46586A47657
14988a24664C53914p2354I2406J67545K20847B00847J52562O5783j34399M76404
14978G61197O297j79317j43720j4963J65703k29429J22759p7087A21871N21266
14968F43137k97631j4764P7878Q5546I2569L00592J7272A13647M22620B29453
14957B99042m4679H6727K61798D7287J64982J1155K45501J76212B07170F5885
$$ y = [257026, 64895, 227086, 318733, 350093, 181352, 521033, 395205, 465531, 442997, 397432, 298802, 203933, 418261, 591715, 209573, 372837, 102804, 564343, 366827, 554664, 80160, 184235, 80967, 400209, 525134, 755633, 161314, 497445, 297261, 321765, 556841, -4026, 185048, 344063, 419516, 375294, 449375, 224242, 700356, 253225, 259280, 279794, 426380, 147657, -124664, 353914, 281560, 92406, 259951, 480798, 200847, 353409, 419192, 284793, 761197, 767494, 588177, 444457, 429494, 595197, 365768, 488527, 411440, 121871, 643137, 345506, 330742, 408620, 494166, 92569, 393161, 410433, 113647, 536267, 229453, 299042, 254363, 86727, 348525, 47287, 212269, 223424, 468925, 645137, 207170, 65885]
14946B43444L7097J25232H9883M68917j02488j52108L27800k24456K2829A81766
14935C90730j54132J83945K59678A56474M35295m0996L87669J21585k23546K85995
14925A122476M5645j09095K46144m5786j03156o561j60877J83534N59221m8406
14915A683139j53554k37570j02679m34164r3607l10813J77910j18156j00759m2106
14905B67641J01406A63100K03174j22291J75455L95314l16720A95784K14082J2369
14895D22235A73673J95987r4389J12332J89021j68446k8567K65738k58012L33726
14885G21063l9328L0036C41140J17692L75210o6696l19924K96558j46036j83212
14875D14732J39768m1957J3402l4435j86111J48077k6273J06201l3459J08781
$$ y = [243444, 280541, 405773, 89883, 558800, 456312, 304204, 632004, 407548, 430377, 181766, 390730, 236598, 420543, 680221, 156474, 591769, 550773, 938442, 1060027, 836481, 1122476, 1168121, 1059026, 1305170, 1259384, 1156228, 1149667, 988790, 1172324, 1731545, 1683139, 1529585, 1292015, 1189336, 755172, 661565, 350752, 528662, 410506, 309747, 267641, 369047, 163100, 366274, 243983, 419438, 814752, 498032, 195784, 409866, 422235, 173673, 369660, 275271, 387603, 576624, 408178, 379611, 645349, 387337, 721063, 681735, 711771, 341140, 458832, 834042, 767346, 447422, 743980, 597944, 414732, 554500, 512543, 525945, 491510, 305399, 453476, 427203, 533404, 499945, 608726]
14865F08726L3212j82925p3535r2541J41055j2918J26688D3914N45177o9333p6858
14854D42900j31461A30669K50633L00425j44913I8906L46394O7434j24857n0744
14844C37133L87700N0185N0717j12358L35489j0790k57019K07622m64301o4613
14834D59765J64311O4853k79059j44841J75046L21654l23286O7601o214M9427
14824E49257q4286j97432M40087E7934N50825J55992j45380K44250l86906K22670
14814F99385k51040p2114q3569N25443k53150Q3973j62101N7946k62928M45122
14804G26967J04515k92400N7268j33280Q5810K1509J21868j13571p4046M41696
14794I46336k70427C18792J34385O4743J33181J16128k77062P1766q9177q5905
$$ y = [608726, 641938, 459013, 385478, 292937, 433992, 421074, 547762, 43914, 589091, 519758, 442900, 311439, 130669, 381302, 681727, 536814, 98906, 445300, 512734, 387877, 337133, 724833, 775018, 825735, 713377, 1048866, 1038076, 781057, 988679, 524378, 459765, 624076, 688929, 409870, 265029, 440075, 761729, 438443, 506044, 499830, 549257, 464971, 267539, 707626, 57934, 608759, 764751, 619371, 863621, 476715, 699385, 448345, 376231, 292662, 818105, 564955, 648928, 486827, 544773, 281845, 726967, 831482, 539082, 596350, 463070, 548880, 570389, 692257, 578686, 504640, 946336, 675909, 318792, 453177, 517920, 651101, 767229, 490167, 561933, 472756, 386851]
14784C86851L53250A56771L30191k01486M4074R6794K91510J39606J14052m43451
14774E28061M05674k28482j2979O5826k27750l6912L01937j96134p6169J15833
14764F38905j97445o1726K63536L39304C82641K65936k24407j67942K48763R7925
14754F02916J08967C03444N92517B73175K28013N5788J88802C05326K54366k54118
14744C05574J36282J34029M7054j68474R2975K3948L37180j11735C60634L39831
14734G00465k62054J67849K56004l27152L94235l62578J79594K91396j53496K47048
14724A131311J72511k0300J53333n93829L58344j38090l61932K23911k13646J11145
14714H22758j07422r3689J42508p6508L48051j87888J23266q4839J21647J53m32170
$$ y = [386851, 740101, 156771, 486962, 285476, 329550, 426344, 717854, 857460, 971512, 528061, 933735, 705253, 692274, 758100, 530350, 493438, 795375, 599241, 523072, 638905, 441460, 379734, 643270, 982574, 382641, 648577, 424170, 256228, 504991, 602916, 711883, 303444, 895961, 273175, 501188, 556976, 745778, 305326, 559692, 305574, 441856, 575885, 622939, 454465, 547440, 571388, 908568, 796833, 360634, 700465, 438411, 606260, 862264, 535112, 929347, 566769, 746363, 1037759, 884263, 1131311, 1303822, 1283522, 1436855, 843026, 1201370, 1063280, 701348, 925259, 711613, 822758, 715336, 621647, 764155, 687647, 1035698, 847810, 971076, 886237, 1007884, 1008037, 575867]
14703E75867N66622O8961K26156r9897K85790l32773k47963j8918J3840k59801
14693G77884J4383o0867K83300K1025k6657m98646N6750Q7536L67055m52813L65369
14682I34319k35002k754M5610j73922K12892B32717O50982q3541J17283Q2586
14672A000027k20485J56390Q5718l69947K33431o7783l967J16586l07446J39939
14662G62463K97289l19290J55800j17411K38929j02536j18184J29458L7156p1238
14652H92436K20626m2259j04392M37194j91127k99105p0677J89975k77686K7593
14642G82578P4688l84469N15263k15070L23111j04784l67817J27294O77438m09520
14632A018712P2287j38344R8147K3653k00097l6136K54662k37354K92971J6747
$$ y = [575867, 1142489, 1211450, 1437606, 1337709, 1623499, 1290726, 1042763, 1023845, 1037685, 777884, 792267, 731400, 1014700, 1035725, 1009068, 510422, 567172, 654708, 1021763, 568950, 934319, 699317, 696563, 742173, 568251, 781143, 232717, 883699, 800158, 917441, 1000027, 779542, 935932, 1021650, 651703, 885134, 817351, 813384, 929970, 622524, 762463, 1059752, 740462, 896262, 778851, 1017780, 915244, 797060, 926518, 963674, 892436, 1113062, 1070803, 966411, 1403605, 1212478, 913373, 842696, 1032671, 754985, 782578, 857266, 472797, 988060, 772990, 1096101, 991317, 623500, 750794, 1428232, 1018712, 1090999, 952655, 1050802, 1074455, 874358, 838222, 1092884, 855530, 1148501, 1165248]
14622A165248k34931J05714k3428J41310J02092l13709K32956l4567J65317J09361
14612A415363m23619J80170J00532k31887K51197J53230k93095J87906j46747
14603A193050K15935j24790l4583J01355J35909j03715J55396l07174J17130K05992
14593A554505j95686K34148j71071J96385j72427K60184R231l93426L88843k74869
14583A435817L0708J91814k149K1444p7099J57072P0974k81013J70073J56205
14573A873846j80491j97743O3608O6351J50782K34577k4759J4425o5399N7753
14563A992950J3993J27011k56184M23275k92181O55623j19813k9308L93250K97512
14553C206128J73727J35754L10677J976001K130641M072081P947826J7486656
$$ y = [1165248, 930317, 1036031, 1012603, 1153913, 1256005, 942296, 1175252, 1140685, 1306002, 1415363, 991744, 1171914, 1272446, 1040559, 1291756, 1444986, 1151891, 1339797, 1193050, 1408985, 1284195, 1249612, 1350967, 1486876, 1383161, 1538557, 1231383, 1348513, 1554505, 1358819, 1592967, 1421896, 1618281, 1445854, 1706038, 1715269, 1321843, 1710686, 1435817, 1466525, 1658339, 1656190, 1677634, 1600535, 1757607, 1828581, 1547568, 1717641, 1873846, 1693355, 1495612, 1559220, 1625571, 1776353, 2010930, 1986171, 2000596, 1935197, 1992950, 2006943, 2133954, 1877770, 2301045, 2008864, 2664487, 2544674, 2515366, 2908616, 3206128, 3379855, 3515609, 3826286, 5802287, 7932928, 12005009, 19952835, 37439491]
14545C7439491k717642A4527120G135682j908890k27372k405316m53402k21310
14537A919392n02004K71553K34622j70016J38986l35107K59014M48k9257m6617
14527A741014j5046J97858j01818K03797k20923M43406k31560K90962k05212J43073
14517B245551K1794P5799j88365M85648l16599L7009J87877k13491j78371J37783
14507B294635M02837l09124J17218J45593j17173q2979j03041L21114k4596R2591
14497B737075k47668L11332J94414k41002q5201J57569k44049K33908o0192K10134
14487B966320J62302l19755K35659K0940J12854Q5788N1045q3153k29229J75237
14477C178008Q8214J99991l04567N13267r1519R1540r7068K66706k47424J18383
$$ y = [37439491, 34721849, 14527120, 7135682, 5226792, 4999420, 2594104, 2140702, 1919392, 1417388, 1688941, 1923563, 1753547, 1892533, 1557426, 1816440, 1816888, 1787631, 1741014, 1725968, 1923826, 1822008, 2025805, 1804882, 2248288, 2016728, 2307690, 2102478, 2245551, 2267345, 2343144, 2154779, 2640427, 2323828, 2360837, 2548714, 2335223, 2156852, 2294635, 2697472, 2388348, 2505566, 2651159, 2533986, 2451007, 2347966, 2669080, 2644484, 2737075, 2489407, 2800739, 2995153, 2754151, 2668950, 2826519, 2582470, 2816378, 2756186, 2966320, 3128622, 2808867, 3044526, 3065466, 3178320, 3264108, 3315153, 3232000, 3002771, 3178008, 3266222, 3466213, 3161646, 3674913, 3583394, 3674934, 3577866, 3844572, 3597148, 3715531]
14467C715531J88641L4110l1228J78248o4574k87003J6155N76780j80886m5516
14457D100258m6842K29818K78960j35186p3216R553K00350m9277j46248L48878
14447D717048j95114l0352r3411L32440P9779L30830l35526K74517O815j61662
14437D925364N73257J65923J15506k34968q7861K50814l02496L62851J19963K17248
14427F105601J10236K40374k34855K34470m59201O62529J30939J37042m4744q829
14417F873562K81481L53040L1786k7412m01783L85604R8014n6813L20044J84012
14407H041535J81793J66184J57065J76796l4935L44177j12375O8389J38655K34669
14397I361953q4912j8764L35325L20499L4160M2290J19822J65232J52399M42548
$$ y = [3715531, 3904172, 3938282, 3907054, 4085302, 4020728, 3733725, 3749880, 4326660, 4145774, 4100258, 4053416, 4283234, 4562194, 4427008, 4353792, 4363345, 4563695, 4514418, 4368170, 4717048, 4521934, 4491582, 4398171, 4730611, 4810390, 5141220, 4805694, 5080211, 5087026, 4925364, 5498621, 5664544, 5780050, 5545082, 5457221, 5708035, 5405539, 5768390, 5888353, 6105601, 6215837, 6456211, 6221356, 6455826, 5996625, 6659154, 6790093, 6927135, 6882391, 6873562, 7155043, 7508083, 7539869, 7512457, 7110674, 7496278, 7594292, 7537479, 7857523, 8041535, 8223328, 8389512, 8546577, 8723373, 8688438, 9032615, 8920240, 8988629, 9127284, 9361953, 9277041, 9258277, 9593602, 9914101, 9948261, 9990551, 10110373, 10275605, 10428004, 10870552]
14387A0870552J33760l0789M82930L78564O4108K65304J58549N05677m4288L48262
14377A3132629K97409K46809L42539j25440K54593M37130O18690o7212K23779
14368A5360926L81397K32050N35024M14744M81238M87954L09868j34846L00224
14359A8368579N08463P47438L54437J69350O54175N34963K39375J019124k32089
14350B2363815J094171P70494k3360O29708P84164R23350P73405R70673L65896
14341B8652316J067242P23111O78333R78259P89231R99888R60129J236289J284222
14332C7369020Q27289Q93726J731161J107735J411044J407387J511975J859468
14324D8118805J219147J472056K193472J856263K107698K170144J901125K170948
$$ y = [10870552, 11004312, 10973523, 11456453, 11835017, 11899125, 12164429, 12322978, 12828655, 12784367, 13132629, 13430038, 13676847, 14019386, 13893946, 14148539, 14585669, 15204359, 15137147, 15360926, 15742323, 15974373, 16509397, 16924141, 17405379, 17893333, 18203201, 18068355, 18368579, 18877042, 19624480, 19978917, 20148267, 20802442, 21337405, 21576780, 22595904, 22363815, 23457986, 24228480, 24205120, 24834828, 25618992, 26542342, 27315747, 28286420, 28652316, 29719558, 30442669, 31121002, 32099261, 32888492, 33888380, 34848509, 36084798, 37369020, 38196309, 39090035, 40821196, 41928931, 43339975, 44747362, 46259337, 48118805, 49337952, 50810008, 53003480, 54859743, 56967441, 59137585, 61038710, 63209658]
14316F3209658K292469K659147K666016K723599L279500L336076L760542L385480
14308H7312487L554269L813835M883911M082260N385910M937806N503438O279719
14300A25753635O030177O560596P328994P374181Q267295Q774535Q927014R902988
14292A88919415J0595147J0776447J1611129J2212921J2857348J3750094J4216268
14285B74938769J4785855J4650457J5493507J5459142J5566900J5187955J4594094
14278C80676679J3829504J2736436J1624678R584444O362829J793787M04850J64270
14270D37177477O25693j064667o157159n112674q579226j0967381j2408798j3712288
14262C79800977j4652100j5619043j6091889j5886005j5689346j5206776j4802766
$$ y = [63209658, 65502127, 68161274, 70827290, 73550889, 76830389, 80166465, 83927007, 87312487, 90866756, 94680591, 99564502, 103646762, 109032672, 113970478, 119473916, 125753635, 131783812, 138344408, 145673402, 153047583, 161314878, 170089413, 179016427, 188919415, 199514562, 210291009, 221902138, 234115059, 246972407, 260722501, 274938769, 289724624, 304375081, 319868588, 335327730, 350894630, 366082585, 380676679, 394506183, 407242619, 418867297, 428451741, 434814570, 436608357, 437013207, 437177477, 437803170, 436738503, 430581344, 425468670, 416889444, 405922063, 393513265, 379800977, 365148877, 349529834, 333437945, 317551940, 301862594, 286655818, 271853052]
14255B71853052j4401080j3789034j3108939j1219832j1247892j1216126j0469478
14248A86400671r705128r105805q560836p857947p219425p206796o735812o495932
14240A23512990n710714n069189n052650m781241m605607m575598l881123l832334
14232H6004534l319668l442945l255976l046126k933058k454589k538066k725485
14224F2288621k163031k479437k140847j652005j658624j885063j797618j809662
14216D6702334j380937j575678j329433p25728j635420j328983j122592r85502
14208C6618061o41347j223299r26772r70251j252972p78548o31032o75122r12721
14199B8605997q48172k79789j168179n95853o96479l73000p85743p32596l43240
$$ y = [271853052, 257451972, 243662938, 230553999, 219334167, 208086275, 196870149, 186400671, 176695543, 167589738, 159028902, 151170955, 143951530, 136744734, 130008922, 123512990, 117802276, 112733087, 107680437, 102899196, 98293589, 93717991, 89836868, 86004534, 82684866, 79241921, 75985945, 72939819, 70006761, 67552172, 65014106, 62288621, 60125590, 57646153, 55505306, 53853301, 52194677, 50309614, 48511996, 46702334, 45321397, 43745719, 42416286, 41690558, 40055138, 38726155, 37603563, 36618061, 35976714, 34753415, 33826643, 32856392, 31603420, 30824872, 30193840, 29518718, 28605997, 27757825, 27478036, 26309857, 25714004, 25017525, 24644525, 23858782, 23126186, 22782946]
14190B2782946n43665n98892n34483n99551o02257k33859k18034n33251n20537
14181A8398417m34354n18871l82131n660p36407L3023k59785p87116N0033l80940
14171A4976209l89579l71932r7355Q0968n39106l53949l80161k9752N8174m09895
14161A2543622m87920L3425l08852l97468j55500j58299p3789j19442J03407l58868
14151A0620316k98513l81973j31378j92976M45882m50422l37389k94979k562J93104
14141I169110m78320j97582P3640r5241k06460M4008j04229k33251j89797l89562
14131G392316j11216j60475K84233k15890k39250K14022j74958k55732o1887m01710
14121F269453O14593k93344j35991l0722n5995j86189j85489r7522l4999K01290
$$ y = [22782946, 22239281, 21640389, 21105906, 20506355, 19904098, 19670239, 19452205, 18918954, 18398417, 17964063, 17445192, 17063061, 17057401, 16320994, 16354017, 16094232, 15307116, 15357149, 14976209, 14586630, 14214698, 14117343, 14198311, 13659205, 13305256, 12925095, 12895343, 12953517, 12543622, 12055702, 12089127, 11780275, 11382807, 11227307, 11069008, 10995219, 10875777, 10979184, 10620316, 10321803, 9939830, 9808452, 9615476, 10061358, 9610936, 9273547, 8978568, 8976006, 9169110, 8690790, 8493208, 8566848, 8471607, 8265147, 8309155, 8204926, 7971675, 7781878, 7392316, 7281100, 7120625, 7404858, 7188968, 6949718, 7163740, 6988782, 6733050, 6671163, 6269453, 6884046, 6590702, 6454711, 6423989, 6367994, 6181805, 5996316, 5898794, 5863795, 6065085]
14111F065085m06093k44739j3991K681q8233k7770L26627m85796K15661k97137
14101E046295J17924k47031L86681l72337k26272p9877Q4726M5752l2923K64036
14091D986974m77043K6631j04449j56810M7376L3359l07648J62149Q0216j81282
14081D109473k26574k01744M01860j2936n7786l52535L76927l65658m6194j04375
14071C520458M40444k81343m22505J46005l7083K29268j74330J14340j74403q4830
14061C276021J63380l4629k06822K96102k35036l03753O3655k8972N3648l39165
14051B704429N77798m88939K72182k46877J20742p348L53752n98480K0854K97270
14041C005383k52974m22166Q3854L64629l65585N5350R6086r387K01119l7786
$$ y = [6065085, 5658992, 5414253, 5400262, 5402943, 5314710, 5286940, 5613567, 5127771, 5343432, 5046295, 5164219, 4917188, 5303869, 4931532, 4705260, 4625383, 4710109, 4755861, 4722938, 4986974, 4509931, 4536562, 4432113, 4275303, 4322679, 4356038, 4048390, 4210539, 4290755, 4109473, 3882899, 3681155, 4083015, 4070079, 4012293, 3659758, 4036685, 3671027, 3624833, 3520458, 3960902, 3679559, 3257054, 3403059, 3365976, 3595244, 3420914, 3535254, 3360851, 3276021, 3439401, 3404772, 3197950, 3494052, 3259016, 2955263, 3018918, 2989946, 3043594, 2704429, 3282227, 2793288, 3065470, 2818593, 2939335, 2931987, 3285739, 2687259, 2708113, 3005383, 2752409, 2330243, 2414097, 2778726, 2413141, 2468491, 2564577, 2555190, 2756309, 2718523]
14031B718523j14353K64749j03378l68782j68169N22695j56642j65902k90811
14022B137930L20848m26960m6601L35483k24254L4709L40282l70202N3804J57546
14012B312585l07183O515l47609L45713q016O1027m6339k72598J14597J9329J94098
14001B072119j21199l93952J89959J05873J48678j91091K59667k07789P7873M5210
13991A985348J96291M07838J574216L085378O342869J5615605J1397000j9338941
13983B1265604j0334819m384720j462043j327360l92612l78378j00598k91091
13975B593983k43803m3139j11073J59286k64163J28928k33985O2077j38574m2280
13965A867257K15784j16661k76213P2670k4793K00722k62488r8691n8304p5384
$$ y = [2718523, 2604170, 2868919, 2765541, 2396759, 2228590, 2751285, 2594643, 2428741, 2137930, 2458778, 2031818, 1985217, 2320700, 2096446, 2131155, 2471437, 2101235, 2155039, 2312585, 2005402, 2011917, 1664308, 2010021, 2002005, 2063032, 2016693, 1744095, 1858692, 1878021, 2072119, 1950920, 1556968, 1746927, 1852800, 2001478, 1810387, 2070054, 1862265, 1940138, 1985348, 2181639, 2589477, 4163693, 7249071, 13591940, 29207545, 40604545, 21265604, 10930785, 6546065, 5084022, 3756662, 3364050, 2985672, 2885074, 2593983, 2350180, 2307041, 2195968, 2355254, 2091091, 2220019, 1986034, 2048111, 1909537, 1867257, 2083041, 1966380, 1690167, 1762837, 1738044, 1938766, 1676278, 1577587, 1519283, 1443899]
13955A443899J97928k26858K35028M92820k82197j16940j11548m04910J97072
13946A424294N8443L49867k20841n733k83627L45128L5036k45303J25607l57933
13936A224938J64751j7430j87065L18380l2227k28193J7342J20883P7037j05844
13926A352572l5140K60573m38548M48486m18820P0850K34103l23811L00621j57995
13916A292891j20722K2970M9052N8556m11316K46515J53750K85418m80755K30222
13906A326581k37788L25636j48397p5814J49290k24603P6148l3348k12642J77982
13896A123045m9896O506j88793J32335K28422l7060l44890L2890O7285k66975
13886G02869M83818j19627J37181j51425p1299J69516j78925m6333k31614J82787
$$ y = [1443899, 1641827, 1414969, 1649997, 2142817, 1860620, 1743680, 1632132, 1227222, 1424294, 1482737, 1832604, 1611763, 1606030, 1322403, 1667531, 1702567, 1457264, 1582871, 1224938, 1389689, 1372259, 1185194, 1503574, 1471347, 1243154, 1260496, 1381379, 1458416, 1352572, 1317432, 1578005, 1139457, 1587943, 1169123, 1239973, 1474076, 1150265, 1450886, 1292891, 1172169, 1195139, 1244191, 1302747, 891431, 1137946, 1291696, 1577114, 1096359, 1326581, 1088793, 1414429, 1266032, 1190218, 1339508, 1114905, 1191053, 1157705, 945063, 1123045, 1073149, 1079655, 890862, 1023197, 1251619, 1214559, 869669, 902559, 969844, 702869, 1186687, 1067060, 1204241, 1052816, 981517, 1151033, 972108, 925775, 694161, 876948]
13876H76948J40973J68546m01173M61448k61130k85880K71572o366r8228L77851
13866A244561j69342j37938m5879J65346l31346J71663j4664k57822L28098q5079
13856H67598k2244j12831K81141n282j08696k28296K49005k4340l59270L57299
13846H94084n7232j8592J59425l90266J62425J78584L4755j80753j9323k38934
13836E24173J27667K13763j65187p0333K90019k82075J45861M6200j19754J27230
13826H37564J47322k38052J1723K95495k81407J65174j15274j14280K17732m15753
13816E10244L54958C67418J10833L08298r5719J03959o1369j20820O9439J44358
13806H26397o1715o0805J97304k93252J91881k48781K87079j44512r1671L06550
$$ y = [876948, 1017921, 1186467, 785294, 1246742, 985612, 699732, 971304, 964938, 866710, 1244561, 1075219, 937281, 891402, 1056748, 725402, 897065, 882401, 624579, 952677, 867598, 845354, 732523, 1013664, 1008382, 899686, 671390, 920395, 896055, 536785, 894084, 836852, 818260, 977685, 587419, 749844, 928428, 963183, 782430, 763107, 524173, 651840, 865603, 700416, 630083, 920102, 638027, 783888, 830088, 710334, 837564, 984886, 746834, 758557, 1054052, 772645, 937819, 822545, 708265, 925997, 510244, 865202, 367418, 478251, 786549, 690830, 794789, 733420, 612600, 682039, 826397, 764682, 703877, 901181, 607929, 799810, 551029, 838108, 693596, 601925, 908475]
13796I08475k28423P748j3070j08930P019J87497j40842j79332O8574J45714p6496
13785E77934p4089N8421p8428K02882j82691K23076l49905K18075J34001k54722
13775D74554L338J02102J1831J55487C45668L62679k05428L75339k54321k25495
13765C98442Q1874P2808j6972J01606j42992q1790O1057K00608n949k51438P7055
13754D94309B26693K01575L45027o5318l10045K19540B56116J10365O8780J28193
13744E63454r5189K30745l33741m6515K28395J20271J1270j73519J22184j54986
13734D72369L110j14906k254L67349j95694J14421C00704J82974A49733J04369
13724B54102J86702P7239P37J33490j06634j55386J01138j67230p3872L59305
$$ y = [908475, 680052, 687800, 674730, 565800, 572819, 760316, 619474, 440142, 508716, 654430, 577934, 503845, 562266, 483838, 686720, 504029, 727105, 377200, 595275, 729276, 474554, 477892, 579994, 591825, 747312, 345668, 708347, 502919, 878258, 623937, 398442, 480316, 553124, 536152, 637758, 494766, 412976, 474033, 674641, 668692, 417254, 494309, 226693, 428268, 773295, 707977, 397932, 617472, 256116, 366481, 435261, 563454, 468265, 699010, 365269, 318754, 547149, 667420, 678690, 505171, 627355, 472369, 475479, 360573, 358319, 725668, 529974, 644395, 300704, 483678, 149733, 254102, 440804, 518043, 518780, 652270, 545636, 390250, 491388, 324158, 250286, 609591]
13714F09591M06642D80135P7200K19841j75616k14345j75026l8359J69169J18489
13704D61488j6480A56470M0990J78856N5481r0114P7792l9833J06742J61823A86288
13692C45448K17627k07727J57368J4685j47693O0382I5943J36940o9191N6091
13682B19783L02289I0327L39445J84651J09330C30538Q6833C0973L89175R5671
13672E15819j2776K12764B88442K65485J67772l31165j33717J1806J9468G6980
13661H1729M75857j18476p8201n0620A39412J10336J38197J16450k30408K40427
13651E14414j02884l0924q158A09380n128K74328j10719J33497C8945L36171J56370
13640E31486B58739H8489M55894j20224J06312A46646L89766H6161K62094Q2659
$$ y = [609591, 1016233, 480135, 557335, 777176, 601560, 387215, 212189, 173830, 342999, 461488, 445008, 156470, 197460, 376316, 431797, 341683, 419475, 379642, 486384, 648207, 186288, 345448, 563075, 355348, 512716, 527401, 379708, 440090, 95943, 232883, 163692, 219783, 522072, 90327, 429772, 614423, 723753, 330538, 417371, 30973, 420148, 515819, 503043, 715807, 288442, 553927, 721699, 390534, 256817, 268623, 288091, 76980, 81729, 557586, 439110, 360909, 310289, 139412, 249748, 387945, 504395, 273987, 514414, 411530, 380606, 372448, 109380, 104252, 378580, 267861, 401358, 38945, 375116, 531486, 258739, 88489, 544383, 424159, 530471, 146646, 536412, 86161, 348255, 430914]
13630D30914R2640j93559J31391J22368q1377r9368l3355J43726A80170M34712
13620F14882k73428P1854A43957o2965N0576K60179n6850K94466B34785M83371
13610G18156A18380m1681O5169K34961j80611J59981A19241C8527Q8403J07821
13600B34751G3875M07577D3670K72138C9247c339B99090C841J97072J13755A52567
13588B99373J15760l8438k4695k8290A56450M15268k129G8976K92668p0596E5443
13576B95604P568h5564A07232M9723J06194J51120j19180L5862I6735K34103A56853
13564G4466L92022N7698k558j33207p4262I4594K21514K04098B57835j14334n1903
13553I1598f4348i127p5507G0036N37457B74773r3446O5841D9592K91045j52392
$$ y = [430914, 523554, 329995, 461386, 583754, 502377, 403009, 369654, 513380, 180170, 614882, 341454, 413308, 143957, 80992, 131568, 391747, 334897, 629363, 234785, 718156, 118380, 76699, 141868, 376829, 196218, 356199, 119241, 38527, 126930, 234751, 73875, 481452, 43670, 315808, 39247, -3339, 299090, 3841, 200913, 314668, 152567, 299373, 415133, 376695, 352000, 323710, 156450, 571718, 569589, 78976, 371644, 301048, 55443, 295604, 303172, -85564, 107232, 156955, 263149, 414269, 295089, 330951, 96735, 330838, 156853, 74466, 466488, 524186, 521628, 388421, 314159, 94594, 316108, 520206, 257835, 143501, 91598, -64348, -9127, -84634, 70036, 607493, 274773, 181327, 247168, 49592, 340637, 188245]
13542A88245O9946P0023j24702e4045I1357K48889A01085a16472B14496m472J40403
13531C50427q6325n9177N7887l2016R6412A45189b0824k33510C43251p6948J09695
13520C75998r4219b0421B39396m3658a84431B70195A32353J3843d78C96586A20287
13508B36680D619Q2874a19373E55316B75452A27577l5818Q145P3236J45665j00427
13497B18378p5024n914L08063R2612i5353D45968A99767K0604k852j5505K8200
13486B30214j6831Q3320i3296C87179N9188j73757j29264b72508B22481P3043
13476B95524A41413a3561B76095p7855q8489P8065J15491M3570c6404D3657J67875
13465B11532J7435b1885C50435l6571r0223a37272B05881j5049m7642k8135B9413
$$ y = [188245, 258191, 328214, 203512, -54045, 91357, 340246, 101085, -116472, 214496, 210024, 350427, 264102, 204925, 262812, 230796, 327208, 145189, -20824, -254334, 343251, 266303, 375998, 281779, -20421, 239396, 195738, -184431, 270195, 132353, 146196, -478, 396586, 120287, 236680, 4619, 87493, -119373, 555316, 275452, 127577, 91759, 99904, 173140, 318805, 218378, 143354, 137440, 445503, 538115, -95353, 445968, 199767, 220371, 217519, 202014, 230214, 213383, 296703, -93296, 387179, 446367, 272610, 143346, -272508, 222481, 295524, 141413, -13561, 276095, 198240, 109751, 187816, 303307, 346877, -36404, 43657, 211532, 228967, -21885, 350435, 313864, 223641, -137272, 205881, 190832, 143190, 115055, 29413]
13453D09136j79965M6480A26073J44943k1738L0106j23893J45906M3972H0009
13442B40462I2528K96506A59734k4513A094J43557i2640k525B41571A6099a96611
13430i3834B56209a6128B21947J57371A66317J41805d3983O323A21519m5804J87969
13419B63684a39134A63719p5470N8543P8594H1365K80489M8713j64072a69302
13408A43099C5403a37584B32992F918b6315C03087K0964o4223m2084i5063B29392
13396C52L65041J13029j69763a59979C75854A84532k3702L00596B7955K11056
13386B39011r4908Q8005K11031k2879d2625B96649C7862M43450A84260R6676A20144
13374B75498e3274A10871O8464B2970J54895l6288f0573J793C56276m6344r3378
$$ y = [409136, 229171, 275651, 126073, 271016, 249278, 279384, 155491, 301397, 345369, 80009, 240462, 92528, 389034, 159734, 135221, 1094, 144651, -92640, -95165, 241571, 16099, -196611, -93834, 256209, -16128, 221947, 379318, 166317, 308122, -43983, -37660, 121519, 75715, 263684, -139134, 163719, 88249, 146792, 225386, 81365, 361854, 410567, 246495, -169302, 143099, 35403, -137584, 232992, 6918, -26315, 303087, 324051, 259828, 217744, -95063, 229392, 352, 365393, 478422, 308659, -159979, 375854, 184532, 160830, 461426, 27955, 239011, 144103, 232108, 443139, 420260, -42625, 296649, 37862, 481312, 184260, 280936, 120144, 275498, -53274, 110871, 179335, 22970, 177865, 141577, -60573, -58780, 356276, 309932, 216554]
13363B16554G7668C8004a89347B16201B9465c2627A49035F1401B1923d0084C7286
13351D0944h4303C08453A36771L13903A38975J57943I1868L16175A14279E1700
13340B43588R2054F7854L35732D9557L33442l6339p5510J24488n9471r5018g7755
13328I5344C6639K9708J26260q7268a34j50766B49803O3802j14681O5374j20787
13317A43511b1396E7970R1540Q7680J64144r0926A33075b57878A05318m2471K85748
13306C48595A05435R6742J79177b0501C07992G4725R996p127a63951B1566K23468
13295B45034M846a86489A0329M3831J93811c0351A36494E4383N55895B01668B4779
13283C17774c9815A67580K09086I8080R0452o0920h2627L1975m8260C33843i9496
$$ y = [216554, 77668, 38004, -189347, 216201, 29465, -32627, 149035, 61401, 21923, -40084, 37286, 40944, -84303, 308453, 136771, 450674, 138975, 296918, 91868, 408043, 114279, 51700, 243588, 335642, 67854, 403586, 49557, 382999, 346660, 271150, 395638, 336167, 241149, -77755, 95344, 36639, 66347, 192607, 105339, -134, -150900, 249803, 313605, 198924, 264298, 143511, -21396, 57970, 149510, 237190, 401334, 310408, 133075, -257878, 105318, 62847, 348595, 105435, 202177, 381354, -20501, 307992, 74725, 84721, 77594, -163951, 21566, 245034, 249880, -186489, 10329, 54160, 247971, -30351, 136494, 54383, 610278, 201668, 24779, 317774, -39815, 167580, 376666, 98080, 188532, 127612, -82627, -50652, -98912, 333843, -99496]
13271A16511h284C23030F9854c9230j4086H1599g0513E6094J96336n4053a63482
13259c4819j1620B83626m2933H9569L05367A41606N1129e4362j66318H0609L24992
13248D05601i0141A22891C8592J95847j9793E4457J42722E5678j7622c86674A20316
13236e5939B8762a13291B73286q3797K03288j65935a2798D55857I0575g2038B54835
13224B17778M0687E1893J13497C6158L24439o0328e1740k0840C27509p8530c25321
13212a28160D1840J37561b12144a4084l2626A86869P5775j30421J84031j26285
13202A89969J27463A17459l1261J41588a29620a2753j04486A03446J26218B5658
13191B098a07096N0726a1664B9307J54749D5041J28437L4842j0259b68880i1664
$$ y = [116511, -8284, 323030, 69854, -39230, -53316, 81599, -70513, 56094, 252430, 198377, -163482, -34819, -46439, 283626, 240693, 89569, 394936, 141606, 192735, -54362, -220680, 80609, 405601, -90141, 122891, 38592, 234439, 214646, 54457, 197179, 55678, 38056, -386674, 120316, -55939, 28762, -113291, 273286, 189489, 392777, 226842, -12798, 455857, 90575, -72038, 254835, 217778, 258465, 51893, 165390, 36158, 360597, 300269, -51740, -72580, 327509, 248979, -325321, -128160, 41840, 179401, -212144, -14084, -46710, 186869, 262644, 132223, 316254, 189969, 317432, 117459, 86198, 227786, -129620, -12753, -117239, 103446, 229664, 25658, 2098, -107096, -56370, -11664, 29307, 184056, 45041, 173478, 208320, 198061, -268880, -91664]
13179G6546J4802b72382i0255E6247q206J59449M9028A11043b058B04672H7478
13167A3656J97255r9352c12120F1680E064a44564n730B17877a5828r8354J4029
13156a00153B22178c4439j14787F9780a40713A73865N6598h9681C74817A34326
13145I3895c59255A30122A4042J15339N7799l8539g3417L3639q4445j6345h924
13133C54086B5709L78608b2788A8793g688B12878r2245n3223M8713n1962g2021
13121e257b012B2498c68864H4430R5241a315j4023j99371A97906I990O9995b70198
13108b27738A87735f3142K7987C28591p3055i1544B89709A38416n1470C8073J08741
13097A46814J63181b75399J35305N0218o5345A67683a27084C83844h1468A7476
$$ y = [76546, 91348, -272382, -90255, 56247, 48041, 207490, 256518, 111043, -2058, 204672, 87478, 13656, 210911, 111559, -312120, 61680, 5064, -144564, -150294, 217877, -15828, -114182, -100153, 222178, -34439, -149226, 69780, -140713, 173865, 230463, -89681, 374817, 134326, 93895, -359255, 130122, 14042, 129381, 187180, 148641, -73417, -39778, -124223, -140568, -8924, 354086, 25709, 404317, -22788, 18793, -7688, 212878, 120633, 67410, 116123, 64161, -72021, -5257, -2012, 22498, -368864, 84430, 179671, -1315, -15338, -214709, 197906, 9990, 79985, -270198, -227738, 187735, -63142, -35155, 328591, 255536, -91544, 289709, 138416, 86946, 38073, 146814, 309995, -275399, -140094, -89876, -155221, 167683, -127084, 383844, -81468, 17476]
13086c95557B35515K3924a65437A99181H0966J28521o1259g0921G2105k5070j5535
13075C1500J1480K94877j37331G5632a55675A03512l1541C1346K53555r0089N6636
13064B51448d3409B006h53q6808B95804J7507a7979B10968g9691A75636b12674
13052b1321B18740j223K74163C3787e3464H4605a07509B67031H2178N01636a21250
13040b13038d1526A99224C7085K07353C2569a4136m2758C52888A6137J03110f466
13028B45042J27638j41585a65693E8317K5135L00295c7434C38120A29870M3174
13018A73044B4989J6194i3948j5041d7152m2143I5724A2260a6865E5851M587h3013
13005c3823j14665D4845J44460q6633M1083a6717j60156h3311n7120C65587I3252
$$ y = [-395557, 235515, 259439, -165437, 199181, 80966, 209487, 148228, -70921, 72105, 47035, 31500, 42980, 337857, 200526, 75632, -155675, 103512, 71971, 31346, 284901, 194812, 251448, -43409, 2006, -853, -87661, 295804, 313311, -17979, 210968, -79691, 175636, -212674, -21321, 218740, 217517, 491680, 33787, -53464, 84605, -107509, 267031, 82178, 583814, -121250, -213038, -41526, 199224, 37085, 244438, 32569, -14136, -56894, 352888, 16137, 119247, -6466, 245042, 372680, 231095, -165693, 58317, 83452, 383747, -37434, 338120, 129870, 173044, 24989, 41183, -93948, -108989, -47152, -89295, 95724, 12260, -16865, 55851, 60438, -83013, -33823, -148488, 44845, 189305, 102672, 143755, -16717, -176873, -83311, -140431, 365587, 93252]
12993B08721D6034b9333o381A41098A7274O7781R5774B5419a95864C4779K67817
12982C02596A77J09910g685A6258b32960H5598a25591C1126J54314n859O6145
12971B45726c9189A92438G8135a31836c4815I9078i1583A7417J21044d6375B55364
12959a93032a1624k8042l80649B6023Q30c01976a14204A09958b15680E8593b26918
12947C70236D3589b88724i6010A8863J18341h5604E5464J22278a7209B62900i1802
12935D4409a82550A16139i7920B97494e0849F4582J3688P6279R0076j00599a09586
12923E8627K09494k8904a9765B20234r0907b67249A2338M0671L9430a16497A3987
12911F9652a96938c8323B54077j15522A1688b19695A42720c79706A46302B1407
$$ y = [208721, 46034, -29333, -35714, 141098, 17274, 85055, 180829, 25419, -195864, 34779, 302596, 177, 110087, -7685, 16258, -232960, 85598, -125591, 31126, 185440, 179581, 245726, -39189, 192438, 78135, -131836, -34815, 99078, -91583, 17417, 138461, -46375, 255364, -193032, -11624, -39666, -420315, 26023, 26853, -301976, -114204, 109958, -215680, 58593, -226918, 370236, 43589, -288724, -96010, 18863, 137204, -85604, 55464, 177742, -17209, 262900, -91802, 44409, -182550, 116139, -97920, 297494, -50849, 64582, 78270, 154549, 244625, 144026, -109586, 58627, 268121, 239217, -19765, 220234, 129327, -267249, 12338, 53009, 92439, -116497, 13987, 69652, -196938, -38323, 254077, 138555, 11688, -219695, 142720, -379706, 146302, 21407]
12900b19192b3274A1113K39062K34387a88066L9528q8450h9124A25987J10742
12890B36729g6554C0862h3451A30636a8523j29602N7975F3131K0900e7629E9882
12878B7943a17790Q601B4561a55452A27374a31646J8852J6090j5718H8885b35051
12866i7393j26613k5224B33139a70685E7976I773c47568A06282k0425K8792c2785
12854A25155a13583a7714G93J77133b6451A59470h7013l47508a21290A04511i1381
12842e5178D9361a04346m2572B18611d9053l909j77551I1160m1022a65894A02128
12830b56294b957C5875J184A2395M3925a5946j11292A25928b14626a9426A7241
12818F8647P6425C9766b01233F8524K5486C953J5766f5610C715c03788a36812
$$ y = [-219192, -23274, 11113, 250175, 484562, -188066, -148538, -236988, -89124, 125987, 236729, -76554, 30862, -83451, 130636, -18523, -148125, -90150, 63131, 84031, -57629, 59882, 27943, -117790, -109189, 24561, -155452, 127374, -131646, -112794, -96704, -112422, 88885, -235051, -97393, -224006, -249230, 233139, -170685, 57976, 9773, -347568, 106282, 85857, 114649, -32785, 125155, -113583, -17714, 793, 177926, -26451, 159470, -87013, -434521, -121290, 104511, -91381, -55178, 49361, -104346, -146918, 218611, -49053, -52962, -230513, 91160, 50138, -165894, 102128, -256294, -2957, 35875, 37059, 12395, 56320, -15946, -127238, 125928, -214626, -19426, 17241, 68647, 145072, 39766, -201233, 68524, 94010, 3953, 19719, -65610, 3715, -303788, -136812]
12806A6463b05003g9585E7012a6690A58429J64491h1888q075K0886A13430k611
12795A10819a20461l0276A06405h7615p0751q1604J18182n8181A37897D3879J59807
12784B03686K44865k17414b34318e3081p1787G8726A0741L2946Q8147a08017A88247
12772d9522B9408j3310O2656A0871c2130k9862k8407B38349D9726N4251a72664
12760A83709b77700h1776b0053k56786A59452g9043K4667B55868a84751p294k7828
12749b19873a0696A27021b03979R8825K7477F1138q682K48827F6529A967K07671
12738B09638J6280a04589d4798i698A31740j0608a33362C5734P4621b03598G852
12726B6245K13945A0691f3302H3438g5088D5297M9705K82422G2284I969N6340
$$ y = [16463, -205003, -79585, 57012, -16690, 158429, 322920, -81888, -89963, -69077, 113430, 110819, -120461, -150737, 106405, -87615, -158366, -239970, -121788, -179969, 137897, 43879, 203686, 448551, 231137, -234318, -53081, -124868, 78726, 10741, 43687, 131834, -108017, 188247, -49522, 29408, 16098, 78754, 10871, -32130, -61992, -90399, 238349, 49726, 103977, -172664, 183709, -277700, -81776, -20053, -276839, 159452, -79043, -54376, 255868, -184751, -192045, -219873, -10696, 127021, -203979, -105154, -77677, 61138, 52456, 301283, 66529, 1967, 209638, 225918, -104589, -44798, -9698, 131740, 121132, -133362, 35734, 110355, -203598, 7852, 26245, 240190, 10691, -63302, 83438, -75088, 45297, 95002, 377424, 72284, 9969, 66309]
12715F6309R6875a8056C09a79293A08623K0405B0422O9760J61525J2152r6456
12704A67403B9761j626J6905A349d4314f227r021j54329C68706d891G429f6633
12691I6207c4984N175k22806j0557A47874F8592c47123A3491O1469d330A59833
12679b05040C613a50490A13676L0615a15205B54908c89551A08300r73L7830O7453
12668B12610I4820f4301j88582H9797o958K21901j51624J47435n4843I7636a4949
12656F5046J5068B2689Q0650a35057G7487B5781J48261H1289R2177g2117F3846
12644b8875p4773A62170L1702C9074N6643L39765a42632B8595f7546D22915A36208
12632A37862F145L1777L11747a17812N8886l7893M2367o7915G7797Q0800B756
$$ y = [66309, 163184, -18056, 309, -179293, 108623, 129028, 20422, 90182, 251707, 263859, 167403, 29761, 28135, 45040, 1349, -44314, -6227, -15248, -169577, 368706, -4891, 7429, -66633, 96207, -34984, -29809, -252615, -263172, 147874, 68592, -347123, 13491, 74960, -4330, 159833, -205040, 3613, -150490, 113676, 144291, -115205, 254908, -389551, 108300, 107327, 145157, 212610, 94820, -64301, -252883, 89797, 82839, 304740, 153116, 300551, 245708, 97636, -14949, 65046, 80114, 22689, 103339, -135057, 77487, 25781, 174042, 81289, 173466, -72117, 63846, -28875, -103648, 162170, 193872, 39074, 95717, 435482, -142632, 28595, -67546, 422915, 136208, 137862, 6145, 37922, 349669, -117812, -58926, -96819, -54452, -122367, 77797, 158597, 2756]
12620a45734A4373a34947j85523N2674h0443j62172a15096M3001j3168C41J41754
12609A42095a9037k22040A88382H8116a7422k2182r0506B48332D4470J59266H4488
12597b0754i746E6791a48930G1369b49284J19998n0620j35992G4969g3610A42698
12585I5437b7698j15551A26060J36180o6327b8891F1361B5803d5792o3111j67917
12574b76820A69386c7136E24756H0617J39332k8943I0190b56496b5296q4202D7527
12562b00303d4777A00865J52250j2033f7118k19168i1740g618D00938a09005B2709
12550B3949a40292A024a86043C2854J6800j8079K09459b97003a39044j8492d538
12538E0369J27967a02887k65843I5517L64425A06591D3522P7909E5642e7484m1700
$$ y = [-145734, 14373, -134947, -320470, -267796, -80443, -242615, -115096, -72095, -85263, 341, 142095, -19037, -241077, 188382, 88116, -17422, -39604, -130110, 248332, 44470, 203736, 84488, -20754, -9746, 56791, -148930, 71369, -249284, -129286, -179906, -315898, 74969, -73610, 142698, 95437, -27698, -143249, 126060, 262240, 195913, -28891, 61361, 25803, -45792, -108903, -276820, 169386, -37136, 524756, 80617, 219949, 191006, 90190, -256496, -25296, -109498, 47527, -200303, -44777, 100865, 253115, 241082, -67118, -286286, -91740, -7618, 400938, -109005, 22709, 23949, -140292, 1024, -186043, 32854, 49654, 31575, 241034, -297003, -139044, -157536, -4538, 50369, 178336, -102887, -368730, 95517, 459942, 106591, 43522, 121431, 55642, -57484, -99184]
12527i9184J4772o9808A52887a76861f0317j16683N5849b5205l78468B5554a97760
12515a56035H6548e6174H1772a12747B04859k7520B4098a4285o6221A72703f2935
12503B4299b23562A94806o0568B2959P98a65859p2205E7221m070b46146E3348
12491H3630e4802A44678K53740b48148D6255K25298a48691B11260a39911A82654
12480a48894f6748A7484c16090a17735r1244f5305L1080a0027D9159c7144p5002
12469a12146M7379e052k5855j1766A55809F9278a80379A53587P1402J90360A03815
12457A25945Q1629C1J0759d3461D443a66045C33938P2731A44276A2054K10370
12446B22424h4095j16375h3272n8932F4360c54765a57360D5065L9404e4155j96558
$$ y = [-99184, -84412, -154220, 152887, -176861, -60317, -177000, -121151, -25205, -403673, 25554, -197760, -156035, 86548, -56174, 81772, -112747, 204859, 177339, 24098, -14285, -80506, 172703, -62935, 24299, -223562, 194806, 134238, 22959, 23757, -165859, -238064, 57221, 53151, -246146, 53348, 83630, -54802, 144678, 398418, -248148, 46255, 271553, -148691, 211260, -139911, 182654, -148894, -66748, 17484, -316090, -117735, -208979, -65305, -34225, -10027, 49159, -37144, -112146, -64767, -5052, -30907, -42673, 155809, 69278, -180379, 153587, 224989, 415349, 103815, 125945, 207574, 31, 10790, -43461, 4443, -166045, 333938, 406669, 144276, 12054, 222424, -84095, -200470, -83272, -142204, 64360, -354765, -157360, 45065, 84469, -54155, -250713]
12435b50713D1807a91099O6071I7163A2545K5754b99380A0736J29309b29789C79093
12423A8865d0177C27220d3914A4622N317a56649d2174B42056a56222l81786a70640
12411A86588c01225k5622a48656E0081d0114k60119J30962M4369p916A39730B7053
12399a07593j31197A50271i7936A89989b19267C3961M1932l2121b84898O6735
12389b18163D1505e2588b4364j20772d4675H2159l6677K3963M3557a37375M8118
12378h9257J9413B71554b11736A88556E0437p472K69530a26467B01710E6523J06986
12367A63509k5077b32889L1361b1412q1318j67701c1897H0626l576K4285i9038
12355A44795N9545c6296C4404a00878j18038j8162A61801a38904Q486a1510o994
$$ y = [-250713, 41807, -191099, -125028, 97163, 12545, 38299, -299380, 10736, 140045, -229789, 379093, 18865, -40177, 327220, -43914, 14622, 19939, -156649, -42174, 242056, -156222, -538008, -170640, 186588, -301225, -326847, -148656, 50081, -40114, -300233, -169271, -124902, -132818, 139730, 27053, -107593, -238790, 150271, -97936, 189989, -219267, 33961, 75893, 43772, -284898, -218163, 41505, -52588, -24364, -145136, -44675, 82159, 45482, 69445, 113002, -137375, -89257, -69844, 271554, -211736, 188556, 50437, 42965, 312495, -126467, 201710, 56523, 163509, 138432, -232889, -201528, -21412, -102730, -270431, -31897, 80626, 77050, 101335, -99038, 144795, 204340, -36296, 34404, -100878, -218916, -237078, 161801, -138904, -130418, -11510, -18504]
12344a8504j3684a1481j51852A46536b9480A75483p390m8635J11707A02118Q6603
12333A88721g7487K9530j06040q7331B07478J44098j20048K3501E4407K2117J16476
12322A93000q6667J31118o0205M2752d602A56080J17396F3299C1173b23797A16211
12310b3235A81276i6226C81259B2355b56636B8172P2135f5899A50569p3275g2525
12298a39012K95M0995j9019C3377g7310k2555A00718e030l54876e3303B50515
12286c7338r117B05536c5406A04625N4181p0690b29939G2775K12321j2231j05830
12275A67035J03808j27289M9287e7351G69J48290J87384r019n9149d9122B30546
12263B00856K8145D8531i5378A38796N7618e2764j59226B88047D3995J2580J913
$$ y = [-18504, -32188, -11481, -163333, 146536, -29480, 175483, 168093, 119458, 231165, 102118, 188721, -77487, -47957, -153997, -241328, 207478, 351576, 231528, 255029, 54407, 76524, 193000, 106333, 237451, 177246, 219998, -4602, 156080, 273476, 63299, 31173, -223797, 116211, -23235, 181276, -96226, 381259, 22355, -256636, 28172, 100307, -65899, 150569, 77294, -72525, -139012, -138717, -97722, -116741, 33377, -77310, -99865, 100718, -5030, -359906, -53303, 250515, -37338, -46455, 205536, -35406, 104625, 158806, 88116, -229939, 72775, 285096, 272865, 167035, 270843, 143554, 192841, -57351, 769, 149059, 336443, 327424, 268275, -49122, 230546, 200856, 229001, 48531, -95378, 138796, 196414, -52764, -211990, 288047, 43995, 56575, 58488]
12252E8488a0819C3386J20580j6298M2886d5575j47761A18280h959o7679G7870
12240g7732A24402E679Q8565O7615o0414P4575J30695q0086j06586D7616a03998
12228f7438l3886d4343A45594J15962m7910a46183C8122L99394A59357K40254
12218C99611G422J86034q4352K02878m8973F5695e8493k42551B4972a68859A19008
12206C88031G8568J6629J59610a21068I7883P591D0068J5061J97185J81909B15844
12194a3479B77096P0449a07297I2880J62337f558j16696G0911F859J64039G9808
12182A31795e1260C34371L3853G8056K47587b607j68921A03408K160M15506B16292
12170A78249I536c8307B07833p3412J77696J29648n6216A71635K09534A64051
$$ y = [58488, -10819, 33386, 153966, 137668, 180554, -45575, -193336, 118280, -8959, -76638, 77870, -77732, 124402, 5679, 94244, 161859, 101445, 176020, 306715, 226629, 120043, 47616, -103998, -67438, -101324, -44343, 145594, 261556, 213646, -146183, 38122, 437516, 159357, 399611, 7422, 193456, 109104, 311982, 263009, 65695, -58493, -301044, 24972, -168859, 119008, 388031, 78568, 95197, 254807, -121068, 97883, 105474, 40068, 55129, 252314, 434223, 215844, -13479, 277096, 347545, -107297, 92880, 255217, -6558, -123254, 70911, 6859, 170898, 79808, 131795, -51260, 334371, 368224, 78056, 325643, -2607, -171528, 103408, 105568, 521074, 216292, 178249, 9536, -38307, 207833, 134421, 312117, 441765, 385549, 171635, 381169, 164051]
12159f1916A57954a19365C29469j1324H332Q9657k8731e6477n8469a8558n8565
12148g7123A8622a7148q6599A52761b7523A17789g9140G1935H407L02790i9994
12136D4192K19431a2990r1591B9303K62114H0966j6758a42891l0411B88656A30704
12124a861B95200A1611J91572f6828B56340C6549J26246a7022A76795H2992K9050
12113A12042K59218d01211A13878Q0851a11099a4775B9114E244a36827A04183
12102b36141I3588b66117i1012k24313C5279K24370b1242k75306a01736A80589
12091C26499n9229c9999k4019B55432A3750a04359J0691C36025j52195n3032a46495
12079C39107j24740b838A70147J8962f2155B34692c12368I5169L9362R5279b8381
$$ y = [-61916, 157954, -119365, 329469, 318145, 8332, 97989, 69258, -56477, -114946, -18558, -77123, 18622, -17148, -103747, 152761, -27523, 117789, -79140, 71935, 8407, 311197, -99994, 44192, 263623, -12990, -104581, 29303, 291417, 80966, 64208, -142891, -173302, 288656, 130704, -1861, 295200, 11611, 203183, -66828, 256340, 36549, 162795, -17022, 176795, 82992, 112042, 371260, -401211, 113878, 194729, -111099, -14775, 29114, 5244, -136827, 104183, -236141, 93588, -266117, -91012, -315325, 35279, 259649, -21242, -296548, -101736, 180589, 326499, 267270, -39999, -64018, 255432, 13750, -104359, -93668, 336025, 183830, 130798, -146495, 339107, 214367, -2838, 170147, 189109, -62155, 234692, -312368, 95169, 134531, 229810, -28381]
12067A42433i6598E14133a00323F3136H013b18918a05150A54159a09529k6427
12057a35956j87860C57501a38362L5735F00795k20454D4080a35938a4872A00871
12046I1861e8549k09483f8554H8193d360l7960p5735A03171B6966b08675o785
12035b15460A57896j7475b23977L6622j05084J1371R4941A00459a73134j5154
12025a88288A7383b4742A25968h163k17561b9289q5223C85513G694N6610L0353
12014I4657Q6628J10584h4994B86570F1923K08732c715n685j9946o4797q9935
12003a84078O1483n9487A00584b45423g633A75937a27258q4793R9318k3473B74131
11991A49385f9504A39725c6040o8401j0976C30004a13216k96977a20522l3901
$$ y = [142433, -96598, 514133, -100323, 63136, 8013, -218918, -105150, 154159, -109529, -135956, -323816, 357501, -138362, -102627, 600795, 380341, 44080, -135938, -14872, 100871, 91861, -58549, -268032, -68554, 88193, -4360, -42320, -118055, 103171, 26966, -208675, -215460, 157896, 140421, -223977, -187355, -292439, -281068, -186127, 100459, -173134, -188288, 17383, -24742, 125968, -8163, -225724, -29289, -114512, 385513, 7694, 64304, 94657, 181285, 291869, -84994, 286570, 61923, 270655, -3715, -9400, -29346, -94143, -184078, -122595, -182082, 100584, -245423, -7633, 175937, -127258, -212051, -112733, -136206, 274131, 149385, -69504, 139725, -36040, -104441, -115417, 330004, -113216, -410193, -120522, -154423]
11981a54423g7183k28481h9183o2585I4986b65296A11427a06426e0113j63093
11971b13206a02121A77697b0860j97367A11365n694b60271H6208L01265A02442
11960c37344a18790A7522L3406m670a57481r3562d2479B3101b24636C1873J08537
11949A40410g5375a1360a092n4821H1389M07510B3059M06668H5123c4781G2189
11937h2598A14961B9309b53555b9925q9578K1507B22720r5405e5332n5226C2873
11925B13586n828a782A24864E174P6122b08679k6938P6469D7127j9270K1258E714
11912c11601n9095b8866D5695Q5074a99114b7967p5890E03642d3994j69504A23232
11900a00550l9143j44059H246N9072b69605J3801a5656n7310B3439l048a16078
$$ y = [-154423, -77183, -305664, -89183, -151768, 94986, -265296, 111427, -106426, -50113, -213206, -102121, 177697, -20860, -218227, 111365, 105671, -260271, 86208, 387473, 102442, -337344, -118790, 17522, 50928, 46258, -157481, -251043, -42479, 23101, -224636, 31873, 140410, -75375, -11360, -1092, -55913, 81389, 488899, 23059, 429727, 85123, -34781, 72189, -82598, 114961, 29309, -253555, -29925, -119503, -97996, 222720, 127315, -55332, -110558, 32873, 213586, 207758, -1782, 124864, 5174, 81296, -208679, -235617, -159148, 47127, 27857, 49115, 5714, -311601, -370696, -28866, 45695, 130769, -199114, -27967, -103857, 503642, -43994, -213498, 123232, -100550, -139693, -283752, 8246, 67318, -269605, -255804, -15656, -72966, 23439, 20391, -116078]
11888a4639o3877B43747b7593j9040i703A07474g6922C8738a16684J538B52969
11876A3975a00226A40448c79128a82523F7444d1577j46546A5968c43684H245c01017
11864b47980E1048b08115A63584A5023a26936C3583K23597c7187N814j5576K1258
11853b5691C55266A52383C0558b44918A83303a68050A44766b82351I4533b92643
11842A5133L22629b05642b5437F9804f4515j05568J2855c0279A68966b53913G991
11830e16308A84938a09704C49994j59452a40722B40106a31258p9444k6473C01423
11819D28903F1980C189J62072Q622B9903Q6827e8445K3285b084C3014O1902a57042
11806c61676D34613a07298B13675a82815b855j90804A46525a66319P4073j12815
$$ y = [-14639, -78516, 243747, -27593, -46633, -9703, 107474, -76922, 38738, -116684, -115146, 252969, 13975, -100226, 140448, -379128, -182523, 67444, -41577, -188123, 15968, -343684, 8245, -301017, -247980, 51048, -208115, 163584, 15023, -126936, 33583, 257180, -37187, -31373, -46949, -25691, 355266, 152383, 30558, -244918, 183303, -168050, 144766, -282351, 94533, -292643, 15133, 337762, -205642, -25437, 69804, -64515, -170083, -157228, -30279, 168966, -253913, 7991, -516308, 184938, -109704, 349994, 190542, -140722, 240106, -131258, -210702, -237175, 301423, 428903, 61980, 3189, 165261, 173883, 29903, 116730, -58445, -35160, -2084, 33014, 94916, -157042, -361676, 434613, -107298, 213675, -182815, -2855, -193659, 146525, -166319, -92246, -205061]
11796b05061D5387L5778e2779B85831c30741A72479d8885j72809D6426o127A0276
11784b92917A41328b64813B04998c79805H1106k7430a75589Q0968C29111c25157
11773g0814l05226o9083H8143B5132J16594e78885G8089J75692A0211J84096j4810
11762A79497b72578p1091A05068a57426P1126j18631a00342B03621b39762N5490
11752a84272B4454K0523K930a16416N4874H5196e494j8670k43804J12528c1230
11740B28795a19687A53941h2415F2797M7746g0159k2419G1568d83839a55519E9582
11728e2655q8069A83900F3951Q2514a5347l21939B6704h6915n1557A3761J6780
11717C0541a08881c0130B58847a53128L624A02112P3095l8173m5656K12115a49664
$$ y = [-205061, 45387, 81165, -52779, 285831, -330741, 172479, -48885, -221694, 46426, 40299, 10276, -292917, 141328, -264813, 204998, -379805, 81106, 53676, -175589, -94621, 329111, -325157, -70814, -376040, -445123, 88143, 25132, 141726, -578885, 78089, 253781, 10211, 194307, 179497, -272578, -343669, 105068, -157426, -86300, -204931, -100342, 203621, -239762, -184272, 24454, 44977, 47907, -116416, -61542, 85196, -5494, -24164, -267968, -155440, -31230, 228795, -119687, 153941, -82415, 62797, 110543, -70159, -92578, 71568, -483839, -155519, 59582, -52655, -140724, 183900, 63951, 146465, -15347, -337286, 26704, -86915, -138472, 13761, 30541, -108881, -30130, 258847, -153128, -149504, 102112, 175207, 137034, 91378, 303493, -149664]
11705b16493f9281m7095N7534J3720l9186l7839B4420q502K24804a4437I2592
11693c79626C1177a4622o762k36661d3929H1150N0132J31583c22309B56667C4088
11681i6502A6709L29647f0437K2582B98114A4433J3642b74815B21236a2589B79060
11669B1093Q3393a41271k48747a5293j85727F3736a68870Q2274J1497E7324A9824
11657A91337i5576a414B44052h4630I0992h4999B59438B29J28452b38415A72304
11645a78512c6429l85320H8410f5840k31787A23028b93341J37630k15450I375
11634A92094o7215J22667c18193J22550N4474N1673a8159B9201e744B08198A04064
11622a83205D9957a54753B2243N7262P0844a1232C4657b61172c7517j4841A38781
$$ y = [-216493, -69281, -116376, -58842, -45122, -84308, -122147, 24420, 15918, 240722, -14437, 92592, -379626, 31177, -14622, -21384, -258045, -43929, 81150, 131282, 262865, -322309, 256667, 34088, -96502, 16709, 346356, -60437, -37855, 298114, 14433, 28075, -274815, 221236, -12589, 279060, 21093, 104486, -141271, -390018, -15293, -201020, 63736, -168870, -86596, -75099, 57324, 19824, 191337, -95576, -1414, 244052, -84630, 90992, -84999, 259438, 229, 128681, -238415, 172304, -178512, -36429, -421749, 88410, -65840, -297627, 123028, -293341, -155711, -371161, 9375, 192094, 124879, 247546, -318193, -195643, -141169, -89496, -18159, 29201, -5744, 208198, 104064, -183205, 49957, -154753, 22243, 79505, 150349, -11232, 34657, -261172, -37517, -52358, 138781]
11610f9083D8671b6296A05199J46228K7670G1592O3669J7827b4505A28284b19258
11598A52328a50755J9525F2337k9857O33a34997j26356A46876b25495B69001j23257
11587A45744D3839J94501E4463b31857C48563a49481B0756J35724F8638a83427
11576A14362n286E1719J00016d762A00816a87925b5945j78842A64681r873i2004
11564a49244F2624a24034G581L6929K6728l2868J35647a40521D1554K00036b14290
11552F1932a43155B8651a21467A03290C5538J81477R621c29506H8293c06737a0286
11540a82985e4600D8902R46J01438K5034f2528B32694I4656J67889d7852A85149
11528G91J40629A3282K49715A0193N0042a85913j840A14976b2431B02374k1860
$$ y = [-69083, 48671, -26296, 105199, 251427, 279097, 71592, 135261, 153088, -24505, 128284, -219258, 152328, -150755, -131230, 62337, 32480, 33113, -134997, -261353, 146876, -225495, 269001, 145744, 43839, 238340, 54463, -231857, 348563, -149481, 20756, 156480, 68638, -183427, 114362, 109076, 51719, 151735, -4762, 100816, -187925, -25945, -204787, 164681, 154808, -92004, -149244, 62624, -124034, 7581, 44510, 71238, 38370, 174017, -140521, 41554, 241590, -214290, 61932, -143155, 28651, -121467, 103290, 35538, 217015, 226636, -329506, 88293, -306737, -10286, -182985, -54600, 48902, 49848, 151286, 176320, -62528, 232694, 94656, 262545, -47852, 185149, 791, 141420, 13282, 262997, 10193, 60235, -185913, -187753, 114976, -22431, 202374, 180514]
11517A80514a52289H9828J6640i8590C53748a9220A12116R2871k1748a39597j85598
11506c25195J42490k27313F8225J45399O8879j9181j8916m5086a91357q3224J04390
11495a70191d6143o950M566B1424P0566J0259a78228m4017H559J73786m3692c3155
11482C01535E8822c2173A26012N8790h915n3109j1372b8315p9573d9365l2482
11471h1847A59288c7110l8862A02232m664k5455J97769e6457j97558I9831J02376
11460B02207m4637J48822m4317D4445J1987a2104B29048J13177a9705j9427A6262
11448B31350e608B0652a87397d7342E1446a65544e3250E7660b5716B6850J58984
11437A85834h798j55274F7292a94507A29618B4549K02495k4712M2700e3621p1629
$$ y = [180514, -152289, 89828, 106468, -98590, 353748, -19220, 112116, 204987, 183239, -139597, -325195, -182705, -410018, 68225, 213624, 282503, 263322, 244406, 199320, -191357, -274581, -170191, -46143, -53093, -48527, 21424, 91990, 102249, -178228, -222245, 8559, 182345, 138653, -33155, 301535, 58822, -32173, 126012, 184802, -8915, -62024, -73396, -28315, -107888, -49365, -81847, 159288, -37110, -75972, 102232, 97568, 72113, 269882, -56457, -254015, 99831, 202207, 157570, 306392, 262075, 44445, 56432, -12104, 229048, 342225, -19705, -39132, 16262, 231350, -5608, 20652, -187397, -47342, 51446, -165544, -53250, 57660, -25716, 26850, 185834, -8798, -164072, 67292, -194507, 129618, 24549, 227044, 202332, 245032, -53621, -125250]
11426a25250L2387k28A35517c07737I9333Q0638j5879m0035A9902a60806H265
11414F1398a13204N3734m36739B04949D1249b17231M1052a0993q7223B38725L2187
11403B70912L541G1685h3855A22689A2181n008f5718J308J7746I678K7431J21548
11391A58657c2914o0641G3840L1818l3143D198a39151J3140l414A63986a64453
11379a57615A69540b364j60659k67013E3791j5597f1632A28076a95465B00906
11368a01727A93749b72630c9609j0107A19365k3959D7640M5065c80677i590E1994
11356a3634j75920k0751d8639j00056A4224e5708j21613B0900a07947a4292K642
11345a1650j18527B96671A4782d1187B95042a21330B2884J91924a97098r2799
$$ y = [-125250, -92863, -93091, 135517, -307737, 99333, 179971, 164092, 124057, 19902, -160806, 8265, 61398, -113204, -59470, -496209, 204949, 41249, -217231, -176179, -10993, -98216, 238725, 270912, 274453, 71685, -83855, 122689, 12181, 7173, -65718, -64410, -46664, 9678, 37109, 158657, -32914, -93555, 73840, 105658, 72515, 4198, -139151, -126011, -129425, 163986, -164453, -157615, 169540, -2364, -163023, -430036, 53791, 38194, -61632, 128076, -195465, 200906, -101727, 193749, -272630, -39609, -49716, 119365, 95406, 47640, 92705, -380677, -9590, 51994, -13634, -189554, -210305, -48639, -148695, 14224, -55708, -177321, 20900, -107947, -14292, -11650, -130177, 296671, 14782, -41187, 295042, -121330, 22884, 214808, -197098, -289897]
11335b89897R5693d4494D3669J65825q4419m4914c2659p3077B9376a14000j73713
11324b87713B63262A00213a69287J9674C6850d3449g548A66227h77A88662L8927
11313B27589d5344J1694j54866e5317k37141N0900A3602c6081A50257b61733p5987
11302c37720C02178a35656j75274A5056N2700J08645J09118j05683b18132A40361
11291i2660B2045a47332J3317k04392f2439I0629b67003G9386P0026F4542h6447
11279a3609j47773a9356j5059j85772C140a28975j03762j34504d8869J9824p9539
11268a08584C28017b66005J23327r7236a02739L1387n7821j6469J2452H3010O5781
11257A48791h3543K7493b0293k72071L4014J26592G4532e7964j34345B17854b60868
$$ y = [-289897, -194204, -44494, 43669, 209494, 125075, 80161, -32659, -105736, 29376, -114000, -287713, 263262, 100213, -169287, -149613, 36850, -43449, -7548, 166227, -877, 188662, 227589, -45344, -33650, -188516, -55317, -292458, -241558, 13602, -36081, 150257, -261733, -337720, 302178, -135656, -310930, 15056, 67756, 176401, 285519, 179836, -218132, 140361, -92660, 22045, -147332, -134015, -338407, -62439, 90629, -267003, 79386, 149412, 64542, -86447, -13609, -161382, -19356, -34415, -220187, 3140, -128975, -232737, -367241, -48869, -29045, -108584, 328017, -266005, -142678, -239914, -102739, -71352, -129173, -145642, -133190, 83010, 148791, -83543, -56050, -20293, -292364, -258350, -131758, 74532, -57964, -192309, 217854, -260868]
11245d6029j73943A99083h3010E5025d06606J85074B90469a72333J1335K8113
11235a32885q8755A34117J1669A6730h1832A41944a57467E1289a24570M6337r4262
11224a72495A64626h1249L6353A06410c70101e8908j89467A6a8996o6490r9234
11213a84720A0813a78886C080a71384e1481a6883k75637a3374C68661A81637D8975
11201b20532Q3332A69264J98760D9446b36419C2532M3052J08478r0359b81403
11190E9885k3644a57177m8166A98913C1620m487a4103C0985M9790c33106H7207
11178A98807g7536B62432C7219g6782a5761A63066K14219a44046k3964M0472k19914
11167c47452J60020O8670F6581k104c10537a04236m9811B9806c6437j31450A43161
$$ y = [-46029, -219972, 199083, -83010, 55025, -406606, -221532, 290469, -172333, -160998, -132885, -221640, 134117, 145786, 16730, -81832, 141944, -157467, 51289, -124570, -78233, -172495, 164626, -81249, -44896, 106410, -370101, -58908, -248375, 16, -18996, -85486, -184720, 10813, -178886, 3080, -171384, -51481, -16883, -292520, -13374, 368661, 181637, 48975, -220532, -137200, 169264, 368024, 49446, -236419, 32532, 75584, 184062, 93703, -281403, 59885, 36241, -157177, -205343, 198913, 31620, 27133, -14103, 30985, 80775, -333106, 87207, 198807, -77536, 262432, 37219, -76782, -15761, 163066, 377285, -144046, -168010, -127538, -347452, -187432, -118762, 66581, 64477, -310537, -104236, -154047, 29806, -36437, -167887, 143161]
11155g1988E6938H43a66077B27993B5901K2599J07866J21826a67061O2917A65562
11143c91156J21636a26211M866J0167B04525D882c0999a2917k5936q7756H6849
11131B78396A09607a29838C4591Q044b40242k01672A61045b52561A41686O3403
11121B05089f4477j1060A24988b9604j11251c6590j24310A43835a59609A45596
11110A11710b2717F9290f5644J4653k2798B35243a40278j29161J02266F0633b16196
11098c4139a5052A25280A1583c01178A31137A9882L5051Q1560L1781R3811R5663
11087C57748G8713g8126n7009A70306k8589b0663C33763K86420F2701K87601j42773
11076B07529J10939J1143A2291J96128R9141j2066A10802a56310B84072L58353
$$ y = [-71988, 56938, 843, -166077, 227993, 25901, 48500, 156366, 278192, -167061, -104144, 165562, -391156, -269520, -126211, -121345, -111178, 204525, 4882, -30999, -12917, -38853, -126609, 86849, 278396, 109607, -129838, 34591, 42635, -240242, -441914, 161045, -252561, 141686, 205089, -64477, -75537, 124988, -29604, -140855, -36590, -160900, 143835, -159609, 145596, 111710, -22717, 69290, -65644, -50991, -73789, 235243, -140278, -269439, -167173, 60633, -216196, -34139, -15052, 125280, 11583, -301178, 131137, 19882, 54933, 136493, 168274, 262085, 357748, 78713, -78126, -135135, 170306, 141717, -20663, 333763, 620183, 62701, 350302, 207529, 318468, 329611, 12291, 208419, 307560, 295494, 110802, -156310, 284072, 642425]
11066F42425k65365K4970K3118j74222J10703A8752L15950n0379J01120Q5185
11056D70628r8290n0513J3520k2623A06835L35376k18868K36835l2301j71189
11046B56688M03781j88612J70116O729k28617K93859k15824K88935k72213K21628
11036G36470J794C04106K26941j81719K83954L5447j06784J5032J63328k88059
11026D52246J57485p7780r027J892K20661J31130A11999L43141j70498L38547
11016F23189j87124j20447Q8429K30275B27157K27948J0514K69372k68689K98739
11006G65041j62023j65834J75787A54140L33267n9243j2417J14421J92484j45017
10996E77635J14940Q796k52513q1142P0329J44776j50597j9082J66069J58456
$$ y = [642425, 377060, 402030, 425148, 250926, 361629, 18752, 334702, 284323, 385443, 470628, 372338, 321825, 335345, 312722, 106835, 442211, 223343, 460178, 427877, 256688, 660469, 471857, 641973, 648702, 420085, 713944, 498120, 787055, 514842, 736470, 738264, 304106, 531047, 349328, 633282, 668729, 561945, 576977, 740305, 452246, 609731, 531951, 522924, 524816, 745477, 876607, 111999, 455140, 284642, 623189, 436065, 315618, 404047, 634322, 227157, 455105, 465619, 734991, 466302, 765041, 603018, 437184, 612971, 154140, 487407, 428164, 415747, 530168, 722652, 577635, 692575, 701371, 448858, 367716, 438045, 582821, 432224, 413142, 579211, 737667]
10986G37667o9828r3543J64173j94886L8692Q6373J49284D02965K39392M41570
10976A083927m73901M97101k25868K13434L22799j76732J14528N29185l1809K80949
10966B133613j26412n4945Q7217j13011O1101n33873j16541P8680l89530Q451
10956A034750j63108L10195R3302j11191L18389k71353k60760j6469D55170L11943
10946G67113j06895k26959j71625L5816L29546k4107b15809C05342j02651g6951
10935C5606J79286K3149c1120A47077K2821m9617O8699a4364B98051a59545C38407
10923d10335A09648b16867A98848N122a5743l3404B9810d48186a38452N0986j28545
10912b16011A5673o184J45148b71066B27271G3524O50J06393a31607A1909J64969
$$ y = [737667, 667839, 574296, 738469, 543583, 582275, 668648, 817932, 402965, 642357, 1083927, 610026, 1107127, 881259, 1094693, 1417492, 1240760, 1355288, 1884473, 1852664, 2133613, 2007201, 1952256, 2039473, 1926462, 1987563, 1453690, 1337149, 1415829, 1026299, 1034750, 871642, 1181837, 1275139, 1163948, 1482337, 1210984, 950224, 933755, 455170, 767113, 660218, 433259, 261634, 297450, 626996, 602889, -215809, 305342, 202691, -76951, 35606, 214892, 238041, -31120, 147077, 169898, 120281, 188980, -14364, 298051, -159545, 338407, -410335, 109648, -216867, 198848, 203970, -15743, -49147, 29810, -448186, -138452, -87466, -216011, 15673, 9489, 154637, -271066, 227271, 73524, 74174, 180567, -131607, 11909, 176878]
10901A76878a62596D2527J33810b45490a10151J6285K919q7163A1288a94245A50398
10889a35544j79433G949f1660j88519C9605J73060a91255O1686j75885g8584j57876
10878b36460D2415a17601l83690a61889A83389B6160a32322j3176g0676l3702
10868a04378M1743B60703l2685b15197A52673b23399d9593j28544a5640G2743
10857a24556O1775A08202B487N6695b1414k1472j22532m4611E221a5573D5848
10845b19747L6649j07793J15881B16614I4690K1097I444Q8631k9572b74453n0006
10834c24459A95303E1955a6785j25627E285Q0914a97091b10G4982j2896k0291
10823D1795i6872A73379g0858A33244l3391a26327b6286j97962P2306C35070a12677
$$ y = [176878, -162596, 42527, 176337, -245490, -110151, -93866, -90947, -178110, 11288, -194245, 150398, -135544, -314977, 7949, -61660, -250179, 39605, 212665, -191255, -129569, -305454, -78584, -236460, 42415, -117601, -501291, -161889, 183389, 26160, -132322, -145498, -70676, -104378, -62635, 260703, 228018, -215197, 152673, -223399, -49593, -178137, -15640, 72743, -124556, -62781, 108202, 2487, 59182, -21414, -42886, -165418, -210029, 5221, -15573, 45848, -219747, -183098, -290891, -175010, 216614, 94690, 115787, 9444, 98075, 68503, -274453, -324459, 195303, 51955, -16785, -142412, 5285, 86199, -197091, -210, 74982, 62086, 41795, -96872, 173379, -70858, 133244, 99853, -126327, -26286, -224248, -151942, 335070, -112677]
10811A46408a0530E9534g7324K8051k57758A51648N016J39570p1350a56567r1781
10800b48348F288h2952L5136j77334B1726G571c3481p6256j15244h8135a3567
10788c44272C9126R4552b06578P0011J9545L030J6375D2078J11052b59619A00866
10776A19563b7016A01195f0063j873Q619A04405b6297r5229A91025E4502b47692
10764b72207F9964d77710b09579a02099F6956O2989a97667j47172d4280m266l2515
10753h1061C2305P3320P480a85394l6697C86752E2920f7698B24688b82106c6555
10741F6967h3110L3106J1514q8593I6075a62847L7041B77769a76783M7764B64499
10729a34852K2963m8771A45616o0663l0632L2222c22765e5127l7997A17256J41297
$$ y = [146408, -10530, 59534, -77324, -49273, -307031, 151648, 156664, 296234, 224884, -156567, -248348, 6288, -82952, -47816, -225150, 21726, 7571, -33481, -109737, -224981, -88135, -13567, -344272, 39126, 133678, -206578, -136567, -117022, -113992, -97617, 42078, 153130, -259619, 100866, 119563, -27016, 101195, -60063, -61936, -53317, 104405, -26297, -121526, 191025, 54502, -247692, -272207, 69964, -477710, -209579, -102099, 66956, 129945, -197667, -344839, -44280, -48546, -81061, 32305, 105625, 113105, -185394, -222091, 386752, 52920, -67698, 224688, -282106, -36555, 66967, -83110, -50004, -38490, -127083, 96075, -162847, -125806, 277769, -176783, -129019, 264499, -134852, -111889, -160660, 145616, 84953, 54321, 86543, -322765, -55127, -93124, 117256, 258553]
10718B58553b81459B21267E800a2092l24842L2193a15856K0371h594A64159a12104
10706b43099A47851b57405b5114n5550j57322M7199H5787j1911P4224b6723G3216
10694D2938K56273j12397C9131g6801K826C18741a23783C5540i6755A10340d6846
10682A4995a49043B47636H8916h0207A0571a32958A88876c37417A72209a2899
10671b87482F2938J21385i1979E665b24837C7678A2138f36027K47559B4572I979
10659A29002j2216c35384b6651A42653a32058n6208P9275p9261D0334O3191D8078
10647I7203a63461a9594j57119A61647b05116D5521h5766j04854A40893D8936
10636b9940l11489C02027a50484m0912d5991J8164j5825k41985a13013A24362
$$ y = [258553, -281459, 221267, 5800, -12092, -336934, -304741, -115856, -95485, -8594, 164159, -112104, -243099, 147851, -257405, -25114, -80664, -237986, -190787, 85787, 73876, 148100, -26723, 73216, 42938, 299211, 186814, 39131, -76801, -73975, 318741, -123783, 35540, -96755, 110340, -46846, 14995, -149043, 247636, 88916, -80207, 10571, -132958, 188876, -337417, 172209, -12899, -287482, 62938, 184323, -91979, 5665, -224837, 37678, 12138, -636027, -388468, 24572, 9979, 129002, 116786, -335384, -26651, 142653, -132058, -188266, -108991, -188252, 40334, 103525, 48078, 97203, -163461, -19594, -176713, 161647, -205116, 45521, -85766, -190620, 140893, 48936, -29940, -341429, 302027, -150484, -191396, -45991, -27827, -43652, -285637, -113013, 124362]
10625B15030j00484h021o590I7249a29124E6293e2280J8836F0537g8405G7598
10613b3072j17304A03539a31710L752L9528r3380L3393A4712J02840B2529a8147
10601a91452O8657j46057P1920A11101c17571B5196a57188m9413A38357a68557
10590A36139a81744A81245c84080h2121E4416c89102J84074e9565r2081j10120
10580b61766N6812d9767j16039H5403R6920D0114a26134A45672F9034k0724a37599
10568c39082B9562R2797i2629C549O9495A1336J88392f2346C6475e7361j65645
10557b23006i015m0631k64107a29500o455c6355m5344C62867A7111h1352m2131
10546a23483j59638e2652J2953B32326j03488a47844J5683d4280k07994J10164
$$ y = [215030, 114546, -8021, -14611, 97249, -129124, 56293, -52280, -33444, 60537, -78405, 77598, -23072, -140376, 103539, -131710, -127958, -88430, -181810, -148417, 14712, 117552, 22529, -18147, -191452, -122795, -268852, -196932, 111101, -317571, 25196, -157188, -206601, 138357, -168557, 136139, -181744, 181245, -384080, -82121, 54416, -389102, -205028, -59565, -151646, -261766, -204954, -49767, -165806, 85403, 182323, 40114, -126134, 145672, 69034, 48310, -137599, -339082, 29562, 122359, -92629, 3549, 73044, 11336, 199728, -62346, 36475, -57361, -223006, -9015, -49646, -313753, -129500, -135955, -36355, -81699, 362867, 17111, -81352, -123483, -283121, -52652, -39699, 232326, 128838, -147844, -132161, -44280, -252274, -142110]
10536a42110L2583j26985B87030j11258N7667D7392K748g839j56057A00323a49088
10524A17457F51c39885D9257b02141A05064b78682J0713A0777i7946o316b3182
10512G0450a81587j85581H7564a17754B8107d24795a25477G118P381J55d2069
10500f1662k29676A9259J44465j1299H427i1572P634a912m2522n8938A30011a68407
10487b47980J01460m2110c2603I8123b81881F4887A6331J69793r2000C9623e8617
10475A1628a62702O8978J5776B59795f8223B98441j24101a52689D7021K64325
10465C11346i8671D7460m187g8589b5732E4080a92426A5960b64354a30800A0350
10453a36614J8176e6702l74539a14290K6409A61616N3669c073r0122A50366K2374
$$ y = [-142110, -109527, -236512, 287030, 175772, 233439, 47392, 50140, -7839, -163896, 100323, -149088, 117457, 651, -339885, 49257, -202141, 105064, -278682, -267969, 10777, -97946, -104262, -23182, 70450, -181587, -367168, 87564, -117754, 28107, -424795, -125477, 7118, 14499, 14654, -42069, -61662, -291338, 19259, 163724, 152425, 8427, -91572, -83938, -1912, -44434, -103372, 130011, -168407, -247980, -146520, -188630, -32603, 98123, -281881, 64887, 16331, 186124, 94124, 39623, -58617, 11628, -162702, -93724, -77948, 259795, -68223, 298441, 174340, -152689, 47021, 311346, -98671, 47460, 43273, -78589, -25732, 54080, -192426, 15960, -264354, -130800, 10350, -136614, -118438, -56702, -431241, -114290, -87881, 161616, 215285, -3073, -93195, 150366, 172740]
10442A72740a11407J3303j17610A36786f221E2378b35095H0374K5664h9701r7174
10431a86875A4966N6987E040N8553r739a56073b516A31868g746C67131b00417
10419a99373m4474A7715h1351A94459a69781e7536l4394A33041O1239b77629A73877
10407e5904o173H1702c6972a713k84480e8901C9706a50316B66163D4627J52705
10396A97332f6813j6488q7815e5002A49831F3615M1840b31180A20596E8772J92010
10385B50782q6416j466D693a45532d8984I3477M20036b9370F5501B6895J68863
10374A95758k5721M7494J28090c0079B28837j5051M12077k79672a35290B86849
10363B77482J86648A88022J2768l2437M9107q7521J74233F9458L4769l3909d95
$$ y = [172740, -111407, -98104, -215714, 136786, -6221, 52378, -235095, 80374, 106038, -89701, -186875, 14966, 71953, 5040, 63593, 53854, -156073, -2516, 131868, -7746, 367131, -200417, -199373, -243847, 17715, -81351, 194459, -169781, -57536, -91930, 133041, 194280, -277629, 173877, -55904, -62077, 81702, -36972, -1713, -286193, -58901, 39706, -150316, 266163, 44627, 197332, -66813, -83301, -171116, -55002, 149831, 63615, 105455, -231180, 120596, 58772, 250782, 164366, 162900, 4693, -145532, -48984, 93477, 513513, -29370, 65501, 26895, 195758, 170037, 217531, 345621, -30079, 228837, 213786, 625863, 346191, -135290, 286849, 277482, 464130, 188022, 200790, 168353, 217460, 129939, 304172, 69458, 104227, 70318, -495]
10351d3720J9900B33587R0156J2763R3627A06758L15447j14789A07818J29216
10341B37034l7154F344b40664A09148J7859M7663A2550K6378J23311B5186L3368
10330E8554L385a27299q850L3545A45738A4947b52558Q1240B14671e367B16792
10318A33074K11866m9939A30386j2282J04481H7206l9883J734g1353r8696g6158
10306A70569a36062k74746A95273b51666B62728j29218f5281A75665a37571B11562
10295A04561M0531a77864A07096P3823H4962K8921a21910F3412d9937l22275a67176
10283B08797j02829b57475A43480D366g836k24078A483K7678a54205c0547I7010
10271a9296A08216j2293b24485D9569j3408O747f4258I1239e12576J97213m7248
$$ y = [-43720, -23820, 233587, 323743, 336506, 430133, 106758, 422205, 307416, 107818, 237034, 199880, 6344, -240664, 109148, 127007, 174670, 12550, 38928, 162239, 25186, 58554, 61939, -127299, -136149, -102604, 145738, 14947, -252558, -171318, 214671, -5367, 216792, 133074, 344940, 295001, 130386, 118104, 222585, 87206, 47323, 49057, -71353, -170049, -76158, 170569, -136062, -410808, 195273, -251666, 262728, 133510, -65281, 175665, -137571, 211562, 104561, 145092, -177864, 107096, 180919, 84962, 113883, -121910, 63412, -49937, -372212, -167176, 208797, 105968, -257475, 143480, 4366, -7836, -231914, 1483, 29161, -154205, -30547, 97010, -19296, 108216, 95923, -224485, 49569, 36161, 42908, -64258, 91239, -512576, -315363, -362611]
10260c62611A20859a77390A00471b11289B60946k3878p104n0699L3129J21610
10250C34004b27506H5147i6762P020D36878b65606a04714B40788C6221P6485i1382
10238a16863k7467E4481J17963a46754A132L306J49994a22352D1305b49521C2444
10226b5557A60899c63295c0275A10172K04396A20014m3317b65637b3171A97121
10215a2290B6688P0264a05323B69321a17111d755A94078c4447o5620g391A34891
10203g8328j91402B98915D6757b45719a14715A92821a96278c5302n2513p0440
10193a58255B47551A1714b98177g0124D1986R0337l826b42459m7246Q0896g696
10181a88385K4824D1410L6299P69J8390h819k55185A76617a31454A01776b9360
$$ y = [-362611, 120859, -177390, 100471, -211289, 260946, 237068, 229964, 179265, 212394, 334004, -227506, 85147, -96762, -89742, 436878, -265606, -104714, 240788, 36221, 112706, -91382, -116863, -144330, 54481, 172444, -146754, 1132, 4438, 154432, -122352, 41305, -249521, 32444, -25557, 160899, -363295, -30275, 110172, 314568, 120014, 76697, -265637, -23171, 197121, -12290, 26688, 96952, -105323, 269321, -117111, -4755, 194078, -34447, -100067, -7391, 134891, -78328, -269730, 298915, 46757, -245719, -114715, 192821, -196278, -35302, -87815, -158255, 247551, 11714, -298177, -70124, 41986, 132323, 128497, -242459, -289705, -208809, -7696, -188385, -163561, 41410, 77709, 78478, 96868, -8819, -264004, 176617, -131454, 101776, -29360]
10169B14616P4422c087r7735J3425r6909g3726j28555G7450j7253c69489a01743
10157b1795k82809D5680K29570N8550b38273C2988a25381c9620o1343I4852B1325
10145c53054C8274b05463q8306F2593B8485i4487A12494d2474Q44k58604F6959
10133g8569n4444D5823a54627J7001j36622O9974L5445O4891C9513b53242A13503
10121A9330b83067A88453L1627d48883J56590o4749a26309f860l2684l68754Q7393
10110c20905L3619a05301b7532j04741c3891m6108G425a75752P0240B5145P3119
10099I8264a68064B7871c64984k4237D7165A7525b28599O0667K3503I1087C10
10087a30254A16380b29191g2321r345o1061f8646k9250E953K86268b27669l4081
$$ y = [214616, 289038, -3087, -100822, -87397, -184306, -73726, -202281, 77450, 60197, -369489, -101743, -21795, -304604, 45680, 275250, 333800, -238273, 32988, -125381, -39620, -100963, 94852, 21325, -353054, 38274, -205463, -293769, 62593, 28485, -94487, 112494, -42474, -41630, -300234, 66959, -78569, -133013, 45823, -154627, -137626, -274248, -204274, -168829, -103938, 39513, -253242, 113503, 19330, -283067, 188453, 220080, -448883, -292293, -357042, -126309, -6860, -39544, -408298, -320905, -287286, -105301, -27532, -132273, -33891, -79999, 7425, -175752, -105512, 25145, 98264, -168064, 27871, -364984, -389221, 47165, 17525, -228599, -167932, -144429, 91087, 310, -130254, 116380, -229191, -72321, -81666, -142727, -68646, -97896, 5953, 292221, -227669, -261750]
10076b61750E7348a13534j48676A8092d14812a18569A58588a99571H7669f5621
10065A96674b81718A444d7870B49593D523h6411E3366J1804h9007j52996e2204
10053a66268k15392a77149A78604b86281A59409e1537d616p5799j2908j33610
10043b26933B53698c14147g3023l1727j03004l43888f0929H4585b07724Q1209
10033a26515j24054A61422b33166A53563b09666O3392M2768A78984b05302O3228
10023a42074G6852N0969c48552a6567D0253e5526l1090m2701M6633j00798A42941
10011c4860I1627k375N0668e2698j9257D9515d47425F6617K74819r1775e6436
9999h8210B841a74569H3478a17036k42084C3208b0537A04245a59756A59609a07895
$$ y = [-261750, 57348, -113534, -262210, 18092, -414812, -118569, 158588, -199571, 87669, -65621, 196674, -281718, 1444, -47870, 249593, 4523, -86411, 53366, 65170, -89007, -242003, -52204, -166268, -381660, -177149, 178604, -286281, 159409, -51537, -4616, -80415, -93323, -226933, 253698, -314147, -73023, -104750, -207754, -551642, -60929, 84585, -207724, -126515, -250569, 161422, -233166, 153563, -209666, -146274, -103506, 178984, -205302, -142074, 76852, 127821, -348552, -16567, 40253, -55526, -86616, -129317, -82684, -183482, 142941, -34860, 91627, 89252, 139920, -52698, -71955, 49515, -447425, 66617, 341436, 249661, -56436, -88210, 2841, -174569, 83478, -117036, -359120, 33208, -20537, 104245, -159756, 159609, -107895]
9987a67277k7225Q3563A59459K4963h8423F7549f2426A57795d55862a366p6575
9976g7941A18127N9976a96805H0806A8834C876N8637M5159H150K8917J24469F1092
9963A80044i9920j1044k7920A52184L3778K4007a35351J1372A57931a056l50351
9952c51407a62718A62129b21667e616j67370M6547M8852A4442b81630B5954a24439
9940H5840i0744L6178j76721A33470d33411a08386j80358Q0660h6770k4722N2988
9929e8504C84825A85871a4303k96924n4981a56663k28848a50459o3829f6929D8671
9917a57347j32584A80446g335j42080e8337C85231A27608a00898E8162h7636j8820
9906a06456B2723b0671j76069J4415J6760a7752k79627C8828b07680I6733c8125
$$ y = [-167277, -194502, -110939, 159459, 184422, -88423, 67549, -62426, 157795, -455862, -1366, -77941, 118127, 178103, -196805, 80806, 18834, 3876, 62513, 107672, 8150, 37067, 161536, 61092, 180044, -99920, -110964, -138884, 152184, 185962, 209969, -135351, -123979, 157931, -1056, -351407, -162718, 162129, -221667, -5616, -172986, -126439, -77587, 14442, -281630, 25954, -124439, 85840, -90744, -54566, -231287, 133470, -433411, -108386, -288744, -208084, -86770, -111492, -58504, 384825, 185871, -14303, -311227, -366208, -156663, -385511, -150459, -214288, -66929, 48671, -157347, -289931, 180446, -7335, -149415, -58337, 385231, 127608, -100898, 58162, -87636, -106456, 22723, -20671, -196740, -182325, -165565, -17752, -297379, 38828, -207680, 96733, -38125]
9894f7354D41e0298G8497f2266B7591c82510A94209o1422m3722h971A481O1956
9882F3437N5472J53267c6082E8357c12947l8744J73572c2787a2393G777J79919
9871A87696a48640l8997k92532a3917A93788j4412M5287f526l27626B20116b73762
9859a98321f7343E6726A425J07406J21771c02851J21157c2077k72257A40074b59455
9847a55757f9836j9216B0906d00406j90502a27405C15383i875j01454j94882a24735
9835c49633B09776C4320a53221C7680d258A31061a49213A32409d4666j69423A85421
9823B66536d9849k89542J54994M8726j3899j10342g741A48250a23614B80317h3346
9811b84551a14684d1705j98932F6718a0201j36691K7350k86353f0263E11515B30211
$$ y = [-67354, 441, -50298, 78497, -62266, 27591, -382510, 194209, 132787, 89065, -8971, 1481, 63437, 118909, 272176, -36082, 58357, -312947, -351691, -178119, -32787, -12393, 7777, 187696, -148640, -187637, -480169, -13917, 193788, 179376, 224663, -6526, -334152, 220116, -273762, -198321, -67343, 56726, 1425, 108831, 230602, -302851, -181694, -32077, -304334, 140074, -259455, -155757, -69836, -89052, 20906, -400406, -590908, -127405, 315383, -9875, -111329, -306211, -124735, -349633, 209776, 34320, -153221, 37680, -4258, 131061, -149213, 132409, -44666, -214089, 185421, 266536, -49849, -339391, -184397, -135671, -149570, -259912, -7741, 148250, -123614, 280317, -83346, -284551, -114684, -41705, -240637, 66718, -10201, -146892, -119542, -405895, -60263, 511515, 230211]
9799i1596C7392d99660J59596g4042G0783f0632I0887c7432D4977J1709K0010
9788G6696e137p612p5432j27002f7365B1226b4826m2887K5699A96112o8456g092
9775b56814C6245A4133b48782Q3976l3247A74934a41383H4825C2565L5742b81719
9763a43657j6927B21586a18551A79589p5854h6375j40220l9820h2038j91133D75328
9751c66539a58683A67327l2304c01343e3451A36627K5070m2618a39483m9631J3386
9740a75728g2710m5122b5731j6630l49804I212L1692c04040i0057A5503a76285
9728I135R7681b7905E8197J45849c00245J07767c0992j73286f7221E0044J4895
9717F4939a1691H264b63369F8243N2697a97035J4947P0135A20999a32060l8248
$$ y = [-91596, 37392, -499660, -340064, -74042, 70783, -60632, 90887, -37432, 44977, 56686, 76696, -5137, -12749, -88181, -215183, -67365, 21226, -24826, -67713, -42014, 196112, 127656, -7092, -256814, 36245, 14133, -248782, -164806, -198053, 174934, -141383, 84825, 32565, 68307, -281719, -143657, -160584, 221586, -118551, 179589, 103735, -86375, -226595, -266415, -82038, -273171, 475328, -366539, -158683, 167327, 135023, -301343, -53451, 136627, 161697, 119079, -139483, -189114, -175728, -72710, -117832, -25731, -42361, -392165, 9212, 40904, -304040, -90057, 15503, -176285, 9135, 106816, -27905, 58197, 204046, -300245, -192478, -30992, -204278, -67221, 50044, 64939, -11691, 8264, -263369, 68243, 120940, -197035, -182088, -111953, 120999, -132060, -170308]
9706a70308C4332a16884J3129k09532e3883k18196o701b2449F3799a93279A55257
9694I3512a11447a4073A43494a43973b5857j06397A86417b39559r208j3845F2837
9682b4021g982k63712O0077Q0990L9812j47084P0040m8635f1625n2829F3788a81916
9669F9908b9419m6486j55756J07542A08544b764j89377j71095F6747c97901h7125
9657A22332a01167d5042q2248m448D1189a02021F413c07026a37604A10530K0651
9646A31181a87901a0096l16419A83777m2384c11834J33709I6924b44974c9008
9635e31895g8751j10352I4649c22538f2322q8949B72660c01506G0151c2247A4531
9623G2021a07297E420J32793l096a42059G051K85374a18885A17482i2767J1167
$$ y = [-170308, 34332, -116884, -103755, -313287, -53883, -272079, -278780, -22449, 63799, -193279, 155257, 93512, -111447, -14073, 143494, -143973, -25857, -132254, 186417, -239559, -248767, -262612, 62837, -24021, -7982, -271694, -211617, -130627, -90815, -237899, -167859, -216494, -61625, -114454, 63788, -181916, 69908, -29419, -75905, -231661, -124119, 108544, -2764, -192141, -363236, 66747, -397901, -87125, 122332, -101167, -45042, -127290, -131738, 41189, -102021, 6413, -307026, -137604, 110530, 131181, -187901, -10096, -326515, 183777, 141393, -311834, -178125, 96924, -244974, -39008, -531895, -78751, -189103, 94649, -322538, -62322, -151271, 272660, -301506, 70151, -32247, 14531, 72021, -107297, 5420, 138213, 135117, -142059, 7051, 292425, -118885, 117482, -92767, -81600]
9612h1600j37275b1515H462f3749A03678e5227E8703a58593F9518b24435D6405
9600i002k7390A27642m7288L9082c10011g4583k00738H0888a76973h1569k03836
9589b85405c1716A28819Q7498e2209j93757A90947D3633a47237D7122o996J94609
9578B34735d29643B50314a91009g0120E6473b12043l9082m1910C474Q976K4295
9567C6745d9701B269a1166E4576b89625i2268J3714A7855d01908a03911j33290
9556b37201K6410A58990l1793a49593r664f0411l21827E7807a25348H4704J08945
9545A93649a74129k4765A89268a81679f1849B52442A83a05952j6305k2646K0030
9534a24873j8936K079d0090q4684j35546g8682j3540a5765C3141i1436M310A42701
$$ y = [-81600, -218875, -21515, 8462, -63749, 103678, -55227, 58703, -158593, 69518, -224435, 46405, -9002, -36392, 127642, 80354, 119436, -310011, -74583, -275321, 80888, -176973, -81569, -285405, -31716, 128819, 216317, -52209, -245966, 190947, 43633, -147237, 47122, 40126, 234735, -429643, 250314, -191009, -70120, 56473, -212043, -251125, -293035, 3474, 12450, 36745, -49701, 2269, -11166, 54576, -289625, -92268, -78554, 17855, -401908, -103911, -237201, -210791, 158990, 127197, -149593, -159257, -60411, -382238, 57807, -125348, 84704, 193649, -174129, -198894, 189268, -181679, -61849, 252442, 183, -105952, -122257, -144903, -124873, -143809, -141730, -40090, -124774, -260320, -78682, -92222, -15765, 33141, -91436, -87126, 142701]
9521a91828i4034C40448a71430K2574D438L2664N1867K57380f4773G8631i3394
9509B07457G3212b11388h8167B0812J8205g3643k47338a33083A4581b23368K3478
9498a99890D2489a24265j7060c4700m1416n4554C4795e3843C0641c01967E1247
9486f1249j17972b251m399C9517b27112h3202B13187b51821b2407G5640O9243
9475A44883a13565d5982n375Q62r3837j3385B8070d9676A48238b4042p9923k4798
9463a28763B07122a55450G3753b11470h787l62570A32209b60302c0291l6763A96015
9451g5654l17728d1895A77293a63840p9282i0124j28460f3525B40040a13600B9193
9439a70475n9344D1014a00129K2874H8476a26067B05629a06263A10135A5513K62075
$$ y = [-191828, -94034, 340448, -171430, -148856, 4438, 37102, 88969, 346349, -64773, 78631, -93394, 207457, 73212, -211388, -88167, 20812, 39017, -73643, -320981, -133083, 14581, -223368, -199890, 42489, -124265, -141325, -34700, -76116, -130670, 34795, -53843, 30641, -301967, 51247, -61249, -179221, -2251, -6650, 39517, -227112, -83202, 213187, -251821, -22407, 75640, 144883, -113565, -45982, -51357, -50495, -144332, -157717, 28070, -49676, 148238, -24042, -103965, -128763, 207122, -155450, 73753, -211470, -8787, -371357, 132209, -260302, -30291, -67054, 196015, -75654, -393382, -41895, 177293, -163840, -243122, -90124, -218584, -63525, 240040, -113600, 29193, -170475, -229819, 41014, -100129, -77255, 88476, -126067, 205629, -106263, 110135, 15513, 277588]
9428B77588b52186D272b5820A85874n0562i57A55790b3376k04548D4534A8080
9416f0077j28402p2591L6729k20587K01876A1850N115b64772c2888l8593A16482
9404f6879C67568j69702b05771G2789a67433A50445a23307A75794a86849p2791
9394b59640c8710j09358p4010A20475j5380m8045a20797c7994j89802e9996j24213
9383a84209B09252F5425d6786B2126J1006c71265g6908E9703M8563h1989A05679
9371c7269j61731o7820a30759L6783a588o0891j63527P2834Q906B06199a65336
9359f3470m097q4579l4072j07622J13760h1654j88332A03516a23951A02119g906
9347a28876k5998O3907L0802b9069A97148B5589M0609c75593a17950c0902p290
$$ y = [277588, -252186, 4272, -25820, 185874, 135312, -957, 155790, -23376, -227924, 44534, 18080, -60077, -188479, -261070, -224341, -444928, -243052, 11850, 16965, -264772, -32888, -71481, 116482, -66879, 367568, 197866, -205771, 72789, -167433, 150445, -123307, 175794, -186849, -259640, -38710, -148068, -222078, 120475, 105095, 57050, -120797, -37994, -227796, -59996, -184209, 209252, 65425, -46786, 22126, 33132, -371265, -76908, 59703, 108266, -81989, 105679, -37269, -199000, -266820, -130759, -93976, -1588, -62479, -226006, -153172, -144266, 206199, -165336, -63470, -67567, -152146, -186218, -293840, -180080, -81654, -269986, 103516, -123951, 102119, -7906, -128876, -154874, -90967, -60165, -29069, 197148, 25589, 66198, -375593, -117950, -30902, -38192]
9336c8192l04758A33747j756D0299c43847e5543K4437A40776J44669a48248k83615
9325d31863I2922c6529l1293j37747A5910a86679P0074A70710d3898A88161a6848
9313C4940L27233J5230K12764b64546B2559c6206j05815k41684F55c43401A43506
9301a9104A20903c04424e2546l2170J6961k49358N0692B40214A4674i3864k04367
9290b98231O4162d1718A5461D267K25798c01182f985l76716e0071A7635b50256
9278b6805j89190Q2645p8915A12420k5378a27308j288a8634H901a25164k68945
9267c94109C0301J29156h3526q3260o4034r4574c6879A80693P3152a80847l7339
9256b18186B11568F0009f4138k6166A03062i4625C6516c034q0677d1338B5516
$$ y = [-38192, -342950, 133747, 131991, 40299, -343847, -55543, -31106, 140776, 285445, -148248, -431863, 92922, -36529, -67822, -205569, 15910, -186679, -116605, 170710, -43898, 188161, -16848, 34940, 362173, 377403, 590167, -264546, 22559, -36206, -142021, -383705, 655, -343401, 143506, -19104, 120903, -304424, -52546, -84716, -67755, -317113, -266421, 240214, 14674, -93864, -298231, -234069, -41718, 15461, 4267, 230065, -301182, -6985, -383701, -50071, 17635, -250256, -26805, -215995, -133350, -212265, 112420, 87042, -127308, -128596, -18634, 8901, -125164, -394109, 30301, 159457, -83526, -166786, -230820, -325394, -36879, 180693, 253845, -180847, -218186, 211568, 60009, -64138, -90304, 103062, -94625, 36516, -3034, -83711, -41338, 25516]
9244a97491k68345d7726A71220A8966b37484H8714b18305j2848N7539N3866i977
9232h8304k6070j27276E3595a24015l41254a29037N6986o3807o4669B84613b3271
9220H5530d53749a86588K965k0323q622f1726D7165a47077b4296n0747A36403
9208C1482a27414E9224B0998K91273A41138b16812A48222b60268a0530j06548
9198a17078B00445o5805K2424Q6957f7096a4219r7403N158A9763d96414C1822
9186B1615a71427f070j42166m6348a5535A80853o4195j3940J02341a73337K2700
9175a50637n8329e9898k39672A45721g2517A0878N2785e3278H272L953J12251
9164A24476a29878G3752R4364m4201h1580C17639e5798B8412b30804r5541G5094
$$ y = [-197491, -465836, -47726, 171220, 18966, -237484, 88714, -218305, -231153, -173614, -119748, -9977, -88304, -114374, -241650, 53595, -124015, -465269, -129037, -72051, -135858, -200527, 284613, -23271, 85530, -453749, -186588, -183623, -203946, -212568, -61726, 47165, -147077, -24296, -75043, 136403, 31482, -127414, 59224, 20998, 312271, 141138, -216812, 148222, -260268, -10530, -117078, 200445, 134640, 157064, 244021, -67096, -14219, -111622, -106464, 19763, -496414, 31822, 21615, -171427, -6070, -148236, -194584, -15535, 180853, 116658, 102718, 205059, -173337, -150637, -208966, -59898, -299570, 145721, -72517, 10878, 63663, -53278, 8272, 12225, 124476, -129878, 73752, 168116, 123915, -81580, 317639, -55798, 28412, -230804, -326345, 75094]
9152b29963L5089A94397m8416b29390A49234a08108L3095j62113b6421l32990
9142c59411a56258d9730r9984q7976d8797n9424k7379F1456b42350A98622b54144
9130A3617e1961p9261N8328l0661l0959G7505e7341j27597q976f1235F4454b3033
9117i3002B3700D869a719m6572E0005c00617E1265K30178F2827b26907A25411
9105b41292A3936L7f8760j4945B4045a46492k4451G6303b9685r7940c1112k36943
9093b68055a180n0181B76244b05409e6908B21745j09843J2573C7189B960c28348
9081a00581j6025Q322H3931b96328d9110n1859A09402j7559a97305i4084N887
9070h8197b9067G2820J08828F5377c26043a51208B24721a2617l22399A15466a53791
$$ y = [-229963, -194874, 194397, 145981, -229390, 149234, -108108, -75013, -237126, -26421, -359411, -156258, -49730, -149714, -237690, -48797, -108221, -135600, 61456, -242350, 198622, -254144, 13617, -51961, -131222, -72894, -103555, -134514, 77505, -57341, -184938, -193914, -61235, 64454, -23033, -93002, 23700, 4869, -1719, -48291, 50005, -300617, 51265, 281443, 62827, -226907, 125411, -241292, 13936, 13973, -68760, -83705, 24045, -146492, -170943, 76303, -29685, -127625, -31112, -268055, -1180, -51361, 276244, -205409, -56908, 221745, 111902, 124475, 37189, 2960, -328348, -100581, -116606, -108284, 83931, -296328, -49110, -100969, 109402, 91843, -197305, -94084, -88197, -29067, 72820, 181648, 65377, -326043, -151208, 224721, -12617, -335016, 115466, -153791]
9058a6596q9018H5811a19668c1229o0532j54665A63361P4649h0154o1392B21124
9046a86750g3378l22814B18326b7540B04921i542k18133A45307c7570j38964n9561
9035b36095q717a11784c4018j83054a03160c3950C8677a77434D1869b45930C4484
9023B34109C5405b29244K9762k1041g1269I3642a99922a4103l82080a4290A22780
9011c17310g7755j00817B60915j27604b05664l3917N1645B07271D9739j7893a45609
8999a91298k19754b2675j19190r7895E263c01776N5965j88377f9576p6636o6107
8988b12319A78934J5071E3476J16139a03846H0173P8841J17169A36309a21429
8977i2008M3648B3552f230E3850O1081a72184R750C1473J32518c70579a24436
$$ y = [-16596, -105614, 85811, -119668, -31229, -91761, -246426, 163361, 238010, -80154, -141546, 221124, -186750, -73378, -396192, 218326, -27540, 204921, -9542, -227675, 145307, -37570, -176534, -236095, -244812, -111784, -34018, -217072, -103160, -33950, 38677, -177434, 41869, -245930, 34484, 234109, 35405, -229244, -199482, -220523, -71269, 93642, -199922, -14103, -396183, -14290, 122780, -317310, -77755, -178572, 260915, 133311, -205664, -239581, -187936, 207271, 49739, 31846, -145609, -191298, -411052, -22675, -141865, -239760, 5263, -301776, -245811, -434188, -69576, -146212, -212319, 178934, 194005, 53476, 169615, -103846, 80173, 159014, 276183, 136309, -121429, -92008, -48360, 23552, -6230, 53850, 114931, -172184, -162434, 31473, 163991, -370579, -124436]
8965f1872j08964p3014K5218e6443H0210a78483e1664k79455b7560m81935K53102
8954b56393a8260E627K23366c09783J19399e7844l68053b04399A06671b4510j47993
8943a72503G5051A9267a28246b9998A25369h521A57089b8041Q272C3975f2146
8931C48164J02343A92669c5621I5268C3486N6963g0348D13514l6053O78939Q71293
8920A927693K068248J0714314G037224B033700E27965j98373j7459J04119i2593
8910A03313b00998O0170A74058b83645D06085A31845P1200J20643f4661k4747
8900h9408f537j37388B88823B928J54798c8429I9045J05543a83495n5238E6281
8888C7352N2614k1889a48445f1727l67267a28575O0771A58365A8321c7396l5059
$$ y = [-61872, -170836, -243850, -218632, -56443, 80210, -178483, -51664, -331119, -27560, -509495, -256393, -18260, 5627, 228993, -309783, -190384, -57844, -425897, -204399, 106671, -24510, -172503, 75051, 19267, -128246, -29998, 125369, -8521, 157089, -28041, -19769, 33975, -62146, 348164, 450507, 192669, -35621, 95268, 33486, 90449, -70348, 413514, 377461, 1056400, 1927693, 3995941, 14710255, 7037224, 2033700, 527965, 329592, 312133, 416252, -92593, 103313, -200998, -140828, 174058, -283645, 406085, 131845, 203045, 323688, -64661, -89408, -6537, -143925, 288823, 2928, 157726, -38429, 99045, 204588, -183495, -238733, 56281, 37352, 89966, 68077, -148445, -61727, -428994, -128575, -67804, 158365, 18321, -37396, -72455]
8877g2455J4065o8935O302j18978E657M3526d1734o3045B91091a65223O2359M0003
8865f2861j67925a05363j21293A01343a62375J0524e651j78375A72759c77432
8854B8413c63460p30A37809o2599J36982G7894a36217q8502K1172A22599Q2293
8843B04892a02302j06091C51740j50442E8702d95529a89513n5346P7601f2005
8832a92912a1980I8284h8521j0146b154A96336r4983m6661h6074B04574b53854
$$ y = [-72455, -58390, -127325, -121023, -240001, 5657, 49183, -41734, -104779, 291091, -165223, -102864, -62861, -230786, -105363, -226656, 101343, -162375, -151851, -5651, -184026, 172759, -377432, 28413, -363460, -364190, 137809, 75210, 212192, 77894, -136217, -224719, -203547, 122599, 204892, -102302, -208393, 351740, 201298, 58702, -495529, -189513, -244859, -167258, -62005, -192912, -11980, 98284, -88521, -98667, -2154, 196336, 101353, 54692, -86074, 204574, -253854]
$$ [...]
##END NTUPLES=NMR SPECTRUM
##END=
