##TITLE=NES1061_CD-4_9883097_TrpMTpxYQ5
##JCAMPDX= 6.0         $$ Bruker NMR JCAMP-DX V2.0
##DATA TYPE= NMR SPECTRUM
##DATA CLASS= NTUPLES
##ORIGIN= BRUKER
##OWNER= Administrator
$$ 1.72 TOPSPIN		Version 2.1
$$ 2016-08-27 00:38:46.086 -0500  Administrator@X
$$ Compression mode = diff/dup
##.OBSERVE FREQUENCY= 400.02188249412
##.OBSERVE NUCLEUS= ^1H
##.ACQUISITION MODE= SIMULTANEOUS (DQD)
##.ACQUISITION SCHEME= undefined
##.AVERAGES= 8
##.DIGITISER RES= 22
##SPECTROMETER/DATA SYSTEM= spect
##.PULSE SEQUENCE= zg30
##.SOLVENT NAME= COFFEE_meoh
##.SHIFT REFERENCE= INTERNAL, COFFEE_meoh, 1, 14.98509
##AUDIT TRAIL= $$ (NUMBER, WHEN, WHO, WHERE, PROCESS, VERSION, WHAT)
$$ ##TITLE= Audit trail, TOPSPIN		Version 2.1
$$ ##JCAMPDX= 5.01
$$ ##ORIGIN= Bruker BioSpin GmbH
$$ ##OWNER= Administrator
$$ $$ E:\/data/COFFEE/nmr/NES1061_CD-4_9883097_TrpMTpxYQ5/10/pdata/1/auditp.txt
$$ ##AUDIT TRAIL=  $$ (NUMBER, WHEN, WHO, WHERE, PROCESS, VERSION, WHAT)
(   1,<2016-08-27 00:38:38.976 -0500>,<Administrator>,<X>,<go>,<TOPSPIN 2.1>,
      <created by zg
	started at 2016-08-27 00:37:32.758 -0500,
	POWCHK enabled, PULCHK disabled,
       configuration hash MD5:
       21 0F 79 D6 B3 7B B4 F6 88 20 88 DB 03 48 BD 9F
       data hash MD5: 64K
       33 7A C6 16 49 69 68 79 05 05 41 B9 B5 0C 18 CC>)
(   2,<2016-08-27 00:38:42.054 -0500>,<Administrator>,<X>,<proc1d>,<TOPSPIN 2.1>,
      <Start of raw data processing
       efp LB = 0 FT_mod = 6 PKNL = 1 PHC0 = 0 PHC1 = 0 SI = 32K 
       data hash MD5: 32K
       DB 8B 64 8D 9A 9B 04 F2 00 C5 95 D9 6E 23 4A C7>)
(   3,<2016-08-27 00:38:42.336 -0500>,<Administrator>,<X>,<proc1d>,<TOPSPIN 2.1>,
      <pk PHC0 = 95.37231 PHC1 = 0 
       data hash MD5: 32K
       97 90 DF CF 67 60 28 A5 21 42 CB 0B 44 6C F4 B3>)
(   4,<2016-08-27 00:38:42.445 -0500>,<Administrator>,<X>,<proc1d>,<TOPSPIN 2.1>,
      <abs ABSG = 1 
       data hash MD5: 32K
       3E AC E7 C8 E3 BB 8E 92 B4 52 84 8F 6F 84 A0 7E>)
(   5,<2016-08-27 00:38:42.508 -0500>,<Administrator>,<X>,<proc1d>,<TOPSPIN 2.1>,
      <abs ABSG = 2 
       data hash MD5: 32K
       2C 90 20 56 4C EA 59 1C 9A 2A 5B 89 F6 86 53 C1>)
(   6,<2016-08-27 00:38:42.570 -0500>,<Administrator>,<X>,<proc1d>,<TOPSPIN 2.1>,
      <abs ABSG = 3 
       data hash MD5: 32K
       13 8E E5 2C 4D A0 8A 5A D1 5B 1B CC 00 8B 26 A6>)
(   7,<2016-08-27 00:38:42.633 -0500>,<Administrator>,<X>,<proc1d>,<TOPSPIN 2.1>,
      <abs ABSG = 4 
       data hash MD5: 32K
       EC 43 72 F0 2F 5C 47 41 B7 1E 45 67 18 4D DD BC>)
(   8,<2016-08-27 00:38:42.695 -0500>,<Administrator>,<X>,<proc1d>,<TOPSPIN 2.1>,
      <abs ABSG = 5 
       data hash MD5: 32K
       0C 3D 32 24 18 12 CD EB E1 7B 47 58 0E ED C4 57>)
$$ ##END=
$$ 
$$ $$ hash MD5
$$ $$ 05 7B 5A 55 20 C8 BA 75 5A 37 C9 30 61 05 87 1C
##$RELAX= 
##$RELAX= 
##$RELAX= 
##$RELAX= 
##$RELAX= 
##$RELAX= 
##$RELAX= 
$$ Bruker specific parameters
$$ --------------------------
##$DU= <E:\>
##$EXPNO= 10
##$NAME= <NES1061_CD-4_9883097_TrpMTpxYQ5>
##$PROCNO= 1
$$ [...]
##$TP= (0..7)
150 150 150 150 150 150 150 150
##$TP07= 0
##$TPNAME0= <>
##$TPNAME1= <>
##$TPNAME2= <>
##$TPNAME3= <>
##$TPNAME4= <>
##$TPNAME5= <>
##$TPNAME6= <>
##$TPNAME7= <>
##$TPOAL= (0..7)
0.5 0.5 0.5 0.5 0.5 0.5 0.5 0.5
##$TPOFFS= (0..7)
0 0 0 0 0 0 0 0
##$TUNHIN= 0
##$TUNHOUT= 0
##$TUNXOUT= 0
##$USERA1= <user>
##$USERA2= <user>
##$USERA3= <user>
##$USERA4= <user>
##$USERA5= <user>
##$V9= 5
##$VALIST= <valist>
##$VCLIST= <CCCCCCCCCCCCCCC>
##$VD= 0
##$VDLIST= <DDDDDDDDDDDDDDD>
##$VPLIST= <PPPPPPPPPPPPPPP>
##$VTLIST= <TTTTTTTTTTTTTTT>
##$WBST= 2048
##$WBSW= 25
##$XGAIN= (0..3)
0 0 0 0
##$XL= 0
##$YL= 0
##$YMAX_a= 609678
##$YMIN_a= -514996
##$ZGOPTNS= <>
##$ZL1= 120
##$ZL2= 120
##$ZL3= 120
##$ZL4= 120
##$ABSF1= 14.98509
##$ABSF2= -5.573092
##$ABSG= 5
##$ABSL= 3
##$ALPHA= 0
##$AQORDER= 0
##$ASSFAC= 0
##$ASSFACI= 0
##$ASSFACX= 0
##$ASSWID= 0
##$AUNMP= <proc_prof1d_extract_pilot.lims>
##$AXLEFT= 0
##$AXNAME= <>
##$AXNUC= <1H>
##$AXRIGHT= 0
##$AXTYPE= 0
##$AXUNIT= <>
##$AZFE= 0.1
##$AZFW= 0.1
##$BCFW= 0
##$BC_mod= 0
##$BYTORDP= 0
##$COROFFS= 0
##$CY= 15
##$DATMOD= 1
##$DC= 0
##$DFILT= <>
##$DTYPP= 0
##$F1P= 0
##$F2P= 0
##$FCOR= 0.5
##$FTSIZE= 32768
##$FT_mod= 6
##$GAMMA= 0
##$GB= 0
##$INTBC= 1
##$INTSCL= 1
##$ISEN= 128
##$LB= 0
##$LEV0= 0
##$LPBIN= 0
##$MAXI= 10000
##$MC2= 0
##$MEAN= 0
##$ME_mod= 0
##$MI= 0
##$NCOEF= 0
##$NC_proc= -9
##$NLEV= 6
##$NOISF1= 0
##$NOISF2= 0
##$NSP= 0
##$NTH_PI= 0
##$NZP= 0
##$OFFSET= 14.98509
##$PC= 1
##$PHC0= 95.37231
##$PHC1= 0
##$PH_mod= 1
##$PKNL= yes
##$PPARMOD= 0
##$PPDIAG= 0
##$PPIPTYP= 0
##$PPMPNUM= 2147483647
##$PPRESOL= 1
##$PSCAL= 4
##$PSIGN= 0
##$PYNMP= <proc.py>
##$REVERSE= no
##$SF= 400.02
##$SI= 32768
##$SIGF1= 0
##$SIGF2= 0
##$SINO= 400
##$SIOLD= 32768
##$SPECTYP= <>
##$SREGLST= <1H.CDCl3>
##$SSB= 0
##$STSI= 32768
##$STSR= 0
##$SW_p= 8223.68421052631
##$SYMM= 0
##$S_DEV= 0
##$TDeff= 65536
##$TDoff= 0
##$TI= <>
##$TILT= no
##$TM1= 0
##$TM2= 0
##$TOPLEV= 0
##$USERP1= <user>
##$USERP2= <user>
##$USERP3= <user>
##$USERP4= <user>
##$USERP5= <user>
##$WDW= 1
##$XDIM= 32768
##$YMAX_p= 514401751
##$YMIN_p= -1237968
##$CURPLOT= <Network HP LaserJet P1505>
##$CURPRIN= <$Network HP LaserJet P1505>
##$DFORMAT= <normdp>
##$LAYOUT= <+/1D_H.xwp>
##$LFORMAT= <normlp>
##$PFORMAT= <normpl>
##$SURQMSG= 1
$$ End of Bruker specific parameters
$$ ---------------------------------
##NTUPLES= NMR SPECTRUM
##VAR_NAME=  FREQUENCY,     SPECTRUM/REAL,   SPECTRUM/IMAG
##SYMBOL=    X,             R,               I
##VAR_TYPE=  INDEPENDENT,   DEPENDENT,       DEPENDENT
##VAR_FORM=  AFFN,          ASDF,            ASDF
##VAR_DIM=   32768,         32768,           32768
##UNITS=     HZ,            ARBITRARY UNITS, ARBITRARY UNITS
##FACTOR=    0.250966925370066, 1,           1
##FIRST=     8223.43324360094, 76466,        5631
##LAST=      0,             -281221,         97955
##MIN=       0,             -1237968,        0
##MAX=       8223.43324360094, 514401751,    0
$$ Real data points
##PAGE= N=1
##DATA TABLE= (X++(R..R)), XYDATA
$$ [...]
19237F7251b94273j96719m39919d44706K11743f7605F8950d73101k61042c64458
$$ 67251 -294273 -490992 -930911 -444706 -232963 -67605 68950 -473101 -734143 -364458
19226B35641n7821a04998k47646J59615k36771Q8488f5439m38769J85215N7728
$$ 235641 177820 -104998 -352644 -193029 -429800 -341312 -65439 -504208 -318993 -261265
19216b61265J16555j54102l2546l46631J15860B49246P6624g67062D11L3751L67457
$$ -261265 -144710 -298812 -331358 -677989 -562129 249246 325870 -767062 411 34162 401619
19205D01619b35753k75724a37510J1324k61430D0344P9995J6373K0695a10088
$$ 401619 -235753 -511477 -137510 -126186 -387616 40344 120339 136712 157407 -110088
19194a93853m74867K41749D6256g0450n21081a04041C33592f3409B44351L6938
$$ -193853 -668720 -426971 46256 -70450 -591531 -104041 333592 -63409 244351 281289
19184B81289A6062e96993C12660L61898d61909a74457n9314C24444d50677h036
$$ 281289 16062 -596993 312660 674558 -461909 -174457 -233771 324444 -450677 -8036
19173c92952a68829D32991d42614B35768c42660l688A53038K8819J34694e24184
$$ -392952 -168829 432991 -442614 235768 -342660 -346348 153038 181857 316551 -524184
19162d26802B27200n8671e2690A56328b62682G7654M32029B15316a33805l38623
$$ -426802 227200 168529 -52690 156328 -262682 77654 509683 215316 -133805 -472428
19152d72428m23402a64709p9678D90843c99053r7690d9843j65765B36021c23482
$$ -472428 -895830 -164709 -244387 490843 -399053 -496743 -49843 -215608 236021 -323482
19141F5304c57112N8346A9044N7111a69721h3345D2135b55879A43691L03854b79341
$$ 65304 -357112 -298766 19044 76155 -169721 -83345 42135 -255879 143691 447545 -279341
19129A73205c44646e4302A24991N8020a63834j50987l0220A84205O1058a29918
$$ 173205 -344646 -54302 124991 183011 -163834 -314821 -345041 184205 245263 -129918
19118f98789K50841a49797f3557B7295a80606k30089E7674K36140a71410A0298
$$ -698789 -447948 -149797 -63557 27295 -180606 -410695 57674 293814 -171410 10298
19107a52386l78674J75011b0758l32938k9728m6577C29352e31393D33624a021500
$$ -152386 -531060 -356049 -20758 -353696 -383424 -430001 329352 -531393 433624 -1021500
19096i6289k65036A20758b98271a29581F7594a48210n51916F11930c15824n04085
$$ -96289 -361325 120758 -298271 -129581 67594 -148210 -700126 611930 -315824 -819909
19086h19909C15244A17137a47615A09193b80091a00755l80495G5220h57902b16264
$$ -819909 315244 117137 -147615 109193 -280091 -100755 -481250 75220 -857902 -216264
19075i8425H47888c06612J49364k37625A33986a93637p7508A31296O11231C7007
$$ -98425 847888 -306612 -157248 -394873 133986 -193637 -271145 131296 742527 37007
19064B133a21370r3768f9735n1579j33024j44057p7434J2025e6799p8368l09990
$$ 2133 -121370 -215138 -69735 -121314 -254338 -398395 -475829 -463804 -56799 -135167 -445157
19053d45157j16760b32510J2169C2996f3944D76292b83742k05387J84032k78023
$$ -445157 -561917 -232510 -220341 32996 -63944 476292 -283742 -489129 -305097 -583120
19043e83120D43103m343e51145b72163n9935A73423F42a71245k84137A46338j9382
$$ -583120 443103 438760 -551145 -272163 -332098 173423 642 -171245 -455382 146338 126956
19032A26956m9547c72821B52904O1920K10597c94495l12410D85325K08943d03961
$$ 126956 77409 -372821 252904 314824 525421 -394495 -706905 485325 694268 -403961
19021a61004j02554j39516C13971d89663A84845O5877o146a61414g0886j54246
$$ -161004 -263558 -403074 313971 -489663 184845 250722 244576 -161414 -70886 -225132
19011b25132j19155d1981j01873N6415B1036J51044d17682h4986k49850C2384
$$ -225132 -344287 -41981 -143854 -87439 21036 172080 -417682 -84986 -334836 32384
19000g18523E57042e7159k9276L1634k23449j7132P9933B7396L0734K47236a14481
$$ -718523 557042 -57159 -86435 -54801 -278250 -295382 -215449 27396 58130 305366 -114481
18988e55605a99891e8421A49283a17204C78837c58200j62419B9853b02455D1603
$$ -555605 -199891 -58421 149283 -117204 378837 -358200 -520619 29853 -202455 41603
18977A95417c73892f5730G0514M6995L65690b81196N170A95340e30789r353D4595
$$ 195417 -373892 -65730 70514 117509 483199 -281196 -276026 195340 -530789 -540142 44595
18965a85186B72047D3947A6550J7323M47316A08662d95986h268A85130J52096
$$ -185186 272047 43947 16550 33873 481189 108662 -495986 -8268 185130 337226
18955C37226i55859B39863c23002n6048K9056J63365q1980A89472f96287g5616
$$ 337226 -955859 239863 -323002 -379050 -349994 -186629 -268609 189472 -696287 -75616
18944D58884G0903b36089j46587f3506B6279M3452K62582A19680Q0368b14269
$$ 458884 70903 -236089 -382676 -63506 26279 69731 332313 119680 200048 -214269
18933A38548L66580e45434A78866a74123E15964k32275A27658b6824m65142A15850
$$ 138548 505128 -545434 178866 -174123 515964 283689 127658 -26824 -491966 115850
18922b43641C59301d84012A54460j563h07n17193J46504D48733c07592l3995J50781
$$ -243641 359301 -484012 154460 152897 -807 -518000 -371496 448733 -307592 -341587 -190806
18911a90806c8713C20395A17972c9754B93471a71968B96741n6218L71128A27775
$$ -190806 -38713 320395 117972 -39754 293471 -171968 296741 240523 611651 127775
18900a99461A99307A308N59213C2293b08124k25371D93627A3526d28988B39396
$$ -199461 199307 1308 560521 32293 -208124 -433495 493627 13526 -428988 239396
18889F20762a72102l28311D25476b52527A46846g07357A91871K45233f17130E96093
$$ 620762 -172102 -500413 425476 -252527 146846 -707357 191871 437104 -617130 596093
18878D36684k12952A05138g27272K75193j08558a74937I2264b24653j05148b6848
$$ 436684 223732 105138 -727272 -452079 -560637 -174937 92264 -224653 -329801 -26848
18867F8544O1038a06113l83984j80041E1914b46222A08716e54364K26873l58621
$$ 68544 129582 -106113 -490097 -670138 51914 -246222 108716 -554364 -327491 -686112
18857f86112a9884A09883a41255C66796N18114a95772o0806J16499p46015d38249
$$ -686112 -19884 109883 -141255 366796 884910 -195772 -256578 -140079 -886094 -438249
18846b64338J2614A4389K40314q4573d03301J67523D85903c47773o5538Q0194
$$ -264338 -251724 14389 254703 170130 -403301 -235778 485903 -347773 -413311 -333117
18836c33117B4922J447C299b26890j23500a64804B14414G3492K06538K59625J40749
$$ -333117 24922 26369 3299 -226890 -350390 -164804 214414 73492 280030 539655 680404
18825F80404c71110A04822d11008L6436k8205a63108P5426p0482i076C11930M2596
$$ 680404 -371110 104822 -411008 -374572 -402777 -163108 -87682 -158164 -9076 311930 354526
18814C54526J30648B00619d79260J18528G8281n540c67359j46425a0038k29537
$$ 354526 485174 200619 -479260 -360732 78281 72741 -367359 -513784 -10038 -239575
18804b39575F27430A48488h0764J211l91291C68989a23075m03890p8886H2156
$$ -239575 627430 148488 -80764 -79553 -470844 368989 -123075 -526965 -605851 82156
18793d49477k11410a1523A2199L42096c75180a37390j95507k4766H600c0275B22449
$$ -449477 -660887 -11523 12199 354295 -375180 -137390 -332897 -357663 8600 -30275 222449
18781A57330c09296l0974B24986d57541C49442K9416c2757A52289c36031A35636
$$ 157330 -309296 -340270 224986 -457541 349442 378858 -32757 152289 -336031 135636
18770c11251N1006A55231i08727c14762k86171C1060L99261A29672L2067D3383
$$ -311251 -260245 155231 -908727 -314762 -600933 31060 430321 129672 161739 43383
18759f1454r7271B56068f4297j79162f7754G2143h17468a27260m71891a03170
$$ -61454 -158725 256068 -64297 -243459 -67754 72143 -817468 -127260 -599151 -103170
18748e18213K43514H80109d94184b39485E81616c07822j24133a66298l90154B70968
$$ -518213 -274699 880109 -494184 -239485 581616 -307822 -431955 -166298 -556452 270968
18737B91748j11233d34825e6567j55781m33123A1427a87659C5072c65484A50643
$$ 291748 180515 -434825 -56567 -212348 -645471 11427 -187659 35072 -365484 150643
18726H8805c17966j8072E17417i2754j56636D7216b86162m1114J9098G4040J61667
$$ 88805 -317966 -336038 517417 -92754 -249390 47216 -286162 -327276 -308178 74040 235707
18715B35707d15308a47086B34221a103057c37613f007C22983j55705d00860J90242
$$ 235707 -415308 -147086 234221 -1103057 -337613 -6007 322983 167278 -400860 -210618
18705b10618B61057c55937a56621j53579C88291A09816P79063g02463B66206e13463
$$ -210618 261057 -355937 -156621 -310200 388291 109816 888879 -702463 266206 -513463
18694i5630f832p5780o3047k66023G2441c1936j86383n7646p3504B2258R2771
$$ -95630 -6832 -82612 -145659 -411682 72441 -31936 -218319 -275965 -349469 22258 115029
18683A15029i55832d20883m7047j51790C6573c72328D51415e22965f7870j92790
$$ 115029 -955832 -420883 -467930 -619720 36573 -372328 451415 -522965 -67870 -260660
18673b60660r2204A42394c56161P8489k85363J71914j11220c3582C28597e31518
$$ -260660 -352864 142394 -356161 -277672 -563035 -391121 -502341 -33582 328597 -531518
18662A48790a30861D59399a97916a8807j28925n9568k52431J02836A84613M2708
$$ 148790 -130861 459399 -197916 -18807 -147732 -207300 -459731 -356895 184613 227321
18652B27321G4032b54373B58338i6983j72438G5985f2854m1582C39156a66824
$$ 227321 74032 -254373 258338 -96983 -269421 75985 -62854 -104436 339156 -166824
18641a41353B89312b09982F32962a21893k8138f7268n90046b3719A17301Q3494
$$ -141353 289312 -209982 632962 -121893 -150031 -67268 -657314 -23719 117301 200795
18631B00795b75618b2829k47723l2323D86924j30712j74118f93662D26070c78779
$$ 200795 -275618 -22829 -270552 -302875 486924 356212 182094 -693662 426070 -378779
18620B99179H7615e30625m75400e2791G0256N10703f30472k48999B35402a70239
$$ 299179 87615 -530625 -1006025 -52791 70256 580959 -630472 -879471 235402 -170239
18609b36807K9284A81497c70351a62945m0962G92453G4922Q4630c79143A31281
$$ -236807 -207523 181497 -370351 -162945 -203907 792453 74922 159552 -379143 131281
18598a53581D19824A20315l6289n228M10792D9614c12671B97119A41396i0208
$$ -153581 419824 120315 84026 78798 489590 49614 -312671 297119 141396 -90208
18587b36017j95427a45153C79602a0057k6623I4729a43413D17715b77508j12859
$$ -236017 -431444 -145153 379602 -10057 -36680 94729 -143413 417715 -277508 -390367
18577c90367r6599N8106k95285B73186l2079J0709K51870c5521j46372j0086P9934
$$ -390367 -486966 -428860 -724145 273186 241107 251816 503686 -35521 -181893 -191979 -112045
18566a12045n14350A33425J60366b02810E37924f56743J19318r9688B91224A11985
$$ -112045 -626395 133425 293791 -202810 537924 -656743 -537425 -637113 291224 111985
18555f67139J86543g1595l90828b01920e4705B49278a41411C794J47192a35505
$$ -667139 -480596 -71595 -462423 -201920 -54705 249278 -141411 3794 150986 -135505
18544a40253l7950N9495A19356M10148j27655c15130a3205H3000Q530a60380F5588
$$ -140253 -178203 -118708 119356 529504 401849 -315130 -13205 83000 91530 -160380 65588
18532B27013j12582M54405E6828g61895n7416b12239k21463B21296a58391D73403
$$ 227013 114431 568836 56828 -761895 -819311 -212239 -433702 221296 -158391 473403
18521e30531b36222C04033b42456l90014K54040k98617B43160A07870J54227Q3690
$$ -530531 -236222 304033 -242456 -632470 -378430 -677047 243160 107870 262097 345787
18511C45787j8694a6777m86183j43238b81501k40003P4671a54636C25416K09582
$$ 345787 327093 -16777 -502960 -646198 -281501 -521504 -446833 -154636 325416 534998
18501E34998c49460J25532j36317J76559j8765I6635a1552m08121A86405a20338
$$ 534998 -349460 -223928 -360245 -183686 -202451 96635 -11552 -419673 186405 -120338
18490a27283B35081a34489C00248A22023b14451C723Q5273p175a081039a05680
$$ -127283 235081 -134489 300248 122023 -214451 3723 88996 81821 -1081039 -105680
18479d78093A39878a29507o1870L4275I7969b94059j57142J88004o8834C24415
$$ -478093 139878 -129507 -191377 -157102 97969 -294059 -451201 -263197 -332031 324415
18468C83912j00518C7321c19448D04884d13257j66628b73432j40136l18757K87385
$$ 383912 283394 37321 -319448 404884 -413257 -579885 -273432 -413568 -732325 -444940
18458d44940K11954k94880i2906A55856N0333J54673b18744k19411j05131j01305
$$ -444940 -232986 -527866 -92906 155856 206189 360862 -218744 -438155 -543286 -644591
18448f44591b56866J13854b7297m82068a76486l02909B38946J11894g17397f5205
$$ -644591 -256866 -143012 -27297 -509365 -176486 -479395 238946 350840 -717397 -65205
18437c3962B0353J34684R3265P43923c97101a10244A72101b13874A71453a43443
$$ -33962 20353 155037 248302 992225 -397101 -110244 172101 -213874 171453 -143443
18426h55886B77081a6786H6204c33855J31015I9322J28054a32076B20255J140
$$ -855886 277081 -16786 86204 -333855 -202840 99322 227376 -132076 220255 221395
18416B21395Q8111C6228d07541l19957D911e71771C0217K6612g55078E16109i2432
$$ 221395 309506 36228 -407541 -727498 4911 -571771 30217 56829 -755078 516109 -92432
18404a38974M142A67165C298J25882a5072B19574d10995A55952b49673r3996J68325
$$ -138974 -134832 167165 3298 129180 -15072 219574 -410995 155952 -249673 -343669 -175344
18393a75344J3501j14742J24584c4518j69658B9865K31829e00040B86972b34657
$$ -175344 -161843 -276585 -152001 -34518 -204176 29865 261694 -500040 286972 -234657
18382h8200k56009l09116A63144h0616F77683c19236b061m08454a03085k31010
$$ -88200 -344209 -653325 163144 -80616 677683 -319236 -2061 -410515 -103085 -334095
18372c34095b0729j89233Q1913a9137l36363Q9099h7798J1522H2869e10328G9784
$$ -334095 -20729 -209962 -128049 -19137 -355500 -266401 -87798 -76276 82869 -510328 79784
18360e5069B44093C2736M09426k02286d07042B8750M57206j68239a04502b4748
$$ -55069 244093 32736 442162 239876 -407042 28750 485956 317717 -104502 -24748
18349a51578r1559h1793j79992q8113C54373K80709I5593O3738c32481b2259D65478
$$ -151578 -243137 -81793 -261785 -349898 354373 635082 95593 159331 -332481 -22259 465478
18337c35143l4555E7673J03590f23208E59850E2443J85909b34244j14574P4083
$$ -335143 -369698 57673 161263 -623208 559850 52443 238352 -234244 -348818 -274735
18327b74735A99255c03524o3166P6355j34845r8091I5470a55509A5578N21698
$$ -274735 199255 -303524 -366690 -290335 -425180 -523271 95470 -155509 15578 537276
18317E37276B9310Q5314b11651D35681b71115a07102B70143I6933a25393n46000
$$ 537276 29310 114624 -211651 435681 -271115 -107102 270143 96933 -125393 -671393
18307f71393d0535k11778a5257B9145M48951a76987f5052B68215L4554c10218
$$ -671393 -40535 -252313 -15257 29145 478096 -176987 -65052 268215 302769 -310218
18296b82597C29551I9842b26629l30217F02732a99719g4683j94834j52396m95890
$$ -282597 329551 99842 -226629 -556846 602732 -199719 -74683 -269517 -421913 -917803
18286i17803C19502f19356K99078C43418g3604l01568J84008i2776B3711g5053
$$ -917803 319502 -619356 -320278 343418 -73604 -375172 -191164 -92776 23711 -75053
18275A51486f03903B00677e8272m61062A69645d52375B25480j10271B5944g65440
$$ 151486 -603903 200677 -58272 -519334 169645 -452375 225480 115209 25944 -765440
18264A97022d83862H2473M17570b01856E97919E268c49866l05165c2961l55977
$$ 197022 -483862 82473 500043 -201856 597919 5268 -349866 -655031 -32961 -388938
18254c88938i7836L9595B0350b71416a6418q6268n48213a01841j89929J33655
$$ -388938 -97836 -58241 20350 -271416 -16418 -102686 -650899 -101841 -291770 -158115
18244a58115C51016A21621a6626B78081q9965h13105c68397l63699C6362a8745
$$ -158115 351016 121621 -16626 278081 188116 -813105 -368397 -732096 36362 -18745
18233b61782G7971d87044C9948c36267a68128I6552L23786a46390q5884k535G2167
$$ -261782 77971 -487044 39948 -336267 -168128 96552 420338 -146390 -232274 -234809 72167
18221a02294D77958P4220a25172D15166d2090j67370d8641j12381A99888R8657
$$ -102294 477958 552178 -125172 415166 -42090 -209460 -48641 -161022 199888 298545
18211B98545J00833g7771D51931A69252c85277a36662n5684j24814C21966a78265
$$ 298545 399378 -77771 451931 169252 -385277 -136662 -192346 -317160 321966 -178265
18200B62854c11921C91095C591M9457a17449j69742Q1994L3884C47919b4654o44014
$$ 262854 -311921 391095 3591 53048 -117449 -287191 -205197 -171313 347919 -24654 -668668
18189f68668A0387M81253c8063L853n33110C44607A9648J92647h29266c80814
$$ -668668 10387 491640 -38063 -34210 -567320 344607 19648 212295 -829266 -380814
18178B21673I8316b79518j9032B72872A978J11672i037I731b48356B6406b5489
$$ 221673 98316 -279518 -298550 272872 1978 113650 -9037 9731 -248356 26406 -25489
18166A55573f319E90201f15791C19935j32418d0416F14530m5907G0334J06157
$$ 155573 -6319 590201 -615791 319935 187517 -40416 614530 568623 70334 176491
18156A76491d12811D3597M90613c42075J59049j5825o68891L73303E29634I4215
$$ 176491 -412811 43597 534210 -342075 -183026 -198851 -867742 -494439 529634 94215
18145d10652J02472C73730d12638A87424q7570K80941a67302c4608D8336a68355
$$ -410652 -308180 373730 -412638 187424 99854 380795 -167302 -34608 48336 -168355
18134C68990j78286q6464c53824C48370A50667d72217d5657m62350J31126E3310
$$ 368990 190704 104240 -353824 348370 150667 -472217 -45657 -508007 -376881 53310
18123A59441o8530g14369I5640a52072C64847g33480H5285N1688K78332e16885
$$ 159441 90911 -714369 95640 -152072 364847 -733480 85285 136973 415305 -516885
18112a25o32845i0081p2754E11870D4385J09397b37724P7270f2835E53935A17030
$$ -125 -632970 -90081 -162835 511870 44385 153782 -237724 -160454 -62835 553935 117030
18100d50924J94086G4017e82441J77976j77447A23604o0271b66465r5094a43338
$$ -450924 -256838 74017 -582441 -404465 -581912 123604 63333 -266465 -361559 -143338
18089c3266j185434c10576h0316D38097l8653L07285C00085c80447E01112c01974
$$ -33266 -1218700 -310576 -80316 438097 399444 706729 300085 -380447 501112 -301974
18078C62594b34037E04570d94997B45554E4449L05859b45455k13488a63853A7548
$$ 362594 -234037 504570 -494997 245554 54449 360308 -245455 -458943 -163853 17548
18067e759m34510C91637f95092C91797g3333j58043p7680a5877C7383h8335D24954
$$ -5759 -440269 391637 -695092 391797 -73333 -231376 -309056 -15877 37383 -88335 424954
18055I3639R1707e61680a47081B95485A08313d05105M7405H2650J80657L30078
$$ 93639 185346 -561680 -147081 295485 108313 -405105 -357700 82650 263307 593385
18045E93385G3241A9650a05364j74830G3950N8573d8730D69788j40357B8187e7428
$$ 593385 73241 19650 -105364 -280194 73950 132523 -48730 469788 329431 28187 -57428
18033A49281L84614j07942b35537j91765N016f3501F54486c40497J55977C11311
$$ 149281 533895 425953 -235537 -427302 -422286 -63501 654486 -340497 -184520 311311
18022a26550k72025a89118C2011d56238d8153I5999a03164C51196h1688A52160
$$ -126550 -398575 -189118 32011 -456238 -48153 95999 -103164 351196 -81688 152160
18011a47727D4958r050g62991F16551H1584f42739B23999m4272G400O83489c43847
$$ -147727 44958 35908 -762991 616551 81584 -642739 223999 179727 7400 690889 -343847
17999d0890C72974j31117f81419k5058C36246h8996A96648J45279O5569f83596
$$ -40890 372974 241857 -681419 -706477 336246 -88996 196648 341927 407496 -683596
17988I1429c76137E66399a66046j93823A59323K60866d88702B40639b56095n62830
$$ 91429 -376137 566399 -166046 -359869 159323 420189 -488702 240639 -256095 -818925
17978h18925i1727D93812A72735J6203b47124d4026k39556k06785a52205H4354
$$ -818925 -91727 493812 172735 188938 -247124 -44026 -283582 -490367 -152205 84354
17967b81066K6020l5390O0184C4063e97419A55292a1661o40844B46412a16672
$$ -281066 -255046 -290436 -230252 34063 -597419 155292 -11661 -652505 246412 -116672
17956A40706b1439J0414D16479b27094B645L98165M7066c15762M200D24191r294
$$ 140706 -21439 -11025 416479 -227094 2645 400810 447876 -315762 -311562 424191 414897
17945D14897d2107A19548J05571a0394A24979a82513M4795n9003j16497K1354
$$ 414897 -42107 119548 225119 -10394 124979 -182513 -137718 -196721 -313218 -291864
17935b91864G9474O70151k28659G8994K19865G1666g1732m35632a33712J4512
$$ -291864 79474 749625 520966 78994 298859 71666 -71732 -507364 -133712 -119200
17925a19200j9023A14208o847M12311A85296e0618p1420l80861N3506G09018A76122
$$ -119200 -138223 114208 107361 519672 185296 -50618 -122038 -502899 -449393 709018 176122
17913D66806c3941A72321c24808R8367K2069E38560a04503F85642A94561A3769
$$ 466806 -33941 172321 -324808 -226441 -204372 538560 -104503 685642 194561 13769
17902a40796F48330g2681k57686g5773A02081J77572K43866f3134j71895O788
$$ -140796 648330 -72681 -330367 -75773 102081 279653 523519 -63134 -235029 -228241
17892b28241L1939A07931e4198n91960C21677I0483b02794N114D269M01189d17167
$$ -228241 -196302 107931 -54198 -646158 321677 90483 -202794 -197680 4269 405458 -417167
17880e01658J23298k7978B78384J1710J19796a92721B28842a28433B69739G9685
$$ -501658 -378360 -406338 278384 290094 409890 -192721 228842 -128433 269739 79685
17869B18873d3491n2733A91249b2126j33196k12171J21676k38022J32749F07707
$$ 218873 -43491 -96224 191249 -22126 -155322 -367493 -245817 -483839 -351090 607707
17858B43455c8874J1436E7911a61524C65445r8167L49200B38599h47401c55365
$$ 243455 -38874 -27438 57911 -161524 365445 267278 616478 238599 -847401 -355365
17847a83633B14379c49878E62431B33611d3310B65212a33126B16967C4886J77076
$$ -183633 214379 -349878 562431 233611 -43310 265212 -133126 216967 34886 211962
17837B11962K30780B15518F2111b45077N5684C59314e91939J02037j02522a25975
$$ 211962 442742 215518 62111 -245077 -189393 359314 -591939 -489902 -592424 -125975
17826a47259E24978a04135i066j0398o3200j45493A01903J44354c31433o44370
$$ -147259 524978 -104135 -9066 -19464 -82664 -228157 101903 246257 -331433 -975803
17816i75803h1359r7880C65372J44007M15487B38561L80211B04294N09328F1133
$$ -975803 -81359 -179239 365372 509379 924866 238561 618772 204294 713622 61133
17805c38806m3797A24083N35012B19327a29134J326E38111b00325I42898d91275
$$ -338806 -382603 124083 659095 219327 -129134 -127808 538111 -200325 942898 -491275
17794b20728E26216A11161c74919j51314A66174c15081e4340I94244b78995A82521
$$ -220728 526216 111161 -374919 -526233 166174 -315081 -54340 994244 -278995 182521
17783c7868E735a61397D61412j29816F447a01494j87769A6685N873G522L29620
$$ -37868 5735 -161397 461412 331596 6447 -101494 -289263 16685 22558 7522 337142
17772C37142Q8494j36280c07672l116a30870A53412L95066A22455d83024P0770
$$ 337142 425636 289356 -307672 -310788 -130870 153412 548478 122455 -483024 -412254
17762d12254j07763a52235D24695d69092H2211b39753C77518C5524K30381F9421
$$ -412254 -520017 -152235 424695 -469092 82211 -239753 377518 35524 265905 69421
17751d73543b0922m67912A4896K469P7851h5734F24538G0524O94786j50105b96254
$$ -473543 -20922 -488834 14896 17365 95216 -85734 624538 70524 765310 615205 -296254
17739C62522r5446e252l42995B65041a07222A44336M79014k95577c6318A28643
$$ 362522 267076 -5252 -348247 265041 -107222 144336 623350 327773 -36318 128643
17728E52403b80135D00980b68045a01101d1250G92724h3447a9106B05019o7702
$$ 552403 -280135 400980 -268045 -101101 -41250 792724 -83447 -19106 205019 137317
17718A37317J71225i3450C39429a89859B35445a52553A26656C6835N0579L60220
$$ 137317 308542 -93450 339429 -189859 235445 -152553 126656 36835 87414 447634
17708D47634l1811j43220O17984C98629K1244q7202N192a92817G72623i4176A86816
$$ 447634 415823 272603 890587 398629 419873 332671 337863 -192817 772623 -94176 186816
17696D26355a10368E55177j63128j5107c45325E42423M1383i78614F98877a20909
$$ 426355 -110368 555177 392049 376942 -345325 542423 583806 -978614 698877 -120909
17685B35820d89034M2533D33786J7776a25898q790A16356C0216J73275b6612B67722
$$ 235820 -489034 -446501 433786 451562 -125898 -134688 116356 30216 203491 -26612 267722
17673B85035E3613L27870j8799g2408j99568A49962P21329B12561o5262d19457
$$ 285035 53613 381483 362684 -72408 -271976 149962 871291 212561 147299 -419457
17662G32089C11132c61812m4454E19662I0066K32592l897A48811P31722D1499
$$ 732089 311132 -361812 -406266 519662 90066 322658 318761 148811 880533 41499
17651C43487A3811M53414c89182A15085O49459a04788c07j90180E13470g26889
$$ 343487 13811 467225 -389182 115085 764544 -104788 -307 -190487 513470 -726889
17640e42476a1561r1315C37215d22391I76M97958j54588A55427o3118a8564D38101
$$ -542476 -11561 -102876 337215 -422391 976 498934 344346 155427 92309 -18564 438101
17628D33723e53525D42252j03300J52307L58046e57804D25207M3151c63499C77293
$$ 433723 -553525 442252 338952 491259 849305 -557804 425207 468358 -363499 377293
17617C87546q0863c62058A068730G3780M30340B12365b2727j1309k83796G1411
$$ 387546 306683 -362058 1068730 73780 504120 212365 -22727 -34036 -317832 71411
17606H2754K6158J48159J41427J85894B44354J58642r7160p5520e36294C97832
$$ 82754 108912 257071 398498 584392 244354 402996 305836 230316 -536294 397832
17595G0974J59054H486O93028b5378A27543L25208L60654k00970h85173D23831
$$ 70974 230028 8486 701514 -25378 127543 452751 813405 612435 -885173 423831
17584a22652A74650M0133L82049k32295j11219J41314M91920P486D34762K03738
$$ -122652 174650 214783 596832 364537 253318 394632 886552 894038 434762 638500
17574F38500a912E11144J28794A97577B9603L74849L01239k54840j03227N69569
$$ 638500 -1912 511144 639938 197577 29603 404452 705691 450851 347624 917193
17564I17193B69924J53471J09285r7469R1785A992L98910L12986A07731Q8549
$$ 917193 269924 423395 532680 435211 526996 1992 400902 713888 107731 196280
17554A96280O18108k31058B26999R4472R4842J38780J2099j00689A61265L88817
$$ 196280 814388 583330 226999 321471 416313 555093 567192 466503 161265 550082
17544E50082M54177q44D64390N31972C60026n7K03750a32611C11119J97591B43252
$$ 550082 1004259 1003415 464390 996362 360026 359969 563719 -132611 311119 508710 243252
17532F65311P8657k43184L14719j64977Q8271C36179O53611m19324A75419P06576
$$ 665311 743968 500784 815503 650526 738797 336179 989790 570466 175419 881995
17522H81995j55406C17951L51210J87342j71374K37604L13569F12618N93704k01800
$$ 881995 726589 317951 669161 856503 685129 922733 1236302 612618 1206322 1004522
17512A004522D81822K38923k11864R3388M01455L24753n0154a99472G80611k88345
$$ 1004522 481822 720745 508881 602269 1003724 1328477 1278323 -199472 780611 492266
17502D92266L26706C95845J54948O78044n43016K16565C96129K71036k09740m3831
$$ 492266 818972 395845 550793 1228837 685821 902386 396129 667165 457425 413594
17492D13594K05737K95395B52394N10805a55135E28126K46085K06693K26861A20519
$$ 413594 619331 914726 252394 763199 -155135 528126 774211 980904 1207765 120519
17481a032H22656l82520l6512l9459L41448b86111F76140B59119L67704a4751
$$ -1032 822656 440136 403624 364165 705613 -286111 676140 259119 626823 -14751
17470A77791K96922N70080C49781J95630J41143C37395M04641j08927A12708K20428
$$ 177791 474713 1044793 349781 545411 686554 337395 742036 633109 112708 333136
17460C33136A08507K36759j10300j14603N33929J3445J05176c6848I81260j64001
$$ 333136 108507 345266 234966 120363 654292 667737 772913 -36848 981260 817259
17450H17259k3872B40594M29842j84398L44336m8627l63813J4109A23895L05538
$$ 817259 793387 240594 670436 486038 830374 781747 417934 432043 123895 429433
17440D29433O94394i246A213552A64154R8541a7392G11159A80009J049119p9434
$$ 429433 1123827 -9246 1213552 164154 262695 -17392 711159 180009 1229128 1149694
17430A149694n39077J33559B60320N49600a02585H22230k54975Q04065C45915
$$ 1149694 610617 744176 260320 809920 -102585 822230 567255 1371320 345915
17420F01569B54119l1822R2502a35380B94121j6490L56950E1838N39627n8037
$$ 601569 254119 222297 314799 -135380 294121 277631 634581 51838 591465 533428
17410E33428k7951h622H85987A40379a26287I29984B23955N58213a6480H70409
$$ 533428 505477 -8622 885987 140379 -126287 929984 223955 782168 -16480 870409
17399a40727E52585K11722a96442D82097J48018m2382j71836M79918k64715j23815
$$ -140727 552585 764307 -196442 482097 630115 587733 415897 895815 631100 507285
17389E07285q7473L04394R6966J24184D60618M14744k52515J55078p2207k52669
$$ 507285 419812 724206 821172 945356 460618 875362 622847 777925 705718 453049
17379D53049J04318B43905H574K51871j03339N87601j36614B78340A6310N19828
$$ 453049 557367 243905 8574 260445 157106 744707 608093 278340 16310 536138
17369E36138N77110B61282M67504k73654A72815J86292k4219A21788M63367k85694
$$ 536138 1113248 261282 728786 455132 172815 359107 334888 121788 585155 299461
17359B99461J01297J67329k26764P53867l08314A00856N20886j28718a91089C83785
$$ 299461 400758 568087 341323 1095190 786876 100856 621742 493024 -191089 383785
17348F06310o0412j28001N84382A96010K35428j50938Q2186c39582D95298n5812
$$ 606310 545898 417897 1002279 196010 431438 280500 362686 -339582 495298 439486
17338D39486N14548j80101B72151N0095M89304k32506L47569L72802m07782D32491
$$ 439486 954034 773933 272151 322246 811550 579044 926613 1299415 891633 432491
17327H21890K08010j0933B99457j45910M22147A37164J055715A46031D5214N81914
$$ 821890 1029900 1018967 299457 153547 575694 137164 1192879 146031 45214 627128
17317F27128J37294B7628P30745A94356N12013B11180G7446N30586J4628N89479
$$ 627128 764422 27628 758373 194356 706369 211180 77446 608032 622660 1212139
17307A212139m81169j90560J42123K96944A45956L09177K98803l36204o3906L89649
$$ 1212139 730970 540410 682533 979477 145956 455133 753936 417732 353826 743475
17297G43475P62957k56926B40044a49194E70514m171J00099K08240c91001H17676
$$ 743475 1506432 1249506 240044 -149194 570514 566343 666442 874682 -391001 817676
17286G81323D0986L45037L24937A10996O10468j21553r2653m3154M54760k41619
$$ 781323 40986 386023 710960 110996 721464 599911 507258 464104 918864 677245
17276F77245G8725P32331K95971k2005C58066P43113E09041J55132C28839J67197
$$ 677245 78725 811056 1107027 1085022 358066 1101179 509041 664173 328839 496036
17266D96036J26268j40113J10798o0580B33142K18919N36938k29012B80074P36319
$$ 496036 622304 482191 592989 532409 233142 452061 988999 759987 280074 1016393
17256A016393C45097K91262J02214J1561M5860L11479r9795j06357K93465C5712
$$ 1016393 345097 636359 738573 750134 795994 1107473 1007678 901321 1194786 35712
17245G09987j58731J35992j09897j41035Q47887F14241J67386C41455M83761j43939
$$ 709987 551256 687248 577351 436316 1284203 614241 781627 341455 825216 681277
17235F81277K46258m03960P5947n4555P92581A10820J093534E24664L99816j48357
$$ 681277 927535 523575 599522 544967 1337548 110820 1204354 524664 924480 776123
17225G76123k40503K39009J58767m55236K10176l7769O23535n64417p383K63623
$$ 776123 535620 774629 933396 478160 688336 650567 1274102 709685 702302 965925
17215I65925K33812E00441O62290k63215M81330m06830j92784B07235O34568J18429
$$ 965925 1199737 500441 1162731 899516 1380846 974016 781232 207235 841803 960232
17205I60232M5096K11681n05663J91180M45223J24225o13590M38705E18857m636
$$ 960232 1005328 1217009 711346 902526 1347749 1471974 858384 1297089 518857 514221
17195E14221K89393M52575m29742K13852n1994L1342m38106O08792L7172n04212
$$ 514221 803614 1256189 826447 1040299 988305 1019647 581541 1190333 1227505 723293
17185G23293L80186l95657l15119J040018n6608l93205L87331k75562L52686p8789
$$ 723293 1103479 707822 392703 1432721 1376113 982908 1370239 1094677 1447363 1368574
17175A368574j78629n6186m62293K34013M42628k50388K51648m314E35839O69984
$$ 1368574 1189945 1133759 671466 905479 1348107 1097719 1349367 1345053 535839 1205823
17165A205823m1164N59182p92009K26523K53660j7146r2620k88656K42633k0004
$$ 1205823 1164659 1723841 931832 1158355 1412015 1394869 1302249 1013593 1256226 1236222
17155A236222n30009L31977L14418l00251Q45950r4685k87434r4625k42215k22037
$$ 1236222 706213 1038190 1352608 1052357 1898307 1803622 1516188 1421563 1179348 957311
17145I57311K75611k21522J15621K4550J64271L67753l03025J29009m20365o881
$$ 957311 1232922 1011400 1127021 1151571 1315842 1683595 1380570 1509579 1089214 1082333
17135A082333J94890R35293r32179k76296O04035m84550N51462k6653m60946Q1148
$$ 1082333 1277223 2212516 1280337 1004041 1608076 1123526 1674988 1648335 1187389 1268537
17125A268537P53461H59093L59738L04083L06248j03823n47142J95239N52154
$$ 1268537 2021998 859093 1218831 1522914 1829162 1725339 1178197 1373436 1925590
17116A925590n76787K00416M60097N52028j243688M14319k56961k97461L14160
$$ 1925590 1348803 1549219 2009316 2561344 1317656 1731975 1475014 1177553 1491713
17107A491713Q25009k94722m92729M12837r28239P73236M98364p08153M89905
$$ 1491713 2316722 2022000 1529271 1942108 1013869 1787105 2285469 1577316 2067221
17098B067221R0548p54592m4498N94108m01460R94474o82102J13851j81549n18087
$$ 2067221 2157769 1403177 1358679 1952787 1551327 2545801 1863699 1977550 1796001 1277914
17088A277914M30166N82746n68116P3916N94129m32034K65527J88097q99761N63490
$$ 1277914 1708080 2290826 1722710 1796626 2390755 1958721 2224248 2412345 1512584 2076074
17078B076074l36381j18034R00491m49646j22519O37274n29349J69234p47207
$$ 2076074 1739693 1621659 2522150 2072504 1949985 2587259 2057910 2227144 1479937
17069A479937M14693P43469K21570m29582K79882p2986L62140l57928k06775l608
$$ 1479937 1894630 2638099 2859669 2430087 2709969 2636983 2999123 2641195 2434420 2430812
17059B430812N05535l65801k54916K45582K47458K96347m51821l10017N30664
$$ 2430812 2936347 2570546 2315630 2561212 2808670 3105017 2653196 2343179 2873843
17050B873843L71289o48720M25142M8727p99522L16938J55114L27648j020972
$$ 2873843 3245132 2596412 3021554 3070281 2270759 2587697 2742811 3070459 2049487
17041B049487J165649o2255k89039R8710N31288n50266l16854O94779k87604N25394
$$ 2049487 3215136 3152881 2863842 2962552 3493840 2943574 2626720 3321499 3033895 3559289
17031C559289m44752n8735M12386j208868R86742l4824M69003p13249L06719P69026
$$ 3559289 3114537 3055802 3468188 2259320 3246062 3211238 3680241 2966992 3273711 4042737
17021D042737o04585m59530P90187k79894J58448k56148M02075n97787L61765
$$ 4042737 3438152 2978622 3768809 3488915 3647363 3391215 3793290 3195503 3557268
17012C557268k51821J53718L91631l46301J26913k23077Q35458l96799M25199
$$ 3557268 3305447 3459165 3850796 3504495 3631408 3408331 4243789 3846990 4272189
17003D272189j027115L46952M89706L90658n88676O12251M74255q28207k83077
$$ 4272189 3245074 3592026 4081732 4472390 3883714 4495965 4970220 4142013 3858936
16994C858936J79507J76338J10777K14699j9691k85713O56313K51316r93470Q17971
$$ 3858936 4038443 4214781 4325558 4540257 4520566 4234853 4891166 5142482 4149012 4966983
16984D966983l21070J61693R9148n74996P23263p356q9874M05050k517j027954
$$ 4966983 4645913 4807606 4906754 4331758 5055021 5047665 4957791 5362841 5360324 4332370
16974D332370P91865L03655l93458N50989n96879O88125L17336K0779K52388n04511
$$ 4332370 5124235 5427890 5034432 5585421 4988542 5676667 5994003 6014782 6267170 5762659
16964E762659R8175M996j73796N49035m91007m8416Q95385r9270J01822n40671
$$ 5762659 5860834 5865830 5692034 6241069 5750062 5701646 6597031 6497761 6599583 6058912
16954F058912L94957J29317J88291j26619L7860K37131R3383k04233M74215n91459
$$ 6058912 6453869 6583186 6771477 6644858 6682718 6919849 7013232 6808999 7283214 6691755
16944F691755M67618M33660n68003J201940o51351l63513P70026j40156P21767
$$ 6691755 7159373 7593033 7025030 8226970 7575619 7212106 7982132 7841976 8563743
16935H563743m02119K92336n19045J486364m84257p55313O14989k95811K63630
$$ 8563743 8161624 8453960 7934915 9421279 8937022 8181709 8796698 8500887 8764517
16926H764517L35042L60974K34946q31377P18331q1547L76237l39481M52845K24444
$$ 8764517 9099559 9460533 9695479 8864102 9582433 9500886 9877123 9537642 9990487 10214931
16916A0214931k4460o5236N66180K67410l7581J44288j08426Q04671n75903m08209
$$ 10214931 10190471 10125235 10691415 10958825 10921244 11065532 10957106 11761777 11185874 10777665
16906A0777665P58667Q7502K10151K65442K16595n48876M74433J071043n46499
$$ 10777665 11536332 11623834 11833985 12099427 12316022 11767146 12241579 13312622 12766123
16897A2766123N57760l90548Q01533n8348N87376L21230l72818J006165J54856
$$ 12766123 13323883 12933335 13734868 13676520 14263896 14585126 14212308 15218473 15373329
16888A5373329L44397m86707N50991n12164J223727J24609m00563l21810J316483
$$ 15373329 15717726 15231019 15782010 15269846 16493573 16618182 16217619 15895809 17212292
16879A7212292p6776L60508K53429O3243O31228L59100N13096j68158j77710O46697
$$ 17212292 17135516 17496024 17749453 17812696 18443924 18803024 19316120 19147962 18970252 19616949
16869A9616949J167586o44033P04859J32837O70834J01362O61842K04889k46997
$$ 19616949 20784535 20140502 20845361 20978198 21649032 21750394 22412236 22617125 22370128
16860B2370128K94964J115070j92788O44504O90081o5414P75885P89561j65763
$$ 22370128 22665092 23780162 23587374 24231878 24921959 24856545 25632430 26421991 26256228
16851B6256228O42226k71938J203734r48861O59597J556169j2056Q77916Q83208
$$ 26256228 26898454 26626516 27830250 26881389 27540986 29097155 29085099 29963015 30846223
16842C0846223o5712L50020N68284J212189J16650J19738P53527O84557P65492
$$ 30846223 30780511 31130531 31698815 32911004 33027654 33147392 33900919 34585476 35350968
16833C5350968L02836J62000Q44376Q50295O03294K35879N19137J199814J381514
$$ 35350968 35653804 35815804 36660180 37510475 38113769 38349648 38868785 40068599 41450113
16824D1450113j47480Q58679K17755P86758J091839O26419M00826J469271l55470
$$ 41450113 41302633 42161312 42379067 43165825 44257664 44884083 45284909 46754180 46398710
16815D6398710J791018Q05093J68313J223051N69687J443600j48053J693580J028727
$$ 46398710 48189728 48994821 49163134 50386185 50955872 52399472 52251419 53944999 54973726
16806E4973726N44656J120843J206883Q58786O94749J460039q8570Q66983J787499
$$ 54973726 55518382 56639225 57846108 58704894 59399643 60859682 60771112 61638095 63425594
16797F3425594Q03581R43056J785464M89955R73375O74587J666562J592288Q05193
$$ 63425594 64229175 65172231 66957695 67447650 68421025 69095612 70762174 72354462 73159655
16788G3159655J637541P95418J251307J250212J238990J532227J116093J197999
$$ 73159655 74797196 75592614 76843921 78094133 79333123 80865350 81981443 83179442
16780H3179442J458325Q40131R70976J856534J262037J470190P52033K255857
$$ 83179442 84637767 85477898 86448874 88305408 89567445 91037635 91789668 94045525
16772I4045525J081874J582565J153639J035201J557184J200761J971413R87150
$$ 94045525 95127399 96709964 97863603 98898804 100455988 101656749 103628162 104615312
16764A04615312J403655R02363K415636R93523J340034J302717Q61972K107419
$$ 104615312 106018967 106921330 109336966 110330489 111670523 112973240 113835212 115942631
16756A15942631J020551J637794P41946K258706J385057J396884K21786K294073
$$ 115942631 116963182 118600976 119342922 121601628 122986685 124383569 124605355 126899428
16748A26899428J106801R10349Q23209J575334J013179J065894J767919K71661
$$ 126899428 128006229 128916578 129739787 131315121 132328300 133394194 135162113 135433774
16740A35433774J492254j35268J210642Q88140M69547J040684j54506N02339n15491
$$ 135433774 136926028 136790760 138001402 138889542 139359089 140399773 140245267 140747606 140232115
16731A40232115N42936Q14931L99946j356588M28374p16873j082437j21045j332954
$$ 140232115 140775051 141589982 141989928 140633340 141061714 140344841 139262404 139141359 137808405
16722A37808405m49287p41144j936032j566601j257594j144183k019486k634862
$$ 137808405 137359118 136617974 134681942 133115341 131857747 130713564 128694078 126059216
16714A26059216j854542k073843k394436k251625k524315k169527l244454k808991
$$ 126059216 124204674 122130831 119736395 117484770 114960455 112790928 109546474 106737483
16706A06737483k462877k701180k949117k547747l232336j895208l053396k703215
$$ 106737483 104274606 101573426 98624309 96076562 92844226 90949018 87895622 85192407
16698H5192407k443629k569394l221870j311095k048412k894268k396056k133695
$$ 85192407 82748778 80179384 76957514 75646419 73598007 70703739 68307683 66173988
16690F6173988j898146k660341j621728j557387k694071j914511j046074j279581
$$ 66173988 64275842 61615501 59993773 58436386 55742315 53827804 52781730 51502149
16682E1502149j753848j036422k297817j603401q65320j581147j700391p78500
$$ 51502149 49748301 48711879 46414062 44810661 43945341 42364194 40663803 39885303
16674C9885303n64350j221983p85448j271382q92552j015709q70485j128465q88072
$$ 39885303 39320953 38098970 37313522 36042140 35149588 34133879 33263394 32134929 31246857
16665C1246857n71864p95895q43788m89203j091699k56896n21437o11954j432985
$$ 31246857 30674993 29879098 29035310 28546107 27454408 27197512 26676075 26064121 24631136
16656B4631136j27367O2596r61491q48640n57074j54534n13106p52375p78940
$$ 24631136 24503769 24566365 23604874 22756234 22199160 22044626 21531520 20779145 20000205
16647B0000205R4045m19474p26632j32909l19429m23540k93101m52208l78510
$$ 20000205 20094250 19674776 18948144 18815235 18495806 18072266 17779165 17326957 16948447
16638A6948447o41385O16962m21555l79359m97943k47854n15198J20990r33700
$$ 16948447 16307062 16924024 16502469 16123110 15625167 15377313 14862115 14983105 14049405
16629A4049405K98173k64398n17452L21906k70832q19591J28258m50647M17593
$$ 14049405 14347578 14083180 13565728 13887634 13616802 12797211 12925469 12474822 12892415
16620A2892415q62222j84m5135N3557j146822M05399J64106k59543k14069m69685
$$ 12892415 12030193 12030009 11984874 12038431 10891609 11297008 11461114 11201571 10987502 10517817
16610A0517817N4945L40886l18044m09555k71570L44088k88497m27289n729J77606
$$ 10517817 10572762 10913648 10595604 10186049 9914479 10258567 9970070 9542781 9537052 9714658
16600I714658R9225j273163M93274k34442J49815k38268J11486k10734J98935
$$ 9714658 9813883 8540720 9033994 8799552 8949367 8711099 8822585 8611851 8810786
16591H810786l19857O1512j07024j01518q46058P4044R1183n4262M23449n55608
$$ 8810786 8490929 8552441 8445417 8343899 7497841 7571885 7663068 7608806 8032255 7476647
16581G476647L71959p13463J81151k80783r2980O5427o57033J78074J32967J18284
$$ 7476647 7848606 7135143 7316294 7035511 6942531 7007958 6350925 6528999 6661966 6780250
16571F780250o43588J178329j152805R25555m11614q28238K90155m7993N06684
$$ 6780250 6136662 7314991 6162186 7087741 6676127 5847889 6138044 6090051 6596735
16562F596735q6039o52102j71142J28325N56712p36411J4106j69435k86865k69136
$$ 6596735 6510696 5858594 5687452 5815777 6372489 5636078 5650184 5480749 5193884 4924748
16552D924748L61496M47753k56451p11366J00446K44210L77353o34346P33797
$$ 4924748 5286244 5733997 5477546 4766180 4866626 5110836 5488189 4853843 5587640
16543E587640p49979M35752j28544q53278L0896P28929l09261J52645p55812P44531
$$ 5587640 4837661 5273413 5144869 4291591 4322487 5051416 4742155 4894800 4138988 4883519
16533D883519m66258M76520j140619K46176Q4852J09276k81473K45462l39727
$$ 4883519 4417261 4893781 3753162 3999338 4084190 4193466 3911993 4157455 3817728
16524C817728M66922j04707M34714n94905j56614l34917O30871o97413L75528
$$ 3817728 4284650 4179943 4614657 4019752 3863138 3528221 4159092 3461679 3837207
16515C837207L38450k60673k52292N14865l48171L81250p86792M78394r40701
$$ 3837207 4175657 3914984 3662692 4177557 3829386 4210636 3423844 3902238 2961537
16506B961537O53248o19921M76078J71239J16342K73847p95596N29220o91594
$$ 2961537 3614785 2994864 3470942 3642181 3758523 4032370 3236774 3765994 3074400
16497C074400N42559l14460o98421Q62060n08795K24607M53333j81211L0221m51913
$$ 3074400 3616959 3302499 2604078 3466138 2957343 3181950 3635283 3454072 3484293 3032380
16487C032380m61966Q45308k92037l5912J82209l0242o71252J55177K4220J74996
$$ 3032380 2570414 3415722 3123685 3087773 3269982 3239740 2568488 2723665 2747885 2922881
16477B922881L71989j344847J348589p42655Q58271q71935O80714l18798q4276
$$ 2922881 3294870 1950023 3298612 2555957 3414228 2542293 3223007 2904209 2819933
16468B819933j79145L1549o12721L32320L44763j60580L33013l41374L0058M54765
$$ 2819933 2640788 2672337 2059616 2391936 2736699 2576119 2909132 2567758 2597816 3052581
16458C052581l96906j99219j09545P59409j28203k60367l22904m25055N02924
$$ 3052581 2655675 2456456 2346911 3106320 2978117 2717750 2394846 1969791 2472715
16449B472715K55291m60492j35163J822q1567P11459q20444J00967Q37629k00814
$$ 2472715 2728006 2267514 2132351 2134173 2052606 2764065 1943621 2044588 2882217 2681403
16439B681403o34487K64898j24555M2241n2247J69837j67119N1389j85749K10914
$$ 2681403 2046916 2311814 2187259 2229500 2177253 2347090 2179971 2231360 2045611 2256525
16429B256525m06339j6885M0390L89965k42939o2579j1210N03648k52482j00173
$$ 2256525 1850186 1833301 1873691 2263656 2020717 1958138 1946928 2450576 2198094 2097921
16419B097921Q7406k87496K23815l16675n48952N10186K59034n68279N76132n59820
$$ 2097921 2185327 1897831 2121646 1804971 1256019 1766205 2025239 1456960 2033092 1473272
16409A473272P2074Q2527O64752n75429M41080k55933K45008m30550J86579j27550
$$ 1473272 1545346 1627873 2292625 1717196 2158276 1902343 2147351 1716801 1903380 1775830
16399A775830m53832J40666P8947M10607k03323K74648q16498M31916m78821K95478
$$ 1775830 1321998 1462664 1541611 1952218 1748895 2023543 1207045 1638961 1160140 1455618
16389A455618k76448P46176l36402J62087l07664p3522K48642p38310J056093
$$ 1455618 1179170 1925346 1588944 1751031 1443367 1369845 1618487 880177 1936270
16380A936270I02610J039090m65222J2097j95700K30935J31389j40107m53560
$$ 1936270 902610 1941700 1476478 1488575 1292875 1523810 1655199 1515092 1061532
16371A061532N06889Q1248n784m29133O9041l27107L32763L11068j46899l18370
$$ 1061532 1568421 1649669 1643885 1214752 1283793 956686 1289449 1600517 1453618 1135248
16361A135248R43305n61833j21280R3890L31471O5836j00054K26459m07814n86958
$$ 1135248 2078553 1516720 1395440 1489330 1820801 1886637 1786583 2013042 1605228 1018270
16351A018270J156829q41876k32332J31337O17012m67279n68120K61448k6735
$$ 1018270 2175099 1333223 1100891 1232228 1849240 1381961 813841 1075289 1048554
16342A048554K71206l90338K04201E49145P20813m24467O00566k91161p8965L57619
$$ 1048554 1319760 929422 1133623 549145 1269958 845491 1446057 1154896 1075931 1433550
16332A433550j54273L73814m61651K28937M1011m15721J24593N4873D63177M40469
$$ 1433550 1279277 1653091 1191440 1420377 1461388 1045667 1170260 1225133 463177 903646
16322I03646L71378R6181n07051j64617K31533L80054r208j84580N54773p39185
$$ 903646 1275024 1371205 864154 699537 931070 1311124 1301916 1117336 1672109 932924
16312I32924J48817m60382K00918l20967R4751N28655j89898l6905R334J93362
$$ 932924 1081741 621359 822277 501310 596061 1124716 934818 897913 907247 1100609
16302A100609J1241n1858j67930j88440j81357O15383k01066j03228K66210O1771
$$ 1100609 1111850 1059992 892062 703622 522265 1137648 936582 833354 1099564 1161335
16292A161335P3008J10490n63674L29786K83084D08353J010634n42546J37955
$$ 1161335 1234343 1344833 781159 1110945 1394029 408353 1418987 876441 1014396
16283A014396j83981k28187n3582n9806P15715k44648M15341l63477k3938D80241
$$ 1014396 830415 602228 548646 488840 1204555 959907 1375248 1011771 987833 480241
16272A066728m90183K54496J74331j86795k53520O8357L85569C82336K76728l17977
$$ 1066728 576545 831041 1005372 818577 565057 633414 1018983 382336 659064 341087
16262C41087K23056O42184E39420O02731C52793J44790J19433M08577a4712A106690
$$ 341087 564143 1206327 539420 1142151 352793 497583 617016 1025593 -14712 1106690
16251A487280p26077l03491N50630j79156C97822N7082k6968L01540J54495C56393
$$ 1487280 761203 457712 1008342 829186 397822 454904 427936 729476 883971 356393
16240E52652O46104D32178K87760q508J23374l29779j01099N2236M1711q5527
$$ 552652 1198756 432178 719938 711430 834804 505025 403926 456162 497873 412346
16230D12346J49017k35275O36751m1151B20231M96747n8819L38717C90815J74333
$$ 412346 561363 326088 962839 921688 220231 716978 658159 996876 390815 565148
16220E65148J28482A38720Q10822C41817j29946L81949J10004k9197K09498B14490
$$ 565148 693630 138720 949542 341817 211871 593820 703824 674627 884125 214490
16209F63889N2188j52339B34267N1574R47543n20536k24815K95270J5799l83269
$$ 663889 716077 563738 234267 285841 1233384 712848 488033 783303 799102 415833
16199D15833M14699b33772E14489H7222P31097E4803K83888L80331k12556n0895
$$ 415833 830532 -233772 514489 87222 818319 54803 338691 719022 506466 455571
16189D55571L62731L78821C09389j0635G5237R35581C20454d170D26634J65591
$$ 455571 818302 1197123 309389 298754 75237 1010818 320454 -4170 426634 592225
16179E92225k26778N65593k31885j70992J1647A34923i5817E42914A62493L50652
$$ 592225 365447 931040 699155 528163 539810 134923 -95817 542914 162493 513145
16169E13145N87314B90626K08039K98579L00757E35687c5625I91871d46697G80114
$$ 513145 1100459 290626 498665 797244 1098001 535687 -35625 991871 -446697 780114
16158B89213c83585D14816J80804B33987M99229J38882B10194K65776K33876J64493
$$ 289213 -383585 414816 595620 233987 733216 872098 210194 475970 709846 874339
16148H74339A63652L28635k10519b43078E71577A06686O33680j90773k28493A28569
$$ 874339 163652 492287 281768 -243078 571577 106686 740366 549593 321100 128569
16137B53631L83279k93485K13104j00053B03415J10217H6379O41238K69547C70794
$$ 253631 636910 343425 556529 456476 203415 313632 86379 727617 997164 370794
16126B65044M47189B34296E5476N0186L63702N6144j9574J29022k62762j46262
$$ 265044 712233 234296 55476 105662 469364 525508 505934 634956 372194 225932
16116B25932r7992J54398D5120N6454K10497j9148n6115d12733E52235k75808
$$ 225932 127940 282338 45120 101574 312071 292923 236808 -412733 552235 276427
16106B76427L61651j58384A29865M01740B43936M65663c00614h2439E92677A88751
$$ 276427 638078 479694 129865 531605 243936 709599 -300614 -82439 592677 188751
16095d40895k60321b62828A91453c01933B11280j01742K81941A79829a83538B3387
$$ -440895 -701216 -262828 191453 -301933 211280 109538 391479 179829 -183538 23387
16084C58953E3960f1418j8510A70893J94906P04460I8523J31191F5553L29989
$$ 358953 53960 -61418 -79928 170893 365799 1070259 98523 229714 65553 395542
16074C95542L53340k23442N6575f6746b5025l8563C67777j08870J78695Q8143
$$ 395542 748882 525440 582015 -66746 -25025 -63588 367777 258907 437602 525745
16064E25745a1640C29475h3448C58200e1438A75503L78807j11962j95052K55468
$$ 525745 -11640 329475 -83448 358200 -51438 175503 554310 442348 247296 502764
16054E02764N7419B77828H5900C8612H443O53878K85303j12551F3703M73630b2390
$$ 502764 560183 277828 85900 38612 8443 662321 947624 835073 63703 537333 -22390
16042A09250N52974j1480p6258K25192A19521L09999j68959A08536M65295c16897
$$ 109250 662224 650744 574486 799678 119521 429520 260561 108536 573831 -316897
16031g0852A6940N66094a61331A86181J84548P8924G0004k8608N5268K94831K84414
$$ -70852 16940 583034 -161331 186181 370729 449653 70004 41396 96664 391495 675909
16020F75909l9570d48944a67001j06540A53656c30035k17775E00823c81786F52964
$$ 675909 636339 -448944 -167001 -273541 153656 -330035 -547810 500823 -381786 652964
16009d48077D04868j78246N77038B41544b2716D73988J05993M8642Q7744A30512
$$ -448077 404868 226622 803660 241544 -22716 473988 579981 628623 716367 130512
15998c47868d0263C71478L62730c46642B84916d02542H54572C28915O2153N18034
$$ -347868 -40263 371478 734208 -346642 284916 -402542 854572 328915 391068 909102
15988I09102I9502K64067p0059j19096M33377Q5838j4930l6623L8550B60066K11628
$$ 909102 99502 363569 293510 174414 607791 693629 678699 642076 680626 260066 471694
15977D71694N64129b37673E94029A03437a84884H5435a91634D37895a38134G37974
$$ 471694 1035823 -237673 594029 103437 -184884 85435 -191634 437895 -138134 737974
15966h7851l58625J18975H40013c0950k36739C34010b22779j21257H255a25893
$$ -87851 -446476 -327501 840013 -30950 -267689 334010 -222779 -344036 8255 -125893
15955f28784a14450k21206D0002g41308C08690I1187K49911l2585A40774R4974
$$ -628784 -114450 -335656 40002 -741308 308690 91187 341098 308513 140774 235748
15945B35748h9699k27869B1529J34055c66134h6481l11582A90005a32324G937
$$ 235748 -89699 -317568 21529 155584 -366134 -86481 -398063 190005 -132324 7937
15934A32821b87631n24667c56687C16239L4120p9159M9194n7345f8993m34844
$$ 132821 -287631 -812298 -356687 316239 350359 271200 320394 263049 -68993 -503837
15924e03837E58694A73742a10535l49145C0463e21245H8551K67171A45580d89294
$$ -503837 558694 173742 -110535 -459680 30463 -521245 88551 355722 145580 -489294
15913D75627c48051A79712g4148C35291b0823k08779C75328J10077A08341b7732
$$ 475627 -348051 179712 -74148 335291 -20823 -229602 375328 485405 108341 -27732
15902E90422b68385o1837B17263c14934d380j83681A22131g1005B1687e70304
$$ 590422 -268385 -330222 217263 -314934 -4380 -188061 122131 -71005 21687 -570304
15891b47761D15745j38765N71262D7993d95181d748D79847a78555A02734c0474
$$ -247761 415745 276980 848242 47993 -495181 -4748 479847 -178555 102734 -30474
15880B81412k1135G3887b03884A72363f56260f0941C00615a6900l30366D47658
$$ 281412 260277 73887 -203884 172363 -656260 -60941 300615 -16900 -347266 447658
15869d76150a46k07097A39844a54986C65177a09652B4797N85990c37992K4364
$$ -476150 -146 -207243 139844 -154986 365177 -109652 24797 610787 -337992 -313628
15859c13628C23615c63345B10200L94706B19291K08309A64613m8314N8182d2178
$$ -313628 323615 -363345 210200 604906 219291 427600 164613 116299 174481 -42178
15848h32935L93843J72371J31849J1125C03666a19951C45153K8517c32935G9871
$$ -832935 -439092 -266721 -134872 -123747 303666 -119951 345153 373670 -332935 79871
15837d7308p5171j0017D10089a42940n4643F61811b48645E04516a60354A7341
$$ -47308 -122479 -132496 410089 -142940 -197583 661811 -248645 504516 -160354 17341
15826d49175k91613A50107e2138C00968d54776a68956r2860j6117A57042K39769
$$ -449175 -740788 150107 -52138 300968 -454776 -168956 -261816 -277933 157042 396811
15816C96811K61591e9442k42226g8653c3220r2175M5863m84906D91778D1311d4044
$$ 396811 658402 -59442 -301668 -78653 -33220 -125395 -79532 -564438 491778 41311 -44044
15804f03061J88965A8997J40679d41335C25113C9893f91951A00686L72989e09793
$$ -603061 -414096 18997 159676 -441335 325113 39893 -691951 100686 473675 -509793
15793D65467b96219P2561A58660G9052a90294E393O50322G1174b35955J12185
$$ 465467 -296219 -223658 158660 79052 -190294 5393 655715 71174 -235955 -123770
15783a23770j13586k16411B17730d32351D23603H8232M51488e80668M7829P4159
$$ -123770 -237356 -453767 217730 -432351 423603 88232 539720 -580668 -532839 -458680
15773d58680B5747M44961K292b82677i4173E87086b15279G67767a2588D7159J49281
$$ -458680 25747 470708 473000 -282677 -94173 587086 -215279 767767 -12588 47159 196440
15762A96440k2129D909K39493i2744C09597A16738b76537l9705D56905d25758
$$ 196440 174311 4909 244402 -92744 309597 116738 -276537 -316242 456905 -425758
15751A1157h981F33431j73160d9423C79863J72417E004R5705c63014B60106c19139
$$ 11157 -8981 633431 460271 -49423 379863 552280 5004 100709 -363014 260106 -319139
15739A18048e9563o61010C91594J5207d917k96454J48084m9461E1674K5880a98491
$$ 118048 -59563 -720573 391594 406801 -4917 -301371 -153287 -202748 51674 77554 -198491
15727a61561e1156p8267k49845P9546B60539d5905C12975b83977a06537k92372
$$ -161561 -51156 -129423 -379268 -299722 260539 -45905 312975 -283977 -106537 -398909
15717c98909J80120E83352K83933b00615p8575Q1717l5951C20650i3910K4846
$$ -398909 -218789 583352 867285 -200615 -279190 -197473 -233424 320650 -93910 -69064
15707f9064o3189l69909e7430B44758f37360b77150j11003H20593B73670J02033
$$ -69064 -132253 -502162 -57430 244758 -637360 -277150 -388153 820593 273670 375703
15697C75703M21955K52820a23447k4389o556f4958I8307O0106J3485L94931B3969
$$ 375703 797658 1050478 -123447 -147836 -154392 -64958 98307 158413 171898 566829 23969
15685C1519a94550B58246m9428a89817Q0476m0780C22683e46606A06382J49872
$$ 31519 -194550 258246 208818 -189817 -109341 -150121 322683 -546606 106382 256254
15675B56254a84715p4997A53270M49761g1866j91226n53102B35621h66197A06912
$$ 256254 -184715 -259712 153270 603031 -71866 -263092 -816194 235621 -866197 106912
15664D73781d77532A13497g1271E7133f490C55921J17623c30692I6341d58064
$$ 473781 -477532 113497 -71271 57133 -6490 355921 473544 -330692 96341 -458064
15653B29252D9037a83050k73162H61c31509A51425K91108a73584f8577k85476
$$ 229252 49037 -183050 -456212 861 -331509 151425 442533 -173584 -68577 -354053
15643c54053D13504B9202b05782C19068r8910J32546A01006p032L77503b66C77110
$$ -354053 413504 29202 -205782 319068 220158 352704 101006 93974 471477 -266 377110
15631f52677b95489E48413k20884H1941b30191E24148b48878n6868B61264D4207
$$ -652677 -295489 548413 327529 81941 -230191 524148 -248878 -305746 261264 44207
15620b47052n81298b8451H577P77a66303n8583E99462b08190B012J19428K83785
$$ -247052 -828350 -28451 8577 9354 -166303 -224886 599462 -208190 2012 121440 405225
15609D05225c93997J10230a08387R010G8567b2031A24820a50365k99512E57127
$$ 405225 -393997 -283767 -108387 -99377 78567 -22031 124820 -150365 -449877 557127
15598B69506o973J08672C6462c33344k75652b12481i3588o10103J44458B3422
$$ 269506 262533 371205 36462 -333344 -608996 -212481 -93588 -703691 -559233 23422
15587A36827b80476L0454k42684A85805a8568J875A62973J66296a0359A70356
$$ 136827 -280476 -250022 -492706 185805 -18568 -16693 162973 329269 -10359 170356
15576a13163k9884j64013N3787C01444a7533j80752n20357J31751C64695D8627
$$ -113163 -143047 -307060 -253273 301444 -17533 -198285 -718642 -586891 364695 48627
15565g0205j12185P4297k9067G2899K583b30601L4267B06482c06350O0448B57981
$$ -70205 -182390 -108093 -137160 72899 75482 -230601 -196334 206482 -306350 -245902 257981
15553b47130d8520E23143k61424H3396a94785D90042b20252E62938A78579J80113
$$ -247130 -48520 523143 261719 83396 -194785 490042 -220252 562938 178579 358692
15543C58692j10305b41979F47205B08140d46938B27060n1323L10733O5442b20069
$$ 358692 248387 -241979 647205 208140 -446938 227060 175737 486470 551912 -220069
15532C36149f10658A58055D7399O27478a90331H517i0845G19497k29092J20277
$$ 336149 -610658 158055 47399 674877 -190331 8517 -90845 719497 490405 610682
15522F10682K01828d30301k2959d7950j75288a3745C15182d16475g5268l5718
$$ 610682 812510 -430301 -453260 -47950 -223238 -13745 315182 -416475 -75268 -110986
15512a10986n11213C84678K11106g974q6218C49438a43529B59153j17383R0232
$$ -110986 -622199 384678 595784 -7974 -94192 349438 -143529 259153 141770 232002
15502B32002F5880L90228L70408A43294a91595D30712e55722A68898L38054p1020
$$ 232002 65880 456108 826516 143294 -191595 430712 -555722 168898 506952 435932
15492D35932j7404j87922p404d15598C06074J29741b29610A94025b64553R1099
$$ 435932 418528 230606 223202 -415598 306074 435815 -229610 194025 -264553 -173454
15482a73454D05358l935k6981o0136A12216J2229M96487b45931I5054M8560e63563
$$ -173454 405358 401423 374442 314306 112216 124445 620932 -245931 95054 143614 -563563
15470B78741F7431K91748M72526B48185A20558c80246C66426K57888A29881K6566
$$ 278741 67431 359179 831705 248185 120558 -380246 366426 624314 129881 156447
15460A56447O23520B70360J94923J2304b50780I4765J5485D07a041603e7055A34560
$$ 156447 779967 270360 465283 477587 -250780 94765 110250 407 -1041603 -57055 134560
15448B12580F4853J57575a2851j30095C55245l7677D2300L79575A84074L45114
$$ 212580 64853 222428 -12851 -142946 355245 317568 42300 421875 184074 529188
15438E29188d6320o95124E4865a77352B66232H4909d58256A11355C0678N05577
$$ 529188 -46320 -741444 54865 -177352 266232 84909 -458256 111355 30678 536255
15428E36255A07547a58629E67438l4450e19012d6142G3655J40457m5373a81367
$$ 536255 107547 -158629 567438 532988 -519012 -46142 73655 214112 168739 -181367
15417A1991M41604b29777g0312k55822A58978c19301J12985b2123B5429J62168
$$ 11991 453595 -229777 -70312 -326134 158978 -319301 -206316 -22123 25429 187597
15407A87597h8093m521k85919B05895c85316C99870c28174P8658M3573e1254F1405
$$ 187597 -88093 -92614 -378533 205895 -385316 399870 -328174 -249516 -205943 -51254 61405
15395e93271A76115n7033L56203j19877A26616J43447M40103a9908B88519F4948
$$ -593271 176115 119082 475285 355408 126616 270063 710166 -19908 288519 64948
15384c86598G62097i121d75A80851M15393j0952L04126B95672h7369j59551O5447
$$ -386598 762097 -9121 -475 180851 596244 585292 889418 295672 -87369 -246920 -181473
15373a81473h9757E31597n0171a72350B27756b07043B74091c0037A78022J38539
$$ -181473 -89757 531597 481426 -172350 227756 -207043 274091 -30037 178022 316561
15363C16561a82353j74606A81041J09207I8414Q28356A0649K35275a84975k58157
$$ 316561 -182353 -356959 181041 290248 98414 926770 10649 245924 -184975 -443132
15353d43132a26946D20733o4185C8612J18121N3329M38543m9224A94975q6224
$$ -443132 -126946 420733 356548 38612 156733 210062 648605 599381 194975 108751
15343A08751D3782b65911c0714C71363M7388a50426j85651E34194J6622M5301
$$ 108751 43782 -265911 -30714 371363 418751 -150426 -336077 534194 550816 596117
15333E96117j47800E0932J46888o4982d6237C87629N23112A40217L94837c73464
$$ 596117 448317 50932 197820 132838 -46237 387629 910741 140217 535054 -373464
15322E20491d14036d5141D8084P3275b39118R9952a5508L365l00902D88904b29359
$$ 520491 -414036 -45141 48084 121359 -239118 -139166 -15508 -12143 -313045 488904 -229359
15310a35481j66314a05847I1491f9363G460N92476b1823l75455C5754K50865a71538
$$ -135481 -301795 -105847 91491 -69363 7460 599936 -21823 -397278 35754 286619 -171538
15298D74061d7682F10928c4511G54852a26172A38695L8597Q4468c52346J28795
$$ 474061 -47682 610928 -34511 754852 -126172 138695 177292 261760 -352346 -223551
15288b23551A54068M76470B70036J99680B0605J56909Q0303A10517L99588L06933
$$ -223551 154068 630538 270036 469716 20605 177514 257817 110517 510105 817038
15278H17038E2941R71272B13987F2451K55150j8504N36477k94113L56943B47829
$$ 817038 52941 1024213 213987 62451 317601 299097 835574 541461 898404 247829
15267g8125A53795Q4290a26401k9250E7768a12451E26930A75135j0397K75173
$$ -78125 153795 238085 -126401 -155651 57768 -112451 526930 175135 164738 439911
15257D39911A99133Q15140C94698d47404B80546O70372D42270R521J18034E8961
$$ 439911 199133 1014273 394698 -447404 280546 950918 442270 451791 569825 58961
15246F64923B76474o6287a68985B5014Q67714C25258J04528j50768g6049C70771
$$ 664923 276474 210187 -168985 25014 892728 325258 429786 279018 -76049 370771
15235B62559j9340J94231L59040c39148D77018j53329b12209n6051B84782d38356
$$ 262559 243219 437450 796490 -339148 477018 323689 -212209 -268260 284782 -438356
15224B34962N35941C05861I8173L43375B16343J53833A53942c97189a41115B0298
$$ 234962 770903 305861 98173 441548 216343 370176 153942 -397189 -141115 20298
15213e31055J00683A7356c65393A47158o4086a47466H120e5228F83034B68410
$$ -531055 -430372 17356 -365393 147158 83072 -147466 8120 -55228 683034 268410
15202C1138R18a21204G6915a4137B42116p2154J10103k7589r152h9128o410q2654
$$ 31138 32056 -121204 76915 -14137 242116 169962 280065 252476 243324 -89128 -95538 -178192
15190a78192B92533q0701L38221a72802M4556E70908D3545J94139I6802L95407
$$ -178192 292533 211832 550053 -172802 -128246 570908 43545 237684 96802 492209
15180D92209L88565F8823b11952k0460C79222j19200F2931K38883j332G1073d8941
$$ 492209 880774 68823 -211952 -232412 379222 260022 62931 301814 300482 71073 -48941
15168B12360O28413a29757E39918q3194j09702j38097M54308c77858D6693n454
$$ 212360 840773 -129757 539918 456724 347022 208925 663233 -377858 46693 41239
15158D1239K88755A18367N8580a55672C03029I596h5307n53691B65830J7415e29820
$$ 41239 329994 118367 176947 -155672 303029 9596 -85307 -638998 265830 283245 -529820
15146d76994C96813O5829A72018N19850A67065K04023e4217C30885j57658K72922
$$ -476994 396813 462642 172018 691868 167065 371088 -54217 330885 173227 446149
15136D46149r1229j73485M01036M66194B34629N3604r9580n1498a8477G31867
$$ 446149 354920 181435 582471 1048665 234629 288233 188653 137155 -18477 731867
15125A98756J26421K75482j00273k44039K68290P0985J29721C50728k9679J18643
$$ 198756 325177 600659 500386 256347 524637 595622 725343 350728 321049 439692
15115D39692M7200e15610C73040c6027k15624D51175B8142K14476N92742j49361
$$ 439692 486892 -515610 373040 -36027 -251651 451175 28142 242618 835360 685999
15105F85999J24352E7203M82556A13146J11985d9307C86649a19923B90892q4464
$$ 685999 810351 57203 539759 113146 225131 -49307 386649 -119923 290892 206428
15095B06428N0604L05255a09633A165232f6057r8320F16176a9395F56948b42860
$$ 206428 257032 562287 -109633 1165232 -66057 -164377 616176 -19395 656948 -242860
15084D20285J7507O7201M21082B32732r5954L7825Q23864k21988P2679B34734
$$ 420285 437792 504993 926075 232732 136778 174603 998467 776479 849158 234734
15073E67177B05482M2086L69934j02120A5404O43491j23381k52070L50370J16159
$$ 567177 205482 247568 617502 515382 15404 658895 535514 283444 633814 749973
15063G49973l02359k18041K99220A50202O02733q608k26697i9296H20304o9746
$$ 749973 447614 229573 528793 150202 752935 744327 517630 -99296 820304 750558
15053G50558j84935O81499B28173J05596M21256C58340K13303l2039K97894b73018
$$ 750558 565623 1247122 228173 333769 755025 358340 571643 539604 837498 -273018
15042F72567l24083P08940C53782N60447L38283A86123J79414d538C02095J20447
$$ 672567 348484 1057424 353782 914229 1252512 186123 365537 -4538 302095 422542
15032D22542P69486C86706K61423j90856J37521r7453O61412k53187l66045K70184
$$ 422542 1192028 386706 648129 457273 594794 497341 1158753 905566 539521 809705
15022H09705k95191L29692K32005l17079L11030k64497j36277K10248q213J31843
$$ 809705 514514 844206 1076211 759132 1070162 805665 669388 879636 871423 1003266
15012A003266m26084J10705A98782P94790j21818q0266B10069J268135j44212
$$ 1003266 577182 687887 198782 993572 871754 791488 210069 1478204 1333992
15003A333992o34975L59079l35303q9263M925O3816k89871j78578J21968N28066
$$ 1333992 699017 1058096 722793 633530 638455 702271 412400 233822 355790 883856
14993H83856K36335k76663l30738Q8878k51776N10482K24280m44594L67699L12952
$$ 883856 1120191 843528 512790 601668 349892 860374 1084654 640060 1007759 1320711
14983A320711F43367K58014P5135J25797k38320M43390E32248N31962m26754J8645
$$ 1320711 643367 901381 976516 1102313 863993 1307383 532248 1064210 637456 656101
14973F56101L53416l20767k11240P06917l5575J95192N5525C12738J214763m06758
$$ 656101 1009517 688750 477510 1184427 1148852 1344044 1399569 312738 1527501 1120743
14963A120743M29493n02761K03434D68822M52575O06093n49252K75453n45980
$$ 1120743 1550236 1047475 1250909 468822 921397 1527490 978238 1253691 707711
14954G07711L91456L12229n61909R49110F42858M55778j69366M12045O737N1726
$$ 707711 1099167 1411396 849487 1798597 642858 1098636 929270 1341315 1348052 1399778
14944A399778J80584n03216M50461l76495M82086m88666l63407O75749K26095
$$ 1399778 1580362 1077146 1527607 1151112 1633198 1144532 781125 1456874 1682969
14935A682969q39810R67422j03858j83466K10101o4583m88046J077022l58503
$$ 1682969 843159 1810581 1706723 1523257 1733358 1668775 1180729 2257751 1899248
14926A899248n46490k1344l2792j24240L24344P95521q09285J59801j76160J93414
$$ 1899248 1352758 1331414 1298622 1174382 1498726 2294247 1484962 1644763 1468603 1662017
14916A662017o5073J329m48622O89034l85221K62254n7035j72359K32210j85447
$$ 1662017 1596944 1598273 1149651 1838685 1453464 1715718 1658683 1486324 1718534 1533087
14906A533087m79564l60676C12543P4734O66761j71674J32362D40117l0096N05399
$$ 1533087 1053523 692847 312543 387277 1054038 882364 1014726 440117 410021 915420
14896I15420M01567A26720J028901o0458j6811m60603j31102O19714j20394m19370
$$ 915420 1316987 126720 1155621 1095163 1078352 617749 486647 1106361 985967 566597
14886E66597J353472r00203p2989K09466l85668K73977Q63j53336O18085E56171
$$ 566597 1920069 1019866 946877 1156343 770675 1044652 1045515 892179 1510264 556171
14875A835245q06607P23962l08400L5482k70507j61211L71212q8656L68137o25700
$$ 1835245 1028638 1752600 1444200 1479682 1209175 1047964 1419176 1330520 1698657 1072957
14865A072957j71021M26400J7528K81387r2553j23385k77377l00173J06043N9262
$$ 1072957 901936 1328336 1345864 1627251 1534698 1411313 1133936 833763 939806 999068
14855I99068j84785K08085J93165K66490O84597o28303j27821n81146N69581k01785
$$ 999068 814283 1022368 1215533 1482023 2166620 1538317 1410496 829350 1398931 1197146
14845A197146K53510G21718J324254H77457O51904n39387J169210p21649L64419
$$ 1197146 1450656 721718 2045972 877457 1529361 989974 2159184 1437535 1801954
14836A801954l73392j54812L96820r5311l73822K15031l15615N58318l52192l76922
$$ 1801954 1428562 1273750 1670570 1575259 1201437 1416468 1100853 1659171 1306979 930057
14826I30057L65401r0402J36580k29915M64978k25928l356n7729K43558n38425
$$ 930057 1295458 1205056 1341636 1111721 1576699 1350771 1347415 1289686 1533244 994819
14816I94819P04949n59848k53963L89470J11855O17892n31696k7464p05219M64893
$$ 994819 1699768 1139920 885957 1275427 1387282 2005174 1473478 1446014 740795 1205688
14806A205688M25746J7937l34676M15968j89059K53941j781n67549M91530j31564
$$ 1205688 1631434 1649371 1314695 1730663 1541604 1795545 1793764 1226215 1717745 1586181
14796A586181q0593j49578J50476l31934P48726K89934A022161K27431j27130
$$ 1586181 1505588 1356010 1506486 1174552 1923278 2213212 1022161 1249592 1122462
14787A122462P48413m39033K55723o58591P66218J21783k07847m69557J31489
$$ 1122462 1870875 1431842 1687565 1028974 1795192 1916975 1709128 1239571 1371060
14778A371060j41492L67708K96820l01078N32523n49819l2086J70087o8312L47148
$$ 1371060 1229568 1597276 1894096 1593018 2125541 1575722 1543636 1713723 1645411 1992559
14768A992559k75743o95049N55838N93458n75475j0171J87525J12752j03648j18291
$$ 1992559 1716816 1021767 1577605 2171063 1595588 1585417 1772942 1885694 1782046 1663755
14758A663755J24042j05288K39061N88921q62461n57324J054018k35258j39934
$$ 1663755 1787797 1682509 1921570 2510491 1648030 1090706 2144724 1909466 1769532
14749A769532R7126J017587p01123j90436j1194J13661l61029L24129J99652j46528
$$ 1769532 1866658 2884245 2183122 1992686 1981492 2095153 1734124 2058253 2257905 2111377
14739B111377J0817k65635Q91848o34085o63950L03444O79452l38190Q4664K67131
$$ 2111377 2122194 1856559 2748407 2114322 1450372 1753816 2433268 2095078 2179742 2446873
14729B446873m22704O36018l81135L1328j28014L67329l42382K87489N3666J99757
$$ 2446873 2024169 2660187 2279052 2310380 2182366 2549695 2207313 2494802 2548468 2748225
14719B748225L1901j72597J70186q25352L44085J42551K59752l34880J99602m09666
$$ 2748225 2780126 2607529 2777715 1952363 2296448 2438999 2698751 2363871 2563473 2153807
14709B153807K83056K51776L6125j64492K53189j52769M359M44668o01438Q73218
$$ 2153807 2436863 2688639 2724764 2560272 2813461 2660692 2665051 3109719 2508281 3381499
14699C381499n32862k28994K05821k27436k0743Q9949O12250j22676j169990J347018
$$ 3381499 2848637 2619643 2825464 2598028 2577285 2667234 3279484 3156808 1986818 3333836
14689C333836p05719K08846L7653J99649l31246J93021L72673l40672l14339O71980
$$ 3333836 2628117 2836963 2874616 3074265 2743019 2936040 3308713 2968041 2653702 3325682
14679C325682k34437K87799j35084J25708l34801j79400K46751K30968P70650
$$ 3325682 3091245 3379044 3243960 3369668 3034867 2855467 3102218 3333186 4103836
14670D103836j761670J197034O00562j41249k78708K59415L57864r20829L26503
$$ 4103836 2342166 3539200 4139762 3998513 3719805 3979220 4337084 3416255 3742758
14661C742758l55898M87556l48414K94346K76208L2292J30148j52003k25705M56272
$$ 3742758 3386860 3874416 3526002 3820348 4096556 4128848 4258996 4106993 3881288 4337560
14651D337560o44775j98948M38650m11040M21884K45557j0899J10452N971r1676
$$ 4337560 3692785 3493837 3932487 3521447 3943331 4188888 4177989 4288441 4294412 4202736
14641D202736l80237R32297P4625m28412q1379M37321n1693J45354P6383l21882
$$ 4202736 3822499 4754796 4829421 4401009 4319630 4756951 4705258 4850612 4926995 4605113
14631D605113J77055O46842n7907j148642K07876N10219l76174J09566J161635
$$ 4605113 4782168 5429010 5371103 4222461 4430337 4940556 4564382 4673948 5835583
14622E835583p50336l38272N15317J05250L88181m83287K65311J30648L41856
$$ 5835583 5085247 4746975 5262292 5367542 5755723 5272436 5537747 5668395 6010251
14613F010251K22749j30829l62043R72140o65024P44111m96325M3409j14781L45259
$$ 6010251 6233000 6102171 5740128 6712268 6047244 6791355 6295030 6338439 6223658 6568917
14603F568917O37365j61802m48508R17362n11163j72969N17431j3336J23298O8689
$$ 6568917 7206282 7044480 6595972 7513334 7002171 6829202 7346633 7333297 7456595 7525284
14593G525284k35500J022244j187819m3411J039437m28074O80623l75940J0260
$$ 7525284 7289784 8312028 7124209 7080798 8120235 7692161 8372784 7996844 8007104
14584H007104M09127Q189J51874N19213j99494J72974r4018M02182m88281O17888
$$ 8007104 8416231 8424420 8576294 9095507 8896013 9068987 8974969 9377151 8888870 9506758
14574I506758J31034m42490Q22820k76141R4681O81683j19369O7358m8106K59857
$$ 9506758 9637792 9195302 10018122 9741981 9836662 10518345 10398976 10466334 10418228 10678085
14564A0678085M05867L12019M65723L30356k18701m55834O87252J18761M0763
$$ 10678085 11083952 11395971 11861694 12192050 11973349 11517515 12204767 12323528 12364291
14555A2364291M94650M29443k51763K82480J15505n1810J87888P36864J96637
$$ 12364291 12858941 13288384 13036621 13319101 13434606 13382796 13570684 14307548 14504185
14546A4504185L20523j83696k19319k96937j53696m73960k93546m79364k7754
$$ 14504185 14824708 14641012 14421693 14124756 13971060 13497100 13203554 12724190 12696436
14537A2696436k49769o354p71138l71133N0024m8682j49496n19872J43231M15291
$$ 12696436 12446667 12440313 11669175 11298042 11348066 11299384 11149888 10630016 10773247 11188538
14527A1188538q28259N55861L54377l68358J2060m71531Q01293N54418q02948
$$ 11188538 10360279 10916140 11270517 10902159 10914219 10442688 11243981 11798399 10995451
14518A0995451Q18506j51834l41644J49723J172725q39070L8900N57246O72653
$$ 10995451 11813957 11662123 11320479 11470202 12642927 11803857 11842757 12400003 13072656
14509A3072656M35641M58386l65425j09584O55769n77886M17130o2267P9339P19830
$$ 13072656 13508297 13966683 13601258 13491674 14147443 13569557 13986687 13924420 14003759 14723589
14499A4723589L78432K31805k51821Q36252L91196n17066J29378M87665J29602
$$ 14723589 15102021 15333826 15082005 15918257 16309453 15792387 15921765 16409430 16539032
14490A6539032M25566k40589L54119J455N90326Q30094k53938N09500k4511J99822
$$ 16539032 16964598 16724009 17078128 17079583 17669909 18500003 18246065 18755565 18731054 18930876
14480A8930876K33427J87382M53768m25301O30435N88324j37704p120J038425
$$ 18930876 19164303 19351685 19805453 19380152 20010587 20598911 20461207 20454087 21492512
14471B1492512O05345N82692j36353p1814M92341O53691j61548N78095k92574
$$ 21492512 22097857 22680549 22544196 22472382 22964723 23618414 23456866 24034961 23742387
14462B3742387n0334J559159m4909P66193K17565K73260L65099K8354O99817O96200
$$ 23742387 23692053 25251212 25206303 25972496 26190061 26463321 26828420 26856774 27556591 28252791
14452B8252791N83512N8685L99687Q15810Q7991O08277Q63714o0678j2229J113887
$$ 28252791 28836303 28894988 29294675 30110485 30198476 30806753 31670467 31609789 31597560 32711447
14442C2711447M44141O77075O23107j28843J382158O12226Q54664J32531R07677
$$ 32711447 33155588 33832663 34455770 34326927 35709085 36321311 37175975 37308506 38216183
14433C8216183M64594J036262N13169N46828P05491J033698K75636R74332K41949
$$ 38216183 38680777 39717039 40230208 40777036 41482527 42516225 42791861 43766193 44008142
14424D4008142O62641R98087O69166J115518N14786J418091K59390J367321Q0231
$$ 44008142 44670783 45668870 46338036 47453554 47968340 49386431 49645821 51013142 51093373
14415E1093373J295240J44288J762390J006704J222740N89448J026485R10521
$$ 51093373 52388613 52532901 54295291 55301995 56524735 57114183 58140668 59051189
14407E9051189J572849N10522J524061J851346Q12758J242247R16548J493732
$$ 59051189 60624038 61134560 62658621 64509967 65322725 66564972 67481520 68975252
14399F8975252R96143J785495J135669R39950J141970J298386K174968J002343
$$ 68975252 69971395 71756890 72892559 73832509 74974479 76272865 78447833 79450176
14391G9450176J248658K113054J055596J762412Q82807J887459J378196K378916
$$ 79450176 80698834 82811888 83867484 85629896 86512703 88400162 89778358 92157274
14383I2157274R01121J949924O71234K078801J877588K258842J674612K173890
$$ 92157274 93058395 95008319 95679553 97758354 99635942 101894784 103569396 105743286
14375A05743286J580010J191227K342505J686498K385529K260306J930906L284252
$$ 105743286 107323296 108514523 110857028 112543526 114929055 117189361 119120267 122404519
14367A22404519K111665K072416K756157J687379J983475K510664K402478K485981
$$ 122404519 124516184 126588600 129344757 131032136 133015611 135526275 137928753 140414734
14359A40414734J339497J666715K894451L361753L205931K258140J870722L476242
$$ 140414734 141754231 143420946 146315397 149677150 152883081 155141221 157011943 160488185
14351A60488185K612274M540442K538470L535970K379554L637005M402388M242601
$$ 160488185 163100459 167640901 170179371 173715341 176094895 179731900 184134288 188376889
14343A88376889L190074K641675L888991K715592M523919K962205M845199L792243
$$ 188376889 191566963 194208638 198097629 200813221 205337140 208299345 213144544 216936787
14335B16936787M787943N045723P163170M637526j58727n75184L426786M173579
$$ 216936787 221724730 226770453 233933623 238571149 238412422 237837238 241264024 245437603
14327B45437603K382248J985220K628397L321446L664979K971572M425845M930601
$$ 245437603 247819851 249805071 252433468 255754914 259419893 262391465 266817310 271747911
14319B71747911M756862M709828M445042L845493L215700N195381M760998L771171
$$ 271747911 276504773 281214601 285659643 289505136 292720836 297916217 302677215 306448386
14311C06448386M992514M313228L144015N073099N821750O243004N282899K289397
$$ 306448386 311440900 315754128 318898143 323971242 329792992 336035996 341318895 343608292
14303C43608292K608063R70338K57307L894691O219522P913966J217750K324610
$$ 343608292 346216355 347186693 347444000 351338691 357558213 365472179 366689929 369014539
14295C69014539L067835P663326Q748950Q780526P207432M007706P33364M267043
$$ 369014539 372082374 379745700 388494650 397275176 404482608 408490314 409223678 413490721
14287D13490721O905328O581136J078002L493869P249075L005439K832025J964819
$$ 413490721 420396049 426977185 428055187 431549056 438798131 441803570 444635595 446600414
14279D46600414M093347Q545203P056332Q138059M903612N018893N743318P547536
$$ 446600414 450693761 459238964 466295296 474433355 479336967 484355860 490099178 497646714
14271D97646714N398299O625715M539864J91159j535900k479583k769945j521261
$$ 497646714 503045013 509670728 514210592 514401751 512865851 510386268 507616323 506095062
14263E06095062p753870o200374m816144n532459j1937022j0775150j2664002
$$ 506095062 498341192 492140818 487324674 481792215 469855193 459080043 446416041
14256D46416041j6387129j5579495j7734714k0241797k0090484k1247023k1353786
$$ 446416041 430028912 414449417 396714703 376472906 356382422 335135399 313781613
14249C13781613k4589518k4947236k3763660j9919334j6605717j4105257j1941181
$$ 313781613 289192095 264244859 240481199 220561865 203956148 189850891 177909710
14242A77909710j0707323j0071495q199890q334009p097324p036959o166712n563262
$$ 177909710 167202387 157130892 148931002 140596993 133499669 126462710 120295998 114732736
14234A14732736n484966m485976m774419l867463m045877l896448k494211l781929
$$ 114732736 109247770 104761794 99987375 96119912 92074035 88177587 85683376 81901447
14226H1901447k786900k514227j998965k883715k089689j561257k273605k304149
$$ 81901447 79114547 76600320 74601355 71717640 69627951 68066694 65793089 63488940
14218F3488940j672230j960757j612099r04354k518009j442708l21133k307629
$$ 63488940 61816710 59855953 58243854 57339500 54821491 53378783 53057650 50750021
14210E0750021j036778j616079j414836j531771j123349j023995j625686k23637
$$ 50750021 49713243 48097164 46682328 45150557 44027208 43003213 41377527 41153890
14202D1153890j078415k11922r66544j710611q42444p52375p35504j121439j565246
$$ 41153890 40075475 39863553 38897009 37186398 36343954 35591579 34856075 33734636 32169390
14193C2169390L78968j79336k488363O38982j308168o5529q57505j425711N47264
$$ 32169390 32548358 32369022 29880659 30519641 29211473 29145944 28288439 26862728 27409992
14184B7409992o59523l60952q4028n97820j177336j52054q01208l43566n94416
$$ 27409992 26750469 26389517 26305489 25707669 24530333 24378279 23577071 23233505 22639089
14175B2639089J06031o94438m03966l38780j87583p04381k20504j33636l49382
$$ 22639089 22745120 22050682 21646716 21307936 21120353 20415972 20195468 20061832 19712450
14166A9712450o86386k31906p08471K13320l39407l05360M38996r37037j46185
$$ 19712450 19026064 18794158 18085687 18299007 17959600 17654240 18093236 17156199 17010014
14157A7010014J99478m39899j60176N43604j099707Q6169o49191Q44583j061072
$$ 17010014 17209492 16769593 16609417 17153021 16053314 16139483 15490292 16334875 15273803
14148A5273803P78609l97331j89241m45216k09847K59118p42834P52435q7513
$$ 15273803 16052412 15655081 15465840 15020624 14810777 15069895 14327061 15079496 14991983
14139A4991983j308257N5475L11960r96371P2691P09820K89122q80501r34629
$$ 14991983 13683726 13739201 14051161 13054790 13127481 13837301 14126423 13245922 12311293
14130A2311293j51504N70311k08503n87190J92291j68930n2734J09700l61455
$$ 12311293 12159789 12730100 12521597 11934407 12126698 11957768 11905034 12014734 11653279
14121A1653279j33682j52805k29250L82938p8418j57717j60095P75528j211687
$$ 11653279 11519597 11366792 11137542 11520480 11442062 11284345 11124250 11899778 10688091
14112A0688091l65984L34083P2480N5709n21063L12546o46804J23383j77195k37967
$$ 10688091 10322107 10656190 10728670 10784379 10263316 10575862 9929058 10052441 9875246 9637279
14102I637279R702n5233q8197k19453j49205O3582L27142l59501l52407m93293
$$ 9637279 9646981 9591748 9503551 9284098 9134893 9198475 9525617 9166116 8813709 8320416
14092H320416K27034k36252N03331n57667L01174m91496N15398n15823j73907
$$ 8320416 8547450 8311198 8814529 8256862 8558036 8066540 8581938 8066115 7892208
14083G892208p2127k39730Q42991m61112l08788N7054J09237l9461j70086m74912
$$ 7892208 7820081 7580351 8423342 7962230 7653442 7710496 7819733 7780272 7610186 7135274
14073G135274j72152l35722O95095k62752l17077M90361j77740M69973m83878
$$ 7135274 6963122 6627400 7322495 7059743 6742666 7233027 7055287 7525260 7041382
14064G041382N860L32997k07575n46733o6953N56748j70972L7547n83165M74259
$$ 7041382 7047242 7380239 7172664 6625931 6558978 7115726 6944754 6982301 6399136 6873395
14054F873395K74899j03791j22860m54316K22353L03133l43932o33049K12925
$$ 6873395 7148294 7044503 6921643 6467327 6689680 6992813 6648881 6015832 6228757
14045F228757L19381n92722L53020J95329J21013m96478K06537N97123q70443
$$ 6228757 6548138 5955416 6308436 6503765 6624778 6128300 6334837 6931960 6061517
14036F061517O31026J23282q28596N02780p46155K39946R19033o98873O37279
$$ 6061517 6692543 6815825 5987229 6490009 5743854 5983800 6902833 6203960 6841239
14027F841239o68429K28435K10572M4574m57185P72398o18035N763L93838j51537
$$ 6841239 6172810 6401245 6611817 6656391 6199206 6971604 6353569 6359332 6753170 6601633
14017F601633K06843j85133P78592Q9587p46011K12449k24202m12808L08666P22234
$$ 6601633 6808476 6623343 7401935 7491522 6745511 6957960 6733758 6320950 6629616 7351850
14007G351850j69231M63392l00405L83767k98262J35725p07704P32810M08775
$$ 7351850 7182619 7646011 7345606 7729373 7431111 7566836 6859132 7591942 8000717
13998H000717l91543L19247P0046j99683n26907P43200Q75305p42251R61593m35489
$$ 8000717 7609174 7928421 7998467 7798784 7271877 8015077 8890382 8148131 9109724 8674235
13988H674235O11681m35749K63090Q1655m4767n02301j4554l96618o62891K06641
$$ 8674235 9285916 8850167 9113257 9194912 9150145 8647844 8633290 8236672 7573781 7780422
13978G780422j05340o98672o76133m0104p67691K60183q19013K9062p43380L08435
$$ 7780422 7675082 6976410 6300277 6260173 5492482 5752665 4933652 4962714 4219334 4527769
13968D527769j18770o88394J0571o4815O9808l70404l00266k18300R24157r97012
$$ 4527769 4408999 3720605 3731176 3666361 3736169 3365765 3065499 2847199 3771356 2774344
13958B774344M42496n13787J7638J86452J41204J25317R0143m48432J53657k19260
$$ 2774344 3216840 2703053 2720691 2907143 3048347 3173664 3263807 2815375 2969032 2749772
13948B749772K35282q281j69631Q1855m31161J93244J47216m62793K15006P124
$$ 2749772 2985054 2976773 2807142 2888997 2457836 2651080 2798296 2335503 2550509 2557633
13938B557633l46889L12712k57221k2732J20526O8151N03655k51063o22918J70812
$$ 2557633 2210744 2523456 2266235 2243503 2364029 2432180 2935835 2684772 2061854 2232666
13928B232666O3329k68828L90470j91948N70213n68825k42674N71292M7550o09491
$$ 2232666 2295995 2027167 2417637 2225689 2795902 2227077 1984403 2555695 2603245 1993754
13918A993754k27465Q9990m6468K99994j21743L83328k65416M68131m45272q5453
$$ 1993754 1766289 1856279 1809811 2109805 1988062 2371390 2105974 2574105 2128833 2043380
13908B043380l79598P53404n38741M37909m58353N67535k8684m66006N95851j253754
$$ 2043380 1663782 2417186 1878445 2316354 1858001 2425536 2396852 1930846 2526697 1272943
13898A272943M87982n29065M61748R34407J56344j056406J751N85801N7245n73765
$$ 1272943 1760925 1231860 1693608 2628015 2784359 1727953 1729704 2315505 2372750 1798985
13888A798985k0717M15016o07827K19005P4060P867K57430n87776L89250J6150
$$ 1798985 1778268 2193284 1585457 1804462 1878522 1886389 2143819 1556043 1945293 1961443
13878A961443k47912Q830j09159J37423k40073K35061k94169Q33038m44657j784
$$ 1961443 1713531 1722361 1613202 1750625 1510552 1745613 1451444 2284482 1839825 1838041
13868A838041j83289N96148k72210l66998K65455n47956L58563l05629M33653
$$ 1838041 1654752 2250900 1978690 1611692 1877147 1329191 1687754 1382125 1815778
13859A815778R6240J93669m54681Q4314j46888J81831j59349K53582n85163P07557
$$ 1815778 1912018 2105687 1651006 1735320 1588432 1770263 1610914 1864496 1279333 1986890
13849A986890o86443O14706N18697A006176Q19437o98838L03687N3049L39282
$$ 1986890 1300447 1915153 2433850 1006176 1825613 1126775 1430462 1483511 1822793
13840A822793j45466J71563k66689N25538k25077I26753N02504j11021M47962
$$ 1822793 1677327 1848890 1582201 2107739 1882662 926753 1429257 1318236 1766198
13831A766198k71636M66032N8801l68804E31508Q44848J33767M57713n28487N60657
$$ 1766198 1494562 1960594 2019395 1650591 531508 1376356 1510123 1967836 1439349 2000006
13821B000006p79536J60974N57945F20696P61286K63180n02054J01471N06644
$$ 2000006 1220470 1381444 1939389 620696 1381982 1645162 1143108 1244579 1751223
13812A751223o68194N41515L25904n29712K72947E19745J064016k92979P15977
$$ 1751223 1083029 1624544 1950448 1420736 1693683 519745 1583761 1290782 2006759
13803B006759o01536Q787Q682j93889j46202P87207m34301D07401Q69368k27550
$$ 2006759 1405223 1414010 1422692 1228803 1082601 1869808 1435507 407401 1276769 1049219
13793A049219K64998M11075Q4026H19807K10427N2537J19342k65688K28917E06693
$$ 1049219 1314217 1725292 1809318 819807 1030234 1082771 1202113 936425 1165342 506693
13782A238576J79511K15952E26287M02063J15020k74084N94364k75478M86821
$$ 1238576 1418087 1634039 526287 928350 1043370 769286 1363650 1088172 1574993
13773A574993m64033O03651C38387J056660M3354j55628M0599m2358n9148K23625
$$ 1574993 1110960 1714611 338387 1395047 1438401 1282773 1323372 1281014 1221866 1445491
13763A445491M51937o41981D00275J724010o99692n24444o6305K95492L55821
$$ 1445491 1897428 1255447 400275 2124285 1424593 900149 833844 1129336 1485157
13754A485157j29038q4101P7014m38124l64800R41090l43544O05068E09157K22041
$$ 1485157 1356119 1272018 1349032 910908 546108 1487198 1143654 1748722 509157 731198
13744G31198n4151O14172k36845j54388L32193D53135M30566O86470C22815K25035
$$ 731198 677047 1291219 1054374 899986 1232179 453135 883701 1570171 322815 547850
13734E47850Q73912E59494J27211L20392m76822O81835j80944D50019Q32719j79195
$$ 547850 1421762 559494 686705 1007097 530275 1212110 1031166 450019 1282738 1103543
13724A103543m98483K64417l61230K90941j27419J80805C98085O5995M48064K95220
$$ 1103543 605060 869477 508247 799188 671769 852574 398085 464080 912144 1207364
13714A207364j05435L58290G12183R6866J42767P5692k28250K33780J98314B72321
$$ 1207364 1101929 1460219 712183 809049 951816 1027508 799258 1033038 1231352 272321
13703G72901O34541j67196j06565J63326k90233o8053l01959Q16072o26041m8852
$$ 772901 1407442 1240246 1133681 1297007 1006774 938721 636762 1452834 826793 777941
13693G77941N07843l06538B44249K31389J106899l52935E30742K45005C40171
$$ 777941 1285784 979246 244249 475638 1582537 1229602 530742 775747 340171
13683G39242A60625J191879B26328J135839o07836j48535l7786H1744P02593l0469
$$ 739242 160625 1352504 226328 1362167 754331 605796 568010 81744 784337 753868
13673G53868j65735j89178N68571n2427A98309J85659M11885k96856K93892J76016
$$ 753868 588133 398955 967526 915099 198309 383968 795853 498997 792889 968905
13663I68905B17160R98198p6733k73511C92566L7891J71915B80609M53703A3904
$$ 968905 217160 1215358 1138625 865114 392566 430457 602372 280609 734312 13904
13652A020471K15151C11849M79283J31246j08753j71526j2517N8333B49869N94749
$$ 1020471 1235622 311849 791132 922378 813625 642099 629582 687915 249869 844618
13642H44618k43345i6872G69377j9600k09125O6899Q4602C15518L04039F7500
$$ 844618 601273 -96872 769377 749777 540652 607551 692153 315518 619557 67500
13631E33327P7287n6720K65054r8869D0546N63305L01671p5158j11875K28217
$$ 533327 610614 553894 818948 720079 40546 603851 905522 830364 718489 946706
13621I46706B73697e12794A211863A86762J110617C81985F6780Q79366l25470
$$ 946706 273697 -512794 1211863 186762 1297379 381985 66780 946146 620676
13612F20676k14931L0792J56578K73032l31427j28355K37130C01528J05209o1526
$$ 620676 405745 436537 593115 866147 534720 406365 643495 301528 406737 345211
13602C45211j70771R09359l28228k08460k30835Q91792D19842J59572n6730r7054
$$ 345211 174440 1083799 755571 547111 316276 1208068 419842 579414 522684 425630
13592D25630j71403M41781M5356k15763A44504Q26274B37426M06567l06965L68998
$$ 425630 254227 696008 741364 525601 144504 970778 237426 643993 337028 706026
13582G06026l35287N56056B21422C1731N25228G4834K68243M65660B88492A20214
$$ 706026 370739 926795 221422 31731 556959 74834 343077 808737 288492 120214
13571E03248N27046B46524J20460J6408K95485l1440A24761O23258l45144L9631
$$ 503248 1030294 246524 366984 383392 678877 647437 124761 748019 402875 442506
13561D42506O6467k05081j9305a08058E04382A41266M39096k13061j60157L18149
$$ 442506 508973 303892 284587 -108058 504382 141266 580362 367301 207144 525293
13551E25293M8630j22089O2378Q2901n9361L1199B13737Q4514o613Q17487k69320
$$ 525293 573923 451834 514212 597113 537752 568951 213737 298251 291638 1109125 839805
13540H39805C43548c25200B27367M25875j81790B35125L26872J23510K16326C57197
$$ 839805 343548 -325200 227367 653242 471452 235125 561997 685507 901833 357197
13529F28638K27895Q7818q6656C01988O15449l79359k3059K5589J79429l18986
$$ 628638 856533 944351 857695 301988 917437 538078 515019 540608 720037 401051
13519D01051J15032K97340j40555L28757B78085j19719R28082m05741C5345K08343
$$ 401051 516083 813423 672868 1001625 278085 158366 1086448 680707 35345 243688
13509B43688j1761K28618L24173L840a73754F51662k42254k04479J2950J192322
$$ 243688 231927 460545 784718 788558 -173754 651662 409408 204929 217879 1410201
13499A410201a54801k4301E47726A25226L70767B09196O47282C6319K17845O30211
$$ 1410201 -154801 -179102 547726 125226 495993 209196 856478 36319 254164 884375
13489H84375j67283C46234R5987h7340k33809N2208D60795M4900N4665J56160
$$ 884375 717092 346234 442221 -87340 -321149 -268941 460795 505695 560360 716520
13479G16520A92087J02907j3284j02779M53666c5789B71984K88536B70260J77509
$$ 716520 192087 294994 281710 178931 632597 -35789 271984 560520 270260 447769
13469D47769N04039m42715j04945J83008k65969m9992L41991d08007E19080P4879
$$ 447769 951808 509093 404148 587156 321187 271195 613186 -408007 519080 593959
13459E93959L51410k54784a67287D26513A96638H6971N6458R50895C55854J52203
$$ 593959 945369 690585 -167287 426513 196638 86971 143429 1094324 355854 508057
13449E08057L8756E6669J07970M27153m5762G7690M78507n6519a94441A71066
$$ 508057 546813 56669 164639 591792 546030 77690 556197 499678 -194441 171066
13438B63368E2091a2072C60720J1858b60594A82371N3067L8510J15136c42830
$$ 263368 52091 -12072 360720 372578 -260594 182371 235438 273948 389084 -342830
13427F2309k5598R1816R72965C35286J31547D8047J29886K9164p1748K81304A73575
$$ 62309 36711 128527 1101492 335286 466833 48047 177933 207097 135349 416653 173575
13415C42444K85221l9282K2682q8596J58339r4155j93029J14205J63292b67649
$$ 342444 627665 588383 611065 522469 680808 586653 393624 507829 671121 -267649
13404e4207A66467K27491N84311B31742b41835B90059M57829B15369J48980K66745
$$ -54207 166467 393958 978269 231742 -241835 290059 747888 215369 364349 631094
13394F31094A58632n3382J95308J50083F7372g6600p1093B34548a5445A244486
$$ 631094 158632 105250 300558 450641 67372 -76600 -147693 234548 -15445 1244486
13383B28329j12707a24745G0838N02801r3135J51862k33359j33210a5074B64810
$$ 228329 115622 -124745 70838 573639 480504 632366 399007 265797 -15074 264810
13372A211002D96702b39817a15010A204827A68906K44603L4541A31032J16719
$$ 1211002 496702 -239817 -115010 1204827 168906 413509 448050 131032 247751
13363B47751L92333C05093O62362C12967K3909K42119A71037O04636B15241b2496
$$ 247751 640084 305093 967455 312967 336876 578995 171037 775673 215241 -22496
13352F22583k90826j62119b61109B42347m293a52378E23370J37795k23189A00286
$$ 622583 331757 169638 -261109 242347 238054 -152378 523370 661165 437976 100286
13341B29802N148L14011e02492B01480h2118a2217H7722P935L10817c31534F36803
$$ 229802 234950 548961 -502492 201480 -82118 -12217 87722 95657 406474 -331534 636803
13329B47338P3266K87678N34386a36911A48354a37980B00468N9138L05968A97770
$$ 247338 320604 608282 1142668 -136911 148354 -137980 200468 259606 565574 197770
13318D55233j90528q742D7598g9557C69640K35080B85230K73279G5104N57290
$$ 455233 264705 255963 47598 -79557 369640 604720 285230 558509 75104 632394
13308F32394a95113F68696b61858B85092l480N67259l71707j51308M98407I0490
$$ 632394 -195113 668696 -261858 285092 281612 848871 477164 325856 824263 90490
13297H24835A86024c36263B81991M6040C9188M35870B28020j06969M90782a58623
$$ 824835 186024 -336263 281991 328031 39188 475058 228020 121051 611833 -158623
13286E8900K76566B6790N05755A69117J07728N59263c69833j44832H5071K58031
$$ 58900 335466 26790 532545 169117 276845 836108 -369833 -514665 85071 343102
13276C43102i531I816L7773N46112A94172G4584C634R2710J92357K32302F9710
$$ 343102 -9531 9816 47589 593701 194172 74584 3634 96344 288701 521003 69710
13264h8301j69864q30959B39985K69797j37119M8435i5445D85454H9248d15627
$$ -88301 -258165 -1089124 239985 509782 372663 421098 -95445 485454 89248 -415627
13253c15552G52428C22344J38248A59989K75952h1381A23901K52266j11445C6422
$$ -315552 752428 322344 460592 159989 435941 -81381 123901 376167 264722 36422
13242D49474K59045k91672K8084j91970g9563D08656K3396i5369A09544i1541
$$ 449474 708519 416847 444931 252961 -79563 408656 432052 -95369 109544 -91541
13231f87989h8458C72963j37383f8749a3672E5142N74600H0797J13114L17117
$$ -687989 -88458 372963 235580 -68749 -13672 55142 629742 80797 193911 511028
13221E11028D9577k2244L48680j47880J56720J51596c09235E3100j5392c8987
$$ 511028 49577 27333 376013 228133 384853 536449 -309235 53100 37708 -38987
13210d85028L2910B88593a3121E83404c1560l54188D12640a36737L0153l61212
$$ -485028 -452118 288593 -13121 583404 -31560 -385748 412640 -136737 -106584 -467796
13200d67796B19726J00365L34560L02069c01684D65054A17258K58748M42735d07611
$$ -467796 219726 320091 654651 956720 -301684 465054 117258 376006 818741 -407611
13189g95936b21602E7020P93754k09727A18414a87160a3880A31114a29923C22078
$$ -795936 -221602 57020 850774 641047 118414 -187160 -13880 131114 -129923 322078
13178E68446A36041K45707A21213K06643A49664a62830D50801I8901e58623F99357
$$ 568446 136041 381748 121213 327856 149664 -162830 450801 98901 -558623 699357
13167b53372Q3046B12620a01405l3621l99785B33847I8980K96815b59192i5689
$$ -253372 -170326 212620 -101405 -135026 -534811 233847 98980 395795 -259192 -95689
13156E01645m3220N9669a29489E1619a28523D321a56971Q853c0423A5337L48881
$$ 501645 458425 518094 -129489 51619 -128523 4321 -156971 -148118 -30423 15337 364218
13145C64218J57148H3608L44193L02045G9232a56333E77132d72664f6289C10843
$$ 364218 521366 83608 427801 729846 79232 -156333 577132 -472664 -66289 310843
13134e7049B42730B7833a6709E94861B73729b99836N736D78932L12511J04281
$$ -57049 242730 27833 -16709 594861 273729 -299836 -294100 478932 791443 895724
13124H95724C37641J40419O8934a91222C90762a43828J1475j05615j35416C46356
$$ 895724 337641 478060 546994 -191222 390762 -143828 -132353 -237968 -373384 346356
13113C43552j66684J01712f3137A8202b6031C95360F9932L68910K17300a63852
$$ 343552 176868 278580 -63137 18202 -26031 395360 69932 438842 656142 -163852
13102a17487j4469f5439D56039F7909M18189j48403g78641a44820j5956j44900
$$ -117487 -131956 -65439 456039 67909 486098 337695 -778641 -144820 -160776 -305676
13092c05676A72382m3534n4394K50990a07721A42697R7202a01931B23100c56272
$$ -305676 172382 128848 74454 325444 -107721 142697 239899 -101931 223100 -356272
13081b83281I35220A4783N93976b02856H0601J48440f4372k39503D68408J03943
$$ -283281 935220 14783 608759 -202856 80601 229041 -64372 -303875 468408 572351
13071E72351c75420J09096D43473B13219f2836E80266a06565C60189M36798e2700
$$ 572351 -375420 -266324 443473 213219 -62836 580266 -106565 360189 796987 -52700
13060D28730e7119j01943D16996R4798b89236A98335K63139D9361J00566O2159
$$ 428730 -57119 -159062 416996 511794 -289236 198335 461474 49361 149927 212086
13050B12086a92344d8635H56447H3636a50278k124B83623C0474c91697D10016
$$ 212086 -192344 -48635 856447 83636 -150278 -152402 283623 30474 -391697 410016
13039b55322m26399B65265K95848D5044J09208C63J94320M02127j1359k84951
$$ -255322 -681721 265265 561113 45044 154252 363 194683 596810 585451 300500
13029C00500A16479M53483c11831L8930B47962a96881H1731c66856m27229D05223
$$ 300500 116479 569962 -311831 -272901 247962 -196881 81731 -366856 -794085 405223
13018C78084A50633b06556o7905I3448d55734H0119L25484a44832q42262D98576
$$ 378084 150633 -206556 -274461 93448 -455734 80119 405603 -144832 -987094 498576
13007A18024A9799f91253a62542A20241b34590I25718l97712j44568G1073h2862
$$ 118024 19799 -691253 -162542 120241 -234590 925718 528006 383438 71073 -82862
12996B77388a4872q11224A42767K00326f6329J004D48486j4386r5602D5665J76772
$$ 277388 -14872 -826096 142767 343093 -66329 -65325 448486 434100 338498 45665 222437
12985B22437K50691b65026F77220h102C90731j78336b8341A20067K34685m0367
$$ 222437 473128 -265026 677220 -8102 390731 212395 -28341 120067 354752 314385
12975C14385b0090I3873c00604r0383E90510b27713C94890A47683a44943B31817
$$ 314385 -20090 93873 -300604 -390987 590510 -227713 394890 147683 -144943 231817
12964i7430k81739C0679j2945M41117N7646A87937d76139C9722L56404a73206
$$ -97430 -379169 30679 17734 458851 516497 187937 -476139 39722 396126 -173206
12953B0849J61457b15846L0472k42419f3344D47349b31249e727A45035C8274K09221
$$ 20849 182306 -215846 -185374 -427793 -63344 447349 -231249 -5727 145035 38274 247495
12942B47495a49748H0285J24846K1355F0520k2968h6240p0318j71620a03581F90965
$$ 247495 -149748 80285 205131 226486 60520 37552 -86240 -156558 -328178 -103581 690965
12930b7487A07036J32755K2216i2271j2689c4992r1162D03393d0344C8733b50387
$$ -27487 107036 239791 262007 -92271 -104960 -34992 -126154 403393 -40344 38733 -250387
12918c67353D24172F5229g788j9758M534A63664f7455E29975g5233G9132c48751
$$ -367353 424172 65229 -7788 -27546 -23012 163664 -67455 529975 -75233 79132 -348751
12906G2605e52328J2545A89636K33619d35221H7975J16149e28487C80430A89016
$$ 72605 -552328 -539783 189636 423255 -435221 87975 204124 -528487 380430 189016
12895b39562A90424e30545b16803l16393D94836A46348b44669A84635a41737H384
$$ -239562 190424 -530545 -216803 -533196 494836 146348 -244669 184635 -141737 8384
12884D0715M64248Q4715b51454c4969E53516k70250r3638D1619f31752C23353
$$ 40715 504963 589678 -251454 -34969 553516 283266 189628 41619 -631752 323353
12873b10860H4988M1510B6321f6710j30941l93535D22349c01047j49947D4405
$$ -210860 84988 126498 26321 -66710 -197651 -591186 422349 -301047 -450994 44405
12862A49189c95189J16127k72746b06168a4845j87257G7397b32661h7826n58202
$$ 149189 -395189 -279062 -551808 -206168 -14845 -202102 77397 -232661 -87826 -646028
12852f46028C12512N6327B5703Q7167J28614b97258C48019d98886j0360I8141
$$ -646028 312512 368839 25703 112870 241484 -297258 348019 -498886 -509246 98141
12841C35437D7518e00202G30916B11991J2868b13547R6532B59928I967b09621
$$ 335437 47518 -500202 730916 211991 224859 -213547 -117015 259928 9967 -209621
12830b79064d6886j34806A92359f41393A24625O1292a44898m96463A77853G430
$$ -279064 -46886 -181692 192359 -641393 124625 185917 -144898 -641361 177853 7430
12819d0776D20386b6843j0716k11750n88463a78135Q8280l45590l94749b96512
$$ -40776 420386 -26843 -37559 -249309 -837772 -178135 -89855 -435445 -830194 -296512
12808F28686B18360J37526b89204c7535n25768A12969f49881a43244j232l9252
$$ 628686 218360 355886 -289204 -37535 -563303 112969 -649881 -143244 -144476 -183728
12798a83728B12213d49083E12469h9454l55305f3202C39108A9849h0914I6971
$$ -183728 212213 -449083 512469 -89454 -444759 -63202 339108 19849 -80914 96971
12787A95355I3870c08940F29492l05709C7826L46301a6857C58210j13629C2057
$$ 195355 93870 -308940 629492 323783 37826 384127 -16857 358210 244581 32057
12776c03559l44015K97077H9294N05691c61122C50205c8024k1204D27975c06615
$$ -303559 -647574 -350497 89294 594985 -361122 350205 -38024 -59228 427975 -306615
12765i2230n0660j89610a54614l64449b16829A60841J12308P91382A76718a7125
$$ -92230 -142890 -332500 -154614 -519063 -216829 160841 273149 1064531 176718 -17125
12754A06829K99864c94249A29426d502o7166j05858p6961D48353f5734H44336
$$ 106829 406693 -394249 129426 -4502 -71668 -177526 -254487 448353 -65734 844336
12743e1344J0923A44523k1958d77208B16625I3041C5713L29080L37669d62078
$$ -51344 -40421 144523 122565 -477208 216625 93041 35713 364793 702462 -462078
12732I3635J17889j4129d1419J7848C13900N2460j13996b22045j96861k5367J57509
$$ 93635 211524 197395 -41419 -23571 313900 366360 252364 -222045 -418906 -444273 -286764
12721b86764N7308B12089A03354L72421M5992A9487a0584l1379B65412p1950L74740
$$ -286764 -229456 212089 103354 475775 521767 19487 -10584 -41963 265412 193462 568202
12710E68202A82199b8402o9310j23531G835g28606C03799L16109b72134C50074
$$ 568202 182199 -28402 -97712 -221243 7835 -728606 303799 619908 -272134 350074
12699a53427G3174c11282l39887F58156a15232H6717L03186b48549a8039A63947
$$ -153427 73174 -311282 -651169 658156 -115232 86717 389903 -248549 -18039 163947
12688a28947d2213l41915O5083f2687m40195B09140a69501H8960d14655F74447
$$ -128947 -42213 -384128 -319045 -62687 -502882 209140 -169501 88960 -414655 674447
12677b94346B17828E3595J00426i878m86558b20371D04381e53167a73899D45947
$$ -294346 217828 53595 154021 -9878 -496436 -220371 404381 -553167 -173899 445947
12666e5344j65597E11563a38248j20739d4832F36584d28242E18878A24390J12064
$$ -55344 -220941 511563 -138248 -258987 -44832 636584 -428242 518878 124390 236454
12656B36454J11493e9554G93214A39643m1697J61393L31926j76864b40441A55447
$$ 236454 347947 -59554 793214 139643 97946 259339 591265 414401 -240441 155447
12645E3677K1746b10714q0274j8364I9165B5865K43062R3901b91734q8250D0186
$$ 53677 75423 -210714 -290988 -309352 99165 25865 268927 362828 -291734 -379984 40186
12633a08401l53187B40729b4898A49241a70176r217D248J78590b43098N3021F7677
$$ -108401 -461588 240729 -24898 149241 -170176 -179393 4248 182838 -243098 -190077 67677
12621b40826M9497A69438p4840b34858R6987H725g51071A88069M89950A74252
$$ -240826 -191329 169438 94598 -234858 -137871 8725 -751071 188069 678019 174252
12610F23302c65179E49933b76946O7168D84542j2528C4942c29915C21575p3267
$$ 623302 -365179 549933 -276946 -209778 484542 472014 34942 -329915 321575 248308
12600B48308h30081c6137p34440A3237J95859b01727F0407c32207a30047E6698
$$ 248308 -830081 -36137 -770577 13237 209096 -201727 60407 -332207 -130047 56698
12589g13344c28092C61629d64909K20107B17956p4034J0722M09340l4539A60715
$$ -713344 -328092 361629 -464909 -244802 217956 143922 154644 563984 529445 160715
12578c391A74096J59114a06475m7424C059L6390P52464C08291H8919c72580J26850
$$ -3391 174096 333210 -106475 -153899 3059 39449 791913 308291 88919 -372580 -245730
12567b45730R4339A41333R3632h71559A12609f2476l731n5943D5523a14195B00437
$$ -245730 -151391 141333 234965 -871559 112609 -62476 -66207 -122150 45523 -114195 200437
12555a106537a9744A38165d10185L2914C49051b49588J06789B13900j6807i8208
$$ -1106537 -19744 138165 -410185 -377271 349051 -249588 -142799 213900 197093 -98208
12544D59948c34755a41694B13522m5749a72615l8771E61656J71292C57762J17697
$$ 459948 -334755 -141694 213522 167773 -172615 -211386 561656 732948 357762 475459
12534D75459n4119a05038o23418A57486O1825H5063R7451i2043k773L0766K0134
$$ 475459 421340 -105038 -728456 157486 219311 85063 182514 -92043 -94816 -64050 -43916
12523d3916A77814h6467B51156c87867F76694A46803m3054b78085b0507k26322
$$ -43916 177814 -86467 251156 -387867 676694 146803 103749 -278085 -20507 -246829
12513b46829A20603f8559o60971a38835D08094L3808j33789e8880A01116K01924
$$ -246829 120603 -68559 -729530 -138835 408094 441902 308113 -58880 101116 303040
12503C03040a50828l57586B59127K80518A05697K97317I7139g96342B87085G9345
$$ 303040 -150828 -508414 259127 539645 105697 403014 97139 -796342 287085 79345
12492B71596i82830A11063b35842C1532K36946g23877b0976j11209j0369C17616
$$ 271596 -982830 111063 -235842 31532 268478 -723877 -20976 -132185 -142554 317616
12481h44505c977j60357N8748C63912R8A59643G0521g1907l1388b4116m10636
$$ -844505 -3977 -164334 -105586 363912 364010 159643 70521 -71907 -103295 -24116 -434752
12470d34752I3912a68237N355C92805b73991H6604d74750E86395f74415A54384
$$ -434752 93912 -168237 -162882 392805 -273991 86604 -474750 586395 -674415 154384
12459B9832J99220b84007E45479b22302C8264a3263k00381P1648A56710e31116
$$ 29832 229052 -284007 545479 -222302 38264 -13263 -213644 -141996 156710 -531116
12448A30062J2220J22859E7094K38298c39639R9579j15176C36998G1174d04612
$$ 130062 142282 265141 57094 295392 -339639 -240060 -355236 336998 71174 -404612
12437D60182b81163a32589B55619L84284F7423C0755d98881a88312j00819c4653
$$ 460182 -281163 -132589 255619 639903 67423 30755 -498881 -188312 -289131 -34653
12426A51984K2801g67698D39892A82181E9764j2683d89564B53726k2465E4475
$$ 151984 174785 -767698 439892 182181 59764 47081 -489564 253726 231261 54475
12415B02122d23860a74755j76009j9585B1082L7478M5223J64889c41917h4126
$$ 202122 -423860 -174755 -350764 -370349 21082 58560 103783 268672 -341917 -84126
12404b83148d9542A06193D8931f4219J8718D07337d83045A97655b49232D40454
$$ -283148 -49542 106193 48931 -64219 -45501 407337 -483045 197655 -249232 440454
12393a90964Q8153j08978H2277M05463d6579E9225L88713h9407C64791d42856
$$ -190964 -102811 -211789 82277 487740 -46579 59225 447938 -89407 364791 -442856
12382B38425a6116M045A34440K82550d9883k30620o2251A68520b61041P5716A76963
$$ 238425 -16116 -12071 134440 416990 -49883 -280503 -342754 168520 -261041 -185325 176963
12370b67576I3559A5231e0109j02032C29070J87135b77088o48323B95427a31547
$$ -267576 93559 15231 -50109 -152141 329070 516205 -277088 -925411 295427 -131547
12359A60314d07412b5111C49047m1347h5301D31446i5447B51025a37793A69590
$$ 160314 -407412 -25111 349047 307700 -85301 431446 -95447 251025 -137793 169590
12348e2317D37390g3607m0287n556E04777b58405a9204C59615f32k84281a35626
$$ -52317 437390 -73607 -113894 -119450 504777 -258405 -19204 359615 -632 -284913 -135626
12336F21198B11614K11311p1206A70545K52460A24934O93545l11013m6198f2786
$$ 621198 211614 422925 351719 170545 423005 124934 818479 507466 461268 -62786
12325G22179j35904d4562B62564J88608d31532a06671j07051k5401B81281H987
$$ 722179 586275 -44562 262564 451172 -431532 -106671 -213722 -239123 281281 8987
12314f6881j11560B5266M36641n601A635b11543C79197j37875a78081H21791a75336
$$ -66881 -178441 25266 461907 456306 1635 -211543 379197 241322 -178081 821791 -175336
12302b22176a04372j68019E43742K30755I7150J30990K13858e96777I2644o894
$$ -222176 -104372 -272391 543742 774497 97150 228140 441998 -596777 92644 85750
12292H5750c19039D7075R2132b9410D73139J57701G7960N04804a30411I02311
$$ 85750 -319039 47075 139207 -29410 473139 630840 77960 582764 -130411 902311
12281E92634N23997g5004a7565m20712D02371j24453J66998P5231k14839b87203
$$ 592634 1116631 -75004 -17565 -438277 402371 277918 444916 520147 305308 -287203
12270B04049D0409L92569K82950C40351j39843h4767l83170G0319J08193K99217
$$ 204049 40409 432978 715928 340351 200508 -84767 -467937 70319 178512 477729
12260D77729j87000O80645B68111A32311J37724e64572E11544h6427F48365d70411
$$ 477729 290729 971374 268111 132311 270035 -564572 511544 -86427 648365 -470411
12249C84538e9585I4934D4099P85700N0928f7784k68790g0074A6589b79119D09787
$$ 384538 -59585 94934 44099 829799 880727 -67784 -336574 -70074 16589 -279119 409787
12237e37286E50538A21129J30667M76051K96771c84128R5991G31629q8343L04003
$$ -537286 550538 121129 251796 727847 1024618 -384128 -288137 731629 643286 947289
12227I47289l16136p2477f60301a34124k0278I4315K77763A28674N46028H6667
$$ 947289 631153 558676 -660301 -134124 -154402 94315 372078 128674 674702 86667
12216B12709K63873a00410A003377h5915G23883a75277J808j663B81639N53210
$$ 212709 476582 -100410 1003377 -85915 723883 -175277 -173469 -175132 281639 834849
12206H34849a407k9034A20140K40232F1215b37743F96449B7949f4816B92343K80778
$$ 834849 -1407 -30441 120140 360372 61215 -237743 696449 27949 -64816 292343 573121
12195E73121j85710J96588j47623n4258K45565o0435A3517O2285b81959h7021
$$ 573121 387411 583999 436376 382118 627683 567248 13517 75802 -281959 -87021
12184G1573J81643b08801j12123J43020F48301A63147J3340J34750b9164B02936
$$ 71573 253216 -208801 -320924 -177904 648301 163147 176487 311237 -29164 202936
12173b51218A98734P43077a3725C95977B3486c66911I69743b56289D34342e9013
$$ -251218 198734 941811 -13725 395977 23486 -366911 969743 -256289 434342 -59013
12162G49137b16769K9376C21889b97223A69079O08489a044105C39019d5455E4513
$$ 749137 -216769 -187393 321889 -297223 169079 777568 -1044105 339019 -45455 54513
12151f0334k54254D61809d1448m48891E05776A11039M39442a45490o7295d1410
$$ -60334 -314588 461809 -41448 -490339 505776 111039 550481 -145490 -212785 -41410
12140A201K05089k2034k3034J12084c6140D63248k14259k6635J72153R078A80520
$$ 1201 206290 184256 161222 273306 -36140 463248 248989 222354 394507 403585 180520
12128G2474e84849E06397d93497A27319K32485a73006B76915Q3897D7143a62003
$$ 72474 -584849 506397 -493497 127319 359804 -173006 276915 360812 47143 -162003
12117D1681O3373j0815a01824C62294J18136m8420q0636b27726F6801J55485O17208
$$ 41681 105054 94239 -101824 362294 480430 432010 351374 -227726 66801 222286 839494
12106H39494a38542L7248j17852i9174k73750H7172c63807B21326J9849a22270
$$ 839494 -138542 -101294 -219146 -99174 -372924 87172 -363807 221326 241175 -122270
12095d8147G04913c59583H355b06872B60913h87222C59690g0922E9997l248M97321
$$ -48147 704913 -359583 8355 -206872 260913 -887222 359690 -70922 59997 56749 554070
12084E54070K40977D9988J26876J67785g7269D2940A5531O1668K03498c31984
$$ 554070 795047 49988 176864 344649 -77269 42940 15531 77199 280697 -331984
12073C80419j47756K85451L08582l61207n1640a19348B94957c6492B21977b47421
$$ 380419 232663 518114 826696 465489 413849 -119348 294957 -36492 221977 -247421
12062B70074N0871a75108B46598a65661G8400d97108J7238a58467F731M25372
$$ 270074 320945 -175108 246598 -165661 78400 -497108 -479870 -158467 6731 432103
12052D32103D3156d75818a01801m92464C89360d29487E6132d74168b04053k38825
$$ 432103 43156 -475818 -101801 -594265 389360 -429487 56132 -474168 -204053 -442878
12042d42878C01559E7787d7413k24187k94331g3687F0381N84983c03516k53135
$$ -442878 301559 57787 -47413 -271600 -565931 -73687 60381 645364 -303516 -556651
12032e56651B07315f6087j91516A55024e07631F66131e4256A9141a86262m14654
$$ -556651 207315 -66087 -257603 155024 -507631 666131 -54256 19141 -186262 -600916
12022f00916C42417d39670A50571E2630N50551j40845j04887j37023l9563b08697
$$ -600916 342417 -439670 150571 52630 603181 462336 357449 220426 180863 -208697
12011A87717b32809l25586F34589A81834K31630k06198f95132C853N66938f30047
$$ 187717 -232809 -558395 634589 181834 413464 207266 -695132 3853 570791 -630047
12000a47456B08063e18489a45717j3272H5023b06468A57092d36374B8189c25260
$$ -147456 208063 -518489 -145717 -158989 85023 -206468 157092 -436374 28189 -325260
11989a7300K902k555A29797K23054b37319j95518J19942G0234O5614f4790l41461
$$ -17300 -14398 -16953 129797 352851 -237319 -432837 -312895 70234 135848 -64790 -406251
11978d06251a2437H6268k7186a35046B27763a30282j71802l9154G74674d43038
$$ -406251 -12437 86268 59082 -135046 227763 -130282 -302084 -341238 774674 -443038
11967D28172G4111c23611B24511L6959c75418E29718a82369l40454b27112g2935
$$ 428172 74111 -323611 224511 261470 -375418 529718 -182369 -522823 -227112 -72935
11956b24834F0783f7970k22103E84223j42945e17208a87504m3311l4959P8610
$$ -224834 60783 -67970 -290073 584223 441278 -517208 -187504 -230815 -265774 -187164
11946a87164k37035B10667b27483l38337K31650J56691P8843m70842K3891D07124
$$ -187164 -424199 210667 -227483 -565820 -334170 -177479 -98636 -569478 -545587 407124
11935d19447B25435c18812A06629a91161l60286i1710A30893d35404A55207c21984
$$ -419447 225435 -318812 106629 -191161 -551447 -91710 130893 -435404 155207 -321984
11924A06414d44212E94245j65876d89690B53063h988j14283A27623K37898I5024
$$ 106414 -444212 594245 428369 -489690 253063 -8988 -123271 127623 365521 95024
11913b17612A23575I867J55634b66922A97747e6884C80347f2047k84022l8597
$$ -217612 123575 9867 165501 -266922 197747 -56884 380347 -62047 -346069 -384666
11903c84666I1321g10475A08771f96428D50195k23074P1813a01032C45081d50725
$$ -384666 91321 -710475 108771 -696428 450195 227121 298934 -101032 345081 -450725
11892D43090A32355L77210j86584c08315B81626a34209l25601a88771E923d4890
$$ 443090 132355 509565 322981 -308315 281626 -134209 -459810 -188771 5923 -44890
11881B83734O3906f85038J89088Q7242h8664H1182a90657l0364m18418I8929e97644
$$ 283734 347640 -685038 -495950 -408708 -88664 81182 -190657 -221021 -639439 98929 -597644
11869a26793a2282l44968a49626m97872B90204r2288d05447I3349L3483c50290
$$ -126793 -12282 -357250 -149626 -647498 290204 197916 -405447 93349 126832 -350290
11858a68124m40606a95572E45806a84521M4747a5862H9798b68323C5533J59000
$$ -168124 -608730 -195572 545806 -184521 -139774 -15862 89798 -268323 35533 194533
11848A94533g2715B36041e39667a73967j02513a28422m4523A11907a95191l00598
$$ 194533 -72715 236041 -539667 -173967 -276480 -128422 -172945 111907 -195191 -495789
11838d95789D6689b99616A32497K18998A8197K01310O2504O2038C6594c0573l78443
$$ -495789 46689 -299616 132497 351495 18197 219507 282011 344049 36594 -30573 -409016
11827d09016A07899b82388g3758A53369a11426j24159A62721d20563J10832G88522
$$ -409016 107899 -282388 -73758 153369 -111426 -235585 162721 -420563 -309731 788522
11816B61984O0494b07541Q3812B96385a18382m60183b27445C9650e95607K13581
$$ 261984 322478 -207541 -123729 296385 -118382 -578565 -227445 39650 -595607 -382026
11806c82026C98567M17914c92124A34153A36a83439C20882L7953j06625a75101
$$ -382026 398567 816481 -392124 134153 136 -183439 320882 358835 252210 -175101
11795a19971D57850a6203B43596R1637g40107a44094A90617a29738A93825J9758
$$ -119971 457850 -16203 243596 335233 -740107 -144094 190617 -129738 193825 213583
11785B13583o250b18960j62350B78548J42862d37402I30477c91039F9234g23975
$$ 213583 207333 -218960 -381310 278548 421410 -437402 930477 -391039 69234 -723975
11774A84373c76276j13012J59146P7545B88537g35515K77550K18764h4461j36009
$$ 184373 -376276 -489288 -330142 -252597 288537 -735515 -457965 -239201 -84461 -220470
11764b20470C15877c3577A39914c44560j89449A40151b51309j1977j76144i1609
$$ -220470 315877 -33577 139914 -344560 -534009 140151 -251309 -263286 -439430 -91609
11753C40124a4847o39361g4355j46626D00815c62918D2149J34967L4961a96657
$$ 340124 -14847 -654208 -74355 -220981 400815 -362918 42149 177116 212077 -196657
11742A59624G5855a4357D89488d90584J96116J40703l00157C02833b98546F87590
$$ 159624 75855 -14357 489488 -490584 -294468 -153765 -453922 302833 -298546 687590
11731a15592j97652G358J0683K67971h8510a229n5925C28558J92422k16339h532
$$ -115592 -313244 7358 18041 286012 -88510 -1229 -57154 328558 520980 304641 -8532
11719a86670O2920D90165a91838C30592J44082f4591C39943J65648E2528b53338
$$ -186670 -123750 490165 -191838 330592 474674 -64591 339943 505591 52528 -253338
11708c2031j04911m98918D63615b67640B44707J28122d26435J94090l09492J51731
$$ -32031 -136942 -635860 463615 -267640 244707 372829 -426435 -232345 -541837 -390106
11698c90106d1375q8066k78721J09627D51844o476j67757a01870N0703m39504
$$ -390106 -41375 -129441 -408162 -298535 451844 445368 277611 -101870 -51167 -490671
11688d90671G57163c79616C51132q7054f02768A4554d98881a91205j99474C32915
$$ -490671 757163 -379616 351132 264078 -602768 14554 -498881 -191205 -390679 332915
11677c13444E59907b64486I8347B5201M16292B04323L44410A05594m9600L89295
$$ -313444 559907 -264486 98347 25201 441493 204323 548733 105594 55994 445289
11667D45289r6911j01640e4175l7763B5690c09860F53039H2884e0835j60520C87052
$$ 445289 348378 246738 -54175 -91938 25690 -309860 653039 82884 -50835 -211355 387052
11655d55054a62454k36042a04591F52771c07973A76294a52459q6453f7786j04592
$$ -455054 -162454 -398496 -104591 652771 -307973 176294 -152459 -238912 -67786 -172378
11645a72378D2170j5046P6678J68481L32984B02624d68410C42074B9713c6651
$$ -172378 42170 27124 103802 272283 605267 202624 -468410 342074 29713 -36651
11634A34868L8552g85919c73689D68138K30343A97643a78633I3916N63555B50126
$$ 134868 173420 -785919 -373689 468138 698481 197643 -178633 93916 657471 250126
11623F38856d12538D0868g86591B35852M62543B13175c75353D77683J74165a88414
$$ 638856 -412538 40868 -786591 235852 698395 213175 -375353 477683 651848 -188414
11612I10436c11128a15544M1844H9461K55210L28859B62880c50473A70845K01909
$$ 910436 -311128 -115544 -73700 89461 344671 673530 262880 -350473 170845 372754
11602C72754A51392a58067C10391q7592f9208D4429N3351N85754j76122A91169
$$ 372754 151392 -158067 310391 222799 -69208 44429 97780 683534 507412 191169
11591C84524n7665a82644B1215b7884A97461F4535P20625j55394d89480A01829
$$ 384524 326859 -182644 21215 -27884 197461 64535 785160 629766 -489480 101829
11580C12832J46188j24711K63485E4069P20722B94421J76764a12556B95611j41306
$$ 312832 459020 334309 597794 54069 774791 294421 471185 -112556 295611 154305
11570A54305P0154b50976D00880a16790B53188f39649A69573a7556C20171K76196
$$ 154305 224459 -250976 400880 -116790 253188 -639649 169573 -17556 320171 596367
11560E96367E3314c4868j01406a0035A07329f79322A84332K12147H0944c35066
$$ 596367 53314 -34868 -136274 -10035 107329 -679322 184332 396479 80944 -335066
11549f56840C41518b6231H18615B12616d85573C34333a9576C96551K6350J28336
$$ -656840 341518 -26231 818615 212616 -485573 334333 -19576 396551 422901 551237
11539E51237K3644k43850K63304k63356e749D3728J57484b29603R3842D52828
$$ 551237 574881 331031 594335 330979 -5749 43728 201212 -229603 -135761 452828
11528A19127O1535K03683A01695c81976D3923N0054J97916B3780J97454I362J04922
$$ 119127 180662 384345 101695 -381976 43923 93977 291893 23780 221234 9362 114284
11517A14284f9597L3144B32760L11518A17235K40352f9657C71293b27832k2005
$$ 114284 -69597 -36453 232760 544278 117235 357587 -69657 371293 -227832 -249837
11507b49837E95427D2010M49323M27068I0398M7111M12365B13608d13015E52848
$$ -249837 595427 42010 491333 918401 90398 137509 549874 213608 -413015 552848
11496a77616F7335b58610a3511m4836k98000G73522C72613P7923A62151M45186
$$ -177616 67335 -258610 -13511 -58347 -356347 773522 372613 450536 162151 607337
11486F07337F2044e5719B11159a30637H54000b33774C30368c51486k21576G15635
$$ 607337 62044 -55719 211159 -130637 854000 -233774 330368 -351486 -573062 715635
11475E11989r3887j55710k5609K383E8408c4164D90512c30497F39180a45767B32685
$$ 511989 418102 262392 236783 239166 58408 -34164 490512 -330497 639180 -145767 232685
11463A90909Q29401A4660J51825b12544B04402K52031c37246A87944a9687B15416
$$ 190909 1020310 14660 166485 -212544 204402 456433 -337246 187944 -19687 215416
11452D2404K33388M28875f01375B34464a47232D30509b37714D65376b32392a6549
$$ 42404 275792 704667 -601375 234464 -147232 430509 -237714 465376 -232392 -16549
11441b19777D39267e86721F8874K21082A03061P3603c12890D00065j90640d61384
$$ -219777 439267 -586721 68874 289956 103061 176664 -312890 400065 209425 -461384
11430g5758j93661D5204i6397m04859C93542a31993C33611a72735m46173b97850
$$ -75758 -269419 45204 -96397 -501256 393542 -131993 333611 -172735 -618908 -297850
11419G41996a89820B91038K54718b84592E54256G8407a3696k91862h7509i731
$$ 741996 -189820 291038 545756 -284592 554256 78407 -13696 -305558 -87509 -9731
11408b19811A77849H5199J53376E6726g69245C33212P8123P3984D427L02692b12866
$$ -219811 177849 85199 238575 56726 -769245 333212 411335 485319 4427 307119 -212866
11396D08883B4152J5353c73449D28355J34133M34983C98559e316D25024J26802
$$ 408883 24152 39505 -373449 428355 562488 997471 398559 -5316 425024 551826
11386E51826a91169F4347L12210R4615j68772b16653q6526m03025b08662l05125
$$ 551826 -191169 64347 376557 471172 302400 -216653 -303179 -706204 -208662 -513787
11376e13787B43752a96045D25595j5326d10215J65775D11373E5175a51678k2591
$$ -513787 243752 -196045 425595 410269 -410215 -244440 411373 55175 -151678 -174269
11366a74269E78254E1753K16337K52818M1219d06280Q3944a38754q5876B90784
$$ -174269 578254 51753 268090 520908 562127 -406280 -322336 -138754 -224630 290784
11355D2737f67020H1080a59610M0569K6777C88808A24646f9467o97374C55800
$$ 42737 -667020 81080 -159610 -119041 -92264 388808 124646 -69467 -766841 355800
11344c33133J09530A70856O9898i0771n36261K95098R9065m82952e7317m43512
$$ -333133 -223603 170856 240754 -90771 -627032 -331934 -232869 -715821 -57317 -500829
11334e00829E49145c64685N0147j0990C48445k0079a42468o2407A85171J99320
$$ -500829 549145 -364685 -314538 -325528 348445 328366 -142468 -204875 185171 384491
11324C84491A22881N12263b46014g9137K6507D12731H3428h5674C18590j34246
$$ 384491 122881 635144 -246014 -79137 -52630 412731 83428 -85674 318590 184344
11314A84344A7128c49354a03876l84623R5572A59030c4520l63209C71713J22278
$$ 184344 17128 -349354 -103876 -488499 -392927 159030 -34520 -397729 371713 493991
11304D93991p893M2903b25170l74493k50043H7909a06633l25292m53925e7667
$$ 493991 486098 529001 -225170 -599663 -849706 87909 -106633 -431925 -885850 -57667
11293c83091J77854B34727a02315E42143c48804J63892A1049b42245A47233O73372
$$ -383091 -205237 234727 -102315 542143 -348804 -184912 11049 -242245 147233 820605
11283H20605b10543m59065D6747A2029L7206L74668a10252d0666j99728m6096
$$ 820605 -210543 -669608 46747 12029 49235 423903 -110252 -40666 -240394 -286490
11273b86490j63157J69654B53897k1270b26428B2312G146L04285g75810e9621
$$ -286490 -449647 -279993 253897 232627 -226428 22312 7146 311431 -775810 -59621
11262d76183c439n16906a76284D05059D5258L5990b17990g3916G4479K380e74493
$$ -476183 -3439 -520345 -176284 405059 45258 81248 -217990 -73916 74479 76859 -574493
11250B0258K5786p625e97287a91857a6919n36274K15475f4098R70q02704c81523
$$ 20258 46044 38419 -597287 -191857 -16919 -553193 -337718 -64098 -63128 -865832 -381523
11238C4468K73498c47696F33060B02453K38901B937O6067E307J74875a99036p2463
$$ 34468 307966 -347696 633060 202453 441354 2937 69004 5307 180182 -199036 -271499
11227b71499L6636j85916j36787J61015R416J0725D65258c9218o31642a20752
$$ -271499 -234863 -420779 -557566 -396551 -387135 -376410 465258 -39218 -670860 -120752
11216B53020J40376m5888J10927A12467J53844d22339A26115N2581l8660a050895
$$ 253020 393396 347508 458435 112467 266311 -422339 126115 178696 140036 -1050895
11205C09931c08597j02976B00374K67854a10111E60507A78761J17086A40362b36887
$$ 309931 -308597 -411573 200374 468228 -110111 560507 178761 295847 140362 -236887
11194f61079e9278C16774f138l02845P4342q5031B9307N40297A12009L21416K16096
$$ -661079 -59278 316774 -6138 -308983 -234641 -319672 29307 569604 112009 433425 649521
11183F49521e86069i5804A28154c74191C923M09929b21857A55624E3018f18623
$$ 649521 -586069 -95804 128154 -374191 3923 413852 -221857 155624 53018 -618623
11172I44153m54728b66377q4146A22103M72536e75512G24532f08274D24770A00595
$$ 944153 489425 -266377 -350523 122103 594639 -575512 724532 -608274 424770 100595
11161A63088d86588E22918B56536K08706b85757c2138j67690D99223L09864a25130
$$ 163088 -486588 522918 256536 465242 -285757 -32138 -199828 499223 809087 -125130
11150B12458P5745I6539N98696D681K69321j10765N17420d04010A068050C92432
$$ 212458 288203 96539 695235 4681 274002 163237 680657 -404010 1068050 392432
11139G46269l29141j90291k1931B0146N54688P6067B11628n1157C6773N06478
$$ 746269 417128 226837 204906 20146 574834 650901 211628 160471 36773 543251
11129E43251k4260k3012K53239j20789r1709C2322Q55021c12257D26954i8406
$$ 543251 518991 495979 749218 628429 536720 32322 887343 -312257 426954 -98406
11118D5726N29951J36354g90260C82601J83297L08564b97913D72343j37291K33151
$$ 45726 575677 712031 -790260 382601 565898 874462 -297913 472343 335052 568203
11108E68203K30109L60319k55728r6545A36890M82990J7588k78917b33341I56925
$$ 568203 798312 1158631 902903 806358 136890 619880 637468 358551 -233341 956925
11097F45472L350K62085k30979B56753M28886j81267Q2515M07346j57767j45340
$$ 645472 648822 910907 679928 256753 685639 504372 586887 994233 836466 691126
11087F91126R0747M69955k83766L28020D74250N82967J2402q9317m70817M91019
$$ 691126 781873 1251828 968062 1296082 474250 1057217 1069619 980302 509485 1000504
11077A000504K67002m93834j26486J44669L47905j84537J40835K36196m64921
$$ 1000504 1267506 773672 647186 791855 1139760 955223 1096058 1332254 867333
11068H67333M99935K05551p37745k09706M70744Q2641r5259l4616K05E18675K84810
$$ 867333 1367268 1572819 835074 625368 1096112 1178753 1083494 1048878 1049083 518675 803485
11057H03485k18728Q17350L4366o08178N67655m52832P08808j6186j58355m42642
$$ 803485 584757 1402107 1436473 828295 1395950 943118 1651926 1635740 1477385 1034743
11047A034743k61446M08882Q60645p03865Q57094j095607M10369J20973k22026
$$ 1034743 773297 1182179 2042824 1338959 2196053 1100446 1510815 1631788 1409762
11038A409762n97557J139983l40581l19859M31589M96226r62644K18679L50316
$$ 1409762 812205 1952188 1611607 1291748 1723337 2219563 1256919 1475598 1825914
11029A825914p15766P73228n26875J49478l69190K06917J06472l9102M34332k16793
$$ 1825914 1110148 1883376 1356501 1505979 1136789 1343706 1450178 1411076 1845408 1628615
11019A628615K27765n75319J99188O5665O53814q86848K09538j25540J05853P16004
$$ 1628615 1856380 1281061 1480249 1545914 2199728 1312880 1522418 1396878 1502731 2218735
11009B218735o70109L38626r9259O167l2117J16549k11341n46003Q50014L74551
$$ 2218735 1548626 1887252 1787993 1794160 1762043 1878592 1667251 1121248 1971262 2345813
10999B345813q15584J01584K70791q18064O81490L4419k10262J097660p46335
$$ 2345813 1530229 1631813 1902604 1084540 1766030 1800449 1590187 2687847 1941512
10990A941512j69178k20846M41694l01858L42624m7664q8630m1921l72582O23365
$$ 1941512 1772334 1551488 1993182 1691324 2033948 1986284 1897654 1855733 1483151 2106516
10980B106516N8639J1195k82012P03594m56640l0024n38635O61199N88005n40430
$$ 2106516 2165155 2176350 1894338 2597932 2141292 2111268 1572633 2233832 2821837 2281407
10970B281407l56828N58838q4307m65749M1632M27349q19028P81120J71791o51118
$$ 2281407 1924579 2483417 2399110 1933361 1974993 2402342 1583314 2364434 2536225 1885107
10960A885107n22688P32409J74138R049l00083o65715P45J79322J33891l9247
$$ 1885107 1362419 2094828 2268966 2278015 1977932 1312217 1312962 1492284 1626175 1586928
10950A586928l22426J82855F59541P01495m21742C40319j16146P97989B04979
$$ 1586928 1264502 1447357 659541 1361036 939294 340319 224173 1022162 204979
10940F00106C0297f755A120742c5552E92078k27865J24124M12249b28908A41653
$$ 600106 30297 -6755 1120742 -35552 592078 364213 488337 900586 -228908 141653
10929A51481l6859n01m5112K32943b55722C30535b88887A5689K99830H407f44498
$$ 151481 114622 114121 69009 301952 -255722 330535 -288887 15689 315519 8407 -644498
10917D93847a0158j69628C44736d18731a5625m36117A75070a28235L0517A86819
$$ 493847 -10158 -179786 344736 -418731 -15625 -451742 175070 -128235 -97718 186819
10906c44944a56641f7751A79195d1963k07869B73585a95565m10107b91718f88
$$ -344944 -156641 -67751 179195 -41963 -249832 273585 -195565 -605672 -291718 -688
10895e11632C64095f40858b03982f45j98974B89111d66362e08j55605k07076h2829
$$ -511632 364095 -640858 -203982 -645 -199619 289111 -466362 -508 -156113 -363189 -82829
10883A3857c56314E00772c30237l3881c6262k08414P5376B72105c11675H5220
$$ 13857 -356314 500772 -330237 -364118 -36262 -244676 -169300 272105 -311675 85220
10872H13436i50634E3215c88773J34187I7327l9005e2423A9176b71356K5839R0541
$$ 813436 -950634 53215 -388773 -254586 97327 58322 -52423 19176 -271356 -245517 -154976
10861a54976m0678C52847b40825D8468d77439a22039j31947l9603C32271d5712
$$ -154976 -195654 352847 -240825 48468 -477439 -122039 -253986 -293589 332271 -45712
10850d23424b2570o4186I06699b58049a19530B90454H4928a70032E45696I8128
$$ -423424 -22570 -86756 906699 -258049 -119530 290454 84928 -170032 545696 98128
10839C06118e83874K38691B00018b81832N9632D33694d47702B24715J71849o3314
$$ 306118 -583874 -345183 200018 -281832 -222200 433694 -447702 224715 396564 333250
10829C33250c09403q8220i8059M4161K3082j47101A21515b59173l27641D5371
$$ 333250 -309403 -397623 -98059 -53898 -30816 -177917 121515 -259173 -586814 45371
10818A42601E7583a84922a9362C12108A01312M21761B11953c82679A53439b51012
$$ 142601 57583 -184922 -19362 312108 101312 523073 211953 -382679 153439 -251012
10807b31991j04745J36178l25118C39574q5632j26401l725c17125C12792b75357
$$ -231991 -336736 -200558 -525676 339574 253942 127541 123816 -317125 312792 -275357
10796b9441l15151G5245g4054R687m38010M5470a02697C12741a87642l3281E42224
$$ -29441 -344592 75245 -74054 -64367 -502377 -456907 -102697 312741 -187642 -220923 542224
10784c87125J77106D72928F4722K09317f11126I23545b30486i7521j58625l75643
$$ -387125 -210019 472928 64722 274039 -611126 923545 -230486 -97521 -256146 -631789
10774f31789C6077c90258a04207D6748N58J45395J10068c96092k30224G87326
$$ -631789 36077 -390258 -104207 46748 47306 192701 302769 -396092 -626316 787326
10763A46865a021185a07464l12996m04824L54259B6839e93798A4002J20972P8377
$$ 146865 -1021185 -107464 -420460 -825284 -471025 26839 -593798 14002 134974 213351
10753B13351K85582j47233O7960e4703B01299C3197i957F59493b6352B71212e40742
$$ 213351 498933 351700 419660 -54703 201299 33197 -9957 659493 -26352 271212 -540742
10741A13505b08979C0739c70174J77596F96195A10323g4405E2017J15554a92465
$$ 113505 -208979 30739 -370174 -192578 696195 110323 -74405 52017 167571 -192465
10730d76735i3001C1644L79901a53997D19998b97217C94311b48519O6732k76581
$$ -476735 -93001 31644 411545 -153997 419998 -297217 394311 -248519 -181787 -458368
10720d58368f1878k06884a12280K1528B43883a01683l81807l06560a89129l42591
$$ -458368 -61878 -268762 -112280 -90752 243883 -101683 -483490 -790050 -189129 -531720
10710e31720C64394A42003g56361B52786b49787a23629l50732h9401l03578N9889
$$ -531720 364394 142003 -756361 252786 -249787 -123629 -474361 -89401 -392979 -333090
10700c33090C29200C217b97088o4346J12536e3229l07906A73530d84435J07344
$$ -333090 329200 3217 -297088 -361434 -248898 -53229 -361135 173530 -484435 -377091
10690c77091A5954e89480C60292j09885b82545j77757a65012l51175b12026M6425
$$ -377091 15954 -589480 360292 250407 -282545 -460302 -165012 -516187 -212026 -165601
10680a65601J6004j00766k40735E80922e3862n46233b8433o53156A06334i2008
$$ -165601 -149597 -250363 -491098 580922 -53862 -600095 -28433 -681589 106334 -92008
10669a96455R83q25479b82163D01854c36941C55053b42921k05783a40249O3483
$$ -196455 -195472 -1020951 -282163 401854 -336941 355053 -242921 -448704 -140249 -76766
10659g6766r3792C39668b5858E01409J29316d404D44302m6548j49381M11584d5572
$$ -76766 -170558 339668 -25858 501409 630725 -4404 444302 397754 248373 659957 -45572
10647A046085e92966F79965a26890j65209L1880J09976j39967h5119C78003c53886
$$ 1046085 -592966 679965 -126890 -292099 -260219 -150243 -290210 -85119 378003 -353886
10636b05912C74441j75168K7305c54010k33265P9067A11428a3649C43242e53514
$$ -205912 374441 199273 226578 -354010 -587275 -508208 111428 -13649 343242 -553514
10625d21928j38990A40608D4649b73364A56769f84866H0200J39083d82375L6861
$$ -421928 -560918 140608 44649 -273364 156769 -684866 80200 219283 -482375 -445514
10615d45514O4404D68287M51755e1788l10048D02105e33926A86089D4385a96198
$$ -445514 -381110 468287 920042 -51788 -361836 402105 -533926 186089 44385 -196198
10604B68042a54979A21303c02921b7021J719E0668g51603J75077b77518i3849
$$ 268042 -154979 121303 -302921 -27021 -25302 50668 -751603 -576526 -277518 -93849
10593e20691A8280J91262e24553I9236L66141j94513K92026c10315a53317j14429
$$ -520691 18280 209542 -524553 99236 465377 270864 562890 -310315 -153317 -267746
10583b67746A55501m5129d71231A21407e56924C7467K10772b88769A56285e71583
$$ -267746 155501 110372 -471231 121407 -556924 37467 248239 -288769 156285 -571583
10572C23857b03208D85065g0320h013I5579D2831B0681L88033K36356B1133J43915
$$ 323857 -203208 485065 -70320 -8013 95579 42831 20681 408714 645070 21133 165048
10561A65048a58817B11631r6188a41629C74479G062c38038O7196j12413C42407
$$ 165048 -158817 211631 115443 -141629 374479 7062 -338038 -270842 -383255 342407
10550e4810j74304H2995e60299A85923e49856G9156a7900B75553L01989k33595
$$ -54810 -229114 82995 -560299 185923 -549856 79156 -17900 275553 577542 343947
10540C43947b65397D66084a51499P0769l85823K26694M275J14916F4470f21315
$$ 343947 -265397 466084 -151499 -80730 -466553 -239859 -235584 -120668 64470 -621315
10529b33862A93727b88004B53284M18930c01220d7972l8729k61372D68110Q12224
$$ -233862 193727 -288004 253284 672214 -301220 -47972 -86701 -348073 468110 1280334
10519A280334A20861B5158J85422j8529f6438A99783l4275a75320D15618g2689
$$ 1280334 120861 25158 210580 192051 -66438 199783 165508 -175320 415618 -72689
10508a025947K23459L61045a35672o3257B67282A00253a28640D90850a93736q0181
$$ -1025947 -802488 -441443 -135672 -198929 267282 100253 -128640 490850 -193736 -273917
10498b73917j27968J04257h463l16758j70887J40253a32265N2834J6475j005464
$$ -273917 -401885 -297628 -8463 -325221 -496108 -355855 -132265 -79431 -62956 -1068420
10488a068420a55473D52414J41672k51487E9987c22365a23238D05465A18407L81531
$$ -1068420 -155473 452414 594086 342599 59987 -322365 -123238 405465 118407 499938
10478D99938j45984n3046B7667a48779C5833L02702J15914d59894j7762F02209
$$ 499938 353954 300908 27667 -148779 35833 338535 454449 -459894 -477656 602209
10467E25141j16485e12098b25798J10482k94598J69104m8605A45224L41171i8847
$$ 525141 408656 -512098 -225798 -115316 -409914 -240810 -289415 145224 486395 -98847
10456F4180M96189a03847B03498P4421D8268O16144e4745n8928N5447k28338G37945
$$ 64180 560369 -103847 203498 277919 48268 664412 -54745 -113673 -58226 -286564 737945
10444g46544F6645f30101b56537D42052j12106b35433a06760A99097M173b05124
$$ -746544 66645 -630101 -256537 442052 329946 -235433 -106760 199097 203270 -205124
10433e48832J64828a6042m14125C931K95975h19726L74762l8388C62175e1254
$$ -548832 -384004 -16042 -430167 3931 299906 -819726 -444964 -483352 362175 -51254
10422A07882b28293Q2875A47938j7883l7901a83611C31984C0143J61385a03077
$$ 107882 -228293 -145418 147938 130055 92154 -183611 331984 30143 191528 -103077
10411C85662j15498L64328j15431a71180k0189C2583L66902I6161P7781M3938
$$ 385662 270164 634492 519061 -171180 -191369 32583 399485 96161 173942 217880
10401B17880a05590F00708k88631N9403A1967O74304K9781b80115D27052j98643
$$ 217880 -105590 600708 312077 371480 11967 686271 716052 -280115 427052 228409
10391B28409K56377e2697C62073K61874A47461L92568j33921D8082M11071M2743
$$ 228409 484786 -52697 362073 623947 147461 540029 406108 48082 459153 501896
10381E01896k20008F5552P8941a45686A104923C91127K42468B84169J10777J86465
$$ 501896 281888 65552 144493 -145686 1104923 391127 633595 284169 394946 581411
10371E81411A76229K00061J10654M24431k51131G569K67318O7449j35690c42025
$$ 581411 176229 376290 486944 911375 660244 7569 274887 342336 206646 -342025
10360G79284C44512M22Q5748I5807K58810a45379O3100C18762o3242q6217d753
$$ 779284 344512 344934 430682 95807 354617 -145379 -82279 318762 255520 169303 -4753
10348C40741A34650a50101E83900j61723A55856K13237Q77192B52630K90506c241
$$ 340741 134650 -150101 583900 422177 155856 369093 1246285 252630 543136 -3241
10337C17109j25388a59843E58089r1692A57202N32092I329J18912L31455c38273
$$ 317109 191721 -159843 558089 466397 157202 689294 9329 128241 459696 -338273
10326c20499a8582D52940c96855J04376k278B41581H5195L7211D337a43960I53012
$$ -320499 -18582 452940 -396855 -292479 -294757 241581 85195 122406 4337 -143960 953012
10314c12289A39201j9489K5906a20434l98178J56828a74668C8855K50741j07770
$$ -312289 139201 119712 145618 -120434 -518612 -361784 -174668 38855 289596 181826
10304A81826i4021L1714B43342J20096f91032b67609B1959i6319i669j11446k02195
$$ 181826 -94021 -62307 243342 363438 -691032 -267609 21959 -96319 -9669 -121115 -323310
10293c23310a23196j753l7200j89351F56899B01346n4238M33961L19693A73041
$$ -323310 -123196 -124949 -162149 -351500 656899 201346 147108 581069 900762 173041
10282d96140C13523i0837F47861a42083G27076A39529R576N4197J46101A38098
$$ -496140 313523 -90837 647861 -142083 727076 139529 149105 203302 349403 138098
10271c12893J41090B55069J00188B1518R2071O6091h67759B46683L47899k24843
$$ -312893 -171803 255069 355257 21518 113589 179680 -867759 246683 594582 369739
10261C69739n4597b79944a24060m8598j62080F0472b29718H50299b08745B7341
$$ 369739 315142 -279944 -124060 -172658 -334738 60472 -229718 850299 -208745 27341
10250c6647F1862L77632l8544C5193L70210L00543l50689F157J43589c40553B21842
$$ -36647 61862 439494 400950 35193 405403 705946 355257 6157 149746 -340553 221842
10238B91038A32565h7000L9515k09417K1418k47749J06368k67007A61764e9069
$$ 291038 132565 -87000 -47485 -256902 -235484 -483233 -376865 -643872 161764 -59069
10227d08697A20034e34769a9807p7219k32157l27518P4347F8823c36901m03904
$$ -408697 120034 -534769 -19807 -97026 -329183 -656701 -582354 68823 -336901 -740805
10217g40805a55804k8715f4688k29242a44826j23183a31845j99832f9644k43623
$$ -740805 -155804 -184519 -64688 -293930 -144826 -268009 -131845 -331677 -69644 -313267
10207c13267j69786J49635k4732k6801C745a98003o1202n6672J50610A03119j7726
$$ -313267 -483053 -333418 -358150 -384951 3745 -198003 -259205 -315877 -165267 103119 85393
10196H5393k0880b3367a1055d763k13260a7439G05605H2225O57751C52872C9321
$$ 85393 64513 -23367 -11055 -4763 -218023 -17439 705605 82225 739976 352872 39321
10184D0580c90420J70315J2067j54325D82596i8243B78822a7858k71886B13202
$$ 40580 -390420 -220105 -208038 -362363 482596 -98243 278822 -17858 -289744 213202
10173e48785J16489J37747A71840a25705k7254e3005n69140B24058a34052A22242
$$ -548785 -432296 -294549 171840 -125705 -152959 -53005 -622145 224058 -134052 122242
10162e05196H4718O1722g1264b9048k78334l11230F7998e15120A5467b75937G50552
$$ -505196 84718 146440 -71264 -29048 -307382 -618612 67998 -515120 15467 -275937 750552
10150b09734A92063J44464a135236a47684j72359g9432k22065P6714N9552H5835
$$ -209734 192063 336527 -1135236 -147684 -320043 -79432 -301497 -224783 -165231 85835
10139e50606a91865n985m90665I9044K3760k7842J08639N182f76856a34755k41626
$$ -550606 -191865 -197850 -688515 99044 122804 94962 203601 208783 -676856 -134755 -376381
10128c76381e4231k26151m97313I3371b66240r045l5832B80206d70698M1182J22858
$$ -376381 -54231 -280382 -777695 93371 -266240 -275285 -311117 280206 -470698 -429516 -306658
10117c06658j19363A45641g53243D6462d20534i6761l25126m3649O3658J32391
$$ -306658 -426021 145641 -753243 46462 -420534 -96761 -421887 -465536 -401878 -269487
10107b69487k80263A36546K02555q1489I087f72492b39027G27878a07492n4811
$$ -269487 -549750 136546 339101 257612 9087 -672492 -239027 727878 -107492 -162303
10097a62303B04861i3430B05303l7016a29131D20565f11674L02642N5576A25759
$$ -162303 204861 -93430 205303 168287 -129131 420565 -611674 -309032 -253456 125759
10086b64537Q7269B67873a44836j39881j04110A25384i3258B29835p8932c61320
$$ -264537 -177268 267873 -144836 -284717 -388827 125384 -93258 229835 150903 -361320
10075A3009M36586k12958e42690l5230C80565A81552h49687B73572J6062J75853
$$ 13009 449595 236637 -542690 -577920 380565 181552 -849687 273572 289634 465487
10065D65487e21802b02244C20531g5324D0052J63254b12193m8489G69845a09360
$$ 465487 -521802 -202244 320531 -75324 40052 203306 -212193 -260682 769845 -109360
10054E85875B08230a76187j94865J70104j61385J54142k94237D66651e68513g404
$$ 585875 208230 -176187 -371052 -200948 -362333 -208191 -502428 466651 -568513 -7404
10043A46867d05725F2483J48744d81257a29252m13894b65847D3070f48757l18440
$$ 146867 -405725 62483 211227 -481257 -129252 -543146 -265847 43070 -648757 -967197
10033i67197d331B3407N24312a02963G7374J06423b03561L4814A35948c72270
$$ -967197 -4331 23407 547719 -102963 77374 183797 -203561 -168747 135948 -372270
10022D88088b16925O3172A80847a46573m17468b36056e4959k3383l10206a2862
$$ 488088 -216925 -153753 180847 -146573 -564041 -236056 -54959 -78342 -388548 -12862
10011A3056a54987o12107D7460M9361e5044B78570c9194r7194A99346Q411a53768
$$ 13056 -154987 -767094 47460 96821 -55044 278570 -39194 -136388 199346 207757 -153768
9999G84751c90864D118L96074b47466p0053l81219A04731R9958D094a81101B00602
$$ 784751 -390864 4118 400192 -247466 -317519 -698738 104731 204689 4094 -181101 200602
9987b98956J29293r8098o49690L91529h0673B57961l0160J66192L1502A08878
$$ -298956 -169663 -267761 -917451 -525922 -80673 257961 227801 393993 425495 108878
9976A5816g58711f9620C11748G4363a86273C95861A08683N2030c45624D88928
$$ 15816 -758711 -69620 311748 74363 -186273 395861 108683 160713 -345624 488928
9965b10220E75958f19165a07724E2901L02769g08426E15059d35744F66080E2042
$$ -210220 575958 -619165 -107724 52901 355670 -708426 515059 -435744 666080 52042
9954B8833c53990E3812p308h54201B26578d15223A93923b18781G0770h0650l4554
$$ 28833 -353990 53812 46504 -854201 226578 -415223 193923 -218781 70770 -80650 -115204
9943a15204m79573G1914g3598n45153b71289k81240a53472j2411o00474a25520
$$ -115204 -594777 71914 -73598 -618751 -271289 -552529 -153472 -165883 -766357 -125520
9932a15215l48532b7838B29800J47800L607A55572a9854j76289E75496k41698
$$ -115215 -463747 -27838 229800 377600 381207 155572 -19854 -196143 575496 333798
9922C33798r9440h73196L36505p0983a62147n19917M8955D1727a40564j98468
$$ 333798 234358 -873196 -536691 -607674 -162147 -682064 -633109 41727 -140564 -339032
9912c39032A51352K63430D9174K49166m950b08237l02980g8432l37003B71646
$$ -339032 151352 414782 49174 298340 293390 -208237 -511217 -78432 -415435 271646
9901A33099C6944a63935A70402a0902j80519j2638E9034d24026L5514a80964J8903
$$ 133099 36944 -163935 170402 -10902 -191421 -204059 59034 -424026 -388512 -180964 -162061
9890a62061D07587J38505F439c69674m2003C21304b88457A01729d50302a3455
$$ -162061 407587 546092 6439 -369674 -411677 321304 -288457 101729 -450302 -13455
9879d94873h8955k12420c0342A35920a68694K2268D0311a33372k35124Q7069j62230
$$ -494873 -88955 -301375 -30342 135920 -168694 -146426 40311 -133372 -368496 -281427 -443657
9868d43657b11481q2016a40480L9284p7507m07734C1678e87355D09714K38940
$$ -443657 -211481 -293497 -140480 -101196 -178703 -586437 31678 -587355 409714 648654
9858F48654k55228d28775A12134m4361a72408n28950K75048a83901j99905O7797
$$ 648654 393426 -428775 112134 67773 -172408 -701358 -426310 -183901 -383806 -316009
9848c16009g3899A21401J94730d87184b40434I7223j2930a171l17795D8829b22382
$$ -316009 -73899 121401 316131 -487184 -240434 97223 84293 -1171 -318966 48829 -222382
9836B59933i0400B78039a52488p6894g707l05032q2281g2847A27868d23847C65985
$$ 259933 -90400 278039 -152488 -229382 -7707 -312739 -395020 -72847 127868 -423847 365985
9824A07184h730A04522b82864C75300e4521o1431l70288A81293Q7081d87567B86791
$$ 107184 -8730 104522 -282864 375300 -54521 -115952 -486240 181293 268374 -487567 286791
9812f47910J93629E1140A9798a05948p7113G30321c45483j82853p0662A2009L59064
$$ -647910 -454281 51140 19798 -105948 -183061 730321 -345483 -528336 -598998 12009 371073
9801C71073c5376j69074l29383K65636q5377J30408l06431j58071a33855J1849
$$ 371073 -35376 -204450 -533833 -268197 -353574 -223166 -529597 -687668 -133855 -122006
9791a22006D80034d91551k05811a99024M57E22136B04765K85631j38175a89964
$$ -122006 480034 -491551 -697362 -199024 -198567 522136 204765 490396 352221 -189964
9780d08836B01159L34908A16130j8374b83532I7691d81228J15757g7154G2898
$$ -408836 201159 536067 116130 97756 -283532 97691 -481228 -365471 -77154 72898
9769f31430a29691j20952R8925A12092i7619A97855e38381a27134a7536k16990
$$ -631430 -129691 -250643 -151718 112092 -97619 197855 -538381 -127134 -17536 -234526
9759b34526n6667j44472J09361j50167j00187A54009f26340J75106D81731b90087
$$ -234526 -291193 -435665 -326304 -476471 -576658 154009 -626340 -451234 481731 -290087
9748a44823j67933A10806b11167j72911e1386j92051A06887J76799b77776I75368
$$ -144823 -312756 110806 -211167 -384078 -51386 -243437 106887 283686 -277776 975368
9737E11082A93392B636a80020j30171d8747k34913P2133k2838r9577H8345h4001
$$ 511082 193392 2636 -180020 -310191 -48747 -283660 -211527 -234365 -333942 88345 -84001
9725B49441c0974A70568C4456b36584B02138j0835a61904p9142m022q8868l45147
$$ 249441 -30974 170568 34456 -236584 202138 191303 -161904 -241046 -245068 -333936 -679083
9714f79083F3872e5175E60343b15660G4078c62745j98580a79587J3344k87365
$$ -679083 63872 -55175 560343 -215660 74078 -362745 -561325 -179587 -166243 -453608
9704d53608H5947c24506n82490J39191a5368j11869O1006n49988E1754M88146
$$ -453608 85947 -324506 -906996 -767805 -15368 -127237 -66231 -616219 51754 539900
9694E39900c32118H4440a29499o9379m78322B7033a16451A42613b36101a07478
$$ 539900 -332118 84440 -129499 -198878 -677200 27033 -116451 142613 -236101 -107478
9683c03801a34773j36107R3197b4385j097672E33775b48784A8844K0959d98563
$$ -303801 -134773 -270880 -177683 -24385 -1122057 533775 -248784 18844 39803 -498563
9672A65424d01059i4735o9691d3067B31590b81323k8556E8972c21338B56868J72472
$$ 165424 -401059 -94735 -164426 -43067 231590 -281323 -309879 58972 -321338 256868 429340
9661D29340A48810b84076A76782G0350b78479Q4995k17137P3746l07238B33079
$$ 429340 148810 -284076 176782 70350 -278479 -193484 -410621 -336875 -644113 233079
9650e49314b72845k08754i6497q3112E04817J7296A57403e78028b05346A15972
$$ -549314 -272845 -481599 -96497 -179609 504817 522113 157403 -578028 -205346 115972
9639a05198j85842p1788A88959d85290E08788a05648K8297m63552p3762B9021
$$ -105198 -291040 -362828 188959 -485290 508788 -105648 -77351 -540903 -614665 29021
9628f4278j06481j26705m25835f4676C32759E7168e3120B24406P7560h54926F73559
$$ -64278 -170759 -297464 -723299 -64676 332759 57168 -53120 224406 301966 -854926 673559
9616i4376C1934b43436k19714p2795l85603I91563b96535F2066b03524D60329
$$ -94376 31934 -243436 -463150 -535945 -921548 991563 -296535 62066 -203524 460329
9605a37507A42548a06390I1042L720b89624n7453n23231a18100j4856I9252d64574
$$ -137507 142548 -106390 91042 94762 -289624 -347077 -870308 -118100 -132956 99252 -464574
9593C16189c41756j34199C50866C1477a76949l00995o6704K08401Q1530P4249
$$ 316189 -341756 -475955 350866 31477 -176949 -477944 -544648 -336247 -254717 -180468
9583a80468K6286j53690k40681O8590c3986G0265M4840b37504l43358E864e89277
$$ -180468 -154182 -307872 -548553 -479963 -33986 70265 115105 -237504 -580862 5864 -589277
9571C42502A7636J01443e31719B38337h62837a86719k23478n739j71460B52786
$$ 342502 17636 119079 -531719 238337 -862837 -186719 -410197 -415936 -587396 252786
9560a67723C73387A8723a41477L5634k75325l38596c18145Q9118M2646r9645m65
$$ -167723 373387 18723 -141477 -105843 -381168 -719764 -318145 -229027 -186381 -286026 -286491
9549b86491B94013O13940f4279E55597h95164M38092J08098B28731e73559K07376
$$ -286491 294013 907953 -64279 555597 -895164 -457072 -348974 228731 -573559 -366183
9539c66183A03233b56413G0353B6954a43633n42909E6498b29187J9059A19089
$$ -366183 103233 -256413 70353 26954 -143633 -686542 56498 -229187 -210128 119089
9528B90572A21981b45116E80215d16138a26882D4644c17956f9016B10770f23754
$$ 290572 121981 -245116 580215 -416138 -126882 44644 -317956 -69016 210770 -623754
9517d10491a19196A75282a75367C47590g07740E95354K00834c69113C37781e83085
$$ -410491 -119196 175282 -175367 347590 -707740 595354 796188 -369113 337781 -583085
9506a4246j47220n10979E8788o484B1218c19929C6278M6321O4835K8855a77993
$$ -14246 -161466 -672445 58788 52304 21218 -319929 36278 82599 147434 176289 -177993
9494B02184e56416D1613d0108A20167M40889B6192L17816f24649b70127B2662
$$ 202184 -556416 41613 -40108 120167 561056 26192 344008 -624649 -270127 22662
9483a63312B58388B5958H990g36649a34935k1483j32096B8042c5681k57190o0336
$$ -163312 258388 25958 8990 -736649 -134935 -156418 -288514 28042 -35681 -292871 -353207
9472c53207B24357b33105p0556B51086B7680e88094d3332l49619j05122b8620
$$ -353207 224357 -233105 -303661 251086 27680 -588094 -43332 -392951 -498073 -28620
9461a76098n30102a55506B24702c720p3553A62564c42688j05310C23505I9862
$$ -176098 -706200 -155506 224702 -3720 -77273 162564 -342688 -447998 323505 99862
9450a02775j55346k5407A45257e53182C39591b63143m2032j06851j01935a25105
$$ -102775 -258121 -283528 145257 -553182 339591 -263143 -305175 -412026 -513961 -125105
9439c67260f777l89544d5182n2407l27592J33704a05525B11294h0542j72037k13840
$$ -367260 -6777 -396321 -45182 -97589 -425181 -291477 -105525 211294 -80542 -252579 -466419
9428d66419e9322p80481L00111O3670G37360k93971l9404j64994a08071l57386
$$ -466419 -59322 -839803 -539692 -476022 737360 443389 403985 238991 -108071 -465457
9418d65457b08406h9635A34696e45943J22929q14800f4721m87210H336i71484
$$ -465457 -208406 -89635 134696 -545943 -423014 -1237814 -64721 -551931 8336 -971484
9407a76881d8627l18413Q4716g1016B69478d0855J8703k5346m46981j236A52156
$$ -176881 -48627 -367040 -282324 -71016 269478 -40855 -22152 -47498 -494479 -495715 152156
9395e64273K65181G2613i0382D03087e71817K37447E5487c59726B63953b07252
$$ -564273 -299092 72613 -90382 403087 -571817 -334370 55487 -359726 263953 -207252
9384d1991D1212f56860A35236F3799a26239n33464D62415c9373A08490O3473b59084
$$ -41991 41212 -656860 135236 63799 -126239 -659703 462415 -39373 108490 171963 -259084
9372f02208A19070J75972c17933H5813e44704E32137J13503D964M14582d53083
$$ -602208 119070 295042 -317933 85813 -544704 532137 645640 4964 419546 -453083
9361c30713g9668j33032a9637k73644m74135a6478m09456q4017d8880C24932c57336
$$ -330713 -79668 -212700 -19637 -293281 -767416 -16478 -425934 -509951 -48880 324932 -357336
9349a16628J4414d2270l96544A04220J24366a68529k44638m68871J21160L02532
$$ -116628 -102214 -42270 -438814 104220 228586 -168529 -413167 -882038 -760878 -458346
9339d58346a99896p3112A3761e1960j36277E11587h55071b39812e2192I81545
$$ -458346 -199896 -273008 13761 -51960 -188237 511587 -855071 -239812 -52192 981545
9328a00549B73694c79420a59245m3289D82814e03119k65768b8398j21853F6656
$$ -100549 273694 -379420 -159245 -202534 482814 -503119 -768887 -28398 -150251 66656
9317a51114j02541j4402m7982h1494K5858j79650j31086C23388c70669B90665
$$ -151114 -253655 -268057 -316039 -81494 -55636 -235286 -366372 323388 -370669 290665
9306d85708K23057D8779c66605q5569J68972h5279C29095c15349J27207k15901
$$ -485708 -262651 48779 -366605 -452174 -283202 -85279 329095 -315349 -188142 -404043
9296d04043l54590A10511K12068d25614R1717C70579a63340A82684j1092a58769
$$ -404043 -758633 110511 322579 -425614 -333897 370579 -163340 182684 171592 -158769
9285a12635j80629j31185A13021b19626A75344b76713C03927d27497k80031B213
$$ -112635 -293264 -424449 113021 -219626 175344 -276713 303927 -427497 -707528 2213
9274e24763b42606g9648j93192a12622j82627l67570A02889D0094J94969a03029
$$ -524763 -242606 -79648 -272840 -112622 -295249 -662819 102889 40094 235063 -103029
9263d50368b18059B13259O7067f28232r1213I2158a29842B41323l434g3505F4724
$$ -450368 -218059 213259 280326 -628232 -719445 92158 -129842 241323 237889 -73505 64724
9251c51037C60909f8795l83385B42642c3132k56206a39587I8347c0326l06207
$$ -351037 360909 -68795 -452180 242642 -33132 -289338 -139587 98347 -30326 -336533
9241c36533E0507a82245j21236A25606a80937D78346A63343e06698h1114m3673
$$ -336533 50507 -182245 -303481 125606 -180937 478346 163343 -506698 -81114 -124787
9231a24787m45564j12005E0350O215a76748D55362e19671A43451c36088A54496
$$ -124787 -570351 -682356 50350 56565 -176748 455362 -519671 143451 -336088 154496
9220c90025B83530J91698Q0674H158b94421A9137Q9720b4461l12606C71899c49739
$$ -390025 283530 475228 555902 8158 -294421 19137 108857 -24461 -337067 371899 -349739
9208f47519C06927c84426j82741F6541b03260A13851d6075B62469b66333B80203
$$ -647519 306927 -384426 -567167 66541 -203260 113851 -46075 262469 -266333 280203
9197f76025C03986c22176A22070b68226i8001p14083A62074a17013M5832p13301
$$ -676025 303986 -322176 122070 -268226 -98001 -812084 162074 -117013 -71181 -784482
9187g84482b68375M916A4081c25403A33172d51983g2343A48432N1547l4244c74255
$$ -784482 -268375 -263459 14081 -325403 133172 -451983 -72343 148432 199979 165735 -374255
9175C2456b86409e3699C71212b27439j88657J17750A23714J61735a7586B78295
$$ 32456 -286409 -53699 371212 -227439 -416096 -298346 123714 285449 -17586 278295
9164G17546d3859A18828c76954E4821d89437A70172K12135d52656J39935j41129
$$ 717546 -43859 118828 -376954 54821 -489437 170172 382307 -452656 -312721 -453850
9154d53850m35523a98064L7675C94455c71620A09646a91180j38509m5283D17781
$$ -453850 -889373 -198064 -160389 394455 -371620 109646 -191180 -329689 -374972 417781
9143c09960a45825j85686m2708n11620g7060k11164k96261K81191P4858Q6458
$$ -309960 -145825 -331511 -374219 -885839 -77060 -288224 -584485 -303294 -228436 -141978
9133a41978B72400m3738E5199i0066j30882a5451l13172a41068B835g02973c43789
$$ -141978 272400 228662 55199 -90066 -220948 -15451 -328623 -141068 2835 -702973 -343789
9121B3860d6325l45896q4508J59541J7014j28956H0977c9300A78111c96434M1430
$$ 23860 -46325 -392221 -476729 -317188 -300174 -429130 80977 -39300 178111 -396434 -355004
9110c55004P9943P5745E9883g95340A64873g28491g8909B96819c79703k74063
$$ -355004 -275061 -199316 59883 -795340 164873 -728491 -78909 296819 -379703 -653766
9100f53766C64335C8076d7998B07936G8279d73633J91463g8223e489p1000b99
$$ -653766 364335 38076 -47998 207936 78279 -473633 -282170 -78223 -5489 -76489 -299
9088b70290F5060g82950c43946B09663K08852c45962K9151B18175p9261D404d94926
$$ -270290 65060 -782950 -343946 209663 418515 -345962 -316811 218175 138914 4404 -494926
9076a09848r3321m57055C02530c70309A26898a90901l25611C34786g3895A86909
$$ -109848 -203169 -660224 302530 -370309 126898 -190901 -516512 334786 -73895 186909
$$ [...]
##END NTUPLES=NMR SPECTRUM
##END=
