##TITLE=NES1065_ptc_ref_9883764_BG3vxLU3YG
##JCAMPDX= 6.0         $$ Bruker NMR JCAMP-DX V2.0
##DATA TYPE= NMR SPECTRUM
##DATA CLASS= NTUPLES
##ORIGIN= BRUKER
##OWNER= Administrator
$$ 1.72 TOPSPIN		Version 2.1
$$ 2016-08-27 01:24:09.367 -0500  Administrator@X
$$ Compression mode = diff/dup
##.OBSERVE FREQUENCY= 400.02188249412
##.OBSERVE NUCLEUS= ^1H
##.ACQUISITION MODE= SIMULTANEOUS (DQD)
##.ACQUISITION SCHEME= undefined
##.AVERAGES= 64
##.DIGITISER RES= 22
##SPECTROMETER/DATA SYSTEM= spect
##.PULSE SEQUENCE= noesygpps1d.comp
##.SOLVENT NAME= COFFEE_meoh
##.SHIFT REFERENCE= INTERNAL, COFFEE_meoh, 1, 14.96032
##AUDIT TRAIL= $$ (NUMBER, WHEN, WHO, WHERE, PROCESS, VERSION, WHAT)
$$ ##TITLE= Audit trail, TOPSPIN		Version 2.1
$$ ##JCAMPDX= 5.01
$$ ##ORIGIN= Bruker BioSpin GmbH
$$ ##OWNER= Administrator
$$ $$ E:\/data/COFFEE/nmr/NES1065_ptc_ref_9883764_BG3vxLU3YG/12/pdata/1/auditp.txt
$$ ##AUDIT TRAIL=  $$ (NUMBER, WHEN, WHO, WHERE, PROCESS, VERSION, WHAT)
(   1,<2016-08-27 01:24:04.195 -0500>,<Administrator>,<X>,<go>,<TOPSPIN 2.1>,
      <created by zg
	started at 2016-08-27 01:12:34.351 -0500,
	POWCHK enabled, PULCHK disabled,
       configuration hash MD5:
       21 0F 79 D6 B3 7B B4 F6 88 20 88 DB 03 48 BD 9F
       data hash MD5: 64K
       5B 60 05 81 CE 5B 37 08 7C F2 60 20 23 56 A2 E6>)
(   2,<2016-08-27 01:24:07.289 -0500>,<Administrator>,<X>,<proc1d>,<TOPSPIN 2.1>,
      <Start of raw data processing
       efp LB = 0.3 FT_mod = 6 PKNL = 1 PHC0 = 0 PHC1 = 0 SI = 128K 
       data hash MD5: 128K
       38 18 D4 59 98 80 F6 3C 30 3B 50 81 11 E5 8F 36>)
(   3,<2016-08-27 01:24:08.164 -0500>,<Administrator>,<X>,<proc1d>,<TOPSPIN 2.1>,
      <pk PHC0 = -81.57349 PHC1 = 0 
       data hash MD5: 128K
       C9 82 45 2F 3C 02 E1 32 9F EE 90 95 B0 11 71 3F>)
(   4,<2016-08-27 01:24:08.554 -0500>,<Administrator>,<X>,<proc1d>,<TOPSPIN 2.1>,
      <abs ABSG = 1 
       data hash MD5: 128K
       0B 2B 40 47 A5 93 32 F1 0C 47 EC 1A DA 7B 8E 7C>)
(   5,<2016-08-27 01:24:08.664 -0500>,<Administrator>,<X>,<proc1d>,<TOPSPIN 2.1>,
      <abs ABSG = 2 
       data hash MD5: 128K
       43 77 7D C0 79 0E 2D 81 47 6D 74 10 E7 31 2D 5E>)
(   6,<2016-08-27 01:24:08.742 -0500>,<Administrator>,<X>,<proc1d>,<TOPSPIN 2.1>,
      <abs ABSG = 3 
       data hash MD5: 128K
       94 66 1A 49 8F EC 95 16 00 CC 5F 9E 30 6D F8 7F>)
(   7,<2016-08-27 01:24:08.820 -0500>,<Administrator>,<X>,<proc1d>,<TOPSPIN 2.1>,
      <abs ABSG = 4 
       data hash MD5: 128K
       4F B4 33 43 FC A1 03 69 73 8C CD 93 4E 19 39 8A>)
(   8,<2016-08-27 01:24:08.914 -0500>,<Administrator>,<X>,<proc1d>,<TOPSPIN 2.1>,
      <abs ABSG = 5 
       data hash MD5: 128K
       7E D6 2C A4 E5 A5 E0 27 52 07 4D C3 A1 CC DC 76>)
$$ ##END=
$$ 
$$ $$ hash MD5
$$ $$ FE F5 6E 4A 4C 7E 8E 38 13 15 1A F1 24 46 96 9F
##$RELAX= 
##$RELAX= 
##$RELAX= 
##$RELAX= 
##$RELAX= 
##$RELAX= 
##$RELAX= 
##$RELAX= 
$$ Bruker specific parameters
$$ --------------------------
##$DU= <E:\>
##$EXPNO= 12
$$ [...]
##$TP07= 0
##$TPNAME0= <>
##$TPNAME1= <>
##$TPNAME2= <>
##$TPNAME3= <>
##$TPNAME4= <>
##$TPNAME5= <>
##$TPNAME6= <>
##$TPNAME7= <>
##$TPOAL= (0..7)
0.5 0.5 0.5 0.5 0.5 0.5 0.5 0.5
##$TPOFFS= (0..7)
0 0 0 0 0 0 0 0
##$TUNHIN= 0
##$TUNHOUT= 0
##$TUNXOUT= 0
##$USERA1= <user>
##$USERA2= <user>
##$USERA3= <user>
##$USERA4= <user>
##$USERA5= <user>
##$V9= 5
##$VALIST= <valist>
##$VCLIST= <CCCCCCCCCCCCCCC>
##$VD= 0
##$VDLIST= <DDDDDDDDDDDDDDD>
##$VPLIST= <PPPPPPPPPPPPPPP>
##$VTLIST= <TTTTTTTTTTTTTTT>
##$WBST= 2048
##$WBSW= 25
##$XGAIN= (0..3)
0 0 0 0
##$XL= 0
##$YL= 0
##$YMAX_a= 6119410
##$YMIN_a= -11644587
##$ZGOPTNS= <>
##$ZL1= 120
##$ZL2= 120
##$ZL3= 120
##$ZL4= 120
##$ABSF1= 14.96032
##$ABSF2= -5.597861
##$ABSG= 5
##$ABSL= 3
##$ALPHA= 0
##$AQORDER= 0
##$ASSFAC= 0
##$ASSFACI= 0
##$ASSFACX= 0
##$ASSWID= 0
##$AUNMP= <proc_prof1d_extract.lims>
##$AXLEFT= 0
##$AXNAME= <>
##$AXNUC= <1H>
##$AXRIGHT= 0
##$AXTYPE= 0
##$AXUNIT= <>
##$AZFE= 0.1
##$AZFW= 0.1
##$BCFW= 0
##$BC_mod= 0
##$BYTORDP= 0
##$COROFFS= 0
##$CY= 15
##$DATMOD= 1
##$DC= 0
##$DFILT= <>
##$DTYPP= 0
##$F1P= 0
##$F2P= 0
##$FCOR= 0.5
##$FTSIZE= 131072
##$FT_mod= 6
##$GAMMA= 0
##$GB= 0
##$INTBC= 1
##$INTSCL= 1
##$ISEN= 128
##$LB= 0.3
##$LEV0= 0
##$LPBIN= 0
##$MAXI= 10000
##$MC2= 0
##$MEAN= 0
##$ME_mod= 0
##$MI= 0
##$NCOEF= 0
##$NC_proc= -2
##$NLEV= 6
##$NOISF1= 0
##$NOISF2= 0
##$NSP= 0
##$NTH_PI= 0
##$NZP= 0
##$OFFSET= 14.96032
##$PC= 1
##$PHC0= -81.57349
##$PHC1= 0
##$PH_mod= 1
##$PKNL= yes
##$PPARMOD= 0
##$PPDIAG= 0
##$PPIPTYP= 0
##$PPMPNUM= 2147483647
##$PPRESOL= 1
##$PSCAL= 4
##$PSIGN= 0
##$PYNMP= <proc.py>
##$REVERSE= no
##$SF= 400.020009908778
##$SI= 131072
##$SIGF1= 0
##$SIGF2= 0
##$SINO= 400
##$SIOLD= 131072
##$SPECTYP= <>
##$SREGLST= <1H.CDCl3>
##$SSB= 0
##$STSI= 131072
##$STSR= 0
##$SW_p= 8223.68421052631
##$SYMM= 0
##$S_DEV= 0
##$TDeff= 65536
##$TDoff= 0
##$TI= <>
##$TILT= no
##$TM1= 0
##$TM2= 0
##$TOPLEV= 0
##$USERP1= <user>
##$USERP2= <user>
##$USERP3= <user>
##$USERP4= <user>
##$USERP5= <user>
##$WDW= 1
##$XDIM= 131072
##$YMAX_p= 378605196
##$YMIN_p= -12684
##$CURPLOT= <Network HP LaserJet P1505>
##$CURPRIN= <$Network HP LaserJet P1505>
##$DFORMAT= <normdp>
##$LAYOUT= <+/1D_H.xwp>
##$LFORMAT= <normlp>
##$PFORMAT= <normpl>
##$SURQMSG= 1
$$ End of Bruker specific parameters
$$ ---------------------------------
##NTUPLES= NMR SPECTRUM
##VAR_NAME=  FREQUENCY,     SPECTRUM/REAL,   SPECTRUM/IMAG
##SYMBOL=    X,             R,               I
##VAR_TYPE=  INDEPENDENT,   DEPENDENT,       DEPENDENT
##VAR_FORM=  AFFN,          ASDF,            ASDF
##VAR_DIM=   131072,        131072,          131072
##UNITS=     HZ,            ARBITRARY UNITS, ARBITRARY UNITS
##FACTOR=    0.0627417313425164, 1,          1
##FIRST=     8223.62146879497, 1207,         -55574
##LAST=      0,             4171,            -55514
##MIN=       0,             -12684,          0
##MAX=       8223.62146879497, 378605196,    0
$$ Real data points
##PAGE= N=1
##DATA TABLE= (X++(R..R)), XYDATA
$$ [...]
63968C18119R488R253Q325P829Q167Q910R751J0898J2502J4276J5982J7888K0470
63955D71858K3836K7672L1733L6264M1896M9030N7280O5789P4161Q2845R2224
63944A054588J01644J09887J16548J22369J28055J33248J36841J37886J35831
63935B176897J30227J20718J07490R1448P3868N5738L7333J8350j409k1550m1382
63924B747728o0523p8754r5316j08862j18484j24447j27650j28643j27535j24577
63914A652937j20221j14669j07868j00030r1781q3614p5586o7725o0327n3542
63904G77574m6973m0222l3683k8305k4453k1453j8464j5388j2692j0590q829p184
63892E09338n743m618l679k704j702q88m20j01O22K229M573O886Q595R936J1544
$$ y = [318119, 327607, 336860, 345185, 353014, 361181, 370091, 379842, 390740, 403242, 417518, 433500, 451388, 471858, 495694, 523366, 555099, 591363, 633259, 682289, 739569, 805358, 879519, 962364, 1054588, 1156232, 1266119, 1382667, 1505036, 1633091, 1766339, 1903180, 2041066, 2176897, 2307124, 2427842, 2535332, 2626780, 2700648, 2756386, 2793719, 2812069, 2810660, 2789110, 2747728, 2687205, 2608451, 2513135, 2404273, 2285789, 2161342, 2033692, 1905049, 1777514, 1652937, 1532716, 1418047, 1310179, 1210149, 1118368, 1034754, 959168, 891443, 831116, 777574, 730601, 690379, 656696, 628391, 603938, 582485, 564021, 548633, 535941, 525351, 516522, 509338, 503595, 498977, 495298, 492594, 490892, 490004, 489584, 489483, 490105, 492334, 496907, 503793, 512388, 522324, 533868]
63877E33868J3573J5705J7897K0483K3375K5695K6609K6210K5235K4264K3480
63866G76394K2853K2090K0687J8451J5862J3390J0744P319L274m84l505o340r690
63853H91045j3435j6846j9430k1238k2539k3552k4365k4962k5296k5438k5520
63842F48424k5425k4843k3773k2795k2482k2624k2375k1203j9402j7505j5536
63831D10461j3236j0859r202q655q660q479q232q605r722j0888j1544j1831j1911
63818B78637j1421j0072q443p427p040o461n218l796k968k884l154l407l521l466
63804A99359l206k811k486k386k332j907r48O0L67k00j105j818k221k171j291
63789A74904K66J334P62j173l017l643l061j847n15M92Q31N73J33j97l08n7N34
$$ y = [533868, 547441, 563146, 581043, 601526, 624901, 650596, 677205, 703415, 728650, 752914, 776394, 799247, 821337, 842024, 860475, 876337, 889727, 900471, 907790, 911064, 910580, 907075, 900735, 891045, 877610, 860764, 841334, 820096, 797557, 774005, 749640, 724678, 699382, 673944, 648424, 622999, 598156, 574383, 551588, 529106, 506482, 484107, 462904, 443502, 425997, 410461, 397225, 386366, 377164, 368509, 359849, 351370, 343138, 334533, 324811, 313923, 302379, 290548, 278637, 267216, 257144, 248701, 241274, 234234, 227773, 222555, 218759, 215791, 212907, 209753, 206346, 202825, 199359, 196153, 193342, 190856, 188470, 186138, 184231, 183283, 183343, 183710, 183510, 182405, 180587, 178366, 176195, 174904, 175170, 176504, 177266, 176093, 173076, 169433, 166372, 164525, 164010, 164502, 165333, 165906, 166039, 165842, 165534, 165477, 166011]
63772A66011R07M72m37q45n10k84p75j396j278n34k1j51n68p60n27M0O50R69R46
63753A61909Q85R83J029Q27N91N91O80N47K58J28K08L09M09O76J114J509J745
63736A74398J816J676J374J218J492K017K367K492K744L198L393K988K366K224
63722B05763K727L364L645L607L535L520L547L779M315M722M257K766R06o92k051
63707B47710l282l961l694l010k838l252l421k927k223j735j248n27K07P67J339
63692B17905J891J961J513J311J846K524K614K413K644L121L007K204J520J465
63678B47939J710J829J787J557Q84k52j376j919j586l58J413K936L493L060K183
63663B63300J319P06O10J029J270N70p76j703j875k098k994m058m483m221l703
$$ y = [166011, 166918, 167390, 166953, 166108, 165598, 165314, 164539, 163143, 161865, 161331, 161310, 161159, 160591, 159831, 159304, 159344, 159994, 160963, 161909, 162794, 163777, 164806, 165633, 166224, 166815, 167495, 168042, 168300, 168428, 168636, 168945, 169354, 170030, 171144, 172653, 174398, 176214, 177890, 179264, 180482, 181974, 183991, 186358, 188850, 191594, 194792, 198185, 201173, 203539, 205763, 208490, 211854, 215499, 219106, 222641, 226161, 229708, 233487, 237802, 242524, 246781, 249547, 250453, 249761, 247710, 244428, 240467, 236773, 233763, 230925, 227673, 224252, 221325, 219102, 217367, 216119, 215592, 215799, 216566, 217905, 219796, 221757, 223270, 224581, 226427, 228951, 231565, 233978, 236622, 239743, 242750, 244954, 246474, 247939, 249649, 251478, 253265, 254822, 255706, 255454, 254078, 252159, 250573, 250215, 251628, 254564, 258057, 261117, 263300, 264619, 265325, 265935, 266964, 268234, 268804, 268028, 266325, 264450, 262352, 259358, 255300, 250817, 246596, 242893]
63648B42893l051k227j506j208j145q82l26L49J071J794K267K410K660L456M531
63633B51086N255N525N802O280O579O398N948N626N554N631N813O143O721P664
63619C36025Q910J0068J0750J1116J1802J3213J5118J7061J8822K0372K1737K3184
63607E18178K5262K8201L1390L3832L5054L5230L4393L1989K7510K1270J4295
63596H36604P544J522l425o863q480q466p552o729o880q462j1307j4788j8295
63583G44423k1581k4657k7405k9369k9955k8820k6216k2971k0028j7805j6027
63572D79589j4224j2314j0535q864o845m173j331P05J474J673K474M275O352P837
63558D46093Q765R791J1125J2283J3023J3869J5341J7128J8624K0112K2637K6636
$$ y = [242893, 239842, 237615, 236109, 234901, 233756, 232874, 232548, 232897, 233968, 235762, 238029, 240439, 243099, 246555, 251086, 256341, 261866, 267668, 273948, 280527, 286925, 292873, 298499, 304053, 309684, 315497, 321640, 328361, 336025, 344935, 355003, 365753, 376869, 388671, 401884, 417002, 434063, 452885, 473257, 494994, 518178, 543440, 571641, 603031, 636863, 671917, 707147, 741540, 773529, 801039, 822309, 836604, 844148, 845670, 842245, 835382, 826902, 818436, 810884, 804155, 797275, 788813, 777506, 762718, 744423, 722842, 698185, 670780, 641411, 611456, 582636, 556420, 533449, 513421, 495616, 479589, 465365, 453051, 442516, 433652, 426807, 422634, 421303, 422008, 423482, 425155, 427629, 431904, 438256, 446093, 454858, 464649, 475774, 488057, 501080, 514949, 530290, 547418, 566042, 586154, 608791, 635427]
63546F35427L1396L6164M1175M6751N1567N2682M7785L7264K3940J1030N41o872
63534A008850j1313j3316j3674j3074j1810j0030q229p233p706r812j3347j7913
63522H71393k2922k7680l1732l4935l7135l8017l7462l5847l3719l1326k8729
63511E11889k6189k4025k2123j9968j7309j4561j2335j0757r434q004o605n719
63499C34860n625o040o336o145n617n110m733m293l560k511j382n71l16l79k51
63484B81991J83M84L77L15R31K119L110L443L421L634M370N439O195N834M144
63469C25990K020O02r2j053k648l922l984l306k927k936k615j795j107r19r14
63454C00394q43q72r54o09K41R34J031J055J719K887M025N232O946Q797R762R700
$$ y = [635427, 666823, 702987, 744162, 790913, 842480, 895162, 942947, 980211, 1004151, 1015181, 1015722, 1008850, 997537, 984221, 970547, 957473, 945663, 935633, 927404, 920171, 912465, 902653, 889306, 871393, 848471, 820791, 789059, 754124, 716989, 678972, 641510, 605663, 571944, 540618, 511889, 485700, 461675, 439552, 419584, 402275, 387714, 375379, 364622, 355188, 347184, 340579, 334860, 329235, 323195, 316859, 310714, 305097, 299987, 295254, 290961, 287401, 284890, 283508, 282937, 282621, 282242, 281991, 282174, 282658, 283035, 283350, 284281, 286400, 289510, 292953, 296374, 300008, 304378, 309817, 316012, 321846, 325990, 328010, 328612, 328520, 327467, 324819, 320897, 316913, 313607, 310680, 307744, 305129, 303334, 302227, 301308, 300394, 299551, 298679, 297725, 297116, 297357, 298291, 299322, 300377, 302096, 304983, 309008, 314240, 321186, 329983, 339745, 349445]
63438C49445R913J1673J4859J8547K2488K7262L2979L8343M1128L9569L3480K4475
63426F64161J5071P293J908j135j909m08L014P596J2646J7804K2945K8002L2901
63413H09889L7444M1154M3419M3667M1333L5969K7779J7978Q255p8o239r750j0782
63400A080038j0542j0572j1397j2498j3680j5852j9975k5768l1815l6648l9515
63389H51776m0524m0409l9828l8680l6424l3203k9985k7319k4641k1295j7662
63378E01806j4573j2121r775p301m901k692p55O05J377K359M391P203R788J1747
63364D87158J3536J5477J7483J9699K2513K5719K8563L0825L3098L5755L8374
63353G68200M0506M2240M3541M3686M1816L7622L1225K2941J3603M619k841q318
$$ y = [349445, 359358, 371031, 385890, 404437, 426925, 454187, 487166, 525509, 566637, 606206, 639686, 664161, 679232, 686525, 688433, 687298, 685389, 684981, 687995, 695591, 708237, 726041, 748986, 776988, 809889, 847333, 888487, 931906, 975573, 1016906, 1052875, 1080654, 1098632, 1106887, 1106809, 1100570, 1090820, 1080038, 1069496, 1058924, 1047527, 1035029, 1021349, 1005497, 985522, 959754, 927939, 891291, 851776, 811252, 770843, 731015, 692335, 655911, 622708, 592723, 565404, 540763, 519468, 501806, 487233, 475112, 465337, 458036, 453135, 450443, 449688, 450293, 451670, 454029, 458420, 465623, 475411, 487158, 500694, 516171, 533654, 553353, 575866, 601585, 630148, 660973, 694071, 729826, 768200, 808706, 850946, 894487, 938173, 979989, 1017611, 1048836, 1071777, 1085380, 1089999, 1087158, 1078840]
63341A078840j1665j2769j2135j1077j0772j1481j3113j5961k0147k4852k8885
63330I05983l1861l4176l5959l6791l6364l4796l2262k8842k4840k0686j6340
63319E73066j1319n646o31J591n27o717j4826k1962k6056k6689k4821k1934j9251
63306C94278j7183j5312j3144j0894r248q323p501o423n550n318n378n180m773
63293B80051m484m215l739l339l373l534l265k730k526k586k262j460q18o00l11
63278B40809L13P31M65q3k36P9M82P76R43Q60N24L12O02J289K010K583K901K685
63260B58045J832R03O79J270K077K644L150L900M685N017M812M577M850N595O282
63245C10318O554O733P497R055J0804J1957J2380J2651J3378J4614J6017J7278
$$ y = [1078840, 1067175, 1054406, 1042271, 1031194, 1020422, 1008941, 995828, 979867, 959720, 934868, 905983, 874122, 839946, 803987, 767196, 730832, 696036, 663774, 634932, 610092, 589406, 573066, 561747, 556101, 555470, 557061, 556534, 549817, 534991, 513029, 486973, 460284, 435463, 413529, 394278, 377095, 361783, 348639, 337745, 328497, 320174, 312673, 306250, 300700, 295382, 290004, 284824, 280051, 275567, 271352, 267613, 264274, 260901, 257367, 254102, 251372, 248846, 246260, 243998, 242538, 241720, 241120, 240809, 241122, 241853, 242318, 242235, 241999, 242078, 242560, 243336, 244279, 245139, 245663, 245975, 246577, 247866, 249876, 252459, 255360, 258045, 259877, 260780, 261459, 262729, 264806, 267450, 270600, 274500, 279185, 284202, 289014, 293591, 298441, 304036, 310318, 316872, 323605, 331102, 340157, 350961, 362918, 375298, 387949, 401327, 415941, 431958, 449236]
63233D49236J8296J9007J9342J9371J9355J9463J9551J9367J8938J8549J8332
63222F58807J8121J7828J7664J7800J8034J8099J8022J7816J6868J4303J0057
63211H43419N212Q65k997p186j2050j6953k0995k3851k5785k7044k7486k6738
63199F58411k4621k1444j7959j4888j2382r946p055l838q82J637M309P645J1226
63186E70213J4120J6074J7717J9537K1254K2451K3224K3640K3193K1521J9435
63175G92379J8331J8527J8941J8624J7769J6867J5587J3196R692N714J496l410
63163I43713r213j5271k0607k4795k8087l0911l3377l5201l5943l5440l4014l2205
63151F08649l0287k8179k5797k3265k0735j8190j5678j3548j2196j1575j1141
$$ y = [449236, 467532, 486539, 505881, 525252, 544607, 564070, 583621, 602988, 621926, 640475, 658807, 676928, 694756, 712420, 730220, 748254, 766353, 784375, 802191, 819059, 833362, 843419, 848631, 849496, 846499, 839313, 827263, 810310, 789315, 765464, 739679, 712635, 685149, 658411, 633790, 612346, 594387, 579499, 567117, 557171, 550116, 546278, 545396, 547033, 551342, 558987, 570213, 584333, 600407, 618124, 637661, 658915, 681366, 704590, 728230, 751423, 772944, 792379, 810710, 829237, 848178, 866802, 884571, 901438, 917025, 930221, 939913, 945627, 947123, 943713, 934500, 919229, 898622, 873827, 845740, 814829, 781452, 746251, 710308, 674868, 640854, 608649, 578362, 550183, 524386, 501121, 480386, 462196, 446518, 432970, 420774, 409199, 398058]
63140C98058j0424r477q596p771o716n437m366l686k905j572k37K9q49j543r30
63125C33578M54J208R67P11J244K188K824L113L436L762L791L608L609L822L894
63110C72209L685L456L415L501L650L795L609K773J602R85J332K087K525K685
63096D11309L070L792M448M689M495L925L009J823M97q59k010k535k183j209j32
63081D32129O82J062R26N36N42J357K606L598M215M876N828O949Q194R563J0750
63066D93813J1444J2000J3126J4811J6280J7220J8328K0222K2525K4522K6232
63055F90523K8227L0739L3493L6237L8940M1573M3977M5846M6798M6764M6404
63044A129521M6566M7159M7139M6005M4607M3983M4061M4241M4606M5527M6396
$$ y = [398058, 387634, 378157, 369561, 361790, 355074, 349637, 345271, 341585, 338680, 337108, 336871, 336900, 336051, 334508, 333578, 334032, 335240, 336207, 336918, 338162, 340350, 343174, 346287, 349723, 353485, 357276, 360884, 364493, 368315, 372209, 375894, 379350, 382765, 386266, 389916, 393711, 397320, 400093, 401695, 402680, 404012, 406099, 408624, 411309, 414379, 418171, 422619, 427308, 431803, 435728, 438737, 440560, 441057, 440198, 438188, 435653, 433470, 432261, 432129, 432811, 433873, 434799, 435335, 435877, 437234, 439840, 443438, 447653, 452529, 458357, 465306, 473500, 483063, 493813, 505257, 517257, 530383, 545194, 561474, 578694, 597022, 617244, 639769, 664291, 690523, 718750, 749489, 782982, 819219, 858159, 899732, 943709, 989555, 1036353, 1083117, 1129521, 1176087, 1223246, 1270385, 1316390, 1360997, 1404980, 1449041, 1493282, 1537888, 1583415, 1629811]
63033A629811M5890M3456L9587L4582K7978J9466R563r79j1752k2352l2078m0405
63021A742767m7348n2981n7012n9086n9169n7365n3736m8627m2808l6912l1002
63010A196721k4897j8600j2144n361J761Q772J5083K0462K4933K8491L1211L3409
62998A299841L5297L6657L7271L7399L7431L7219L6351L5010L3952L3439L2699
62987A692566L0695K7075K2070J5829Q353p1q858j7611k6405l5401m4356n2562
62975A611324n9226o3943o6895o8598o9315o8761o6547o2837n8313n3553m8756
62964I24580m4092l9835l5922l1947k7901k4549k2505k1302j9956j8214j6567
62953F21790j5205j3820j2495j1807j1846j1967j1890j2140j2857j3037j1874
$$ y = [1629811, 1675701, 1719157, 1758744, 1793326, 1821304, 1840770, 1850333, 1849354, 1837602, 1815250, 1783172, 1742767, 1695419, 1642438, 1585426, 1526340, 1467171, 1409806, 1356070, 1307443, 1264635, 1227723, 1196721, 1171824, 1153224, 1141080, 1135719, 1137480, 1146252, 1161335, 1181797, 1206730, 1235221, 1266432, 1299841, 1335138, 1371795, 1409066, 1446465, 1483896, 1521115, 1557466, 1592476, 1626428, 1659867, 1692566, 1723261, 1750336, 1772406, 1788235, 1796588, 1796517, 1787659, 1770048, 1743643, 1708242, 1663886, 1611324, 1552098, 1488155, 1421260, 1352662, 1283347, 1214586, 1148039, 1085202, 1026889, 973336, 924580, 880488, 840653, 804731, 772784, 744883, 720334, 697829, 676527, 656571, 638357, 621790, 606585, 592765, 580270, 568463, 556617, 544650, 532760, 520620, 507763, 494726, 482852]
62942D82852j0253r787j0614j1197j0381q754p638p451p475o930n805m782m480
62929C77305m777m957m547l796l126k522j806j211j140j411j408r34m73m66p75
62914C43956r82q93o31m26l55k35J57O03M87m24j548k241k575k908l030k502j581
62897C24872j037j029r99p39p16j128j328o55O29J651J817J244N32K95N97Q49
62881C24855N39m1k04J16L96M48O03R01Q56K90k56k89pJ18n8m18q04r51o53j56
62861C25285L7j61m37p31j202j550j163j48N72M93J03l5P7M16J247K311K687K009
62843C29810J066N45J6j016j861j479k3J337J841J613J093O96P57J117J155P45
62827C37412O33J271J948J863J413J376J504J080M24N25J364J937J898K017K862
$$ y = [482852, 472599, 462812, 452198, 441001, 430620, 421866, 414228, 406777, 399302, 392372, 386567, 381785, 377305, 372528, 367571, 363024, 359228, 356102, 353580, 351774, 350563, 349423, 348012, 346604, 345670, 345197, 344731, 343956, 342974, 342081, 341450, 341024, 340669, 340434, 340591, 341194, 341681, 341257, 339709, 337468, 334893, 331985, 328955, 326453, 324872, 323835, 322806, 321807, 321068, 320352, 319224, 317896, 317241, 317870, 319521, 321338, 322582, 323114, 323409, 324006, 324855, 325394, 325353, 325149, 325265, 325661, 326109, 326712, 327613, 328469, 328759, 328503, 328214, 328207, 328325, 328267, 327849, 327045, 326094, 325441, 325285, 325322, 325161, 324724, 323993, 322791, 321241, 320078, 319930, 320502, 320995, 321098, 321063, 321140, 321556, 322803, 325114, 327801, 329810, 330876, 331421, 331437, 330421, 328560, 327081, 327058, 328395, 330236, 331849, 332942, 333638, 334395, 335512, 336667, 337412, 338045, 339316, 341264, 343127, 344540, 345916, 347420, 348500, 348924, 349449, 350813, 352750, 354648, 356665, 359527]
62812C59527M080N129N781N871N422N131N733O803P173O630O138O237O419O483
62798D42557P261R343J1937J3796J4580J4759J4792J5120J6332J8688K1759K5091
62786F26015K8741L2803L6937M0902M5093M9961N5252O0415O5351P0197P4628
62775A186295P7914P9535P9245P6803P2175O5807N8160M9036L7852K4581J0089
62764A817492m544j8660l1985m4188n4627o2614o7954p1216p3165p3962p3196
62753A241381p0797o7466o3977o0449n6568n2294m7987m4081m0829l8126l5363
62742F63444l1803k7469k3374k0508j8807j7455j5908j4203j2359j0241q042o381
62730D56894n554n001l906k237q32l42l92p6Q64J847K521L391M968O759P842Q281
$$ y = [359527, 363607, 368736, 374517, 380388, 385810, 390941, 396674, 403477, 410650, 417280, 423418, 429655, 436074, 442557, 449818, 459161, 471098, 484894, 499474, 514233, 529025, 544145, 560477, 579165, 600924, 626015, 654756, 687559, 724496, 765398, 810491, 860452, 915704, 976119, 1041470, 1111667, 1186295, 1264209, 1343744, 1422989, 1499792, 1571967, 1637774, 1695934, 1744970, 1782822, 1807403, 1817492, 1812948, 1794288, 1762303, 1718115, 1663488, 1600874, 1532920, 1461704, 1388539, 1314577, 1241381, 1170584, 1103118, 1039141, 978692, 922124, 869830, 821843, 777762, 736933, 698807, 663444, 631641, 604172, 580798, 560290, 541483, 524028, 508120, 493917, 481558, 471317, 463275, 456894, 451340, 446339, 442433, 440196, 439364, 439022, 438630, 438554, 439418, 441265, 443786, 447177, 452145, 458904, 466746, 475027]
62714D75027R178J1184J3744J6019J7920J9824K1880K4110K6813L0257L4298L8707
62702G38961M3606M9100N4790O0130O5121P0048P4621P7991P9704Q0179P9867
62691A474118P8322P4455O7668N8438M7596L5334K1270N635j0168k4670l7641
62680A790357m9720o0856o9968p6231p9867q1356q0736p8194p4604p0763o6619
62669A001443o1972n7320n3194m9114m4353l9424l5647l3231l0884k7619k3946
62658E44739k0886j8638j6814j5248j3959j2686j1108r301p633o451o136o963
62646C98916q496r486q995p393n796m751m013l390l027k862k443j609p87l35j9
62631C35514M42P01K26p36j249q71k14r5m69o24k00M33P84Q14Q05R86J427K062
$$ y = [475027, 484205, 495389, 509133, 525152, 543072, 562896, 584776, 608886, 635699, 665956, 700254, 738961, 782567, 831667, 886457, 946587, 1011708, 1081756, 1156377, 1234368, 1314072, 1394251, 1474118, 1552440, 1626895, 1694563, 1753001, 1800597, 1835931, 1857201, 1862836, 1852668, 1827998, 1790357, 1740637, 1679781, 1609813, 1533582, 1453715, 1372359, 1291623, 1213429, 1138825, 1068062, 1001443, 939471, 882151, 828957, 779843, 735490, 696066, 660419, 627188, 596304, 568685, 544739, 523853, 505215, 488401, 473153, 459194, 446508, 435400, 426099, 418466, 412015, 405879, 398916, 390420, 380934, 371939, 364546, 358750, 353999, 349986, 346596, 343569, 340707, 338264, 336655, 335868, 335533, 335514, 335956, 336657, 336883, 336147, 334898, 334027, 333813, 333718, 333249, 332625, 332425, 332858, 333642, 334456, 335261, 336247, 337674, 339736]
62613C39736K674L089L496M284N403O326O912P853R694J1787J2978J3240J3828
62600D41300J5599J7971J9984K1696K3887K6857L0160L3342L6212L8434L9508
62589G44950L9245L7784L5049L0737K5048J8834J2693O357o72q162j5308k1482
62577I05073k6443l0049l2362l3846l4928l5442l4998l3803l2405l0744k8275
62566E51778k5247k2879k1683k0557j8301j5386j3172j1896j0616q982p717p142
62554C68200o448m988l331k327j979j927k305l189l735l026j499m67k67OQ12J357
62538C34887J018O26J437L288M726M786L959L315L356L948M866O007P176Q134
62524C91529Q884R842J1547J4159J7224K0042K2308K4426K7074L0509L4381L8115
$$ y = [339736, 342410, 345499, 348995, 353279, 358682, 365008, 371920, 379773, 389467, 401254, 414232, 427472, 441300, 456899, 474870, 494854, 516550, 540437, 567294, 597454, 630796, 667008, 705442, 744950, 784195, 821979, 857028, 887765, 912813, 931647, 944340, 950697, 950025, 941863, 926555, 905073, 878630, 848581, 816219, 782373, 747445, 712003, 677005, 643202, 610797, 580053, 551778, 526531, 503652, 481969, 461412, 443111, 427725, 414553, 402657, 392041, 383059, 375342, 368200, 361752, 356764, 353433, 351106, 349127, 347200, 344895, 341706, 337971, 334945, 333446, 332979, 332712, 332718, 333530, 334887, 335905, 336531, 337968, 341256, 345982, 350768, 354727, 358042, 361398, 365346, 370212, 376219, 383395, 391529, 400413, 410255, 421802, 435961, 453185, 473227, 495535, 519961, 547035, 577544, 611925, 650040]
62512F50040M1278M3552M4674M4619M3703M2255M0149L6903L2147K5796J7854
62501A062970Q522j293j0067j6704k1414k5195k8572l1213l2678l3002l2432l1037
62489H07885k8865k6080k2782j8954j4852j1081p938m994j668J949N323Q369J1537
62476F97849J4945J7869J9381J9253J8116J6775J5465J3705J0852O860K367k017
62464H51420o319j0846j5514j9868k3671k6926k9383l0524l0278k9345k8538k8056
62452E72152k7568k6681k5146k2888k0161j7435j4969j2676j0597r047q001o777
62440C70206m951l208k565k837k752j642k47N24Q28J226J494R10m28j516j753
62425C53289j652j990k813l645m244m697m956m793m209l633l500l751l826l163
$$ y = [650040, 691318, 734870, 779544, 824163, 867866, 910121, 950270, 987173, 1019320, 1045116, 1062970, 1071492, 1070199, 1060132, 1043428, 1022014, 996819, 968247, 937034, 904356, 871354, 838922, 807885, 779020, 752940, 730158, 711204, 696352, 685271, 677333, 672339, 670671, 672620, 677943, 686312, 697849, 712794, 730663, 750044, 769297, 787413, 804188, 819653, 833358, 844210, 851070, 853437, 851420, 845101, 834255, 818741, 798873, 775202, 748276, 718893, 688369, 658091, 628746, 600208, 572152, 544584, 517903, 492757, 469869, 449708, 432273, 417304, 404628, 394031, 384984, 376983, 370206, 365255, 362047, 359482, 356645, 353893, 352251, 352004, 352528, 353356, 354582, 356076, 356986, 356558, 355042, 353289, 351637, 349647, 346834, 343189, 338945, 334248, 329292, 324499, 320290, 316657, 313157, 309406, 305580, 302417]
62411C02417j825n71k06p56j452j552j052n07l17l63k89J29P67J245J229P57K36
62394B97890N9L18R24J732K431K511J723N12k66r8Q39K001K907L292L212L046
62378C23033L233L895M826N803O745P657Q542R474J0524J1624J2662J3686J4861
62365D36565J6243J7819J9673K1842K4109K6251K8548L1633L5782M0676M5926
62354G45067N1380N6759O1370O4482O5627O4330N9994N2562M3018L2751K2490
62343A319830J2398K892n304j2143j8600k5612l2933l9504m4709m8730n1753n3359
62331A002473n3084n1149m8226m4554l9868l4364k9182k5470k3155k1169j8843
62320F13409j6604j5181j4621j4389j4170j4127j4473j5049j5392j5112j4209
$$ y = [302417, 300592, 300021, 299815, 299059, 297607, 296055, 295003, 294496, 294179, 293816, 293527, 293656, 294423, 295668, 296897, 297654, 297890, 297949, 298267, 299191, 300923, 303354, 305865, 307588, 308100, 307834, 307736, 308575, 310576, 313483, 316775, 319987, 323033, 326266, 330161, 334987, 340790, 347535, 355192, 363734, 373208, 383732, 395356, 408018, 421704, 436565, 452808, 470627, 490300, 512142, 536251, 562502, 591050, 622683, 658465, 699141, 745067, 796447, 853206, 914576, 979058, 1044685, 1109015, 1169009, 1221571, 1264589, 1297340, 1319830, 1332228, 1335120, 1329816, 1317673, 1299073, 1273461, 1240528, 1201024, 1156315, 1107585, 1055832, 1002473, 949389, 898240, 850014, 805460, 765592, 731228, 702046, 676576, 653421, 632252, 613409, 596805, 581624, 567003, 552614, 538444, 524317, 509844, 494795, 479403, 464291, 450082]
62309D50082j3122j2363j2002j1547j0443q645o639n028m110l762l633l478l262
62296C52048k902k131r31Jk18j443k338j808k89Q53J034R56J465K442L155L283
62280C53177L222L450L917M209M168M162M647N572O356O557O402O592P572R142
62266D29145J0741J2124J3578J5564J8165K1132K4363K8098L2431L6896M0974
62255F83211M4868M9281N4375N9365O3350O6027O7241O6132O1428N2701M1100
62244A309079K8693J7147O972k194j0791j8888k6392l3428m0304m7096n3428n8606
62232A070764o1855o2604o0920n7623n3739m9692m5234m0131l4693k9652k5694
62221E48927k2983k0980j8883j6570j4812j4085j3571j2097r842q134p521p154
$$ y = [450082, 436960, 424597, 412595, 401048, 390605, 381960, 375321, 370293, 366183, 362421, 358788, 355310, 352048, 349146, 347015, 346084, 346085, 345867, 344424, 342086, 340278, 339989, 340842, 341876, 342832, 344297, 346739, 349894, 353177, 356399, 359849, 363766, 367975, 372143, 376305, 380952, 386524, 392880, 399437, 405839, 412431, 420003, 429145, 439886, 452010, 465588, 481152, 499317, 520449, 544812, 572910, 605341, 642237, 683211, 728079, 777360, 831735, 891100, 954450, 1020477, 1087718, 1153850, 1215278, 1267979, 1309079, 1337772, 1354919, 1361891, 1359697, 1348906, 1330018, 1303626, 1270198, 1229894, 1182798, 1129370, 1070764, 1008909, 946305, 885385, 827762, 774023, 724331, 679097, 638966, 604273, 574621, 548927, 525944, 504964, 486081, 469511, 454699, 440614, 427043, 414946, 405104, 396970, 389449, 382295]
62209C82295o285n296m741m368l817l346l108k514j231q2N9l12j04P15J341J649
62193C50855K214L155M068N093O656Q236Q675P996P616Q362R465J0036J0303J0672
62179D53402J0628R632Q306P640P578P341O898P064Q189R775J1440J3566J6690
62166E78149K0753K5300L0078L5084M0182M4814M8173M9637M9023M6452M2014
62155A009659L5721K7820J9015J0281K550l683q678j3393j8680k4483l0065l4926
62143I71138l8985m1887m2826m1506l8747l5641l2388k8517k3980j9385j5114
62132F12162j0878o457k367O50K671M605P165J0178J3050J5476J7314J8019J6916
62119F98504J4072J0429O928L987J963J327J880K343J466q38l922p536j1601j5319
$$ y = [382295, 376010, 370714, 365973, 361605, 357788, 354442, 351334, 348820, 347589, 347507, 347566, 347254, 347150, 347865, 349206, 350855, 353069, 356224, 360292, 365385, 372041, 380277, 388952, 396948, 404564, 412926, 422391, 432427, 442730, 453402, 464030, 473662, 481968, 489608, 497186, 504527, 511425, 518489, 526678, 536453, 547893, 561459, 578149, 598902, 624202, 654280, 689364, 729546, 774360, 822533, 872170, 921193, 967645, 1009659, 1045380, 1073200, 1092215, 1102496, 1105046, 1101363, 1092685, 1079292, 1060612, 1036129, 1006064, 971138, 932153, 890266, 847440, 805934, 767187, 731546, 699158, 670641, 646661, 627276, 612162, 601284, 594827, 592460, 593110, 595781, 600386, 607551, 617729, 630779, 646255, 663569, 681588, 698504, 712576, 723005, 729933, 733920, 735883, 737210, 739090, 741433, 742899, 742061, 738139, 730603, 719002, 703683]
62105G03683j7500j7882j7252j6201j4606j2500j0416q586o556m027j499L80J590
62092E78628K514L474M723O356P902Q567Q232P698P688Q196R073J0498J2409J4144
62078F90102J5271J6192J7403J8663J9554K0307K1379K2573K3294K3433K3341
62067I11512K3187K2977K3019K3761K5283K7377K9909L2674L5066L6347L6040
62056A227152L3792K9288K2844J5663Q974L120k150p038j1864j7296k3537k9731
62044A249217l4963l9448m3849m7769n0024n0265m9250m7548m5102m2137l9352
62033G59510l6880l4009l0403k6802k3994k1826j9651j7221j4677j2185j0000
62022E11862q470p635p129o761o727p071p478p786q183q560q256o874m987l538
$$ y = [703683, 686183, 668301, 651049, 634848, 620242, 607742, 597326, 588740, 582184, 578157, 576658, 577038, 578628, 581142, 584616, 589339, 595695, 603597, 612164, 620396, 628094, 635782, 643978, 653051, 663549, 675958, 690102, 705373, 721565, 738968, 757631, 777185, 797492, 818871, 841444, 864738, 888171, 911512, 934699, 957676, 980695, 1004456, 1029739, 1057116, 1087025, 1119699, 1154765, 1191112, 1227152, 1260944, 1290232, 1313076, 1328739, 1337713, 1340833, 1338683, 1331645, 1319781, 1302485, 1278948, 1249217, 1214254, 1174806, 1130957, 1083188, 1033164, 982899, 933649, 886101, 840999, 798862, 759510, 722630, 688621, 658218, 631416, 607422, 585596, 565945, 548724, 534047, 521862, 511862, 503392, 495757, 488628, 481867, 475140, 468069, 460591, 452805, 444622, 436062, 427806, 420932, 415945, 412407]
62008D12407k929k892k879k311q44J180K974M214N337O610P481P308O276N044
61994D46976L850K553J189r3j409k870m123m759n029n555o406p086p395p643p931
61979C94269p862p220o434o001n859n611n143m611m032l278k466j964j880j767
61965C30141j087R8J115J431J195Q98P27N72N02Q37J647K628L586M614N601O019
61949C60524N613N047N335O718Q556J0167J1398J2355J3116J3873J4987J6629
61937D84318J8486J9995K0779K0821K0391J9863J9485J9234J8937J8425J7449
61926F98183J5692J3142J0342P923N794L223j79l928p252r788j1537j2448j2469
61913F96698j1722j0337q238n395k141J202M808R017J3460J6993J8712J8765J7928
$$ y = [412407, 409478, 406586, 403707, 401396, 400552, 401732, 404706, 408920, 414257, 420867, 428348, 435656, 441932, 446976, 450826, 453379, 454568, 454475, 453066, 450196, 446073, 441314, 436285, 430730, 424324, 417238, 409843, 402200, 394269, 386407, 379187, 372753, 366752, 360893, 355282, 350139, 345528, 341496, 338218, 335752, 333788, 331908, 330141, 329054, 329152, 330267, 331698, 332893, 333791, 334518, 335090, 335592, 336429, 338076, 340704, 344290, 348904, 354505, 360524, 366137, 371184, 376519, 383237, 391793, 401960, 413358, 425713, 438829, 452702, 467689, 484318, 502804, 522799, 543578, 564399, 584790, 604653, 624138, 643372, 662309, 680734, 698183, 713875, 727017, 737359, 745282, 751076, 754299, 754120, 750192, 742940, 733152, 721615, 709167, 696698, 684976, 674639, 666401, 661006, 658865, 660067, 664875, 673892, 687352, 704345, 723057, 741822, 759750]
61900G59750J6646J4708J1724P674L001j757o326j0717j4852j8344k0775k2142
61888G18590k2746k2763k2274k1614k1192k0837j9786j7682j5154j3121j1863
61877E09558j1158j0909j1037j1023j0205q562o701n077l696k503j500m75Q24
61864D27536K160L037L566M509O232Q165R617J0611J1592J2875J4734J7493K0981
61851E53108K4312K6811K8822L1073L3510L5410L6383L6642L6323L5230L3221
61840I10845L0263K6028K0048J2597M906j800p331j2276j6891k0440k1704k0093
61828I04152j6277j1649p182k916J522O197J0880J5245J8777K0735K0621J8486
61816I78591J4528Q716J260o946j4832k1918k8066l2925l6283l8629m0520m1487
$$ y = [759750, 776396, 791104, 802828, 810502, 813503, 811746, 805420, 794703, 779851, 761507, 740732, 718590, 695844, 673081, 650807, 629193, 608001, 587164, 567378, 549696, 534542, 521421, 509558, 498400, 487491, 476454, 465431, 455226, 446664, 439963, 434886, 431190, 428687, 427187, 426712, 427536, 429696, 432733, 436299, 440808, 447040, 455205, 464822, 475433, 487025, 499900, 514634, 532127, 553108, 577420, 604231, 633053, 664126, 697636, 733046, 769429, 806071, 842394, 877624, 910845, 941108, 967136, 987184, 999781, 1004687, 1002887, 995556, 983280, 966389, 945949, 924245, 904152, 887875, 876226, 869044, 866128, 867650, 873847, 884727, 899972, 918749, 939484, 960105, 978591, 993119, 1001835, 1003095, 996149, 981317, 959399, 931333, 898408, 862125, 823496, 782976, 741489]
61804G41489m0559l7894l4923l2610l0485k7786k4636k1590j8791j6239j4311
61793D41665j3237j2494j1431j0139r072q137o932n684n157n517n970n761n021
61780C37113m357l983l600k997k411k251k571k933k849k301j722j507j706k097
61766B99828k308j897p27O36J287R67L88L22O97R11P69O85R93J490J716J509J273
61749C08539J590K508L269L094K211J624J746J861J289M08J0J20K57N28J566L313
61733C33933M713M918M284L813M057M825N613N958N609M708L798L430L666M050
61719C97375M046L566K995K693K578K410K319K586K836K082M6k154l260l492m050
61704D12576n283o284o369o008n907n977n777n365n081m873m462l947l643l426
$$ y = [741489, 700930, 663036, 628113, 595503, 565018, 537232, 512596, 491006, 472215, 455976, 441665, 428428, 415934, 404503, 394364, 385292, 377155, 370223, 364539, 359382, 353865, 347895, 342134, 337113, 332756, 328773, 325173, 322176, 319765, 317514, 314943, 312010, 309161, 306860, 305138, 303631, 301925, 299828, 297520, 295623, 294896, 295532, 296819, 297786, 298174, 298496, 299193, 300104, 300873, 301558, 302551, 304041, 305757, 307266, 308539, 310129, 312637, 315906, 319000, 321211, 322835, 324581, 326442, 327731, 328139, 328149, 328269, 328526, 329054, 330620, 333933, 338646, 343564, 347848, 351661, 355718, 360543, 366156, 372114, 377723, 382431, 386229, 389659, 393325, 397375, 401421, 404987, 407982, 410675, 413253, 415663, 417982, 420568, 423404, 425486, 425532, 423378, 420118, 416626, 412576, 407293, 401009, 394640, 388632, 382725, 376748, 370971, 365606, 360525, 355652, 351190, 347243, 343600, 340174]
61690C40174k841j820q99n72q07j227j552j729j832j884j726j186m28K7j34o01
61674C20963q36p55p09q88j091j087q72n34j25K27L75L71M07M68L13o6k41J25
61656C16045Q16J342J569J787K251K871L319L348L049K929L497M618N447N366
61642C58254M776M646N302O167O651O731O476N573L868J917M30o64j991l604m754
61627C99778m913m482m129l946l649l259l071l044k802k237j667j312r38k48O58
61612C60739J439J833J686Q17p86k705m293n213n635n918o208o367o156n516m680
61597C13037l975l470k984k602k847l930n015m896l538k345k461l317l536k817
61583B65304k166k302k681k428j556q23p49j214j752j936j633j191j164j688k317
$$ y = [340174, 337333, 335513, 334614, 334042, 333235, 332008, 330456, 328727, 326895, 325011, 323285, 322099, 321671, 321698, 321564, 320963, 320127, 319372, 318663, 317775, 316684, 315597, 314725, 314191, 314066, 314293, 314668, 315039, 315446, 315914, 316227, 316161, 315920, 316045, 316861, 318203, 319772, 321559, 323810, 326681, 330000, 333348, 336397, 339326, 342823, 347441, 352888, 358254, 363030, 367676, 372978, 379145, 385796, 392527, 399003, 404576, 408444, 410361, 410791, 410127, 408136, 404532, 399778, 394865, 390383, 386254, 382308, 378659, 375400, 372329, 369285, 366483, 364246, 362579, 361267, 360329, 360081, 360739, 362178, 364011, 365697, 366514, 365728, 363023, 358730, 353517, 347882, 341964, 335756, 329389, 323233, 317717, 313037, 309062, 305592, 302608, 300006, 297159, 293229, 288214, 283318, 279780, 277435, 274974, 271657, 268121, 265304, 263138, 260836, 258155, 255727, 254171, 253348, 252599, 251385, 249633, 247697, 246064, 244873, 243709, 242021, 239704]
61568B39704k628k621k284j331J35J166R01k30r59p73l60m46r16j291j381j172
61552B25514o20L5K62j10n56n04P5R35J921K658K457J171k57p64m04KJ92N94J287
61533B33888J720J636J395J147N44l20m92N09J611J344j81j435j564j355j861
61518B36586k920l592l462k879k195j466p85l42j41mN1j64n66p94p25o57q21j088
61500B14036j269j430j641j772j757j736j691j314o22k96q33j619j532m06P24
61485A96842R46L68m52j250j839j777q26N04J450J913K392L083L551L347K563
61470B10815J568N79l38r96j161q54m15j82j89k29j88j72l29n85o68m15N0M84
61452B06775P70R39J008Q66M43m3j57K40O84N89Q2o3N51J384J721J695J943K557
$$ y = [239704, 237076, 234455, 232171, 230840, 230975, 232141, 233042, 232812, 231853, 231080, 230720, 230274, 229358, 228067, 226686, 225514, 224894, 224929, 225191, 225081, 224525, 224021, 224096, 225031, 226952, 229610, 232067, 233238, 232981, 232217, 231813, 231815, 232007, 232601, 233888, 235608, 237244, 238639, 239786, 240330, 240010, 239518, 240027, 241638, 242982, 242801, 241366, 239802, 238447, 236586, 233666, 230074, 226612, 223733, 221538, 220072, 219287, 218945, 218804, 218800, 218851, 218687, 218121, 217327, 216602, 215945, 215124, 214036, 212767, 211337, 209696, 207924, 206167, 204431, 202740, 201426, 200804, 200508, 199675, 198056, 196524, 196118, 196842, 197788, 198156, 197704, 196454, 194615, 192838, 192012, 192516, 193966, 195879, 198271, 201354, 204905, 208252, 210815, 212383, 212962, 212624, 211628, 210467, 209613, 209198, 209016, 208827, 208598, 208410, 208238, 207909, 207324, 206656, 206241, 206291, 206775, 207545, 208484, 209492, 210358, 210801, 210758, 210601, 210841, 211525, 212114, 212196, 212133, 212684, 214068, 215789, 217484, 219427, 221984]
61434B21984K973K870K568K392K225J879J453J089P61N03M60N03K92p8j6O61J332
61417B43851J544J762K513L280L091K032J235J296J573J238L34n77j291j945k512
61402B57424k748k575k181j854j800k031k256k106j609j282j531k093k270j662
61388B29426n37M62Q21M84j92p73j074j139r05j95Q49J586J462O80Rp3K27M96
61370B31614O24O78O11M06L94R65J999K852L068K866K737K784K713K410K199K450
61354B61370L073L621L886M266N319O957Q270Q385P396O170N286M604L863L267
61340C35733L105L278L575M116N018N835N902N195M354L881L705L572L326K769
61326C93364J747M37q21k080l632n207n886n189l753k566j877j293n95L2M46Q22
$$ y = [221984, 224957, 227827, 230395, 232787, 235012, 236891, 238344, 239433, 240194, 240697, 241157, 241660, 241952, 241874, 241858, 242519, 243851, 245395, 247157, 249670, 252950, 256041, 258073, 259308, 260604, 262177, 263415, 263749, 263172, 261881, 259936, 257424, 254676, 252101, 249920, 248066, 246266, 244235, 241979, 239873, 238264, 236982, 235451, 233358, 231088, 229426, 228889, 229351, 230172, 230656, 230464, 229691, 228617, 227478, 226573, 226378, 227227, 228813, 230275, 230955, 230964, 230891, 231118, 231614, 232238, 232916, 233527, 233933, 234327, 235292, 237291, 240143, 243211, 246077, 248814, 251598, 254311, 256721, 258920, 261370, 264443, 268064, 271950, 276216, 281535, 288492, 296762, 305147, 312543, 318713, 323999, 328603, 332466, 335733, 338838, 342116, 345691, 349807, 354825, 360660, 366562, 371757, 376111, 379992, 383697, 387269, 390595, 393364, 395111, 395548, 394727, 392647, 389015, 383808, 377922, 372733, 368980, 366414, 364537, 363244, 362649, 362681, 363127, 363949]
61310C63949J426K361L477M424M929N144N505O123O561O332N341L765J813j22
61296D21028j526k290k900l702m319m194l515l051l212l643l774l373k609j859
61282C77061j507j662k098k521k768k619j738j34J526K473K659K670K895L167
61268C77404L216L108L091L253L461L576L731M347N758P680R236R696R095Q008
61254D54660O901N905N017M259L707L503L787M440N073N372N283M731L561J930
61240E18129M96j72k19k60p15j604k820m253n671o709p041o561n535m483l657
61225D68925k678j204J86M71k84p64j30Q75J198R97J123J666K081K268K516K604
61209D79850K028J001L09J43M5l8L75J249J849J933K188L134M381N470O710Q526
$$ y = [363949, 365375, 367736, 371213, 375637, 380566, 385710, 391215, 397338, 403899, 410231, 415572, 419337, 421150, 421028, 419502, 417212, 414312, 410610, 406291, 402097, 398582, 395531, 392319, 388676, 384902, 381529, 378920, 377061, 375554, 373892, 371794, 369273, 366505, 363886, 362148, 362014, 363540, 366013, 368672, 371342, 374237, 377404, 380620, 383728, 386819, 390072, 393533, 397109, 400840, 405187, 410945, 418625, 427861, 437557, 446652, 454660, 461561, 467466, 472483, 476742, 480449, 483952, 487739, 492179, 497252, 502624, 507907, 512638, 516199, 518129, 518625, 518453, 518234, 517974, 517259, 515655, 512835, 508582, 502911, 496202, 489161, 482600, 477065, 472582, 468925, 466247, 465043, 465229, 465700, 465416, 464652, 464522, 465397, 466595, 467592, 468715, 470381, 472462, 474730, 477246, 479850, 481878, 482879, 483188, 483331, 483376, 483338, 483713, 484962, 486811, 488744, 490932, 494066, 498447, 503917, 510627, 519153]
61193E19153J0590J2223J3278J3987J4151J3154J0756P624M919L469L283L747
61181F30334M306M932N753O503O687O247N600N038M473L830L244K793K421K193
61167F94354K209K135J328l64k224l383l707l805m386n707p462r024r933j0144
61153F39887r827r082q068p154o585o145n622n378n971p273q562r476j0282j1080
61139E29382j1332j0498q803p067n928n388m941m132l037k167j743j420q62j39
61125D61925P72K296M421O077O359O049O856R129J1515J2927J3803J5007J6564
61112E73700J8087J9577K1090K2245K2800K3299K4404K5826K6439K5461K3140
61101H26068K0443J8215J6519J4600J1704Q035M720K707J933J440J16k615o345
$$ y = [519153, 529743, 541966, 555244, 569231, 583382, 596536, 607292, 614916, 619835, 623304, 626587, 630334, 634640, 639572, 645325, 651828, 658515, 664762, 670362, 675400, 679873, 683703, 686947, 689740, 692161, 694354, 696563, 698698, 700026, 699662, 697438, 694055, 690348, 686543, 682157, 676450, 668988, 659964, 650031, 639887, 630060, 620978, 612910, 605756, 599171, 593026, 587404, 582026, 576055, 568782, 560220, 550744, 540462, 529382, 518050, 507552, 498749, 491682, 485754, 480366, 475425, 471293, 468256, 466089, 464346, 462926, 462064, 461925, 462697, 464993, 469414, 475491, 481850, 487899, 494755, 503884, 515399, 528326, 542129, 557136, 573700, 591787, 611364, 632454, 654699, 677499, 700798, 725202, 751028, 777467, 802928, 826068, 846511, 864726, 881245, 895845, 907549, 915584, 920304, 923011, 924944, 926384, 926500, 923885, 917540]
61088I17540r908j2431j4040j5270j6137j6363j6208j6283j6668j6950j7081j7338
61076G32863j7456j6796j5435j4211j3488j2736j1570j0316r247q118o772n497
61064E91221m436l345k161j170l62O49J905L082M226N690P205Q043Q238Q701R821
61049F37307J1012J1904J2924J4338J5815J7316J9337K1875K4245K6306K8759
61038H41138L1850L4949L7823M1010M4519M7537M9842N2014N3837N4288N3822
61027A342629N4795N8633O4418P1213P9658Q9913J00128J08860J17415J28298
61017B215960J43178J63961J93614K33730K83208L41208M09070M87567N76199
61008E047695O78952Q07280R73295J183921J443787J747256K042411K203573K078317
$$ y = [917540, 907632, 895201, 881161, 865891, 849754, 833391, 817183, 800900, 784232, 767282, 750201, 732863, 715407, 698611, 683176, 668965, 655477, 642741, 631171, 620855, 611608, 603490, 596718, 591221, 586785, 583440, 581279, 580109, 579747, 580396, 582301, 585383, 589609, 595299, 602504, 610547, 618785, 627486, 637307, 648319, 660223, 673147, 687485, 703300, 720616, 739953, 761828, 786073, 812379, 841138, 872988, 907937, 945760, 986770, 1031289, 1078826, 1128668, 1180682, 1234519, 1288807, 1342629, 1397424, 1456057, 1520475, 1591688, 1671346, 1761259, 1861387, 1970247, 2087662, 2215960, 2359138, 2523099, 2716713, 2950443, 3233651, 3574859, 3983929, 4471496, 5047695, 5726647, 6533927, 7507222, 8691143, 10134930, 11882186, 13924597, 16128170, 18206487]
60999A8206487J606010R01376K02745k78840m66568l97928j45871K04213N16748
60990B0348372O09390L52206k21377r17247j506849j859354j972967j915812j759948
60981A1156414j557768j345143j143937r62727q03264o66997n54310m61720l84441
60972C276107l20511k69849k30849k00379j75976j55929j38390j22401j08728
60963A553095r7923q8530p8827o9138o0663n3159m5800l9425l5776l4886l5052
60952I13916l5098l5044l4751l3576l1393k8631k5403k1695j8259j6073j5048
60941F18945j4256j3272j2275j1178r804q732q760r633j0336j0601j0983j1531
60929D87584j1541j0705r572q672q002p512p289p231p168p239p503p322o108m533
$$ y = [18206487, 19812497, 20713873, 20916618, 20637778, 20171210, 19773282, 19627411, 19831624, 20348372, 20957762, 21309968, 21088591, 20171344, 18664495, 16805141, 14832174, 12916362, 11156414, 9598646, 8253503, 7109566, 6146839, 5343575, 4676578, 4122268, 3660548, 3276107, 2955596, 2685747, 2454898, 2254519, 2078543, 1922614, 1784224, 1661823, 1553095, 1455172, 1366642, 1287815, 1218677, 1158014, 1104855, 1059055, 1019630, 983854, 948968, 913916, 878818, 843774, 809023, 775447, 744054, 715423, 690020, 668325, 650066, 633993, 618945, 604689, 591417, 579142, 567964, 558160, 549428, 540668, 531035, 520699, 510098, 499115, 487584, 476043, 465338, 455766, 447094, 439092, 431580, 424291, 417060, 409892, 402653, 395150, 387828, 381720, 377187]
60915C77187l993m745n545n353m532l990l912l771l077j787l04P23R18O77P01
60900C39197J090J335J247J303J859K544K759K465K168K263K601K633J968P99
60886C66231k28o96q54j243k031k867l338l406l471l964m795n281m893l939l061
60871C22164k294j289k47K35L10P51J477J459N28m2M04O52l85j607j308J49J035
60854C21992J117J732L091L610K375N68m08p14r96p89P02K874M070L510K041R19
60838C45694N38M20L9n67r69r93j003j308j570j218l96Q6k25q72j122p37p0K84
60820C36011j04j052j756j645j230j564k833m081m463m171l907l941m028l911
60806B97325l533l009k547k272k000j428n80J60M85L53j83r59j547j579j216r17
$$ y = [377187, 373194, 368449, 362904, 357551, 353019, 349029, 345117, 341346, 338269, 336482, 336178, 336901, 337819, 338496, 339197, 340287, 341622, 342869, 344172, 346031, 348575, 351334, 353799, 355967, 358230, 360831, 363464, 365432, 366231, 366003, 365307, 364453, 363210, 361179, 358312, 354974, 351568, 348097, 344133, 339338, 334057, 329164, 325225, 322164, 319870, 318581, 318334, 318569, 318879, 319630, 321107, 322566, 323094, 323052, 323456, 324108, 323723, 322116, 320808, 320957, 321992, 323109, 324841, 327932, 331542, 333917, 334485, 334077, 333363, 332367, 331578, 332280, 335154, 339224, 342734, 344775, 345694, 346232, 346652, 346691, 346124, 345155, 344162, 343159, 341851, 340281, 339063, 338667, 338753, 338528, 337656, 336534, 335797, 335727, 336011, 335907, 334855, 333099, 331454, 330224, 328660, 325827, 321746, 317283, 313112, 309205, 305264, 301236, 297325, 293792, 290783, 288236, 285964, 283964, 282536, 281956, 282116, 282601, 282954, 282771, 281812, 280265, 278686, 277470, 276553]
60790B76553p87n69k35p3j44j95j53j04J93J083K205K650K218J802K116K763L101
60773B92424L360M150N294N989N966N748N750N750N409M804M225L791L487L358
60759C59505L425L403K830J584K25l90N1R84J675K010K384K888L152K971K703
60744C89400K739K942K884K459J967J665J444R59Q3q05j102p10k08k6L38J626
60728D05655L449M481M268M035N048O838P961Q118Q489R861J1508J2347J2479
60715E04537J2854J3848J4928J5606J5986J6283J6436J6453J6605J6850J6481
60704F76867J4928J2665J0742R453Q021N779L028M89j643l693n922q353j0979
60691G11382j3656j5931j7338j7960j8373j8977j9613j9789j9176j7888j6387
$$ y = [276553, 275766, 275197, 274962, 274889, 274745, 274550, 274397, 274293, 274486, 275569, 277774, 280424, 282642, 284444, 286560, 289323, 292424, 295784, 299934, 305228, 311217, 317183, 322931, 328681, 334431, 339840, 344644, 348869, 352660, 356147, 359505, 362930, 366333, 369163, 370747, 370972, 370582, 370633, 371617, 373292, 375302, 377686, 380574, 383726, 386697, 389400, 392139, 395081, 397965, 400424, 402391, 404056, 405500, 406459, 406542, 405737, 404635, 403925, 403717, 403691, 404029, 405655, 409104, 413585, 417853, 421888, 426936, 433774, 441735, 449853, 458342, 468203, 479711, 492058, 504537, 517391, 531239, 546167, 561773, 577759, 594042, 610478, 626931, 643536, 660386, 676867, 691795, 704460, 715202, 724655, 732676, 738455, 741483, 741972, 740329, 736636, 730714, 722361, 711382, 697726, 681795, 664457, 646497, 628124, 609147, 589534, 569745, 550569, 532681, 516294]
60680E16294j5094j4082j3222j2536j2171j1992j1596j0818r882q880p620o214
60668C82187n317n311n650n497m777m106l934m272m947n603n618m627l089j867
60654C17572j358j376j602j681j143L2J043J132O60O07J171J621J532J203Q34
60639C20247J71p68j492j782j946k022j630q29l16k86N7J234K458K629J813J003
60623C18541P64Q67R40Q20L90k79p80q39p84j029j339j182p33q49j909l200l676
60606C05723l047j942j180j072j313j463j422j375j298r41l00J43nn26r46j206
60590B87830j651k394l076l267k889k215j572j037l91N49J536K049J946J712J907
60575B79037K520L177L763M517N598O793P705Q138Q243Q374Q699Q908Q416O879
$$ y = [516294, 501200, 487118, 473896, 461360, 449189, 437197, 425601, 414783, 404901, 396021, 388401, 382187, 376870, 371559, 365909, 360412, 355635, 351529, 347595, 343323, 338376, 332773, 327155, 322528, 319439, 317572, 316214, 314838, 313236, 311555, 310412, 310444, 311487, 312619, 313279, 313886, 315057, 316678, 318210, 319413, 320247, 320418, 319650, 318158, 316376, 314430, 312408, 310778, 309949, 309633, 309347, 309404, 310638, 313096, 315725, 317538, 318541, 319305, 320172, 321112, 321932, 322322, 322043, 321263, 320424, 319640, 318611, 317272, 316090, 315357, 314508, 312599, 309399, 305723, 302676, 300734, 299554, 298482, 297169, 295706, 294284, 292909, 291611, 290670, 290370, 290513, 290508, 289982, 289036, 287830, 286179, 283785, 280709, 277442, 274553, 272338, 270766, 269729, 269338, 269887, 271423, 273472, 275418, 277130, 279037, 281557, 284734, 288497, 293014, 298612, 305405, 313110, 321248, 329491, 337865, 346564, 355472, 363888, 370767]
60561C70767M446J556j248l442m768n525o225o788o495m932k697p57O08J815L111
60546C39426M216M868N318O096P325Q494Q867Q162O719M957K859K55k467m406
60532D00689n017m593l695k548j256j45N36R91J438J568R15k74j167j373j355
60517C84714j605j859j480l53R35J801K251K678L305M066M927O128P864R921J1887
60502D35180J3716J5869J8837K2673K6982L1139L4489L6598L7400L6902L4604
60491G44389K9585K1435J0967k55j0994k0770k9336l6142m0412m1769m0660l8106
60479E47932l4933l1338k7270k3046j9291j6259j3683j1365r640q943r131r533
60467C33500r478q711p411o001m838l924l041k238j875k095k468k453k030j627
$$ y = [370767, 375213, 376769, 375521, 372079, 367311, 361786, 355561, 348773, 342278, 337346, 334649, 333892, 334500, 336315, 339426, 343642, 348510, 353828, 359924, 367249, 375743, 384610, 392772, 399491, 404448, 407307, 407562, 405095, 400689, 395672, 391079, 387384, 384836, 383580, 383435, 383971, 384962, 386400, 387968, 388883, 388609, 387442, 386069, 384714, 383109, 381250, 379770, 379417, 380352, 382153, 384404, 387082, 390387, 394453, 399380, 405508, 413372, 423293, 435180, 448896, 464765, 483602, 506275, 533257, 564396, 598885, 635483, 672883, 709785, 744389, 773974, 795409, 806376, 806121, 795127, 774357, 745021, 708879, 668467, 626698, 586038, 547932, 512999, 481661, 454391, 431345, 412054, 395795, 382112, 370747, 361107, 352164, 343033, 333500, 324022, 315311, 307900, 301899, 297061, 293137, 290096, 287858, 285983, 283888, 281420, 278967, 276937, 275310]
60453B75310j577j849k202k327j928q98M61J553J858J261J18r28j349j076m54
60438B65973P5K13k20j158k138k578k379k081k245k816l193k788j504J83J567
60423B44911K295K626K972L271L158K588J902J278O12j1l00l35n50r75j066o65
60407B61711m04p21r98m44O35J224J046Q33J175J741J896J474Q25L52K79O03J106
60390B72333J549J847K012K033J939J894K024K241K364K277J863J067K67J68R62
60375B96840J867K006J525J311J703K143K103J785J595J458J061M80J46K86P54
60360C17063J321J856K101J633M16p16o36Q03K458L227L426M175N713P106P726
60345C57672Q064Q593Q729P655N646L664J962k4k491m799o313p001p093o725o117
$$ y = [275310, 273733, 271884, 269682, 267355, 265427, 264529, 264990, 266543, 268401, 269662, 269780, 268852, 267503, 266427, 265973, 266048, 266261, 266041, 264883, 262745, 260167, 257788, 255707, 253462, 250646, 247453, 244665, 243161, 243344, 244911, 247206, 249832, 252804, 256075, 259233, 261821, 263723, 265001, 265613, 265602, 265302, 264967, 264417, 263442, 262376, 261711, 261307, 260586, 259588, 259144, 259779, 261003, 262049, 262882, 264057, 265798, 267694, 269168, 269993, 270345, 270624, 271227, 272333, 273882, 275729, 277741, 279774, 281713, 283607, 285631, 287872, 290236, 292513, 294376, 295443, 295710, 295878, 296840, 298707, 300713, 302238, 303549, 305252, 307395, 309498, 311283, 312878, 314336, 315397, 315877, 316023, 316309, 317063, 318384, 320240, 322341, 323974, 324390, 323674, 323038, 323841, 326299, 329526, 332952, 337127, 342840, 349946, 357672, 365736, 374329, 383058, 390713, 396359, 400023, 401985, 401961, 399470, 394671, 388358, 381357, 374264, 367539, 361422]
60330C61422n607n274m914m464m046l574k804j931j570j869k135j741r84o02o53
60315C19254m58L92J452J985J849J621J930K861M082N387P003R160J1499J3054
60301C81071J3016J1513R516P861O356M039M75l374n827n990m414k425j160j159
60287D09498k248l625m482m857n503o699p711p770p126o556o184n495m369l415
60273C33458l172l422l458k794j662r70j561l159m351m041k707j686j513j654
60259B97308j691j805k024j888j291q69j046j247p24K59P31L79j25j55O5Qk19
60242B85666J7Q68J577J366N49K38Q82J615J428N73K25R34K087K916L380L717
60226C08038L722L037J907J011N42j2r55j610r89Q86K740L413L092K825L110L455
$$ y = [361422, 355815, 350541, 345627, 341163, 337117, 333543, 330739, 328808, 327238, 325369, 323234, 321493, 320509, 319907, 319254, 318796, 319188, 320640, 322625, 324474, 326095, 328025, 330886, 334968, 340355, 347358, 356518, 368017, 381071, 394087, 405600, 415116, 422977, 429333, 433372, 433847, 430473, 424646, 418656, 414242, 411817, 410657, 409498, 407250, 403625, 399143, 394286, 388783, 382084, 374373, 366603, 359477, 352921, 346737, 341242, 336873, 333458, 330286, 326864, 323406, 320612, 318950, 317980, 316419, 313260, 308909, 304868, 302161, 300475, 298962, 297308, 295617, 293812, 291788, 289900, 288609, 287740, 286694, 285447, 284723, 284982, 285713, 286092, 285967, 285812, 285877, 285885, 285666, 285683, 286551, 288128, 289494, 290043, 290281, 291163, 292778, 294206, 294779, 295004, 295938, 298025, 300941, 304321, 308038, 311760, 314797, 316704, 317715, 318257, 318245, 317290, 315680, 314691, 315577, 318317, 321730, 324822, 327647, 330757, 334212]
60210C34212L309K811K434K374K625L216L992M470M322L825L581L880M562N202
60196C84815N344M869M258M084M112L579K513J863J880J469j5j330j001L06O60
60181D17406k71r43n99m36j536l230m308m757n221n632n456m760m066l493k802
60166C69896k092j719j673j599j349j107j042j141j204q27K22J415J759J022J92
60151C60753K23Q35J159J062J118J567K070K386K618K740K582K287K301K775L383
60136C89859L795L970L931L696L477L549L775L623K769J490K96n79j204j641j764
60121D19042j410o44J26M90N43Q24J506J967J521M62j79Q6O86R20Q92J139J620
60104D29591J682R99P7l97m15n07q94j207j147j043j415k158k581k309j756j541
$$ y = [334212, 337521, 340332, 342766, 345140, 347765, 350981, 354973, 359443, 363765, 367590, 371171, 375051, 379613, 384815, 390159, 395028, 399286, 403370, 407482, 411061, 413574, 415437, 417317, 418786, 418771, 417441, 416440, 416746, 417406, 417135, 416192, 415593, 415157, 413621, 410391, 406083, 401326, 396105, 390473, 385017, 380257, 376191, 372698, 369896, 367804, 366085, 364412, 362813, 361464, 360357, 359315, 358174, 356970, 356143, 356365, 357780, 359539, 360561, 360753, 360976, 361811, 362970, 364032, 365150, 366717, 368787, 371173, 373791, 376531, 379113, 381400, 383701, 386476, 389859, 393654, 397624, 401555, 405251, 408728, 412277, 416052, 419675, 422444, 423934, 424230, 423651, 422447, 420806, 419042, 417632, 416988, 417114, 417604, 418147, 418971, 420477, 422444, 423965, 424427, 424248, 424334, 425020, 425940, 426832, 427971, 429591, 431273, 432272, 432349, 431952, 431537, 431030, 430136, 428929, 427782, 426739, 425324, 423166, 420585, 418276, 416520, 414979]
60088D14979j670j638j228q37q67j056p16L59J482J781J145K47k57k23K25R49
60072D12675J626J732J025j67j413k574l478l666l047k465k842l899m444m010
60058C85053l455l674m462m994m910m426l718k801j816j044n36l4O87J466J821
60043C53157J469P60M41Q32J475J857K132K725L529M096M400M683M711M027K965
60028C93259K455K557K169N93j442k864l595m206m884n520o204o945p289o956
60014C51128o447o305o159n355m157l337k917k251j354r89j321j477q78q9J94
59999C08286K64Q46J843K457K313J870J633J580J473J385J596K133K691L025L202
59984C36597L354L385L100K555K022J632J274Q88O01M37J94l04j009j818k621
$$ y = [414979, 413309, 411671, 410443, 409606, 408739, 407683, 406967, 407326, 408808, 410589, 411734, 411981, 411724, 411501, 411726, 412675, 414301, 416033, 417058, 416891, 415478, 412904, 409426, 405760, 402713, 400248, 397406, 393507, 389063, 385053, 381598, 377924, 373462, 368468, 363558, 359132, 355414, 352613, 350797, 349753, 349217, 349183, 349870, 351336, 353157, 354626, 355386, 355827, 356659, 358134, 359991, 362123, 364848, 368377, 372473, 376873, 381556, 386267, 390294, 393259, 395714, 398271, 400440, 401033, 399591, 396727, 393132, 388926, 384042, 378522, 372318, 365373, 358084, 351128, 344681, 338376, 332217, 326862, 322705, 319368, 316451, 314200, 312846, 311857, 310536, 309059, 308181, 308092, 308286, 308550, 309396, 311239, 313696, 316009, 317879, 319512, 321092, 322565, 323950, 325546, 327679, 330370, 333395, 336597, 339951, 343336, 346436, 348991, 351013, 352645, 353919, 354807, 355408, 355845, 356039, 355735, 354726, 352908, 350287]
59969C50287l131l027k467k008j851j571r21m20n86r99q12j7N22K92k33l59j7
59952C32682L12K21l01q38p74J42J392K096J888J124L48j16p9M58R82O99n60k002
59934C37674k703k530j966j391r40p84j023j308j082m01q6p91k054k642j828j48
59918C15997J163J327N94j82l57qK85J07k47l8R91K164K528J912J114R43J403
59901C29696J894J948J647J396J544K145K964L670M065M145M036L959M147M588
59887C71844M924M842M517M386M492M406L870L160K682K471K381K415K623K782
59873D21795K530J746O90l28j222k131l155m099m599m559m308m146l868l067j790
59858C89489m78P46K285M456P023R324J0572J0095P878M947K689J516P41j18n42
$$ y = [350287, 347156, 344129, 341662, 339654, 337803, 336232, 335311, 334891, 334305, 333306, 332494, 332477, 332999, 333291, 333058, 332699, 332682, 332994, 333215, 332914, 332076, 331302, 331444, 332836, 334932, 336820, 337944, 338292, 338176, 338097, 338555, 339537, 340236, 339676, 337674, 334971, 332441, 330475, 329084, 328144, 327360, 326337, 325029, 323947, 323546, 323460, 322669, 320615, 317973, 316145, 315997, 317160, 318487, 319081, 318899, 318542, 318534, 318819, 318926, 318679, 318641, 319632, 321796, 324324, 326236, 327350, 328293, 329696, 331590, 333538, 335185, 336581, 338125, 340270, 343234, 346904, 350969, 355114, 359150, 363109, 367256, 371844, 376768, 381610, 386127, 390513, 395005, 399411, 403281, 406441, 409123, 411594, 413975, 416390, 419013, 421795, 424325, 426071, 426761, 426433, 425211, 423080, 419925, 415826, 411227, 406668, 402360, 398214, 394346, 391279, 389489, 389011, 389757, 392042, 396498, 403521, 412845, 423417, 433512, 441390, 446337, 449026, 450542, 451283, 451165, 450623]
59843D50623O4J285K055J701J50k451n692q646j0349j0569r806q652p363n961
59829C86389m416k776j349n39m41p51j214j821k442k705k531k385k671l196l591
59814C53561l774l683l049j923j016r52j439j733j624j461j474j634j944k302
59800C25553k317j774j108r25j237j678k123k563k578j716k66Q99J277R79K31
59785C10654p93j652j879j566j278j268j222p73M7Q75J230Q83K12r2M8l7n77o98
59767C02114L40J865K637K502K151J711Q89J75N02J622K258K113K261L116L501
59752C29757K603J481J534K496L154L317L725M411M530L816L053K865K938K731
59738C72411K272J872J548J160P76N43L58L4l27m07j98j60o75j421j593p97N30
$$ y = [450623, 450687, 451972, 454027, 455728, 455878, 453427, 447735, 439089, 428740, 418171, 408365, 399713, 392350, 386389, 381973, 379197, 377848, 377309, 376868, 376117, 374903, 373082, 370640, 367935, 365404, 363019, 360348, 357152, 353561, 349787, 346104, 343055, 341132, 340116, 339164, 337725, 335992, 334368, 332907, 331433, 329799, 327855, 325553, 323236, 321462, 320354, 319429, 318192, 316514, 314391, 311828, 309250, 307534, 307268, 308167, 309444, 310423, 310654, 309861, 308209, 306330, 304764, 303486, 302218, 300996, 300223, 300270, 301145, 302375, 303258, 303470, 303378, 303426, 303389, 302812, 302114, 302454, 304319, 306956, 309458, 311609, 313320, 314209, 314384, 314886, 316508, 318766, 320879, 323140, 326256, 329757, 332360, 333841, 335375, 337871, 341025, 344342, 348067, 352478, 357008, 360824, 363877, 366742, 369680, 372411, 374683, 376555, 378103, 379263, 380039, 380582, 380940, 380974, 380647, 380240, 380042, 379882, 379207, 377786, 376193, 375396, 375926]
59721C75926J598J952J617Q59Q0l83n54o85o93j49Q83J566J416J142J609K422
59705C88606K477J674R41O24P4r06j386o75N41J210J322J525J906J999J728J470
59689D03130J293P68k95j502k354k749k791k436j529k72O00L45r48k223k478j828
59673C84731j265j458k110k518k427k185k263k702l027k802k308k250k659k601
59659C52156j504j72K92J02L18J047J352R23N80Q14J028P54N51R45J392J090K08
59642C61876n23r02j163j215p95j56J72J12m1k63p30j247j305p63o7K48L3m22
59624C52849n73q4P13J011M50m35r10q99q28r56j240j675k262k723k609j819p84
59607C37226l3L45P64J549K294K119Q48m80p78k41J08k7m0L18N92O37R64J641
$$ y = [375926, 377524, 379476, 381093, 381952, 382032, 381649, 381095, 380410, 379717, 379568, 380451, 382017, 383433, 384575, 386184, 388606, 391083, 392757, 393698, 394322, 394396, 393490, 392104, 391429, 391970, 393180, 394502, 396027, 397933, 399932, 401660, 403130, 404423, 405191, 404896, 403394, 401040, 398291, 395500, 393064, 391535, 391263, 391863, 392208, 391260, 389037, 386559, 384731, 383466, 382008, 379898, 377380, 374953, 372768, 370505, 367803, 364776, 361974, 359666, 357416, 354757, 352156, 350652, 350480, 350772, 350874, 351192, 352239, 353591, 354514, 355094, 355908, 356936, 357690, 358241, 359186, 360578, 361668, 361876, 361353, 360451, 359288, 358073, 357278, 357122, 357294, 357406, 357365, 357102, 356372, 355125, 353820, 353057, 352990, 353238, 353271, 352849, 352276, 352192, 352905, 353916, 354366, 353931, 353021, 352122, 351294, 350338, 349098, 347423, 345161, 342438, 339829, 338010, 337226, 337193, 337538, 338302, 339851, 342145, 344264, 345112, 344632, 343854, 343613, 343721, 343694, 343654, 343972, 344564, 345201, 346165, 347806]
59589C47806J904J344N72O0o51j858k721k414j533j253j580j575j032p16j037
59574C35316j502j649j608j577j436j159j003j074j143j078j046j157j220r98
59560C17666n08N5M69O34O68Q14J156J566J971K438K881L002K745K460K513K955
59544C43485L681M506N064N183N435O653Q883J1567J4752J8761K2180K1697J5362
59531D87209N302m028r796j1973j1542r228n965k985r44L65J257J946K852M186
59517D46656N250N074L727K174Q30o68k259l199l369l678m752o067o921p453q075
59502D17270q560q404p646o684n639m417l226k532k442k452j894o57N38P51q2
59487C63924r75j042n29j75N2Q33K309L855N075O214P393Q235Q517Q558Q619Q418
$$ y = [347806, 349710, 351054, 351626, 351686, 351035, 349177, 346456, 344042, 342509, 341256, 339676, 338101, 337069, 336353, 335316, 333814, 332165, 330557, 328980, 327544, 326385, 325382, 324308, 323165, 322087, 321041, 319884, 318664, 317666, 317158, 317213, 317682, 318316, 318984, 319798, 320954, 322520, 324491, 326929, 329810, 332812, 335557, 338017, 340530, 343485, 347166, 351672, 356736, 361919, 367354, 374007, 382890, 394457, 409209, 427970, 450150, 471847, 487209, 492511, 488483, 478687, 466714, 455172, 445944, 439979, 436994, 436050, 436415, 437672, 439618, 442470, 446656, 451906, 456980, 460707, 462881, 463711, 463043, 460784, 457585, 454216, 450538, 445786, 439719, 432798, 425345, 417270, 408710, 400306, 392660, 385976, 380337, 375920, 372694, 370162, 367720, 365268, 363374, 362717, 363255, 364006, 363924, 362949, 361907, 361378, 361203, 361255, 362088, 364397, 368252, 373327, 379541, 386934, 395169, 403686, 412244, 420863, 429281]
59471D29281P545N948L859J643j83j277j897k540l103l018k188j111M3J649L726
59456D38377N605O883P891Q844R365R388R762J1153J3038J4545J5739J7054J7748
59443E85392J6125J1507N192q91n799r606j2318j3545j3218j2101j1294j1276
59431E28168j1716j2063j2006j1371j0076q501p346o633n352k729M47K708L872
59418D47402N176P446J0200J2756J5130J7506J9829K2389K5513K7794K5910J7838
59406F54889N856n028j1542j4036j4352j3417j1222p680k750L256Q513R638M237
59393F06362o333j7496k4971k7516k6523k3911k0840j7775j4870j2088r439p279
59381C97321o086n790n577m667l174j910j350j120n44M62J263J245N83J03K73
$$ y = [429281, 436826, 442774, 446633, 448276, 448093, 446816, 444919, 442379, 439276, 436258, 434070, 432959, 433002, 434651, 438377, 443982, 450865, 458756, 467600, 476965, 486353, 496115, 507268, 520306, 534851, 550590, 567644, 585392, 601517, 613024, 618216, 617325, 611526, 601920, 589602, 576057, 562839, 550738, 539444, 528168, 516452, 504389, 492383, 481012, 470936, 462435, 455089, 448456, 443104, 440375, 440822, 443530, 447402, 452578, 460024, 470224, 482980, 498110, 515616, 535445, 557834, 583347, 611141, 637051, 654889, 660745, 655717, 644175, 630139, 615787, 602370, 591148, 583468, 580718, 583974, 592487, 602125, 606362, 600029, 582533, 557562, 530046, 503523, 479612, 458772, 440997, 426127, 414039, 404600, 397321, 391235, 385445, 379868, 375201, 372027, 370117, 368767, 367647, 367103, 367565, 368828, 370073, 370656, 370759, 371032]
59366C71032N59Q4j058j703j001N01J617J929J938K077K288K522L002L844M840
59351C92471N783O663P513Q412R554J0924J1954J2125J1871J2266J3587J4841
59339E17964J4976J3964J2417J0764R189P901O849N533L596J362o55k469m427
59326E96964o550q501j0069j1215j1853j1957j1777j1516j0950r802q317p016
59314D77441n928m552k620m56J511L231M852O501Q398J0913J3978J6489J6653
59301E46411J3286O919m18o568j0532j2561j3291j3022j1848j0052q161o576n360
59288D68227m370l568l056k824k524j752o31J39J06l32l99R0P26J339K253L620
59272D57044N054O202P214Q320R370J0177J0892J1594J1795J0949R331P853O961
$$ y = [371032, 371591, 371675, 370617, 368914, 367913, 368414, 370031, 371960, 373898, 375975, 378263, 380785, 383787, 387631, 392471, 398254, 404917, 412430, 420842, 430396, 441320, 453274, 465399, 477270, 489536, 503123, 517964, 532940, 546904, 559321, 570085, 579274, 587175, 594024, 599557, 603153, 604515, 603860, 601391, 596964, 590414, 581913, 571844, 560629, 548776, 536819, 525042, 513526, 502576, 492774, 484457, 477441, 471513, 466961, 464341, 463885, 465396, 468627, 473479, 479980, 488378, 499291, 513269, 529758, 546411, 559697, 566616, 566198, 559630, 549098, 536537, 523246, 510224, 498376, 488324, 480163, 473587, 468227, 463857, 460289, 457233, 454409, 451885, 450133, 449502, 449641, 449747, 449415, 449016, 449106, 449832, 451171, 453424, 457044, 462098, 468300, 475514, 483834, 493204, 503381, 514273, 525867, 537662, 548611, 557942, 565795, 572756]
59259E72756O152M713K539J44j939l533m834o159p558q608q798q162p325o808
59245E22580o509o010n226m454l924l587l310l011k512j586l06Q95J716K295K806
59230D89857L026K719K192J941J786J068k56j392j906k445l728n372o409o612
59216D74469o558o589o480o149n929n955n854n312m558m070m061m406m759m695
59202C99094l988k913j989j436j117r48r54r82q17o12p61j126j007l2J289K285
59186C83986K974L775M619M924M432L719L584M075M343L594K084R43R94J955K912
59171D32913L263L027K570K401K956M134N216N676N884O616P943R189R797R718
59157E11303R093Q094P098O368N550M034J885j34j514k443l224l897m489n104
$$ y = [572756, 578908, 583621, 586160, 586304, 584365, 580832, 575998, 569839, 562281, 553673, 544875, 536713, 529388, 522580, 516071, 510061, 504835, 500381, 496457, 492870, 489560, 486549, 484037, 482451, 482145, 483040, 484756, 487051, 489857, 492883, 495602, 497794, 499735, 501521, 502589, 502333, 500941, 499035, 496590, 492862, 487490, 481081, 474469, 467911, 461322, 454842, 448693, 442764, 436809, 430955, 425643, 421085, 417015, 412954, 408548, 403789, 399094, 395106, 392193, 390204, 388768, 387651, 386703, 385749, 384767, 383950, 383338, 382577, 381451, 380444, 380412, 381701, 383986, 386960, 390735, 395354, 400278, 404710, 408429, 412013, 416088, 420431, 424025, 426109, 427052, 428046, 430001, 432913, 436176, 439203, 441773, 444174, 447130, 451264, 456480, 462156, 468040, 474656, 482599, 491788, 501585, 511303, 520396, 528490, 535588, 541956, 547506, 551540, 553425, 553291, 551777, 549334, 546110, 542213, 537724, 532620]
59143E32620n533n446n059n037n533n936n856n711o012o578o853o552n657m283
59129D52574k767j559p40oO79J033J177J755K934L941M115L894M201N184O202
59114D82617O761O994P310P959Q847R534R606R159Q651Q233P675P043O844P183
59100E94416P375O879O068N537N078L992K152K00j185j774j721j417j366j745
59086F22489k177k169j732j385j648k660m103n390o099o294o280o137n854n763
59072E64798o272p135p611p462p169p048o826o360n983n875n715n336n024m767
59058D76215m026k731j710j553j737j569j286j383j459p36N93J477J326N07k80
59043D61648n46j04P38J237R76M34L80R82J858K663L137L114K961L531N017O329
$$ y = [532620, 527087, 521641, 516582, 511545, 506012, 500076, 494220, 488509, 482497, 475919, 469066, 462514, 456857, 452574, 449807, 448248, 447508, 447502, 448181, 449214, 450391, 452146, 455080, 459021, 463136, 467030, 471231, 476415, 482617, 489378, 496372, 503682, 511641, 520488, 530022, 539628, 548787, 557438, 565671, 573346, 580389, 587233, 594416, 601791, 608670, 614738, 620275, 625353, 629345, 631497, 631697, 630512, 628738, 627017, 625600, 624234, 622489, 620312, 618143, 616411, 615026, 613378, 610718, 606615, 601225, 595126, 588832, 582552, 576415, 570561, 564798, 558526, 551391, 543780, 536318, 529149, 522101, 515275, 508915, 502932, 497057, 491342, 486006, 480982, 476215, 472189, 469458, 467748, 466195, 464458, 462889, 461603, 460220, 458761, 458025, 458618, 460095, 461421, 461928, 461648, 461102, 460998, 461736, 462973, 463949, 464383, 464763, 465745, 467603, 470266, 473403, 476517, 479478, 483009, 488026, 494355]
59027D94355O303N202M308M358N092N995O697O961O965P310Q142Q626Q060O995
59013E85369O352N899M825L389K677K755K446J195p6m68k81j53N9P63J705K333
58997F18789K717L348M226M756M546L884L355L191L111K703J850O69p67k382l798
58982F50198m624n169o243p889q885q149o138m115k519r12P82K034K723L392M262
58967F08748M886N000N009N314N734O062O580P579Q633Q823P668N626L717K665
58953F92044K255J574l6k374m767o770q215q935q947q644q350p819o668n118l811
58938F15419l036k655k710l457m794o138o994p261o982o254n337m550l933l316
58924E48002k622j877j047j62N44R62J369K047K826L375L734M188M815N571O535
$$ y = [494355, 500658, 505860, 510168, 514526, 519618, 525613, 532310, 539271, 546236, 553546, 561688, 570314, 578374, 585369, 591721, 597620, 602445, 605834, 608511, 611266, 613712, 614907, 614831, 614363, 614082, 613929, 613988, 614751, 616456, 618789, 621506, 624854, 629080, 633836, 638382, 642266, 645621, 648812, 651923, 654626, 656476, 657145, 656378, 653996, 650198, 645574, 640405, 634162, 626273, 617388, 609239, 603101, 598986, 596467, 595555, 596337, 598371, 601094, 604486, 608748, 613634, 618634, 623643, 628957, 634691, 640753, 647333, 654912, 663545, 672368, 680036, 685662, 689379, 692044, 694299, 695873, 695837, 693463, 688696, 681926, 673711, 664776, 655829, 647185, 638835, 631016, 624348, 619230, 615419, 612383, 609728, 607018, 603561, 598767, 592629, 585635, 578374, 571392, 565138, 559801, 555251, 551318, 548002, 545380, 543503, 542456, 542294, 542838, 543800, 545169, 547216, 550042, 553417, 557151, 561339, 566154, 571725, 578260]
58909E78260P650Q526Q882Q952R068R190R272R700J0666J1503J1247R733P682
58896G00331N854M619L922L230J859l6j176l90K167N423Q475J0776J2047J2734
58882G69835J3849J5505J6343J5299J3202J1403R709P097L829J108j005l556o680
58869H65938r364j1308j3322j5606j7291j8036j8552j9055j8748j7458j6268j5801
58857F75129j5218j3838j2483j2205j2669j2799j2280j1551j0971j0695j0723
58846E39697j0475r109o861n228n096n524n176m182l609l741l915l668l156k645
58832D67312k332k446k885k976k186q97RJ31k43o48q15p02m95l09J81J453L271
58815D55423M657M987M621M158L584K618J431N08P2j9ko0k67m70m52k45PL29P21
$$ y = [578260, 585910, 594436, 603318, 612270, 621338, 630528, 639800, 649500, 660166, 671669, 682916, 692649, 700331, 706185, 710804, 714726, 717956, 719815, 719779, 718603, 718213, 720380, 725803, 734278, 745054, 757101, 769835, 783684, 799189, 815532, 830831, 844033, 855436, 865145, 872242, 876071, 877179, 876174, 872618, 865938, 856574, 845266, 831944, 816338, 799047, 781011, 762459, 743404, 724656, 707198, 690930, 675129, 659911, 646073, 633590, 621385, 608716, 595917, 583637, 572086, 561115, 550420, 539697, 529222, 520113, 513252, 508024, 502928, 497404, 492228, 488046, 484437, 480696, 476781, 473113, 469957, 467312, 464980, 462534, 459649, 456673, 454487, 453590, 453599, 453730, 453487, 452839, 452024, 451322, 450827, 450518, 450699, 452152, 455423, 460080, 465067, 469688, 473846, 477430, 480048, 481479, 481987, 482059, 482040, 482038, 481978, 481711, 481241, 480789, 480544, 480551, 480880, 481601]
58796D81601Q02K63n03r07j171j976l140l578k778j471n33l6M23J136K297L846
58780D74275N184N724N774O054O352N753M242K799J718K01j940l605m093m135
58766E04303m431m510m059m099n484p132p272n899m600m283m348m000l238k400
58752D38548j625r43l27M38J549K814L742L972L540K944K891L593M335M376M199
58737D74046M982O737Q066Q057P342O808O335N544M793M526M455M239M229M696
58723E54855M955M248K922J848J133K53q57j657j733j128j42P55J207J418J933
58708E70010K732L205L183L126L043K275P66n85j410k579m623o690p949q973j0540
58693E44991j2130j2803j2709j2437j1712j0026p989o671o086n530m949m718m529
$$ y = [481601, 482403, 482666, 482163, 481256, 480085, 478109, 474969, 471391, 468613, 467142, 466609, 466573, 466996, 468132, 470429, 474275, 479459, 485183, 490957, 497011, 503363, 509116, 513358, 516157, 517875, 518076, 516136, 512531, 508438, 504303, 499872, 495362, 491303, 487204, 481720, 474588, 467316, 461417, 456817, 452534, 448186, 444186, 440948, 438548, 436923, 435980, 435653, 436091, 437640, 440454, 444196, 448168, 451708, 454652, 457543, 461136, 465471, 469847, 474046, 479028, 485765, 493831, 501888, 509230, 516038, 522373, 527917, 532710, 537236, 541691, 545930, 550159, 554855, 559810, 564058, 566980, 568828, 569961, 570214, 569357, 567700, 565967, 564839, 564697, 565452, 566659, 568077, 570010, 572742, 575947, 579130, 582256, 585299, 587574, 588340, 587755, 586345, 583766, 579143, 572453, 564504, 555531, 544991, 532861, 520058, 507349, 494912, 483200, 473174, 465185, 458514, 452428, 446898, 441949, 437231, 432702]
58680D32702l763k710k229k420k640k577k309j593j39J637L046L985M631M796
58666D30417M538M799O314Q357R638R928R648Q502N934K629K1j544k840m063m538
58651D87740m105l527l287l107k780k515k333k036j785j841j846j338p81j015
58637D55444j779j893j004R9Q93J710K694L322L295K988K687K228J709J743K581
58622D76717L571L860L193J899N44k96l18L65J529L049M565N457N674N961O640
58607E22410O821N665L833K559J808O21j096k375k721k597k375j902j200o88n54
58592E28209p08j251k190k886k659j741p85L32K206M651O769Q098Q723Q514P431
58577E62713O333O258O924P123O498N702N031M230L703M365O052P430P879Q222
$$ y = [432702, 428939, 426229, 424000, 421580, 418940, 416363, 414054, 412461, 412322, 413959, 417005, 420990, 425621, 430417, 434955, 439754, 446068, 454425, 464063, 473991, 483639, 492141, 498075, 500704, 500725, 499181, 496341, 492278, 487740, 483635, 480108, 476821, 473714, 470934, 468419, 466086, 464050, 462265, 460424, 458578, 457240, 456459, 455444, 453665, 451772, 450768, 450867, 451760, 453470, 456164, 459486, 462781, 465769, 468456, 470684, 472393, 474136, 476717, 480288, 484148, 487341, 489240, 489784, 489488, 489170, 489535, 491064, 494113, 498678, 504135, 509809, 515770, 522410, 529231, 534896, 538729, 541288, 543096, 543717, 542621, 540246, 537525, 534928, 532553, 530651, 529451, 528763, 528209, 527501, 526250, 524060, 521174, 518515, 516774, 515989, 516321, 518527, 523178, 529947, 538045, 546768, 555282, 562713, 569046, 575304, 582228, 589351, 595849, 601551, 606582, 610812, 614515, 618880, 624932, 632362, 640241, 648463]
58563F48463R218J0533J1700J3001J4781J6756J8499J9897K0735K0559J9278J7237
58551H40657J4533J0970O888L192L38k026m197n907o828o972o531n923n936p096
58537H25162q946j0651j2133j3813j5370j5855j5035j3736j2797j2348j2138j1698
58525F70642j0414q195n904m359l283k134j289j235j257m31N10R9j350k005j296
58510F28099m92k50L87J923L146K942J881J115Q13O42O87J009J163Q10K04m08
58494F43671j048j423j045k51k9m52l86P78K137K665K519K408K588L128M336O202
58478F65798Q122R651J0917J1966J2414J2143J1602J1093J0402R372Q087O335
58466G87902L738O80j757l009l453l379k551j002N20J332J402J045O87R07J939
$$ y = [648463, 657681, 668214, 679914, 692915, 707696, 724452, 742951, 762848, 783583, 804142, 823420, 840657, 855190, 866160, 873048, 876240, 876578, 874552, 870355, 864448, 857620, 850648, 844117, 838194, 832258, 825162, 816216, 805565, 793432, 779619, 764249, 748394, 733359, 719623, 706826, 694478, 682340, 670642, 660228, 652033, 646129, 641770, 638487, 636353, 635064, 633829, 632572, 632141, 632651, 632750, 631400, 629395, 628099, 627607, 627357, 627744, 629667, 632813, 635755, 637636, 638751, 639564, 640206, 640893, 641902, 643065, 643875, 644079, 643671, 642623, 641200, 640155, 639904, 639875, 639423, 639037, 639815, 641952, 644617, 647136, 649544, 652132, 655260, 659596, 665798, 673920, 683571, 694488, 706454, 718868, 731011, 742613, 753706, 764108, 773480, 781567, 787902, 791640, 792320, 790563, 787554, 784101, 780722, 778171, 777169, 777689, 779021, 780423, 781468, 782155, 783062, 785001]
58451G85001L086L420K994K562K260J559L14j154k868m993o986q002q112p929
58437G61152p347n859l888k479j718q51K59J177K113L609N184N960O334P402Q856
58422G79904R453R345R882J1052J1293J0151Q937Q248P003M586K033K89r15j839
58408H69422k107j895k101k797l133l067l411l852l064j133K57O13J342L019M308
58393H52401M521M857O041O890O532N983O195O417N856N190N161N265M996M791
58379I31096M734L981K518J733K231K784K399J709J405J135R08J584L028L725
58365I64970L269L202M435N957P042Q473J0402J1466J1294J1516J2850J3665J2869
58352A081410J1808J1554J0915Q973P199P004P358O939O502P071P857Q009Q420
$$ y = [785001, 788087, 791507, 794501, 797063, 799323, 800882, 801196, 800042, 797174, 792181, 785195, 777193, 769081, 761152, 753805, 747946, 744058, 741579, 739861, 739010, 739269, 740446, 742559, 746168, 751352, 757312, 763646, 771048, 779904, 789357, 798702, 808584, 819636, 830929, 841080, 850017, 858265, 865268, 869854, 871887, 872176, 871261, 869422, 867315, 865420, 863319, 860522, 857389, 854322, 850911, 847059, 843995, 842862, 843119, 843732, 845074, 848093, 852401, 856922, 861779, 867820, 874710, 881242, 887225, 893420, 899837, 905693, 910883, 916044, 921309, 926305, 931096, 935830, 939811, 942329, 944062, 946293, 949077, 951476, 953185, 954590, 955725, 956633, 958217, 961245, 964970, 968239, 971441, 975876, 981833, 988875, 997348, 1007750, 1019216, 1030510, 1042026, 1054876, 1068541, 1081410, 1093218, 1104772, 1115687, 1124660, 1131859, 1138863, 1146221, 1153160, 1159662, 1166733, 1174590, 1182599, 1191019]
58339A191019R817J1028J1179J1507J2978J4301J4420J4737J6530J8319J8329
58328A344164J7546J7770J8510J8402J7927J8112J8162J6972J5431J4818J4449
58317A532263J3262J2142J2347J3138J3307J3367J4080J4467J3677J3051J4085
58306A679186J6027J7574J9132K1148K2411K2308K2609K4619K6739K7322K7470
58295A926545K8431K8847K7589K6684K8093K9998K9840K8794K9507L1437L2340
58284B248105L2586L4218L7088L9432M1070M2855M4470M5658M7886N1739N4818
58273B719925N5303N5262N7131N9386N9471N8532N9267O1285O2728O4333O7809
58262C380432P2113P5278P7997Q1677Q5284Q7820R1202R6650J01283J02611J03318
$$ y = [1191019, 1200836, 1211864, 1223043, 1234550, 1247528, 1261829, 1276249, 1290986, 1307516, 1325835, 1344164, 1361710, 1379480, 1397990, 1416392, 1434319, 1452431, 1470593, 1487565, 1502996, 1517814, 1532263, 1545525, 1557667, 1570014, 1583152, 1596459, 1609826, 1623906, 1638373, 1652050, 1665101, 1679186, 1695213, 1712787, 1731919, 1753067, 1775478, 1797786, 1820395, 1845014, 1871753, 1899075, 1926545, 1954976, 1983823, 2011412, 2038096, 2066189, 2096187, 2126027, 2154821, 2184328, 2215765, 2248105, 2280691, 2314909, 2351997, 2391429, 2432499, 2475354, 2519824, 2565482, 2613368, 2665107, 2719925, 2775228, 2830490, 2887621, 2947007, 3006478, 3065010, 3124277, 3185562, 3248290, 3312623, 3380432, 3452545, 3527823, 3605820, 3687497, 3772781, 3860601, 3951803, 4048453, 4149736, 4252347, 4355665]
58251D355665J06792J11261J13506J15198J19779J26137J31287J36478J44501
58242E460604J53651J60694J67275J76913J88272J97883K07045K19240K33296
58233G164873K46025K59074K76125K95855L14787L34398L58071L84057M09105
58224A0042370M35804M68305N04378N40259N79611O28382O84738P43897Q08801
58215A5436545Q85482R72311J065395J170333J296297J442763J605046J788606
58207B5662778K004607K257367K551871K908056L350659L890920M536507N311714
58199E2474479O245726P347919Q619177J0080580J1766053J3700839J5923282
58192A26158055J8512920K1541384K4975876K8618353L2019357L4277822L3961677
$$ y = [4355665, 4462457, 4573718, 4687224, 4802422, 4922201, 5048338, 5179625, 5316103, 5460604, 5614255, 5774949, 5942224, 6119137, 6307409, 6505292, 6712337, 6931577, 7164873, 7410898, 7669972, 7946097, 8241952, 8556739, 8891137, 9249208, 9633265, 10042370, 10478174, 10946479, 11450857, 11991116, 12570727, 13199109, 13883847, 14627744, 15436545, 16322027, 17294338, 18359733, 19530066, 20826363, 22269126, 23874172, 25662778, 27667385, 29924752, 32476623, 35384679, 38735338, 42626258, 47162765, 52474479, 58720205, 66068124, 74687301, 84767881, 96533934, 110234773, 126158055, 144670975, 166212359, 191188235, 219806588, 251825945, 286103767, 320065444]
58185C20065444K9591833K0649471Q298448m969110j6571041k4940777k9768729
58178C02355539l1559374l1109893k9215986k6539888k3552532k0553162j7732602
58171A22092102j5205171j3008529j1126268r529999q191838p071225o121035
58164E1838037n310393m624293m043464l543027l109154k739429k426518k156026
58156B3885733j919538j715793j539310j380653j237588j114117j008626r13581
58148A3056527q26292p49658o82843o21186n64981n18867m82561m50650m20969
58139G738520l94996l70831l44372l17088k94424k76643k58876k40010k23730
58130E017550k10742j97454j82971j70437j60786j51529j42206j34990j29459
$$ y = [320065444, 349657277, 370306748, 378605196, 373636086, 357065045, 332124268, 302355539, 270796165, 239686272, 210470286, 183930398, 160377866, 139824704, 122092102, 106886931, 93878402, 82752134, 73222135, 65030297, 57959072, 51838037, 46527644, 41903351, 37859887, 34316860, 31207706, 28468277, 26041759, 23885733, 21966195, 20250402, 18711092, 17330439, 16092851, 14978734, 13970108, 13056527, 12230235, 11480577, 10797734, 10176548, 9611567, 9092700, 8610139, 8159489, 7738520, 7343524, 6972693, 6628321, 6311233, 6016809, 5740166, 5481290, 5241280, 5017550, 4806808, 4609354, 4426383, 4255946, 4095160, 3943631, 3801425, 3666435, 3536976]
58121C536976j22641j14619j08513j04601r9921r3940q9169q5926q1743p6385
58111B559518p2294o9753o6475o2266n9284n7460n4494n0674m8751m8707m7455
58100A921905m4275m1793m0975l9763l7455l5942l5681l4725l2712l1731l2248
58089A514605l2129l0593k9379k9000k7662k4933k2918k2663k2706k2217k2286
58078A228119k3135k3235k2213k1706k2368k2820k2301k1605k0837j9158j7187
58067I91554j6692j7366j6933j5039j3842j4149j4173j3043j2249j2546j2537
58056H32985j1629j1412j2618j3433j2412j0769j0202j0486j0558j0118r107p359
58044G02882n653n301n996n975m930m545n549o482o305n972o431p101p365p693
$$ y = [3536976, 3414335, 3299716, 3191203, 3086602, 2986681, 2892741, 2803572, 2717646, 2635903, 2559518, 2487224, 2417471, 2350996, 2288730, 2229446, 2171986, 2117492, 2066818, 2018067, 1969360, 1921905, 1877630, 1835837, 1794862, 1755099, 1717644, 1681702, 1646021, 1611296, 1578584, 1546853, 1514605, 1482476, 1451883, 1422504, 1393504, 1365842, 1340909, 1317991, 1295328, 1272622, 1250405, 1228119, 1204984, 1181749, 1159536, 1137830, 1115462, 1092642, 1070341, 1048736, 1027899, 1008741, 991554, 974862, 957496, 940563, 925524, 911682, 897533, 883360, 870317, 858068, 845522, 832985, 821356, 809944, 797326, 783893, 771481, 760712, 750510, 740024, 729466, 719348, 710241, 702882, 697229, 691928, 685932, 679957, 675027, 670482, 664933, 658451, 652146, 646174, 639743, 632642, 625277, 617584]
58030F17584q261q318p853q044r164r843r278q466q275q056p162o162n586n004
58016E08112m300m288n142n639m979m061l997m490m533l727k308q29j00m81r72
58001D58266k62J315K167J766J078O28j08j139j593j277j125j650k462l401m647
57986D47556n584n290m267l891l993l053j005K48l32j607k328k507k212j028N49
57971D11256J068K74m94n98q85j626j735q74l06o67r26m95m36j414k373k410k204
57954C95155k424k449j884j658k294k743k214j633j967k591k584k195j783p72
57940C65964J022K469K810K925L713M646N163N958P398Q253P593O504O274O183
57926D36875M878K714Q73p01k643m336m818m733n488o917p657p420p159p236p081
$$ y = [617584, 609323, 601005, 593152, 585108, 575944, 566101, 556823, 548357, 540082, 532026, 524864, 518702, 513116, 508112, 503812, 499524, 494382, 488743, 483764, 479703, 475706, 471216, 466683, 462956, 460648, 459819, 459719, 459238, 458266, 458004, 459319, 461486, 463252, 464330, 464958, 464850, 463711, 462118, 460841, 459716, 458066, 455604, 452203, 447556, 441972, 436682, 432415, 428524, 424531, 421478, 420473, 420721, 420389, 418782, 416454, 413947, 411735, 410707, 411256, 412324, 412598, 412104, 411506, 410621, 408995, 407260, 406386, 406080, 405413, 404487, 403992, 403556, 402142, 399769, 397359, 395155, 392731, 390282, 388398, 386740, 384446, 381703, 379489, 377856, 375889, 373298, 370714, 368519, 366736, 365964, 366986, 369455, 372265, 375190, 378903, 383549, 388712, 394670, 402068, 410321, 417914, 424418, 430692, 436875, 441753, 444467, 445340, 444639, 441996, 437660, 432842, 428109, 422621, 415704, 408047, 400627, 393468, 386232, 379151]
57911C79151o544o036n400m058k269j037o60m90j58j07p88k100l551m469m325
57896C37159l426k930l459m150l757k236n70M92Q05M54j68l51J36N78K80m77j033
57879C17347j321j585j741j706j837k345k809k892k916l128l122k620k118k003
57865B85204j805j075k16L65J080K253L205L301L114L559M513N371O265P534Q636
57850C31304Q684P752O505N093L435K081J611J498P66n68j735k536l334l995m061
57835C52500l812l983m516m573l859k966k356j747p36N84J718K155J836J484K068
57820C33797L573M906N374N446N447M506J853j635m289n584o149o432o447o423
57806C27943o493o079m632k703j272l40O95J688J950J585J380J508J425R95O27
$$ y = [379151, 372607, 366571, 361171, 357113, 354844, 353807, 353147, 352657, 352499, 352392, 351604, 349504, 345953, 341484, 337159, 333733, 330803, 327344, 323194, 319437, 317201, 316631, 317123, 317928, 318382, 318214, 317863, 317999, 318577, 318857, 318380, 317347, 316026, 314441, 312700, 310994, 309157, 306812, 304003, 301111, 298195, 295067, 291945, 289325, 287207, 285204, 283399, 282324, 282108, 282473, 283553, 285806, 289011, 292312, 295426, 298985, 303498, 308869, 315134, 322668, 331304, 339988, 347740, 354245, 359338, 362773, 364854, 366465, 367963, 368729, 368161, 366426, 363890, 360556, 356561, 352500, 348688, 344705, 340189, 335616, 331757, 328791, 326435, 324688, 323952, 324536, 326254, 328409, 330245, 331729, 333797, 337370, 342276, 347650, 353096, 358543, 363049, 364902, 363267, 358978, 353394, 347245, 340813, 334366, 327943, 321450, 315371, 310739, 308036, 306764, 306424, 307119, 308807, 310757, 312342, 313722, 315230, 316655, 317650, 318277]
57791C18277L73r7o39p55m80k55m9M64J050J246J351J957K717K692J922J425J577
57774C32776J637J026O8p45j324j702k013k684l840m645m308l568l898n215n831
57759B95734m892l542l055l133k779j909j201j062j383j867k108j723p68K95J160
57744B67767J770J885J319O05N78J198J568J335J132J380J579J210N21r8p46j469
57728B81534j808j433p04j11L44P72R46O80K17j31l68m78k13M28R48R69P34O37
57710B82963O45M68j5p39j477j713r91M01J524J818J652J635J856K082K235K365
57694B94709K500K718L031L094K487J404N57K71J61j50n32p05n26K30J721L573
57678C14543N185O614Q443J0629J2499J4128J6650K0649K5360L0124L5498M1676
$$ y = [318277, 318650, 318553, 317914, 317159, 316679, 316424, 316375, 316839, 317889, 319135, 320486, 322443, 325160, 327852, 329774, 331199, 332776, 334413, 335439, 335507, 334762, 333438, 331736, 329723, 327039, 323199, 318554, 314246, 310678, 306780, 301565, 295734, 290842, 287300, 284245, 281112, 278333, 276424, 275223, 274161, 272778, 270911, 268803, 267080, 266312, 266607, 267767, 269537, 271422, 272741, 273346, 273924, 275122, 276690, 278025, 279157, 280537, 282116, 283326, 283847, 283749, 283003, 281534, 279726, 278293, 277589, 277478, 277822, 278594, 279540, 280220, 280437, 280306, 279938, 279460, 279247, 279675, 280623, 281592, 282326, 282963, 283608, 284076, 284061, 283322, 281845, 280132, 279141, 279542, 281066, 282884, 284536, 286171, 288027, 290109, 292344, 294709, 297209, 299927, 302958, 306052, 308539, 309943, 310500, 310771, 310932, 310782, 310250, 309545, 309019, 309249, 310970, 314543, 319728, 326342, 334785, 345414, 357913, 372041, 388691, 409340, 434700, 464824, 500322, 541998]
57666E41998M6555M6616L9617K5776P226j2468k8819l8413m1095l9444l6048l1992
57654D79509k7753k4015k0963j7847j4151j0584q193o915n806m455l401l103l128
57641C29195k695j646n78k5J88O59J599K471K564J785P21Qj41J38O25J055J142
57624C37065Q14L60J56K86N01N58M19J63o4j5M92J178J346O62k67n10M1O09O93
57605C44487O90J034J354J031K90j7M10J013J277J237J024N50m3k92j05q0n87
57588C53273j046o75K69P47L82o5K24J118J999K714L508M196M045K739J075L06
57572C74809P94J691J973J551J182J466K178K581K253J478R54J116J785K445K784
57557D01040K892K943K957K951L084L457L877M012L778L343K858K366J960J882
$$ y = [541998, 588553, 635169, 674786, 700562, 707788, 695320, 666501, 628088, 586993, 547549, 511501, 479509, 451756, 427741, 406778, 388931, 374780, 364196, 356003, 349088, 343282, 338827, 335426, 332323, 329195, 326500, 324854, 324276, 324251, 324439, 325098, 326697, 329168, 331732, 333517, 334238, 334246, 334105, 334243, 334868, 335923, 337065, 337879, 338239, 338395, 338681, 339182, 339740, 340159, 340322, 340258, 340243, 340735, 341913, 343259, 343921, 343654, 343144, 343185, 343794, 344487, 345177, 346211, 347565, 348596, 348886, 348869, 349279, 350292, 351569, 352806, 353830, 354380, 354337, 354045, 353940, 353860, 353273, 352227, 351552, 351821, 352568, 352950, 352885, 353109, 354227, 356226, 358940, 362448, 366644, 370689, 373428, 374503, 374809, 375603, 377294, 379267, 380818, 382000, 383466, 385644, 388225, 390478, 391956, 392910, 394026, 395811, 398256, 401040, 403932, 406875, 409832, 412783, 415867, 419324, 423201, 427213, 430991, 434334, 437192, 439558, 441518, 443400]
57543D43400K306L090L760L857L379K858K828L232L511L323K841K367K003J866
57529D84621K194K912L441L320K817K533K629K849L099L477L835L877L720L795
57515E29119M113M159L716L326L539M066M192L833L675M148M749M688L985L459
57501E84767L610L975L832L164K517K116J733J330J265J710K394L099L900M700
57487F24112N028M705M238M184M516M965N565O332O885O907O690O666O671O280
57473G03744N623N215N163N119M960M871M841M643M327M253M584N161N796O313
57459G74613O431O081N725N864O385O790O928O959O857O542O349O676P251P413
57445H66864P077O777O825P039P323P796Q317Q538Q461Q369Q237P850P463P579
$$ y = [443400, 445706, 448796, 452556, 456413, 459792, 462650, 465478, 468710, 472221, 475544, 478385, 480752, 482755, 484621, 486815, 489727, 493168, 496488, 499305, 501838, 504467, 507316, 510415, 513892, 517727, 521604, 525324, 529119, 533232, 537391, 541107, 544433, 547972, 552038, 556230, 560063, 563738, 567886, 572635, 577323, 581308, 584767, 588377, 592352, 596184, 599348, 601865, 603981, 605714, 607044, 608309, 610019, 612413, 615512, 619412, 624112, 629140, 633845, 638083, 642267, 646783, 651748, 657313, 663645, 670530, 677437, 684127, 690793, 697464, 703744, 709367, 714582, 719745, 724864, 729824, 734695, 739536, 744179, 748506, 752759, 757343, 762504, 768300, 774613, 781044, 787125, 792850, 798714, 805099, 811889, 818817, 825776, 832633, 839175, 845524, 852200, 859451, 866864, 873941, 880718, 887543, 894582, 901905, 909701, 918018, 926556, 935017, 943386, 951623, 959473, 966936, 974515]
57431I74515Q162Q781R451J0393J0997J0249Q403P101P295Q092Q216P740P572
57418A086967Q002Q625R152R550R731R716R831J0198J0442J0343J0301J0660J0986
57405A214504J0686R947R493R615J0030J0416J0641J0602J0369J0259J0458J0815
57393A337835J1290J2170J3396J4197J3971J3194J2813J3084J3611J4224J4976
57382A484761J5472J5073J3918J2979J2886J3238J3318J2995J2661J2629J2895
57371A632825J3250J3458J3432J3371J3571J4063J4620J5136J5704J6266J6480
57360A792176J6157J5652J5507J5797J6137J6317J6573J7060J7472J7564J7767
57349A974179J8616J9685J9855J8876J7828J7662J8001J8112J8263J9089K0135
$$ y = [974515, 982677, 991458, 1000909, 1011302, 1022299, 1032548, 1040951, 1048052, 1055347, 1063439, 1071655, 1079395, 1086967, 1094969, 1103594, 1112746, 1122296, 1132027, 1141743, 1151574, 1161772, 1172214, 1182557, 1192858, 1203518, 1214504, 1225190, 1235137, 1244630, 1254245, 1264275, 1274691, 1285332, 1295934, 1306303, 1316562, 1327020, 1337835, 1349125, 1361295, 1374691, 1388888, 1402859, 1416053, 1428866, 1441950, 1455561, 1469785, 1484761, 1500233, 1515306, 1529224, 1542203, 1555089, 1568327, 1581645, 1594640, 1607301, 1619930, 1632825, 1646075, 1659533, 1672965, 1686336, 1699907, 1713970, 1728590, 1743726, 1759430, 1775696, 1792176, 1808333, 1823985, 1839492, 1855289, 1871426, 1887743, 1904316, 1921376, 1938848, 1956412, 1974179, 1992795, 2012480, 2032335, 2051211, 2069039, 2086701, 2104702, 2122814, 2141077, 2160166, 2180301]
57338B180301K0283J9519J9019J9377J9887J9910J9780J9899K0014J9995K0434
57327B398418K1613K2581K2208K0665J9199J8712J9205K0285K1523K2520K3132
57316B630061K3507K3633K3201K2218K1291K0888K0776K0647K0777K1466K2320
57305B870785K2686K2529K2296K2234K2399K2866K3439K3475K2718K1966K2212
57294C119605K3380K4568K5276K5658K5813K5588K5078K4615K4291K3980K3790
57283C391642K3891K3994K3648K2978K2551K2502K2358K1830K1269K1198K1764
57272C639625K2672K3387K3453K2957K2529K2581K2792K2622K2125K1711K1445
57261C887899K1165K1029K1281K1654K1628K1256K1067K1162K1030K0360J9417
$$ y = [2180301, 2200584, 2220103, 2239122, 2258499, 2278386, 2298296, 2318076, 2337975, 2357989, 2377984, 2398418, 2420031, 2442612, 2464820, 2485485, 2504684, 2523396, 2542601, 2562886, 2584409, 2606929, 2630061, 2653568, 2677201, 2700402, 2722620, 2743911, 2764799, 2785575, 2806222, 2826999, 2848465, 2870785, 2893471, 2916000, 2938296, 2960530, 2982929, 3005795, 3029234, 3052709, 3075427, 3097393, 3119605, 3142985, 3167553, 3192829, 3218487, 3244300, 3269888, 3294966, 3319581, 3343872, 3367852, 3391642, 3415533, 3439527, 3463175, 3486153, 3508704, 3531206, 3553564, 3575394, 3596663, 3617861, 3639625, 3662297, 3685684, 3709137, 3732094, 3754623, 3777204, 3799996, 3822618, 3844743, 3866454, 3887899, 3909064, 3930093, 3951374, 3973028, 3994656, 4015912, 4036979, 4058141, 4079171, 4099531, 4118948]
57250D118948J8615J8159J8212J8821J9607J9948J9638J8925J8011J6919J5919
57239D321722J5476J5623J5787J5386J4368J3126J2177J1911J2273J2708J2697
57228D473254J2329J2081J2183J2493J2796J2859J2473J1826J1563J1932J2159
57217D607948J1289R460P656O448N630M963M429L752K570J119O1m92j029j679
57203D662125k032k113k635l896n173n706n662n671n965o393o844p183p152o783
57189D588917o535o705o930o670n859m864m017l572l755m548n557o358o883p366
57175D509298q048r010j0101j0983j1500j1951j2677j3467j3803j3682j3683j4178
57163D366215j4893j5407j5593j5475j5136j4939j5331j6258j7142j7658j8063
$$ y = [4118948, 4137563, 4155722, 4173934, 4192755, 4212362, 4232310, 4251948, 4270873, 4288884, 4305803, 4321722, 4337198, 4352821, 4368608, 4383994, 4398362, 4411488, 4423665, 4435576, 4447849, 4460557, 4473254, 4485583, 4497664, 4509847, 4522340, 4535136, 4547995, 4560468, 4572294, 4583857, 4595789, 4607948, 4619237, 4628697, 4636353, 4642801, 4648431, 4653394, 4657823, 4661575, 4664145, 4665264, 4665325, 4664833, 4663804, 4662125, 4660093, 4657980, 4655345, 4651449, 4646276, 4640570, 4634908, 4629237, 4623272, 4616879, 4610035, 4602852, 4595700, 4588917, 4582382, 4575677, 4568747, 4562077, 4556218, 4551354, 4547337, 4543765, 4540010, 4535462, 4529905, 4523547, 4516664, 4509298, 4501250, 4492240, 4482139, 4471156, 4459656, 4447705, 4435028, 4421561, 4407758, 4394076, 4380393, 4366215, 4351322, 4335915, 4320322, 4304847, 4289711, 4274772, 4259441, 4243183, 4226041, 4208383, 4190320]
57152D190320j8739j9833k1479k3790k6390k8525k9899l0891l1730l2040l1549
57141C895455l0683k9913k8963k7238k4698k1833j9003j6275j3788j1861j0703
57130C660497j0308j0506j1046j1679j2283j2721j2611j1531r438o514k604K667
57118C551923R070J5688K1841K7736L3923M0664M8194N7060O7809Q0658R5899
57107D050465J14182J36045J61496J90673K24786K66006L16432L77453M50039
57098F287577N35410O35295P51439Q84630J034225J198713J376308J564404J758721
57089A6026722J953704K143684K322635K482261K610177K688740K693835K595927
57081C5517685K367909J998914J505005R27773L21411k63187p89526j239072j607882
$$ y = [4190320, 4171581, 4151748, 4130269, 4106479, 4080089, 4051564, 4021665, 3990774, 3959044, 3927004, 3895455, 3864772, 3834859, 3805896, 3778658, 3753960, 3732127, 3713124, 3696849, 3683061, 3671200, 3660497, 3650189, 3639683, 3628637, 3616958, 3604675, 3591954, 3579343, 3567812, 3558374, 3551860, 3549256, 3551923, 3560993, 3576681, 3598522, 3626258, 3660181, 3700845, 3749039, 3806099, 3873908, 3954566, 4050465, 4164647, 4300692, 4462188, 4652861, 4877647, 5143653, 5460085, 5837538, 6287577, 6822987, 7458282, 8209721, 9094351, 10128576, 11327289, 12703597, 14268001, 16026722, 17980426, 20124110, 22446745, 24929006, 27539183, 30227923, 32921758, 35517685, 37885594, 39884508, 41389513, 42317286, 42638697, 42375510, 41585984, 40346912, 38739030]
57072C8739030j899292k117517k265687k347205k367077k332037k250654k133374
57064B1026187j991359j834727j671939j510229j355431j211085j078461r57728
57056I415228q48755p51009o63655n86193n18511m60123m09801l66170l28280
57047D482731k95533k67360k43128k21913k02398j83436j64834j47171j30799
57038B626159j15392j00419q5554p0487n4716l7727j9471j321J2769J6767O122
57027B176730j7995m8264p5627r4302j03168j03886r8890r0613q1194p2076o3878
57016A326837n6701n0401m4708l9489l4923l1332k8772k6917k5362k3917k2641
57005I41674k1589k0608j9364j7671j5775j4193j3258j2858j2644j2377j1988
$$ y = [38739030, 36839738, 34722221, 32456534, 30109329, 27742252, 25410215, 23159561, 21026187, 19034828, 17200101, 15528162, 14017933, 12662502, 11451417, 10372956, 9415228, 8566473, 7815464, 7151809, 6565616, 6047105, 5586982, 5177181, 4811011, 4482731, 4187198, 3919838, 3676710, 3454797, 3252399, 3068963, 2904129, 2756958, 2626159, 2510767, 2410348, 2324794, 2254307, 2199591, 2161864, 2142393, 2141072, 2153841, 2170608, 2176730, 2158735, 2110471, 2034844, 1940542, 1837374, 1733488, 1634598, 1543985, 1462791, 1390715, 1326837, 1270136, 1219735, 1175027, 1135538, 1100615, 1069283, 1040511, 1013594, 988232, 964315, 941674, 920085, 899477, 880113, 862442, 846667, 832474, 819216, 806358, 793714, 781337, 769349]
56994G69349j1426j0544r313q022p097o560n915m811l584k698j944q65j1q38l900
56979F91821p875j1012j2944j4346j5341j5326j4203j2733j1468j0150q496o842
56967E51085n632m680l404j554N51K383L729N003O919R551J1780J2095R942N931
56953F03699Q63m746j0164j4255j6314j6638j5953j4575j2510j0017p631n710
56941D76049m208k788j081J037L275N317P348R912J3032J5852J7377J7139J4904
56928E73165J0216K988n491j2870j7404j9180j9556j9662j9658j9245j8368j7179
56916D17756j5664j3752j1741j0145q967p652o037m877m838n331n065l729k337
56903C17621j822j918j727r07J30R00J285J472J706K159K906M025N545P129Q114
$$ y = [769349, 757923, 747379, 738066, 730044, 722947, 716387, 710472, 705661, 702077, 699379, 697435, 696570, 696559, 695721, 691821, 683946, 672934, 659990, 645644, 630303, 614977, 600774, 588041, 576573, 566423, 557927, 551085, 545453, 540773, 537369, 535815, 536366, 538749, 542478, 547481, 554400, 563951, 575731, 587826, 597768, 603699, 604562, 599816, 589652, 575397, 559083, 542445, 526492, 511917, 499407, 489390, 481759, 476049, 471841, 469053, 467972, 469009, 472284, 477601, 484949, 494861, 507893, 523745, 541122, 558261, 573165, 583381, 586369, 580878, 568008, 550604, 531424, 511868, 492206, 472548, 453303, 434935, 417756, 402092, 388340, 376599, 366454, 357487, 349835, 343798, 338921, 334083, 328752, 323687, 319958, 317621, 315799, 313881, 312154, 311247, 311377, 312277, 313562, 315034, 316740, 318899, 321805, 325830, 331375, 338504, 346618]
56888C46618Q274Q373R286J0548J0524Q221M355L57l066n885p959q982q969q213
56874C63482o915n239l497j825R5K463M824O660Q320J0701J3984J7405K0335K2943
56860D53736K5348K6653K5328K0454J2537L253n389j1963j6142j8386j9170j8571
56848D77688j6633j3761j0503p101l457N44M881R432J4031J8552K3130K8165L3808
56835E58776L9470M3900M5694M3594L6616K4668R268o737k0607l0892l7282l9918
56823F66550l9318l6623l3083k9184k4657j9380j3852q634l801Q44N400R929J4572
56810D88763J9338K3970K8043L0846L1028K7017J8387O631n750j6791k5490l1332
56798E94660l4116l4197l2339k9228k5375k1271j7237j3254r336n927l384j290
$$ y = [346618, 354892, 363265, 372551, 383099, 393623, 401844, 406199, 406556, 403490, 397605, 389646, 380664, 371695, 363482, 356567, 351328, 347831, 346006, 346101, 348564, 353388, 360048, 368368, 379069, 393053, 410458, 430793, 453736, 479084, 505737, 531065, 551519, 564056, 567309, 561920, 549957, 533815, 515429, 496259, 477688, 461055, 447294, 436791, 429690, 426233, 426777, 431658, 441090, 455121, 473673, 496803, 524968, 558776, 598246, 642146, 687840, 731434, 768050, 792718, 801986, 795249, 774642, 743750, 706468, 666550, 627232, 590609, 557526, 528342, 503685, 484305, 470453, 461819, 458018, 458862, 464262, 474191, 488763, 508101, 532071, 560114, 590960, 621988, 649005, 667392, 674023, 668273, 651482, 625992, 594660, 560544, 526347, 494008, 464780, 439405, 418134, 400897, 387643, 378307, 372380, 368996, 367706]
56786C67706J204M342P603J0465J2750J4209J4356J2871R663M575k285r772j5972
56773D31715j9708k1319k1722k1243j9769j7585j5444j3889j2926j2187j1215
56762B44708r747p977o398n257m395l693l328l370l514l482l383l342l107k413
56748A81302j576j221j508j948k003j613j104p97p66q63q98p84n66l49k94n32
56732A64480r36j112q35m32l78o37p30m73k08k82o11q60p55j82P29J517J797J667
56714A61759J431J034L19l21l04J31R3n56q47j44Q82J249R26M49q3q37j490j443
56696A62248o94J73O13M13l53j132j111k15M73j0j150j588q77K27J035J574J851
56679A61477J522N88j77q7N39P54R9q54j121l63P07J066N43l0M5N12O97M52J08
$$ y = [367706, 368910, 373252, 380855, 391320, 404070, 418279, 432635, 445506, 455169, 459744, 457459, 447687, 431715, 412007, 390688, 368966, 347723, 327954, 310369, 294925, 281036, 268110, 255923, 244708, 234961, 226984, 220586, 215329, 210934, 207241, 203913, 200543, 197029, 193547, 190164, 186822, 183715, 181302, 179726, 178505, 176997, 175049, 173046, 171433, 170329, 169532, 168766, 167903, 167005, 166221, 165655, 165306, 165012, 164480, 163544, 162432, 161597, 161165, 160787, 160150, 159420, 158947, 158739, 158457, 157846, 156986, 156231, 156049, 156778, 158295, 160092, 161759, 163190, 164224, 164543, 164222, 163918, 164049, 164142, 163586, 162739, 162595, 163477, 164726, 165652, 166101, 166018, 165181, 163691, 162248, 161554, 161727, 162340, 162753, 162400, 161268, 160157, 159942, 160415, 160405, 159255, 157667, 156790, 157017, 158052, 159626, 161477, 162999, 163587, 163410, 163323, 163862, 164616, 164715, 163861, 162740, 162377, 163084, 164150, 164693, 164663, 164708, 165220, 165917, 166369, 166477]
56660A66477j52k96j32M05Q38O58J35PM33Q63R38Q81R24R22P08L54K1j51OM44
56640A74283P00M07q2r8L70P48Q39J029J444J650J378R42O98O24O56Q65J102R90
56622A88545N23J34p6n04j218j576j122l07J30M8k89p53j199j213o44p6k03q98
56604A79302j434j439j190j073j226j545j732j425o71q1j18m65n22l17l51o46
56588A65067o51j31M73P42Q31J022J143Q47J90m43q36j008q26j3J313K379K419
56571A72518J569P93Q05J248J281P91O43J527K981L932M060M262N593P945R906
56556B19854R936P695M257J161p42j520j604j310r43r27j488k279k659k392j887
56541B25152j712j978k354k504k413k220k004j782j656j725j901j952j811j643
$$ y = [166477, 166325, 166029, 165897, 166302, 167140, 167798, 167933, 167940, 168373, 169236, 170174, 171055, 171979, 172901, 173609, 173963, 173984, 173833, 173839, 174283, 174983, 175390, 175308, 175210, 175580, 176328, 177167, 178196, 179640, 181290, 182668, 183610, 184308, 184932, 185588, 186453, 187555, 188545, 189068, 189202, 189126, 188622, 187404, 185828, 184706, 184399, 184529, 184577, 184288, 183535, 182336, 181123, 180479, 180403, 180200, 179302, 177868, 176429, 175239, 174166, 172940, 171395, 169663, 168238, 167567, 167486, 167368, 166903, 166381, 166064, 165713, 165067, 164416, 164285, 164758, 165500, 166331, 167353, 168496, 169343, 169533, 169090, 168254, 167246, 166420, 166407, 167720, 170099, 172518, 174087, 174880, 175685, 176933, 178214, 179005, 179648, 181175, 184156, 188088, 192148, 196410, 202003, 209948, 219854, 229790, 237485, 241742, 242903, 242161, 240641, 239037, 237727, 236784, 235857, 234369, 232090, 229431, 227039, 225152, 223440, 221462, 219108, 216604, 214191, 211971, 209967, 208185, 206529, 204804, 202903, 200951, 199140, 197497]
56527A97497j467j026k15M75L41o82j848k358k086j499j028p49n68m86o02q62
56511A82837r30m80L08P34K82p17j395j299q00m87m43l45o8J55J96L14P61J235
56493A79858J119L03n34o70j83L11M52L53J12k48l54L04J480K070J413K10m20
56476A85576l59l40o53q31n59j75RJ96O62J203J405J228J048J178J503J522Q07
56459A93420n10j667j895j092J38J033J140N11k84n03R5R91J506J495J296J149
56443A96823J058R79Q52N41J09r3J08L67L00J05K29P17J232J557J562R82j67j215
56425B06046j464j008m16J30P17J085R57P67J113J682J657J094Q26R82P92j3o96
56408B14251p66o40o48m48Q7L62J24KM39Q62P16M17N21P01M40R1L00Q47J022Q02
$$ y = [197497, 196030, 195004, 194789, 195264, 195605, 194923, 193075, 190717, 188631, 187132, 186104, 185355, 184787, 184301, 183699, 182837, 181907, 181427, 181735, 182469, 182751, 182034, 180639, 179340, 178540, 178053, 177610, 177265, 177197, 177352, 177548, 177862, 178623, 179858, 180977, 181280, 180746, 180076, 179893, 180204, 180656, 181009, 181121, 180873, 180519, 180823, 182303, 184373, 185786, 185996, 185576, 185217, 184877, 184224, 183393, 182834, 182659, 182668, 182864, 183526, 184729, 186134, 187362, 188410, 189588, 191091, 192613, 193420, 192910, 191243, 189348, 188256, 188394, 189427, 190567, 191078, 190794, 190291, 190386, 191377, 192883, 194378, 195674, 196823, 197881, 198860, 199712, 200253, 200362, 200269, 200377, 200744, 201044, 201149, 201378, 202095, 203327, 204884, 206446, 207428, 207261, 206046, 204582, 203574, 203158, 203288, 204005, 205090, 206047, 206814, 207927, 209609, 211266, 212360, 213186, 214168, 214960, 214947, 214251, 213485, 212845, 212197, 211749, 211836, 212198, 212322, 212324, 212763, 213625, 214341, 214758, 215279, 215980, 216420, 216511, 216811, 217658, 218680, 219482]
56388B19482P36R14Q65M51J27K37N94Q10P05M32L73P75J363J567J240P57M38L64
56370B32230P88J850K800K422P38p35q86l07o2j44j8K67M82R36J753K111J381
56353B45606L52J60M97K75l82k69Q63J896K070J883J916J923J479Q14M49O29J245
56336B61406J909K072J644J415K152L405L947L375K482J977J714J389J196J440
56322B91523J930K148J753R12K71L99R59Q89j31r80n75M99R05N69N64J199J604
56305C04438J406J347J891K394K233J853K000K665L347L821M120M190M010L642
56291C43357L040K165J336R53Q65O87P18J651L283M467M577M244M259M656N187
56276C85445N847O437O420N870N784O823Q302R094R046Q910R320J0421J2065J3822
$$ y = [219482, 220218, 221132, 221997, 222448, 222575, 222812, 223406, 224216, 224921, 225353, 225726, 226501, 227864, 229431, 230671, 231428, 231866, 232230, 233018, 234868, 237668, 240090, 240828, 240093, 239207, 238900, 238838, 238694, 238676, 238943, 239425, 240361, 242114, 244225, 245606, 245958, 246118, 246615, 246890, 246508, 246239, 247102, 248998, 251068, 252951, 254867, 256790, 258269, 259083, 259532, 260161, 261406, 263315, 265387, 267031, 268446, 270598, 274003, 277950, 281325, 283807, 285784, 287498, 288887, 290083, 291523, 293453, 295601, 297354, 298266, 298537, 298936, 299895, 300784, 300653, 299673, 299098, 299597, 300502, 301071, 301635, 302834, 304438, 305844, 307191, 309082, 311476, 313709, 315562, 317562, 320227, 323574, 327395, 331515, 335705, 339715, 343357, 346397, 348562, 349898, 350851, 351716, 352403, 353121, 354772, 358055, 362522, 367099, 371343, 375602, 380258, 385445, 391292, 397729, 404149, 410019, 415803, 422626, 430928, 440022, 449068, 457978, 467298, 477719, 489784, 503606]
56262E03606J5110J5832J6684J8404K0946K3771K6548K9250L1921L4792L8366
56251G75230M2909M8057N3257N8327O3321O8064P2203P5516P7938P9341P9479
56240A493642P8053P4773O9504O2327N3269M2108K8885J4452J07j3308k5494l6084
56228A842234m4705n1560n7243o1790o4681o5922o6305o6297o5401o3085n9711
56217A175534n6036n2371m8639m4911m1402l8245l5512l3164l0850k8183k5332
56206G40889k2879k0919j8942j6701j4571j2837j1302r892q943q434p682o251
56194E81536m665l653l196k755k074j295o23k03p0L5M12Q26P29K20J47Q75J668
56177E67914J762J472J678K553L426L714L573L668M434N522O019N506M698M638
$$ y = [503606, 518716, 534548, 551232, 569636, 590582, 614353, 640901, 670151, 702072, 736864, 775230, 818139, 866196, 919453, 977780, 1041101, 1109165, 1181368, 1256884, 1334822, 1414163, 1493642, 1571695, 1646468, 1715972, 1778299, 1831568, 1873676, 1902561, 1917013, 1917120, 1903812, 1878318, 1842234, 1797529, 1745969, 1688726, 1626936, 1562255, 1496333, 1430028, 1363731, 1298330, 1235245, 1175534, 1119498, 1067127, 1018488, 973577, 932175, 893930, 858418, 825254, 794404, 766221, 740889, 718010, 697091, 678149, 661448, 646877, 634040, 622738, 612846, 603903, 595469, 587787, 581536, 576871, 573218, 570022, 567267, 565193, 563898, 563275, 563072, 563002, 563037, 563449, 564275, 565004, 565224, 565371, 566246, 567914, 569676, 571148, 572826, 575379, 578805, 582519, 586092, 589760, 594194, 599716, 605735, 611241, 615939, 620577]
56163F20577N431O372P122P927Q792R380R828J0759J2338J4166J6205J8853K1946
56150G69696K4759K7250L0280L4276L8789M3773N0154N8491O8065P7656Q6193
56139A309382R2045R3051Q8253P8905O7216N4961M3823L5724L1640L0684L1049
56128A956733L1071K8999K3241J4115M421k944p387r974j1755j3950j8772k8137
56116A965661m1550n6279o9330p8599q2847q1962p7159p0078o1774n2992m4661
56105A248430l7328l0660k4334j8843j4656j1257p878m672k298q85r0M13J159
56092A097101K849N360P505Q495Q827R118R196R021R342J0412J1253J1308J1582
56079A211369J2819J3884J3537J2718J3233J4962J6162J6029J5280J4701J4622
$$ y = [620577, 626008, 632380, 639502, 647429, 656221, 665601, 675429, 686188, 698526, 712692, 728897, 747750, 769696, 794455, 821705, 851985, 886261, 925050, 968823, 1018977, 1077468, 1145533, 1223189, 1309382, 1401427, 1494478, 1582731, 1661636, 1728852, 1783813, 1827636, 1863360, 1895000, 1925684, 1956733, 1987804, 2016803, 2040044, 2054159, 2058580, 2055636, 2048249, 2038275, 2026520, 2012570, 1993798, 1965661, 1924111, 1867832, 1798502, 1719903, 1637056, 1555094, 1477935, 1407857, 1346083, 1293091, 1248430, 1211102, 1180442, 1156108, 1137265, 1122609, 1111352, 1103474, 1098802, 1096504, 1095619, 1095529, 1095942, 1097101, 1099950, 1105310, 1112815, 1121310, 1130137, 1139255, 1148451, 1157472, 1166814, 1177226, 1188479, 1199787, 1211369, 1224188, 1238072, 1251609, 1264327, 1277560, 1292522, 1308684, 1324713, 1339993, 1354694, 1369316]
56068A369316J5402J6949J8185J8389J8466J9519K0899K1283K1079K1860K3817
56057A585164K5578K6403K6916K7609K8214K8617K9090K9615K9988L0394L0967
56046A898555L1184L0741L0442L1073L2087L2578L2820L3558L4632L5696L7445
56035B260811M0553M4190M7110M9467N2049N4524N6148N7345N8901O0517O1847
56024B843462O3837O7150P0298P1554P1826P3442P6861Q0746Q4421Q8026R1139
56013C682762R3538R6539J01305J06682J10919J14471J18740J23333J27272J31728
56003D807289J38500J46829J54719J62437J71556J81629J91100K00487K11273
55994F365819K22710K33403K44941K60075K78222K96720L15547L36636L59564
$$ y = [1369316, 1384718, 1401667, 1419852, 1438241, 1456707, 1476226, 1497125, 1518408, 1539487, 1561347, 1585164, 1610742, 1637145, 1664061, 1691670, 1719884, 1748501, 1777591, 1807206, 1837194, 1867588, 1898555, 1929739, 1960480, 1990922, 2021995, 2054082, 2086660, 2119480, 2153038, 2187670, 2223366, 2260811, 2301364, 2345554, 2392664, 2442131, 2494180, 2548704, 2604852, 2662197, 2721098, 2781615, 2843462, 2907299, 2974449, 3044747, 3116301, 3188127, 3261569, 3338430, 3419176, 3503597, 3591623, 3682762, 3776300, 3872839, 3974144, 4080826, 4191745, 4306216, 4424956, 4548289, 4675561, 4807289, 4945789, 5092618, 5247337, 5409774, 5581330, 5762959, 5954059, 6154546, 6365819, 6588529, 6821932, 7066873, 7326948, 7605170, 7901890, 8217437, 8554073, 8913637]
55985H913637L82529M06764M35261M67850N02349N39809N83468O33285O86989
55976A3551941P45908Q14089Q92258R78590J075020J186699J316034J463901J636026
55967B3660466J841211K084539K370356K710995L123859L621382M213738M919886
55959D8546432N763853O760325P916311R247161J0779019J2539713J4565833J6914341
55951A33032988J9634458K2700358K5940311K8944727L0933601L0738089K7163882
55944C19088414J9718524R188866k507526j3180198k1286606k6301952k8500188
55937B56219334k8530992k7106280k4843114k2201859j9488894j6897799j4543803
55930A02606593j2476515j0695791r179446p900309o825187n916244n142130m482120
$$ y = [8913637, 9296166, 9702930, 10138191, 10606041, 11108390, 11648199, 12231667, 12864952, 13551941, 14297849, 15111938, 16004196, 16982786, 18057806, 19244505, 20560539, 22024440, 23660466, 25501677, 27586216, 29956572, 32667567, 35791426, 39412808, 43626546, 48546432, 54310285, 61070610, 68986921, 78234082, 89013101, 101552814, 116118647, 133032988, 152667446, 175367804, 201308115, 230252842, 261186443, 291924532, 319088414, 338806938, 347995804, 345488278, 332308080, 311021474, 284719522, 256219334, 227688342, 200582062, 175738948, 153537089, 134048195, 117150396, 102606593, 90130078, 79434287, 70254841, 62354532, 55529345, 49613101, 44470971, 39988851]
55922C9988851l918279l432052l010426k647339k336129k066765j831937j629147
55914A9116777j454880j302475j167610j050270r49470q60890p81406p11224o49883
55905A0188669n94426n43163m97384m57839m22815l90842l62062l36063l11539
55896F272536k88732k69101k52066k35300k18498k03445j90012j75753j60386
55887D279243j47129j38516j33856j31630j31188j31088j28862j23900j18094
55878C094980j12576j06296r8677r1134q4865p9514p5020p2348p1327p0011o7340
55867B165872o4398o2042n9400n5784n2081m9057m6064m2660l9800l8297l7490
55856A618799l6426l5095l3767l2394l1274l0980l1148l0739k9911l0003l1257
$$ y = [39988851, 36070572, 32638520, 29628094, 26980755, 24644626, 22577861, 20745924, 19116777, 17661897, 16359422, 15191812, 14141542, 13192072, 12331182, 11549776, 10838552, 10188669, 9594243, 9051080, 8553696, 8095857, 7673042, 7282200, 6920138, 6584075, 6272536, 5983804, 5714703, 5462637, 5227337, 5008839, 4805394, 4615382, 4439629, 4279243, 4132114, 3993598, 3859742, 3728112, 3596924, 3465836, 3336974, 3213074, 3094980, 2982404, 2876108, 2777431, 2686297, 2601432, 2521918, 2446898, 2374550, 2303223, 2233212, 2165872, 2101474, 2039432, 1980032, 1924248, 1872167, 1823110, 1777046, 1734386, 1694586, 1656289, 1618799, 1582373, 1547278, 1513511, 1481117, 1449843, 1418863, 1387715, 1356976, 1327065, 1297062, 1265805]
55845A265805l2184l1827l0906l0081k8843k6914k5163k4108k3014k1322j9726
55834I71717j8859j8206j7166j6118j5539j5034j4024j2560j0975r591r092j0122
55822H04431j2122j3606j4025j4157j4480j4410j3619j2770j2400j2173j1787
55811F58882j1436j1017r971q433p323o899o389n465m778m583m131l010j849j143
55797E72455o00j79m84j544k371k307j657o20J064L022M348N359P481J0568J1948
55782F06483R401L634l189r849j5674j9345j9915j8235j5871j3210r889o184k706
55769D85451M53K847K724j228p500j2728j5033j5197j4619j3544j1601q947o288
55756C84790m240k992k316j863j697k262l598m951n584n618n661n966o414o902
$$ y = [1265805, 1233621, 1201794, 1170888, 1140807, 1111964, 1085050, 1059887, 1035779, 1012765, 991443, 971717, 952858, 934652, 917486, 901368, 885829, 870795, 856771, 844211, 833236, 823645, 814553, 804431, 792309, 778703, 764678, 750521, 736041, 721631, 708012, 695242, 682842, 670669, 658882, 647446, 636429, 626458, 618025, 610702, 603803, 597414, 591949, 587171, 582588, 578457, 575447, 573598, 572455, 571855, 571676, 571192, 569648, 567277, 564970, 563313, 562693, 563757, 566779, 571127, 576486, 583967, 594535, 606483, 615884, 619518, 616329, 606480, 590806, 571461, 551546, 533311, 517440, 504230, 494341, 488157, 485451, 485904, 488751, 491475, 490247, 482747, 470019, 454986, 439789, 425170, 411626, 400025, 391078, 384790, 380550, 377558, 375242, 373379, 371682, 369420, 365822, 360871, 355287, 349669, 344008, 338042, 331628, 324726]
55742C24726p293p259o688n884n120m299l413k787k569k482k390k507k746k678
55728B66611k449k904m147m965m504l644l682m437m761m368l886l448k529j174
55714B15713k14j02l82m47j13O25J613K287K086J250N19j2r54k364l268k945j983
55697B11309j550j932k513k920l420m154m580m105k964j964j480j151o05QM14
55682A78393O22O27K10m64n56L85J418J171l11j559j629j057o95n07OQ93J786
55665A78733K379K447J838Q41J32LK3k37o11p36n98l68j13K8j80o15p39k93K77
55646A82211L81k6n36p56n26k7K09j68p47q33n28o25j352j978j994j902k377l247
55628A65179l846l871l506l064k849k975l063k597j707j100j079j237j240j173
$$ y = [324726, 317433, 310174, 303486, 297602, 292482, 288183, 284770, 281983, 279414, 276932, 274542, 272035, 269289, 266611, 264162, 261258, 257111, 252146, 247642, 243998, 240316, 235879, 231118, 226750, 222864, 219416, 216887, 215713, 215499, 215397, 215015, 214568, 214455, 215080, 216693, 218980, 221066, 222316, 222835, 222823, 221869, 219505, 216237, 213292, 211309, 209759, 207827, 205314, 202394, 198974, 194820, 190240, 186135, 183171, 181207, 179727, 178576, 177971, 177979, 178393, 179015, 179642, 179852, 179388, 178832, 179217, 180635, 181806, 181495, 179936, 178307, 177250, 176555, 176048, 176054, 176947, 178733, 181112, 183559, 185397, 186238, 186370, 186373, 186396, 186159, 185548, 184812, 184214, 183846, 183733, 183761, 183581, 182966, 182227, 181934, 182211, 182592, 182566, 182030, 181274, 180748, 180721, 180930, 180762, 180015, 179182, 178654, 178029, 176677, 174699, 172705, 170803, 168426, 165179, 161333, 157462, 153956, 150892, 148043, 145068, 142005, 139408, 137701, 136601, 135522, 134285, 133045, 131872]
55614A31872j011n40k9p8n52o45l33o21j879l002k980k236j608j064l32J21j34
55597A14949m96k93m6o37j702k100j631j132j066j060p89m18j48m1j77m72m94
55580A02247n4L63L37K60O79J379J856K252L015M013M758N081M847L589J312p98
55564A35136j573j320j173j405j506j473j744k133k148k142k827l722l549k266
55550A06155j281j348j601j159l97l2J2P0n8o22j281j515j269p36k1P01J130J233
55532I7981J232J054M33l18m30K24Q29Q02M82K95L9m76p89m56J28L08J58K06M70
55513A02172L80l22j197j687j721j619j602j582j395j131j000r70p63m56n75j260
55497H5272j763j388n78l14o78q86o75n79p71o66r7J30n23j330j255l88L79O10
$$ y = [131872, 130861, 130321, 130292, 130214, 129662, 129017, 128684, 128063, 126184, 123182, 120202, 117966, 116358, 115294, 114962, 115083, 114949, 114453, 114160, 114114, 113477, 111775, 109675, 108044, 106912, 105846, 104786, 103997, 103579, 103431, 103390, 103213, 102741, 102247, 102193, 102556, 102893, 103153, 103832, 105211, 107067, 109319, 112334, 116347, 121105, 126186, 131033, 134622, 135934, 135136, 133563, 132243, 131070, 129665, 128159, 126686, 124942, 122809, 120661, 118519, 115692, 111970, 108421, 106155, 104874, 103526, 101925, 100766, 100369, 100337, 100349, 100419, 100361, 99739, 98458, 96943, 95674, 94938, 94917, 95618, 96748, 97981, 99213, 100267, 100700, 100382, 99952, 100176, 101005, 101807, 102289, 102584, 102623, 102147, 101358, 100902, 101030, 101338, 101496, 101702, 102172, 102552, 102230, 101033, 99346, 97625, 96006, 94404, 92822, 91427, 90296, 89296, 88326, 87563, 87107, 86532, 85272, 83509, 82121, 81543, 81229, 80551, 79665, 78990, 78411, 77640, 76974, 76877, 77007, 76484, 75154, 73899, 73511, 73890, 74500]
55479G4500N65M77L59L30N35P42N94K12K6P8J6k50l85k66k48n70q52n92O6M41
55459G5778J68m55r43j150j141q55k52L98P16P37Q30J049R62L04n32q73m85K55
55441G4511P60P09L16J03K26J57n10j178q35L63J016K88j014j638j351o45J96
55424G1474Q82P48l70j401j203j23O18P17Q58J200J087L21m23o09l72Q4O54Q40
55406G4982J55q13q30J50O84j64j514j996j481p15n3N95J013Q06J02m95o38m97
55388F9291l98m59n01k28L64P60N10l1p8M46P80N02J43L07P88R85P06J41n58j255
55368G2215j710j762j473r47l33L8K0R9Q41J772J714M21r39j382j272j333j352
55351F4617p10L72J083J104P89M14J5k46k39k38o03j094j086m22K84L14m07j195
$$ y = [74500, 75065, 75542, 75901, 76231, 76766, 77508, 78102, 78314, 78340, 78418, 78434, 78184, 77799, 77533, 77285, 76715, 75863, 75271, 75337, 75778, 75946, 75491, 74548, 73398, 72257, 71402, 71150, 71548, 72264, 73001, 73831, 74880, 75842, 76146, 75614, 74741, 74256, 74511, 75271, 75980, 76296, 76399, 76625, 76782, 76272, 75094, 74259, 74622, 75638, 75926, 74912, 73274, 71923, 71278, 71474, 72356, 73104, 72734, 71333, 70130, 70007, 70625, 71342, 72200, 73400, 74487, 74808, 74385, 73776, 73404, 73488, 74142, 74982, 75137, 74324, 73494, 73644, 74328, 74164, 72650, 70654, 69173, 68458, 68405, 69000, 70013, 70819, 70921, 70426, 69788, 69291, 68893, 68434, 67933, 67705, 68069, 68829, 69339, 69308, 69230, 69676, 70456, 70958, 71101, 71408, 72196, 73181, 73887, 74028, 73470, 72215, 70505, 68743, 67270, 66323, 65990, 66028, 66048, 66147, 66988, 68760, 70474, 70895, 69956, 68574, 67302, 65969, 64617, 63907, 64279, 65362, 66466, 67255, 67669, 67684, 67438, 67199, 66961, 66358, 65264, 64178, 63756, 64040, 64354, 63947, 62752]
55333F2752j183j77R94J337Q53L99L20K3p80j283p34K73N43p4o03l53L97J062
55315F3766J372J287Q92N22N47Q80R85N23k87r27j060p84n03n34p10n98m7P02
55297F6026J482K243K603K036P71j69l37n14j375k126j542R3J147P47k98q17o41
55280F9329l63l66n62o61l70M02J297J694J334N37k19p34j044j199j170p98O9
55263F7176J163J669R55n70j734j843j325r40p97m28L46R99R14J66m75l90K31
55246F5117P16P92P86R26R04M15k29m35j30J83R0l33p77j028j030p99m03J07P14
55227F5586J292J536J247N97m3m96q17j036j021o54k0O11R81J050R55P82M79J35
55209G1164J19O23J239J361R91O31M41O3n64r32p65n88r18j397j274m96K09K63
$$ y = [62752, 61569, 61392, 62386, 63723, 64576, 64975, 65295, 65318, 64538, 63255, 62521, 62794, 63337, 63263, 62660, 62307, 62704, 63766, 65138, 66425, 67317, 67839, 68386, 69266, 70251, 70774, 70487, 69560, 68500, 67716, 67213, 66679, 65969, 65371, 65324, 66026, 67508, 69751, 72354, 74390, 75161, 74992, 74655, 74141, 72766, 70640, 69098, 69191, 70338, 71085, 70787, 69970, 69329, 68966, 68600, 68038, 67377, 67007, 67409, 68706, 70400, 71734, 72271, 72052, 71318, 70274, 69075, 67905, 67107, 67176, 68339, 70008, 70963, 70393, 68659, 66816, 65491, 64551, 63754, 63326, 63672, 64671, 65585, 65751, 65276, 64886, 65117, 65833, 66625, 67411, 68337, 69241, 69656, 69427, 68992, 68862, 69045, 69135, 68802, 68025, 66997, 65967, 65168, 64765, 64872, 65586, 66878, 68414, 69661, 70258, 70215, 69719, 68902, 67866, 66845, 66191, 66171, 66782, 67763, 68813, 69768, 70550, 71029, 71164, 71283, 71906, 73145, 74506, 75497, 76128, 76569, 76632, 76068, 75136, 74371, 73783, 72865, 71468, 70194, 69698, 69907, 70170]
55191G0170j66n07m12l5J16k32p36p98l75M5K69O35J148J114J91p68o76L46J204
55172G0533J309J093J088J213J110P07K00k09l93l29r6K11N28O75M19j87p43r70
55154G6159r91r34o82k57m8k67n04l36l2j50o06p91m83j31j89n63p91n55J0M02
55134F8261L41K65Q21J799K122J269O2m71l87l28l45m6M12M55N8k63l29l60l03
55115G3033J08O54Q03O45P78J182J045L1j028j138l13O36J053Q86N04L11L40K07
55097G9737l18p87n65K33P83O15J40M1N17J245J695J523R51O41Q94J094M98p05
55079H8232j663k022k091j975j448o73k07q7K89J047J435R18J9m76n55p24j057
55062G8962j113o26J06N30M16J72M44J259J759J229J05n94o46o29p48n53mJ67
$$ y = [70170, 70004, 69497, 69085, 69050, 69166, 68934, 68198, 67400, 67025, 67070, 67339, 67974, 69122, 70236, 70427, 69659, 68983, 69329, 70533, 71842, 72935, 74023, 75236, 76346, 77053, 77253, 77044, 76651, 76322, 76226, 76437, 76965, 77640, 78059, 77872, 77129, 76159, 75168, 74234, 73552, 73295, 73247, 72980, 72476, 72140, 72108, 71958, 71352, 70561, 70078, 69947, 69758, 69195, 68404, 67849, 67859, 68261, 68602, 68867, 69688, 71487, 73609, 74878, 74940, 74469, 74082, 73754, 73409, 73363, 73775, 74230, 74288, 74025, 73696, 73336, 73033, 73141, 73795, 74598, 75243, 76021, 77203, 78248, 78279, 77251, 76113, 75800, 76436, 77489, 78375, 78879, 79190, 79530, 79737, 79419, 78632, 78067, 78300, 79083, 79698, 79838, 79879, 80396, 81641, 83336, 84859, 85810, 86451, 87345, 88439, 88937, 88232, 86569, 84547, 82456, 80481, 79033, 78360, 78153, 78066, 78355, 79402, 80837, 81755, 81774, 81298, 80743, 80019, 78962, 77849, 77223, 77329, 77859, 78275, 78447, 78891, 80150, 81909, 83138, 83243, 82649, 82003, 81374, 80626, 80073, 80069, 80236]
55044H0236m31j185j318p92j0P50J218J100N99L29L45n7j078j724j111J46P09
55027G7726K86k17j67M4j83p18q40j19R83J459Q23k29o04k33r4p25j394j222m55
55008G4121rj55l88k56K56R53J529J568J028N11O08J139J422J203P90M52J91Q
54990H4971J9J99M50P33R70R51O66M66N45N29N3m92l95L02P58M24l70r57j073
54971H8749q50m71r1J48J89J22O1N0P6J01J41L19P63J318J596J403J015Q30Q70
54952I6339P52J52p91j460j291m88Km09j040p60L66J047O16m7J01P91J104R11
54934I5895O91M38k32j047j229o80r0J68M10P44P01J44k72j1N70Q84J019J475
54916I9578K296L070L537L785L940M061M234M412M208L284J874N79m02j458k828
$$ y = [80236, 79805, 78620, 77302, 76510, 76500, 77250, 78468, 79568, 80167, 80496, 80841, 80784, 79706, 77982, 76871, 77017, 77726, 78012, 77795, 77628, 77672, 77489, 76771, 75931, 75812, 76795, 78254, 79077, 78848, 78244, 78011, 77917, 77192, 75798, 74576, 74121, 74112, 73957, 73569, 73313, 73569, 74522, 76051, 77619, 78647, 79158, 79766, 80905, 82327, 83530, 84320, 84772, 84963, 84971, 84990, 85189, 85639, 86372, 87342, 88293, 88959, 89425, 89970, 90499, 90552, 90060, 89665, 89967, 90725, 91149, 90779, 89822, 88749, 87899, 87428, 87337, 87485, 87674, 87796, 87857, 87907, 87983, 88084, 88225, 88544, 89307, 90625, 92221, 93624, 94639, 95469, 96339, 97091, 97243, 96452, 94992, 93701, 93213, 93215, 92806, 91766, 91006, 91372, 92419, 93035, 92988, 93089, 93880, 94984, 95895, 96586, 97024, 96792, 95745, 94516, 93836, 93746, 93914, 94324, 95068, 95769, 95913, 95641, 95630, 96200, 97084, 98103, 99578, 101874, 104944, 108481, 112266, 116206, 120267, 124501, 128913, 133121, 136405, 138279, 138858, 138456, 136998, 134170]
54901A34170m037m419m028l597l546l441k719j609r52j102j526j529j050m60J6
54886A00171L37L59p5p10r77n86J30O07O18M44N51J139J960K522K520K167K077
54869A13254K765M080N129M937L423J576M81K71K87N5l40p61j339k165l070l912
54853A24671m681n139m894m009l150k777k645k391k151k123j959j217j87L01j06
54838H7543q85j241q42j5N68N01J36J36M85M32k61p02j18Q06P98j56q35o05j45
54819H5600j63l47r5M56P54P24P11Q45R34Q24N35J87K1L27J002J401J022K02k50
54800I4690n0K58Q2m91r32r69p29l32K98J042J412J055L09j21l9J35J08R6K78
54781I6100L62P7k92k90O9M88R07J307J260L60q76j309m63R60K058K633K881K787
$$ y = [134170, 130133, 125714, 121686, 118089, 114543, 111102, 108383, 106774, 105822, 104720, 103194, 101665, 100615, 100155, 100171, 100508, 100867, 100792, 100082, 99105, 98519, 98649, 99256, 99874, 100318, 100869, 102008, 103968, 106490, 109010, 111177, 113254, 116019, 120099, 125228, 130165, 133588, 135164, 135645, 135916, 136203, 136258, 135918, 135157, 133818, 131653, 128583, 124671, 119990, 114851, 109957, 105948, 102798, 100021, 97376, 94985, 92834, 90711, 88752, 87535, 87348, 87649, 87543, 86658, 85417, 84575, 84560, 85128, 85629, 85765, 85901, 86386, 86818, 86557, 85855, 85737, 86543, 87341, 87185, 86350, 85745, 85600, 85437, 85090, 84995, 85451, 86205, 86929, 87640, 88485, 89419, 90243, 90778, 90965, 90986, 91313, 92315, 93716, 94738, 94940, 94690, 94640, 94898, 94980, 94489, 93557, 92588, 91859, 91527, 91825, 92867, 94279, 95334, 95643, 95522, 95483, 95618, 95726, 95822, 96100, 96462, 96539, 96247, 95957, 96026, 96514, 97421, 98728, 99988, 100348, 99472, 98163, 97700, 98660, 100718, 103351, 106232, 109019]
54763A09019K325J906K083K862L705M178M266M126L810L319K724K096J426N96
54749A48441n08j855l153m018m353m468m625m572l845k555j566j635k540l326
54735A05422l306k552j553p47l55k49R0R82J802J492J67m98P18K784L613K782
54719A10592J840J925K442K486K379K822L513L665L405L493L823L267J253j300
54705A45605k915l043k395k066k570l466l919l613l034k775k774k495j698p72
54691A08070l34o78j488k085k047j585j097n72J61P45O15l3l90k84l70q15q19
54674I6994m2N75J73p16j148j148j170r51j48N62L16l74l76K06L22j10j57K89
54656I3097K19o58j300r89l22M0L60Q91J114N82k19o44p12o55l34K61O49N64M38
$$ y = [109019, 111344, 113250, 115333, 118195, 121900, 126078, 130344, 134470, 138280, 141599, 144323, 146419, 147845, 148441, 147933, 146078, 142925, 138907, 134554, 130086, 125461, 120889, 117044, 114489, 112923, 111288, 108748, 105422, 102116, 99564, 98011, 97264, 96909, 96660, 96750, 97732, 99534, 101026, 101193, 100695, 101413, 104197, 107810, 110592, 112432, 114357, 116799, 119285, 121664, 124486, 127999, 131664, 135069, 138562, 142385, 145652, 146905, 145605, 142690, 139647, 137252, 135186, 132616, 129150, 125231, 121618, 118584, 115809, 113035, 110540, 108842, 108070, 107736, 107058, 105570, 103485, 101438, 99853, 98756, 98184, 98345, 99090, 99705, 99672, 99282, 98998, 98628, 97813, 96994, 96952, 97527, 97700, 96984, 95836, 94688, 93518, 92567, 92419, 92981, 93297, 92923, 92547, 92753, 93075, 92965, 92808, 93097, 93316, 92658, 91358, 90369, 90047, 90087, 90447, 91338, 92452, 93034, 92815, 92171, 91459, 90804, 90470, 90731, 91380, 91944, 92382]
54637I2382O48Q93P95N28L60J55j56k63n9M2j91m14m89q31j453j535o49L22L50
54618I0435k90n84k93M9K15L76L95M6k52J13P76O15o55j865j740l99R14J280R22
54599I0058O76R16J216J063O12M29O78J029J266J400J251N95k09m53j73j34n56
54582I9664o96j30M54L83K3J1J86Q6j35j14o4k82m27j13K38M6l70l38mJ4j99p1
54560I8162L04K86j81m83l62j36M7L02M43J68k15q8M81Q97J063J357J687J510
54542A05242Q54L38J48q7l65k76O0R0PN57J532J688P13n4L83J173J044K27j50
54523A13124Q2J10l46o45l01L52O51L03m53j053j123r86j258j821j815r78k27
54506A03616k91m98J64J353J844J377R00R61R72L49n52j097j213j121p89j88L27
$$ y = [92382, 93030, 93923, 94718, 95246, 95606, 95761, 95605, 95342, 95283, 95325, 95134, 94720, 94231, 93400, 91947, 90412, 89763, 90085, 90435, 90145, 89561, 89268, 89317, 89532, 89908, 90303, 90349, 90097, 90210, 90986, 91601, 90946, 89081, 87341, 86942, 87856, 89136, 90058, 90734, 91650, 92866, 93929, 94541, 94970, 95648, 96677, 97943, 99343, 100594, 101189, 100980, 100527, 100354, 100220, 99664, 98968, 98838, 99292, 99675, 99698, 99709, 99895, 99981, 99846, 99732, 99668, 99386, 98959, 98846, 99084, 99130, 98760, 98422, 98418, 98432, 98233, 98162, 98466, 98752, 98571, 98088, 97726, 97590, 97637, 97939, 98382, 98550, 98335, 98247, 98728, 99625, 100688, 102045, 103732, 105242, 106096, 106434, 106582, 106495, 106130, 105854, 105914, 106004, 106011, 106568, 108100, 109788, 110501, 110447, 110830, 112003, 113047, 113274, 113124, 113206, 113316, 112970, 112325, 112024, 112376, 113027, 113330, 112877, 111824, 110701, 109715, 108457, 106636, 104821, 103843, 103616, 103325, 102827, 102991, 104344, 106188, 107565, 108465, 109426, 110398, 110747, 110195, 109098, 107885, 106764, 105975, 105787, 106114]
54489A06114M42M19P34J322J626J348P49J89k91p94j246j443j330j002n25J40
54473A06452R79J790K264K231J779J157O16K75J13Q5J76L32L80K15K5K07Q61J531
54455A21468J581Q43j96q03o40n1K24j67p89r93q33r31j394j490p51J90M34K5
54437A15727l48n24q54j213r25J03J071J354J225J169J097P13J37k42k54M0M96
54420A18772P79N38o7m02k01J02J55K91Q57J448J407O84k73j191j884j925j101
54403A17989l9L84J33n8K15O99J175J622J681Q23o25j455j030j02L62M97R40J480
54385A24691J236J04r38j129p63m59k49J49N93P15O15P54J152J210N35m70j103
54368A26643j150r13o11k07K42M23J80j78k30K6J58j11n13n52r2M26M48j15q19
$$ y = [106114, 106556, 106975, 107709, 109031, 110657, 112005, 112754, 112943, 112652, 111858, 110612, 109169, 107839, 106837, 106312, 106452, 107431, 109221, 111485, 113716, 115495, 116652, 117268, 117543, 117656, 117741, 117917, 118249, 118629, 118844, 118869, 119076, 119937, 121468, 123049, 123892, 123696, 122893, 122253, 122202, 122426, 122259, 121470, 120477, 119644, 118713, 117319, 115829, 115078, 115268, 115702, 115727, 115379, 114855, 114001, 112788, 111863, 111966, 113037, 114391, 115616, 116785, 117882, 118595, 118732, 118490, 118236, 118276, 118772, 119551, 120089, 120022, 119620, 119419, 119521, 119676, 119967, 120824, 122272, 123679, 124363, 124090, 122899, 121015, 119090, 117989, 117950, 118334, 118467, 118409, 118624, 119323, 120498, 122120, 123801, 124624, 123999, 122544, 121514, 121412, 121774, 122271, 123211, 124691, 125927, 126031, 125093, 123964, 123201, 122742, 122493, 122642, 123235, 123950, 124565, 125319, 126471, 127681, 128216, 127746, 126643, 125493, 124580, 123969, 123762, 124004, 124427, 124607, 124429, 124199, 124225, 124383, 124272, 123759, 123207, 123115, 123541, 123989, 123874, 123055]
54349A23055j130q79l14K02M10K28k67q90j370j408q25K19J172J449R73L05J11
54332A21041M91Q86O63k09j099j328q61k64K3J26L29N49N70N84R47J565J947J982
54314A27942K051K290K335J985J449P79k55j348j591q10j50n52j380j528j214
54299A30003j382j802j387j94L88j92q52p45n48j081j794j670q10p7K55N25P84
54282A19421Q06O90O78N68P0n44p60o24n08l82j0L47J90l23m82m4M72N76L53J32
54262A20626Q3J67J51k36q38r81l48L35J85m78m76N77J727K011J507Q58L95J08
54244A25373m0j24k80m12k90n2j72p63j335j475j305j067p28l16j41l15m35j67
54226A15956J95J78j54l54k30J9J55J5m66j046j147m02Q05J667J695J002R3l88
$$ y = [123055, 121925, 121046, 120732, 120934, 121344, 121572, 121305, 120415, 119045, 117637, 116812, 117031, 118203, 119652, 120625, 120930, 121041, 121532, 122418, 123081, 122872, 121773, 120445, 119584, 119320, 119343, 119469, 119798, 120347, 120917, 121501, 122448, 124013, 125960, 127942, 129993, 132283, 134618, 136603, 138052, 138831, 138576, 137228, 135637, 134827, 134677, 134125, 132745, 131217, 130003, 128621, 126819, 125432, 125238, 125626, 125434, 124582, 123837, 123289, 122208, 120414, 118744, 117934, 117857, 118112, 118637, 119421, 120227, 120917, 121595, 122163, 122233, 121689, 120929, 120305, 119797, 119415, 119405, 119752, 119942, 119619, 119137, 119093, 119565, 120141, 120494, 120626, 120709, 120876, 121027, 120791, 119953, 118972, 118624, 118959, 119144, 118666, 118190, 118767, 120494, 122505, 124012, 124870, 125265, 125373, 125333, 125209, 124929, 124517, 124227, 124175, 124003, 123240, 121905, 120430, 119125, 118058, 117330, 117014, 116873, 116558, 116123, 115956, 116151, 116329, 116175, 115821, 115591, 115610, 115765, 115780, 115314, 114268, 113121, 112719, 113524, 115191, 116886, 117888, 117981, 117593]
54208A17593k5Q84J366P68m44j253j259q52l73K11P82Q63K44o02j024q22j80O84
54190A16561J464J697J208M66J11J83J80r2k19J58P40R60P26M49M08M40K72j60
54172A25552p52j330j611j352p49m11o62j127j233r45o61n76n74o58r47j236j060
54155A09668l83K33L84L19M31O41O69N65N38N20L32J10O0J1k53l66K67J458K227
54136A17431K021J299P24L70Q8O7L85M92j17r39r06J79J310J467O35n12j302j269
54118A21423k99J015J667J327P94Q70J261J162N91K95M33L34k90p22l66K44K21
54101A29960l62o59l76j06l39q22j105j162j168j022n28J50N97O17M03K26J76
54084A24480J91J78J21J05K88P32J314J753J787J359O96K01J52M31P03P79P26
$$ y = [117593, 117568, 118452, 119818, 120586, 120142, 118889, 117630, 116778, 116405, 116616, 117398, 118261, 118505, 117903, 116879, 116057, 115877, 116561, 118025, 119722, 120930, 121396, 121507, 121690, 121870, 121778, 121559, 121717, 122457, 123417, 124143, 124592, 125000, 125440, 125712, 125552, 124800, 123470, 121859, 120507, 119758, 119347, 118685, 117558, 116325, 115380, 114719, 114143, 113569, 112911, 111964, 110728, 109668, 109285, 109518, 109902, 110221, 110652, 111293, 111962, 112527, 113065, 113585, 113917, 114027, 114087, 114098, 113845, 113479, 113746, 115204, 117431, 119452, 120751, 121475, 121845, 121933, 122000, 122385, 122877, 122760, 121821, 120915, 121094, 122404, 123871, 124506, 123994, 122692, 121423, 121124, 122139, 123806, 125133, 125927, 126797, 128058, 129220, 129811, 130106, 130539, 130873, 130583, 129861, 129495, 129739, 129960, 129598, 128939, 128563, 128457, 128118, 127296, 126191, 125029, 123861, 122839, 122311, 122461, 123058, 123675, 124078, 124304, 124480, 124671, 124849, 124970, 125075, 125363, 126095, 127409, 129162, 130949, 132308, 133004, 133205, 133357, 133788, 134491, 135270, 135996]
54067A35996N94K91j51l93j76K20K50j81n90o39o21r24j237q01M71J670J958J622
54049A37359J561J908J858R52o3j16Q70J999K636K999L537M175M487M294L823
54034A72279L363L009K701K443K353K507K725K645K129J445R25O11L92L63N81
54019B00471O75J59p25j070m79K29n0j343k643l190l204l255l388l198k548j856
54003A74585j554j527j354j009r53j338j529r03Q3K87n73j434j225j23Q71J112
53987A63416N76n04j558j684o17N26L65r19j707j114l3L48K39O98K011L431M327
53970A67801M901N694O875Q152R134R638R676R114P464M364L03l545o277p756
53956B25538q095p372o130n395n517n536m439k643j400j043q00k20K54K69K03
$$ y = [135996, 136590, 136881, 136730, 136337, 136161, 136381, 136631, 136450, 135860, 135221, 134600, 133676, 132439, 131638, 132109, 133779, 135737, 137359, 138920, 140828, 142686, 143638, 143575, 143459, 144329, 146328, 148964, 151963, 155500, 159675, 164162, 168456, 172279, 175642, 178651, 181352, 183795, 186148, 188655, 191380, 194025, 196154, 197599, 198524, 199135, 199527, 199890, 200471, 201146, 201305, 200580, 199510, 199031, 199260, 199210, 197867, 195224, 192034, 188830, 185575, 182187, 178989, 176441, 174585, 173031, 171504, 170150, 169141, 168188, 166850, 165321, 164418, 164501, 164788, 164215, 162781, 161556, 161433, 162304, 163416, 163992, 163488, 161930, 160246, 159629, 160155, 160520, 159601, 157894, 156780, 156747, 157095, 157334, 158032, 160043, 163474, 167801, 172702, 178396, 185271, 193423, 202557, 212195, 221871, 230985, 238449, 242813, 243116, 239571, 233294, 225538, 217443, 210071, 203941, 198546, 193029, 187493, 183054, 180411, 179011, 177968, 177168, 176948, 177202, 177471, 177674]
53941A77674N45J322K406L662M551M399L397K599K574K763K626K511K731K658
53927B16418J699N70M69J363K188K472K678K976K929K543K525L069L428L223L183
53912B51733L911M684M387L133J961J330Q29K80P4K79J87p73k230l342l717l524
53896B59202l087k795l059l856m469m188l320k987l740m820n079m299l178k340
53882B07985j889j814k146k499k115q56K59N0j386k737k924k095j186r02j218
53867A84527j584j464q67l74m94j067j567j811j962j961j534q80o69j141j686
53852A65466j724j498j555j823j805j455j191j148r40k98N25J154J490J586J450
53837A58234J107O87K81r4l17j81K60O51P47P59J016J387J313M76p24j491j338
$$ y = [177674, 178219, 179541, 181947, 185609, 190160, 194559, 197956, 200555, 203129, 205892, 208518, 211029, 213760, 216418, 218117, 218687, 219156, 220519, 222707, 225179, 227857, 230833, 233762, 236305, 238830, 241899, 245327, 248550, 251733, 255644, 260328, 264715, 267848, 269809, 271139, 271968, 272248, 272322, 272601, 272788, 272015, 269785, 266443, 262726, 259202, 256115, 253320, 250261, 246405, 241936, 237748, 234428, 231441, 227701, 222881, 217802, 213503, 210325, 207985, 206096, 204282, 202136, 199637, 197522, 196666, 196925, 196975, 195589, 192852, 189928, 187833, 186647, 185745, 184527, 182943, 181479, 180612, 180238, 179744, 178677, 177110, 175299, 173337, 171376, 169842, 168962, 168293, 167152, 165466, 163742, 162244, 160689, 158866, 157061, 155606, 154415, 153267, 152327, 152029, 152554, 153708, 155198, 156784, 158234, 159341, 160028, 160309, 160215, 159898, 159717, 159977, 160628, 161375, 162134, 163150, 164537, 165850, 166326, 165602, 164111, 162773]
53820A62773m23P27J656K118K033J521J002R74J568K361K855L017L251L820M543
53805A93796N154N848P153R153J1149J2399J3171J4482J6487J7563J5605J0228
53793C32188L232l055p466j0045j1220j1419j1054j0346r235p751o298n310m777
53780B37444m436m213m185m256m227m102m022l924l607l084k625k450k542k691
53766A87080k573j951j034m28m78q27r33p68o08m45j66j06o69j442j453n50K12
53749A72861l1p12o55K86J059Q52Q4k74O7N12N60N52J130K147K604J924Q12M51
53731A84229J093J964K424K578K730K923L162L614M256M744M874M792M649M443
53717B32475M343M597M851M163K170k54j997k965l701m270m190l337k128q62M84
$$ y = [162773, 162350, 163077, 164733, 166851, 168884, 170405, 171407, 172381, 173949, 176310, 179165, 182182, 185433, 189253, 193796, 198950, 204798, 211951, 221104, 232253, 244652, 257823, 272305, 288792, 306355, 321960, 332188, 335420, 332365, 324899, 314854, 303634, 292215, 281161, 270815, 261580, 253829, 247531, 242221, 237444, 233008, 228795, 224610, 220354, 216127, 212025, 208003, 204079, 200472, 197388, 194763, 192313, 189771, 187080, 184507, 182556, 181522, 181094, 180616, 179789, 178856, 178088, 177480, 177035, 176869, 176763, 176094, 174652, 173199, 172649, 172861, 172830, 172118, 171463, 171749, 172808, 173660, 173744, 173470, 173537, 174049, 174609, 175161, 176291, 178438, 181042, 182966, 183778, 184229, 185322, 187286, 189710, 192288, 195018, 197941, 201103, 204717, 208973, 213717, 218591, 223383, 228032, 232475, 236818, 241415, 246266, 250429, 252599, 252345, 250348, 247383, 243682, 239412, 235222, 231885, 229757, 228895, 229379]
53702B29379J771K621K940L007K936K589K098J899K046J999J372M79j63m88o32
53687B53853m21L88J468J995J425J7j491k433k509j777o39K34K56n67j522j793
53671B46484j285o43m07l97k36q4l92j014j241p98k95l91r01j089n62L76J097
53654B38222J158O76K93N12R97Q94P4n13p4R04J330R72N96Q07J435K009K239K020
53636B54551J482J119J307J696J618J120R50J351J686J555J564K364L516L986
53622B79865L466K584K064K207K981L993M549M272L627L341L476L596L625L826
53608C27472L998L555K598K064K454L051K871J872P45k3l57k24L06P65O54J06
53592C51907l09m11o13j163j670j684j440j620k408l103k933k002j166r55j045
$$ y = [229379, 231150, 233771, 236711, 239718, 242654, 245243, 247341, 249240, 251286, 253285, 254657, 255136, 254973, 254485, 253853, 253432, 253820, 255288, 257283, 258708, 258725, 257234, 254801, 252292, 250515, 249876, 250110, 250366, 249799, 248277, 246484, 245199, 244556, 244149, 243752, 243516, 243432, 243040, 242026, 240785, 239987, 239692, 239301, 238400, 237311, 236749, 237125, 238222, 239380, 240056, 240349, 240861, 241858, 242752, 242826, 242313, 242239, 243143, 244473, 245445, 246041, 246848, 248283, 250292, 252531, 254551, 256033, 257152, 258459, 260155, 261773, 262893, 263843, 265194, 266880, 268435, 269999, 272363, 275879, 279865, 283331, 285915, 287979, 290186, 293167, 297160, 301709, 305981, 309608, 312949, 316425, 320021, 323646, 327472, 331470, 335025, 337623, 339687, 342141, 345192, 348063, 349935, 350680, 350657, 350300, 350076, 350382, 351147, 351801, 351907, 351598, 351187, 350574, 349411, 347741, 346057, 344617, 342997, 340589, 337486, 334553, 332551, 331385, 330430, 329385]
53577C29385r96j048j644k419k381j224J77Q93R95J068J130P18j91r67j098p19
53561C21679k88m4N9J08J45K62O44J392K251K657K358J869J964K696L348L482
53545C44582L571M269N507O739P673Q352Q821R257J0112J1526J2779J2970J2153
53532D58311J1248J0836J0650J0314R904R601R380R247R433J0026J0782J1507
53520E81239J2424J3890J5953J8305K0585K2594K4348K5866K6903K7070K6417
53509H15594K5587K5070K4616K3832K3028K2773K2939K2954K2894K3323K3974
53498A076584K3706K2182K0630K0253K0667K0710K0201J9958K0333K0664K0245
53487A306133J9162J8070J7534J7647J7965J7760J6657J4959J3206J1482R468
$$ y = [329385, 328389, 327341, 325697, 323278, 320897, 319673, 319850, 320743, 321738, 322806, 323936, 324654, 324463, 323496, 322398, 321679, 321391, 321347, 321406, 321514, 321659, 321921, 322565, 323957, 326208, 328865, 331223, 333092, 335056, 337752, 341100, 344582, 348153, 352422, 357929, 364668, 372341, 380693, 389514, 398771, 408883, 420409, 433188, 446158, 458311, 469559, 480395, 491045, 501359, 511263, 520864, 530244, 539491, 548924, 558950, 569732, 581239, 593663, 607553, 623506, 641811, 662396, 684990, 709338, 735204, 762107, 789177, 815594, 841181, 866251, 890867, 914699, 937727, 960500, 983439, 1006393, 1029287, 1052610, 1076584, 1100290, 1122472, 1143102, 1163355, 1184022, 1204732, 1224933, 1244891, 1265224, 1285888, 1306133, 1325295, 1343365, 1360899, 1378546, 1396511, 1414271, 1430928, 1445887, 1459093, 1470575, 1480043]
53476A480043P075M654K575P99j118l613o662r683j2078j3909j5695j7495j8633
53463A396260j8623j7979j7667j8057j8850j9775k0842k1983k2882k3268k3101
53452A173233k2535k1837k1292k0958k0576j9860j8723j7106j4931j2353r836
53441I73226p709n921m470l584l178k592j365J24J331K502M219O299P938Q945
53427I75765J0006J1645J3546J5137J6279J7185J8107J9270K0738K2231K3485
53416A163394K4780K6637K8925L0870L2137L3361L5237L7563L9608M1155M2729
53405A536396M4931M7792N0723N3012N4483N5646N7069N8639N9771O0233O0358
53394B139053O0421O0364O0187N9982N9377N7564N4349N0702M7739M5537M3321
$$ y = [1480043, 1487118, 1491772, 1494347, 1495146, 1494028, 1490415, 1483753, 1474070, 1461992, 1448083, 1432388, 1414893, 1396260, 1377637, 1359658, 1341991, 1323934, 1305084, 1285309, 1264467, 1242484, 1219602, 1196334, 1173233, 1150698, 1128861, 1107569, 1086611, 1066035, 1046175, 1027452, 1010346, 995415, 983062, 973226, 965517, 959596, 955126, 951542, 948364, 945772, 944407, 944531, 945862, 948364, 952583, 958882, 966820, 975765, 985771, 997416, 1010962, 1026099, 1042378, 1059563, 1077670, 1096940, 1117678, 1139909, 1163394, 1188174, 1214811, 1243736, 1274606, 1306743, 1340104, 1375341, 1412904, 1452512, 1493667, 1536396, 1581327, 1629119, 1679842, 1732854, 1787337, 1842983, 1900052, 1958691, 2018462, 2078695, 2139053, 2199474, 2259838, 2320025, 2380007, 2439384, 2496948, 2551297, 2601999, 2649738, 2695275, 2738596]
53383B738596M0505L7042L3016K8497K3748J9062J4391R477M325p59n582j0318
53371B932000j5412k1426k8794l7258m5647n2510n7106n9675o0902o1427o1657
53360B430186o1702o1386o0579n9429n8017n6049n3337n0489m8593m8102m8439
53349A824064m8757m8612m7818m6258m4169m2113m0282l8191l5487l2694l0563
53338A369120k8922k6822k3789k0431j7677j5967j5250j5313j5708j5815j5281
53327A158145j4331j3377j2559j1819j1171j0576r787q652p413o410n498m161
53315A042391k205p5J552K380K766L535N383Q162J0859J2604J3577J4666J6317
53302A131912J8244K0143K2070K3997K5619K6891K8293L0118L1857L2675L2313
$$ y = [2738596, 2779101, 2816143, 2849159, 2877656, 2901404, 2920466, 2934857, 2944334, 2948659, 2947900, 2942318, 2932000, 2916588, 2895162, 2866368, 2829110, 2783463, 2730953, 2673847, 2614172, 2553270, 2491843, 2430186, 2368484, 2307098, 2246519, 2187090, 2129073, 2073024, 2019687, 1969198, 1920605, 1872503, 1824064, 1775307, 1726695, 1678877, 1632619, 1588450, 1546337, 1506055, 1467864, 1432377, 1399683, 1369120, 1340198, 1313376, 1289587, 1269156, 1251479, 1235512, 1220262, 1204949, 1189241, 1173426, 1158145, 1143814, 1130437, 1117878, 1106059, 1094888, 1084312, 1074525, 1065873, 1058460, 1052050, 1046552, 1042391, 1040186, 1040111, 1041663, 1044043, 1046809, 1050344, 1055727, 1063889, 1074748, 1087352, 1100929, 1115595, 1131912, 1150156, 1170299, 1192369, 1216366, 1241985, 1268876, 1297169, 1327287, 1359144, 1391819, 1424132]
53291A424132L1150K9622K7862K5817K3413K0712J8096J6009J4405J2654J0278
53280A654150P359M072K45m083q181j1305j3641j5912j8247k0163k1601k3168
53268A529525k5201k7280k8959l0327l1510l2175l2076l1703l1861l2668l3366
53257A192399l3137l1913l0393k9416k9230k9252k8693k7455k6303k5991k6419
53246H74197k6802k6567k5826k4974k4081k2901k1456k0250j9639j9169j7969
53235F24563j5865j3631j1953j0667r390q369q130q520q870q975r219r743j0176
53222D91055j0380j0782j1659j2632j3179j3185j2692j1554r809q016o817o297
53210C64053o134o128o278o481o508o283n971n788n830n994o013n734n341n137
$$ y = [1424132, 1455282, 1484904, 1512766, 1538583, 1561996, 1582708, 1600804, 1616813, 1631218, 1643872, 1654150, 1661509, 1665581, 1665826, 1661743, 1653562, 1642257, 1628616, 1612704, 1594457, 1574294, 1552693, 1529525, 1504324, 1477044, 1448085, 1417758, 1386248, 1354073, 1321997, 1290294, 1258433, 1225765, 1192399, 1159262, 1127349, 1096956, 1067540, 1038310, 1009058, 980365, 952910, 926607, 900616, 874197, 847395, 820828, 795002, 770028, 745947, 723046, 701590, 681340, 661701, 642532, 624563, 608698, 595067, 583114, 572447, 563057, 554688, 546558, 538038, 529168, 520193, 510974, 501231, 491055, 480675, 469893, 458234, 445602, 432423, 419238, 406546, 394992, 385183, 377167, 370350, 364053, 357919, 351791, 345513, 339032, 332524, 326241, 320270, 314482, 308652, 302658, 296645, 290911, 285570, 280433]
53196B80433n112m973m574m009l338k584j982j764j622j034j75R6n50j418j822
53181B45572j982k261k316j771j201j464k258k402j535n51j76k8M06P33L18m97
53165B28587o61J18R51R31K44k41j79r2n50j368j819j453n44J98K63k25n90l08
53147B23262L33M80j42p42n07K43N65L25K77P22J008O85K76L42N18R6q59j725
53129B25157k233k471k279j447l58K52J58k64p52j338j864j994j742j437j098
53114B06290m14N05R84O28j71p74r93r71p85n10l67m50n43m64m24o60r07o47J40
53095A99467Q16Q40L84Qq8j16j91j36qk73j116j868j715p51K14P90J186J301O13
53076A99357p40j656j495j012j127j477j120j79L28L2m23n41m62l46j43r1n18
$$ y = [280433, 275321, 270348, 265774, 261765, 258427, 255843, 253861, 252097, 250475, 249441, 249266, 249362, 248812, 247394, 245572, 243590, 241329, 239013, 237242, 236041, 234577, 232319, 229917, 228382, 227831, 227655, 227627, 228033, 228766, 229084, 228587, 227926, 228044, 228995, 229926, 230170, 229929, 229750, 229658, 229108, 227740, 225921, 224468, 223924, 224122, 224385, 224160, 223570, 223262, 223595, 224075, 223933, 223191, 222684, 222927, 223492, 223817, 224094, 224816, 225824, 226509, 226785, 227127, 227645, 227741, 226882, 225157, 222924, 220453, 218174, 216727, 216369, 216621, 216779, 216515, 215763, 214425, 212561, 210567, 208825, 207388, 206290, 205876, 206381, 207365, 207993, 207822, 207048, 206055, 205084, 204299, 203789, 203422, 202972, 202429, 201965, 201541, 200881, 199974, 199327, 199467, 200283, 201123, 201507, 201515, 201427, 201311, 201120, 200984, 200976, 200703, 199587, 197719, 196004, 195253, 195467, 196257, 197443, 198744, 199357, 198617, 196961, 195466, 194454, 193327, 191850, 190730, 190551, 190879, 190911, 190488, 189947, 189485, 189139, 188996, 188905, 188387]
53059A88387r93o03O61J722J874J582J418J223Q07O58J135J636J455Q65N55L97
53043B02779k59j325j929j638q67p6O60J143R34J20m49j64M73N25j36p31o63k22
53025A98175j04n24j062j203q21j51M54P11N58K10m2j83m09p55r55q98q47r39
53007A91215q05j22O62P49J00m80m25k7J82J53J57L13N92Q88R24M58j75k03N39
52988A94695J170Q36j53p48m64K92R83J425J521J084J40r11j619j786j485q90
52972A94090k17M15R90J470J740J784J766J818J897J982K151K283J996J202M19
52957B15786J79L26L63J99O1j73q79j854k282j789j009p64j039j208j021q47r81
52940B03068j203j114p33m79o33j021j243j120q07m86k06j0q3n18j059j270r61
$$ y = [188387, 187394, 186791, 187452, 189174, 191048, 192630, 194048, 195271, 196078, 196736, 197871, 199507, 200962, 201827, 202382, 202779, 202520, 201195, 199266, 197628, 196761, 196685, 197345, 198488, 199422, 199542, 199093, 198929, 199402, 199927, 199791, 199060, 198397, 198175, 198071, 197547, 196485, 195282, 194461, 194310, 194764, 195475, 196033, 196243, 196201, 196018, 195609, 194854, 193899, 193001, 192154, 191215, 190410, 190288, 190950, 191699, 191799, 191319, 190894, 190867, 191049, 191202, 191359, 191672, 192264, 193152, 194076, 194534, 194359, 194156, 194695, 195865, 196701, 196548, 195800, 195336, 195628, 196611, 198036, 199557, 200641, 200781, 199870, 198251, 196465, 194980, 194090, 193873, 194288, 195278, 196748, 198488, 200272, 202038, 203856, 205753, 207735, 209886, 212169, 214165, 215367, 215786, 215965, 216291, 216654, 216853, 216914, 216741, 215862, 214008, 211726, 209937, 208928, 208164, 207125, 205917, 204896, 204049, 203068, 201865, 200751, 200018, 199539, 198906, 197885, 196642, 195522, 194715, 194229, 194023, 194013, 193930, 193412, 192353, 191083, 190122]
52923A90122l60J08J46k20p17j053j145j018n90K34J142J447P92l35j060j031
52907A86462o45m36n52p82q63o68k52K14N97Q51R71R56R17J003J147J074O64J03
52889A90761l96p53p81k40O06R45L96l39l42K62N52J23n61j027j234j092l50P57
52871A87287J426J254P66O43Q59R83Q91P18M21r1n71o47l08J11L54L90K41j18
52853A94609o83j411k122k443k122j472j060q55k44Q39J445Q67k30o49l14j85
52837A83970o87j184j149q92q58q57n72k22j77j98L27J455K416K346J146m54j519
52820A82891j736j547j518j653j557j119n89p3N49J105J124N59O8K10P59J185
52804A78658J388J566J708J714J702J703J262k0j683k755k808k195j414p45m51
$$ y = [190122, 189762, 189870, 190016, 189796, 189079, 188026, 186881, 185863, 185273, 185507, 186649, 188096, 188888, 188553, 187493, 186462, 185817, 185381, 184829, 184047, 183184, 182516, 182264, 182478, 183075, 183926, 184897, 185853, 186770, 187773, 188920, 189994, 190658, 190761, 190365, 189612, 188831, 188591, 189197, 190142, 190538, 190199, 189857, 190119, 190671, 190794, 190233, 189206, 187972, 186880, 186530, 187287, 188713, 189967, 190733, 191376, 192235, 193218, 194109, 194827, 195248, 195157, 194586, 193939, 193631, 193742, 194096, 194486, 194727, 194609, 193926, 192515, 190393, 187950, 185828, 184356, 183296, 182441, 182197, 183036, 184481, 185348, 185118, 184469, 184155, 183970, 183283, 182099, 180950, 180058, 179200, 178343, 177771, 177549, 177372, 177174, 177501, 178956, 181372, 183718, 184864, 184410, 182891, 181155, 179608, 178090, 176437, 174880, 173761, 173172, 173099, 173648, 174753, 175877, 176436, 176504, 176714, 177473, 178658, 180046, 181612, 183320, 185034, 186736, 188439, 189701, 189681, 187998, 185243, 182435, 180240, 178826, 178081, 177630]
52789A77630o37q80o26o5J01k07l01M7J14n70j262j022j41K58k35r34j091o60
52771A69519K4O55J008J015R22J016J210J158P82L29m2l66o05o92p52r77j215
52754A72989j088m96K95J030J528J529R62K86L8J08K2j23K35J054J499J121M65
52737A81454J82K67N68J222J992K015J011R4M15J456J771J096N25O62P95J96q20
52720A94901j550j826j764j303n16J17K62J28l6l55q15r15l96J25m7o33q39o13
52702A83925o34j092j296o85M03J224J381Q90j2q29r89m76P4J94K28P59J686K381
52684A87132K510K272J884J334P08K79J37R7O2R1N3l47r08q39K07J415J636P74
52666A98497k66q19j018j070p77r3N02O34N81P18P94L74k21p4J143K682L472L049
$$ y = [177630, 176993, 176113, 175487, 175422, 175523, 175316, 175015, 175062, 175176, 174606, 173344, 172322, 172181, 172439, 172204, 171270, 170179, 169519, 169543, 170198, 171206, 172221, 173143, 174159, 175369, 176527, 177309, 177638, 177596, 177230, 176625, 175933, 175181, 174204, 172989, 171901, 171405, 171700, 172730, 174258, 175787, 176749, 177035, 177073, 177181, 177203, 177080, 177315, 178369, 179868, 180989, 181454, 181636, 181903, 182471, 183693, 185685, 187700, 188711, 188805, 189220, 190676, 192447, 193543, 194068, 194730, 195525, 195721, 194901, 193351, 191525, 189761, 188458, 187942, 188059, 188321, 188449, 188413, 188058, 187243, 186328, 185932, 186057, 186010, 185377, 184538, 183925, 183291, 182199, 180903, 180218, 180621, 181845, 183226, 184116, 184104, 183275, 182286, 181810, 181884, 182078, 182306, 183065, 184751, 187132, 189642, 191914, 193798, 195132, 195840, 196119, 196256, 196353, 196415, 196506, 196559, 196212, 195304, 194465, 194672, 196087, 197723, 198497, 198231, 197412, 196394, 195324, 194547, 194454, 194956, 195590, 196171, 196889, 197683, 198057, 197836, 197762, 198905, 201587, 205059, 208108]
52648B08108J692L9j324k214k857l371l408k671j675j290j480j249j23R90J034
52633A90201K97k2N76J512K165K505K692K769K919L309L471K545M91j537k460
52618B11433k422k138j705q58L4J99k88m58J02N51L4r78j274m85N96J167J221
52601B04731J148J036P16J82l56p52j025j179j088o71q3L77N87P11Q94R54N88
52584B06770r6n44l26M27J260J893K204K037J359N75K70N56R17Q18K71l54q17
52567B17220j151j391j386j010m47j60m67j142j650j766j740j745j510p95j2J53
52551B01001l18p02m47K34Q25J163J331J284R54N28L19L49L08n4o35j050r93n54
52533B03543j11J28L55P17Q62L88l70n87j00K87o2p46j019q22o00m79l13j88k12
$$ y = [208108, 209800, 209839, 208515, 206301, 203444, 200073, 196665, 193994, 192319, 191029, 189549, 188300, 188177, 189167, 190201, 190498, 190476, 191052, 192564, 194729, 197234, 199926, 202695, 205614, 208923, 212394, 214939, 215430, 213893, 211433, 209011, 206873, 205168, 204310, 204344, 204543, 204255, 203797, 203899, 204450, 204484, 203506, 202232, 201747, 202343, 203510, 204731, 205879, 206915, 207631, 207813, 207457, 206705, 205680, 204501, 203413, 202742, 202659, 203036, 203623, 204334, 205228, 206182, 206770, 206674, 206130, 205804, 206231, 207491, 209384, 211588, 213625, 214984, 215559, 215829, 216385, 217302, 218120, 218391, 218037, 217220, 216069, 214678, 213292, 212282, 211835, 211675, 211208, 210066, 208416, 206650, 204910, 203165, 201655, 200860, 200848, 201001, 200683, 199981, 199534, 199768, 200593, 201756, 203087, 204371, 205325, 205853, 206172, 206521, 206829, 206775, 206140, 205090, 204097, 203543, 203432, 203560, 203915, 204632, 205494, 205882, 205512, 204925, 204825, 205112, 205050, 204304, 203285, 202463, 201863, 201384, 201071, 200883, 200671]
52514B00671M2J081K511L275L012K443K251K261K101J961K093K137J548M85l69
52499B27503p12q27r23q56n90m79q22j419j761j521q18j34O8k06m12j11L45K13
52481B16538n53j046n29O46J607K027K078J738Q60m6n2R33J845J822J239Q62O28
52464B30597O8n31l60N66J293J271J005J045J147Q73L80K3l49j066j926k393k398
52447B29245k366k524k652k562k381k281k164j786j060k20K83J72l20o45n41k27
52431B07971K1K48N39P26N72P3n31q49m22Q44K221K713K304J968K195K335J977
52414B24905K001L226M755N013M109L776M997O993Q808J0443J1897J2230J0484
52401C13637O826K180k645o858r505j0202r678q897p960o508m733l281k383j782
$$ y = [200671, 200713, 201794, 204305, 207580, 210592, 213035, 215286, 217547, 219648, 221609, 223702, 225839, 227387, 227872, 227503, 226791, 225964, 225041, 224185, 223595, 223116, 222294, 220875, 219114, 217593, 216775, 216641, 216709, 216503, 216091, 215980, 216325, 216538, 215985, 214939, 214410, 215056, 216663, 218690, 220768, 222506, 223366, 223320, 223268, 224201, 226046, 227868, 229107, 229969, 230597, 230665, 230134, 229774, 230340, 231633, 232904, 233909, 234954, 236101, 236974, 237354, 237377, 237028, 235962, 234036, 231643, 229245, 226879, 224355, 221703, 219141, 216760, 214479, 212315, 210529, 209469, 209249, 209532, 209704, 209384, 208739, 208198, 207971, 207992, 208240, 208779, 209505, 210077, 210150, 209619, 208770, 208348, 209192, 211413, 214126, 216430, 218398, 220593, 222928, 224905, 226906, 230132, 234887, 239900, 244009, 247785, 252782, 259775, 268583, 279026, 290923, 303153, 313637, 320463, 322643, 319998, 313140, 303635, 293433, 283755, 274858, 266898, 260390, 255657, 252376, 249993, 248211]
52387B48211j356j108p25K02J461K265K209J685J323J341J615K023K513K990L245
52372B67894L073K516K079K399L498M552M763M330M143M543M797M032K396R78
52358C15993N34N88N5j308k486k426j291r9O37J223J881K335K484K790L547M372
52342C28829M845N157N642O130O380O759P865R631J1387J2654J3424J3844J4207
52329D46754J4987J6326J7589J8071J8022J8331J9297K0316K0878K1131K1295
52318F52997K1212K0771K0191J9569J8529J6736J4416J2082J0049Q455P454O978
52306H29439O514N509L930K242R05O8l82o70j016j480j973k404k724k823k632
52291H32503k499l132m827o821p791p144n620m427l904l216j368J715N206Q230
$$ y = [248211, 246855, 245747, 245022, 245224, 246685, 248950, 251159, 252844, 254167, 255508, 257123, 259146, 261659, 264649, 267894, 270967, 273483, 275562, 277961, 281459, 286011, 290774, 295104, 299247, 303790, 308587, 312619, 315015, 315993, 316527, 317115, 317170, 315862, 313376, 310950, 309659, 309560, 310197, 311420, 313301, 315636, 318120, 320910, 324457, 328829, 333674, 338831, 344473, 350603, 356983, 363742, 371607, 381238, 392625, 405279, 418703, 432547, 446754, 461741, 478067, 495656, 513727, 531749, 550080, 569377, 589693, 610571, 631702, 652997, 674209, 694980, 715171, 734740, 753269, 770005, 784421, 796503, 806552, 815007, 822461, 829439, 835953, 841462, 845392, 847634, 848539, 848607, 848225, 847555, 846539, 845059, 843086, 840682, 837958, 835135, 832503, 830004, 826872, 822045, 815224, 807433, 800289, 794669, 790242, 786338, 783122, 781754, 783469, 788675, 796905]
52277G96905J0464J1996J3001J3578J3808J3722J3416J3168J3253J3599J3869
52266I40779J3910J3845J3610J2805J1242R293P481N940M600L525K726J880P13
52253A042349n17j316j605j743k060k664l532m434n027n431o401q416j0778j2237
52239I76188j2347j1562j0228q336o280m909m472m262l628k759k061j385m35N77
52225I04101J209J479J721J967J993J893K195L250M760N947O214N742N372N717
52211I53560O483O939P016P341Q139Q679Q168O714N035L629K630K118K092K272
52197A030815K362K361K339K099J441O00L8j43k34m84q48j155j268j184j121j362
52181A034256j909k437k779l132l625m044m288m713n541o245o081n117m200l910
$$ y = [796905, 807369, 819365, 832366, 845944, 859752, 873474, 886890, 900058, 913311, 926910, 940779, 954689, 968534, 982144, 994949, 1006191, 1015484, 1022965, 1028905, 1033505, 1037030, 1039756, 1041636, 1042349, 1041832, 1040516, 1038911, 1037168, 1035108, 1032444, 1028912, 1024478, 1019451, 1014020, 1007619, 999203, 988425, 976188, 963841, 952279, 942051, 933715, 927435, 922526, 918054, 913792, 910164, 907405, 905344, 903959, 903524, 904101, 905310, 906789, 908510, 910477, 912470, 914363, 916558, 919808, 924568, 930515, 936729, 942471, 947843, 953560, 960043, 966982, 973998, 981339, 989478, 998157, 1006325, 1013039, 1018074, 1021703, 1024333, 1026451, 1028543, 1030815, 1033177, 1035538, 1037877, 1039976, 1041417, 1042017, 1042055, 1041912, 1041678, 1041194, 1040346, 1039191, 1037923, 1036739, 1035618, 1034256, 1032347, 1029910, 1027131, 1023999, 1020374, 1016330, 1012042, 1007329, 1001788, 995543, 989462, 984345, 980145, 976235]
52167I76235l998l839l084j830n25L19N84Q12J598K823L784M043L827L577L476
52152I87802L456L286K611J258l71j499j728j337q20l35K65J081J972K623K832
52137A001096K826L188M196N457O497P498Q958J0739J2163J3101J4311J6366J8836
52124A125232K0958K2668K4449K6435K8176K9189K9337K8672K7330K5556K3590
52113A411592K1497J9251J6891J4456J1859R011N978K793o94m508q161j0925j2481
52100A476559j3105j3225j2984j2280j1020r352p793o992p093p375o819n156l083
52087A360282j449n26j88l79j038j720j684m83J624L925N868P480R190J1204J3136
52072A405242J4390J4843J4876J4749J4363J3762J3341J3166J2499J0599P801
$$ y = [976235, 972237, 968398, 965314, 963484, 962959, 963278, 963862, 964674, 966272, 969095, 972879, 976922, 980749, 984326, 987802, 991258, 994544, 997155, 998413, 998042, 996543, 994815, 993478, 992658, 992323, 992588, 993669, 995641, 998264, 1001096, 1003922, 1007110, 1011306, 1016763, 1023260, 1030758, 1039716, 1050455, 1062618, 1075719, 1090030, 1106396, 1125232, 1146190, 1168858, 1193307, 1219742, 1247918, 1277107, 1306444, 1335116, 1362446, 1388002, 1411592, 1433089, 1452340, 1469231, 1483687, 1495546, 1504557, 1510535, 1513328, 1512634, 1508126, 1499965, 1489040, 1476559, 1463454, 1450229, 1437245, 1424965, 1413945, 1404593, 1396800, 1389808, 1382715, 1375340, 1368521, 1363365, 1360282, 1358833, 1358307, 1358119, 1357740, 1356702, 1354982, 1353298, 1352815, 1354439, 1358364, 1364232, 1371712, 1380902, 1392106, 1405242, 1419632, 1434475, 1449351, 1464100, 1478463, 1492225, 1505566, 1518732, 1531231, 1541830, 1549631]
52061A549631N187L181J174j404m310p016r411j1493j2952j3605j3919j4475j5180
52048A455408j5578j5718j6016j6388j6341j5986j6212j7479j9065j9896j9625
$$ y = [1549631, 1554818, 1557999, 1559173, 1557769, 1553459, 1546443, 1537032, 1525539, 1512587, 1498982, 1485063, 1470588, 1455408, 1439830, 1424112, 1408096, 1391708, 1375367, 1359381, 1343169, 1325690, 1306625, 1286729, 1267104]
$$ [...]
##END NTUPLES=NMR SPECTRUM
##END=
