##TITLE=NES1066_Nhol10911_9883663_4HlQrt3YVF
##JCAMPDX= 6.0         $$ Bruker NMR JCAMP-DX V2.0
##DATA TYPE= NMR SPECTRUM
##DATA CLASS= NTUPLES
##ORIGIN= BRUKER
##OWNER= Administrator
$$ 1.72 TOPSPIN		Version 2.1
$$ 2016-08-26 19:41:09.101 -0500  Administrator@X
$$ Compression mode = diff/dup
##.OBSERVE FREQUENCY= 400.02188249412
##.OBSERVE NUCLEUS= ^1H
##.ACQUISITION MODE= SIMULTANEOUS (DQD)
##.ACQUISITION SCHEME= undefined
##.AVERAGES= 8
##.DIGITISER RES= 22
##SPECTROMETER/DATA SYSTEM= spect
##.PULSE SEQUENCE= zg30
##.SOLVENT NAME= COFFEE_meoh
##.SHIFT REFERENCE= INTERNAL, COFFEE_meoh, 1, 14.98509
##AUDIT TRAIL= $$ (NUMBER, WHEN, WHO, WHERE, PROCESS, VERSION, WHAT)
$$ ##TITLE= Audit trail, TOPSPIN		Version 2.1
$$ ##JCAMPDX= 5.01
$$ ##ORIGIN= Bruker BioSpin GmbH
$$ ##OWNER= Administrator
$$ $$ E:\/data/COFFEE/nmr/NES1066_Nhol10911_9883663_4HlQrt3YVF/20/pdata/1/auditp.txt
$$ ##AUDIT TRAIL=  $$ (NUMBER, WHEN, WHO, WHERE, PROCESS, VERSION, WHAT)
(   1,<2016-08-26 19:41:01.929 -0500>,<Administrator>,<X>,<go>,<TOPSPIN 2.1>,
      <created by zg
	started at 2016-08-26 19:39:55.383 -0500,
	POWCHK enabled, PULCHK disabled,
       configuration hash MD5:
       21 0F 79 D6 B3 7B B4 F6 88 20 88 DB 03 48 BD 9F
       data hash MD5: 64K
       C0 8A EA 6A 3A 57 A8 E8 89 3A 1C 44 54 E4 A8 E7>)
(   2,<2016-08-26 19:41:05.023 -0500>,<Administrator>,<X>,<proc1d>,<TOPSPIN 2.1>,
      <Start of raw data processing
       efp LB = 0 FT_mod = 6 PKNL = 1 PHC0 = 0 PHC1 = 0 SI = 32K 
       data hash MD5: 32K
       CD E9 5A BD E4 03 9E 0F 23 A1 B8 92 A0 0A C2 DE>)
(   3,<2016-08-26 19:41:05.304 -0500>,<Administrator>,<X>,<proc1d>,<TOPSPIN 2.1>,
      <pk PHC0 = 87.60498 PHC1 = 0 
       data hash MD5: 32K
       B7 E4 44 F3 13 7B 58 42 C8 AA 17 38 D5 C5 3E 99>)
(   4,<2016-08-26 19:41:05.414 -0500>,<Administrator>,<X>,<proc1d>,<TOPSPIN 2.1>,
      <abs ABSG = 1 
       data hash MD5: 32K
       CB 11 D7 E4 C9 E1 B8 24 3F 64 34 46 72 1E AB 04>)
(   5,<2016-08-26 19:41:05.476 -0500>,<Administrator>,<X>,<proc1d>,<TOPSPIN 2.1>,
      <abs ABSG = 2 
       data hash MD5: 32K
       E1 2E 6B CA 65 DF A2 D7 4B 58 CE E8 B6 4A 2C BF>)
(   6,<2016-08-26 19:41:05.539 -0500>,<Administrator>,<X>,<proc1d>,<TOPSPIN 2.1>,
      <abs ABSG = 3 
       data hash MD5: 32K
       9E 53 49 3D BA A6 E3 00 68 57 C0 6C F2 2F 0A 95>)
(   7,<2016-08-26 19:41:05.586 -0500>,<Administrator>,<X>,<proc1d>,<TOPSPIN 2.1>,
      <abs ABSG = 4 
       data hash MD5: 32K
       B5 52 01 7D C4 5C 3A A0 74 1C E7 4D 81 B9 3E 22>)
(   8,<2016-08-26 19:41:05.648 -0500>,<Administrator>,<X>,<proc1d>,<TOPSPIN 2.1>,
      <abs ABSG = 5 
       data hash MD5: 32K
       E5 EC 02 74 B8 4A 71 D3 8B 77 20 73 2E 54 CB 98>)
$$ ##END=
$$ 
$$ $$ hash MD5
$$ $$ F3 46 F9 15 C0 35 70 5A 78 CF CA 28 00 86 1D 40
##$RELAX= 
##$RELAX= 
##$RELAX= 
##$RELAX= 
##$RELAX= 
##$RELAX= 
##$RELAX= 
$$ Bruker specific parameters
$$ --------------------------
##$DU= <E:\>
##$EXPNO= 20
##$NAME= <NES1066_Nhol10911_9883663_4HlQrt3YVF>
$$ [...]
150 150 150 150 150 150 150 150
##$TP07= 0
##$TPNAME0= <>
##$TPNAME1= <>
##$TPNAME2= <>
##$TPNAME3= <>
##$TPNAME4= <>
##$TPNAME5= <>
##$TPNAME6= <>
##$TPNAME7= <>
##$TPOAL= (0..7)
0.5 0.5 0.5 0.5 0.5 0.5 0.5 0.5
##$TPOFFS= (0..7)
0 0 0 0 0 0 0 0
##$TUNHIN= 0
##$TUNHOUT= 0
##$TUNXOUT= 0
##$USERA1= <user>
##$USERA2= <user>
##$USERA3= <user>
##$USERA4= <user>
##$USERA5= <user>
##$V9= 5
##$VALIST= <valist>
##$VCLIST= <CCCCCCCCCCCCCCC>
##$VD= 0
##$VDLIST= <DDDDDDDDDDDDDDD>
##$VPLIST= <PPPPPPPPPPPPPPP>
##$VTLIST= <TTTTTTTTTTTTTTT>
##$WBST= 2048
##$WBSW= 25
##$XGAIN= (0..3)
0 0 0 0
##$XL= 0
##$YL= 0
##$YMAX_a= 592492
##$YMIN_a= -512576
##$ZGOPTNS= <>
##$ZL1= 120
##$ZL2= 120
##$ZL3= 120
##$ZL4= 120
##$ABSF1= 14.98509
##$ABSF2= -5.573092
##$ABSG= 5
##$ABSL= 3
##$ALPHA= 0
##$AQORDER= 0
##$ASSFAC= 0
##$ASSFACI= 0
##$ASSFACX= 0
##$ASSWID= 0
##$AUNMP= <proc_prof1d_extract_pilot.lims>
##$AXLEFT= 0
##$AXNAME= <>
##$AXNUC= <1H>
##$AXRIGHT= 0
##$AXTYPE= 0
##$AXUNIT= <>
##$AZFE= 0.1
##$AZFW= 0.1
##$BCFW= 0
##$BC_mod= 0
##$BYTORDP= 0
##$COROFFS= 0
##$CY= 15
##$DATMOD= 1
##$DC= 0
##$DFILT= <>
##$DTYPP= 0
##$F1P= 0
##$F2P= 0
##$FCOR= 0.5
##$FTSIZE= 32768
##$FT_mod= 6
##$GAMMA= 0
##$GB= 0
##$INTBC= 1
##$INTSCL= 1
##$ISEN= 128
##$LB= 0
##$LEV0= 0
##$LPBIN= 0
##$MAXI= 10000
##$MC2= 0
##$MEAN= 0
##$ME_mod= 0
##$MI= 0
##$NCOEF= 0
##$NC_proc= -8
##$NLEV= 6
##$NOISF1= 0
##$NOISF2= 0
##$NSP= 0
##$NTH_PI= 0
##$NZP= 0
##$OFFSET= 14.98509
##$PC= 1
##$PHC0= 87.60498
##$PHC1= 0
##$PH_mod= 1
##$PKNL= yes
##$PPARMOD= 0
##$PPDIAG= 0
##$PPIPTYP= 0
##$PPMPNUM= 2147483647
##$PPRESOL= 1
##$PSCAL= 4
##$PSIGN= 0
##$PYNMP= <proc.py>
##$REVERSE= no
##$SF= 400.02
##$SI= 32768
##$SIGF1= 0
##$SIGF2= 0
##$SINO= 400
##$SIOLD= 32768
##$SPECTYP= <>
##$SREGLST= <1H.CDCl3>
##$SSB= 0
##$STSI= 32768
##$STSR= 0
##$SW_p= 8223.68421052631
##$SYMM= 0
##$S_DEV= 0
##$TDeff= 65536
##$TDoff= 0
##$TI= <>
##$TILT= no
##$TM1= 0
##$TM2= 0
##$TOPLEV= 0
##$USERP1= <user>
##$USERP2= <user>
##$USERP3= <user>
##$USERP4= <user>
##$USERP5= <user>
##$WDW= 1
##$XDIM= 32768
##$YMAX_p= 446137067
##$YMIN_p= -650543
##$CURPLOT= <Network HP LaserJet P1505>
##$CURPRIN= <$Network HP LaserJet P1505>
##$DFORMAT= <normdp>
##$LAYOUT= <+/1D_H.xwp>
##$LFORMAT= <normlp>
##$PFORMAT= <normpl>
##$SURQMSG= 1
$$ End of Bruker specific parameters
$$ ---------------------------------
##NTUPLES= NMR SPECTRUM
##VAR_NAME=  FREQUENCY,     SPECTRUM/REAL,   SPECTRUM/IMAG
##SYMBOL=    X,             R,               I
##VAR_TYPE=  INDEPENDENT,   DEPENDENT,       DEPENDENT
##VAR_FORM=  AFFN,          ASDF,            ASDF
##VAR_DIM=   32768,         32768,           32768
##UNITS=     HZ,            ARBITRARY UNITS, ARBITRARY UNITS
##FACTOR=    0.250966925370066, 1,           1
##FIRST=     8223.43324360094, 40005,        -35523
##LAST=      0,             -141459,         -48828
##MIN=       0,             -650543,         0
##MAX=       8223.43324360094, 446137067,    0
$$ Real data points
##PAGE= N=1
##DATA TABLE= (X++(R..R)), XYDATA
$$ [...]
19509i821j33184L6209C4167b14650A82775A4924a70397g9381K7465G1677a89458
19497D4596a84114B02500q0115a73743A04758A935d1109m15516C2120c65758N1518
19486c14240f457l4327A6346L5390J1252e4965p1059e9661a0860A05107a13184
19474a72909E9334J1918h6630A91218l682h1979A88885h1859F2840i8186j31965
19463b30151C505Q9927J12126A2625a58584a4216m37084A16462b0798A52126b68730
19451b22314L2611R2458A70461a31980H8325J66855c11942a33717J7728m28N3146
19440f3271B9233f5364j21161k2459Q1276e5006j79884a12074C9923A3704c10132
19428d4879A10769m8288L9775e8028A46424c54819a64911J3488F4386d0011R644
$$ plain form
19509 -9821 -143005 -106796 34167 -214650 182775 14924 -170397 -79381 -51916 71677 -189458
19497 44596 -184114 202500 122385 -173743 104758 1935 -41109 -456625 32120 -365758 -314240
19486 -314240 -6457 -40784 16346 51736 62988 -54965 -126024 -59661 -10860 105107 -113184
19474 -172909 59334 71252 -86630 191218 187536 -81979 188885 -81859 62840 -98186 -230151
19463 -230151 3505 93432 205558 12625 -158584 -14216 -451300 116462 -20798 152126 -268730
19451 -222314 -189703 -97245 170461 -131980 88325 255180 -311942 -133717 -115989 -116417 -63271
19440 -63271 29233 -65364 -186525 -208984 -127708 -55006 -234890 -112074 39923 13704 -310132
19428 -44879 110769 62481 102256 -58028 146424 -354819 -164911 -151423 64386 -40011 -30367
19417c0367l2098q0149E9944j7965a85438A19096b2557j26787k53927C0093P6064
19406A06157a31637r004J846d7427k08628k3312B05546N3219d1171B60701b35148
19394b4880H6220a13573k1422A0791Q3022l6015c3805C02984c6361F6844O8055
19383A34899a08756r2353p4526i4376L1085k36344D1498c59006C0220J64081n6952
19372A37349a40168G9524r849j5916f3282j69211l99i9971B0175b10399i3195
19360b07863i2136J7635G0818a23817r622j04244e6649j6687k36002a21269K2140
19349i9129A01502L465a74455A18387h2440p028B1545L1532a76900e4370j37422
19338a91792K4151G8870b93548A1595b35869B443a05236C1739K72822g0036B51392
$$ plain form
19417 -30367 -62465 -142614 59944 41979 -185438 119096 -22557 -149344 -403271 30093 106157
19406 106157 -131637 -140641 -138795 -47427 -256055 -279367 205546 258765 -41171 260701 -235148
19394 -24880 86220 -113573 -134995 10791 93813 57798 -33805 302984 -36361 66844 134899
19383 134899 -108756 -201109 -275635 -94376 -63291 -299635 41498 -359006 30220 194301 137349
19372 137349 -140168 79524 69675 53759 -63282 -232493 -232892 -99971 20175 -210399 -93195
19360 -207863 -92136 -74501 70818 -123817 -133439 -237683 -56649 -73336 -309338 -121269 -99129
19349 -99129 101502 104967 -174455 118387 -82440 -89468 21545 53077 -176900 -54370 -191792
19338 -191792 -167641 78870 -293548 11595 -235869 2443 -105236 31739 304561 -70036 251392
19326C80088j43638c88962A8226L1712M6919c56187a20642K7828B00188h9182
19315C395M9884c22809F6384J9068J52852a72309J159b4845j28388G5772j6088
19304E9684a66123i252k61565a15414m3208j04744P6513m1877f8883k08474B8484
19292a46080L6715B54529I7081g9657A79753c57938C6678K37732c07845c8665
19281d0395j58605N6613j19578h2731k076k2851l5695E038a8015j79682n8554
19270b56251g3963l19905J71800B22199b51754O7446c4435D2823J61464a95810
19259A39540b52910G43J60858c6693j81508g9614n4714K2073o5861n190C77182
19247f2972D3123e3200A82908a57381P3896L0979G4323f993p0979j84939A0904
$$ plain form
19326 380088 236450 -388962 18226 49938 96857 -356187 -120642 -92814 200188 -89182
19315 3395 53279 -322809 66384 85452 238304 -172309 -171150 -24845 -153233 75772 59684
19304 59684 -166123 -9252 -270817 -115414 -158622 -263366 -186853 -228730 -68883 -277357 28484
19292 -146080 -109365 254529 97081 -79657 179753 -357938 36678 274410 -307845 -38665
19281 -40395 -199000 -142387 -261965 -82731 -84807 -107658 -143353 5038 -18015 -197697 -256251
19270 -256251 -73963 -393868 -222068 222199 -251754 -184308 -34435 42823 204287 -195810
19259 139540 -252910 743 161601 -36693 -218201 -79614 -134328 -112255 -178116 -183306 377182
19247 -62972 43123 -53200 182908 -157381 -83485 -52506 74323 -6993 -77972 -262911 10904
19235a83037m9537L0229A34649b11867d8975j0958C4015N2240c2444j73115A54981
19223b60210G179c5961J7403F9940a22804N0835a4802B4987a73999f2969B62098
19211a4483G2943K58658A5102a1338j04758R272c5616r6806C5080a5961j79519
19200a95480A31380d1762j74965l5868b9952O946c619I9700f090D5013c07046
19188c6554o6023a3109j4313E1666b8719A64017e1303k49462e8060j17063Q0817
19177i4306p2377j78861c9664l2373J940A07159d7323k25296b960q7615k7387
19166a17962C024b10939E7490K33441b13892A02229J4110J97674d2897m01448
19156d44345a51756j1701D1857a43188M7196c5281G1860e5054C63439a03844o2408
$$ plain form
19235 -183037 -232574 -202345 134649 -211867 -48975 -59933 34015 86255 -32444 -205559 154981
19223 -260210 7179 -35961 -18558 69940 -122804 -71969 -14802 24987 -173999 -62969 262098
19211 -14483 72943 331601 15102 -11338 -116096 -106824 -35616 -132422 35080 -15961 -195480
19200 -195480 131380 -41762 -216727 -252595 -29952 -23006 -3619 99700 -6090 45013 -307046
19188 -36554 -102577 -13109 -27422 51666 -28719 164017 -51303 -300765 -58060 -175123 -94306
19177 -94306 -166683 -345544 -39664 -72037 -70097 107159 -47323 -272619 -2960 -90575 -117962
19166 -117962 3024 -210939 57490 290931 -213892 102229 116339 314013 -42897 -444345
19156 -444345 -151756 -163457 41857 -143188 -95992 -35281 71860 -55054 363439 -103844 -166252
19145a66252M9071A19079g9057j21759J2030E138J31096c06037O5258a389A46375
19133b95500C8033a64724f4536k0665B89408B1153b07495H1060J21038C0319K91789
19122C22108j25126a69978p4824j02178J04769k1403B5751G246f3040A05480k3818
19111H1662f2453H6945k9581b18364O3127L1366m4251A18338a80321C7593c6955
19099c2607A74841p3681k72a30662k5420J0715m6924O3530G6746i0031j51845
19088b41876i2843o4778m5799Q8400n9308B93391D5196J91925E8658f7235r8073
19077a65308B22105a47123b4738k91005I9990c40992f0849j37615a4796n149B92383
19065f6693H95d2918p7389D8561i8657r9516B19505d13942b4817A66831p326b12137
$$ plain form
19145 -166252 -117181 119079 -79057 -200816 -188786 5138 136234 -306037 -240779 -1389 146375
19133 -295500 38033 -164724 -64536 -85201 289408 21153 -207495 81060 202098 30319 322108
19122 322108 196982 -169978 -244802 -346980 -242211 -263614 25751 7246 -63040 105480 81662
19111 81662 -62453 86945 57364 -218364 -155237 -123871 -168122 118338 -180321 37593 -36955
19099 -32607 174841 101160 100888 -130662 -156082 -145367 -192291 -128761 76746 -90031 -241876
19088 -241876 -92843 -157621 -203420 -115020 -174328 293391 45196 237121 58658 -67235 -165308
19077 -165308 222105 -147123 -24738 -315743 99990 -340992 -60849 -198464 -14796 -19945 292383
19065 -66693 895 -42918 -120307 48561 -98657 -198173 219505 -413942 -24817 166831 159505 -212137
19052a16764m3674M6156n659b9933r3456H5466B647b15594A21332a50820n2200
19041b03020A30787a55734J6875A986a27963q382F146J56193L5470c75183I1362
19029I8814C3440c22323C82815a51213B83335m3307r6457b20626d0490j81101
19019b21591J10534B33842r8093A460K53100A9042K5425J29347E37K30672a15869
19007A12532a47028B6648a9644A03108O5199G9804C8670L29103G5335f4355k02689
18996b67044g8115C6560c4104j17816j0743P3970I1386b88703O8259B04152J3556
18985B17708I8783J18712r769h2171l56247B30442g1390o5113o1172P7597k21617
18974c41695a15903n830B181J07990a55574f6993A11705f5491A34447J23336m0392
$$ plain form
19052 -116764 -160438 -114282 -119941 -29933 -123389 85466 2647 -215594 121332 -150820 -203020
19041 -203020 130787 -155734 -138859 1986 -127963 -136345 6146 162339 197809 -375183 91362
19029 98814 33440 -322323 382815 -151213 283335 240028 143571 -220626 -40490 -221591
19019 -221591 -111057 233842 135749 1460 254560 19042 44467 173814 537 231209 -115869
19007 112532 -147028 26648 -19644 103108 168307 79804 38670 367773 75335 -64355 -267044
18996 -267044 -78115 36560 -34104 -151920 -162663 -88693 91386 -288703 -220444 204152 217708
18985 217708 98783 217495 207726 -82171 -438418 230442 -71390 -136503 -197675 -120078 -341695
18974 -341695 -115903 -121733 2181 110171 -155574 -66993 111705 -65491 134447 257783 217391
18963B17391q7121f8860n2418o6201E2288c93717d4309p2708L6959k7710B33454
18951b1481j01426l128B29929b6442o4763C0647b64433B5569J39066J92409b04087
18939B42505a91221r1283a08013L8640n9763A20544K75417h4254F4863c57596
18928a67252J2399P6354k3047A08352B2588J63414a99790L4187o2562a9195G5805
18916b71133d7501G2273B0033g4317j24612A44731L5462m7487m9138K23774b178
18904C2932b8923A95650R0863N41a21441o7714A6814c4090m14593e3560B3539
18892C85882e7754C6193K4052a96871A8165c7018A26547e0909m2327q5698B89669
18880F57K72939j24248A6086a34880B75120a64769j09832P5563r1215D7231c2469
$$ plain form
18963 217391 130270 -68860 -121278 -187479 52288 -393717 -44309 -117017 -80058 -107768 233454
18951 -21481 -122907 -126035 229929 -26442 -91205 30647 -264433 25569 164635 357044 -204087
18939 242505 -191221 -282504 -108013 -69373 -129136 120544 395961 -84254 64863 -357596
18928 -167252 -154853 -78499 -101546 108352 22588 186002 -199790 -165603 -228165 -19195 75805
18916 -271133 -47501 72273 20033 -74317 -198929 144731 180193 132706 83568 307342 -2178
18904 32932 -28923 195650 286513 287054 -121441 -189155 16814 -34090 -448683 -53560 23539
18892 385882 -57754 36193 60245 -196871 18165 -37018 126547 -50909 -93236 -178934 289669
18880 657 273596 149348 16086 -134880 275120 -164769 -274601 -199038 -290253 47231 -32469
18868A23939f852D7876i9889E5644b3005k703B37712I4488O7880m5027E6336c05124
18855a13839A11571b32860E1404Q0531E0330J98050a41432k62977a96136A88113
18844E3535a01053l3759A13530b53616d0233j07708n8382K7207l8368J07215o7758
18833a78027A492a78245p9116A23545d1189l8103j96792L3063d2150a7378j16540
18822a33918A24064C7226i2830H0740a72178I97L9092g9244a3047j80741I237
18810A12908k1202f7341A20240R8127c9516k20967h1346A91592r3589J14088b03912
18798d3213l59944J67802a4991N819k38590N6938B0241J54348J73321I866b70734
18786B86664a13216j7684B1282J5994O900K6550b23602n8905a05567M7428J1549
$$ plain form
18868 123939 -6852 47876 -99889 55644 -23005 -25708 237712 94488 162368 117341 56336 -305124
18855 -113839 111571 -232860 51404 131935 50330 248380 -141432 -404409 -196136 188113
18844 53535 -101053 -134812 113530 -253616 -40233 -147941 -206323 -179116 -217484 -110269 -178027
18833 -178027 1492 -178245 -257361 123545 -41189 -79292 -276084 -243021 -42150 -17378 -133918
18822 -133918 124064 37226 -92830 80740 -172178 997 40089 -79244 -13047 -193788 9237
18810 112908 91706 -67341 120240 218367 -39516 -260483 -81346 191592 98003 212091 -203912
18798 -43213 -403157 -235355 -14991 -9172 -247762 -190824 20241 174589 347910 9866 -270734
18786 286664 -113216 -130900 21282 37276 44176 70726 -223602 -282507 -105567 -58139 -46590
18775d6590A41088C5204b25948J05138H6312d4377m4206E7434K475a02219q463
18764a10682A21358c93503a9803j7553j42904A43100b50555N7412B67625i1517
18753A20477b46165A23934J73370N1120b33188r4415K48J04578A76997b80799
18742a01005B12652O4247a73066p5167B0115P0660e7261A6808J17323a05942A73142
18730g621B92476A5987B155c63724d5723j08740d5353j8265l6770E6865d2022
18718F2614b67188D8641b22787P945I6122i491o4036B92871h1318j1459j62762
18707b55539d8082J9240j94487N6015B43784i2154p3675I3196e3139I3539e6925
18695A29650P8885e3486q6466L6504j82130A879K74385b4599G6360h1442c556
$$ plain form
18775 -46590 141088 35204 -225948 -120810 86312 -44377 -88583 57434 59909 -102219 -110682
18764 -110682 121358 -393503 -19803 -37356 -180260 143100 -250555 -193143 267625 -91517
18753 120477 -246165 123934 297304 348424 -233188 -327603 -327355 -222777 176997 -280799
18742 -101005 212652 276899 -173066 -248233 20115 90775 -57261 16808 134131 -105942 173142
18730 -7621 292476 15987 2155 -363724 -45723 -154463 -45353 -63618 -100388 56865 -42022
18718 62614 -267188 48641 -222787 -214842 96122 -9491 -73527 292871 -81318 -92777 -255539
18707 -255539 -48082 -28842 -223329 -167314 243784 -92154 -165829 93196 -53139 93539 -56925
18695 129650 208535 -53486 -139952 -103448 -285578 1879 276264 -24599 76360 -81442 -3556
18683B2080d2257A13779a30088C8974j8464c6490B43076c45787a61869O9259b5353
18671a49084e9552A91401a96922q2342Q3437p8007k7319c145q4883j72112A09824
18659a241A35364b75443J13767l35510b10865F3737e0008p9323B36553d12162
18648b17218i2597c0448B8230g2513E1684K9235c26463R7619J06488M371p5262
18637a93247B6504I979d707j97353A38659a72716k14547a70343B40276l1982d4890
18625i2024A5876g4782A18780E5350k4261a94965g2495C39539a13935G0161q193
18614F1968J03875g9082c9523A22114j059b76173a20720c0871J2570A2709h118
18602A30093e9991o5241r551q6511p2262l3762c0940A29723a44686j77839J08454
$$ plain form
18683 22080 -42257 113779 -130088 38974 20510 -36490 243076 -345787 -161869 -92610 -25353
18671 -149084 -59552 191401 -196922 -279264 -195827 -273834 -301153 -3145 -88028 -260140 109824
18659 -1241 135364 -275443 -161676 -497186 -210865 63737 -50008 -129331 236553 -412162
18648 -217218 -92597 -30448 28230 -72513 51684 80919 -326463 -228844 -122356 -117985 -193247
18637 -193247 26504 9979 -4707 -202060 138659 -172716 -387263 -170343 240276 208294 -44890
18625 -92024 15876 -74782 118780 55350 31089 -194965 -72495 339539 -113935 70161 61968
18614 61968 165843 -79082 -39523 122114 121055 -276173 -120720 -30871 -18301 12709 -8118
18602 130093 -59991 -125232 -134783 -221294 -293556 -327318 -30940 129723 -144686 -322525 -214071
18591b14071P023R0666c511A92605b07550A52929E4128f3603C12718e718j90195
18580a95913D5973N0139c2724B00991F1722c08722d5176A24766J2386a21032G8184
18568a84037j62303b2349H3022Q3344b8737k47807B35106a8978j91370k0492A23596
18556A7329J56646b63418C6681a55201A08391g4539A49931n2590d4126i477H7933
18544a00913p0969N1005j07365a02817B1758a26785h961q002j63090E1454O0947
18533A12401h5019r0449B44115a69714O906a0558I1880j139a82194N5060D2363
18521d12001a71872A09282h8696b0663B10992r7257R6761C357a3434k42461A4255
18509a35010F8027G378c54880C8209K3533K37563J5381a5535k61830H7460a79851
$$ plain form
18591 -214071 -207048 -116382 -3511 192605 -207550 152929 54128 -63603 312718 -5718 -195913
18580 -195913 45973 96112 -32724 200991 61722 -308722 -45176 124766 137152 -121032 78184
18568 -184037 -346340 -22349 83022 166366 -28737 -276544 235106 -18978 -210348 -230840 123596
18556 17329 173975 -263418 36681 -155201 108391 -74539 149931 97341 -44126 -9477 87933
18544 -100913 -171882 -120877 -228242 -102817 21758 -126785 -8961 -16963 -180053 51454 112401
18533 112401 -85019 -175468 244115 -169714 -162808 -10558 91880 90741 -182194 -127134 42363
18521 -412001 -171872 109282 -88696 -20663 210992 113735 210496 3357 -13434 -255895 14255
18509 -135010 68027 7378 -354880 38209 61742 299305 314686 -15535 -277365 87460 -179851
18497A03423c8868A994a17962B54234A6251b93600G9853b2528Q113G0067c2543
18485C2166b87803G4689i5467j3482C32275a8582B02805c73047g4957L3570A01138
18473a35542j49415E5882a74662l1414B3033M9168g2541q1458l0726B01703m007
18462A97696a41435k33883h6938k51116a59933O6461j99846B29302r9772M0511
18452A70041J36953a79231m5997P9427K2064j22755R6810j20643J1951K6252J8183
18441b13939K8208Q8313A3616J27366a48590B20486a30206d4554l00265n209G1500
18429A00818k7565a39195F4696A6759c77119H625J6482d7477k46132N4617l3658
18418b72650f2854B38070F5759K46415c89416i8241c3705j16988A63630c07526
$$ plain form
18497 103423 -38868 1994 -117962 254234 16251 -293600 79853 -22528 -14415 70067 -32543
18485 32166 -287803 74689 -95467 -108949 332275 -18582 202805 -373047 -74957 -41387 101138
18473 -135542 -284957 55882 -174662 -206076 23033 72201 -72541 -153999 -184725 201703 197696
18462 197696 -141435 -375318 -86938 -338054 -159933 -93472 -293318 229302 129530 170041
18452 170041 306994 -179231 -225228 -145801 -123737 -246492 -149682 -270325 -258374 -232122 -213939
18441 -213939 -185731 -97418 13616 140982 -148590 220486 -130206 -44554 -344819 -350028 71500
18429 100818 73253 -139195 64696 16759 -377119 8625 25107 -47477 -293609 -238992 -272650
18418 -272650 -62854 238070 65759 312174 -389416 -98241 -33705 -150693 163630 -307526
18407G736J79664a3618A68502a22435G4318A20c7486A4339d3160J7931J32j73855
18395a98952i1212A28169M9715r345b49062A94869a7148C1306J93566O2825j07978
18384A79719g904H6638J37764j04870M3465e8022j87111O7841f0429l03981A81309
18372A9250a25121A75500o0190a74292B57445l7368c99122A97456k8077c65946
18361f6222F7383N8415a02693C5843b958m9546q0724J4208q6101B34060a14973
18349g6327A08662a19490q9389b1997D00578f955j77026L0099D8814e7094J354
18338e5740j63398G9685a4735A76797e951k23322I248Q1101b2850n6894A89748
18326C90430b3607n1046J3842l2912B39221I1006b97627g7311o7075q2841B269
$$ plain form
18407 7736 187400 -13618 168502 -122435 74318 120 -37486 14339 -43160 -25229 -25097 -198952
18395 -198952 -91212 128169 177884 168539 -249062 194869 -17148 31306 224872 287697 179719
18384 179719 -7904 86638 224402 119532 162997 -58022 -245133 -177292 -60429 -364410 181309
18372 19250 -125121 175500 115310 -174292 257445 220077 -399122 197456 169379 -365946
18361 -66222 67383 125798 -102693 35843 -2958 -52504 -133228 -119020 -205121 234060 -114973
18349 -76327 108662 -119490 -208879 -21997 400578 -6955 -183981 -153882 48814 -57094 -55740
18338 -55740 -219138 79685 -14735 176797 -5951 -229273 9248 90349 -22850 -79744 189748
18326 390430 -23607 -74653 -60811 -93723 239221 91006 -297627 -77311 -144386 -227227 2269
18314A55915a59285B87324A16059a0912l4659j17265A30456a052B11398c38373
18303A60802b9597j70625M4761P4139j69581K4419R8173p0555b6553j18616H460
18291b44847d5523C2233b15462B3421h0096H0085K06063H2863c6255A01069j7890
18280H3179j4184J9568K64605G5193a44340a6432A19618a6470l46643A97351J11141
18269C08492A40306e7258A85407g7903j0037G7186N7631r831K48942C8304f234
18257c37339f8161B30844b59728f1112j89844O7297f5605j0542r1747H9605J23117
18246B12722a79134B17987a03617p2739A08638A8162Q249Q812a46293j8582c2779
18234A24912a59161D0463b55253F5949f0867k64043O0191j18580I5983i1528H8794
$$ plain form
18314 155915 -159285 287324 116059 -10912 -45571 -162836 130456 -1052 211398 -338373
18303 160802 -29597 -200222 -155461 -81322 -250903 -226484 -128311 -198866 -26553 -145169 8460
18291 -244847 -45523 32233 -215462 23421 -80096 80085 286148 82863 -36255 101069 83179
18280 83179 68995 88563 353168 75193 -144340 -16432 119618 -16470 -363113 197351 308492
18269 308492 140306 -57258 185407 -77903 -87940 77186 134817 124986 373928 38304 -6234
18257 -337339 -68161 230844 -259728 -61112 -250956 -183659 -65605 -76147 -167894 89605 212722
18246 212722 -179134 217987 -103617 -176356 108638 18162 26411 35223 -146293 -164875 -32779
18234 124912 -159161 40463 -255253 65949 -60867 -324910 -264719 -383299 95983 -91528 88794
18222B92726A1920a73798Q6075j57772g6579B90897b0864j06706I3561b61574
18211c84952J87613d8408j1583K72k02729B08818b6556p9828F6848c72682a21684
18199a43979H7374c8124j41785L8107o2886K0548B60143a27375K7907A8067Q7981
18188A06048J42213h3532j60235B83021g8900m3653c768A17700d58295D7344i666
18176b2828K562k55031J36381B01130f1224F0192e3066o6224K3051J2468o9068
18165a52839A44118P5752b08192k03942A9880J98882c01844Q6021g7563B6569
18154c5292B85610H8473b7549j63613R3631B501Q5691a20326B14019b55759I3499
18142A57772E8857B0464G000c3477l5908m8943e5426B65112p0334c9155C7103
$$ plain form
18222 292726 11920 -173798 -87723 -245495 -76579 290897 -20864 -127570 93561 -261574
18211 -384952 -197339 -48408 -59991 -59719 -262448 208818 -26556 -106384 66848 -372682 -121684
18199 -143979 87374 -38124 -179909 -141802 -204688 -184140 260143 -127375 -99468 18067 106048
18188 106048 248261 -83532 -243767 283021 -78900 -122553 -3768 117700 -458295 47344 -9666
18176 -22828 -20266 -275297 -138916 201130 -61224 60192 -53066 -119290 -96239 -83771 -152839
18165 -152839 144118 219870 -208192 -412134 19880 218762 -301844 -215823 -77563 26569
18154 -35292 285610 88473 -27549 -191162 -97531 2501 88192 -120326 214019 -255759 93499
18142 157772 58857 20464 7000 -33477 -69385 -118328 -55426 265112 194778 -39155 37103
18130A00293L94666i3890G0016e7751j3659A11114a9339j84934A31505n1940a9855
18118b25138A31425b12886H4148A4908b45408A82730F4393L2001A9930a6212G8705
18106h1815A6788N5879M3778a04227A37781J7792K9788b05416B5164K5127a60303
18094b27157a6564M141B09237K5734j09266d33356a13087J9215k21627a7031C39479
18082B7707b76708a13345k0046A73709b3145B63103a13087d8549j11963D6960
18071A60714b69038B2223J68227a8001A19222d3080G5461a29036j282F9578a14142
18059f1918o8055J4629j03419e7987d761k30444B53808c79013n392D5483f2842
18047G039d71294B1891b30558a03111H3103K24057i5778n8218k37913a40897p0681
$$ plain form
18130 100293 494959 -93890 70016 -57751 -71410 111114 -19339 -204273 131505 79565 -19855
18118 -225138 131425 -212886 84148 14908 -245408 182730 64393 96394 19930 -16212 78705
18106 -81815 16788 72667 116445 -104227 137781 155573 185361 -205416 25164 50291 -160303
18094 -227157 -16564 -12423 209237 234971 125705 -433356 -113087 -93872 -315499 -17031 339479
18082 27707 -276708 -113345 -133391 173709 -23145 263103 -113087 -48549 -160512 46960
18071 160714 -269038 22223 190450 -18001 119222 -43080 75461 -129036 -130318 69578 -114142
18059 -61918 -129973 -115344 -218763 -57987 -4761 -235205 253808 -379013 -384405 45483 -62842
18047 7039 -471294 21891 -230558 -103111 83103 307160 -95778 -153996 -391909 -140897 -211578
18036b11578J05611d1307A27941g0587G120a04572A88423a53593E4504J84209
18026B38713g1026c4526p6423A92027l2692f0265a2463B06331q7809b826j20083
18015a22909C09313h3398j340j53486A44290a96936g1234b1771B46665A18985
18004E8219c83694b7645n8641A39520k0568a8039G3831B3593a87917M2574C00284
17992a1688l105B34564p6364C069a8886D882c58135E7607K60762a94259h8645
17980a74432E7575J216a33882A08901R6493E7086K26379a75465f5036G3768J2194
17969H5962a17829K1026q7067l020k4853B19399c28342d6429A70490b5376C11213
17957b87948A03821C6283J59124l1043b06509R5464C070a80818K9972k2349B31916
$$ plain form
18036 -211578 -105967 -41307 127941 -70587 7120 -104572 188423 -153593 54504 238713
18026 238713 -71026 -34526 -110949 192027 159335 -60265 -12463 206331 118522 -2826 -122909
18015 -122909 309313 -83398 -84738 -238224 144290 -196936 -71234 -21771 246665 118985
18004 58219 -383694 -27645 -86286 139520 118952 -18039 73831 23593 -187917 -145343 300284
17992 -11688 -14793 234564 158200 3069 -18886 4882 -358135 57607 318369 -194259 -88645
17980 -174432 57575 58791 -133882 108901 205394 57086 283465 -175465 -65036 73768 85962
17969 85962 -117829 -96803 -183870 -186890 -211743 219399 -328342 -46429 170490 -25376 311213
17957 -287948 103821 36283 195407 164364 -206509 -111045 3070 -180818 -150846 -173195 231916
17945B99037q8709o5425b45560B42886A8271M9581P1204B5982J77067a93461h4649
17933A36608n1477K8303b70421g1005a4482A38573N0074F455g0989F9835a17870
17921B13227d4573B19158m3414a33585C03127A50905a36475A72048a08364b9036
17910a57169c5738B26275b83099C00485e4934J7505q7371A22186K3328J272J87551
17899C34337f3688n7842B69953K4774a09768A94798p2234b49418J07263f5594
17888d4260A18937O8688N3458J17795c91233H023J19149n7993Q3771f1524l04692
17877c66216f6922j43569C09883b31587A77447O0373c1466I8204l7049c54094
17866i7016C71563A80672a53060C2897K39490j27274d1872A83185b62174A6654
$$ plain form
17945 299037 210328 144903 -245560 242886 18271 67852 139056 25982 203049 -193461 -84649
17933 136608 85131 113434 -270421 -71005 -14482 138573 188647 6455 -70989 69835 -117870
17921 213227 -44573 219158 175744 -133585 303127 150905 -136475 172048 -108364 -29036
17910 -157169 -35738 226275 -283099 300485 -54934 -37429 -124800 122186 145514 146786 334337
17899 334337 -63688 -121530 269953 294727 -109768 194798 122564 -249418 -142155 -65594
17888 -44260 118937 187625 241083 358878 -391233 8023 127172 69179 152950 -61524 -366216
17877 -366216 -66922 -210491 309883 -231587 177447 237820 -31466 98204 61155 -354094
17866 -97016 371563 180672 -153060 32897 272387 145113 -41872 183185 -262174 16654
17855I9074j5535M7650a0483A8615a67432F1159a6640A46146a54388I687J16085
17844A25772a32021B63620b72678k3459e6979J2176E1378b45752d1311E9536l696
17833E5840h2817B8373a319l22902G8641O5487L6639L8852K9952k516a87104a8262
17820D9815i9196B44114A00270d204l64358F2056b04866P2214A42972G929K4554
17809C2483M29768A29030K37669e8391B59764F152K45899I3234b38314a4006E01986
17797C56793F7998c58896b1311l10102I7669A6866g4744B42832a54314A91032
17786A12535d2561j13433K2093H6555a35259r147k49720A95688a93533j404B68972
17774A69331j5221J8941A1475J83476O6559a09292G6647e754A48328d8275I5247
$$ plain form
17855 99074 83539 131189 -10483 18615 -167432 61159 -16640 146146 -154388 9687 125772
17844 125772 -132021 263620 -272678 -296137 -56979 -44803 51378 -245752 -41311 59536 55840
17833 55840 -82817 28373 -1319 -324221 78641 144128 180767 219619 249571 247055 -187104 -18262
17820 49815 -99196 244114 100270 -4204 -368562 62056 -204866 -132652 142972 7929 32483
17809 32483 462251 129030 366699 -58391 259764 6152 252051 93234 -238314 -14006 501986
17797 356793 67998 -358896 -21311 -331413 97669 16866 -74744 242832 -154314 191032
17786 112535 -42561 -155994 -133901 86555 -135259 -144406 -394126 195688 -193533 -194937 268972
17774 169331 154110 173051 11475 194951 261510 -109292 76647 -5754 148328 -48275 95247
17762a1556A96146B8922L34874E0713K5869f415D9928f6304G9745M9997J48318
17751B78060l5145B0634a40282A4131L5999Q0723a8102l5259m6152C43785i2212
17739A575R3529h1729C43399I4595k9123K81089j44829A0835g9893j67347H9417
17727d485k28591A09842O571N7702C0437K02933b5337A34721B6644J21968j6476
17716A32136b1532A48683e9715A12725J98654r3731n1036G2619M1453a66858L1881
17705a34977A56127j9023e3741J5052B1583N63870a2638o3431B23216F5916c06651
17693b67897c6741H5249c9958B07743C2490K21725f6015f222B55781b6716B31384
17681i0202A3501j606a7075C41182b09298J8329B44614A6391K3440A7592b04973
$$ plain form
17762 -11556 196146 28922 363796 50713 76582 -6415 49928 -66304 79745 129742 278060
17751 278060 242915 20634 -140282 14131 50130 130853 -18102 -53361 -99513 343785 -92212
17739 1575 95104 -81729 343399 94595 65472 346561 201732 10835 -79893 -247240 89417
17727 -4485 -233076 109842 116413 174115 30437 233370 -25337 134721 26644 148612 132136
17716 132136 -21532 148683 -59715 112725 311379 217648 166612 72619 114072 -166858 -134977
17705 -134977 156127 137104 -53741 -38689 21583 585453 -12638 -76069 223216 65916 -306651
17693 -267897 -36741 85249 -39958 207743 32490 254215 -66015 -6222 255781 -26716 231384
17681 -90202 13501 11895 -17075 341182 -209298 -190969 244614 16391 39831 17592 -204973
17669B01940K4361d2276B6375K55242n7838H5818m0259b48213G1528L34483A50604
17657b19684F3216a236A05975m6950L8834l9067a80187k7572h0920B12522a90228
17645b2310C54502h1248c791j40512C32385o543j9462A4577P2640K14957d5626
17633b04251C05612a4045A69024j1528a44274d5116C90807q8657i7764A24207
17622A77380J9237N0187d419D21042j57036I0907h0324B57880A01131i814C38860
17610a41717E1659J86143J78819k3005b12600e7947A45145c09720B42315D0156
17599b01659F3188a75178E3810a12393A08446B4460a06381b759A11147G870N3443
17588F1313R0850A8228b648j00262B16515a63009j69669F918K05218J77521j87542
$$ plain form
17669 201940 226301 -42276 26375 281617 223779 85818 45559 -248213 71528 406011 150604
17657 -219684 63216 -1236 105975 59025 97859 58792 -180187 -207759 -80920 212522 -190228
17645 -22310 354502 -81248 -3791 -144303 332385 325842 306380 14577 87217 302174 -45626
17633 -204251 305612 -14045 169024 157496 -144274 -45116 390807 302150 -97764 124207
17622 177380 196617 246804 -4419 421042 264006 90907 -80324 257880 101131 -9814 338860
17610 -141717 51659 237802 416621 393616 -212600 -57947 145145 -309720 242315 40156
17599 -201659 63188 -175178 53810 -112393 108446 24460 -106381 -2759 111147 7870 61313
17588 61313 152163 18228 -2648 -102910 216515 -163009 -332678 6918 212136 389657 202115
17577B02115J52180A48551D2683L33891d8904G5126K24576G0542a2263A88018
17566F8059A8946J60951j0272J6720f6879B10052d2074j18707F8423O5193a371
17554c7920f502H9275a23518e5216A37956B7179a50654B3369C00J58721k5805
17543A33216e2117B71882N7621H4800J34311e5020C8326Q187f2780A05676J60977
17532B66653K777m3024a15637B76016J87311A71064P2345k1636L9767l2025K69465
17521D98980N3976O4154p8480B53602J09103L5627j78735m729K68001D8480J87625
17510B36105a66723G39878l52414F4611K69334J04019L18851B13712J15677J84315
17500E13704A15020R5508H0881a38808B75971A15573L2630J01180p9186K23939
$$ plain form
17577 202115 354295 148551 42683 376574 -48904 75126 299702 70542 -12263 188018
17566 68059 18946 179897 169625 186345 -66879 210052 -42074 -160781 68423 133616 -1371
17554 -37920 -6502 89275 -123518 -55216 137956 27179 -150654 23369 300 159021 133216
17543 133216 -52117 271882 329503 84800 219111 -55020 38326 46513 -62780 105676 266653
17532 266653 269430 226406 -115637 276016 463327 171064 243409 221773 261540 229515 498980
17521 498980 552956 617110 538630 253602 362705 398332 219597 214868 482869 48480 236105
17510 236105 -166723 739878 387464 64611 333945 437964 756815 213712 329389 513704
17500 513704 115020 210528 80881 -138808 275971 115573 148203 249383 170197 394136
17490C94136J07542e3533C76273A29789K30434j52136L12048B32096A13435k4944
17480H8491k3467K36898J09115R6220A05469K53755A27746M5081K77163q6882
17470C63108K62469m8554a11301C1208J84750A07608M26462B05681J16388a55981
17459A5664a07869d3134D39353l5597A01338N0600L31591J33514B81421l2117
17449B49304K13883n9979j08722L07983r7415A77134K15406A73967L55726B55600
17438C65955q8529k617M2084q7883J2337n9032o70K34023r0461k0962j4683E2605
17425B06191H3985P9045L8416L7993A3106M26166r7922l6568j16177K04261J09202
17414E02068j29276j77935k7287L52518B55065N5655r4933D4549a8197A06117
$$ plain form
17490 394136 501678 -53533 376273 129789 360223 208087 520135 232096 113435 88491
17480 88491 65024 301922 411037 507257 105469 359224 127746 172827 449990 363108
17470 363108 625577 577023 -111301 31208 215958 107608 534070 205681 322069 -155981
17459 15664 -107869 -43134 439353 403756 101338 151938 483529 617043 281421 249304
17449 249304 463187 403208 294486 602469 505054 177134 392540 173967 529693 255600
17438 365955 277426 274809 316893 229010 241347 182315 181645 415668 325207 304245 289562 52605
17425 206191 83985 163030 201446 239439 13106 439272 341350 304782 188605 392866 502068
17414 502068 372792 194857 167570 520088 255065 310720 215787 44549 -18197 106117
17403B2497O440L00153A34475a34223B79889c8890C72852N5375D1346J46523J27110
17392C14979n8369q2527J64889j33405C2172f2506A44863b49E2118J92413o4330
17381A80201Q7035J6130i773B93011A4688f3526F5058m247L87077B4201L5240
17370E9441M83596a15244a1912A4266K36195J50652f2844A29864F1244K05289
17360B66533h4345a0483A35485L40282A25305a27742C31205Q4272A69486J4886
17350A84372p7430K29975r1237J18327b54213H9127M063J05939P1835a51876A40268
17338B59554M333J01192j63791O5078K2284J7710j01803d3894A05483R1280i7533
17326a13546A55912E7753J91193M8982j26266D353P1948J67416o1692E6333K97527
$$ plain form
17403 22497 28937 329090 134475 -134223 279889 -38890 372852 428227 41346 187869 314979
17392 314979 256610 174083 338972 205567 32172 -62506 144863 -249 52118 244531 180201
17381 180201 267236 283366 -9773 293011 14688 -63526 65058 60811 447888 24201 59441
17370 59441 543037 -115244 -11912 14266 250461 401113 -62844 129864 61244 266533
17360 266533 -84345 -10483 135485 475767 125305 -127742 331205 415477 169486 184372
17350 184372 106942 336917 245680 364007 -254213 89127 93190 199129 270964 -151876 140268
17338 259554 263887 365079 201288 266366 288650 306360 204557 -43894 105483 196763 -97533
17326 -113546 155912 57753 248946 297928 171662 4353 76301 243717 182025 56333 353860
17315C53860c8807H0569l484J74884P821A07196l0101J75519N0756C9365A3847
17303D03489j9608j73268A04249R0308J5806q5907D0681M18969B21747L2398P8679
17292C32824n4592A29998f2081I8920O451m7304J43644o2836j8482f8784A27213
17280C9922j9793J28327K54297j24029j23782N8114G0356J77421F6237b9722B32044
17268a44766A07512J20120d1943B70087A6137J16662K76387j19906j26010K35335
17258C98605k5596d9780C73336G8243L14345J46990j64867l9031J95164B37372
17247B29601m4677I326O176L15814q9923k3181K13459j96195J04070H2859K1772
17236A04631N4820a14336A71767R0391A12913O29821B97977O4633P720f4F14148
$$ plain form
17315 353860 -38807 80569 77085 251969 259790 107196 77095 252614 303370 39365 13847
17303 403489 383881 210613 104249 194557 210363 124456 40681 459650 221747 254145 332824
17292 332824 278232 129998 -62081 98920 105371 58067 201711 138875 120393 -68784 127213
17280 39922 20129 148456 402753 278724 154942 213056 70356 247777 66237 -29722 232044
17268 -144766 107512 227632 -41943 270087 16137 132799 409186 289280 163270 398605
17258 398605 373009 -49780 373336 78243 392588 539578 374711 335680 530844 237372
17247 229601 184924 9326 15502 331316 241393 218212 431671 235476 339546 82859 104631
17236 104631 159451 -114336 171767 262158 112913 742734 297977 362610 370330 -64 614148
17224C15441l5538k0983k372A01414J50505K42037B17872J71001j63352L6455
17214B61976N19407A35647a17085C15459J4458k3395p4899K1906q847K30436K2979
17203D98097B39050N0162l0215A00198L72098j19365J05307K48683A72545J14671
17193B87216P90M27811B7561J89552J11778j41502K96121J28378k55759K239L12939
17182F71307A37649g5877D0318N0927K09398B5849M06403A10827K78370q1923
17172C07274K43023B34987L31064k38720l1935J20430j50460N7509r9328P1237
17162B94784I0364K98496L04471B94022j0068L73371k65704r130l8894K67417
17152F11014k35830K49796B89000j18288J86838m4139l9794p3416R1765j00918
$$ plain form
17224 315441 279903 258920 256548 101414 251919 493956 217872 388873 225521 261976
17214 261976 781383 135647 -117085 315459 329917 306522 231623 253529 244682 475118 498097
17203 498097 239050 289212 258997 100198 472296 352931 458238 706921 172545 287216
17193 287216 288006 715817 27561 217113 328891 187389 483510 611888 356129 358368 671307
17182 671307 137649 -75877 40318 91245 300643 25849 432252 110827 389197 307274
17172 307274 550297 234987 566051 327331 295396 415826 265366 322875 223547 294784
17162 294784 90364 388860 693331 294022 283954 657325 391621 382491 343597 611014
17152 611014 375184 624980 289000 170712 357550 313411 273617 200201 291966 191048
17142A91048M7711j6663J23941j07764K77714q4817n5305j50103J85252o1242
17132C49772R9535r4684Q4570o1283j53036K16690J05158k00332Q5116B12662
17121F42358l01155K45580A27766M23482B63155N05624l78931O3104J19489E7958
17110D31107L0276A90724L9778M95350l22128l6288L84444l29084N4053J63997
17100F40846l3010j96060J40627l2488m5126j55932L59583j51425o3322k9524
17090D34169M6948m8216Q9133K28162P3261k28863j70650K43506M01088D25838
17079C48768K17540J6606A96581Q0421R5693O3242K17136L6920I9662M39041L5607
17068E74310o4807K85164j03539B92859J66198N7829K44222n089j11552R6464
$$ plain form
17142 191048 238759 222096 346037 238273 515987 431170 375865 225762 411014 349772
17132 349772 449307 354623 439193 377910 224874 441564 546722 346390 431506 212662
17121 642358 341203 586783 127766 551248 263155 768779 389848 452952 572441 57958
17110 431107 461383 190724 230502 725852 403724 367436 751880 422796 476849 640846
17100 640846 607836 411776 552403 519915 474789 318857 678440 527015 463693 434169
17090 434169 481117 432901 522034 750196 823457 594594 423944 667450 1068538 425838
17079 348768 566308 582914 196581 277002 372695 435937 653073 689993 99662 538703 574310
17068 574310 509503 794667 691128 292859 459057 516886 761108 756019 644467 740931
17058G40931K52673l26629K5470k95269M78366j44890R266j35862j11388P7980
17048E70648J48546J77630k04619J45623r8357k08499M33571k77207j33778L53422
17038I06980j14625k48424Q2818J15942k29784J41945J85269k16732N87139E91195
17027H57518j64082j68205L37071J50066D93973M85170l60888K37288l8226K31980
17017A049297m28727L30198j10793k8466L54582k87952J4414k06081L56323j26531
17007I16264j22657j52354j76576N18778l52031l1340J59428k00689J69996N4462
16997G83281k0321L01421m80191O14262j79856k22258J86367k51462L96686r5034
16987A032895k15982r1523K04211K58383l07050M25339j33327k94897K74831O6097
$$ plain form
17058 740931 993604 666975 692445 397176 875542 730652 739918 604056 492668 570648
17048 570648 719194 896824 692205 837828 739471 530972 964543 687336 553558 906980
17038 906980 792355 543931 626749 742691 512907 654852 840121 623389 1210528 591195
17027 857518 693436 525231 862302 1012368 493973 979143 618255 855543 817317 1049297
17017 1049297 620570 950768 839975 811509 1166091 878139 892553 686472 1042795 916264
17007 916264 793607 641253 464677 983455 631424 600084 759512 558823 728819 783281
16997 783281 762960 1064381 584190 1198452 1018596 796338 982705 731243 1127929 1032895
16987 1032895 816913 725390 929601 1187984 880934 1306273 1172946 878049 1152880 1218977
16977A218977j0927l04319L3990k27024J53034M438L50267J44075Q1274n13685
16967I30100L27748k39185J06028K72192k28543j93901J63307K83024j19656k75515
16957A025599J17801J1588J28529j15081J95767J19944R5762j00302M084N0274
16947A533965k56286J00204o0746O1129q7967K19795L8267k09422M4825R028J5537
16936A408329J46233N9667J13934N2713k99429J06123k0055q7813J06492J02982
16926A689176m3373k77087L98156j80057r9501O8694J36131K50138k71161J76622
16916A847738m9147J51654k08132m9644J66140M3818j70150M2619M11023P9940
16906B265859j55073q6067p6346K16861k8418N89938k93239l28379M5416K00449
$$ plain form
16977 1218977 1208050 903731 937721 710697 863731 868169 1218436 1362511 1443785 930100
16967 930100 1257848 1018663 1124691 1396883 1168340 974439 1137746 1420770 1301114 1025599
16957 1025599 1143400 1154988 1283517 1168436 1364203 1484147 1579909 1479607 1483691 1533965
16947 1533965 1277679 1377883 1317137 1378266 1290299 1510094 1548361 1338939 1383764 1392792 1408329
16936 1408329 1554562 1614229 1728163 1780876 1481447 1587570 1567515 1479702 1586194 1689176
16926 1689176 1645803 1368716 1766872 1586815 1487314 1556008 1692139 1942277 1671116 1847738
16916 1847738 1798591 1950245 1742113 1692469 1858609 1902427 1732277 1774896 2185919 2265859
16906 2265859 2110786 2024719 1948373 2165234 2136816 2726754 2433515 2105136 2150552 2351001
16896B351001O6639j40397L70721l78392j6615P01626m47012R9066M4654j17848
16886B533443R0059L5407L9544K94219n72743M73901K48949K6246l33050M06261
16876C242236j78199J17679j97148M57690k00262R5745K05401l2121k14637L48100
16866C644484k32610J98926M3121k1778j99285K67967M7171J56761M47237k41430
16856D110564j66402K45428J84331k16795L98421q7769L6800K58395l61445J07073
16846D508601K73596J29578M42200k72074J7959K68353K07395q0773L0476J29049
16836E654360l9979K41119J70529l4948K38423K92730m33934N12929J95001o7322
16826F728908J11583J82361m2628L99292R2430L99986j4968P4552K02832J78768
$$ plain form
16896 2351001 2417640 2277243 2647964 2269572 2252957 2954583 2507571 2606637 2651291 2533443
16886 2533443 2623502 2658909 2698453 2992672 2419929 2893830 3142779 3169025 2835975 3242236
16876 3242236 3064037 3181716 2984568 3442258 3241996 3337741 3543142 3511021 3296384 3644484
16866 3644484 3411874 3610800 3653921 3632143 3432858 3700825 3747996 3904757 4351994 4110564
16856 4110564 3944162 4189590 4373921 4157126 4555547 4467778 4504578 4762973 4401528 4508601
16846 4508601 4782197 4911775 5353975 5081901 5099860 5368213 5575608 5494835 5525311 5654360
16836 5654360 5614381 5855500 6026029 5991081 6229504 6522234 6088300 6601229 6796230 6728908
16826 6728908 6840491 7022852 6980224 7379516 7471946 7871932 7856964 7931516 8134348 8313116
16816H313116M03988J4650K20548j15138L50702L5314N91851n5301J483N08272
16806A0269485K76481L67505r4862N49411J34531M30607N55241K6972J57505Q10361
16796A3483237K32603Q703R11983P1963N18594R4897M92554M31127R35632o6995
16786A7114298O87830P00895O63182J81718J007316L55213P11833Q99118M67990
16777B2789393P48365R00362O57169J187609P57284O82459J045815R47142J496394
16768C1211992Q01456J030143J701375Q95794J266611J670562J750658J765738
16760D2094329J709729J245566K389485J848923J659156J925161K787687K416280
16752E8076316K681099K167751K444349K986467K677591L207153L124105L052314
$$ plain form
16816 8313116 8717104 8731754 8952302 8837164 9187866 9223180 9815031 9759730 9761213 10269485
16806 10269485 10545966 10913471 10818609 11368020 11502551 11933158 12488399 12515371 12672876 13483237
16796 13483237 13715840 13724543 14636526 14708489 15227083 15321980 15814534 16245661 17181293 17114298
16786 17114298 17802128 18503023 19166205 19347923 20355239 20710452 21422285 22321403 22789393
16777 22789393 23537758 24438120 25095289 26282898 27040182 27722641 28768456 29715598 31211992
16768 31211992 32013448 33043591 34744966 35640760 36907371 38577933 40328591 42094329
16760 42094329 43804058 45049624 47439109 49288032 50947188 52872349 55660036 58076316
16752 58076316 60757415 62925166 65369515 68355982 71033573 74240726 77364831 80417145
16744H0417145L340447K965243L810102L253161L391098L753949L599027K845930
16736A07376102L374369L119101L345680K369405K671043J782622J913015J410829
16728A27362166J254078P06229K66703j71140o70608j135318j525732j530624
16720A24555754k303312k568679k312560k934118l094739l488640l176264l458211
16712A01219231l279450l425242l365340l646806k887226l512043l150222k537644
16704G5415258k953492l309302l014086k256679k823683k204521k249970k337078
16696E4266447k315447j875260j758798j943399j727730j917738j765950j119338
16688C9842787j354319j710556j211464j264288r76949j049674j177099r74488
$$ plain form
16744 80417145 83757592 86722835 90532937 93786098 97177196 100931145 104530172 107376102
16736 107376102 110750471 113869572 117215252 119584657 122255700 124038322 125951337 127362166
16728 127362166 128616244 129322473 129589176 129418036 128747428 127612110 126086378 124555754
16720 124555754 122252442 119683763 117371203 114437085 111342346 107853706 104677442 101219231
16712 101219231 97939781 94514539 91149199 87502393 84615167 81103124 77952902 75415258
16704 75415258 72461766 69152464 66138378 63881699 61058016 58853495 56603525 54266447
16696 54266447 51951000 50075740 48316942 46373543 44645813 42728075 40962125 39842787
16688 39842787 38488468 36777912 35566448 34302160 33325211 32275537 31098438 30123950
16680C0123950j195547j150395p57751q50031o90066j223977o02415p79148q57809
16671B2016811l72120o17209n79771m82541p41701l48331o00005n88754n96561
16662A7089818k95373l50851p44288m17736m06455k28428l09794l28890m93304
16653A3514699q369n17625q2005m02462l48356m32925j00210k23274k02404n65217
16643A0631852l7203m7791m37518j29117m33826l94401J3612k28561j54845k25061
16633H557141p8491k67054J16563j05330l40533k19613k75362p4649l50576L05767
16623G267863q9369n33365L25744m05822J41337k09017O70l72099Q0889L2883
16613F239714j30485k38684k34189K90998l11584j77986j45592K93583n07706
$$ plain form
16680 30123950 28928403 27778008 27020257 26170226 25480160 24256183 23653768 22874620 22016811
16671 22016811 21644691 21027482 20447711 19965170 19223469 18875138 18275133 17686379 17089818
16662 17089818 16794445 16443594 15699306 15281570 14875115 14646687 14336893 14008003 13514699
16653 13514699 13506330 12988705 12906700 12504238 12155882 11722957 11622747 11399473 11197069 10631852
16643 10631852 10594649 10546858 10109340 9980223 9546397 9151996 9165608 8937047 8782202 8557141
16633 8557141 8478650 8211596 8328159 8222829 7882296 7662683 7387321 7312672 6962096 7267863
16623 7267863 7178494 6645129 6970873 6565051 6706388 6497371 6498041 6125942 6206831 6239714
16613 6239714 6109229 5870545 5636356 5927354 5615770 5437784 5292192 5585775 5078069
16604E078069J25766j06913j76371j5336K83269k93822j83069L226j56355j7188
16594D541276j51404M16191n89968r1384J22705k94647J67309q0822N5547m86237
16584C608566K48361k75919M27280j93883J947m7372k94706R5601J25515j60432
16574C534958o6633l42918K0583J76733k90919R6652K44725r2743r3727q5861
16564C100850j1877j40829k16074m9339m3127K92997K74248K1404m42851n69429
16554B215973N32242j99420M111O0965J98826j83931k70495L27296k28454M39015
16544B896128n25030K43094O1036J6413n41723J1491q21K62824k77816m26227
16534A719369N29067l7315k03449p5821J33659N220j87589L40846k26097O4710
$$ plain form
16604 5078069 5203835 5096922 4920551 4905215 5188484 4894662 4711593 4714819 4558464 4541276
16594 4541276 4389872 4806063 4216095 4124711 4247416 3952769 4120078 4039256 4094803 3608566
16584 3608566 3856927 3581008 4008288 3814405 3816352 3768980 3474274 3569875 3695390 3534958
16574 3534958 3468325 3125407 3145990 3322723 3031804 3128456 3373181 3280438 3186711 3100850
16564 3100850 3088973 2948144 2732070 2682731 2639604 2932601 3206849 3228253 2785402 2215973
16554 2215973 2748215 2548795 2552906 2613871 2812697 2628766 2358271 2685567 2457113 2896128
16544 2896128 2371098 2614192 2675228 2691641 2149918 2161409 2160588 2423412 2145596 1719369
16534 1719369 2248436 2211121 2007672 1931851 2065510 2070730 1883141 2223987 1997890 2062600
16524B062600k29358L39335o6653p7254L4504M2940N2814l99752K40831J33296
16514B133303m14722J81177j78972J1281J19480J5771l6031j98575J2849k0038
16504A625523k6823l11250N64970r8371J27226j45546n4902j12926J65393j70205
16494A563089k46702J56669J4215K1935K67606l65421P7256J62102R7599K9236
16484A777584l98564j4882L15663k61593o5990K63238p1539J23315m71510L02884
16474A498606K06867l33624j50072K1008j41704N30319k19635o7337j15395m9342
16464A179691J02159J08863j11423L5283j32195K89057o6729j32929k71941O19569
16454A619405n61843L05758r3586K69253n66527K42415r2356J36959j98639J66220
$$ plain form
16524 2062600 1833242 2172577 2105924 2028670 2063174 2106114 2158928 1759176 2000007 2133303
16514 2133303 1718581 1899758 1720786 1732067 1851547 1867318 1831287 1632712 1645561 1625523
16504 1625523 1598700 1287450 1852420 1754049 1881275 1735729 1680827 1567901 1733294 1563089
16494 1563089 1316387 1473056 1487271 1509206 1776812 1411391 1488647 1650749 1748348 1777584
16484 1777584 1379020 1364138 1679801 1418208 1352218 1615456 1543917 1667232 1195722 1498606
16474 1498606 1705473 1371849 1221777 1242785 1101081 1631400 1411765 1344428 1229033 1179691
16464 1179691 1281850 1390713 1279290 1314573 1182378 1471435 1404706 1271777 999836 1619405
16454 1619405 1057562 1363320 1269734 1538987 972460 1214875 1122519 1259478 1060839 1227059
16444A227059K1455J83849j39211j41750K44416K0930l59518o6248J67431l24320
16434H34093L81483r9877K57801k19884K15532j62552k10139K1669K60876J57643
16424A436645n49665L37144p9413j01659j0833n0408o0416L40578k18570j75614
16414H67789p3836N96475k53254m3303k34430r2994J0797K95413k91571j70797
16404F10289K11651K07672k1218m52341L88983J80631l5437l38044K48632J78525
16394A179343m21129j819M3054K50857L8270E29304L46505o2273J43080j79976
16384G76640N8202j25024L6275k0706J71384R8968k12394p4196L981M1676J55493
16373I10299j21743j40431J48948k53353J73982k94588L48215J45744L475C65217
$$ plain form
16444 1227059 1248514 1432363 1293152 1151402 1395818 1416748 1057230 990982 1158413 834093
16434 834093 1215576 1115699 1373500 1153616 1369148 1206596 996457 1018126 1279002 1436645
16424 1436645 886980 1224124 1144711 1043052 1032219 981811 921395 1261973 1043403 867789
16414 867789 793953 1390428 1137174 1093871 859441 766447 777244 1072657 781086 610289
16404 610289 821940 1029612 1008394 556053 945036 1125667 1090230 752186 1000818 1179343
16394 1179343 758214 756395 799449 1050306 1088576 529304 875809 813536 956616 776640
16384 776640 834842 709818 746093 725387 896771 995739 783345 709149 713130 754806 910299
16373 910299 788556 648125 797073 543720 717702 423114 771329 917073 920548 365217
16362F38687J85245j30403L92332k74055J13926m05232L87164J29960p3065k75551
16352F89008j2742Q3538k19189O6169J580J40092j58794J85778k19985J92366
16342G47821L1718Q7939k07561J18656M5561R3026k56697N8742n2645r1150K87770
16331H63180m27220L34632p4075J7541m4338r27J24020j27551k6419J29035j14381
16320F53497J53260L0666o3077l7821q4262m1762K2767A10719M43409m8977O4321
16309E69472J65830j46079J46309C04147K15717J8479q9244Q9763K9054J5771
16299E83687l4445P6055J86117K26088k42148k69342j6162k03507M08210j66468
16289E48085J60987A20397N60929n2559j59315M9504k17215J70907L29408N5440
$$ plain form
16362 638687 823932 693529 1085861 811806 925732 520500 907664 1037624 964559 689008
16352 689008 676266 759804 540615 606784 608364 748456 589662 775440 555455 747821
16342 747821 779539 867478 659917 778573 824134 917160 660463 719205 666560 575410 863180
16331 863180 435960 770592 696517 714058 669720 668793 792813 665262 638843 767878 653497
16320 653497 806757 837423 774346 736525 652263 610501 633268 110719 554128 505151 569472
16309 569472 735302 589223 735532 304147 519864 538343 449099 538862 567916 583687
16299 583687 549242 625297 811414 1037502 795354 526012 509850 306343 714553 548085
16289 548085 709072 120397 681326 628767 469452 518956 301741 472648 802056 857496
16279H57496j06886A18573N22354j25376M3302K81762l67378M8057j49089j68601
16269B03604L38002J12529C07041M08863B73901L0086J87349K31953j85806q3273
16259D54210K92233j42918j02877j80445J15048K7728J22783n9683K9600K76P5464
16248F31419J7112j71266A96039K01180K37105j93410J5745r992K41808C19590
16237F72014k18821j17352L47308j40176J1451j51139j50577N52988B03126K88607
16227D91733j06115L5339A20266M60059k58811M34738j79237k16474m1396A36348
16216F30269k86238A49748L43161A26350j8214J25391N267L17278j98730N8724
16206D16066A8120L03446Q558j55733L69453k42540A47919M01600B30698l4104
$$ plain form
16279 857496 750610 118573 640927 515551 558853 840615 473237 521294 372205 203604
16269 203604 541606 654135 307041 715904 273901 303987 491336 723289 537483 454210
16259 454210 746443 603525 500648 320203 435251 462979 585762 526079 555679 555955 631419
16248 631419 648531 477265 196039 397219 634324 440914 456659 446667 688475 319590
16237 672014 453193 335841 683149 542973 554424 403285 252708 805696 203126 491733
16227 491733 385618 420957 120266 580325 321514 756252 577015 360541 319145 136348
16216 630269 344031 149748 492909 126350 108136 233527 238794 556072 357342 416066
16206 416066 18120 321566 330124 174391 543844 301304 147919 549519 230698 196594
16196A96594P5323B9849L63221J82303k75201p1391L74013r8427o6105A10126
16185B11105J41531A55353K13904J89881B33125J0997J47787l6275M40068l90064
16175D05638n6294J96452j94424P5965L3857A42086L56318D8867p870L17067m5030
16164C13034L46032k81137O6264j68646G8387K80480A00320K74389o837A00445
16153B51275o4151M4113R1184A18810M51950k34738A49788F5767A2045L01491
16143C13536h0698J5932F28508k99668j13428m5623K90615A33792L71764f247
16132b65791E509K03019a26583e4292D04557G0335J08520K9843o0625J25587o7948
16121B05712K9275J12710j60399H1126l0691N8162L08636d5831B27613E4714i1669
$$ plain form
16196 196594 271917 29849 393070 575373 300172 228781 602794 504367 438262 110126
16185 211105 352636 155353 369257 559138 233125 244122 391909 355634 795702 405638
16175 405638 349344 545796 351372 427337 461194 142086 498404 48867 40997 358064 313034
16164 313034 659066 377929 444193 275547 78387 358867 100320 374709 367872 100445
16153 251275 187124 231237 322421 118810 570760 336022 149788 65767 12045 313536
16143 313536 -80698 -64766 628508 328840 215412 169789 460404 133792 505556 -6247
16132 -265791 5509 208528 -126583 -54292 404557 70335 178855 208698 148073 273660 205712
16121 205712 234987 347697 187298 81126 50435 108597 417233 -45831 227613 54714 -91669
16109C02245q1806o5285o4506k6552L56016A17309C8230J80717d28254J93387
16099b34867A86484a1537C87029A73185d764D8136L5682P2966a17567A43417j5102
16088A28315J16568R9038A3950J39241K6812c1198L202B13133A5343b4074A37476
16076B32063A07601a71284Q4256A47112A131a31367D2078e2574J1666A94413K50939
16065D45352k16812A13600P4212b11277B14055J59875j23561D2455J04873B7406
16054A15780R7533c29405a69C20027A5556M30908j23571G1273N565b60857i9509
16042A39462J05960c6444J3598C53641A68996a44276e5266b5250B49280b24084
16031e9795H6648b3249E3493R8485n6603B7635R7021k6104a02471B46915j02709
$$ plain form
16109 302245 220439 155154 90648 64096 420112 117309 38230 218947 -428254 -234867
16099 -234867 186484 -11537 387029 173185 -4764 48136 83818 156784 -117567 143417 128315
16088 128315 244883 343921 13950 153191 180003 -31198 -27996 213133 15343 -24074 137476
16076 232063 107601 -171284 -87028 147112 1131 -131367 42078 -52574 -40908 194413 445352
16065 445352 228540 113600 187812 -211277 214055 373930 250369 42455 147328 27406
16054 115780 213313 -329405 -169 320027 15556 446464 322893 71273 76838 -260857 -99509
16042 139462 245422 -36444 -22846 353641 168996 -144276 -55266 -25250 249280 -224084
16031 -59795 86648 -23249 53493 151978 95375 27635 124656 98552 -102471 246915 144206
16020A44206f3546C67777C5230a83008j3233B32192L566B0697K09261A1145O8320
16009G9465B5222J04734b13324A68275R5849e6965b7450A74313a77075B27743
15998B39189K2242a99586J4529F7352M6833J24072a32698A29545k6700P0898J61114
15987C34857J0439I24N12675A37377L31405l4020N3023j68651H3316H455a29543
15975D1226a8168A462J21411a68453j8637e9776I04c0213m7445F7448k8856d1694
15962I6067A8798a07961G2526K09567A1288J51558F5180b37629C02210A07039
15951I3653a9622k38704D28740A17076J0035g6420n782j26968P2212A25795c01222
15939d7984j99714h5796A05437i547q2695K4317k5106C86657C356L19701j40481
$$ plain form
16020 144206 -63546 367777 35230 -183008 -196241 232192 235758 20697 229958 11145 79465
16009 79465 25222 129956 -213324 168275 264124 -56965 -27450 174313 -177075 227743
15998 239189 261431 -199586 -185057 67352 114185 238257 -132698 129545 102845 173743 334857
15987 334857 345296 924 513599 137377 468782 434762 487785 319134 83316 8455 -129543
15975 41226 -18168 1462 122873 -168453 -187090 -59776 904 -30213 -77658 67448 38592 -41694
15962 96067 18798 -107961 72526 282093 11288 162846 65180 -237629 302210 107039
15951 93653 -19622 -258326 428740 117076 127111 -76420 -82202 -209170 -136958 125795 -301222
15939 -47984 -247698 -85796 105437 -9547 -92242 -67925 -93031 386657 3356 323057 182576
15928A82576d2868C1144P5918a52037A8882K6445d4484a8124A67471o5277b40719
15916A24178J09267i4484G5020H165d47500a27270A3127g760n2106A33910m2777
15905I1133I298J34374A6105J28653O4637c70092a08002C6290m070a33549k5721
15894a59270C03012N1013j54912d06376A52668D7207b1450q132D0856a2686A95247
15882E7589a97286c3232A5406K25631F4356a4311j90365d4716E5926a79896A65262
15870A15541n0590a6517n7861J2542B953K02006F8636N4158a08004A60317J422
15859A61739H573a233A9689a57708P7130h075A65019d0986E7814a71198l2033
15848b03231G9139e9516A95244A7360L8908K32245E6489f0226D7268b22547A3899
$$ plain form
15928 182576 -42868 31144 107062 -152037 18882 45327 -44484 -18124 167471 102194 -240719
15916 124178 233445 -94484 75020 8165 -447500 -127270 13127 -7760 -59866 133910 91133
15905 91133 9298 143672 16105 144758 209395 -370092 -108002 36290 32220 -133549 -159270
15894 -159270 303012 354025 199113 -406376 152668 47207 -21450 -29582 40856 -12686 195247
15882 57589 -197286 -33232 15406 241037 64356 -14311 -204676 -44716 55926 -179896 165262
15870 115541 64951 -16517 -74378 -61836 2953 204959 68636 122794 -108004 160317 161739
15859 161739 8573 -1233 19689 -157708 -80578 -8075 165019 -40986 57814 -171198 -203231
15848 -203231 79139 -59516 195244 17360 56268 288513 56489 -60226 47268 -222547 13899
15836G6487J76785c20646B31479e0630j5687F9343a46368n0641a2944A32558g6364
15824i9686k61427a17561A88581a17454a6648j55127A96309a33618j1411M6019
15814i9010j58271N098c9240j02725a4578j31413B62513F1299g7610o6681e3313
15802h3398j64081H1897C0916f7700m2906L6983E929K65440c6580A64508c62336
15790C355J73169J5320c48681A8418K12790h0958G2099b58882l815f4518b9902
15778d02084A01114a46957k01537B17890C4865B414a70559A66395P8027a09370
15767B86636d6668A88751a34923J7245D471K72669N8046I8591i0758A46779a36572
15755a48851B05961l6842i2838C19851I1952J39490i8409j57239A80689c6470
$$ plain form
15836 76487 253272 -320646 231479 -50630 -66317 69343 -146368 -197009 -12944 132558 -76364
15824 -99686 -361113 -117561 188581 -117454 -16648 -171775 196309 -133618 -145029 -99010
15814 -99010 -257281 -252183 -39240 -141965 -14578 -145991 262513 61299 -77610 -144291 -53313
15802 -83398 -247479 81897 30916 -67700 -110606 -73623 5929 271369 -36580 164508 -362336
15790 3355 176524 191844 -348681 18418 231208 -80958 72099 -258882 -262697 -64518 -29902
15778 -402084 101114 -146957 -348494 217890 34865 2414 -170559 166395 244422 -109370
15767 286636 -46668 188751 -134923 -117678 4471 277140 335186 98591 -90758 146779 -136572
15755 -148851 205961 169119 -92838 319851 91952 231442 -98409 -255648 180689 -36470
15744c05500J37401D8816J19321d1021H3894e843j16106C15193c68029i7316A81536
15732f1646B66740j19463b88232a13500m5677j54387C17566c82728i2614M0543
15722e2071A19797K70218j71545b34667d3342j05669C25109d05288a67928j3806
15712a81734A38400B9236a42024B66362A3636e5993E2045K36389a69718o6467
15702b36185B57005R0059b78867a05390p0059A06139e5366R821H4097E127c638
15690B9958h7961L4085l0156o296r7469A76998g5100L0616l40661J15303j56035
15679d25877a18291D2393a41795L3089A3139J51141G8898a213l9187E4542K05264
15668B59806A6233a00847a4719A314e5053j29314a5644j30852K2015N0045r2439
$$ plain form
15744 -305500 -168099 48816 168137 -41021 83894 -5843 -121949 315193 -368029 -97316 181536
15732 -61646 266740 147277 -288232 -113500 -159177 -313564 317566 -382728 -92614 -52071
15722 -52071 119797 390015 218470 -234667 -43342 -149011 325109 -405288 -167928 -181734
15712 -181734 138400 29236 -142024 266362 13636 -55993 52045 288434 -169718 -236185
15702 -236185 257005 347064 -278867 -105390 -175449 106139 -55366 -45545 84097 5127 -3638
15690 29958 -87961 -53876 -84032 -90328 -187797 176998 -75100 -44484 -385145 -269842 -425877
15679 -425877 -118291 42393 -141795 -108706 13139 164280 78898 -1213 -40400 54542 259806
15668 259806 16233 -100847 -14719 1314 -55053 -184367 -15644 -146496 -124481 -74436 -166875
15657a66875d1171j14208k8754D9804e0882k59652A09072b89000A98515a05175
15646B66936A19020a93296n7045l4523D0001J18315G0041h2203A01316b61089
15635b65407J2648a00716c5866B13206I9352f2501A25284A035b77861f3388A22521
15623D9970A1416b00686n400C69158I1334l5454b90819n2210a22139A27793B1099
15611E6125P2139R4363a82469j42816i6919M2247A11993D545Q879g8526o044j58516
15599b43086i2041B18592a54657B10677c7460A20613N8378F382b21110A74072
15588H4937h1472C877O1160f8437A11545k8488J25664b08288b087n393A50035
15576A28629e326l2145C04157a78391J0933c8387B70813q0170a89902B35694c4430
$$ plain form
15657 -166875 -41171 -155379 -184133 49804 -50882 -310534 109072 -289000 198515 -105175
15646 266936 119020 -193296 -250341 -284864 40001 158316 70041 -82203 101316 -261089
15635 -265407 -252759 -100716 -35866 213206 99352 -62501 125284 1035 -277861 -63388 122521
15623 49970 11416 -200686 -206086 369158 91334 55880 -290819 -343029 -122139 127793 21099
15611 56125 128264 222627 -182469 -325285 -96919 -54672 111993 4545 13424 -78526 -84570 -243086
15599 -243086 -92041 218592 -154657 210677 -37460 120613 178991 6382 -221110 174072
15588 84937 -81472 3877 65037 -68437 111545 83057 208721 -208288 -2087 -7480 150035
15576 128629 -5326 -37471 304157 -178391 -167458 -38387 270813 190643 -189902 235694 -34430
15564b12300Q0712d4967o8892C55586b69373A16701e5996A886Q7904N3103J69045
15553C11938b38599Q9487a410k312C3675J70582n6161k9268a3030j24515D1758
15541B53160j25779b4983C6585e9744a6285j11641e2847k5014a7422j57970B40009
15529A98857G0691a66598j91904A73527a55531M9664A07708b56050A87770b62108
15518d9806K4841B59453l551A20873P2813N1514A22468a26620B46426A6742a10068
15506a9570j86707B58195D7439J8359a13827A33399J43299a25949C5252L03437
15496C38689b0600j83059Q4424l5441O4287B06207C7032Q1498K48434b9720B6136
15484A45122C4184J01463a56223b1372B63648B5039J41718o5026O1835R732G5404
$$ plain form
15564 -212300 -131588 -44967 -113859 355586 -269373 116701 -55996 1886 89790 142893 311938
15553 311938 -238599 -149112 -1410 -3722 33675 204257 148096 118828 -13030 -137545 41758
15541 253160 127381 -24983 36585 -59744 -16285 -127926 -52847 -77861 -17422 -175392 240009
15529 198857 70691 -166598 -358502 173527 -155531 -105867 107708 -256050 187770 -262108
15518 -49806 -24965 259453 255902 120873 193686 245200 122468 -126620 246426 16742 -110068
15506 -19570 -206277 258195 47439 65798 -113827 133399 276698 -125949 35252 338689
15496 338689 -20600 -203659 -119235 -154676 -90389 206207 37032 118530 366964 -29720 26136
15484 145122 34184 135647 -156223 -21372 263648 25039 166757 101731 163566 173298 75404
15472B58173J02318A73972o5033l89a83558n0020a08252M6867B44579e9745q204
15461f7949A05695J96685I2427A7723L00582l0073b08377B46832f5244p3454a9088
15449a76560B6068K07125b95490b8400k9005E6699K5128l7939J23506K02855J52338
15438E22587k33084A38528J18485j14472K8140f3119B6506a43934f5311o3681
15428a28992A8218a36330M737q1952d8523A39571a6577o3846G6794N9834Q1723
15417B18351o6057E3851J19646C7768a35435A00511K26050i6356a0469j99624
15407b10093G7958B1737a09761C7860e2999G9925a96839B10321r5719C2807J0845
15396D3652J92893c27236A67736b20786j7847N6184C6928a45730j01814B96143
$$ plain form
15472 258173 360491 173972 108939 108550 -183558 -233578 -108252 -61385 244579 -59745 -67949
15461 -67949 105695 302380 92427 17723 318305 288232 -208377 246832 -65244 -138698 -19088
15449 -176560 26068 233193 -295490 -28400 -57405 56699 81827 43888 167394 370249 522587
15438 522587 289503 138528 257013 142541 170681 -63119 26506 -143934 -65311 -128992
15428 -128992 18218 -136330 -131593 -213545 -48523 139571 -16577 -80423 76794 136628 218351
15417 218351 152294 53851 173497 37768 -135435 100511 326561 -96356 -10469 -210093
15407 -210093 77958 21737 -109761 37860 -52999 79925 -196839 210321 114602 32807 43652
15396 43652 236545 -327236 167736 -220786 -238633 -182449 36928 -145730 -247544 296143
15385b69860E5671c9643m2729H7988M7769F0791R0095A2935J77659i3356o1039
15374a54395j57431C39586l1062J3920D2802K32404F3894a32466A35592K9375
15364A64967R9583a67938g9775k4841A82359M5899E4456J70746q9294L3054C3178
15352A16048N482a93451B92602p9401I9034L4315a065B11400j02188i8919E2753
15340a55179b4395H6084m2996J25963j0837B2384K26497a13613n5296B95064J55121
15329D50185h110k77731a28699B01662F9513h6073m8404F9597P8591o4763a6884
15317B55277N2538H545f6795A67260b53481A57738l7232G700J52117h6415A34071
15305B12897L6756j06032o7752J49184F9635a89937e6684g680A39655G011i3905
$$ plain form
15385 -269860 55671 -39643 -82372 87988 135757 60791 150886 12935 190594 -93356 -154395
15374 -154395 -311826 339586 308524 322444 42802 275206 63894 -132466 135592 164967
15364 164967 264550 -167938 -79775 -104616 182359 228258 54456 225202 135908 168962 33178
15352 116048 121530 -193451 292602 213201 99034 133349 -1065 211400 109212 -98919 52753
15340 -155179 -24395 86084 43088 169051 158214 22384 248881 -113613 -168909 295064 450185
15329 450185 -8110 -285841 -128699 201662 69513 -86073 -134477 69597 148188 83425 -16884
15317 255277 307815 8545 -66795 167260 -253481 157738 120506 7700 159817 -86415 134071
15305 212897 249653 143621 75869 225053 69635 -189937 -56684 -7680 139655 7011 -93905
15293F9882b87503d1175E01156B40572c67536A18418R704a1033B66048E6847A3411
15281a47826I5575g2492k67259h0774I4222R1141H2220K54580a74A90256f0830
15269b4716j95178A08038i7997B92490e4691j19441d762k26823E381P2614P4159
15258A52154o6669c3563A72465m4525a80934c7309C03915E5903R399K88184O88076
15247A041562L64059k94857L86655m67647A28202J90066q8504E5817K2061k9338
15237D8540J33856a7503B395a27394C97166F6854J90330g4561j84041D68179e0105
15225A98068r363d9888A7800J89550H5170L3437a59673g1453A83257M0151n1082
15214A72326c2583G8771R2527j9M2953C8019J27511a23386A27901L5973h1563
$$ plain form
15293 69882 -287503 -41175 501156 240572 -367536 118418 128122 -11033 266048 56847 13411
15281 -147826 95575 -72492 -339751 -80774 94222 185363 82220 336800 -174 190256 -60830
15269 -24716 -219894 108038 -97997 292490 -54691 -174132 -4762 -231585 5381 77995 152154
15258 152154 85485 -33563 172465 127940 -180934 -37309 303915 55903 65302 353486 1041562
15247 1041562 1405621 1110764 1497419 1029772 128202 318268 229764 55817 77878 48540
15237 48540 182396 -17503 2395 -127394 397166 66854 257184 -74561 -258602 468179 -50105
15225 198068 188705 -49888 17800 207350 85170 118607 -159673 -71453 183257 223408 172326
15214 172326 -32583 78771 171298 171279 214232 38019 165530 -123386 127901 163874 -81563
15202B41237q6920d3104F5765K04399j18260a92287g0882B1077K63732a30593
15191C4989L827J05373K43075j37559E5232L2833a14072A32692i6292D48821A33757
15179d0785A526a04114d2090p7816A5057h1684n7261b0505m4906H075b48742A4381
15166B23594Q2674b51962G1901J81699a7866A32570N8630N295a60225C3497C171
15154a70386j25658A19740B377c03084f3393A33078c60935O1883B21104k5102
15144A96002a29345F37743d2524m0500C36654A41508J76047j57441F7833J45651
15134B13484H3841o011C8393J77494l5701K0995K26417k0295j35638o9651n9951
15123A42063a26111A25683n2334o524J07187B517J76821C6560L06437O8607J28028
$$ plain form
15202 241237 154317 -43104 65765 270164 151904 -192287 -70882 21077 284809 -130593
15191 34989 38816 144189 387264 249705 55232 88065 -114072 132692 -96292 448821 133757
15179 -40785 1526 -104114 -42090 -119906 15057 -81684 -138945 -20505 -65411 8075 -248742 14381
15166 223594 306268 -251962 71901 253600 -17866 132570 191200 196495 -160225 33497 3171
15154 -170386 -296044 119740 2377 -303084 -63393 133078 -360935 -299052 221104 196002
15144 196002 -129345 637743 -42524 -83024 336654 141508 317555 160114 67833 213484
15134 213484 83841 77830 38393 215887 180186 201181 427598 407303 271665 202014 142063
15123 142063 -126111 125683 73349 66825 174012 2517 179338 36560 342997 411604 539632
15112E39632H1549b3060B84117E8892J71168G5733A5407K30075k3547D9209L00447
15101C49656A19073A3352f2544A78310B2111a4814A58688J02720Q4635A08751
15090a70269e789A59007d2928A68199H1980Q1552j4654J4760B7367c0701A68729
15078E6812J91434J03906A69170J53516G8366K873J90431L4844m527F9363b2154
15066D77612j00762a82720C52635c8715j02617B46925O674I2353L23671j09961
15056C06063M670F0947L81502A91527F5910K53850J45135j4448j78607J22562
15046C94402K7377B1161L22513j65609G435a9189A69301J26755A9466N60948A88892
15034B30188N2597J08894e9425A7341L60774j85801K50657B11210K25802j43642
$$ plain form
15112 539632 81549 -23060 284117 58892 230060 75733 15407 245482 221935 49209 349656
15101 349656 119073 13352 -62544 178310 22111 -14814 158688 261408 346043 108751
15090 -170269 -5789 159007 -42928 168199 81980 163532 148878 163638 27367 -30701 168729
15078 56812 248246 352152 169170 322686 78366 81239 271670 306514 301987 69363 -22154
15066 477612 376850 -182720 352635 -38715 -141332 246925 253599 92353 416024 306063
15056 306063 310733 60947 442449 191527 65910 319760 464895 450447 271840 394402
15046 394402 421779 21161 343674 178065 7435 -19189 169301 296056 19466 580414 188892
15034 230188 282785 391679 -59425 17341 378115 192314 442971 211210 437012 293370
15024B93370q1985L52876B8174L55405J43464A13470K72318O7608j34885A29018
15013A89716K88489j39029j29726a9265A19408m973K40636p7787k5396J3320n9394
15002B05814K22988J6270j02146J7884A13147K45651K39746k89431K13828A06521
14991C02014J01939j40316L3674m9156H0228P1398r372l3170J81985A3800J23385
14980A37185K59432A29680K89827K28203B16863O9371J15103J0171o2359A63737
14969B31523J5507R2913A37196J63191P2279c7185F06646G4265M90675A9653J18584
14958A38237L03699k9249R363j80915L58275j85652J66646A70653R2165K02518
14948D65336B22381J35499K98506B95548r4442K79921h9160B58245K03926N577
$$ plain form
15024 293370 211385 564261 28174 383579 527043 113470 385788 453396 318511 129018
15013 189716 478205 339176 209450 -19265 119408 114435 355071 277284 251888 265208 205814
15002 205814 428802 445072 342926 360810 113147 358798 598544 309113 522941 106521
14991 302014 403953 263637 297311 248155 80228 151626 142254 109084 291069 13800 137185
14980 137185 396617 129680 419507 647710 216863 286234 401337 411508 349149 163737
14969 231523 247030 339943 137196 300387 372666 -37185 606646 74265 564940 19653 138237
14958 138237 441936 412687 422050 241135 599410 413758 580404 170653 262818 465336
14948 465336 222381 357880 656386 295548 201106 481027 -89160 258245 462171 467748
14938D67748j32439N4839K46787A18845J02752K71964B09922o0237M31616m640
14928E76661j08002K05506j11084j25816L05822k6865K78564m7232l55849J65844
14918G57549q7590m8771K38840m0699J92860D67043J35705J86959L48611E64755
14907E33284A67588R2461j05219J17087J42815m0597o6946J41036J95140k40152
14897D03213n0435I5618A0791M62930j44242P9677j79447J56372J32347k36132
14887B82296j8099J80066p1242Q2053N6007B41530M02718j12030j50327j26383
14877B55508J66900j2437K4678D0918M00975J55843k19446L73093B06409L16486
14867E22895r323l701K6033j57961j17127K55898L0177j01877j83963M17280k65789
$$ plain form
14938 467748 335309 390148 636935 118845 221597 493561 209922 149685 581301 576661
14928 576661 468659 674165 563081 437265 743087 716222 994786 947554 591705 757549
14918 757549 669959 621188 860028 819329 1012189 467043 602748 789707 1138318 564755
14907 533284 167588 260049 154830 271917 414732 374135 307189 448225 643365 403213
14897 403213 352778 95618 10791 473721 329479 409156 229709 386081 518428 282296
14887 282296 264197 444263 373021 455074 511081 241530 644248 532218 381891 255508
14877 255508 422408 409971 434649 40918 441893 597736 378290 751383 206409 522895
14867 522895 513572 509871 535904 377943 260816 516714 546891 445014 261051 678331 412542
14856D12542n4774J27435L12571j59104N9437k03268k15325M28244j72039L0295
14846E66014q3175n4746L92054C01963J13670J13977K67659l70148q7202J62983
14836E02902J45821B77044M92293K76807l2303l31992l14052J30279O1054q0422
14826D78708K5390l4553L30204C35798n1260N29573C50434j39032L48102K7690
14816E87194l7749j10842J75477J05206k80195B01007O50281j42808j91409j75915
14806C41156N098M89240C74641K62317j86275L03253l04883M28943O53k29722
14796F48927k03040J1504K24365q7728l3790K72782l01569k36491K06834J68684
14786F70478j23457k04106J22836o464K45466j35672M9828l8095p8455k09746
$$ plain form
14856 412542 357768 485203 797774 638670 698107 494839 279514 707758 535719 566014
14846 566014 482839 428093 820147 301963 415633 529610 797269 427121 339919 502902
14836 502902 648723 277044 769337 1046144 1013841 681849 367797 498076 559130 478708
14826 478708 504098 469545 799749 335798 284538 814111 350434 211402 559504 587194
14816 587194 549445 438603 614080 719286 439091 201007 851288 708480 517071 341156
14806 341156 346254 835494 374641 636958 450683 753936 449053 877996 878649 648927
14796 648927 445887 457391 681756 594028 560238 833020 531451 294960 501794 670478
14786 670478 547021 342915 465751 459287 704753 569081 618909 580814 502359 292613
14776B92613K21694m1282J71571o9263k06953J31934K40830j35784m6364J00977
14766F59973o2126m312B71472P0408L09054J47818k18938Q6558K05221k29531
14756F42062J36348O1984Q719C65745M60746M4533C93673L43910K57264l00059
14746F94788K28043l65012K67696J3754K01856l17366l0590j19574M75346K5715
14736A074656D74937L21948n4555j89374M09662q4962k11705o7775J85608K35856
14726A019640m00082J29862Q0974J39300k19282N17152p3065l36460P6784J23196
14716A058019N09l22056J9893J73600k38915L79368l22777j4864n9162J77582
14706H51197O0453m5931p512O0476k44026J82789J74708J68225m99679J03248
$$ plain form
14776 292613 514307 473025 644596 575333 368380 500314 741144 605360 558996 659973
14766 659973 597847 593535 271472 341880 650934 798752 579814 666372 871593 642062
14756 642062 778410 840394 849113 365745 826491 871024 393673 737583 994847 694788
14746 694788 922831 557819 825515 839269 1041125 723759 693169 573595 1048941 1074656
14736 1074656 474937 796885 742330 552956 962618 877656 665951 598176 783784 1019640
14726 1019640 619558 749420 830394 969694 750412 1267564 1194499 858039 934823 1058019
14716 1058019 1058528 736472 756365 929965 691050 1070418 747641 732777 673615 851197
14706 851197 911650 865719 858207 918683 674657 857446 1032154 1200379 700700 803948
14696H03948L92849j45559J21336r3975K00654k85177R5463j33318q6128J43985
14686A014078j87622J18464j89338J22528Q2075p6801J71873j37690o1259K86976
14676A143284p8543J09558k00378J08412k09417J4528K56717k43697J28697j72098
14666H57063j11167L07345J40783j88089j869l1037j35761N13087l21889L73283
14656A401749o04941K98157J5278J23697K07135l63165M25008j96449k9292l83818
14646H93359M1679K37231J97325r8074l61960L44540k76484L22496Q3668k15688
14636A168092J65466j39972Q9088q0347J17512l4497L6131j14767R0005J49626
14626A446337j34580R8786j73554N493O6138k0725q0159J86909K11883l9333m86807
$$ plain form
14696 803948 1196797 1051238 1172574 1078599 1279253 994076 1089539 956221 870093 1014078
14686 1014078 826456 944920 755582 878110 960185 883384 1055257 917567 856308 1143284
14676 1143284 1064741 1174299 973921 1082333 872916 887444 1144161 900464 1029161 857063
14666 857063 745896 1053241 1194024 1005935 1004066 973029 837268 1350355 1028466 1401749
14656 1401749 796808 1094965 1110243 1233940 1441075 1077910 1502918 1306469 1277177 893359
14646 893359 935038 1172269 1369594 1271520 909560 1254100 977616 1300112 1383780 1168092
14636 1168092 1333558 1193586 1282674 1202327 1319839 1285342 1321473 1206706 1296711 1446337
14626 1446337 1311757 1410543 1236989 1242482 1308620 1287895 1207736 1394645 1606528 1567195 1080388
14615A080388o7454K55015j04360J77294k24264M01054K66296k84667L58082n32537
14605A324847m2975L59608K01263k8842m60107J04389l6805j2876K09036k77508
14595A340030K68290k28079M08222l6778j39951K78490j64161J5996m0092J6308
14585A718275J14228l28227K45587K41670j90300j83057l2013K34896r2354N30342
14575B259047n44320K56526L5183J73938k84193K26294j0997l24721M45815j66317
14565B066255K53553J07483j57417K30088l83818N07389n9269p440j5791N35637
14555C076670J84376P6160M64269J98858R93117J596868L219611M992015R847974
14546B4649918J1627768p258340j1686407q157991m050740j420579j195260l25928
$$ plain form
14615 1080388 1012934 1267949 1163589 1340883 1116619 1517673 1783969 1499302 1857384 1324847
14605 1324847 1281872 1641480 1842743 1813901 1353794 1458183 1421378 1408502 1617538 1340030
14595 1340030 1608320 1380241 1788463 1751685 1611734 1890224 1726063 1742059 1701967 1718275
14585 1718275 1832503 1504276 1749863 1991533 1801233 1618176 1586163 1821059 1728705 2259047
14575 2259047 1714727 1971253 2006436 2180374 1896181 2122475 2111478 1786757 2232572 2066255
14565 2066255 2319808 2427291 2269874 2499962 2116144 2623533 2564264 2556824 2541033 3076670
14555 3076670 3261046 3337206 3801475 4000333 4993450 6590318 9809929 14801944 24649918
14546 24649918 36277686 29019346 17332939 9174948 5124208 3703629 2508369 2182441
14538B182441R5508N1992k53192R2741j93711q9518J09040n29200O91835k32340
14528A925596K18580J01293L3621k42611M96368m24950o5227K06239M0572M0533
14518B330014J50286m2422n6961K60378l10261L72945m20508K06759M22217j63866
14508B748581j63416N8274r4805m57312M85941M93826j65994J07204k76118K82450
14498C018631P2548K2360j66540J52874J00236K8165k00282j21925L08398k97238
14488B917227J96627M04607j78414L19627j57135M5237M6757j92614K42369j33887
14478C510401K55707j92044K49224j26567Q3786l1209J42364j25180L11609O5380
14468D143471m90820O51757O1087L0219k98265M1229L29759J3651K58869K8864
$$ plain form
14538 2182441 2277949 2329941 2076749 2169490 1975779 1886261 1995301 1466101 2157936 1925596
14528 1925596 2144176 2245469 2279090 2036479 2532847 2107897 2042670 2248909 2289481 2330014
14518 2330014 2480300 2437878 2380917 2641295 2331034 2703979 2283471 2490230 2912447 2748581
14508 2748581 2585165 2643439 2548634 2091322 2577263 3071089 2905095 3012299 2736181 3018631
14498 3018631 3091179 3113539 2946999 3099873 3200109 3228274 3027992 2906067 3214465 2917227
14488 2917227 3113854 3518461 3340047 3659674 3502539 3547776 3594533 3401919 3644288 3510401
14478 3510401 3766108 3574064 3823288 3696721 3780507 3749298 3891662 3766482 4078091 4143471
14468 4143471 3652651 4304408 4365495 4395714 4097449 4138678 4468437 4482088 4740957 4769821
14458D769821J20327n2592j13810J88879l09646j56157K99901L09751L61326l24769
14448E093031k32748O28091m42210K75295J42413J69198j93680L69304k5398L82045
14438F165341r2190N0578r071Q4878M44165m26359J83004J13332K3282j92520
14428F344440O94819k81974K28674p1953K6006j2951M92584J08458j26035N8035
14418G460103O6670L67429j77343P01788k5354J96014j21222o7890M73603k91562
14408H582236K46356J52427K22255N1052M05261K7757o2587M83445R5774N12081
14398A0716057o6663J8750J07116R0863L71696J71854K00892K65878j53067K84926
14388A2008302M64366j40502N33905p8305J04807L96690L67348N64877J7883J98598
$$ plain form
14458 4769821 4890148 4837556 4723746 4912625 4602979 4446822 4746723 5056474 5417800 5093031
14448 5093031 4860283 5488374 5046164 5321459 5463872 5633070 5439390 5808694 5783296 6165341
14438 6165341 6073151 6123729 6114658 6199536 6643701 6217342 6400346 6513678 6536960 6344440
14428 6344440 7039259 6757285 6985959 6914006 6940012 6927061 7419645 7528103 7402068 7460103
14418 7460103 7526773 7894202 7716859 8418647 8393293 8589307 8468085 8400195 8873798 8582236
14408 8582236 8828592 8981019 9203274 9254326 9659587 9687344 9624757 10108202 10203976 10716057
14398 10716057 10649394 10668144 10775260 10866123 11237819 11409673 11610565 11876443 11723376 12008302
14388 12008302 12472668 12332166 12866071 12787766 12892573 13289263 13656611 14221488 14239371 14437969
14378A4437969J40519K75698O29108j9607L97750N27389K15251O9845L52921K35642
14368A7262485N75431J19854L25785M25780Q95267K1548Q10931J34541N55069
14359B1126691J79378O80524M35953N67280M16073Q28934J40394N49364N78637
14350B5503228R07609O62041M59566O97064J058996N62528P07342R04777J014830
14341C2477981O91652R82559J125302Q17242Q48316J244069J345320P70607J308670
14332D1611718J513115J169720J163488J842377J193042J873354J404223J968773
14324E3739810J598507K043782K043424K488798K178677K105931K430037K456757
14316G1085723K627923L015753K894835L461012L289584L288169M390430L941153
$$ plain form
14378 14437969 14578488 14854186 15483294 15463687 15861437 16388826 16604077 16673922 17026843 17262485
14368 17262485 17837916 17957770 18283555 18709335 19604602 19626150 20437081 20571622 21126691
14359 21126691 21306069 21986593 22422546 22989826 23405899 24234833 24375227 24924591 25503228
14350 25503228 26410837 27072878 27532444 28229508 29288504 29851032 30558374 31463151 32477981
14341 32477981 33169633 34152192 35277494 36094736 36943052 38187121 39532441 40303048 41611718
14332 41611718 43124833 44294553 45458041 47300418 48493460 50366814 51771037 53739810
14324 53739810 55338317 57382099 59425523 61914321 64092998 66198929 68628966 71085723
14316 71085723 73713646 76729399 79624234 83085246 86374830 89662999 94053429 97994582
14308I7994582M069385M431073N116458M990656N453081N908581O214548O465683
14300A40644047O665704P516486P777564Q005229R019158R207640R920062J0886060
14292B09641950J0755683J1834573J2197785J3199370J3098336J4046315J4356656
14285B99130668J4728139J5151223J5492751J5007410J4918014J4383606J3558182
14278D02369993J2708349J1280400R031763P154485L592077l87069j674645j857734
14270D42217619l020206m853416n605524q170665q982024j0423814j1672872j2652731
14262C76836367j3662164j4876966j4959797j5005385j5366066j4746560j4888976
14255B73330453j3224731j2362708j2504877j2110513j1433207j0853820r890875
$$ plain form
14308 97994582 102063967 106495040 111611498 116602154 122055235 127963816 134178364 140644047
14300 140644047 147309751 154826237 162603801 170609030 179628188 188835828 198755890 209641950
14292 209641950 220397633 232232206 244429991 257629361 270727697 284774012 299130668
14285 299130668 313858807 329010030 344502781 359510191 374428205 388811811 402369993
14278 402369993 415078342 426358742 435390505 442544990 446137067 445749998 444075353 442217619
14270 442217619 439197413 434343997 428738473 420567808 411585784 401161970 389489098 376836367
14262 376836367 363174203 348297237 333337440 318332055 302965989 288219429 273330453
14255 273330453 260105722 247743014 235238137 223127624 211694417 200840597 190949722
14248A90949722r649649r164497q332581p995055p120680o994850o953496o150130
14240A28588784n847260n161436m988035n101319m738389m359524m001560m053063
14232I0338198l530240l126566l508911k872981l324096k616059k597917k526389
14224F6235039k859124j939000k202656j791771k029500k237272j447307j685275
14216E0043134j664147j656617j230604j405480j453548j063200j541855q83480
14208C9144203p05536j103039j461730j078428p51854j028659p74649p52273p13475
14199C0774560j078544p53492p96464o87322o86706m82994p40082p69283m76020
14190B4303653n45391o54331p30313n87279j65856m88766o43962r0014q04511
$$ plain form
14248 190949722 181300073 172135576 163802995 155807940 148687260 141692410 134738914 128588784
14240 128588784 122741524 117580088 112592053 107490734 102752345 98392821 94391261 90338198
14232 90338198 86807958 83681392 80172481 77299500 73975404 71359345 68761428 66235039
14224 66235039 63375915 61436915 59234259 57442488 55412988 53175716 51728409 50043134
14216 50043134 48378987 46722370 45491766 44086286 42632738 41569538 40027683 39144203
14208 39144203 38438667 37335628 35873898 34795470 34043616 33014957 32240308 31488035 30774560
14199 30774560 29696016 28942524 28146060 27458738 26772032 26289038 25548956 24779673 24303653
14190 24303653 23758262 23103931 22373618 21786339 21620483 21131717 20487755 20397741 19593230
14181A9593230l04356j05062o73179M8524o67704m66485o96116k7281k90552l10566
14171A6100453n26687k03048k68665m40315Q241m56559j39074o54197q6357j55395
14161A3178397k69220o9731l16182p6623m37315m9360j72913j65571n7116k87169
14151A1277197m70847l6669r5887r8776m56141k58986J45154l96518p8244n49934
14141H980349N07695l27313j50831k99980J57139K59358o97027j45147R2991L3756
14131H410990k59460l76451Q4079l73342L82541k21657p0912r4682k21291k21433
14121G038382J03608j95958J60791j95790j67803j38925r7655R1189n41199J993
14111F058633K34407j95p9026n30959O3901k23831K86789n8460n41351M10357
$$ plain form
14181 19593230 19288874 19183812 18510633 18559157 17891453 17424968 16728852 16701571 16411019 16100453
14171 16100453 15573766 15370718 15102053 14661738 14669979 14213420 14074346 13420149 13333792 13178397
14161 13178397 12909177 12839446 12523264 12446641 12009326 11959966 11787053 11621482 11564366 11277197
14151 11277197 10806350 10769681 10673794 10575018 10118877 9859891 10005045 9608527 9530283 8980349
14141 8980349 9488044 9160731 9009900 8709920 8867059 9126417 8429390 8284243 8377234 8410990
14131 8410990 8151530 7775079 7859158 7485816 7868357 7646700 7575788 7481106 7259815 7038382
14121 7038382 7141990 6946032 7106823 6911033 6743230 6604305 6506650 6597839 6056640 6058633
14111 6058633 6293040 6292845 6213819 5682860 5746761 5522930 5809719 5751259 5209908 5620265
14101E620265j04685j31598j22282n6833J47410J165l77203L78024j55279k09328
14091D989656j97024j85931K04312k81086J73621Q542o5513k89199J8421l5874
14081D339925L7743k4469j42282N4576M2389j77470p8485K20663j46672j51696
14071C974222J11564k25838r4151P7627j16499K32515o6006l01544K74358n42826
14061C323422K46308j63451J26459l33496r77L31315k17290l8283o6077N773M51660
14050C665363k56429j27800r4455J40496j62629n54555P06422k44750j54844K43241
14040C160060k01628O2399j81046j71985K47459j91245O2809O9353J57575o6675
14030B947076l47213L11361j82056j63361m4707j26093j30731Q1317J03412K09531
$$ plain form
14101 5620265 5515580 5383982 5261700 5204867 5352277 5353442 4976239 5354263 5198984 4989656
14091 4989656 4792632 4606701 4811013 4529927 4703548 4712090 4646577 4357378 4375799 4339925
14081 4339925 4377668 4353199 4210917 4265493 4307882 4130412 4051927 4272590 4125918 3974222
14071 3974222 4085786 3859948 3765797 3843424 3726925 3959440 3893434 3591890 3866248 3323422
14061 3323422 3569730 3406279 3532738 3199242 3198265 3529580 3312290 3274007 3207930 3213703 3665363
14050 3665363 3408934 3281134 3186679 3327175 3164546 2609991 3316413 3071663 2916819 3160060
14040 3160060 2958432 3020831 2839785 2667800 2915259 2724014 2786823 2856176 3013751 2947076
14030 2947076 2599863 2911224 2729168 2565807 2521100 2395007 2264276 2345593 2449005 2658536
14020B658536j81956l24122K02305k81550O9566q9979L22830l41190k1871j25205
14010A887364J75133R4079r7607K996R8519J9388m65934M67490l27770J31824
14000A985482L20984j90031L940l33203R8031m3223J17450J64721L5994M07185
13990B567330R01407J978225L709713Q861166J4048279n38485j1992594p730414
13982A1804627m183068j655212j281180o42634n31127n82848J78468l66088J4404
13973B755342k72666N2478k60539p1138l40628M20735k21545M4908j525j32257
13963A973165k31126L85980m12433m3741K85423Q4587k85040J29564o176l1490
13953A848713k68628K42940j30740J37661k39496J32386n4491l5832m3819Q131
$$ plain form
14020 2658536 2476580 2152458 2354763 2073213 2142779 2052800 2375630 2034440 2012569 1887364
14010 1887364 2062497 2156576 2058969 2061965 2160484 2179872 1713938 2181428 1853658 1985482
14000 1985482 2306466 2116435 2120375 1787172 1885203 1841980 1959430 2124151 2160145 2567330
13990 2567330 3468737 5446962 9156675 18017841 32066120 31527635 19535041 11804627
13982 11804627 7621559 5966347 4685167 4042533 3511406 2928558 3107026 2740938 2755342
13973 2755342 2482676 2535154 2274615 2203477 1862849 2283584 2062039 2106947 2105422 1973165
13963 1973165 1742039 2128019 1715586 1671845 1957268 2041855 1756815 1886379 1880203 1848713
13953 1848713 1580085 1823025 1692285 1829946 1590450 1722836 1668345 1632513 1588694 1596825
13943A596825o5731k73933N59879l83446J21674j78781J55444j67852J9269j18944
13933A264404k933M68138N780n46364K67843l84905p5900N74323q354P7922k49250
13922A390704j09678J56338J33503j63979m2796Q0915k05835N6916J8240j58985
13912A155343l91879J13091N77867l44265J67149j11208K20691J81950m20143
13903A148596j34888J45813M9859j76333O868L33838m27405J85498L4244m32765
13893G33325N18831j19967P9755j48868M0647K0621k10641o2115O2002L62477
13883A276067k46020p5553j9767N7431k37968J56058l5725j0269l4002J71488
13873A001740K73509k919m95962Q3725K45352j75290k62838K66939J76850J08863
$$ plain form
13943 1596825 1531094 1257161 1817040 1433594 1555268 1376487 1531931 1364079 1383348 1264404
13933 1264404 1261471 1729609 1735389 1189025 1456868 1071963 996063 1570386 1562032 1639954 1390704
13922 1390704 1281026 1437364 1570867 1406888 1364092 1445007 1239172 1296088 1314328 1155343
13912 1155343 763464 876555 1454422 1110157 1277306 1166098 1386789 1568739 1148596
13903 1148596 1013708 1159521 1209380 1033047 1039915 1373753 946348 1131846 1166090 733325
13893 733325 1252156 1132189 1211944 1063076 1103723 1124344 913703 851588 913590 1276067
13883 1276067 1030047 954494 934727 992158 754190 910248 874523 864254 830252 1001740
13873 1001740 1275249 1272330 776368 860093 1105445 930155 667317 934256 1111106 1219969
13863A219969k16794q8487L9094K004k20277J31754j3968j73295m2796L12735
13853I49939l01858J45111Q0933q1824j4585k51022L49425L8669j78477n3615
13843F82696K69386k34350n1978m9942K92665k74977j66726K06958K8779J35445
13833H37956j87719j9733L4379p10L31573k71853J51306m7649o3031j21332R0251
13822G33438J63735N2422D32592J08436m1636K34957R3127N4660k70510K60070
13812H71696j45438J43796j78929p433m029k65175J51651J14944L6910P5931C84879
13800E21839l6434L18822j3976j51066j06193R6135J88913j78374N7653K67461
13790I64780l25308O028j06462J65538K37708r5431k60743R8682J05091l44247
$$ plain form
13863 1219969 1003175 914688 953782 955786 735509 867263 853295 680000 637204 949939
13853 949939 648081 793192 874125 792301 777716 526694 876119 914788 736311 682696
13843 682696 952082 717732 665754 615812 908477 633500 466774 673732 702511 837956
13833 837956 650237 630504 664883 664173 995746 723893 875199 827550 764519 643187 733438
13822 733438 897173 949595 432592 541028 499392 734349 827476 882136 611626 871696
13812 871696 726258 870054 691125 683692 679663 414488 566139 681083 717993 793924 384879
13800 521839 485405 804227 790251 639185 532992 629127 818040 639666 697319 964780
13790 964780 639472 645500 539038 704576 942284 846853 586110 684792 789883 445636
13780D45636M21921p4639B70381J67320L55383l62659J49064r1101N0446R5438
13770F34272k3392j31452L1090J872J21915j01939M2445j8310J04250J85094k15646
13759F30199k58207l0426M59396C43317M0737M12920Q5062C98948L75634l45160
13749D29422l0571K15106k69350K70184l5125j29593J29356K74621C68980P4790
13739D43770r6667K96729k88451M11716k83979k3689K59077j03755j25911j00006
13729C88834O5661M3568J7140q5444J08279k68826K06260j23907L89350C09284
13718C21826L42833k88224p3853J04465R1848j41984k6911J40007J23468L3068
13708F26543j92434j63207K15415J12425k71408l4858j01199K87661A64531L21799
$$ plain form
13780 445636 867557 792918 270381 437701 793084 430425 579489 488388 538834 634272
13770 634272 610880 479428 510518 512390 634305 532366 574811 556501 660751 845845 630199
13759 630199 371992 341566 800962 343317 384054 796974 882036 398948 774582 429422
13749 429422 398851 613957 344607 614791 579666 450073 579429 854050 368980 443770
13739 443770 347103 643832 355381 767097 483118 459429 718506 614751 488840 388834
13729 388834 454495 498063 515203 429759 538038 269212 475472 351565 740915 309284
13718 321826 664659 376435 302582 407047 498895 356911 330000 470007 593475 626543
13708 626543 434109 270902 486317 598742 327334 292476 191277 478938 164531 486330
13698D86330O8487j9890k64367J72541O3430A11457K70374o2457J82107J5639
13688E17120J9835j22906J95144k15590N2217J54317k43280j41748K91669r4481
13678D12297F1910O63940C31292M24777l58987k0870M4690O1799n4006j09722
13668C18973p879q2019Q4523K73844l4753k51823j11376K81806l5416K00027B20155
13656A34149J11661L19839j00363j52137K47259k64607j0764K74211k20439j44897
13646A93912A1032J81872K15518L45934B95997j5095j4207L0791P2665P5831j96543
13635B49439A22659K19910I3767L72039K55823A80122h240B17090J97873j64562
13625B50401b38328B64079J7186A28216l2440M53056A82533p7961K81788n2465
$$ plain form
13698 486330 554817 534927 270560 443101 506531 111457 381831 319374 501481 517120
13688 517120 536955 414049 609193 393603 445820 600137 356857 215109 506778 412297
13678 412297 61910 725850 331292 756069 397082 376212 420902 482701 428695 318973
13668 318973 311094 229075 313598 587442 552689 300866 189490 471296 435880 635907 220155
13656 134149 245810 565649 465286 313149 560408 295801 285037 559248 338809 193912
13646 193912 11032 192904 408422 754356 295997 280902 266695 297486 370151 445982 249439
13635 249439 122659 342569 93767 465806 721629 180122 -8240 217090 414963 250401
13625 250401 -238328 264079 281265 128216 95776 548832 182533 104572 386360 333895
13615C33895O1288P3980r9509j34614R2922j62238n8825J89245n8827k4843j3359
13604A99115o1866M52792k39208M2578A75011J76670R2976p7500j12348l4435
13594B20374R287K37994M8223O2287A46021L77777q5793A39400J21197J45021
13584D05618j74040p7895K32920p5776j07903J20319n264A41304K54036q1193
13574C14147I3266K70864h6209e479q116C60694p7548A13971K77857j20312K8747
13563C00263A36842k5876J85144R4036A40258L37652J1483I0957P9697K50660
13553D21314K7610A011L30710j56502n155O8316i4199D34211A77169K80557g8784
13541g1094B43015q4143J78067j67000K13128j90182o0467J70562p8515J96609
$$ plain form
13615 333895 395183 469163 369654 235040 327962 165724 106899 296144 237317 212474 199115
13604 199115 137249 590041 350833 393411 175011 351681 444657 367157 254809 220374
13594 220374 229661 467655 515878 578165 146021 523798 438005 139400 260597 405618
13584 405618 231578 153683 386603 310827 202924 323243 317979 141304 395340 314147
13574 314147 93266 364130 -86209 -5479 -13595 360694 283146 113971 391828 271516 300263
13563 300263 136842 110966 296110 390146 140258 477910 489393 90957 170654 421314
13553 421314 448924 1011 331721 175219 170064 238380 -94199 434211 177169 457726 -78784
13541 -71094 243015 158872 336939 169939 383067 192885 132418 302980 224465 421074
13531D21074q740A05078J86209F6299K07166A7749L15224c5011B17707K8344o7267
13520A78784G6279K77584j00695R5817j20742K53879j61751r7795g4511B15344
13509A59852Q4542l7465m8246G2683G357f3400A13742K88299j96294R7778J1599
13498C15124r0366C6232l981J5473O5594N3330J5540J29148L1003n7401L3887
13487C18825A11926J46630J76676j67502n5096k9639J99218D4247M24579B28329
13476I3601O9068J4117m8002K00867R1554j12943g1229A83556i0137L9789a2891
13464b5616k37535E24232B09152A03369a1621C03404A8586C109M24270B13544
13453C79292h4616b5465C61195f9192D6526J35615K4852b0445D93142b989E07920
$$ plain form
13531 421074 412334 105078 291287 66299 273465 17749 332973 -35011 217707 246051 178784
13520 178784 76279 353863 253168 348985 228243 482122 320371 222576 -74511 215344
13509 159852 244394 206929 158683 72683 7357 -63400 113742 402041 205747 303525 315124
13498 315124 224758 36232 32251 47724 113318 166648 182188 311336 342339 284938 318825
13487 318825 111926 258556 435232 267730 212634 182995 382213 44247 468826 228329
13476 93601 162669 176786 128784 329651 421205 308262 -71229 183556 -90137 -50348 -12891
13464 -25616 -263151 524232 209152 103369 -11621 303404 18586 3109 427379 213544
13453 379292 -84616 -25465 361195 -69192 46526 182141 206993 -20445 493142 -2989 507920
13441A45474J80167O5407e4949A12471e108A51970A3132b51323M9090A19980L1625
13430A51605d4553B17370l9076J35135r2281j09418L19161f0076E91734B01061
13419B31241F7679J11871d4198C60208C107a05585A20066J98766A04249C2758
13408b50809H903K42157A05852e3623C34651A52397J10660M5014j22570O5038
13398B50539g9200C69633I4380b2566C31587c8632a8070B08395l8877e0270D38285
13386d1045o0482b6305G5859K0027P1901H937e2004D03030k852A54363E9543R1004
13374A50547o5142M6147J3451J8402J95300a67052A31458K15412G1873J78338
13364B50211O2718O7042A56179J44724A00332e1074l5143B18083L4458g7890A64341
$$ plain form
13441 145474 325641 391048 -54949 112471 -5108 151970 13132 -251323 -202233 119980 151605
13430 151605 -44553 217370 178294 313429 221148 111730 430891 -60076 591734 201061
13419 231241 67679 179550 -44198 360208 3107 -105585 120066 318832 104249 32758
13408 -250809 8903 251060 105852 -53623 334651 152397 263057 308071 185501 250539
13398 250539 -79200 369633 94380 -22566 331587 -38632 -18070 208395 169518 -50270 438285
13386 -41045 -101527 -26305 75859 95886 167787 8937 -52004 403030 400178 154363 59543 150547
13374 150547 85405 131552 145003 163405 358705 -167052 131458 346870 71873 250211
13364 250211 312929 379971 156179 300903 100332 -51074 -86217 218083 252541 -77890 164341
13352b3954n8520n1339D85564B25949q4278N9188M3867c7225A72196J85356j56958
13341B00594K72409H6088h3191c4812A29594K04741j40082J1849E5464M4465J38532
13330B38461o0803g3189B89782j19062A295J49297b50432F8651M7728M04286A33905
13318B05327A02327e759E5422p286i0154B411M37045D9254J47554E096K12581
13307B17677K1095A12000J3714J26227N4280O9398q8635d9318J3922F948c03875
13295A11741P7170b7970A72674b0149C48844a21675j83235A30585e1049j9050
13285g0099A46788O7654b95470B70404d3965D23898a44028A06811L8333k2614
13275A22530b64547C15337Q5922j94926K23128b1886j06717a4555e176m2021B96689
$$ plain form
13352 -23954 -82474 -133813 485564 225949 141671 200859 244726 -37225 172196 357552 200594
13341 200594 473003 86088 -83191 -34812 129594 334335 194253 206102 55464 99929 238461
13330 238461 177658 -73189 289782 170720 1295 150592 -250432 68651 116379 520665 133905
13318 205327 102327 -5759 55422 48136 -90154 2411 439456 49254 196808 5096 217677
13307 217677 238772 112000 125714 251941 306221 375619 286984 -49318 -35396 6948 -303875
13295 111741 188911 -27970 172674 -20149 348844 -121675 -304910 130585 -51049 -70099
13285 -70099 146788 214442 -295470 270404 -43965 423898 -144028 106811 145144 122530
13275 122530 -264547 315337 401259 206333 429461 -21886 -128603 -14555 -5176 -47197 296689
13263b42201B63413M5040I8736g1704B87691e9A33695J40960o9729a13488A4814
13251B13543a32141j35175h341C06022A48690K87874D2535b5421A01463r341f9868
13239c9954E3320K6248k5180a85811A64895e3654B00625k8162G8756P2764J11233
13228B62753C6089J01700C85a59656c2375j91855C33380i6278c5475E8660A8371
13216c86817C9876M43785c4483C48325J45616I6044a8905B16042n0810A6498J31935
13205A48433g9958C63720g855G988J75040c5743D3068J89552G7027J59941B652
13193A67144J96012A54424n9833a79289A31032a6841j03474A41898L06550j20154
13183C28294c0486l97252a01141B4457R4185l5768g5794F5712K16305h1385C04449
$$ plain form
13263 -242201 263413 308453 98736 -71704 287691 -59 133695 274655 204926 -113488 14814
13251 213543 -132141 -267316 -8341 306022 148690 436564 42535 -25421 101463 92122 -69868
13239 -39954 53320 79568 54388 -185811 164895 -53654 200625 172463 78756 151520 262753
13228 262753 36089 137789 385 -159656 -32375 -224230 333380 -96278 -35475 58660 18371
13216 -386817 39876 483661 -34483 348325 493941 96044 -18905 216042 165232 16498 148433
13205 148433 -79958 363720 -7855 7988 183028 -35743 43068 232620 77027 236968 2652
13193 167144 363156 154424 94591 -179289 131032 -16841 -120315 141898 448448 328294
13183 328294 -30486 -427738 -101141 24457 118642 82874 -75794 65712 282017 -81385 304449
13171a51510A0666f6125c839j44552n9102i8975B35609E6098e3750A17955g2106
13159g6372n8918N0694I6996J06685i4395I6088I38K4617Q2420A8624J72045L0035
13147B20704J01578h8352j21620a5759q1807C84131a51337B18890d9281l9032
13137h8313D4789a41485a7096A45849R9704I6352P9394Q5341O9900G015a32405
13125H8999h3107A45609B2504a34554l87457A36664j8365D4590a13751B68082
13114c55800J72671c6928l5636H6264J14530r5017M608j634J45800C9268J14377
13103A53645a17780b8985r8401E0880e4190A22271C2030N844K27274F1629l46
13092F1283a39053B47796b07634b2652A06621Q799R3175a19373A39447f3693B78874
$$ plain form
13171 -151510 10666 -66125 -3839 -148391 -207493 -98975 235609 56098 -53750 117955 -72106
13159 -76372 -135290 -84596 96996 203681 -94395 96088 938 25555 107975 18624 190669 220704
13147 220704 322282 -88352 -209972 -15759 -97566 384131 -151337 218890 -49281 -88313
13137 -88313 44789 -141485 -17096 145849 245553 96352 175746 261087 330987 7015 -132405
13125 88999 -83107 145609 22504 -134554 -522011 136664 118299 44590 -113751 268082
13114 -355800 -183129 -36928 -72564 86264 200794 105777 110385 108751 254551 39268 153645
13103 153645 -117780 -28985 -127386 50880 -54190 122271 32030 37874 265148 61629 61283
13092 61283 -139053 247796 -207634 -22652 106621 115420 208595 -119373 139447 -63693 278874
13080H5489M23933C4766c2579o7684A18809b00981B79690G796c3932j51638D05277
13068B23950F8729K61267J7533A05483c27940A99485r8790a4691j78526B6523
13057C45989C64h3216B80128e3710C2036c1004h647j0128j38148C27999b10967
13045a58332j8654f5649j48931I6732J27864H2539m578f154n3151m4424k32057
13034c35786a10558b6263f452k61054A37347B1180P4907a17580L6351p9496B02987
13022a21479A87667m9522R1889B6409a39755j01736G6196J39785a80786C2305
13011b41530A47709J78872b63876C57736q7893j332f3782B92665b05860B12806
13000a38382C30960h4926j85961f8928a6121A7617P2909k2062J64752G5952h9135
$$ plain form
13080 85489 509422 34766 -32579 -100263 118809 -200981 279690 7796 -33932 -185570 405277
13068 223950 68729 329996 347529 105483 -327940 199485 100695 -14691 -193217 26523
13057 345989 364 -83216 280128 -53710 32036 -31004 -8647 -18775 -156923 327999 -210967
13045 -158332 -176986 -65649 -214580 96732 224596 82539 77961 -6154 -59305 -103729 -335786
13034 -335786 -110558 -26263 -6452 -267506 137347 21180 96087 -117580 -81229 -160725 202987
13022 -121479 187667 138145 230034 26409 -139755 -241491 76196 215981 -180786 32305
13011 -241530 147709 326581 -263876 357736 269843 268511 -63782 292665 -205860 212806
13000 -138382 330960 -84926 -270887 -68928 -16121 17617 90526 68464 233216 75952 -89135
12988a21818A38356K03465i528A98369I3853a07510j56065I1415b05397E4284
12977B98105a87916A5912a80306A65195n8502N9985F2033K39401a7316I2004D4306
12965A15061j7217c6836D6110K44331F9305j9490j3486b17605D7250R4081c87741
12953A18459d4024r3541A19353n7364A5127J4930J24477a07990I6459b89036B60929
12941b61826P8646A86623I2249J57222b68003G4693h9497c7019a6443A40313a31797
12929H2974R2562F0516I094c38743B7648J99315E2090J13081d29047H0150a14518
12917A41611n5420J94249a33090e1487l2637B3999c74805a38331C46659a55714
12906B17426g6507A97763D4208b16638p9230a13059l2260C80355h8403A72614
$$ plain form
12988 -121818 138356 341821 -9528 198369 93853 -107510 -263575 91415 -205397 54284
12977 298105 -187916 15912 -180306 165195 106693 166678 62033 301434 -17316 92004 44306
12965 115061 97844 -36836 46110 290441 69305 49815 36329 -217605 47250 141331 -387741
12953 118459 -44024 -137565 119353 61989 15127 30057 154534 -107990 96459 -289036 260929
12941 -261826 -183180 186623 92249 249471 -268003 74693 -89497 -37019 -16443 140313 -131797
12929 82974 175536 60516 9094 -338743 27648 226963 52090 165171 -429047 80150 -114518
12917 141611 86191 280440 -133090 -51487 -84124 23999 -374805 -138331 346659 -155714
12906 217426 -76507 197763 44208 -216638 -295868 -113059 -145319 380355 -88403 172614
12895A03016a22770A1894N2558c0498j58021R3748M2263k05666a6750A82678N0051
12884B32729C6566P184J96377b42019A46742L1135R7606a70024j05260J11944
12874a63340J3952r4790i6270n1668d1495j17425F0044h9144E5969K77263c60509
12862I3129a35082j73468A14585d2484j53710P0048C1884J97232i6734F8417b35171
12850C3092g7691B733J50645J56817I3037b35791j23382a27882E9558d1505D2240
12838a40362e3377o7785A05443K77566A04770k8820a93155I4090K09606F5947
12827f0320k24939J06844B1944L2236b8792q140j79328O725E1a79492Q6921a690
12814c38728r0845B4597b61553f3798j91802B33664B5675K60660p482a88562C6703
$$ plain form
12895 103016 -122770 11894 64452 -30498 -188519 -94771 -52508 -258174 -16750 182678 232729
12884 232729 36566 43750 240127 -242019 146742 177877 275483 -170024 -275284 -163340
12874 -163340 -149388 -244178 -96270 -147938 -41495 -158920 60044 -89144 55969 333232 -360509
12862 93129 -135082 -308550 114585 -42484 -196194 -126146 31884 229116 -96734 68417 -235171
12850 33092 -77691 2733 153378 310195 93037 -235791 -359173 -127882 59558 -41505 42240
12838 -140362 -53377 -121162 105443 383009 104770 75950 -193155 94090 303696 65947
12827 -60320 -285259 -178415 21944 54180 -28792 -36932 -216260 -209535 51 -179492 -92571 -1690
12814 -338728 -429573 24597 -261553 -63798 -255600 233664 25675 286335 278853 -188562 36703
12802I3046O9964a34231C74218N8153a30318H1233i5899b751B94972H8361a9458
12790a87221j14653D9225a44071c770A8575d00080g9966A38432o4147K62377A10677
12778H9564b36697Q6853n4268B76494d19667B55043r6025G2301a62826B04785
12767B98495e1138A49204Q3855a02732A77776F9508c47531B11309n2157b34383
12756b84601n5179c785k07522l6333e1260I4362a25249b2092C09425p1374p0563
12745A67488M501a11740M7262j69870a07308m8866a6489l1449G4708a03238F7627
12733B60399b76941c9128B88159j10367p6620N3565a46447L5146D8453o844L0553
12722G2162Q9554d8622j23312A91383a94055A17108J87815C551a73387j17856
$$ plain form
12802 93046 163010 -134231 374218 432371 -130318 81233 -95899 -2751 294972 88361 -19458
12790 -187221 -301874 49225 -144071 -3770 18575 -400080 -79966 138432 74285 336662 110677
12778 89564 -236697 -149844 -204112 276494 -419667 255043 159018 72301 -162826 204785
12767 298495 -51138 149204 233059 -102732 177776 69508 -347531 211309 159152 -234383
12756 -284601 -339780 -3785 -211307 -247640 -51260 94362 -125249 -22092 309425 238051 167488
12745 167488 171989 -111740 -64478 -234348 -107308 -156174 -16489 -47938 74708 -103238 67627
12733 260399 -276941 -39128 288159 177792 101172 154737 -146447 -111301 48453 41609 72162
12722 72162 161716 -48622 -171934 191383 -194055 117108 304923 3551 -173387 -291243
12712b91243A32920o3140J48943a04757j58724B71565b307A16481J92269k7440
12702B81310j28986D5340a84458j89105J32190b6779I0632a39198A77883b25680
12691C55759a27816A5212b00582i2660d0752C1995K45361B4438J60629m9908o3929
12680G1230l2861c3387I7193J2482k8184c3661m571C92881G5656l1920Q5442M5189
12668A74367b73870C7260P7841a5082l15546F6597d998A79113a23230B81470J423
12657B82893a07546B44863A5557c16450a384r020F3819j6684M1653B7223Q5761
12646A12984J6776g2311J1254A36031a11097E566b5714B83724F8060J20609C4546
12634B8110M42050j88832n9686j4208G8350J40045E6759e459B45990r0053a3172
$$ plain form
12712 -291243 132920 69780 218723 -104757 -263481 271565 -2307 116481 308750 281310
12702 281310 152324 45340 -184458 -373563 -241373 -26779 90632 -139198 177883 -225680
12691 355759 -127816 15212 -200582 -92660 -40752 31995 277356 24438 185067 135159 71230
12680 71230 38369 -33387 97193 109675 81491 -33661 -38232 392881 75656 43736 129178 174367
12668 174367 -273870 37260 115101 -15082 -330628 66597 -4998 179113 -123230 281470 282893
12657 282893 -107546 244863 15557 -316450 -1384 -10404 63819 47135 88788 27223 112984
12646 112984 129760 -72311 -61057 136031 -111097 5566 -25714 283724 68060 188669 34546
12634 28110 470160 281328 221642 207434 78350 218395 56759 -5459 245990 155937 -13172
12622b71892B62775D4454c7451A22068a76463n3477A22012h60k79825I1060b88522
12610F5692K72847d8576A11937a827C8103K81346b04579O7350A77651N4339r4646
12599A37344M8005h7580A16754b26696M5503a0560j15643B26942H7499a50493
12588I2177a74191I4045a00087j68962g5007k07327b6999k46584b3643j51306
12578a74949b816o0042O855A05234c63597a55185c1872B09694B7873A1885c57420
12566b92506J22568B44891e26120a04705A91858b86532i6952A57927c7920j80537
12556b18457A757e2666J5997D1330J7249M8793Q6581a50722J9219A20758c1050
12544G0261Q0526B8845b446j4089A80441A0595K48465f2821G4653L2299J52824
$$ plain form
12622 -271892 262775 44454 -37451 122068 -176463 -229940 122012 -860 -280685 91060 -288522
12610 65692 338539 -48576 111937 -1827 38103 319449 -204579 -137229 177651 231990 137344
12599 137344 185349 -87580 116754 -226696 -181193 -10560 -126203 226942 87499 -150493
12588 92177 -174191 94045 -100087 -269049 -75007 -282334 -26999 -273583 -23643 -174949
12578 -174949 -2816 -62858 -56003 105234 -363597 -155185 -31872 209694 27873 11885 -357420
12566 -292506 -169938 244891 -526120 -104705 191858 -286532 -96952 157927 -37920 -218457
12556 -218457 1757 -52666 -36669 41330 58579 107372 193953 -150722 -131503 120758 -31050
12544 70261 150787 28845 -2446 -16535 180441 10595 259060 -62821 74653 106952 259776
12533B59776A28946M0011D6107K188a44539A48905o4065J05931b32835A7103c2909
12521h0426A3295e3486B7327c03170h602k31066B83361j39397n9624C4923J06651
12510A41574C1580N4501a30996L9823B16068f2451I3772a51927A26048e9195B65568
12498A57348b25358F6722i8433A57965E4504g3061j8968c1821G6958J94483a02274
12486A16548J91622B1104a53164D5740Q0287f232o9645j79458A06640a33038B03888
12474A02061a79675P9960a5026A24009g1541p9070b9146q5445E1119N6224K2693
12463A30036e2314j89913B90768J3207A44122e0355l8443B64714G9332l3677N3023
12452I8678a1225k1518p4978d5150l56164A13723h9096k48945F0571B1281c8740
$$ plain form
12533 259776 128946 168957 46107 48295 -144539 148905 84840 190771 -232835 17103 -32909
12521 -80426 13295 -53486 27327 -303170 -8602 -239668 283361 143964 84340 34923 141574
12510 141574 31580 86081 -130996 -91173 216068 -62451 93772 -151927 126048 -59195 265568
12498 157348 -225358 66722 -98433 157965 54504 -73061 -92029 -31821 76958 271441 -102274
12486 116548 308170 21104 -153164 45740 126027 -6232 -75877 -255335 106640 -133038 203888
12474 102061 -179675 -99715 -15026 124009 -71541 -150611 -29146 -114591 51119 107343 130036
12463 130036 -52314 -242227 290768 303975 144122 -50355 -88798 264714 79332 45655 98678
12452 98678 -11225 -32743 -107721 -45150 -401314 113723 -89096 -338041 60571 21281 -38740
12440G5649C943c65441A20569m9288b84179a06412a7781I4475b11292j0037O7236
12429a54093K9708j19429A94190a96328B0900a05727L5977k62946e8937A5747
12418E9950J14211a58817A28686b9919k07622B14571F5607M2523a26974B25914
12407D5137b70189J18436A31784N1882e7276j15073j06322a38233f3742B10952
12396B17324a4074D1217K0714b2461D61973a96474g9726c858B27594D0960a31006
12384g9279C15279A21290L083C8350Q1042a12280A13195h1155L6567A84026i4110
12372B80033a10215N4976n9317e0062G7076c21121A46191l6941a73192g8012b7668
12360G0598J57107K1728G5093l0807Q6545c15406B9478J99849E0733A6237a70069
$$ plain form
12440 75649 3943 -365441 120569 71281 -284179 -106412 -17781 94475 -211292 -221329 -154093
12429 -154093 -124385 -243814 194190 -196328 20900 -105727 -69750 -332696 -58937 15747
12418 59950 174161 -158817 128686 -29919 -237541 214571 65607 108130 -126974 225914
12407 45137 -270189 -151753 131784 183666 -57276 -172349 -278671 -138233 -63742 210952
12396 217324 -14074 41217 61931 -22461 461973 -196474 -79726 -3858 227594 40960 -131006
12384 -79279 315279 121290 124373 38350 119392 -112280 113195 -81155 -44588 184026 -94110
12372 280033 -110215 -55239 -114556 -50062 77076 -321121 146191 109250 -173192 -78012 -27668
12360 70598 227705 249433 75093 44286 130831 -315406 29478 229327 50733 16237 -170069
12348I2599M2386b37672G5518P5469L19166A08358A7298J6626J18998a18296b4341
12336a78237A66509n2701b25067A07414l3379d2301m2438E4928D306K30489b77327
12324B32664o0285b12384g8652b1725B50487a74390k18263B7770J43738b0159
12313F4479d8618G3035O8940a26258m316A58592b18942F7041c3630l96822a22444
12301b26919o504P7267L827A16074E6783M4004C0353L3029d0033F9795a33800
12289A44114F9011j5321J44813b18757A68671a99338A92320K6789a10718e4392
12278i3578D4816i4182B82351h8826A68006p3539g1190J3465A6319K52303f7577
12266A15598A4173K15251a57094A46323r715a50814A12750i2817A13430d0808
$$ plain form
12348 92599 134985 -237672 75518 150987 470153 108358 17298 33924 152922 -118296 -24341
12336 -178237 166509 113808 -225067 107414 74035 -42301 -84739 54928 4306 234795 -277327
12324 232664 172379 -212384 -78652 -21725 250487 -174390 -392653 27770 171508 -20159
12313 64479 -48618 73035 141975 -126258 -130574 158592 -218942 67041 -33630 -430452 -122444
12301 -226919 -233423 -156156 -152329 116074 56783 100787 30353 63382 -40033 69795 -133800
12289 144114 69011 53690 198503 -218757 168671 -199338 192320 219109 -110718 -54392
12278 -93578 44816 -94182 282351 -88826 168006 94467 -71190 -57725 16319 268622 -67577
12266 115598 14173 229424 -157094 146323 136608 -150814 112750 -92817 113430 -40808
12255B95526A12706c84101B10451a7455j36388B85784C4636g0474B74434j36677
12245A37757D3346J12358b31365f6698A43663B774a60751A56239L2563j8272H2015
12233B00349L876d6792A01620K75245j67871o1836b18087A61732K5034c9888j32616
12222a72504A02253Q0352M3893j3093d3110C75607j79035J74010o099j13158C8556
12210A16716N6836b375C28477A57479D0947P0081m1147a7350D14230j13407d0189
12198a0062A53006J39141I718M09961A54230k1866j7849P3814J81514H6647J6292
12187A02939d4444A02101J56735K1598K11132C7813J02717b6388B53805o4647
12177A89158H9022b47205H3559f8275I5199h811B65310N3540B4750a08472E6159
$$ plain form
12255 295526 112706 -384101 210451 -17455 -153843 285784 34636 -70474 274434 137757
12245 137757 43346 155704 -231365 -66698 143663 2774 -160751 156239 188802 170530 82015
12233 200349 204225 -46792 101620 376865 208994 147158 -218087 161732 186766 -39888 -172504
12222 -172504 102253 182605 226498 213405 -43110 375607 196572 370582 364483 251325 38556
12210 116716 173552 -2375 328477 157479 40947 111028 69881 -17350 414230 300823 -40189
12198 -10062 153006 292147 9718 419679 154230 132364 114515 188329 369843 86647 102939
12187 102939 -44444 102101 258836 280434 491566 37813 140530 -26388 253805 189158
12177 189158 89022 -247205 83559 -68275 95199 -8811 265310 318850 24750 -108472 56159
12165D84071j74439A05706O8880J10416J51139c27967A83511R5521f3979r3489
12155a57468F6981J309Q8571K5782a0511B17564d0281B5300b13381Q1034E6507
12143a73355B98706o6319R6940m3728H3007c53542C097O5611b3600g382o7520
12132g4902A1325K03876b50826G2545f5443B6697a4120B67878d0292B05783d4869
12120B42401a6419D28109a39076A54225F012L85935B9756i9430A68887K79975
12110D48862F0526C383d4180A06678a61813j1069O8272C29264H7109j9227c24518
12098a74n3777D4882a08584b0577A37115c23717J39170g1209B24323a87689L4123
12087a53566A14703j4884K4317k8583A3139d0794J0707B3410b71775E9641a25905
$$ plain form
12165 484071 309632 105706 174586 285002 436141 -327967 183511 279032 -63979 -157468
12155 -157468 66981 68290 156861 182643 -10511 217564 -40281 25300 -213381 -132347 56507
12143 -173355 298706 232387 329327 285599 83007 -353542 3097 68708 -23600 -7382 -74902
12132 -74902 11325 215201 -250826 72545 -65443 26697 -14120 267878 -40292 205783 -44869
12120 242401 -16419 428109 -139076 154225 6012 391947 29756 -99430 168887 448862
12110 448862 60526 3383 -44180 106678 -161813 -172882 -104610 329264 87109 67882 -324518
12098 -174 -53951 44882 -108584 -20577 137115 -323717 -184547 -71209 224323 -187689 -153566
12087 -153566 114703 99819 124136 95553 13139 -40794 -30087 23410 -271775 59641 -125905
12075A11354a00501b9272A33516J96764A09425h3617n1665j39060E2306a43150
12064b0893A23484b75452B56624a24426g646C93352E8107J03465K652b26893h053
12052B1629J12815Q9613i4849c2966D3421R6666P883b43216N5997C64663b51857
12040A81766a77977P1780B95842a28673d9936N959f76p5310C39174a24705A15025
12028b01379R1180r9255A54052L9738e3973A90591a36807m9074D0220J13052n7163
12017I6109e858D2632i994I5095a08004C08716a8383M392k06496A26050a1356
12005D8755A5422c29351A08509l5744A3674M6811b49762P4045B20669a20702B00632
11993D9741c49346A66371a79571N6721B64301A19029a22081j39064C9907O9885
$$ plain form
12075 111354 -100501 -29272 133516 330280 109425 -83617 -135282 -274342 52306 -143150
12064 -20893 123484 -275452 256624 -124426 -7646 393352 58107 161572 164224 -226893 -8053
12052 21629 134444 224057 -94849 -32966 43421 140087 147970 -243216 -187219 364663 -251857
12040 181766 -177977 -106197 295842 -128673 -49936 -43977 -676 -75986 339174 -124705 115025
12028 -201379 -110199 -209454 154052 193790 -53973 190591 -136807 -185881 40220 153272 96109
12017 96109 -5858 42632 -9994 95095 -108004 308716 -18383 -13991 -220487 126050 -11356
12005 48755 15422 -329351 108509 72765 13674 60485 -249762 -175717 220669 -120702 200632
11993 49741 -349346 166371 -179571 -122850 264301 119029 -122081 -261145 39907 109792
11983A09792c94947J84068D5857f8149D4189a11250G2221B8053M4997a6124E6570
11971h5983H7064a65233D7504f1974r5919B17989b30856D1533i6044n636l31461
11960d33141I0865O604c26936N0767a8295B32830a08464j24923M2921K0790o1603
11949b31279C9447A5855a4158B37463I1719D1162a65287B97974d86747a49766
11938c2197A7224b22151D61102h6571F9347e5549k49446I1261a9659l02339O0025
11927b61973k26793A41898B4261J28087c47643i4147m4799B9577j0701K8385c81794
11915b11928A07112J12751a84832d8990k54023j79848i3010K2526H2341M0898
11905A23239a72740k04188I9024f6694o041A98248a84197A80286K41533A17192
$$ plain form
11983 109792 -394947 -210879 45857 -68149 44189 -111250 72221 28053 73050 -16124 56570
11971 -85983 87064 -165233 47504 -61974 -157893 217989 -230856 41533 -96044 -101680 -433141
11960 -433141 90865 97469 -326936 -276169 -18295 232830 -108464 -233387 -190466 -169676 -231279
11949 -231279 39447 15855 -14158 237463 91719 41162 -165287 297974 -486747 -149766
11938 -32197 17224 -222151 461102 -86571 69347 -55549 -304995 91261 -19659 -321998 -261973
11927 -261973 -488766 141898 24261 152348 -347643 -94147 -138946 29577 18876 47261 -381794
11915 -211928 107112 219863 -184832 -48990 -303013 -482861 -93010 -70484 82341 123239
11905 123239 -172740 -376928 99024 -66694 -72735 198248 -184197 180286 421819 117192
11894c7769k44533k28948A94416a75914h955m0561k35987P3098A35620A6112a61460
11882B91150c096j98976A22511m2531B2454b08917K0261e0566k75394J58279e6472
11870b52090A00187a08258I46b6338m634B69079H7034g2779E0703c93309A04799
11858i1472p4978j87654A74725b4717A25082j9704g1799C16619a08421A73941
11847A9849a9243l57361a48428k3506M1057I4400k9525b07841e7715K8517I9999
11835F9939c52508a07220a6151m7673A116a21373D3297g1284a9871D1400b5516
11823b2639B5391H56c1753J1554k82435Q7891G0282a63354O2450d553n9572o3023
11811a27148L1470k31032D21420c3220A35996O440b85755f9578C8375h0375ej05546
$$ plain form
11894 -37769 -282302 -511250 194416 -175914 -8955 -49516 -285503 -212405 135620 16112 -161460
11882 291150 -3096 -202072 122511 79980 22454 -208917 -188656 -50566 -325960 -167681 -56472
11870 -252090 100187 -108258 946 -26338 -30972 269079 87034 -72779 50703 -393309 104799
11858 -91472 -166450 -354104 174725 -24717 125082 105378 -71799 316619 -108421 173941
11847 19849 -19243 -376604 -148428 -171934 -130877 94400 64875 -207841 -57715 -29198 99999
11835 69939 -352508 -107220 -16151 -63824 1116 -121373 43297 -71284 -19871 41400 -25516
11823 -22639 25391 856 -31753 -20199 -302634 -214743 70282 -163354 -100904 -4553 -64125 -127148
11811 -127148 -95678 -326710 421420 -33220 135996 142436 -285755 -69578 38375 -80375 -5 -105551
11799a05551j12063A17040d2767A3002K91803A38593m855a29662B22855o6353
11789A56502b26748A16025a30082B24301r0656c7633H8616M0737r764L29503a67553
11777b63232E0194R1646B1085O138a33309A20689i62E5353a06625j79302a29588
11765a57310O492j46867j8004a48463A0337K30223a39709B88663b90921A08048
11754a82018h5158C2176a65839B39326F5588K52288a33652a2653C18425a08081
11743a04892A33463d2436j27509b880B10243d37247D585a7243A10423B82J69173
11732A69455e7975r6098A37142B4559K93242a38359B94807b00652f7416m3173
11722a10589A73009b02565N3876G2049J63019N0026b638j78446Q0105B06833a94565
$$ plain form
11799 -105551 -217614 117040 -42767 13002 304805 138593 133738 -129662 222855 156502
11789 156502 -226748 116025 -130082 224301 133645 -37633 88616 129353 119589 449092 -167553
11777 -263232 50194 141840 21085 27223 -133309 120689 -962 55353 -106625 -285927 -129588
11765 -157310 -150818 -297685 -315689 -148463 10337 240560 -139709 288663 -290921 108048
11754 -182018 -85158 32176 -165839 239326 65588 317876 -133652 -12653 318425 -108081
11743 -104892 133463 -42436 -169945 -2880 210243 -437247 4585 -17243 110423 282 169455
11732 169455 -57975 -154073 137142 24559 317801 -138359 294807 -200652 -67416 -110589
11722 -110589 173009 -202565 -148689 72049 235068 285094 -2638 -181084 -100979 206833 -194565
11710b1865j2654B7188J81325a69588A02454a66125Q0567o6089A0393P9577b94891
11698A03875c69118B37472a35733j40441A43140J09249h615A64207c37611a10593
11687e0540j17570p4660G7530h6546M489I0739L5774B7694J23316g9663A09066
11675a52908P1906d159o0238A6558J61544a82706G5909a76861M0567e9693B3988
11663B70320B9880J15530a24442E1754P149k0408A1270L2791O1214c06710J09567
11652a97143B11502O1044I0166K788P7748K3571n6965i3393C70540C4494d6922
11640B65565c76835D6338a31786B06791a60300E5456J37832C0306K07191c8895
11629D3794a01738j58896A0493J92337b66037m4291G5897c5231J1394B70204a52813
$$ plain form
11710 -21865 -34519 27188 208513 -169588 102454 -166125 -85558 -151647 10393 89970 -294891
11698 103875 -369118 237472 -135733 -276174 143140 252389 -8615 164207 -337611 -110593
11687 -50540 -168110 -242770 77530 -86546 -82057 90739 126513 27694 151010 -79663 109066
11675 -152908 -81002 -4159 -64397 16558 178102 -182706 75909 -176861 -136294 -59693 23988
11663 270320 29880 145410 -124442 51754 58903 38495 11270 44061 105275 -306710 -197143
11652 -197143 211502 272546 90166 92954 170702 194273 137308 -93393 370540 34494 -46922
11640 265565 -376835 46338 -131786 206791 -160300 55456 193288 30306 237497 -38895
11629 43794 -101738 -260634 10493 202830 -266037 -310328 75897 -35231 -23837 270204 -152813
11617a22540A45916d1497a6693n5888c2495k04340C79719f3321I2665a93126j20259
11606c13385e1063k40210D4844a23956B55605q2591q3628i5246A23774d2672k6287
11595f8959A58340a46258k7861C4867a949C88089b1770G1129J04379b022B39789
11583b11037e9226J3892j2106F0224c4236G5917K94383C6046j5110b09827B73289
11571d1837A8446K20877a53215I2065a98295A1486b05660A62899h5312L8542C66
11559b5636C14018d8369A05212e1495k5798j09715m6658G0546N8099D155Q6764
11548I0919J78301a79711a018D04641b5562p6346a0244k12777i3842j065a4772
11536B24422I6903N4810o5179k45a78723f147C1597i7886A9353J0204O2916m2808
$$ plain form
11617 -122540 145916 -41497 -16693 -72581 -32495 -236835 379719 -63321 92665 -193126 -313385
11606 -313385 -51063 -291273 44844 -123956 255605 173014 89386 -95246 123774 -42672 -68959
11595 -68959 158340 -146258 -174119 34867 -1949 388089 -21770 71129 175508 -2022 239789
11583 -211037 -59226 -45334 -57440 60224 -34236 75917 370300 36046 20936 -209827 273289
11571 -41837 18446 239323 -153215 92065 -198295 11486 -205660 162899 -85312 -46770 366
11559 -25636 314018 -48369 105212 -51495 -77293 -187008 -233666 70546 128645 4155 90919
11548 90919 269220 -179711 -1018 404641 -25562 -101908 -10244 -223021 -93842 -94907 -14772
11536 224422 96903 151713 86534 86289 -178723 -6147 31597 -97886 19353 29557 92473 49665
11524D9665h1670c0768B01463C959J72599D4498i2055D03904D0481a83332B0785
11512B58796m208b057o4965A7083K12075N6951p4019c31943B2449b30839A94862
11500A59663j6725a5604B51624a11338B39574E5634K85061g6109A14025J82367
11490B96392A47973J80878a57051B00854E3691b6808C35072B6632K33453A8059
11479d21930e7311D5420j2637N6167C9038J53310i732C05980c32739C26024B8100
11467A40979J55838p2115a0134B94686j41816o5681h8309A247L0175a54465E7391
11455B02048d6045A85655l6821k7344i3446B60317i1741B66105D7241e6793C0527
11443B8842b5715B99627q7911a28934A89957J01859D3031K44085n3489b4158n9675
$$ plain form
11524 49665 -81670 -30768 201463 3959 176558 44498 -92055 403904 40481 -183332 20785
11512 258796 254588 -2057 -67022 17083 229158 286109 212090 -331943 22449 -230839 194862
11500 159663 142938 -15604 251624 -111338 239574 55634 340695 -76109 114025 296392
11490 296392 147973 328851 -157051 200854 53691 -26808 335072 26632 260085 18059
11479 -421930 -57311 45420 32783 88950 39038 192348 -9732 305980 -332739 326024 28100
11467 140979 296817 224702 -10134 294686 152870 87189 -88309 1247 31422 -154465 57391
11455 202048 -46045 185655 148834 121490 -93446 260317 -91741 266105 47241 -56793 30527
11443 28842 -25715 299627 211716 -128934 189957 291816 43031 287116 233627 -24158 -83833
11432h3833D67389a820A04387f2784A70616J29984H2583c18435B10631q1016b8881
11420a5913D00780A81070c25675D51507j45031b69515A66127c05493j41672A1481
11409A32042J26512b12736C39141A41214I242c9114O343p0716A65238b989A26888
11397F6526f7710r5870b9370I1503c487j66094N8019K4434D45895d93608a44835
11385b21794j1333i5409q3646E4459b3634B6067K5550b4528k48513f1471B19580
11373h8345a1260B62107a45427G7110a96772O9217I1165K50415i165A87873a15378
11361b61305o466a6495j59566N0892H376d58k19308O5968C0790J53839c0620A5245
11348b23361i0067q3691m1547F9333L48790C3976K5673b18470f7088B81851J62193
$$ plain form
11432 -83833 467389 -1820 104387 -62784 170616 300600 82583 -318435 210631 129615 -28881
11420 -15913 400780 181070 -325675 451507 306476 -269515 166127 -305493 -447165 11481
11409 132042 258554 -212736 339141 141214 9242 -39114 -32771 -103487 165238 -2989 126888
11397 66526 -67710 -163580 -29370 91503 -3487 -169581 -111562 -87128 445895 -493608 -144835
11385 -221794 -233127 -95409 -179055 54459 -23634 26067 51617 -24528 -273041 -61471 219580
11373 -88345 -11260 262107 -145427 77110 -196772 -127555 91165 341580 -9165 187873 -115378
11361 -261305 -267771 -16495 -176061 -125169 8376 -458 -219766 -153798 30790 184629 -30620 15245
11348 -223361 -90067 -173758 -215305 69333 418123 33976 59649 -218470 -67088 281851 444044
11337D44044g5856q0030j24628j06368A76598d1053J894a3718p5339A80653a35330
11325c2446p1476a6627j08517j58631j76949a029r8719A52923n3244a12601E7521
11313c46283A42994i6325a8352k3778I7301f0929b0543G9868c43024h8309j60857
11302b49166e1101B00235a20983C51264e7261l5419j07715F6956b40979C7983
11291b10420J1886Q1068A13144k4566a33060D0796b0801p5105A19605a34942c2160
11279B2595c37281a15415j7374J2071B00900C4359J70066r4995a33562l84801
11269e18363B1492c99745e2662B7004b93982I6637d3095A68445i2896j36515A94075
11257A89570O5212a63742Q0542m6141A20987c0099j31891j11493c3027l3678j03095
$$ plain form
11337 444044 -75856 -155886 -280514 -386882 176598 -41053 -39159 -13718 -89057 180653 -135330
11325 -32446 -103922 -16627 -125144 -283775 -460724 -1029 -99748 152923 99679 -112601 57521
11313 -346283 142994 -96325 -18352 -42130 97301 -60929 -20543 79868 -343024 -88309 -249166
11302 -249166 -51101 200235 -120983 351264 -57261 -92680 -200395 66956 -240979 37983
11291 -210420 -198534 -117466 113144 88578 -133060 40796 -20801 -95906 119605 -134942 -32160
11279 22595 -337281 -115415 -132789 -120718 200900 34359 204425 109430 -133562 -518363
11269 -518363 21492 -399745 -52662 27004 -293982 96637 -43095 168445 -92896 -229411 194075
11257 189570 254782 -163742 -83200 -129341 120987 -30099 -161990 -273483 -33027 -66705 -169800
11246a69800N9757D2846J1754M4033a10144B0988J29578i744B93271F4377H436
11234b960B51212b2103j45842P6200C9693A3747h5752d893m821B193a26074b1080
11221i332E3579i0844j56274Q2612D0790J37428e9602n6734B3499J3023a91247
11209e5213G0435b24176f5073J9167n9123H6459J88818b14378A06959C073a9654
11197E07563g7557n3543C3851b34085b1943B61419d5196D22263b49554k70352
11187e19906K13909a4998m8435o8244o7442J5503M6247O1332A79863f5278r0913
11176a56191D5835J4755a66534A24226b1941r2596j23596L6025m0045a12766C22828
11164h5758L9648j7889A25085j6630d06862c2536a1088B11891q1259N4467J43215
$$ plain form
11246 -169800 -110043 42846 54600 98633 -110144 20988 150566 -9744 293271 64377 8436
11234 -2960 251212 -22103 -167945 -91745 39693 13747 -85752 -4893 -9714 2193 -126074 -21080
11221 -9332 53579 -90844 -247118 -164506 40790 178218 -59602 -116336 23499 36522 -191247
11209 -55213 70435 -224176 -65073 -45906 -105029 86459 275277 -214378 106959 3073 -19654
11197 507563 -77557 -131100 33851 -234085 -21943 261419 -45196 422263 -249554 -519906
11187 -519906 -305997 -14998 -63433 -131677 -199119 -183616 -137369 -76037 179863 -65278 -156191
11176 -156191 45835 60590 -166534 124226 -21941 -114537 -238133 -202108 -242153 -112766 322828
11164 -85758 -46110 -63999 125085 108455 -406862 -32536 -11088 211891 130632 185099 328314
11153C28314C8756c76397A82150B1170f7334C9779d5175A08270e575j70529C9960
11141a09582C5854M70203a34333A82841B5648M3607a32934F2525i4783o7139H9813
11129b24817B43088F0356O6277J04995H7636O9145R3446C7772J08939c5542A85271
11117a53357j37263J05350A97744A7492R7348b83006J6855G2192K2532e4167J2579
11106d1588l22269E3295A4294J91906I0582J15271E2400K85438F5521g187B12321
11094a21439D4155J3908K79823I4648B249L49233A25996K29668j37867p6558J8771
11083A60010f1823C0863J96588H9271l755L28943J52479B31990J67525j1414K2271
11072D10372j66113j9528R0080J12798j18338j24708K44849j13568J39831Q291
$$ plain form
11153 328314 38756 -376397 182150 21170 -67334 39779 -45175 108270 -5575 -176104 39960
11141 -109582 35854 506057 -134333 182841 25648 69255 -132934 62525 -94783 -161922 89813
11129 -224817 243088 60356 126633 231628 87636 156781 250227 37772 146711 -35542 185271
11117 -153357 -290620 -185270 197744 17492 114840 -283006 -266151 72192 94724 -54167 -41588
11106 -41588 -363857 53295 14294 206200 90582 205853 52400 337838 65521 -7187 212321
11094 -121439 44155 58063 337886 94648 2249 351482 125996 355664 217797 141239 160010
11083 160010 -61823 30863 227451 89271 85516 414459 566938 231990 399515 388101 410372
11072 410372 244259 224731 314811 427609 309271 184563 429412 315844 455675 463966
11062D63966m1390K62840j04574O2155G4895O01209O9568k0253J10412l82573
11052D53258L95885j38640J34582J33076j62631P8424j61209N08565F07916M29079
11042A036995k90338K29887l68037j2825K08921J61811k78151J06556k61690N03460
11032A036589r1465r4214K43784l97849J52351J37386C86646M67371j17310J1117
11022G47824k04158J96221r145l24716j0890J31173P34B54909N05524k4854o2357
11011F73222J85365k45649q7965J15953L2124J2056O6420n0551k3764j46138M59482
11000I90555k39361l19610J19733J43171K16444j08159j18198j40972K4989k2353
10990E46239J59527J2682p3579J39040j27063J5286K27197K32325N7419J44465
$$ plain form
11062 463966 422576 685416 580842 642997 74895 676104 745672 725419 835831 453258
11052 453258 849143 710503 845085 978161 815530 893954 732745 1241310 607916 1036995
11042 1036995 746657 976544 608507 595682 804603 966414 688263 794819 533129 1036589
11032 1036589 945124 850910 1094694 696845 849196 986582 386646 854017 736707 747824
11022 747824 543666 739887 730742 406026 395136 526309 527043 254909 760433 735579 673222
11011 673222 858587 612938 524973 640926 673050 685106 751526 700975 677211 531073 990555
11000 990555 751194 431584 551317 694488 910932 802773 684575 543603 568592 546239
10990 546239 705766 718448 644869 783909 656846 672132 899329 1131654 1189073 1333538
10980A333538k87915K21031P858N14339J24658j51389K74801N94994P5997L66822
10970C074734J10321K95387j05636N19959j36104p98663l12876q22969J40024
10961A964177m26833l42300K00917m68094L51532k3187p361l35255L23066P5495
10951A312157j67580l29159k15739P6180B7750J38523R544L10261f2656C72976
10940A93681A7701O7617K06876A7191K38847D524M7900J43411k0292D8085J89650
10929B37735b57149F9049J42131b45988A28673b4012p2066F6141h7041q0400I4619
10917A83031A1205M58624C293K22402E4991a11864I9473K962a15834F7868a62931
10905e3536B20772m1312C5119L68331F005J37867J2934K25963h169B58280r4011
$$ plain form
10980 1333538 1045623 1266654 1274512 1788851 1913509 1762120 2036921 2631915 2707912 3074734
10970 3074734 3185055 3480442 3374806 3894765 3758661 2959998 2647122 1824153 1964177
10961 1964177 1537344 1195044 1395961 927867 1279399 1256212 1248851 913596 1236662 1312157
10951 1312157 1144577 815418 599679 675859 27750 166273 175817 486078 -62656 372976
10940 193681 17701 85318 292194 17191 256038 4524 52424 195835 175543 48085 237735
10929 237735 -257149 69049 211180 -245988 128673 -24012 -96078 66141 -87041 -167441 94619
10917 183031 11205 469829 3293 225695 54991 -111864 99473 102435 -115834 67868 -162931
10905 -53536 220772 179460 35119 403450 6005 143872 156806 382769 -8169 258280 164269
10894A64269h0739j95350h9186c195G8879g0720I8224a99175A55622E8192a04001
10882a7614n8589l4638C72437A2863e11845a32878j8394I7085c23566a3609B50792
10870A01737c11797p7561i1333b0029k11553i5247E8325a14066m234c5619j8904
10859e4523A99063a00418k2911B45198g5539J9744H1775a72863d2102G3957a64812
10847A41294g3798A11797b66440F5613P420d8327G3497B3026J40838a9580B21503
10835a17709j19047A55265J34771b05659b3806j52605C31678a0648p201I3461
10824A79613o4962N1560c2451j15373j44430a03164j6087n4830I0867B1662P2735
10813I4397K92991i3706J3689F3093J15902b79435Q4313R1795j06853R3330o4123
$$ plain form
10894 164269 -80739 -276089 -89186 -3195 78879 -70720 98224 -199175 155622 58192 -104001
10882 -17614 -76203 -110841 372437 12863 -511845 -132878 -151272 97085 -323566 -13609 250792
10870 101737 -311797 -389358 -91333 -20029 -231582 -95247 58325 -114066 -118300 -35619 -54523
10859 -54523 199063 -100418 -123329 245198 -75539 -55795 81775 -172863 -42102 73957 -164812
10847 141294 -73798 111797 -266440 65613 73033 -48327 73497 23026 163864 -19580 221503
10835 -117709 -236756 155265 290036 -205659 -23806 -176411 331678 -10648 -17849 93461
10824 179613 114651 166211 -32451 -147824 -292254 -103164 -119251 -174081 90867 21662 94397
10813 94397 387388 -93706 -80017 63093 178995 -279435 -195122 -103327 -210180 -116850 -180973
10802a80973d1400k57129A20553O9373b64905D9169b09201C6524c92717g2233
10791a86045A8575c75059c0793m107A30145a46298a1753o1193n4072B9635b21604
10779b00076G8930j9058b59155b2155F6924J8742a62605N4459F1377k524Q2489
10768A41342h8584B60859c17402B2447e7298J9258j74726B31300a53293K7088
10758a26205k84009P0497k9717A05328b26107E6173e8051B07771h2576K1285A72068
10746F0105a19587B15296a62865e6162j8287l8537k57759a33775m5943h7739A5360
10734a36164O0833r2935E2011R8870K17688D2809a57240G9357c12265J11634B42230
10722b26913A58084D2092j0477g3199j02811M1883j32388J28190J4663n7690f5917
$$ plain form
10802 -180973 -41400 -298529 120553 189926 -264905 49169 -209201 36524 -392717 -72233
10791 -186045 18575 -375059 -30793 -34900 130145 -146298 -11753 -72946 -127018 29635 -221604
10779 -200076 78930 59872 -259155 -22155 66924 85666 -162605 -108146 61377 58853 141342
10768 141342 -88584 260859 -317402 22447 -57298 -38040 -212766 231300 -153293 -126205
10758 -126205 -410214 -339717 -369434 105328 -226107 56173 -58051 207771 -82576 -61291 172068
10746 60105 -119587 215296 -162865 -56162 -74449 -112986 -370745 -133775 -179718 -87739 15360
10734 -136164 -75331 -168266 52011 150881 368569 42809 -157240 79357 -312265 -200631 242230
10722 -226913 158084 42092 31615 -73199 -176010 -134127 -266515 -138325 -123662 -181352 -65917
10710b20132A49882F5894c57752J11671j1243f7312j92418d7339F2364b551k34219
10699b36770a1943j70212A82946j079i2092j79693i5635E8803c36771a13724j27477
10688b41201A53122a05677A63444a9901j18067M6341A32455b88750e6988q7912
10678a44900I9905f9104j0900B4003b84372A04742c33840A92498a09444j30380
10668b39824p5027K7265B58568a72644n7853I194J69963d34424J58627B45737
10657c5297A19169f4219A30841D1902a27353A23441d7391m6670C4421P220P7328
10646A18969M0127a26721A62195c0884j12830D6167j2281d4059j71595f7679b989
10634C3269a17144c8577D8297N9570a06819C53541g2761H0551b7449l2132J9323
$$ plain form
10710 -220132 149882 65894 -357752 -246081 -257324 -67312 -259730 -47339 62364 -2551 -236770
10699 -236770 -11943 -182155 182946 181867 -92092 -271785 -95635 58803 -336771 -113724 -241201
10688 -241201 153122 -105677 163444 -19901 -137968 -91627 132455 -288750 -56988 -144900
10678 -144900 99905 -69104 -80004 24003 -284372 104742 -333840 192498 -109444 -239824
10668 -239824 -314851 -287586 258568 -172644 -230497 9194 179157 -434424 -275797 245737
10657 -35297 119169 -64219 130841 41902 -127353 123441 -47391 -94061 34421 41641 118969
10646 118969 159096 -126721 162195 -30884 -143714 46167 33886 -44059 -215654 -67679 -2989
10634 33269 -117144 -38577 48297 107867 -106819 353541 -72761 80551 -27449 -59581 -40258
10623d0258m3758j98286f7976j06421j72145A47941b7404J2375A55748R3710D5535
10611A68465p7126J5250C5265c7951m9364r4331D5738K74119a3988k05497P7650
10600a41835B26591j05065E6205e8132A36916a38567I9785j7110c6137A02491
10589a66226b949I0540i4399A49308q46o5546b54363a18856l4694c1999q2495
10578a14494J9731k27769a08254G0759j2227k11j0576J1245a43009N5184j35762
10567b23587h8649A3694R4489o2J24702b61582M3584G0025b3222A12515b53945
10555A27577A0507N4007a85071k919E8548h4540r3533k04939H0165j3706b42136
10543a50119q7972A43038C0179d9412m06703D5945J11233k7629B2042N0228c4202
$$ plain form
10623 -40258 -84016 -282302 -67976 -174397 -346542 147941 -27404 -15029 155748 249458 45535
10611 168465 91339 106589 35265 -37951 -87315 -181646 45738 319857 -13988 -219485 -141835
10600 -141835 226591 121526 56205 -58132 136916 -138567 99785 82675 -36137 102491
10589 -166226 -2949 90540 -94399 149308 148462 82916 -254363 -118856 -153550 -31999 -114494
10578 -114494 -94763 -322532 -108254 70759 58532 58321 47745 58990 -143009 -87825 -223587
10567 -223587 -88649 13694 108183 108121 232823 -261582 -217998 70025 -23222 112515 -253945
10555 127577 10507 64514 -185071 -187990 58548 -84540 -178073 -383012 80165 66459 -242136
10543 -150119 -238091 143038 30179 -49412 -456115 45945 157178 129549 22042 72270 -34202
10531c42016a42718A62569b7177H6482J0109a29905M0842j64686C3085a07703
10520a61171f9033j44378N8420A26976E147P1748a00703q9750c8422E9143O9015
10509A28158d9162B66558f6361p1089C56471d6606k60654h766m7763A4562J01690
10498A16252M8722A4195P2454a6988A89557b29234E1649A617b67560g9660k1495
10487a01155A03666a47139B63212G1474a36375A62021K07187R3019A34803e5392
10476B91052B0140I392c6287n054D7033a53498C2199Q5072b67296e1183r6634
10465a47817K9080B09785G9601K98710A46977l1692J76349a26820A48152l7556
10455A10596e3206D9876b20118k7691B26100E933b44191j20158F4567i756k15114
$$ plain form
10531 -342016 -142718 162569 -27177 86482 96591 -129905 -89063 -253749 33085 -107703
10520 -161171 -69033 -213411 -154991 126976 5147 76895 -100703 -190453 -38422 59143 128158
10509 128158 -49162 266558 -66361 -137450 356471 -46606 -307260 -8766 -56529 14562 116252
10498 116252 164974 14195 86649 -16988 189557 -229234 51649 1617 -267560 -79660 -101155
10487 -101155 103666 -147139 263212 71474 -136375 162021 369208 462227 134803 -55392
10476 291052 20140 9392 -36287 -41341 47033 -153498 32199 117271 -267296 -51183 -147817
10465 -147817 -118737 209785 79601 378311 146977 115285 291634 -126820 148152 110596
10455 110596 -53206 49876 -220118 -247809 226100 5933 -244191 -364349 64567 -9756 -224870
10444b24870f5467F6454b85012g9736K7339E4737i3561A68909a71079B3918a6561
10432c44578R1723J22982k98404A29974a45042r96l560j65988h8881k14342I1367
10420A31349a74802E2460k4302c54680a25631q1381O4265O7897j74194g7919k19927
10409b97846j5076E34185b62882Q7838A02408c4908k13266A93409L9897c1079
10398F9531j0284a74266m0347B66275J10388j78840m316b13715l3882D73732A93976
10386A31573A6359O9624J34718l7586K1601I732J86183J59290H6782M1225m0191
10375H7816c4876B20982B0407J8843N13666i4181D37630j42590A35268a29401
10364E13008o6958n4460J42850j39585A07563K79503A01893K2503m3108J56710
$$ plain form
10444 -224870 -65467 66454 -285012 -79736 -52397 54737 -93561 168909 -171079 23918 -16561
10432 -344578 -252855 -129873 -428277 129974 -145042 -146038 -149598 -315586 -88881 -303223 91367
10420 131349 -174802 52460 28158 -354680 -125631 -207012 -142747 -74850 -249044 -77919 -297846
10409 -297846 -312922 534185 -262882 -175044 102408 -34908 -248174 193409 233306 -31079
10398 69531 59247 -174266 -214613 266275 376663 197823 193507 -213715 -247597 473732 193976
10386 131573 16359 85983 220701 183115 204716 9732 195915 355205 86782 128007 87816
10375 87816 -34876 220982 20407 39250 552916 -94181 437630 295040 135268 -129401
10364 513008 446050 391590 534440 394855 107563 387066 101893 124396 81288 237998
10354B37998J5691P9634e5269E29419j9560J82733j55070k144o9543C8295K09634
10343B47929H7678L37674j68190l1212A4238J77190a10395B36466h6446A87889
10332A73608q3172d6123A29358J452d6265A11994E5835c13075D26517j20611A40631
10320e1183B54294m7609j00181d5795A78359J35220o7842a0091B51984c5390A46383
10308B33461H154a5991H3049b05465a2450k39898A97802K4948a66057O9001M8521
10297d8535j39104j8569O7605N1661A84714a44735J46B26319f4755k24133F3244
10285A51852b2589j5280A9919a12703d7213j02875a0421G0719B3827R2993m531
10274A12289q599a89772N5501J0961h713C14929b02452A3280e8340A00252J21081
$$ plain form
10354 237998 253689 333323 -55269 529419 509859 692592 537522 535378 465835 38295 247929
10343 247929 87678 425352 257162 225950 14238 191428 -110395 236466 -86446 187889
10332 173608 90436 -46123 129358 130810 -46265 111994 55835 -313075 426517 305906 140631
10320 -51183 254294 206685 106504 -45795 178359 313579 245737 -10091 251984 -35390 146383
10308 233461 8154 -15991 83049 -205465 -12450 -252348 197802 222750 -166057 -97056 -48535
10297 -48535 -187639 -206208 -138603 -86942 184714 -144735 -144589 226319 -64755 -288888 63244
10285 151852 -22589 -37869 19919 -112703 -47213 -150088 -10421 70719 23827 116820 112289
10274 112289 103690 -189772 -134271 -123310 -8713 314929 -202452 13280 -58340 100252 221333
10263B21333d2329j42842B44204q0994F3797a97521D70067A2189Q0571R4366J4126
10252B01252B8768J77041P3713l3752b27859A13401i5200B9946e2877n2098H2336
10240a57517j28552r8983J54407k6083J17566e1512o2521l441A53933r29J48427
10229C01431a2464A36360b42998j46037A65029O8749I6152e10161A49205h552
10218b99334r8458Q9486J28592Q5767C22718b90708B38491a1991A27363L2550
10208A59913A487a0338k5147F4516i8561J7369j08622p8304Q3566G7585c3310
10196g9056A27292b2292D4907c3592k03438J2254F9533b07027A31412j1254c31007
10184d5015F995a88761c5057A9687b44374A00031a41818L8597j73202M1672B941
$$ plain form
10263 221333 -42329 -185171 244204 163210 63797 -197521 470067 12189 92760 187126 201252
10252 201252 28768 205809 279522 245770 -227859 113401 -95200 29946 -52877 -104975 82336
10240 -157517 -286069 -385052 -230645 -256728 -139162 -51512 -114033 -117474 153933 153004 301431
10229 301431 -12464 136360 -242998 -389035 165029 233778 96152 -510161 149205 -8552
10218 -299334 -397792 -308306 -179714 -93947 322718 -290708 238491 -11991 127363 159913
10208 159913 1487 -10338 -35485 64516 -98561 -81192 -189814 -268118 -184552 77585 -33310
10196 -79056 127292 -22292 44907 -33592 -237030 -224776 69533 -207027 131412 120158 -331007
10184 -45015 6995 -188761 -35057 19687 -244374 100031 -141818 -103221 -276423 -234751 2941
10172A51859J69472a48186C4662b01173A0697b67410q4726a12668B1869a08574
10161b52412e7766k0677o9068A09102B2817a16310A6469d6720o5277L1821l22812
10150d02988J86576B33830A14411a48335i146A12537a08401k73901O2694a39549
10139d8988J7753j70492f6808j0085D20159a19015M4288C58989h1720c7087k01738
10128b38825a5971n9813n9327A70462a15391C324J16748f9859A7056b76477N5921
10117b20556E9620Q9460b72816g6844j47240A04001D5493F097R2441M3290j0661
10106A31167K75810a4371A18250E0622a39203A44414p1216R8925a17049p1367
10096a88416b3893j84354o4392c1330C69269b24348B55819b82987B6739j0938
$$ plain form
10172 151859 321331 -148186 34662 -201173 10697 -267410 -352136 -112668 21869 -108574
10161 -252412 -57766 -78443 -147511 109102 22817 -116310 16469 -46720 -111997 -80176 -402988
10150 -402988 -216412 233830 114411 -148335 -9146 112537 -108401 -382302 -319608 -139549
10139 -48988 -31235 -201727 -66808 -76893 420159 -119015 -74727 358989 -81720 -37087 -238825
10128 -238825 -15971 -75784 -135111 170462 -115391 3324 120072 -69859 17056 -276477 -220556
10117 -220556 59620 149080 -272816 -76844 -224084 104001 45493 6097 98538 141828 131167
10106 131167 406977 -14371 118250 50622 -139203 144414 73198 172123 -117049 -188416
10096 -188416 -23893 -208247 -272639 -31330 369269 -224348 255819 -282987 26739 15801
10086A5801h8835L4810a6417E5871N8118b79357n5868C20120a9743k48104b9374
10074i6376l8039d1323F9525Q1723a41184A41359a46177C10747o0602g7122j60397
10063b37519b0916A70936a51818B67117b38151J13348A76160l0032g3496A59194
10052b22254L6192q5973G876b82664f5851B1549K18104A09349g129D228c2624
10040d16066J97452d4124m18022C1277a97414B579L53240a58209O1962G5748f6953
10028a95412g478D2448j8071a99903E1808R2296c5234j52389e4549m4531a386
10016e0755j67903f0879k63414e8494j49910B3846A1684a08814j15547L5442q3264
10005b72183F917a10577d3624k77057A01790f8036p3655k1022i746n3015j72294
$$ plain form
10086 15801 -88835 -54025 -16417 55871 113989 -279357 -335225 320120 -19743 -267847 -29374
10074 -96376 -134415 -41323 69525 151248 -141184 141359 -146177 310747 250145 -77122 -237519
10063 -237519 -20916 170936 -151818 267117 -238151 -124803 176160 146128 -73496 159194
10052 -222254 -186062 -272035 7876 -282664 -65851 21549 239653 109349 -7129 4228 -32624
10040 -416066 -218614 -44124 -462146 31277 -197414 2579 355819 -158209 -96247 75748 -66953
10028 -195412 -7478 42448 24377 -199903 51808 144104 -35234 -187623 -54549 -99080 -1386
10016 -50755 -218658 -60879 -324293 -58494 -208404 23846 11684 -108814 -224361 -188919 -272183
10005 -272183 6917 -110577 -43624 -320681 101790 -68036 -141691 -162713 -9746 -62761 -235055
9994b35055A09326c9825q6946A27731h0087o3105E7676J93136l1472o5199C2366
9982h6376K5049l8509m2958K2667d4127r0004O6920A00618a53468k6251d2563
9970b9997l17450a21073H5692a94756B1003a81182a9474A88139A0957g4749c0974
9958C6405c21709j24427a35282c525A46745B9504b1561A19033l6615L7196c2679
9946B14671a40224K5807j89516R5011A76856C4694K20037g5602B5665a4557k43222
9935b57779B8195c6258j67646L6569A87403g6963k77557P6900G4012a60837E2441
9923a20138E461a56085A07619a19471l0662N0426J1500j28050C6924J55232b20586
9911a16053q8612Q3980H1798i1054j36613A94409c958C8586f3946A4582c90655
$$ plain form
9994 -235055 109326 -39825 -126771 127731 -80087 -143192 57676 250812 219340 154141 32366
9982 -86376 -61327 -99836 -142794 -120127 -44127 -134131 -67211 100618 -153468 -179719 -42563
9970 -29997 -347447 -121073 85692 -194756 21003 -181182 -19474 188139 10957 -74749 -30974
9958 36405 -321709 -446136 -135282 -3525 146745 29504 -21561 119033 82418 119614 -32679
9946 214671 -140224 -114417 -303933 -208922 176856 34694 254731 -75602 25665 -14557 -257779
9935 -257779 28195 -36258 -203904 -167335 187403 -76963 -354520 -277620 74012 -160837 52441
9923 -120138 5461 -156085 107619 -119471 -150133 -99707 -88207 -216257 36924 192156 -220586
9911 -116053 -204665 -120685 81798 -91054 -227667 194409 -3958 38586 -63946 14582 -390655
9899D2297A8612a45517c6937Q666l4491A36294j7458a17058H7650a51792j46572
9888b98364A59190o7221B9277J65728I3569i3170j35773J00327B515g1983B3896
9876A29422C4371R1501a60567G4392J73040a48412O1696m6841p277N051k08058
9865c43841B8263g7162l02750A20568l2419Q4366a36881A91831B2099Q3082b54261
9853A41864d215k42202a22073d6706k45836C275b95412L9158A91700d12430H4505
9841c58222R9059r1519i4320I1478g4838I5105f4897k15698a25969l29693e9953
9829a36041A91960h1981A13168e5710h475C05735c78418f7754o4907E0041c06702
9817b89984B80522f1470A0835a00125j85494e1758j16763B53148A09541e636A19232
$$ plain form
9899 42297 18612 -145517 -36937 -28271 -62762 136294 118836 -117058 87650 -151792 -298364
9888 -298364 159190 91969 29277 195005 93569 -93170 -228943 -128616 2515 -71983 23896
9876 129422 34371 125872 -160567 74392 247432 -148412 -86716 -133557 -140834 -135783 -343841
9865 -343841 28263 -77162 -379912 120568 88149 172515 -136881 191831 22099 105181 -254261
9853 141864 -4215 -246417 -122073 -46706 -292542 3275 -295412 -256254 191700 -412430 84505
9841 -358222 -259163 -350682 -94320 91478 -74838 95105 -64897 -280595 -125969 -455662 -59953
9829 -136041 191960 -81981 113168 -55710 -8475 305735 -378418 -67754 -132661 50041 -306702
9817 -289984 280522 -61470 10835 -100125 -285619 -51758 -168521 253148 109541 -5636 119232
9805a24755j4968q0939j46968d8618l0108l7394A89908a69617O8671c9871m6829
9794h6700l06941f9964G2743e8810A18825c1056p8781B03623d802j35393f5744
9782A22881h7666C68g2214D7018L7974a87451M9668f2173F7093C1832P9799b25517
9769C10331C4995c2549p1274K1456A50211b16896j5239F5776b51353Q1773j55198
9758c24778i4145k03728A79006e012p7516A01891a44592F3007b29314k491F450
9746H6000c19940R4443f3958G256b03406l7076d2236D8699K18972b9892j27722
9735a57614j31186J39924e3042j76842A04529a0103A28633A6941a14385c9051
9724A4326J32790b52729n0190B27761B6479d2240k05406b1335j65946K1001b4547
$$ plain form
9805 -124755 -139723 -220662 -367630 -48618 -78726 -116120 189908 -169617 -100946 -39871 -86700
9794 -86700 -393641 -69964 72743 -58810 118825 -31056 -109837 203623 -4802 -140195 -65744
9782 122881 -87666 368 -72214 47018 84992 -187451 -137783 -62173 67093 31832 111631 -225517
9769 310331 34995 -32549 -103823 -82367 150211 -216896 -232135 65776 -251353 -169580 -324778
9758 -324778 -94145 -297873 179006 -5012 -82528 101891 -144592 63007 -229314 -231805 6450
9746 86000 -319940 -225497 -63958 7256 -203406 -240482 -42236 48699 267671 -29892 -157614
9735 -157614 -288800 -148876 -53042 -229884 104529 -10103 128633 16941 -114385 -39051
9724 14326 147116 -252729 -302919 227761 26479 -42240 -247646 -21335 -187281 -166280 -24547
9712b42908L5741r9731i9035L3990P180j15182G1035k1675b42742B2641P0575
9701I3216P1418Q4277a67131j48203k7705a37340j95208B35180b79223h6159H9435
9689A97317b63106A44048b03965C42224d6711j1428C52924H8967a47205M7713
9679i9492C6188c4302j35559D6277a53748E5584c82791J02861A24593J50187d9051
9667B254b39617q7239I703J86238a16615B08255h938o4885B05478a31995A70812
9655g4013D0356J19823J54675b26730J00141a1177k3509j09353L9039j6909k29972
9644c51881a2740B61780i8446J493R684l9337b1371A62103b72538k6407h1066
9632a46433B1873c10123Q7380Q3338N919N9523l14437H6181c43581A31516m0936
$$ plain form
9712 -242908 -207167 -306898 -99035 -65045 -57865 -173047 71035 49360 -242742 22641 93216
9701 93216 164634 248911 -167131 -315334 -343039 -137340 -332548 235180 -279223 -86159 89435
9689 197317 -263106 144048 -203965 342224 -46711 -58139 352924 88967 -147205 -99492
9679 -99492 36188 -34302 -169861 46277 -153748 55584 -382791 -279930 124593 274780 -49051
9667 2254 -239617 -326856 9703 195941 -116615 208255 -8938 -73823 205478 -131995 170812
9655 -74013 40356 160179 314854 -226730 -126589 -11177 -34686 -144039 -105000 -121909 -351881
9644 -351881 -12740 261780 -98446 -96953 -87269 -126606 -21371 162103 -272538 -298945 -81066
9632 -146433 21873 -310123 -222743 -139405 -133486 -73963 -388400 86181 -343581 131516 90580
9621I0580a98074A81991l7915a52034C9682K18646h1750j45247k0963h2899j50147
9610b33046E4533K00565d03463A01970e2598A43956b2237n2598E2144c30197J24830
9599b05367R2536a2122A54946b67648f2834m9925j19454l3552M185c2351o0214
9588i2565B94509B2562N4345A080c56455c5591j38797k59777E0551M8704l9888
9577E9367a76602q114d0677j21223e9401k29838J26586q8805E7226b56976B83454
9565A2474b59436O2586O6472k47718L967B9232J39901q2129a73509A27477F0100
9553c18975D9177f4515j89575I57d4356a7516j39669b3125A12783d08060a38484
9541b21627j74117b7467A53392d0162j39504I5148b8560F5653J24803f6026j18257
$$ plain form
9621 90580 -198074 181991 144076 -152034 39682 258328 -81750 -226997 -247960 -82899 -233046
9610 -233046 54533 255098 -403463 101970 -52598 143956 -22237 -74835 52144 -330197 -205367
9599 -205367 -112831 -12122 154946 -267648 -62834 -112759 -232213 -265765 -261580 -32351 -92565
9588 -92565 294509 22562 76907 1080 -356455 -35591 -174388 -434165 50551 99255 59367
9577 59367 -176602 -184716 -40677 -161900 -59401 -289239 -162653 -251458 57226 -256976 283454
9565 12474 -259436 -196850 -130378 -378096 -374129 29232 169133 87004 -173509 127477 60100
9553 -318975 49177 -64515 -254090 957 -44356 -17516 -157185 -23125 112783 -408060 -138484
9541 -221627 -395744 -27467 153392 -40162 -179666 95148 -28560 65653 190456 -66026 -184283
9530a84283C4780N1363b15431O9785A1626a55288G5796a03550k19034J13548d5323
9518g7183c916G4837A9764b15443J0340B1682J50634i0826d0756B3300M8046J59673
9506B31019h5668j55283C3812L7769c7449I9065J11167g9332l70534a14909A37238
9494a42765L9596G7814l7317A3327a45482D62028i6630A0203P8803B1618J16260
9483A37878N2248b3924B54334j13163a84026q6088g6572j1709a5746C6084b31021
9471a56577j36812P191f7200F5923a2568m5322k1101j89663a843j56065M2689
9460a15219D3142N9382o598b97539g0127j72248b6228A63109a8593m21825F7981
9448B35136c37961O7930J17693h762p1107j19409Q0535c351o7698A91668i6472
$$ plain form
9530 -184283 34780 86143 -215431 -145646 11626 -155288 75796 -103550 -322584 -209036 -45323
9518 -77183 -3916 74837 19764 -215443 -205103 21682 172316 -90826 -40756 23300 71346 231019
9506 231019 -85668 -240951 33812 71581 -37449 99065 210232 -79332 -449866 -114909 137238
9494 -142765 -103169 77814 40497 13327 -145482 462028 -96630 10203 89006 21618 137878
9483 137878 190126 -23924 254334 141171 -184026 -270114 -76572 -88281 -15746 36084 -231021
9471 -156577 -293389 -286198 -67200 65923 -12568 -57890 -78991 -268654 -1843 -157908 -115219
9460 -115219 43142 102524 95926 -297539 -70127 -242375 -26228 163109 -18593 -440418 67981
9448 235136 -337961 -270031 -152338 -8762 -79869 -199278 -118743 -3351 -71049 191668 -96472
9436b23417A17640a78666a6665o0753j37105O995N1463k8567E5549J3722J38715
9425B07986a51801A22330b64485B88226d7981A19789a43326A33430e9882A04320
9414c96232A88705B787g303j54294B1453Q2587a18115j301A4451J69197a34380
9402b31751F6633j6470K8983a76403L7147O2156b4973C43050n8819b27793D6829
9390E392L86845A82960b06617e0144C22010a41063N6592j06803I4886N3648i1078
9378b25224B9338K22208C6687e9408p5693a3415A78416g9341k56b9542a3828C0623
9365B12133b31919l5917a8630j20532M1918a3416D4854b08986B07982h1453A15893
9353c0171j73335a6781n0961j77015C2403a68636E600c3410l01183p1800I1088
$$ plain form
9436 -223417 117640 -178666 -16665 -77418 -214523 -207528 -156065 -184632 55549 69271 207986
9425 207986 -151801 122330 -264485 288226 -47981 119789 -143326 133430 -59882 104320
9414 -396232 188705 2787 -7303 -161597 21453 104040 -118115 -119416 14451 183648 -134380
9402 -231751 66633 50163 79146 -176403 -139256 -77100 -24973 343050 284231 -227793 46829
9390 5392 392237 182960 -206617 -50144 322010 -141063 -84471 -191274 94886 148534 -91078
9378 -225224 29338 251546 36687 -59408 -135101 -13415 178416 -79341 -79597 -29542 -13828 30623
9365 212133 -231919 -267836 -18630 -139162 -97244 -13416 44854 -208986 207982 -81453 115893
9353 -30171 -203506 -16781 -67742 -244757 32403 -168636 5600 -33410 -334593 -406393 91088
9341b31609q3828J1005e6758j72845C1031b27371i9585B36404c04141C957b45163
9329b8058F3012b00584B28921b4188A46112K2209g0257a9680o5180A13479d55159
9317i2295p8451j95033C1122j2151J66259C8164O69h3837B1267c02227D6368c73080
9304a43491B7797a28969J7816j07251k0898G4313a60825g932q7842j16299A4924
9292a79375A21591g357m05810A91180G469a50183D3529g9734H24h1810l4618A977
9279A37166a03128D875K6166c06127K831A81446a02534r4515B4980J73634a20924
9267h5500K3137E6786g138A52381I578M4062f7591A40255a98396A687Q6783g3803
9254a42019C3662L44775b78417g0979A51259j7945C9101b21118B94957A13836
$$ plain form
9341 -231609 -315437 -304432 -56758 -229603 31031 -227371 -99585 236404 -304141 3957 -245163
9329 -28058 63012 -200584 228921 -24188 146112 168321 -70257 -19680 -84860 113479 -455159
9317 -92295 -170746 -365779 31122 18971 185230 38164 38833 -83837 21267 -302227 46368 -373080
9304 -143491 27797 -128969 -111153 -218404 -239302 74313 -160825 -7932 -95774 -212073 14924
9292 -179375 121591 -7357 -413167 191180 7469 -150183 43529 -79734 824 -81810 -116428 1977
9279 137166 -103128 4875 31041 -306127 -303296 181446 -102534 -197049 24980 198614 -120924
9267 -85500 -62363 56786 -7138 152381 9578 53640 -67591 140255 -198396 1687 88470 -73803
9254 -142019 33662 378437 -278417 -70979 151259 133314 39101 -221118 294957 113836
9243c86188A39031a4764m04460q8059I9499g3673A00859a65273m0997c2850j32642
9232a65492A94159h4056B18310b09153A23499a9417j10391l1461A6285g0258A84967
9220F0101A077M3915b41086A95010a68006H295K69427b50973C0035a9562l1318
9209e0880j0128A84545b38819O1548N3810j54745Q4474b0835E1320b18545F6137
9197B58462A3659a40820H7180c11679J23074a9470F4587c7601j6331E1620K4021
9186G5641J93464c96603a69940k06342a43032A3174g1669A3942b01666B21052
9175B04516p9406b5319B37112c08070c6506H082b09386M3575E4510p268a05840
9163a85512p6116b0171j0415j11732i452n18424A34448a36287r5888A30113i9704
$$ plain form
9243 -386188 139031 -14764 -419224 -507283 99499 -73673 100859 -165273 -206270 -32850 -165492
9232 -165492 194159 -84056 218310 -209153 123499 -19417 -129808 -161269 16285 -70258 184967
9220 60101 1077 44992 -241086 195010 -168006 8295 277722 -250973 30035 -19562 -50880
9209 -50880 -61008 184545 -238819 -177271 -123461 -278206 -193732 -20835 51320 -218545 66137
9197 258462 13659 -140820 87180 -311679 -188605 -19470 64587 -37601 -53932 51620 75641
9186 75641 269105 -396603 -169940 -376282 -143032 13174 -71669 13942 -201666 221052
9175 204516 125110 -25319 237112 -308070 -36506 8082 -209386 -165811 54510 47242 -105840
9163 -185512 -261628 -20171 -30586 -142318 -9452 -527876 134448 -136287 -232175 130113 -99704
9151A10331a408C1576G900K8284e2259I5634f7103k52273B92511a91105B62607
9139a73334e362k03655k8113B5705J7162a20082D37989A35282b79435g0659a2284
9127c179n0453A36523b11325B21607J21423E4649b47387d5629A60435m5878j3365
9116A01192a16753F1050J26411b3769k67393L4897a20011D206N15f2903j98044
9105b60947g0465q7640A01299D2472K7668d0565A81201a59408j70650O8447A44841
9093A001b73631o952d8173k09608n1680L1471B4164i0455q1683A3080J40305l1179
9081A22206c66951i5304o7579K0063j06368K6565A67821a02183o1772j7099H4054
9069a70047B2240a76064P7544B10722b7492q4226K0412I4717D5710b60081e8554
$$ plain form
9151 110331 -1408 31576 7900 36184 -52259 95634 -67103 -319376 292511 -191105 262607
9139 -173334 -5362 -209017 -237130 25705 42867 -120082 437989 135282 -279435 -70659 -12284
9127 -3179 -53632 136523 -211325 221607 343030 54649 -247387 -45629 160435 114557 101192
9116 101192 -116753 61050 187461 -23769 -291162 -256265 -120011 4206 4721 -62903 -260947
9105 -260947 -70465 -158105 101299 42472 70140 -40565 181201 -159408 -330058 -261611 144841
9093 1001 -273631 -280583 -48173 -257781 -309461 -277990 24164 -90455 -172138 13080 153385 122206
9081 122206 -366951 -95304 -162883 -142820 -249188 -222623 167821 -102183 -163955 -181054 84054
9069 -170047 22240 -176064 -98520 210722 -27492 -111718 -91306 94717 45710 -260081 -58554
9057B2781r865b57750R1604q0167C08106C7826l470c2534k26624j4701i2580m5227
9045a37807N0876r5886c8997B5594b98371d2344I1769b6902j16713A4562c1970
9033C3861L0688b7134A07332h2259j89788D5373i627B78048M769e6194j4627A27253
9020A67816i4291j35476D5499L94676A5158a70125e6841A92664b9386H1546b06621
9008C34634B1984d4967k26597a27267F4753c476j35394N6263j25793A73159F447
8996A18645a45490B28776C6714N6759b71017a20619j5361c6575B01909g6453j5648
8985i2101E9957c04753A98273q2420J5403a80909k57127a01564p9503B79862a57894
8973a41130A81081L1033A7930B055g7964j11984k42131P6937K3252B8259J09687
$$ plain form
9057 22781 12916 -257750 -166146 -246313 308106 37826 34356 -32534 -259158 -273859 -92580 -137807
9045 -137807 -86931 -182817 -38997 25594 -298371 -42344 91769 -26902 -143615 14562 -31970
9033 33861 64549 -27134 107332 -82259 -272047 45373 -9627 278048 282817 -56194 -70821 127253
9020 167816 -94291 -229767 45499 440175 15158 -170125 -56841 192664 -29386 81546 -206621
9008 334634 21984 -44967 -271564 -127267 64753 -3476 -138870 -82607 -208400 173159 6447
8996 118645 -145490 228776 36714 93473 -271017 -120619 -135980 -36575 201909 -76453 -92101
8985 -92101 59957 -304753 198273 115853 131256 -180909 -438036 -101564 -181067 279862 -157894
8973 -141130 181081 212114 17930 2055 -77964 -189948 -432079 -355142 -331890 28259 137946
8962A37946a54533B33486a4849k75516A86522J83654i1942k31954B056a31956
8951a43204l86572A7547e9254j65612c2081A77957e3743F5475b62224B20943b69605
8939h947j60614j95736h889p4089A23078j5301J5828d6671I3163b12816A17609
8927D9240e6717C2073P8876j428K15850O80J826612J11883H65221A93476a34312
8915G5438O0545f3520B50519h6000j74037a29288n9719I0355a28722B53166b64440
8903A18374m0013g1644k74012a2233o1099l04446J02591A20343J1487c8093k66642
8892c04735d3205l8333G5728i856j2281A22741a8098B8116O3957J85255a35226
8880A62294c0259j80225c6604A83695a63662L9458f0275j31261f9060j13615Q7550
$$ plain form
8962 137946 -154533 233486 -14849 -290365 186522 370176 -91942 -323896 2056 -131956
8951 -143204 -529776 17547 -59254 -224866 -32081 177957 -53743 65475 -262224 220943 -269605
8939 -8947 -169561 -365297 -8889 -82978 123078 107777 123605 -46671 93163 -212816 117609
8927 49240 -56717 32073 110949 109521 325371 326051 2152663 2264546 865221 193476 -134312
8915 75438 135983 -63520 250519 -86000 -260037 -129288 -189007 90355 -128722 253166 -264440
8903 118374 78361 -71644 -345656 -12233 -73332 -377778 -275187 120343 131830 -38093 -304735
8892 -304735 -43205 -81538 75728 -9856 -22137 122741 -18098 28116 92073 277328 -135226
8880 162294 -30259 -210484 -36604 183695 -163662 -124204 -60275 -191536 -69060 -182675 -95125
8869i5125K7754E2329A1266a40353l6305O2915a6183k23010A66502b40408d1417
8857e4682b3184A881b52779G373c36333e5729q9846B46544f7275o3784j09231
8846b40290R7872N9770J3256q9997A97267A9253c949j13634A37220a81644c1151
8834B11049b51952H0175f1368k16465P1862A93759I5278l2324g8598A06520c8640
$$ plain form
8869 -95125 -67371 52329 11266 -140353 -176658 -113743 -16183 -239193 166502 -240408 -41417
8857 -54682 -23184 1881 -252779 7373 -336333 -55729 -145575 246544 -67275 -131059 -240290
8846 -240290 -142418 -82648 -69392 -159389 197267 19253 -3949 -117583 137220 -181644 -31151
8834 211049 -251952 80175 -61368 -277833 -205971 193759 95278 62954 -78598 106520 -38640
$$ [...]
##END NTUPLES=NMR SPECTRUM
##END=
