##TITLE=NES1066_Nhol10911_9883663_4HlQrt3YVF
##JCAMPDX= 6.0         $$ Bruker NMR JCAMP-DX V2.0
##DATA TYPE= NMR SPECTRUM
##DATA CLASS= NTUPLES
##ORIGIN= BRUKER
##OWNER= Administrator
$$ 1.72 TOPSPIN		Version 2.1
$$ 2016-08-26 19:54:11.789 -0500  Administrator@X
$$ Compression mode = diff/dup
##.OBSERVE FREQUENCY= 400.02188249412
##.OBSERVE NUCLEUS= ^1H
##.ACQUISITION MODE= SIMULTANEOUS (DQD)
##.ACQUISITION SCHEME= undefined
##.AVERAGES= 64
##.DIGITISER RES= 22
##SPECTROMETER/DATA SYSTEM= spect
##.PULSE SEQUENCE= noesygpps1d.comp
##.SOLVENT NAME= COFFEE_meoh
##.SHIFT REFERENCE= INTERNAL, COFFEE_meoh, 1, 14.96163
##AUDIT TRAIL= $$ (NUMBER, WHEN, WHO, WHERE, PROCESS, VERSION, WHAT)
$$ ##TITLE= Audit trail, TOPSPIN		Version 2.1
$$ ##JCAMPDX= 5.01
$$ ##ORIGIN= Bruker BioSpin GmbH
$$ ##OWNER= Administrator
$$ $$ E:\/data/COFFEE/nmr/NES1066_Nhol10911_9883663_4HlQrt3YVF/22/pdata/1/auditp.txt
$$ ##AUDIT TRAIL=  $$ (NUMBER, WHEN, WHO, WHERE, PROCESS, VERSION, WHAT)
(   1,<2016-08-26 19:54:06.586 -0500>,<Administrator>,<X>,<go>,<TOPSPIN 2.1>,
      <created by zg
	started at 2016-08-26 19:42:36.851 -0500,
	POWCHK enabled, PULCHK disabled,
       configuration hash MD5:
       21 0F 79 D6 B3 7B B4 F6 88 20 88 DB 03 48 BD 9F
       data hash MD5: 64K
       AE 2D 9E 65 39 5E 6F BA BD 80 0F 6A B7 A1 63 30>)
(   2,<2016-08-26 19:54:09.726 -0500>,<Administrator>,<X>,<proc1d>,<TOPSPIN 2.1>,
      <Start of raw data processing
       efp LB = 0.3 FT_mod = 6 PKNL = 1 PHC0 = 0 PHC1 = 0 SI = 128K 
       data hash MD5: 128K
       11 D8 0D E7 75 67 45 15 FE 0C 9B 73 E6 D2 30 F3>)
(   3,<2016-08-26 19:54:10.586 -0500>,<Administrator>,<X>,<proc1d>,<TOPSPIN 2.1>,
      <pk PHC0 = -88.25867 PHC1 = 0 
       data hash MD5: 128K
       8B E2 B0 AA D4 FE 6B EF A9 7A 61 AB 78 BD 63 83>)
(   4,<2016-08-26 19:54:10.961 -0500>,<Administrator>,<X>,<proc1d>,<TOPSPIN 2.1>,
      <abs ABSG = 1 
       data hash MD5: 128K
       10 62 95 E1 C8 47 6E 90 F1 89 4B BA 91 97 8F 82>)
(   5,<2016-08-26 19:54:11.054 -0500>,<Administrator>,<X>,<proc1d>,<TOPSPIN 2.1>,
      <abs ABSG = 2 
       data hash MD5: 128K
       E3 2B B8 21 8E 73 F3 EC A9 F7 0D 13 48 93 FD D5>)
(   6,<2016-08-26 19:54:11.148 -0500>,<Administrator>,<X>,<proc1d>,<TOPSPIN 2.1>,
      <abs ABSG = 3 
       data hash MD5: 128K
       EE 2B CC 4D E8 BC 4B FA A9 51 B3 86 F4 4D A5 0F>)
(   7,<2016-08-26 19:54:11.242 -0500>,<Administrator>,<X>,<proc1d>,<TOPSPIN 2.1>,
      <abs ABSG = 4 
       data hash MD5: 128K
       FE 1E 3D BD B7 BA F5 6A 17 D9 98 B6 C4 D3 ED 01>)
(   8,<2016-08-26 19:54:11.367 -0500>,<Administrator>,<X>,<proc1d>,<TOPSPIN 2.1>,
      <abs ABSG = 5 
       data hash MD5: 128K
       CD CF 66 EC 44 2F 2B A6 6F F2 CB 80 A0 E8 44 76>)
$$ ##END=
$$ 
$$ $$ hash MD5
$$ $$ 19 79 96 CE C7 C7 BA 06 B4 1F C1 0C 62 72 D3 E3
##$RELAX= 
##$RELAX= 
##$RELAX= 
##$RELAX= 
##$RELAX= 
##$RELAX= 
##$RELAX= 
##$RELAX= 
$$ Bruker specific parameters
$$ --------------------------
##$DU= <E:\>
##$EXPNO= 22
$$ [...]
##$TP07= 0
##$TPNAME0= <>
##$TPNAME1= <>
##$TPNAME2= <>
##$TPNAME3= <>
##$TPNAME4= <>
##$TPNAME5= <>
##$TPNAME6= <>
##$TPNAME7= <>
##$TPOAL= (0..7)
0.5 0.5 0.5 0.5 0.5 0.5 0.5 0.5
##$TPOFFS= (0..7)
0 0 0 0 0 0 0 0
##$TUNHIN= 0
##$TUNHOUT= 0
##$TUNXOUT= 0
##$USERA1= <user>
##$USERA2= <user>
##$USERA3= <user>
##$USERA4= <user>
##$USERA5= <user>
##$V9= 5
##$VALIST= <valist>
##$VCLIST= <CCCCCCCCCCCCCCC>
##$VD= 0
##$VDLIST= <DDDDDDDDDDDDDDD>
##$VPLIST= <PPPPPPPPPPPPPPP>
##$VTLIST= <TTTTTTTTTTTTTTT>
##$WBST= 2048
##$WBSW= 25
##$XGAIN= (0..3)
0 0 0 0
##$XL= 0
##$YL= 0
##$YMAX_a= 6928960
##$YMIN_a= -12314886
##$ZGOPTNS= <>
##$ZL1= 120
##$ZL2= 120
##$ZL3= 120
##$ZL4= 120
##$ABSF1= 14.96163
##$ABSF2= -5.596552
##$ABSG= 5
##$ABSL= 3
##$ALPHA= 0
##$AQORDER= 0
##$ASSFAC= 0
##$ASSFACI= 0
##$ASSFACX= 0
##$ASSWID= 0
##$AUNMP= <proc_prof1d_extract.lims>
##$AXLEFT= 0
##$AXNAME= <>
##$AXNUC= <1H>
##$AXRIGHT= 0
##$AXTYPE= 0
##$AXUNIT= <>
##$AZFE= 0.1
##$AZFW= 0.1
##$BCFW= 0
##$BC_mod= 0
##$BYTORDP= 0
##$COROFFS= 0
##$CY= 15
##$DATMOD= 1
##$DC= 0
##$DFILT= <>
##$DTYPP= 0
##$F1P= 0
##$F2P= 0
##$FCOR= 0.5
##$FTSIZE= 131072
##$FT_mod= 6
##$GAMMA= 0
##$GB= 0
##$INTBC= 1
##$INTSCL= 1
##$ISEN= 128
##$LB= 0.3
##$LEV0= 0
##$LPBIN= 0
##$MAXI= 10000
##$MC2= 0
##$MEAN= 0
##$ME_mod= 0
##$MI= 0
##$NCOEF= 0
##$NC_proc= -2
##$NLEV= 6
##$NOISF1= 0
##$NOISF2= 0
##$NSP= 0
##$NTH_PI= 0
##$NZP= 0
##$OFFSET= 14.96163
##$PC= 1
##$PHC0= -88.25867
##$PHC1= 0
##$PH_mod= 1
##$PKNL= yes
##$PPARMOD= 0
##$PPDIAG= 0
##$PPIPTYP= 0
##$PPMPNUM= 2147483647
##$PPRESOL= 1
##$PSCAL= 4
##$PSIGN= 0
##$PYNMP= <proc.py>
##$REVERSE= no
##$SF= 400.020009383806
##$SI= 131072
##$SIGF1= 0
##$SIGF2= 0
##$SINO= 400
##$SIOLD= 131072
##$SPECTYP= <>
##$SREGLST= <1H.CDCl3>
##$SSB= 0
##$STSI= 131072
##$STSR= 0
##$SW_p= 8223.68421052631
##$SYMM= 0
##$S_DEV= 0
##$TDeff= 65536
##$TDoff= 0
##$TI= <>
##$TILT= no
##$TM1= 0
##$TM2= 0
##$TOPLEV= 0
##$USERP1= <user>
##$USERP2= <user>
##$USERP3= <user>
##$USERP4= <user>
##$USERP5= <user>
##$WDW= 1
##$XDIM= 131072
##$YMAX_p= 372830232
##$YMIN_p= -11478
##$CURPLOT= <Network HP LaserJet P1505>
##$CURPRIN= <$Network HP LaserJet P1505>
##$DFORMAT= <normdp>
##$LAYOUT= <+/1D_H.xwp>
##$LFORMAT= <normlp>
##$PFORMAT= <normpl>
##$SURQMSG= 1
$$ End of Bruker specific parameters
$$ ---------------------------------
##NTUPLES= NMR SPECTRUM
##VAR_NAME=  FREQUENCY,     SPECTRUM/REAL,   SPECTRUM/IMAG
##SYMBOL=    X,             R,               I
##VAR_TYPE=  INDEPENDENT,   DEPENDENT,       DEPENDENT
##VAR_FORM=  AFFN,          ASDF,            ASDF
##VAR_DIM=   131072,        131072,          131072
##UNITS=     HZ,            ARBITRARY UNITS, ARBITRARY UNITS
##FACTOR=    0.0627417313425164, 1,          1
##FIRST=     8223.62146879497, 1772,         -56196
##LAST=      0,             5121,            -55930
##MIN=       0,             -11478,          0
##MAX=       8223.62146879497, 372830232,    0
$$ Real data points
##PAGE= N=1
##DATA TABLE= (X++(R..R)), XYDATA
$$ [...]
67710 41851 41846 41658 41305 40562 39421 38358 37883 38049 38600 39352 40171 40881 41530 42481 43830 44913 44935 44054 43271
67691 43271 43164 43285 43041 42615 42564 42858 42916 42433 41679 40942 40211 39590 39565 40461 41823 42750 42771 42135 41279 40445
67671 40445 39856 39841 40423 41011 40898 40058 39147 38746 38905 39470 40381 41408 41957 41618 40814 40472 40991 41845 42323
67652 42323 42335 42330 42676 43407 44356 45224 45590 45207 44346 43632 43404 43415 43270 43008 43081 43850 45216 46712 47815 48219
67632 48219 48005 47609 47491 47773 48196 48536 48961 49898 51544 53599 55523 56975 57949 58558 58858 58928 58958 59046 58978
67613 58978 58431 57462 56580 56187 56084 55738 54952 53987 53041 51977 50747 49782 49581 49967 50138 49616 48882 48772
67595 48772 49375 49829 49289 47882 46531 46017 46374 47117 47781 48229 48675 49522 50929 52427 53220 53094 52801 53198
67577 53198 54137 54645 54182 53238 52592 52400 52303 52054 51690 51333 51186 51507 52220 52686 52311 51359 50745 50998 51778
67558 51778 52463 52786 52755 52361 51608 50636 49620 48738 48299 48538 49130 49322 48878 48553 49130 50265 50821 50295 49323
67539 49323 48769 48873 49473 50454 51560 52179 51892 51107 50663 50825 51049 50823 50316 50030 50128 50353 50465 50505 50687
67520 50687 51247 52333 53846 55340 56245 56297 55745 55101 54745 54747 54979 55300 55603 55721 55432 54666 53644 52623
67502 52623 51607 50544 49847 50267 51910 53731 54481 54059 53440 53334 53468 53251 52553 51552 50394 49403 49177
67485 49177 49947 51128 52014 52662 53555 54590 55078 54733 54048 53573 53323 53082 52811 52568 52380 52368 52633 52882 52618
67466 52618 51909 51530 52013 52899 53336 53159 52980 53386 54429 55767 56957 57609 57639 57450 57657 58550 59802 60736
67448 60736 60879 60377 59844 59681 59672 59521 59622 60730 62791 64714 65578 65538 65201 64705 63929 63140 62709 62492 62119
67429 62119 61703 61589 61614 61363 61041 61289 62060 62451 61888 60829 60045 59770 59817 59994 60068 59759 59142 58720 58816 59190
67409 59190 59445 59464 59276 58899 58488 58227 57908 57104 55984 55403 55801 56647 57395 58320 59753 61058 61321 60760
67391 60760 60505 61021 61663 61900 62111 62794 63724 64376 64722 65067 65439 65659 65859 66410 67286 67903 67773 67145 66794
67372 66794 67158 67830 68044 67621 67174 67279 67680 67663 67118 66766 67211 68067 68344 67608 66557 66370 67546 69364
67354 69364 70553 70499 69768 69422 69953 70995 71896 72307 72257 71982 71769 71799 71975 72036 71902 71812 72087 72798 73716 74481
67334 74481 74813 74672 74256 73842 73630 73734 74159 74680 74910 74758 74722 75467 77153 79327 81384 82868 83446 83028
67316 83028 82013 81074 80541 80241 80047 80224 80982 81973 82510 82161 81005 79502 78355 78261 79414 81258 82945
67299 82945 84080 84897 85787 86831 87750 88141 87803 87012 86449 86724 87877 89393 90633 91279 91493 91724 92195
67282 92195 92524 92020 90520 88701 87428 87000 87241 88011 89156 90180 90540 90362 90368 90979 91913 92842 93992 95660
67264 95660 97476 98596 98527 97466 95956 94648 94280 95372 97647 100058 101660 102383 102783 103235 103632 103835
67248 103835 104086 104770 105865 106827 107113 106719 106149 105937 106362 107551 109581 112234 114781 116331 116493 115650 114510
67231 114510 113536 112826 112436 112632 113716 115620 117725 119285 120114 120719 121615 122673 123392 123666 123869 124187 124426
67214 124426 124608 125222 126478 127823 128727 129593 131123 133001 134033 133710 132851 132420 132464 132632 133025 133856 134710
67197 134710 134954 134730 134825 135605 136703 137743 138786 139917 141016 142151 143676 145623 147419 148582 149347 150175
67181 150175 150933 151033 150333 149472 149226 149854 151139 152821 154771 156852 158822 160482 161902 163376 165097 166908
67165 166908 168424 169402 169838 169827 169553 169425 169898 170980 172100 172753 173155 174022 175709 177786 179564 180875 182219
67148 182219 184132 186517 188656 189924 190424 190867 191849 193364 195011 196525 198027 199840 202130 204700 207100
67133 207100 208993 210372 211354 211907 211983 211880 212185 213236 214884 216863 219169 221840 224607 227006 228808 230192
67117 230192 231530 233139 235148 237440 239767 242035 244383 246926 249524 251963 254262 256636 259216 261971
67103 261971 264869 267969 271297 274716 277934 280664 282892 284998 287430 290207 292919 295290 297513 299879
67089 299879 302350 304694 306838 308812 310616 312453 314921 318542 323057 327555 331340 334436 337244 340011
67075 340011 342725 345284 347688 350176 353162 356830 360810 364443 367367 369700 371750 373841 376336 379464
67061 379464 383024 386548 389874 393341 397351 401949 406859 411742 416402 420988 425988 431730 437849 443579
67047 443579 448638 453494 458689 464265 470008 475857 481835 487864 493919 500085 506182 511618 515959 519517
67033 519517 523119 527420 532677 538925 545966 553296 560365 567000 573382 579684 585984 592485 599581 607568
67019 607568 616383 625581 634583 643059 651118 659041 666856 674479 682251 690867 700519 710600 720596 730867
67005 730867 741956 753428 764124 773514 782216 791087 800360 809846 819460 829282 839405 849889 860600
66992 860600 871064 880903 890518 900908 912621 925325 938597 952633 967698 983316 998589 1013139
66980 1013139 1027245 1041199 1055065 1069054 1083567 1098662 1113869 1128785 1143634 1159013 1175178
66969 1175178 1191774 1208263 1224510 1240936 1258055 1275835 1293620 1310834 1327637 1344702 1362357
66958 1362357 1380292 1398171 1416237 1435032 1454701 1474847 1495048 1515267 1535695 1556360 1577044
66947 1577044 1597475 1617492 1637075 1656307 1675325 1694277 1713346 1732766 1752698 1772987 1793130
66936 1793130 1812696 1831790 1850981 1870692 1890732 1910510 1929599 1948008 1965986 1983723 2001221
66925 2001221 2018330 2034906 2051039 2067138 2083622 2100408 2116733 2131645 2144778 2156676 2168349
66914 2168349 2180438 2192738 2204511 2215200 2224796 2233585 2241703 2249060 2255552 2261210 2266096 2270162 2273233
66901 2273233 2275161 2276062 2276389 2276558 2276388 2275085 2272014 2267425 2262258 2257284 2252635 2248062 2243255 2237836 2231320
66886 2231320 2223360 2213964 2203377 2191805 2179311 2165899 2151634 2136765 2121666 2106547 2091257 2075553
66874 2075553 2059633 2044121 2029396 2015060 2000164 1983886 1965947 1946653 1926769 1907217 1888616
66863 1888616 1870922 1853548 1835834 1817437 1798398 1778912 1759020 1738584 1717655 1696762 1676538
66852 1676538 1657014 1637512 1617392 1596720 1576067 1555837 1536035 1516569 1497500 1478983 1461057
66841 1461057 1443558 1426256 1409142 1392501 1376449 1360421 1343467 1325294 1306715 1288831 1271936
66830 1271936 1255516 1239101 1222746 1206770 1191321 1176258 1161212 1145849 1130286 1115164 1100999
66819 1100999 1087494 1073836 1059676 1045496 1031930 1019094 1006747 994804 983320 972072 960519
66808 960519 948285 935596 923029 910858 898790 886460 873997 861871 850212 838648 826933
66797 826933 815400 804589 794693 785631 777305 769488 761739 753844 746073 738568 730708 721728 711832 702084
66783 702084 693188 685027 677421 670515 664112 657340 649600 641453 634049 627876 622454 617035 611194 604820
66769 604820 597906 590459 582534 574498 567181 561358 556911 552840 548265 543068 537378 531089 524340 517930
66755 517930 512530 507722 502520 496668 490732 485034 479274 473404 468033 463562 459451 454882 449865 445212
66741 445212 441525 438627 435945 433093 429957 426501 422743 418901 415381 412418 409741 406736 403008 398752
66727 398752 394564 390968 388074 385455 382376 378460 374258 370803 368405 366257 363511 360299 357247 354380
66713 354380 351270 348004 345201 342982 340701 337888 334803 331759 328584 325234 322338 320490 319295 317733
66699 317733 315346 312547 309832 307202 304417 301436 298448 295753 293604 291980 290440 288465 285995 283440
66685 283440 281131 278990 276801 274601 272647 271115 269990 269149 268327 267039 264768 261457 257781 254729 252776
66670 252776 251536 250302 248775 247120 245480 243756 241913 240156 238629 237105 235209 232935 230753 229183
66656 229183 228303 227712 226978 226119 225517 225271 224836 223574 221577 219589 218068 216684 214883 212620 210298 208280
66640 208280 206718 205634 204810 203707 201890 199556 197427 196064 195408 194992 194456 193865 193598 193875 194382 194538
66624 194538 194205 193839 193746 193499 192486 190823 189216 188007 186915 185854 185389 185965 187032 187451 186686 185209
66608 185209 183718 182353 180846 179158 177622 176509 175660 174655 173235 171530 169913 168703 167922 167272 166448
66593 166448 165555 165046 165076 165101 164459 163355 162809 163400 164416 164625 163720 162600 162212 162487 162578 161908 160735 159753
66575 159753 159288 159010 158409 157434 156533 156039 155753 155203 154159 152710 150973 149020 147090 145597 144812 144576 144403
66558 144403 143865 142908 141857 141111 140837 140971 141426 142043 142359 141749 140068 137984 136409 135646 135303 134962 134687
66541 134687 134802 135375 135995 136093 135516 134735 134291 134116 133707 133007 132604 132776 132894 132316 131449 131187 131487 131347 130259
66522 130259 128840 127761 126777 125288 123332 121444 119894 118573 117416 116396 115268 113841 112499 111976 112532
66507 112532 113659 114705 115454 115971 116141 115648 114381 112720 111334 110655 110505 110286 109628 108823 108536 109070 109943
66490 109943 110251 109486 108021 106791 106415 106627 106656 106079 105171 104448 104095 103993 104102 104563 105352 106002 105871 104787
66472 104787 103358 102440 102256 102225 101775 101037 100423 99820 98725 97155 95843 95353 95506 95883 96453 97298 98125 98550
66454 98550 98677 98881 99170 99214 98966 98717 98424 97498 95575 93220 91498 90926 91083 91282 91363 91714 92618 93798
66436 93798 94673 94931 94702 94259 93811 93614 93955 94792 95553 95571 94721 93471 92345 91486 90777 90230 90098 90562 91334
66417 91334 91720 91250 90255 89609 89829 90613 91291 91556 91562 91490 91216 90441 89085 87587 86709 86816 87323 87191 86074
66398 86074 84682 83841 83547 83229 82649 82129 82013 82287 82666 82809 82509 81903 81353 80973 80501 79946 80021 81355 83406
66379 83406 84768 84664 83613 82492 81495 80361 79201 78562 78675 79020 78798 77804 76723 76460 77178 78147 78621
66362 78621 78565 78334 77954 77205 76254 75651 75656 76004 76429 77006 77853 78862 79842 80631 81007 80877 80583 80558 80576 79917
66342 79917 78482 77109 76435 76053 75291 74293 73649 73385 73141 73095 73774 74931 75487 74911 73965 73679 74121 74655
66324 74655 74952 75191 75478 75685 75809 76014 76193 75935 75098 74109 73491 73275 73092 72683 72078 71443 71035 71190 71983
66305 71983 72899 73249 73036 72997 73547 74151 74164 73885 74097 74705 74627 73189 70978 69052 67873 67412 67758 68950
66287 68950 70466 71510 71832 71845 71915 71868 71264 69876 67906 65940 64675 64435 64992 66018 67544 69615 71650
66270 71650 72665 72278 71142 70146 69527 68947 68201 67520 67202 67225 67304 67289 67457 68273 69799 71449 72488 72721
66252 72721 72496 72145 71697 71159 70778 70844 71454 72503 73742 74781 75282 75281 75161 75172 75145 74767 73971 72952 71988
66233 71988 71352 71159 71081 70423 68767 66540 64725 63975 64097 64372 64325 64168 64491 65448 66393 66593 66213 66200 67040
66214 67040 68111 68570 68446 68374 68542 68537 68067 67254 66170 64778 63468 63042 63782 64978 65800 66294 67075 68320
66196 68320 69630 70734 71793 72876 73579 73435 72473 71222 70294 70078 70643 71722 72842 73629 74028 74196 74219
66179 74219 73981 73329 72325 71290 70527 70053 69686 69381 69310 69557 69954 70366 70922 71715 72435 72654 72382 72020 71722
66160 71722 71239 70457 69699 69233 68837 68178 67372 66835 66695 66747 66916 67390 68261 69266 69951 69972 69345 68617 68644 69757
66140 69757 71150 71494 70303 68363 66734 65726 65081 64674 64557 64558 64394 64172 64344 65076 65972 66484 66347 65623
66122 65623 64635 63975 64159 65042 65833 65963 65719 65782 66293 66761 66779 66439 66001 65444 64510 63026 61150 59475 58829
66103 58829 59631 61295 62595 62815 62372 62102 62247 62436 62405 62286 62206 62088 61950 62055 62600 63479 64424 65140 65231
66084 65231 64405 62984 61890 61757 62163 62049 60840 58948 57284 56521 56766 57655 58736 59879 61263 62873
66068 62873 64212 64849 65082 65652 66712 67500 67213 65883 64191 62698 61546 60723 60238 60037 60012 60102 60230 60161
66050 60161 59630 58700 57839 57554 57996 58961 60126 61175 61812 61865 61495 61201 61506 62605 64270 65994 67179
66033 67179 67350 66463 65084 64105 64115 64998 66115 66784 66649 65779 64592 63593 63052 62846 62616 62060 61113 59983
66015 59983 59008 58364 57936 57606 57597 58235 59306 60008 59734 58683 57548 56858 56826 57468 58545 59573 60272 60848
65997 60848 61526 62031 61880 61021 59814 58616 57791 57791 58588 59209 58654 57282 56513 56973 57717 57604 56685 55784 55363
65978 55363 55383 55777 56382 56745 56687 56835 57891 59473 60292 59592 57945 56532 56052 56401 56995 57193 56710 55842
65960 55842 55172 54928 54752 54152 53063 51879 51029 50612 50417 50256 50204 50428 50862 51229 51435 51726 52308 52992 53399
65941 53399 53414 53274 53246 53331 53288 52930 52464 52424 53115 54159 54890 55131 55270 55551 55709 55449 54877 54262 53704 53237
65921 53237 52951 52806 52666 52708 53367 54617 55699 55878 55133 53874 52487 51537 51796 53426 55410 56476 56356
65904 56356 55676 54906 54076 53313 52983 53271 54072 55161 56101 56338 55963 56071 57637 60220 62413 63374 63194 62064
65886 62064 60101 57949 56518 55908 55410 54729 54318 54320 54125 53423 52825 52862 53076 52717 51840 51137 51079 51687 52746
65867 52746 53781 54170 53721 52922 52325 51940 51456 50675 49587 48426 47837 48426 49868 51031 51307 51263 51661 52440
65849 52440 53105 53457 53423 52774 51649 50870 51065 51855 52487 52843 53154 53178 52479 51280 50337 50070 50350 50895 51273
65830 51273 50903 49719 48580 48363 48930 49655 50541 51914 53337 53968 53951 54369 55641 57012 57844 58439 59129
65813 59129 59530 59291 58837 58731 58829 58720 58574 58886 59635 60308 60666 60941 61276 61390 60983 60292 60070 60914 62530
65794 62530 63841 64011 63240 62286 61444 60452 59337 58644 58649 58909 58954 58947 59289 59885 60263 60251 60125 60134 60175 59973 59410
65773 59410 58639 57895 57240 56570 55932 55618 55781 56110 56236 56285 56627 57203 57587 57664 57700 57718 57436 56928 56769 57231
65753 57231 57861 58111 57889 57240 56067 54550 53317 52746 52512 52250 52166 52475 52720 52289 51292 50298 49474 48705
65735 48705 48296 48765 49911 50853 51088 50920 50752 50599 50463 50611 51173 51919 52666 53470 54160 54177 53290 52119 51459
65716 51459 51297 50947 50094 49177 48671 48376 47706 46549 45567 45523 46467 47687 48479 48756 48835 48836 48587 48076 47664 47752
65696 47752 48423 49439 50397 50870 50654 50023 49509 49280 48950 48209 47380 47070 47436 48107 48746 49319 49869 50398 50983
65677 50983 51637 51962 51392 50019 48745 48264 48239 47970 47567 47797 48827 49873 50329 50584 51300 52346 53029 53100
65659 53100 52951 52947 53122 53514 54272 55237 55885 55916 55657 55619 55853 55973 55733 55352 55252 55532 55779 55490 54697 54009
65639 54009 53863 53933 53557 52624 51654 51033 50570 49875 48807 47432 45917 44626 44002 44167 44875 45897 47099
65622 47099 48037 48062 47142 46155 45902 46195 46380 46411 46791 47589 48224 48239 47748 47041 46224 45419 44905 44799 44905 45053
65602 45053 45314 45741 46206 46670 47343 48314 49252 49721 49667 49399 49170 48985 48726 48300 47741 47267 47135 47278 47209 46529
65582 46529 45470 44714 44628 44883 44892 44456 43886 43578 43625 43832 44041 44323 44849 45587 46224 46469 46371 46288 46527 47089 47729
65561 47729 48172 48269 48083 47891 47973 48299 48477 48134 47312 46375 45610 45046 44680 44633 45075 46111 47774 49915 52000
65542 52000 53266 53294 52335 50975 49648 48648 48290 48709 49532 50095 50012 49342 48310 47211 46488 46476 46965 47347
65524 47347 47363 47343 47622 48057 48390 48718 49274 49959 50465 50789 51256 51977 52514 52251 51073 49668 49085 49849 51497
65505 51497 53049 53889 54013 53585 52703 51639 50845 50485 50331 50342 50916 52237 53761 54816 55399 55887 56217 56000
65487 56000 55343 54918 55105 55618 56106 56626 57260 57674 57414 56475 55305 54377 53864 53626 53353 52826 52114 51465 51015
65468 51015 50717 50567 50727 51391 52666 54488 56466 57909 58331 57966 57507 57270 56962 56315 55559 54986 54392 53379
65450 53379 52058 51032 50648 50554 50175 49428 48805 48790 49365 50126 50735 51178 51645 52361 53530 55244 57332 59459
65432 59459 61427 63218 64654 65323 65089 64429 63980 63904 63975 64093 64305 64501 64558 64652 64939 65032 64400 63315 62686
65413 62686 62805 62979 62740 62648 63330 64299 64494 63669 62468 61328 60099 58760 57734 57285 57180 57195 57430 57845
65395 57845 58016 57765 57638 58179 58981 59088 58332 57664 57886 58568 58685 58051 57613 58297 60065 62275 64511 66684
65377 66684 68630 70171 71575 73454 75996 78690 81056 83380 86337 90020 93710 96705 99096 101574
65363 101574 104586 107833 110662 112818 114648 116500 118136 118962 118801 118089 117285 116404 115307 114087 112858
65348 112858 111347 109091 105992 102414 98770 95239 91886 88795 86070 83844 82279 81315 80510 79399 77963
65333 77963 76500 75078 73543 72108 71416 71698 72221 71984 70805 69325 68094 67057 66000 65057 64577 64677
65317 64677 65101 65428 65321 64690 63736 62775 62037 61727 62209 63830 66404 69120 71227 72680 73915 75119 76082
65300 76082 76686 77150 77661 78042 77990 77432 76511 75412 74387 73710 73311 72569 70834 68197 65486 63449 62161
65283 62161 61201 60154 58825 57291 55969 55403 55709 56298 56450 56085 55704 55616 55604 55481 55529 56070 56842 57251 57171
65264 57171 57049 57143 57129 56702 56186 56122 56457 56608 56233 55587 55072 54849 54969 55455 56003 55877 54467 51946 49276
65245 49276 47533 47176 47753 48301 48239 47890 47974 48628 49319 49707 50087 50758 51458 51758 51576 50911 49510 47427 45616
65226 45616 45249 46423 48049 49051 49249 49050 48837 48763 48717 48287 47122 45507 44309 44168 44883 45686 45927 45519
65208 45519 44916 44687 44940 45266 45370 45530 46088 46768 47029 46883 46787 46827 46758 46825 47673 49165 50139 49807 48786 48226
65188 48226 48471 49180 50287 52078 54477 56864 58643 59615 59875 59704 59471 59333 59089 58515 57693 56850 56150
65171 56150 55841 56259 57254 57925 57389 55759 54011 52982 52743 52821 52708 52289 51993 52327 53086 53314 52407 50915
65153 50915 49866 49567 49547 49411 49145 48676 47772 46453 45127 44238 44014 44472 45348 46191 46844 47663 48896 50112
65135 50112 50722 50792 50768 50595 49856 48735 48043 48131 48466 48494 48320 48245 48195 47962 47607 47287 47055 47115 47924 49652 51751
65114 51751 53331 53873 53465 52582 51757 51290 51155 51267 51720 52453 52853 52275 50992 50052 50062 50703 51598 52986
65096 52986 55123 57577 59694 61390 62973 64531 66024 67695 69780 71970 73695 74927 76161 77644
65082 77644 79077 80207 81245 82483 83777 84669 84912 84692 84397 84256 84222 84098 83716 82970 81825 80422 79058
65065 79058 77857 76517 74631 72246 69803 67566 65462 63491 61851 60495 59023 57216 55295 53400
65051 53400 51305 49013 47187 46457 46579 46831 47008 47483 48331 48984 48846 47843 46348 44922 44127 44161 44594
65034 44594 44823 44816 45056 45656 46002 45516 44520 43996 44590 45970 47137 47320 46612 45744 45187 44650 43690 42601 42214
65015 42214 42804 43740 44418 45077 46294 47993 49505 50434 50950 51203 51000 50327 49785 50019 50825 51203 50408 48714
64997 48714 47080 46278 46451 47232 48024 48285 47817 46863 45798 44819 44035 43702 44023 44744 45258 45242 44943 44792 44978
64978 44978 45518 46408 47487 48323 48529 48135 47537 47149 47154 47440 47606 47240 46330 45341 44766 44768 45299 46313 47592
64959 47592 48581 48796 48380 47956 47883 47886 47495 46681 45882 45475 45384 45291 45120 45088 45295 45541 45731 46140 46889 47446 47175
64938 47175 46276 45529 45121 44476 43437 42782 43108 43886 44266 44283 44570 45266 45958 46441 46850 47212 47507 48028 49012
64919 49012 50096 50768 51193 51767 52059 51116 48914 46562 44831 43411 41961 41021 41212 42219 43238 44007
64903 44007 44753 45526 46253 47187 48633 50258 51249 51237 50690 50346 50527 51092 51787 52492 53095 53220 52351 50520
64885 50520 48672 47857 48006 48074 47527 47044 47399 48244 48637 48361 48087 48363 49023 49519 49389 48476 47142 46214 46280
64866 46280 47058 47768 47991 47798 47232 46286 45328 44947 45215 45573 45630 45603 45786 46056 46253 46695 47869 49727 51618
64847 51618 52920 53531 53718 53642 53168 52144 50797 49687 49196 49209 49432 49776 50193 50358 50004 49517 49675 50607
64829 50607 51483 51455 50636 49867 49771 50269 50802 50761 49877 48510 47427 47103 47320 47618 47906 48376 49041 49752 50520
64810 50520 51317 51631 50816 49145 48009 48626 50764 53071 54470 54794 54264 52968 51131 49435 48652 49056
64794 49056 50396 52255 54112 55230 55003 53611 51985 50846 49980 48713 46935 45361 44769 45264 46332
64779 46332 47408 48239 48850 49368 49876 50344 50659 50772 50798 50858 50828 50363 49287 47928 46880 46435 46419 46651 47332
64760 47332 48733 50619 52278 53134 53134 52558 51723 50909 50282 49755 49149 48567 48349 48548 48782 48759 48623 48533 48264
64741 48264 47594 46778 46207 45833 45432 45286 45964 47446 49036 50261 51360 52718 54286 55756 56874 57325
64725 57325 56756 55232 53382 51779 50462 49302 48474 48216 48442 48939 49648 50363 50509 49833 49109 49500 51188
64708 51188 53226 54793 55950 57014 57814 58056 57953 57905 57754 56938 55431 54090 53824 54664 55853 56696 57117
64691 57117 57413 57710 57863 57776 57609 57580 57690 57717 57382 56460 54925 53162 51873 51534 51912 52354 52520 52630 53016
64672 53016 53658 54288 54805 55384 56264 57447 58601 59285 59377 59196 59089 59012 58719 58284 58111 58359 58704 58785 58638
64653 58638 58493 58417 58328 58203 58014 57655 57143 56764 56733 56793 56416 55413 54138 53143 52808 53333 54774 56911 59140
64634 59140 60729 61328 61290 61376 61993 62755 62971 62499 61814 61183 60231 58635 56896 55906 55850 56013 55748 55200 54930
64615 54930 55138 55550 55909 56283 56854 57561 58101 58311 58468 59004 59914 60668 60869 60767 60927 61587 62547 63483 64029
64596 64029 63797 62788 61712 61440 62090 63025 63720 64171 64471 64544 64436 64336 64127 63457 62502 62063 62530 63261 63509
64577 63509 63495 63922 64767 65282 65057 64438 63871 63473 63338 63723 64620 65495 65691 64964 63621 62348 61824 62122 62503
64558 62503 62130 61016 59916 59301 58935 58530 58232 58153 57951 57321 56583 56286 56421 56501 56321 56159 56230 56407 56616
64539 56616 57039 57713 58212 58106 57565 57129 56973 56790 56490 56543 57285 58206 58483 58143 58133 59058 60350 61056 61006 60722
64519 60722 60477 60049 59364 58704 58154 57374 56240 55254 54986 55338 55740 55908 56020 56256 56522 56667 56703 56662 56424
64500 56424 55872 55198 54909 55415 56597 57846 58523 58380 57540 56296 55005 53986 53313 52830 52552 52846 53954
64483 53954 55487 56736 57375 57457 56870 55455 53726 52797 53224 54401 55472 56392 57606 59045 60061 60242
64467 60242 59800 59149 58545 58156 58111 58330 58533 58526 58351 58182 58153 58231 58215 57994 57878 58402 59627 60969 61973 62852
64447 62852 63807 64247 63397 61586 60121 59755 59918 59723 59132 58757 58946 59514 60107 60446 60369 59965 59517 59127 58615
64428 58615 58001 57780 58316 59175 59531 59210 58851 58988 59391 59498 59194 58848 58806 59094 59531 59872 59848 59329 58548 57968
64408 57968 57808 57841 57757 57574 57542 57814 58453 59577 61079 62308 62619 62335 62544 63541 64100 62992 60844 59628
64390 59628 60366 62166 63597 64163 64092 63522 62593 61862 61892 62567 63333 63938 64476 64860 64829 64451 64117 64016 64010 64062
64370 64062 64313 64676 64810 64682 64718 65173 65651 65573 64881 64032 63503 63528 64119 65022 65735 65901 65715 65685 65984 66246
64350 66246 66033 65333 64477 63733 63152 62781 62822 63444 64453 65333 65730 65855 66252 67148 68183 68863 69182 69642 70719
64331 70719 72416 74363 76208 77822 79155 80043 80304 80016 79523 79071 78557 77857 77275 77333 78062 78811 79012 78888
64313 78888 79123 80034 81437 83255 85792 89197 93055 96832 100580 104778 109513 114217 118391 122380 127037
64298 127037 132625 138303 142819 145519 146549 146325 145191 143593 142085 140797 139065 136009 131535 126528
64284 126528 121986 118128 114455 110499 106355 102507 99264 96442 93640 90821 88517 87265 86899 86599 85723
64269 85723 84461 83560 83475 83887 83988 83250 81983 81083 81121 81722 82067 81901 81642 81486 81013 80009 79176 79401 80530
64250 80530 81541 81901 82091 82626 83160 82990 82082 81158 80917 81507 82629 83812 84575 84601 83957 83091 82556 82632 83104
64231 83104 83423 83261 82899 82882 83269 83506 83144 82377 81693 81242 80876 80533 80235 79851 79265 78766 78863 79613 80446 80793
64211 80793 80656 80489 80729 81546 82801 84027 84651 84484 83958 83725 84076 84863 85897 87183 88667 89957 90489
64194 90489 90092 89356 89350 90851 93750 97185 100248 102644 104680 106697 108628 110194 111521 113359 116502 121046
64178 121046 126382 131919 137506 143073 148166 152186 155002 157036 158661 159708 159603 157877 154556 150225
64164 150225 145742 141676 137892 133826 129212 124460 120238 116870 114200 111834 109366 106548 103561 101074
64150 101074 99728 99480 99680 99877 100201 100784 101126 100537 99141 97943 97749 98361 99062 99501 99769 99851 99514 98748
64132 98748 97942 97512 97615 98232 99299 100683 102224 103847 105446 106755 107657 108551 110017 112067 114215 116362
64116 116362 119084 122677 126464 129536 131941 134572 137991 141870 145617 149179 153063 157734 163068 168308
64102 168308 172568 175458 177132 177806 177497 176304 174466 171990 168627 164563 160661 157502 154572 150958 146609
64087 146609 142282 138500 135261 132619 130740 129320 127686 125664 123770 122433 121639 121535 122609 124879 127412
64072 127412 129120 129766 129900 130225 131271 133293 136100 139265 142696 146622 150847 154583 157392 159780 162348
64057 162348 164834 166612 167762 168870 169887 169932 168400 165753 163012 160784 158965 157125 155055 152990 151366
64042 151366 150355 149718 149166 148649 148124 147314 145973 144321 142933 142269 142468 143522 145397 147928 150684 153019
64026 153019 154447 155169 156072 157851 160175 162204 163848 165822 168301 170362 171260 171584 172498 174415 177156
64011 177156 180875 185814 191379 196459 200728 204850 209351 214058 218751 223575 228559 233487 238558 244564
63997 244564 251950 260176 268412 276549 285143 294663 305117 316202 327567 339079 351013 363885 378099
63984 378099 393973 411983 432433 454744 477605 500160 522678 545827 569681 593809 617994
63973 617994 642483 667710 694171 722474 753222 786979 824509 866839 914820 968853 1029404
63962 1029404 1097807 1176342 1267562 1373646 1496322 1637292 1798793 1983813 2195579 2436717
63952 2436717 2708809 3012465 3347203 3711065 4100766 4512536 4942583 5386518 5838517
63943 5838517 6291112 6735390 7161108 7557098 7912443 8217751 8465715 8651094 8770605
63934 8770605 8822494 8805671 8719284 8563495 8340740 8056279 7717917 7335427 6919637 6481119
63924 6481119 6029391 5573237 5121142 4680598 4257108 3854503 3476217 3125687 2805460
63915 2805460 2516598 2259015 2031744 1832612 1658395 1505899 1372673 1256560 1155107
63906 1155107 1065926 987259 917770 856097 801067 752022 708326 668727 631797 596908 564248
63895 564248 533892 505468 478737 453785 430383 407787 385663 364739 346016 329603 314836
63884 314836 301301 289155 278482 268925 260079 251814 244085 236847 230275 224658 219810 215049 210076
63871 210076 205510 202107 199666 197180 193943 190025 185708 181013 175967 170939 166440 162713 159648 156876
63857 156876 153937 150637 147353 144680 142654 140623 138059 135153 132325 129478 126274 122987 120454 119034
63843 119034 118100 116831 115193 113763 112814 112049 111236 110592 110302 109970 108972 107243 105387 103951 102896 101829
63827 101829 100475 98812 97087 95883 95891 97204 98974 100049 99929 98912 97554 96333 95640 95569 95674 95391
63811 95391 94803 94574 95061 95853 96390 96582 96553 96195 95350 94188 92978 91644 89962 88117 86716 86177 86327
63794 86327 86689 86990 87367 88144 89413 90755 91465 91139 90066 88988 88501 88643 88959 88935 88523 88243 88613 89472
63776 89472 90084 89917 89114 88198 87637 87752 88620 89823 90596 90481 89695 88741 87952 87577 87862 88653 89223 88938 87985
63757 87985 87188 87240 88305 90062 91800 92805 93121 93680 95273 97579 99690 101314 102851 104473 105879 107011
63741 107011 108327 110109 112111 114167 116733 120461 125474 131306 137351 143320 149496 156580 164949 174016
63727 174016 182687 190522 198041 205729 213137 219211 223175 224829 224360 222177 218770 214429 209220 203334
63713 203334 197124 190687 183745 176254 168828 162268 156881 152548 149180 146749 145056 143862 143190 143159 143630
63698 143630 144333 145256 146552 148115 149579 150785 151898 153041 154061 154762 155150 155331 155359 155305 155411 156126 157989
63681 157989 161404 166338 172223 178313 184289 190482 197495 205593 214391 223079 230932 237611 242968 246718
63667 246718 248522 248451 247027 244633 241080 236018 229547 222120 214005 205340 196664 188880 182383 176575 170615
63652 170615 164469 158950 154838 152269 150921 150398 150325 150368 150405 150570 151003 151763 153159 155844 160156 165432 170495
63635 170495 174970 179616 185143 191239 197339 203966 212471 223392 235806 248544 261426 274930 289207
63622 289207 304107 319889 337153 355971 375660 395653 416193 437831 460323 482228 501584
63611 501584 516880 527513 533619 535708 534550 531207 526789 521953 516725 510974 505000 499421 494478 489631
63597 489631 483913 476602 467559 457084 445584 433286 420201 406368 392199 378593 366659 357264
63585 357264 350659 346359 343337 340564 337563 334598 332385 331629 332695 335415 339065 342746 346113 349776
63571 349776 354700 361106 368181 375014 381551 388338 395697 403673 412674 423400 435890 449296 463053
63558 463053 477790 494538 513391 533584 554493 575698 596097 613887 627764 637553 643489 645583
63546 645583 644158 640410 635932 631952 629333 628823 630732 634549 639244 643750 646947 647760 645879 641988 636649
63531 636649 629150 618147 603300 585649 566447 546355 525822 505457 485652 466338 447426 429159
63519 429159 411834 395580 380639 367498 356395 346970 338649 331159 324435 318303 312586 307440 303255
63506 303255 300188 297919 295862 293589 291093 288696 286645 284821 282959 281089 279519 278429 277702 277231 277202
63491 277202 278036 280204 284055 289636 296643 304667 313398 322440 331210 339418 347474 355854 364050 370718
63477 370718 374958 376885 376811 374501 369702 362882 354988 346752 338598 330881 323738 316897 310077 303483 297648
63462 297648 292964 289627 287759 287235 287531 288073 288631 289247 290090 291603 294310 298056 301872 305113 308314 312307
63446 312307 316901 321279 325480 330541 337123 344885 353440 363109 374346 387040 400821 415617 431580
63433 431580 448895 467928 489164 512674 538043 565060 594030 625099 657701 690944 723984
63422 723984 755526 783446 805591 820879 829333 831503 828434 821860 813660 805036 796579 788816 782018
63409 782018 775571 768311 759637 749754 738722 725898 710658 693178 674220 654469 634397 614491
63397 614491 595291 577363 561278 547320 535080 523766 513210 504187 497354 492166 487352 482368
63385 482368 477939 475215 474819 476761 480804 486638 493883 502198 511363 521272 531965 543695 556739 571064
63371 571064 586364 602600 620239 639709 660731 682590 704999 728221 752082 775227 795757
63360 795757 812454 825083 833662 838037 838220 834719 828314 819933 810885 802571 795424 788540 780957 772983
63346 772983 765508 758087 748625 735292 718167 698722 678302 657562 636882 616624 597088 578610
63334 578610 561590 546104 531664 517740 504421 492238 481441 471753 462707 453891 444999 436052
63322 436052 427497 419741 412633 405779 399257 393527 388592 383784 378587 373251 368319 363870 359507 354935
63308 354935 350316 346142 342853 340447 338401 336081 333307 330381 327664 325365 323611 322323 320987 319014
63294 319014 316398 313615 310799 307562 303789 299971 296362 292444 287818 283094 279185 276038 272870 269483
63280 269483 266447 263973 261477 258551 255678 253617 252577 252298 252463 252673 252500 251933 251367 250775 249412 246949
63264 246949 244529 243867 245328 247570 249163 249967 250713 251853 253251 254678 256142 257880 260331 263967 268838
63249 268838 274336 279733 285003 290837 297842 305994 314903 324341 334303 344785 355803 367516 380072
63236 380072 393391 407328 422009 437711 454363 471379 488135 504380 520112 535323 550094
63225 550094 564736 579545 594518 609543 624761 640457 656666 673129 689548 705541 720363
63214 720363 733119 743404 751387 757078 759744 758281 751983 740916 725854 708109 689054 669324
63202 669324 648578 626372 603220 580493 559298 539836 521879 505510 491158 479177 469584 462165
63190 462165 456702 453127 451491 451772 453709 456948 461250 466420 472156 478233 484796 492151 500171 508260
63176 508260 516018 523579 531081 538191 544510 550232 555856 561375 566244 570202 573641 576854 579247 579616
63162 579616 577141 571962 564897 556765 547842 537788 526151 513032 499225 485653 472809 460785
63150 460785 449590 439171 429371 420182 411989 405218 399755 395008 390551 386370 382509 378872 375546 372868
63136 372868 370864 368928 366492 363806 361676 360510 360109 360282 361128 362506 363765 364386 364591 364938 365445 365568
63120 365568 365029 364269 363895 363943 363950 363637 363247 363183 363535 364152 364971 366003 366976 367342 366856 365987 365518 365795 366575 367502
63100 367502 368396 369133 369570 369741 369866 370119 370672 372028 374835 379046 383609 387420 390395 393190 396082 398706
63084 398706 400861 402943 405340 407910 410364 412843 415753 419275 423370 428043 433219 438494 443492 448498
63070 448498 454381 461694 470050 478567 486790 495112 504426 515495 528583 543520 560021 577915 597032
63057 597032 617007 637477 658586 681102 705825 732849 761549 791258 821798 853291 885606
63046 885606 918188 950422 981997 1012839 1042846 1071898 1100132 1128018 1156019 1184276 1212693
63035 1212693 1241167 1269553 1297439 1324116 1348755 1370386 1387603 1398637 1402114 1397822 1386503 1368753
63023 1368753 1344305 1312585 1273911 1229932 1182827 1134222 1084979 1035831 987922 942601 900884
63012 900884 863192 829554 799912 774240 752473 734380 719556 707633 698501 692242 688758 687562
63000 687562 688058 689969 693388 698424 704894 712332 720167 727968 735679 743656 752296 761520 770748 779382
62986 779382 787165 794001 799649 803777 806118 806316 803671 797365 786978 772622 754593 733241 709280
62973 709280 683907 658220 632597 606874 581086 555706 531122 507287 484086 461845 441118
62962 441118 422066 404373 387869 372908 359914 348709 338562 328891 319741 311523 304395 298009
62950 298009 291848 285812 280396 276186 273134 270466 267419 263985 260765 258195 256136 254222 252307 250452
62936 250452 248711 247187 246158 245873 246148 246379 246091 245444 245048 245248 245660 245511 244377 242479 240268 238034
62920 238034 236009 234516 233601 232639 230859 228385 226365 225796 226467 227285 227411 226796 225804 224721 223651 222612
62904 222612 221645 220924 220676 220903 221291 221584 221908 222520 223358 224131 224772 225478 226356 227347 228576 230355 232629 234672
62886 234672 235693 235715 235665 236468 238063 239450 239756 239216 238902 239460 240436 240945 240702 240050 239278 238392 237416 236405
62868 236405 235151 233381 231326 229598 228394 227260 225869 224523 223574 222759 221539 219877 218273 217120 216274
62853 216274 215210 213460 211057 208740 207505 207737 208946 210460 212079 213761 215052 215287 214301 212567 210668
62838 210668 208940 207560 206642 206195 206172 206579 207421 208633 210238 212411 215181 218197 221036 223636 226209 228840
62822 228840 231441 233970 236461 238914 241434 244305 247611 250888 253526 255452 257160 259186 261858 265376
62808 265376 269614 273894 277515 280643 284255 289017 294612 300355 306174 312725 320737 330408 341311 352781
62794 352781 364518 376948 390901 406969 425351 446144 469497 495486 524208 556036 591435
62783 591435 630425 672580 717606 765601 816679 870775 927902 988040 1050338 1112774 1173030
62772 1173030 1229545 1281418 1327562 1366522 1397087 1418660 1430887 1433237 1425148 1406569 1378232 1341507
62760 1341507 1297992 1249208 1196475 1140910 1083473 1025146 967141 910755 856843 805529 756611
62749 756611 710148 666492 625936 588606 554583 523822 496070 471146 449129 429867 412596
62738 412596 396619 382221 370185 360342 351365 342192 332996 324533 317221 311176 306392 302379 298231
62725 298231 293665 289465 286395 284212 282414 281331 281595 282884 284142 285013 286200 288472 291997 296693 302395
62710 302395 308598 314777 321280 329343 339906 352795 367253 382874 399842 418642 439693 462913
62698 462913 487501 512529 537874 564217 591972 620558 648847 675844 700673 722290 739629
62687 739629 751936 758818 760231 756576 748504 736405 720307 700470 677742 653005 626484 598061
62675 598061 568231 538398 510062 483858 459452 436302 414418 394366 376594 360912 346665
62664 346665 333334 320823 309322 299080 290207 282479 275388 268639 262543 257665 254134 251563 249574
62651 249574 248001 246588 244957 243053 241277 239943 238823 237456 235641 233476 231112 228727 226602 224994
62637 224994 223983 223530 223562 223912 224307 224528 224528 224360 224120 223934 223904 224030 224331 224965 226042 227416 228902 230586
62619 230586 232556 234449 235750 236592 237746 239644 241964 244373 247133 250578 254540 258843 264027 270915
62605 270915 279612 289517 300304 312361 326175 341715 358671 377004 397038 419153 443518 470007
62593 470007 498154 527143 555968 583845 610610 636551 661527 684229 702685 715633 723191 725982
62581 725982 723966 716477 703263 685135 663603 640099 615480 590031 563778 536867 509668 482619
62569 482619 456156 430828 407236 385710 366180 348464 332509 318329 305922 295288 286244 278127
62557 278127 270119 262067 254641 248458 243464 239406 236369 234289 232425 230020 227270 224917 223025 220888
62543 220888 218212 215615 213773 212658 211887 211317 210989 210946 211411 212796 215141 217817 220101 221941 223936 226764
62527 226764 230737 235693 241061 246286 251412 257126 264042 272149 281088 290700 301000 311864 323131
62514 323131 334935 347593 361162 375341 389798 404359 418804 432641 445114 455353 462642 466732
62502 466732 467883 466416 462279 455253 445538 433867 420977 407273 393128 379157 365857 353088
62490 353088 340301 327338 314735 303158 292781 283391 274896 267464 261189 255879 251161 246703 242327
62477 242327 238080 234167 230674 227405 224193 221324 219322 218285 217732 217257 216996 217203 217693 218042 218144 218180
62461 218180 218140 217834 217364 217214 217735 218833 220295 222120 224390 226932 229374 231536 233640 236072 238897 241686
62445 241686 243971 245813 247656 249538 250872 251293 251348 251795 252432 252233 250700 248496 246609 245379 244592 244017
62429 244017 243529 243051 242701 242702 242921 242809 242128 241408 241333 241972 243019 244489 246642 249360 252181 254913 257690
62412 257690 260385 262507 263910 265170 266973 269397 272038 274599 277138 279849 282835 286052 289461 293301
62398 293301 298098 304072 310525 316258 320814 324910 329340 333892 337872 341404 345496 350759 356720 362647
62384 362647 368515 374736 381319 387874 394347 401282 409246 418319 428283 439072 450850 463798 478045
62371 478045 493794 511420 531368 553965 579300 607305 637908 671077 706722 744741 785250
62360 785250 828522 874371 921631 968427 1012984 1054010 1090435 1121242 1145711 1163575 1174815
62349 1174815 1179597 1178536 1172600 1162411 1147833 1128546 1104781 1077150 1046049 1011825 975544 938969
62337 938969 903490 869363 836185 803825 772725 743513 716600 692012 669432 648500 629155
62326 629155 611622 596036 582256 570122 559578 550402 542103 534403 527626 522287 518388 515499 513407
62313 513407 512227 511835 511692 511497 511590 512402 513807 515428 517316 519720 522274 524145 525273 526879 530232 535187
62297 535187 540405 544814 548392 551725 555450 560109 565846 571961 577289 581369 584893 588737 593044 597642
62283 597642 602894 609442 617353 626158 635647 646042 657366 669293 681756 695198 710004 726171
62271 726171 743779 763379 785557 810430 837937 868395 902315 939665 979699 1021638 1065431
62260 1065431 1111749 1161216 1213568 1267456 1320963 1372124 1418909 1459137 1491082 1514324 1529651
62249 1529651 1537909 1539253 1533710 1522028 1505542 1485300 1461660 1434698 1404755 1372587 1339215 1305680
62237 1305680 1272825 1241266 1211550 1184197 1159506 1137493 1118182 1101799 1088491 1077932 1069450
62226 1069450 1062561 1057249 1053718 1051949 1051577 1052121 1053283 1054914 1056739 1058372 1059821 1061749 1064823 1068913
62212 1068913 1073437 1078488 1084909 1092996 1101790 1110273 1118784 1128528 1139920 1152184 1164594 1177394 1191211
62199 1191211 1206084 1221521 1237286 1253846 1272067 1292506 1314880 1338189 1361560 1384977 1409035
62188 1409035 1433984 1459219 1483670 1506445 1527110 1545645 1562168 1576517 1588149 1596800 1603252 1609062
62176 1609062 1615485 1623036 1632224 1644133 1659891 1679848 1703616 1730650 1760405 1792095 1824645 1856759
62164 1856759 1886769 1912677 1932873 1946896 1955261 1958638 1957518 1952496 1944193 1932728 1917631 1898556
62152 1898556 1875753 1849688 1820617 1788957 1755828 1722773 1690883 1660392 1631102 1602938 1576151
62141 1576151 1551266 1528874 1509256 1492099 1476698 1462427 1448913 1435892 1423196 1410978 1399712
62130 1399712 1389776 1381113 1373361 1366172 1359368 1353000 1347335 1342679 1339118 1336574 1335128 1335013 1336157 1338042
62116 1338042 1340307 1343219 1347152 1351658 1355444 1357236 1356311 1352248 1344774 1334302 1322353 1310897 1301041
62103 1301041 1292434 1283939 1274665 1264240 1252378 1238772 1223739 1208691 1195383 1184566 1175801 1168678
62091 1168678 1163689 1161494 1161855 1163966 1167628 1173353 1181255 1190544 1200413 1210928 1222688 1235929 1250271
62078 1250271 1265094 1279862 1294235 1308070 1321368 1334239 1347063 1360432 1374447 1388122 1400084
62067 1400084 1410017 1418867 1427321 1434600 1439125 1439887 1436712 1429634 1418664 1403986 1385859 1364376 1339720
62054 1339720 1312497 1283393 1252605 1219991 1185636 1149907 1113123 1075621 1038076 1001340 966020
62043 966020 932515 901297 872717 846694 823024 801849 783344 767158 752835 740661 731288 724363
62031 724363 718324 711929 705380 699539 694533 689663 684298 678276 671536 663906 655298 645857 635842 625522
62017 625522 615227 605420 596743 589895 585275 582685 581634 582061 584568 589828 597879 608063 619515 631548
62003 631548 643719 655634 666727 676239 683527 688275 690327 689470 685645 679219 670681 660104 647359
61990 647359 632878 617729 602777 588132 573647 559608 546582 534813 524086 514163 505118 497271
61978 497271 490847 485710 481483 478017 475609 474556 474644 475403 476774 479091 482415 486304 490344 494515 498966
61963 498966 503870 509644 516885 525839 536293 548017 560955 574886 589499 605048 622349 641862
61951 641862 663312 686579 712345 741390 773793 809393 848566 891730 938378 987299 1037627
61940 1037627 1089075 1141256 1193454 1245108 1296053 1346208 1395355 1443139 1488927 1531855 1571337
61929 1571337 1607310 1639547 1667093 1689124 1706236 1720281 1733037 1745766 1759947 1777509 1799995
61918 1799995 1828190 1862910 1905620 1957870 2020481 2093535 2176653 2268913 2368823 2474827 2585798
61907 2585798 2700992 2819817 2941765 3066279 3192524 3319577 3446980 3574792 3702920
61898 3702920 3830509 3955833 4076155 4187464 4284863 4363630 4419812 4449883 4450625 4420010 4358135
61887 4358135 4267081 4150148 4011352 3855190 3686277 3509218 3328778 3149617 2975335 2807981
61877 2807981 2648807 2499222 2360685 2233988 2119161 2015887 1923579 1841280 1768083 1703742
61867 1703742 1648517 1602472 1565179 1536015 1514441 1500084 1493003 1493755 1502807 1519857 1544026 1574599
61855 1574599 1611176 1653238 1700089 1751251 1806341 1864328 1923294 1981072 2035772 2085518 2128168
61844 2128168 2161735 2185009 2197618 2199793 2192377 2177034 2156193 2132678 2109194 2087839 2070007 2056860
61832 2056860 2049760 2049783 2056689 2068774 2083933 2100436 2116478 2129535 2136791 2136080 2126029 2105677 2074682
61819 2074682 2033998 1985668 1931669 1873270 1811647 1748656 1686595 1627426 1572456 1522486 1477796
61808 1477796 1438094 1402995 1372657 1347670 1328248 1313858 1303820 1297991 1296590 1299617 1306867 1318408
61796 1318408 1334567 1355306 1380032 1408299 1440415 1477055 1518525 1564845 1616424 1674146 1738700
61785 1738700 1810259 1889057 1975904 2071880 2177802 2294349 2422508 2563485 2718259 2887552
61775 2887552 3072227 3273262 3491110 3725231 3974302 4236632 4510106 4791755 5077386
61766 5077386 5361431 5636959 5895875 6129327 6328262 6484038 6589211 6638385 6628829 6560749
61756 6560749 6437304 6264360 6049813 5802595 5531820 5246258 4953891 4661467 4374332
61747 4374332 4096631 3831494 3581010 3346271 3127761 2925665 2739779 2569323 2413115
61738 2413115 2269967 2138869 2018928 1909368 1809545 1718746 1635990 1560288 1491094 1428260
61728 1428260 1371458 1319847 1272503 1229013 1189423 1153576 1120719 1089864 1060523 1032931 1007461
61717 1007461 983860 961194 938521 915445 891937 867946 843409 818576 793915 769673 745768
61706 745768 722204 699435 678142 658702 640906 624169 608093 592843 578914 566410 554715
61695 554715 543113 531587 520678 510633 501137 491939 483266 475400 468203 461420 455160 449733 445150
61682 445150 441055 437027 432707 427856 422643 417728 413604 409876 405567 400265 394629 389628 385546 381925
61668 381925 378287 374634 371233 368164 365277 362602 360581 359632 359500 359387 358877 358471 358970 360577 362983 366097
61652 366097 370181 375247 380815 386463 392255 398429 404936 411480 417725 423210 427231 429147 428787 426447
61638 426447 422542 417406 411363 404822 398297 392364 387446 383561 380316 377313 374544 372355 371097 370840
61624 370840 371415 372680 374779 378094 382808 388485 394189 399027 402479 404262 404146 402058 398201 392948 386678
61609 386678 379741 372416 364868 357328 350279 344160 338776 333398 327734 322496 318680 316507 315464 315139
61595 315139 315495 316332 317112 317521 317862 318671 320196 322401 325160 328228 331260 334132 336977 339742 342043 343904
61579 343904 346392 350867 357540 365229 372749 380059 387825 396348 405423 414988 425268 436231 447461
61566 447461 458783 470619 483431 497074 510964 524643 537859 550335 561884 572730 583284
61555 583284 593512 602884 611067 618347 625180 631604 637364 642403 646924 651067 654809 658147 661152 663834
61541 663834 666174 668305 670406 672383 673861 674583 674628 674111 672886 670748 667754 664194 660330 656447 653084
61526 653084 650900 650184 650723 652239 654777 658555 663709 670459 679340 690856 704929 721024 738988 759439
61512 759439 783162 810375 840865 874639 912107 953635 999284 1049046 1103137 1161937 1225722
61501 1225722 1294468 1367686 1444358 1523134 1602684 1681800 1759122 1832831 1900635 1959948 2008233
61490 2008233 2043543 2065043 2072939 2067854 2050523 2022274 1985499 1943109 1897319 1849203 1799553 1749809
61478 1749809 1701913 1657376 1616869 1580627 1548827 1521403 1497847 1477517 1459991 1444819 1431125
61467 1431125 1417900 1404801 1392383 1381480 1372650 1366173 1362134 1360208 1359796 1360734 1363690 1369516 1378375
61454 1378375 1389809 1403462 1419314 1437352 1457373 1479059 1501927 1525389 1549305 1574361 1601426
61443 1601426 1630554 1661018 1692088 1723099 1752787 1779534 1802640 1822708 1840321 1854936 1865614
61432 1865614 1872326 1875938 1877309 1876992 1875506 1873224 1870107 1866138 1861846 1857864 1854100 1849999 1845517 1841078
61418 1841078 1836453 1830372 1821638 1810090 1796187 1780042 1761402 1740411 1717936 1695142 1672890 1651534
61406 1651534 1631071 1611417 1592613 1574809 1558198 1542932 1528994 1516081 1503912 1492780 1483571
61395 1483571 1476940 1472776 1470920 1472127 1477728 1488377 1503692 1523198 1547010 1575472 1608781 1647274
61383 1647274 1691565 1741997 1798357 1860432 1928379 2002033 2080178 2161036 2243208 2325649 2406895
61372 2406895 2484930 2557741 2623471 2680046 2725319 2757932 2777737 2785167 2780484 2763978 2736711 2700662
61360 2700662 2657934 2609893 2557149 2500363 2440846 2380141 2319068 2257470 2194951 2131565 2067763
61349 2067763 2004165 1941835 1882321 1826764 1774971 1725931 1679348 1636165 1597424 1563076 1532143
61338 1532143 1503731 1477635 1454194 1433839 1416647 1402218 1390171 1380718 1374402 1371136 1370012 1370388
61326 1370388 1372691 1377630 1384968 1393727 1403462 1414559 1427139 1440393 1453384 1466035 1478909 1492332
61314 1492332 1506162 1520162 1534097 1547522 1559814 1570327 1578174 1581970 1580412 1573387 1562189 1548453
61302 1548453 1533074 1516225 1498029 1478894 1459466 1440625 1423336 1408057 1394265 1381025 1368073
61291 1368073 1355968 1345058 1334784 1324445 1314378 1305817 1299531 1295050 1291522 1289008 1288519 1290794 1295379
61278 1295379 1301053 1306915 1312852 1319149 1325987 1333352 1341169 1349342 1357892 1367241 1378213 1391477 1406942
61265 1406942 1423760 1440835 1457104 1471539 1483372 1492612 1500121 1506944 1513634 1520403 1527781 1536817 1548556
61252 1548556 1563461 1581375 1602017 1625501 1652438 1683485 1718624 1756782 1796133 1834603 1870052
61241 1870052 1900188 1922780 1936141 1939305 1931739 1913263 1884538 1847363 1803983 1755947 1703894 1648495
61229 1648495 1591249 1534043 1478192 1424300 1372997 1325345 1282286 1243959 1209688 1178407 1148840
61218 1148840 1119571 1089477 1058239 1026234 993919 961591 929833 899844 873014 850260 831891
61207 831891 817926 808269 802647 800740 802486 808092 817542 830130 844510 859189 872905 884622 893387
61194 893387 898483 899973 899050 897552 896853 897166 897879 898377 898358 897585 895756 892756 888806 884237 879272 874071
61178 874071 868787 863455 857991 852416 846836 841031 834292 826025 816463 806442 796497 786495 776245
61165 776245 766134 756919 749060 742426 736546 731038 726019 722258 720674 721357 723110 724180 723366 720088
61151 720088 713604 702850 687439 668461 647836 626917 606056 585426 565750 547926 532154 517796
61139 517796 504151 491188 479378 468963 459620 450947 443031 436271 430699 425747 420803 415777 410988
61126 410988 406663 402763 399191 395944 393136 391069 390158 390574 391949 393802 396252 400069 405856 413449 422200
61111 422200 431484 440709 449107 455940 460736 463034 462162 457847 451082 443703 436825 430126 422998 415883
61097 415883 409948 405750 402892 400832 399319 397975 396243 394133 392431 391695 391433 390844 390039 389900 390836 392283
61081 392283 393485 394272 394956 395844 396984 398128 398915 399397 400299 402303 405028 407291 408541 409497 411110 413435
61065 413435 415936 418355 420750 423016 425013 427022 429513 432517 435680 438912 442482 446498 450751 455180
61051 455180 460040 465466 471191 476919 482788 489309 496973 505870 515553 525355 535098 545482 557538 571671
61037 571671 587440 604170 621483 639362 658088 678205 700256 724500 751095 780414 812863
61026 812863 848504 887232 929161 974218 1021435 1069428 1117896 1168213 1222459 1282612 1350877
61015 1350877 1429852 1521375 1625527 1741491 1869473 2011671 2172176 2356942 2573851 2831916
61005 2831916 3139885 3505632 3936736 4441528 5030429 5717950 6525173 7482101 8629190
60996 8629190 10014308 11676297 13609885 15725007 17833246 19688756 21074175 21883898
60988 21883898 22156479 22047049 21768633 21532263 21491924 21692648 22040195 22323966 22298844 21785771
60978 21785771 20734135 19219535 17395264 15434603 13488972 11667531 10033731 8612551
60970 8612551 7402389 6386601 5542084 4844427 4270333 3798558 3410464 3090220 2824286
60961 2824286 2600620 2408708 2240358 2090115 1954765 1832511 1722157 1622234 1530681 1445794
60951 1445794 1367472 1296794 1234138 1178182 1126891 1078754 1032730 987831 943499 900036 858059
60940 858059 817798 779455 743865 712063 684255 659811 638281 619779 604250 590856 578479
60929 578479 566683 555999 547252 540631 535353 530297 525006 519949 515819 512809 510694 509208 508050 506764
60915 506764 505000 502729 499947 496389 491890 486774 481460 475847 469565 462712 455857 449379 443315 437796
60901 437796 433016 428707 424295 419746 415652 412159 408438 403701 398307 393366 389585 387008 385515 384803
60887 384803 383991 382053 378918 375646 373221 371558 369957 368158 366531 365412 364705 364179 363825 363814 364241 364996
60871 364996 365779 366282 366423 366454 366639 366866 366734 366127 365496 365390 365903 366820 368182 370277 373001 375523 376903
60854 376903 376899 375985 374753 373608 372999 373568 375789 379475 383666 386981 388273 387295 384888 382320 380209 378142
60838 378142 375404 371897 368185 364826 361978 359604 357686 356112 354656 353317 352527 352780 354070 355831 357396
60823 357396 358365 358640 358390 358087 358316 359373 361066 362994 364865 366482 367593 368036 368020 368029 368368 368896 369297 369509
60805 369509 369742 370064 370140 369440 367698 365120 362177 359326 356875 354961 353512 352280 350997 349472 347499
60790 347499 344928 341979 339256 337120 335169 332856 330554 329365 329652 330372 330325 329547 328846 328367 327484 326018
60774 326018 324691 324097 323916 323513 322848 322394 322522 323307 324652 326262 327679 328667 329365 329885 330014 329580 328808
60757 328808 328050 327410 327001 327280 328656 330927 333487 335999 338441 340710 342650 344404 346157 347565 347951
60742 347951 347166 345697 343802 341114 337436 333412 329917 327032 324076 320505 316428 312358 308852 306297
60728 306297 304638 303267 301495 299273 297205 295735 294544 292927 290592 287872 285255 283008 281317 280464
60714 280464 280529 281005 281081 280427 279471 278726 278076 277029 275560 274269 273674 273610 273440 272640 271112 269159 267327 266071
60696 266071 265389 264885 264328 264006 264415 265669 267341 268785 269549 269609 269336 269164 269304 269913 271424 274250 277998
60679 277998 281436 283656 284994 286348 287874 289047 289884 291331 294089 297637 300860 303236 304981 306345
60665 306345 307323 307960 308432 308799 309034 309320 309947 310876 311781 312650 313903 315723 317589 318832 319392 319713 320016
60648 320016 320060 319528 318319 316480 314231 312080 310525 309453 308163 306190 303897 302017 300840 300128 299661
60633 299661 299459 299440 299231 298527 297497 296664 296401 296597 296823 296792 296661 296839 297523 298532 299704 301289 303731 307022
60615 307022 310459 313163 314849 316054 317593 319724 321891 323425 324453 325815 327951 330253 331827 332595
60601 332595 333079 333306 332651 330901 328752 326797 324561 321157 316728 312594 309885 308442 307184 305311 302980
60586 302980 300945 299683 298926 298051 296861 295735 294966 294290 293280 291948 290594 289272 287822 286335 285162
60571 285162 284433 283922 283389 282710 281713 280382 279297 279316 280567 282200 283454 284511 285914 287562 288892 289875
60555 289875 291179 293330 296170 299183 301961 304281 306204 308248 311080 314822 318956 323123 327662 333148
60541 333148 339701 347107 355424 365037 376280 389375 404672 422485 442680 464895 489282 516584
60529 516584 547163 580284 614630 649140 682771 713676 739333 757728 767993 769882 763301 748905
60517 748905 728653 705028 679697 653363 626821 601432 578424 558277 541184 527627 518047 512221
60505 512221 509502 509587 512632 518701 527587 539221 553854 571646 592298 615144 639326 663768 687273
60492 687273 708775 727307 741728 750961 754840 754515 751730 747767 743213 738428 733816 729750 726510 724309
60478 724309 723183 723062 724335 728307 736688 750566 770142 795493 827177 865979 912519 967394 1031426
60465 1031426 1105392 1189656 1284328 1389489 1504645 1627648 1754205 1878360 1993206 2091374
60455 2091374 2165628 2209965 2220667 2196757 2139987 2054648 1947017 1824228 1693094 1559713
60445 1559713 1429631 1307545 1196305 1096402 1006872 926834 856070 794350 740782 694097 653301
60434 653301 617719 586566 558889 534048 511950 492646 475790 460754 447310 435967 427375 421338
60422 421338 416622 411988 407274 403210 400182 397587 394588 391140 387908 385378 383460 381897 380598 379529
60408 379529 378575 377658 376765 375778 374549 373248 372386 372357 373155 374624 376715 379369 382428 385869 389820 394074
60392 394074 397909 400856 403491 406933 411512 416315 420185 422892 425142 427692 430656 433540 435761 437200
60378 437200 438332 439780 441691 443660 445301 446679 448076 449567 450996 452256 453263 453750 453429 452538 451959
60363 451959 452524 454248 456394 458221 459478 460282 460846 461461 462504 464232 466621 469537 472920 476734 480936
60348 480936 485707 491440 498106 504753 510117 513737 516056 517461 517868 517470 517103 517161 516612 513983 509301 504305
60332 504305 500591 498227 496454 495007 494084 493422 492275 490357 488161 486090 483707 480277 475873 471542 468291
60317 468291 466160 464358 462154 459461 456645 453943 451141 447838 444082 440707 438778 438623 439568 440831 442375
60302 442375 444561 447203 449590 451511 453570 456126 458394 459155 458150 456329 454803 453830 452785 450859 447913
60287 447913 444811 442651 441449 439998 437424 434349 431836 429642 426626 422785 419669 418391 418294 418262 418471
60272 418471 419895 422640 425808 428791 431818 435173 438633 441876 444868 447655 450235 452736 455331 457860
60258 457860 459952 461660 463511 465743 467886 469448 470729 472565 475364 478681 481788 484518 487579 492073
60244 492073 498673 507175 516870 527258 538340 550420 563970 579631 597918 618700 641229 664945
60232 664945 690060 717207 746699 778331 811755 846881 884069 924091 967664 1014687 1064010
60221 1064010 1114106 1163825 1212278 1258349 1300910 1339556 1374611 1406192 1433542 1455507 1471420
60210 1471420 1481360 1485793 1485234 1480107 1470686 1457233 1440417 1421576 1402381 1384264 1368144 1354527
60198 1354527 1343679 1335852 1331591 1331740 1336971 1347342 1362593 1382826 1408566 1440157 1477421 1519977
60186 1519977 1567511 1619405 1674302 1730418 1786251 1840834 1893249 1942149 1985857 2022914 2052517
60175 2052517 2074517 2089011 2095979 2095257 2086736 2070441 2046578 2015889 1980049 1941374 1901772 1862037
60163 1862037 1822311 1783143 1745899 1712307 1683845 1661505 1645869 1637302 1636108 1642379 1655613 1674729
60151 1674729 1698735 1727125 1759284 1793618 1827762 1859660 1888034 1911850 1929977 1941698 1947188
60140 1947188 1947117 1942020 1932335 1918784 1902403 1884316 1865785 1848300 1833243 1821484 1813524 1809992 1811758
60127 1811758 1819562 1833755 1854434 1881703 1915840 1957441 2007419 2066766 2136250 2216327 2307232
60116 2307232 2409008 2521486 2644228 2776266 2915777 3060271 3207298 3354742 3500125
60107 3500125 3640017 3770710 3889481 3994659 4084390 4155986 4206849 4235693 4242479 4227471 4190903
60096 4190903 4133529 4057084 3964048 3857257 3739814 3615135 3486770 3358082 3232022 3111056
60086 3111056 2997108 2891594 2795605 2710187 2636408 2575108 2526513 2490108 2464928 2450077 2445074
60075 2445074 2449788 2463972 2486733 2516297 2550324 2586524 2623029 2658252 2690578 2718315 2739881
60064 2739881 2753921 2759391 2755816 2743526 2723395 2696188 2662211 2621671 2575156 2523584 2467749 2408198
60052 2408198 2345595 2281006 2215664 2150582 2086500 2024214 1964816 1909576 1859576 1815413 1777245
60041 1777245 1745235 1719980 1702327 1692628 1690392 1694999 1706654 1726234 1754168 1789904 1832594 1881726
60029 1881726 1936627 1995745 2057071 2119138 2180931 2240830 2296313 2344987 2385465 2416951 2438460
60018 2438460 2448949 2447996 2435884 2413068 2379933 2337253 2286671 2230566 2171272 2110363 2048742 1987564
60006 1987564 1928900 1875122 1827658 1786671 1752055 1724276 1704065 1691721 1687127 1690257 1701291 1720362
59994 1720362 1747439 1782379 1824980 1875174 1933218 1999310 2072703 2151427 2233085 2315604 2396944
59983 2396944 2474571 2545733 2608155 2660205 2700842 2729717 2746926 2752098 2744201 2722940 2689971 2647893
59971 2647893 2598314 2541771 2479383 2413573 2347082 2282183 2220870 2164770 2114521 2070191 2032691
59960 2032691 2003781 1984188 1972694 1967841 1969758 1979453 1997017 2021560 2052452 2089542 2132289 2179621
59948 2179621 2230623 2284471 2339642 2393953 2445636 2493786 2537658 2576192 2608525 2634525 2654541
59937 2654541 2668990 2678404 2683686 2686156 2687523 2689745 2694602 2703366 2717163 2737630 2766762 2806089 2856412
59924 2856412 2918427 2993045 3080806 3181267 3293236 3415282 3545653 3681873 3820688 3958345
59914 3958345 4090771 4213596 4322242 4412107 4478922 4519439 4532086 4516868 4474626 4406728 4315647
59903 4315647 4205442 4081149 3947690 3809488 3670770 3535563 3407152 3287769 3178857
59894 3178857 3081395 2995880 2922346 2860771 2811304 2773919 2748042 2732947 2728534 2735300 2753305 2781457
59882 2781457 2818046 2861756 2911758 2966939 3025456 3085068 3143476 3198237 3246716 3286387 3315034
59871 3315034 3330683 3331805 3317952 3289890 3248834 3195795 3132015 3059632 2981260 2898802 2813108
59860 2813108 2724790 2635038 2545615 2458460 2375460 2298291 2228209 2165974 2111845 2065507 2026147
59849 2026147 1992961 1965515 1943344 1925400 1910364 1897417 1886120 1875493 1863973 1850568 1835567
59838 1835567 1819860 1804183 1789399 1776776 1767122 1759860 1753720 1748191 1743658 1740179 1736933 1733117 1728832
59825 1728832 1724763 1721314 1718251 1714817 1709952 1702689 1692676 1680208 1665672 1649312 1631740 1614310
59813 1614310 1598463 1584761 1572885 1562480 1553641 1546541 1541023 1536834 1534049 1533045 1534190 1537766 1544090
59800 1544090 1553406 1565464 1579340 1593815 1607956 1621348 1633842 1645225 1655149 1663300 1669538 1673854
59788 1673854 1676274 1676894 1676139 1675012 1675003 1677602 1683812 1694160 1709138 1729481 1756005 1789443 1830639 1880675
59774 1880675 1940367 2009595 2087580 2174150 2270509 2378392 2498463 2629791 2770657 2919051
59764 2919051 3071596 3221827 3359831 3474018 3553956 3592707 3587884 3541631 3459906 3351413
59754 3351413 3226206 3093989 2962495 2836826 2720082 2614474 2521718 2442539 2376392 2322013
59744 2322013 2278207 2244052 2218692 2201392 2191782 2189683 2194655 2205998 2223297 2246692 2276404 2312165
59732 2312165 2353413 2400001 2452588 2512382 2580626 2658217 2745603 2843012 2950929 3070371 3202580
59721 3202580 3348480 3508684 3683981 3875487 4083993 4309332 4550586 4806762 5076849
59712 5076849 5358998 5649758 5944171 6236537 6521252 6793447 7049436 7286854 7504493
59703 7504493 7702174 7880842 8042599 8190296 8326712 8453800 8572381 8682394 8783480
59694 8783480 8875271 8957049 9027258 9083896 9125708 9152746 9165554 9164260 9149131 9121935 9086073
59683 9086073 9045190 9002127 8959495 8920755 8890254 8872341 8870626 8887732 8925308 8984446 9066409
59672 9066409 9172867 9305039 9462695 9644281 9847897 10071673 10313126 10568489 10832640
59663 10832640 11099227 11360560 11607627 11830555 12019142 12163277 12253631 12282826 12246454 12143359
59653 12143359 11975457 11747652 11467754 11145853 10793224 10421437 10041983 9665854 9302609
59644 9302609 8959308 8640197 8347286 8080740 7838239 7613838 7397949 7179174 6947141
59635 6947141 6694865 6419951 6124688 5815084 5499100 5184807 4879225 4587933 4314966
59626 4314966 4062796 3832496 3624064 3436671 3268842 3118728 2984474 2864482 2757500
59617 2757500 2662543 2578660 2504715 2439458 2381834 2331055 2286276 2246413 2210447 2177800 2148239
59606 2148239 2121521 2097255 2074957 2054027 2033816 2013860 1993910 1973587 1952312 1929861 1906705
59595 1906705 1883483 1860334 1837163 1814301 1792345 1771456 1751346 1731917 1713338 1695537 1678260
59584 1678260 1661718 1646517 1632719 1619619 1606748 1594508 1583471 1573628 1564784 1557209 1551305 1547050
59572 1547050 1544353 1543640 1545415 1549458 1555128 1562396 1571913 1584041 1598424 1614698 1633120 1654229 1678260
59559 1678260 1705158 1734991 1768119 1804979 1845740 1890028 1937133 1986756 2039614 2097011 2159711
59548 2159711 2227394 2299247 2374809 2454153 2537564 2625414 2718202 2816170 2918270 3021169 3119517
59537 3119517 3207802 3282612 3343463 3391718 3428980 3456321 3474312 3483163 3482968 3474216 3457956 3435034
59525 3435034 3405337 3368296 3324126 3274087 3219525 3161284 3100315 3038280 2977127 2918391 2863317
59514 2863317 2813414 2770445 2735909 2710818 2695919 2691906 2699540 2719752 2753527 2801468 2863627 2939905
59502 2939905 3030287 3134178 3249580 3373327 3502023 3632215 3759615 3878874 3984646 4072589
59492 4072589 4139105 4180739 4194706 4180114 4138181 4071242 3982050 3874103 3751964 3620698 3485102
59481 3485102 3349631 3218572 3095608 2983171 2882547 2794556 2719918 2659097 2612244 2579262
59471 2579262 2559604 2552036 2555128 2568130 2591023 2623563 2664538 2711994 2763767 2817574 2871027 2921933
59459 2921933 2968380 3008273 3039092 3058499 3065117 3058543 3038840 3006279 2961349 2904723 2837330 2760717
59447 2760717 2677132 2588878 2497645 2404708 2311555 2219909 2131142 2045993 1964854 1888084 1816029
59436 1816029 1748914 1686726 1629206 1576221 1528187 1485686 1448426 1415123 1384889 1358239 1336002
59425 1336002 1317683 1301862 1288112 1277506 1271041 1268544 1269431 1273721 1281754 1293456 1308323 1325448
59413 1325448 1343026 1358419 1369558 1376201 1379447 1380474 1380343 1380673 1383494 1390204 1400987 1415157 1431496
59400 1431496 1448205 1463177 1474854 1482939 1488360 1492769 1497937 1505192 1515150 1527993 1543969 1563534
59388 1563534 1587077 1614729 1646380 1681739 1720392 1761990 1806333 1853222 1902424 1953990 2008439
59377 2008439 2066337 2127728 2192223 2259541 2329744 2403030 2479665 2560145 2645181 2735443 2831548
59366 2831548 2934369 3045265 3165976 3298341 3443983 3604032 3779155 3969935 4176979
59357 4176979 4400321 4638700 4889618 5149950 5416125 5683742 5947543 6202155 6442957
59348 6442957 6666357 6869664 7050955 7208986 7343059 7452831 7538014 7597932 7631317 7636642
59338 7636642 7612632 7558345 7472958 7355945 7207549 7028912 6821840 6588964 6334374 6063755
59328 6063755 5783543 5499968 5218785 4945274 4683775 4437064 4206378 3992071 3794114
59319 3794114 3612085 3445017 3291568 3150464 3020849 2902189 2793803 2694550 2603132 2518671
59309 2518671 2440816 2369330 2303799 2243794 2188967 2138868 2092987 2051236 2014110 1982083 1955062
59298 1955062 1932794 1915473 1903249 1894987 1888053 1879615 1867947 1852488 1833374 1811563 1789144 1768662
59286 1768662 1751746 1738600 1728946 1723087 1721830 1725628 1734243 1747193 1764220 1785256 1810211 1838898
59274 1838898 1870972 1905755 1942157 1978876 2014703 2048653 2079938 2107811 2131343 2149332 2160641
59263 2160641 2164695 2161530 2151291 2133928 2109542 2078819 2042902 2002969 1960134 1915560 1870340 1825398
59251 1825398 1781831 1741132 1704492 1671780 1641726 1613437 1587408 1564845 1546328 1531500 1519816
59240 1519816 1511186 1505913 1504277 1506130 1510689 1516846 1523971 1532353 1542629 1554869 1568617 1583781 1600981
59227 1600981 1620793 1642961 1666717 1691766 1718628 1748045 1780298 1815151 1852253 1891535 1933379
59216 1933379 1978591 2028087 2082466 2141933 2206698 2277362 2354703 2439238 2531337 2631827 2742068
59205 2742068 2863106 2994956 3136979 3288589 3448934 3615777 3785133 3952089 4111546
59196 4111546 4258065 4385733 4488938 4563304 4605733 4614023 4587171 4526106 4433668 4313752 4170799
59185 4170799 4010031 3837514 3659441 3481282 3307527 3141715 2986270 2842347 2710200
59176 2710200 2589935 2481955 2386744 2304189 2233096 2171477 2117595 2070695 2030540 1996287 1966274
59165 1966274 1939092 1914442 1892572 1873056 1854531 1835537 1815198 1793046 1768630 1741568 1711824
59154 1711824 1679637 1645204 1608643 1570398 1531572 1493612 1457398 1422631 1388306 1353948 1320298
59143 1320298 1288704 1259999 1234104 1210547 1189023 1169468 1151914 1136441 1123122 1111924 1102704
59132 1102704 1095322 1089570 1085038 1081316 1078452 1076935 1077083 1078674 1081457 1085767 1092264 1101116 1111856 1124051
59118 1124051 1137745 1153068 1169765 1187390 1205834 1225396 1246369 1268752 1292234 1316153 1339529
59107 1339529 1361475 1381764 1400846 1419167 1436575 1452486 1466539 1478997 1490632 1502389 1515148
59096 1515148 1529545 1545846 1563943 1583560 1604549 1627070 1651500 1678111 1706770 1736883 1767604
59085 1767604 1798080 1827686 1856201 1883748 1910364 1935604 1958722 1979242 1997035 2011670 2021982
59074 2021982 2026629 2024948 2016949 2002630 1981779 1954480 1921366 1883171 1840421 1793787 1744440 1693704
59062 1693704 1642519 1591510 1541411 1493007 1446713 1402569 1360688 1321447 1285203 1252073 1222070
59051 1222070 1195206 1171310 1149960 1130793 1113829 1099269 1086962 1076203 1066195 1056747 1048423 1041948
59039 1041948 1037557 1035102 1034640 1036538 1040838 1046969 1054398 1063307 1074151 1086687 1099904 1112832 1124860
59026 1124860 1135265 1143110 1147989 1150467 1151385 1151040 1149308 1146293 1142421 1138113 1133720 1129636 1126097 1122960
59012 1122960 1120034 1117536 1115940 1115462 1116001 1117371 1119173 1120519 1120476 1118980 1116900 1115014 1113160 1110521 1106415
58997 1106415 1100649 1093437 1085289 1076850 1068639 1060976 1054204 1048797 1045120 1043229 1042997 1044282 1046877 1050495
58983 1050495 1054913 1059948 1065124 1069551 1072318 1072933 1071323 1067676 1062463 1056372 1049951 1043421 1036989 1031095
58969 1031095 1026019 1021460 1016950 1012622 1009157 1006926 1005622 1004926 1005143 1006829 1009901 1013443 1016479 1018795
58955 1018795 1020976 1023736 1027306 1031462 1036000 1041019 1046758 1053368 1060937 1069550 1079107 1089284 1099922
58942 1099922 1111333 1123859 1137168 1150350 1162876 1175058 1187377 1199746 1211818 1223823 1236605
58931 1236605 1250801 1266372 1283102 1301272 1321527 1344170 1368840 1394997 1422607 1452267 1484748
58920 1484748 1520585 1560104 1603563 1650989 1701846 1755153 1810069 1866211 1923338 1981018 2038999
58909 2038999 2097897 2159245 2224665 2295099 2370825 2451961 2538753 2631425 2729993 2834333 2944414
58898 2944414 3060398 3182492 3310711 3444857 3584816 3730774 3882984 4041303 4205013
58889 4205013 4372969 4543620 4714865 4884243 5049498 5208677 5359344 5497887 5620019
58880 5620019 5722121 5802019 5858707 5891823 5901417 5887752 5850994 5791278 5709289 5606687 5485893
58869 5485893 5349678 5200985 5042778 4877721 4708138 4536444 4365269 4196862 4032487
58860 4032487 3872692 3717972 3568883 3425751 3288777 3158368 3034991 2918692 2809054
58851 2809054 2705585 2607797 2515039 2426831 2343443 2265662 2193848 2127655 2066791 2011430 1961537
58840 1961537 1916319 1874974 1837721 1805480 1778552 1756046 1736573 1719163 1703485 1689645 1678048
58829 1678048 1669261 1663664 1661113 1660994 1662745 1666396 1672586 1681954 1694639 1710494 1729578 1752050 1777661
58816 1777661 1805906 1836807 1871080 1909250 1951061 1996047 2044232 2095841 2150787 2209051 2271324
58805 2271324 2338613 2411351 2489402 2572871 2662259 2757845 2859608 2967928 3083804 3208136
58795 3208136 3341198 3482965 3633381 3791922 3957190 4127350 4300817 4476321 4652487
58786 4652487 4827515 4999019 5163889 5318463 5459074 5582420 5685454 5765233 5819128 5845221
58776 5845221 5842517 5810972 5751387 5665095 5553809 5420038 5267604 5101191 4925093 4742566
58766 4742566 4556382 4369433 4184397 4003164 3827005 3657085 3494416 3339503 3192464
58757 3192464 3053420 2922386 2798947 2682456 2572613 2469507 2373116 2283091 2199144 2121338
58747 2121338 2049916 1985034 1926679 1874618 1828255 1786753 1749498 1716364 1687484 1662788 1641813
58736 1641813 1623844 1608058 1593525 1579215 1564238 1548279 1531727 1515211 1498983 1482928 1467152
58725 1467152 1452298 1439153 1428169 1419486 1413116 1408681 1405064 1400607 1393689 1383052 1367798 1347484
58713 1347484 1322237 1292532 1258795 1221432 1181221 1139369 1097086 1055296 1014823 976486 940713
58702 940713 907264 875759 846571 820821 799244 781285 765664 751770 740003 730689 723260 717024
58690 717024 712261 709777 709408 709704 709230 707534 704605 700180 694127 686997 679556 672111 664885 658637 654201
58675 654201 651569 650168 649961 651536 655063 659856 665183 670932 677306 684355 691986 699903 707250 712779
58661 712779 715704 716153 714632 711473 706981 701629 695741 689299 682323 675101 667748 659879 651062 641288
58647 641288 630792 619826 608977 599232 591223 584710 579201 574660 571082 567880 564556 561727 560603
58634 560603 561491 563606 566357 569822 573788 577384 580251 583276 587404 592295 596942 601200 605830 611242
58620 611242 617069 623099 629805 637670 646566 656190 666698 678537 691847 706395 721959 738491 755979
58607 755979 774450 794114 815343 838441 863560 890861 920653 953279 988826 1027024 1067515
58596 1067515 1110282 1155729 1204229 1255639 1309306 1364443 1420251 1475687 1529396 1580015 1626395
58585 1626395 1667456 1702035 1729105 1748106 1758934 1761747 1756917 1745053 1726893 1703259 1675323 1644823
58573 1644823 1613628 1582965 1553159 1524182 1496311 1470212 1446527 1425492 1406890 1390320 1375512
58562 1375512 1362379 1350746 1340184 1330205 1320381 1310015 1297799 1282251 1262648 1239300 1212806 1183408
58550 1183408 1151229 1116793 1080941 1044419 1007948 972634 939801 910202 883589 859265 836954
58539 836954 816998 799772 785058 772000 759531 746896 733861 720671 707771 695417 683441
58528 683441 671463 659432 647792 636993 627005 617563 608726 600831 593891 587534 581629 576558 572572
58515 572572 569231 565875 562409 559246 556616 554341 552227 550336 548849 548009 548210 549836 552850 556758 561080
58500 561080 565761 571146 577675 585566 594563 604000 613281 622350 631493 640756 649873 658902 668604 679881
58486 679881 692844 706562 719732 731574 742121 751673 760022 766351 769960 770902 769716 766699 761717
58473 761717 754645 745606 734780 722371 708939 695436 682664 670831 659756 649264 639216 629428
58461 629428 619900 611030 603245 596472 590208 584214 578801 574332 570646 567249 564005 561326 559670 559091
58447 559091 559434 560617 562446 564387 566048 567847 570685 574840 579705 584801 590478 597202 604775 612939
58433 612939 622294 633683 646745 659997 672522 684810 697647 710885 723842 736390 749047 762147
58421 762147 775241 787054 795721 799426 797469 790844 781522 771098 760259 749373 739262 731174 725991
58408 725991 723522 722764 723043 724694 728389 734010 740678 747819 755528 763763 771809 778871 784649 788985 791482
58393 791482 791933 790731 788379 784998 780824 776719 773535 771254 769455 768349 768560 769988 771767 773494 775755
58378 775755 779176 783577 788378 793277 798116 802475 805901 808403 810460 812637 815319 818605 822295 826161
58364 826161 830308 835055 840401 845962 851569 857611 864507 872145 880096 888154 896354 904675 913085 921823
58350 921823 931306 941771 953171 965365 978175 991351 1004729 1018406 1032453 1046473 1059691 1071630
58338 1071630 1082424 1092416 1101697 1110216 1118099 1125560 1132628 1139296 1145907 1153056 1161047 1169758 1179121 1189445
58324 1189445 1201043 1213801 1227348 1241483 1256220 1271607 1287881 1305568 1325017 1345889 1367525
58313 1367525 1389751 1412865 1436826 1461033 1485018 1508797 1532289 1554939 1576259 1596273 1615051
58302 1615051 1632277 1647829 1662419 1677089 1692269 1707921 1724391 1742366 1761889 1782088 1802178
58291 1802178 1822416 1843851 1867322 1892843 1919755 1947455 1976156 2006971 2041067 2078774 2119705
58280 2119705 2163597 2210658 2261067 2314521 2370460 2428496 2488426 2549862 2612039 2674068 2735543
58269 2735543 2796972 2859425 2923546 2988945 3054615 3119708 3183774 3246514 3307717 3367393 3425834
58258 3425834 3483738 3542510 3604125 3670197 3741279 3817281 3898316 3984692 4076379 4173150 4275297
58247 4275297 4383690 4498991 4621237 4750314 4886557 5030841 5184275 5347754 5521523
58238 5521523 5705290 5899074 6103864 6321119 6551859 6796681 7056549 7333045 7627910
58229 7627910 7942850 8279706 8640349 9026527 9440398 9885228 10365033 10883597 11444466
58220 11444466 12052023 12712083 13431420 14217389 15078298 16023904 17065652 18217112 19494620
58211 19494620 20917624 22509148 24297144 26316247 28609016 31227047 34233122 37703859
58203 37703859 41731146 46421621 51894363 58276896 65701172 74303669 84232459 95658760
58195 95658760 108787993 123867427 141187896 161070506 183817206 209591771 238202762
58188 238202762 268813554 299708618 328320957 351657592 367037015 372830232 368863814
58181 368863814 356327573 337282365 314021226 288546446 262322111 236305715 211128702
58174 211128702 187262425 165085117 144873085 126779884 110836254 96967048 85016764
58167 85016764 74781665 66041982 58583954 52210161 46744992 42038523 37966396 34425924
58159 34425924 31332645 28618274 26227335 24112601 22232952 20554041 19048116 17691694
58151 17691694 16463908 15347098 14327527 13394640 12539994 11756977 11040469 10385882 9788424
58142 9788424 9243090 8744858 8288985 7871580 7489625 7139679 6816725 6515066 6230407
58133 6230407 5960472 5703830 5459133 5225691 5003841 4794187 4596860 4411667 4238290
58124 4238290 4075924 3923160 3778694 3641977 3512969 3391497 3277103 3169330 3067856
58115 3067856 2972283 2881952 2796096 2714267 2636471 2562630 2491932 2423182 2355919 2290681 2227917
58104 2227917 2167157 2107681 2049560 1993414 1939515 1887839 1838869 1793650 1752987 1717009 1685466
58093 1685466 1657988 1634018 1612863 1593816 1575988 1558206 1539343 1518567 1495037 1467797 1436505
58082 1436505 1401911 1365086 1326564 1286856 1247350 1209723 1174588 1141566 1110542 1081933 1055691
58071 1055691 1031110 1007860 986391 966987 949258 932778 917456 902914 888398 873868 860433
58060 860433 849050 839265 829740 819543 808374 796100 782762 768828 754843 741056 727731 715449
58048 715449 704533 694509 684696 675068 665984 657377 648842 640414 632616 625744 619674 614352 609933 606323
58034 606323 602998 599443 595438 590860 585589 579730 573585 567277 560654 553667 546535 539423 532245 524980
58020 524980 517960 511607 505960 500648 495312 489975 485057 481063 478261 476589 475847 475868 476453 477274 478087 479053
58004 479053 480646 483177 486513 490378 494822 500298 507291 515943 526042 537232 549150 561329 573147
57991 573147 583985 593427 601266 607482 612423 616854 621444 626036 629749 632035 633468 635255 638147 642049
57977 642049 646552 651413 656457 661326 665583 668954 671344 672699 672917 671742 668564 662405 652468 638921
57963 638921 623066 606496 589978 573273 556060 538845 522805 508796 496729 485925 475998 467366
57951 467366 460984 457552 456960 458478 461475 465814 471593 478791 487398 497596 509406 522211 535005
57938 535005 547153 558618 569397 579016 586690 591718 593684 592560 588720 582646 574553 564466 552705
57925 552705 540011 527154 514732 503360 493678 486003 480244 476228 473690 471836 469496 466081 461994
57912 461994 457721 452865 446563 438595 429640 420572 411915 403825 396130 388510 380990 374169 368640 364334
57898 364334 360790 357886 355776 354322 353208 352598 353042 354575 356366 357434 357262 355678 352735 348955 345151
57883 345151 341547 337451 332199 326129 320254 315257 311246 308230 306284 305277 304995 305617 307699 311469 316410
57868 316410 321745 327223 333332 340861 350298 361443 373441 385201 395988 405638 414194 421411 426768
57855 426768 430011 431477 431696 430730 428125 423600 417530 410577 403003 394665 385658 376574 367927 359568 351044
57840 351044 342506 334919 329176 325170 322043 319338 317595 317702 319902 323729 328608 334035 339216 343201
57826 343201 345736 347543 349323 350699 350666 348874 345921 342437 338485 334082 329830 326640 325001 324672 324901
57811 324901 324734 323420 320857 317676 314691 312250 310248 308679 308003 308868 311509 315564 320569 326562 333909
57796 333909 342511 351574 360497 369591 379361 389254 397834 404299 409167 413246 416615 419040 420786 422333
57782 422333 423654 424428 424705 424647 423692 420690 415015 406932 396819 384713 370919 356498 342536 329191
57768 329191 315876 302230 288506 275167 262520 250766 240056 230451 222056 215238 210392 207360
57756 207360 205313 203372 201272 199310 197757 196505 195269 194015 193112 193002 193707 194702 195444 195960 196769 198163
57740 198163 199845 201361 202609 203714 204702 205722 207432 210551 214906 219324 222749 225134 227029 228670
57726 228670 229864 230570 231069 231598 232117 232444 232356 231614 230143 228210 226210 224376 222949 222408 223047 224383 225495
57709 225495 226071 226707 228075 230327 233426 237430 241981 246081 249046 251493 254766 259368 264496 269116 273084
57694 273084 277120 282083 288420 295935 303864 311463 318808 326907 336833 348806 362310 377013 393328
57681 393328 411983 433277 457000 483080 512077 544854 581955 623618 670494 724034 785998
57670 785998 857641 939415 1030946 1130635 1234810 1337341 1430556 1507388 1563710 1599420 1617482
57659 1617482 1621871 1616187 1603581 1586860 1567800 1546452 1521722 1492751 1459535 1422359 1381244 1336212
57647 1336212 1287802 1237024 1184981 1132717 1081284 1031684 984648 940499 899217 860658 824791
57636 824791 791743 761649 734555 710541 689765 672179 657289 644388 632981 622881 614030 606546
57624 606546 600851 597340 595845 595778 596856 599385 603733 609909 617940 628282 641515 657777 676825 698538
57610 698538 723005 750156 779657 811296 845250 881785 920743 961478 1003287 1045799 1088773
57599 1088773 1131468 1172357 1209670 1242183 1269233 1289965 1302929 1306690 1300691 1285341 1261479 1230073
57587 1230073 1192424 1150250 1105266 1058647 1010977 962704 914589 867702 822906 780387 739799
57576 739799 700919 664070 629830 598472 569808 543477 519247 497053 476908 458833 442701
57565 442701 428171 414823 402404 390876 380248 370429 361331 353011 345604 339054 333018 327140 321481
57552 321481 316560 312875 310435 308827 307676 306863 306381 306171 306137 306132 305936 305525 305413 306426 308915 312385 316129
57535 316129 319995 324286 329059 333971 338812 343874 349682 356589 364740 374133 384501 395323 406283
57522 406283 417756 430657 445755 463135 482283 502519 523308 544475 566424 590156 616656
57511 616656 645999 677238 709436 742668 777658 814364 851310 886379 917991 945371 968091
57500 968091 985756 997994 1004358 1004212 996957 982482 961393 934935 904704 872154 838139 803041
57488 803041 767413 732205 698108 665131 633303 603461 576616 552619 530237 508743 488764
57477 488764 471226 456018 442205 429180 417173 406872 398976 393838 391106 389863 389518 390406 393158
57464 393158 397703 403395 409947 417646 426689 437028 449028 463592 481153 500968 521836 543265
57452 543265 565564 589159 614350 641558 671108 702572 734758 766547 797525 827623 856407
57441 856407 882904 905876 923947 935625 939643 935564 924012 906176 883074 855298 823408 788383
57429 788383 751569 714180 676914 640060 603878 568803 535366 504025 474967 447959 422469
57418 422469 398175 375398 354786 336461 319703 303675 288307 274159 261520 250035 239304
57407 239304 229441 220747 213088 206042 199566 193998 189238 184432 178942 173392 169115 166508 164450 161601
57393 161601 157872 154217 151298 148893 146516 144047 141629 139410 137601 136439 135810 135183 134206 133120 132354
57378 132354 131977 131849 132052 132721 133562 133980 133677 132773 131389 129543 127479 125658 124272 123122 122104 121414
57362 121414 121128 120973 120702 120351 119858 118901 117468 116245 115908 116231 116355 115760 114507 112703 110347 107810 105903
57345 105903 105220 105689 106844 108199 109283 109751 109704 109601 109626 109433 108710 107728 107044 106906 107252 108046 109242 110499
57327 110499 111341 111597 111440 111027 110394 109697 109191 108948 108899 109208 110286 112243 114591 116701 118393 119848 121194
57310 121194 122489 124017 126178 129048 132304 135662 139084 142480 145580 148357 151339 155073 159428 163795
57296 163795 167981 172456 177659 183478 189732 196807 205277 214977 224845 233835 241758 249148 256553 264177
57282 264177 272041 280222 288752 297327 305252 311782 316579 319753 321417 321350 319260 315267 309880 303481 296069
57267 296069 287578 278235 268428 258380 248140 237886 228084 219254 211569 204746 198376 192462 187516
57254 187516 184019 181824 180247 178738 177244 175948 174939 174278 174101 174371 174676 174544 173901 172989 171956 170800
57238 170800 169642 168728 168108 167635 167476 168268 170468 173661 176854 179455 181708 184104 186674 189024 190881
57223 190881 192349 193647 194853 195967 197120 198562 200488 202883 205553 208265 210918 213582 216376 219320
57209 219320 222378 225585 229012 232610 236173 239575 242902 246362 250175 254573 259690 265317 270914 276031
57195 276031 280663 285037 289216 293189 297254 301991 307689 313949 319951 325142 329688 334345 339787 345915
57181 345915 351909 357066 361526 366020 371085 376743 382786 388936 394843 400386 406045 412449 419451 426106
57167 426106 431866 437337 443507 450598 458137 465881 474109 483085 492768 503109 514245 526242 538915
57154 538915 552044 565604 579697 594424 609810 625738 641943 658230 674674 691487 708746
57143 708746 726368 744280 762365 780326 797894 815209 832760 850869 869471 888481 908167
57132 908167 929052 951543 975793 1001782 1029464 1058836 1089983 1123073 1158326 1195948 1236066
57121 1236066 1278704 1323930 1372041 1423453 1478445 1537291 1600749 1670005 1745872 1828397 1917706
57110 1917706 2014988 2122083 2240327 2370607 2514662 2675735 2857834 3065187 3303028 3578474
57100 3578474 3900015 4276311 4715812 5226940 5817504 6493152 7256261 8106139 9040208
57091 9040208 10055319 11148611 12317442 13558319 14865100 16226195 17619862 19008207
57083 19008207 20333971 21525212 22508652 23226200 23646818 23769330 23616925 23227193 22641777
57074 22641777 21898694 21028795 20056157 19000770 17881573 16718517 15533355 14349227
57066 14349227 13189207 12074171 11020852 10040959 9141369 8324735 7590081 6933667 6350201
57057 6350201 5833788 5378075 4976010 4620090 4303121 4018769 3761665 3527534 3313692
57048 3313692 3119236 2944330 2788826 2651342 2529412 2420252 2321313 2230290 2144990 2063468
57038 2063468 1984461 1907732 1833995 1764388 1699828 1640767 1587501 1540557 1500541 1467646 1441673
57027 1441673 1422675 1411174 1407463 1411107 1421508 1438207 1459128 1478082 1485273 1471917 1435167 1378906
57015 1378906 1310486 1237018 1163737 1093985 1029547 971090 918651 871912 830290 793251 760656
57004 760656 732506 708249 686716 666872 648361 631125 614870 599222 584196 570111 557041
56993 557041 544655 532648 521130 510467 500873 492316 484780 478444 473412 469240 464873 459222 451802
56980 451802 442766 432386 420691 407654 393666 379713 366951 355977 346518 338039 330658 325229
56968 325229 322392 321906 323205 326251 331359 338380 346686 355991 366595 378613 391423 404088 415833
56955 415833 425762 432572 435114 433232 427793 420018 410971 401503 392282 383772 376251 369807 364349 359922
56941 359922 357034 356270 357436 359596 362365 366708 373968 384370 396953 410660 424708 437983 448799
56928 448799 455545 457228 453468 444614 431946 417177 401373 384745 367603 350952 335833 322502
56916 322502 310643 300028 290625 282361 275225 269317 264430 259803 254732 249308 244230 240068 237021 235186
56902 235186 234565 234857 235631 236682 238010 239595 241591 244575 249174 255446 263042 271811 281776 292572 303570
56887 303570 314569 325732 336616 345942 352665 356745 358482 357703 354299 349200 344025 339755 336267 333191
56873 333191 330698 329337 329521 331354 334751 339609 346086 354689 365940 379965 396596 415717 436986
56860 436986 459191 480246 498053 511167 518747 520366 516191 507041 494003 478171 460931 444123
56848 444123 429542 418292 410714 406672 405742 407515 412164 420583 433619 451339 473404 499940 531396
56835 531396 567379 605976 644284 679135 707179 724996 730083 722067 702883 675664 643393 608397
56823 608397 572750 538798 508883 484351 464999 449857 438560 431650 429583 432027 438509 449384
56811 449384 465548 487133 512812 540396 567711 592700 612998 625947 629415 622841 607510 585746
56799 585746 559725 531031 501203 472224 446035 423576 404545 388205 374293 363187 355429 351156
56787 351156 349886 350873 353872 359564 368921 381916 396885 411190 422443 429139 430538 426414 417078
56774 417078 403456 386941 368981 350690 332721 315438 299149 284130 270562 258581 248312
56763 248312 239676 232236 225535 219671 215218 212412 210575 208649 206147 203360 200739 198379 196074 193643
56749 193643 191076 188505 186073 183714 181108 178055 174894 172344 170802 170020 169557 169412 169979 171440 173356
56734 173356 174941 175702 175804 175744 175695 175316 174370 173373 173253 174335 175945 177243 178082 178756 179227 179100 178299 177236
56716 177236 176203 175101 173966 173320 173576 174372 174947 175024 174909 174869 174919 175222 176104 177465 178694 179496 180320 181541
56698 181541 182554 182396 181113 179855 179502 179724 179606 178735 177400 176117 175279 175070 175374 175858 176331 176840 177324
56681 177324 177493 177305 177253 177839 178977 180286 181681 183207 184472 184868 184393 183723 183380 183290 183294 183588 184330 185130
56663 185130 185249 184236 182280 180176 178901 178810 179113 178566 176927 175364 175135 176242 177710 178810 179515 179928
56647 179928 179841 178990 177476 175893 175018 175141 175603 175325 174032 172559 171667 171090 170303 169667 169912 170690 170704 169441
56629 169441 167845 166877 166237 165118 163639 162718 162759 163170 163268 163093 163152 163647 164245 164515 164407 164164 163867 163300 162340
56610 162340 161228 160217 159225 158200 157585 157824 158505 158682 158137 157652 157765 157991 157690 157093 156846 157000 157176 157483
56592 157483 158589 160859 163862 166716 168633 169384 169615 170487 172477 174770 176334 177321 178727 180775 182536
56577 182536 183303 183555 184243 185677 187501 189307 190889 192278 193856 196107 198957 201670 203762 205708 208425
56562 208425 212348 217358 223294 229985 236904 243377 249240 254863 260457 265660 270017 273549 276651 279607
56548 279607 282424 285033 287316 288898 289245 288234 286473 284698 282872 280302 276675 272475 267983 262463
56534 262463 255075 246416 238242 231492 225289 218350 210812 204112 199407 196562 194540 192321 189535 186624
56520 186624 184427 183378 183072 182701 181825 180591 179410 178535 177831 176846 175413 174237 174458 176278 178421 179379
56504 179379 178919 177879 176861 175789 174625 173702 173189 172801 172269 171684 171190 170770 170539 170844 171766 172813 173388
56487 173388 173422 173337 173587 174324 175291 175945 175927 175578 175686 176539 177540 178013 178066 178314 179013 179927 180981 182511 184705
56468 184705 187137 189096 190244 190809 191193 191595 192028 192559 193370 194557 196004 197527 199075 200626 202000 202922
56452 202922 203312 203301 202982 202349 201599 201166 201256 201451 201116 200190 199388 199491 200540 201833 202713 203163 203549 203969 204172
56433 204172 204076 203938 203804 203209 201813 199996 198340 196806 195081 193565 193123 193674 193918 192921 191294 190185
56417 190185 189740 189339 188937 189163 190103 190932 191066 191022 191636 192814 193614 193471 192955 193115 194280 195722 196559 196758
56399 196758 196982 197615 198425 199271 200553 202524 204614 206015 206738 207509 208790 210433 212217 214076 215777 217017
56383 217017 217970 219172 220716 222075 222865 223179 222954 221694 219328 216759 215031 214287 214034 213988 214068 213931 213275
56366 213275 212487 212272 212646 212925 212750 212535 212803 213657 215028 216837 218610 219555 219474 219235 219825 221221 222619
56349 222619 223585 224405 225353 226207 226691 227039 227829 229405 231637 234093 236313 238040 239297 240222 240778 240790 240361
56332 240361 240036 240348 241331 242654 244128 245777 247518 249228 251138 253688 256743 259424 261121 262322 263876
56317 263876 265711 266960 267372 267801 269018 270692 271998 272739 273263 273643 273673 273587 274034 275149 276243 276720 276869
56300 276869 277351 278218 278936 279293 279752 280724 281866 282469 282419 282365 282873 283793 284732 285839 287589 289872 291838 292915
56282 292915 293517 294373 295500 296315 296621 296932 297755 298952 300025 300773 301463 302463 303845 305409 307032 308907
56266 308907 311265 313895 316199 317943 319633 321870 324621 327489 330533 334214 338543 342833 346469 349593
56252 349593 352836 356646 360986 365400 369300 372447 375266 378448 382265 386518 391103 396111 401279 405858
56238 405858 409298 411785 414013 416764 420668 425733 430904 434810 437280 439543 442479 445355 446885 446914 446255
56223 446255 445344 444085 442805 442273 442629 443046 442744 441715 440381 439126 438349 438365 438999 439728 440433 441529 443253
56206 443253 445376 447814 450868 454476 457779 459955 461186 462377 464166 466560 469262 471963 474438 476741
56192 476741 479150 481768 484393 487011 490050 493806 497890 501689 505097 508344 511337 513867 516399 519951
56178 519951 524900 530396 535354 539719 544377 550040 556682 564055 572247 581365 590958 600270 609179 618510
56164 618510 629169 641224 654201 667991 682927 699011 715756 733092 751982 773705 798760
56153 798760 826885 858112 893478 934630 982843 1038568 1102140 1175158 1261005 1363602 1485538
56142 1485538 1627650 1790006 1972152 2171628 2382516 2595883 2801592 2990162 3154659
56133 3154659 3292755 3407400 3504715 3590512 3668158 3738289 3798949 3845871 3874154 3881106 3868024
56122 3868024 3839415 3800598 3755311 3704022 3643388 3567356 3469514 3345378 3193830 3017889 2824589
56111 2824589 2623404 2423689 2232880 2056241 1897230 1757624 1637709 1536791 1453415 1385155
56101 1385155 1328889 1281922 1242766 1210688 1184828 1164145 1147891 1135661 1126909 1120723 1116142 1112632
56089 1112632 1110351 1109893 1111571 1114853 1118759 1122870 1127624 1133540 1140633 1148798 1158247 1169071 1180657 1192043
56075 1192043 1202737 1212842 1222578 1232116 1241705 1251553 1261627 1271959 1283001 1295210 1308314 1321478
56063 1321478 1334267 1347095 1360652 1375345 1391361 1408795 1427393 1446549 1465912 1485854 1506967
56052 1506967 1529211 1551861 1574305 1596595 1619136 1642107 1665419 1689174 1713922 1740344 1768794
56041 1768794 1799304 1831935 1866923 1904347 1943756 1984210 2024723 2064703 2104069 2142976 2181428
56030 2181428 2219238 2256472 2293852 2332482 2373129 2415961 2461084 2509098 2560956 2617303 2678094
56019 2678094 2742812 2811056 2882962 2959022 3039401 3123536 3210592 3300255 3392861 3488893 3588765
56008 3588765 3693056 3802355 3916639 4035257 4157937 4285587 4419828 4561905 4712236
55999 4712236 4870714 5037152 5211661 5394924 5588014 5791913 6007446 6235809 6478672
55990 6478672 6737514 7013297 7307225 7621415 7958328 8319921 8707988 9125121 9574830
55981 9574830 10060946 10587611 11159815 11783410 12464725 13210805 14030118 14932647 15929500
55972 15929500 17033355 18259821 19628315 21162176 22889274 24843763 27068085 29614479
55964 29614479 32546533 35941273 39890848 44502225 49894192 56192679 63527325 72032845
55956 72032845 81856636 93170317 106180747 121136548 138325716 158052310 180564521
55949 180564521 205896059 233609193 262512017 290524080 314878443 332700175 341761788
55942 341761788 341074454 331059390 313286711 289972582 263464790 235860013 208793331
55935 208793331 183380023 160263872 139718563 121758435 106235426 92915086 81530204
55928 81530204 71813733 63516753 56417753 50325815 45078863 40540049 36595218 33150812
55920 33150812 30130381 27470542 25118489 23030778 21171552 19510268 18020629 16680791
55912 16680791 15473119 14382810 13396571 12502346 11689626 10949557 10274671 9658454 9094958
55903 9094958 8578712 8104848 7669048 7267300 6895958 6552176 6233914 5939207 5665624
55894 5665624 5410711 5172756 4950816 4744082 4551457 4371572 4202989 4044514 3895619
55885 3895619 3756428 3627055 3507071 3395826 3293047 3198622 3111771 3030656 2952791 2875555
55875 2875555 2796518 2714013 2627943 2539986 2452699 2368264 2287924 2212207 2141235 2074655 2011537
55864 2011537 1950736 1891461 1833457 1776689 1721118 1666949 1614798 1565297 1518651 1474926 1434690
55853 1434690 1398838 1367576 1339853 1313943 1288395 1262370 1235523 1207933 1180007 1152137 1124429
55842 1124429 1096801 1069179 1041519 1013937 987017 961792 939167 919447 902506 888065 875543
55831 875543 863959 852540 841435 831554 823658 817752 813228 809332 805559 801871 798563 795788 793331
55818 793331 790979 788914 787409 786284 784954 782882 779636 774659 767493 758297 747691 735993 722926
55805 722926 708184 691924 674642 657000 639914 624357 610651 598259 586584 575726 566097 557558
55793 557558 549507 541868 535564 531879 531610 534906 541440 550181 558952 564732 565063 559577 550102 539043
55779 539043 527604 515624 502963 490542 479806 471470 465110 459823 454934 450093 445089 439709 433653
55766 433653 426544 418279 409439 401111 394060 388176 382852 377828 373493 370358 368359 366682 364212 360193
55752 360193 354614 348048 341064 333753 325827 317179 308295 300013 292792 286230 279472 272199 265156 259447
55738 259447 255321 251920 248303 244489 241197 238779 236794 234617 232038 229185 226217 223330 220749 218436
55724 218436 215937 212835 209211 205427 201585 197588 193645 190284 187700 185481 183170 180922 179342 178797
55710 178797 179097 179754 180340 180621 180554 180209 179618 178641 177043 174725 171839 168704 165602 162685 160073 158004
55694 158004 156733 156174 155753 154816 153272 151724 150972 151480 153192 155606 157974 159712 160822 161797 163059 164660
55678 164660 166560 168873 171637 174608 177557 180604 183930 187286 190203 192685 195321 198557 202105 205232
55664 205232 207457 208750 209205 208767 207347 205056 202187 198949 195319 191180 186569 181738 177063 173003 170073
55649 170073 168575 168289 168585 168932 169170 169277 169139 168713 168212 167945 168102 168820 170224 172156 174067 175475 176400
55632 176400 177068 177314 176644 174866 172340 169563 166830 164314 162189 160484 158953 157184 154874 152113 149510
55617 149510 147844 147297 147128 146348 144601 142094 138880 134771 129955 125120 120757 116762 112902 109310 106199
55602 106199 103451 100718 97753 94483 91013 87733 85157 83374 81945 80488 79090 77913 76792 75576
55588 75576 74527 73878 73219 71882 69935 68281 67668 67972 68544 68954 69130 69035 68535 67639 66722 66301 66457 66622
55570 66622 66193 65332 64810 64962 65179 64681 63383 61678 59750 57558 55276 53185 51272 49410 47841 46984
55554 46984 46837 47126 47856 49074 50126 50080 49125 48751 49936 51826 52805 52467 51746 51472 51585 51743 51875 51907
55536 51907 51531 50656 49780 49569 50146 51021 51630 51806 51749 51657 51525 51320 51196 51339 51564 51391 50678 49879 49439 49233
55516 49233 48960 48861 49496 50869 52322 53380 54234 55245 56427 57710 59282 61325 63678 66114 68687 71451
55500 71451 74044 75997 77404 78868 80744 82710 84142 84652 84283 83406 82490 81714 80748 79112 76800 74359
55484 74359 72304 70663 69119 67347 65092 62149 58483 54348 50222 46652 44067 42506 41539 40644 39660
55469 39660 38658 37495 35959 34378 33563 33797 34301 34084 33034 31778 30749 29909 29262 29077 29500 30293 31081
55452 31081 31624 31867 31948 32114 32394 32437 31972 31317 30985 30919 30640 30131 29936 30170 30052 28849 26895 25216 24442
55433 24442 24536 25337 26789 28606 30157 30912 30851 30389 29985 29794 29582 29103 28556 28487 29074 29755 29821 29198 28355
55414 28355 27629 27041 26674 26773 27352 28077 28715 29414 30332 31217 31636 31460 30896 30078 28922 27444 26043 25277
55396 25277 25404 26198 27190 27990 28399 28399 28191 28144 28557 29431 30541 31662 32598 33101 32980 32344 31564 30931 30530
55377 30530 30366 30395 30362 29893 28882 27645 26592 25944 25823 26317 27242 28022 28109 27445 26438 25577 25149 25128 25175
55358 25175 24898 24246 23509 22852 22114 21221 20543 20591 21481 22832 24029 24476 23872 22440 20748 19221 18041
55341 18041 17507 17941 19052 19903 19890 19336 18775 18221 17604 17364 17890 18757 19298 19626 20279 21097 21331 20848 20333
55322 20333 20230 20297 20323 20518 20960 21401 21801 22388 22971 22911 22056 21045 20444 20254 20511 21550 23260 24845 25860
55303 25860 26760 27851 28468 27957 26812 25946 25274 24058 22387 21300 21408 22234 23045 23627 23985 23892 23139 21947
55285 21947 20874 20437 20817 21691 22358 22255 21412 20369 19753 19974 21024 22310 22948 22563 21659 20987 20781 20836
55267 20836 20941 20873 20341 19379 18577 18373 18419 18152 17722 17727 18186 18551 18697 19120 19983 20606 20221 18841 17165 15922
55247 15922 15463 15677 16150 16596 17121 17841 18413 18384 17897 17565 17627 17718 17487 16952 16223 15403 14880 15176 16313 17786
55227 17786 19206 20489 21380 21490 21060 21035 21925 23135 23845 24027 24086 23944 23193 21945 20848 20263 19897 19338
55209 19338 18625 18131 18098 18358 18549 18631 19139 20614 22723 24320 24589 23846 23034 22749 23006 23524 23829 23340 21927
55190 21927 20276 19323 19363 20030 20953 21999 22990 23729 24331 25066 25725 25669 24732 23661 23314 23698 24204 24557 25014
55171 25014 25673 26132 26129 26106 26711 27916 29058 29677 29798 29385 28189 26485 25371 25637 26639 26983 26266 25444
55153 25444 25403 25857 25964 25427 24576 23753 23118 22814 22890 23107 23146 22994 22932 23200 23766 24375 24699 24641 24495 24642 25055
55132 25055 25364 25450 25622 26108 26752 27423 28317 29503 30492 30641 29895 28846 28198 28286 28866 29184 28571 27196 25949
55113 25949 25402 25280 25213 25431 26170 26882 26878 26512 26919 28543 30608 32245 33469 34804 36351 37612 37958 37076
55095 37076 35190 32989 31218 30182 29716 29607 29812 30249 30575 30284 29063 27129 25252 24223 24145 24467 24820
55078 24820 25453 26515 27395 27364 26631 26154 26488 27382 28377 29132 29197 28254 26801 25940 26211 27109 27960 28679 29354
55059 29354 29694 29372 28486 27266 25696 23907 22580 22421 23362 24715 25910 26665 26696 25897 24774 24142 24225
55042 24225 24511 24680 25242 26869 29321 31416 32154 31662 30936 30773 31098 31336 31192 30902 30791 30926 31322 32201
55024 32201 33796 35879 37805 39097 39907 40705 41552 41850 41004 39229 37482 36561 36459 36591 36362 35427 33870
55007 33870 32386 31890 32482 33076 32603 31316 30272 29706 28825 27306 26068 26056 26939 27683 27942 28213 28870 29709
54989 29709 30501 31394 32603 34001 35160 35756 35864 35902 36156 36379 36155 35699 35908 37293 39200 40461 40600
54972 40600 40035 39329 38791 38776 39768 41874 44426 46419 47340 47512 47601 47826 47789 47201 46620 47003 48514 50209
54954 50209 51174 51460 51555 51406 50667 49653 49292 50009 51245 52273 53009 53812 54893 56261 58047 60549 63990
54937 63990 68355 73418 78834 84280 89504 94254 98225 101221 103293 104557 104929 104197 102321 99445 95675
54922 95675 91042 85718 80085 74576 69500 64945 60730 56666 53026 50516 49480 49344 49247 49037 49126 49467
54906 49467 49340 48340 47039 46360 46644 47600 48851 50292 52164 54977 59057 64013 68926 73294 77483
54891 77483 82043 86960 91930 96956 102152 107132 111078 113329 113566 111557 107305 101496 95293 89478 84054
54876 84054 78759 73592 68698 64085 59728 55782 52424 49602 47229 45478 44647 44652 44875 44638 43754 42537
54860 42537 41368 40412 39764 39633 40140 40996 41650 41810 41618 41174 40229 38612 36761 35404 34746 34366 33952 33693
54842 33693 33758 33805 33356 32366 31068 29442 27355 25132 23505 22852 22850 23034 23314 23737 24082 24102 24012 24396 25649
54823 25649 27709 30260 32893 35167 36773 37698 38025 37631 36363 34492 32691 31512 31123 31493 32401 33210
54807 33210 33257 32770 32943 34612 37139 39117 39966 40266 40681 41260 41886 42763 44074 45569 46851 47859 48803
54790 48803 49922 51507 53856 56853 59844 62367 64856 68153 72436 77147 82044 87731 94766 102613
54776 102613 109996 116088 120956 124815 127299 127726 125913 122549 118815 115633 113196 111099 109040 107369
54762 107369 106770 107390 108611 109864 111390 113781 116958 120053 122417 124270 126231 128464 130522 131776 131810
54747 131810 130544 128247 125359 122222 119075 116273 114191 112773 111536 110264 109451 109750 111236 113534 116339
54732 116339 119315 121715 122727 122224 120669 118211 114419 109068 102707 96164 89828 83710 77905 72685
54718 72685 68269 64777 62278 60680 59636 58735 57769 56776 55921 55335 54941 54450 53767 53322 53697 54841 56009
54701 56009 56605 56802 57159 57946 59010 60015 60556 60262 59118 57594 56362 56020 57000 59320 62265 64753
54685 64753 66326 67418 68478 69353 69847 70267 70758 70625 69195 67074 65691 65631 66291 67149 68445 70307 72127
54668 72127 73303 73988 74564 74928 74843 74646 74981 76085 77843 80313 83628 87470 91219 94668 98191 102171
54652 102171 106707 111977 118450 126426 135555 145057 154414 163754 173584 184105 194711 204172 211400 216009
54638 216009 218144 217933 215314 210314 203254 194673 185189 175408 165765 156435 147549 139454 132526 126721
54624 126721 121570 116727 112368 108925 106627 105390 104928 104731 104113 102622 100570 98900 98327 98594 98723 97975
54608 97975 96528 95139 94297 93845 93362 92683 91956 91400 91221 91642 92789 94482 96260 97701 98686 99454 100422
54591 100422 101821 103392 104567 105158 105702 106886 108761 110868 113045 115581 118503 121164 122845 123386 123016
54576 123016 121987 120776 120183 120639 121507 121695 120895 119744 118824 118104 117486 117254 117577 118007 117977 117597 117594 118475 119989
54557 119989 121401 122113 122090 121792 121696 121859 122085 122474 123504 125475 128136 131036 133973 136909 139747 142509
54541 142509 145520 149072 153014 156992 160997 165386 170389 175796 181075 185656 189257 192161 194955 197742
54527 197742 199786 200288 199302 197472 195076 191882 187866 183500 179222 175133 171307 167919 164922 162072 159486
54512 159486 157740 157139 157271 157498 157496 157181 156596 156221 156879 158804 161122 162749 163602 164515 166121 168287 170485
54495 170485 172242 173333 173929 174551 175503 176461 176982 177263 177936 179151 180422 181427 182432 183664 184694 184828
54479 184828 183952 182735 182049 182278 183100 183875 184298 184722 185740 187557 189862 192097 193574 193570 191864 189312 187374
54462 187374 186788 186918 186581 185275 183416 181645 180219 178969 177568 175866 174073 172628 171774 171361 171049 170546
54446 170546 169598 168019 165938 163878 162450 161986 162496 163703 164961 165424 164700 163211 161624 159993 157835
54431 157835 154988 151966 149327 147081 144998 143135 141653 140361 138970 137794 137636 138772 140538 142202
54417 142202 143795 145562 147046 147509 147177 147195 148156 149390 150086 150412 150929 151514 151643 151419 151431 151713 151632 150942
54399 150942 150214 150017 150290 150690 150962 150696 149337 146899 144247 142210 140765 139462 138321 137814 138164 139149
54383 139149 140433 141682 142472 142496 141839 140713 139053 136763 134296 132523 131902 132107 132531 132817 132809 132328 131258
54366 131258 129685 127790 125706 123606 121779 120483 119810 119786 120510 121979 123814 125319 125982 125896 125566 125282
54350 125282 124748 123467 121386 119011 116890 115170 113728 112543 111804 111680 112030 112344 112045 110988 109659 108708
54334 108708 108301 108068 107561 106492 104588 101753 98526 95954 94673 94347 94185 93773 93137 92399 91738 91483 91815
54317 91815 92501 93175 93731 94137 94175 93735 93178 92897 92702 92071 90911 89540 88010 86039 83635 81284 79391
54300 79391 77895 76500 74895 72805 70321 68137 66892 66277 65462 64432 64066 64626 65092 64605 63808 63907 64956
54283 64956 66022 66747 67661 68881 69507 68752 67069 65607 64946 64762 64545 64234 64161 64619 65558 66642 67609 68552
54265 68552 69757 71297 72993 74742 76598 78357 79351 78989 77515 75977 75349 75795 76821 77918 78859 79566
54249 79566 80089 80769 82045 83819 85242 85460 84508 83198 82223 81676 81345 81011 80373 79194 77716 76565 75945
54232 75945 75297 74073 72525 71340 70756 70513 70517 70984 71885 72701 72932 72607 72193 72190 72878 74168 75568 76463 76595
54213 76595 76191 75554 74665 73285 71423 69537 68169 67375 66690 65787 65001 64850 65144 65071 64288 63337 62615 61565
54195 61565 59575 57281 56073 56320 56871 56535 55422 54511 54405 54848 55106 54539 53059 51212 49637 48418
54179 48418 47285 46403 46309 46949 47442 47222 46840 47089 47802 48148 47843 47383 47198 47163 47003 46679 46326 46153 46422
54160 46422 47249 48401 49499 50343 50862 51033 51161 51836 53127 54081 53751 52520 51669 51657 51709 51279 50967 51429
54142 51429 52176 52229 51560 51114 51532 52523 53428 53876 53797 53251 52413 51494 50532 49397 47962 46164 44023 41828
54124 41828 40168 39506 39717 40254 40700 40983 41187 41420 41771 42122 42088 41465 40666 40332 40567 40943 41241 41635 42048
54105 42048 41900 40862 39478 38607 38549 39052 39862 40822 41623 42073 42523 43423 44414 44491 43346 41973 41521 41992
54087 41992 42627 43280 44575 46652 48536 49246 49084 49239 50233 51364 51755 51477 51291 51620 52188 52626 53021 53646
54069 53646 54455 55096 55475 56030 57319 59391 61666 63470 64573 65193 65570 65716 65606 65445 65536 65901 66242 66335
54051 66335 66366 66675 67326 68158 69285 71163 73957 77070 79669 81632 83616 86159 89100 92077 95197 98746
54035 98746 102417 105352 107089 108165 109588 111892 114753 117338 118898 119279 119050 119082 119884 121379 123282 125450
54019 125450 127704 129554 130385 129903 128301 126059 123673 121379 118962 115957 112238 108313 104888 102275 100412
54004 100412 99219 98606 98226 97559 96278 94357 91991 89703 88280 88053 88232 87547 85664 83524 82131 81555
53988 81555 81331 81228 81141 80711 79667 78346 77331 76741 76298 75905 75607 75119 73950 72044 69903 68061 66806
53971 66806 66310 66524 67026 67490 68278 69927 72035 73451 73796 74041 75122 76681 77709 77887 77631 77310 77165
53954 77165 77668 79115 81045 82773 84337 86186 88107 89395 90085 91021 92572 94273 96135 99202 104064
53939 104064 109641 114393 118198 122066 126369 130455 133890 137044 140166 142762 144297 144917 145122 145232 145550
53924 145550 146554 148412 150525 152101 153083 154174 156002 158538 161357 164146 166888 169688 172558 175343
53910 175343 177786 179657 180855 181478 181826 182213 182683 182927 182569 181432 179580 177354 175472 174630 174605 174081 171944
53893 171944 168529 165033 161828 158146 153464 148333 143569 139391 135779 132895 130579 128061 124848 121437
53879 121437 118467 115724 112762 110030 108321 107352 105941 103638 101174 99184 97481 95890 94786 94264 93543
53864 93543 91911 89749 88034 87177 86925 87081 87647 88380 88695 88138 86781 85264 84485 84871 85723 85664 84059
53847 84059 81736 79997 79331 79468 80222 81555 82994 83722 83405 82529 81829 81740 82328 83354 84335 84850 84909 84795
53829 84795 84584 84061 83085 81777 80378 79214 78730 79224 80493 82004 83387 84537 85365 85857 86348 87352
53813 87352 89021 91105 93420 95951 98442 100400 101747 103117 105203 108074 111355 114869 118753 123038
53799 123038 127307 130855 133219 134700 136237 138488 141025 142750 143160 142787 142338 141937 141491 141213 141232 141043
53783 141043 140052 138588 137722 137893 138197 137309 134847 131603 128691 126723 125642 124985 124264 123286 122279 121600
53767 121600 121251 120675 119222 116880 114488 113043 112789 113046 112958 112251 111228 110203 109103 107620 105659 103584
53751 103584 102016 101325 101352 101693 102185 102888 103620 103855 103296 102319 101586 101338 101346 101427 101583 101561 100700 98597 95787
53732 95787 93409 92125 91559 90950 90160 89805 90441 91924 93710 95567 97679 100065 102215 103529 103967 104046
53716 104046 104219 104481 104635 104768 105239 106208 107379 108320 108921 109387 109914 110650 111968 114387 118012 122259 126414
53699 126414 130293 134109 137863 141216 143917 145954 147311 147945 148150 148585 149741 151600 153939 156687 159811
53684 159811 163101 166318 169391 172329 175146 177996 181072 184108 186284 187061 186950 187078 188010 189327 190266
53669 190266 190425 189816 188704 187581 187014 187217 187848 188334 188335 187917 187474 187529 188330 189518 190411 190811 191266 192291
53651 192291 193524 194088 193690 192920 192263 191282 189207 186141 183226 181533 181119 181240 181195 180757 180076 179460 179153
53634 179153 179044 178607 177369 175476 173654 172587 172399 172664 172832 172723 172743 173521 175219 177380 179576 181918
53618 181918 184604 187254 189250 190609 191933 193498 194994 196273 197762 199851 202435 205368 208862 213012
53604 213012 217354 221359 225016 228479 231481 233662 235355 237480 240655 244701 248912 252542 255179 256998
53590 256998 258534 259973 260899 261057 260951 261221 261788 262185 262461 263033 263831 264345 264513 264741 264971 264554 263290 261775
53572 261775 260378 258625 256155 253676 252238 251854 251527 250590 249464 249049 249669 250743 251335 251040 250336 250039
53556 250039 250453 251227 251910 252262 252120 251520 251044 251486 252865 254272 255049 255582 256530 257755 258693 259423 260668
53539 260668 262805 265476 268215 270957 273880 277143 280834 284859 288908 292846 297133 302455 308976 316306
53525 316306 324192 332825 342397 352800 363957 376024 389018 402512 415976 429315 442840 456807
53513 456807 471193 485954 501359 517966 536196 555899 576560 598041 620933 645841 672428
53502 672428 699568 726462 753206 780150 807141 833736 859864 885876 912107 938788 966402
53491 966402 995667 1026889 1059527 1092615 1125517 1158111 1190332 1221886 1252455 1281916 1310124
53480 1310124 1336656 1361043 1383197 1403383 1421903 1439149 1455922 1473191 1491344 1510001 1528738
53469 1528738 1547549 1566281 1584035 1599665 1612759 1623712 1632869 1639933 1644150 1644759 1641408 1634538 1625208
53456 1625208 1614078 1600639 1583962 1564135 1542351 1519492 1495390 1469749 1443055 1415957 1388266
53445 1388266 1359267 1328912 1298043 1267495 1237498 1208067 1179434 1151789 1124806 1097805 1070508
53434 1070508 1043557 1018148 995078 974199 955001 937555 922515 910121 899733 890726 883515 879204
53422 879204 878340 880451 884736 890821 898831 909140 922155 938005 956244 976078 996993 1018960 1041985
53409 1041985 1065786 1090127 1115320 1142139 1171235 1202667 1235908 1270303 1305689 1342627 1381911
53398 1381911 1423843 1468205 1514916 1564396 1617095 1672914 1731299 1791737 1853957 1917864 1983473
53387 1983473 2050744 2119242 2188185 2257201 2326849 2397870 2469886 2541258 2610354 2676504 2739551
53376 2739551 2799015 2854279 2905502 2953790 3000273 3045214 3088108 3128448 3166207 3201638 3234790
53365 3234790 3265370 3292930 3316988 3336649 3350209 3355433 3350422 3334114 3306007 3265851 3214060 3152285
53353 3152285 3083079 3008819 2931132 2851292 2770612 2690085 2609942 2530009 2450578 2372548 2296615
53342 2296615 2222540 2149463 2076887 2005123 1934732 1865760 1797774 1730584 1664682 1600894 1539827
53331 1539827 1481812 1427103 1375823 1327823 1282947 1241512 1204259 1171805 1144302 1121492 1102699
53320 1102699 1086743 1072398 1059246 1047767 1038310 1030278 1022701 1015300 1008550 1002828 998018 993945 990721
53307 990721 988597 987840 988775 991558 995791 1000736 1006159 1012658 1020967 1031187 1042936 1055988 1070475 1086636
53293 1086636 1104690 1124841 1147074 1170961 1195947 1221850 1248867 1277111 1306429 1336748 1368290
53282 1368290 1401149 1434818 1468442 1501543 1534179 1566269 1597105 1625902 1652710 1678331 1703224
53271 1703224 1726922 1748762 1768734 1787120 1803532 1816896 1826414 1832021 1833796 1831438 1824562 1813099
53259 1813099 1797134 1776701 1751999 1723435 1691116 1654665 1614023 1570144 1524398 1477475 1429441
53248 1429441 1380748 1332559 1285968 1241471 1199301 1159716 1122619 1087367 1053258 1019913 986963
53237 986963 953755 919784 885090 849946 814480 779041 744595 712126 681721 652830 625388
53226 625388 600065 577307 556731 537838 520828 506301 494440 484879 477119 470608 464507 457967
53214 457967 450711 443048 435179 426808 417627 407943 398533 389882 381740 373434 364591 355537 346980 339280
53200 339280 332120 324949 317622 310368 303225 295902 288329 280982 274353 268340 262422 256264 249802 242967
53186 242967 235868 229228 223998 220256 216975 213268 209462 206347 203674 200224 195476 190469 186546 183731
53172 183731 180967 177710 174560 172241 170588 168931 167091 165492 164437 163802 163431 163387 163566 163402 162372 160640
53156 160640 158904 157590 156482 155189 153672 152177 150829 149530 148213 147017 146206 145921 145996 146033 145796 145596
53140 145596 145995 146950 147513 146757 144993 143620 143634 144589 145264 145090 144574 144422 144652 144666 143977 142670 141297 140390
53122 140390 140086 140114 140094 139798 139121 137995 136467 134787 133201 131725 130315 129165 128516 128135 127358 125823 123882
53105 123882 122098 120634 119360 118232 117209 116028 114529 113032 111903 110840 109207 107055 105216 104193
53091 104193 103559 102784 102043 101716 101563 101043 100166 99418 98951 98479 97929 97576 97473 97384 97432 98220 99965 102009 103537
53072 103537 104455 105162 105801 106207 106421 106752 107273 107622 107378 106448 105085 103716 102713 102141 101747 101279 100778 100415
53054 100415 100163 99849 99415 98875 98108 96990 95783 95062 95147 95803 96561 97133 97409 97289 96767 96075 95540 95303
53036 95303 95220 94997 94348 93146 91536 89915 88677 87993 87807 87975 88363 88940 89841 91234 92969 94411 94796
53019 94796 93902 92334 91130 91010 91916 93149 93945 94006 93589 93155 92971 93015 93186 93501 94087 95054 96381 97862
53001 97862 99059 99431 98732 97438 96603 96953 98108 98921 98723 98010 97740 98158 98680 98825 98850 99292 100176 100960
52983 100960 101189 100984 100891 101337 102203 102845 102581 101269 99440 97920 97318 97766 98940 100274 101358 102226 103164
52966 103164 104239 105206 105910 106490 106982 107053 106446 105493 104814 104650 104915 105727 107293 109184 110417 110600 110500 111030
52948 111030 112076 112874 113199 113450 113636 113115 111661 110148 109654 110244 111076 111507 111522 111240 110670 110137 110422 111986
52930 111986 114278 116189 117200 117714 118256 118766 118896 118707 118656 118977 119455 119875 120314 120818 121148 121191 121348 122045
52912 122045 122980 123405 123217 123200 123991 125301 126575 127933 129863 132173 133917 134405 133794 132583 131072 129517
52896 129517 128345 127816 127656 127333 126489 124977 122812 120476 118985 119095 120399 121597 121767 121117 120480 120396 120838
52879 120838 121541 122307 123064 123832 124708 125817 127245 128969 130848 132715 134560 136497 138460 140106 141190
52864 141190 141969 142921 144110 145150 145789 146139 146193 145477 143543 140583 137277 134209 131653 129733 128380 127168
52848 127168 125641 123861 122325 121252 120266 118923 117220 115413 113629 111993 110886 110618 110794 110469 109144
52833 109144 107426 106407 106540 107256 107675 107384 106556 105565 104714 104138 103704 102983 101604 99752 98114 97165 96623
52816 96623 95807 94460 92980 91790 90785 89592 88215 87147 86815 87106 87599 88111 88780 89651 90453 90944 91222
52799 91222 91399 91126 89921 88021 86397 85648 85279 84558 83702 83545 84153 84557 84080 83223 82818 82923 83141 83560
52781 83560 84543 85728 86059 85011 83214 81597 80463 79627 79026 78673 78363 77915 77557 77619 77925 77989 77829 78110
52763 78110 79257 80787 81825 82052 81853 81676 81676 81983 82840 84175 85248 85172 83858 82277 81648 82440 84149
52746 84149 85815 86673 86514 85701 84831 84295 84117 84250 84778 85716 86751 87480 87858 88221 88915 90084 91719 93679
52728 93679 95640 97237 98247 98482 97722 96101 94414 93463 93055 92249 90699 89163 88346 87950 87342 86603 86173
52711 86173 85863 85110 84079 83689 84410 85764 87136 88401 89463 89903 89600 89199 89373 89906 90049 89588 88998
52694 88998 88604 88222 87801 87921 89220 91459 93532 94508 94479 94231 94226 94199 93797 93284 93323 94204 95573 96934 98048
52675 98048 98836 99248 99433 99785 100549 101450 101859 101366 100184 99062 98717 99138 99478 98862 97324 95704 94596
52658 94596 93762 92657 91175 89671 88538 87996 88019 88211 87986 87158 86115 85221 84398 83652 83605 84901 87224
52641 87224 89530 91264 92742 94171 95008 94717 93794 93386 94013 95106 95879 96188 96311 96216 95552 94330 93143
52624 93143 92524 92385 92422 92733 93512 94305 94290 93444 92764 92992 93705 94162 94497 95327 96518 97200 97009 96533 96365
52605 96365 96389 96257 96007 95820 95645 95483 95675 96421 97247 97481 97215 97292 98283 99814 101087 101728 101876 101628 100778
52586 100778 99279 97682 96898 97473 99211 101414 103315 104362 104438 103938 103346 102601 101174 99040 97177 96687
52570 96687 97580 98898 99846 100347 100553 100493 100278 100153 100066 99637 98761 97877 97384 97121 96707 96095 95492 94982 94504
52551 94504 94014 93424 92582 91548 90753 90547 90719 90772 90534 90293 90342 90687 91190 91843 92785 94054 95270 95682 94809
52532 94809 93077 91549 90897 90919 91162 91586 92340 93235 93848 94013 93898 93775 93970 94815 96270 97740 98565 98576
52514 98576 97952 96886 95797 95452 96223 97424 98128 98532 99644 101557 102968 102828 101649 100588 99912 99172
52498 99172 98405 98254 98934 99870 100443 100531 100206 99502 98725 98520 99273 100661 101981 102682 102448 101235 99556 98406
52480 98406 98395 99073 99499 99370 99185 99277 99268 98679 97662 96816 96491 96642 97185 98136 99411 100758 101972 103025 103969
52461 103969 104838 105631 106277 106650 106774 106903 107164 107183 106409 104884 103378 102577 102340 102017 101372 100898 101288 102740
52443 102740 104808 106730 107895 108113 107582 106633 105500 104344 103369 102820 102800 103106 103348 103295 103153 103424 104406 105804
52425 105804 106899 107069 106201 104797 103751 103787 104805 105864 106036 105291 104371 103941 104123 104697 105315 105486 104865
52408 104865 103782 103165 103674 105093 106653 107714 108040 107795 107505 107690 108282 108702 108714 108817 109471 110299 110537 109968
52390 109968 108983 107939 106998 106402 106253 106072 105216 103866 103057 103513 104930 106562 108085 109519 110705 111337
52374 111337 111394 111224 111219 111600 112408 113509 114643 115645 116613 117720 118925 119998 120870 121761 122885 124048 124701
52357 124701 124466 123568 122702 122477 123072 124322 125927 127549 128936 130127 131388 132802 134101 135035 135733 136474
52341 136474 137220 137640 137547 137198 137169 138006 139790 141955 143807 145434 147794 151568 156166 160346 163717 167144
52325 167144 171615 177133 182871 188140 193008 198151 204138 210889 217881 224996 232884 242232 252859 263843
52311 263843 274434 284542 294576 305155 316743 329088 341212 352463 363407 375058 387389
52300 387389 399347 410340 420846 431388 441741 451504 460731 469525 477614 484861 491641 498156 503753
52287 503753 507501 509161 509180 508099 506456 504869 503508 501653 498375 493650 488374 483365 478814 474609 470680
52272 470680 466918 463168 459483 456246 453981 453134 453902 456104 459361 463531 468769 475016 481751 488535 495586
52257 495586 503424 512159 521450 530983 540617 550234 559768 569309 578846 588066 596623 604393 611149 616380
52243 616380 619952 622626 625325 627972 629638 629787 628758 626998 624463 620924 616342 610737 604102 596643
52229 596643 588750 580577 571953 562798 553377 544089 535242 526924 518731 509745 499384 488350 478200
52216 478200 469868 463106 457408 452780 449277 446413 443504 440286 436854 433430 430488 428685 428188 428346 428389
52201 428389 428144 427767 427232 426594 426433 427333 429048 430746 432039 433256 434689 436147 437357 438352 439291 440173
52185 440173 440931 441514 441789 441532 440656 439265 437440 435255 433042 431341 430414 429937 429295 428042 426029 423367
52169 423367 420494 418050 416360 415038 413320 410857 408020 405366 403005 400618 397988 395253 392605 389958
52155 389958 387096 384065 381234 378925 377169 375808 374652 373499 372210 370939 370125 370003 370193 369956 368877
52140 368877 367129 365089 362957 360854 359099 358183 358433 359776 361760 363751 365272 366395 367862 370551 374708
52125 374708 379770 385026 390321 395938 401991 408262 414595 421153 428216 435967 444595 454302 465031 476461
52111 476461 488489 501423 515425 530032 544635 559181 573868 588281 601499 613275 624505
52100 624505 636119 647800 658303 666830 673679 679531 684481 688034 689900 690517 690639 690515 689739 687945
52086 687945 685323 682158 678116 672471 665037 656494 647666 638869 630116 621610 613748 606806 600808 595553
52072 595553 590721 586162 582198 579379 577873 577330 577488 578589 581030 584896 590022 596150 602886 609914 617534
52057 617534 626513 636925 647493 656687 664350 671697 679836 688743 697630 705753 712779 718789 724048 728525
52043 728525 731716 733286 733730 733874 733709 732267 728765 723399 716857 709560 701664 693325 684547 675014 664397
52028 664397 652703 640172 627055 613590 599933 585983 571640 557342 543858 531238 518515
52017 518515 504986 491416 479264 468817 458806 447934 436229 424692 414101 404467 395356 386440
52005 386440 377836 370033 363254 356918 350053 342432 334913 328411 322829 317373 311636 305904 300481 295242
51991 295242 289919 284341 278285 271468 264005 256592 249981 244446 239945 236447 233703 230989 227662 223987
51977 223987 220895 218768 216857 214083 210043 205077 199783 194773 190580 187272 184337 181254 178104 175253
51963 175253 172578 169460 165620 161533 157885 154866 152082 148988 145344 141456 137992 135343 133160 130807
51949 130807 128185 125755 123752 121882 120040 118767 118591 119193 119700 119667 119379 119259 119387 119598 119736 119718 119549
51932 119549 119345 119175 118905 118392 117778 117365 117202 117086 116948 116923 116929 116526 115457 114104 113159 112930 113219 113772 114550
51913 114550 115507 116350 116636 116080 114739 112999 111377 110192 109367 108662 108105 107986 108293 108391 107539 105713 103708
51896 103708 102432 102274 103037 104151 104840 104535 103459 102606 102752 103606 104204 104060 103561 103310 103479 103891 104372 104881
51878 104881 105593 106883 108883 110969 112156 112261 112230 112983 114353 115613 116623 117828 119376 120978 122634
51863 122634 124746 127383 130064 132587 135425 138946 142762 146377 150068 154477 159495 164138 167465 169168
51849 169168 169318 168148 166187 164063 161823 158815 154606 149802 145573 142494 140165 137967 135808 133999
51835 133999 132621 131299 129620 127661 126022 125267 125374 125737 125762 125426 125252 125771 127034 128559 129659 129826
51819 129826 129016 127690 126548 125989 125742 125163 124061 123165 123511 125249 127306 128359 128079 127176 126417 125883 125252
51802 125252 124479 123964 124205 125413 127349 129421 131002 131793 131881 131450 130620 129580 128601 127777 126945 126059 125383
51785 125383 125041 124677 123953 123181 122905 122983 122752 122169 122046 122826 123773 123933 123376 122809 122380 121700 120888 120672 121279
51766 121279 122029 122381 122765 123859 125470 126677 126891 126287 125325 124316 123431 122783 122325 121879 121280 120423 119246
51749 119246 117847 116548 115583 114768 113633 111924 109828 107773 106192 105444 105679 106677 107905 108864 109397 109736
51733 109736 110251 111063 111795 111846 111038 109895 109101 108821 108767 108724 108691 108583 108168 107377 106373 105277 104096 102899
51715 102899 101782 100633 99329 98174 97705 97896 98071 97873 97850 98639 99939 100880 101189 101377 101803 102188 102194 101973
51697 101973 101899 102080 102426 102910 103523 104110 104550 105021 105898 107329 108979 110213 110580 110243 109904 110177 110945 111439
51679 111439 110925 109240 106780 104196 102156 101079 100931 101387 102281 103718 105680 107760 109481 110724 111620
51664 111620 112185 112286 111903 111207 110373 109522 108868 108772 109561 111320 113827 116621 119192 121207 122636 123642 124427
51647 124427 125141 125805 126256 126316 126056 125733 125362 124574 123127 121382 120010 119349 119255 119475 119789 119844 119256 118024
51629 118024 116576 115271 114074 112840 111652 110702 110012 109460 108943 108347 107519 106454 105394 104563 103910 103331
51613 103331 103063 103535 104777 106196 107027 106918 106069 104982 104182 104047 104726 106168 108254 110866 113792 116622
51597 116622 118874 120226 120603 120066 118788 117195 115949 115523 115721 115854 115490 114884 114537 114533 114550 114459 114505 114861 115295
51578 115295 115488 115452 115362 115102 114317 112982 111666 111043 111265 111970 112850 113972 115484 117210 118807 120250 121846
51561 121846 123712 125521 126936 127977 128720 128941 128562 128256 129010 130996 133385 135445 137278 139260 141276
51546 141276 142990 144456 145968 147578 149242 151118 153142 154540 154545 153565 152877 152989 153064 152283 151086 150511 150724
51529 150724 150893 150300 149045 147655 146453 145346 143997 142148 139967 137996 136608 135669 134900 134278 133729 132694
51513 132694 130599 127787 125388 124130 123655 123213 122570 121996 121659 121424 121019 120104 118418 116170 114150 113092
51497 113092 113036 113587 114598 116082 117568 118208 117773 117049 116911 117387 118037 118805 119849 120720 120512 119126 117784
51480 117784 117794 119083 120450 121103 121423 122178 123491 124863 125865 126375 126273 125352 123687 121822 120353 119334
51464 119334 118267 116666 114571 112516 111061 110366 110173 110138 110105 109977 109449 108182 106414 105134 105268 106645
51448 106645 108089 108642 108435 108274 108626 109273 109746 109768 109334 108649 107958 107291 106415 105274 104312 104014 104200 104162 103546
51429 103546 102686 102010 101519 101086 100835 100970 101530 102548 104085 105769 106680 106177 104665 103095 101894 100841
51413 100841 99815 99058 98752 98853 99401 100447 101599 102201 102125 101867 101656 100999 99472 97476 95782 94693 94089
51396 94089 93954 94304 94785 94909 94600 94091 93370 92290 91223 90994 91861 92971 93205 92416 91551 91627 92772 94212
51378 94212 94959 94491 92931 90801 88639 86724 84979 83195 81479 80423 80549 81554 82470 82777 82970 83727
51362 83727 84839 85456 85233 84660 84313 84324 84726 85712 87219 88595 89095 88552 87358 86037 85076 84898 85593 86652
51344 86652 87299 87106 86182 84895 83640 82765 82377 82211 81929 81580 81522 81918 82594 83489 84858 86820 88936 90560
51326 90560 91513 92114 92605 92855 92746 92565 92776 93463 94198 94473 94160 93508 92817 92175 91484 90669 89780 88930 88172
51307 88172 87515 86996 86663 86476 86399 86617 87410 88660 89639 89613 88632 87442 86632 86174 85816 85520 85286 84940 84497
51288 84497 84531 85649 87598 89316 90032 89970 89830 89875 89831 89515 89191 89215 89580 90014 90461 91207 92395 93565 93942
51269 93942 93278 92176 91490 91554 92098 92705 93078 93116 93024 93278 94175 95443 96605 97615 98770 100042 100991 101404
51251 101404 101562 101705 101687 101422 101308 101827 102987 104469 106024 107374 108007 107613 106642 106000 106174 106993 108214
51234 108214 109840 111804 113728 115229 116284 117146 118049 119066 120092 120895 121298 121402 121477 121627 121714 121652 121627 121936
51216 121936 122723 123903 125183 126193 126767 127113 127526 127932 127951 127545 127255 127619 128514 129295 129463 129052 128467 128187
51198 128187 128537 129464 130508 131160 131333 131310 131200 130629 129183 127080 125153 124091 123884 124084 124369 124586 124400
51181 124400 123471 122090 121192 121327 121866 121651 120359 118816 117993 118063 118525 118895 119099 119407 120118 121138 121851 121607
51163 121607 120422 118961 117831 117117 116644 116319 116083 115842 115674 115785 116075 116069 115553 114998 115014 115567 116090 116197 115927
51144 115927 115441 114861 114384 114272 114662 115550 116841 118201 119045 119016 118395 117734 117143 116284 115053 113883 113336 113655
51126 113655 114747 116293 117837 119080 120139 121285 122459 123322 123803 124200 124673 125041 125204 125423 126019 127062
51110 127062 128523 130422 132567 134438 135572 135942 135844 135634 135688 136321 137476 138669 139421 139632 139464 139169 139103
51093 139103 139525 140184 140507 140501 141029 142686 144750 145819 145350 144113 143294 143656 145407 148163 150948 152827 153783
51076 153783 154607 155863 157369 158807 160248 161787 163164 164179 165107 166259 167359 167819 167484 166726 165918 165248
51060 165248 165006 165542 166769 167971 168406 167968 167139 166409 165886 165386 164753 164045 163477 163196 163088 162780 161861 160190
51042 160190 158094 156260 155280 155183 155428 155411 154999 154586 154728 155796 157835 160521 163221 165271 166350 166658 166682
51025 166682 166820 167214 167837 168697 169915 171599 173665 175788 177621 179052 180267 181587 183280 185451 187987
51010 187987 190607 193135 195757 198854 202479 206185 209576 212801 216172 219443 222018 224024 226602 230686
50996 230686 235808 240620 244441 247797 251527 255986 261233 267418 274632 282730 291552 301103 311313 321954
50982 321954 333074 345222 359002 374624 392192 412107 434774 460077 487500 516644 547318
50971 547318 579377 612950 648700 687296 728524 771285 814495 857699 900754 943352 984932
50960 984932 1024680 1061393 1093646 1120382 1141367 1156979 1167595 1173139 1173155 1167445 1156734 1142534
50948 1142534 1126181 1108170 1088610 1067974 1047035 1026407 1006654 988501 972238 957032 941601
50937 941601 925593 909613 893841 877404 859358 839578 818451 796403 774005 751780 729428
50926 729428 705910 680833 655178 630181 606169 583037 561205 541301 523369 507152 492728
50915 492728 480050 468269 456505 445117 435260 427266 420356 413989 408590 404724 402332 400981 400281
50902 400281 399810 399242 398773 398843 399261 399175 398196 396982 396484 397123 398926 401851 405524 409186 412448 415761 419711
50885 419711 424112 428252 431864 435431 439621 444725 450579 456796 463124 469739 477142 485652 495197 505676
50871 505676 517288 530367 545101 561606 580069 600630 623282 648130 675638 706463 741158
50860 741158 780154 823902 872867 927465 988064 1054971 1128285 1207761 1292725 1382119 1474833
50849 1474833 1570274 1668338 1768484 1868998 1967630 2062648 2152551 2234830 2306061 2363687 2407078
50838 2407078 2436468 2451535 2451647 2436994 2408884 2369275 2320666 2266119 2208657 2150598 2093786 2040151
50826 2040151 1991386 1948196 1910343 1877338 1848565 1822857 1798547 1774099 1748333 1720089 1688208
50815 1688208 1652043 1611673 1567564 1520282 1470570 1419396 1367797 1316845 1267668 1221264 1178329
50804 1178329 1139488 1105548 1077201 1054630 1037737 1026667 1021764 1023107 1030583 1044295 1064367 1090328
50792 1090328 1121134 1155871 1193981 1234688 1276627 1318155 1357699 1393752 1425099 1451275 1472467
50781 1472467 1488810 1500115 1506406 1508203 1505979 1499642 1488837 1473409 1453302 1428322 1398373 1363676
50769 1363676 1324587 1281483 1235206 1187276 1139229 1091895 1045739 1001736 961377 925672 894559
50758 894559 867447 844085 824738 809746 799154 792744 790199 791142 795130 801821 811271 823833 839625
50745 839625 858167 878817 901543 926983 955761 988026 1023719 1062934 1105788 1152198 1201978
50734 1201978 1254936 1310632 1368177 1426462 1484493 1541406 1596431 1649040 1698748 1744330 1783368
50723 1783368 1813061 1831636 1838890 1835451 1821914 1798784 1766977 1728163 1684628 1638849 1593026 1548885
50711 1548885 1507779 1470738 1438313 1410567 1387437 1368955 1354744 1343380 1332674 1320919 1307717
50700 1307717 1293410 1277900 1260308 1239793 1216502 1191615 1166637 1142752 1120781 1101412 1085292
50689 1085292 1072956 1064804 1061228 1062704 1069832 1083306 1103710 1131219 1165632 1206949 1255856 1313424
50677 1313424 1380330 1456518 1541352 1633570 1731063 1831238 1931897 2031463 2128194 2219651 2303361
50666 2303361 2377855 2442830 2498667 2546057 2585729 2617968 2642603 2659797 2670400 2674785 2671590 2658519
50654 2658519 2634604 2601141 2560421 2514393 2464820 2413867 2363757 2316139 2272276 2233495 2200959
50643 2200959 2175218 2156313 2144036 2137681 2135873 2137166 2140516 2144667 2147440 2146522 2140989 2131361 2118095
50630 2118095 2100736 2078769 2052540 2022872 1990343 1955518 1919510 1883773 1849557 1818067 1790837
50619 1790837 1769249 1753627 1743270 1737430 1735833 1738239 1744039 1752518 1763169 1775472 1788612 1801585
50607 1801585 1813309 1822405 1827097 1825568 1816430 1798861 1772634 1738155 1696235 1647644 1593139 1534135
50595 1534135 1472958 1412008 1352756 1295808 1241613 1190652 1143148 1099215 1059217 1023392 991057
50584 991057 960917 932482 906728 884980 867535 853727 842860 834538 828324 823795 820971 820260 821863
50571 821863 825551 831083 838561 848385 861143 877520 897902 921997 949208 979607 1014283 1054436
50559 1054436 1100392 1151665 1207805 1268821 1334792 1405215 1478786 1553687 1628141 1700769 1770507
50548 1770507 1836385 1897732 1954767 2008769 2061372 2113622 2165749 2217662 2269392 2321042 2372431
50537 2372431 2422838 2471255 2517136 2561065 2604566 2649110 2695565 2744714 2797912 2856628 2921245
50526 2921245 2990647 3062937 3136137 3208206 3276991 3340597 3397480 3445824 3483080 3506610 3514762
50515 3514762 3506968 3482931 3442249 3385086 3312880 3228072 3133227 3030643 2922834 2813128 2705543
50504 2705543 2603925 2511137 2429013 2358889 2301885 2258643 2229099 2212780 2209182 2217578 2236515
50493 2236515 2263839 2297226 2334457 2372977 2409367 2439326 2458186 2461752 2447283 2414185 2363785
50482 2363785 2298385 2220494 2132780 2038192 1939678 1839803 1740752 1644470 1552459 1465507 1383857
50471 1383857 1307632 1236913 1171551 1111299 1056220 1006666 962732 923953 889656 859387 832796
50460 832796 809297 788190 769136 752257 737682 725149 714212 704687 696635 689901 683923 678227
50448 678227 672983 668834 666178 664797 664304 664713 666463 669982 675391 682620 691661 702694 716035 731962
50434 731962 750590 771884 795760 822176 851207 883112 918163 956195 996416 1037931 1080491
50423 1080491 1124484 1170185 1217326 1265483 1314610 1365056 1417390 1472292 1530145 1590339 1651272
50412 1651272 1711403 1770156 1827549 1883227 1936253 1985567 2030126 2068759 2100406 2124621 2141444
50401 2141444 2150746 2151938 2144149 2126350 2097487 2057114 2006021 1945986 1879008 1807166 1732944 1658881
50389 1658881 1586709 1517433 1452332 1393237 1341511 1297365 1260564 1231260 1209761 1195903 1189153
50378 1189153 1189042 1195052 1206344 1221812 1240094 1259230 1276770 1290643 1299603 1302501 1297734 1284206
50366 1284206 1262571 1234801 1202504 1166230 1126390 1084182 1041360 999450 959285 920963 884148
50355 884148 848673 814942 783564 754649 727770 702538 678908 656967 636798 618565 602331
50344 602331 587699 573939 560625 547970 536477 526469 517943 510634 504172 498351 493267 489017 485344
50331 485344 481835 478405 475321 472849 471129 470279 470230 470521 470734 471140 472443 474859 477976 481675 486578 493226
50315 493226 501224 509724 518498 528066 538889 550887 563776 577443 591786 606319 620205 632709
50303 632709 643605 653048 661133 667778 673145 677871 682510 686800 689821 690907 690011 687023 681167 671465
50289 671465 657742 640978 622739 604405 586832 570484 555678 542601 531125 520925 512077 505334
50277 505334 501366 499665 498713 497473 496368 496544 498456 501511 504827 507882 510488 512552 514054 515078 515747
50262 515747 516187 516573 517168 518221 519744 521372 522558 523076 523250 523453 523482 522838 521697 521150 522123 524284 526372
50245 526372 527509 527936 528528 529876 531857 533924 535769 537734 540514 544440 549234 554527 560306 566603 573034
50230 573034 579029 584480 589802 595344 601021 606592 612010 617387 622819 628426 634458 641161 648576 656532
50216 656532 664844 673526 682926 693747 706873 723000 742305 764486 789184 816449 846855 881243
50204 881243 920454 965282 1016483 1074615 1139885 1212330 1292283 1380571 1478128 1585231 1700865
50193 1700865 1822655 1947363 2071465 2191363 2303478 2404906 2494442 2572857 2641920 2703331
50183 2703331 2758576 2808903 2854305 2892289 2918328 2927838 2917503 2885038 2828817 2748569 2646214
50172 2646214 2525604 2391587 2249362 2104029 1959902 1820127 1687153 1563304 1450512
50163 1450512 1349599 1260167 1181211 1111705 1050773 997577 951100 910083 873476 840984 812782
50152 812782 788496 766882 746748 727814 710375 694577 680443 668125 657528 647967 638796 630139
50140 630139 622481 615859 610091 605522 602695 601346 600543 599868 599745 600499 601823 603401 605337 607679 610171
50125 610171 612845 616396 621588 628627 637319 647421 658575 670373 682812 696200 710375 724519
50113 724519 738186 752001 766806 782531 798486 814396 830525 847024 863881 881443 900251
50102 900251 920266 940830 961622 983215 1006500 1031923 1059623 1089984 1123687 1161279 1202996
50091 1202996 1249075 1300097 1356919 1420352 1491076 1569986 1658489 1758239 1870559 1996322 2136484
50080 2136484 2292435 2465458 2655683 2861335 3078678 3302548 3527297 3747723 3959479
50071 3959479 4159191 4345002 4517283 4678275 4830241 4973762 5107625 5229514 5335776
50062 5335776 5420571 5476329 5495970 5475040 5412191 5308481 5166791 4991586 4788553 4564138
50052 4564138 4325206 4078643 3830618 3585880 3347731 3118684 2901108 2697271 2508899
50043 2508899 2336762 2180748 2040313 1914838 1803597 1705555 1619383 1543695 1477131 1418349
50033 1418349 1366199 1320072 1279831 1245156 1214974 1187704 1162105 1137721 1114505 1092138 1069945
50022 1069945 1047422 1024707 1002378 980885 960288 940434 921151 902228 883391 864551 845992
50011 845992 828188 811473 795956 781707 768816 757260 746865 737450 728904 721077 713768 706984
49999 706984 701168 696920 694380 692951 691767 690391 688950 687664 686492 685358 684431 683898 683579 683114 682552
49984 682552 682430 683248 685151 688227 692756 698936 706629 715664 726174 738391 752354 768190 786559
49971 786559 808401 834237 864059 897966 936590 980804 1031322 1088696 1153460 1226209 1307762
49960 1307762 1399362 1502256 1616682 1741250 1873419 2010315 2148834 2285244 2415343 2535451
49950 2535451 2643366 2738571 2821914 2895228 2960886 3020998 3076390 3125826 3165939 3191836 3198086
49939 3198086 3179766 3133354 3057340 2952473 2821774 2670354 2504947 2332913 2160883 1993820
49929 1993820 1835013 1686737 1550733 1428163 1319359 1223738 1139973 1066408 1001630 944806
49919 944806 895386 852471 814687 780777 750187 722890 698743 677153 657354 638892 621783
49908 621783 606233 592155 578995 566180 553730 542243 532163 523184 514533 505656 496529 487492
49896 487492 479056 471715 465675 460720 456526 453013 450064 447082 443308 438693 434074 430207 426957 423715
49882 423715 420321 417195 414656 412512 410367 408040 405583 403116 400686 398223 395584 392766 390017 387584
49868 387584 385407 383301 381385 380066 379504 379382 379307 379205 379147 379028 378684 378189 377731 377251 376447 375220 373925
49851 373925 373075 372939 373447 374377 375455 376266 376263 375117 373215 371695 371650 373156 375152 376375 376273 375057 373188
49834 373188 371135 369457 368655 368806 369532 370444 371498 372877 374586 376215 377131 377007 376254 375840 376482 378092
49818 378092 380063 382012 384046 386438 389310 392537 395678 398023 399084 399089 398727 398413 398100 397731 397401 396925
49802 396925 395790 393876 391813 390283 389212 388065 386647 385186 383826 382568 381607 381178 380994 380353 378994
49787 378994 377436 376228 375163 373625 371530 369598 368619 368652 369016 368948 368232 367207 366289 365619 365132 364789 364563
49770 364563 364310 363798 362952 362000 361367 361395 362035 362796 363156 363102 363068 363261 363305 362797 361985 361562 361963 363183 365075
49751 365075 367303 369137 369904 369817 369875 370733 372038 373084 373658 373968 374193 374538 375421 377035 378854 380059 380408
49734 380408 380353 380421 380942 382303 384826 388115 390942 392246 392122 391595 391540 392049 392734 393341 393997 395052 396818
49717 396818 399328 402225 404926 407026 408605 410069 411647 413140 414267 415233 416692 419006 421690 423831
49703 423831 425085 426096 427808 430482 433540 436341 438894 441686 444963 448481 451923 455257 458460 461227
49689 461227 463364 465343 467955 471305 474584 477063 478884 480570 482145 483337 484431 486273 489281 492885
49675 492885 496199 498904 501285 503672 506159 508717 511312 513890 516383 518697 520683 522247 523596 525196
49661 525196 527325 529737 531885 533410 534384 535262 536719 539301 542918 546742 549831 551892 553306 554558 555932
49646 555932 557726 560305 563713 567445 570878 573834 576564 579294 582000 584589 587115 589762 592679 595817
49632 595817 598892 601658 604380 607846 612569 617989 622837 626481 629622 633428 638217 643313 648020 652278
49618 652278 656377 660469 664597 668884 673429 678161 682988 687994 693269 698664 703917 709023 714240 719786
49604 719786 725629 731545 737249 742515 747333 751953 756630 761397 766247 771429 777281 783733 790254 796415
49590 796415 802335 808487 815192 822329 829413 835946 841866 847718 854142 861159 868207 874880 881306 887622
49576 887622 893490 898524 902979 907619 912961 918963 925360 931936 938461 944694 950621 956450 962300 968026
49562 968026 973389 978285 982755 986946 991073 995306 999620 1003863 1007943 1011905 1015854 1019865 1023832 1027290
49548 1027290 1029661 1030988 1032177 1034082 1036428 1038170 1038918 1039439 1040600 1042366 1044117 1045520 1046640 1047552 1048320
49533 1048320 1049173 1050340 1051779 1053334 1055021 1056877 1058726 1060432 1062211 1064343 1066755 1069244 1071955 1075216
49519 1075216 1078996 1082981 1087125 1091622 1096283 1100466 1103708 1106034 1107496 1107971 1107662 1107203 1106800 1105617 1102602
49504 1102602 1097785 1092200 1086581 1080693 1074093 1067020 1060133 1053597 1046929 1039764 1032391 1025388 1018995 1013046
49490 1013046 1007352 1001817 996236 990369 984238 978027 971635 964753 957609 951147 946029 941773 937385 932555
49476 932555 927657 922757 917422 911587 905927 901067 896941 893180 889606 886097 882521 879165 876696 875201
49462 875201 873730 871352 868292 865417 862901 860177 857029 853904 851034 847969 844286 840289 836694 833977
49448 833977 832266 831517 831512 831901 832468 833250 834264 835369 836442 837482 838431 839224 840168 841952 844959 848792 852767
49431 852767 856783 861461 867460 874899 883318 891929 899804 905997 909707 910491 908566 904932 901008 897896
49417 897896 895998 895344 896056 898285 901837 906159 910786 915699 921234 927745 935357 943948 953336 963436
49403 963436 974102 984805 994710 1003327 1010999 1018493 1026188 1034030 1042120 1050819 1060015 1068754 1076122 1082261
49389 1082261 1088102 1094173 1100160 1105620 1110576 1115223 1119560 1123655 1127929 1132705 1137718 1142499 1147140 1152214
49375 1152214 1157973 1164056 1169972 1175450 1180288 1184372 1188025 1191895 1196257 1200841 1205522 1210697 1216603 1222823
49361 1222823 1229036 1235868 1244168 1253518 1262270 1269318 1275193 1281121 1287547 1294090 1300501 1307006 1313688 1320222
49347 1320222 1326492 1333125 1340966 1350037 1359446 1368429 1377137 1386086 1395144 1403641 1411450 1419312 1427806 1436528
49333 1436528 1444692 1452122 1459127 1465778 1471908 1477668 1483423 1489158 1494564 1499675 1504804 1509883 1514583 1519185
49319 1519185 1524513 1530684 1536616 1541279 1544888 1548306 1551748 1554689 1556690 1557676 1557635 1556722 1555627 1555201 1555616
49304 1555616 1556291 1556606 1556282 1555140 1553100 1550604 1548549 1547456 1546891 1545910 1543898 1540838 1537036 1532853 1528599
49289 1528599 1524403 1520128 1515531 1510560 1505427 1500383 1495460 1490604 1486055 1482368 1479729 1477353 1473992 1469197
49275 1469197 1463744 1458579 1453777 1448858 1443722 1438613 1433329 1427141 1419685 1411390 1402786 1393792 1384001 1373449
49261 1373449 1362802 1352892 1344160 1336422 1329075 1321667 1314280 1307190 1300149 1292380 1283445 1273762 1264070 1254663
49247 1254663 1245408 1236126 1226444 1215480 1202346 1187191 1171351 1156215 1142171 1128827 1115883 1103368
49235 1103368 1091144 1078762 1066051 1053559 1042047 1031690 1022049 1012769 1003991 996081 989338 984111
49223 984111 980753 979075 978039 976478 974079 971339 968689 966157 963943 962685 962758 963599 964176 963967 963186 962207
49207 962207 961221 960408 960034 960212 960839 961857 963353 965298 967465 969760 972410 975589 979029 982289 985330
49192 985330 988539 992114 995745 999035 1002106 1005515 1009619 1014112 1018322 1021905 1025232 1029058 1033874 1039630
49178 1039630 1046017 1052786 1059671 1066224 1072133 1077692 1083635 1090385 1097822 1105964 1115408 1126560 1138635
49165 1138635 1150015 1159744 1168339 1177084 1186933 1198179 1210659 1223768 1236497 1247982 1258144 1267642
49153 1267642 1277207 1287172 1297508 1308066 1318651 1329039 1339001 1348366 1357065 1365158 1372812 1380243 1387725
49140 1387725 1395576 1403984 1412816 1421710 1430335 1438426 1445716 1452146 1458147 1464261 1470370 1475686 1479710 1482782
49126 1482782 1485458 1487842 1490040 1492761 1496656 1501209 1505080 1507655 1509635 1511872 1514320 1516471 1518295 1520191
49112 1520191 1522274 1524239 1525912 1527547 1529486 1531753 1534085 1536211 1537988 1539287 1539895 1539710 1539049 1538579 1538755
49097 1538755 1539442 1540297 1541342 1542863 1544889 1547193 1549820 1553135 1557207 1561549 1565690 1569686 1573845 1578226
49083 1578226 1582682 1587154 1591639 1596009 1600110 1603895 1607311 1610184 1612418 1614082 1615147 1615313 1614429 1612880
49069 1612880 1611266 1609790 1608173 1606117 1603545 1600514 1597137 1593535 1589637 1585096 1579761 1574164 1569202 1565221
49055 1565221 1561723 1558111 1554533 1551726 1550105 1549218 1548195 1546697 1545316 1544935 1545795 1547419 1549460 1552248 1556232
49040 1556232 1561260 1566908 1573310 1581054 1590090 1599366 1607957 1616203 1625274 1635822 1647548 1659983 1673086
49027 1673086 1686831 1700774 1714533 1728523 1743655 1760259 1777759 1795594 1814049 1833787 1854814
49016 1854814 1876433 1898201 1920464 1943692 1967616 1991349 2014293 2036636 2058954 2081517 2104112
49005 2104112 2126493 2148802 2171422 2194464 2217663 2240870 2264353 2288317 2312317 2335519 2357494
48994 2357494 2378323 2397982 2416142 2432732 2448165 2462693 2475892 2487155 2496471 2504322 2511056 2516669
48982 2516669 2521067 2524145 2525733 2525789 2524598 2522463 2519299 2514780 2508852 2501812 2493895 2485071 2475261 2464593
48968 2464593 2453544 2442992 2433997 2427223 2422563 2419415 2417178 2415417 2413967 2413204 2413938 2416532 2420292 2424208
48954 2424208 2428104 2432565 2437916 2443933 2450531 2458013 2466495 2475677 2485375 2495764 2506907 2518627 2531153
48941 2531153 2545317 2561737 2580248 2600454 2622417 2646361 2672108 2699287 2727820 2757763 2788972
48930 2788972 2821361 2855233 2890859 2927954 2966131 3005710 3047455 3091529 3137247 3183965 3231769
48919 3231769 3281146 3332342 3385203 3439369 3494519 3550662 3608227 3667603 3728585 3790591 3853519
48908 3853519 3917955 3984289 4051856 4119278 4185601 4250898 4315808 4380674 4445156 4508539 4570320
48897 4570320 4630483 4689269 4746728 4802519 4856043 4906830 4954855 5000467 5043838 5084490 5121574
48886 5121574 5154661 5183999 5209901 5232215 5250546 5264618 5274048 5278093 5276148 5268459 5255914 5239150
48874 5239150 5218192 5192878 5163258 5129565 5092194 5051689 5008394 4962059 4912194 4858819 4802424
48863 4802424 4743211 4681023 4616288 4550437 4484941 4420248 4356056 4292254 4229090 4166745 4105372
48852 4105372 4045583 3988305 3933943 3882035 3831991 3784018 3739054 3697915 3660699 3627119 3597202
48841 3597202 3571385 3549812 3531902 3516912 3504777 3495964 3490541 3487927 3487746 3490426 3496617 3506354 3519193
48828 3519193 3534848 3553217 3573969 3596559 3620650 3646147 3672870 3700520 3728948 3758176 3788201
48817 3788201 3819117 3851265 3884919 3919886 3955841 3992956 4031614 4071409 4111071 4149677 4187463
48806 4187463 4225145 4262954 4300851 4339275 4378975 4420141 4462313 4505321 4549798 4596474 4645270
48795 4645270 4695416 4746281 4797666 4849282 4900423 4950516 4999857 5049320 5099205 5148610 5196174
48784 5196174 5241228 5283931 5324431 5362295 5396825 5427590 5454500 5477609 5497003 5512647 5524220
48773 5524220 5531378 5534352 5534077 5531387 5526246 5518001 5506258 5491176 5473007 5451780 5427484 5400100 5369178
48760 5369178 5333662 5292530 5245574 5193289 5136000 5073414 5005208 4931964 4855305 4777135 4698821
48749 4698821 4621052 4544236 4468814 4395245 4323838 4254631 4187360 4121613 4057239 3994694 3934834
48738 3934834 3878219 3824692 3773795 3725474 3680104 3637745 3597685 3559005 3521528 3485899 3452693
48727 3452693 3421824 3393103 3367029 3344502 3325717 3309820 3295828 3283495 3272998 3264170 3256486 3249716
48715 3249716 3244095 3239785 3236417 3233212 3229440 3224871 3220030 3215926 3213250 3211916 3211478 3211802 3212967 3214779
48701 3214779 3216948 3219650 3223257 3227486 3231470 3234928 3238638 3243396 3249060 3255001 3261003 3267175 3273391 3279464
48687 3279464 3285708 3292720 3300639 3309009 3317337 3325419 3333252 3341026 3349171 3358074 3367721 3377849 3388329
48674 3388329 3399168 3410290 3421565 3432831 3443585 3452990 3460697 3467431 3474093 3480353 3484733 3486159 3484866
48661 3484866 3481643 3476704 3469636 3460036 3447861 3433321 3416605 3397642 3376074 3351620 3324434 3295027
48649 3295027 3264023 3232175 3200209 3168096 3134738 3099085 3061571 3023794 2986827 2950578 2914896
48638 2914896 2880316 2847248 2815209 2783514 2752200 2721675 2691909 2662660 2634206 2607136 2581513
48627 2581513 2556858 2532916 2509961 2488359 2468258 2449728 2432791 2417237 2402661 2388767 2375490
48616 2375490 2362930 2351420 2341538 2333601 2327162 2321329 2315757 2311075 2308185 2307262 2307529 2307978 2308223 2308641 2309739
48601 2309739 2311551 2313745 2316169 2319011 2322501 2326767 2331962 2338149 2344930 2351614 2357904 2364131 2370686 2377632
48587 2377632 2385016 2393069 2401810 2410873 2420044 2429525 2439362 2449098 2458463 2467914 2477856 2487803 2496979 2505447
48573 2505447 2513780 2521825 2528681 2533960 2538267 2542232 2545721 2548181 2549121 2548008 2544413 2538758 2532502 2526988
48559 2526988 2522262 2517300 2511237 2504059 2496288 2488309 2480080 2471319 2461833 2451620 2440663 2428834 2416153
48546 2416153 2402918 2389415 2375656 2361651 2347636 2333651 2319197 2303893 2288293 2273408 2259363
48535 2259363 2245152 2229835 2213482 2196814 2180490 2164909 2150136 2135656 2120650 2104818 2088584
48524 2088584 2072287 2055675 2038472 2020983 2003719 1986769 1969904 1953017 1936139 1919301 1902720
48513 1902720 1886801 1871615 1856670 1841593 1826709 1812593 1799319 1786536 1773943 1761198 1747710
48502 1747710 1733226 1718518 1704898 1693018 1682586 1673112 1664269 1655528 1646230 1636460 1627309 1619791 1613679
48489 1613679 1607812 1601358 1594400 1587374 1580382 1573256 1566113 1559545 1554094 1549589 1545174 1540102 1534399 1528675
48475 1528675 1523395 1518536 1513812 1508851 1503115 1496043 1487682 1479046 1471473 1465449 1460213 1454564 1447894 1440310
48461 1440310 1432016 1423047 1413686 1404702 1396756 1389681 1382687 1375280 1367604 1359866 1351778 1342906 1333427 1324193
48447 1324193 1315932 1308493 1300995 1292736 1283881 1275185 1267131 1259526 1251978 1244403 1236914 1229484 1222112 1215095
48433 1215095 1208692 1202618 1196360 1189987 1184149 1179140 1174451 1169457 1164206 1159275 1155127 1151834 1149140 1146593
$$ [...]
##END NTUPLES=NMR SPECTRUM
##END=
