##TITLE=NES1066_Nhol10911_9883663_4HlQrt3YVF
##JCAMPDX= 6.0         $$ Bruker NMR JCAMP-DX V2.0
##DATA TYPE= NMR SPECTRUM
##DATA CLASS= NTUPLES
##ORIGIN= BRUKER
##OWNER= Administrator
$$ 1.72 TOPSPIN		Version 2.1
$$ 2016-08-26 22:03:03.211 -0500  Administrator@X
$$ Compression mode = diff/dup
##.OBSERVE FREQUENCY= 400.02188249412
##.OBSERVE NUCLEUS= ^1H
##.ACQUISITION MODE= SIMULTANEOUS (DQD)
##.ACQUISITION SCHEME= undefined
##.AVERAGES= 64
##.DIGITISER RES= 22
##SPECTROMETER/DATA SYSTEM= spect
##.PULSE SEQUENCE= noesygpps1d.comp
##.SOLVENT NAME= COFFEE_meoh
##.SHIFT REFERENCE= INTERNAL, COFFEE_meoh, 1, 14.96196
##AUDIT TRAIL= $$ (NUMBER, WHEN, WHO, WHERE, PROCESS, VERSION, WHAT)
$$ ##TITLE= Audit trail, TOPSPIN		Version 2.1
$$ ##JCAMPDX= 5.01
$$ ##ORIGIN= Bruker BioSpin GmbH
$$ ##OWNER= Administrator
$$ $$ E:\/data/COFFEE/nmr/NES1066_Nhol10911_9883663_4HlQrt3YVF/12/pdata/1/auditp.txt
$$ ##AUDIT TRAIL=  $$ (NUMBER, WHEN, WHO, WHERE, PROCESS, VERSION, WHAT)
(   1,<2016-08-26 22:02:58.008 -0500>,<Administrator>,<X>,<go>,<TOPSPIN 2.1>,
      <created by zg
	started at 2016-08-26 21:51:28.554 -0500,
	POWCHK enabled, PULCHK disabled,
       configuration hash MD5:
       21 0F 79 D6 B3 7B B4 F6 88 20 88 DB 03 48 BD 9F
       data hash MD5: 64K
       74 56 F5 70 20 DB AC 07 2A A1 E1 29 BA B4 03 E0>)
(   2,<2016-08-26 22:03:01.133 -0500>,<Administrator>,<X>,<proc1d>,<TOPSPIN 2.1>,
      <Start of raw data processing
       efp LB = 0.3 FT_mod = 6 PKNL = 1 PHC0 = 0 PHC1 = 0 SI = 128K 
       data hash MD5: 128K
       E2 0A 56 0C 36 50 D9 63 46 2B 24 B8 93 F5 ED 14>)
(   3,<2016-08-26 22:03:02.023 -0500>,<Administrator>,<X>,<proc1d>,<TOPSPIN 2.1>,
      <pk PHC0 = -83.92456 PHC1 = 0 
       data hash MD5: 128K
       90 96 3D 73 A2 13 2F D3 89 11 8B 2E C0 1F A1 37>)
(   4,<2016-08-26 22:03:02.383 -0500>,<Administrator>,<X>,<proc1d>,<TOPSPIN 2.1>,
      <abs ABSG = 1 
       data hash MD5: 128K
       FC 19 8B E3 6D 03 7D 32 ED AB 36 B1 30 BB E5 AC>)
(   5,<2016-08-26 22:03:02.492 -0500>,<Administrator>,<X>,<proc1d>,<TOPSPIN 2.1>,
      <abs ABSG = 2 
       data hash MD5: 128K
       60 8D A7 C0 47 69 DC D0 38 A8 09 3B E1 2F 25 30>)
(   6,<2016-08-26 22:03:02.570 -0500>,<Administrator>,<X>,<proc1d>,<TOPSPIN 2.1>,
      <abs ABSG = 3 
       data hash MD5: 128K
       14 26 DE 8A 4F EB BC 76 AE 99 A0 1A 62 84 63 61>)
(   7,<2016-08-26 22:03:02.664 -0500>,<Administrator>,<X>,<proc1d>,<TOPSPIN 2.1>,
      <abs ABSG = 4 
       data hash MD5: 128K
       9E 66 BD D6 56 3A ED 15 1D 0F B7 F1 FA 54 C2 B3>)
(   8,<2016-08-26 22:03:02.742 -0500>,<Administrator>,<X>,<proc1d>,<TOPSPIN 2.1>,
      <abs ABSG = 5 
       data hash MD5: 128K
       DD D7 58 E0 5E E8 84 DA 9E A4 C4 1D BB 0E 35 2D>)
$$ ##END=
$$ 
$$ $$ hash MD5
$$ $$ 88 32 DC 8D 51 0B E3 9B 0C 02 E6 F1 27 91 16 F8
##$RELAX= 
##$RELAX= 
##$RELAX= 
##$RELAX= 
##$RELAX= 
##$RELAX= 
##$RELAX= 
##$RELAX= 
$$ Bruker specific parameters
$$ --------------------------
##$DU= <E:\>
##$EXPNO= 12
$$ [...]
##$TP07= 0
##$TPNAME0= <>
##$TPNAME1= <>
##$TPNAME2= <>
##$TPNAME3= <>
##$TPNAME4= <>
##$TPNAME5= <>
##$TPNAME6= <>
##$TPNAME7= <>
##$TPOAL= (0..7)
0.5 0.5 0.5 0.5 0.5 0.5 0.5 0.5
##$TPOFFS= (0..7)
0 0 0 0 0 0 0 0
##$TUNHIN= 0
##$TUNHOUT= 0
##$TUNXOUT= 0
##$USERA1= <user>
##$USERA2= <user>
##$USERA3= <user>
##$USERA4= <user>
##$USERA5= <user>
##$V9= 5
##$VALIST= <valist>
##$VCLIST= <CCCCCCCCCCCCCCC>
##$VD= 0
##$VDLIST= <DDDDDDDDDDDDDDD>
##$VPLIST= <PPPPPPPPPPPPPPP>
##$VTLIST= <TTTTTTTTTTTTTTT>
##$WBST= 2048
##$WBSW= 25
##$XGAIN= (0..3)
0 0 0 0
##$XL= 0
##$YL= 0
##$YMAX_a= 7307193
##$YMIN_a= -13626893
##$ZGOPTNS= <>
##$ZL1= 120
##$ZL2= 120
##$ZL3= 120
##$ZL4= 120
##$ABSF1= 14.96196
##$ABSF2= -5.596222
##$ABSG= 5
##$ABSL= 3
##$ALPHA= 0
##$AQORDER= 0
##$ASSFAC= 0
##$ASSFACI= 0
##$ASSFACX= 0
##$ASSWID= 0
##$AUNMP= <proc_prof1d_extract.lims>
##$AXLEFT= 0
##$AXNAME= <>
##$AXNUC= <1H>
##$AXRIGHT= 0
##$AXTYPE= 0
##$AXUNIT= <>
##$AZFE= 0.1
##$AZFW= 0.1
##$BCFW= 0
##$BC_mod= 0
##$BYTORDP= 0
##$COROFFS= 0
##$CY= 15
##$DATMOD= 1
##$DC= 0
##$DFILT= <>
##$DTYPP= 0
##$F1P= 0
##$F2P= 0
##$FCOR= 0.5
##$FTSIZE= 131072
##$FT_mod= 6
##$GAMMA= 0
##$GB= 0
##$INTBC= 1
##$INTSCL= 1
##$ISEN= 128
##$LB= 0.3
##$LEV0= 0
##$LPBIN= 0
##$MAXI= 10000
##$MC2= 0
##$MEAN= 0
##$ME_mod= 0
##$MI= 0
##$NCOEF= 0
##$NC_proc= -2
##$NLEV= 6
##$NOISF1= 0
##$NOISF2= 0
##$NSP= 0
##$NTH_PI= 0
##$NZP= 0
##$OFFSET= 14.96196
##$PC= 1
##$PHC0= -83.92456
##$PHC1= 0
##$PH_mod= 1
##$PKNL= yes
##$PPARMOD= 0
##$PPDIAG= 0
##$PPIPTYP= 0
##$PPMPNUM= 2147483647
##$PPRESOL= 1
##$PSCAL= 4
##$PSIGN= 0
##$PYNMP= <proc.py>
##$REVERSE= no
##$SF= 400.02000925146
##$SI= 131072
##$SIGF1= 0
##$SIGF2= 0
##$SINO= 400
##$SIOLD= 131072
##$SPECTYP= <>
##$SREGLST= <1H.CDCl3>
##$SSB= 0
##$STSI= 131072
##$STSR= 0
##$SW_p= 8223.68421052631
##$SYMM= 0
##$S_DEV= 0
##$TDeff= 65536
##$TDoff= 0
##$TI= <>
##$TILT= no
##$TM1= 0
##$TM2= 0
##$TOPLEV= 0
##$USERP1= <user>
##$USERP2= <user>
##$USERP3= <user>
##$USERP4= <user>
##$USERP5= <user>
##$WDW= 1
##$XDIM= 131072
##$YMAX_p= 369723255
##$YMIN_p= -11237
##$CURPLOT= <Network HP LaserJet P1505>
##$CURPRIN= <$Network HP LaserJet P1505>
##$DFORMAT= <normdp>
##$LAYOUT= <+/1D_H.xwp>
##$LFORMAT= <normlp>
##$PFORMAT= <normpl>
##$SURQMSG= 1
$$ End of Bruker specific parameters
$$ ---------------------------------
##NTUPLES= NMR SPECTRUM
##VAR_NAME=  FREQUENCY,     SPECTRUM/REAL,   SPECTRUM/IMAG
##SYMBOL=    X,             R,               I
##VAR_TYPE=  INDEPENDENT,   DEPENDENT,       DEPENDENT
##VAR_FORM=  AFFN,          ASDF,            ASDF
##VAR_DIM=   131072,        131072,          131072
##UNITS=     HZ,            ARBITRARY UNITS, ARBITRARY UNITS
##FACTOR=    0.0627417313425164, 1,          1
##FIRST=     8223.62146879497, -135,         -60153
##LAST=      0,             2077,            -60778
##MIN=       0,             -11237,          0
##MAX=       8223.62146879497, 369723255,    0
$$ Real data points
##PAGE= N=1
##DATA TABLE= (X++(R..R)), XYDATA
$$ [...]
63471C93402p398q621r068q538p517o651o122n848n756n517m583l050j797j203
$$ 393402 386004 377383 368315 359777 352260 345609 339487 333639 327883 322366 317783 314733 312936 311733
63457C11733m01J358L239L857L314K994L414L662L104K424K486L144L845M553
$$ 311733 311332 312690 315929 319786 323100 326094 329508 333170 336274 338698 341184 344328 348173 352726
63443C52726N453O346P047P856R060J0400J1525J2598J3899J5260J6486J7930
$$ 352726 358179 364525 371572 379428 388488 398888 410413 423011 436910 452170 468656 486586
63431D86586K0006K2425K4518K6065K7243K7976K7980K7275K6039K4085K1014
$$ 486586 506592 529017 553535 579600 606843 634819 662799 690074 716113 740198 761212
63420G61212J6824J1850O297N22m444p452q419q372q218q073p785p390o885o343
$$ 761212 778036 789886 796183 796705 792261 784809 776390 768018 759800 751727 743942 736552 729667 723324
63406G23324o389p909j0813j3827j5876j7138j8231j8963j8626j7185j5393j3823
$$ 723324 716935 709026 698213 684386 668510 651372 633141 614178 595552 578367 562974 549151
63394E49151j2391j0889r472q349p338n979m094k113p11l2N90J854L528M688M992
$$ 549151 536760 525871 516399 508050 500712 494733 490639 488526 487815 487783 488373 490227 493755 498443 503435
63379E03435N221O306Q218J0150J1448J2077J2385J2873J3897J5298J6423J6917
$$ 503435 508656 514962 523180 533330 544778 556855 569240 582113 596010 611308 627731 644648
63367F44648J7217J8001J9250K0302K0585J9931J8268J5454J1526O773J648l198
$$ 644648 661865 679866 699116 719418 740003 759934 778202 793656 805182 811955 813603 810405
63355H10405o930r040r812r937r683q849p468o151n565n940p218r263j1724j3997
$$ 810405 803475 794435 784623 774686 765003 756154 748686 742535 736970 731030 723812 714549 702825 688828
63341F88828j5619j6654j7400j7872j7817j7149j6173j5208j4240j3137j2129
$$ 688828 673209 656555 639155 621283 603466 586317 570144 554936 540696 527559 515430
63330E15430j1662j1659j1317j0059q497p774q014q128p405o499o289o455o081
$$ 515430 503768 492109 480792 470733 462236 454462 446448 438320 430915 424416 418127 411672 405591
63317D05591n230m881n295n488m659l341k645k849l322l516l459l336l072k513
$$ 405591 400361 395480 390185 384697 380038 376697 374052 371203 367881 364365 360906 357570 354498 351985
63303C51985j795j356j475j898k137k169k510l351m020l825l178l178m092m959
$$ 351985 350190 348834 347359 345461 343324 341155 338645 335294 331274 327449 324271 321093 317001 312042
63289C12042m905m176l575l429l529l643l564l052k233j780k183k954l075k225
$$ 312042 307137 302961 299386 295957 292428 288785 285221 282169 279936 278156 275973 273019 269944 267719
63275B67719j127o35q52j243j358j249j197j194q06J70J132J179L49k25K72J260
$$ 267719 266592 265957 265105 263862 262504 261255 260058 258864 258058 258228 259360 260539 260888 260663 260935 262195
63259B62195J645J402J484K330L299L727L767L870M064M175M326M718N205N584
$$ 262195 263840 265242 266726 269056 272355 276082 279849 283719 287783 291958 296284 301002 306207 311791
63245C11791O067O974Q105Q933R404J0006J0996J2034J2753J3225J3619J3881
$$ 311791 317858 324832 332937 341870 351274 361280 372276 384310 397063 410288 423907 437788
63233D37788J4089J4780J6285J8020J9049J9260J9311J9431J9003J7715J6311
$$ 437788 451877 466657 482942 500962 520011 539271 558582 578013 597016 614731 631042
63222F31042J5670J5649J5574J5446J5770J6399J6518J5817J4836J3837J2231
$$ 631042 646712 662361 677935 693381 709151 725550 742068 757885 772721 786558 798789
63211G98789R562O299L011n94n019r846j4101j7464k0253k2391k3389k3422k3428
$$ 798789 808351 814650 817661 817067 812048 802202 788101 770637 750384 727993 704604 681182 657754
63198F57754k3723k3351k1425j8480j5824j3960j2351j0532q637o876n079l009
$$ 657754 634031 610680 589255 570775 554951 540991 528640 518108 509471 502595 497516 494507
63186D94507o85J766M209O270P401P434O916O591O727P065P312P432P532P658
$$ 494507 493822 495588 499797 506067 513468 520902 527818 534409 541136 548201 555513 562945 570477 578135
63172E78135P723P560P082O459N924N382M436K909J183k84j454k553l664m896
$$ 578135 585858 593418 600500 606959 612883 618265 622701 625610 626793 626509 625055 622502 618838 613942
63158F13942o622q999j1377j2840j3370j3745j4175j3957j2861j1906j1957j2233
$$ 613942 607320 598321 586944 574104 560734 546989 532814 518857 505996 494090 482133 469900
63146D69900j1289r098p048n938n199m249l514l505l833l844l585l412l111k220
$$ 469900 458611 449513 442465 436527 431328 427079 423565 420060 416227 412383 408798 405386 402275 400055
63132D00055r13J86Q69J302J327O14m81j046p92m18m70n68j92L33L02k00l05M29
$$ 400055 399142 399328 400197 401499 402826 403440 402959 401913 401121 400703 400233 399665 399473 399806 400108 399908 399603 400032
63114D00032J372J528O52n17j000m84M05Q01N27K39N28J145J425J205R20Q60R21
$$ 400032 401404 402932 403584 403067 402067 401583 401988 402789 403316 403555 404083 405228 406653 407858 408778 409638 410559
63097D10559J137J820K817L177K204N71k66K61J337J975K040J859J467Q09L00
$$ 410559 411696 413516 416333 419510 421714 422285 422019 422280 423617 425592 427632 429491 430958 431767 432067
63082D32067N28J501K619L392L811M068M348M871N683O371O426O037O094P077
$$ 432067 432595 434096 436715 440107 443918 447986 452334 457205 462888 469259 475685 481722 487816 494893
63068D94893Q339Q922Q859R179J0609J2707J4414J5223J5554J6108J7151J8488
$$ 494893 503232 512154 521013 530192 540801 553508 567922 583145 598699 614807 631958 650446
63056F50446J9953K1607K3459K5197K6459K7313K8259K9691L1414L2776L3259
$$ 650446 670399 692006 715465 740662 767121 794434 822693 852384 883798 916574 949833
63045I49833L3027L2779L2956L3171L2715L1611L0676L0372L0187K9602K9085
$$ 949833 982860 1015639 1048595 1081766 1114481 1146092 1176768 1207140 1237327 1266929 1296014
63034A296014K9337K9898K9503K7732K5298K2512J8590J2962O285n83p861j6105
$$ 1296014 1325351 1355249 1384752 1412484 1437782 1460294 1478884 1491846 1498131 1497548 1489687 1473582
63022A473582k4702l2293l8483m4075m9358n3210n4381n3151n1027m9031m6787
$$ 1473582 1448880 1416587 1378104 1334029 1284671 1231461 1177080 1123929 1072902 1023871 977084
63011I77084m3349l8587l3433k8845k4847k0879j6870j3421j0829q526n881l051
$$ 977084 933735 895148 861715 832870 808023 787144 770274 756853 746024 737498 731617 728566
62999G28566n77J547L761O101Q053R197R575R421R001Q705Q857R370R898J0227
$$ 728566 727989 729536 733297 739398 747451 756648 766223 775644 784645 793350 802207 811577 821475 831702
62985H31702J0202R446P652N084K297n40l606o867j0104j3418j7007k0475k3128
$$ 831702 841904 851350 859002 864086 866383 865843 862237 855370 845266 831848 814841 794366 771238
62972G71238k5033k6926k8916l0107k9904k8867k7698k6273k4329k2432k1312
$$ 771238 746205 719279 690363 660256 630352 601485 573787 547514 523185 500753 479441
62961D79441k0611j9292j7077j4696j2790j1390j0447j0059r887r178p734o341
$$ 479441 458830 439538 422461 407765 394975 383585 373138 363079 353192 344014 336280 329939
62949C29939n808n972o029n564m792l993l211k509k081j933j763j332q29o76j003
$$ 329939 324131 318159 312130 306566 301774 297781 294570 292061 289980 288047 286284 284952 284123 283447 282444
62934B82444j488j737j611j218p46m58o19j265k053k553k574k200j622j131j016
$$ 282444 280956 279219 277608 276390 275644 275186 274567 273302 271249 268696 266122 263922 262300 261169 260153
62919B60153j228j297r40n28n50p84n55J86O53K58p12j599k047j954j280l06L56
$$ 260153 258925 257628 256688 256160 255610 254826 254271 254457 255110 255368 254656 253057 251010 249056 247776 247470 247826
62902B47826M23K61K72L61L83O01J209J750J652J053N91N59P84J101J328J019
$$ 247826 248249 248510 248782 249143 249526 250127 251336 253086 254738 255791 256382 256941 257725 258826 260154 261173
62886B61173o7j324j791j292n39o5K73P01J105J408J771K155K087J244n0j165
$$ 261173 261106 259782 257991 256699 256160 256095 256368 257069 258174 259582 261353 263508 265595 266839 266789 265624
62870B65624j718j702j368j046q90o90l29k83j140k591l516l295k449j721j124
$$ 265624 263906 262204 260836 259790 258900 258210 257881 257598 256458 253867 250351 247056 244607 242886 241762
62855B41762m07J54P7n51j175j552j804j908j613r21k75j05m28q89j030o12J56
$$ 241762 241355 241509 241586 241035 239860 238308 236504 234596 232983 232062 231787 231682 231254 230365 229335 228723 228879
62838B28879P84R99R51Q10N13J00LN52J437K066K270K300K230J898J376J107J437
$$ 228879 229663 230662 231613 232423 232936 233036 233039 233591 235028 237094 239364 241664 243894 245792 247168 248275 249712
62821B49712K333L501M506M851M368L518K878K399J644P84P12J825L270L904L646
$$ 249712 252045 255546 260052 264903 269271 272789 275667 278066 279710 280494 281206 283031 286301 290205 293851
62806B93851L417L874M803N729O532P266P764P836P784Q265R525J1017J2074J2810
$$ 293851 297268 301142 305945 311674 318206 325472 333236 341072 348856 357121 366646 377663 389737 402547
62792D02547J4057J6311J9082K1477K3159K4528K6200K8611L1960L6029M0146
$$ 402547 416604 432915 451997 473474 496633 521161 547361 575972 607932 643961 684107
62781F84107M3707M6807N0008N3406N6452N8759O0624O2410O3735O3709O1798
$$ 684107 727814 774621 824629 878035 934487 993246 1053870 1116280 1180015 1243724 1305522
62770A305522N8080N2731M5639L6645K6016J4530L064p918j8398k8277l7107m4593
$$ 1305522 1363602 1416333 1461972 1498617 1524633 1539163 1542227 1534309 1515911 1487634 1450527 1405934
62758A405934n1104n7081o1967o4491o4250o2360o0146n7808n4965n1854m9065
$$ 1405934 1354830 1297749 1235782 1171291 1107041 1044681 984535 926727 871762 819908 770843
62747G70843m6499m3529m0128l6885l3926l0761k7328k4198k1504j8678j5751
$$ 770843 724344 680815 640687 603802 569876 539115 511787 487589 466085 447407 431656
62736D31656j3832j3479j3424j2033r539p635p107p045o527n817n437n084m165
$$ 431656 417824 404345 390921 378888 369349 361714 354607 347562 341035 335218 329781 324697 320532
62723C20532k873j903j433j035m80J4L33Q08J801L232M676N769O425O775P048
$$ 320532 317659 315756 314323 313288 312808 312822 313155 313963 315764 318996 323672 329441 335866 342641 349689
62708C49689P498Q299R476J0855J2211J3480J4862J6568J8520K0413K2053K3548
$$ 349689 357187 365486 374962 385817 398028 411508 426370 442938 461458 481871 503924 527472
62696E27472K5139K6960K8847L0236L0393K9055K6804K4442K1948J8514J3781
$$ 527472 552611 579571 608418 638654 669047 698102 724906 749348 771296 789810 803591
62685H03591Q486L560j017n918j1257j6313k0463k3821k6748k9139l0563l0894
$$ 803591 812077 815637 814620 808702 797445 781132 760669 736848 710100 680961 650398 619504
62673F19504l0537k9996k9352k8215k6233k3572k0841j8543j6745j5308j4183
$$ 619504 588967 558971 529619 501404 475171 451599 430758 412215 395470 380162 365979
62662C65979j3259j2253j1070j0092r660r381q423o549m464l026k459k431k510
$$ 365979 352720 340467 329397 319305 309645 300264 291841 285292 280828 277802 275343 272912 270402
62649B70402k336j743r97o75j008j562j761j522j125p19k90M1M3l35r16j488j878
$$ 270402 268066 266323 265326 264651 263643 262081 260320 258798 257673 256954 256664 256705 256748 256413 255497 254009 252131
62632B52131j892j462q13l34j73j42R1O99J501K011J873J308R00Q44P26L05Q5
$$ 252131 250239 248777 247964 247630 247457 247315 247406 248105 249606 251617 253490 254798 255698 256542 257268 257573 257658
62615B57658O77J862K840L269L522L928M332M571M869N506O482P723R273J1040
$$ 257658 258335 260197 263037 266306 269828 273756 278088 282659 287528 293034 299516 307239 316512 327552
62601C27552J2689J4121J5735J7882K0250K2202K3618K5028K6894K9070L1026
$$ 327552 340241 354362 370097 387979 408229 430431 454049 479077 505971 535041 566067
62590E66067L2288L2546L1588K9439K6498K3271J9860J5807J0638M538j719p486
$$ 566067 598355 630901 662489 691928 718426 741697 761557 777364 788002 792540 790821 783335
62578G83335j2737j7682k2155k5641k7840k8898k9158k8889k8287k7485k6505
$$ 783335 770598 752916 730761 705120 677280 648382 619224 590335 562048 534563 508058
62567E08058k5402k4405k3625k2686k1045j8750j6479j4728j3305j1863j0477
$$ 508058 482656 458251 434626 411940 390895 372145 355666 340938 327633 315770 305293
62556C05293r368q393p278o152n447n270n211m818m066l319k918k770k348j284
$$ 305293 295925 287532 280254 274102 268655 263385 258174 253356 249290 245971 243053 240283 237935 236651
62542B36651N0Q64Q67N09J86k43q34j075n65K86Q98J507K667M080M818M737M665
$$ 236651 236701 237565 238432 238941 239127 238884 238050 236975 236410 236696 237594 239101 241768 245848 250666 255403 260068
62525B60068N057N445N535N912P000Q097Q284P855P985R231J1031J2588J3593
$$ 260068 265125 270570 276105 282017 289017 297114 305398 313253 321238 330469 341500 354088 367681
62512C67681J4113J4346J4558J4834J4796J3972J2460J0870R534Q135O174L481
$$ 367681 381794 396140 410698 425532 440328 454300 466760 477630 487164 495299 501473 504954
62500E04954K26l267o574r338j1470j3061j4101j4548j4660j4828j4958j4510
$$ 504954 505180 501913 495339 486001 474531 461470 447369 432821 418161 403333 388375 373865
62488C73865j3341j2108j1442j1041j0116q598p320o898o946o696o013n389n057
$$ 373865 360524 348416 336974 325933 315817 307219 299899 293001 286055 279359 273346 267957 262900
62475B62900m643l800k747j938j499j271j238j467j668j318l58O05R76Q07N81
$$ 262900 258257 254457 251710 249772 248273 247002 245764 244297 242629 241311 240953 241558 242534 243341 243922
62460B43922O17R40J451J937K159K199K484L090L366K765J816J600K193K504J786
$$ 243922 244539 245479 246930 248867 251026 253225 255709 258799 262165 264930 266746 268346 270539 273043 274829
62445B74829O83K01K97J52m99j047r28k83M28R22J082Q52M04N9j06l75r31j503
$$ 274829 275512 275713 276010 276162 275663 274616 273688 273405 273833 274755 275837 276689 277093 277152 277046 276671 275740 274237
62427B74237j665j282n37K93Q98J029Q09P86J329K090K419K209J936J860J677
$$ 274237 272572 271290 270753 271046 271944 272973 273782 274568 275897 277987 280406 282615 284551 286411 288088
62412B88088J200Q81J271K184K955L353L759M392M858M729M204L885M061M507
$$ 288088 289288 290169 291440 293624 296579 299932 303691 308083 312941 317670 321874 325759 329820 334327
62398C34327M892N122N298N499N638N518N047M526M452M990N674N945N805N685
$$ 334327 339219 344341 349639 355138 360776 366294 371341 375867 380319 385309 390983 396928 402733 408418
62384D08418N738N700N457N382N858O745P606Q326R197J0407J1728J2823J3668
$$ 408418 414156 419856 425313 430695 436553 443298 450904 459230 468427 478834 490562 503385 517053
62371E17053J4573J5912J7923K0599K3649K6588K9084L1256L3469L5832L8064
$$ 517053 531626 547538 565461 586060 609709 636297 665381 696637 730106 765938 804002
62360H04002L9922M1514M2954M3796M3163M0439L5668K9321K2087J4898Q700L735
$$ 804002 843924 885438 928392 972188 1015351 1055790 1091458 1120779 1142866 1157764 1166464 1170199
62348A170199o74n316j0180j4632j8371k1771k5233k8562l1120l2450l2698l2458
$$ 1170199 1169525 1164209 1154029 1139397 1121026 1099255 1074022 1045460 1014340 981890 949192 916734
62336I16734l2260l2041l1228k9430k6965k4547k2587k0982j9437j7653j5460
$$ 916734 884474 852433 821205 791775 764810 740263 717676 696694 677257 659604 644144
62325F44144j3100j1288j0443r968q877p093n470m430l435k105j014o59l28J019
$$ 644144 631044 619756 609313 599345 590468 583375 577905 573475 570040 567935 566921 566262 565934 566953
62311E66953L102M491M381L379K451J951J873K297L098L745L864L762L992M601
$$ 566953 570055 574546 578927 582306 584757 586708 588581 590878 593976 597721 601585 605347 609339 613940
62297F13940N110N109M601L972L716L973M263M024L525L731M942O164O404O120
$$ 613940 619050 624159 628760 632732 636448 640421 644684 648708 652233 655964 660906 667070 673474 679594
62283F79594O616Q193R805J0595J0899J1414J2191J2953J3825J5054J6450J7765
$$ 679594 686210 694403 704208 714803 725702 737116 749307 762260 776085 791139 807589 825354
62271H25354J9339K1703K4562K6954K8480K9816L1789L4452L7282L9877M2172
$$ 825354 844693 866396 890958 917912 946392 976208 1007997 1042449 1079731 1119608 1161780
62260A161780M4280M6365M8374M9737M9589M7557M3953L9015L2443K4142J5025
$$ 1161780 1206060 1252425 1300799 1350536 1400125 1447682 1491635 1530650 1563093 1587235 1602260
62249A602260O516n92o356j0982j4586j7525k0291k2929k5061k6554k7655k8314
$$ 1602260 1608776 1608184 1601828 1590846 1576260 1558735 1538444 1515515 1490454 1463900 1436245 1407931
62237A407931k8013k6520k4340k2086j9828j7419j4950j2546j0022p277m712k853
$$ 1407931 1379918 1353398 1329058 1306972 1287144 1269725 1254775 1242229 1232207 1224930 1220218 1217365
62225A217365j713r13j68O98J860L110L685L124K194K211L529N238O448P139P660
$$ 1217365 1215652 1214739 1214571 1215269 1217129 1220239 1223924 1227048 1229242 1231453 1234982 1240220 1246668 1253807 1261467
62210A261467Q066Q328Q658R201R764J0252J1014J2380J4141J5807J7154J8213
$$ 1261467 1269533 1277861 1286519 1295720 1305484 1315736 1326750 1339130 1353271 1369078 1386232 1404445
62198A404445J8979J9566K0352K1556K2764K3344K3253K3006K2922K2812K2463
$$ 1404445 1423424 1442990 1463342 1484898 1507662 1531006 1554259 1577265 1600187 1622999 1645462
62187A645462K1906K1148J9976J8293J6233J3824J0839P331M092K190K034L107
$$ 1645462 1667368 1688516 1708492 1726785 1743018 1756842 1767681 1775012 1779104 1781294 1783328 1786435
62175A786435M572O090P983J0763J4466J8403K1664K3862K5254K6075K6026K4550
$$ 1786435 1791007 1797097 1805080 1815843 1830309 1848712 1870376 1894238 1919492 1945567 1971593 1996143
62163A996143K1464J7065J1855O406J348k987o851j0693j4463j7677k0261k2821
$$ 1996143 2017607 2034672 2046527 2052933 2054281 2051294 2044443 2033750 2019287 2001610 1981349 1958528
62151A958528k5862k9077l1667l3123l3396l2624l1098k9301k7578k5824k3819
$$ 1958528 1932666 1903589 1871922 1838799 1805403 1772779 1741681 1712380 1684802 1658978 1635159
62140A635159k1700j9836j8312j7024j6124j5861j5929j5548j4322j2645j1173
$$ 1635159 1613459 1593623 1575311 1558287 1542163 1526302 1510373 1494825 1480503 1467858 1456685
62129A456685j0230r838r795r604q800p623o793o483o057n221m629m805n047m321
$$ 1456685 1446455 1436617 1426822 1417218 1408418 1400795 1394002 1387519 1381462 1376241 1371612 1366807 1361760 1357439
62115A357439k825j665j180n71O91K001K467J786l6l056o898j0432j2556j3091
$$ 1357439 1354614 1352949 1351769 1351198 1351889 1353890 1356357 1358143 1358107 1355051 1348153 1337721 1325165 1312074
62101A312074j2491j1036q802o225m229l688m961p594j0304j1546j0645q267n484
$$ 1312074 1299583 1288547 1279745 1273520 1269291 1265603 1260642 1253048 1242744 1231198 1220553 1212286 1206802
62088A206802k617N75L881O491P909Q453Q701Q946R329J0082J1206J2179J2406
$$ 1206802 1204185 1204760 1208641 1215132 1223041 1231494 1240195 1249141 1258470 1268552 1279758 1291937 1304343
62075A304343J1838J0974J0299R923R647R122Q040O393M595L122K027R12o36k796
$$ 1304343 1316181 1327155 1337454 1347377 1357024 1366146 1374186 1380579 1385174 1388296 1390323 1391235 1390599 1387803
62061A387803n673r340j3509j7462k0606k3052k5266k7259k8617k9423l0589l2780
$$ 1387803 1382130 1372790 1359281 1341819 1321213 1298161 1272895 1245636 1217019 1187596 1157007 1124227
62049A124227l5322l6757l6440l5040l3430l1712k9570k7057k4481k1887j9181
$$ 1124227 1088905 1052148 1015708 980668 947238 915526 885956 858899 834418 812531 793350
62038G93350j6672j4851j3579j2078r949p786o358n581m740l591k710k624l154
$$ 793350 776678 761827 748248 736170 726221 718435 712077 706496 701756 698165 695455 692831 689677
62025F89677l905n025o930r317j1036j1266j0465r825r809r660q402o055l522
$$ 689677 685772 680747 673817 664500 653464 642198 631733 621908 612099 602439 594037 587982 584460
62012E84460j488K63K336M852P373R601J1691J3695J5115J5406J4757J3810J2600
$$ 584460 582972 583235 585571 590423 597796 607397 619088 632783 647898 663304 678061 691871 704471
61999G04471J0369O722K385j587m925p970j0718j2857j4559j6365j8128j8859
$$ 704471 714840 721562 723947 722360 717435 709465 698747 685890 671331 654966 636838 617979
61987F17979j8029j6380j4950j3855j2563j0979r474q045o337m480l187k692k204
$$ 617979 599950 583570 568620 554765 542202 531223 521749 513704 507367 502887 499700 497008 494804
61974D94804r03R24K257K669K767L267M123M795N089N374O080P230Q557R798J0828
$$ 494804 493901 494825 497082 499751 502518 505785 509908 514703 519792 525166 531246 538476 547033 556831 567659
61959E67659J1686J2596J3859J5569J7478J9290K0974K2706K4622K6800K9382
$$ 567659 579345 591941 605800 621369 638847 658137 679111 701817 726439 753239 782621
61948G82621L2458L5951L9779M3982M8393N2293N4855N5999N6395N6541N6286
$$ 782621 815079 851030 890809 934791 983184 1035477 1090332 1146331 1202726 1259267 1315553
61937A315553N5395N4152N2981N1816N0223M7970M5160M1921L8312L4475L0543
$$ 1315553 1370948 1425100 1478081 1529897 1580120 1628090 1673250 1715171 1753483 1787958 1818501
61926A818501K6492K2344J8587J6142J5859J8062K2555K8899L6736M5863N5982
$$ 1818501 1844993 1867337 1885924 1902066 1917925 1935987 1958542 1987441 2024177 2070040 2126022
61915B126022O6446P6642Q6667R7199J08340J18943J27525J33713J38325J42231
$$ 2126022 2192468 2269110 2355777 2452976 2561316 2680259 2807784 2941497 3079822 3222053
61905C222053J45631J48516J51152J53839J56350J57872J57465J54486J48545
$$ 3222053 3367684 3516200 3667352 3821191 3977541 4135413 4292878 4447364 4595909
61896D595909J39011J24606J03783P5854M1682L147l7694p8664j17150j50619
$$ 4595909 4734920 4859526 4963309 5039163 5080845 5083992 5046298 4967634 4850484 4699865
61886D699865j77699j98256k12386k19851k20815k16561k08921j99103j87422
$$ 4699865 4522166 4323910 4111524 3891673 3670858 3454297 3245376 3046273 2858851
61877B858851j74015j59447j44527j29847j15714j02447r0436p9710o9673n9651
$$ 2858851 2684836 2525389 2380862 2251015 2135301 2032854 1942418 1862708 1793035 1733384
61867A733384m9727m0637l2636k4982j6945q777j098O305J4200K2584L0550L7592
$$ 1733384 1683657 1643020 1610384 1585402 1568457 1559680 1558582 1564887 1579087 1601671 1632221 1669813
61855A669813M4108N0326N5637N9470O2126O3957O4387O2477N8166N2162M4799
$$ 1669813 1713921 1764247 1819884 1879354 1941480 2005437 2069824 2132301 2190467 2242629 2287428
61844B287428L5826K5302J4027K991p090j5564k1667k4864k5123k2748j8214j2186
$$ 2287428 2323254 2348556 2362583 2365574 2358484 2342920 2321253 2296389 2271266 2248518 2230304 2218118
61832B218118n429J451P962J3433J7012J8020J6149J1263L401o830j8119k9001
$$ 2218118 2212689 2214140 2222102 2235535 2252547 2270567 2286716 2297979 2301380 2294550 2276431 2247430
61820B247430l8658m7130n4739o1312o5996o7947o7171o4524o0809n6213n0740
$$ 2247430 2208772 2161642 2106903 2045591 1979595 1911648 1844477 1779953 1719144 1662931 1612191
61809A612191m4821l9021l3366k7511k1485j5757j0587n714q61L962Q767J3698
$$ 1612191 1567370 1528349 1494983 1467472 1445987 1430230 1419643 1413929 1413068 1417030 1425797 1439495
61797A439495J8578K2816K6157K9308L3374L8849M5367N2265N9062O5601P2137
$$ 1439495 1458073 1480889 1507046 1536354 1569728 1608577 1653944 1706209 1765271 1830872 1903009
61786A903009P9302Q7658R7288J07911J19368J31761J45302J60272J76899J94941
$$ 1903009 1982311 2069969 2167257 2275168 2394536 2526297 2671599 2831871 3008770 3203711
61776C203711K13509K31769K49772K68074K86483L03787L18825L31119L39837
$$ 3203711 3417220 3648989 3898761 4166835 4453318 4757105 5075930 5407049 5746886
61767E746886L42656L36420L18879K89279K47504J93693J29096N6722j9367r5125
$$ 5746886 6089542 6425962 6744841 7034120 7281624 7475317 7604413 7661135 7641768 7546643
61757G546643j66679k30146k82288l21594l48275l63210l67312l61997l49511
$$ 7546643 7379964 7149818 6867530 6545936 6197661 5834451 5467139 5105142 4755631
61748D755631l32315l12238k90508k68289k46676k26193k06749j88213j70822
$$ 4755631 4423316 4111078 3820570 3552281 3305605 3079412 2872663 2684450 2513628
61739B513628j54923j40581j27607j15818j05105r5368q6568p8737p1811o5493
$$ 2513628 2358705 2218124 2090517 1974699 1869594 1774226 1687658 1608921 1537110 1471617
61729A471617n9479n3794m8669m4064l9627l5253l1458k8873k7406k6203k4549
$$ 1471617 1412138 1358344 1309675 1265611 1225984 1190731 1159273 1130400 1102994 1076791 1052242
61718A052242k2626k1298k1204k2202k3590k4736k5487k6015k6363k6264k5403
$$ 1052242 1029616 1008318 987114 964912 941322 916586 891099 865084 838721 812457 787054
61707G87054k3805k1843j9990j8626j7963j7832j7646j6862j5553j4220j3073
$$ 787054 763249 741406 721416 702790 684827 666995 649349 632487 616934 602714 589641
61696E89641j1908j0738j0050j0110j0480j0511j0021r155p986o748n967n801
$$ 589641 577733 566995 556945 546835 536355 525844 515823 506668 498682 491934 485967 480166
61684D80166n628n021m660n389o568o609n248m095m450n688o440o447o339o255
$$ 480166 474538 469517 464857 459468 452900 446291 441043 436948 432498 426810 420370 413923 407584 401329
61670D01329n793m988m312l846l221k402j722j180m30M83R98Q87O44Q31J441K133
$$ 401329 395536 390548 386236 382390 379169 376767 375045 373865 373435 373918 374916 375803 376447 377278 378719 380852
61654C80852K742L401M349N633O846P334O984O569O818P332P019N503L394J203
$$ 380852 383594 386995 391344 396977 403823 411157 418141 424710 431528 438860 445879 451382 454776 455979
61640D55979j123l447n073n635n670n784n820n341m469l629k850j979j256r84
$$ 455979 454856 451409 446336 440701 435031 429247 423427 418086 413617 409988 407138 405159 403903 402919
61626D02919p62K63K270M374N527N532N056M844M905M425K568m88l566n723p095
$$ 402919 402157 402420 404690 409064 414591 420123 425179 430023 434928 439353 441921 441433 437867 432144 425049
61611D25049q270r207r409q923q450q378q282p606o342m832l307j912q59k10K43
$$ 425049 416779 407572 398163 389240 380790 372412 364130 356524 350182 345350 342043 340131 339272 339062 339305
61596C39305O97J029J060R00Q75J118J569K236L150M044M395M011L441L464M187
$$ 339305 340002 341031 342091 342991 343866 344984 346553 348789 351939 355983 360378 364389 367830 371294 375481
61581C75481M889M951M654M838N853P198Q222Q838R423J0252J1301J2341J3046
$$ 375481 380370 385321 389975 394813 400666 407864 416086 424924 434347 444599 455900 468241 481287
61568D81287J3192J2949J2878J3406J4411J5432J6073J6031J5120J3617J2313
$$ 481287 494479 507428 520306 533712 548123 563555 579628 595659 610779 624396 636709
61557F36709J1740J1415J0361Q364O300N188N247N903O327N974M981M159M190
$$ 636709 648449 659864 670225 678589 684889 690077 695324 701227 707554 713528 718509 722668 726858
61544G26858M756M814L920K741K103J959J698J083L70k85j074k140l304m276m939
$$ 726858 731614 736428 740348 743089 745192 747151 748849 749932 750302 750017 748943 746803 743499 739223 734284
61529G34284n364n629n634n038l546j325J026L057M935P139R784J2442J4657J6490
$$ 734284 728920 723291 717657 712619 709073 707748 708774 711831 716766 723905 733689 746131 760788 777278
61515G77278J8504K1175K4370K7462L0119L2881L6693M1905M7873N3638N8702
$$ 777278 795782 816957 841327 868789 898908 931789 968482 1010387 1058260 1111898 1170600
61504A170600O3173O7501P2176P7358Q2596Q7122R0513R2705R3266R1235Q6045
$$ 1170600 1233773 1301274 1373450 1450808 1533404 1620526 1711039 1803744 1897010 1988245 2074290
61493B074290P8083O7886N5210L9684K2200M791j0981k4952l7436m8023n5714
$$ 2074290 2152373 2220259 2275469 2315153 2337353 2342144 2331163 2306211 2268775 2220752 2165038
61482B165038n9937o1077o0145n8074n5236n1424m6388m0512l4783k9998k6137
$$ 2165038 2105101 2044024 1983879 1925805 1870569 1819145 1772757 1732245 1697462 1667464 1641327
61471A641327k2680j9387j6552j4492j3052j1753j0360r077q073p020n379l080
$$ 1641327 1618647 1599260 1582708 1568216 1555164 1543411 1533051 1523974 1515901 1508881 1503502 1500422
61459A500422n33K072N030Q436J1692J4163J6014J7877J9872K1537K2695K3777
$$ 1500422 1499889 1501961 1506991 1515427 1527119 1541282 1557296 1575173 1595045 1616582 1639277 1663054
61447A663054K5117K6451K7405K8147K9213L0860L2746L4144L4375L3193L0775
$$ 1663054 1688171 1714622 1742027 1770174 1799387 1830247 1862993 1897137 1931512 1964705 1995480
61436A995480K7285K2714J7377J2252Q210N006J746j640m190n414o198p597r417
$$ 1995480 2022765 2045479 2062856 2075108 2083318 2088324 2090070 2088430 2084240 2078826 2072628 2065031 2055614
61423B055614j0642j0912j0749j0589j0285r668r068r104j0275j2646j5661j8310
$$ 2055614 2044972 2034060 2023311 2012722 2002437 1992769 1983701 1974597 1964322 1951676 1936015 1917705
61411A917705j9943k0820k1594k2319k2431k1646k0329j8910j7410j5778j4287
$$ 1917705 1897762 1876942 1855348 1833029 1810598 1788952 1768623 1749713 1732303 1716525 1702238
61400A702238j3237j2457j1429r832p810n664l440q74K278N912R830J4220J9610
$$ 1702238 1689001 1676544 1665115 1655283 1647473 1641809 1638369 1637495 1639773 1645685 1655515 1669735 1689345
61387A689345K6123L3075L9574M5434N1167N7225O3591P0019P6344Q2396Q7882
$$ 1689345 1715468 1748543 1788117 1833551 1884718 1941943 2005534 2075553 2151897 2234293 2322175
61376B322175R2354R5239R6010R4543R1120Q5757P7738O6308N1831L5786J9617
$$ 2322175 2414529 2509768 2605778 2700321 2791441 2877198 2954936 3021244 3073075 3108861 3128478
61365C128478L988j0767k4073l5391m4683n2316n8640o3854o7962p0717p1870
$$ 3128478 3132466 3121699 3097626 3062235 3017552 2965236 2906596 2842742 2774780 2704063 2632193
61354B632193p1806p1566p1948p2777p3263p2858p1413o8812o5002o0386n5714
$$ 2632193 2560387 2488821 2416873 2344096 2270833 2197975 2126562 2057750 1992748 1932362 1876648
61343A876648n1499m7758m4338m1136l7957l4459l0474k6190k1929j7853j4049
$$ 1876648 1825149 1777391 1733053 1691917 1653960 1619501 1589027 1562837 1540908 1523055 1509006
61332A509006j0627p605m749j715J586M885P724R802J1201J2320J3446J4342J4465
$$ 1509006 1498379 1490774 1486025 1484310 1485896 1490781 1498505 1508307 1519508 1531828 1545274 1559616 1574081
61319A574081J3708J2738J2367J2713J3266J3686J4101J4609J4904J4606J3470
$$ 1574081 1587789 1600527 1612894 1625607 1638873 1652559 1666660 1681269 1696173 1710779 1724249
61308A724249J1072O810P67n713j0999j4614j7156j8950j9664j9343j8924j9098
$$ 1724249 1735321 1742131 1742898 1737185 1726186 1711572 1694416 1675466 1655802 1636459 1617535 1598437
61296A598437j9336j8664j7101j5665j5101j5137j4911j3739j1626r339p787o979
$$ 1598437 1579101 1560437 1543336 1527671 1512570 1497433 1482522 1468783 1457157 1447818 1440031 1433052
61284A433052n829l410j93K524M163N313O696Q355R838J0649J0435R348Q297Q349
$$ 1433052 1427223 1423813 1423620 1426144 1430307 1435620 1442316 1450671 1460509 1471158 1481593 1490941 1499238 1507587
61270A507587R716J1703J3692J5634J7501J8881J9376J8919J7452J4780J1021
$$ 1507587 1517303 1529006 1542698 1558332 1575833 1594714 1614090 1633009 1650461 1665241 1676262
61259A676262O888L270Q65K44J712M794Q360J1643J4869J8639K3120K8070L3226
$$ 1676262 1683150 1686420 1687285 1687529 1689241 1694035 1702395 1714038 1728907 1747546 1770666 1798736 1831962
61246A831962L8210M2393M5163M6065M4458L9490L0854J9320O213p342k0494l2497
$$ 1831962 1870172 1912565 1957728 2003793 2048251 2087741 2118595 2137915 2144128 2136786 2116292 2083795
61234B083795m2949n1866n9206o4645o8040o9677o9672o7726o3977n9376n4649
$$ 2083795 2040846 1988980 1929774 1865129 1797089 1727412 1657740 1590014 1526037 1466661 1412012
61223A412012m9384m3079l6608l1628k8776k7438k7151k8035k9742l1092l1306
$$ 1412012 1362628 1319549 1282941 1251313 1222537 1195099 1167948 1139913 1110171 1079079 1047773
61212A047773l0756l0020k8808k6362k2460j7523j2054o470j203L449P478J0999
$$ 1047773 1017017 986997 958189 931827 909367 891844 879790 873320 872117 875566 883044 894043
61200H94043J4033J6508J8172J8376J6428J2449P661L548Q77m09p14n29k77j35
$$ 894043 908076 924584 942756 961132 977560 990009 997670 1001218 1002095 1001686 1000972 1000443 1000166 1000031
61186A000031r2l57j408l352n511o996p550p598p661p978q595r388j0012j0185
$$ 1000031 999939 999582 998174 994822 989311 982315 974765 967167 959506 951528 942933 933545 923533 913348
61172I13348j0045j0020j0292j0585j0606j0474j0592j1104j1656j1614j0610
$$ 913348 903303 893283 882991 872406 861800 851326 840734 829630 817974 806360 795750
61161G95750q846o905n191l541j502R48K972L345J502j986o063j0206j4507j8837
$$ 795750 786904 779999 774808 771267 769765 770713 773685 777030 778532 776546 770483 760277 745770 726933
61147G26933k2388k4314k4576k3810k2585k1081j9344j7465j5511j3595j2019
$$ 726933 704545 680231 655655 631845 609260 588179 568835 551370 535859 522264 510245
61136E10245j1074j0615j0182r558q898q255p383o196n125m663m684m469l465
$$ 510245 499171 488556 478374 468816 459918 451663 444280 438084 432959 428296 423612 419143 415678
61123D15678j865l68M94Q55J315K339L834N330O476P316Q108Q988R791J0137R710
$$ 415678 413813 413445 413939 414794 416109 418448 422282 427612 434088 441404 449512 458500 468291 478428 488138
61108D88138Q401O238L237m21m139p131q995r848r823q824o968m915l388k531
$$ 488138 496539 502777 506014 505593 501454 494323 485328 475480 465657 456833 449865 444950 441562 439031
61094D39031k065j815j731j625j278p97m38k20kJ52J20R7M02R60J324J225P74
$$ 439031 436966 435151 433420 431795 430517 429720 429282 429062 429060 429212 429332 429429 429831 430791 432115 433340 434114
61077D34114K21j48l6N07R38Q66P05J094J804J986J509J254J765K386K209J391
$$ 434114 434335 434187 434151 434658 435596 436462 437167 438261 440065 442051 443560 444814 446579 448965 451174 452565
61061D52565R03J294K205L072L762M491N294N817N672N037M650N103O209P252
$$ 452565 453468 454762 456967 460039 463801 468292 473586 479403 485075 490112 494762 499865 506074 513326
61047E13326P815Q068Q469R345J0679J1998J2655J2528J2204J2253J2638J3198
$$ 513326 521141 529209 537678 547023 557702 569700 582355 594883 607087 619340 631978 645176
61035F45176J4167J5657J7129J8199J9454K1579K4065K5915K7380K9641L2877
$$ 645176 659343 675000 692129 710328 729782 751361 775426 801341 828721 858362 891239
61024H91239L6040L8787M2128M6667N1425N5119N7554N9258O0754O2858O6652
$$ 891239 927279 966066 1008194 1054861 1106286 1161405 1218959 1278217 1338971 1401829 1468481
61013A468481P2507P9969Q9062J00545J14412J29342J44409J60329J78659K01451
$$ 1468481 1540988 1620957 1710019 1810564 1924976 2054318 2198727 2359056 2537715 2739166
61003B739166K32123K74279L28081L89790M56666N30543O15036P12457Q26483
$$ 2739166 2971289 3245568 3573649 3963439 4420105 4950648 5565684 6278141 7104624
60994G104624R64847J135040J340564J585749J873861K176958K397928K386112
$$ 7104624 8069471 9204511 10545075 12130824 14004685 16181643 18579571 20965683
60986B0965683K031699J369527N86767q4446m91622o00004m49843j20795K54769
$$ 20965683 22997382 24366909 24953676 24869230 24377608 23777604 23327761 23206966 23461735
60977B3461735M87530M02133n0446p46393j461913k002180k281583k317244k177817
$$ 23461735 23949265 24351398 24300952 23554559 22092646 20090466 17808883 15491639 13313822
60968A3313822j940148j667916j403060j165614r61402p90619o50585n35788m40712
$$ 13313822 11373674 9705758 8302698 7137084 6175682 5385063 4734478 4198690 3757978
60959C757978l62997l02014k55474k19598j91768j70629j54081j39540j26083
$$ 3757978 3394981 3092967 2837493 2617895 2426127 2255498 2101417 1961877 1835794
60950A835794j14367j04344r4782q5098p5886o7374n9078n1423m6087m3937m3760
$$ 1835794 1721427 1617083 1522301 1437203 1361317 1293943 1234865 1183442 1137355 1093418 1049658
60939A049658m3743m3158m1928l9674l6178l2106k8399k5271k2460k0010j8077
$$ 1049658 1005915 962757 920829 881155 844977 812871 784472 759201 736741 716731 698654
60928F98654j6313j4123j1504r064p307o220n543n110m896m908n055n151n130
$$ 698654 682341 668218 656714 647650 640343 634123 628580 623470 618574 613666 608611 603460 598330
60915E98330n207n572o029o242o334o774p584q162q120p837p893q243q362p931
$$ 598330 593123 587551 581522 575280 568946 562172 554588 546426 538306 530469 522576 514333 505971 498040
60901D98040p075o148n557n588o028o191n636m751m248m256m273l924l310k722
$$ 498040 490965 484817 479260 473672 467644 461453 455817 451066 446818 442562 438289 434365 431055 428333
60887D28333k406k563l119l455k902j652p22p35j156j101l87M89J118J317Q09
$$ 428333 425927 423364 420245 416790 413888 412236 411514 410779 409623 408522 408135 408624 409742 411059 411868
60872D11868n04j942k453j836j030q99j174j054m12J34J91K8M4K09K74K60N14
$$ 411868 411364 409422 406969 405133 404103 403204 402030 400976 400564 400698 400889 400917 400961 401170 401444 401704 402218
60855D02218J351K659L847M194L465K152J093Q18J298K145K937L413L539L335
$$ 402218 403569 406228 410075 414269 417734 419886 420979 421797 423095 425240 428177 431590 435129 438464
60841D38464K606J059j163l308m642n027m714l893k839k190k351k783k470j246
$$ 438464 441070 442129 440966 437658 433016 427989 423275 419382 416543 414353 412002 409219 406749 405503
60827D05503lM98M66M61N62N87O45R15J166R81L94j50l50l08k55l28o03j019j324
$$ 405503 405500 405998 406464 406925 407487 408074 408719 409634 410800 411781 412175 412025 411675 411367 411112 410784 410181 409162 407838
60808D07838j262r21p25r73j497j805j618j230j236j791k278k001j131o71j339
$$ 407838 406576 405655 404930 403957 402460 400655 399037 397807 396571 394780 392502 390501 389370 388699 387360
60793C87360k745l793l672k518j290j011j774k545k320j425j108j792k471k142
$$ 387360 384615 380822 377150 374632 373342 372331 370557 368012 365692 364267 363159 361367 358896 356754
60779C56754j091k29J86M38M65L8m53l11L46N65j11r99j224p32m2N70J181J802
$$ 356754 355663 355434 355620 356058 356523 356561 356108 355797 356143 356708 356597 355598 354374 353642 353600 354170 355351 357153
60761C57153K203K108J462N50j02j58J91N01O83R93J405J465R58L95M71J160J682
$$ 357153 359356 361464 362926 363476 363374 363216 363407 363908 364591 365584 366989 368454 369412 369807 370278 371438 373120
60744C73120J317J27j173j972k363k918l841m557m421l664l186l389l705l501
$$ 373120 374437 374564 373391 371419 369056 366138 362297 357740 353319 349655 346469 343080 339375 335874
60730C35874l000k915l390l785l488k558j529q13m77m13n64q84j203j294j101
$$ 335874 332874 329959 326569 322784 319296 316738 315209 314396 313919 313506 312942 312058 310855 309561 308460
60715C08460q53q04r73j216j487j732j707j202m54NJ5p2k3q7m43o91l73K63N39
$$ 308460 307607 306803 305830 304614 303127 301395 299688 298486 298032 298037 298052 297980 297957 297870 297427 296736 296363 296626 297165
60696B97165K99Q7L78J012J552J767J688J487J436J705K044J990J533J208J375
$$ 297165 297464 297551 297929 298941 300493 302260 303948 305435 306871 308576 310620 312610 314143 315351 316726
60681C16726J734J852J763J735J720J567J501J835K292K225J519Q04O05Q05J035
$$ 316726 318460 320312 322075 323810 325530 327097 328598 330433 332725 334950 336469 337273 337878 338683 339718
60666C39718J142J025N44j19m02r1K42o9q65j398j251o17J54Q43J180R12J98l82
$$ 339718 340860 341885 342429 342310 341908 341817 342059 341990 341125 339727 338476 337859 338013 338856 340036 340948 341146 340764
60648C40764l70J30N52L63m75j397j713j340q85q33r45p49l55k78o26r08o67K8
$$ 340764 340394 340524 341076 341439 340964 339567 337854 336514 335629 334796 333851 333102 332747 332469 331843 330935 330268 330296
60630C30296P35R53M76k44k92P02J916K220J601J020R99J107R46Q04R36R60M42
$$ 330296 331031 331984 332460 332216 331924 332626 334542 336762 338363 339383 340382 341489 342435 343239 344175 345135 345577
60613C45577l28o93m41O4M11M90N35R26J722K399K399J960J849K184K236J535
$$ 345577 345249 344556 344115 344179 344590 345080 345615 346541 348263 350662 353061 355021 356870 359054 361290 362825
60597C62825M45o43j875l214l905l447k495k054k232k544k974l721m190l398j436
$$ 362825 363270 362627 360752 357538 353633 350186 347691 345637 343405 340861 337887 334166 329976 326578 325142
60582C25142K80O12j36q73j033q58q47j203j727k033j910j506j113q69p75q08
$$ 325142 325422 326034 325898 325025 323992 323134 322287 321084 319357 317324 315414 313908 312795 311926 311151 310343
60566C10343q10n45m0L60N31Q23J465K083K224K060K082K308K342K010J511J042
$$ 310343 309533 308988 308948 309308 309839 310662 312127 314210 316434 318494 320576 322884 325226 327236 328747 329789
60550C29789P47Q68J473K231K859L559M562N583O257O846P788Q816R282R237R453
$$ 329789 330536 331404 332877 335108 337967 341526 346088 351671 357928 364774 372562 381378 390660 399897 409350
60535D09350J0419J2041J4215J6916J9733K2176K4522K7524L1142L4359L6468
$$ 409350 419769 431810 446025 462941 482674 504850 529372 556896 588038 622397 658865
60524F58865L7685L8164L7195L3902K8142K0294J0766K19j0159j9098k5855l0205
$$ 658865 696550 734714 771909 805811 833953 854247 865013 865232 855073 835975 810120 779915
60512G79915l2225l2250l0705k7849k3976j9781j5929j2271q231m016o14J739
$$ 779915 747690 715440 684735 656886 632910 613129 597200 584929 576698 572682 572068 573807
60500E73807M157P655J1891J5887J9319K2366K4879K6450K7001K6579K4933K1812
$$ 573807 577964 585619 597510 613397 632716 655082 679961 706411 733412 759991 784924 806736
60488H06736J7466J2354O756J183l256n705o546o941p485p900p860p463o773n482
$$ 806736 824202 836556 843312 844495 841239 835534 828988 822047 814562 806662 798802 791339 784566 779084
60474G79084l178K74M730R913J5651K2034K9148L6655M3958N0968N8296O6469
$$ 779084 775906 776180 780910 790823 806474 828508 857656 894311 938269 989237 1047533 1114002
60462A114002P5466Q5239R5983J07353J17986J26476J32171J34206J30317J17755
$$ 1114002 1189468 1274707 1370690 1478043 1596029 1722505 1854676 1988882 2119199 2236954
60452B236954R5507O4908K8445j1042n0139q5241j13801j34705j47360j51379
$$ 2236954 2332461 2397369 2425814 2414772 2364633 2279392 2165591 2030886 1883526 1732147
60442A732147j47610j38605j27189j14892j02131q9390p7476o6905n7690m9787
$$ 1732147 1584537 1445932 1318743 1203851 1101720 1012330 934854 867949 810259 760472
60432G60472m3250l7940l3512k9845k7116k5218k3291k0238j5848j1180p674n923
$$ 760472 717222 679282 645770 615925 588809 563591 540300 520062 504214 493034 485360 479437
60420D79437n435n477n692n942n936n438m602l821l291k952k646k160j312k84
$$ 479437 474002 468525 462833 456891 450955 445517 440915 437094 433803 430851 428205 426045 424733 424449
60406D24449L82L69Qk07k61l59l62P8R50J926K844L702M258M284M132M407N011
$$ 424449 424831 425200 425208 425001 424740 424381 424019 424097 425047 426973 429817 433519 437777 442061 446193 450600 455611
60389D55611N127M373L352K824K846L026L126L024K547J818J465J926K711K900
$$ 455611 460738 465111 468463 471287 474133 477159 480285 483309 485856 487674 489139 491065 493776 496676
60375D96676K318J773J962K549K606J719L71p30j309j443j140m60Q0j74j074j514
$$ 496676 498994 500767 502729 505278 507884 509603 509974 509244 507935 506492 505352 504892 504972 504798 503724 502210
60359E02210o42J127K659L405L589L427K909K381K532L527M671N300N572N988
$$ 502210 501568 502695 505354 508759 512348 515775 518684 521065 523597 527124 531795 537095 542667 548655
60345E48655O560O856O620N951N008L876K594J088q18l039n013o132o328n999
$$ 548655 555215 562071 568691 574642 579650 583526 586120 587208 586390 583351 578338 572206 565878 559879
60331E59879n480m805l948l027k192j515j060r79j448k426l532m239m378m334
$$ 559879 554399 549594 545646 542619 540427 538912 537852 536873 535425 532999 529467 525228 520850 516516
60317E16516m530m733m304l205k286k267k751k759k018j159o80k81M71J324J695
$$ 516516 511986 507253 502949 499744 497458 495191 492440 489681 487663 486504 485824 485543 486014 487338 489033
60302D89033J562J556K078K783L086K877K403J706N37j098k699l693l931l659
$$ 489033 490595 492151 494229 497012 500098 502975 505378 507084 507621 506523 503824 500131 496200 492541
60288D92541l193k834k776k933k930k571k164k180k636l105l179k693j592j5J490
$$ 492541 489348 486514 483738 480805 477875 475304 473140 470960 468324 465219 462040 459347 457755 457740 459230
60273D59230K246K182K001K443L583M930N908O117N431M182L016K336J966J573
$$ 459230 461476 463658 465659 468102 471685 476615 482523 488640 494071 498253 501269 503605 505571 507144
60259E07144J254J377J959K540K771K800K992L441L927M251M467M807N434O309
$$ 507144 508398 509775 511734 514274 517045 519845 522837 526278 530205 534456 538923 543730 549164 555473
60245E55473P309Q445R888J1696J3616J5320J6826J8447K0284K1933K3021K3843
$$ 555473 562782 571227 581115 592811 606427 621747 638573 657020 677304 699237 722258 746101
60233G46101K5219K7632L0832L4289L7775M1215M4359M6923M8995N0936N2859
$$ 746101 771320 798952 829784 864073 901848 943063 987422 1034345 1083340 1134276 1187135
60222A187135N4463N5308N4957N2949M9105M3956L8443L3046K7541K1743J5945
$$ 1187135 1241598 1296906 1351863 1404812 1453917 1497873 1536316 1569362 1596903 1618646 1634591
60211A634591J0400M856r76o814j2045j6263j9231k0625k0357j8943j7054j4803
$$ 1634591 1644991 1649847 1648871 1642057 1630012 1613749 1594518 1573893 1553536 1534593 1517539 1502736
60199A502736j1900q219l840J299P131J3098J8677K4163L0230L6727M2688M7658
$$ 1502736 1490836 1482617 1478777 1480076 1487207 1500305 1518982 1543145 1573375 1610102 1652790 1700448
60187A700448N2203N6749O0597O2545O2040N9393N5214M9988M3899L6777K8517
$$ 1700448 1752651 1809400 1869997 1932542 1994582 2053975 2109189 2159177 2203076 2239853 2268370
60176B268370J9694J1282L542m258j2632k0958k8257l4393l9715m3901m6014m5724
$$ 2268370 2288064 2299346 2302888 2298630 2285998 2265040 2236783 2202390 2162675 2118774 2072760 2027036
60164B027036m3773m0987l7427l2727k6902k0425j3724o933j21O483J2659J8541
$$ 2027036 1983263 1942276 1904849 1872122 1845220 1824795 1811071 1804138 1804017 1810500 1823159 1841700
60152A841700K4507L0512L5615L8651L9330L8279L5930L1973K6203J9292J2183
$$ 1841700 1866207 1896719 1932334 1970985 2010315 2048594 2084524 2116497 2142700 2161992 2174175
60141B174175N064k338r746j6288k1405k5046k6964k6597k3957j9863j4943q906
$$ 2174175 2179239 2176901 2167155 2150867 2129462 2104416 2077452 2050855 2026898 2007035 1992092 1983186
60129A983186j361P129J5424K3124L0897L9495M8913N8668O8410P8050Q7599R7184
$$ 1983186 1981825 1988954 2004378 2027502 2058399 2097894 2146807 2205475 2273885 2351935 2439534 2536718
60117B536718J07175J17861J28882J39146J47465J53353J57041J58712J57878
$$ 2536718 2643893 2761754 2890636 3029782 3177247 3330600 3487641 3646353 3804231
60108C804231J53650J45570J33976J19509J02548Q3263O2024L9446J6082p704
$$ 3804231 3957881 4103451 4237427 4356936 4459484 4542747 4604771 4644217 4660299 4652595
60098D652595l1437n4332p5572r4601j11086j24616j34740j41137j43692j42435
$$ 4652595 4621158 4566826 4491254 4396653 4285567 4160951 4026211 3885074 3741382 3598947
60088C598947j37734j30440j21515j11378r9813q6712p2689n8769m5638l3302
$$ 3598947 3461213 3330773 3209258 3097880 2998067 2911355 2838666 2779897 2734259 2700957
60078B700957k1378r526K254J3531K3670L2230L9076M4060M6858M7274M5495M1776
$$ 2700957 2679579 2670053 2672307 2685838 2709508 2741738 2780814 2824874 2871732 2919006 2964501 3006277
60066C006277L6155K8714J9997J0702J071r043j9563k9994l9811m8756n6763o3870
$$ 3006277 3042432 3071146 3091143 3101845 3102916 3093873 3074310 3044316 3004505 2955749 2898986 2835116
60054B835116p0121p5248p8601p9749p9064p7278p4586p0729o5768o0167n4015
$$ 2835116 2764995 2689747 2611146 2531397 2452333 2375055 2300469 2229740 2163972 2103805 2049790
60043B049790m6915l8798l0213k1638j3064m540L650J1694K0409L0093L9766M8142
$$ 2049790 2002875 1964077 1933864 1912226 1899162 1894622 1898272 1909966 1930375 1960468 2000234 2048376
60031B048376N4909O0445O4782O7564O8644O7939O4964N9313N1390M2033L1567
$$ 2048376 2103285 2163730 2228512 2296076 2364720 2432659 2497623 2556936 2608326 2650359 2681926
60020B681926J9994P905l816j5190k6986l9114n0083n8517o4397o8336p0333o9979
$$ 2681926 2701920 2709825 2706009 2690819 2663833 2624719 2574636 2516119 2451722 2383386 2313053 2243074
60008B243074o7368o2988n7104m9923m2182l4744k7635k0103j1755l074N374J3614
$$ 2243074 2175706 2112718 2055614 2005691 1963509 1928765 1901130 1881027 1869272 1866198 1871572 1885186
59996A885186K1938L0346L8775M7418N6393O5197P3042P9621Q5129Q9459R1819
$$ 1885186 1907124 1937470 1976245 2023663 2080056 2145253 2218295 2297916 2383045 2472504 2564323
59985B564323R1310Q7560Q0679P0978N9028M5656L1531J6899J997j2563k6162
$$ 2564323 2655633 2743193 2823872 2894850 2953878 2999534 3031065 3047964 3049961 3037398 3011236
59974C011236l8711n0304o0547o8718p4420p7526p7594p4188o7901o0307n2551
$$ 3011236 2972525 2922221 2861674 2792956 2718536 2641010 2563416 2489228 2421327 2361020 2308469
59963B308469m4679l6527k8436k0575j2356l397N522J3354K0218K7058L4127M0717
$$ 2308469 2263790 2227263 2198827 2178252 2165896 2162499 2168021 2181375 2201593 2228651 2262778 2303495
59951B303495M6342N1138N4968N7143N7336N6124N4063N0836M5783L8988L1438
$$ 2303495 2349837 2400975 2455943 2513086 2570422 2626546 2680609 2731445 2777228 2816216 2847654
59940B847654K4227J7845J2114O739K050r94j728n90J512M527R378J6744K6391
$$ 2847654 2871881 2889726 2901840 2908579 2910629 2909635 2907907 2907317 2908829 2913356 2922734 2939478 2965869
59927B965869L7803N0694O4578P8532R2016J05405J19113J32517J44275J53462
$$ 2965869 3003672 3054366 3118944 3197476 3289492 3394897 3514010 3646527 3790802 3944264
59917C944264J59774J62828J61869J56196J45396J29130J07101P9540M7501J2761
$$ 3944264 4104038 4266866 4428735 4584931 4730327 4859457 4966558 5046098 5093599 5106360
59907E106360k2585n6567q7688j14842j36920j52803j62024j65175j63394j57569
$$ 5106360 5083775 5027208 4939520 4824678 4687758 4534955 4372931 4207756 4044362 3886793
59897C886793j48318j36435j22879j08451r3732p9200o5043n1079l7230k3899
$$ 3886793 3738475 3602040 3479161 3370710 3276978 3197778 3132735 3081656 3044426 3020527
59887C020527j1394P62J3240K5697L6866M6034N3750O0782O7016P1652P3936P3187
$$ 3020527 3009133 3009895 3023135 3048832 3085698 3131732 3185482 3246264 3313280 3384932 3458868 3532055
59875C532055O8711O0435M9315L6415K1832N166j3011l1039m7660o2889p7040
$$ 3532055 3600766 3661201 3710516 3746931 3768763 3773929 3760918 3729879 3682219 3619330 3542290
59864C542290q9560r9380j06058j09943j11381j10336j06812j01163r3905q5481
$$ 3542290 3452730 3353350 3247292 3137349 3025968 2915632 2808820 2707657 2613752 2528271
59854B528271p6400o7220n8333m9985m2573l6612l2258k9091k6610k4672k3153
$$ 2528271 2451871 2384651 2326318 2276333 2233760 2197148 2164890 2135799 2109189 2084517 2061364
59843B061364k1462j8844j5163j0940o673k586P40K167J052j578l575l540j795
$$ 2061364 2039902 2021058 2005895 1994955 1988282 1985696 1986436 1988603 1989655 1988077 1984502 1980962 1979167
59830A979167O10L227O014Q196Q238N204l15o913j3471j9250k3451k5564k6029
$$ 1979167 1979777 1983004 1989018 1997214 2005452 2010656 2010341 2003428 1989957 1970707 1947256 1921692 1895663
59817A895663k5835k5304k3905k1383j8448j5954j3971j2148j0475r030p321m664
$$ 1895663 1869828 1844524 1820619 1799236 1780788 1764834 1750863 1738715 1728240 1719210 1711889 1707225
59805A707225j220K072M715P216J0181J3306J5672J6754J6820J6442J5839J4652
$$ 1707225 1706005 1708077 1712792 1720008 1730189 1743495 1759167 1775921 1792741 1809183 1825022 1839674
59793A839674J2334Q853N066K180P28K36O7L26J791N056R967J5898K2405K9545
$$ 1839674 1852008 1860861 1865927 1868107 1868835 1869071 1869138 1869464 1871255 1876311 1886278 1902176 1924581 1954126
59779A954126L7604M6603N6221O6159P6493Q7451R9033J11017J23180J35256J46813
$$ 1954126 1991730 2038333 2094554 2160713 2237206 2324657 2423690 2534707 2657887 2793143 2939956
59768B939956J57334J65995J70742J67723J52674J23601Q2176L2712j9499o8802
$$ 2939956 3097290 3263285 3434027 3601750 3754424 3878025 3960201 3992913 3973414 3904612
59758C904612j09620j37968j53023j56816j52364j42291j28715j13483r7963q2977
$$ 3904612 3794992 3657024 3504001 3347185 3194821 3052530 2923815 2810332 2712369 2629392
59748B629392o9016n6304m4672l3832k3907j5287p837p08O774J4405K1562K8107
$$ 2629392 2560376 2504072 2459400 2425568 2401661 2386374 2378537 2377829 2384603 2399008 2420570 2448677
59736B448677L4468M0992M7649N4310O1043O8154P6096Q5164R5100J05187J15099
$$ 2448677 2483145 2524137 2571786 2626096 2687139 2755293 2831389 2916553 3011653 3116840 3231939
59725C231939J25621J38084J53002J69617J86863K04326K22057K39835K57090
$$ 3231939 3357560 3495644 3648646 3818263 4005126 4209452 4431509 4671344 4928434
59716D928434K73367K88320L01179L10594L15243L14363L07661K95100K77237
$$ 4928434 5201801 5490121 5791300 6101894 6417137 6731500 7039161 7334261 7611498
59707G611498K55682K32888K11260J92443J77204J65605J57179J51175J46848
$$ 7611498 7867180 8100068 8311328 8503771 8680975 8846580 9003759 9154934 9301782
59698I301782J43346J39389J33382J24248J12023R7350Q0519O1463M0715J9795
$$ 9301782 9445128 9584517 9717899 9842147 9954170 10051520 10132039 10193502 10234217 10254012
59688A0254012K90j7155l2447m4895n3019n5665n2912m5685l4693j9944j116K1795
$$ 10254012 10254302 10237147 10204700 10159805 10106786 10051121 9998209 9952524 9917831 9897887 9896771 9918566
59676I918566M8056P6331J05339J34534J63971J93432K21987K48530K72343K92698
$$ 9918566 9966622 10042953 10148292 10282826 10446797 10640229 10862216 11110746 11383089 11675787
59666A1675787L08174L16933L17468L08627K88996K57006K11890J54227Q5586
$$ 11675787 11983961 12300894 12618362 12926989 13215985 13472991 13684881 13839108 13924694
59657A3924694Q345p3898j56405k34356l03765l61390m04641m32328m45209m45114
$$ 13924694 13933039 13859141 13702736 13468380 13164615 12803225 12398584 11966256 11521047 11075933
59647A1075933m33743m12764l84772l53244l21568k92898k70960k59900k62391
$$ 11075933 10642190 10229426 9844654 9491410 9169842 8876944 8605984 8346084 8083693
59638H083693k77782l02125l29600l53982l69983l74689l68302l53258l32389
$$ 8083693 7805911 7503786 7174186 6820204 6450221 6075532 5707230 5353972 5021583
59629E021583l07880k81458k54801k29315k05740j84214j64670j46963j30803
$$ 5021583 4713703 4432245 4177444 3948129 3742389 3558175 3393505 3246542 3115739
59620C115739j15850j02097q9921p9582p0758o2839n5558m9090m3533l8654l4297
$$ 3115739 2999889 2897792 2807871 2728289 2657531 2594692 2539134 2490044 2446511 2407857 2373560
59609B373560l0634k7760k5319k2886k0594j9006j8456j8837j9876k1316k2892
$$ 2373560 2342926 2315166 2289847 2266961 2246367 2227361 2208905 2190068 2170192 2148876 2125984
59598B125984k4435k5919k7201k7899k7848k7442k7083k6508k5213k3356k1546
$$ 2125984 2101549 2075630 2048429 2020530 1992682 1965240 1938157 1911649 1886436 1863080 1841534
59587A841534j9853j7836j5616j3979j3073j1909r835p703o780o940o830n648
$$ 1841534 1821681 1803845 1788229 1774250 1761177 1749268 1739433 1731730 1724950 1718010 1711180 1705532
59575A705532l934k547j552l14J651M136O424Q025R385J1545J4839J8314K0893
$$ 1705532 1701598 1699051 1697499 1697185 1698836 1702972 1709396 1717421 1726806 1738351 1753190 1771504 1792397
59562A792397K2802K5159K8410L1964L5368L8959M3053M7251N1094N4914N9441
$$ 1792397 1815199 1840358 1868768 1900732 1936100 1975059 2018112 2065363 2116457 2171371 2230812
59551B230812O4845P0602P6165Q1341Q6137R0648R5098R9588J03824J07344J10047
$$ 2230812 2295657 2366259 2442424 2523765 2609902 2700550 2795648 2895236 2999060 3106404 3216451
59540C216451J12009J12524J09643J01267Q7040O9085N0753L4545K1137R967L08
$$ 3216451 3328460 3440984 3550627 3651894 3738934 3808019 3858772 3893317 3914454 3924421 3924729
59529C924729q379j6619k4894l3315m1515m8999n5480o0868o5025o7582o8031
$$ 3924729 3916350 3899731 3874837 3841522 3800007 3751008 3695528 3634660 3569635 3502053 3434022
59518C434022o6124o2188n6800n0017m1220l0095j7501m697Q192K2314L8361N5378
$$ 3434022 3367898 3305710 3248910 3198893 3157673 3127578 3110077 3105380 3113572 3135886 3174247 3229625
59506C229625P1732Q6818J01158J14979J27403J36980J42424J42697J36907J24630
$$ 3229625 3301357 3388175 3489333 3604312 3731715 3868695 4011119 4153816 4290723 4415353
59496D415353J06150Q2186N3616K1642j2005m5327p6539j04256j27484j45612
$$ 4415353 4521503 4603689 4657305 4678947 4666942 4621615 4545076 4440820 4313336 4167724
59486D167724j58285j65139j65869j60816j51249j38778j24563j09365r3973p9017
$$ 4167724 4009439 3844300 3678431 3517615 3366366 3227588 3103025 2993660 2899687 2820670
59476B820670o4365m9356l3854j8649m590Q256K0288L1624M2003N1148N8792O4538
$$ 2820670 2756305 2706949 2673095 2654446 2649856 2658112 2678400 2710024 2752027 2803175 2861967 2926505
59464B926505O8121O9734O9738O8026O3964N6939M6801L3923J9063L056j3689
$$ 2926505 2994626 3064360 3134098 3202124 3266088 3323027 3369828 3403751 3422814 3425870 3412181
59453C412181l1146m8858o5380p9133q9764r8048j04500j08744j10395j09867
$$ 3412181 3381035 3332177 3266797 3187664 3097900 2999852 2895352 2786608 2676213 2566346
59443B566346j07807j04370r9601r4052q8350q2385p5693o8615o2307n7368n2987
$$ 2566346 2458539 2354169 2254568 2160516 2072166 1989781 1914088 1845473 1783166 1725798 1672811
59432A672811m7903m1862l5710l0267k5595k1416j7686j4474j1506q350m937j524
$$ 1672811 1624908 1583046 1547336 1517069 1491474 1470058 1452372 1437898 1426392 1418042 1413105 1411581
59420A411581J854N408Q963J1924J4270J6921K0296K2884K2279J7819J1453N841
$$ 1411581 1413435 1418843 1427806 1439730 1454000 1470921 1491217 1514101 1536380 1554199 1565652 1571493
59408A571493K304R21J594M206Q242J3058J8244K3140K6367K6647K4049J9859
$$ 1571493 1573797 1574718 1576312 1580518 1588760 1601818 1620062 1643202 1669569 1696216 1720265 1740124
59396A740124J5461J1984J0724J2748J7625K3368K8200L1958L5483L9193M2801
$$ 1740124 1755585 1767569 1778293 1791041 1808666 1832034 1860234 1892192 1927675 1966868 2009669
59385B009669M6047M9042N1991N4983N8124O1427O4633O7438O9966P2706P5931
$$ 2009669 2055716 2104758 2156749 2211732 2269856 2331283 2395916 2463354 2533320 2606026 2681957
59374B681957P9460Q3115Q7165R2126R8199J05231J13184J22454J33513J46419
$$ 2681957 2761417 2844532 2931697 3023823 3122022 3227253 3340437 3462891 3596404 3742823
59364C742823J60893J76831J94380K13240K32190K49659K64793K77493K87315
$$ 3742823 3903716 4080547 4274927 4488167 4720357 4970016 5234809 5512302 5799617
59355E799617K92740K91941K84277K70770K53167K32831K10477J86662J62111
$$ 5799617 6092357 6384298 6668575 6939345 7192512 7425343 7635820 7822482 7984593
59346G984593J37544J13268Q8987O3937L7235Q199k3504n7883r4678j33332j72892
$$ 7984593 8122137 8235405 8324392 8388329 8425564 8433763 8410259 8352376 8257698 8124366 7951474
59335G951474k11862k48200k79614l04181l20869l29501l30301l23772l11079
$$ 7951474 7739612 7491412 7211798 6907617 6586748 6257247 5926946 5603174 5292095
59326E292095k94191k75163k55295k35226k15652j97383j80732j65428j51449
$$ 5292095 4997904 4722741 4467446 4232220 4016568 3819185 3638453 3473025 3321576
59317C321576j39354j29369j20603j11837j02845r4344q6801p9982p3631o7872
$$ 3321576 3182222 3052853 2932250 2820413 2717568 2623224 2536423 2456441 2382810 2314938
59307B314938o2760n7969n3207m8503m3885l9228l4594l0330k6490k2631j8451
$$ 2314938 2252178 2194209 2141002 2092499 2048614 2009386 1974792 1944462 1917972 1895341 1876890
59296A876890j4194j0100n868j144L786Q242J1702J3620J3044R402L785j263l621
$$ 1876890 1862696 1852596 1846728 1845584 1849370 1857612 1869314 1882934 1895978 1905380 1909165 1907902 1904281
59283A904281l003l77L475Q396J4190K0253K6021L1448L6666M1267M4378M5569
$$ 1904281 1901278 1900901 1904376 1912772 1926962 1947215 1973236 2004684 2041350 2082617 2126995 2172564
59271B172564M5351M4460M2855L9818L4934K8439K0662J1670J771q231j7587k6109
$$ 2172564 2217915 2262375 2305230 2345048 2379982 2408421 2429083 2440753 2442524 2434293 2416706 2390597
59259B390597l3762m0174m4939m8107m9940n0453m9637m7877m5584m2606l8600
$$ 2390597 2356835 2316661 2271722 2223615 2173675 2123222 2073585 2025708 1980124 1937518 1898918
59248A898918l3937k9540k5706k1758j7105j2162p814m389j582Q87L086N348Q250
$$ 1898918 1864981 1835441 1809735 1787977 1770872 1758710 1750896 1746507 1744925 1745812 1748898 1754246 1762496
59235A762496J1816J5139J7321J8693K0439K2897K4956K5642K5696K6734K9133
$$ 1762496 1774312 1789451 1806772 1825465 1845904 1868801 1893757 1919399 1945095 1971829 2000962
59224B000962L1794L3965L6211L9125M2253M5016M7954N2102N7589O3752P0280
$$ 2000962 2032756 2066721 2102932 2142057 2184310 2229326 2277280 2329382 2386971 2450723 2521003
59213B521003P7382Q5109R3388J02609J13318J25327J37818J50240J62286J73030
$$ 2521003 2598385 2683494 2776882 2879491 2992809 3118136 3255954 3406194 3568480 3741510
59203C741510J81015J85242J85294J80352J69094J50969J26650R6893O1879K2436
$$ 3741510 3922525 4107767 4293061 4473413 4642507 4793476 4920126 5017019 5078898 5101334
59193E101334j8898n9005r6023j29373j58254j81098j96552k04368k05222k00223
$$ 5101334 5082436 5023431 4927408 4798035 4639781 4458683 4262131 4057763 3852541 3652318
59183C652318j90736j78254j64044j49010j33849j19152j05272r2305q0343o9645
$$ 3652318 3461582 3283328 3119284 2970274 2836425 2717273 2612001 2519696 2439353 2369708
59173B369708o0510n3005m6839m1534l6769l2634k9437k7246k5669k4222k2905
$$ 2369708 2309198 2256193 2209354 2167820 2131051 2098417 2068980 2041734 2016065 1991843 1968938
59162A968938k2365k3405k6223l0112l3974l7194l9883m2315m4352m5613m5893
$$ 1968938 1946573 1923168 1896945 1866833 1832859 1795665 1755782 1713467 1669115 1623502 1577609
59151A577609m5179m3524m1249l9106l7618l6278l3930l0159k5970k2807k1128
$$ 1577609 1532430 1488906 1447657 1408551 1370933 1334655 1300725 1270566 1244596 1221789 1200661
59140A200661k0075j8422j5690j2485r816q085o799n316l637k150q30Q33L148
$$ 1200661 1180586 1162164 1146474 1133989 1124173 1116088 1109289 1103973 1100336 1098186 1097356 1098189 1101337
59127A101337N832Q380J0425J1793J2552J3208J4406J6262J8187J9542K0253K0853
$$ 1101337 1107169 1115549 1125974 1137767 1150319 1163527 1177933 1194195 1212382 1231924 1252177 1273030
59115A273030K2058K4209K6801K8703K9265K9070K9087K9226K8548K6769K4697
$$ 1273030 1295088 1319297 1346098 1374801 1404066 1433136 1462223 1491449 1519997 1546766 1571463
59104A571463K2885K0873J8345J6129J5214J5377J5722J6252J7880K0903K4346
$$ 1571463 1594348 1615221 1633566 1649695 1664909 1680286 1696008 1712260 1730140 1751043 1775389
59093A775389K7091K9040L0841L2926L5127L6977L8182L8797L9050L8952L8190
$$ 1775389 1802480 1831520 1862361 1895287 1930414 1967391 2005573 2044370 2083420 2122372 2160562
59082B160562L6494L3952L0750K6836K2110J6792J1078M525l626j3386k3630l3109
$$ 2160562 2197056 2231008 2261758 2288594 2310704 2327496 2338574 2343099 2339473 2326087 2302457 2269348
59070B269348m1444m8864n5254n9986o2644o3537o3295o2275o0569n8411n6197
$$ 2269348 2227904 2179040 2123786 2063800 2001156 1937619 1874324 1812049 1751480 1693069 1636872
59059A636872n4042n1559m8299m4308m0146l6273l2626k8826k4764k0832j7540
$$ 1636872 1582830 1531271 1482972 1438664 1398518 1362245 1329619 1300793 1276029 1255197 1237657
59048A237657j5031j3120j1701j0823j0223r148p033m234j715kJ201K432L955
$$ 1237657 1222626 1209506 1197805 1186982 1176759 1167611 1160578 1156344 1154629 1154627 1155828 1158260 1162215
59035A162215N841Q021J0094J1583J2547J3379J3779J2689R777O290L717K127
$$ 1162215 1168056 1176077 1186171 1197754 1210301 1223680 1237459 1250148 1259925 1266215 1269932 1272059
59023A272059O58p68j344q65k45l13r14j475j780j802j393n30M11R79J053Q61
$$ 1272059 1272717 1271949 1270605 1269740 1269495 1269182 1268268 1266793 1265013 1263211 1261818 1261288 1261699 1262678 1263731 1264592
59007A264592Q05J246K141K958L205K888K125O70j569l853n230n724o076o509
$$ 1264592 1265397 1266643 1268784 1271742 1274947 1277835 1279960 1280630 1279061 1275208 1269978 1264254 1258178 1251669
58993A251669o610o383o281o045m659k016N10J702J865J856J571L70j579l380
$$ 1251669 1245059 1238676 1232395 1226350 1221691 1219675 1220185 1221887 1223752 1225608 1227179 1227549 1225970 1222590
58979A222590m623n711p068q593r880j0545j0359r360p833o081m349k914j860
$$ 1222590 1217967 1212256 1205188 1196595 1186715 1176170 1165811 1156451 1148618 1142537 1138188 1135274 1133414
58966A133414q31N40J920K569K452K353K771L432M067M823N559N659N085M838
$$ 1133414 1132583 1133123 1135043 1137612 1140064 1142417 1145188 1148620 1152687 1157510 1163069 1168728 1173813 1178651
58952A178651N697P159Q311R074R940J1028J2127J3150J3904J3957J3409J3232
$$ 1178651 1184348 1191507 1199818 1208892 1218832 1229860 1241987 1255137 1269041 1282998 1296407 1309639
58940A309639J4081J5239J5529J4811J3838J3131J2895J3551J5363J7777K0015
$$ 1309639 1323720 1338959 1354488 1369299 1383137 1396268 1409163 1422714 1438077 1455854 1475869
58929A475869K2099K4497K7068K9293L1291L3627L6339L9034M1878M5431M9493
$$ 1475869 1497968 1522465 1549533 1578826 1610117 1643744 1680083 1719117 1760995 1806426 1855919
58918A855919N3125N5862N8089O0091O1690O3009O4764O7483P1018P5173Q0140
$$ 1855919 1909044 1964906 2022995 2083086 2144776 2207785 2272549 2340032 2411050 2486223 2566363
58907B566363Q6049R2576R9305J06050J12690J19035J25104J31177J37467J43981
$$ 2566363 2652412 2744988 2844293 2950343 3063033 3182068 3307172 3438349 3575816 3719797
58897C719797J50737J57800J65110J72461J79642J86357J92240J97174K01199
$$ 3719797 3870534 4028334 4193444 4365905 4545547 4731904 4924144 5121318 5322517
58888E322517K03623K02777J97255J87222J73690J56802J35721J10133Q1098N0229
$$ 5322517 5526140 5728917 5926172 6113394 6287084 6443886 6579607 6689740 6770838 6821067
58878F821067J8684j2850m3777p3421j00902j25262j46114j64004j79568j92462
$$ 6821067 6839751 6826901 6783124 6709703 6608801 6483539 6337425 6173421 5993853 5801391
58868E801391k01730k07119k09340k09034k06212k00886j93705j85720j77832
$$ 5801391 5599661 5392542 5183202 4974168 4767956 4567070 4373365 4187645 4009813
58859D009813j70411j63178j55526j47312j39112j31347j23665j15670j07786
$$ 4009813 3839402 3676224 3520698 3373386 3234274 3102927 2979262 2863592 2755806
58850B755806j00615r3948q7301q0953p5419p0189o4264n7765n1821m6823m2065
$$ 2755806 2655191 2561243 2473942 2392989 2317570 2247381 2183117 2125352 2073531 2026708 1984643
58839A984643l7177l2583k8328k3742j8775j4436j1361q979o619m442k582l95
$$ 1984643 1947466 1914883 1886555 1862813 1844038 1829602 1818241 1809262 1802643 1798201 1795619 1795224
58827A795224K591N820Q569J1051J3941J7346K0954K4741K8817L3012L7068M0909
$$ 1795224 1797815 1803635 1812204 1823255 1837196 1854542 1875496 1900237 1929054 1962066 1999134 2040043
58815B040043M4394M7298M9854N2738N6134N9547O2896O6944P2115P7755Q3306
$$ 2040043 2084437 2131735 2181589 2234327 2290461 2350008 2412904 2479848 2551963 2629718 2713024
58804B713024Q9342R6513J04246J11660J19225J28204J38631J49082J58570J67608
$$ 2713024 2802366 2898879 3003125 3114785 3234010 3362214 3500845 3649927 3808497 3976105
58794C976105J77019J86550J95131K01990K07035K10365K11678K10056K04317
$$ 3976105 4153124 4339674 4534805 4736795 4943830 5154195 5365873 5575929 5780246
58785E780246J93685J78175J58313J34587J07332P6883M3690Q436k7708o3271
$$ 5780246 5973931 6152106 6310419 6445006 6552338 6629221 6672911 6681347 6653639 6590368
58775F590368r7067j28458j56839j81180k00458k14318k23087k27337k27748k25137
$$ 6590368 6493301 6364843 6208004 6026824 5826366 5612048 5388961 5161624 4933876 4708739
58765D708739k20201k13315k04771j95118j84937j74473j63733j52903j42406
$$ 4708739 4488538 4275223 4070452 3875334 3690397 3515924 3352191 3199288 3056882
58756C056882j32622j23719j15646j08102j00699r3292q6088p9297p2782o6224
$$ 3056882 2924260 2800541 2684895 2576793 2476094 2382802 2296714 2217417 2144635 2078411
58746B078411n9516n2886m6742m1410l6904l2792k8484k3761j9016j4968j2180
$$ 2078411 2018895 1966009 1919267 1877857 1840953 1808161 1779677 1755916 1736900 1721932 1709752
58735A709752j0754j0318j0370j0803j1873j3539j5041j5558j5004j3865j2429
$$ 1709752 1698998 1688680 1678310 1667507 1655634 1642095 1627054 1611496 1596492 1582627 1570198
58724A570198j0713q931p444o414o081p162j0258j4956k0298k6004l2290l8505
$$ 1570198 1559485 1550554 1543110 1536696 1530615 1523453 1513195 1498239 1477941 1451937 1419647 1381142
58712A381142m3058m5151m5596m5520m5098m4067m2602m0949l8811l5874l2443
$$ 1381142 1338084 1292933 1247337 1201817 1156719 1112652 1070050 1029101 990290 954416 921973
58701I21973k8977k5370k1366j7289j3763j0968q691o837n338l862k215q59m98
$$ 921973 892996 867626 846260 828971 815208 804240 795549 788712 783374 779512 777297 776438 775940
58688G75940j262k719m481o373q070r128r396r111q536p707o602n300l886k277
$$ 775940 774678 771959 767478 761105 753035 743907 734511 725400 716864 709157 702555 697255 693369 691092
58674F91092k75K041M088N246N663O142P031P734P823P941Q748R486Q742O484
$$ 691092 690817 692858 696946 702192 707855 713997 721028 728762 736585 744526 753274 762760 771502 777986
58660G77986M045K080k56l714p703j1155j3654j5162j5508j4833j3834j2993j2178
$$ 777986 782031 784111 783855 780141 772438 761283 747629 732467 716959 702126 688292 675299 663121
58647F63121j1360j0971j0942j0317q447n927l647j688J56J472J804J634J898
$$ 663121 651761 640790 629848 619531 611084 605157 601510 599822 599978 601450 603254 604888 606786
58634F06786K811L890M823N626O141O081N501M831M536M913N835O591O455N743
$$ 606786 609597 613487 618310 623936 630077 636158 641659 646490 651026 655939 661774 668365 674820 680563
58620F80563N686O950Q890J0601J1944J3131J4015J4511J5073J6169J7729J9561
$$ 680563 686249 693199 702089 712690 724634 737765 751780 766291 781364 797533 815262 834823
58608H34823K1690K3910K5703K7156K9188L2332L6032L9635M3212M6798M9848
$$ 834823 856513 880423 906126 933282 962470 994802 1030834 1070469 1113681 1160479 1210327
58597A210327N2207N4701N7847O0847O2822O4093O5100O4972O2526N8001N2447
$$ 1210327 1262534 1317235 1375082 1435929 1498751 1562844 1627944 1692916 1755442 1813443 1865890
58586A865890M5925L7730K8024J7733P107m198j5553k5266l2285l6971m0047m1704
$$ 1865890 1911815 1949545 1977569 1995302 2002409 1998211 1982658 1957392 1925107 1888136 1848089 1806385
58574A806385m1985m1153l9439l6964l4010l0908k7762k4703k2067j9830j7348
$$ 1806385 1764400 1723247 1683808 1646844 1612834 1581926 1554164 1529461 1507394 1487564 1470216
58563A470216j4327j1558r912r126q507q288r238j1311j3916j7198k1826k7517
$$ 1470216 1455889 1444331 1434419 1425293 1416786 1408498 1399260 1387949 1374033 1356835 1335009 1307492
58551A307492l2918l6999l9643m0894m0617l9067l6942l4703l2444l0309k8416
$$ 1307492 1274574 1237575 1197932 1157038 1116421 1077354 1040412 1005709 973265 942956 914540
58540I14540k6557k4600k2892k1615k0179j8156j6259j5338j4880j3776j2221
$$ 914540 887983 863383 840491 818876 798697 780541 764282 748944 734064 720288 708067
58529G08067j1397j1394j0953r429p703o750o511o501o490o154n079l557k605
$$ 708067 696670 685276 674323 664894 657191 650441 643930 637429 630939 624785 619706 616149 613544
58516F13544k725l299l481l081k387j721j350j284j052k53P48J267J449K194L846
$$ 613544 610819 607520 604039 600958 598571 596850 595500 594216 593164 592911 593659 594926 596375 598569 602415
58501F02415N698O881P239P280P684Q824J0297J1183J1189J1167J1941J3083J3618
$$ 602415 608113 614994 622233 629513 637197 646021 656318 667501 678690 689857 701798 714881 728499
58488G28499J3458J3235J3165J2978J2628J2098J0866Q580N927L771J840o73l576
$$ 728499 741957 755192 768357 781335 793963 806061 816927 825507 831434 835205 837045 836372 832796
58475H32796n928p531q978j0484j1883j3374j5034j5908j5110j3483j2684j2790
$$ 832796 826868 819337 810359 799875 787992 774618 759584 743676 728566 715083 702399 689609
58463F89609j2487j1424j0626j0435r939q733p575o837n969m914m473m634m186
$$ 689609 677122 665698 655072 644637 634698 625965 618390 611553 605584 600670 596197 591563 587377
58450E87377k694j351j083j135m97N39J209J639K398L486M574N613O563P179P579
$$ 587377 584683 583332 582249 581114 580617 581156 582365 584004 586402 589888 594462 600075 606638 613817 621396
58435F21396Q353R635J0805J1442J1891J2468J2851J2579J1573R938P952O266
$$ 621396 629749 639384 650189 661631 673522 685990 698841 711420 722993 732931 740883 747149
58423G47149N376M851M032L368M023O098Q256R243Q666O416K610j709n004o660
$$ 747149 752525 757376 761408 764776 768799 774897 783153 792396 801062 807478 810088 808379 803375 796715
58409G96715o998o079l780q88J399L170N385P711Q591P705O530N934M997K961
$$ 796715 789717 783638 779858 778970 780369 783539 788924 796635 805226 812931 819461 825395 830392 833353
58395H33353N84j226k634l887m530m454m347m337l540j732j01M95P37J472K421
$$ 833353 833937 832711 830077 826190 821660 817206 812859 808522 804982 803250 803149 803644 804381 805853 808274
58380H08274L029L379L521L053K086J419J145M20q28j434q14J90J004K145L621
$$ 808274 811303 814682 818203 821256 823342 824761 825906 826326 825498 824064 823250 823440 824444 826589 830210
58365H30210M240L584L027L622M562M905N255O332P366P484P480Q575J0394J1599
$$ 830210 834450 838034 841061 844683 849245 854150 859405 865737 873103 880587 888067 896642 907036 918635
58351I18635J1820J1683J1644J1863J2545J3471J3919J3774J3800J4144J3741
$$ 918635 930455 942138 953782 965645 978190 991661 1005580 1019354 1033154 1047298 1061039
58340A061039J1941R598P754O421N420N136N526N684N297N308O267P372Q002Q777
$$ 1061039 1072980 1082578 1090332 1096753 1102173 1107309 1112835 1118519 1123816 1129124 1135391 1142763 1150765 1159542
58326A159542J0180J1540J2371J3268J4519J5346J5555J6297J8030J9398J9441
$$ 1159542 1169722 1181262 1193633 1206901 1221420 1236766 1252321 1268618 1286648 1306046 1325487
58315A325487J9337K0496K2375K3594K3915K3721K2854K1379K0195J9635J8701
$$ 1325487 1344824 1365320 1387695 1411289 1435204 1458925 1481779 1503158 1523353 1542988 1561689
58304A561689J6861J5213J4686J4581J4120J3899J4549J5494J6273J7514J9396
$$ 1561689 1578550 1593763 1608449 1623030 1637150 1651049 1665598 1681092 1697365 1714879 1734275
58293A734275K0869K1613K2919K5324K7428K8468K9903L2700L5307L6335L7179
$$ 1734275 1755144 1776757 1799676 1825000 1852428 1880896 1910799 1943499 1978806 2015141 2052320
58282B052320L9692M3094M5575M7398N0006N3430N6725N9793O2744O4731O5279
$$ 2052320 2092012 2135106 2180681 2228079 2278085 2331515 2388240 2448033 2510777 2575508 2640787
58271B640787O5598O6756O7911O7891O7047O5938O3950O0773N7564N5028N2292
$$ 2640787 2706385 2773141 2841052 2908943 2975990 3041928 3105878 3166651 3224215 3279243 3331535
58260C331535M9216M7658M8796N1379N4329N8556O4407P0077P4697Q0166Q7697
$$ 3331535 3380751 3428409 3477205 3528584 3582913 3641469 3705876 3775953 3850650 3930816 4018513
58249D018513R5379J01572J07732J15248J22568J28345J34448J42781J52015J60540
$$ 4018513 4113892 4215464 4323196 4438444 4561012 4689357 4823805 4966586 5118601 5279141
58239E279141J69595J80361J91059K00266K10006K22249K35641K49000K64370
$$ 5279141 5448736 5629097 5820156 6020422 6230428 6452677 6688318 6937318 7201688
58230G201688K83003L02217L20308L40524L65853L93939M21799M51378M85538
$$ 7201688 7484691 7786908 8107216 8447740 8813593 9207532 9629331 10080709 10566247
58221A0566247N22896N61866O05417O56357P12532P72436Q40700R21907J014258
$$ 10566247 11089143 11651009 12256426 12912783 13625315 14397751 15238451 16160358 17174616
58212A7174616J116031J232806J371157J531251J713887J928907K188104K496556
$$ 17174616 18290647 19523453 20894610 22425861 24139748 26068655 28256759 30753315
58204C0753315K860830L299070L832305M471912N224866O100733P099545Q204005
$$ 30753315 33614145 36913215 40745520 45217432 50442298 56543031 63642576 71846581
58196G1846581R403063J0717981J2190905J3860112J5765326J7958308K0470613
$$ 71846581 81249644 91967625 104158530 118018642 133783968 151742276 172212889
58189A72212889K3264058K6201486K8969402L0893348L0835434K7510951K0237612
$$ 172212889 195476947 221678433 250647835 281541183 312376617 339887568 360125180
58182C60125180R598075k581617j3988364k2770928k8082535l0035272k9305786
$$ 360125180 369723255 367141638 353153274 330382346 302299811 272264539 242958753
58175B42958753k6752897k3245131j9630508j6645904j4700072j3716013j3244674
$$ 242958753 216205856 192960725 173330217 156684313 141984241 128268228 115023554
58168A15023554j2792559j2084412j1089808r904287q650637p439706o346235
$$ 115023554 102230995 90146583 79056775 69152488 60501851 53062145 46715910
58161D6715910n395068m579745l891621l322802k854695k463771k136069j864234
$$ 46715910 41320842 36741097 32849476 29526674 26671979 24208208 22072139 20207905
58153B0207905j635931j437681j265855j122443j003313r00419q11718p39010
$$ 20207905 18571974 17134293 15868438 14745995 13742682 12842263 12030545 11291535
58145A1291535o78972o25267n76717n35093m97530m59179m20975l87226l57590
$$ 11291535 10612563 9987296 9410579 8875486 8377956 7918777 7497802 7110576 6752986
58136F752986l28486l00146k75391k53427k31691k12095j98880j91565j85957
$$ 6752986 6424500 6124354 5848963 5595536 5363845 5151750 4952870 4761305 4575348
58127D575348j80560j76287j71463j63256j53005j44487j37744j29923j21097
$$ 4575348 4394788 4218501 4047038 3883782 3730777 3586290 3448546 3318623 3197526
58118C197526j13936j08405j02082r5125q9961q6421q1944p6338p1853o8776o5320
$$ 3197526 3083590 2975185 2873103 2777978 2688017 2601596 2519652 2443314 2371461 2302685 2237365
58107B237365o1607n9525n8691n6706n3432n1188n0563m9746m8040m6462m4731
$$ 2237365 2175758 2116233 2057542 2000836 1947404 1896216 1845653 1795907 1747867 1701405 1656674
58096A656674m1145l5734l0401k5728k0601j5198j1409j0049j0307j1960j5557
$$ 1656674 1615529 1579795 1549394 1523666 1503065 1487867 1476458 1466409 1456102 1444142 1428585
58085A428585k0410k4953k8992l3185l6633l7619l6558l5546l5084l3846l1561
$$ 1428585 1408175 1383222 1354230 1321045 1284412 1246793 1210235 1174689 1139605 1105759 1074198
58074A074198k9469k7951k6088k3785k1895k0359j8374j6392j5578j5448j4411
$$ 1074198 1044729 1016778 990690 966905 945010 924651 906277 889885 874307 858859 844448
58063H44448j2546j1451j1383j1015j0103r924j0745j1207j0703j0240j0497j0951
$$ 844448 831902 820451 809068 798053 787950 778026 767281 756074 745371 735131 724634 713683
58051G13683j1303j1969j2687j2439j1107r752q959q351p757p399p008o130n297
$$ 713683 702380 690411 677724 665285 654178 644426 635467 627116 619359 611960 604952 598822 593525
58038E93525n340n815n660m983m572m105k756j311j484l193m623m992n279n996
$$ 593525 588185 582370 576710 571727 567155 563050 560294 558983 557499 554306 549683 544691 539412 533416
58024E33416o344n937n500n363m921m006l309l025k542j730j140p97j41O95R65
$$ 533416 527072 521135 515635 510272 505351 501345 498036 495011 492469 490739 489599 488802 488661 489356 490321
58009D90321P32P96J275J701K403M039N861O249N314N054O578Q723J0023J0420
$$ 490321 491053 491849 493124 494825 497228 501267 507128 513377 518691 523745 530323 539046 549069 559489
57995E59489J0484J0308R821R116Q012O256M377L263K879K498K126K440L383M158
$$ 559489 569973 580281 590102 599218 607230 613486 617863 621126 624005 626503 628629 631069 634452 638610
57981F38610M679N495O331O184N066M156M043M202M305M463M089K173r67l867
$$ 638610 643289 648784 655115 661299 666365 670521 674564 678766 683071 687534 691623 693796 692829 688962
57967F88962o137q870j2403j5441j6998j7659j8126j8063j7162j6010j4997j3493
$$ 688962 682825 673955 661552 646111 629113 611454 593328 575265 558103 542093 527096 513603
57955E13603j0978q020n427l332j646m57N72K251M762P305R245J0698J1784J2340
$$ 513603 502625 494605 489178 485846 484200 483743 484315 486566 491328 498633 507878 518576 530360 542700
57941E42700J2603J3092J3540J3108J1840J0692R761P983M969J710j078l845o788
$$ 542700 555303 568395 581935 595043 606883 617575 627336 635319 640288 641998 640920 637075 630287
57928F30287r054j0201j1058j2141j2556j1560j0018r036q203o583m617l599l807
$$ 630287 621233 611032 599974 587833 575277 563717 553699 544663 536460 529877 525260 521661 517854
57915E17854m408m983n958p595r457j0979j1890j2145j1794j0973r738q158o620
$$ 517854 513446 508463 502505 494910 485453 474474 462584 450439 438645 427672 417934 409776 403156
57902D03156n615n062m361l252k053r17M44K008L147L473L291K930K247J167K8
$$ 403156 397541 392479 388118 384866 382813 381896 382340 384348 387495 390968 394259 397189 399436 400603 400631
57887D00631r66k064l375m565n441o219o858o891o206n350m689l899k702j487
$$ 400631 399665 397601 394226 389661 384220 378001 371143 364252 358046 352696 348007 344108 341406 339919
57873C39919p16k53M10J659L655O139Q253R264R573J0238J1400J2076J1727J0943
$$ 339919 339203 338950 339360 341019 344674 350813 359066 368330 377903 388141 399541 411617 423344 434287
57859D34287J0246R253P578N657L942K157k8k266m130n764p314q395q748q796
$$ 434287 444533 453786 461364 467021 470963 473120 473092 470826 466696 460932 453618 445223 436475 427679
57845D27679q900q712p898o897o241n670m707l665l212l228k885j758k45J088
$$ 427679 418779 410067 402169 395272 389031 383361 378654 374989 371777 368549 365664 363906 363661 364749
57831C64749K059K722L053K908K247J380Q42Q33Q70L73o43j781k937m154n036
$$ 364749 366808 369530 372583 375491 377738 379118 379960 380793 381663 382036 381393 379612 376675 372521 367485
57816C67485n065m401l642k917j961r19j21P73K305L921M365L534K703K668K940
$$ 367485 362420 358019 354377 351460 349499 348580 348459 349232 351537 355458 359823 363357 366060 368728 371668
57801C71668L122L710M985O297P235Q314R778J0868J1059J0975J1116J0723R011
$$ 371668 374790 378500 383485 389782 397017 405331 415109 425977 437036 448011 459127 469850 478861
57788D78861O580M546K962J280l03j129j278j424j816k348l323n176p601r852
$$ 478861 485441 489987 492949 494229 493926 492797 491519 490095 488279 485931 482608 477432 469831 459979
57774D59979j1705j3478j5179j6385j6855j6716j6146j5383j4739j4227j3385
$$ 459979 448274 434796 419617 403232 386377 369661 353515 338132 323393 309166 295781
57763B95781j1932j0246q859p833p022o457n975n032l435j856j035q19n11J18
$$ 295781 283849 273603 264744 256911 249889 243432 237457 232425 228990 227134 226099 225280 224769 224887
57749B24887P30J017R55O80M61O01J097J708K395L222L789L551K830K638L230
$$ 224887 225617 226634 227589 228269 228730 229331 230428 232136 234531 237753 241542 245093 247923 250561 253791
57734B53791L733L539L070K710K080J095O01J050J499R31k16r58j319j834k140
$$ 253791 257524 261063 264133 266843 268923 270018 270619 271669 273168 274099 273883 272925 271606 269772 267632
57719B67632j490k46M17K50J95Q92J849K274J947J208N99O14J328K329L178L731
$$ 267632 266142 265896 266313 266563 266758 267650 269499 271773 273720 274928 275527 276141 277469 279798 282976 286707
57703B86707L954L945M286N599P397Q300P904P450P988Q858Q942Q432Q266Q631
$$ 286707 290661 294606 298892 304491 311888 320188 328092 335542 343530 352388 361330 369762 378028 386659
57689C86659R247J0392J2364J4487J5920J6949J8359K0140K2078K4946K9542L4945
$$ 386659 395906 406298 418662 433149 449069 466018 484377 504517 526595 551541 581083 616028
57677F16028L9471M3143M7532N3208N9092O4619P0820P8700Q7953R7880J08195
$$ 616028 655499 698642 746174 799382 858474 923093 993913 1072613 1160566 1258446 1366641
57666A366641J17775J23445J20978J07525Q3404N2417K0577o750k7374m2143n2647
$$ 1366641 1484416 1607861 1728839 1836364 1919768 1972185 1992762 1986012 1958638 1916495 1863848
57655A863848n9832o4497o7722p0098p1448p1687p1284p0424o8538o5221o1080
$$ 1863848 1804016 1739519 1671797 1601699 1530251 1458564 1387280 1316856 1248318 1183097 1122017
57644A122017n7151n3851n0824m7425m3168l8075l2876k8485k5091k2098j8971
$$ 1122017 1064866 1011015 960191 912766 869598 831523 798647 770162 745071 722973 704002
57633G04002j5721j2572r722p472o015m979l697k006k81J392L396N804Q081R840
$$ 704002 688281 675709 665987 658515 652500 647521 643824 641818 641537 642929 646325 652129 660210 670050
57619F70050J1377J3197J5425J7889K0422K2875K5190K7586L0395L3647L7099
$$ 670050 681427 694624 710049 727938 748360 771235 796425 824011 854406 888053 925152
57608I25152M0652M4311M7765N0417N1876N2070N0972M8528M4765L9608L2685
$$ 925152 965804 1010115 1057880 1108297 1160173 1212243 1263215 1311743 1356508 1396116 1428801
57597A428801K3793J3361K176r239k0467l0827l9637m6672n1919n5213n6674n7081
$$ 1428801 1452594 1465955 1468131 1458892 1438425 1407598 1367961 1321289 1269370 1214157 1157483 1100402
57585A100402n7048n6211n4015n0922m7928m5173m2094l8737l5763l3266l0626
$$ 1100402 1043354 987143 933128 882206 834278 789105 747011 708274 672511 639245 608619
57574F08619k7658k4830k2308j9820j7551j6052j5062j3577j1472r875r498r568
$$ 608619 580961 556131 533823 514003 496452 480400 465338 451761 440289 430414 420916 411348
57562D11348r020p905o957o461o150n728n045m162l508l378l259k313p14M06N14
$$ 411348 402328 394423 387466 381005 374855 369127 364082 359920 356412 353034 349775 347462 346748 347154 347668
57547C47668L08M52P28Q83J304K142K668K351J891K378L864N535O826P748Q396
$$ 347668 347976 348428 349156 350039 351343 353485 356153 358504 360395 362773 366637 372172 378998 386746 395142
57532C95142Q874R414J0069J0561J0795J1234J2290J3714J4988J6000J6949J7968
$$ 395142 404016 413430 423499 434060 444855 456089 468379 482093 497081 513081 530030 547998
57520E47998J9215K1003K3406K6036K8559L1125L3921L6649L8765L9995M0351
$$ 547998 567213 588216 611622 637658 666217 697342 731263 767912 806677 846672 887023
57509H87023L9984L9161L8023L6089L2575K7356K1189J4681P581n10r273j7908
$$ 887023 927007 966168 1004191 1040280 1072855 1100211 1121400 1136081 1143662 1143152 1133879 1115971
57497A115971k5828l2662l7953m1374m3010m3209m2393m1119l9862l8481l6351
$$ 1115971 1090143 1057481 1019528 978154 935144 891935 849542 808423 768561 730080 693729
57486F93729l3252k9716k6335k3278k0672j8680j6911j4464j1124p901n826m739
$$ 693729 660477 630761 604426 581148 560476 541796 524885 510421 499297 491396 485570 480831
57474D80831l809k699j547k43J488L477N204O442P429Q510R910J1644J3445J5027
$$ 480831 477022 474323 472776 472533 474021 477498 482702 489144 496573 505083 514993 526637 540082 555109
57460E55109J6562J8515K0795K2651K3730K4682K6288K8498L0807L3047L5264
$$ 555109 571671 590186 610981 633632 657362 682044 708332 736830 767637 800684 835948
57449H35948L7063L7751L7000L4993L2027K8252K3630J7890J0768K459o308j4749
$$ 835948 873011 910762 947762 982755 1014782 1043034 1066664 1084554 1095322 1097781 1091473 1076724
57437A076724k2286k8513l3436l7692m1840m5318m6847m6030m3803m1177l8393
$$ 1076724 1054438 1025925 992489 954797 912957 867639 820792 774762 730959 689782 651389
57426F51389l5537l3009l0885k8718k6348k4124k1978j9372j6613j4967j4773
$$ 651389 615852 582843 551958 523240 496892 472768 450790 431418 414805 399838 385065
57415C85065j4655j3474j1848j0661r408p410n608n316n931n731m515l702l878
$$ 385065 370410 356936 345088 334427 325019 317609 312001 306685 300754 295023 290508 286806 282928
57402B82928m084l606k951k620k333j860j487j232p16j19k48j146j735j369q09
$$ 282928 278844 275238 272287 269667 267334 265474 263987 262755 262039 261920 261672 260526 258791 257422 256613
57387B56613r28j267p52O20J673J515N44j20R0O79Q37N58O02J286J884J676J033
$$ 256613 255685 254418 253666 254286 255959 257474 258018 257898 257988 258667 259504 260062 260664 261950 263834 265510 266543
57370B66543P70Q83P50L63L62Q97J358J311R79O69M30L70O49J040J148J086J332
$$ 266543 267313 268196 268946 269309 269671 270568 271926 273237 274216 274885 275315 275685 276334 277374 278522 279608 280940
57353B80940J896K294K316K178J939J571J488K180L246L728L537L536M038M297
$$ 280940 282836 285130 287446 289624 291563 293134 294622 296802 300048 303776 307313 310849 314887 319184
57339C19184L902L604M065M676M445L470K731K787L378L989M208L789K867K046
$$ 319184 323086 326690 330755 335431 339876 343346 346077 348864 352242 356231 360439 364228 367095 369141
57325C69141J836K219K920L801M671N197N314N505O151O985P501P653P689P590
$$ 369141 370977 373196 376116 379917 384588 389785 395099 400604 406755 413740 421241 428894 436583 444173
57311D44173P181O664O581P177Q185R204J0088J0838J1369J1525J1356J1304J1832
$$ 444173 451354 458018 464599 471776 479961 489165 499253 510091 521460 532985 544341 555645 567477
57298E67477J2797J3395J3138J2679J3190J4822J6398J6848J6487J6488J7343
$$ 567477 580274 593669 606807 619486 632676 647498 663896 680744 697231 713719 731062
57287G31062J8329J8420J7480J6362J5925J6077J5909J4816J3173J1782J0868
$$ 731062 749391 767811 785291 801653 817578 833655 849564 864380 877553 889335 900203
57276I00203R898Q192N489K168p18k005j552n98m56j027j143j82J400L009M536
$$ 900203 910101 918293 923782 925950 925232 923227 921675 921077 920621 919594 918451 918269 919669 922678 927214
57261I27214N936O960P596Q178Q888R558J0152J0824J1546J2214J3098J4472J5833
$$ 927214 933150 940110 947706 955884 964772 974330 984482 995306 1006852 1019066 1032164 1046636 1062469
57248A062469J6355J6192J6406J7344J8131J8202J8253J9118K0554K1957K3320
$$ 1062469 1078824 1095016 1111422 1128766 1146897 1165099 1183352 1202470 1223024 1244981 1268301
57237A268301K4680K5392K5018K4335K4402K5120K5797K6563K7981K9485K9748
$$ 1268301 1292981 1318373 1343391 1367726 1392128 1417248 1443045 1469608 1497589 1527074 1556822
57226A556822K8690K7853K8334K9467L0049K9935K9692K9504K9278K9294K9872
$$ 1556822 1585512 1613365 1641699 1671166 1701215 1731150 1760842 1790346 1819624 1848918 1878790
57215A878790L0671L1071L1144L1500L2234L2762L2877L3205L4307L5805L6956
$$ 1878790 1909461 1940532 1971676 2003176 2035410 2068172 2101049 2134254 2168561 2204366 2241322
57204B241322L7627L8166L8581L8499L7967L7585L7637L7668L7148L6208L5315
$$ 2241322 2278949 2317115 2355696 2394195 2432162 2469747 2507384 2545052 2582200 2618408 2653723
57193B653723L4648L4147L3828L3652L3384L2962L2723L2803L2659L1744L0381
$$ 2653723 2688371 2722518 2756346 2789998 2823382 2856344 2889067 2921870 2954529 2986273 3016654
57182C016654K9387K9021K9014K9369L0303L1470L2095L2053L1960L2049L1753
$$ 3016654 3046041 3075062 3104076 3133445 3163748 3195218 3227313 3259366 3291326 3323375 3355128
57171C355128L0715K9411K8412K7694K7125K6923K7183K7512K7676K8011K8698
$$ 3355128 3385843 3415254 3443666 3471360 3498485 3525408 3552591 3580103 3607779 3635790 3664488
57160C664488K9226K9185K9059K9431K9887K9428K7798K5624K3409K1073J8459
$$ 3664488 3693714 3722899 3751958 3781389 3811276 3840704 3868502 3894126 3917535 3938608 3957067
57149C957067J5692J2958J0467Q601P679P541P765Q266R309J1039J3322J6035
$$ 3957067 3972759 3985717 3996184 4004785 4012464 4020005 4027770 4036036 4045345 4056384 4069706 4085741
57137D085741J9039K1858K3814K4587K4394K3590K2442K1286K0447J9815J8824
$$ 4085741 4104780 4126638 4150452 4175039 4199433 4223023 4245465 4266751 4287198 4307013 4325837
57126D325837J7273J6046J6691K0021K5122K9848L2398L2456L0965K9187K8189
$$ 4325837 4343110 4359156 4375847 4395868 4420990 4450838 4483236 4515692 4546657 4575844 4604033
57115D604033K8874L1914L7476M5321N5243O7160Q0928R6519J14419J35433J60080
$$ 4604033 4632907 4664821 4702297 4747618 4802861 4870021 4950949 5047468 5161887 5297320 5457400
57104E457400J88728K22409K62914L11962L70832M41116N25129O25105P42287
$$ 5457400 5646128 5868537 6131451 6443413 6814245 7255361 7780490 8405595 9147882
57095I147882Q76929J028407J194795J372820J558605J747846J934725K111257
$$ 9147882 10024811 11053218 12248013 13620833 15179438 16927284 18862009 20973266
57087B0973266K268144K395297K480630K509671K469003K351455K157795J893744
$$ 20973266 23241410 25636707 28117337 30627008 33096011 35447466 37605261 39499005
57079C9499005J566673J185372P61473L09418j54956o15410j055383j458423j809632
$$ 39499005 41065678 42251050 43012523 43321941 43166985 42551575 41496192 40037769 38228137
57070C8228137k097244k313529k455039k522657k521630k461125k352958k209791
$$ 38228137 36130893 33817364 31362325 28839668 26318038 23856913 21503955 19294164
57062A9294164k043659j865303j683924j506935j339665j185218j044673r17765
$$ 19294164 17250505 15385202 13701278 12194343 10854678 9669460 8624787 7707022
57054G707022q03974p03137o14976n38287m71214m12395l61298l17391k79588
$$ 7707022 6903048 6199911 5584935 5046648 4575434 4163039 3801741 3484350 3204762
57045C204762k46837k18620j94516j73750j55541j39493j25309j12629j01461
$$ 3204762 2957925 2739305 2544789 2371039 2215498 2076005 1950696 1838067 1736606
57036A736606r2147q4460p7307o9809o2091n4572m7124l9564l2262k5466j8618
$$ 1736606 1644459 1559999 1482692 1412883 1350792 1296220 1249096 1209532 1177270 1151804 1133186
57025A133186j1061k769O398J7238K9912M3279N7060P3122R1346J03963R7661
$$ 1133186 1122125 1119356 1125754 1142992 1172904 1216183 1273243 1346365 1437711 1541674 1639335
57014A639335O4444J0195m8628r6192j25174j36285j33834j22684j07331r1424
$$ 1639335 1703779 1713974 1665346 1569154 1443980 1307695 1173861 1051177 943846 852422
57004H52422p7190o5319n5541m7298m0205l4063k8770k4290k0586j7397j4291
$$ 852422 775232 709913 654372 607074 566869 532806 504036 479746 459160 441763 427472
56993D27472j1225q858p812p672p186n622l431j430J86J734L315M504M676L416
$$ 427472 416247 407389 399577 391905 384719 379097 375666 374236 374422 376156 379471 383975 388651 392067
56979C92067O83l130p288j0865j3043j3570j2985j2025j0730q547n528k764j143
$$ 392067 392750 389620 382332 371467 358424 344854 331869 319844 309114 300567 295039 292275 291132
56966B91132j91J130L004M892O739Q958J1470J3670J5374J6816J7678J7030J4452
$$ 291132 290941 292071 295075 299967 306706 315664 327134 340804 356178 372994 390672 407702 422154
56953D22154J0326N023j243p610j2600j5419j6387j5935j4135j1546r313p847
$$ 422154 432480 437503 436260 428650 416050 400631 384244 368309 354174 342628 333315 325468
56941C25468o276l852j055J382L627O191Q945J1595J4427J7669K0639K2252K1979
$$ 325468 319192 315340 314285 315667 319294 325485 334430 346025 360452 378121 398760 421012 442991
56928D42991J9552J4377O329l206j1995j8657k3029k5316k5708k4693k2870k0411
$$ 442991 462543 476920 483249 480043 468048 449391 426362 401046 375338 350645 327775 307364
56916C07364j7355j4267j1902j0310q949p596o440n425m223k896j856j174n65
$$ 307364 290009 275742 263840 253530 244581 236985 230545 225120 220897 218001 216145 214971 214406
56903B14406q3j31o57r60n68K04P74R56R68J047J308J664J914K130K811M375O508
$$ 214406 214323 214192 213535 212575 212007 212211 212985 213941 214909 215956 217264 218928 220842 222972 225783 230158 236666
56886B36666Q430R649J0096R658Q103N447K002j868n612q356r481r264q359o796
$$ 236666 245096 254745 264841 274499 282602 288049 290051 288183 282571 274215 264734 255470 247111 240315
56872B40315m182q25K258M639O988R902J2990J5617J7939K0523K3384K6039K8274
$$ 240315 236133 235308 237566 242205 249193 259095 272085 287702 305641 326164 349548 375587 403861
56859D03861L0144L1177L0132K5826J8087P942k857j2493j9595k3495k4203k2303
$$ 403861 434005 465182 495314 521140 539227 547169 544312 531819 512224 488729 464526 442223
56847D42223j8737j4474j0148n916j616K947P773J2599J7163K1569K6341L1902
$$ 442223 423486 409012 398864 392948 391332 394279 402052 414651 431814 453383 479724 511626
56835E11626L8134M4444M9889N2939N1447M3633K9444J0829r147k7333m1137m9136
$$ 511626 549760 594204 644093 697032 748479 792112 821556 832385 823238 795905 754768 705632
56823G05632n1547m9829m5552l9770l3232k6567k0032j3550p281j704L106P852
$$ 705632 654085 604256 558704 518934 485702 459135 439103 425553 418272 416568 419674 427526
56811D27526J3203J8962K4479K9559L4229L7743L8365L4425K5337J1820m241k0032
$$ 427526 440729 459691 484170 513729 547958 585701 624066 658491 683828 695648 691407 671375
56799F71375l2664m0566m4011m4047m1311l6176k9723k3599j8679j4439j0029
$$ 671375 638711 598145 554134 510087 468776 432600 402877 379278 360599 346160 336131
56788C36131n556j806R49L417O485J0410J4678J8343K0449K0434J8233J3846P076
$$ 336131 330575 328769 329718 333135 339620 350030 364708 383051 403500 423934 442167 456013 463089
56775D63089j842j1447j9531k4656k6908k7085k5740k3265k0368j7802j5803j4109
$$ 463089 461247 449800 430269 405613 378705 351620 325880 302615 282247 264445 248642 234533
56763B34533j2432j0699r001p581o661o099n384m182k771j758j599k302l318l662
$$ 234533 222101 211402 202401 194820 188159 182060 176676 172494 169723 167965 166366 164064 160746 157084
56749A57084k743j210l84n90p39MR59R73P0q11j192j234q77O1J064J238N33j87
$$ 157084 154341 153131 152747 152157 151418 151422 152381 153354 153424 152613 151421 150187 149310 149371 150435 151673 152206 152019
56731A52019m29n58r11j293j529j749j784j082L74J730K211J919J395R44P09Q37
$$ 152019 151590 151032 150121 148828 147299 145550 143766 142684 143058 144788 146999 148918 150313 151257 151966 152803
56715A52803J148J115N41p6k13P8M71P84Q20L12n76j166j055o45n00o25o91o21
$$ 152803 153951 155066 155607 155531 155318 155396 155867 156651 157471 157783 157207 156041 154986 154341 153841 153216 152525 151904
56697A51904m70j58K84N23L84J80K56N04P43J072J451J404P67K81P41J756K153
$$ 151904 151434 151276 151560 152083 152467 152647 152903 153407 154150 155222 156673 158077 158844 159125 159866 161622 163775
56680A63775J462L73k83l19N9O10J015R32L97j79m90n17k35M37J283J766J560
$$ 163775 165237 165610 165327 165008 165067 165677 166692 167624 168021 167842 167352 166835 166600 167037 168320 170086 171646
56663A71646Q17j37j032j544j320m35M20N28j65j070j570j481r92m38n2J05J28
$$ 171646 172463 172326 171294 169750 168430 167995 168415 168943 168778 167708 166138 164657 163665 163227 163175 163280 163408
56646A63408J47J82R7k55p78j076p76j1N97M82l11j185j499j132o18o84j434k087
$$ 163408 163555 163737 163834 163579 162801 161725 160949 160938 161535 162017 161706 160521 159022 157890 157272 156588 155154 153067
56628A53067j840r56n24j070j868j904j085j28L81L37p5m89m21K10O96K46r32
$$ 153067 151227 150271 149747 148677 146809 144905 143820 143692 144073 144410 144335 143846 143425 143635 144331 144577 143645
56611A43645j703j284p8Q36Q01P3n04k73N92J227J065N36M43Q64J124Q24K80j10
$$ 143645 141942 140658 140580 141416 142217 142290 141786 141513 142105 143332 144397 144933 145376 146240 147364 148188 148468 148358
56593A48358l35l67Q8J021J745J725J361J402J818J893J445J130J383J689J397
$$ 148358 148023 147656 147744 148765 150510 152235 153596 154998 156816 158709 160154 161284 162667 164356 165753
56578A65753P46N15Q61J153R76O83P69J148J456J738K327L217M003M498M950N536
$$ 165753 166499 167014 167875 169028 170004 170687 171456 172604 174060 175798 178125 181342 185345 189843 194793 200329
56562B00329O041O210O167O161O163O057O044O436P052P277O807O068N587N271
$$ 200329 206370 212580 218747 224908 231071 237128 243172 249608 256660 263937 270744 276812 282399 287670
56548B87670M568L272J785N62l76j255k128k970l966n359o974q231q711q524q021
$$ 287670 292238 295510 297295 297857 297481 296226 294098 291128 287162 281803 274829 266598 257887 249363 241342
56533B41342p452o949o553o099n431m812m715m947m537l002j299p62j380j936
$$ 241342 233890 226941 220388 214289 208858 204046 199331 194384 189847 186845 185546 184784 183404 181468
56519A81468j773j503j768k209k083j338n03L7J97m8n80j046j168j026p43k60
$$ 181468 179695 178192 176424 174215 172132 170794 170291 170328 170525 170477 169897 168851 167683 166657 165914 165654
56503A65654L19N27N8p62j398j741j967k006j633r37j96N39J333J890J706P77
$$ 165654 165973 166500 166558 165796 164398 162657 160690 158684 157051 156114 155918 156457 157790 159680 161386 162163
56487A62163j60l35K64Q96Q15P1m76j11Q25J278Q44L01N02J207J487J024M43M84
$$ 162163 162003 161668 161932 162828 163643 163714 163238 163127 163952 165230 166074 166375 166877 168084 169571 170595 171038 171522
56469A71522J275K359L047K782J608L26j85K19R72J527J667J306N14k46l98L1
$$ 171522 172797 175156 178203 180985 182593 182919 182734 182953 183925 185452 187119 188425 188939 188693 188295 188326
56453A88326L66J86r9J52R17J511J458R97O97P78J002J107J047P89K08n66j033
$$ 188326 188692 188878 188779 188931 189848 191359 192817 193814 194511 195289 196291 197398 198445 199234 199442 198876 197843
56436A97843r03o19q33j483j942j931j699j303n81Q9q0r76j357n53M38L93l73
$$ 197843 196940 196321 195488 194005 192063 190132 188433 187130 186549 186638 186558 185582 184225 183672 184110 184503 184130
56419A84130o91m25m43r93j368j167q23n78o6P74J249R01L25L78J030J530J421
$$ 184130 183439 183014 182571 181578 180210 179043 178220 177642 177576 178350 179599 180500 180825 181203 182233 183763 185184
56402A85184R58O73Q09J192J454J479J505J705J843J649J430J743K531L007K590
$$ 185184 186142 186815 187624 188816 190270 191749 193254 194959 196802 198451 199881 201624 204155 207162 209752
56387B09752J557O16J21j01m12r34j384j355q71m79o09j044j271j153q97n98k25
$$ 209752 211309 211925 212046 211945 211533 210599 209215 207860 206989 206510 205901 204857 203586 202433 201536 200938 200713
56370B00713J45M45Q19J267J366Q47J63p2M3K8n4K41Q36J200J251J488K110K760
$$ 200713 200858 201303 202122 203389 204755 205602 205765 205693 205736 205764 205710 205951 206787 207987 209238 210726 212836 215596
56352B15596L065K874K079R06K01N02J009N69m59n28P21J801J581Q25P98J434
$$ 215596 218661 221535 223614 224520 224721 225223 226232 226801 226342 225814 226535 228336 229917 230742 231540 232974
56336B32974J828J789J829K076K089J585P85J48N3M47O68J26o63n08P41J804J767
$$ 232974 234802 236591 238420 240496 242585 244170 244955 245103 245156 245603 246271 246397 245734 245226 245967 247771 249538
56319B49538J318J508K134K320J990J719J583J207P09O27J004J308J190P05q8
$$ 249538 250856 252364 254498 256818 258808 260527 262110 263317 264026 264653 265657 266965 268155 268860 268772
56304B68772r71j269m73Q59J551J235O95O78R98J056P27M24M80P41O91N4p66r80
$$ 268772 267801 266532 266059 266918 268469 269704 270399 271077 272075 273131 273858 274282 274762 275503 276194 276248 275482 274502
56286B74502k68Q51J626J799J564J199R51J000J267J482J604J860K181K125J591
$$ 274502 274234 275085 276711 278510 280074 281273 282224 283224 284491 285973 287577 289437 291618 293743 295334
56271B95334J130J208J648K112K628L154L191K468J546J214J526K032K498K882
$$ 295334 296464 297672 299320 301432 304060 307214 310405 312873 314419 315633 317159 319191 321689 324571
56257C24571K945K605K345K629L180L445L476L645L842L722L604M184N373O159
$$ 324571 327516 330121 332466 335095 338275 341720 345196 348841 352683 356405 360009 364193 369566 375725
56243C75725N860M873M043L739L760L758L559L277L209L445L702L664L318K777
$$ 375725 381585 386458 390501 394240 398000 401758 405317 408594 411803 415248 418950 422614 425932 428709
56229D28709K043J191N42L12L83O17J048J488J434P33p5m97o72p81m86L75J145
$$ 428709 430752 431943 432485 432797 433180 433797 434845 436333 437767 438500 438425 437928 437256 436475 435989 436364 437509
56212D37509J188R80J476K660L620L854L635L203K482J622J038Q39Q12R49J364
$$ 437509 438697 439677 441153 443813 447433 451287 454922 458125 460607 462229 463267 464106 464918 465867 467231
56197D67231J701J445Q03O34J337K402L152L387L261L066L206L813M371M235L554
$$ 467231 468932 470377 471180 471814 473151 475553 478705 482092 485353 488419 491625 495438 499809 504044 507598
56182E07598L144L408L945M335M695N280O005O551O790O913P353Q408R740J0458
$$ 507598 510742 514150 518095 522430 527125 532405 538410 544961 551751 558664 566017 574425 584165 594623
56168E94623J0144R608J0126J2006J4324J5981J6636J6740J7075J8214K0017K1778
$$ 594623 604767 614375 624501 636507 650831 666812 683448 700188 717263 735477 755494 777272
56156G77272K3054K4271K6206K9288L3661L9425M6373N3914O1783P0438Q0434
$$ 777272 800326 824597 850803 880091 913752 953177 999550 1053464 1115247 1185685 1266119
56145A266119R1953J05519J22299J42791J65627J88637K10462K29926K44143K48717
$$ 1266119 1358072 1463591 1585890 1728681 1894308 2082945 2293407 2523333 2767476 3016193
56135C016193K40307K18802J87489J52195J19816R5837Q1941P5618P1750O4582
$$ 3016193 3256500 3475302 3662791 3814986 3934802 4030639 4112580 4188198 4259948 4324530
56125D324530M9699K6274k029k9149n0193o3352o9779p3202p9230r3010j16325
$$ 4324530 4374229 4400503 4398474 4369325 4319132 4255780 4186001 4112799 4033569 3940559 3824234
56114C824234j46802j79504k08692k29169k37939k35283k23573k05064j81618
$$ 3824234 3677432 3497928 3289236 3060067 2822128 2586845 2363272 2158208 1976590
56105A976590j55935j31327j09777r1199p4900o0816m9143l9768l2348k6362k1031
$$ 1976590 1820655 1689328 1579551 1488352 1413452 1352636 1303493 1263725 1231377 1205015 1183984
56094A183984j5932j1611q760o975n197l145j291L20K053L684M631N097N800O664
$$ 1183984 1168052 1156441 1147681 1140706 1135509 1132364 1131073 1131393 1133446 1137130 1141761 1146858 1152658 1159322
56080A159322O978O766O741O998P040O959P225P480P036O447O923Q242Q983Q994
$$ 1159322 1166300 1173066 1179807 1186805 1193845 1200804 1208029 1215509 1222545 1228992 1235915 1244157 1253140 1262134
56066A262134R693J1561J3292J4025J4684J6227J8120J9380J9901K0002J9898
$$ 1262134 1271827 1283388 1296680 1310705 1325389 1341616 1359736 1379116 1399017 1419019 1438917
56055A438917K0160K1467K3298K4214K3934K3855K4908K6306K7084K7492K8116
$$ 1438917 1459077 1480544 1503842 1528056 1551990 1575845 1600753 1627059 1654143 1681635 1709751
56044A709751K8839K9422L0103L1032L2051L3360L5363L7716L9673M1381M3414
$$ 1709751 1738590 1768012 1798115 1829147 1861198 1894558 1929921 1967637 2007310 2048691 2092105
56033B092105M5076M5034M3713M3111M3845M4470M4272M4576M6450M9142N1740
$$ 2092105 2137181 2182215 2225928 2269039 2312884 2357354 2401626 2446202 2492652 2541794 2593534
56022B593534N4614N8181O1952O5665O9809P4242P7979Q0968Q4338Q8334R1884
$$ 2593534 2648148 2706329 2768281 2833946 2903755 2977997 3055976 3136944 3221282 3309616 3401500
56011C401500R4796R8362J03109J08074J12932J18558J24824J30317J35070J41027
$$ 3401500 3496296 3594658 3697767 3805841 3918773 4037331 4162155 4292472 4427542 4568569
56001D568569J48873J56967J64382J72321J81425J90580J99575K10070K22556
$$ 4568569 4717442 4874409 5038791 5211112 5392537 5583117 5782692 5992762 6215318
55992F215318K35277K47604K61496K78176K96488L16008L38442L64174L90933
$$ 6215318 6450595 6698199 6959695 7237871 7534359 7850367 8188809 8552983 8943916
55983H943916M17885M47615M81974N19558N59489O04101O55453P12807P75957
$$ 8943916 9361801 9809416 10291390 10810948 11370437 11974538 12629991 13342798 14118755
55974A4118755Q47553R29841J022958J128656J251572J394918J559761J750839
$$ 14118755 14966308 15896149 16919107 18047763 19299335 20694253 22254014 24004853
55966B4004853J977946K249526K571438K955026L419608L983350M657436N450019
$$ 24004853 25982799 28232325 30803763 33758789 37178397 41161747 45819183 51269202
55958E1269202O365189P394974Q526171R764179J1141592J2699688J4475901J6512915
$$ 51269202 57634391 65029365 73555536 83319715 94461307 107160995 121636896 138149811
55950A38149811J8853598K1503343K4391803K7323826K9841360L1039343K9623918
$$ 138149811 157003409 178506752 202898555 230222381 260063741 291103084 320727002
55943C20727002K4459669J5373147L565243q790160j9491183k7118069l1279950
$$ 320727002 345186671 360559818 364125061 355334901 335843718 308725649 277445699
55936B77445699l2382578l1233936k8706160k5523903k2187285j8997615j6116559
$$ 277445699 245063121 213829185 185123025 159599122 137411837 118414222 102297663
55929A02297663j3608827j1472995r676031q178860o940314n915167n061949m350322
$$ 102297663 88688836 77215841 67539810 59360950 52420636 46505469 41443520 37093198
55921C7093198l756427l256887k832531k472369k168245j909436j686367j494868
$$ 37093198 33336771 30079884 27247353 24774984 22606739 20697303 19010936 17516068
55913A7516068j332170j192371j069571r61656q67452p83689p08126o41987n85872
$$ 17516068 16183898 14991527 13921956 12960300 12092848 11309159 10601033 9959046 9373174
55904I373174n36468m90536m48980m13731l83493l55761l30422l08252k88174
$$ 9373174 8836706 8346170 7897190 7483459 7099966 6744205 6413783 6105531 5817357
55895E817357k68896k51224k36123k22443k08819j95788j83948j72172j59767
$$ 5817357 5548461 5297237 5061114 4838671 4629852 4434064 4250116 4077944 3918177
55886C918177j48266j38946j30545j21574j12834j05523r8822r1509q4094p7322
$$ 3918177 3769911 3630965 3500420 3378846 3266012 3160489 3061667 2970158 2886064 2808742
55876B808742p0363o2766n6687n4842n7286o1946o7197p2202p5935p7571p7073
$$ 2808742 2738379 2675613 2618926 2564084 2506798 2444852 2377655 2305453 2229518 2151947 2074874
55865B074874p4453o9660o3955n9673n7589n6188n4402n2999n2215n0401m6637
$$ 2074874 2000421 1930761 1866806 1807133 1749544 1693356 1638954 1585955 1533740 1483339 1436702
55854A436702m2508l9495l6623l2591k8388k5647k4098k2747k2070k2876k4217
$$ 1436702 1394194 1354699 1318076 1285485 1257097 1231450 1207352 1184605 1162535 1139659 1115442
55843A115442k4602k4286k4427k4849k4450k3032k1151j8988j6781j5316j4652
$$ 1115442 1090840 1066554 1042127 1017278 992828 969796 948645 929657 912876 897560 882908
55832H82908j3464j1057q748p809p395o091m129k386n41J810L490L276J976J053
$$ 882908 869444 858387 849639 841830 834435 828344 824215 821829 821288 823098 826588 829864 831840 832893
55818H32893J20k068n090p520r348j1656j4366j6411j7696j8973k0089k0275j9781
$$ 832893 833013 830945 825855 818335 808987 797331 782965 766554 748858 729885 709796 689521 669740
55805F69740j9420j8825j7048j4576j2805j1748j0119p672n592m521l969l785
$$ 669740 650320 631495 614447 599871 587066 575318 565199 557527 551935 547414 543445 539660
55793E39660m443n557n645l924j044K175N594Q993J1517J2164J0158N116k123
$$ 539660 535217 529660 524015 520091 519047 521222 526816 535809 547326 559490 569648 574764 572641
55780E72641r102j3414j4833j4849j4400j3210j1129q583n716k431M35J262o70
$$ 572641 563539 550125 535292 520443 506043 492833 481704 473121 467405 464974 465409 466671 466001
55767D66001m429q500j1767j3495j3447j2267j0926r709q415p297o826o714o193
$$ 466001 461572 453072 441305 427810 414363 402096 391170 381461 373046 365749 358923 352209 346016
55754C46016n332m990n512o442p523q878j0103j0299r311q012p151o635o179n834
$$ 346016 340684 335694 330182 323740 316217 307339 297236 286937 277626 269614 262463 255828 249649 243815
55740B43815n618n284m694l948l128k376k043k181k158j510q36r92j674j805j240
$$ 243815 238197 232913 228219 224271 221143 218767 216724 214543 212385 210875 210039 209047 207373 205568 204328
55725B04328j002j760l028m025m424m170l372k536k204k253k135j797j581j387
$$ 204328 203326 201566 198538 194513 190089 185919 182547 180011 177807 175554 173419 171622 170041 168654
55711A68654p26L40J155J404J312R85L45l14n29m18n05p75p85n85o81j079j278
$$ 168654 167928 168268 169423 170827 172139 173124 173469 173155 172626 172208 171703 170928 170143 169558 168877 167798 166520
55694A66520j276j556k050k027j222j76P17J590K312K312J528P37N79R51J613
$$ 166520 165244 163688 161638 159611 158389 158213 158930 160520 162832 165144 166672 167409 167988 168939 170552
55679A70552K627L884M900N468N918O389O423N595M125K606J537J165J334J409
$$ 170552 173179 177063 181963 187431 193349 199738 206161 211756 215881 218487 220024 221189 222523 223932
55665B23932Q15l51j628k872m072m839m849m608m829n191m716l308j882r41j68
$$ 223932 224747 224396 222768 219896 215824 210985 206136 201528 196699 191508 186792 183484 181602 180661 180493
55650A80493M88M85j39m50O0Q06J210J523K001K196J755J147R79J080R30M09l00
$$ 180493 180981 181466 181327 180877 180937 181743 182953 184476 186477 188673 190428 191575 192554 193634 194564 194973 194673
55633A94673j082j720j906j795k038k870l708l995l894l778l646l397l109k738
$$ 194673 193591 191871 189965 188170 186132 183262 179554 175559 171665 167887 164241 160844 157735 154997
55619A54997k107j508j610k450l220l458l664m256m789m876n035n749o322n696
$$ 154997 152890 151382 149772 147322 144102 140644 136980 132724 127935 123059 118024 112275 105953 100257
55605A00257m036k571k063k204k440k540k359j715p34J51N75M89K3n87j065j298
$$ 100257 96221 93650 91587 89383 86943 84403 82044 80329 79595 79746 80321 80810 80833 80246 79181 77883
55589G7883j416j530j515j281r61p09n14l96n17q78j151j080q33p29q19r66j109
$$ 77883 76467 74937 73422 72141 71180 70471 69957 69561 69044 68166 67015 65935 65102 64373 63554 62588 61479
55572F1479j281j409j354j073p22n63p01q40o01j85k90j014j392o96L32M56j86
$$ 61479 60198 58789 57435 56362 55640 55077 54376 53536 52935 52750 52460 51446 50054 49358 49690 50146 49960
55555D9960m11kk5q86j462p94N22J392J721J935J853J051j28q57q81n94l54l07
$$ 49960 49549 49547 49522 48636 47174 46380 46902 48294 50015 51950 53803 54854 54726 53869 52988 52394 52040 51733
55537E1733n72j006j072m76L28P53Q06Q07P57N60L92L36P5m61n67L53J694K206
$$ 51733 51161 50155 49083 48607 48935 49688 50494 51301 52058 52618 53010 53346 53421 52960 52393 52746 54440 56646
55519E6646J470K40n48n12K49J293K019K134J916J677J293P73P32J619K721K916
$$ 56646 58116 58356 57808 57296 57545 58838 60857 62991 64907 66584 67877 68650 69382 71001 73722 76638
55503G6638K202J646J769J952J641J233J340J733J720J136M98K21J17k67j039
$$ 76638 78840 80486 82255 84207 85848 87081 88421 90154 91874 93010 93508 93729 93846 93579 92540
55488I2540j840k359k784l560m663n502n661n410n150m740l770k304r05j1L16
$$ 92540 90700 88341 85557 81997 77334 71832 66171 60761 55611 50871 47101 44797 43892 43881 44197
55473D4197N4q08j952k743k778k247j622j149p18j52M65P25K98n79j190j089n55
$$ 44197 44251 43443 41491 38748 35970 33723 32101 30952 30234 30082 30547 31272 31570 30991 29801 28712 28157
55456B8157k18l51p21j001j078r97p88m12J39O39P25L81J71N67J141R76n9r86
$$ 28157 27939 27588 26867 25866 24788 23791 23003 22591 22730 23369 24094 24475 24646 25213 26354 27330 27271 26285
55438B6285r32j69M30M94L01J79K31N08R77J351J257O53o0l29L1N28L76n19j186
$$ 26285 25353 25184 25614 26108 26409 26588 26819 27327 28304 29655 30912 31565 31505 31176 31207 31735 32111 31592 30406
55419C0406p20M32J032P90O51J175J638J176lj122j798j956j461n77j00l09l94
$$ 30406 29686 30118 31150 31940 32591 33766 35404 36580 36577 35455 33657 31701 30240 29663 29563 29254 28860
55402B8860L33J221J212M37j04r1o0k04r3M29R39J160J237J151O29k38r04j000
$$ 28860 29193 30414 31626 32063 31959 31868 31808 31604 31511 31940 32879 34039 35276 36427 37056 36818 35914 34914
55384C4914o59j66K03J13n56j340j674j599j485j254n59L36O70K05m88r16j092
$$ 34914 34255 34089 34292 34405 33849 32509 30835 29236 27751 26497 25938 26274 26944 27149 26661 25745 24653
55367B4653j061o67m5K93J48o8k0Q8m4k46j18M06R31R52L37m54p65n57m86r56
$$ 24653 23592 22925 22880 23173 23321 23253 23233 23321 23277 23031 22913 23319 24250 25202 25539 25085 24320 23763 23277 22321
55347B2321j432j276p94p24j035j033n65j75k2M10J275J892J613O14m80j189j224
$$ 22321 20889 19613 18819 18095 17060 16027 15462 15287 15265 15675 16950 18842 20455 21069 20589 19400 18176
55330A8176n69K39M58J2m67o13o45o40k34N67J053P16J7k66J6M52P11P09N02L33
$$ 18176 17607 17846 18304 18316 17849 17236 16591 15951 15717 16284 17337 18053 18070 17804 17820 18272 18983 19692 20194 20527
55310B0527M28N40J62o40j033m76N90J343J467J128O09K39K50L51J8n98p08j70
$$ 20527 20955 21495 21657 21017 19984 19508 20098 21441 22908 24036 24645 24884 25134 25485 25503 24905 24197 24027
55292B4027J34k52l97O47K182K630J606J62p70j170j242j015p63r16j329j384
$$ 24027 24161 23909 23512 24159 26341 28971 30577 30739 29969 28799 27557 26542 25779 24863 23534 22150
55276B2150j009r11j410j817j367k71O47R29O89K12k15k80M9L33J66k74m74k88
$$ 22150 21141 20230 18820 17003 15636 15365 16012 16941 17630 17842 17627 17347 17396 17729 17895 17621 17147 16859
55258A6859k8L9m6k03m12n48m55k85l72o22m55L63J188J272P98N59P49P95M51
$$ 16859 16831 16870 16824 16621 16209 15661 15206 14921 14549 13927 13472 13835 15023 16295 17093 17652 18401 19196 19647
55239A9647K84O66R98N56l81r29q83p97r48r98p65n12l08K43J236K016J923J137
$$ 19647 19931 20597 21595 22151 21770 20841 19958 19161 18213 17215 16450 15938 15630 15873 17109 19125 21048 22185
55221B2185L42j64n60r12r76o38k07j14m11o93n62j37J16J03L27J025J488Q71
$$ 22185 22527 22363 21803 20891 19915 19277 19070 18956 18545 17852 17290 17153 17269 17372 17699 18724 20212 21083
55203B1083m54j184p80j29j58o14p13l48K1K53N49Q48Q73O46M07K23J23L74R89
$$ 21083 20629 19445 18665 18536 18378 17764 17051 16703 16724 16977 17526 18374 19247 19893 20300 20523 20646 21020 22009
55184B2009J209L33j068j584q00J83L23p3j66Q1R3j97l12j69k58p56j121q80k76
$$ 22009 23218 23551 22483 20899 20099 20282 20605 20532 20366 20447 20540 20343 20031 19862 19604 18848 17727 16847 16571
55165A6571J60M11Q96J703K370K413J835R87J65n11r55j093r23n48j22J37On13
$$ 16571 16731 17142 18038 19741 22111 24524 26359 27346 27511 27000 26045 24952 24029 23481 23359 23496 23502 22989
55147B2989j026j001l17N53J009R31O97N62L19k87r73j115o05q7r3k76R9J061
$$ 22989 21963 20962 20645 21198 22207 23138 23835 24397 24716 24429 23456 22341 21736 21649 21556 21280 21379 22440
55129B2440J895K135K013J805J313M13m30o92n52n40o74m50K64R07Q75J57p61
$$ 22440 24335 26470 28483 30288 31601 32014 31584 30892 30340 29800 29126 28676 28940 29847 30722 30879 30118
55112C0118j386j477j099m82J81P71J076Q67L60K34Q03J414J160K3j112j555j414
$$ 30118 28732 27255 26156 25674 25855 26626 27702 28569 28929 29163 29966 31380 32540 32563 31451 29896 28482
55095B8482j186j204j473j697j484q59m09n41q19o17j30l8k94j18P04J447J509
$$ 28482 27296 26092 24619 22922 21438 20579 20170 19629 18810 18193 18063 18025 17731 17613 18317 19764 21273
55078B1273J098O03P6l49l11J21K79j55p12r96j211j414j075o8P25O10K30N85
$$ 21273 22371 22974 23050 22701 22390 22511 22790 22635 21923 20927 19716 18302 17227 17159 17884 18494 18724 19309
55060A9309J434J685J039K24k00l11j59L86J069J290Q63J33o15j173j002J90J504
$$ 19309 20743 22428 23467 23691 23491 23180 23021 23407 24476 25766 26629 26762 26147 24974 23972 24162 25666
55043B5666J521K41p17k79O58P09N0n0P10J163M21q95j460r13j55j07n12k58J135
$$ 25666 27187 27428 26711 26432 27090 27799 27849 27799 28509 29672 30093 29198 27738 26825 26670 26563 26051 25793 26928
55024B6928K695K999J826L25m54o47q65j090q74l16k6j83l12j36jj92l80j82J50
$$ 26928 29623 32622 34448 34773 34319 33672 32807 31717 30843 30527 30501 30318 30006 29870 29869 29677 29297 29115 29265
55005B9265J74R1N00J408K160K394K408K451K299J915J824K268K469J566m1j079
$$ 29265 29439 29530 30030 31438 33598 35992 38400 40851 43150 45065 46889 49157 51626 53192 53151 52072
54989E2072j051o90p11r08q13n04l03j91K6K91M38M85M98M17L32N82J180J558
$$ 52072 51021 50331 49620 48712 47899 47395 47092 46901 46927 47218 47656 48141 48639 49056 49388 49970 51150 52708
54971E2708J260O16L00L60K69j88o32o71l69l2K04L91N99P56O55J68m79p86m37
$$ 52708 53968 54584 54884 55244 55513 55325 54693 54022 53653 53621 53825 54216 54815 55571 56226 56394 55915 55129 54692
54952E4692M36J489K391K797K461J650J080J122J397J483J591K142L001L753M471
$$ 54692 55128 56617 59008 61805 64266 65916 66996 68118 69515 70998 72589 74731 77732 81485 85956
54937H5956N501O576O887O167N064M158L162J437j032l599n594o668o752o066
$$ 85956 91457 98033 104920 111087 116151 120309 123471 124908 123876 120277 114683 108015 101263 95197
54923I5197n230m880n083n260m911m191l571l063k246j130m89r00j721j687m35
$$ 95197 89967 85087 80004 74744 69833 65642 62071 59008 56762 55632 55143 54243 52522 50835 50400
54908E0400J141K067K281K273K345K542K819K950K665K191K233L085M214N043
$$ 50400 51541 53608 55889 58162 60507 63049 65868 68818 71483 73674 75907 78992 83206 88249
54894H8249N656O255O546O235N675N269M626L093Q51j317l165m988o612p369p146
$$ 88249 93905 100160 106706 112941 118616 123885 128511 131604 132455 131138 127973 122985 116373 109004 101858
54879A01858o654o352n859m757l400k530k526l253m304n052m924l899k496j147
$$ 101858 95204 88852 82993 78236 74836 72306 69780 66527 62223 57171 52247 48348 45852 44705
54865D4705J02J173J683J368M77m85j211j624j736j630j418j097o79m08n43q53
$$ 44705 44807 45980 47663 49031 49508 49023 47812 46188 44452 42822 41404 40307 39628 39220 38677 37824
54849C7824p35kP48Q06J06q12j396j440j008l49J23np59j512j363j17J208J384
$$ 37824 37089 37087 37835 38641 38747 37935 36539 35099 34091 33742 33865 33860 33101 31589 30226 30109 31317 32701
54831C2701N44J10Q38J645J118m53j480j283p68q38j170j001l27K12K81J14J26
$$ 32701 33245 33355 34193 35838 36956 36503 35023 33740 32972 32134 30964 29963 29636 29848 30129 30243 30369
54814C0369N11J113J525J469J103Q22Q18J074J508J845J577O28k16j73M13N54
$$ 30369 30880 31993 33518 34987 36090 36912 37730 38804 40312 42157 43734 44362 44146 43973 44386 44940
54798D4940Q3j58L65J262K056K772L465L956M303M798N271N147M548M408N154
$$ 44940 45023 44865 45230 46492 48548 51320 54785 58741 63044 67842 73113 78260 82808 87216 92370
54783I2370O046O390O536P035P517P195N968M277K315R6k021l529m269m272l520
$$ 92370 98416 104806 111342 118377 125894 133089 139057 143334 145649 145745 143724 140195 135926 131654 128134
54768A28134k343j593j697j911j173N08K115K898L054L238L886M830N276M426
$$ 128134 125791 124198 122501 120590 119417 119925 122040 124938 127992 131230 135116 139946 145222 149648
54754A49648K485O57k17n84j294k343l126l518l843m078l848l141k347j653r34
$$ 149648 152133 152790 152573 151989 150695 148352 145226 141708 137865 133787 129939 126798 124451 122798 121864
54739A21864j18Q26K008L228L719K871J026j009k893m623n825o048n605n320n427
$$ 121864 121746 122572 124580 127808 131527 134398 135424 134415 131522 126899 121074 115026 109421 104101 98674
54724I8674n468n154m675m147l534l054k947k868k307j563j429j898k074j550
$$ 98674 93206 88052 83377 79230 75696 72642 69695 66827 64520 62957 61528 59630 57556 56006
54710E6006q91n20r1O09J000O02q3k37J64M96M06Q3j13J05Q06J656K081J858J246
$$ 56006 55115 54595 54504 55113 56113 56715 56632 56395 56559 57055 57461 57544 57431 57536 58342 59998 62079 63937 65183
54691F5183M62m42j093p90N14J839K197J661R53N28N12J070K053K623K048P57
$$ 65183 65645 65203 64110 63320 63834 65673 67870 69531 70484 71012 71524 72594 74647 77270 79318 80075
54675H0075o6L8M06L59L0j16mJ72L62N64N90L56K21O82J717K796L549M122M827
$$ 80075 80009 80047 80453 80812 80842 80726 80722 80894 81256 81820 82410 82766 82987 83669 85386 88182 91731 95853 100680
54656A00680N700O545P234P687P837P865Q352R680J1394J2589J2924J2739J2049
$$ 100680 106380 112925 120159 127846 135683 143548 151900 161580 172974 185563 198487 211226 223275
54643B23275J0215P022L382K48k650o110r787j2278j2884j2360j1681j0925r760
$$ 223275 233490 240512 243894 244142 241492 235382 225595 213317 200433 188073 176392 165467 155707
54630A55707q286o875n662m667m045l845l815l757l685l424k581j273l76m98j096
$$ 155707 147421 140546 134884 130217 126172 122327 118512 114755 111070 107646 105065 103792 103416 102918 101822
54615A01822j195o91l19n02r24j127j026o81j27M66P98Q24Q59J197J723J982J618
$$ 101822 100627 99936 99617 99115 98191 97064 96038 95357 95230 95696 96494 97318 98177 99374 101097 103079 104697
54598A04697P86J03oJ52q7p30r49j47J298K624L534L970L640K495J330J019J378
$$ 104697 105483 105586 105580 105732 105645 104915 103966 103819 105117 107741 111275 115245 118885 121380 122710 123729 125107
54581A25107J539J302J160J085M53o64j213p07j1L3j23K85R05Q97M07K64M76K52
$$ 125107 126646 127948 129108 130193 130646 129982 128769 128062 128051 128084 127961 128246 129151 130048 130455 130719 131195 131447
54563A31447n35j013o55P9O77J190J531J154M4q03n41M11J173J660K263K775K637
$$ 131447 130912 129899 129244 129323 130000 131190 132721 133875 133919 133116 132575 132986 134159 135819 138082 140857 143494
54546A43494K049J797K109K542L005L946N325O297O353N980N789N598M919L804
$$ 143494 145543 147340 149449 151991 154996 158942 164267 170564 176917 182897 188686 194284 199203 203007
54532B03007K695J790J084N52p6j391l483n401o020n358m429m000l927l679k980
$$ 203007 205702 207492 208576 209128 209052 207661 204178 198777 192757 187399 182970 178970 175043 171364 168384
54517A68384j944j016p38j194j738j634q89m8O22J208J591J476J061J022J609
$$ 168384 166440 165424 164686 163492 161754 160120 159231 159183 159805 161013 162604 164080 165141 166163 167772
54502A67772K277K501K456K617L029L371L448L297K917K223J226J22p74j167r86
$$ 167772 170049 172550 175006 177623 180652 184023 187471 190768 193685 195908 197134 197256 196482 195315 194329
54487A94329m95p9M7j06m35p49p96n14j94q8m1K03N19N95M64L44J79j77m34j90
$$ 194329 193834 193755 193802 193696 193261 192512 191716 191202 191008 190920 190879 191082 191601 192196 192660 193004 193183 193006 192572 192382
54467A92382L10M64K82K69L59j20j174j881j772j571j871k091j499n19p9k24m00
$$ 192382 192692 193156 193438 193707 194066 193946 192772 190891 189119 187548 185677 183586 182087 181568 181489 181265 180865
54450A80865o25j308k131k233j522q10n48k87L40R15R00L69j97m73l99j46j74
$$ 180865 180240 178932 176801 174568 173046 172236 171688 171401 171741 172656 173556 173925 173728 173255 172856 172710 172536
54433A72536q45j851k420k269j869j646j458j130r73j250j587j401q24o10j097
$$ 172536 171691 169840 167420 165151 163282 161636 160178 159048 158075 156825 155238 153837 153013 152403 151306
54418A51306j625j250J57J722K541K579K449K425K177J536R49P74O23rp72q89
$$ 151306 149681 148431 148588 150310 152851 155430 157879 160304 162481 164017 164966 165740 166363 166354 165582 164693
54402A64693l96j34m69q90j038j283j839k088j432l89p3q08j751j920j141r8L19
$$ 164693 164297 164163 163694 162804 161766 160483 158644 156556 155124 154735 154662 153854 152103 150183 149042 148944 149263
54385A49263j59q70r24l42q6p34j581j580p27O7K30j9l26n89o92m79j78l21j050
$$ 149263 149104 148234 147310 146968 146882 146148 144567 142987 142260 142327 142557 142538 142212 141623 140931 140452 140274 139953 138903
54366A38903j921k558l019l302k982j794k19R07J230R90N09j8l57l40k15m77j134
$$ 138903 136982 134424 131405 128103 125121 123327 123108 124015 125245 126235 126744 126726 126369 126029 125814 125337 124203
54349A24203j482q60N23J778K275K063J426M06j004k432l279l295k799k298k073
$$ 124203 122721 121861 122384 124162 126437 128500 129926 130332 129328 126896 123617 120322 117523 115225 113152
54334A13152k122k287k324k069j653j441j567j670j265l23O51J113R34L90j23
$$ 113152 111030 108743 106419 104350 102697 101256 99689 98019 96754 96431 97082 98195 99129 99519 99396
54319I9396l85m46m48m51m24l59k49j9K68K22n19j641k279k011j409j223j461
$$ 99396 99011 98565 98117 97666 97242 96883 96634 96615 96883 97105 96586 94945 92666 90655 89246 88023 86562
54302H6562j629j608j704j963k077j945j831j859j908k048k465k803k244o25R86
$$ 86562 84933 83325 81621 79658 77581 75636 73805 71946 70038 67990 65525 62722 60478 59853 60839
54287F0839J397O33l12p02n85k63J58N75P40M89j9l35LR93J929J942J055L08M80
$$ 60839 62236 62869 62557 61855 61270 61007 61165 61740 62480 62969 62950 62615 62618 63611 65540 67482 68537 68845 69325
54268F9325J081J161P51O95J159J267M88m53n02L90J425J986K062J869J613J459
$$ 69325 70406 71567 72318 73013 74172 75439 75927 75474 74972 75362 76787 78773 80835 82704 84317 85776
54252H5776J397J191Q07O28R08J211Q79k0p48r22r65j381j969k124j625r09n52
$$ 85776 87173 88364 89171 89799 90707 91918 92797 92777 92029 91107 90142 88761 86792 84668 83043 82134 81582
54235H1582o60p80l96M50J033O18o91j974k348j707o21L05P82P81L71k05n62m25
$$ 81582 80922 80142 79746 80196 81229 81847 81156 79182 76834 75127 74506 74811 75593 76374 76745 76540 75978 75553
54217G5553qJ15l24q66q01r6N03M38j6l11m15o04p58n03K9K29p1l05l2M14M77
$$ 75553 75545 75660 75336 74470 73669 73573 74076 74514 74498 74187 73772 73168 72410 71907 71936 72165 72094 71789 71757 72171 72648
54196G2648J06m63j212k072k471j850o30M5l52j143j424j113o77l04Q8K69j88
$$ 72648 72754 72291 71079 69007 66536 64686 64056 64101 63749 62606 61182 60069 59392 59088 59176 59445 59257
54179E9257j101j643j382r14j002j440j355n58R8p7o96r48p27n25m63j48N08R92
$$ 59257 58156 56513 55131 54217 53215 51775 50420 49862 49960 49883 49187 48239 47512 46987 46524 46376 46884 47876
54161D7876R33O29N23N19K74j77m50m00k20r6rQ0J66L16N74P53N61O8k87k14R4
$$ 47876 48809 49438 49961 50480 50754 50577 50127 49727 49507 49411 49402 49482 49648 49964 50538 51291 51852 51920 51633 51419 51513
54140E1513K87L58N42Q30Q93M75k35q00r83r21p79n04l2L74K99k31o39m83K7L39
$$ 51513 51800 52158 52700 53530 54423 54898 54663 53863 52880 51959 51180 50676 50644 51018 51317 51086 50447 49964 49991 50330
54120E0330K77N6k10n90r69j039q40q35j167j325r10m12n78j172j141j17R47J062
$$ 50330 50607 50663 50453 49863 48894 47855 47015 46180 45013 43688 42778 42366 41788 40616 39475 39358 40305 41367
54102D1367N88O61J504K086J512J74q14q70l52Q8J73J06K62P88J391J585J236
$$ 41367 41955 42616 44120 46206 47718 47892 47078 46208 45856 45944 46117 46223 46485 47273 48664 50249 51485
54085E1485O91K87m2m35o65m09J26L53J03j56n1J49K9k51j90K81O61O15M60P34
$$ 51485 52176 52463 52421 51986 51321 50912 51038 51391 51494 51338 51287 51436 51465 51214 51024 51305 51966 52581 53041 53775
54065E3775J440K063K182J884J527J285J098R30Q83J059J407J763J953J893J667
$$ 53775 55215 57278 59460 61344 62871 64156 65254 66184 67067 68126 69533 71296 73249 75142 76809
54050G6809J513J503J372Q89M38P49J846K753K615J797J331J550J903K034K184
$$ 76809 78322 79825 81197 82086 82524 83273 85119 87872 90487 92284 93615 95165 97068 99102 101286
54035A01286K461K498K233K338L261M297M331L324K330K112K306K138J418N75
$$ 101286 103747 106245 108478 110816 114077 118374 122705 126029 128359 130471 132777 134915 136333 136908
54021A36908K8j36j9K61N71P27N63K8p38j510k154k657k982l014k779k526k488
$$ 136908 136936 136800 136781 137042 137613 138340 138903 138931 138193 136683 134529 131872 128890 125876 123097 120571 118083
54004A18083k610k677k684k864l284l570l148j900m59K59j8o52r31r44j258j876
$$ 118083 115473 112796 110112 107248 103964 100394 97246 95346 94887 95146 95128 94476 93545 92601 91343 89467
53988H9467k129j737j329j530j972j807q80J48N94K72o24j513j497j78J533K120
$$ 89467 87338 85601 84272 82742 80770 78963 78083 78231 78825 79097 78473 76960 75463 75285 76818 78938
53972G8938J178j47o61m07j18l9J2o9n46j060q67P3R13J048Q49Q62Q66L84k31
$$ 78938 80116 79969 79308 78901 78783 78744 78756 78687 78141 77081 76214 76287 77200 78248 79097 79959 80825 81209 80978
53953H0978k3J179K364K601K115J675J494J300J221J745K822L746M110M301M697
$$ 80978 80955 82134 84498 87099 89214 90889 92383 93683 94904 96649 99471 103217 107327 111628 116325
53938A16325M955M534L619K977L021L423L580L166K299J403Q91Q29R79J202J546
$$ 116325 121280 125814 129433 132410 135431 138854 142434 145600 147899 149302 150193 151022 152001 153203 154749
53923A54749J883J902J606J449J610J688J482J613K629L912M325L750L150L114
$$ 154749 156632 158534 160140 161589 163199 164887 166369 167982 170611 174523 178848 182598 185748 188862
53909A88862L225K986K494J935J125P4o59o92m16m56q61j293j653k095k615l121
$$ 188862 192087 195073 197567 199502 200627 200701 200042 199350 198934 198478 197617 196324 194671 192576 189961 186840
53893A86840l612m043m231m212m373m836n035m450l500l124l531l976l768l038
$$ 186840 183228 179185 174954 170742 166369 161533 156498 152048 148548 145424 141893 137917 134149 131111
53879A31111k335j903j602j278r66q54j173j959k842l200k736j859j344j574k161
$$ 131111 128776 126873 125271 123993 123027 122173 121000 119041 116199 112999 110263 108404 107060 105486 103325
53864A03325k449k217j806j505j172o35j64j69n51p96o77m64m17n07p00j012j201
$$ 103325 100876 98659 96853 95348 94176 93541 93377 93208 92657 91861 91184 90720 90303 89796 89096 88084 86883
53847H6883q67j20M16M60M71P86R65M79l74q27o07j3O13R21M17q98k001j752l53
$$ 86883 86016 85896 86312 86772 87243 88029 88994 89473 89099 88272 87665 87652 88265 89186 89603 88705 86704 84952 84599
53828H4599Q76J126P65K63n44j705k424j826q6J684K523K248J360O93R12J892
$$ 84599 85475 86601 87366 87629 87085 85380 82956 81130 81044 82728 85251 87499 88859 89552 90464 92356
53812I2356K742K705K025J598J919K635L113L104K818K572K545K828L497M497
$$ 92356 95098 97803 99828 101426 103345 105980 109093 112197 115015 117587 120132 122960 126457 130954
53798A30954N378N463M539L201K256J816J408Q78O01P15P18J83o10j134j329j423
$$ 130954 136332 141795 146334 149535 151791 153607 155015 155893 156494 157209 157927 158110 157500 156366 155037 153614
53782A53614j387j099q30j029j622k002j787j176n62j54n3l14p38j010j147j592
$$ 153614 152227 151128 150298 149269 147647 145645 143858 142682 142120 141966 141913 141599 140861 139851 138704 137112
53766A37112k557l463l416k265r37n16j099j775j752j174o61m04k11k25q70j826
$$ 137112 134555 131092 127676 125411 124474 123958 122859 121084 119332 118158 117497 117093 116882 116657 115787 113961
53750A13961j988q25O56J097M40k99o18r16j387j583j351j239j518j521o94L19
$$ 113961 111973 111148 111804 112901 113341 113042 112424 111508 110121 108538 107187 105948 104430 102909 102215 102534
53734A02534M02n24j415j436p41K7M13K67k85q22r01n01l7J67J74K23M72R86J744
$$ 102534 102936 102412 100997 99561 98820 98847 99260 99527 99242 98420 97519 97018 96981 97148 97322 97545 98017 99003 100747
53715A00747K541L037K987K357J278O4q28j059p19j47M84J228K077K855L414L738
$$ 100747 103288 106325 109312 111669 112947 113011 112183 111124 110405 110258 110742 111970 114047 116902 120316 124054
53699A24054L859L850L820L714L239K310J428J195J522J742J553J324J488K021
$$ 124054 127913 131763 135583 139297 142536 144846 146274 147469 148991 150733 152286 153610 155098 157119
53685A57119K728L481L927L546K352J198R25J467K175K639K861K874K642K214
$$ 157119 159847 163328 167255 170801 173153 174351 175276 176743 178918 181557 184418 187292 189934 192148
53671A92148J626Q58J72R1O44R96M48m33m34O66J783J939J329P77P14J044J460
$$ 192148 193774 194632 194804 194895 195539 196535 196983 196550 196116 196782 198565 200504 201833 202610 203324 204368 205828
53654B05828J606J201L68l74o96q49j215j720j906j558r69o28p02r50j093j271
$$ 205828 207434 208635 209003 208629 207933 207084 205869 204149 202243 200685 199716 199088 198386 197436 196343 195072
53638A95072j833k688l161k763j758p26R5N70L21o14j173l62J158J693Q27q1m0
$$ 195072 193239 190551 187390 184627 182869 182143 182238 182808 183129 182515 181342 180980 182138 183831 184658 184577 184537
53621A84537K75K1k36L44J197J198O86J065K570L820L796L042K554K496K550K653
$$ 184537 184812 184833 184597 184941 186138 187336 188022 189087 191657 195477 199273 202315 204869 207365 209915 212568
53605B12568K852L053L329L935M603M508L430K304K107K678L221L421L405L063
$$ 212568 215420 218473 221802 225737 230340 234848 238278 240582 242689 245367 248588 252009 255414 258477
53591B58477K309J744K072K946L265K715K088J924J687Q24j65m38o1K25K26M18
$$ 258477 260786 262530 264602 267548 270813 273528 275616 277540 279227 280051 279886 279448 279387 279612 279838 280256
53575B80256Q80R60J53j190k368l010l017k337j194k56j18p23j538k146k276j732
$$ 280256 281136 282096 282249 281059 278691 275681 272664 270327 269133 268877 268759 268036 266498 264352 262076 260344
53559B60344o52K90N29L27L41N81N04J7k63l7K38J93J67M75P23M86J72M66J252
$$ 260344 259692 259982 260511 260838 261179 261760 262264 262281 262018 261981 262219 262412 262579 263054 263777 264263 264435 264901 266153
53540B66153J834K018K209K531K660K593K809L461M044M149M031M137M568N165
$$ 266153 267987 270005 272214 274745 277405 279998 282807 286268 290312 294461 298492 302629 307197 312362
53526C12362N790O250O435O697P665R309J0749J1290J1324J1740J2772J3925J4771
$$ 312362 318152 324402 330837 337534 345199 354508 365257 376547 387871 399611 412383 426308 441079
53513D41079J5323J5722J5986J6077J6033J6067J6653J8219K0486K2531K3804
$$ 441079 456402 472124 488110 504187 520220 536287 552940 571159 591645 614176 637980
53502F37980K4821K6300K8020K9076K9128K8677K8196K7664K7093K6825K7074
$$ 637980 662801 689101 717121 746197 775325 804002 832198 859862 886955 913780 940854
53491I40854K7680K8546K9845L1522L3079L4104L4706L5114L5249L5009L4581
$$ 940854 968534 997080 1026925 1058447 1091526 1125630 1160336 1195450 1230699 1265708 1300289
53480A300289L4047L2967L0851K7827K4555K1638J9397J7990J7288J6913J6745
$$ 1300289 1334336 1367303 1398154 1425981 1450536 1472174 1491571 1509561 1526849 1543762 1560507
53469A560507J7181J8438J9833K0365J9835J8796J7513J5707J3369J0944Q505
$$ 1560507 1577688 1596126 1615959 1636324 1656159 1674955 1692468 1708175 1721544 1732488 1740993
53458A740993N437J424k875o609r733j2683j5511j7867j9623k0991k2238k3684
$$ 1740993 1746430 1747854 1744979 1738370 1728637 1715954 1700443 1682576 1662953 1641962 1619724 1596040
53446A596040k5709k8215l0386l1539l2050l2680l3261l2832l1246k9706k9344
$$ 1596040 1570331 1542116 1511730 1480191 1448141 1415461 1382200 1349368 1318122 1288416 1259072
53435A259072k9858l0125k9632k8741k7816k6693k5032k2775k0176j7576j5198
$$ 1259072 1229214 1199089 1169457 1140716 1112900 1086207 1061175 1038400 1018224 1000648 985450
53424I85450j3031j0913q744o557m305j778J117M045O518Q458J0422J3023J6142
$$ 985450 972419 961506 952762 946205 941900 940122 941239 945284 951802 960260 970682 983705 999847
53411I99847J8923K0727K1926K3402K5321K6986K8008K8929L0247L1575L2450
$$ 999847 1018770 1039497 1061423 1084825 1110146 1137132 1165140 1194069 1224316 1255891 1288341
53400A288341L3486L5545L8173M0058M1050M2451M5050M8145N1054N4308N8401
$$ 1288341 1321827 1357372 1395545 1435603 1476653 1519104 1564154 1612299 1663353 1717661 1776062
53389A776062O2413O5068O6550O8007O9680P0795P1146P1600P2784P4237P5126
$$ 1776062 1838475 1903543 1970093 2038100 2107780 2178575 2249721 2321321 2394105 2468342 2543468
53378B543468P5096P4191P2540P0365O7795O4551O0355N5701N1670M8844M6829
$$ 2543468 2618564 2692755 2765295 2835660 2903455 2968006 3028361 3084062 3135732 3184576 3231405
53367C231405M4976M3006M0883L8631L6480L4615L2564K9283K4065J6896P846
$$ 3231405 3276381 3319387 3360270 3398901 3435381 3469996 3502560 3531843 3555908 3572804 3580650
53356C580650l287j6328l0241m3665n5676o5776p3651p9272q3007q5219q6051
$$ 3580650 3577363 3561035 3530794 3487129 3431453 3365677 3292026 3212754 3129747 3044528 2958477
53345B958477q5816q5278q5081q5052q4422q2729q0296p7939p6327p5543p5129
$$ 2958477 2872661 2787383 2702302 2617250 2532828 2450099 2369803 2291864 2215537 2139994 2064865
53334B064865p4574p3677p2368p0384o7558o4271o1125n8095n4606n0491m6256
$$ 2064865 1990291 1916614 1844246 1773862 1706304 1642033 1580908 1522813 1468207 1417716 1371460
53323A371460m2213l7998l3307k8555k4342k0749j7562j4778j2446j0439q841
$$ 1371460 1329247 1291249 1257942 1229387 1205045 1184296 1166734 1151956 1139510 1129071 1120230
53312A120230q092q168q156p251n845m860m303l388j900m52P34K285M481O502
$$ 1120230 1112138 1103970 1095814 1088563 1082718 1077858 1073555 1070167 1068267 1067815 1068549 1070834 1075315 1081817
53298A081817P439P587Q072R459J1304J2993J4490J6172J8286K0668K2869K4481
$$ 1081817 1089256 1096843 1104915 1114374 1125678 1138671 1153161 1169333 1187619 1208287 1231156 1255637
53286A255637K5534K6531K7992K9875L1615L2719L3231L3552L3926L4256L4301
$$ 1255637 1281171 1307702 1335694 1365569 1397184 1429903 1463134 1496686 1530612 1564868 1599169
53275A599169L3900L3032L1810L0476K9271K8261K7388K6638K5879K4629K2304
$$ 1599169 1633069 1666101 1697911 1728387 1757658 1785919 1813307 1839945 1865824 1890453 1912757
53264A912757J8921J5142J1370P223K244l218q486j3526j8797k4226k9185l3478
$$ 1912757 1931678 1946820 1958190 1965413 1967657 1964439 1955953 1942427 1923630 1899404 1870219 1836741
53252A836741l7479m1222m4189m6291m8156n0001n1131n1074n0429m9762m8455
$$ 1836741 1799262 1758040 1713851 1667560 1619404 1569403 1518272 1467198 1416769 1367007 1318552
53241A318552m5692m2046l8975l6952l5240l3524l2646l3335l5080l6715l7607
$$ 1318552 1272860 1230814 1191839 1154887 1119647 1086123 1053477 1020142 985062 948347 910740
53230I10740l7841l7704l7313l6587l5255l3105l0308k7286k4227k1022j7665
$$ 910740 872899 835195 797882 761295 726040 692935 662627 635341 611114 590092 572427
53219E72427j4436j1647r539q398q335q865r142q774q120p730p781q167q732r282
$$ 572427 557991 546344 536805 528407 520072 511207 502065 493291 485171 477441 469660 461493 452761 443479
53205D43479r666r945j0251j0415j0100r357q646q252q068q091q537r262r530
$$ 443479 433813 423868 413617 403202 393102 383745 375099 366847 358779 350688 342151 332889 323359
53192C23359q836p612o730o523o669o845p047p326p588p645p369o794o212n969
$$ 323359 314523 306911 300181 293658 286989 280144 273097 265771 258183 250538 243169 236375 230163 224194
53178B24194o005n808n013l889k993k559k388k199j815j183n42l75q59j483j605
$$ 224194 218189 212381 207368 203479 200486 197927 195539 193340 191525 190342 189800 189425 188566 187083 185478
53163A85478j321j264j609j768j344q90j234k295l067k795j773q26l48j00J74
$$ 185478 184157 182893 181284 179516 178172 177282 176048 173753 170686 167891 166118 165292 164944 164844 165018
53148A65018L28O4n78j182j414j344j268j264j059n02M8Jo76j282j156m86JMj23
$$ 165018 165346 165410 164832 163650 162236 160892 159624 158360 157301 156799 156847 156848 156172 154890 153734 153248 153249 153253 153130
53129A53130m9N0j27n20q82j106j169j050q91r30j058p33K29J143J182M01m89
$$ 153130 153081 153131 153004 152484 151602 150496 149327 148277 147386 146456 145398 144665 144894 146037 147219 147620 147131
53112A47131j128j675k130k148j671j178j087j355j753k151k376k229j806j446
$$ 147131 146003 144328 142198 140050 138379 137201 136114 134759 133006 130855 128479 126250 124444 122998
53098A22998j251j049q79j004j278j150n39j06k59m55q1N00M95j04o36r06j333
$$ 122998 121747 120698 119819 118815 117537 116387 115848 115742 115483 115028 114947 115447 115942 115838 115202 114296 112963
53081A12963j902j807n87R89J650J011j59q99r48o54l70j11K62O95R67J000R72
$$ 112963 111061 109254 108667 109656 111306 112317 112158 111259 110311 109657 109287 109176 109438 110133 111100 112100 113072
53064A13072R87Q28K43n41r55p66m06m21q04j034p94l49j63k85l70k18n0j90o31
$$ 113072 114059 114887 115130 114589 113634 112868 112462 112041 111237 110203 109409 109060 108897 108612 108242 108024 107974 107784 107153
53045A07153j095j340j237p27N7O75P65N29N05Q08R47N35j72o47p43o40m40j67
$$ 107153 106058 104718 103481 102754 102811 103486 104251 104780 105285 106093 107040 107575 107403 106756 106013 105373 104933 104766
53027A04766j1j50m26n37n71r20j556j829j259k60K67k4o08p77l75K34O43P06
$$ 104766 104755 104605 104179 103642 103071 102151 100595 98766 97507 97247 97514 97490 96882 96105 95730 95964 96607 97313
53009I7313N39L79L69L21o1o45p65K2J232J926J799J347J021P40M24L68P49J250
$$ 97313 97852 98231 98600 98921 98860 98215 97450 97472 98704 100630 102429 103776 104797 105537 105961 106329 107078 108328
52991A08328J512J576J531J122K83m28m88j72q0j99j44k7k42n85m77PK61L02P36
$$ 108328 109840 111416 112947 114069 114352 113924 113436 113264 113184 112985 112841 112814 112572 111987 111510 111517 111778 112080 112816
52972A12816J463J497N55k25J69J191J588J064L17m0P9N09Q28M88m68j183j001
$$ 112816 114279 115776 116331 116106 116275 117466 119054 120118 120435 120395 120474 120983 121811 122299 121831 120648 119647
52955A19647l39O5K37N93R51Q32M29L52O06O59M29L11L33J09k81l03RJ4l89m03
$$ 119647 119308 119373 119610 120203 121154 121986 122415 122767 123373 124032 124461 124772 125105 125214 124933 124630 124639 124653 124264 123861
52935A23861M33J466J817J445Q27K41j49LP44J418J303N45p8j26J82M88O29N52
$$ 123861 124294 125760 127577 129022 129849 130090 129941 129944 130688 132106 133409 133954 133876 133750 133932 134420 135049 135601
52917A35601K48j33l67l51p5M90J229J711J507P54R6PL31O30P32P82Q72R27R30
$$ 135601 135849 135716 135349 134998 134923 135413 136642 138353 139860 140614 140710 140717 141048 141678 142410 143192 144064 144991 145921
52898A45921R43P76N6j107j809j272O4R59Q59L83J52ml22m16k5K14l65j258j420
$$ 145921 146864 147640 147696 146589 144780 143508 143572 144531 145390 145773 145925 145921 145599 145183 145158 145372 145007 143749 142329
52879A42329q50n04o71o05O5O50N94L91P27J375J660J426R58L73k11l52K34J026
$$ 142329 141479 140975 140304 139699 139764 140414 141008 141399 142126 143501 145161 146587 147545 147918 147707 147355 147589 148615
52861A48615J227Q54O81J075J402P90q19k548l427l328k975l032l275l023k272
$$ 148615 149842 150696 151377 152452 153854 154644 153825 151277 147850 144522 141547 138515 135240 132217 129945
52846A29945j767j831j795j095k90l30j126j627j186j82O77J009O76k68j361j937
$$ 129945 128178 126347 124552 123457 123167 122837 121711 120084 118898 118716 119393 120402 121078 120810 119449 117512
52830A17512j776j239o35O4P31Q41J31r25j624j754j442p04L24R23M02q40j544
$$ 117512 115736 114497 113862 113926 114657 115498 115629 114704 113080 111326 109884 109180 109504 110427 110829 109989 108445
52813A08445j106l26j80m96m68n8j3n83j089r83o15m98m84k57j36o51j559j907
$$ 108445 107339 107013 106833 106337 105869 105811 105798 105215 104126 103143 102528 102030 101546 101289 101153 100502 98943 97036
52795I7036j178J11R34O51n21j581j525l99O50P75L82K10L2p56j662j510l47M13
$$ 97036 95858 95969 96903 97554 97033 95452 93927 93528 94178 94953 95335 95545 95577 94821 93159 91649 91302 91715
52777I1715P1l72P8Q58Q45J9p60j054r73n32K08P45P03N38Q90J536J693J113J92
$$ 91715 91786 91414 91492 92350 93195 93214 92454 91400 90427 89895 90103 90848 91551 92089 92979 94515 96208 97321 97513
52758I7513p75j613j874j280m11j41m27n39l31m23j017j480j300p13j20M31R04
$$ 97513 96738 95125 93251 91971 91560 91419 90992 90453 90122 89699 88682 87202 85902 85189 85069 85500 86404
52741H6404J043P98M76K56M7q0J39O21R10Q92R96J447J927K136K149K055J729
$$ 86404 87447 88245 88721 88977 89024 88944 89083 89704 90614 91506 92502 93949 95876 98012 100161 102216 103945
52724A03945J249Q99N97j07j173j845j660j017m48L3M45M22j60o92o53l80m35
$$ 103945 105194 106093 106690 106583 105410 103565 101905 100888 100440 100473 100918 101340 101180 100488 99835 99455 99020
52707I9020o45m89q0O0m9J32P21J221J232Q36K36m72j115j430j281o52L80J388
$$ 99020 98375 97886 97806 97866 97817 97949 98670 99891 101123 101959 102195 101723 100608 99178 97897 97245 97625 99013
52689I9013J627Q04l67q57m60K66R19J500J846J599Q67K97K61M25L41M7j47j50
$$ 99013 100640 101444 101077 100220 99760 100026 100945 102445 104291 105890 106757 107054 107315 107740 108081 108128 107981 107831
52671A07831j63m42j047j626j525m78Q70J525J175L32m93j205j718j752j310q36
$$ 107831 107668 107226 106179 104553 103028 102550 103420 104945 106120 106452 105959 104754 103036 101284 99974 99138
52655I9138o45n49l57k35l41m26k03J76L56L18L14M54O54Q68J094J190R98O00
$$ 99138 98493 97944 97587 97352 97011 96585 96382 96558 96914 97232 97546 98000 98654 99522 100616 101806 102804 103404
52637A03404K87K70N89J189J919K474K474J748N67m42p88o23o03j002j240p25
$$ 103404 103691 103961 104550 105739 107658 110132 112606 114354 114921 114479 113691 113068 112465 111463 110223 109498
52621A09498J16K91k90n86J4P35N71j84m02K10Q04O99K01j07j93l31n21n90n83
$$ 109498 109614 109905 109615 109029 109043 109778 110349 110165 109763 109973 110777 111476 111677 111570 111377 111046 110525 109935 109352
52602A09352o89q70r44r03r04q89n38K74J129J382Q30p3p28r68r97q90m39L99
$$ 109352 108663 107793 106849 105946 105042 104153 103615 103889 105018 106400 107230 107157 106429 105461 104464 103574 103135 103534
52584A03534J199J419R77L30O0M12J078J362P32n19j396j221m10M2k45o70m69
$$ 103534 104733 106152 107129 107459 107519 107931 109009 110371 111103 110584 109188 107967 107557 107599 107354 106684 106215
52567A06215M50J554K179J900P21p74j713j665j049o33p49j151j554j891k015
$$ 106215 106665 108219 110398 112298 113019 112245 110532 108867 107818 107185 106436 105285 103731 101840 99825
52552I9825j601o50J75K02l26m74J72Q85Q30J87j74L8K91K54K75N50N25l01j358
$$ 99825 98224 97574 97749 97951 97625 97151 97323 98208 99038 99225 99051 99089 99380 99634 99909 100459 100984 100683 99325
52533I9325j547o96K21L53l8j61K69Q99J346J507J352Q34Q5m61l98K30R30J207
$$ 99325 97778 97082 97303 97656 97618 97457 97726 98625 99971 101478 102830 103664 103749 103288 102890 103120 104050 105257
52515A05257R99N95K11j75n53p03m27J12M88L93j59q92j390j330p71k09j32m61
$$ 105257 106256 106851 107062 106887 106334 105631 105204 105316 105804 106197 106038 105146 103756 102426 101655 101446 101314 100853
52497A00853o07r2R18J707J631P62o5l5P47J377J205M75k31p25j025q78m8J012
$$ 100853 100246 100154 101072 102779 104410 105172 105107 105072 105819 107196 108401 108876 108645 107920 106895 106017 105969 106981
52479A06981J467J091M53J04R0L21Q33J400J436O19o10j497j643j117k08O53J056
$$ 106981 108448 109539 109992 110096 110186 110507 111340 112740 114176 114795 114185 112688 111045 109928 109720 110373 111429
52462A11429R67P10M65M8n96j051q85j90O12J226J500J291P29L45N18Q89P96J77
$$ 111429 112396 113106 113571 113619 113023 111972 111087 110897 111509 112735 114235 115526 116255 116600 117118 118007 118803 118980
52444A18980l36k97lm8n83j172j345j119r12r08p23m4P07Q22M45N04J299J880
$$ 118980 118644 118347 118344 118296 117713 116541 115196 114077 113165 112257 111534 111490 112197 113019 113464 113968 115267 117147
52426A17147J390L33k00q6k9k17j74J52J67k27k88L78J047P98k76j301j618j143
$$ 117147 118537 118870 118670 118584 118555 118338 118164 118316 118483 118256 117968 118346 119393 120191 119915 118614 116996 115853
52408A15853k01O10O75K6n38l42L93R90J169J014M53n79j631k009j596r12l58
$$ 115853 115652 116262 116937 116963 116425 116083 116476 117466 118635 119649 120102 119523 117892 115883 114287 113375 113017
52391A13017J04M68M53K7k98l7O10J042J021Q45P77O59J91n61j121j047l42N70
$$ 113017 113121 113589 114042 114069 113771 113734 114344 115386 116407 117252 118029 118688 118879 118318 117197 116150 115808 116378
52373A16378J233J414J094M27k16l88L3O13Q08N65L02K68L01K22J80L31M43K16
$$ 116378 117611 119025 120119 120546 120330 119942 119975 120588 121396 121961 122263 122531 122832 123054 123234 123565 124008 124224
52355A24224j10R7J014K000K342K068J793J867K047J941J516J071R13J140J618
$$ 124224 124114 124211 125225 127225 129567 131635 133428 135295 137342 139283 140799 141870 142783 143923 145541
52340A45541K057K161J793J028R6o47q42m06L42J002J494J973K440K721K826K961
$$ 145541 147598 149759 151552 152580 152676 152029 151187 150781 151123 152125 153619 155592 158032 160753 163579 166540
52324A66540L173L361L643M271N041N359N156N190O063P312Q036Q047P841P764
$$ 166540 169713 173074 176717 180988 186029 191388 196544 201734 207797 215109 223145 231192 239033 246797
52310B46797P821Q133Q853R760J0468J1042J1794J2603J3036J3087J3075J2903
$$ 246797 254618 262751 271604 281364 291832 302874 314668 327271 340307 353394 366469 379372
52298C79372J2251J1489J1462J2137J2423J1753J0894J0667J0688J0187R309Q707
$$ 379372 391623 403112 414574 426711 439134 450887 461781 472448 483136 493323 502632 511339
52286E11339Q378P777O807N796M757L518K298J460P48l58j676k525k817l126l622
$$ 511339 519717 527494 534301 540097 544854 548372 550670 552130 552878 552520 550844 548319 545502 542376 538754
52271E38754l837l605l416l529l537l136k648k397k183j713j001k5J368K842L621
$$ 538754 534917 531312 527896 524367 520830 517694 515046 512649 510466 508753 507752 507727 509095 511937 515558
52256E15558L652M016N459P183P942P822P897Q507R046R378J0210J1706J2796
$$ 515558 519210 523226 528685 535868 543810 551632 559529 568036 577082 586460 596670 608376 621172
52243F21172J2497J1149R721Q510P262O066N292M796L998K782J662R01Q6j193
$$ 621172 633669 644818 654539 663049 670311 676377 681669 686465 690463 693245 694907 695808 695894 694701
52229F94701k745m198n547o837p683p716p443p896r299j0626j0846j0188r677
$$ 694701 691956 687758 682211 675374 667691 659975 652532 644636 635337 624711 613865 603677 594000
52216E94000r715r754r371q951r023r378r321q557p353o055m835m012l922m345
$$ 594000 584285 574531 565160 556209 547186 537808 528487 519930 512577 506522 501687 497675 493753 489408
52202D89408m393l423j854p20n41q97j054o82P0Q75J391J362Q17J39k53k10J49
$$ 489408 485015 481592 479738 479018 478477 477580 476526 475844 475914 476789 478180 479542 480359 480498 480245 480035 480184
52185D80184O10R13P96K12n53j128j431j561j465r59j34N36O15J21o34j386j973
$$ 480184 480794 481707 482503 482715 482162 481034 479603 478042 476577 475618 475484 476020 476635 476756 476122 474736 472763
52168D72763k207k010j629j525j910k523k917k923k749k661k692k673k559k518
$$ 472763 470556 468546 466917 465392 463482 460959 458042 455119 452370 449709 447017 444344 441785 439267
52154D39267k743l230l836m422m809m728m068l133k412k013j611j020n47n53q67
$$ 439267 436524 433294 429458 425036 420227 415499 411431 408298 405886 403873 402262 401242 400695 400142 399275
52139C99275q89k62P47J510J593J018J24p95j603k082j807o16Q92J802J902J843
$$ 399275 398386 398124 398871 400381 401974 402992 403116 402321 400718 398636 396829 396213 397105 398907 400809 402652
52123D02652K089K280K062K017K964M576N570N438N213O137Q086R816J0478J0340
$$ 402652 404741 407021 409083 411100 414064 418640 424210 429648 434861 440998 449084 458900 469378 479718
52109D79718J0172J0391J0941J1649J2444J3254J3913J4275J4433J4636J4968
$$ 479718 489890 500281 511222 522871 535315 548569 562482 576757 591190 605826 620794
52098F20794J5206J5094J4612J3841J2828J1793J1166J1042J0728R420P225N009
$$ 620794 636000 651094 665706 679547 692375 704168 715334 726376 737104 746524 753749 758758
52086G58758L239J592j70j648k548l265m281n383o129o634p289p996q361q416
$$ 758758 761997 763589 763419 761771 759223 755958 751677 746294 740165 733531 726242 718246 709885 701469
52072G01469q475q332p523o294n595n747n889n137l732k556j926j405n45O55J917
$$ 701469 692994 684662 677139 670845 665250 659503 653614 648477 644745 642189 640263 638858 638313 638968 640885
52057F40885K968L738M487N572O949Q078Q587Q751R065R593J0046J0266J0228
$$ 640885 643853 647591 652078 657650 664599 672677 681264 690015 699080 708673 718719 728985 739213
52044G39213R787Q877P833P076O528N766M688L583K562J408L2j346k620l943n317
$$ 739213 749000 757877 765710 772786 779314 785080 789768 793351 795913 797321 797353 796007 793387 789444 784127
52029G84127o438p132p617q200q971r975j1319j2898j4316j5213j5482j5134j4362
$$ 784127 777689 770557 762940 754740 745769 735794 724475 711577 697261 682048 666566 651432 637070
52016F37070j3830j4251j5388j6079j5669j4852j4545j4483j3769j2412j1401
$$ 637070 623240 608989 593601 577522 561853 547001 532456 517973 504204 491792 480391
52005D80391j1282j1525j1466j1108j0767j0528j0311j0041r478q401p196o758
$$ 480391 469109 457584 446118 435010 424243 413715 403404 393363 383885 375484 368288 361530
51993C61530p474q660r293r002q112p093o301n943n915n829n465n003m582m007
$$ 361530 354056 345396 336103 327101 318989 311896 305595 299652 293737 287908 282443 277440 272858 268851
51979B68851l176k504k493l021l512l751m052m629n107m930m067l135k790l073
$$ 268851 265675 263171 260678 257657 254145 250394 246342 241713 236606 231676 227609 224474 221684 218611
$$ [...]
##END NTUPLES=NMR SPECTRUM
##END=
