##TITLE=NES1085_IP2_9884916_xXUE9NG3Dy
##JCAMPDX= 6.0         $$ Bruker NMR JCAMP-DX V2.0
##DATA TYPE= NMR SPECTRUM
##DATA CLASS= NTUPLES
##ORIGIN= BRUKER
##OWNER= Administrator
$$ 1.72 TOPSPIN		Version 2.1
$$ 2016-08-27 15:22:28.242 -0500  Administrator@X
$$ Compression mode = diff/dup
##.OBSERVE FREQUENCY= 400.02188249412
##.OBSERVE NUCLEUS= ^1H
##.ACQUISITION MODE= SIMULTANEOUS (DQD)
##.ACQUISITION SCHEME= undefined
##.AVERAGES= 8
##.DIGITISER RES= 22
##SPECTROMETER/DATA SYSTEM= spect
##.PULSE SEQUENCE= zg30
##.SOLVENT NAME= COFFEE_meoh
##.SHIFT REFERENCE= INTERNAL, COFFEE_meoh, 1, 14.98509
##AUDIT TRAIL= $$ (NUMBER, WHEN, WHO, WHERE, PROCESS, VERSION, WHAT)
$$ ##TITLE= Audit trail, TOPSPIN		Version 2.1
$$ ##JCAMPDX= 5.01
$$ ##ORIGIN= Bruker BioSpin GmbH
$$ ##OWNER= Administrator
$$ $$ E:\/data/COFFEE/nmr/NES1085_IP2_9884916_xXUE9NG3Dy/20/pdata/1/auditp.txt
$$ ##AUDIT TRAIL=  $$ (NUMBER, WHEN, WHO, WHERE, PROCESS, VERSION, WHAT)
(   1,<2016-08-27 15:22:21.148 -0500>,<Administrator>,<X>,<go>,<TOPSPIN 2.1>,
      <created by zg
	started at 2016-08-27 15:21:14.648 -0500,
	POWCHK enabled, PULCHK disabled,
       configuration hash MD5:
       21 0F 79 D6 B3 7B B4 F6 88 20 88 DB 03 48 BD 9F
       data hash MD5: 64K
       D5 FB 7B 46 3F FA 24 7E AB A7 B3 6A 31 73 9E 39>)
(   2,<2016-08-27 15:22:24.226 -0500>,<Administrator>,<X>,<proc1d>,<TOPSPIN 2.1>,
      <Start of raw data processing
       efp LB = 0 FT_mod = 6 PKNL = 1 PHC0 = 0 PHC1 = 0 SI = 32K 
       data hash MD5: 32K
       D2 02 19 E9 29 DE C6 B9 14 B3 1E 0A C7 48 C7 2D>)
(   3,<2016-08-27 15:22:24.492 -0500>,<Administrator>,<X>,<proc1d>,<TOPSPIN 2.1>,
      <pk PHC0 = 97.58606 PHC1 = 0 
       data hash MD5: 32K
       35 D4 22 E2 29 1D 09 EF 91 39 34 E7 DF F7 0F 82>)
(   4,<2016-08-27 15:22:24.617 -0500>,<Administrator>,<X>,<proc1d>,<TOPSPIN 2.1>,
      <abs ABSG = 1 
       data hash MD5: 32K
       CD 67 6A 13 31 30 ED B6 F3 1F A7 63 BA E8 37 8D>)
(   5,<2016-08-27 15:22:24.664 -0500>,<Administrator>,<X>,<proc1d>,<TOPSPIN 2.1>,
      <abs ABSG = 2 
       data hash MD5: 32K
       A1 65 87 E9 46 10 FC BB 1F 03 5A B3 1C 43 6F 8D>)
(   6,<2016-08-27 15:22:24.726 -0500>,<Administrator>,<X>,<proc1d>,<TOPSPIN 2.1>,
      <abs ABSG = 3 
       data hash MD5: 32K
       BC 55 78 EE 0F 5B D1 C4 81 2E 07 62 2F 4E 86 10>)
(   7,<2016-08-27 15:22:24.773 -0500>,<Administrator>,<X>,<proc1d>,<TOPSPIN 2.1>,
      <abs ABSG = 4 
       data hash MD5: 32K
       45 DC 0F B9 0A 32 0E 14 AD 03 FC F2 93 4D CF BE>)
(   8,<2016-08-27 15:22:24.836 -0500>,<Administrator>,<X>,<proc1d>,<TOPSPIN 2.1>,
      <abs ABSG = 5 
       data hash MD5: 32K
       0B FD C0 A4 F5 23 4F 6B 68 48 91 8D DD 02 65 1C>)
$$ ##END=
$$ 
$$ $$ hash MD5
$$ $$ 03 F7 5A 29 26 92 81 08 8C 2A 07 74 F3 CA 8C 9B
##$RELAX= 
##$RELAX= 
##$RELAX= 
##$RELAX= 
##$RELAX= 
##$RELAX= 
##$RELAX= 
$$ Bruker specific parameters
$$ --------------------------
##$DU= <E:\>
##$EXPNO= 20
##$NAME= <NES1085_IP2_9884916_xXUE9NG3Dy>
##$PROCNO= 1
$$ [...]
150 150 150 150 150 150 150 150
##$TP07= 0
##$TPNAME0= <>
##$TPNAME1= <>
##$TPNAME2= <>
##$TPNAME3= <>
##$TPNAME4= <>
##$TPNAME5= <>
##$TPNAME6= <>
##$TPNAME7= <>
##$TPOAL= (0..7)
0.5 0.5 0.5 0.5 0.5 0.5 0.5 0.5
##$TPOFFS= (0..7)
0 0 0 0 0 0 0 0
##$TUNHIN= 0
##$TUNHOUT= 0
##$TUNXOUT= 0
##$USERA1= <user>
##$USERA2= <user>
##$USERA3= <user>
##$USERA4= <user>
##$USERA5= <user>
##$V9= 5
##$VALIST= <valist>
##$VCLIST= <CCCCCCCCCCCCCCC>
##$VD= 0
##$VDLIST= <DDDDDDDDDDDDDDD>
##$VPLIST= <PPPPPPPPPPPPPPP>
##$VTLIST= <TTTTTTTTTTTTTTT>
##$WBST= 2048
##$WBSW= 25
##$XGAIN= (0..3)
0 0 0 0
##$XL= 0
##$YL= 0
##$YMAX_a= 551478
##$YMIN_a= -467150
##$ZGOPTNS= <>
##$ZL1= 120
##$ZL2= 120
##$ZL3= 120
##$ZL4= 120
##$ABSF1= 14.98509
##$ABSF2= -5.573092
##$ABSG= 5
##$ABSL= 3
##$ALPHA= 0
##$AQORDER= 0
##$ASSFAC= 0
##$ASSFACI= 0
##$ASSFACX= 0
##$ASSWID= 0
##$AUNMP= <proc_prof1d_extract_pilot.lims>
##$AXLEFT= 0
##$AXNAME= <>
##$AXNUC= <1H>
##$AXRIGHT= 0
##$AXTYPE= 0
##$AXUNIT= <>
##$AZFE= 0.1
##$AZFW= 0.1
##$BCFW= 0
##$BC_mod= 0
##$BYTORDP= 0
##$COROFFS= 0
##$CY= 15
##$DATMOD= 1
##$DC= 0
##$DFILT= <>
##$DTYPP= 0
##$F1P= 0
##$F2P= 0
##$FCOR= 0.5
##$FTSIZE= 32768
##$FT_mod= 6
##$GAMMA= 0
##$GB= 0
##$INTBC= 1
##$INTSCL= 1
##$ISEN= 128
##$LB= 0
##$LEV0= 0
##$LPBIN= 0
##$MAXI= 10000
##$MC2= 0
##$MEAN= 0
##$ME_mod= 0
##$MI= 0
##$NCOEF= 0
##$NC_proc= -8
##$NLEV= 6
##$NOISF1= 0
##$NOISF2= 0
##$NSP= 0
##$NTH_PI= 0
##$NZP= 0
##$OFFSET= 14.98509
##$PC= 1
##$PHC0= 97.58606
##$PHC1= 0
##$PH_mod= 1
##$PKNL= yes
##$PPARMOD= 0
##$PPDIAG= 0
##$PPIPTYP= 0
##$PPMPNUM= 2147483647
##$PPRESOL= 1
##$PSCAL= 4
##$PSIGN= 0
##$PYNMP= <proc.py>
##$REVERSE= no
##$SF= 400.02
##$SI= 32768
##$SIGF1= 0
##$SIGF2= 0
##$SINO= 400
##$SIOLD= 32768
##$SPECTYP= <>
##$SREGLST= <1H.CDCl3>
##$SSB= 0
##$STSI= 32768
##$STSR= 0
##$SW_p= 8223.68421052631
##$SYMM= 0
##$S_DEV= 0
##$TDeff= 65536
##$TDoff= 0
##$TI= <>
##$TILT= no
##$TM1= 0
##$TM2= 0
##$TOPLEV= 0
##$USERP1= <user>
##$USERP2= <user>
##$USERP3= <user>
##$USERP4= <user>
##$USERP5= <user>
##$WDW= 1
##$XDIM= 32768
##$YMAX_p= 433221396
##$YMIN_p= -688982
##$CURPLOT= <Network HP LaserJet P1505>
##$CURPRIN= <$Network HP LaserJet P1505>
##$DFORMAT= <normdp>
##$LAYOUT= <+/1D_H.xwp>
##$LFORMAT= <normlp>
##$PFORMAT= <normpl>
##$SURQMSG= 1
$$ End of Bruker specific parameters
$$ ---------------------------------
##NTUPLES= NMR SPECTRUM
##VAR_NAME=  FREQUENCY,     SPECTRUM/REAL,   SPECTRUM/IMAG
##SYMBOL=    X,             R,               I
##VAR_TYPE=  INDEPENDENT,   DEPENDENT,       DEPENDENT
##VAR_FORM=  AFFN,          ASDF,            ASDF
##VAR_DIM=   32768,         32768,           32768
##UNITS=     HZ,            ARBITRARY UNITS, ARBITRARY UNITS
##FACTOR=    0.250966925370066, 1,           1
##FIRST=     8223.43324360094, 49608,        -109569
##LAST=      0,             -42479,          -110303
##MIN=       0,             -688982,         0
##MAX=       8223.43324360094, 433221396,    0
$$ Real data points
##PAGE= N=1
##DATA TABLE= (X++(R..R)), XYDATA
$$ [...]
$$ plain form
19527 -535749 -3112 55900 -293118 -335023 -26535 -87316 51564 -11697 -53461 -79583 -66975
19516 -66975 12236 73788 -4629 223040 -110796 108582 -252081 -87730 104226 -354271 -41546
19504 -82659 -286195 222908 -126069 -193658 158837 3105 208333 -456863 -39172 9922 -286257
19492 -105125 -192622 -190043 95073 -431739 124724 -7828 265160 1181 -83040 -43369 -40576 -189075
19480 -189075 -128628 -54420 135781 -255314 7263 -164234 257532 -276515 140879 286722
19470 286722 -258036 174235 -42658 -105316 -251397 -74416 -121989 -15149 -216292 -141890 -111318
19459 -111318 -24756 -231080 -11551 1528 41050 79374 -82705 -164844 207288 -115772 -142430
19448 -142430 -96714 -179535 -150177 19729 58369 139353 299689 -235321 162762 -213693 252135
$$ packed form
19527e35749c112E5900b93118m1905b6535o0781E1564a1697m1764k6122J2608
19516f6975A2236O1552d629B23040a10796A08582b52081h7730A04226c54271d1546
19504h2659k03536B22908a26069o7589A58837C105K05228d56863c9172I922b86257
19492a05125q7497K579I5073d31739A24724g828B65160A181h3040L9671K793j48499
19480a89075O0447e4420A35781b55314G263a64234B57532b76515A40879J45843
19470B86722b58036A74235d2658o2658j46081g4416m7573a5149k01143P4402L0572
19459a11318b4756k06324a1551A528L9522L8324h2705q2139B07288a15772k6658
19448a42430M5716q2821K9358A9729L8640Q0984J60336b35321A62762b13693B52135
$$ plain form
19436 -144443 -319369 31806 -95164 91061 -86396 36555 -92380 27668 -261887 334652 194197
19425 194197 -64394 -55665 -349069 -311967 -79838 -24989 -89582 -196041 -230472 63 -307888 -122687
19412 -210301 -181175 4592 -97561 31051 -180607 -197644 -19251 19177 46740 -168553 66501
19400 -293410 -453889 44669 -176114 36495 -128641 -172446 -311652 -55868 88619 9762 -188049
19388 -56870 -188781 -126423 -149786 217305 100977 -205501 -122126 -78947 -226816 -143914 4847
19376 183678 -390570 31388 -28844 -362253 -150610 -80377 169544 67696 -188472 -289863
19366 -289863 51705 -165781 104097 228903 174333 248489 -80102 -222405 -174266 -30103 -76679
19355 -76679 -123584 243909 -218828 14393 14052 -27663 70043 -440667 250145 -52605 134301
$$ packed form
19436a44443j74926C1806i5164I1061h6396C6555i2380B7668b61887C34652j40455
19425A94197f4394Q729k93404L7102g9838b4989o4593j06459l4431F3c07888a22687
19412b10301K9126D592i7561C1051a80607j7037a9251A9177K7563a68553F6501
19400b93410j60479D4669a76114C6495a28641m3805j39206e5868H8619I762a88049
19388e6870j31911O2358k3363B17305A00977b05501Q3375M3179j47869Q2902D847
19376A83678c90570C1388b8844l33409a50610P0233A69544F7696a88472j01391
19366b89863E1705a65781A04097J24806n4570P4156h0102j42303M8139c0103m6576
19355g6679m6905B43909b18828A4393l41b7663G0043d40667B50145e2605A34301
$$ plain form
19343 7242 132026 87064 -278992 -125648 85134 -75426 162883 85527 -68600 -254164 -235592
19332 -235592 -135659 -78458 -107007 55496 -15116 -47767 -263543 181024 112511 14973 134611
19321 134611 -116323 248368 27288 -304832 193099 -537936 99390 239126 -93946 -22984
19310 -58708 -420031 -140748 -190163 144260 17189 -78160 -192894 -90310 -113106 -281013 -38880
19298 136534 -174664 198103 42793 -613 314 -139635 -35856 -209711 -286547 227257 -76678
19286 -122975 150824 -262646 -250937 35372 221596 124925 15699 -71071 8546 99541 -68758
19274 -120812 -267417 103154 -10107 -633840 15289 -251370 233724 -138038 212295 315888
19264 315888 -124884 -353452 -144108 -102422 48609 -219111 -69658 68901 -58008 -159194
$$ packed form
19343G242J24784m4962b78992a25648H5134g5426A62883p7356f8600j85564J8572
19332b35592R9933N7201k8549E5496a5116l2651k15776A81024o8513A4973J19638
19321A34611a16323B48368B7288c04832A93099e37936I9390J39736i3946b2984
19310e8708l61323a40748m9415A44260A7189g8160j14734i0310k2796j67907c8880
19298A36534a74664A98103D2793f13C14a39635c5856j73855p6836B27257g6678
19286a22975A50824b62646J1709C5372J86224r6671A5699g1071H546R0995f8758
19274a20812j46605A03154a0107o23733A5289b51370B33724a38038B12295J03593
19264C15888a24884k28568a44108M1686D8609b19111f9658F8901e8008j01186
$$ plain form
19254 -159194 -150089 283289 -350096 -45689 -142995 -33946 190852 -162913 -40099 107159 41013
19242 -194064 -47173 53776 158834 -224808 -160497 -62475 -317095 -29028 -149676 -297388
19232 -297388 -324442 135032 -7411 90889 54656 -180251 -64164 61687 -156531 -116597 -116448
19221 -116448 -57507 107197 -146626 -178268 65425 130877 -39525 -41693 -15483 -33727 42224
19209 -63644 -41914 -149932 36067 162544 -264496 166251 -121314 -135764 9985 -144660 264293
19197 106390 299465 -88732 54671 61969 -280157 -250438 -124524 -152088 -223291 -75968 307071
19185 51980 182220 144771 230443 -122389 -127647 -101475 -245931 -40973 -224051 17254 35274
19174 35274 -19023 -15131 58552 -171726 223860 -426411 -22413 16073 -70131 -110339 -188583
$$ packed form
19254a59194R105B83289c50096d5689r7306c3946A90852a62913d0099A07159D1013
19242a94064d7173E3776J05058b24808O4311f2475k54620b9028j20648j47712
19232b97388k7054A35032g411I0889l6233a80251f4164F1687a56531L9934J49
19221a16448e7507A07197a46626l1642F5425O5452c9525k168a5483j8244D2224
19209f3644K1730j08018C6067J26477b64496A66251a21314j4450I985a44660B64293
19197A06390J93075h8732E4671P298b80157K9719a24524k7564p1203g5968C07071
19185E1980J30240l7449Q5672a22389n258K6172j44456d0973j83078A7254J8020
19174C5274a9023L892E8552a71726B23860d26411b2413A6073g0131m0208p8244
$$ plain form
19163 -188583 74 204303 57602 -203845 -217374 -106301 -205841 -242526 168143 66056 -228023
19151 238896 -205519 52294 -330047 -477562 -122166 -325970 -104724 13825 -33714 -59859
19141 -59859 19159 3991 -33313 88776 177141 121374 -103980 -155185 -76430 6463 613 -355533
19128 196446 213321 -115214 -300128 204334 -85743 113203 -113596 15080 -126503 -87562
19118 -87562 -113923 25588 -116193 -29398 201652 119111 -26645 70172 -124049 -130969 -155983
19107 -155983 -204004 -19643 -97599 -77739 284314 -282026 -320642 -392340 107934 -10710 163255
19095 -114212 -6864 -92051 -30393 108413 71463 -26125 6233 -143539 -175329 112391 -159770
19083 -195200 39675 -155855 -328644 -408566 -65755 75060 -32364 -119987 -71825 330406 -293186
$$ packed form
19163a88583G4K04229E7602b03845j3529a06301r9540l6685A68143F6056b28023
19151B38896b05519E2294c30047j47515a22166k03804a04724A3825c3714k6145
19141e9859A9159C991c3313H8776Q8365n5767a03980n1205g6430F463F13c55533
19128A96446J6875a15214j84914B04334h5743A13203a13596A5080a26503L8941
19118h7562k6361B5588a16193b9398B01652q2541b6645G0172a24049o920k5014
19107a55983m8021a9643p7956J9860B84314b82026l8616p1698A07934a0710A63255
19095a14212f864q5187c0393A08413l6950b6125F233a43539l1790A12391a59770
19083a95200C9675a55855j72789p9922f5755G5060c2364q7623M8162C30406b93186
$$ plain form
19071 -87607 -401677 -142500 26963 -264442 -174377 -91484 -33665 150636 -163109 2443 -128824
19059 -61307 -180943 -215584 -9063 -20937 93845 -28196 248793 -109286 -110287 -232838 161999
19047 -288610 -40514 -102347 -39414 -230629 -114650 -48554 197841 -131847 -268472 -78458
19036 -52328 -60077 -8336 -130079 -383470 -59467 -17144 110080 -388137 93601 68757 -334472
19024 -285764 216691 107188 -153321 68502 -170585 242990 30258 -225322 73935 -61008
19013 -114975 -291528 156271 -213558 -141863 -120946 23229 -114541 -233833 18585 -132069
19002 -299143 -420455 136373 -134375 -239839 -82099 30855 4705 -116613 139310 -158976
18991 240422 -173486 169141 -1722 67457 -232686 -140648 -117257 -68009 -269323 171864 -114139
$$ packed form
19071h7607l14070a42500B6963b64442R0065Q2893c3665A50636a63109B443a28824
19059f1307j19636l4641i063j1874I3845b8196B48793a09286j001j22551A61999
19047b88610d0514o1833c9414j91215a14650d8554A97841a31847j36625g8458
19036e2328p749h336j21743k53391e9467a7144A10080c88137I3601k4844c34472
19024b85764B16691A07188a53321F8502a70585B42990C0258b25322G3935f1008
19013a14975j76553A56271b13558P1695K0917B3229a14541j19292A8585a32069
19002b99143j21312A36373a34375j05464h2099C0855D705a16613A39310a58976
18991B40422a73486A69141a722F7457b32686R2038K3391M9248k01314A71864a14139
$$ plain form
18979 -63112 72245 -284083 -68356 256198 255721 200899 -120508 279842 325206 -174875 467816
18967 65823 91130 -30426 26682 90977 -44657 15895 279872 -165616 -24455 -84227 -92289
18956 -92289 -65995 -160063 -45204 122884 -519507 -269066 -325291 -290609 -8164 -36034 188294
18944 -19793 -224222 -135005 -10162 36477 116273 -6918 69578 -97243 -174804 -91936 107450
18932 -180093 -391756 -48620 -74600 50453 -31690 189020 -254577 -42209 -170516 -200752 -23180
18920 37329 34458 1593 -230285 32670 -205483 77396 -71294 161551 62452 215107 -132360
18908 155941 172817 -104846 -68281 -262648 8110 -141284 149633 -338128 -10851 -15248 -116297
18897 -116297 -92657 -254788 -8672 63603 -336774 -119680 186699 -243925 -157356 -231760 38192
$$ packed form
18979f3112G2245b84083f8356B56198m77n4822a20508B79842M5364a74875D67816
18967F5823K5307c0426B6682O4295d4657A5895K63977a65616b4455n9772q062
18956i2289K6294r4068d5204A22884e19507K50441n6225L4682h164k7870A88294
18944a9793k04429Q9217a0162C6477P9796f918F9578i7243p7561Q2868A07450
18932a80093k11663d8620k5980E0453c1690A89020b54577d2209j28307l0236b3180
18920C7329k871A593b30285C2670b05483G7396g1294A61551F2452J52655a32360
18908A55941J6876a04846L6565j94367H110a41284A49633c38128a0851m397j01049
18897a16297K3640j62131h672F3603c36774a19680A86699b43925Q6569p4404C8192
$$ plain form
18885 -72813 34258 -101977 -543142 -222235 -202477 10014 185385 31579 -131498 99099 -74871
18873 -110234 -179776 -203287 -146307 -43941 -219701 72888 -226073 28166 -51332 -13269 -32895
18862 -32895 -142825 57764 55015 -176112 -168971 -6340 -123010 -32792 187928 2962 2927 39032
18850 39032 511983 276460 51497 70612 99203 -202331 -21907 -469497 -189122 -264309 185035
18838 -66621 -317777 17338 -168801 -91414 -187817 26768 42801 24541 -40935 108949 -58017
18826 51038 252836 -195193 -130576 -136439 72851 181973 32510 45506 -54502 163554 -96022
18814 -14330 -84856 140081 -34372 -18805 -341087 67580 81848 -37394 96949 65427 -126644
18802 9085 -90760 -93413 -320681 -288766 95876 -186248 15208 -265477 -102155 196004 -13238
$$ packed form
18885g2813C4258a01977m41165b22235J9758A0014J75371C1579a31498I9099g4871
18873a10234o9542k3511N6980d3941j75760G2888b26073B8166e1332a3269j9626
18862c2895j09930E7764k749a76112P141f340j16670c2792A87928B962l5L6105
18850C9032M72951k35523E1497J9115K8591b02331b1907m47590a89122p5187A85035
18838f6621k51156A7338a68801P7387r6403B6768J6033j8260d0935A08949e8017
18826E1038K01798a95193O4617n863G2851J09122C2510J2996e4502A63554i6022
18814a4330p0526A40081c4372J5567l22282F7580J4268c7394I6949l1522a26644
18802I085i0760k653k27268L1915I5876a86248A5208b65477a02155A96004a3238
$$ plain form
18790 48048 288870 -138428 14930 74915 -278337 -201144 5148 21018 -136016 -57967 -87049
18779 -87049 53664 -73103 -111079 -33688 -135831 85864 -70685 -40456 108995 50712 -31032
18767 -53114 -162499 -88956 -47184 -140821 28573 -98856 334274 -111605 -18981 -175304 48017
18755 26933 -59766 -110346 -238511 -340324 57756 166480 341356 -4293 239331 -283859 -279311
18744 -279311 -253953 -138075 -195607 37766 151434 21954 -36038 292262 130635 -182279
18733 56419 -107316 28942 -232967 -259737 -108292 -156014 -40934 230906 19618 -91146 -36225
18721 -43485 -235072 198842 316653 118291 -91848 -274469 -163037 -146535 -333455 -229785
18711 -229785 -139165 37294 359312 295225 -194673 -1913 96292 53121 -34652 -125806 -91219
$$ packed form
18790D8048K40822a38428A4930N9985b78337P7193E148J5870a36016e7967k9082
18779h7049E3664g3103l7976c3688j02143H5864g0685L0229A08995E0712c1032
18767e3114j09385P3543M1772r3637B8573i8856C34274a11605a8981j56323D8017
18755B6933e9766n0580j28165j01813E7756J08724J74876d293B39331b83859M548
18744b79311K5358J15878n7532C7766J13668B1954c6038B92262A30635a82279
18733E6419a07316B8942b32967k6770a08292m7722d0934B30906A9618i1146c6225
18721d3485j91587A98842J17811A18291i1848j82621J11432J6502j86920J03670
18711b29785R0620C7294L22018o4087a94673a913I6292m3171c4652r1154L4587
$$ plain form
18700 -91219 58807 -128592 -248087 30105 53350 -34194 75100 71141 -128720 -138166 29723
18688 -17325 232746 -208216 60434 7542 129463 -161583 256640 135906 191672 45585 54699
18677 54699 -184542 21312 -8552 71024 23206 -200207 54497 -225421 250037 101130 25319
18665 30726 -156672 -129927 113514 -29499 9400 -460959 -213195 -122095 -130925 23414 -102994
18653 -38286 47456 242760 -170537 119117 -363095 -1387 -146301 -121255 285643 6741 -231634
18641 -206978 -184538 98656 -121676 435830 -270173 76906 -241609 -147835 -90886 64022 161704
18630 161704 -181195 209710 -6627 -46926 -165156 -180532 -306263 -117174 66517 -86115 30906
18618 -248614 -48089 -308765 -109376 250842 -27555 26342 -6305 -115482 -10125 -324476 72230
$$ packed form
18700i1219E8807a28592j19495C0105K3245c4194G5100l959a28720r446B9723
18688a7325B32746b08216F0434G542J21921a61583B56640j20734N5766D5585R114
18677E4699a84542B1312h552G1024B3206b00207E4497b25421B50037A01130B5319
18665C0726a56672K6745A13514b9499I400d60959b13195R1100q830B3414a02994
18653c8286D7456J95304a70537A19117c63095a387j44914K5046B85643F741b31634
18641b06978K2440I8656a21676D35830b70173G6906b41609R3774N6949F4022R7682
18630A61704a81195B09710f627m0299j18230j5376j25731a17174F6517h6115C0906
18618b48614d8089k60676a09376B50842b7555B6342f305j09177a0125l14351G2230
$$ plain form
18606 44596 93094 -121990 156779 -182485 -185405 48370 189211 -160363 -312655 133050
18595 -148592 111653 -157586 -108311 -84929 -202629 40187 -451904 -158667 -21982 -12669 -211902
18584 -211902 -260748 -16354 -243187 -12081 -72733 -217583 175810 206194 46591 -120194 -4349
18572 -20199 302975 136475 -216967 -286239 108477 -73262 -43877 129624 240114 -183772
18561 -31117 -144470 71863 -43814 61703 291112 -267760 -113869 8525 -335366 -343700 82132
18549 -197246 -213786 -22615 -287042 -411278 35909 -192965 8507 -296728 -316703 33811 -55056
18537 82269 -131222 -218897 52310 -109095 -205795 13245 200096 318 -218728 36540 -216856
18525 -236801 -104663 -96634 175341 -11892 225190 29925 158264 79632 -2845 37573 -94231
$$ packed form
18606D4596M8498a21990A56779a82485k920D8370J40841a60363j52292A33050
18595a48592A11653a57586M9275K3382j17700D0187d51904a58667b1982R313j99233
18584b11902m8846a6354k26833a2081o0652j44850A75810L0384D6591a20194d349
18572b0199C02975A36475b16967o9272A08477g3262K9385A29624J10490a83772
18561c1117j13353G1863d3814F1703K29409b67760a13869H525c35366q334H2132
18549a97246j6540b2615k64427j24236C5909a92965H507b96728j9975C3811e5056
18537H2269a31222q7675E2310a09095r6700A3245J86851C18b18728C6540b16856
18525b36801a04663Q029A75341a1892B25190B9925J28339p8632b845C7573i4231
$$ plain form
18513 306631 -90108 -111265 -101448 -380653 -165800 46149 -397470 -247120 -249779 -45742 -270918
18502 -270918 -56648 -35148 -232468 -89609 -6231 -335553 -8932 1218 -204291 44723 -13681
18490 -375404 74359 -101449 -161484 -102945 -365435 -65432 -151124 -90757 113194 -1367 -209201
18479 -209201 145297 -471970 -112198 21002 -93900 32879 -6701 67438 -215479 -99569 5541
18467 -188669 -31688 -93809 -200582 -156386 -89913 50165 1862 -108583 -168267 312411 -276189
18455 -87449 238893 -177507 -154687 134616 71971 -180310 -126529 21715 -165851 -76550 -54039
18444 -54039 115594 -52216 144409 150281 114026 134110 -138085 -38615 -117614 -135476 -55902
18432 -212888 33921 -34439 136640 -399973 -25961 281694 -313001 -81156 -192591 -28195
$$ packed form
18513C06631i0108k1157R817k79205a65800D6149c97470J50350k659d5742k25176
18502b70918e6648K1500j97320h9609f231l29322h932A218b04291D4723a3681
18490c75404G4359a01449o0035N8539k62490f5432q5692O0367A13194a367k07834
18479b09201A45297d71970a12198B1002i3900C2879f701F7438b15479i9569E541
18467a88669c1688o2121j06773M4196O6473E0165A862a08583n9684C12411b76189
18455h7449B38893a77507K2820A34616o2645a80310N3781B1715a65851g6550K2511
18444e4039A15594e2216A44409N872l6255K0084a38085c8615p8999j7862e5902
18432b12888C3921c4439A36640c99973b5961B81694c13001h1156j11435b8195
$$ plain form
18421 134119 -95826 401399 48099 -137010 -132144 -286203 361386 -57962 -120503 106878 123917
18410 123917 286524 65474 75709 -113876 -165702 -256137 -185667 -67143 -137511 282653 -18893
18398 -12532 142485 521735 -62456 -87630 55867 -72518 -175232 -165237 80428 -78307 154962
18386 287624 113341 15259 -186185 79308 -111944 218700 -150061 -25077 26632 -326018
18375 -12520 -73473 -244582 76586 -137932 -256156 113174 30343 127022 -54192 152608 327250
18364 327250 173245 81131 241667 -671 -123227 158870 -169794 -205050 -226264 -196840 29438
18352 44810 -57714 118736 -18716 -240887 -501442 -103187 206937 -109075 184265 34406
18341 45860 88544 -167201 104228 -24159 9250 -80848 -1507 -88307 197702 -301008 142408
$$ packed form
18421A34119i5826D01399D8099a37010M866j54059C61386e7962o2541A06878J7039
18410A23917J62607F5474J0235a13876n1826r0435P0470f7143p0368B82653a8893
18398a2532A42485L79250f2456k5174E5867g2518j02714R995H0428g8307A54962
18386B87624A13341A5259a86185G9308a11944B18700a50061b5077B6632c26018
18375a2520o0953j71109G6586a37932j18224A13174C0343R6679e4192A52608J74642
18364C27250j54005H1131J60536f71j22556A58870a69794l5256k1214K9424B9438
18352D4810e7714A18736a8716k22171k60555a03187B06937a09075A84265C4406
18341D5860M2684a67201A04228b4159I250h0848a507q6800A97702c01008A42408
$$ plain form
18329 -35197 -78603 -367473 103444 -185204 -366941 -172497 -189017 -126295 -158707 59444 3639
18317 -10910 64406 -35268 -93734 -68607 -474398 -110760 -170487 -258768 -83026 -254294 145862
18305 -170466 -284694 91015 -80917 -70906 -176703 -337341 -121801 -58843 -24431 -324285
18295 -324285 -254870 105091 -4791 -219334 -43781 81256 114929 362126 -224266 -259795 -96032
18283 -263424 -63017 -101553 -58144 128837 -205586 -59355 85770 -175881 280909 -56822 76790
18271 -99071 18651 6423 -193040 -37754 75831 -176650 -221047 13742 -194949 -276673 129947
18259 -26523 -55154 -8666 -53722 -100583 95407 86076 -143912 -421530 -6888 -101762 -38158 -97742
18247 -97742 -46600 127113 -102412 148412 -32875 -124479 -140883 130322 -93969 -261212 -158810
$$ packed form
18329c5197m3406k88870A03444a85204j81737a72497j6520O2722l2412E9444C639
18317a0910F4406c5268n8466K5127m05791a10760n9727q8281h3026j71268A45862
18305a70466j14228I1015h0917J0011j05797j60638a21801e8843b4431k99854
18295c24285O9415A05091d791k14543d3781H1256L3673K47197b24266l5529i6032
18283b63424f3017l8536M3409A28837b05586e9355H5770a75881B80909e6822G6790
18271i9071A8651F423a93040c7754G5831a76650m4397A3742a94949q1724A29947
18259b6523k8631h666m5056m6861I5407r331a43912k77618f888r4874c8158n9584
18247i7742d6600A27113a02412A48412c2875r1604j6404A30322i3969j67243J02402
$$ plain form
18236 -158810 182476 292286 135407 -240280 -4536 -218169 212485 -285413 61899 244302
18226 244302 55262 80724 -29794 -97393 189642 -11384 296682 -7231 122416 -269090 90338
18214 -116011 -119063 64563 79116 -163878 -98682 42765 -75462 -198018 -237059 -113118 -58596
18203 -58596 36542 -77441 -76013 48007 184015 -34912 -74178 -392167 -262843 201275 -303317
18191 -541241 -125947 -54057 18941 50978 -120683 -152798 197394 -201177 277788 169058
18181 169058 -128446 -1983 -28019 -246925 2957 340985 -51571 127656 -144692 -60335 232176
18169 71726 7522 265020 -244416 203287 -308223 303103 -362561 81812 99557 -320194
18158 146442 -38102 -88048 -276905 -103032 -89236 -178690 -146492 74792 -1529 -92302 94397
$$ packed form
18236a58810A82476J09810A35407b40280d536k13633B12485b85413F1899J82403
18226B44302E5262K5462b9794o7599A89642a1384B96682g231A22416b69090I0338
18214a16011l052F4563J4553a63878O5196D2765g5462j22556l9041a13118N4522
18203e8596C6542g7441J428D8007J36008c4912l9266l17989J29324B01275c03317
18191e41241a25947e4057A8941L2037a20683l2115A97394b01177B77788j08730
18181A69058a28446a983k6036k18906B957L38028e1571A27656a44692f0335B32176
18169G1726G522K57498b44416B03287c08223C03103c62561H1812J7745c20194
18158A46442c8102m9946j88857a03032J3796q9454L2198G4792a529r0773I4397
$$ plain form
18146 215322 236159 -12054 -141276 278377 -145667 362181 -32277 -171867 5281 -59380 263048
18134 -100939 115785 -343589 277135 -312714 3835 -295087 -97093 -553438 41831 -25759
18123 -193337 96262 214975 -112849 97976 161360 -37043 -212006 -36113 -417078 -84767 -256211
18112 -256211 -29147 -118976 -104778 83593 14313 -88604 -28644 192570 82195 -299870 -160489
18101 -160489 -238483 286893 -401043 -112231 -171255 38441 -155228 97718 27176 2205 41834
18090 41834 278667 -280452 47876 -9116 -116957 106119 86531 -109319 -70610 -36576 131313
18078 -10599 188214 134917 -158675 119677 26987 -108267 -29418 -153807 -69342 -241984
18068 -241984 -255287 -137628 -226453 120357 80495 -80668 -207044 -248474 -113112 64399 -265576
$$ packed form
18146B15322K0837a2054j29222B78377a45667C62181c2277j39590E281e9380B63048
18134a00939A15785c43589B77135c12714C835b95087i7093m56345D1831b5759
18123a93337I6262J18713a12849I7976O3384c7043j74963c6113l80965h4767j71444
18112b56211b9147q9829J4198H3593A4313h8604b8644A92570H2195b99870J39381
18101a60489p7994B86893d01043a12231n9024C8441a55228I7718B7176B205L9629
18090D1834K36833b80452D7876i116j07841A06119j9588a09319L8709L4034A31313
18078a0599A88214n3297a58675A19677B6987a08267b9418j24389f9342j72642
18068b41984j3303J17659q8825A20357l9862h0668j26376m1430a13112F4399b65576
$$ plain form
18056 -137830 -209420 -83993 -388364 -152296 -125483 4022 223066 71861 -15472 -8462 112667
18044 -23511 -459820 -95854 -164327 -125661 -152943 298705 221421 -65547 8103 -166330 140901
18032 -372882 19359 -187669 -223137 298057 87157 169561 -20139 -271573 260659 171582 -3799
18020 -195254 -92814 -152067 -142229 -135505 127621 111204 221101 -204798 7813 -198951 -15366
18008 158116 187170 -39095 -118630 217921 181221 142871 -260182 34516 64169 -74748 -190547
17997 -190547 -198915 163939 220036 393695 -247443 31697 -98347 169222 -145459 -31899 90723
17985 -42597 134653 -132744 -70768 -172220 275951 -123846 76054 -193127 28216 243037
17975 243037 -151198 -459751 -102020 142423 -327139 -213181 -143608 -72251 -52035 69961
$$ packed form
18056a37830p1590h3993l04371a52296K6813D022K19044G1861a5472P010A12667
18044b3511m36309i5854o8473L8666k7282B98705p7284f5547H103a66330A40901
18032c72882A9359a87669l5468B98057H7157Q2404b0139k51434B60659q9077c799
18020a95254i2814n9253R838O724A27621j6417J09897b04798G813a98951a5366
18008A58116K9054c9095p9535B17921l6700l8350b60182C4516K9653g4748j15799
17997a90547q368A63939N6097J73659b47443C1697i8347A69222a45459c1899I0723
17985d2597A34653a32744O1976j01452B75951a23846G6054a93127B8216K14821
17975B43037a51198l08553a02020A42423c27139J13958O9573P1357K0216F9961
$$ plain form
17964 163341 94091 -220632 255108 1962 -277037 48833 30441 33659 -248606 147222 69836
17952 -75551 -15458 -108525 374528 -340290 -199123 -27544 -239861 128770 144737 74213 140835
17941 140835 -19366 159498 276553 -314351 -144421 183709 -257401 -179219 -63058 96853
17930 235263 26869 -168523 160240 145954 177607 56883 210731 -60238 140230 -58310 4594
17918 -82115 -299085 177201 292091 -268001 -97023 -91092 -225141 -2307 -59353 278940 -150029
17906 -34253 32792 -129959 84744 -106399 4457 -23889 35111 201143 133635 -68135 -100586
17895 -100586 -129283 217822 -154610 -125708 -84362 136006 188221 115539 -141724 5741 -336137
17883 146508 -21672 147781 -199084 96414 -189049 -204336 83730 -109772 52481 -79991 276526
$$ packed form
17964A63341o9250b20632B55108A962b77037D8833j8392L218b48606A47222F9836
17952g5551a5458r3067C74528c40290J41167b7544k12317A28770J5967p0524O6622
17941A40835a9366A59498J17055c14351a44421A83709b57401P8182f3058I6853
17930B35263B6869a68523A60240j4286L1653E6883J53848f0238A40230e8310D594
17918h2115k16970A77201J14890b68001i7023N931j34049b307n7046B78940a50029
17906c4253C2792a29959H4744a06399D457b3889C5111J66032o7508f8135l2451
17895a00586k8697B17822a54610K8902M1346A36006N2215p2682a41724E741c36137
17883A46508b1672A47781a99084I6414a89049j5287H3730a09772E2481g9991B76526
$$ plain form
17871 -62536 129420 245344 -169247 159020 -143195 31464 -222634 -63010 -453528 -29697
17860 84676 -99681 -135417 263700 -221391 -29578 23123 75628 -102173 -34493 -351077 -356823
17849 -356823 82703 -310242 128445 -286011 -120429 111046 -8528 -234876 77449 -67052
17838 15653 14331 -209061 15017 39878 -533177 -175400 -167830 -317209 -177140 356390 285738
17827 285738 -85225 -360945 -29450 -447656 -83817 32304 -189012 -163925 53027 -292264 78096
17815 134578 -69724 -123717 -110849 77580 -54497 -228380 -202799 100243 -5111 -83330 -60907
17804 -60907 50996 116074 426924 124783 -90483 -52023 -28231 293644 103663 100037 161841
17793 161841 155071 12316 -39467 -134331 -103910 212732 -43061 41749 344774 -47997 4373
$$ packed form
17871f2536A29420J15924a69247A59020a43195C1464b22634f3010l90518b9697
17860H4676i9681l5736B63700b21391b9578B3123N2505a02173c4493l16584n746
17849c56823H2703c10242A28445b86011a20429A11046h528k26348G7449f7052
17838A5653j322b09061A5017K4861e33177a75400P570j49379J40069C56390p0652
17827B85738h5225k75720b9450m18206h3817C2304a89012K5087E3027b92264G8096
17815A34578f9724n3993J2868G7580e4497j73883K5581A00243e111p8219K2423
17804f0907E0996O5078L10850A24783i0483L8460K3792B93644A03663l626O1804
17793A61841o770A2316c9467r4864L0421B12732d3061D1749L03025d7997D373
$$ plain form
17781 81103 377573 -218865 240677 -148165 -66410 -213558 98937 -236553 -42199 -184185
17771 -184185 -13126 253219 -12687 -173535 18959 107794 17551 286586 259889 -114723 -166371
17760 -166371 183846 -86434 61468 218606 76225 -121684 52078 206759 -79476 -40091 -120581
17749 -120581 -187090 215291 -220492 9285 -55621 -128746 -220281 310066 -81225 89340 137722
17738 137722 -128511 193952 4953 3584 -185181 -10983 108528 126442 44196 -198885 89806
17726 7344 117300 -60722 180485 232 218280 199051 -56262 -104681 88724 134140 401220
17715 401220 141323 87266 188390 306216 -74232 179203 168559 67766 141890 -141043
17704 224335 177488 118644 108329 237449 136694 91261 76693 255789 308434 -259650 -45023
$$ packed form
17781H1103K96470b18865B40677a48165f6410j47148I8937b36553d2199j41986
17771a84185a3126B53219a2687j60848A8959Q8835A7551K69035k6697a14723n1648
17760a66371A83846h6434F1468J57138G6225a21684E2078J54681g9476L9385q0490
17749a20581o6509B15291b20492I285e5621p3125r1535C10066h1225H9340M8382
17738A37722a28511A93952D953j369a85181a0983A08528J7914D4196a98885H9806
17726G344J09956f0722A80485B32K18048j9229e6262m8419H8724M5416K67080
17715D01220A41323n4057J01124J17826g4232A79203j0644F7766P4124a41043
17704B24335m6847n8844j0315J29120j00755m5433j4568J79096N2645b59650d5023
$$ plain form
17692 124763 -161303 -131459 336822 30808 35954 166558 301670 74952 350017 117405
17681 9876 73652 -114319 -118038 141581 -74192 -5719 -58986 -24311 -112565 67573 314154 -258777
17668 253253 199690 105515 238082 62439 49289 -59606 -4850 358015 170235 -39526 295858
17656 -12780 62379 191091 -44127 221544 43580 200019 443428 246616 -141082 54397
17645 -137442 189255 201216 -69473 -221775 -103210 -151882 -151023 132026 -180854 221703 -147828
17633 102620 -251672 -137021 129487 -18632 22624 21827 13551 -75965 -69285 -62275 -328883 149403
17620 -92756 229923 -174249 -105389 -118843 152100 -214772 385502 312842 -96491 15382 204638
17609 204638 -215205 99606 95479 -278779 -180217 -136530 385347 240042 30905 19272 -23668
$$ packed form
17692A24763a61303K9844C36822C0808N146J30604J35112G4952K75065A17405
17681I876O3776a14319l719A41581g4192e719n3267b4311q8254F7573K46581b58777
17668B53253n3563r4175J32567F2439j3150e9606d850C58015A70235c9526B95858
17656a2780F2379J28712d4127B21544D3580J56439K43409j96812a41082E4397
17645a37442A89255J1961f9473j52302a03210m8672Q59A32026a80854B21703a47828
17633A02620b51672J14651A29487a8632B2624p97q276g5965O680P010k66608A49403
17620i2756B29923a74249O8860j3454A52100b14772C85502p2660i6491A5382J89256
17609B04638b15205I9606m127b78779R8562M3687C85347j45305C0905j1633b3668
$$ plain form
17597 143047 -246556 110288 538590 -39096 44232 -129468 -195085 3982 59625 66011 185155
17586 185155 107454 41598 126996 248429 166665 32168 220887 -104296 -78228 -13890 -11778
17575 -11778 37750 263333 281858 311337 -162200 -17420 168738 -145838 286976 291629 -16056
17563 -37670 355123 73431 -129721 -9411 370591 253310 89668 293358 89345 116451 156286
17552 156286 593457 23985 168336 -82316 376200 106826 98039 -63745 112455 166955 -24361
17540 -269501 -65932 62381 162969 -23922 303949 442795 -56957 -130671 54549 285187 169933
17529 169933 133520 3303 20189 282950 213311 396709 272150 586395 608612 436626 381097
17518 381097 245101 176691 354407 211122 140736 201774 112342 234530 54446 196155
$$ packed form
17597A43047b46556A10288M28302c9096D4232a29468o5617C982N5643O386J19144
17586A85155p7701D1598Q5398J21433q1764C2168J88719a04296K6068a3890K112
17575a1778C7750K25583J8525K9479a62200a7420A68738a45838B86976M653a6056
17563c7670C55123G3431a29721i411C70591j17281H9668K03690H9345K7106L9835
17552A56286M37171B3985J44351h2316C76200A06826q787f3745A12455N4500b4361
17540b69501f5932F2381J00588b3922C03949J38846e6957p3714E4549K30638j15254
17529A69933l6413C303J6886K62761o9639J83398j24559L14245K2217j71986n5529
17518C81097j35996o8410J77716j43285p0386O1038q9432J22188E4446J41709
$$ plain form
17508 196155 367564 304382 497131 666198 498558 341337 254006 109661 186502 408357
17498 408357 272445 -60548 -76956 178255 -26606 -49895 -29127 83948 54758 -32866 117195
17486 269959 214225 595107 157741 -100908 232987 194134 376729 142948 -198347 23319
17475 51154 -150687 66578 380386 -267180 129256 159854 250451 -138975 -202876 188293
17464 278898 11109 2044 188725 -121681 269931 173734 -168317 327809 258318 66916 146482
17453 146482 180920 -21874 266527 574256 356282 151001 528236 164072 187585 538960
17443 538960 109597 380707 339566 118425 184591 6877 262411 132014 2482 14276 96796
17432 96796 296480 202444 -113591 523642 521186 230607 -36917 167173 160788 216434 361223
$$ packed form
17508A96155J71409o3182J92749J69067j67640j57221q7331A09661P6841K21855
17498D08357j35912f0548j6408A78255b6606k3289K0768H3948k9190c2866A17195
17486B69959n5734L80882A57741a00908B32987l8853J82595A42948a98347B3319
17475E1154a50687F6578L13808b67180A29256L0598R0597a38975o3901A88293
17464B78898A1109B044J86681a21681B69931r6197a68317C27809o9491F6916P9566
17453A46482L4438b1874B66527L07729k17974A51001L77235A64072K3513L51375
17443E38960A09597K71110m1141A18425O6166F877K55534j30397B482J1794Q2520
17432I6796J99684r4036a13591E23642k456B30607c6917A67173o385N5646J44789
$$ plain form
17421 361223 33668 105267 120710 194244 87454 33841 343590 228386 84018 238301 159637
17410 159637 150779 102411 -67456 -155207 211629 263186 103554 80502 -45003 171360 -21762
17398 287199 179791 -52517 377892 167374 234092 -122482 -209161 -168481 20633 211725
17388 211725 115186 -30391 121085 99570 134519 148927 180144 -112081 162198 4227 44074
17377 44074 -132272 410894 18006 34616 232436 203010 -115702 268456 -274009 -40435
17366 62710 274594 75668 107785 366507 9959 54707 38534 182750 256942 92176 39063
17354 321018 -123367 -57319 20949 -32820 -19883 122229 -127360 26473 86636 199872 202710
17343 202710 277195 276648 187302 -26922 300254 155728 234534 101348 155879 51210 208473
$$ packed form
17421C61223C3668P1599J5443P3534H7454C3841L09749j15204H4018J54283p8664
17410A59637q858m8368f7456q7751B11629N1557A03554k3052d5003A71360b1762
17398B87199j07408e2517C77892A67374O6718a22482q6679M0680B0633J91092
17388B11725r6539c0391A21085k1515L4949J4408L1217a12081A62198D227L9847
17377D4074a32272D10894A8006J6610J97820k9426a15702B68456b74009d0435
17366F2710K11884G5668L2117K58722I959M4748j6173J44216P4192I2176C9063
17354C21018a23367e7319B0949c2820J2937A22229a27360B6473O0163J13236K838
17343B02710P4485n47q9346b6922C00254j44526P8806A01348N4531E1210J57263
$$ plain form
17332 208473 130066 113939 183542 102422 603415 47137 353202 65216 105437 149612 220672
17321 220672 84441 413664 159596 180967 -252777 217756 60106 114000 245155 -159725
17310 150882 320707 51877 169271 -308027 186085 -81238 29721 -38664 -66600 329724
17299 543710 41165 97496 250717 -49031 -117840 94787 -48248 107226 613059 234355 182709
17288 182709 335886 34603 129889 -52100 336455 60082 192705 -140407 281140 203385
17278 203385 206539 321472 90234 328073 282078 198388 271227 4420 219585 24289 286301
17267 286301 -57989 343766 128378 245103 182593 38409 216546 7167 93825 87208 -42331
17255 -49748 262275 80412 245441 191659 159053 122088 214360 292430 -15652 179523 -15029
$$ packed form
17332B08473p8407j6127O9603q1120N00993D7137L06065F5216M0221M4175P1060
17321B20672H4441L29223A59596K1371b52777B17756F0106N3894J31155a59725
17310A50882J69825E1877J17394c08027A86085h1238B9721c8664k7936C29724
17299E43710D1165N6331J53221d9031o8809I4787d8248A07226N05833B34355n1646
17288A82709J53177C4603R5286e2100C36455F0082J32623a40407B81140p7755
17278B03385L154J14933I0234K37839m5995q3690P2839D420K15165B4289K62012
17267B86301e7989C43766A28378J16725o2510C8409J78137G167Q6658o617d2331
17255d9748B62275H0412J65029n3782l2606l6965R2272P8070a5652A79523a5029
$$ plain form
17243 119481 169687 -16864 11315 233391 191112 -184138 230470 236395 55450 103856 125876
17232 125876 214252 157409 -59796 244689 416488 652537 122400 214071 -39632 448962
17221 367171 439496 71362 440871 313808 403981 167060 350983 151173 223639 438263
17211 438263 149081 69874 425969 159620 507077 133751 254612 329692 541951 352712
17201 352712 259434 122661 301117 195130 362683 164934 280361 151175 331448 -88519
17190 108227 -17559 164786 424350 330737 198566 82652 405308 258474 491983 123464
17179 267411 418422 362087 100514 162529 400845 -163214 523369 262402 -18150 428546
17168 351208 490437 256711 369689 270394 112291 145480 276344 360848 167736 111121
$$ packed form
17243A19481N0206a6864A1315K22076m2279a84138B30470N925E5450M8406K2020
17232A25876Q8376n6843e9796B44689J71799K36049A22400R1671c9632D48962
17221C67171P2325G1362L69509j27063R0173A67060J83923A51173P2466K14624
17211D38263A49081F9874L56095A59620L47457A33751J20861P5080K12259j89239
17201C52712r3278A22661J78456j05987J67553A64934J15427j29186J80273h8519
17190A08227a7559A64786K59564r3613j32171H2652L22656j46834K33509A23464
17179B67411J51011n6335A00514O2015K38316a63214E23369k60967a8150D28546
17168C51208J39229k33726J12978r9295A12291L3189J30864Q4504A67736n6615
$$ plain form
17158 111121 101198 297725 224986 237278 339277 62672 135780 81302 225596 292612 278232
17147 278232 127459 458704 228671 414653 -6527 294915 163016 373974 171638 354315
17137 354315 78691 524696 42074 344482 276194 87230 380039 174425 91387 448348
17127 448348 437104 222553 264386 416802 429187 117444 392104 324552 329328 79300 330189
17116 330189 369210 327338 551960 404902 367538 93349 316092 347269 368354 383875 547480
17105 547480 371776 218538 354707 256655 243012 650907 -148148 269128 402333 461049
17095 461049 438210 601180 251839 78942 662838 439925 530586 480697 506808 457606 528023
17084 528023 504737 254910 415608 604821 375715 353949 478712 254280 201606 320920
$$ packed form
17158A11121r923J96527p2739J2292J01999F2672P3108n4478J44294O7016j4380
17147B78232A27459L31245B28671J85982f527B94915j31899K10958A71638J82677
17137C54315G8691M46005D2074L02408o8288H7230K92809A74425q3038L56961
17127D48348j1244k14551M1833J52416J2385A17444K74660o7552M776G9300K50889
17116C30189L9021m1872K24622j47058l7364I3349K22743L1177K1085J5521J63605
17105E47480j75704j53238J36169r8052j3643M07895a48148B69128J33205N8716
17095D61049k2839J62970B51839G8942N83896k22913R0661m9889K6111m9202P0417
17084E28023k3286k49827J60698J89213k29106k1766J24763k24432n2674J19314
$$ plain form
17074 320920 457176 503875 288465 782770 356263 279543 754647 148448 127358 528405
17064 528405 409383 96527 490512 409483 142856 83538 720446 278513 611694 621326
17054 621326 673897 518393 458918 435904 554975 386752 343761 541898 727564 422667
17044 422667 747999 557005 430794 390783 313069 507790 412754 649904 518413 603586
17034 603586 582190 631186 818482 670683 756963 1115812 822778 863686 800571 440449
17024 440449 703699 386953 444991 326972 736822 705532 808994 668343 800793 610647
17014 610647 804764 791294 709174 444648 651330 766500 693699 771890 407062 426620
17004 426620 1003632 555025 594789 616031 779432 624888 851440 818613 866856 719326
$$ packed form
17074C20920J36256M6699k15410M94305C56263p6720M75104A48448k1090M01047
17064E28405j19022I6527L93985q1029A42856n9318O36908B78513L33181R632
17054F21326N2571j55504n9475k3014J19071j68223m2991J98137J85666l04897
17044D22667L25332j90994j26211m0011p7714J94721r5036K37150j31491Q5173
17034F03586k1396M8996J87296j47799Q6280L58849k93034M0908o3115l60122
17024D40449K63250l16746N8038j18019M09850l1290J03462j40651J32450j90146
17014F10647J94117j3470q2120k64526K06682J15170p2801P8191l64828J9558
17004D26620N77012m48607L9764K1242J63401j54544K26552l2827M8243j47530
$$ plain form
16994 719326 798239 834214 922522 820504 914143 676891 903989 582946 781653 738699
16984 738699 628415 1118156 737483 857851 978531 949949 833324 802881 783362 1062159
16974 1062159 788678 1181045 1115870 1115721 1027787 908370 772394 1145193 887746 1085294
16964 1085294 880956 595655 959852 799076 963888 1050467 1122561 1228974 1276284 1378365
16954 1378365 1377731 915616 1231189 1179562 1052961 1400592 951730 1067629 1190236 1175823
16944 1175823 1197598 1253199 1332999 1552634 1529867 1059259 1119530 1511807 1468682 1477832 1288280
16933 1288280 1046861 1298650 1069456 1236510 1452996 1226553 1264492 1677378 1423015 1355588
16923 1355588 1326182 1423069 1435335 1151268 1623172 1560594 1636729 1507937 1719296 1283311
$$ packed form
16994G19326P8913L5975Q8308j02018R3639k37252K27098l21043J98707m2954
16984G38699j10284M89741l80673J20368J20680k8582j16625l0443j9519K78797
16974A062159k73481L92367o5175j49q7934j19417j35976L72799k57447J97548
16964A085294k04338k85301L64197j60776J64812Q6579P2094J06413M7310J02081
16954A378365o34m62115L15573n1627j26601L47631m48862J15899J22607j4413
16944A175823K1775N5601P9800K19635k2767m70608O0271L92277m3125R150j89552
16933A288280k41419K51789k29194J67054K16486k26443L7939M12886k54363o7427
16923A355588k9406R6887J2266k84067M71904o2578P6135j28792K11359m35985
$$ plain form
16913 1283311 1594353 1560826 1490762 1864242 1608348 1862963 1407635 1787800 2086184 1553694
16903 1553694 1752997 1640530 1887518 1979573 2015047 1913402 1799553 2355561 2087507 1953121
16893 1953121 2054127 2251895 2280438 2083400 2317430 2348190 2196328 2138935 2161387 2447317
16883 2447317 2703952 2515603 2399553 2206712 2501609 2446960 2649459 2433202 2748009 2377848
16873 2377848 2633834 2761848 2665305 2746486 2978287 2784205 3351751 2920864 2962023 2952954
16863 2952954 2968468 3427595 3110196 3439419 3459428 3187364 3258582 3301833 3512581 3819197
16853 3819197 3836317 4025634 3764976 4106747 3658849 3847309 4033409 4350730 4196816 3991318
16843 3991318 4243172 4151672 4528909 4344413 4330588 4647002 4701418 4693352 5036609 4752776
$$ packed form
16913A283311L11042l3527p0064L73480k55894K54615m55328L80165K98384n32490
16903A553694J99303j12467K46988R2055L5474j01645j13849N56008k68054j34386
16893A953121J01006J97768K8543j97038K34030L0760j51862n7393K2452K85930
16883B447317K56635j88349j16050j92841K94897n4649K02499k16257L14807l70161
16873B377848K55986J28014r6543Q1181K31801j94082N67546m30887M1159r069
16863B952954J5514M59127l17399L29223K0009k72064P1218M3251K10748L06616
16853C819197J7120J89317k60658L41771m47898J88460J86100L17321j53914k05498
16843C991318K51854r1500L77237j84496j3825L16414N4416q066L43257k83833
$$ plain form
16833 4752776 5073979 5123647 5563827 4982562 5707549 5680050 5642196 5795799 5973305 5972179
16823 5972179 6020978 6171264 6202829 6381066 6392518 6622907 7022398 6935369 6759143 7386973
16813 7386973 7251035 7233746 7686179 8095758 8042044 8423966 8521149 8726329 8656252 9250086
16803 9250086 9380891 9515263 9687145 9674973 10273408 10277091 10638836 10612898 11049381 11376461
16793 11376461 11799594 12197703 12709487 12922186 12862015 13433865 14014803 13823861 14609643
16784 14609643 15216614 15619876 16003413 16832920 16799675 17617325 17985673 18604454 18989309
16775 18989309 19758737 20724641 21098322 21676599 22544696 23509527 24017396 24921387 25727039
16766 25727039 27207982 27446073 28621755 29738883 30964256 32129915 33068478 34643802
$$ packed form
16833D752776L21203M9668M40180n81265P24987k7499l7854J53603J77506j126
16823E972179M8799J50286L1565J78237J1452K30389L99491q7029j76226O27830
16813G386973j35938j7289M52433M09579n3714L81922R7183K05180p0077N93834
16803I250086J30805J34372J71882j2172N98435L683L61745k5938M36483L27080
16793A1376461M23133L98109N11784K12699o0171N71850N80938j90942P85782
16784A4609643O06971M03262L83537Q29507l3245Q17650L68348O18781L84855
16775A8989309P69428R65904L73681N78277Q68097R64831N07869R03991Q05652
16766B5727039J480943K38091J175682J117128J225373J165659R38563J575324
$$ plain form
16758 34643802 36023985 37387381 38884015 40566775 42221106 43846740 45802865 47530794
16750 47530794 49334054 51875444 53440824 56109477 58349736 60905659 63292220 65768498
16742 65768498 68587896 71596434 74258691 77306647 80368529 83391542 86363085 89198245
16734 89198245 92017268 95147890 97920304 100663898 103469496 105752408 108107104 109825295
16726 109825295 111553176 112554994 113436501 114173292 114151714 114160523 113683754 112810505 111489226
16717 111489226 109765014 108301974 105865019 103744862 101101100 98396796 95828429 92686540
16709 92686540 90176759 87065687 83840392 81222930 77982620 74999051 72523333 69723519
16701 69723519 66910340 64434153 61478560 59621437 57001272 54795132 52666112 50690449
$$ packed form
16758C4643802J380183J363396J496634J682760J654331J625634J956125J727929
16750D7530794J803260K541390J565380K668653K240259K555923K386561K476278
16742F5768498K819398L008538K662257L047956L061882L023013K971543K835160
16734H9198245K819023L130622K772414K743594K805598K282912K354696J718191
16726A09825295J727881J001818Q81507P36791k1578Q809m76769q73249j321279
16717A11489226j724212j463040k436955k120157k643762k704304k568367l141889
16709I2686540k509781l111072l225295k617462l240310k983569k475718k799814
16701F9723519k813179k476187k955593j857123k620165k206140k129020j975663
$$ plain form
16693 50690449 48938469 46570505 44813344 43298749 41589465 40000118 38433737 37072550
16685 37072550 35857569 34762145 33424456 32293302 31103661 29720287 28949027 28191067
16677 28191067 27005736 26019454 25400376 24245784 23761691 22996126 22355758 21414703 20933367
16668 20933367 20297398 19890006 19099937 18658279 18166833 17333861 16989711 16469144 16144941
16659 16144941 16042409 15572680 15146314 14637739 14243037 13572770 13223756 13117549 13211048
16650 13211048 12537368 12346472 12047942 11707627 11427303 11358880 11130485 10762665 10350529
16641 10350529 10197972 9858511 9968221 9620019 9184234 9076662 9210789 9002162 8566095
16632 8566095 8578708 8430561 8250073 8093343 7410134 7798297 7650782 7493101 7178705 7131690
$$ packed form
16693E0690449j751980k367964j757161j514595j709284j589347j566381j361187
16685C7072550j214981j095424j337689j131154j189641j383374p71260p57960
16677B8191067j185331r86282o19078j154592m84093p65565o40368r41055m81336
16668B0933367o35969m07392p90069m41658m91446q32972l44150n20567l24203
16659A6144941j02532m69729m26366n08575l94702o70267l49014j06207R3499
16650A3211048o73680j90896k98530l40315k80324o8423k28395l67820m12136
16641A0350529j52557l39461J09710l48202m35785j07572J34127k08627m36067
16632H566095J2613j48147j80488j56730o83209L88163j47515j57681l14396m7015
$$ plain form
16622 7131690 6923526 6998269 6606647 6447141 6530540 6380465 6095827 6021584 6295161 5891265
16612 5891265 5776178 5826270 5887812 5400066 5600843 5462109 5152771 5377061 5182861 5196576
16602 5196576 5097956 4911077 4848422 4718376 4620808 4580614 5023594 4718496 4217217 4738932
16592 4738932 4584246 4400093 4178897 4146983 4039813 3921359 3746524 3875712 3671263 3853879
16582 3853879 3539843 3878413 3637786 3648426 3628354 3340577 3250089 3540181 3310792 3381427
16572 3381427 3104630 3191502 3044267 3581245 3305755 3473900 3430023 3112233 3108155 2959683
16562 2959683 3340639 3161193 3055500 2935614 2722236 3115044 2824818 2946560 2872498 2546865
16552 2546865 3011034 2596898 2520625 2560246 2506682 2547479 2504113 2422948 2321223 2411803 2475023
$$ packed form
16622G131690k08164P4743l91622j59506Q3399j50075k84638p4243K73577m03896
16612E891265j15087N0092O1542m87746K00777j38734l09338K24290j94200J3715
16602E196576r8620j86879o2655j30046r7568m0194M42980l05098n01279N21715
16592D738932j54686j84153k21196l1914j07170j18454j74835J29188k04449J82616
16582C853879l14036L38570k40627J0640k0072k87777r0488K90092k29389P0635
16572C381427k76797Q6872j47235N36978k75490J68145m3877l17790m078j48472
16562B959683L80956j79446j05693j19886k13378L92808k90226J21742p4062l25633
16552B546865M64169m14136p6273L9621n3564M0797m3366q1165j01725R0580O3220
$$ plain form
16541 2475023 2437154 2444083 2309091 2450267 2394377 2258784 2412298 2477554 2206452 2161096
16531 2161096 2244449 2046957 2169485 2472050 2149182 2190689 2228214 1929664 2244601 2149594
16521 2149594 2061169 2000336 1985356 2116048 2115214 2011807 2083494 1819098 2072286 1668052 1604618
16510 1604618 1612634 1886475 1757545 1906964 1908432 1985629 1746562 2048558 2036043 1872574
16500 1872574 1858338 1761259 1575056 1461625 1636511 1436240 1654321 1957257 1714143 2100555
16490 2100555 1535795 1484107 1085636 1725922 1528894 1422370 1301133 1756837 1414953 1499591
16480 1499591 1778385 1256967 1388912 1326830 1400180 1431237 1493520 1347617 1379193 1521087
16470 1521087 1459066 1526492 1245133 1278740 1457555 1606510 1610647 1389442 1301078 1271286 1382223
$$ packed form
16541B475023l7869O929j34992J41176n5890j35593J53514O5256k71102m5356
16531B161096Q3353j97492J22528L02565l22868M1507L7525k98550L14937r5007
16521B149594q8425o0833j4980J30692q34j03407P1687k64396K53188m04234o3434
16510A604618Q016K73841j28930J49419J468P7197k39067L01996j2515j63469
16500A872574j4236r7079j86203j13431J74886k00271K18081L02936k43114L86412
16490B100555n64760n1688l98471O40286j97028j06524j21237M55704l41884Q4638
16480A499591K78794n21418J31945o2082P3350L1057O2283j45903L1576J41894
16470A521087o2021O7426k81359L3607J78815J48955M137k21205q8364k9792J10937
$$ plain form
16459 1382223 1161522 1134518 1537402 1296700 1217763 869822 1173002 1240271 1530737 1522752
16449 1522752 744990 1371400 907613 1373227 1170658 1306164 1101197 1439828 1195149
16440 1195149 1213388 1222228 1109916 1132766 1155022 1235625 1176432 862628 1528730 1242477 981005
16429 981005 1104931 923148 1278163 1245829 1015916 1278619 861240 1171252 1139676 964896
16419 964896 712949 1173927 1270071 1096280 1149639 996840 834318 874652 1086256 1036126
16409 1036126 1112215 1019057 1162975 880092 553009 1187732 1120454 961339 1010594 916222
16399 916222 896201 1266943 908105 1186605 1098456 809193 724070 727314 776971 715462 764772
16388 764772 776642 885321 1148281 775321 779480 1099756 871335 800113 910730 825077
$$ packed form
16459A382223k20701k7004M02884k40702p8937l47941L03180O7269K90466p985
16449A522752G44990O26410m63787M65614k02569J35506k04967L38631k44679
16440A195149J8239Q840j12312K2850K2256Q0603n9193l13804O66102k86253k61472
16429I81005J23926j81783L55015l2334k29913K62703m17379L10012l1576j74780
16419I64896k51947M60978R6144j73791N3359j52799j62522M0334K11604n0130
16409A036126P6089r3158J43918k82883l27083O34723o7278j59115M9255r4372
16399I16222k0021L70742l58838K78500q8149k89263q5123L244M9657o1509M9310
16388G64772J1870J08679K62960l72960M159L20276k28421p1222J10617q5653
$$ plain form
16378 825077 854453 878534 985097 752676 670156 855019 766602 1061808 931269 961587
16368 961587 1074401 1032026 1047531 769084 599840 686580 363163 769315 563715 688875
16358 688875 880088 468745 703825 951771 1233438 970169 697895 823748 714561 680489
16348 680489 775369 1051764 840504 538603 765092 470254 851071 548333 751160 907482
16338 907482 833581 688413 1057775 747892 470398 688862 569338 922227 836892 501381
16328 501381 751720 853399 676674 791087 820460 944294 503506 564725 657445 580928
16318 580928 887873 1018303 493583 946378 364175 635675 702194 875751 586046 1123396
16308 1123396 431101 897053 635990 704529 688664 629525 773832 532192 814412 596675
$$ packed form
16378H25077K9376K4081J06563k32421q2520J84863q8417K95206j30539L0318
16368I61587J12814m2375J5505k78447j69244Q6740l23417M06152k05600J25160
16358F88875J91213m11343K35080K47946K81667k63269k72274J25853j09187l4072
16348F80489R4880K76395k11260l01901K26489k94838L80817l02738K02827J56322
16338I07482p3901j45168L69362l09883k77494K18464j19524L52889q5335l35511
16328E01381K50339J01679j76725J14413K9373J23834m40788O1219R2720p6517
16318E80928L06945J30430D93583M52795C64175K71500O6519J73557k89705N37350
16308A123396D31101M65952k61063O8539j5865n9139J44307k41640K82220k17737
$$ plain form
16298 596675 882657 531498 793691 774978 598284 760704 374490 750167 563823 649165
16288 649165 730952 497780 561652 945566 656678 423683 662587 449893 607372 566155
16278 566155 594964 532906 437198 673804 878737 854809 415909 488418 230393 508808
16268 508808 508744 228420 453793 388782 601487 353943 504298 265395 498551 786704
16258 786704 619778 194672 555332 489529 554191 407885 671366 282055 263900 353164
16248 353164 333169 481966 360218 332260 453975 542171 313859 657050 670649 347852
16238 347852 488604 658041 175007 349818 377545 382125 525819 650440 572006 235265
16227 345659 393123 172380 262256 364495 371965 527582 573558 579394 202923 424348 731113
$$ packed form
16298E96675K85982l51159K62193j8713j76694J62420C74490L75677j86344Q5342
16288F49165Q1787k33172O3872L83914k88888k32995K38904k12694J57479m1217
16278E66155K8809o2058r5708K36606K04933k3928D15909P2509B30393K78415
16268E08808o4B28420K25373o5011K12705k47544J50355k38903K33156K88153
16258G86704j66926A94672L60660o5803O4662j46306K63481B82055j8155Q9264
16248C53164j9995J48797j21748k7958J21715Q8196k28312L43191J3599l22797
16238C47852J40752J69437A75007J74811K7727M580J43694J24621p8434B35265
16227C45659M7464A72380Q9876J02239P470J55617M5976N836B02923K21425L06765
$$ plain form
16216 731113 682601 531997 511745 567888 534389 262378 236692 372309 722545 396516
16206 396516 396590 472337 437325 607965 371282 385482 479257 514576 469657 387038 482827 417916
16194 417916 368578 429882 178957 153503 73458 556064 413499 382809 86007 504213 543523
16183 543523 -90822 330229 346364 454532 444862 10573 677803 281608 326684 367182 215801
16172 215801 228880 320046 43585 63663 582844 255222 355679 216914 320660 -61761
16161 584099 142880 520928 226302 281536 270720 113026 270793 363421 302030 369508
16151 369508 153786 120658 66997 236891 327781 349617 235166 306309 443781 460187 -2673
16139 416482 285951 175200 373414 154614 350503 342919 182201 306640 131654 94738
$$ packed form
16216G31113m8512j50604k0252N6143l3499B62378k5686J35617L50236l26029
16206C96516P4P5747l5012J70640k36683J4200R3775L5319m4919q2619R5789o4911
16194D17916m9338O1304A78957k5454G3458M82606j42565l0690H6007M18206L9310
16183E43523i0822C30229J6135J08168r670A0573O67230B81608M5076M0498j51381
16172B15801J3079R1166D3585K0078N19181B55222J00457j38765J03746f1761
16161E84099A42880L78048B26302N5234j0816A13026J57767R2628o1391O7478
16151C69508A53786l3128n3661J69894R0890K1836j14451P1143J37472J6406b673
16139D16482j30531j10751J98214A54614J95889p584j60718J24439A31654l6916
$$ plain form
16129 94738 217112 138402 156568 86915 251617 134983 302205 175036 197562 -67616 5649
16117 349648 605000 293891 79547 424486 396740 35812 138796 413554 240555 308912
16107 308912 -191937 93109 60989 191567 -71305 301254 287156 420186 44113 342041
16097 342041 271630 -120756 439655 63725 14075 -22547 -7243 58428 106680 172611 470660
16086 470660 298532 146481 105953 253328 -72625 266438 223255 143803 -5957 508174 196427
16074 93504 172606 395691 170626 298302 -54014 262039 380379 176276 -206321 -17156
16063 -62388 307792 200174 -23364 162707 87854 220866 295095 -232618 -153921 160626
16052 790 313406 11396 -174591 214379 218235 190084 366077 289792 249371 26757 465181
$$ packed form
16129I4738J22374p8710J8166o9653J64702j16634J67222j27169K2526f7616E649
16117C49648K55352B93891G9547L44939k7746C5812J02984K74758j72999O8357
16107C08912a91937I3109l2120J30578g1305C01254j4098J33030D4113K97928
16097C42041p0411a20756D39655F3725A4075b2547g243E8428M8252O5931K98049
16086D70660j72128A46481m0528J47375g2625B66438m3183p9452e957E08174A96427
16074I3504P9102K23085A70626J27676e4014B62039J18340A76276b06321a7156
16063f2388C07792j07618b3364A62707p4853J33012P4229b32618P8697A60626
16052G90L12616A1396a74591B14379L856k8151J75993p6285m0421B6757M38424
$$ plain form
16041 465181 259725 247801 -113156 376662 256394 16975 117277 137693 118781 193382
16031 193382 341236 168190 64651 198842 50344 -52782 172671 147546 155505 254521 255144
16020 255144 83708 24149 -15749 120717 10031 48764 106795 78912 22568 -317846 -101387
16008 61434 -363828 293680 66523 -140728 62118 -317955 146954 120654 260132 -196298
15997 155095 210540 -3649 320916 -93222 268142 74292 -70660 142497 116414 673947 468308
15986 468308 981215 834724 825281 751020 212168 -52294 310821 48060 70311 -398152 295966
15974 -282182 415605 -94462 173725 -82833 172081 268590 -37423 -125418 222337 -2063 -8444
15963 -8444 -23927 -181400 205943 24221 81408 168930 -5963 -100144 225355 -178964 30455
$$ packed form
16041D65181k05456j1924a13156C76662j20268A6975J00302K0416j8912P4601
16031A93382J47854A68190F4651J34191E0344e2782A72671k5125P959R9016O23
16020B55144H3708B4149a5749A20717A0031L8733N8031k7883B2568c17846a01387
16008F1434c63828B93680F6523a40728F2118c17955A46954k6300J39478a96298
15997A55095N5445c649C20916i3222B68142G4292g0660A42497k6083N57533k05639
15986D68308N12907j46491r443p4261B12168e2294C10821D8060K2251c98152B95966
15974b82182D15605i4462A73725h2833A72081R6509c7423q7995B22337b063o381
15963h444j5483j57473B05943B4221N7187Q7522e963r4181B25355a78964C0455
$$ plain form
15951 -9640 -22170 1963 -201049 -19357 76486 -58082 -1658 231233 107936 56870 -23632 -237858
15939 -237858 -211341 201160 -116408 -230669 305065 119176 -301944 191404 -6848 189678
15928 -38681 11297 340 211314 -155084 -31511 163502 -102138 196276 -284050 17294 -226593
15916 176662 -13593 108140 -184862 -136037 -82677 -123452 -189843 65729 -104682 -310847 170390
15904 120214 163654 260877 -76256 286914 238506 186034 33607 26989 98899 -63251 76568
15892 98952 -117562 -46161 -43057 174837 144987 -11744 51224 134045 134933 -10083 117380 -64034
15879 236415 -22378 -16504 -6375 88269 55237 236142 82084 184942 -66709 357559 -4523
15867 -227843 -145701 -193357 257452 -168201 -63597 -67004 -409124 -40758 -120110 38890 -100178
$$ packed form
15951i640j2530A963b01049a9357G6486e8082a658B31233A07936n1066b3632k14226
15939b37858K6517B01160a16408j14261C05065A19176c01944A91404f848A89678
15928c8681A1297C40K10974a55084c1511A63502a02138A96276b84050A7294b26593
15916A76662a3593A08140a84862M8825N3360m0775o6391F5729a04682k06165A70390
15904A20214M3440R7223g6256B86914m8408n2472C3607o618P1910f3251G6568
15892I8952a17562d6161L104A74837k9850a1744E1224Q2821Q88a0083A17380f4034
15879B36415b2378N874f375H8269l3032J80905H2084J02858f6709C57559d523
15867b27843Q2142m7656B57452a68201f3597l407l42120d0758p9352C8890a00178
$$ plain form
15855 94356 91843 -239833 119026 46343 85147 103923 89350 40519 1176 -91555 -158314 -120058
15843 -120058 -38856 -203018 9372 117459 -244442 33404 -189872 232127 17871 184582
15833 184582 -169202 -11604 133288 74590 -48833 -200792 -72111 -228849 -129581 -22484 67327
15821 -110268 -115076 -86722 132652 -369983 -85497 141961 -377448 216854 130402 -142467
15810 105486 -49688 218920 209826 -132519 -238930 -193076 -24721 -65428 112602 -206942 116395
15798 -111272 -363402 -263227 -188269 -209587 -114830 -277133 261119 34087 108505 -127061
15787 -89345 102972 -47790 284368 57020 -220396 -527367 -49363 -305337 -354712 -95663 -109621
15776 -109621 134694 245070 166164 56347 334673 -134531 1910 -27959 -204058 202635
$$ packed form
15855I4356k513b39833A19026D6343L8804J8776j4573D0519A176i1555o6759L8256
15843a20058c8856j64162I372J08087b44442C3404a89872B32127A7871J66711
15833A84582a69202a1604A33288n8698d8833j51959g2111j56738R9268b2484F7327
15821a10268m808K8354A32652c69983h5497A41961c77448B16854q6452a42467
15810A05486d9688B18920r094a32519j06411M5854b4721m0707A12602b06942A16395
15798a11272k52130J00175P4958k1318R4757j62303B61119C4087P4418a27061
15787h9345A02972d7790B84368E7020b20396l06971d9363k55974m9375i5663j3958
15776a09621A34694J10376p8906E6347K78326a34531A910b7959j76099B02635
$$ plain form
15765 245942 -178818 -8911 -50165 133742 -71771 -68960 92514 469655 307118 -7069 34198
15753 239591 -26676 81410 110196 2860 220932 -176959 119934 -17776 164085 -32520 30839
15741 182258 -44089 204772 -70439 194844 -158351 149332 86811 -99319 50406 32936 37151
15730 37151 -108984 168653 165336 -175 -218864 -199198 -80692 111257 132401 151685 25983
15718 -156882 381408 99399 -298888 -262084 -90293 -259993 98560 388604 -76462 -39857 50444
15706 -260029 -55668 -97362 53275 -19240 -76700 -95337 -260181 -102648 78987 -4162 49240
15694 -19255 379934 -272721 -108179 -62094 132854 -5243 70323 307533 18148 189667 -307424
15682 -214291 -202721 -173869 -175122 258578 -10528 -161003 159988 -123718 -38771 289648 -4482
$$ packed form
15765B45942a78818h911m1254A33742g1771K811I2514L77141j62537g069C4198
15753B39591b6676H1410K8786B860K18072a76959A19934a7776A64085c2520C0839
15741A82258d4089B04772g0439A94844a58351A49332o2521i9319E0406j7470M215
15730C7151a08984A68653l317a75k18689J9666h0692A11257K1144J9284B5983
15718a56882C81408I9399b98888L6804i0293j69700I8560K90044g6462L6605E0444
15706b60029e5668m1694E3275a9240n7460j8637j64844a02648G8987d162D9240
15694a9255C79934b72721a08179M6085A32854e243G0323K37210A8148J71519c07424
15682b14291J1570K8852j253B58578a0528j50475A59988a23718c8771B89648d482
$$ plain form
15670 -160064 -251516 229947 -194093 -111762 139760 -47240 -39026 -211832 20648 -87890 94084
15658 -160614 -175805 233897 -120259 -93856 -148994 -333759 -214932 138375 -334142 -145450
15647 -45838 -114892 -127549 226521 -73017 -89432 -70440 10706 -143359 -96131 -87019 50859
15635 13026 112460 126810 66608 -239183 138715 -8533 -140 103804 30881 -68584 -236050
15624 -236050 -234836 -166659 62263 65631 50707 -159278 -197844 134465 8418 5630 -9837 60724
15611 -139040 -234048 106533 -206945 -128278 2315 -188597 278274 156917 139625 245892
15601 245892 -265872 -74003 194957 -257866 165206 66092 -189707 27836 -20874 -49166
15591 -49166 96125 -70808 -191408 173971 -250611 -249303 -110444 -137976 235696 209312 -96067
$$ packed form
15670a60064r1452B29947a94093Q2331A39760d7240Q214j72806B0648h7890I4084
15658a60614j5191B33897a20259K6403n5138j84765J18827A38375c34142a45450
15647d5838o9054j2657B26521g3017j6415J8992A0706a43359M7228R112E0859
15635A3026R9434J4350o0202b39183A38715h533a40A03804C0881f8584j67466
15624b36050J214O8177F2263L368j4924a59278l8566A34465H418k788i837F0724
15611a39040r5008A06533b06945P8667B315a88597B78274j21357j7292J06267
15601B45892b65872g4003A94957b57866A65206F6092a89707B7836b0874k8292
15591d9166I6125g0808j20600A73971b50611J308a10444k7532B35696k6384i6067
$$ plain form
15579 -71937 -65995 19631 245529 -64393 -213512 57384 83642 -226454 -154108 234797 343414
15568 343414 38663 118389 -22413 156196 -6918 -10246 -146364 94244 -98812 19120 114622
15557 114622 -125793 -70894 1093 55183 7768 -224881 -13119 65825 -323075 235884 189196
15546 189196 110298 -59523 -67590 -174336 -181136 -37841 295033 -15251 -5688 250530 -182955
15534 -230890 -99016 232739 137701 -304117 269148 -70501 -282640 -293519 -320491 -32077 115357
15522 49849 -215772 -129172 -103437 371726 154004 44896 -213713 192830 -1504 81934 78957
15511 78957 -159131 -231589 -122054 -11340 15604 53562 -94258 316607 14532 -4602 -55887
15500 -55887 145670 -85189 -180079 466580 -108771 -208541 289529 12951 76171 -148031 213589
$$ packed form
15579g1937N942A9631K25898f4393j49119E7384K6258b26454P2346B34797J08617
15568C43414C8663P9726b2413A56196f918l328j36118I4244i8812A9120R5502
15557A14622a25793N4899A093N4090G768b24881a3119F5825c23075B35884m6688
15546A89196p8898e9523q067j06746o800c7841B95033a5251e688B50530a82955
15534b30890i9016B32739r5038c04117B69148g0501k12139j0879k6972c2077A15357
15522D9849b15772Q6600K5735C71726A54004D4896b13713A92830a504H1934k977
15511G8957a59131p2458J09535a1340A5604L7958i4258C16607A4532d602n1285
15500e5887A45670h5189r4890D66580a08771r9770B89529A2951O3220a48031B13589
$$ plain form
15488 162854 135677 75479 -287953 -220846 -42033 -164023 173138 179462 41151 164506 -176252
15476 -148411 -71263 36741 116829 164291 67580 284799 -88122 162879 27691 23013 99813
15465 99813 64235 280019 -97007 104091 -170096 -340689 -74150 35858 -108657 18770 175255
15454 175255 -97172 45206 103386 172672 -10653 60553 -126640 -45359 -141165 -75868 264266
15442 168050 433627 466822 457088 615617 36919 221878 290095 480142 238026 53490 -42218
15430 -150959 329708 215059 52296 -129378 -305125 110067 -83301 -8957 71507 94680 -72476
15418 23988 -220588 -172657 -187631 -182568 -41732 260523 -98107 110486 111387 22058 3898 49638
15406 49638 -217092 -95308 97827 -103816 -55368 29799 73716 55793 -80323 -206891 52171
$$ packed form
15488A62854k7177o0198b87953O7107d2033j21990A73138O324D1151J23355a76252
15476a48411g1263C6741Q0088M7462F7580K17219h8122A62879B7691m678P6800
15465I9813l5578K15784i7007A04091a70096j70593g4150C5858a08657A8770J56485
15454A75255i7172D5206N8180O9286a0653F0553a26640d5359r5806O5297B64266
15442A68050K65577L3195r734J58529C6919J84959O8217J90047B38026E3490d2218
15430a50959C29708j14649E2296a29378j75747A10067h3301h957G1507K3173g2476
15418B3988b20588M7931j4974N063d1732B60523i8107A10486R01B2058C898M5740
15406D9638b17092i5308I7827a03816M8448B9799M3917j7923h0323j26568E2171
$$ plain form
15394 -72859 44735 255040 237678 54947 103947 271896 -40527 -55819 -34551 40454 -185334
15382 270130 -16885 -260622 -21567 -199644 -96716 537642 -30440 -16772 112094 230479
15372 230479 120923 349156 40431 262825 187546 155873 260714 82179 50615 -97774 -99544
15361 -99544 124057 41362 139338 21186 -24053 101187 -267222 -18752 3250 -175444 -100474
15350 -100474 1843 -192279 237695 -70689 231925 -165693 -75834 308436 -76964 117240
15339 204074 180890 -201546 115772 258580 -132346 13385 93058 144709 81348 233182
15329 233182 142883 -156100 84691 -39356 101764 -204751 12110 147539 -301935 -27031
15318 -74032 -302089 123271 -65726 499991 28024 -237515 -83679 -55968 -48487 10709 137274
$$ packed form
15394g2859D4735K10305j7362E4947M9000J67949d0527j5292K1268D0454a85334
15382B70130a6885k43737b1567j78077i6716E37642c0440J3668A12094J18385
15372B30479j09556K28233D0431K22394p5279l1673J04841H2179l1564i7774j770
15361i9544A24057D1362R7976B1186b4053A01187b67222a8752C250a75444P4970
15350a00474A843a92279B37695g0689B31925a65693g5834C08436g6964A17240
15339B04074k3184b01546A15772J42808a32346A3385P9673N1651o3361J51834
15329B33182r0299a56100H4691c9356A01764b04751A2110J35429c01935b7031
15318g4032k28057A23271f5726D99991B8024b37515h3679K7711P481A0709J26565
$$ plain form
15307 137274 113545 79375 229562 -75185 243827 -9364 -4526 -181194 84730 30120 156160
15296 156160 115344 -22468 85736 -21912 94877 22120 -87175 -329822 -58964 -24262 -104560
15285 -104560 -107727 -115279 508200 129357 157856 148145 57374 243017 47538 359406 349295
15274 349295 -149707 -142041 102733 53427 3719 -1705 -16132 -29534 118726 -295774 -68598
15262 -409549 83456 -215671 178817 -99336 116675 -6650 48067 -70126 -89537 -53416 138995
15250 519194 520942 612112 1103711 353938 778255 568788 34050 -50611 81765 -44641 -81069
15239 -81069 2970 -56083 -75651 167443 1074 -240592 -100120 -36165 7323 -38838 125417
15227 257808 -78445 -39814 243596 37385 -389225 18364 -185856 -4116 -14879 474 -14939
$$ packed form
15307A37274k3729l4170J50187g5185B43827i364d526j76668H4730C0120J26040
15296A56160m0816b2468H5736b1912I4877B2120h7175k42647e8964b4262q0298
15285a04560l167p552E08200A29357K8499r711E7374J85643D7538L11868j0111
15274C49295a49707P666A02733m9306C719a705j4427j3402A18726b95774f8598
15262d09549H3456b15671A78817i9336A16675f650D8067g0126j9411L6121A38995
15250E19194J748R1170M91599C53938M24317k09467C4050e0611H1765d4641l6428
15239h1069B970e6083j9568A67443A074b40592a00120c6165G323c8838A25417
15227B57808g8445L8631B43596C7385c89225A8364a85856d116j0763D74a4939
$$ plain form
15215 74849 -4405 44637 -99845 126352 129706 -328195 -209724 -64674 -313131 177547 -134783
15203 -8707 313547 360914 91150 -40908 -41994 -156610 -21452 -34854 259466 20837 -71150
15191 56362 404912 -270813 -263198 -67695 -5377 138419 554085 -159628 2514 -214562 103040
15179 47213 80703 -212261 171038 -4970 -138620 -98550 278748 83350 -50432 -56611 73924
15167 -40491 28313 195577 161915 159688 374351 -20710 103911 -61964 100581 -37206 -28052
15156 -28052 -80538 -70178 150732 124838 150508 251996 84274 150890 247594 202330 -348209
15144 -340265 35250 150028 -219940 -28903 76059 58918 223376 363768 469405 165002
15133 59029 -117411 -216355 149824 116009 231702 -107705 187521 173441 105981 179175 431415
$$ packed form
15215G4849d405D4637i9845A26352L354c28195J18471f4674k48457A77547a34783
15203h707C13547M7367I1150d0908j086j14616b1452j3402B59466B0837g1150
15191E6362L48550b70813P615f7695e377A38419M15666a59628B514b14562A03040
15179D7213L3490b12261A71038d970j33650M0070B78748H3350e0432o179G3924
15167d0491B8313J67264l3662k227K14663b0710A03911f1964A00581c7206R154
15156b8052n2486J0360A50732k5894K5670J01488H4274O6616R6704m5264c48209
15144c40265C5250J14778b19940b8903G6059j7141J64458J40392J05637A65002
15133E9029a17411r8944A49824l3815J15693a07705A87521j4080o7460P3194K52240
$$ plain form
15122 431415 346403 179904 28329 -16465 192189 79516 -48840 93863 427612 -149929 -58442
15110 -82639 379267 -275992 -259849 -28208 -36701 -82845 24102 165466 -154489 -45645 -66515
15099 -66515 23190 69234 269315 -325013 197135 60230 60118 -298012 188633 168814 -26580
15087 208429 -125334 125837 179454 302350 -148758 87106 -119149 34510 -43024 319195
15076 -220455 33844 7794 -33961 44169 123388 196683 -5036 88374 48450 151458 295959
15065 295959 -8379 178679 -17253 -216596 -94346 73965 818 10996 81764 322630 94334
15053 182594 368169 320696 33453 -331770 388175 279691 138981 104590 242176 152100
15043 152100 125202 -81941 241694 50474 362979 -185463 167364 177830 487149 97370
$$ packed form
15122D31415q5012j66499B8329a6465A92189G9516d8840I3863L33749a49929e8442
15110h2639C79267b75992J6143b8208q493m6144B4102J41364a54489d5645k0870
15099f6515B3190M6044K00081c25013A97135F0230j12b98012A88633j9819b6580
15087B08429a25334A25837N3617J22896a48758H7106a19149C4510d3024C19195
15076b20455C3844G794c3961D4169P9219P3295e036H8374l9924J03008J44501
15065B95959h379A78679a7253j99343i4346G3965H18J0178P0768K40866I4334
15053A82594J85575m7473C3453c31770C88175j08484A38981l4391J37586r0076
15043A52100k6898h1941B41694E0474L12505a85463A67364J0466L09319I7370
$$ plain form
15032 226019 103277 134974 261418 532694 191217 279449 633943 291086 -20615 373165
15021 161970 398989 166294 -45603 317301 288477 336603 70336 510642 205812 191770
15011 191770 432758 253694 -57824 369220 278357 153462 510553 112925 248565 55950
15000 -70739 94799 192499 192657 153830 214503 207030 392107 447811 117241 83760 65527 237092
14988 237092 48097 322492 338817 391212 269893 784624 295598 354040 388477 363457 395870
14977 395870 376156 462093 128049 402482 348806 116441 62134 379343 487909 384343
14967 384343 549145 -140062 626583 99648 4676 336994 69728 167406 126337 141432 90559
14956 90559 -81202 254772 -223778 -439 184020 139648 -29151 185467 11716 151939 303434
$$ packed form
15032B26019A03277L1697J26444K71276A91217Q8232L54494B91086b0615C73165
15021A61970K37019A66294d5603C17301k8824M8126G0336M40306B05812j4042
15011A91770K40988j79064e7824C69220r0863j24895L57091A12925J35640E5950
15000g0739I4799R7700J58l8827O0673p473J85077N5704A17241l3481j8233J71565
14988B37092D8097K74395J6325N2395j21319N14731B95598N8442L4437k5020L2413
14977C95870j9714Q5937A28049K74433n3676A16441n4307L17209J08566j03566
14967C84343J64802a40062F26583I9648D676L32318F9728R7678m1069J5095n0873
14956I0559h1202B54772b23778d39A84020m4372b9151A85467A1716J40223J51495
$$ plain form
14945 303434 364257 193526 391080 368383 481982 244835 559515 515299 260439 296571
14935 296571 238368 118257 113420 44640 171424 385330 576174 674174 797661 681799
14925 681799 835318 639333 909045 824818 783430 817851 757442 574860 537571 811992
14915 811992 1243949 1151008 768039 650458 734310 935636 364717 667197 360206 197525
14905 197525 276037 514023 320253 108 138954 165544 230123 313366 44056 114994 388314
14894 388314 237719 213676 433167 456188 206421 199062 291023 446863 177019 527815
14884 527815 359829 243049 562927 238579 720553 396889 80649 768590 300013 451070
14874 451070 549613 443387 524324 502121 356494 272525 584905 397088 621388 301818
$$ packed form
14945C03434O0823j70731J97554k2697J13599k37147L14680m4216k54860L6132
14935B96571n8203A18257m837D4640J26784K13906J90844R8000J23487j15862
14925F81799J53519j95985K69712q4227m1388L4421o0409j82582l7289K74421
14915H11992M31957r2941l82969j17581Q3852K01326C64717L02480l06991j62681
14905A97525P8512K37986j93770A08J38846K6590O4579Q3243D4056P0938K73320
14894C88314j50595k4043K19491K3021B06421p359R1961J55840A77019L50796
14884E27815j67986j16780L19878B38579M81974l23664H0649O87941C00013J51057
14874D51070R8543j06226Q0937k2203j45627q3969L12380j87817K24300C01818
$$ plain form
14863 546436 233095 200969 248355 256509 647308 164730 119338 190000 97915 476940 192205
14851 157162 434718 669540 160743 406500 227646 199594 313769 250787 322220 626740
14841 626740 429631 524911 568258 675648 948687 922468 870940 763115 446729 325138
14831 325138 305989 131995 77348 456708 269894 104609 412613 49666 372022 362493
14821 362493 648302 550217 689356 64267 217933 339419 443394 664476 564782 344777
14811 344777 292098 416810 132086 449584 423579 450030 231744 -2808 -12477 529635 568484
14800 568484 736648 449864 765818 385606 359096 419714 704468 262429 524577 449931
14790 449931 273502 184706 542837 808329 583482 476768 547350 488656 252679 727863
$$ packed form
14863E46436B33095l2126M7386Q154L90799A64730m5392P0662r2085L79025A92205
14851A57162K77556K34822A60743K45757j78854k8052J14175o2982P1433L04520
14841F26740j97109R5280M3347J07390K73039k6219n1528j07825l16386j21591
14831C25138j9149A31995n4647L79360j86814A04609L08004D9666L22356r529
14821C62493K85809r8085J39139F4267J53666J21486J03975K21082r9694k20005
14811C44777n2679J24712A32086L17498k6005K6451k18286b808r669E29635L8849
14800E68484J68164k86784L15954l80212k6510O0618K84754B62429K62148p4646
14790D49931j76429q8796L58131K65492k24847j06714P0582n8694k35977M75184
$$ plain form
14780 727863 294135 287972 606149 159789 401774 135727 341032 339769 532783 538938 650850
14769 650850 803544 572620 462723 322718 37311 565057 636338 231823 403526 448811
14759 448811 417057 142381 802439 438377 608735 366436 402174 442073 140972 363605
14749 363605 758747 783798 372632 529833 427648 162339 603759 616053 680970 708534
14739 708534 555802 445927 612517 800982 390701 373285 554846 695614 995533 358277
14728 689135 562755 925966 568155 623426 954525 951777 876188 859318 838554 958224 718231
14717 718231 345336 344293 603017 503892 751512 756174 582083 655092 506673 666334 504156
14706 504156 899581 549065 900278 713555 578056 622620 660749 578058 762830 1248609
$$ packed form
14780G27863B94135o163L18177A59789K41985A35727K05305j263J93014O155J11912
14769F50850J52694k30924j09897j40005C7311N27746P1281B31823J71703M5285
14759D48811l1754A42381O60058l64062J70358k42299L5738L9899A40972K22633
14749C63605L95142K5051C72632J57201j02185A62339M41420J2294O4917K7564
14739G08534j52732j09875J66590J88465C90701j7416J81561J40768K99919C58277
14728F89135j26380L63211l57811N5271L31099k748p5589j6870k0764J19670k39993
14717G18231C45336j043K58724r9125K47620M662j74091P3009j48419J59661j62178
14706E04156L95425l50516L51213j86723j35499M4564L8129q2691J84772M85779
$$ plain form
14696 1248609 1100919 910501 974393 923773 847563 845432 514548 560127 603149 347553 568109
14685 568109 701984 718980 529167 667717 713579 899782 698939 541041 511537 564678
14675 564678 620981 855658 484509 712525 502510 452827 724794 779108 800990 627247
14665 627247 686125 758511 580262 914354 713556 678683 533487 514332 740003 636705
14655 636705 875132 956067 909366 840034 752827 961573 895278 686385 879196 1038146
14645 1038146 1126713 972049 678677 617175 849573 800290 916279 858235 1011350 1042827
14635 1042827 1070776 1376378 853027 943750 1095072 854577 1053996 668028 1064327 840210
14625 840210 1023534 891191 813255 1030065 866117 996711 807912 901293 890635 957719
$$ packed form
14696A248609j47690j90418O3892n0620p6210k131l30884M5579M3022k55596K20556
14685E68109J33875J6996j89813J38550M5862J86203k00843j57898k9504N3141
14675E64678N6303K34677l71149K28016k10015m9683K71967N4314K1882j73743
14665F27247N8878P2386j78249L34092k00798l4873j45196j9155K25671j03298
14655F36705K38427Q0935m6701o9332q7207K08746o6295k08893J92811J58950
14645A038146Q8567j54664k93372o1502K32398m9283J15989n8044J53115L1477
14635A042827K7949L05602n23351R0723J51322k40495J99419l85968L96299k24117
14625H40210J83324j32343p7936K16810j63948J30594j88799R3381j0658O7084
$$ plain form
14615 957719 938745 1232307 912444 700976 1461355 831463 1075877 1165179 1109513 989214
14605 989214 1043897 1007412 1386182 1026263 958986 949148 960588 1364387 1233277 1281661 1269021
14594 1269021 1258946 1158609 1261861 873826 1037183 1532447 1194400 1310150 1369388 1370301
14584 1370301 1379114 1460174 1075956 1290753 1238362 1638815 1516979 1641323 1774635 1257150
14574 1257150 1488601 1587520 1312236 1608264 1677309 1460112 1492558 1631991 1712054 1818114
14564 1818114 1467033 1769587 1737154 1842753 2002494 2099823 1977627 2029326 1997579 2336254
14554 2336254 2767901 2463411 2993211 3679460 4729079 6545102 11070707 18364180 31874996
14545 31874996 32295613 18903413 7872893 3847326 2342053 2322643 1627582 1618229 1575508
$$ packed form
14615I57719j8974K93562l19863k11468P60379o29892K44414Q9302n5666j20299
14605I89214N4683l6485L78770l59919o7277r838J1440M03799j31110M8384j2640
14594A269021j0075j00337J03252l88035J63357M95264l38047J15750N9238R13
14584A370301Q813Q1060l84218K14797n2391M00453j21836J24344J33312n17485
14574A257150K31451R8919k75284K96028O9045k17197L2446J39433Q0063J06060
14564A818114l51081L02554l2433J05599J59741R7329j22196N1699l1747L38675
14554B336254M31647l04490N29800O86249J049619J816023M525605P293473J3510816
14545C1874996M20617j3392200G872893C847326j505273j9410o95061r353m2721
$$ plain form
14536 1575508 1639557 1106246 1547530 1231188 1501803 1734775 1315988 2012707 1478933 1506832
14526 1506832 1752337 1451318 1600544 1831632 1591247 1648455 1747436 1802127 1859504 1608470
14516 1608470 1818284 1993911 1954350 1788247 2073926 1891413 1985512 1864911 2206255 2092990
14506 2092990 2155254 2205466 2032865 2154921 2459764 2231805 2438938 2502129 2113435 2255020
14496 2255020 2322934 2554487 2303807 2457176 2346398 2551935 2294729 2556660 2411419 2723073
14486 2723073 2739615 2395415 2661229 2605828 2978772 2853419 2626585 2703752 2924330 2924636
14476 2924636 2714708 2691655 3138181 3439526 2993133 3040023 2948733 3256491 3512769 3356205
14466 3356205 3219496 3735742 3277851 3027254 3261015 3370393 3309488 3710369 3521928 3883011
$$ packed form
14536A575508O4049n33311M41284l16342K70615K32972m18787O96719n33774K7899
14526A506832K45505l01019J49226K31088k40385N7208R8981N4691N7377k51034
14516A608470K09814J75627l9561j66103K85679j82513R4099j20601L41344j13265
14506B092990O2264N0212j72601J22056L04843k27959K07133O3191l88694J41585
14496B255020O7914K31553k50680J53369j10778K05537k57206K61931j45241L11654
14486B723073J6542l44200K65814n5401L72944j25353k26834P7167K20578L06
14476B924636k09928k3053M46526L01345m46393M6890r1290L07758K56278j56564
14466C356205j36709N16246m57891k50597K33761J09378o0905M00881j88441L61083
$$ plain form
14456 3883011 3661683 3626795 4166658 3418797 3953084 3804364 4053379 3946490 4077770 4112270
14446 4112270 4115423 4254292 4303314 4410174 4503087 4406529 4518656 4565593 4638904 4271710 4511099
14435 4511099 4589828 4927545 4755489 4783953 4758207 4879750 5070312 5205332 5303310 5881421
14425 5881421 5619908 5493234 5317156 5588466 5533534 6009093 5961902 5889553 6189352 6317592
14415 6317592 6656431 6509437 6677789 6327724 6716755 6623864 6920980 7069498 7209795 7115799
14405 7115799 7612292 7516337 7504446 7509527 7766926 7723857 7850620 8240995 8434410 8151013
14395 8151013 8738651 8920760 8837277 8560445 9077634 8972294 9333661 9264397 9593558 9707356
14385 9707356 9952213 9853992 10401916 10262499 10935373 10772224 11326053 11340672 11808267 11817066
$$ packed form
14456C883011k21328l4888N39863p47861N34287j48720K49015j06889J31280L4500
14446D112270L153J38869M9022J06860R2913r6558J12127M6937P3311l67194K39389
14435D511099P8729L37717j72056K8464k5746J21543J90562J35020R7978N78111
14425E881421k61513j26674j76078K71310n4932M75559m7191p2349K99799J28240
14415F317592L38839j46994J68352l50065L89031r2891K97116J48518J40297r3996
14405G115799M96493r5955j1891N081K57399m3069J26763L90375J93415k83397
14395H151013N87638J82109q3483k76832N17189j05340L61367o9264L29161J13798
14385I707356K44857r8221N47924j39417O72874j63149N53829J4619M67595Q799
$$ plain form
14375 11817066 12072580 11978991 12267541 12751218 12894268 12981811 13249537 13863782 14093200 14348526
14365 14348526 14613734 14934435 15116545 15582137 16222684 16186894 16639607 16722183 17147837 17844892
14355 17844892 18324860 18019917 19179120 19277518 19850515 20461565 20616284 21472501 21911893
14346 21911893 22116398 22939601 23798486 24265968 24645141 25416224 26047020 26991148 27764248
14337 27764248 28479533 29477697 30173781 31484104 31652003 33269272 33864990 34917493 36195800
14328 36195800 37283649 38911697 39862705 41234456 42600192 44295787 45725573 47561012
14320 47561012 49169739 51142936 52765372 54905607 57152818 59237197 61613780 64148395
14312 64148395 66474899 69645845 72215069 75671937 79163147 82854859 86056661 90397874
$$ packed form
14375A1817066K55514r3589K88550M83677J43050Q7543K67726O14245K29418K55326
14365A4348526K65208L20701J82110M65592O40547l5790M52713Q2576M25654O97055
14355A7844892M79968l04943J159203R8398N72997O11050J54719Q56217M39392
14346B1911893K04505Q23203Q58885M67482L79173P71083O30796R44128P73100
14337B7764248P15285R98164O96084J310323J67899J617269N95718J052503J278307
14328C6195800J087849J628048R51008J371751J365736J695595J429786J835439
14320D7561012J608727J973197J622436K140235K247211K084379K376583K534615
14312F4148395K326504L170946K569224L456868L491210L691712L201802M341213
$$ plain form
14304 90397874 94739056 99275397 104080525 109378586 114799765 120778174 127228914 133917885
14296 133917885 141166782 148732711 157222818 166173672 175441279 185729143 196244574 207543666
14288 207543666 219516540 232383972 245958642 260082276 275013922 290429833 306427358
14281 306427358 322695227 338832240 355206764 370565037 385924690 399927430 412777214
14274 412777214 422788845 427979986 430049040 431850067 433221396 432027568 432964740 431328618
14266 431328618 425006742 415239965 403415354 389191360 374059961 357993625 341277060
14259 341277060 324729904 308033268 292362381 276813779 261924847 247886364 234039119
14252 234039119 221048134 209164981 197454604 186370959 176500657 166686693 158054834
$$ packed form
14304I0397874M341182M536341M805128N298061N421179N978409O450740O688971
14296A33917885P248897P565929Q490107Q950854R267607J0287864J0515431J1299092
14288B07543666J1972874J2867432J3574670J4123634J4931646J5415911J5997525
14281C06427358J6267869J6137013J6374524J5358273J5359653J4002740J2849784
14274D12777214J0011631N191141K069054J801027J371329j193828R37172j636122
14266D31328618o321876r766777j1824611j4223994j5131399j6066336j6716565
14259C41277060j6547156j6696636j5670887j5548602j4888932j4038483j3847245
14252B34039119j2990985j1883153j1710377j1083645r870302r813964q631859
$$ plain form
14245 158054834 149685011 142099893 134946369 128461489 121823715 115863456 110398343 105339956
14237 105339956 100556372 95879612 91280178 87620857 83384556 80108554 76820948 73706168
14229 73706168 70717692 67702373 64819689 62627674 60244272 57831219 55600036 53658910
14221 53658910 51672647 50072103 48100421 46385802 44678809 43552666 41946222 41188073
14213 41188073 39575989 38418003 37228905 35900444 34586776 34221066 33066934 32319753
14205 32319753 31202251 30237719 29240469 28521509 27726347 27268691 26433425 25721629 24935881
14196 24935881 24278158 23913779 23248612 22837241 21864309 21444172 20998866 20481334 19925285
14187 19925285 19600135 19180012 18594967 17959670 17515172 17542776 16685456 16762680 16062174 15922653
$$ packed form
14245A58054834q369823p585118p153524o484880o637774n960259n465113n058387
14237A05339956m783584m676760m599434l659321m236301l276002l287606l114780
14229G3706168k988476l015319k882684k192015k383402k413053k231183j941126
14221E3658910j986263j600544j971682j714619j706993j126143j606444p58149
14213D1188073j612084j157986j189098j328461j313668l65710j154132p47181
14205C2319753j117502r64532r97250p18960p95162m57656q35266p11796p85748
14196B4935881o57723l64379o65167m11371r72932m20137m45306n17532n56049
14187A9925285l25150m20123n85045o35297m44498K7604q57320P7224p00506j39521
$$ plain form
14177 15922653 15655944 15226930 14918407 14560539 14414731 13915139 13841269 13318205 13262455 12863264
14167 12863264 12693589 12279511 12365596 12007990 11878690 11488083 11334164 10980121 10960733 10773384
14157 10773384 10410688 10423093 10258973 9992388 9667063 9716118 9569376 9406350 9286514 9122458
14147 9122458 8879398 8837399 8645423 8478668 8252522 8186763 8103322 8153381 8156707 7754849
14137 7754849 7572783 7808007 7675136 7474595 7369254 7256630 6801937 7089894 6574905
14128 6574905 6894069 6644595 6573939 6344811 6359199 6016525 6387535 6196710 5728418 5705577
14118 5705577 6025305 5959653 5605064 5484831 5430385 5227193 5499911 5471885 5087620 5172423
14108 5172423 5079464 5194215 5232681 4921650 4911402 4743710 4599026 4928445 4698807 4455707
$$ packed form
14177A5922653k66709m29014l08523l57868j45808m99592p3870n23064n5750l99191
14167A2863264j69675m14078Q6085l57606j29300l90607j53919l54043j9388j87349
14157A0773384l62696J2405j64120k66585l25325M9055j46742j63026j19836j64056
14147I122458k43060m1999j91976j66755k26146o5759q3441N0059L326m01858
14137G754849j82066K35224j32871k00541j05341j12624m54693K87957n14989
14128F574905L19164k49474p0656k29128J4388l42674L71010j90825m68292k2841
14118E705577L19728o5652l54589j20233n4446k03192K72718k8026l84265Q4803
14108E172423r2959J14751L8466l11031j0248j67692j44684L29419k29638k43100
$$ plain form
14098 4455707 4512225 4172545 4394793 4317288 4540217 4544461 4234693 4320312 4242962 4141639
14088 4141639 3911578 4034655 3747545 3786923 4196922 3861896 3980109 3546023 3463139 3459826
14078 3459826 3665580 3591902 3536961 3161175 3839466 3748379 3594067 3333716 3551653 3488295
14068 3488295 3293242 3391136 3151378 3301163 3230592 3447466 3194537 2703021 3044563 3251657
14058 3251657 3186692 2974013 3071804 2774865 2591734 3179588 2842735 3055611 2886233 2662214
14048 2662214 2665153 2715131 2863234 2871018 2684427 2535784 2699511 2865075 2409818 2769737
14038 2769737 2470110 2614266 2591844 2481402 2520077 2174545 2593172 2301841 2301705 2376363
14028 2376363 2248432 2504947 2037799 2120295 2158328 1907776 1883871 2166964 2209108 2145229
$$ packed form
14098D455707N6518l39680K22248p7505K22929M244l09768Q5619p7350j01323
14088D141639k30061J23077k87110L9378M09999l35026J18213m34086q2884l313
14078C459826K05754p3678n4941l75786O78291r1087j54312k60351K17937o3358
14068C488295j95053R7894k39758J49785p0571K16874k52929m91516L41542K07094
14058C251657o4965k12679R7791k96939j83131N87854l36853K12876j69378k24019
14048B662214K939M9978J48103P784j86591j48643J63727J65564m55257L59919
14038B769737k99627J44156k2422j10442L8675l45532M18627k91331j36P4658
14028B376363j27931K56515m67148Q2496L8033k50552k3905K83093M2144o3879
$$ plain form
14018 2145229 2140344 1980788 2607820 1923197 2223286 1760061 2023955 2058100 2165744 1859607
14008 1859607 1802768 1851520 1985856 1610238 2056497 1488433 1347681 1799111 1524318 1511603
13998 1511603 1763602 1317238 1669116 1660495 1403436 1891544 1930570 1848951 2442491 3866343
13988 3866343 6704743 12868682 26015235 32869552 23850063 12176655 6734989 4841821
13980 4841821 3970567 3365035 3027683 2728980 2370867 2386756 2439740 2215355 2119551 1741358
13970 1741358 1829263 1984618 2025436 1768076 1768699 1951539 1633474 1851373 1801714 1858670 1717483
13959 1717483 1757490 1815318 1718700 1555585 1642987 1577939 1600336 1440147 1329203 1672102
13949 1672102 1613257 1502895 1516167 1611027 1351534 1334105 1458714 1320653 1459706 1512488
$$ packed form
14018B145229m885j59556O27032o84623L00089m63225K63894L4145J07644l06137
14008A859607n6839M8752J34336l75618M46259n68064j40752M51430k74793j2715
13998A511603K51999m46364L51878q621k57059M88108L9026q1619N93540J423852
13988C866343K838400O163939J3146553O854317r019489j1673408n441666j893168
13980D841821q71254o05532l37352k98703l58113J5889N2984k24385r5804l78193
13970A741358Q7905J55355M0818k57360O23J82840l18065K17899m9659N6956j41187
13959A717483M0007N7828r6618j63115Q7402o5048K2397j60189j10944L42899
13949A672102n8845j10362J3272R4860k59493j7429J24609j38061J39053N2782
$$ plain form
13939 1512488 1454251 1371916 1319990 1321258 1404365 1303270 1494402 1006255 1297163 1200447 1649651
13928 1649651 1401488 1528097 1273034 1055328 1132789 1318130 1599437 1186909 1306963 1053840
13918 1053840 1271897 1514001 1037818 1032809 850800 904997 1280925 926504 1267536 1196343
13908 1196343 932991 1136055 1116331 1173581 955786 1340959 898143 915777 904503 1315097
13898 1315097 1102885 891239 1230281 977506 1161553 1164479 743430 798191 969732 1060033
13888 1060033 1141619 856668 907151 925269 1076249 1035712 937781 1308156 1302743 940642 1129749
13877 1129749 1019176 745797 969465 1410403 678435 809722 1078706 896191 944175 854360
13867 854360 1112297 773359 817525 844692 1185541 1077672 1006090 815271 712037 941840
$$ packed form
13939A512488n8237q2335n1926J268Q3107j01095J91132m88147K90908r6716M49204
13928A649651k48163J26609k55063k17706P7461J85341K81307m12528J20054k53123
13918A053840K18057K42104m76183n009j82009N4197L75928l54421L41032p1193
13908A196343k63352K03064j9724N7250k17795L85173m42816J7634j1274M10594
13898A315097k12212k11646L39042k52775J84047K926m21049N4761J71541R0301
13888A060033Q1586k84951N0483J8118J50980m0537r7931L70375n413l62101J89107
13877A129749j10573k73379K23668M40938F78435J31287K68984j82515M7984q9815
13867H54360K57937l38938M4166K7167L40849j07869p1582j90819j03234K29803
$$ plain form
13857 941840 798405 643260 573606 632899 756841 842162 920363 937182 644519 775794
13847 775794 861187 909829 1109333 588489 638891 743469 841175 854396 878083 533793 1045358
13836 1045358 654945 648047 665888 606655 878415 953283 881305 371623 553844 565437 729545
13825 729545 986861 455634 803020 718536 626040 750504 680380 292682 342506 667152
13815 667152 747420 713813 791292 663049 711688 569909 583063 895985 701457 867502
13805 867502 823794 439026 794573 657977 483619 642197 244568 611274 881465 356457
13794 779262 647346 716353 450662 530570 603957 472994 510410 728955 417663 436203
13784 436203 368690 647550 765053 697291 634523 369769 540523 535419 507210 448652 721904
$$ packed form
13857I41840j43435j55145o9654N9293J23942Q5321P8201J6819k92663J31275
13847G75794Q5393M8642J99504n20844N0402J04578R7706J3221K3687l44290N11565
13836A045358l90413o898J7841n9233K71760P4868p1978C71623J82221J1593J64108
13825G29545K57316D55634L47386q4484r2496J24464p0124B92682M9824L24646
13815F67152Q0268l3607P7479j28243M8639j41779J3154L12922j94528J66045
13805H67502m3708l84768L55547j36596j74358J58578B44568L66706K70191C56457
13794G79262j31916O9007k65691P9908P3387j30963L7416K18545l11292J8540
13784D36203o7513K78860J17503o7762o2768k64754J70754n104k8209n8558K73252
$$ plain form
13773 721904 302131 531344 560202 617392 544275 480369 343484 650023 557368 855533
13763 855533 713484 512677 803057 644368 742283 509222 422193 500489 676147 467458
13753 467458 592806 194753 711867 756266 499582 419064 464691 569304 539470 495543
13743 495543 616877 348400 479846 498134 767702 310500 431285 315344 396894 341320
13733 341320 260056 406162 385318 621376 435472 48287 447614 520182 620471 272390
13722 443402 520121 554363 386000 608183 31084 446008 497049 462310 222897 411758
13712 411758 477875 318478 447322 342679 669512 640874 548985 448720 625173 478520
13702 478520 559906 380122 731458 634485 462604 600765 208079 363615 98564 124096
$$ packed form
13773G21904C02131K29213K8858N7190p3117o3906j36885L06539r2655K98165
13763H55533j42049k00807K90380j58689R7915k33061q7029P8296J75658k08689
13753D67458J25348A94753N17114M4399k56684q0518M5627J04613k9834m3927
13743D95543J21334k68477J31446J8288K69568C10500J20785j15941Q1550n5574
13733C41320q1264J46106k0844K36058j85904D8287L99327P2568J00289B72390
13722D43402P6719L4242j68363K22183C1084M14924N1041l4739B22897J88861
13712D11758O6117j59397J28844j04643L26833k8638r1889j00265J76453j46653
13702D78520Q1386j79784L51336r6973j71881J38161B08079J55536I8564K5532
$$ plain form
13692 124096 307619 423554 233212 441164 393799 628850 388917 308741 347897 458437
13682 458437 448229 284908 617873 566851 596193 244824 659523 264127 394323 454819
13672 454819 144631 496997 196896 428396 457495 502123 268899 783795 448525 230745
13662 230745 762055 404496 642721 311085 47742 106744 280981 514798 132200 672397
13652 672397 161315 355696 431722 258768 488584 173991 94425 199388 247645 31504
13641 267282 502032 419498 181753 309279 168043 787626 285587 390443 139792 356348
13631 356348 257687 363284 606277 436731 466279 469908 446196 258790 328006 55406 264950
13620 264950 407294 141853 210487 495308 279865 428572 609774 247921 263540 422296
$$ packed form
13692A24096J83523J15935j90342K07952m7365K35051k39933q0176L9156J10540
13682D58437j0208j63321L32965n1022K9342B44824M14699B64127J30196O0496
13672D54819A44631L52366A96896K31500K9099M4628k33224N14896l35270k17780
13662B30745N31310l57559K38225C11085D7742N9002J74237K33817A32200N40197
13652F72397A61315J94381P6026j72954K29816A73991p9566J04963M8257C1504
13641B67282K34750q2534A81753J27526j41236O19583B85587J04856A39792K16556
13631C56348r8661J05597K42993j69546K9548L629k3712j87406O9216E5406K09544
13620B64950J42344A41853O8634K84821k15443J48707J81202B47921J5619J58756
$$ plain form
13610 422296 409000 392484 669960 454920 70254 287559 257065 528693 341441 314195
13600 314195 65484 349814 336699 198397 306901 22564 -90031 29817 308416 391269 -21763
13588 467402 364401 87615 373410 262880 94853 486043 8359 190944 305509 434253
13578 434253 202998 -50570 428875 246530 507747 201860 305774 227407 102874 290314
13568 290314 55201 106493 462113 42725 520331 317625 271405 2827 339326 418579 311293
13557 311293 189901 315542 42908 466159 131284 304225 255385 21589 24796 232060
13547 232060 87053 285444 181122 422888 263007 -50863 164234 378486 435395 16519
13536 -2861 282484 7898 33682 197950 111612 325959 -95804 356834 63715 71297 152737
$$ packed form
13610D22296j3296j6516K77476k15040G0254K17305l0494K71628j87252k7246
13600C14195F5484K84330j3115j38302J08504B2564i0031B9817K78599Q2853b1763
13588D67402j03001H7615K85795j10530I4853L91190H359J82585J14565J28744
13578D34253B02998e0570D28875j82345K61217B01860J03914p8367A02874J87440
13568B90314E5201N1292L55620D2725M77606k02706m6220B827L36499P9253j07286
13557C11293j21392J25641D2908M23251A31284J72941m8840B1589L207K07264
13547B32060H7053J98391j04322K41766j59881e0863A64234K14252N6909A6519
13536b861B82484G898K5784J64268q6338K14347i5804C56834F3715P582Q1440
$$ plain form
13525 152737 144768 -56130 -133898 96535 265911 198281 182155 396821 149894 157599 231696
13514 231696 332500 144120 -74887 303106 371470 320995 170847 -47064 256368 74595
13503 53538 186930 21381 370063 132270 340702 165251 -9826 80758 258062 160576 280466
13492 280466 374363 86092 -46679 -52914 182245 105808 -118642 389113 165623 84187 98824
13481 98824 212075 313766 542960 36338 350285 150978 613310 195241 309903 -232569
13470 121370 129649 246597 332662 286664 -49434 78490 173178 374857 188936 271078 529994
13459 529994 239994 151567 -59857 235876 383779 80346 226468 206836 103110 30681
13448 -84044 -78704 238143 236937 310589 131694 -58126 146009 299690 397098 63059 193352
$$ packed form
13525A52737p969e6130p7768I6535J69376o7630j6126K14666A49894P705P4097
13514B31696J00804A44120g4887C03106O8364n0475j50148d7064B56368G4595
13503E3538J33392B1381L48682A32270K08432A65251i826H0758J77304r7486J19890
13492B80466R3897H6092d6679o235A82245p6437a18642C89113A65623q1436J4637
13481I8824J13251J01691K29194C6338L13947A50978M62332A95241J14662b32569
13470A21370Q279J16948Q6065m5998d9434G8490R4688K01679j85921Q2142K58916
13459E29994B39994q8427e9857B35876J47903H0346J46122j9632A03110C0681
13448h4044N340B38143j206P3652A31694e8126A46009J53681R7408F3059J30293
$$ plain form
13437 193352 293277 187701 -150492 265765 549593 304555 445922 475984 143542 356081
13427 356081 46876 265630 79927 501073 288016 139524 31371 91737 30568 -97966 421675
13415 301929 75522 202772 4964 153117 198197 422175 180447 356396 198548 161788
13405 161788 413388 153345 -66672 320753 217691 370738 263651 137272 -22241 -148888
13395 -148888 222877 356659 18052 -58369 47610 478372 92108 30392 133966 -172352
13384 193413 334160 406373 97336 -156533 62120 53153 190041 -267601 233765 125605
13374 125605 18333 58001 236421 86335 88986 128425 34141 466104 251679 39971 88149
13363 88149 526192 187461 36387 443221 -236749 15650 107801 318502 320986 79103 379164
$$ packed form
13437A93352R9925j05576a50492B65765K83828k45038J41367L0062A43542K12539
13427C56081D6876K18754G9927M21146k13057A39524C1371O0366C0568i7966D21675
13415C01929G5522J27250D964J48153M5080K23978A80447J75949j57848l6760
13405A61788K51600A53345f6672C20753j03062J53047j07087j26379b2241j26647
13395a48888B22877J33782A8052e8369D7610M30762I2108C0392J03574a72352
13384A93413J40747P2213I7336a56533F2120q967J36888b67601B33765j08160
13374A25605A8333L9668J78420H6335K651L9439C4141M31963k14425C9971M8178
13363H8149M38043A87461C6387M06834b36749A5650R2151K10701K484G9103L00061
$$ plain form
13352 379164 253963 342181 416127 218264 111935 -137760 48990 170916 332072 113649
13341 261528 -199963 158878 245774 26625 -54071 108611 501840 291269 326994 275231
13331 275231 -167157 327761 -38210 169483 376701 263987 72777 421571 359300 50017
13320 214991 53613 137722 284346 217918 125880 171719 62693 265947 230696 48323 -187895
13308 193116 143549 478752 -54207 237246 -15765 36436 268108 67193 150989 56487 125578
13297 125578 313680 238201 47044 -66395 41322 34498 301060 114448 348805 171816 323084
13286 323084 98574 21369 445253 -21473 19275 -188531 219279 -8867 10452 128523 -49445
13274 -94928 392020 135574 34672 173321 74175 52114 48082 75739 -43337 116730 435907
$$ packed form
13352C79164j25201Q8218P3946j97863j06329a37760D8990J21926J61156A13649
13341B61528a99963A58878Q6896B6625e4071A08611L93229k10571L5725n1763
13331B75231a67157C27761c8210A69483K07218j12714G2777L48794o2271E0017
13320B14991E3613Q4109J46624o6428r2038M5839F2693K03254l5251D8323a87895
13308A93116m9567L35203e4207B37246a5765C6436K31672F7193Q3796E6487O9091
13297A25578J88102p5479D7044f6395D1322o824K66562A14448K34357A71816J51268
13286C23084I8574B1369M23884b1473A9275a88531B19279h867A0452J18071d9445
13274i4928C92020A35574C4672J38649G4175k2061m032K7657d3337A16730L19177
$$ plain form
13263 435907 94736 52635 -87382 1319 383968 130022 22594 -99709 130725 7275 25912
13252 25912 192423 46138 249063 41615 7376 -68088 161923 230322 169771 -1167 222515
13240 74466 20218 134626 29322 103714 -335319 317875 -72799 -2817 -24397 299665 186307
13229 186307 145965 55708 149859 -280721 190453 233945 -61919 115515 136745 90864 -79345
13217 227122 -32173 182840 1012 -133743 297542 126699 -148328 -15711 237408 -240440
13206 8655 124582 160405 191019 -44476 226894 300865 52377 358321 -81283 19592 -113262
13194 169896 183642 345304 55284 168025 50578 -115656 80039 181542 79516 13218 -69332
13182 -160581 -242629 33992 338120 134417 488157 115545 -24305 476352 -38631 -91200
$$ packed form
13263D35907I4736m2101h7382A319L82649A30022B2594i9709A30725G275J8637
13252B5912J66511D6138K02925D1615G376f8088A61923O8399o0551a167B22515
13240G4466B0218J14408B9322P4392c35319C17875g2799b817k1580B99665j13358
13229A86307m0342E5708R4151b80721A90453M3492f1919A15515K1230m5881g9345
13217B27122c2173A82840A012a33743B97542A26699a48328a5711B37408b40440
13206H655J15927L5823L0614d4476B26894P3971E2377L05944h1283A9592a13262
13194A69896J3746J61662E5284J12741E0578a15656H0039J01503G9516A3218f9332
13182a60581q2048C3992L04128A34417L53740A15545b4305D76352c8631n2569
$$ plain form
13172 -91200 56296 -25869 291798 20549 -66629 400036 215806 125926 167591 15012 40269
13161 40269 133905 -363132 169948 229500 122280 120915 -30229 406877 -139375 404591 74422
13149 -78829 9598 -11066 206671 471619 415137 -337647 -9533 121579 7786 -23711 -152115
13138 -152115 308971 154022 274212 -139511 47759 303718 296632 -100927 50344 -16706
13127 296338 -119147 75763 262045 -103696 140448 -366255 158752 145238 -392996 -27249
13116 55194 -315445 206464 13739 56393 -140299 -140608 -65031 265001 84487 113620 172799
13105 172799 198864 398255 20219 18841 125957 113764 2359 431211 -219128 -194520 -16866
13093 48566 -167411 201986 276651 -74358 -136485 131882 -180764 422672 -96713 -10686 163317
$$ packed form
13172i1200E6296b5869B91798B0549f6629D00036j84230q9880M1665A5012K5257
13161D0269R3636c63132A69948N9552j07220j365c0229D06877a39375D04591G4422
13149g8829I598a1066B06671K64948n6482c37647i533A21579G786b3711j28404
13138a52115C08971A54022J20190a39511D7759K55959p086a00927E0344a6706
13127B96338a19147G5763J86282a03696A40448c66255A58752j3514c92996b7249
13116E5194c15445B06464A3739M2654a40299l09f5031B65001H4487K9133N9179
13105A72799K6065J99391B0219j378J07116j2193B359M28852b19128K4608a6866
13093D8566a67411B01986P4665g4358o2127A31882a80764D22672i6713a0686A63317
$$ plain form
13081 -54909 -23880 53728 24810 158303 109016 -39940 116378 238056 273945 -14524 125247
13069 322279 250063 -107544 -58695 130429 74108 64347 217913 308861 -103030 122284 -54823
13057 178344 102125 28502 129882 157332 85787 -28493 -71633 235445 -150158 75951 -237863
13045 -96137 216942 -4736 494798 204575 23510 110695 -88093 -23968 121763 433808 110907
13033 -396554 345465 64020 -186661 -93383 99939 168136 287238 44578 186377 133364 6271
13021 91667 211265 132562 112983 -30999 137466 -176036 163670 -4384 51322 92025 120192
13010 120192 196972 36125 -196753 309175 85342 482033 101711 -123247 30377 -53456
12999 123317 125509 71410 15372 112045 290656 9499 -188924 -270518 162904 152939 -43592
$$ packed form
13081e4909b3880E3728B4810J33493m9287c9940A16378J21678L5889a4524A25247
13069C22279p2216a07544M8849A30429n6321r761J53566R0948a03030A22284e4823
13057A78344p6219B8502J01380K7450p1545b8493m3140B35445a50158G5951b37863
13045i6137B16942d736D94798B04575B3510Q7185h8093b3968A21763L12045A10907
13033c96554C45465F4020a86661R3278I9939O8197J19102D4578J41799n3013F271
13021I1667J19598p8703j9579c0999A37466a76036A63670d384E1322M0703K8167
13010A20192P6780C6125a96753C09175H5342L96691A01711a23247C0377e3456
12999A23317K192n4099A5372R6673J78611I499a88924q1594A62904r965d3592
$$ plain form
12987 236765 347314 271313 -146778 23466 -2672 61361 192909 -32025 98889 -7377 88662
12975 -134349 21025 -101645 -79305 -342580 -197906 -240578 -53173 228069 240521 137266
12965 137266 173428 446224 105308 181294 -174095 75736 -246317 -16275 126555 59268
12954 -112195 146916 -86399 -124921 -94175 -183494 192779 452316 86462 282136 32003 -152367
12942 180727 92182 -62277 -173650 -116130 -1548 28295 267505 -324483 311260 102507 158506
12931 158506 48668 -259686 64627 31761 -58764 205363 -135066 70579 -46384 -9738 -39588
12920 -39588 -140089 84912 -152523 -363117 -4071 126919 88791 -233418 235601 440032
12910 440032 -13369 34617 -163394 -131439 50114 -2640 -165463 67328 65754 56754 -166801
$$ packed form
12987B36765J10549p6001a46778B3466b672F1361J31548c2025I8889g377H8662
12975a34349B1025a01645K2340k63275J44674m2672e3173B28069J2452j03255
12965A37266L6162K72796A05308P5986a74095G5736b46317a6275A26555E9268
12954a12195A46916h6399l8522L0746q9319A92779K59537H6462J95674C2003a52367
12942A80727q8545f2277j11373N7520a548B8295K39210c24483C11260A02507N5999
12931A58506D8668b59686F4627C1761e8764B05363a35066G0579d6384i738k9850
12920c9588j00501H4912a52523k10594d071A26919l8128b33418B35601K04431
12910D40032a3369C4617a63394L1955E0114b640j62823F7328j574r000a66801
$$ plain form
12898 76838 -301274 201962 -36978 -102969 359874 -47049 107840 -173067 -238505 -105259
12887 10372 -70858 328853 -154824 292666 99202 96305 59804 -72301 100936 7200 178764
12876 178764 1944 -67788 -44275 -91551 -275856 -65453 282256 -18451 239995 131542 -113334
12864 -263460 -106731 169057 195756 -101530 -246423 190398 8378 384852 -64011 106115
12853 54077 -103358 34942 288883 65960 54025 -247112 357675 72646 235642 259343 -59775
12841 -140017 48012 -60041 197639 206820 246576 308933 77012 161426 -2811 -124684 53943
12829 -417460 -40894 -17904 422430 -124803 199245 343941 61516 24860 363583 -71787
12818 31280 -113962 -202131 -172938 -78774 217430 -220525 15503 -140483 63635 -91834 -83503
$$ packed form
12898G6838c01274B01962c6978o5991C59874d7049A07840a73067o5438a05259
12887A0372g0858C28853a54824B92666I9202k897l6501g2301A00936G200J71564
12876A78764A944f7788K3513m7276j84305f5453B82256a8451B39995j08453a13334
12864b63460a06731A69057K6699a01530j44893A90398H378L76474f4011A06115
12853E4077a03358C4942K53941F5960j1935b47112C57675G2646J62996K3701e9775
12841a40017D8012f0041A97639R181L9756O2357G7012Q4414b811j21873E3943
12829d17460d0894a7904D22430a24803A99245J44696F1516B4860L38723g1787
12818C1280a13962q8169K9193g8774B17430b20525A5503a40483F3635i1834Q331
$$ plain form
12807 -83503 60643 -21067 234682 20647 -125153 -75198 38731 -55090 -71939 -96319 188038
12795 97233 69584 126517 -353877 222518 -16223 21647 83510 107369 181199 -77019 -136350
12784 -136350 134065 20725 -175574 11298 60403 -258945 63791 -68329 11179 534944 -94219
12772 -31441 -176448 15013 -116942 -84647 -229478 182423 -185162 181371 -401262 -92292
12761 341654 -121274 70727 -74149 -153916 -223508 -353199 -123729 17780 -274688 -194983 286551
12749 72857 113676 -184833 -200338 130317 -177969 205248 160099 -80740 -108575 -11495 31209
12737 169678 -82198 89183 -146601 62011 -10045 -175394 20582 -158737 -7687 263933 -398093
12725 407822 107822 116353 -109330 119287 -25966 95362 -164373 102558 -60055 -111963 32883
$$ packed form
12807h3503F0643b1067B34682B0647a25153M9955C8731e5090j6849k4380A88038
12795I7233k7649N6933c53877B22518a6223B1647O1863K3859P3830g7019n9331
12784a36350A34065B0725a75574A1298M9105b58945F3791f8329A1179N23765i4219
12772c1441j45007A5013a16942L2295j44831A82423a85162A81371d01262i2292
12761C41654a21274G0727g4149p9767o9592j29691a23729A7780b74688P9705B86551
12749G2857M0819a84833j5505A30317a77969B05248m5149h0740k7835a1495C1209
12737A69678h2198H9183a46601F2011a0045j65349B0582a58737g687B63933c98093
12725D07822A07822Q531a09330A19287b5966I5362a64373A02558f0055n1908C2883
$$ plain form
12713 181224 -62256 17726 -20662 336141 -172027 327855 304644 54398 459790 47208 20513
12701 61763 89205 160809 -287837 -1106 50491 -126775 292914 393813 -28464 78083 -136366
12689 -97525 653 395966 -258325 -3003 183560 -18666 165763 64340 25888 87306 76463
12678 76463 -186738 93237 -81749 42491 166224 105750 -77822 -180895 -227259 32450 -234110
12666 -247 -33940 136777 -311334 217056 -49015 191429 267407 248074 266059 -3984 228315
12654 -11200 90871 25113 99830 -295861 -9305 -59924 -317348 -81306 -275262 112004 5655
12642 -77771 254569 -54979 -50993 235695 -189942 -90136 303376 -135128 91320 -14404 319660
12630 89157 254143 72472 -26208 244675 145377 101643 -72005 248737 184078 217762 157143
$$ packed form
12713A81224f2256A7726b0662C36141a72027C27855k3211E4398M05392D7208B0513
12701F1763K7442P1604b87837a106E0491a26775B92914J00899b8464G8083a36366
12689i7525F53L95313b58325c003A83560a8666A65763F4340B5888O1418j0843
12678G6463a86738I3237h1749D2491J23733o0474g7822j03073m6364C2450b34110
12666b47l3693A36777c11334B17056d9015A91429P5978j9333J7985c984B28315
12654a1200I0871B5113P4717b95861i305n0619k57424h1306j93956A12004E655
12642g7771B54569e4979L986B35695a89942i0136C03376a35128I1320a4404C19660
12630H9157J64986G2472b6208B44675r9298m3734g2005B48737o4659L3684o0619
$$ plain form
12619 157143 252610 -130722 -197409 101955 -252085 -67294 -37392 -58902 304853 -155778
12608 -96319 -19215 -91239 53373 27963 -14300 166914 -156608 54874 60384 95418 312126
12597 312126 68977 -42350 141106 -236709 232383 -66618 -89441 120135 -187474 -105442
12587 -105442 -81282 182924 12200 -101952 205488 109925 -64127 -137394 27901 -76447 121335
12575 -46676 -100924 -82044 -119970 117525 -20126 252915 -96317 65542 189098 80231 105618
12564 105618 73541 -73562 36781 -35532 -198193 137152 152533 451209 -24436 33248 -160482
12552 54339 47628 33248 64544 -85801 -10234 198670 -86921 373523 -136710 -160999 13055
12540 138971 43832 -54435 -106101 202537 74347 -86199 -192460 178571 -86910 -214138 -197679
$$ packed form
12619A57143R5467a30722o6687A01955b52085f7294K9902k1510C04853a55778
12608i6319a9215p2024E3373k5410a4300A66914a56608E4874N510L5034K16708
12597C12126F8977d2350A41106b36709B32383f6618k2823A20135a87474Q2032
12587a05442K4160A82924A2200a01952B05488r5563f4127p3267B7901g6447A21335
12575d6676n4248J8880l7926A17525b0126B52915i6317F5542J23556H0231K5387
12564A05618l2077g3562C6781c5532j62661A37152J5381K98676b4436C3248a60482
12552E4339o711j4380L1296h5801a0234A98670h6921C73523a36710k4289A3055
12540A38971D3832e4435n1666B02537G4347h6199j06261A78571h6910j27228J6459
$$ plain form
12529 -197679 71596 -251593 187190 401047 345949 -236057 -51839 37556 184872 -99416
12518 105817 -224263 199439 158754 -77572 244307 -256820 327107 216950 5611 -186181
12507 108849 153107 62475 -96994 70689 193448 163457 228146 177065 89162 -11679 252500
12495 23500 -310716 54697 -44060 278514 -94679 108513 -146807 -167415 -12444 133725 103913
12484 103913 88849 161656 91818 -54997 -163459 -110914 -159136 -290829 -158868 -188265 -109508
12473 -109508 128805 299065 -101192 46630 -56588 -115380 -70240 521619 -163371 -127737
12463 -127737 109039 -37087 -80177 69363 -148725 7462 27561 130885 -122467 -213780 269470
12451 -94635 15394 60901 -142488 -72641 20054 -143534 -145471 56062 -179197 -328015 -129096
$$ packed form
12529a97679G1596b51593A87190K13857n5098b36057e1839C7556J47316i9416
12518A05817b24263A99439m0685g7572B44307b56820C27107j10157E611a86181
12507A08849M4258F2475i6994G0689J22759k9991O4689n1081q7903a1679B52500
12495B3500c10716E4697d4060B78514i4679A08513a46807k0608a2444A33725k9812
12484A03913j5064P2807o9838e4997j08462N2545m8222j31693J31961k9397P8757
12473a09508A28805J70260a01192D6630e6588n8792M5140E21619a63371L5634
12463a27737A09039c7087m3090F9363a48725G462K0099J03324a22467r1313B69470
12451i4635A5394M5507a42488O9847B0054a43534j937E6062a79197j48818a29096
$$ plain form
12439 -244767 158502 166997 -404020 219678 -16912 -29927 -210263 -92789 -276660 67147 -5389
12427 -185889 167949 44885 -327328 -222768 251549 60495 -28175 123430 -17674 85789
12416 -102119 87970 -44214 97113 -352156 11943 -243383 -448173 -219598 267014 20021
12405 229855 -156092 4116 -3618 34825 10218 -57369 268526 130664 -274816 -211280 -187392
12394 -187392 -174766 217730 -96860 96598 -81416 -112272 145748 -278507 107484 -77149 186104
12382 -37998 12954 180005 95512 370483 19136 51385 -115888 202003 -167508 -215987 -18930
12370 45511 162930 253624 58184 108339 70978 -106782 -222962 155248 -114260 236905
12359 255651 -22072 -15271 221534 -158966 -257045 -298819 -230630 -7157 -28673 -27749 13743 -192681
$$ packed form
12439b44767A58502Q495d04020B19678a6912j3015j80336i2789j83871F7147e389
12427a85889A67949D4885c27328J04560B51549F0495b8175A23430a7674H5789
12416a02119H7970d4214I7113c52156A1943b43383k04790b19598B67014B0021
12405B29855a56092D116c618C4825A0218e7369B68526A30664b74816O3536K3888
12394a87392J2626B17730i6860I6598h1416l0856A45748b78507A07484g7149A86104
12382c7998A2954J67051q4493K74971A9136L2249a15888B02003a67508m8479a8930
12370D5511J17419R0694E8184N0155l7361a06782j16180A55248a14260B36905
12359B55651b2072O801B21534a58966r8079m1774O8189g157k1516R24A3743a92681
$$ plain form
12346 90886 425480 207218 297746 26923 110564 63264 -295517 136899 -263606 -61801 172891
12334 6412 -105465 -233958 39290 23814 93644 105845 7347 -138445 269264 -13177 -157554
12323 -157554 -74885 29447 256828 270788 -62481 99239 215233 304263 302899 83595 -278204
12311 -203107 26400 78233 -112420 108647 191935 51298 215425 -144032 -49358 -38683 -314276
12300 -314276 17360 130135 -30157 -112839 53524 308206 62626 161136 -106435 218092 230477
12289 230477 -164785 263782 50799 230059 64902 -37817 97829 -82606 145674 104120 33498
12277 388460 -117030 79104 -166317 -137185 -56398 208571 243455 -69150 68779 -159141 117056
12265 142980 -79646 28659 -109512 -17050 483999 81098 -146436 34151 -188332 -53872 199302
$$ packed form
12346I0886L34594B07218R0528B6923Q3641m7300b95517A36899b63606f1801A72891
12334F412a05465j28493C9290j5476O9830J2201G347a38445B69264a3177j44377
12323a57554g4885B9447K27381J3960f2481I9239J15994Q9030j364H3595b78204
12311b03107B6400N1833a12420A08647Q3288E1298J64127a44032d9358J0675k75593
12300c14276A7360J12775c0157q2682E3524K54682F2626R8510a06435B18092J2385
12289B30477a64785B63782E0799J79260F4902c7817I7829h2606A45674m1554C3498
12277C88460a17030G9104a66317K9132e6398B08571L4884f9150F8779a59141A17056
12265A42980g9646B8659a09512a7050D83999H1098a46436C4151a88332e3872A99302
$$ plain form
12253 177375 -172717 37122 337350 -53057 13475 -121545 265909 207807 52957 -184815
12242 7115 -43107 -33585 -18205 -139883 119179 162929 52065 -77350 195333 124037 96560
12231 96560 -79329 121111 119838 -39317 242760 280317 163001 129347 126127 108249 -42050
12219 416277 350834 -201828 187910 78133 -124088 -60868 340544 401447 -190394 -117181
12209 -117181 208049 192752 42799 356948 226752 17761 35906 367281 -106075 -233508
12199 -233508 72404 160071 85978 174827 752 243788 -153291 92292 -110948 -21955 -127341
12188 -127341 35651 91802 128575 -214731 75959 75011 213644 77216 2152 284739 206002
12177 206002 139922 92458 -77332 9891 377277 99173 152445 126637 181929 83152 132867
$$ packed form
12253A77375a72717C7122L00228e3057A3475a21545B65909n8102E2957a84815
12242G115d3107R522J5380j21678A19179M3750E2065g7350A95333p1296k7477
12231I6560g9329A21111j273c9317B42760L7557j17316l3654l220j7878d2050
12219D16277o5443b01828A87910G8133a24088f0868C40544O0903a90394P3213
12209a17181B08049j5297D2799L14149j30196A7761J8145L31375a06075j27433
12199b33508G2404Q7667p4093Q8849G52K43036a53291I2292a10948b1955j05386
12188a27341C5651N6151L6773b14731G5959r48J38633G7216B152K82587p8737
12177B06002o6080m7464g7332I891L67386I9173N3272k5808N5292H3152M9715
$$ plain form
12166 132867 -380158 -257038 201771 136158 -97752 184036 391716 71051 -36211 19993
12155 183422 -330799 119757 173604 33612 -232943 -228814 59192 74074 -175713 227884 -210499
12143 -101720 -255327 189495 110741 -124545 143841 134155 58868 -176698 -221687 -129699 -159610
12132 -159610 -50207 88575 293906 50042 -71673 106925 -97133 201735 -63804 66355 -39983
12120 31352 4791 -156137 234461 -224274 38190 162908 133914 257091 29536 -238891 30132
12108 23232 13495 213745 356669 20257 214819 -186420 227561 -43981 -56084 223353 150882
12097 150882 71141 150721 184274 -200387 354716 199080 -81210 49636 -24881 -3829 31892
12085 231196 208487 -70553 130339 -290952 56318 150461 16585 252196 17720 59314 -53064
$$ packed form
12166A32867c80158J23120B01771o5613i7752A84036K07680G1051c6211A9993
12155A83422c30799A19757N3847C3612b32943M129E9192J4882a75713B27884b10499
12143a01720j53607A89495p8754a24545A43841r686E8868a76698m4989R1988k9911
12132a59610e0207H8575K05331E0042g1673A06925i7133B01735f3804F6355c9983
12120C1352D791a56137B34461b24274C8190J24718k8994J23177B9536b38891C0132
12108B3232r737K00250J42924B0257J94562a86420B27561d3981j2103B23353p2471
12097A50882G1141P9580L3553b00387C54716j55636h1210D9636b4881c829C1892
12085B31196k2709g0553A30339b90952E6318R4143A6585K35611A7720M1594e3064
$$ plain form
12073 2540 183726 184062 114850 148155 78602 -59572 -124901 30609 -36354 11044 -75818 -256806
12061 -256806 189876 21505 151783 91724 41972 1117 230920 -84967 -320246 -19893 -220322
12050 -220322 75007 23513 61781 -132359 37368 30736 -23493 -37865 -61728 37395 -31118
12038 9111 58557 -25533 33573 -163807 215191 -22934 274823 13675 58511 -90687 -224877
12027 -224877 142463 -74995 -146269 -142240 21308 197705 68582 -17386 -25707 -78466 -517359
12016 -517359 -232423 -329533 257230 5201 -73772 -52379 59160 -289817 202175 -94437 -389932
12005 -389932 429462 -198504 126156 -8067 -156099 -73276 109174 109034 95053 145163 -350377
11993 -12484 213312 173322 115568 -1295 7155 -296337 -157077 -152281 -459568 -68608 -47876
$$ packed form
12073B540J81186L36o9212L3305o9553e9572o5329C0609c6354A1044g5818j80988
12061b56806A89876B1505J30278o0059D1972A117K29803h4967k35279a9893k00429
12050b20322G5007B3513L8268a32359C7368o632b3493j4372k3863C7395c1118
12038I111M9446b5533C3573a63807B15191b2934B74823A3675M4836i0687j34190
12027b24877A42463g4995p1274M029B1308J76397F8582a7386q321n2759m38893
12016e17359b32423r7110B57230E201g3772K1393E9160b89817B02175i4437k95495
12005c89932D29462a98504A26156h067j48032g3276A09174j40j3981N0110c50377
11993a2484B13312l9990n7754a295G155b96337J39260M796l07287f8608K0732
$$ plain form
11982 -47876 -305074 -250604 -258667 -196586 73495 8896 63266 83061 -88401 -186284 -73353 194820
11969 -297177 -138832 -103724 -40976 184854 -85130 -311029 248903 3844 315620 -319736
11958 -291002 -42690 24730 -113157 -111174 107098 -60477 -220265 64920 323705 -171239 106596
11946 11402 -9935 152652 302395 44516 97812 -242659 -203066 -258160 -423233 194003 280179
11935 280179 404 -21760 -205101 -1351 -160475 -78183 -171286 -182387 240208 248460 115510
11923 115431 19706 1901 159889 473324 -334616 -59628 -347773 -290376 -26332 -99741 110620
11911 116465 77379 -61568 -150642 209122 -332521 -134093 -217393 -19665 -90064 -21461 -172185
11900 -172185 -133664 -225222 -37754 -190300 68537 -118269 11164 127630 123764 216605 103290
$$ packed form
11982d7876k57198N4470q063O2081G3495H896N4370J9795h8401r7883g3353A94820
11969b97177a38832L5108d0976A84854h5130k25899B48903C844L11776c19736
11958b91002d2690B4730a13157J983A07098f0477j59788F4920K58785a71239A06596
11946A1402i935A52652J49743D4516N3296b42659L9593n5094j65073A94003Q6176
11935B80179D04b1760j83341a351j59124g8183r3103j1101B40208Q252A15510
11923A15431A9706A901J57988L13435c34616e9628k88145N7397b6332p3409A10620
11911A16465l9086f1568q9074B09122c32521a34093q3300a9665p0399b1461j50724
11900a72185L8521r1558c7754j52546F8537a18269A1164J16466l866R2841A03290
$$ plain form
11888 -105620 -224791 -201490 -123231 -80113 39960 -126684 146545 -587897 110574 243401
11878 243401 -152146 229455 83733 222034 -117139 -178041 207887 -310061 44275 -201107
11867 19775 113029 113767 -119523 -5652 -53304 32236 22848 -5253 -133781 -85666 -154424 -15537
11854 -13486 74203 150392 30596 143804 -34976 302860 142577 -256325 -181257 175662 158348
11843 158348 236498 280525 -252280 -162984 111082 345729 -130508 -186342 191547 13221
11832 100043 -199191 -58649 166547 -174555 321769 67137 -375299 221940 150925 -188182
11821 52757 46554 -317205 -72627 94445 195621 -7361 71165 16526 -118311 -150071 78658
11809 -74271 -76598 35291 -140007 -171497 86299 -114679 -384538 -20770 -238377 -35868 -43709
$$ packed form
11888a05620j19171K3301P8259M3118C9960a26684A46545e87897A10574J32827
11878B43401a52146B29455H3733J38301a17139o0902B07887c10061D4275b01107
11867A9775R3254P38a19523e652m7652C2236r388e253j28528M8115o8758a5537
11854a3486G4203P6189C0596J13208c4976C02860A42577b56325P5068A75662j7314
11843A58348P8150M4027b52280Q9296A11082K34647a30508n5834A91547A3221
11832A00043a99191e8649A66547a74555C21769F7137c75299B21940p1015a88182
11821E2757o203c17205g2627I4445J01176g361G1165A6526a18311l1760G8658
11809g4271k327C5291a40007l1490H6299a14679k69859b0770k17607c5868p841
$$ plain form
11798 -43709 -31961 -158392 63352 48632 12340 -86397 24509 -13862 238773 -438578 57622
11786 -237089 184837 136349 1842 -87475 78285 -58716 135960 178201 28112 -3349 -246993
11775 -246993 -78851 -77485 -48998 109374 -62107 109152 -263061 104753 113581 -316241 -135894
11763 -171579 19207 -6553 59813 -15074 310428 122150 -176296 229684 189392 276115 131317
11751 -61739 -76784 -137305 135834 -139984 109573 -211429 56049 160079 21812 -261045
11740 -39206 45767 -292018 -48620 197037 -184008 82959 -17675 -304612 58575 -230525 158210
11728 -334922 224143 -95324 6974 -85594 -392815 86837 20698 -199503 -253698 -143801 25376
11716 168730 197238 -107682 -144900 -123322 -266633 63504 -48399 126765 -51584 329600 16716
$$ packed form
11798d3709J1748j26431F3352j4720A2340h6397B4509a3862B38773d38578E7622
11786b37089A84837m8488A842h7475G8285e8716A35960M2241B8112c349k43644
11775b46993g8851J366K8487A09374f2107A09152b63061A04753Q828c16241a35894
11763a71579A9207f553E9813a5074C10428A22150a76296B29684m0292Q6723A31317
11751f1739j5045o0521A35834a39984A09573b11429E6049J04030B1812b61045
11740c9206D5767b92018d8620A97037a84008H2959a7675k86937E8575b30525A58210
11728c34922B24143i5324F974h5594l07221H6837B0698a99503n4195J09897B5376
11716A68730K8508a07682l7218K1578j43311F3504d8399A26765e1584C29600A6716
$$ plain form
11704 -14080 59521 205776 25570 -116729 5408 -244335 181095 -64410 77595 130329 2835
11692 106521 104111 -21439 -284335 72416 -96074 137274 -248711 -276308 263730 159741 -416047
11680 180601 24345 155661 -9129 4278 73170 -195814 41184 200812 58725 178799 15165
11668 -26239 71681 41572 -17970 157984 17326 -166147 56794 -226400 -125331 212122 195986
11657 195986 -63601 274303 -133017 34081 210414 339298 -108063 -183846 75212 305414
11647 305414 -237310 -276681 98950 -144464 -182288 122996 -482252 -41248 43196 79835 -284804
11635 73873 -498451 -11910 -7469 -49359 -114581 -26940 125996 385699 -95439 -111744 -160367
11624 -160367 113156 -250570 166777 373848 277000 503 108430 -85168 -81218 -58734 11303
$$ packed form
11704a4080E9521J46255B5570a16729E408b44335A81095f4410G7595N2734B835
11692A06521k410b1439k62896G2416i6074A37274b48711k7597B63730j03989d16047
11680A80601B4345J31316i129D278O8892a95814D1184J59628E8725J20074A5165
11668b6239G1681l0109a7970A57984A7326a66147E6794b26400J01069B12122j6136
11657A95986f3601B74303a33017C4081J76333J28884a08063p5783G5212K30202
11647C05414b37310l9371I8950a44464l7824A22996d82252d1248D3196L6639b84804
11635G3873d98451a1910M441m1890o5222b6940A25996K59703i5439j6305m8623
11624a60367A13156b50570A66777K07071r6848E03J07927h5168L950K2484A1303
$$ plain form
11612 254536 -44221 -83283 321057 79798 52262 -82874 213032 -251106 -157058 473 -70018
11600 170384 153649 48503 -292521 -46412 -42693 -102470 64706 142519 -128673 -76950 -366031
11589 -366031 -211581 71527 264987 -148323 -51817 -371943 208055 -1960 -192927 -102858
11579 -102858 -292744 -59263 -120554 131256 -79763 310750 -191154 -79141 193806 -37871
11568 347643 138644 38616 150478 -159081 14745 80939 69969 112862 161068 264351 -312435
11556 3645 -239832 6166 -68766 18961 112877 66073 6052 -57625 109474 -140515 -25361 -234692
11544 -234692 199994 214944 -226502 -158182 427614 254373 -6504 353965 -267666 -131415
11533 -123294 127987 339056 4071 -8597 -142677 316723 275514 327916 36677 -63440 -25959
$$ packed form
11612B54536d4221l9062C21057G9798k7536h2874B13032b51106R4048D73g0018
11600A70384j6735D8503b92521d6412L719n9777F4706P7813a28673N1723k89081
11589c66031J54450G1527J93460a48323e1817l20126B08055a960j90967R0069
11579a02858j89886e9263o1291A31256g9763C10750a91154g9141A93806c7871
11568C47643A38644C8616J11862a59081A4745O6194j0970M2893M8206J03283c12435
11556C645b39832F166f8766A8961R3916m6804F052e7625A09474a40515b5361k09331
11544b34692A99994J4950b26502O8320D27614j73241f504C53965b67666a31415
11533a23294A27987K11069D071h597j34080C16723m1209N2402C6677f3440b5959
$$ plain form
11521 -110294 153469 -52636 12441 239443 -84581 383774 -12394 -66058 -68815 121040 140842
11510 140842 60407 -5240 -75683 275116 223441 143433 407571 -235638 -149151 114524 12109
11498 -1138 -138307 253526 248301 294854 21581 -68575 -259208 31881 -9691 233379 228234 -18928
11485 276508 -9300 103458 22571 -122784 -58020 -33003 42521 222496 -67444 66048 -96069
11473 109033 -189024 190962 -61681 140944 184785 74290 478835 -234102 257004 -87815
11462 114483 44046 1097 210977 303890 -140399 -100974 211116 58976 91679 206872 73573
11450 5526 171178 -182983 73856 -139449 402538 183297 44714 45173 83827 192193 335958
11439 335958 -27591 135616 117927 -329379 -35240 -137437 201025 -125571 141091 143917
$$ packed form
11521a10294A53469e2636A2441K27002h4581C83774a2394n3664k757A21040J9802
11510A40842F0407e240p0443B75116n1675q0008K64138b35638Q6487A14524A2109
11498a138j37169B53526n225M6553B1581f8575j90633C1881i691B33379n145a8928
11485B76508i300A03458B2571a22784e8020K5017D2521J79975f7444F6048i6069
11473A09033a89024A90962f1681A40944M3841G4290M04545b34102B57004h7815
11462A14483D4046A097K09880R2913a40399L9425B11116E8976L2703J15193G3573
11450E526J65652a82983G3856a39449D02538A83297D4714M59L8654J08366J43765
11439C35958b7591A35616j7689c29379c5240j02197B01025a25571A41091K826
$$ plain form
11429 143917 -43980 27862 -188911 -133182 42140 36658 -9492 -118962 -160596 74449 -355977
11417 26917 -35165 39532 115709 -50110 -89937 139614 66494 -226804 -189914 85178 -108300
11405 135303 -148061 68439 29465 264444 81179 153662 -124047 -142211 31445 14620 -36261
11393 82917 34894 -354680 -223194 -146364 234125 -227116 147220 170856 45647 29759 53417
11382 53417 -8673 263770 119117 92481 -239828 46287 -330602 264885 38701 -125882 -79082
11371 -79082 -174475 -275968 -308233 1376 -142575 -169751 117982 -213760 -99340 -181437 7289
11359 160770 -59973 -182921 153624 -162683 -209649 19350 -157471 5658 69434 -103990 -65420
11348 -65420 152409 -361889 -167110 31482 -101747 -53921 33249 -49159 -23826 8080 125289
$$ packed form
11429A43917d3980B7862a88911N5729D2140n482i492j09470m1634G4449c55977
11417B6917c5165C9532P6177e0110l9827A39614F6494b26804L6890H5178a08300
11405A35303a48061F8439B9465K34979H1179P2483a24047j8164C1445A4620c6261
11393H2917C4894c54680J31486P6830B34125b27116A47220K3636D5647j5888K3658
11382E3417h673B63770A19117k6636b39828D6287c30602B64885C8701a25882M6800
11371g9082r5393j01493l2265A376a42575k7176A17982b13760i9340q2097G289
11359A60770e9973j22948A53624a62683m6966A9350a57471E658O3776a03990L8570
11348f5420A52409c61889a67110C1482a01747M7826C3249d9159b3826H080J17209
$$ plain form
11337 125289 25866 457578 20157 -122054 -159154 -208734 182596 138041 -241385 -39976 -5234
11325 -248672 -27722 -73941 -107186 315977 282742 102078 -365955 154281 -13231 186917
11314 -52591 195295 190350 -100361 60328 -519002 -255917 11927 263614 -93327 197417 -356274
11302 3117 -137015 -262448 46371 27542 -237964 41603 -335936 -448003 -181739 -214795 20322
11290 -54541 -195944 261141 -13300 15351 -241266 95694 -125951 101475 -88229 28345 -202725
11278 36241 -43671 -327062 30116 182099 23519 186414 -361278 69843 -488712 18355 -172608
11266 -226015 -371121 39919 -41425 -45792 -137777 16129 -266228 48694 -205254 132700 -86061
11254 -254324 -117650 -179096 -76870 78290 -227265 47856 193714 37190 -263777 -35210 -31274
$$ packed form
11337A25289B5866M31712B0157a22054l7100m9580A82596m4555b41385c9976e234
11325b48672b7722m6219l3245C15977l3235A02078c65955A54281a3231A86917
11314e2591A95295m945a00361F0328e19002b55917A1927K51687i3327A97417c56274
11302C117a37015j25433D6371j8829b37964D1603c35936j12067a81739l3056B0322
11290e4541j41403B61141a3300A5351b41266I5694a25951A01475h8229B8345b02725
11278C6241d3671k83391C0116J51983B3519J62895c61278F9843d88712A8355a72608
11266b26015j45106C9919d1425m367r1985A6129b66228D8694b05254A32700h6061
11254b54324a17650o1446g6870G8290b27265D7856J45858C7190b63777c5210L936
$$ plain form
11243 -31274 -10514 -305450 219458 89750 53273 -106719 -79960 -46349 56923 -61896 112505
11231 -238527 -99714 337375 291593 215689 -221417 -357064 84975 -220110 367868 -71913
11220 -255033 -8223 45830 -302545 -157526 58501 30333 85865 145911 -110367 222154 -331756
11208 -41078 -252683 -48422 -190286 202500 95663 -271787 -215392 274691 163927 -137310
11197 185358 -61483 -51289 151457 -388510 -85088 63129 49721 317673 -214947 -36020 71805
11185 -181755 37102 -18150 -84196 -147134 -56833 -418982 -163433 -258592 -5103 -365590 -441233
11174 -441233 -414342 -100285 -143996 -114134 184576 25290 -264751 -231618 136707 -161839
11163 214904 -18024 -100767 3181 -228517 -57658 98433 23482 108407 -217974 2652 170663
$$ packed form
11243c1274a0514k94936B19458H9750l6477a06719K6759L3611E6923f1896A12505
11231b38527i9714C37375m5782p5904b21417j35647H4975b20110C67868g1913
11220b55033h223D5830c02545J45019E8501k8168N5532O0046a10367B22154c31756
11208d1078k11605d8422j41864B02500I5663b71787N6395B74691j10764a37310
11197A85358f1483J0194A51457c88510h5088F3129j3408K67952b14947c6020G1805
11185a81755C7102a8150o6046o2938e6833l62149a63433r5159e103l60487p5643
11174d41233K6891a00285m3711K9862A84576B5290b64751L3133A36707a61839
11163B14904a8024q2743C181b28517e7658I8433B3482Q4925b17974B652J68011
$$ plain form
11152 170663 140773 -42395 -174226 -134323 63012 -173289 124234 112940 296150 -147195
11141 -53751 -221407 -186071 25313 230117 266786 -135924 -128023 -131888 235390 -94581 235243
11129 243327 201984 -23135 62947 44447 -154621 -44487 61050 104055 -28907 -149333 192380
11117 -17968 -327505 68879 77514 -179983 164652 -157488 10016 202621 284644 -95160 71803
11105 94707 -55327 55339 133573 138084 59831 -28726 224916 425781 -36835 63576 116741
11094 116741 66401 301824 90898 371537 -61889 -48588 56108 135205 73417 -245064 -223476
11083 -223476 -239769 -52518 252912 -223331 312380 206481 -123523 279081 -61005 -111744
11073 -111744 322343 -28332 187274 -111799 273657 87874 165680 60698 154599 170188 303983
$$ packed form
11152A70663k9890d2395j31831L9903F3012a73289A24234j1294J83210a47195
11141e3751j67656L5336B5313K04804L6669a35924P901l865B35390i4581B35243
11129B43327m1343b3135F2947j8500a54621d4487F1050M3005b8907j20426A92380
11117a7968l09537F8879Q635a79983A64652a57488A0016J92605Q2023i5160G1803
11105I4707e5327E5339P8234M511E9831b8726B24916K00865c6835F3576N3165
11094A16741n0340K35423I0898K80639f1889J3301E6108P9097o1788b45064K1588
11083b23476j6293e2518B52912b23331C12380j05899a23523B79081f1005n0739
11073a11744C22343b8332A87274a11799B73657H7874P7806F0698R3901J5589J33795
$$ plain form
11062 303983 145088 346384 237808 224054 132940 271711 370937 292272 246504 171865 458758
11051 458758 254406 299517 307233 269443 459700 350772 632038 -24797 164836 326229
11041 326229 270931 305441 304666 406902 855951 454283 369813 266084 314819 208814 407295
11030 407295 162171 141165 488758 139916 822031 534080 124100 337491 626417 186291
11019 193250 259961 408968 325143 497302 408927 221679 226189 204926 33868 463012 402799
11008 402799 212409 529845 432492 106423 237559 183464 256827 484729 337906 285753
10998 285753 273550 176307 387512 437464 348272 274934 190301 318185 434922 626654 212457
10986 502000 325905 512567 470837 594862 477011 698201 722656 553658 727992 757727
$$ packed form
11062C03983A45088K01296j08576j3754r1114J38771R9226p8665m5768p4639K86893
11051D58758k04352M5111P716l7790J90257j08928K81266b4797A64836J61393
11041C26229n5298L4510p75J02236M49049m01668q4470j03729M8735j06005J98481
11030D07295A62171k1006L47593A39916O82115k87951A24100K13391K88926A86291
11019A93250O6711J49007q3825J72159q8375j87248M510k1263C3868M29144o0213
11008D02799j90390L17436r7353A06423J31136n4095P3363K27902j46823n2153
10998B85753j2203r7243K11205M9952q9192p3338q4633J27884J16737J91732B12457
10986E02000j76095J86662m1730J24025j17851K21190K4455j68998J74334K9735
$$ plain form
10976 757727 776308 984712 732567 1087754 1406540 1587781 1333594 1493731 1358248 1446787
10966 1446787 1429028 1049689 1374349 849925 1013740 1091629 1035970 984763 1219784 1247326
10956 1247326 1294864 1498519 1530916 1465381 935392 894170 817267 602104 317259 541404
10946 541404 63269 414720 -18313 286361 316855 40222 -24649 234786 393747 -102436
10935 231091 106262 186339 -46093 130585 14646 -79231 -48426 44954 -278230 108499 -51584
10923 -19593 -76544 -201650 317508 -37243 237350 151204 196134 -70647 338732 57835 -329697
10911 -377988 149830 119716 -102587 -135713 -128748 -2496 384595 47375 -56885 -132560 24771
10899 -160585 137856 319052 239281 -343705 36100 -72034 -23118 58265 -110653 76153 -200019
$$ packed form
10976G57727J8581K08404k52145L55187L18786J81241k54187J60137j35483Q8539
10966A446787j7759l79339L24660n24424J63815P7889n5659n1207K35021K7542
10956A247326M7538K03655L2397o5535n29989m1222p6903k15163k84845K24145
10946E41404F3269L51451a8313B86361L0494D0222b4649B34786J58961a02436
10935B31091A06262Q0077d6093A30585A4646g9231L0805D4954b78230A08499e1584
10923a9593n6951j25106C17508c7243B37350q6146M4930g0647C38732E7835c29697
10911c77988A49830l0114a02587l3126O965b496C84595D7375e6885p5675B4771
10899a60585A37856J81196p9771c43705C6100g2034b3118E8265a10653G6153b00019
$$ plain form
10887 -238912 -90195 -165921 127364 -107489 105567 -112198 -218895 296206 281442 364546
10877 364546 64928 -381631 97724 -142867 -117117 -169055 -4215 27435 -54842 128815 -268238
10865 182623 -25346 6210 -108857 -217970 -123252 -59044 152595 -83796 34545 -76941 160764
10853 -153257 -244174 -257121 335192 -165104 -335721 -131393 303216 -100466 -47151 -211686
10843 -211686 -219942 56375 239070 67835 -4753 -41730 -21100 118469 -43209 -65881 -43729
10832 -43729 -120954 136525 34944 -8238 -122830 -290602 -332651 36037 -62838 -93876 80160
10820 361120 103778 163691 -206595 2231 39874 -1242 69239 -161356 -78459 -54858 -227957
10809 -227957 -91956 -428328 17246 265376 81288 -250997 93533 -66134 38053 94143 -178717
$$ packed form
10887b38912i0195p5726A27364a07489A05567a12198j06697B96206j4764Q3104
10877C64546F4928c81631I7724a42867K5750n1938d215B7435e4842A28815b68238
10865A82623b5346F210a08857j09113R4718e9044A52595h3796C4545g6941A60764
10853a53257r0917j2947C35192a65104j70617a31393C03216a00466d7151j64535
10843b11686q256E6375J82695F7835d753l6977K0630A18469d3209k2672K2152
10832d3729p7225A36525C4944h238j14592j67772m2049C6037f2838l1038H0160
10820C61120A03778N9913b06595B231L7643a242F9239a61356g8459K3601j73099
10809b27957i1956l36372A7246K48130H1288b50997I3533f6134C8053N6090a78717
$$ plain form
10797 -86816 -177904 -118638 335365 -199973 308895 22777 171393 234831 124655 -157469
10786 -179458 114034 73737 -154351 -27251 -326697 -83873 -350037 -99511 -342620 -198261
10776 -198261 -179908 7597 50069 102803 63565 -122255 -42375 -154404 302710 -183658 110446
10764 -21502 -226684 -73774 51219 -80195 264220 110478 327376 -78574 -91150 -193090 -208027
10753 -208027 -127647 -391772 166062 -299187 -182942 -264985 179257 -315938 -97334 35193
10742 218141 12100 363511 -22443 -325931 29938 -59917 -233533 323387 -290592 -183828
10732 -183828 -125480 -253895 14938 -91441 -375794 -103025 222546 -298877 -178452 -236157
10722 -236157 -30268 -14567 87789 -72846 -296199 -218447 19483 11510 -110374 -114345 -98915
$$ packed form
10797h6816r1088N9266C35365a99973C08895B2777J48616O3438j10176a57469
10786a79458A14034m0297a54351b7251k99446h3873k66164i9511k43109J44359
10776a98261J8353G597M2472N2734l9238a22255d2375j12029C02710a83658A10446
10764b1502k05182g3774E1219h0195B64220A10478K16898g8574j2576j01940j4937
10753b08027Q0380k64125A66062b99187J16245q2043A79257c15938i7334C5193
10742B18141A2100L51411b2443l03488B9938e9917j73616C23387b90592J06764
10732a83828N8348j28415A4938i1441k84353a03025B22546b98877J20425n7705
10722b36157c0268a4567H7789g2846k23353P7752A9483p973a10374l971J5430
$$ plain form
10711 -98915 -113805 -116010 117304 65170 -504739 -16525 49564 -125077 127653 513553 146695
10699 -31942 11838 10300 58412 79735 -142953 -244902 -10909 -112151 -337703 -75855 -168298
10688 -168298 28931 55358 102280 -241923 -148894 96365 -183647 -45170 88497 -82529 203039
10676 -126626 108154 -4238 -132680 197683 -124486 190717 -38274 -184208 57398 124199
10666 124199 129219 19957 -184174 -18921 13712 -95432 -61969 47467 275359 192689 -107330
10654 140657 -131928 -205855 -90096 -21186 381935 190859 9236 -83224 636 128086 182567
10643 182567 -4621 -178695 372119 -245213 -207034 -183155 -5774 -60894 -458648 -243695 -315408
10632 -315408 -208439 149834 -132444 -10394 -196122 -403255 -144441 -35722 -152751 28093
$$ packed form
10711i8915j4890k205A17304n2134e04739a6525D9564a25077A27653L85900A46695
10699c1942A1838j538M8112K1323a42953j01949a0909j01242k25552g5855r2443
10688a68298B8931K6427M6922b41923R3029I6365a83647d5170H8497h2529B03039
10676a26626A08154d238j28442A97683a24486A90717c8274j45934E7398O6801
10666A24199N020A9957a84174a8921A3712i5432L3463D7467K27892q2670a07330
10654A40657a31928p3927i0096b1186C81935A90859I236h3224F36J27450N4481
10643A82567d621j74074C72119b45213L8179K3879e774n5120l97754K14953p1713
10632c15408J06969A49834a32444a0394j85728k07133a44441c5722j17029B8093
$$ plain form
10621 -161158 -262889 51906 -71112 -192622 -240883 57402 -186260 249968 -77642 -128793 -8713
10609 -132845 281599 6676 11557 273511 -52728 61392 -192605 14228 -150434 15899 26285
10598 26285 -72058 135217 -56661 246531 197134 348823 -151972 -97697 -13006 -7709 238442
10586 -105889 13476 -415366 -77767 -74754 133198 163612 -270968 -110633 -18684 -106659 95160
10574 -66575 -129792 66943 81046 223792 115337 205309 -20132 -63600 -138933 -143752 -182840
10563 -182840 -225313 234648 -126704 28217 199457 -176962 15545 100191 -187946 3011 -121264
10551 -112438 268588 -105035 -134425 -99374 -67362 53778 18880 -2498 107492 171088 69397
10539 -28626 -14476 40473 -28570 -12705 9451 -335295 -247496 -174812 44187 168187 -104255
$$ packed form
10621a61158j01731E1906g1112j21510m8261E7402a86260B49968g7642n1151h713
10609a32845B81599F676M881K61954e2728F1392a92605A4228a50434A5899J0386
10598B6285g2058A35217e6661B46531m9397J51689a51972N4275a3006N297B38442
10586a05889A3476d15366g7767L013A33198L0414b70968a10633a8684q7975I5160
10574f6575o3217F6943J4103J42746j08455Q9972b0132m3468p5333m819l9088
10563a82840m2473B34648a26704B8217J71240a76962A5545Q4646a87946C011a21264
10551a12438B68588a05035k9390L5051L2012E3778A8880b498A07492O3596F9397
10539b8626J4150D0473b8570a2705I451c35295Q7799P2684D4187J24000a04255
$$ plain form
10527 -127663 17297 301231 -227872 -30801 140970 56478 -71742 -290940 60647 -194383
10516 -7742 -13295 260317 -229085 -278757 -274786 -304455 -113326 -75300 -267190 84203 307899
10505 307899 188829 104380 -71448 -14551 37543 -217757 -21134 -152202 -59634 47251 -227299
10493 -100391 67898 4232 -274183 -160247 157606 -12939 -51355 -40380 212877 129006 -67471
10481 161833 100924 84306 413969 59587 147568 -68905 112445 -437593 10222 253775 164726
10470 164726 152862 337191 163476 32625 -224126 182914 242337 -131432 -2860 -121323
10460 -121323 -18374 33268 -246311 -167348 21873 5015 84558 201856 -111101 -389652 330469
10448 802 -373937 -25051 -277174 -55616 -115674 -163639 178680 109081 -31674 -204222 168129
$$ packed form
10527a27663A7297K83934b27872c0801A40970E6478g1742k19198F0647a94383
10516g742n553B60317b29085m9672L971k9669a13326L8026j91890H4203K23696
10505C07899j19070q4449g1448a4551C7543b17757b1134j31068e9634D7251b27299
10493a00391F7898D232b74183J13936A57606a2939l8416J0975B12877q3871f7471
10481A61833o0909j6618L29663E9587Q7981f8905A12445d37593A0222K43553q9049
10470A64726j1864J84329A63476C2625b24126A82914N9423a31432b860j18463
10460a21323a8374C3268b46311P8963B1873E015P9543J17298a11101k78551C30469
10448H02c73937b5051k52123e5616o0058m7965A78680o9599c1674j72548A68129
$$ plain form
10436 -52561 -307857 -64023 221495 -101234 -16540 198446 -251451 135259 -182774 140768
10425 6815 280600 -226904 -22735 5324 134433 -120026 -267973 144705 2848 -162813 -142433
10414 -142433 103575 -147361 32816 -187047 170972 18820 -171973 -184431 -535285 -234118
10403 -9194 63728 -126483 70338 -193708 98893 -134100 -123570 -144681 140381 235588 -3636
10391 58350 262114 -57370 85554 258896 154600 356652 222086 329144 136140 -22058
10380 -27841 50661 -75404 -371482 -125666 -85698 81938 -216084 -64742 -40579 -213545 270891
10368 -29099 -38935 189629 194384 56854 -29638 316671 242845 21877 180137 45148 -290930
10356 270047 196672 181415 -104867 147584 386478 165546 202005 338590 219984 -57729
$$ packed form
10436e2561k55296f4023B21495a01234a6540A98446b51451A35259a82774A40768
10425F815K73785b26904b2735E324J29109a20026j47947A44705B848a62813K0380
10414a42433A03575a47361C2816a87047A70972A8820a71973j2458l50854b34118
10403i194F3728a26483G0338a93708I8893a34100J0530k1111A40381R5207c636
10391E8350K03764e7370H5554J73342j04296K02052j34566J07058A36140b2058
10380b7841E0661g5404k96078a25666L9968H1938b16084f4742K4163j72966B70891
10368b9099r836A89629M755E6854b9638C16671p3826B1877J58260D5148b90930
10356B70047p3375j5257a04867A47584K38894A65546L6459J36585j18606e7729
$$ plain form
10345 178669 61412 200125 140683 468788 382545 105276 344000 429166 253665 80432
10334 194880 -194707 162246 227739 313933 99336 -192497 -177558 234678 260288 -79201 75260
10322 84609 67667 -49684 240734 107859 135632 37619 23185 -61182 237667 17933 221145
10311 221145 -36433 -121083 235703 -23635 64934 48412 187919 -201078 -129526 192192 -161404
10299 -87362 55645 -163054 29083 -60987 157777 101886 -114700 -120068 46972 -161159 112792
10287 -5829 284519 -250226 -273109 -154589 129635 118530 118800 308214 -137084 -60686 161532
10275 -109061 -173639 86038 2943 -9280 169715 38735 18934 -53544 173740 -156959 -307608
10264 -307608 11479 -203706 294719 9761 462916 171389 147127 82488 467461 120209
$$ packed form
10345A78669F1412J38713n9442L28105q6243A05276K38724Q5166j75501H0432
10334A94880a94707A62246O5493Q6194I9336a92497J4939B34678K5610g9201G5260
10322H4609j6942d9684B40734A07859K7773C7619j4434f1182B37667A7933K03212
10311B21145c6433q4650B35703b3635F4934j6522J39507b01078P1552A92192a61404
10299h7362E5645a63054B9083f0987A57777n5891a14700n368D6972a61159A12792
10287e829B84519b50226k2883J18520A29635j1105K70J89414a37084f0686A61532
10275a09061o4578H6038B943i280A69715C8735A8934e3544A73740a56959j50649
10264c07608A1479b03706B94719I761M53155A71389k4262o4639L84973A20209
$$ plain form
10253 -84548 341161 116418 -30337 62255 44508 -101948 58168 -18733 22692 -203068 -220570
10242 -220570 6021 -16091 108724 343977 -278458 -38311 -135728 160894 209054 -59359 -277133
10231 -277133 -188676 80743 9059 -298896 287061 40155 -236621 131496 -270620 33239 -266750
10219 -132224 -226359 -326522 -383216 -168941 140362 88570 -113606 93170 206 -43431 -107515
10208 -107515 -14958 100407 -208985 -132583 23211 -85882 15325 -267900 29990 87146 -245464
10196 -156100 127386 -28477 303449 -93716 -249565 148910 -124088 -308033 139634 45609
10185 49358 58790 -77133 115711 -319539 -171651 206526 56969 -320025 -97642 228099 -62234
10173 -8088 68544 -360874 180608 39242 -177659 -78378 -107324 -84259 304567 -6307 -7743
$$ packed form
10253h4548C41161A16418c0337F2255j7747a01948E8168a8733B2692b03068j7502
10242b20570F021a6091A08724K35253b78458c8311r7417A60894M8160e9359k17774
10231b77133Q8457H0743I059b98896B87061D0155b36621A31496b70620C3239b66750
10219a32224r4135j00163n6694a68941A40362n1792a13606I3170B06d3431o4084
10208a07515a4958A00407b08985P6402B3211h5882A5325b67900B9990N7156b45464
10196a56100A27386b8477C03449i3716j55849A48910a24088j83945A39634D5609
10185D9358R432g7133A15711c19539J47888B06526E6969c20025i7642B28099f2234
10173h088F8544c60874A80608C9242a77659g8378k8946K3065C04567f307j436
$$ plain form
10162 -7743 -83922 -154948 61927 -140136 -23072 -305511 -65468 21419 -74995 -104346 135714
10150 -104057 -7020 -254518 -88988 74751 -101449 -241082 -34960 -1319 83209 17391 -47773
10138 -74883 63487 165404 336154 107727 17326 -284588 -347260 10530 -286487 -16690 104780
10126 219274 -332243 233075 318775 -109396 24150 39434 -193221 -454865 -494067 -92539
10115 -47287 -179474 -252464 -328083 -115872 -115922 -264041 64843 317340 256295 -120634 -18618
10103 -258296 51982 79066 -71753 253071 -151340 -132408 293348 93185 38558 -185836 -28596
10091 67434 16161 117430 98106 108104 -218820 -25080 -168775 -34150 137595 104708 -236874
10079 172231 98759 -57562 -80000 -96511 117607 -75068 -330514 187896 -128688 -150114 111661
$$ packed form
10162g743p6179p1026F1927a40136b3072k82439f5468B1419g4995k9351A35714
10150a04057g020k47498h8988G4751a01449j39633c4960a319H3209A7391d7773
10138g4883F3487J01917J70750A07727A7326b84588o2672A0530b86487a6690A04780
10126B19274c32243B33075Q5700a09396B4150J5284a93221k61644l9202i2539
10115d7287j32187p2990p5619a15872n0j48119F4843K52497o1045a20634a8618
10103b58296E1982K7084g1753B53071a51340J8932B93348I3185C8558a85836b8596
10091F7434A6161J01269j9324R998b18820b5080j43695c4150A37595l2887b36874
10079A72231p3472e7562k2438j6511A17607g5068k55446A87896a28688k1426A11661
$$ plain form
10067 89070 113190 85588 140096 6090 -115084 108139 57678 -40069 172337 -102169 66712
10055 30474 -190903 -118191 98265 -102371 387178 55680 121525 -185998 -349324 98778 -97510
10043 -50528 182711 -356172 -271155 -76762 -66942 -79248 -11085 -142937 -66759 -139746 -27968
10031 -304204 -33944 -240529 -54875 -256882 41016 190421 153214 201553 286685 24324 -184544
10019 203815 -12159 209601 78067 139130 -173379 -90348 36036 -97822 -39063 252410 39912
10007 -114958 -45548 -43026 10055 -55387 -361659 -155479 -160471 77944 -161373 6737 -48571
9995 -152936 5703 -58727 11866 -102630 127764 -161876 15128 -115168 -263251 197363 -182806
9983 181116 -190052 207292 -207656 -104904 -205838 203395 -116334 -77449 -12368 -105068
$$ packed form
10067H9070K4120k7602N4508F090a15084A08139n0461d0069A72337a02169F6712
10055C0474a90903P2712I8265a02371C87178E5680O5845a85998j63326I8778i7510
10043e0528A82711c56172Q5017g6762R820j2306a1085j31852f6759p2987b7968
10031c04204c3944k06585e4875k02007D1016J49405l7207M8339Q5132B4324a84544
10019B03815a2159B09601G8067O1063a73379Q3031C6036i7822c9063B52410C9912
10007a14958d5548K522A0055e5387l06272a55479m992G7944a61373F737d8571
9995a52936E703e8727A1866a02630A27764a61876A5128a15168j48083A97363a82806
9983A81116a90052B07292b07656J02752j00934B03395a16334L8885a2368r2700
$$ plain form
9973 -105068 -16135 137016 -42646 -21905 -164521 160779 78547 -64512 -289496 16190 -104720
9961 71995 -121626 -86217 -50082 -341454 -124040 -204625 -266546 13473 225672 -123770 -32487
9949 -129496 -51567 -37124 -111979 -98850 167908 79648 -187662 133675 -46852 -149562 -59237
9937 -436178 -65183 189976 -197945 -72488 27492 -26177 80731 -166093 75645 32327 -38902
9925 -73657 282602 252604 -139550 142388 -78778 63422 -82167 -7655 -255103 -113424 259790
9913 221975 140614 -172784 -164685 -144121 123380 -80114 -108093 11498 -14791 -84276 -124032
9902 -124032 -185695 -78846 18182 202688 -1035 -19153 -351123 -87581 22575 -363977 388706
9890 -108236 -134621 -121903 -35366 -34864 251499 -171936 -119103 3065 -7578 59465 76168 -268124
$$ packed form
9973a05068a6135A37016d2646K0741j42616A60779G8547f4512k24984A6190a04720
9961G1995a21626L5409L6135k91372a24040q0585o1921A3473K12199a23770c2487
9949a29496e1567J4443p4855J3129A67908G9648a87662A33675d6852j02710e9237
9937d36178f5183A89976a97945g2488B7492b6177H0731a66093G5645C2327c8902
9925g3657B82602k9998a39550A42388g8778F3422h2167g655k47448a13424B59790
9913B21975q1361a72784Q099K0564A23380h0114k7979A1498a4791o9485l9756
9902a24032o1663g8846A8182J84506a035j8118l31970h7581B2575c63977C88706
9890a08236k6385J2718c5366N02B51499a71936N2833C065g578E9465J6703b68124
$$ plain form
9877 -159473 -41537 128921 104097 84006 -121125 -60125 -482540 -332754 -95542 -182259 -63933
9865 -120276 107997 128139 -327336 21312 44008 -165361 -283292 -430106 49228 362655
9855 362655 -386735 92806 -148882 -91672 34207 22249 65259 316443 -301617 -99098 25924
9843 -169207 10312 -29433 -307602 82962 -180991 -100775 -203883 58535 -139496 -180584 146158
9831 174374 -428480 250389 24460 112702 -326569 -36033 47653 -205194 62681 43570 85891
9820 85891 -155709 -261977 -148184 -192342 -292612 -79156 122910 198153 164564 -105614 -215694
9809 -215694 -77826 84819 150574 -21237 -167872 -167935 21538 -872 25207 -135874 113645 87595
9797 87595 126441 -180664 146659 -371514 61234 121767 299861 -34377 -227061 1841 -114121
$$ packed form
9877a59473d1537A28921k4824k0091a21125f0125m22415J49786i5542q6717f3933
9865a20276A07997K0142c27336B1312K2696a65361j17931j46814D9228L13427
9855C62655c86735I2806a48882N7210C4207j1958M3010K51184c01617i9098B5924
9843a69207A0312b9433k78169H2962a80991Q0216j03108E8535a39496m1088A46158
9831A74374d28480B50389B4460Q8242c26569c6033D7653b05194F2681j9111M2321
9820H5891a55709j06268J13793m4158j00270g9156A22910P5243l3589a05614j10080
9809b15694g7826H4819O5755b1237j46635o3B1538h72B5207a35874A13645k6050
9797H7595L8846a80664A46659c71514F1234O0533J78094c4377j92684A841a14121
$$ plain form
9785 344757 -94524 -57768 7109 131076 -252417 -353326 -86571 82389 -148282 5498 91770
9774 91770 24146 -63213 -199904 -256813 -142709 62168 -96020 241570 5574 152827 253431
9763 253431 -237278 260504 -328592 -56835 -99375 -397209 43929 -96317 -54232 -68795 -188437
9752 -188437 -14514 -89669 -239989 80938 -110792 -274913 -17583 -169518 -120538 -256437 60555
9740 187290 29533 -209936 -128751 101771 -2886 -58664 134682 67696 -36433 78651 158700
9729 158700 188095 -112261 -401681 50079 -278208 -269448 38044 -252432 -16951 -325374 -251257
9718 -251257 370072 -326679 -35074 -258104 -387086 26226 145549 93404 -147186 -115505
9708 -115505 -8915 -242311 214900 -152575 -20695 69474 36092 137133 -142560 98815 -146833
$$ packed form
9785C44757i4524L6756G109J23967b52417j00909h6571H2389a48282E498Q6272
9774I1770B4146f3213j36691n6909J14104F2168i6020B41570E574J47253J00604
9763B53431b37278B60504c28592e6835m2540k97834D3929i6317M2085j4563j19642
9752a88437a4514p5155j50320H0938a10792j64121a7583j51935M8980j35899F0555
9740A87290B9533b09936Q1185A01771b886n5778A34682o6986c6433G8651Q0049
9729A58700K9395a12261k89420E0079b78208Q760C8044b52432a6951l08423P4117
9718b51257C70072c26679c5074k23030j28982B6226J19323n2145a47186L1681
9708a15505h915k33396B14900a52575b0695F9474l3382J01041a42560I8815a46833
$$ plain form
9696 -2595 -105774 12496 -248402 70594 -179657 132401 109048 -228848 167967 -47347 -238012
9685 -238012 254940 -78302 -157156 53832 -329625 -150704 -41600 119047 -134423 -47649 -102126
9674 -102126 97921 -105327 73345 -157545 -236034 -970 162977 -8716 84458 75092 -132868 -166066
9662 -166066 -137358 -117732 47395 200385 319089 51463 144474 -12264 45959 60028 -130045
9650 -340708 131850 -57753 -13439 526923 -179349 181454 -252907 133531 102860 -117333
9639 -210703 -134367 31928 53460 -179591 309881 399275 -122816 -223258 -414401 229702
9628 1847 -323670 -315674 -280738 -43248 -84286 11526 97081 -414313 -134007 31578 -80317 -38895
9615 89859 -193796 87456 158433 -174270 -145176 74055 -161686 -136308 96690 -5920 -1740 12935
$$ packed form
9696b595j03179A2496b48402G0594a79657A32401k3353b28848A67967d7347j90665
9685b38012B54940g8302p8854E3832c29625a50704d1600A19047a34423d7649n4477
9674a02126I7921a05327G3345a57545p8489i70A62977h716H4458r366a32868l3198
9662a66066K8708J9626D7395J52990J18704E1463R3011a2264D5959J4069a30045
9650c40708A31850e7753a3439E26923a79349A81454b52907A33531l0671a17333
9639b10703P6336C1928K1532a79591C09881Q9394a22816j00442j91143B29702
9628A847c23670P996L4936d3248m1038A1526Q5555d14313a34007C1578h0317c8895
9615H9859a93796H7456P0977a74270K9094G4055a61686K5378I6690e920a740A2935
$$ plain form
9602 -277322 -79037 28707 -30365 -134722 -40981 155124 92131 68047 -76712 -399012 -93202
9590 -98265 148677 -1533 -212134 -55134 -13062 -212818 -51616 125165 -66451 -118140 28795
9578 -438048 34543 -78873 -488828 -15646 -61035 -142786 42196 -59793 -147363 -119375 214480
9566 65373 -64103 -50683 -283217 297550 -13284 -241889 -225002 -17964 24367 -125607 39597
9554 -96278 -134204 -305610 -149558 -56869 34990 -11053 250258 92049 308860 9930 87916
9543 87916 118619 -88646 -148893 46875 -87583 -201958 -170016 4381 -44138 13051 141732 -57650
9530 -1957 -159541 -6760 -349610 -219029 -125146 -451109 -296014 -24271 244240 141078 235446
9519 235446 -156964 -278034 -15914 224315 -105860 26575 -357873 347859 172221 -75914
$$ packed form
9602b77322g9037B8707c0365j04357d0981A55124o2993k4084g6712l22300i3202
9590i8265A48677a533k10601e5134a3062j99756e1616A25165f6451n1689B8795
9578d38048C4543g8873m09955a5646m5389q1751D2196e9793q7570K7988B14480
9566F5373f4103J3420k32534B97550a3284k28605J6887a7964B4367a25607C9597
9554i6278l7926j71406a49558e6869C4990a1053B50258I2049K16811I930P7986
9543H7916L0703h8646o0247D6875h7583j14375L1942D381d4138A3051J28681e7650
9530a957j57584f760l42850J30581R3883l25963J55095b4271B44240j03162R4368
9519B35446a56964j21070a5914B24315a05860B6575c57873C47859A72221g5914
$$ plain form
9508 23185 106990 56790 -562 49537 -43074 51461 -131315 42911 84247 -57160 -172976 169571
9495 31723 27309 -62243 205781 -35136 83864 178351 40494 87075 113543 -169299 -83957 -166688
9483 -166688 -99827 -65008 -63261 295304 -270399 -96205 205708 24267 -45655 -226923 -113121
9471 40391 103911 -72095 -240501 -290338 66413 -34319 -73806 -268376 -23245 -36905 79515
9459 -286060 43814 -34848 169743 -155699 87141 -93043 -260828 105570 109823 -26969 -105784
9448 -105784 34040 -25106 -57111 -77486 276314 -61201 13510 -165901 334962 104044 50982
9436 -62421 -156431 -832 70842 -120931 46391 -396040 101115 1880 -32331 -266379 -227833 -70142
9423 -33531 -94230 -93676 241043 -123366 126436 -41465 271328 -81281 -298218 76803 -56348
$$ packed form
9508B3185Q3805n0200e62D9537d3074E1461a31315D2911M1336e7160j15816A69571
9495C1723m414f2243B05781c5136H3864R4487D0494M6581K6468a69299h3957q2731
9483a66688O6861L4819J747B95304b70399i6205B05708B4267d5655j81268a13121
9471D0391O3520g2095j68406m9837F6413c4319l9487j94570b3245j3660G9515
9459b86060D3814c4848A69743a55699H7141i3043j67785A05570M253b6969p8815
9448a05784C4040b5106l2005k0375B76314f1201A3510a65901C34962A04044E0982
9436f2421r4010h32G0842a20931D6391c96040A01115A880c2331k34048L8546g0142
9423c3531o0699N54B41043a23366A26436d1465B71328h1281k16937G6803e6348
$$ plain form
9411 -113233 -236821 -50730 56547 -196465 -88090 -321638 132038 -46442 -58265 27244 435706
9400 435706 159975 96587 -328952 -23174 79231 -48945 111991 60919 -165247 156628 -128039
9388 427661 -21175 -363986 -166603 -111099 -150024 55574 -138736 -407456 -134250 -207930 12889
9376 43271 40749 16709 99352 -116453 -437544 -9486 -17362 -181919 -61061 -319632 -171552
9365 -171552 -244317 -131709 -419834 -2861 88682 261560 102874 -80623 -55515 -271842 117637
9353 -107864 -306996 -216918 42145 -35726 11185 17777 41520 -16964 -106104 -543356 -142566
9341 -197484 -168798 -75799 -127095 -328205 -121591 205589 -61978 35983 -57434 -144548 34660
9329 -38837 -126845 -64320 -75995 85219 -5042 149861 -150648 -151174 85843 -37444 8542 124158
$$ packed form
9411a13233j23588e0730E6547a96465h8090k33548A32038d6442j1823B7244M08462
9400D35706A59975o3388c28952b3174G9231d8945A11991n1072a65247A56628a28039
9388D27661b1175l42811a66603N5504l8925E5574a38736k68720a34250p3680A2889
9376D3271k522A6709Q2643a16453l21091i486p876j64557f1061k58571J48080
9365a71552p2765J12608k88125b861H8682J72878A02874h0623K5108k16327A17637
9353a07864j99132R0078D2145c5726A1185O592K3743a6964q9140m37252a42566
9341a97484K8686g5799n1296k01110a21591B05589f1978C5983e7434q7114C4660
9329c8837q8008O2525j1675H5219e042A49861a50648n26H5843c7444H542J15616
$$ plain form
9317 124158 -70063 -148631 206788 45497 -90767 -51578 -281405 105502 151458 -69245 -45648
9306 -45648 -21675 -294026 -307768 -200252 -236090 -129485 73017 -332607 -64392 130231 -175334
9294 210597 -85058 -158553 474156 -142872 -335343 66710 -104560 -35964 174028 67604 -201424
9282 -117229 157041 7856 110480 103083 -220506 -202510 36820 -191519 105403 156947 -109116
9270 72208 101556 -347518 167220 -239396 -369867 -194681 -47871 -153885 143479 -152838
9259 -52649 -229648 141802 -122374 101999 -105999 -222791 -159913 -163076 -205035 -98883 314540
9247 -121031 24270 -93137 359099 -55941 -74197 91357 77660 382072 -132436 -3168 -71786
9236 -71786 64886 -200662 -1927 -169555 -59647 136338 -174731 86960 -49249 -5472 91705
$$ packed form
9317A24158g0063p8568B06788D5497i0767L9189k29827A05502M5956f9245K3597
9306d5648b1675k72351j3742J07516l5838J06605G3017c32607f4392A30231a75334
9294B10597h5058p3495D74156a42872j92471F6710a04560c5964A74028F7604b01424
9282a17229A57041G856J02624p397b20506J7996C6820a91519A05403N1544a09116
9270G2208K9348c47518A67220b39396j30471J75186d7871j06014A43479a52838
9259e2649j76999A41802a22374A01999a05999j16792O2878l163m1959i8883C14540
9247a21031B4270i3137C59099e5941j8256I1357j3697L04412a32436c168o8618
9236g1786F4886b00662a927j67628e9647A36338a74731H6960d9249e472I1705
$$ plain form
9224 -288480 -91273 -214511 -99651 -44244 -137926 20294 -176422 -401707 -200681 -249628 -41542
9212 -199440 -210296 532194 31376 2461 165603 17981 27675 -136166 -171270 -84317 -45834
9201 -45834 -186919 -295867 47302 144225 -33923 -12424 -152529 -349308 -4749 167017 176697
9190 176697 -288056 -281626 238488 101143 -185180 233225 -30732 -386719 67765 -292073
9179 -37783 -79501 114345 -245833 69839 -71693 -305701 -340893 -46356 -16075 -346662 30016
9167 10880 -5937 -327317 38614 41889 -103975 -113611 47847 169031 -196918 -162538 -60152 281749
9154 203359 30419 -36976 -181462 -298938 196264 -8422 -78190 78788 -199935 -77357 -99216
9143 -99216 -160920 85965 -251535 -31352 -163711 -241976 -66973 17272 -128677 262999 119737
$$ packed form
9224b88480i1273j23238i9651d4244r3682B0294a76422k25285b00681m8947d1542
9212a99440j0856E32194C1376B461J63142A7981R694a36166l5104h4317L8483
9201d5834j41085j08948D7302R6923c3923a2424j40105j96779d749A67017R680
9190A76697b88056O430B38488A01143a85180B33225c0732l55987F7765b92073
9179c7783m1718A14345b45833F9839g1693k34008l5192d6356a6075l30587C0016
9167A0880e937l21380C8614L275a03975r636D7847J21184a96918L4380f0152B81749
9154B03359C0419c6976j44486j17476A96264h422o9768G8788a99935g7357k1859
9143i9216o1704H5965b51535c1352j32359p8265f6973A7272a28677B62999A19737
$$ plain form
9131 -280697 -299889 161764 159531 48078 63328 -202977 -228103 -367714 -151052 -102086 171826
9119 107062 87218 2163 -66633 -112706 -24893 345741 9914 12528 80488 409945 306060 -73276
9106 -230266 -20152 25707 -15316 180671 -196035 94872 -215514 -93865 -66018 288398 -129687
9094 65811 67686 -126846 86360 69937 -2338 170161 -65449 22785 -38709 -206509 -31360 -184448
9082 -184448 -84727 -198231 119617 -297289 13835 61619 -37478 79377 -75932 -148557 178125
9070 -148475 -42250 108432 109628 -228545 -305950 118699 -82000 133218 -147254 -446816 -35147
9058 -36171 -201311 -7279 -264859 -342434 74073 -452215 -139117 119528 -247014 -146432 -18871
9046 22771 -343833 -148488 -20786 -309608 157832 -216835 -112432 190724 -126067 -136264
$$ packed form
9131b80697j9192A61764k233D8078J5250b02977k5126j39611a51052M8966A71826
9119A07062j9844B163f6633m6073b4893C45741I914K614O7960L29457j03885g3276
9106b30266b0152B5707a5316A80671a96035I4872b15514i3865K7847B88398a29687
9094F5811J875a26846H6360j6423b338A70161f5449B2785c8709j67800c1360j53088
9082a84448h4727j13504A19617b97289A3835M7784c7478G9377g5932p2625A78125
9070a48475d2250A08432J196b28545p7405A18699h2000A33218a47254k99562c5147
9058c6171j65140g279k57580p7575G4073d52215a39117A19528b47014J00582a8871
9046B2771c43833a48488b0786k88822A57832b16835J04403A90724a26067j0197
$$ plain form
9036 -136264 -91344 38004 -113628 139413 254449 70376 -57959 112998 -9002 -147954 231704
9024 263074 23759 -229543 -319133 -114951 -140250 -243666 -228096 -14712 -446445 -110440 -49325
9012 316449 -354739 -155630 123755 142334 -5154 144733 127345 154075 -123335 -331331 14206
9000 -217388 -268743 -246785 -263902 -63591 74899 209498 7212 113860 -33154 -232657 -134021
8989 -134021 -14125 -74478 30779 -59867 -129170 145710 -202877 -251417 -106003 237096 196931
8978 196931 -116964 -194802 -26517 -109412 -58079 -319906 -130254 -202757 173934 270408 -4045
8966 -139258 -54596 -102570 -71263 -245988 -239392 7946 -11520 149034 88254 -124815 -106956
8955 -106956 -271490 64911 -311156 -198817 -188997 -5773 -10141 -101313 -4133 -154922 234970
$$ packed form
9036a36264M4920C8004a13628A39413J15036G0376e7959A12998i002j38952B31704
9024B63074B3759b29543q9590a14951k5299j03416J5570a4712m31733a10440d9325
9012C16449c54739a55630A23755J8579e154A44733j7388K6730a23335k07996A4206
9000b17388n1355K1958j7117f3591G4899J34599G212J06648c3154j99503R8636
8989a34021a4125o0353C0779e9867o9303A45710b02877m8540a06003B37096m0165
8978A96931a16964p7838b6517q2895N1333k61827a30254p2503A73934R6474d045
8966a39258e4596m7974L1307j74725O596G946a1520A49034o0780a24815J7859
8955a06956j64534F4911c11156J12339R820e773m368r1172d133j50789B34970
$$ plain form
8943 135089 139797 -100367 -227901 -283747 -46886 -249475 -173572 95589 -211490 320498 -12731
8931 191415 -129941 -32593 11264 201371 -275013 -267560 196366 -34216 25057 228179 1131063
8920 1131063 1668067 1467814 562565 -5612 174991 2080 282784 -286894 -186482 -173305
8910 -173305 234730 -155332 8442 -49148 -75516 -82015 -197683 -41562 104256 108015 157559
8899 157559 114709 -268741 171257 -47978 16550 -257059 -156859 -358816 -106263 -3867 69453
8887 -255202 218178 -155383 32722 -185788 80498 144573 -57125 -253820 -24205 29496 215123
8876 215123 -210423 -143133 -118678 331237 7826 -56423 -234981 -127394 -52788 35649 -6982
8864 -12025 -138112 151708 57886 159259 -18681 -69887 -203803 89834 50173 -360013 149519
$$ packed form
8943A35089M708a00367j27534n5846d6886k02589P5903I5589b11490C20498a2731
8931A91415a29941c2593A1264J90107b75013P453A96366c4216B5057K03122R02884
8920A131063N37004k00253E62565e612A74991B080K80704b86894J00412J3177
8910a73305B34730a55332H442d9148k6368o499j15668d1562A04256L759M9544
8899A57559m2850b68741A71257d7978A6550b57059J00200k01957a06263c867F9453
8887b55202B18178a55383C2722a85788H0498O4075e7125j96695b4205B9496J85627
8876B15123b10423O7290K4455C31237G826e6423j78558J07587e2788C5649f982
8864a2025j26087A51708E7886J01373a8681n1206j33916H9834l9661c60013A49519
$$ plain form
8852 8630 -152438 -11342 -31950 51028 -306378 121516 12870 -44612 28058 -11864 36675
8840 -100784 173302 -92811 -65258 78294 54292 -434861 163319 40303 4243 -459733 127449
8828 -380343 -5499 49041 232520 220195 -124119 -24886 172317 160399 235371 -40527 -120383
8817 -120383 76490 -340445 -145062 95220 -330590 275256 -172892 71582 8449 -23445 112775
$$ packed form
8852H630a52438a1342k0608E1028c06378A21516A2870d4612B8058a1864C6675
8840a00784A73302i2811K7553G8294k4002d34861A63319D0303D243d59733A27449
8828c80343e499D9041J83479j2325a24119b4886A72317j1918P4972d0527p9856
8817a20383G6490c40445a45062I5220c30590B75256a72892G1582H449b3445A12775
$$ [...]
##END NTUPLES=NMR SPECTRUM
##END=
