##TITLE=NES1085_IP2_9884916_xXUE9NG3Dy
##JCAMPDX= 6.0         $$ Bruker NMR JCAMP-DX V2.0
##DATA TYPE= NMR SPECTRUM
##DATA CLASS= NTUPLES
##ORIGIN= BRUKER
##OWNER= Administrator
$$ 1.72 TOPSPIN		Version 2.1
$$ 2016-08-27 15:35:33.023 -0500  Administrator@X
$$ Compression mode = diff/dup
##.OBSERVE FREQUENCY= 400.02188249412
##.OBSERVE NUCLEUS= ^1H
##.ACQUISITION MODE= SIMULTANEOUS (DQD)
##.ACQUISITION SCHEME= undefined
##.AVERAGES= 64
##.DIGITISER RES= 22
##SPECTROMETER/DATA SYSTEM= spect
##.PULSE SEQUENCE= noesygpps1d.comp
##.SOLVENT NAME= COFFEE_meoh
##.SHIFT REFERENCE= INTERNAL, COFFEE_meoh, 1, 14.9619
##AUDIT TRAIL= $$ (NUMBER, WHEN, WHO, WHERE, PROCESS, VERSION, WHAT)
$$ ##TITLE= Audit trail, TOPSPIN		Version 2.1
$$ ##JCAMPDX= 5.01
$$ ##ORIGIN= Bruker BioSpin GmbH
$$ ##OWNER= Administrator
$$ $$ E:\/data/COFFEE/nmr/NES1085_IP2_9884916_xXUE9NG3Dy/22/pdata/1/auditp.txt
$$ ##AUDIT TRAIL=  $$ (NUMBER, WHEN, WHO, WHERE, PROCESS, VERSION, WHAT)
(   1,<2016-08-27 15:35:27.914 -0500>,<Administrator>,<X>,<go>,<TOPSPIN 2.1>,
      <created by zg
	started at 2016-08-27 15:23:57.461 -0500,
	POWCHK enabled, PULCHK disabled,
       configuration hash MD5:
       21 0F 79 D6 B3 7B B4 F6 88 20 88 DB 03 48 BD 9F
       data hash MD5: 64K
       11 84 00 A5 2F 4F 46 64 58 62 19 87 D5 F1 AF 55>)
(   2,<2016-08-27 15:35:30.976 -0500>,<Administrator>,<X>,<proc1d>,<TOPSPIN 2.1>,
      <Start of raw data processing
       efp LB = 0.3 FT_mod = 6 PKNL = 1 PHC0 = 0 PHC1 = 0 SI = 128K 
       data hash MD5: 128K
       FC 06 A8 7F 25 0E 00 34 DD EA 1C 4D F2 85 41 93>)
(   3,<2016-08-27 15:35:31.883 -0500>,<Administrator>,<X>,<proc1d>,<TOPSPIN 2.1>,
      <pk PHC0 = -79.34875 PHC1 = 0 
       data hash MD5: 128K
       F1 E1 38 BA DB C3 1E 3F E1 83 D8 E8 8B DE EA 2D>)
(   4,<2016-08-27 15:35:32.258 -0500>,<Administrator>,<X>,<proc1d>,<TOPSPIN 2.1>,
      <abs ABSG = 1 
       data hash MD5: 128K
       47 29 FD ED B9 A1 8A 9C A8 1C 59 B7 5E A3 9E A4>)
(   5,<2016-08-27 15:35:32.351 -0500>,<Administrator>,<X>,<proc1d>,<TOPSPIN 2.1>,
      <abs ABSG = 2 
       data hash MD5: 128K
       C6 85 5F 47 18 40 95 48 FB 51 57 FB F4 21 A3 82>)
(   6,<2016-08-27 15:35:32.445 -0500>,<Administrator>,<X>,<proc1d>,<TOPSPIN 2.1>,
      <abs ABSG = 3 
       data hash MD5: 128K
       FF 51 D1 E6 AA 8D 09 C4 E4 6D 2C B1 AF 21 EA F2>)
(   7,<2016-08-27 15:35:32.539 -0500>,<Administrator>,<X>,<proc1d>,<TOPSPIN 2.1>,
      <abs ABSG = 4 
       data hash MD5: 128K
       1C EF 99 03 96 4F CA CD 53 7F D6 77 D0 F4 21 C2>)
(   8,<2016-08-27 15:35:32.664 -0500>,<Administrator>,<X>,<proc1d>,<TOPSPIN 2.1>,
      <abs ABSG = 5 
       data hash MD5: 128K
       1F B5 B7 49 AD 3B 50 24 6A 4F B4 9A 93 94 A2 07>)
$$ ##END=
$$ 
$$ $$ hash MD5
$$ $$ D5 CE AE A9 53 E7 6D 40 04 59 CA 86 CD 0B F3 47
##$RELAX= 
##$RELAX= 
##$RELAX= 
##$RELAX= 
##$RELAX= 
##$RELAX= 
##$RELAX= 
##$RELAX= 
$$ Bruker specific parameters
$$ --------------------------
##$DU= <E:\>
##$EXPNO= 22
$$ [...]
150 150 150 150 150 150 150 150
##$TP07= 0
##$TPNAME0= <>
##$TPNAME1= <>
##$TPNAME2= <>
##$TPNAME3= <>
##$TPNAME4= <>
##$TPNAME5= <>
##$TPNAME6= <>
##$TPNAME7= <>
##$TPOAL= (0..7)
0.5 0.5 0.5 0.5 0.5 0.5 0.5 0.5
##$TPOFFS= (0..7)
0 0 0 0 0 0 0 0
##$TUNHIN= 0
##$TUNHOUT= 0
##$TUNXOUT= 0
##$USERA1= <user>
##$USERA2= <user>
##$USERA3= <user>
##$USERA4= <user>
##$USERA5= <user>
##$V9= 5
##$VALIST= <valist>
##$VCLIST= <CCCCCCCCCCCCCCC>
##$VD= 0
##$VDLIST= <DDDDDDDDDDDDDDD>
##$VPLIST= <PPPPPPPPPPPPPPP>
##$VTLIST= <TTTTTTTTTTTTTTT>
##$WBST= 2048
##$WBSW= 25
##$XGAIN= (0..3)
0 0 0 0
##$XL= 0
##$YL= 0
##$YMAX_a= 5397285
##$YMIN_a= -11291906
##$ZGOPTNS= <>
##$ZL1= 120
##$ZL2= 120
##$ZL3= 120
##$ZL4= 120
##$ABSF1= 14.9619
##$ABSF2= -5.596282
##$ABSG= 5
##$ABSL= 3
##$ALPHA= 0
##$AQORDER= 0
##$ASSFAC= 0
##$ASSFACI= 0
##$ASSFACX= 0
##$ASSWID= 0
##$AUNMP= <proc_prof1d_extract.lims>
##$AXLEFT= 0
##$AXNAME= <>
##$AXNUC= <1H>
##$AXRIGHT= 0
##$AXTYPE= 0
##$AXUNIT= <>
##$AZFE= 0.1
##$AZFW= 0.1
##$BCFW= 0
##$BC_mod= 0
##$BYTORDP= 0
##$COROFFS= 0
##$CY= 15
##$DATMOD= 1
##$DC= 0
##$DFILT= <>
##$DTYPP= 0
##$F1P= 0
##$F2P= 0
##$FCOR= 0.5
##$FTSIZE= 131072
##$FT_mod= 6
##$GAMMA= 0
##$GB= 0
##$INTBC= 1
##$INTSCL= 1
##$ISEN= 128
##$LB= 0.3
##$LEV0= 0
##$LPBIN= 0
##$MAXI= 10000
##$MC2= 0
##$MEAN= 0
##$ME_mod= 0
##$MI= 0
##$NCOEF= 0
##$NC_proc= -2
##$NLEV= 6
##$NOISF1= 0
##$NOISF2= 0
##$NSP= 0
##$NTH_PI= 0
##$NZP= 0
##$OFFSET= 14.9619
##$PC= 1
##$PHC0= -79.34875
##$PHC1= 0
##$PH_mod= 1
##$PKNL= yes
##$PPARMOD= 0
##$PPDIAG= 0
##$PPIPTYP= 0
##$PPMPNUM= 2147483647
##$PPRESOL= 1
##$PSCAL= 4
##$PSIGN= 0
##$PYNMP= <proc.py>
##$REVERSE= no
##$SF= 400.02000927793
##$SI= 131072
##$SIGF1= 0
##$SIGF2= 0
##$SINO= 400
##$SIOLD= 131072
##$SPECTYP= <>
##$SREGLST= <1H.CDCl3>
##$SSB= 0
##$STSI= 131072
##$STSR= 0
##$SW_p= 8223.68421052631
##$SYMM= 0
##$S_DEV= 0
##$TDeff= 65536
##$TDoff= 0
##$TI= <>
##$TILT= no
##$TM1= 0
##$TM2= 0
##$TOPLEV= 0
##$USERP1= <user>
##$USERP2= <user>
##$USERP3= <user>
##$USERP4= <user>
##$USERP5= <user>
##$WDW= 1
##$XDIM= 131072
##$YMAX_p= 337763401
##$YMIN_p= -11018
##$CURPLOT= <Network HP LaserJet P1505>
##$CURPRIN= <$Network HP LaserJet P1505>
##$DFORMAT= <normdp>
##$LAYOUT= <+/1D_H.xwp>
##$LFORMAT= <normlp>
##$PFORMAT= <normpl>
##$SURQMSG= 1
$$ End of Bruker specific parameters
$$ ---------------------------------
##NTUPLES= NMR SPECTRUM
##VAR_NAME=  FREQUENCY,     SPECTRUM/REAL,   SPECTRUM/IMAG
##SYMBOL=    X,             R,               I
##VAR_TYPE=  INDEPENDENT,   DEPENDENT,       DEPENDENT
##VAR_FORM=  AFFN,          ASDF,            ASDF
##VAR_DIM=   131072,        131072,          131072
##UNITS=     HZ,            ARBITRARY UNITS, ARBITRARY UNITS
##FACTOR=    0.0627417313425164, 1,          1
##FIRST=     8223.62146879497, -1937,        -38138
##LAST=      0,             -56,             -37946
##MIN=       0,             -11018,          0
##MAX=       8223.62146879497, 337763401,    0
$$ Real data points
##PAGE= N=1
##DATA TABLE= (X++(R..R)), XYDATA
$$ [...]
61216A169134m1948m1014l9079l5477l1361k7919k4849k1221j7092j3285r926
61205H65963o296k285J014K635K945K969L101L103K948K838K634K006J124N21
61191H85220K97Q0k45m96r17k115m076n986p338q494r754j0646j0733j0403j0233
61176H04161j0216j0278j0891j2242j3331j2984j1552j0568j0740j1316j1429
61165F78614j1090j0592r852q788p731p053o773o816p141p519p659p821q738j0671
61151E60370j2939j4709j5712j6028j5654j4685j3548j2597j1768j0860r901q943
61139D03026p850o600n530m927m541l807k460p78O76J465J638J738K282L209M135
61124C81676N039O200P437Q073P929P757Q245R072R466R364R392R840J0193R706
$$ plain form
61216 1169134 1127186 1086172 1047093 1011616 980255 952336 927487 906266 889174 875889 865963
61205 865963 859667 857382 858396 861031 863976 866945 870046 873149 876097 878935 881569 883575 884699 885220
61191 885220 885517 885597 885352 884856 883939 881824 877748 871762 864424 855930 846176 835530 824797 814394 804161
61176 804161 793945 783667 772776 760534 747203 734219 722667 712099 701359 690043 678614
61165 678614 667524 656932 647080 638292 630561 623508 616735 609919 602778 595259 587600 579779 571041 560370
61151 560370 547431 532722 517010 500982 485328 470643 457095 444498 432730 421870 411969 403026
61139 403026 395176 388576 383046 378119 373578 369771 367311 366533 367209 368674 370312 372050 374332 377541 381676
61124 381676 386715 392915 400352 408425 416354 424111 432356 441428 450894 460258 469650 479490 489683 499389
61110D99389Q141N884L617J836N33o28j831k927l763m384m754m709m407m483n307
61095D82207o343o684o100n190m642m654n053n477n462m789l846l356l529l771
61081D13311l381k444j730j833k549l234l564l726l875l725k967j897j241j268
61067C75877j425j015J9J186K152K990L777M296M260L770L315L313L708M123M281
61052D14627M172L943L811M008M489M714M198L414L528M918O536P263P386Q003
61038D85010R315J0497J1149J1918J3445J5476J7412J9151K1000K3119K5363K7391
61026F90246K8859K9800L0868L2848L5919L9726M4081M9138N5043O1880O9881
61015A168289P9259R0120J03153J19938J41648J67869J97676K31402K70169L14778
$$ plain form
61110 499389 507530 513414 517031 518867 519400 518772 516941 514014 510251 505867 501113 496404 491997 487514 482207
61095 482207 475864 469180 463080 457890 453248 448594 443541 438064 432602 427813 423967 420611 417082 413311
61081 413311 409930 407486 405756 403923 401374 398140 394576 390850 386975 383250 380283 378386 377145 375877
61067 375877 374452 373437 373456 374642 376794 379784 383561 387857 392117 395887 399202 402515 406223 410346 414627
61052 414627 418799 422742 426553 430561 435050 439764 443962 447376 450904 455822 462358 469621 477007 485010
61038 485010 494325 504822 515971 527889 541334 556810 574222 593373 614373 637492 662855 690246
61026 690246 719105 748905 779773 812621 848540 888266 932347 981485 1036528 1098408 1168289
61015 1168289 1247548 1337668 1440821 1560759 1702407 1870276 2067952 2299354 2569523 2884301
61005B884301L67312M33208N18698O26161P54858R04127J065787J206825J268049
60996A0029326J197325R93436P13413M32105J97611K7269o6877p1285J142Q8992
60986A3542457J08094Q904j92510m38608o77264q82446j041104j137984j160625
60977H128914j112540j013639q88093p54853o27029n13428m17832l39315k75448
60968B186737k24560j84873j53611j28297j08054r2629q1070p1989o4450n7925
60958A019279n1948m6288m0973l5928l1098k6935k3994k1985k0079j8244j7241
60947F84566j7127j6907j6063j5218j4802j4146j2746j1297j0557j0079r111q064
60935E28449p861q342q479p969p487p454p527p433p380p433p234o659o185o239
$$ plain form
61005 2884301 3251613 3684821 4203519 4829680 5584538 6488665 7554452 8761277 10029326
60996 10029326 11226651 12220087 12933500 13365605 13563216 13590485 13523608 13452323 13453465 13542457
60986 13542457 13650551 13659455 13466945 13028337 12351073 11468627 10427523 9289539 8128914
60977 8128914 7016374 6002735 5114642 4359789 3732760 3219332 2801500 2462185 2186737
60968 2186737 1962177 1777304 1623693 1495396 1387342 1294713 1213643 1141654 1077204 1019279
60958 1019279 967331 921043 880070 844142 813044 786109 762115 740130 720051 701807 684566
60947 684566 667439 650532 634469 619251 604449 590303 577557 566260 555703 545624 536513 528449
60935 528449 520588 512246 503767 495798 488311 480857 473330 465897 458517 451084 443850 437191 431006 424767
60921D24767o525o394n706m986m709m695m413l840l660m325n283n590n147m690
60907C54804m623m577m272m033m109m173l911l528l202k695j982j690k186k740
60893C07083k413j408p38p95j039r72o70l39m2J01nl5M94J550K607L370L941M329
60875C15019M391M266M347M621M665M421M419M880N158M559L371K556K601L117
60861C72391L443L258K535J380R6q60j255j322j390j370r73l75k36q18j504j582
60845C71418j198r91j094j155j231j750k406k076l49J594K383K177K202K956L799
60830C74279M187M409M928N694O361O772O927O901O881P018P146O907O271N620
60816D60301N269N113M868M403L832L441L479L832L944L362K294J359Q18L30n57
$$ plain form
60921 424767 418242 411848 406142 401156 396447 391752 387339 383499 379839 375514 370231 364641 359494 354804
60907 354804 350181 345604 341332 337299 333190 329017 325106 321578 318376 315681 313699 312009 309823 307083
60893 307083 304670 303262 302524 301729 300690 299718 299048 298709 298667 298768 298763 298728 299222 300772 303379 306749 310690 315019
60875 315019 319410 323676 328023 332644 337309 341730 346149 351029 356187 360746 364117 366673 369274 372391
60861 372391 375834 379092 381627 383007 383103 382243 380988 379666 378276 376906 375933 375558 375322 374504 373000 371418
60845 371418 370220 369229 368135 366980 365749 363999 361593 359517 359168 360762 363145 365322 367524 370480 374279
60830 374279 378466 382875 387803 393497 399858 406630 413557 420458 427339 434357 441503 448410 454681 460301
60816 460301 465570 470683 475551 479954 483786 487227 490706 494538 498482 501844 504138 505497 506315 506645 506088
60801E06088j921l461m686n259n332n474n935o293o159n932o186o634o449n633
60787D30734n126n324n413m591l275k438k291k249j868j150j85R48J902K287K196
60772D04157K193K728L649M318M155L290K741L548N418O744O328M746L452K954
60758D60421K616K037J698K108L053M031M834N364N424N081M830M951N037M598
60744E16083L850L369L165K721J897J219J117J323J338J098Q60O47K25l71p11
60729E37830m89J2J93j67p61j271j812k662l716m525m842m854m839m926n241n919
60713D92011o717o989o383n360m623m291m102m152m805n855o508o363n804n225
60699D14834m497l574k913k771k539j512j9R53J115J165J692K443K875K932K949
$$ plain form
60801 506088 504167 500706 496020 490761 485429 479955 474020 467727 461568 455636 449450 442816 436367 430734
60787 430734 425608 420284 414871 410280 407005 404567 402276 400027 398159 397009 396824 397772 399674 401961 404157
60772 404157 406350 409078 412727 417045 421200 424490 427231 430779 436197 442941 449269 454015 457467 460421
60758 460421 463037 465074 466772 468880 471933 475964 480798 486162 491586 496667 501497 506448 511485 516083
60744 516083 519933 523302 526467 529188 531085 532304 533421 534744 536082 537180 538040 538687 538912 538541 537830
60729 537830 537341 537353 537546 537379 536618 535347 533535 530873 527157 522632 517790 512936 508097 503171 497930 492011
60713 492011 485294 478305 471922 466562 461939 457648 453546 449394 444589 438734 432226 425863 420059 414834
60699 414834 410337 406763 403850 401079 398540 397028 397009 397962 399077 400242 401934 404377 407252 410184 413133
60684D13133L061L016K496J477L02o46j335j960k452k522k357k735m056n593o330
60669C93499o179n776n369m735m012l713l892m097m143m143l724k225Q5J895K360
60654C45831J938J391R00O53J234K628L659L386K447K017J978J264k28j287j053
60639C66758o3N87N07J34M1L75Q04J054J498K805M804O247O218N339M931N476
60623D07515O560P894R412J0683J1188J1140J1190J1406J1378J1146J1045J0698
60611E31255R296O995M981L819K798J229o02k167l519m796n723o177o582p222
60597E23585p775p980q021p918p321o477o416p430q182p309n205l331k261j517
60583D36442q64n30l76O7P15J015R71J167J719K075J958J656J289O22j06j07Q69
$$ plain form
60684 413133 416194 419210 421706 423183 423485 422839 421504 419544 417092 414570 412213 409478 405422 399829 393499
60669 393499 387320 381544 376175 371440 367428 363715 359823 355726 351583 347440 343716 341491 341576 343471 345831
60654 345831 347769 349160 350060 350713 351947 354575 358234 361620 364067 366084 368062 369326 369098 367811 366758
60639 366758 366695 367282 367789 367923 367964 368339 369143 370197 371695 374500 379304 385551 391769 397108 402039 407515
60623 407515 414075 421969 431381 442064 453252 464392 475582 486988 498366 509512 520557 531255
60611 531255 540551 547546 552527 556346 559144 560373 559771 557604 554085 549289 543566 537389 530807 523585
60597 523585 515810 507830 499809 491891 484570 478093 471677 464247 456065 448756 443551 440220 437959 436442
60583 436442 435578 435048 434672 434739 435454 436469 437440 438607 440326 442401 444359 446015 447304 447926 447820 447713 448582
60566D48582J988K381K174K103K580L541M766N964O820P356P888Q455Q709Q631
60552E21938Q908J0222J2483J5188J8042K0853K3127K4409K4766K4346K2674J9043
60540G45999J3564P242Q92n397j1579j7028k0965k3156k3781k2941k0729j7670
60528F04451j4488j1421q083m292p18J654K628L026L714M683N307N411N682O969
60514F04523R412J2495J5757J9181K2979K7339L2513L8878M6623N5466O4848P4410
60502A024424Q4161R4234J04711J15679J27293J39667J52799J66564J80417J92653
60492B382602K00057J98796J86107J61260J25035P8768K4460l4186r1590j41912
60482C089397j81235k08280k23385k27355k21427k07754j89202j68458j47445
$$ plain form
60566 448582 450570 452951 455125 457228 459808 463349 468115 474079 480899 488255 496143 504598 513307 521938
60552 521938 530846 541068 553551 568739 586781 607634 630761 655170 679936 704282 726956 745999
60540 745999 759563 766805 767697 762300 750721 733693 712728 689572 665791 642850 622121 604451
60528 604451 589963 578542 570459 566167 565449 567103 569731 572757 576471 581154 586461 591872 597554 604523
60514 604523 613935 626430 642187 661368 684347 711686 744199 783077 829700 885166 950014 1024424
60502 1024424 1108585 1202819 1307530 1423209 1550502 1690169 1842968 2009532 2189949 2382602
60492 2382602 2582659 2781455 2967562 3128822 3253857 3332625 3357085 3322899 3231309 3089397
60482 3089397 2908162 2699882 2476497 2249142 2027715 1819961 1630759 1462301 1314856
60473A314856j27442j09298r3372p9559o7693n7745m9601m2844l7031l2020k7903
60462E90348k4615k1949j9756j7926j6249j4589j3140j2177j1508j0613r371q321
60450D10134p899p741p121n962n000m838n194n274m749m021l558l280k842k299
60436C40356k073k257k385k155j971k369l146l561l357l011k911k765k097r28
60422C05370L21J290J776J637J031N36O12J020J096O54K06K92Q37J381J689J898
60406C21646K257K808L384L747L802L771M125N140O421P050O414M936L729L449
60392C82679L731L863L772L880M165L993K964J492K46o11j225j511j303q75p30
60377D04530r35j138j320j901k880l425k840j603q38r30j166q20J3Q99J798K849
$$ plain form
60473 1314856 1187414 1078116 984744 905185 837492 779747 730146 687302 650271 618251 590348
60462 590348 565733 543784 524028 506102 489853 475264 462124 449947 438439 427826 418455 410134
60450 410134 402235 394494 387373 381411 376411 371573 366379 361105 356356 352335 348777 345497 342655 340356
60436 340356 338283 336026 333641 331486 329515 327146 324000 320439 317082 314071 311160 308395 306298 305370
60422 305370 305691 306981 308757 310394 311425 311961 312573 313593 314689 315343 315549 315841 316678 318059 319748 321646
60406 321646 323903 326711 330095 333842 337644 341415 345540 350680 357101 364151 370565 375501 379230 382679
60392 382679 386410 390273 394045 397925 402090 406083 409047 410539 410785 410174 408949 407438 406135 405260 404530
60377 404530 403595 402457 401137 399236 396356 392931 390091 388488 387650 386720 385554 384734 384747 385646 387444 390293
60361C90293L731L881L312K712K616K862K979K732K103J177L16M0L23L37n85j934
60345D16895k598k334k012k249k530k039r29j26j09l77k28L07N36j1r38j397j082
60328C98779n42m55p99j072j068r85r19p74o48p41q34m06N53J440J940K412K984
60311C98865L011J960L78p00r43p12k35M27Q18L44q78k108k927l454l625l020
60295C87201j676m26o9o42j698k783l417l188k307j628j600j601p62P57J928K160
60279C70249J939K046K637L259L539L532L467L440L467L737M489N514O086N730
60265D23131M959M782N462O193O154N428M612L957L407L146L501M301M884M909
60251D88826M807N246O405Q005R804J1804J3936J5853J7204J8094J9083K0690
$$ plain form
60361 390293 394024 397905 401217 403929 406545 409407 412386 415118 417221 418398 418714 418754 419077 419414 418829 416895
60345 416895 414297 411963 409951 407702 405172 403133 402204 402078 401969 401592 401364 401671 402207 402196 401258 399861 398779
60328 398779 398237 397782 396983 395911 394843 393858 392939 392165 391517 390776 389942 389536 390089 391529 393469 395881 398865
60311 398865 401876 403836 404214 403514 402571 401859 401624 402051 402869 403213 402335 400227 397300 393846 390221 387201
60295 387201 385525 385099 385030 384388 382690 379907 376490 373302 370995 369367 367767 366166 365404 366161 368089 370249
60279 370249 372188 374234 376871 380130 383669 387201 390668 394108 397575 401312 405801 411315 417401 423131
60265 423131 428090 432872 438334 444527 450681 456109 460721 464678 468085 471231 474732 479033 483917 488826
60251 488826 493633 498879 505284 513289 523093 534897 548833 564686 581890 599984 619067 639757
60239F39757K3016K5932K9439L3481L7550M0912M3382M5556M8151N1346N4973
60228A073495N8781O2235O4428O4842O3933O2401O0054N6119N0648M4710L8892
60217A700538L2466K4664J6185Q517K039m213j0837j6999k1508k4283k6084k7087
60205A653398k6511k3718j9195j4081r046l931J716Q062J4980K2239K9508L6366
60193A669787M2620M8552N4583O0572O5606O8640O9313O8063O5536O1956N6982
60182B332210N0125M1390L1476K1278J1128P87r757j9847k8838l6920m4702n1992
60170B296338n7530o0131n9795n7474n4079m9922m4860l8641l1182k2778j3960
60159A805986n117L671J2313K0550K8123L4790L9959M2743M2786M0725L7509L3426
$$ plain form
60239 639757 662773 688705 718144 751625 789175 830087 873469 919025 967176 1018522 1073495
60228 1073495 1132276 1194511 1258939 1323781 1387714 1450115 1510169 1566288 1616936 1661646 1700538
60217 1700538 1733004 1757668 1773853 1782370 1784409 1780196 1769359 1752360 1730852 1706569 1680485 1653398
60205 1653398 1626887 1603169 1583974 1569893 1560847 1556916 1558632 1566694 1581674 1603913 1633421 1669787
60193 1669787 1712407 1760959 1815542 1876114 1941720 2010360 2079673 2147736 2213272 2275228 2332210
60182 2332210 2382335 2423725 2455201 2476479 2487607 2488394 2478637 2458790 2429952 2393032 2348330 2296338
60170 2296338 2238808 2178677 2118882 2061408 2007329 1957407 1912547 1873906 1842724 1819946 1805986
60159 1805986 1800869 1804540 1816853 1837403 1865526 1900316 1940275 1983018 2025804 2066529 2104038 2137464
60147B137464K8316K2384J6221J0103L914k163p524j1829j5241j7654j8320j6695
60135B128976j3341r346m986N75Q173J7553K7608L7559M7665N8723P1007Q4012
60123B454178R7189J10512J24090J37559J50348J62260J73264J82909J90477J95634
60113C978420J98206J97430J92206J82328J68724J52227J32847J10578Q6101O0175
60103E459242L2945M504k4434n2978q0581j06443j29037j47169j61078j71498
60093D623473j77970j79292j75454j67949j57987j45564j30648j14136r6985p9235
60083C198253o0782m2523k5807j0982K694J5709K7489L7010M3755M7883M9805
60072C282504M9796M7775M3387L6441K7344J6995O087n268j7070k8730l9274m8365
$$ plain form
60147 2137464 2165780 2188164 2204385 2214488 2218402 2216239 2208715 2196886 2181645 2163991 2145671 2128976
60135 2128976 2115635 2106289 2101303 2101878 2110051 2127604 2155212 2192771 2240436 2299159 2370166 2454178
60123 2454178 2551367 2661879 2785969 2923528 3073876 3236136 3409400 3592309 3782786 3978420
60113 3978420 4176626 4374056 4566262 4748590 4917314 5069541 5202388 5312966 5399067 5459242
60103 5459242 5492187 5496691 5472257 5419279 5338698 5232255 5103218 4956049 4794971 4623473
60093 4623473 4445503 4266211 4090757 3922808 3764821 3619257 3488609 3374473 3277488 3198253
60083 3198253 3137471 3094948 3069141 3058159 3060853 3076562 3104051 3141061 3184816 3232699 3282504
60072 3282504 3332300 3380075 3423462 3459903 3487247 3504242 3510329 3505061 3487991 3459261 3419987 3371622
60060C371622n6622o4571p1635p6756p9864q1939q3541q4079q2812p9815p5438
60049B534550o9657o2659n5339m8274m0693l1564k1376j1634k670O693J7156K7778
60037B242311L7314M5580N2993N9615O5338P0159P3571P4349P1757O6446N9461
60026B918894N0849M0129K7582J4198M94j3642k8051m2018n4887o6274p5523q1760
60014B689991q4728q5102q3722q0825p6197o9710o1572n2309m2605l2958k3359
60003A996904j3518l434O453J5748K4636L3818M3893N4707O5302P4699Q2772R0013
59991B471993R6356J00760J02236J00759R6649Q9579P9048O5631N0808L5447J9237
59980C308503J842j6027l3129m8704o2557p4435q3816r0114r2879r1990q7891
$$ plain form
60060 3371622 3315000 3250429 3178794 3102038 3022174 2940235 2856694 2772615 2689803 2609988 2534550
60049 2534550 2464893 2402234 2346895 2298621 2257928 2226364 2204988 2193354 2190684 2197377 2214533 2242311
60037 2242311 2279625 2325205 2378198 2437813 2503151 2573310 2646881 2721230 2792987 2859433 2918894
60026 2918894 2969743 3009872 3037454 3051652 3052146 3038504 3010453 2968435 2913548 2847274 2771751 2689991
60014 2689991 2605263 2520161 2436439 2355614 2279417 2209707 2148135 2095826 2053221 2020263 1996904
60003 1996904 1983386 1979952 1986405 2002153 2026789 2060607 2104500 2159207 2224509 2299208 2381980 2471993
59991 2471993 2568349 2669109 2771345 2872104 2968753 3058332 3137380 3203011 3253819 3289266 3308503
59980 3308503 3310345 3294318 3261189 3212485 3149928 3075493 2991677 2901563 2808684 2716694 2628803
59969B628803q1461p3423o4050n3559m2482l1427k0698j0350m09R209J8738K8156
59957B307047L6956M4687N1567N8057O3894O8036O9734O9239O7187O3662N8296
59946B958362N1170M3125L5068K7314J9823J2718O326Q23l630o450o753m171Q21
59933C134546P635J6366K7504M1066N6471P3200R1030J09526J27771J44992J61157
59922C991264J76551J90735K02186K09042K10052K04778J92979J74121J47739
59913E699447J14345P5724L4163q493n0776r0908j26723j56453j79303j95077
59903E115946k03750k05631k01627j92913j80440j65099j48040j30381j12546
59894C575519r4349p5690n6911l8411k0390l087J3172K8350M2721N6241O8236
$$ plain form
59969 2628803 2547342 2473919 2409869 2356310 2313828 2282401 2261703 2251353 2250944 2260153 2278891 2307047
59957 2307047 2344003 2388690 2440257 2498314 2562208 2630244 2699978 2769217 2836404 2900066 2958362
59946 2958362 3009532 3052657 3087725 3115039 3134862 3147580 3153906 3154729 3151099 3144649 3137896 3133725 3134546
59933 3134546 3142181 3158547 3186051 3227117 3283588 3356788 3447818 3557344 3685115 3830107 3991264
59922 3991264 4167815 4358550 4560736 4769778 4979830 5184608 5377587 5551708 5699447
59913 5699447 5813792 5889516 5923679 5915186 5864410 5773502 5646779 5490326 5311023 5115946
59903 5115946 4912196 4706565 4504938 4312025 4131585 3966486 3818446 3688065 3575519
59894 3575519 3481170 3405480 3348569 3310158 3289768 3286681 3299853 3328203 3370924 3427165 3495401
59883C495401P8063Q5746R1422R4417R3409Q7648P7476O3647M6581K6510M002
59872D244322j9970m4176o7259q7990j05747j20497j32067j39795j43225j42896
59862C240700j39873j34630j26917j16747j05058r3224q2228p2435o3782n5981
59852B249825m8718m1950l5907l0821k6747k3649k1418j9728j8176j6694j5556
59841A950461j4841j4105j2816j0969r133q006q033r238j1172j3158j4797j6184
59829A808009j7630j9255k0943k2509k3747k4473k4654k4337k3434k1809j9663
59818A565555j7530j5690j3855j1664r185o648l944q03K737O430J0230J4136J7748
59805A537517K0544K2623K4666K6964K8850K9331K7986K5113K1297J7142J3133
$$ plain form
59883 3495401 3573464 3659210 3750632 3845049 3938458 4026106 4103582 4167229 4213810 4240320 4244322
59872 4244322 4224352 4180176 4112917 4024927 3919180 3798683 3666616 3526821 3383596 3240700
59862 3240700 3100827 2966197 2839280 2722533 2617475 2524251 2442023 2369588 2305806 2249825
59852 2249825 2201107 2159157 2123250 2092429 2065682 2042033 2020615 2000887 1982711 1966017 1950461
59841 1950461 1935620 1921515 1908699 1897730 1888597 1880591 1872558 1863320 1852148 1838990 1824193 1808009
59829 1808009 1790379 1771124 1750181 1727672 1703925 1679452 1654798 1630461 1607027 1585218 1565555
59818 1565555 1548025 1532335 1518480 1506816 1497631 1490983 1487039 1486236 1488973 1495403 1505633 1519769 1537517
59805 1537517 1558061 1580684 1605350 1632314 1661164 1690495 1718481 1743594 1764891 1782033 1795166
59794A795166R431N891K521j55j409r40J056M395R118J5134K1989K9267L7101
59781A928565M5954N5953O6745P8118R0429J04165J19299J35378J52041J68942
59771B945589J85138J98762K07313K07931J97597J73979J36839Q8753L4302k1305
59761D354898p3136j17095j50589j72775j83914j84685j76451j61749j43686j24627
59751B866191j05707q7528p0729n5765m2607l0954k0528j1021k023O767J5420
59740B461516K3954L2422M0758M8817N6711O4887P3701Q3154R3249J04310J16706
59729C200185J30367J44906J60172J76361J93685K12187K31935K53034K75194
59720D978026K97438L18570L37855L54968L69173L78895L82394L78896L68893
$$ plain form
59794 1795166 1804597 1810488 1813009 1812854 1811445 1810505 1811561 1815956 1825074 1840208 1862197 1891464 1928565
59781 1928565 1974519 2030472 2097217 2175335 2265764 2369929 2489228 2624606 2776647 2945589
59771 2945589 3130727 3329489 3536802 3744733 3942330 4116309 4253148 4341901 4376203 4354898
59761 4354898 4281762 4164667 4014078 3841303 3657389 3472704 3296253 3134504 2990818 2866191
59751 2866191 2760484 2672956 2602227 2546462 2503855 2472901 2452373 2441352 2439329 2446096 2461516
59740 2461516 2485470 2517892 2558650 2607467 2664178 2729065 2802766 2885920 2979169 3083479 3200185
59729 3200185 3330552 3475458 3635630 3811991 4005676 4217863 4449798 4702832 4978026
59720 4978026 5275464 5594034 5931889 6286857 6656030 7034925 7417319 7796215 8165108
59711H165108L53559L34155L12116K89287K67817K49614K35765K26209K20063
59702A0653693K16384K14546K13516K11016K04196J91471J73238J50540J23615
59693A2352215R2389N7899K2481j1474m2286o8629q9179j02919j09415j08617
59683A1992465j00686q6056o5332l8968p375K8636O7897J09519J53108J98124
59673A2251332K43366K87386L29138L67802M01965M29296M47049M52729M44152
59664A5654215M19178L75853L13329K32745J37125L0530q2326j95709l02949l97728
59654A6184263m75535n33863n71620n89003n87638n70248n40003n00647m57018
59645A1358688m14740l79104l54246l42815l45258l59134l79782m02194m22208
$$ plain form
59711 8165108 8518667 8852822 9164938 9454225 9722042 9971656 10207421 10433630 10653693
59702 10653693 10870077 11084623 11298139 11509155 11713351 11904822 12078060 12228600 12352215
59693 12352215 12444604 12502503 12524984 12513510 12471224 12402595 12313416 12210497 12101082 11992465
59683 11992465 11891779 11805723 11740391 11701423 11694048 11722684 11790581 11900100 12053208 12251332
59673 12251332 12494698 12782084 13111222 13479024 13880989 14310285 14757334 15210063 15654215
59664 15654215 16073393 16449246 16762575 16995320 17132445 17162975 17080649 16884940 16581991 16184263
59654 16184263 15708728 15174865 14603245 14014242 13426604 12856356 12316353 11815706 11358688
59645 11358688 10943948 10564844 10210598 9867783 9522525 9163391 8783609 8381415 7959207
59636G959207m36420m42198m38404m25624m05305l79129l49241l18151k87636
59627D477099k58221k30194k04553j82204j62712j44784j27854j12479r9231q7892
59617B866975p7852o8724o0374n2744m5829l9607l4021k9216k5623k3465k2311
59606B387209k1612k1570k2969k6028k9911l3594l6761l9575m1927m3430m3990
59595B025842m3960m3493m2128l9374l5715l2498l0551k9147k6835k3169j9080
59584A659892j5554j2593r797p238n193l361j038K045N443Q529J0828J2142J2830
59571A656935J3827J5776J8228K0192K1395K2456K3807K5242K6673K8644L1649
59560A904824L5436L9404M3344M7432N1870N6839O2571O8961P5440Q1698Q8300
$$ plain form
59636 7959207 7522787 7080589 6642185 6216561 5811256 5432127 5082886 4764735 4477099
59627 4477099 4218878 3988684 3784131 3601927 3439215 3294431 3166577 3054098 2954867 2866975
59617 2866975 2789123 2720399 2660025 2607281 2561452 2521845 2487824 2458608 2432985 2409520 2387209
59606 2387209 2365597 2344027 2321058 2295030 2265119 2231525 2194764 2155189 2113262 2069832 2025842
59595 2025842 1981882 1938389 1896261 1856887 1821172 1788674 1758123 1728976 1702141 1678972 1659892
59584 1659892 1644338 1631745 1621948 1614710 1609517 1606156 1605118 1607163 1612606 1621135 1631963 1644105 1656935
59571 1656935 1670762 1686538 1704766 1724958 1746353 1768809 1792616 1817858 1844531 1873175 1904824
59560 1904824 1940260 1979664 2023008 2070440 2122310 2179149 2241720 2310681 2386121 2467819 2556119
59549B556119R6005J04586J12897J20319J27496J35173J42481J46887J46025J39532
59539C827520J29017J16490J03042Q8957P4583O0488M6872L3410J9973P002n210
59528D502144j7242k9815m2429n3494o2019o8432p3310p5976p5193p0951o4524
59517C868759n6664m6616l3408j7394K71J9110L9404O0814Q1870J01180J18460
59506D135786J33864J46623J54795J56320J50128J36404J16141R0405N9872K5118
59496E305456j2608n1130q8000j21256j49481j71574j86936j95793j98876j96776
59486C933026j89854j78743j64545j48425j31303j13880r6626p9615o2686m5978
59476B721371l0023j5157j040J2889K6620L9588N1387O2249P2652Q2664R1729
$$ plain form
59549 2556119 2652124 2756710 2869607 2989926 3117422 3252595 3395076 3541963 3687988 3827520
59539 3827520 3956537 4073027 4176069 4265026 4339609 4400097 4446969 4480379 4500352 4507354 4502144
59528 4502144 4484902 4455087 4412658 4359164 4297145 4228713 4155403 4079427 4004234 3933283 3868759
59517 3868759 3812095 3765479 3732071 3714677 3714948 3734058 3773462 3834276 3916146 4017326 4135786
59506 4135786 4269650 4416273 4571068 4727388 4877516 5013920 5130061 5220466 5280338 5305456
59496 5305456 5292848 5241718 5153718 5032462 4882981 4711407 4524471 4328678 4129802 3933026
59486 3933026 3743172 3564429 3399884 3251459 3120156 3006276 2909650 2830035 2767349 2721371
59476 2721371 2691348 2676191 2675151 2688040 2714660 2754248 2805635 2867884 2940536 3023200 3114929
59465C114929R9004J03795J05762J04745J00458R2425Q0412O4852M6596K6190
59455C939168L715k0375m4580o7014q6671j03615j17953j29175j36769j40974
59445C095757j42456j41639j38772j34381j29002j22611j14927j06255r7500q9227
59435A878987q1332p3722o6748o0558n4651m8521m2426l6985l2277k7830k3396
59424A330541j9219j5499j2015q383m383LM491Q249J0039R153O231K909M46j203
59410A311360k772m378n204m414j997J392M831P095O979M444J112j093j742j637
59396A313976j130K64K647N350Q148J1768J6549K1567K5835K9625L3714L8072
59384A506385M2227M6410N1235N6589O1923O7435P3876Q1240Q8771R6428J05301
$$ plain form
59465 3114929 3213933 3317728 3423490 3528235 3628693 3721118 3801530 3866382 3912978 3939168
59455 3939168 3942883 3922508 3877928 3810914 3724243 3620628 3502675 3373500 3236731 3095757
59445 3095757 2953301 2811662 2672890 2538509 2409507 2286896 2171969 2065714 1968214 1878987
59435 1878987 1797655 1723933 1657185 1596627 1541976 1493455 1451029 1414044 1381767 1353937 1330541
59424 1330541 1311322 1295823 1283808 1275425 1271042 1271045 1275536 1283785 1293824 1302977 1309208 1312117 1312563 1311360
59410 1311360 1308588 1304210 1299006 1294592 1292595 1293987 1298818 1305913 1312892 1317336 1318448 1317355 1315613 1313976
59396 1313976 1312846 1313110 1315757 1321107 1329255 1341023 1357572 1379139 1404974 1434599 1468313 1506385
59384 1506385 1548612 1595022 1646257 1702846 1764769 1832204 1906080 1987320 2076091 2172519 2277820
59373B277820J16148J28444J41467J55596J71866J90600K10998K32010K53126
59364C878075K74302K95117L14037L28729L37464L40176L37813L30841L18917
59355F755471L02027K81225K58126K34098K10185J87119J64922J42676J19056
59346H654905R2943O3522L0149p552m9496r5070j43016j91422k38136k81241l18970
59335G516616l49353l70611l82125l84589l79122l66666l48373l26047l01740
59326D307990k77072k52990k29826k07481j85903j65603j47348j31260j16575
59317B593932j02549q9205p7096o6660n7926n0466m3405l5965k8201k0881j4455
59306B007123q609k903K639P896J2950J7642K1361K3720K5045K5845K6251K6416
$$ plain form
59373 2277820 2393968 2522412 2663879 2819475 2991341 3181941 3392939 3624949 3878075
59364 3878075 4152377 4447494 4761531 5090260 5427724 5767900 6105713 6436554 6755471
59355 6755471 7057498 7338723 7596849 7830947 8041132 8228251 8393173 8535849 8654905
59346 8654905 8747848 8811370 8841519 8833967 8784471 8689401 8546385 8354963 8116827 7835586 7516616
59335 7516616 7167263 6796652 6414527 6029938 5650816 5284150 4935777 4609730 4307990
59326 4307990 4030918 3777928 3548102 3340621 3154718 2989115 2841767 2710507 2593932
59317 2593932 2491383 2402178 2325082 2258422 2200496 2150030 2106625 2070660 2042459 2021578 2007123
59306 2007123 1998514 1995611 1998250 2006146 2019096 2036738 2058099 2081819 2106864 2132709 2158960 2185376
59294B185376K6888K8039K9525L0863L2175L3790L5507L6948L8267L9800M1211
59283B558389M1806M1584M1321M1602M2343M3236M4020M4399M4307M4221M4565
59272C031793M4822M3891M1310L7410L2281K5481J7071P949j344j1424k2873l4842
59260C211525m5537n3904o0164o4857o8111o9892p0276o9185o6343o1806n6288
59249B525162n0556m4717l8441l1852k5673k0306j5180r605m020K15K496L779
59237B291302N367P392R005R693R616Q915P478N573L950L060K757K987M200O659
59223B377954R936J3698J8566K5463L4328M4219N4689O6345P9858R5005J11015
59212B931076J27423J44030J60282J75175J87853J97844K04515K06536K02161
$$ plain form
59294 2185376 2212264 2240303 2269828 2300691 2332866 2366656 2402163 2439111 2477378 2517178 2558389
59283 2558389 2600195 2641779 2683100 2724702 2767045 2810281 2854301 2898700 2943007 2987228 3031793
59272 3031793 3076615 3120506 3161816 3199226 3231507 3256988 3274059 3282008 3280664 3269240 3246367 3211525
59260 3211525 3165988 3112084 3051920 2987063 2918952 2849060 2778784 2709599 2643256 2581450 2525162
59249 2525162 2474606 2429889 2391448 2359596 2333923 2313617 2298437 2288832 2284812 2285027 2287523 2291302
59237 2291302 2296669 2304061 2313066 2322759 2332375 2341290 2348768 2354341 2358291 2361351 2364108 2367095 2371295 2377954
59223 2377954 2387890 2401588 2420154 2445617 2479945 2524164 2578853 2645198 2725056 2820061 2931076
59212 2931076 3058499 3202529 3362811 3537986 3725839 3923683 4128198 4334734 4536895
59203D536895J90119J70145J42805J08996O9731K6350j9264o4780j07890j46802
59193D906305j80316k07445k27146k38721k42509k39936k32634k21583k07303
59184B908712j90604j72807j55115j38101j22006j07239r4301q3230p3483o4567
59174A707259n6631n0213m5360m1357l7447l3643l0436k7865k5331k2408j9423
59163A317145j6923j4920j2996j0875q504n830k943l28J560K927M417O230Q035
59150A266995R732J1701J4067J6326J8161K0022K2392K4901K6829K8279L0003
59139A489408L2119L3795L4455L4660L5243L6083L6303L5485L4098L2642L0920
59128A865211K8473K5386K2203J9177J6040J2702R723P731O523N286L786K826
$$ plain form
59203 4536895 4727014 4897159 5039964 5148960 5218691 5245041 5225777 5160997 5053107 4906305
59193 4906305 4725989 4518544 4291398 4052677 3810168 3570232 3337598 3116015 2908712
59184 2908712 2718108 2545301 2390186 2252085 2130079 2022840 1928539 1845309 1771826 1707259
59174 1707259 1650628 1600415 1555055 1513698 1476251 1442608 1412172 1384307 1358976 1336568 1317145
59163 1317145 1300222 1285302 1272306 1261431 1252927 1247097 1244154 1243826 1245386 1248313 1252730 1258960 1266995
59150 1266995 1276727 1288428 1302495 1318821 1336982 1357004 1379396 1404297 1431126 1459405 1489408
59139 1489408 1521527 1555322 1589777 1624437 1659680 1695763 1732066 1767551 1801649 1834291 1865211
59128 1865211 1893684 1919070 1941273 1960450 1976490 1989192 1998915 2006646 2013169 2018455 2022241 2025067
59116B025067L236M796O543P941R245J0796J2497J4054J5382J6591J7880J9518
59104B163546K1541K3525K5034K6492K9066L3334L8601M3881M9148N4966O1324
59093B570458O7570P3319P8589Q2976Q5467Q5416Q3061P8789P2397O3446N1890
59082C393378L7977K1982M435j3658l1321m8033o3423p6898q7976r6678j03173
59071B936612j07326j09153j09362j08795j07524j05040j01271r6761r1918q6787
59061A912675q1555p6645p2131o7720o3431n9673n6396n2812m8425m3862m0207
59050A249818l7739l5734l3355l0467k7648k5533k4056k2371j9821j6858j4522
59039I61714j3100j1874j0273q536o952n302l576k510k737l822m856n588o324
$$ plain form
59116 2025067 2028303 2033099 2039642 2047583 2056828 2067624 2080121 2094175 2109557 2126148 2144028 2163546
59104 2163546 2185087 2208612 2233646 2260138 2289204 2322538 2361139 2405020 2454168 2509134 2570458
59093 2570458 2638028 2711347 2789936 2872912 2958379 3043795 3126856 3205645 3278042 3341488 3393378
59082 3393378 3431355 3453337 3457772 3444114 3412793 3364760 3301337 3224439 3136463 3039785 2936612
59071 2936612 2829286 2720133 2610771 2501976 2394452 2289412 2188141 2091380 1999462 1912675
59061 1912675 1831120 1754475 1682344 1614624 1551193 1491520 1435124 1382312 1333887 1290025 1249818
59050 1249818 1212079 1176345 1142990 1112523 1084875 1059342 1035286 1012915 993094 976236 961714
59039 961714 948614 936740 926467 917931 910979 905677 902101 899591 896854 893032 888176 882588 876264
59026H76264p040p348p181o768o125n145m054l202k514j812j361j386j267j62
59012H20899J596K762K928L029L816M859N535O070O859P512P397O684O058N747
58998H91751N508N261M965M122K202m38k691l811l893l388k695k243k247k282
58984H90121j627k05J275K220K709L011L128L107L253L727M304M841N521O293
58970I31678O617O235N782N967O526O702O551O885P958R098R800J0342J0979J1265
58956A042385J0784R919R327Q962Q347P571P348Q091R390J0529J1159J1442J1846
58943A167100J2775J4214J5769J7182J8606K0160K1584K2723K3980K5775K7836
58932A387704K9630L1321L3531L6299L9077M1826M5131M9040N2677N5522N8183
$$ plain form
59026 876264 869224 861876 854695 847927 841802 836657 832603 829401 826887 825075 823714 822328 821061 820899
59012 820899 822495 825257 828185 831214 835030 839889 845424 851494 858353 865865 873262 879946 886004 891751
58998 891751 897259 902520 907485 911607 913809 913371 910680 906869 902976 899588 896893 894650 892403 890121
58984 890121 888494 888289 889564 891784 894493 897504 900632 903739 906992 910719 915023 919864 925385 931678
58970 931678 938295 944530 950312 956279 962805 969507 976058 982943 990901 999999 1009799 1020141 1031120 1042385
58956 1042385 1053169 1063088 1072415 1081377 1089724 1097295 1104643 1112734 1122124 1132653 1143812 1155254 1167100
58943 1167100 1179875 1194089 1209858 1227040 1245646 1265806 1287390 1310113 1334093 1359868 1387704
58932 1387704 1417334 1448655 1482186 1518485 1557562 1599388 1644519 1693559 1746236 1801758 1859941
58921A859941O1417O5082O8794P2975P8394Q4990R2069R9421J07504J16618J26575
58910B833780J37240J48649J60601J72721J85045J98077K12063K26650K41289
58901D516115K55607K69283K82024K93742L04295L12874L17965L18090L12340
58892G182335L00115K80830K54187K20419J80007J33406Q1399K5702l1049q6062
58882H541289j37193j83125k22998k56015k81521k99361l10004l14245l13001
58873F223826l07342k98372k86812k72968k57319k40961k25028k09996j95764
58864C929264j82306j69746j58068j47211j37404j28908j21388j14024j06296
58855B663913r8438r1042q4508p8749p3199o7208o0766n4657m9459m4675l9465
$$ plain form
58921 1859941 1921358 1986440 2055234 2128209 2206603 2291593 2383662 2483083 2590587 2707205 2833780
58910 2833780 2971020 3119669 3280270 3452991 3638036 3836113 4048176 4274826 4516115
58901 4516115 4771722 5041005 5323029 5616771 5921066 6233940 6551905 6869995 7182335
58892 7182335 7482450 7763280 8017467 8237886 8417893 8551299 8632698 8658400 8627351 8541289
58882 8541289 8404096 8220971 7997973 7741958 7460437 7161076 6851072 6536827 6223826
58873 6223826 5916484 5618112 5331300 5058332 4801013 4560052 4335024 4125028 3929264
58864 3929264 3746958 3577212 3419144 3271933 3134529 3005621 2884233 2770209 2663913
58855 2663913 2565475 2474433 2389925 2311176 2237977 2170769 2110003 2055346 2005887 1961212 1921747
58844A921747l3991k9192k5296k1393j6800j1995p805m384j401J250L610N978
58832A780328Q571J1151J3448J5694J8264K1157K4244K7774L2015L6687M1319
58821B030652M5996N1115N6502O1455O5831P0467P6213Q2975R0179R7780J06367
58810B835532J16260J27060J38287J50146J63279J77826J93219K08956K25147
58801D335712K41907K58606K74188K88087L00159L09770L15553L16216L11061
58792F951259K99512K80740K54120K19673J77828J29298P5615J9310l7006r1579
58782H278770j43191j90345k31354k65059k90978l08999l19477l23508l22469
58773E883390l17313l08668k97398k84449k70237k54865k38945k23500k08928
$$ plain form
58844 1921747 1887756 1858564 1833268 1811875 1795075 1783080 1775275 1770891 1769490 1770740 1774350 1780328
58832 1780328 1788899 1800050 1813498 1829192 1847456 1868613 1892857 1920631 1952646 1989333 2030652
58821 2030652 2076648 2127763 2184265 2245720 2311551 2382018 2458231 2541206 2631385 2729165 2835532
58810 2835532 2951792 3078852 3217139 3367285 3530564 3708390 3901609 4110565 4335712
58801 4335712 4577619 4836225 5110413 5398500 5698659 6008429 6323982 6640198 6951259
58792 6951259 7250771 7531511 7785631 8005304 8183132 8312430 8388045 8407355 8370349 8278770
58782 8278770 8135579 7945234 7713880 7448821 7157843 6848844 6529367 6205859 5883390
58773 5883390 5566077 5257409 4960011 4675562 4405325 4150460 3911515 3688015 3479087
58764C479087j94742j80555j66733j53784j41701j30252j19508j09634j00557
58755B181621r2215q4723p7939p1278o4517n8326n3363m9123m4453l9117l4111
58744A512456l0182k6910k3528k0105j7395j5872j5329j5261j5242j5076j4894
58733A302662j5052j5710j6608j7421j8098j8676j9024j9127j9313j9854k0506
58722A103273k0941k1377k2241k3259k3600k2967k1946k1085k0337j9717j9702
58711H66101k0448k1079k0515j8725j6573j4674j3030j1627j0633r910q953p591
58699F92343o250n353m811m365m101m341n188o381p569q579r517j0538j1560j2235
58685E91555j2341j2023j1466j0530r011p146n449m117k966j920j077k41J148
$$ plain form
58764 3479087 3284345 3103790 2937057 2783273 2641572 2511320 2391812 2282178 2181621
58755 2181621 2089406 2004683 1926744 1855466 1790949 1732623 1679260 1630137 1585684 1546567 1512456
58744 1512456 1482274 1455364 1431836 1411731 1394336 1378464 1363135 1347874 1332632 1317556 1302662
58733 1302662 1287610 1271900 1255292 1237871 1219773 1201097 1182073 1162946 1143633 1123779 1103273
58722 1103273 1082332 1060955 1038714 1015455 991855 968888 946942 925857 905520 885803 866101
58711 866101 845653 824574 804059 785334 768761 754087 741057 729430 718797 708887 699934 692343
58699 692343 686093 680740 675929 671564 667463 663122 657934 651553 643984 635405 625888 615350 603790 591555
58685 591555 579214 567191 555725 545195 536184 529038 523589 519472 516506 514586 513509 513268 514416
58672E14416L247N280O194N810N029M842N301N630N263M459L710K819J136j323
58658E71813l588m835n320n735o186o292o015n755n722n778n797n631m934l563
58644D96662k118j429j483j376l62J410L236M446M765M537M537N146N921O413
58630E30305O994Q143R325R608R225R420J0673J2213J3482J4883J6695J8388J9626
58617F88980K1009K3117K5642K8097L0690L3766L7121M0544M4390M8938N3713
58606A076007N8131O2362O6891P1756P6761Q1904Q6898R0846R2967R3226R1592
58595A949341Q7349P9870O9516N6997M2374K5566P412j0683k7806m3490n7106
58584B179340o8157p6837q3348q7124q7651q5653q2404p8159p2444o5659n9075
$$ plain form
58672 514416 517663 522943 529137 534947 539976 544818 550119 555749 561012 565471 569181 572000 573136 571813
58658 571813 568225 563390 558070 552335 546149 539857 533842 528087 522365 516587 510790 505159 500225 496662
58644 496662 494544 493115 491632 490256 489894 491304 494540 498986 503751 508288 512825 517971 523892 530305
58630 530305 537299 545442 554767 564375 573600 583020 593693 605906 619388 634271 650966 669354 688980
58617 688980 709989 733106 758748 786845 817535 851301 888422 928966 973356 1022294 1076007
58606 1076007 1134138 1196500 1263391 1335147 1411908 1493812 1580710 1671556 1764523 1857749 1949341
58595 1949341 2036690 2116560 2186076 2243073 2285447 2311013 2318425 2307742 2279936 2236446 2179340
58584 2179340 2111183 2034346 1950998 1863874 1776223 1690570 1608166 1530007 1457563 1391904 1332829
58573A332829n3202m7423m1403l5737l0813k6143k1309j6793j3292j0860r140
58562A026714p929p170o826o999p823r121j0579j2249j4371j6713j8699k0234
58550H88001k1681k3001k3624k3303k2408k1251j9797j8212j6930j5888j4454
58539F67452j2450j0626r684r436r271q929q421p699o920o548o817p354p641p475
58525E48181o801n586m225l545l916m653m762m037l091k526k431k460k132j164
58511D96852K26J454K188K680L356M240M922M955M299L467L211L689M094L457
58497E43090J856M04n6K16M00N2o53j210j154m76K53M99M79Q43J605K016J638
58480E49802R10L77r2r00j966k898l635m388n121n422n048m313l908m278n121
$$ plain form
58573 1332829 1279627 1232204 1190801 1155064 1124251 1098108 1076799 1060006 1046714 1035854 1026714
58562 1026714 1018785 1011615 1004789 997790 989967 980846 970267 958018 943647 926934 908235 888001
58550 888001 866320 843319 819695 796392 773984 752733 732936 714724 697794 681906 667452
58539 667452 655002 644376 634692 625256 615985 607056 598635 590936 584016 577468 570651 563297 555656 548181
58525 548181 541380 535794 531569 528024 524108 519455 514693 510656 507565 505039 502608 500148 498016 496852
58511 496852 497078 498532 500720 503400 506756 510996 515918 520873 525172 528639 531850 535539 539633 543090
58497 543090 544946 545350 545294 545510 545910 545962 545309 544099 542945 542469 542722 543221 543700 544543 546148 548164 549802
58480 549802 550712 551089 550997 550097 548131 545233 541598 537210 532089 526667 521619 517306 513398 509120 503999
58465E03999n611n254m421l867l841l950l766l248k681k467k774l150k814j735
58451D54420r10r48r15N68L286N576O389O179N734N197M600M268M223L876K822
58436E04365J353n5j151j710j670j633k293l210l115j797n70l98o96o41n78j112
58420D85089j756j586o77J99Q23J485K071K119J684J267J123J279J969L360M947
58405E03396N940O119N847N458N148N129N309N181M550M006M034M121L540K691
58391E70469K698L872N391O480P055P169O670N659M705M296M420M819N236N431
58377F44370N226M652L825K805J725Q53K51l34r49j159o98K4M81P74J229J662
58361F64737J704J555J690K031K204K487L588N390O704O611N514M582M497N014
$$ plain form
58465 503999 498388 493134 488713 484846 481005 477055 473289 470041 467360 464893 462119 458969 456155 454420
58451 454420 453510 452562 451647 452215 455501 461077 467466 473645 479379 484576 489176 493444 497667 501543 504365
58436 504365 505718 505663 504512 502802 501132 499499 497206 493996 490881 489084 488514 488116 487420 486779 486201 485089
58420 485089 483333 481747 481070 481269 482092 483577 485648 487767 489451 490718 491841 493120 495089 498449 503396
58405 503396 509336 515455 521302 526760 531908 537037 542346 547527 552077 556083 560117 564238 567778 570469
58391 570469 573167 577039 582430 588910 595965 603134 609804 615463 620168 624464 628884 633703 638939 644370
58377 644370 649596 654248 658073 660878 662603 663456 663707 663373 662424 661265 660567 660591 661072 661846 663075 664737
58361 664737 666441 667996 669686 671717 673921 676408 679996 685386 692090 698701 704215 708797 713294 718308
58347G18308N417N231M635M247M412M824N048N134N420N911O324O624O968P221
58333G95724P040O497O177O496P306Q233R156J0157J1199J2041J2372J2130J1660
58320I16188J1489J1869J2605J3368J3909J4027J3674J3190J3014J3040J2692
58309A059065J1835J1148J1238J1865J2435J2905J3576J4337J4643J4271J3668
58298A200986J3508J4101J5197J6292J7158J8059J9238K0368K0907K0923K1088
58287A397825K1786K2819K3938K5183K6581K7989K9275L0196L0280K9564K9176
58276A694612L0245L2380L4284L5749L7661M0030M1636M2011M2156M2727M3024
58265B116515M2593M2214M2386M2339M1656M1472M2768M4787M6416M8026N0513
$$ plain form
58347 718308 723725 728956 733591 737838 742250 747074 752122 757256 762676 768587 774911 781535 788503 795724
58333 795724 802764 809261 815438 821934 829240 837473 846629 856786 867985 880026 892398 904528 916188
58320 916188 927677 939546 952151 965519 979428 993455 1007129 1020319 1033333 1046373 1059065
58309 1059065 1070900 1082048 1093286 1105151 1117586 1130491 1144067 1158404 1173047 1187318 1200986
58298 1200986 1214494 1228595 1243792 1260084 1277242 1295301 1314539 1334907 1355814 1376737 1397825
58287 1397825 1419611 1442430 1466368 1491551 1518132 1546121 1575396 1605592 1635872 1665436 1694612
58276 1694612 1724857 1757237 1791521 1827270 1864931 1904961 1946597 1988608 2030764 2073491 2116515
58265 2116515 2159108 2201322 2243708 2286047 2327703 2369175 2411943 2456730 2503146 2551172 2601685
58254B601685N3723N7155O1183O6061P0723P4188P7293Q1537Q6949R2593R8287
58243C421377J04378J10525J16235J21945J28238J34779J41314J48815J58179
58234D585785J68777J79683J91200K03736K16448K28864K42620K59609K79413
58225F556135L00477L22756L47265L74130M03196M35539M72417N13698N59183
58216A0284796O10187O68112P33228Q06799Q92356R92658J107938J239675J393462
58207A8729211J575424J789566K042950K350495K730175L196115L759696M431983
58199D0605615N218601O117201P128825Q270960R576560J1089225J2867858J4983718
58191A15858563J7490676K0384794K3560547K6719235K9230687L0116868K8362718
$$ plain form
58254 2601685 2655408 2712563 2773746 2839807 2910530 2984718 3062011 3143548 3230497 3323090 3421377
58243 3421377 3525755 3636280 3752515 3874460 4002698 4137477 4278791 4427606 4585785
58234 4585785 4754562 4934245 5125445 5329181 5545629 5774493 6017113 6276722 6556135
58225 6556135 6856612 7179368 7526633 7900763 8303959 8739498 9211915 9725613 10284796
58216 10284796 10894983 11563095 12296323 13103122 13995478 14988136 16096074 17335749 18729211
58207 18729211 20304635 22094201 24137151 26487646 29217821 32413936 36173632 40605615
58199 40605615 45824216 51941417 59070242 67341202 76917762 88006987 100874845 115858563
58191 115858563 133349239 153734033 177294580 204013815 233244502 263361370 291724088
58184B91724088K3472456J5846206O623157k873898j1609058j8923983k4397792
58177B79861176k7776857k9044993k8477122k6561348k3842866k0797743j7775821
58170A05584426j4993153j2552628j0479005q752260p329870o161916n202458
58163D0113136m413864l764616l227636k781403k409610k098688j837270j617231
58155A7962818j432268j275306j139385j020496r16981q26449p45727o73393o09631
58146I323182n53599n03354m58260m19049l85432l55722l29062l05894k86025
58137E726785k68153k51517k36380k22616k09453j96815j85312j74689j63790
58128C818060j52400j41753j32802j25150j18002j11209j04989r9404r4425q9973
$$ plain form
58184 291724088 315196544 331042750 337665907 334792009 323182951 304258968 279861176
58177 279861176 252084319 223039326 194562204 168000856 144157990 123360247 105584426
58170 105584426 90591273 78038645 67559640 58807380 51477510 45315594 40113136
58163 40113136 35699272 31934656 28707020 25925617 23516007 21417319 19580049 17962818
58155 17962818 16530550 15255244 14115859 13095363 12178382 11351933 10606206 9932813 9323182
58146 9323182 8769583 8266229 7807969 7388920 7003488 6647766 6318704 6012810 5726785
58137 5726785 5458632 5207115 4970735 4748119 4538666 4341851 4156539 3981850 3818060
58128 3818060 3665660 3523907 3391105 3265955 3147953 3036744 2931755 2832351 2737926 2647953
58118B647953q5836q1967p8598p5675p2639o9248o6019o3255o0449n7369n4742
58107A882156n2991n1280m8925m6742m5605m4642m2494l9555l7175l5289l2773
58096A404685k9755k7608k6729k6270k6050k6769k8013k8032k6172k3935k2859
58085A112493k2740k2694k2622k2648k2314k1322k0406k0412k1053k1345k0877
58074H74060j9977j8974j7969j7122j6593j6169j5316j3729j1705r905q766q160
58062F99675p725p428p377p267o636n820n811o786p631p490o961o905o980o349
58048F02509n179m257l629k827k090k064k510k546k075j753j719j543j334j618
58034E67365k090j799p80j95o50j498k140k808l726m594n306o210p301q083q508
$$ plain form
58118 2647953 2562117 2480150 2401552 2325877 2253238 2183990 2117971 2054716 1994267 1936898 1882156
58107 1882156 1829165 1777885 1728960 1682218 1636613 1591971 1549477 1509922 1472747 1437458 1404685
58096 1404685 1374930 1347322 1320593 1294323 1268273 1241504 1213491 1185459 1159287 1135352 1112493
58085 1112493 1089753 1067059 1044437 1021789 999475 978153 957747 937335 916282 894937 874060
58074 874060 854083 835109 817140 800018 783425 767256 751940 738211 726506 716601 707835 699675
58062 699675 691950 684522 677145 669878 663242 657422 651611 644825 637194 629704 622743 615838 608858 602509
58048 602509 597330 593073 589444 586617 584527 582463 579953 577407 575332 573579 571860 570317 568983 567365
58034 567365 565275 563476 562696 562501 561851 560353 558213 555405 551679 547085 541779 535569 528268 520185 511677
58019E11677r016r304q398o310m495l976m114l984l796m036m245l761l010k846
58005D40386l062k652j358oO87R44J474K635M084N058N139M865N218O372P403
57990D77187P455O739O030N675N486N185M548L445K065Q09k10j196k137k829l513
57975E14739m670n957o184m906l199k215j669n96J050K477L280L603L263J755
57961E00771p30l129m626n480o446p700q619q547p638o772o573o687o320n311
57947D16193m157l085j855o30j75p68j593j756j371j137j337j842k580l413l840
57932C86654l481k587j667q98k95k7n0R8O86J267J351J082Q20M98j4m45o94j311
57914C80987k610l859m198l923l849l803k941j374k52j43m08l50kM30R22J176
$$ plain form
58019 511677 502661 493357 484959 478649 474154 470178 466064 462080 458284 454248 450003 446242 443232 440386
58005 440386 437324 434672 433314 433308 433995 434939 436413 439048 443132 448190 453329 458194 463412 469784 477187
57990 477187 484642 491381 497411 503086 508572 513757 518305 521750 523815 524624 524414 523218 521081 518252 514739
57975 514739 510069 504112 497928 493022 489823 487608 485939 485343 486393 488870 492150 495753 499016 500771
57961 500771 500041 496912 492286 486806 480360 472660 464041 455494 447856 441084 434511 427824 421504 416193
57947 416193 412036 408951 407096 406466 406291 405523 403930 402174 400803 399666 398329 396487 393907 390494 386654
57932 386654 383173 380586 378919 378021 377726 377699 377649 377747 378433 379700 381051 382133 382953 383451 383437 382992 382298 380987
57914 380987 378377 374518 370320 366397 362548 358745 355804 354430 354178 354035 353627 353277 353275 353705 354627 355803
57898C55803O44o40j967k904l643m236m394m289m624n480n955n505m823m724m883
57883B98380m490l532k661k151j782j472j246q16P6J010J340J264J711L062M583
57868B93276N393N455N282N072M617L894L274K987K719K022R74R2m61j212k540
57853C30844l891m303l679k927k757k868k662k242k174k518k640k035r62j23R5
57838B95158j10l87p98j702l060m107m170l623l503m133m754m757m569m832n229
57823B45424m934l939l139l012k952k191r33j28m21j572k772l322l054k345j768
57808B08942j639j927k458k991l087k228l39J893L440L847L687M052N457P333
57794B23982Q656R106R363J0109J1049J1271J0475R280Q256P099N154K346p54
$$ plain form
57898 355803 356447 355807 353840 350936 347293 343057 338663 334374 329750 324270 318315 312810 307987 303263 298380
57883 298380 293890 290358 287697 285546 283764 282292 281046 280230 280306 281316 282656 283920 285631 288693 293276
57868 293276 298669 304124 309406 314478 319095 322989 326263 329250 331969 333991 334965 335057 334596 333384 330844
57853 330844 326953 322650 318971 316044 313287 310419 307757 305515 303341 300823 298183 296148 295186 295063 295158
57838 295158 295048 294661 293863 292161 289101 284994 280824 277201 273698 269565 264811 260054 255485 250653 245424
57823 245424 240490 236551 233412 230400 227448 225257 224324 224196 223775 222203 219431 216109 213055 210710 208942
57808 208942 207303 205376 202918 199927 196840 194612 194273 196166 199606 203453 207140 211192 216649 223982
57794 223982 232638 241744 251107 261216 272265 283536 294011 303291 311547 318646 323800 326146 325392
57781C25392l586n866p428q301q937r753j0418j0127q850p696p596q077p931o803
57767B14023n440m482l789k994k121j337o36l3L12L99M97P14R08J164J873K967
57751B02025L582L088K027J446J584J861J987K266K866L468L816L976L956L560
57737B41508K843K190J757J312Q27P20J146J618J696J687K102K738K873K252J386
57722B68655Q43O78O66P55J040J465J779J800J657J709K160K788L189L210L088
57707B95482L167L598M295N050N659O098O565P245Q108R009R844J0481J0746J0774
57693C96121J1142J2223J3678J5036J6631J9249K2842K6395K9322L2323L6460
57682F31422M1974M8383N5246O2368O9740P7838Q7655R9886J14308J30232J47254
$$ plain form
57781 325392 321806 315940 308512 300211 291274 281521 271103 260976 252126 244430 236834 228757 220826 214023
57767 214023 208583 204101 200312 197318 195197 193860 193224 193191 193503 193902 194399 195113 196021 197185 199058 202025
57751 202025 205607 208695 210722 212168 213752 215613 217600 219866 222732 226200 230016 233992 237948 241508
57737 241508 244351 246541 248298 249610 250437 251157 252303 253921 255617 257304 259406 262144 265017 267269 268655
57722 268655 269498 270176 270842 271597 272637 274102 275881 277681 279338 281047 283207 285995 289184 292394 295482
57707 295482 298649 302247 306542 311592 317251 323349 329914 337159 345267 354276 364120 374601 385347 396121
57693 396121 407263 419486 433164 448200 464831 484080 506922 533317 562639 594962 631422
57682 631422 673396 721779 777025 839393 909133 986971 1074626 1174512 1288820 1419052 1566306
57671A566306J64998J82124J95633K00931J93026J69153J31285Q5525L8200p176
57661B920005m8951q4874j12332j30626j41333j46164j45813j41076j33699j25307
57651A709830j16345j06780r7121q8112p9964p2487o5502n8714n1639m4277l7452
57640H91437l1996k7844k4325k0961j7605j4206j0921q154o021m056j811O05K932
57627G27074N297P844J0257J2242J4225J6928K0402K4094K7728L1537L5676M0006
57615I73310M4514M9352N4395N9200O3517O7431P0816P3056P3477P1810O8053
57604A668931O2058N3467M1972K7737J1664m881k0817l5800m9751o2106p1916
57593A620558p8568q2106q2925q1561p8755p5223p1252o6760o1844n6930n2377
$$ plain form
57671 1566306 1731304 1913428 2109061 2309992 2503018 2672171 2803456 2888981 2927181 2920005
57661 2920005 2871054 2786180 2673848 2543222 2401889 2255725 2109912 1968836 1835137 1709830
57651 1709830 1593485 1486705 1389584 1301472 1221508 1149021 1083519 1024805 973166 928889 891437
57640 891437 859441 831597 807272 786311 768706 754500 743579 735425 729404 725348 723537 724142 727074
57627 727074 732371 740215 750472 762714 776939 793867 814269 838363 866091 897628 933304 973310
57615 973310 1017824 1067176 1121571 1180771 1244288 1311719 1382535 1455591 1529068 1600878 1668931
57604 1668931 1730989 1784456 1826428 1854165 1865829 1860948 1840131 1804331 1754580 1692474 1620558
57593 1620558 1541990 1459884 1376959 1295398 1216643 1141420 1070168 1003408 941564 884634 832257
57582H32257m8217m4350m0695l7104l3520l0221k7567k5409k3194k0764j8613
57571D82603j7117j5925j4433j2575j0759r318q315p689p263o738o034n457n209
57558C55771m902m014k763k021k248k863k908k052p48L93J146J651K177K908L843
57543C43370M769N403N638N682N940O737Q096R750J1333J2584J3462J4108J4731
57530D61603J5497J6577J8202K0465K3130K5769K8281L1059L4490L8387M2199
57519G55659M5636M8843N1938N4758N7147N9134O0563O0751N8789N4192M7179
57508A354589L8401K8481J7621N574p841k1962l5154m5732n3047n7606o0304o1714
57496A101306o1984o1065n8900n5639n1724m7657m3594l9340l4800l0248k6090
$$ plain form
57582 832257 784040 739690 698995 661891 628371 598150 570583 545174 521980 501216 482603
57571 482603 465486 449561 435128 422553 411794 402476 394161 386472 379209 372471 366437 360980 355771
57558 355771 350869 346855 344092 342071 339823 336960 334052 332000 331252 331645 332791 334442 336619 339527 343370
57543 343370 348139 353542 359180 364862 370802 377539 385635 395385 406718 419302 432764 446872 461603
57530 461603 477100 493677 511879 532344 555474 581243 609524 640583 675073 713460 755659
57519 755659 801295 850138 902076 956834 1013981 1073115 1133678 1194429 1253218 1307410 1354589
57508 1354589 1392990 1421471 1439092 1444666 1436825 1414863 1379709 1333977 1280930 1223324 1163020 1101306
57496 1101306 1039322 978257 919357 863718 811994 764337 720743 681403 646603 616355 590265
57485E90265k2504j9473j6985j4969j3141j1126q804o411m239k392q29N64K028
57472D71984L921O389R143J1665J3623J5023J6109J7355J9392K2555K6435L0213
57460F63807L3546L6847M0490M4208M7465N0101N2143N3311N3293N2307N0720
57449A178238M8051M3004L4789K3925J1590j335j4237k6424l7345m6846n4776
57438A158634o0571o3720o4508o3736o1905n9135n5767n2338m8923m5130m0915
57427E41986l6853l3334l0060k6666k3443k0955j9291j8078j7024j5990j4690
57416B85602j2931j1077r841r475r494r309q790q145p485o728n786m707l712l093
57402A75029k944l008k921k667k511k563k600k435k138j846j582j430j543j797
$$ plain form
57485 590265 567761 548288 531303 516334 503193 492067 483263 476852 472613 470221 469392 469956 471984
57472 471984 475905 482294 491437 503102 516725 531748 547857 565212 584604 607159 633594 663807
57460 663807 697353 734200 774690 818898 866363 916464 968607 1021918 1075211 1127518 1178238
57449 1178238 1226289 1269293 1304082 1328007 1339597 1338262 1324025 1297601 1260256 1213410 1158634
57438 1158634 1098063 1034343 969835 906099 844194 785059 729292 676954 628031 582901 541986
57427 541986 505133 471799 441739 415073 391630 370675 351384 333306 316282 300292 285602
57416 285602 272671 261594 251753 242278 232784 223475 214685 206540 199055 192327 186541 181834 178122 175029
57402 175029 172085 169077 166156 163489 160978 158415 155815 153380 151242 149396 147814 146384 144841 143044
57388A43044j718j037j20M33M37J54p5L6O59J507J790J069J4k58L36P57L30l54
57370A47004m44j02j69q33j324r86j18M12J31o67j373j709j849j930j755j152
57354A33136n08m15p99r09l60L05M40J72K3M1j04l77m44l01k59l17j00M36Q48
57335A30508Q70P80R04J163J345J492J720J950J985J707J133M63J26M26J102J564
57319A49238J660J805K253K669K709K604K795L211L356L027K612K666L342M267
57305A88214M953N283N570O068O569O738O665O715O985P292P661Q258Q883R105
57291B84959R029R328J0257J1257J1831J2172J2580J2801J2518J1958J1466J0886
57279D21042R899Q578P081N221K947P79r29k772n474q545j0753j1781j2451j3259
$$ plain form
57388 143044 141326 140289 140169 140602 141039 141193 141118 141154 141813 143320 145110 146179 146193 145935 146271 147028 147358 147004
57370 147004 146560 146458 146289 145456 144132 143146 143028 143440 143571 142904 141531 139822 137973 136043 134288 133136
57354 133136 132628 132213 131414 130505 130145 130450 130890 131062 131085 131126 131022 130645 130201 129900 129641 129324 129224 129660 130508
57335 130508 131378 132158 133062 134225 135570 137062 138782 140732 142717 144424 145557 146020 146146 146572 147674 149238
57319 149238 150898 152703 154956 157625 160334 162938 165733 168944 172300 175327 177939 180605 183947 188214
57305 188214 193167 198450 204020 210088 216657 223395 230060 236775 243760 251052 258713 266971 275854 284959
57291 284959 293988 303316 313573 324830 336661 348833 361413 374214 386732 398690 410156 421042
57279 421042 430941 439519 446600 451821 454768 455547 454618 451846 446372 437827 427074 415293 402842 389583
57265C89583j3692j3332j2720j2561j2736j2568j1742j0457q970p419n963m808
57253B62615m138l954l926l501k549j734j734k168j937p41L88L95n08j197q83
57238B34428L09J688K542K630K358K322K553K563K186J898K126K737L440M259
57224B68039N184N835N902N615N422N431N531N731N999O120O063O163O536O698
57210C50269O221N470N122N235N410N612O132O896P492P854Q240Q546Q379P904
57196D44782P897Q657R525R812R684R762J0231J0832J1311J1468J1116J0468J0300
57183E75845J1174J2639J3637J3709J3280J2839J2417J1991J1825J2103J2543
57172G14002J2699J2454J1986J1481J1182J1434J2251J3057J3366J3522J4175
$$ plain form
57265 389583 375891 362559 349839 337278 324542 311974 300232 289775 280805 273386 267423 262615
57253 262615 258477 254523 250597 247096 244547 242813 241079 238911 236974 236233 236621 237016 236508 235311 234428
57238 234428 234737 236425 238967 241597 243955 246277 248830 251393 253579 255477 257603 260340 263780 268039
57224 268039 273223 279058 284960 290575 295997 301428 306959 312690 318689 324809 330872 337035 343571 350269
57210 350269 356490 361960 367082 372317 377727 383339 389471 396367 403859 411713 419953 428499 436878 444782
57196 444782 452679 461336 470861 480673 490357 500119 510350 521182 532493 543961 555077 565545 575845
57183 575845 587019 599658 613295 627004 640284 653123 665540 677531 689356 701459 714002
57172 714002 726701 739155 751141 762622 773804 785238 797489 810546 823912 837434 851609
57161H51609J5050J5070J3976J3003J3390J4852J6298J7438J8730K0017K0465
57150A029898K0004J9692K0245K1124K1647K2094K2970K3890K4221K4433K5788
57139A276006K8787L2746L6817M0632M3918M6422M8574N1446N5699O1038O6941
57128A789026P3271P9789Q5701R0475R4765R9798J05767J11504J15843J18933
57118B764872J21932J25760J30480J35816J41911J49488J59363J71999J87447
57109D089068K05678K26874K51550K80455L14435L54370M01353M57035N23807
57100G104625O04606P02531Q20514R60938J125021J312259J520512J746942J989173
57091A7887121K245681K515036K794380L077845L355559L613465L834555M000994
$$ plain form
57161 851609 866659 881729 895705 908708 922098 936950 953248 970686 989416 1009433 1029898
57150 1029898 1049902 1069594 1089839 1110963 1132610 1154704 1177674 1201564 1225785 1250218 1276006
57139 1276006 1304793 1337539 1374356 1414988 1458906 1505328 1553902 1605348 1661047 1722085 1789026
57128 1789026 1862297 1942086 2027787 2118262 2213027 2312825 2418592 2530096 2645939 2764872
57118 2764872 2886804 3012564 3143044 3278860 3420771 3570259 3729622 3901621 4089068
57109 4089068 4294746 4521620 4773170 5053625 5368060 5722430 6123783 6580818 7104625
57100 7104625 7709231 8411762 9232276 10193214 11318235 12630494 14151006 15897948 17887121
57091 17887121 20132802 22647838 25442218 28520063 31875622 35489087 39323642 43324636
57083D3324636M094714M093809L967258L676877L193086K517516J694207P97325
57075F7359428r7072r34785j689111k351367k918339l385102l744044l987522
57067D8252086m111472m118229m017699l826904l568137l265848k943003k618462
57059A9782332k306260k016062j753577j520824j316941j139636r86532q55529
57051G886971p44276o49702n68539m98407m38124l86712l42574l04026k70296
57042C684315k41245k16215j93945j73669j55535j39620j25212j11428r8074q5382
57032B143990p3282o1269m8793l5682k2926j3279j0135j4817k5233l7905n0834
57021A749835o3563p5008q2797q5218q2827p7600p1169o4383n7847n2072m7148
$$ plain form
57083 43324636 47419350 51513159 55480417 59157294 62350380 64867896 66562103 67359428
57075 67359428 67262356 66327571 64638460 62287093 59368754 55983652 52239608 48252086
57067 48252086 44140614 40022385 36004686 32177782 28609645 25343797 22400794 19782332
57059 19782332 17476072 15460010 13706433 12185609 10868668 9729032 8742500 7886971
57051 7886971 7142695 6492993 5924454 5426047 4987923 4601211 4258637 3954611 3684315
57042 3684315 3443070 3226855 3032910 2859241 2703706 2564086 2438874 2327446 2229372 2143990
57032 2143990 2070708 2009439 1960646 1924964 1902038 1888759 1878624 1863807 1838574 1800669 1749835
57021 1749835 1686272 1611264 1528467 1443249 1360422 1282822 1211653 1147270 1089423 1037351 990203
57010I90203m2809l8861l5245l1889k8771k6041k3830k2063k0695j9934j9896
56999F80169k0086j9676j8392j6815j5619j4710j3417j1469r437q094p477o824
56987E18153n409l171n91J758L370L704K374n15m318q207j1481j3641j4505j4317
56973D53204j3655j2959j2152j0787q605n850l045m49J996M284O061P095P871
56960D13009R337J1861J4668J6482J6483J4561J0968O132P26m420q668j1766j3793
56947D75580j4924j5240j4640j3116j1020q819o532l796p10J927L613N012P256
56934D04591J0625J4429J7965K0833K2318K1260J6990J0070J920o018j2794j8087
56922E04102k2084k4894k6146k5493k3499k1382j9701j7918j5508j2883j0845
$$ plain form
57010 990203 947394 908533 873288 841399 812628 786587 762757 740694 719999 700065 680169
56999 680169 660083 640407 622015 605200 589581 574871 561454 549985 540548 532454 524977 518153
56987 518153 512744 509573 508982 510740 514110 517814 520188 519673 515355 507148 495667 482026 467521 453204
56973 453204 439549 426590 414438 403651 395046 389196 386151 385702 387698 391982 398043 405138 413009
56960 413009 422346 434207 448875 465357 481840 496401 507369 513501 514227 509807 501139 489373 475580
56947 475580 460656 445416 430776 417660 406640 397821 391289 387493 386783 388710 392323 397335 404591
56934 404591 415216 429645 447610 468443 490761 512021 529011 539081 541001 534983 522189 504102
56922 504102 482018 457124 430978 405485 381986 360604 340903 322985 307477 294594 283749
56911B83749r530q481p443o533n813n160m529l993l529k975k125q90M57J216R13
56896B25334K20O46K858N754P682Q247Q391R067J0506J2532J4768J6434J6667
56883C39106J5199J2395Q634M230j03l431n546p176q805r769r012o476l271n50
56869C25425J397L057N024P614J0878J4757J9140K3777K8203L1735L3505L2619
56857E37131K8527K1493J2544K916o401j4582k0847k4739k6286k5654k2898j8361
56845D42843j3018p800k776K487P897J2838J7287K2197K8479L5959M3606N0236
56833F40235N4557N4920M9746L8597K2823N084j1961k6696l8512m6952n1372n1660
56821F38809m8725m3755l7312k9764k2191j5832j0568m988J710Q724J4978K0550
$$ plain form
56911 283749 274219 265738 258295 251762 245949 240789 236260 232267 228738 225763 223638 222748 223205 224421 225334
56896 225334 225554 226200 229058 234812 242494 250741 259132 268199 278705 291237 306005 322439 339106
56883 339106 354305 366700 375334 379564 379461 376030 370484 363308 354503 344734 335722 329246 325975 325425
56869 325425 326822 329879 334903 342517 353395 368152 387292 411069 439272 471007 504512 537131
56857 537131 565658 587151 599695 602611 596210 581628 560781 536042 509756 484102 461204 442843
56845 442843 429825 422025 419249 421736 429633 442471 459758 481955 510434 546393 589999 640235
56833 640235 694792 749712 799458 838055 860878 865962 854001 827305 788793 741841 690469 638809
56821 638809 590084 546329 509017 479253 457062 441230 430662 425674 427384 436108 451086 471636
56809D71636K6185L1868L6500L8563L6702L0190J9545O542o809j9116k9374l6592
56797F05840m0284m0944l9556l6826l3172k8903k3942j8037j1658o126k126J248
56785C25514N181R512J3337J6530J9425K1295K0631J6960J1229M409l105j0565
56773D50353j6712k1015k4005k5913k6058k4180k1392j8971j6890j4487j1931
56762B28799j0171r610r558r005p533n573l973l104k442j362l02k87j271j901
56748A62707j371n26m47q52q14l13KR2M03P96O85J31k13k47n38j162j433j012
56730A55888m59l35m61m64m80q04j331j710j839j812j613j152m90J55N48N04L3
56713A44178n72r62j041q89n41j39o8n23j010q20l6N01L20j40k93j21J32M93J010
$$ plain form
56809 471636 497821 529689 566189 604752 641454 671644 691189 697731 690922 671806 642432 605840
56797 605840 565556 524612 485056 448230 415058 386155 362213 344176 332518 326392 324266 325514
56785 325514 330695 340207 353544 370074 389499 410794 431425 448385 459614 464023 460918 450353
56773 450353 433641 412626 388621 362708 336650 312470 291078 272107 255217 240730 228799
56762 228799 218628 209018 199460 190455 182922 177349 173376 170272 167830 166468 166166 165879 164608 162707
56748 162707 161336 160810 160363 159511 158697 158384 158386 158478 158881 159677 160362 160493 160280 160033 159495 158333 156900 155888
56730 155888 155429 155094 154633 154169 153689 152885 151554 149844 148005 146193 144580 143428 142938 143093 143641 144145 144178
56713 144178 143606 142644 141603 140714 140173 140034 139966 139443 138433 137613 137577 138078 138398 138258 137965 137844 137976 138469 139479
56694A39479J310R19o4r64j204q23l26k22n66r55r87o96l98j56K18P31J088J125
56676A37509R42N97M1n04n84j02N00Q58J091J359J521J485J492J607J357M58m83
56659A49144o42j09K52J6l49l11P0L92L91l2p57j297j107l47P1m76j483j868j275
56640A40283m21j74n91j004q95m26j31k79p04j099j223q41R9J162J561R78l4o70
56622A35591p24m48K5O33R41M32o47j368j194n14N4L40L77N1n34q36n35r6j05
56603A31443l05J6Q49J359J085N45M30O51O43K21j81m2P66J926K847K983K239
56586A47475J076J57j34J20N46P42N84L83N73J141J523J225M49m4L11J411K656
56569A60194L429L466K986K463K250K382K772L427M299N050N225M738M054L771
$$ plain form
56694 139479 140789 141708 141644 140680 139476 138653 138327 138105 137539 136584 135597 134901 134503 134347 134565 135296 136384 137509
56676 137509 138451 139048 139089 138585 138001 137899 138399 139257 140348 141707 143228 144713 146205 147812 149169 149627 149144
56659 149144 148502 148393 148645 148661 148312 148001 148071 148463 148854 148822 148065 146768 145661 145314 145385 144909 143426 141558 140283
56640 140283 139862 139688 139097 138093 137198 136772 136641 136362 135658 134559 133336 132495 132594 133756 135317 136295 136261 135591
56622 135591 134867 134419 134444 135077 136018 136450 135803 134435 133241 132727 132781 133121 133498 133549 133015 132179 131644 131548 131443
56603 131443 131138 131154 132003 133362 134447 134992 135422 136073 136716 136937 136756 136714 137480 139406 142253 145236 147475
56586 147475 148551 148708 148574 148694 149240 149982 150566 150949 151522 152663 154186 155411 155860 155816 156127 157538 160194
56569 160194 163623 167089 170075 172538 174788 177170 179942 183369 187668 192718 197943 202681 206735 210506
56555B10506M079M637M881M412L196J603K52l33j28K95K56m08j267j957k663l707
56539B23654m862n473n285m764m416m212l884l481l244l125k870k481k238k253
56525A71066k346k346k274k121j765j199o56l19j20R0K71K36j16p07j391j995
56509A54308k225j762o20N63Q88J41q85j286j136j179j575j629r60j90M2Q8O30
56492A43213J458J766J391R36P10M35R2J80Q42J449J424R40M17j10p25j150r91
56475A52277k33Q12J788K363K337J923J620J667J941K464L433M475M596L419J899
56460A86781J210J336J479J435J690K251K359J600O25K79M85M63j57q74j108j022
56444A98832j269j992k462k031j070n04n35n59l36m84j378k305k365j773j503
$$ plain form
56555 210506 214585 219222 224103 228515 231711 233314 233566 233233 233105 233400 233656 233248 231981 230024 227361 223654
56539 223654 218792 213319 208034 203270 198854 194642 190758 187277 184033 180908 178038 175557 173319 171066
56525 171066 168720 166374 164100 161979 160214 159015 158359 158040 157920 158010 158281 158517 158401 157694 156303 154308
56509 154308 152083 150321 149701 150264 151152 151293 150408 149122 147986 146807 145232 143603 142643 142453 142495 142583 143213
56492 143213 144671 146437 147828 148764 149474 149909 150001 150181 151023 152472 153896 154836 155253 155143 154418 153268 152277
56475 152277 152044 152856 154644 157007 159344 161267 162887 164554 166495 168959 172392 176867 181463 184882 186781
56460 186781 187991 189327 190806 192241 193931 196182 198541 200141 200766 201045 201530 201993 201836 200962 199854 198832
56444 198832 197563 195571 193109 191078 190008 189504 188969 188410 188074 187590 186212 183907 181542 179769 178266
56429A78266j920k433k519k280j991j603r61j83L98N26J79l66o51l66L75J132
56413A65603J456J150M17j43o0M15N72K40J06P15J615J925J450P50L62L82O13
56396A77568O38L5j063j777j327N7J403K017J854J192L94j85m71o80q11m94K52
56379A78602P12M79K24P09J469J433N86p2o6Q9Q1L87J326K347K688K213J341N59
56361A95107K63N54J070J312J186Q92N06J64L38J165J829J482O19M97J272J861
56345B10117J756J692K168K544K273J905K143K725L072L267L560L551K696J293
56331B44762J86k04l3M27Q54R05O42O28J168J834K165K356K759L199L308L152
56315B68108L026K940K832K854L036K987K490K015K140K750L288L537L663L828
$$ plain form
56429 178266 176346 173913 171394 169114 167123 165520 164559 164376 164774 165300 165479 165113 164462 164096 164471 165603
56413 165603 167059 168209 168626 168483 168423 168838 169410 169650 169756 170471 172086 174011 175461 176211 176573 176955 177568
56396 177568 178206 178241 177178 175401 174074 174131 175534 177551 179405 180597 180991 180806 180335 179655 178844 178350 178602
56379 178602 179314 179793 180017 180726 182195 183628 184214 184142 184076 184165 184246 184633 185959 188306 190994 193207 194548 195107
56361 195107 195370 195924 196994 198306 199492 200384 200890 201054 201392 202557 204386 205868 206487 206984 208256 210117
56345 210117 211873 213565 215733 218277 220550 222455 224598 227323 230395 233662 237222 240773 243469 244762
56331 244762 244948 244744 244711 245138 245992 246897 247539 248167 249335 251169 253334 255690 258449 261648 264956 268108
56315 268108 271134 274074 276906 279760 282796 285783 288273 290288 292428 295178 298466 302003 305666 309494
56301C09494M183M854N581N693M941L969L543L689L946M019L717K832J675J250
56287C63386K176L847N234O069O595O677O111N490N769P039Q526R748J0933J2361
56273D59961J4052J6006J8122J9992K1438K3184K6155L0157L4104L7538M1097
56262G41806M5329N0028N4985O0548O6884P3361P9292Q4738R0021R4792R8275
56251A540059J00251J01195J01358J00158R6694R0608Q2232P2042O0274M7203
56241B392074L3587K0469Q451k618j3104k2882l1370l8154m3466m8053n2573n7047
56229B145314o0911o3769o5954o8067p0116p1624p2568p3471p4403p4541p3223
56218A376667p0905o8486o6142o3411o0199n6898n3604m9848m5353m0576l6275
$$ plain form
56301 309494 313677 318531 324112 329805 334746 338715 342258 345947 349893 353912 357629 360461 362136 363386
56287 363386 365562 369409 374643 380712 387307 393984 400095 405585 411354 418393 426919 436667 447600 459961
56273 459961 474013 490019 508141 528133 549571 572755 598910 629067 663171 700709 741806
56262 741806 787135 837163 892148 952696 1019580 1092941 1172233 1256971 1346992 1441784 1540059
56251 1540059 1640310 1741505 1842863 1943021 2039715 2130323 2212555 2284597 2344871 2392074
56241 2392074 2425661 2446130 2454581 2451963 2438859 2415977 2384607 2346453 2302987 2254934 2202361 2145314
56229 2145314 2084403 2020634 1954680 1886613 1816497 1744873 1672305 1598834 1524431 1449890 1376667
56218 1376667 1305762 1237276 1171134 1107723 1047524 990626 937022 887174 841821 801245 764970
56207G64970l2623k9101k5291k1633j9050j7691j6496j4487j2145j0747j0474
56196E55232j0110q830p242o259n769n128m296l701l408l076k539j859j088l77
56182D91550J4J76O30J549K364K572K438K500K820L282M026N097O138O933P751
56167E39840Q608Q867Q263P664P977Q873R456R760J0572J2133J3975J5919J8273
56154F80180K1082K3879K6362K8721L1369L4751L9317M5217N2200N9997O8536
56143A111611P7483Q6058R3553R9400J02509J01392R5623Q6521P5936O5198N5631
56132B050915M8644M4117L9659L2843K3666J3831M552l756j0546j5592j9987k5262
56120B183084l1906l9845m9618o1500p3922q4438r1978r6704r8186r5597q9566
$$ plain form
56207 764970 732347 703246 677955 656322 637272 619581 603085 588598 576453 565706 555232
56196 555232 545122 536292 529050 522791 517022 511894 507598 503897 500489 497413 494874 493015 491927 491550
56182 491550 491564 491740 492370 493919 496283 498855 501293 503793 506613 509895 513921 519018 525156 532089 539840
56167 539840 548448 557315 565578 573242 581219 590092 599548 609308 619880 632013 645988 661907 680180
56154 680180 701262 725141 751503 780224 811593 846344 885661 930878 983078 1043075 1111611
56143 1111611 1189094 1275152 1368705 1468105 1570614 1672006 1767629 1854150 1930086 1995284 2050915
56132 2050915 2099559 2143676 2183335 2216178 2239844 2253675 2258227 2254471 2243925 2228333 2208346 2183084
56120 2183084 2151178 2111333 2061715 2000215 1926293 1841855 1749877 1653173 1554987 1459390 1369824
56109A369824q1972p3776o4650n4843m5653l7800l0871k4679j9673j5676j1734
56098I08497p629m245j942Q0K336M298N564O636P924R061R720J0268J1033J1736
56084I73337J1957J1517J0305Q486O831N974N460M503L411L064L280L175K991
56071A054291L922N939P489P697P438P762Q688R929J1482J2961J3575J3305J3087
56058A177565J3473J4182J5053J6294J7552J8057J7930J8127J8871J9474J9849
56047A366427K0829K2560K4066K4778K5245K5923K6463K6554K6425K6245K6029
56036A641544K6118K6709K7204K7212K7751K9846L2538L4120L4909L6589L9102
56025A983642M0694M1050M1828M3812M5944M7687M9938N2993N5859N8233O1022
$$ plain form
56109 1369824 1287852 1214076 1149426 1094583 1048930 1011130 980259 955580 935907 920231 908497
56098 908497 900868 896623 894681 894761 897097 901395 906959 913595 921519 930580 940300 950568 961601 973337
56084 973337 985294 996811 1007116 1015602 1022433 1028407 1033867 1038370 1041781 1044845 1048125 1051300 1054291
56071 1054291 1058213 1064152 1071641 1079338 1086776 1094538 1103226 1113155 1124637 1137598 1151173 1164478 1177565
56058 1177565 1191038 1205220 1220273 1236567 1254119 1272176 1290106 1308233 1327104 1346578 1366427
56047 1366427 1387256 1409816 1433882 1458660 1483905 1509828 1536291 1562845 1589270 1615515 1641544
56036 1641544 1667662 1694371 1721575 1748787 1776538 1806384 1838922 1873042 1907951 1944540 1983642
56025 1983642 2024336 2065386 2107214 2151026 2196970 2244657 2294595 2347588 2403447 2461680 2522702
56014B522702O4328O7130O9472P2725P7190Q1620Q5653R0278R5520J00129J04055
56003C430802J08700J14192J19086J23306J28607J35497J42551J49348J57216
55994D609305J66410J75592J84782J95723K08671K22009K35684K51651K70344
55985F520171K90197L11250L35400L62635L91003M20925M55170M94212N36337
55976A0117300N82695O36961O99490P67800Q43613R32968J038444J158528J296180
55967A8073979J460488J658396J893523K175819K523553K952760L473075M095050
55959C8306643M829749N678192O635043P709166Q930878J0339624J1983037J3928938
55951A08341270J6248880J8970032K2039830K5282867K8268264L0158053K9824099
$$ plain form
56014 2522702 2587030 2654160 2723632 2796357 2873547 2955167 3040820 3131098 3226618 3326747 3430802
56003 3430802 3539502 3653694 3772780 3896086 4024693 4160190 4302741 4452089 4609305
55994 4609305 4775715 4951307 5136089 5331812 5540483 5762492 5998176 6249827 6520171
55985 6520171 6810368 7121618 7457018 7819653 8210656 8631581 9086751 9580963 10117300
55976 10117300 10699995 11336956 12036446 12804246 13647859 14580827 15619271 16777799 18073979
55967 18073979 19534467 21192863 23086386 25262205 27785758 30738518 34211593 38306643
55959 38306643 43136392 48814584 55449627 63158793 72089671 82429295 94412332 108341270
55951 108341270 124590150 143560182 165600012 190882879 219151143 249309196 279133295
55944B79133295K6382377J9802074J1019413J426242p772405j5800696k2165458
55937B92024842k6513437k8695921k8878446k7497780k5096577k2179566j9146107
55930A14017008j6267096j3688110j1461232r585478q030598o749484n693594
55923D2541416m824105m108948l517234l023166k610334k266394j977394j731317
55915A8482524j522238j346102j196032j065503r52262q55240p70839o95559o29029
55906I449720n71358n20476m74670m34699m00834l70727l42475l16924k94786
55897E722771k74385k54377k35897k19932k05314j91182j78706j68417j58556
55888C836005j47864j37454j28145j18774j09063j01336r7121r4480r0979q7105
$$ plain form
55944 279133295 305515672 325317746 336337159 337763401 329990996 314190300 292024842
55937 292024842 265511405 236815484 207937038 180439258 155342681 133163115 114017008
55930 114017008 97749912 84061802 72600570 63015092 54984494 48235010 42541416
55923 42541416 37717311 33608363 30091129 27067963 24457629 22191235 20213841 18482524
55915 18482524 16960286 15614184 14418152 13352649 12400387 11545147 10774308 10078749 9449720
55906 9449720 8878362 8357886 7883216 7448517 7047683 6676956 6334481 6017557 5722771
55897 5722771 5448386 5194009 4958112 4738180 4532866 4341684 4162978 3994561 3836005
55888 3836005 3688141 3550687 3422542 3303768 3194705 3093369 2996248 2901768 2810789 2723684
55878B723684q4588q3316q2087q0740p9566p8066p5897p3681p1513o8345o3961
55867A881924n9801n6667n3533m9831m6846m5395m4149m1817l9184l7404l6019
55856A371278l4345l3085l2910l2920l2157l1328l1484l2186l2348l1776l0699
55845A016040k8957k6743k4890k3529k1765j9527j8136j8124j8129j7064j5624
55834G83552j4641j3633j2181j1011j0383r167o936n214n152n627n235m616m993
55821F74763n971o600p392r255j1500j2745j2993j3133j3210j2797j2283j2208
55809E44676j1982j0793r122q008p381o509n340m224k940j279J16P00J099K061
55795D81074L136L567L707M320N224N977O981Q594R766R034O357K694j595o587
$$ plain form
55878 2723684 2639096 2555780 2473693 2392953 2313387 2235321 2159424 2085743 2014230 1945885 1881924
55867 1881924 1822123 1765456 1711923 1662092 1615246 1569851 1525702 1483885 1444701 1407297 1371278
55856 1371278 1336933 1303848 1270938 1238018 1205861 1174533 1143049 1110863 1078515 1046739 1016040
55845 1016040 987083 960340 935450 911921 890156 870629 852493 834369 816240 799176 783552
55834 783552 768911 755278 743097 732086 721703 712536 705600 700386 695234 689607 684372 679756 674763
55821 674763 668792 662192 654800 645545 634045 621300 608307 595174 581964 569167 556884 544676
55809 544676 532694 521901 512779 504771 497390 490881 485541 481317 478377 477098 477214 477914 479013 481074
55795 481074 484210 487777 491484 495804 501028 507005 513986 522580 532346 541380 547737 550431 548836 542249
55781E42249j1523j5154j7145j8053j8164j7343j5639j3249j0287p406n832n924
55769C86530o388n959n114n046n710o200o336o551o749o523o152o167o264n749
55755C01622m683l678k998k783l531n361p311q479r114r634r401p783n706m617
55741B16543m457m154l615l588l890l540k596k202k629k788k019j081q49j136
55727A77999j329j329j409j765k488l491m270m271l563k789k439k486k591k353
55713A41426j574n70J00M02Q04J303J289O95L46O02O75Rp17q15q09j357k037k282
55695A37490k569l360l841l214k260k072k085j157J22K42o36r59l69Q3K48J186
55679A16849K884L830L418K881L060L061K012O42j5j80n14p60l25M74P73L19l93
$$ plain form
55781 542249 530726 515572 498427 480374 462210 444867 429228 415979 405692 398286 392454 386530
55769 386530 380142 374183 369069 364023 358313 352113 345777 339226 332477 325954 319802 313635 307371 301622
55755 301622 296939 293261 290263 287480 283949 278588 271277 262798 253684 244050 234649 226866 221160 216543
55741 216543 212086 207932 204317 200729 196839 193299 190703 188501 185872 183084 181065 179984 179135 177999
55727 177999 176670 175341 173932 172167 169679 166188 161918 157647 154084 151295 148856 146370 143779 141426
55713 141426 139852 139282 139382 139784 140588 141891 143180 143875 144221 144823 145498 145507 144790 143975 143166 141809 139772 137490
55695 137490 134921 131561 127720 124506 122246 120174 118089 116932 117054 117296 116660 115701 115332 115415 115663 116849
55679 116849 119733 123563 126981 129862 132922 135983 137995 138637 138622 138442 137928 137168 136843 137317 138090 138409 138016
55662A38016q35p21l7P96J164R83Q09J070J622K209K814L406L833M109M317M289
55646A67844L796L050K436J933J425J279J808K308J685j9j620k399k703k926k873
55631A75024k450k004j775j679j803k384l139l456l292l137l029k617k104k173
55617A39982k838l428l807m443n125m941l931l391l952m510l876k480j566j563
55603I0131k043k578k842k442j476p54q93j556k058k199k091j752j408j554k186
55588F2299k529k060j247p81p24q95j401k091k175j263k17p3o10q25n29l92n99
55571D3888m89K14P39L11p50j439j294p73m84m95n42o22r51j420j568j288j015
55554C2022r25n22M24J062N63m16m87L47O56j72r33m71O40J157R69Q17Q28M51
$$ plain form
55662 138016 137181 136460 136423 137219 138383 139366 140175 141245 142867 145076 147890 151296 155129 159238 163555 167844
55646 167844 171640 174690 177126 179059 180484 181763 183571 185879 187564 187545 185925 183526 180823 177897 175024
55631 175024 172574 170570 168795 167116 165313 162929 159790 156334 153042 149905 146876 144259 142155 139982
55617 139982 137144 133716 129909 125466 120341 115400 111469 108078 104126 99616 95740 93260 91694 90131
55603 90131 88088 85510 82668 80226 78750 77996 77103 75547 73489 71290 69199 67447 66039 64485 62299
55588 62299 59770 57710 56463 55682 54958 54063 52662 50571 48396 47133 46916 46843 46233 45408 44879 44487 43888
55571 43888 43399 43613 44352 44663 43913 42474 41180 40407 39923 39428 38886 38264 37313 35893 34325 33037 32022
55554 32022 31097 30575 30999 32061 32624 32208 31721 32068 32724 32552 31619 31148 31788 32945 33914 34731 35559 36010
55536C6010l34q06n32J37O84R90J074P97J74l00JJ056J972J795O09m15l25O04
55518D3191J398J667J798K160K708L250L522L118K025J118J301K176K484J955
55504G3871J639K111K433J640L42j06M97R91L97j124k762l937m596m983n209n051
55488E6153m299l257k556k406k442k349k219k125j853j296p30m45m54p04j190
55473B7828j769k170k288k144j631p63p0j24o70r34p31n62n92l91J56N77N97M19
55455A4738K8q18j706j700p44J02K44L10Q37J249R45L42L0k13o59p41N0J065J323
55436A4682Q92N03L11%k99k18R7K61L53N65N75J04l45j09N55R01P85N34J58m32
55416A9873p55l16M84Q51P24M76n7j129k021j692m49K76j00p54r48r23r63p47
$$ plain form
55536 36010 35676 34870 34338 34475 35159 36149 37223 38020 38194 37894 37895 38951 40923 42718 43327 42912 42587 43191
55518 43191 44589 46256 48054 50214 52922 56172 59694 62812 64837 65955 67256 69432 71916 73871
55504 73871 75510 77621 80054 81694 82036 81930 82427 83418 83815 82691 79929 75992 71396 66413 61204 56153
55488 56153 51854 48597 46041 43635 41193 38844 36625 34500 32647 31351 30621 30176 29722 29018 27828
55473 27828 26059 23889 21601 19457 17826 17063 16993 16869 16199 15265 14534 13972 13380 12989 13145 13722 14319 14738
55455 14738 14766 13948 12242 10542 9798 9900 10144 10454 11291 12540 13485 13827 13857 13644 12985 12244 12294 13359 14682
55436 14682 15574 16077 16388 16388 16089 15871 15968 16229 16582 17147 17722 17826 17481 17372 17927 18828 19613 20147 20305 19873
55416 19873 19118 18802 19286 20137 20861 21337 21280 20151 18130 16438 15989 16265 16165 15411 14463 13540 12577 11830
55398A1830j32K95M7n52q79q01n14j53J65K93K72K61J74j62m51j62N74R39N00
55379A1544k46o14m86j02L44O13M08k35q19r36o48j97K83O42O43K72j76m71o44
55360I175p54p19n51m06l22j24K72O77Q46O97L28n7k40j92q8J4K52N39L74m73
55340I248j411j616j017k34L03O13P31N75K65L5j21l09l78j73k8l84j003j196
55322C900p52q2M65Q04O99o7j030j337q26j31L43P50J021O76k02p05l43J96J44
55303C523j61N9P12J042Q39O38P93J012R03M76l6m73p15o19j68M28Q39Q26M15
55284A0333j18m90o23n78m04j93j58l51m34m9N72P89L98p3j16J11P8m07j015j302
55264E970j125p01l31jO03J529K224K054J122K15l3L47Q83J007L52q96j896j918
$$ plain form
55398 11830 11698 11993 12040 11488 10609 9808 9294 9141 9306 9599 9871 10132 10306 10144 9693 9531 10105 11044 11544
55379 11544 11298 10684 10198 10096 10440 11053 11461 11226 10407 9471 8823 8626 8909 9551 10194 10466 10290 9819 9175
55360 9175 8421 7702 7151 6745 6423 6299 6571 7248 8094 8791 9119 9062 8822 8630 8542 8556 8808 9347 9721 9248
55340 9248 7837 6221 5204 4970 5273 5886 6617 7192 7457 7492 7371 7062 6684 6511 6483 6099 5096 3900
55322 3900 3148 3066 3531 4335 5034 4967 3937 2600 1774 1643 1986 2736 3757 4433 4231 3526 3183 3379 3523
55303 3523 3362 3421 4133 5175 6014 6652 7445 8457 9360 9836 9800 9327 8612 7993 7825 8253 9092 9918 10333
55284 10333 10215 9725 9102 8524 8120 7927 7769 7418 6984 6935 7507 8296 8694 8621 8505 8616 8694 8287 7272 5970
55264 5970 4845 4144 3813 3812 4415 5944 8168 10222 11344 11559 11526 11873 12756 13763 14115 13219 11323 9405
55246I405j199o00m10j57M08Q27P13L96L57M54J96m73j085j166o52P6M33J09n80
55227G052j007r61p11m28j1M59O60O27Q18J294J405P24k22o54n67m89n87n80l67
55208F455j28O2K33K48j5k77j25L40O16N30M74P27R73P22o9q70j028l27P51J231
55188A0523M92j020k047j660j67J218J519Q46J55J89P00P72n4j169j585j101n00
55171G111n20r76j091m79M97J270J544J267N32k54n20k19q5p45j787k236A461
55153A99f67l38N02F48J324J535K188K573J781J98q50q03l30j05l6R6J38k8j76
55134H153j67j44p7L06Q68R60L50k66j97K82L99j9m51n09l09o2J71L55L84L22
55114A0349M01O68P81L89l31p43m93N0L28M22Q58J628K007J562P73K25j53n45
$$ plain form
55246 9405 8206 7606 7196 7039 7447 8274 8987 9383 9740 10194 10390 9917 8832 7666 7014 7090 7523 7632 7052
55227 7052 6045 5084 4373 3945 3934 4393 5053 5680 6498 7792 9197 9921 9699 9045 8478 7989 7402 6822 6455
55208 6455 6327 6389 6622 6870 6855 6578 6453 6793 7409 7939 8413 9140 10113 10835 10766 9896 8868 8541 9292 10523
55188 10523 11015 9995 7948 6288 6121 7339 8858 9704 9859 10048 10748 11520 11466 10297 8712 7611 7111
55171 7111 6591 5615 4524 4045 4542 5812 7356 8623 9155 8901 8381 8162 8077 7332 5545 3309 1461
55153 199 -667 -1005 -503 648 1972 3507 5695 8268 10049 10247 9397 8594 8264 8159 8123 8219 8357 8329 8153
55134 8153 7986 7842 7765 8071 8939 9899 10249 9983 9786 10068 10467 10448 9997 9488 9179 9117 9288 9643 10027 10349
55114 10349 10750 11418 12199 12588 12257 11514 11021 11071 11399 11821 12679 14307 16314 17876 18649 18874 18721 18176
55096A8176n18L30J444J926J787J686J663J173L03k08k09l27o89o40j15r3j023
55079B4666j814j264K88J550J912J635R66jq85j280j348j501j659j388o72k2J42
55062A9325j30m58m20J52Q81J177R74P93Q84Q63M27j14l95n34o72n71k37k56r04
55043B0785j460j176m44j34k13P7Q32J274R17K03j36J67Q33J221P60l66j082n62
55025B1496O95J461J291P91N06L23%l83o58p66n93p8M45M40j85r77j431j287m72
55006B0618P49J637J535O11l12o48m76j40J20K41K97M33N76L91j50n54m93l38
54988B4097m49m47J29Q39Q98M78M30Q54R61M55QJ58N85Q57J048J244J175P55L65
54969C4440K66L00M58J006J693J634N41n82o80J2N74Q34J325K086K448K083J568
$$ plain form
55096 18176 17658 17988 19432 21358 23145 24831 26494 27667 27970 27762 27553 27226 26537 25897 25782 25689 24666
55079 24666 22852 21588 21876 23426 25338 26973 27939 27938 27053 25773 24425 22924 21265 19877 19205 19183 19325
55062 19325 19195 18737 18317 18469 19350 20527 21501 22294 23178 24041 24468 24354 23959 23425 22753 22182 21945 21689 20785
55043 20785 19325 18149 17705 17571 17358 17435 18267 19541 20458 20661 20525 20692 21525 22746 23506 23140 22058 21496
55025 21496 22191 23652 24943 25734 26240 26563 26563 26180 25522 24756 24163 24085 24530 24970 24785 23808 22377 21090 20618
55006 20618 21367 23004 24539 25150 24838 24190 23714 23574 23694 23935 24232 24665 25241 25632 25482 24928 24435 24097
54988 24097 23648 23201 23330 24169 25067 25545 25975 26829 27790 28245 28253 28411 28996 29853 30901 32145 33320 34075 34440
54969 34440 34706 35006 35464 36470 38163 39797 40338 39756 39076 39088 39662 40496 41821 43907 46355 48438 50006
54952E0006J667K493L553M317M595M607M860N788P382R158J0535J1233J1337J1034
54938A42565J0388R318P706N412K254j667n627q620j0318j1314j2127j2381j1410
54925A04179r412p335n846n013m797n076n184m348k777j592j386j521j144k95
54911D8453N22J188J902K597L067L438M073N018N899O371O563P097Q517J0466
54897A15171J1652J1131R452P874O560M441J023k713n651p839r738j0993j0931
54884A19439r806q665q122p990p912p654p031o053n084m349l558k486j559j244
54870C7926j260j108j006j405j868j497m37K20J09J04P46J237O86n21j337j452
54854B9137j250q43q2P33R45M59j61n49r23j432j717j483j079j038j255j070j73
$$ plain form
54952 50006 51673 54166 57719 62036 66631 71238 76098 81886 89268 98426 108961 120194 131531 142565
54938 142565 152953 162271 169977 175389 177643 175976 170349 161729 151411 140097 127970 115589 104179
54925 104179 94767 87432 81586 76573 71776 66700 61516 57168 54391 52799 51413 49892 48748 48453
54911 48453 48975 50163 52065 54662 57729 61167 65240 70258 76157 82528 89091 96188 104705 115171
54897 115171 126823 137954 147406 155280 161840 166281 167304 164591 158940 151101 141363 130370 119439
54884 119439 109633 100968 92846 84856 76944 69290 62259 56206 51122 46773 43215 40729 39170 37926
54870 37926 36666 35558 34552 33147 31279 29782 29345 29565 29674 29778 30524 31761 32447 31926 30589 29137
54854 29137 27887 27044 26962 27695 28640 29099 28938 28389 27466 26034 24317 22834 21755 20717 19462 18392 18219
54837A8219Q91J269O79l05q08m01N16J115R53M36L34Q25J185O49n68j422j176
54820B2391j71O18N88l1n82o13j85L20O48Q82J206J551J698J669J736K002K232
54803C5959K273K321K573K831K752K389K179K424L051L856M718N571O342P059
54789H6298P852Q790R707J0318J0408R923Q926P436N367K654n18l707o461q552
54775A48441r883j0339r893q804p584o653o077n595m940m032k973j917j095q20
54761F7836j201j756j668o94M57J014J190J790K866L570L532L587M580N992O571
54746I7666O148N964P098R090J0515J0465R186P444N650L657J201j612m305o503
54732A61664q275r863j1152j1591j0817r255p922p517p695p429o168m480l425
$$ plain form
54837 18219 19110 20379 21058 20753 19945 19544 20060 21175 22128 22564 22898 23723 24908 25557 24989 23567 22391
54820 22391 22220 22838 23426 23395 22813 22200 22015 22335 22983 23865 25071 26622 28320 29989 31725 33727 35959
54803 35959 38232 40553 43126 45957 48709 51098 53277 55701 58752 62608 67326 72897 79239 86298
54789 86298 94150 102940 112647 122965 133373 143296 152222 159658 165025 167679 167161 163454 156993 148441
54775 148441 138558 128219 118326 109522 101938 95285 89208 83613 78673 74641 71668 69751 68656 67836
54761 67836 66635 64879 63211 62517 62974 63988 65178 66968 69834 73404 76936 80523 85103 91095 97666
54746 97666 103814 109778 116876 125966 136481 146946 156132 163576 169226 172883 174084 172472 168167 161664
54732 161664 153389 143526 132374 120783 109966 100711 92789 85272 77577 70148 63980 59500 56075
54719E6075l337l564l300k407j302m31j9r3m63q04r83j156j404j441r42k6P72
54702C5175J007O14j10o70o53q1N85R66J128J275J300R18J69n29q15o70l29j01
54684C9179j71l90l50R3N39N33J98L3J92L67L53L06L85N53Q36J344J903K029J549
54665D9481Q94N38L87O2m67q78j023j053j033q01l48m0k51q92j483j596j209o52
54647C9636l09k91k98J06R29J588J514Q66M15N68R05Q10K72k45m60m32j48N24
54629D5950J446K217K600K689K524K009J342J037J262J534J347Q37M68L31J67
54614F7760j77o49j199j717j939j776j577j686j887j703j126o06l84l28l53n56
54598E0097q46r30p97p93j079j374j428j331j186q33k26K50J44m93j201j593j548
$$ plain form
54719 56075 52738 49174 45874 43467 42165 41734 41715 41622 41159 40355 39372 38216 36812 35371 34429 34403 35175
54702 35175 36182 36796 36686 36016 35363 35282 35867 36833 37961 39236 40536 41454 41623 41094 40279 39609 39280 39179
54684 39179 39008 38618 38268 38361 38900 39433 39631 39664 39856 40223 40576 40882 41267 41820 42656 44000 45903 47932 49481
54665 49481 50375 50913 51300 51362 50895 50017 48994 47941 46908 46107 45759 45719 45468 44576 43093 41497 40288 39636
54647 39636 39327 39036 38738 38844 39773 41361 42875 43741 44156 44724 45629 46439 46711 46466 46006 45574 45426 45950
54629 45950 47396 49613 52213 54902 57426 59435 60777 61814 63076 64610 65957 66794 67262 67593 67760
54614 67760 67583 66934 65735 64018 62079 60303 58726 57040 55153 53450 52324 51718 51334 51006 50653 50097
54598 50097 49251 48321 47524 46731 45652 44278 42850 41519 40333 39500 39274 39524 39668 39175 37974 36381 34833
54581C4833j063k62M91Q21P02M87M53N12M06R5j99l29m32p02j084j296j217j027
54563C1189r89j163j389j381r32j74L24J22l98l42M50J008M76o86j310j009l84
54546B3412K1K22K82R0j64L9P96J546J763J467Q74J30m09k44N30J092R39M87L01
54527C3174J90k17o08l74L77R91J292J673K203K385J926J163N34P8l42p55j174
54510D2516j560j612r83N3O65M01k43n44l88j15J23M00O34O14L65R3j84n68q48
54491C8819n72K78J037J063N37K40N71J028P91k47j250j334n73J47K29L9K05N75
54473D1583M28l62r35n95K23N41J49k70k20L1J36K86Q00J437J581J034K21l27
54455D5741m79n29q38j441j896j676p70K91J079J589J747J142k44j467j529o91
$$ plain form
54581 34833 33770 33508 33999 34820 35522 36009 36462 36974 37380 37475 37276 36947 36515 35813 34729 33433 32216 31189
54563 31189 30200 29037 27648 26267 25335 25161 25485 25607 25209 24867 25317 26325 26801 26115 24805 23796 23412
54546 23412 23433 23655 23937 24027 23863 23902 24698 26244 28007 29474 30348 30478 30069 29825 30355 31447 32386 32873 33174
54527 33174 33364 33147 32539 32165 32542 33533 34825 36498 38701 41086 43012 44175 44709 44787 44445 43690 42516
54510 42516 40956 39344 38361 38414 39079 39480 39237 38693 38305 38190 38313 38713 39347 39961 40326 40419 40235 39667 38819
54491 38819 38247 38525 39562 40625 41162 41402 41973 43001 43792 43545 42295 40961 40388 40535 40764 40803 41008 41583
54473 41583 42011 41649 40714 40119 40342 40883 41032 40762 40542 40573 40709 40995 41795 43232 44813 45847 46068 45741
54455 45741 45262 44733 43895 42454 40558 38882 38112 38403 39482 41071 42818 43960 43716 42249 40720 40029
54439D0029j00j64j88K80O47L65j20j25J51R9j91j66J26J36j30q9L29M01k22q53
54419D0215p23N9R11J604K163K320J797R25L76L58M64L76K25K93P38J593K651
54402E6345L345L137K263J625J738K088J836Q39l04j054j329j230q02j88K94M26
54386F9029L31L09M64O06L82l86j490k369k536k057j475j247j300j279j065q64
54370E5053q67r86r70o80j22N92J268J614J379O24k21o89o76m57l21k61j38O5
54352E4207K90O41J262K000K431K341K007J851J949K006J689Q96j83j105j488
54337G0794j415j373j627j810j392m82J74oq71j802k305k270j888j413j019p64
54321E0531o90p69p67l94J91L41k93j101j173m72J34O4l34n25n67p74j069j158
$$ plain form
54439 40029 39929 39765 39577 39857 40504 40869 40749 40624 40775 40874 40683 40517 40643 40779 40649 40560 40889 41290 41068 40215
54419 40215 39492 39551 40462 42066 44229 46549 48346 49271 49647 50005 50469 50845 51070 51363 52101 53694 56345
54402 56345 59690 62827 65090 66715 68453 70541 72377 73216 72912 71858 70529 69299 68497 68309 68603 69029
54386 69029 69360 69669 70133 70739 71121 70735 69245 66876 64340 62283 60808 59561 58261 56982 55917 55053
54370 55053 54186 53200 52230 51550 51428 52020 53288 54902 56281 56905 56684 55995 55319 54862 54541 54280 54142 54207
54352 54207 54497 55138 56400 58400 60831 63172 65179 67030 68979 70985 72674 73570 73387 72282 70794
54337 70794 69379 68006 66379 64569 63177 62695 62869 62863 61992 60190 57885 55615 53727 52314 51295 50531
54321 50531 49841 49072 48305 47911 48102 48443 48150 47049 45876 45404 45538 45602 45268 44743 44176 43402 42333 41175
54303D1175j078j017q41k65N48J077J065O66k3j058k109k405j604l74K82J98J01
54286C4338N85J396J886J761J215N01j38l68l7L47j4j045j539n83J089J895J429
54269D2718Q02R03J204Q42P1k10J48M34K78L7M1J52K05K71K60j32q54j352j254
54250D4564p82l09J12M86O43N11K53j37q56j620j614o20L70M10k2K10J156J809
54232D4564J735J519J427P98o14j762j578n01K06K01J87N13O52J93n00q99r37
54215D5204p79m83k04k18m19k62M14Q57L12q35j436j016k50O5l9r7o5k72o77p51
54195C9049k45L26K68l41p15l42L97P08K96m66j033j102o50O2M97K23n87j271
54177C5074j417j239j082q81l65L87R71J135R31M63k10q35r80m73K99O65L16m59
$$ plain form
54303 41175 40097 39080 38239 37974 38522 39599 40664 41330 41307 40249 38140 35735 34131 33757 34039 34237 34338
54286 34338 34923 36319 38205 39966 41181 41682 41544 41176 41139 41486 41472 40427 38888 38305 39394 41289 42718
54269 42718 43520 44423 45627 46469 46540 46330 46478 46912 47190 47227 47268 47420 47625 47896 48156 48024 47170 45818 44564
54250 44564 43782 43473 43585 44071 44714 45225 45478 45341 44485 42865 41251 40631 41001 41411 41389 41599 42755 44564
54232 44564 46299 47818 49245 50043 49429 47667 46089 45588 45794 45995 46182 46695 47347 47540 47040 46141 45204
54215 45204 44425 43942 43738 43520 43101 42839 43253 44110 44422 43587 42151 41135 40885 40950 40911 40814 40749 40477 39800 39049
54195 39049 38804 39130 39398 39057 38342 38000 38397 39105 39401 38935 37902 36800 36150 36212 36709 36932 36345 35074
54177 35074 33657 32418 31336 30455 30090 30477 31448 32583 33514 33977 33767 32932 31952 31479 31778 32443 32759 32300
54159C2300j100j299j141q21l44L07Q93J120J093J218J500J376N32m37o84k38
54143C4275P9j85n37l44L03P70O76K07k49m97o36q83j271j481j069J8J244J898
54125C2318J722J067N18L36K64j20p72j115p26N2M74K75j30k85j44J31M30N80
54107C4875L61j66n61n19k31m1J8J66N23J036J565J849J670J219J010J121R29
54090D4824Oj010j115k93M78O17O02J016J660K016K067K075J898J207K77j47K12
54073E6390Q20J148J314J663K091K240K088J924J826J581J187R16Q33O47K87K22
54057G7177P91J541J678J091M38K16L04M85R18J678K281K201J775K001L258M687
54041A02520N139M576M094M579N714O492O433N909N418N000M504M028L766L670
$$ plain form
54159 32300 31200 29901 28760 27939 27595 27902 28795 29915 31008 32226 33726 35102 35634 35197 34513 34275
54143 34275 34354 34169 33632 33288 33591 34361 35037 35244 34995 34498 33862 32979 31708 30227 29158 29176 30420 32318
54125 32318 34040 35107 35625 35961 36225 36105 35333 34218 33492 33544 34018 34293 34163 33878 33734 33865 34295 34875
54107 34875 35236 35070 34509 33990 33759 33718 33736 33902 34425 35461 37026 38875 40545 41764 42774 43895 44824
54090 44824 44830 43820 42705 42412 42890 43507 44109 45125 46785 48801 50868 52943 54841 56048 56325 56178 56390
54073 56390 57210 58358 59672 61335 63426 65666 67754 69678 71504 73085 74272 75188 76021 76668 76955 77177
54057 77177 77968 79509 81187 82278 82716 82932 83236 83721 84639 86317 88598 90799 92574 94575 97833 102520
54041 102520 107659 112235 116329 120908 126622 133114 139547 145456 150874 155874 160378 164406 168172 171842
54027A71842L555L448L443L392K975K131J114K02m61q31j054j422j953k235k077
54012A82069k101l047m563n495n385m968m912m894m398l707l381l374l325l327
53998A25192l645l946l672k979k520k399k107j573j379j752k127k060j917k147
53984I0969k392k003j080m45o06j225j615j423q44l36k38m84o56m58p3L3k76n87
53966G6261l47M94J353J524Q92O6k41J16P52J308J701J897J787J429J116R74P20
53949I1802J41k73L10J922L426L679K903K425L025M086M600M536M599M989N200
53934A37370N057N088N581N957N687N227N423O206O682O363N639N056M718M581
53920B14635M726N114N490N761O077O395O350N807N240N142N298M956L712J950
$$ plain form
54027 171842 175397 178845 182288 185680 188655 190786 191900 192102 191641 190810 189756 188334 186381 184146 182069
54012 182069 179968 176921 172358 166863 161478 156510 151598 146704 142306 138599 135218 131844 128519 125192
53998 125192 121547 117601 113929 110950 108430 106031 103924 102351 100972 99220 97093 95033 93116 90969
53984 90969 88577 86574 85494 85049 84443 83218 81603 80180 79336 79000 78762 78278 77622 77164 77091 77124 76848 76261
53966 76261 75914 76408 77761 79285 80177 80243 80002 80118 80870 82178 83879 85776 87563 88992 90108 91082 91802
53949 91802 91943 91670 91980 93902 97328 101007 103910 106335 109360 113446 118046 122582 127181 132170 137370
53934 137370 142427 147515 153096 159053 164740 169967 175390 181596 188278 194641 200280 205336 210054 214635
53920 214635 219361 224475 229965 235726 241803 248198 254548 260355 265595 270737 276035 280991 284703 286653
53906B86653M44l95q03j351k252l124l499l494l686m385n248n766n828n739n853
53891B35674o292o878p188o940o322n891n956o239o158n362m049k860k535l299
53877A59705m578n450n503n039m516m047l559l169l117l447l859l898l323k378
53863A03822j633j357j305j191j163j429j715j611j312j342j612j493r92j008
53849H4659k006l077k938j487J89J029Q10k7p72q63l15L27O17O17N29L43J44K88
53831G8067Q26J118O41j59m00R9P23R96R23O29L08M10J230K206K404J759J241
53814I3021J596K510L283L714M013M264M377M324M126L878L878M440N397O133
53800A48954O297O074N639M850L790L057L010L136K742K038J808K154K182J149
$$ plain form
53906 286653 287097 286702 285899 284548 282296 279172 275673 272179 268493 264108 258860 253094 247266 241527 235674
53891 235674 229382 222504 215316 208376 202054 196163 190207 183968 177810 172448 168399 165539 163004 159705
53877 159705 155127 149677 144174 139135 134619 130572 127013 123844 120727 117280 113421 109523 106200 103822
53863 103822 102189 100832 99527 98336 97173 95744 94029 92418 91106 89764 88152 86659 85667 84659
53849 84659 82653 79576 76638 75151 75340 76369 77179 77152 76380 75517 75202 75529 76146 76763 77292 77635 77779 78067
53831 78067 78893 80011 80652 80493 80093 80192 80915 81911 82834 83463 83771 84181 85411 87617 90021 91780 93021
53814 93021 94617 97127 100410 104124 108137 112401 116778 121102 125228 129106 132984 137424 142821 148954
53800 148954 155251 161325 166964 171814 175604 178661 181671 184807 187549 189587 191395 193549 195731 196880
53786A96880o26k240l200l648l875m007m138m374m630m559l952l154k847l276
53772A48354l890l945l410k965l108l569l697l224k438j745j341j183j156j214
53758A11469j466k002k615k809k318j519j094j283j647j659j343j169j375j573
53744H7597j214k88N64P44L30n7M7N28Q79P65L32R1L62Q06O97k02j205j453r18
53725H8405l28j98l88n81o73n58l3P93J371J333R87Q21Q27O19M3p94j818k931
53707H6897l704l632k697j332J19J556K784L465L515L213K830K442K137K022J965
53692A01580J695J241R36Q71P67N06L62N17P82J062J568K206K327J646R04R37
53676A19907J372J142J16p39q62p92j040j222q65l70m14q95j214j216j114p68
$$ plain form
53786 196880 196254 194014 190814 187166 183291 179284 175146 170772 166142 161583 157631 154477 151630 148354
53772 148354 144464 140519 137109 134144 131036 127467 123770 120546 118108 116363 115022 113839 112683 111469
53758 111469 110003 108001 105386 102577 100259 98740 97646 96363 94716 93057 91714 90545 89170 87597
53744 87597 86383 86095 86659 87403 87733 87676 87723 88251 89130 89895 90227 90318 90680 91486 92183 91981 90776 89323 88405
53725 88405 88077 87879 87491 86910 86237 85679 85646 86439 87810 89143 90130 90951 91778 92397 92440 91646 89828 86897
53707 86897 83193 79561 76864 75532 75651 77207 79991 83456 86971 90184 93014 95456 97593 99615 101580
53692 101580 103275 104516 105452 106323 107090 107596 107958 108475 109257 110319 111887 114093 116420 118066 118970 119907
53676 119907 121279 122421 122537 121798 120936 120144 119104 117882 117017 116647 116233 115338 114124 112908 111794 111026
53660A11026R2J007J102L42k62n4M52N16K67L20P37J032R48O84M28K08P6J12J97
53641A19230J41k7j36j55n9L68J187J864J762J048N91Q23J250J268R80Q47R93
53624A31975J245J493J594J262N57K19R54K466L674L913L398K636J912J461J530
53609A60289J995K303K146J873J988K508L101L539L676L280K375J579J609K379
53595A94640K978K686J685P56M50P34J184J348J062N96M69R85J872K427K081R61
53579B16914j24m49j11K13K43L98R42J309Q42j65q09p58m27l5N96J219J013k28
53561B20583j514j787j123k68M08Q56P99P3p46r30n93m11m99l99j03p5k42J24
53543B14153J156J992K019J737J815K007J705J014O00P42J195J746K325K773L007
$$ plain form
53660 111026 111118 112125 113227 113569 113307 113253 113705 114221 114488 114808 115545 116577 117525 118209 118637 118845 118921 119033 119230
53641 119230 119371 119344 119208 119053 118994 119362 120549 122413 124175 125223 125814 126637 127887 129155 130135 130982 131975
53624 131975 133220 134713 136307 137569 138126 138345 139299 141765 145439 149352 152750 155386 157298 158759 160289
53609 160289 162284 164587 166733 168606 170594 173102 176203 179742 183418 186698 189073 190652 192261 194640
53595 194640 197618 200304 201989 202745 203195 203929 205113 206461 207523 208119 208588 209573 211445 213872 215953 216914
53579 216914 216790 216341 216230 216443 216686 217084 218026 219335 220177 220012 219203 218445 218018 217983 218579 219798 220811 220583
53561 220583 219069 217282 216159 215891 216299 217155 217954 218027 217281 216351 215758 215347 214848 214449 214346 214271 214029 214153
53543 214153 215309 217301 219320 221057 222872 224879 226584 227598 228198 228940 230135 231881 234206 236979 239986
53528B39986L253L634L734L197K550K807M182N833O909P347P507P562P528P532
53514C13561P716Q069Q555R213J0040J0874J1549J2027J2339J2519J2665J2914
53502D42041J3301J3772J4300J4818J5093J4904J4370J3926J3866J4097J4308
53491E98796J4220J3682J2809J2073J2015J2673J3506J3904J3671J2980J2179
53480G42508J1746J2101J3167J4190J4363J3583J2441J1519J0927J0509J0199
53469H77253R928R358Q060O076M088K814K222J570J96j848l994n724o867p521
53455H95611p928q339q814r183r310r314r398r538r567r529r699j0227j0878j1289
53441G62598j1348j1289j1379j1559j1515j1084j0523j0080r543q476o936n528
$$ plain form
53528 239986 243239 246873 250607 253804 256354 259161 263343 269176 276085 283432 290939 298501 306029 313561
53514 313561 321277 329346 337901 347114 357154 368028 379577 391604 403943 416462 429127 442041
53502 442041 455342 469114 483414 498232 513325 528229 542599 556525 570391 584488 598796
53491 598796 613016 626698 639507 651580 663595 676268 689774 703678 717349 730329 742508
53480 742508 754254 766355 779522 793712 808075 821658 834099 845618 856545 867054 877253
53469 877253 887181 896539 904599 910675 914763 917577 919799 921369 921565 919717 915723 909999 903132 895611
53455 895611 887683 879344 870530 861347 852037 842723 833325 823787 814220 804691 794992 784765 773887 762598
53441 762598 751250 739961 728582 717023 705508 694424 683901 673821 664278 655802 648866 643338
53429F43338m580l733k568j304m29k6J23M7k76m64J9J210K633L857M610M636M071
53412F51164L849M932P023Q798R634J0313J1675J3328J4372J4759J5190J5926
53400G80963J6546J6855J7340J8528K0253K1852K2891K3527K4263K5358K6523
53389A014899K7319K7803K8571K9954L1477L2313L2156L1386L0551K9923K9448
53378A345800K8806K7641K5980K4311K3040K1955K0549J8709J6709J4564J1908
53367A579972Q640N297K447Pk498n174p680r870j2110j4696j7336j9559k1414
53354A486026k3302k5176k6434k6775k6709k6857k7209k7424k7498k7568k7278
53343A193796k6087k4172k2427k1404k0845k0366k0003j9827j9604j9161j8688
$$ plain form
53429 643338 638758 635025 632457 631153 630724 630698 630821 630868 630592 630128 630147 631357 633990 637847 642457 647093 651164
53412 651164 655013 659945 666968 675766 685400 695713 707388 720716 735088 749847 765037 780963
53400 780963 797509 814364 831704 850232 870485 892337 915228 938755 963018 988376 1014899
53389 1014899 1042218 1070021 1098592 1128546 1160023 1192336 1224492 1255878 1286429 1316352 1345800
53378 1345800 1374606 1402247 1428227 1452538 1475578 1497533 1518082 1536791 1553500 1568064 1579972
53367 1579972 1588612 1593909 1596356 1596363 1593865 1588691 1581011 1571141 1559031 1544335 1526999 1507440 1486026
53354 1486026 1462724 1437548 1411114 1384339 1357630 1330773 1303564 1276140 1248642 1221074 1193796
53343 1193796 1167709 1143537 1121110 1099706 1078861 1058495 1038492 1018665 999061 979900 961212
53332I61212j8290j7726j6924j6310j6167j6009j5058j3163j0820q632p027o267
53320G98819o188o192n918n697n929o367o501o386o488o862p121p028o542n422
53306G10178l561j657p78r81j078q3J603K830L066K772K713L288M347N473O437
53291G34569P442Q783J0370J1795J2819J3448J3623J3365J3108J3334J3770J3571
53279H79997J2486J1226J0406R783Q878P777O694N341L423J412N6p06j555k636
53265I52582l361l537l880n016o599p844q609r377j0409j1435j2200j2816j3429
53252H44070j3908j4135j4360j4912j5640j6030j5901j5630j5480j5078j3920
53241F79076j2259j0988j0619j0792j0849j0518r858r008q199p785p873q156q307
$$ plain form
53332 961212 942922 925196 908272 891962 875795 859786 844728 831565 820745 812113 805086 798819
53320 798819 792631 786439 780521 774824 768895 762528 756027 749641 743153 736291 729170 722142 715600 710178
53306 710178 706617 704960 704182 703201 702123 702040 703643 706473 709539 712311 715024 718312 722659 728132 734569
53291 734569 742011 750794 761164 772959 785778 799226 812849 826214 839322 852656 866426 879997
53279 879997 892483 903709 914115 923898 932776 940553 947247 952588 956011 957423 957479 956773 955218 952582
53265 952582 949221 945684 941804 936788 930189 922345 913736 904359 893950 882515 870315 857499 844070
53252 844070 830162 816027 801667 786755 771115 755085 739184 723554 708074 692996 679076
53241 679076 666817 655829 645210 634418 623569 613051 603193 594185 585986 578201 570328 562172 553865
53228E53865q340q290p831o714n443m903n229n533n001l888l085k991l212l370
53214D80035l657m470n652o477o402n665n085n261o035o699o715o185n679n634
53200D00419n955o233o237o095n987n860n609n345n289n362n185m617m072m104
53186C24469m716n308n378n066m859m889m734m022k987k252k131k377k621k734
53172B70395k708k456j970j506j310j314j336j434j778k244k481k350k090j987
53158B43431k173k661l316l726l465k635j843j572j739j980k046j868j423q36
53144B12148m15m40r47j763k584l083l073k657k069j414p70m12o01j168j700k106
53128A86946k595l073l167k871k625k546k220j550j160j442j871j819j523j522
$$ plain form
53228 553865 545525 537235 529404 522690 517247 512344 507115 501582 496581 492693 489608 486617 483405 480035
53214 480035 476378 471908 466256 459779 453377 447712 442627 437366 431331 424632 417917 411732 406053 400419
53200 400419 394464 388231 381994 375899 369912 364052 358443 353098 347809 342447 337262 332645 328573 324469
53186 324469 319753 314445 309067 304001 299142 294253 289519 285497 282510 280258 278127 275750 273129 270395
53172 270395 267687 265231 263261 261755 260445 259131 257795 256361 254583 252339 249858 247508 245418 243431
53158 243431 241258 238597 235281 231555 228090 225455 223612 222040 220301 218321 216275 214407 212984 212148
53144 212148 211733 211293 210346 208583 205999 202916 199843 197186 195117 193703 192933 192521 191920 190752 189052 186946
53128 186946 184351 181278 178111 175240 172615 170069 167849 166299 165139 163697 161826 160007 158484 156962
53114A56962j631j353r53j161j907k332k142j966k172k155j386m13k04r23j808
53099A34456k124j746j027m72l70n20m51q3O7l85j087j384j134o89k20M34J214
53082A24479J590J143J28p58j168j342j534j512r42j30J66k19m61J67J153J355
53066A22115N49k66j84N71J205J365J214R82P84P19P40O37L58J94L85P59J042
53049A33169J194J180P68n8p41p32l07k59q60j613k041k267k586k931k946k489
53033A16481j778j232j146j448j733j671j370j247j491j872k003j631p94J23N46
53018I7734J94o10j274j544j532j340r64n38k44j8L10N98N52L05K96M88L12l49
53000I2376p67m46K0j72p25o58J44P09M11j95l14K8L67O60J124J536J407P52P1
$$ plain form
53114 156962 155331 153978 153025 151864 149957 147625 145483 143517 141345 139190 137804 137391 137187 136264 134456
53099 134456 132332 130586 129559 129087 128717 128197 127746 127663 127730 127345 126258 124874 123740 123051 122831 123265 124479
53082 124479 126069 127212 127340 126582 125414 124072 122538 121026 120084 119954 120120 119901 119440 119607 120760 122115
53066 122115 122664 122398 122214 122785 123990 125355 126569 127551 128335 129054 129794 130431 130789 130983 131368 132127 133169
53049 133169 134363 135543 136311 136253 135512 134780 134473 134214 133354 131741 129700 127433 124847 121916 118970 116481
53033 116481 114703 113471 112325 110877 109144 107473 106103 104856 103365 101493 99490 97859 97065 97188 97734
53018 97734 97928 97318 96044 94500 92968 91628 90664 90126 89882 89864 90174 90772 91324 91629 91925 92413 92725 92376
53000 92376 91609 91163 91183 91011 90286 89628 89772 90481 90892 90697 90383 90411 90778 91438 92562 94098 95505 96257 96328
52981I6328m33j016j610j573o15N36Q89M35J4R5L34L70M24P47J033Q04R7o43j139
52962I5077j320j034k34O73J170J298J475J616J125o9j092j098k68N83R96J019
52946I9917P23J41m02m73o1M30P21Q15P35M85L16N86J199J588J360O84q3p67j216
52927A06698j169n52K67Q17R44P78N16M38Q63J725K334K015R59J11R4N19O13K72
52909A18242K00R40K081K697K446J918J805K059K118J758J315J155J298J543J568
52894A43143J010j48j155j118k08L20k84j224j324p23o10j465k467k683k129j388
52878A27547q26n54o40r57j050n99J91Q54J100Q35J05p56j197j038p18o92q12
52861A20793o59k40Q4J79J98J20k28o63o43L1R04J437J554J459J224Q62N01K35
$$ plain form
52981 96328 95895 94879 93269 91696 91081 91617 92506 92941 92955 93050 93384 93754 94178 94925 95958 96762 96859 96216 95077
52962 95077 93757 92723 92489 93162 94332 95630 97105 98721 99846 99777 98685 97587 97319 97902 98898 99917
52946 99917 100640 100781 100379 99906 99845 100275 100996 101811 102546 103031 103347 103933 105132 106720 108080 108764 108681 107914 106698
52927 106698 105529 104977 105244 106061 107005 107783 108299 108737 109600 111325 113659 115674 116633 116744 116838 117357 117970 118242
52909 118242 118442 119382 121463 124160 126606 128524 130329 132388 134506 136264 137579 138734 140032 141575 143143
52894 143143 144153 144005 142850 141732 141524 141844 141560 140336 139012 138289 137679 136214 133747 131064 128935 127547
52878 127547 126721 126167 125527 124570 123520 122921 123112 123966 125066 125901 126006 125250 124053 123015 122297 121605 120793
52861 120793 120134 119894 119978 120157 120355 120475 120247 119584 118941 118972 119876 121313 122867 124326 125550 126412 126913 127148
52843A27148n7m20o08m67l75p88j431j453n89L14L00m75j017p80j88Q9j28p26
52825A18349j640k622l042k448j229k28K48N45Q33P65J62n15p81q03j026j408
52809A05160j528j298j051r42p78m67k22k02k92l40l27k52q2P8R8J12L31N07R3
52790I8598q19j309o76O12J501J543J121P26N51O23Q12Q00M71K55O03J156J043
52773A07611K5j233k114k648k931k684j865j169j245j792j992j626j162q72n97
52758H3706l44m34r60j549j918k149k301k209j881j597j354p02M61J340J084j53
52742F9040j457k282k648k490j583k44O06M51j87n07m43n31j004j452j357o89
52726E3223J13N63N61M19M44N26L29j38m79n15n12o44n60P8R54J409J233P08N1
$$ plain form
52843 127148 127091 126671 126063 125596 125221 124433 123002 121549 120960 121274 121574 121099 120082 119302 119114 119203 119075 118349
52825 118349 116709 114087 111045 108597 107368 107140 107388 107933 108766 109531 109693 109178 108397 107594 106568 105160
52809 105160 103632 102334 101283 100341 99563 99096 98874 98672 98380 98040 97713 97461 97379 97457 97555 97667 97998 98505 98598
52790 98598 97779 96470 95794 96406 97907 99450 100571 101297 101848 102471 103283 104083 104554 104809 105412 106568 107611
52773 107611 107636 106403 104289 101641 98710 96026 94161 92992 91747 89955 87963 86337 85175 84303 83706
52758 83706 83362 82928 81968 80419 78501 76352 74051 71842 69961 68364 67010 66308 66769 68109 69193 69040
52742 69040 67583 65301 62653 60163 58580 58336 58942 59393 59206 58699 58256 57725 56721 55269 53912 53223
52726 53223 53336 53899 54460 54879 55323 55849 56178 56040 55561 55046 54534 53890 53330 53408 54362 55771 57004 57712 57763
52707E7763o76j189j080m31J37J86j44m92o58n29p5L83L44j89n88l97Q8L64L49
52688E3166J94j66p53j186j094o18o1O75J697K394K000Q26J20M40Q85M06p82j609
52670E6534j565j066n69o0M99P26K23o98j104m38P19J214O82q8l05k47o23j242
52652E2592j195l51L35K62P9N61J378J757J768J991K223J622K13p42k97R85J855
52635F5036J879J588J477J415J063M58K2J13O36J140J242R29M21n5k73l2M96P02
52617G8257J10r71j763j931j777j637j513j462j732k255k367j504RJ176J311O48
52601F2599M2J81R65J591J380N61j4P7L71K50k61o68p32n90l79p2L19O69R03J056
52581F8248J140J063P75L90J69L02O84R48Q44N21K87J96J09K6Q4K21K23Q7j2j04
$$ plain form
52707 57763 57087 55898 54818 54387 54524 54710 54566 54074 53416 52887 52812 53195 53539 53350 52762 52365 52453 52817 53166
52688 53166 53360 53194 52441 51255 50161 49543 49482 50157 51854 54248 56248 57074 57194 57634 58519 58925 58143 56534
52670 56534 54969 53903 53334 53274 53773 54499 54722 54024 52920 52482 53201 54415 55097 55009 54704 54457 53834 52592
52652 52592 51397 51046 51381 51643 51722 52283 53661 55418 57186 59177 61400 63022 63235 62493 62196 63181 65036
52635 65036 66915 68503 69980 71395 72458 72916 72938 73051 73687 74827 76069 76998 77419 77364 77091 77059 77555 78257
52617 78257 78367 77396 75633 73702 71925 70288 68775 67313 65581 63326 60959 59455 59464 60640 61951 62599
52601 62599 62641 62822 63787 65378 66758 67319 67305 67382 67753 68003 67742 67074 66342 65752 65373 65301 65620 66289 67192 68248
52581 68248 69388 70451 71226 71616 71785 72087 72771 73719 74563 75084 75371 75567 75676 75702 75786 76007 76230 76317 76305 76201
52561G6201l49n58k75N25J302J623J499R87J08o76o21K12P64M04j30J14Q56J174
52543H3160R79R22J148J154Q34O60Q22J027J198J523J777J413N30r8j15M7Q6J93
52525I7260K80k61j472k320j881m82Q57J562J602J061K48k05k0L41M25M75P59
52508I8229P65r8j344j890j499r39p61p46o38o05p19o64k95Lj13m13m51j48K59
52489H7933O26Q99R19O15K48K52O28Q29L73n23j107r12k62K25M27P49J399J990
52471I5308K017J449P21L13M90J147J820K004J666J207Q65M82j0k86j67o2m29
52454A08535j093j471j302p62o7N68Q29N81J68k2j07m19q22q47m11J23M96O70
52436A04647M84k04r95j192o65M1M97O92N55j12r74j193n22K23K80nJ59P46R79
$$ plain form
52561 76201 75852 75294 75019 75544 76846 78469 79968 80955 81063 80387 79766 79978 80742 81146 81016 81130 81986 83160
52543 83160 84139 85061 86209 87363 88197 88857 89679 90706 91904 93427 95204 96617 97147 97049 96934 96981 97067 97260
52525 97260 97540 97279 95807 93487 91606 91124 91981 93543 95145 96206 96454 96249 96229 96570 96995 97470 98229
52508 98229 98994 98896 97552 95662 94163 93224 92463 91717 91079 90474 89755 89091 88796 88799 88686 88273 87822 87674 87933
52489 87933 88559 89458 90377 90992 91240 91492 92120 92949 93322 92799 91692 90780 90518 90743 91170 91919 93318 95308
52471 95308 97325 98774 99495 99808 100298 101445 103265 105269 106935 108142 109007 109489 109479 109193 109026 108964 108535
52454 108535 107442 105971 104669 103907 103840 104408 105237 105818 105986 105964 105857 105438 104616 103769 103358 103481 103977 104647
52436 104647 105131 104927 103932 102740 102075 102116 102613 103305 103860 103748 102774 101581 101059 101282 101562 101557 101716 102462 103441
52417A03441N08j65n10o01p87j066j091o21J82Q56J026P32L86L73P46J250J594
52400A06253J659J544J430J358J140O60J57J9L08O39O46L02j35l36k3P96J667
52383A18084K036J839J485J269J035N92O4k75l14n1M77J128J705K250K985L830
52367A38139M274L945L082K248J796J762K005K205K031J571J351J669K138K171
52353A70387J697J143Q30P72Q75J090J387J766K163K280J789R11M68R96K096K909
52337A93559L042K676K107J664J762K495L282L449L093K883L114L524L997M818
52323B35465O049P239P989Q378Q671R011R577J0572J1775J2513J2451J2099J2136
52310C63925J2544J2790J2684J2561J2639J2652J2271J1587J0990J0665J0434
$$ plain form
52417 103441 103949 103784 103274 102673 101886 100820 99729 99108 99290 100146 101172 101904 102290 102663 103409 104659 106253
52400 106253 107912 109456 110886 112244 113384 114044 114201 114220 114528 115167 115813 116115 115980 115644 115621 116417 118084
52383 118084 120120 121959 123444 124713 125748 126340 126404 126129 125815 125764 126241 127369 129074 131324 134309 138139
52367 138139 142413 146358 149440 151688 153484 155246 157251 159456 161487 163058 164409 166078 168216 170387
52353 170387 172084 173227 174057 174829 175704 176794 178181 179947 182110 184390 186179 187090 187558 188554 190650 193559
52337 193559 196601 199277 201384 203048 204810 207305 210587 214036 217129 220012 223126 226650 230647 235465
52323 235465 241514 248753 256742 265120 273791 282802 292379 302951 314726 327239 339690 351789 363925
52310 363925 376469 389259 401943 414504 427143 439795 452066 463653 474643 485308 495742
52299D95742J0028R428Q846Q464Q288Q227Q130P705O674N134L605K436J391P6
52285E84174j343k189k140j632j414j847k667l232l086k507k356k966l411k470
52271E50914l47J375J701J398J784K998M192M990N861P106Q267Q732Q527Q245
52257F15743Q460R244J0116J0476J0271J0065J0201J0179R295P749O454N863N504
52244G29620M835L872K765J371l03j716k367k491k748l370m110m858n790o926
52230G07784p931q500q598q297p675o986o610o601o507n838m714l783l562l903
52216F18279m108l598k427j197m85l59m84m92k05M24J333K331L175L680L719L251
52200F22837K498J951J900K041J813J123M42J22K0j24k67k48j10j4j6j58n78j290
$$ plain form
52299 495742 505770 515198 524044 532508 540796 549023 557153 564858 571532 576666 580271 582707 584098 584174
52285 584174 582831 580642 578502 576870 575456 573609 570942 567710 564624 562117 559761 556795 553384 550914
52271 550914 550567 551942 553643 555041 556825 559823 564015 569005 574866 581972 590239 598971 607498 615743
52257 615743 624203 633447 643563 654039 664310 674375 684576 694755 704050 711799 718253 724116 729620
52244 729620 734455 738327 741092 742463 742160 740444 738077 735586 732838 729468 725358 720500 714710 707784
52230 707784 699853 691353 682755 674458 666783 659797 653187 646586 640079 634241 629527 625744 622182 618279
52216 618279 614171 610573 608146 606949 606464 606105 605621 605129 604924 605348 606681 609012 612187 615867 619586 622837
52200 622837 625335 627286 629186 631227 633040 634163 634605 634727 634747 634623 634356 634108 633998 633984 633968 633810 633232 631942
52182F31942k076k766l417l947l959l310k625k637l173l326k724k033k006k522
52168E91421k955l077l161l366l460l268k955k763k557j943r00j05l29j454k463
52153E56665k611k287k287k537k233j209m18o77j582k126j950j456j012o84o59
52138E32937j189k053k509k085j119l97l45o51o19J65J438K541L157L546M047
52123E36864M621N181N967P174Q429R171R462R870J0516J0913J0894J1052J1875
52110F51989J2975J3689J4025J4428J4889J4894J4317J3698J3435J3169J2254
52099H03762J0588Q673P004N732M782L998L090J783J86j224k228l209m562n868
52085H32507o257n665n137n540o448o852o570o282o299o172n553m696l840k762
$$ plain form
52182 631942 629866 627100 623683 619736 615777 612467 609842 607205 604032 600706 597982 595949 593943 591421
52168 591421 588466 585389 582228 578862 575402 572134 569179 566416 563859 561916 561016 560911 560582 559128 556665
52153 556665 554054 551767 549480 546943 544710 543501 543083 542406 540824 538698 536748 535292 534280 533596 532937
52138 532937 531748 529695 527186 525101 523982 523585 523240 522589 521970 522135 523573 526114 529271 532817 536864
52123 536864 541485 546666 552633 559807 568236 577407 586869 596739 607255 618168 629062 640114 651989
52110 651989 664964 678653 692678 707106 721995 736889 751206 764904 778339 791508 803762
52099 803762 814350 823023 830027 835759 840541 844539 847629 849412 849598 848374 846146 842937 838375 832507
52085 832507 826250 820585 815448 809908 803460 796608 790038 783756 777457 771285 765732 761036 757196 754434
52071G54434j376j60N69J279K514L936M818N172N678O509P117P251P341P638P718
52056H20438P301O910P113P511P234O162N061M428L854K610N46j837l816m870
52042H68645m958m644m723n541o727p759q596r576j0816j1877j2236j1918j1576
52029G57698j1834j2637j3354j3452j2940j2122j1217j0417j0030j0232j0750
52018F28713j1110j1184j1215j1340j1342j0994j0363r692r210r088r322r661
52006E04192r849r995j0315j0602j0413r892r792j0397j0973j0797j0213j0091
51994C80863j0565j0963j0886j0625j0502j0392j0026r338q441p556p012o926
51982B67631o968o783o539o563o581n935m586l239k415k066k184k992m214m901
$$ plain form
52071 754434 753058 752898 753467 754746 757260 761196 766014 771186 776864 783373 790490 797741 805082 812720 820438
52056 820438 827739 834649 841762 849273 856507 862669 867730 872158 876012 878622 879168 877331 873515 868645
52042 868645 863687 859043 854320 848779 842052 834293 825697 816121 805305 793428 781192 769274 757698
52029 757698 745864 733227 719873 706421 693481 681359 670142 659725 649695 639463 628713
52018 628713 617603 606419 595204 583864 572522 561528 551165 541473 532263 523175 513853 504192
52006 504192 494343 484348 474033 463431 453018 443126 433334 422937 411964 401167 390954 380863
51994 380863 370298 359335 348449 337824 327322 316930 306904 297566 289125 281569 274557 267631
51982 267631 260663 253880 247341 240778 234197 228262 223676 220437 218022 215956 213772 210780 206566 201665
51968B01665m517l605k947k548k031j463j188j216j369j693k153k262j646o97
51954A72330j40j57m61r31j509j778j420q74p74r35o67LL63K50J97K79j77j289
51936A62310k017j532m18J25j74p03j014j143j104q09m39k88l24k71j48k75p51
51919A51025j264j464j239p04j28J36r6o37j157j490j602j384q36k86j49m38p99
51902A37488j050j324j642j657j131m54k80o44p75m9J124J698J252L94j74m71
51886A32305p92r25m75K36L78k41q41p48k21J10J26J85M78Q97J299J607J738J728
51868A36844J740J779J641J237P83M68K65K02M18P63P37K28j87q5N5m67j426j827
51850A43168j163N2R03Q04k20j437j701n13J189J878J185K32J10O67J090J084
$$ plain form
51968 201665 197148 193543 190596 188048 186017 184554 183366 182150 180781 179088 176935 174673 173027 172330
51954 172330 172190 172033 171572 170641 169132 167354 165934 165060 164286 163351 162684 162687 163050 163300 163497 163776 163599 162310
51936 162310 160293 158761 158343 158468 158294 157591 156577 155434 154330 153521 153082 152794 152470 152199 152051 151776 151025
51919 151025 149761 148297 147058 146354 146226 146362 146266 145629 144472 142982 141380 139996 139160 138874 138725 138287 137488
51902 137488 136438 135114 133472 131815 130684 130230 129950 129306 128531 128482 129606 131304 132556 132950 132776 132305
51886 132305 131513 130588 130113 130349 130727 130486 129645 128897 128676 128786 128912 129097 129575 130472 131771 133378 135116 136844
51868 136844 138584 140363 142004 143241 144024 144492 144757 144959 145377 146140 146877 147105 146918 146833 146888 146421 144995 143168
51850 143168 142005 142057 142960 143764 143544 142107 140406 139893 141082 142960 144145 144377 144487 145154 146244 147328
51834A47328R80J057J242J401J514J581J550J333Q48J19o37j136j272j076o12
51819A54220q9k2p60j866k396k005j349j102j069o35K00Q22Q71N73K03k36o95
51802A44665q80o04j02K99O21J062J445J281M53m31o57k43J25k9m39n39j44M78
51784A46361J001J293J314J069O51J81k46n07m28j0M74Q01J156J840K730L344
51768A61024L443L217K909K565K285K289K520K483J740M09r77j939k262j942j240
51753A76524o43n03p99j270j638j632j014J26J256J780J574J019O16O24Q79R22
51737A77821M95l7m4M68P04J41p20j107j155j592k428k769k114j116o55o84m91
51720A64717J73Q02Q40K20p77j777k425k483j985j129k3J239K310K668K199J485
$$ plain form
51834 147328 148308 149365 150607 152008 153522 155103 156653 157986 158834 158953 158316 157180 155908 154832 154220
51819 154220 154131 154109 153349 151483 149087 147082 145733 144631 143562 142927 143127 143949 144820 145393 145596 145360 144665
51802 144665 143785 143181 143079 143378 143999 145061 146506 147787 148240 147809 147152 146909 147034 147005 146566 146027 145883 146361
51784 146361 147362 148655 149969 151038 151689 151870 151624 151117 150689 150679 151153 151954 153110 154950 157680 161024
51768 161024 164467 167684 170593 173158 175443 177732 180252 182735 184475 184884 183907 181968 179706 177764 176524
51753 176524 175881 175378 174579 173309 171671 170039 169025 169151 170407 172187 173761 174780 175396 176020 176899 177821
51737 177821 178316 178279 178235 178703 179407 179548 178828 177721 176566 174974 172546 169777 167663 166547 165892 165208 164717
51720 164717 164890 165692 166532 166752 165975 164198 161773 159290 157305 156176 156153 157392 159702 162370 164569 166054
51704A66054J232J453J438O68l89o63K81J677K390K187J832K003K513K781K631
51689A88088K324K125K227K841L820M363L700K151Q73L94L2q98j986k458k463
51674B05133k816l611m017l499k581k035j973k007j957j904j885j888j978k124
51660A70858k091j746j297r69p06n12p32j549k344k171r41L72P84K64n44j134
51644A55542j396j384j163q71o50n38m72m73o76j165j750j955j394k08Q54J052
51628A43353L21p37j467j627j323q00l16m2P4K05L75M35L81M17O30P72O26M07
51610A41684N36J061J533J569J370J482K166L046L550L528L321L200L022K580
51596A73648K087J978K331K779L026L084K922K241R10o30j706k036j845j480j156
$$ plain form
51704 166054 167286 168739 170177 170845 170456 169793 170074 171751 174141 176328 178160 180163 182676 185457 188088
51689 188088 190412 192537 194764 197605 201425 205788 209488 211639 212512 212906 212938 212040 210054 207596 205133
51674 205133 202317 198706 194689 191190 188609 186574 184601 182594 180637 178733 176848 174960 172982 170858
51660 170858 168767 167021 165724 164755 164049 163537 162805 161256 158912 156741 155800 156172 156956 157220 156676 155542
51644 155542 154146 152762 151599 150728 150078 149540 149068 148595 147919 146754 145004 143049 141655 141447 142301 143353
51628 143353 143674 142937 141470 139843 138520 137720 137404 137362 137436 137641 138016 138451 138832 139249 139879 140651 141277 141684
51610 141684 142220 143281 144814 146383 147753 149235 151401 154447 157997 161525 164846 168046 171068 173648
51596 173648 175735 177713 180044 182823 185849 188933 191855 194096 195006 194376 192670 190634 188789 187309 186153
51581A86153j010j055j095r55p61q25j157j333r59j22P30J255J492J701K086K609
51565A86754L013L044K667K102J645J476J571J771J832J521P63k35j068j382j190
51550B04284q43o81o82n10L3P36J219J359J337J356J443J511J463J223P96L70
51534B14414J54P3k09q02j340j430j249j356j949k684l181l408l411l097k574
51519A87951k287k441k568k165j525j355j646j664j120o24o07n52J14R05Q15k40
51503A70991j231j245l33Q48J626J517N12n81o75M00J612J946J577J395J778K277
51487A82414K452K457K707L223L545L184K184J201R23J407K153K842L646M609
51473B18947N094M374K692J250R51J447J604P49p71k117k805k931k770k372j661
$$ plain form
51581 186153 185143 184088 182993 182038 181277 180452 179295 177962 177003 176881 177611 178866 180358 182059 184145 186754
51565 186754 189767 192811 195478 197580 199225 200701 202272 204043 205875 207396 208159 207924 206856 205474 204284
51550 204284 203441 202760 202078 201568 201601 202337 203556 204915 206252 207608 209051 210562 212025 213248 214044 214414
51534 214414 214568 214641 214432 213630 212290 210860 209611 208255 206306 203622 200441 197033 193622 190525 187951
51519 187951 185664 183223 180655 178490 176965 175610 173964 172300 171180 170556 169949 169397 169511 170416 171231 170991
51503 170991 169760 168515 168182 169030 170656 172173 172685 172104 171429 171829 173441 175387 176964 178359 180137 182414
51487 182414 184866 187323 190030 193253 196798 199982 202166 203367 204290 205697 207850 210692 214338 218947
51473 218947 224041 228415 231107 232357 233308 234755 236359 237108 236337 234220 231415 228484 225714 223342 221681
51458B21681q26l17l48n54l94J66N67L65k13n71m92l90p46j554k412l028l413
51441B07521l605l483l053k672k749l262l744l771l310k604j900j340r48o08j67
51426A70305M11R83J326J250O96q4n35k08P59J762K339K531K575K524K213J514
51410A90361M76o35j410j629j528j588j956k386k783l382m142m422l726k556j980
51395A56714k421l299l917m130m014l474k545j735j521j677j548r31l05j42l95
51380A24660p89j203j523j493j082p89j110j769j950j341n09r5p7o8N5J51J91
51363A11259K42K44J07j27l85o40o55p4Q64J163K32j055j283l61L70K9p37r20
51345A08273n37k57k33m2N35J311K126K932L474L419K816K187J987K192K420K386
$$ plain form
51458 221681 220855 220538 220190 219636 219242 219408 219975 220340 220127 219556 219064 218674 217928 216374 213962 210934 207521
51441 207521 203916 200433 197380 194708 191959 188697 184953 181182 177872 175268 173368 172028 171080 170472 170305
51426 170305 170716 171699 173025 174275 174971 174887 174352 174144 174903 176665 179004 181535 184110 186634 188847 190361
51410 190361 190837 190202 188792 187163 185635 184047 182091 179705 176922 173540 169398 164976 161250 158694 156714
51395 156714 154293 150994 147077 142947 138933 135459 132914 131179 129658 127981 126433 125502 125197 125055 124660
51380 124660 123871 122668 121145 119652 118570 117781 116671 114902 112952 111611 111102 111007 110930 110862 110917 111068 111259
51363 111259 111501 111745 111852 111725 111340 110700 110045 109971 110835 111998 112230 111175 109892 109531 109901 109930 109193 108273
51345 108273 107736 107479 107246 107204 107739 109050 111176 114108 117582 121001 123817 126004 127991 130183 132603 134989
51329A34989K180K084K046J589N25m37m21L08N15l24j336j612j521j925k739l155
51313A30766k895k402k017j779j900k543l219l186k580k238k404k378j757j114
51299I8354j036j207r67l45J03J05j21k78k28L6L33L70J10j39j70j64l15m44k52
51280I3745K06N84O08K79j80l89j10M08N98K94l8M0L47M10J32k22m75o88r30j156
51260I3463j279j163p16j06K62J75j08k40k12k54n09r53j396j420o29P51J820
51243H7486J933J398R63Q96R58R90R75P25J09n43q14q61j048j053j71J373K264
51226I5580J673K70p66j109j081p33L2P41O66j86j001j150o53J87J044J414R93
51209I5921L02K97J052J565J129K39l10m80n50l09M16R29L96p43j188n90P4O6
$$ plain form
51329 134989 137169 139253 141299 142888 143413 142976 142555 142863 143378 143054 141718 140106 138585 136660 133921 130766
51313 130766 127871 125469 123452 121673 119773 117230 114011 110825 108245 106007 103603 101225 99468 98354
51299 98354 97318 96111 95144 94799 94902 95007 94886 94608 94380 94416 94749 95119 95229 95090 94920 94756 94441 93997 93745
51280 93745 93951 94535 95143 95422 95242 94853 94743 95151 95749 96043 96005 96045 96392 96802 96934 96712 96237 95549 94619 93463
51260 93463 92184 91021 90305 90199 90461 90636 90528 90288 90076 89822 89313 88360 86964 85544 84915 85666 87486
51243 87486 89419 90817 91780 92676 93634 94624 95599 96324 96433 95890 95076 94215 93167 92114 91943 93316 95580
51226 95580 97253 97523 96757 95648 94567 93834 93866 94607 95273 95087 94086 92936 92283 92470 93514 94928 95921
51209 95921 96223 96520 97572 99137 100266 100505 100195 99715 99165 98856 99272 100201 100597 99854 98666 98076 98150 98216
51191I8216j49L3L78M56M63O68O69K3p90r48m85j22j17j75l41j013j965k286j611
51172I0904o88m03q18j427j836j778j070L5Q16Q48M88K19n2o28j275j462j124
51155H0749o74l26J27Q39J575J918J692J069N10M31P57R78Q07N60O51R28R32O18
51137I4141L52J69l78j479k539k731j906p48q7k11p27j013q52o15p33j003p12
51120G8928M00J532J543K31j363k096j794j036j78Q64J956K419J791N60k95l46
51104H3116R2O33J172J608J730J531J223Q02L9r26j398q54M03J638K382K463J810
51087I7464O45l34m99mM33L96J42J83P62J640K178J813P47k0K43J124J646J491
51069A10050J156R73O97J28m32o18n23m79n87o54m56L0M87M15k92r98r65l12J28
$$ plain form
51191 98216 98067 98100 98478 98934 99397 100065 100734 100757 99967 99019 98534 98412 98295 98120 97779 96766 94801 92515 90904
51172 90904 90216 89813 88995 87568 85732 83954 82884 82919 83735 84583 85071 85290 85238 84610 83335 81873 80749
51155 80749 80075 79749 79876 80715 82290 84208 85900 86969 87479 87910 88667 89645 90452 91012 91663 92591 93523 94141
51137 94141 94493 94662 94284 92805 90266 87535 85629 84881 84794 84583 83856 82843 81991 81376 80643 79640 78928
51120 78928 79328 80860 82403 82634 81271 79175 77381 76345 76167 77031 78987 81406 83197 83757 83462 83116
51104 83116 83208 83841 85013 86621 88351 89882 91105 91907 91946 91020 89622 88768 89171 90809 93191 95654 97464
51087 97464 98109 97775 97276 97272 97705 98101 98243 98426 99188 100828 103006 104819 105566 105546 105789 106913 108559 110050
51069 110050 111206 112179 112876 113004 112572 111954 111431 110952 110365 109711 109255 109285 109772 110187 109895 108897 107932 107620 107748
51050A07748k3k37l7K26n2p86j347j380j034n64j18J83L26M85P44Q69O54L46L54
51031A06357O21O85L43r3k71k04j17j03r7lJ90M12O08R03J473K167K474K132J576
51012A19053J436J732J975J971K094K633L385L941M119L906L392K882K781L125
50998A58425L497L634L772M240M948N630O222O744P037P032P054P503Q311R171
50984B43220J0079J1274J2740J4204J5694J7601K0072K2788K5400K7838L0041
50973D50951L1827L3282L4952L7288M0043M2467M3944M4324M3824M2793M1475
50962H87170L9851L7742L5033L1646K7432K2472J7507J3449J0264O868K632j495
50950A130571l927m290l673l189k954k532j802j092q46j433k992n277p805j0300
$$ plain form
51050 107748 107725 107488 107451 107677 107625 106839 105492 104112 103078 102514 102396 102579 102905 103390 104134 105003 105657 106003 106357
51031 106357 106978 107663 108006 107913 107642 107438 107321 107218 107121 107118 107308 107720 108328 109231 110704 112871 115345 117477 119053
51012 119053 120489 122221 124196 126167 128261 130894 134279 138220 142339 146245 149637 152519 155300 158425
50998 158425 161922 165556 169328 173568 178516 184146 190368 197112 204149 211181 218235 225738 234049 243220
50984 243220 253299 264573 277313 291517 307211 324812 344884 367672 393072 420910 450951
50973 450951 482778 516060 551012 588300 628343 670810 714754 759078 802902 845695 887170
50962 887170 927021 964763 999796 1031442 1058874 1081346 1098853 1112302 1122566 1129434 1132066 1130571
50950 1130571 1126644 1122354 1118681 1115492 1112538 1110006 1108204 1107112 1106266 1104833 1101841 1096564 1088759 1078459
50936A078459j2877j5737j8931k2411k6150l0020l3758l7091l9778m1502m1951
50925G58253m1131l9474l7556l5757l4169l2654l0958k8898k6453k3716k0834
50914D06653j8046j5586j3451j1467r731q566p807o621m585k540j627j737j779
50901C03110j361j136j361j271m30K90n3r38j040l1J182J867K236K797L591M284
50885C11736M539M265L796L800M639N902O876P416P894Q501R148R922J1046J2295
50871D11775J3094J3416J4064J5743J8272K1016K3784K6894L0645L5040L9924
50860F63667M5060N0150N5048O0021O5484P1428P7265Q2433Q6966R1320R5569
50849A444411R9064J00958J00885R8857R4731Q8168P9201O8457N6645M4186L1532
$$ plain form
50936 1078459 1065582 1049845 1030914 1008503 982353 952333 918575 881484 841706 800204 758253
50925 758253 717122 677648 640092 604335 570166 537512 506554 477656 451203 427487 406653
50914 406653 388607 373021 359570 348103 338372 329806 321999 315378 310793 308253 306626 304889 303110
50901 303110 301749 300613 299252 297981 297551 297841 297788 296850 295810 295779 296961 298828 301064 303861 307452 311736
50885 311736 316275 320540 324336 328136 332775 338677 345553 352969 360863 369364 378512 388434 399480 411775
50871 411775 424869 438285 452349 468092 486364 507380 531164 558058 588703 623743 663667
50860 663667 708727 758877 813925 873946 939430 1010858 1088123 1170556 1257522 1348842 1444411
50849 1444411 1543475 1644433 1745318 1844175 1938906 2027074 2106275 2174732 2231377 2275563 2307095
50838B307095J9438Q610p10q488j4438j8124j9387j8394j5483j1209o406j819
50826B220685K109M888N724M053J20n522j2781k1858l2367m3341n4119o4653p4788
50813A928150q3870r1213r6507r9527r9947r7782r3699q8621q3118p7306p1084
50802I45476o4379n7390n0642m4541l8906l3323k7918k3270j9532j6241j3126
50791E56208j0567q911p901p173o815o970p191o794n702m522l914m126m944n734
50777D64944n756m874l858l642m324n175n525n276m673l951l248k595j922j259
50763D08866p99o04k99O04K083L599M726N607O745Q454J0533J2386J3615J4568
50749D90084J6073J8439K0955K2774K4121K6139K9499L3657L7635M1111M4406
$$ plain form
50838 2307095 2326533 2335143 2334433 2325945 2311507 2293383 2273996 2255602 2240119 2228910 2222504 2220685
50826 2220685 2222794 2227682 2233406 2237459 2237579 2232057 2219276 2197418 2165051 2121710 2067591 2002938 1928150
50813 1928150 1844280 1753067 1656560 1557033 1457086 1359304 1265605 1176984 1093866 1016560 945476
50802 945476 881097 823707 773065 728524 689618 656295 628377 605107 585575 569334 556208
50791 556208 545641 536730 528829 521656 514841 507871 500680 493886 488184 483662 479748 475622 470678 464944
50777 464944 459188 454314 450456 446814 442490 437315 431790 426514 421841 417890 414642 412047 410125 408866
50763 408866 408067 407463 407164 407768 409851 413450 418176 423783 430528 438982 449515 461901 475516 490084
50749 490084 506157 524596 545551 568325 592446 618585 648084 681741 719376 760487 804893
50738H04893M7726N0826N3384N5334N6723N7482N7462N6582N4771N1889M7794
50727A394866M2479L6019K8450J9915J0975K443n248j2285j8763k3949k6721k6796
50715A421385k5026k2350j8849j4108q280k448K051M464M841L683J341k279p414
50702A337011j3955k1351k8995l6456m3333m9152n3490n6090n6870n6028n4091
50691H67200n1467m8040m3576l8601l4156l0557k7083k3237j9578j6694j4020
50680E20191j0665o977m220k708j359O49K710L780L838L753M135M885N655O191
50666E29858O358O232O194O629P522Q493R271R963J0928J2504J4754J7402K0010
50653F66118K2335K4440K6439K8253K9797L1189L2684L4388L6139L7645L8613
$$ plain form
50738 804893 852619 903445 956829 1012163 1068886 1126368 1183830 1240412 1295183 1347072 1394866
50727 1394866 1437345 1473364 1501814 1521729 1532704 1535147 1529899 1517614 1498851 1474902 1448181 1421385
50715 1421385 1396359 1374009 1355160 1341052 1332772 1330324 1332375 1336839 1341680 1345363 1346704 1344425 1337011
50702 1337011 1323056 1301705 1272710 1236254 1192921 1143769 1090279 1034189 977319 921291 867200
50691 867200 815733 767693 724117 685516 651360 620803 593720 570483 550905 534211 520191
50680 520191 509526 502549 498329 495621 494262 494911 497621 501401 505239 508992 513127 518012 523667 529858
50666 529858 536216 542448 548642 555271 562793 571286 580557 590520 601448 613952 628706 646108 666118
50653 666118 688453 712893 739332 767585 797382 828571 861255 895643 931782 969427 1008040
50642A008040L8814L8120L6502L3986L0685K6824K2614J8152J3540R081N079J431
50630A282868k275o160r747j2507j4388j5567j5895j5050j3193j0975q798o417
50618A151896l569o01J783L316M282N018N581N943O081N718M293J464k488p032
50604A181685j2005j7533k3393k8836l3213l6469l8891m0521m1193m0984m0295
50593H28352l9397l8138l6192l3531l0559k7829k5655k3878k1952j9347j6057
50582E15817j2704j0005q078o399m520k617j156j20R84K368L646M481N192O252
50568D93141P457Q150Q265Q486R277J0273J0948J1408J2050J2771J3082J2945
50556F18253J2979J3712J4909J5847J6001J5488J4940J5041J5977J7305J8459
$$ plain form
50642 1008040 1046854 1084974 1121476 1155462 1186147 1212971 1235585 1253737 1267277 1276358 1281437 1282868
50630 1282868 1280593 1274433 1264686 1252179 1237791 1222224 1206329 1191279 1178086 1167111 1158313 1151896
50618 1151896 1148327 1147726 1149509 1152825 1157107 1162125 1167706 1173649 1179730 1185448 1189741 1191205 1188717 1181685
50604 1181685 1169680 1152147 1128754 1099918 1066705 1030236 991345 950824 909631 868647 828352
50593 828352 788955 750817 714625 681094 650535 622706 597051 573173 551221 531874 515817
50582 515817 503113 493108 485030 478631 474111 471494 470338 470218 471202 473570 477216 481697 486889 493141
50568 493141 500598 508748 517013 525499 534776 545049 555997 567405 579455 592226 605308 618253
50556 618253 631232 644944 659853 675700 691701 707189 722129 737170 753147 770452 788911
50545G88911J9371K0527K2447K5320K9124L3760L8905M3983M8537N2653N6802
50534A180340O1299O6018P0648P5020P9019Q2293Q4305Q4815Q4038Q2183P8911
50523B028889P3591O6042N6746M6227L4529K1573P789n950j8986l1200m2658n3205
50511B183387o2403o9692p4522p6501p5676p2549o7702o1382n3612m4653l5186
50500A489509k5855j6732p464J986J0986J8653K4509K8567L0889L1266K9233K4264
50488A639811J6100N148p485k0525l3110m4672n4600o2353o7900p1614p3632p3730
50476A151438p1815o8219o3457n8063n2718m8012m3853l9570l4853l0225k6252
50465F14401k2742j9122j5331j1848q988o579m283j989J18J680K525K939L464
$$ plain form
50545 788911 808282 828809 851256 876576 905700 939460 978365 1022348 1070885 1123538 1180340
50534 1180340 1241639 1307657 1378305 1453325 1532344 1614637 1698942 1783757 1867795 1949978 2028889
50523 2028889 2102480 2168522 2225268 2271495 2306024 2327597 2335386 2329436 2310450 2279250 2236592 2183387
50511 2183387 2120984 2051292 1976770 1900269 1824593 1752044 1684342 1622960 1569348 1524695 1489509
50500 1489509 1463654 1446922 1439458 1441444 1452430 1471083 1495592 1524159 1555048 1586314 1615547 1639811
50488 1639811 1655911 1661059 1653574 1633049 1599939 1555267 1500667 1438314 1370414 1298800 1225168 1151438
50476 1151438 1079623 1011404 947947 889884 837166 789154 745301 705731 670878 640653 614401
50465 614401 591659 572537 557206 545358 536370 529791 525508 523519 523637 525317 527842 530781 534245
50452E34245M329N446O882Q807J0760J1682J1188J0275J0143J0803J1423J1605
50440F47588J1590J1442J0930J0102R287Q569P901P602P954Q461Q323P729P731
50427G65209Q761J0121J1236J2496J4425J6835J9351K2134K5408K8803L1740L4156
50415A000675L6339L8337L9937M0938M1065M0017L8004L5804L3755L1105K6875
50404A402851K1061J4347O978j250j0089j8786k7002l4977m2570m8829n2946n5043
50392A153745n5593n4621n2014m8287m4279m0205l5585l0199k4482j8837j3061
50381G36582o881o30N093J0090J4403J7646J9187J9030J7774J5549J1721O075
50369H65639l37o250j1561j6926k2252k6466k8840k9773l0075l0082k9631k8490
$$ plain form
50452 534245 538574 544020 550902 559709 570469 582151 593339 603614 613757 624560 635983 647588
50440 647588 659178 670620 681550 691652 700939 709508 717409 725011 732965 741426 749749 757478 765209
50427 765209 773970 784091 795327 807823 822248 839083 858434 880568 905976 934779 966519 1000675
50415 1000675 1037014 1075351 1115288 1156226 1197291 1237308 1275312 1311116 1344871 1375976 1402851
50404 1402851 1423912 1438259 1445237 1443987 1433898 1415112 1388110 1353133 1310563 1261734 1208788 1153745
50392 1153745 1098152 1043531 991517 943230 898951 858746 823161 792962 768480 749643 736582
50381 736582 729701 729071 734164 744254 758657 776303 795490 814520 832294 847843 859564 865639
50369 865639 865302 859052 847491 830565 808313 781847 753007 723234 693159 663077 633446 604956
50357F04956k6579k4138k1769j9916j8326j6420j4253j2429j1135r863q319o889
50345D14920n879n010m045l290k919k406j253J37J026J495K323L806N360O284
50331D10549O522O573P011Q027R149R598R129Q408Q254Q714R200R276Q906Q146
50317E27462P125O203N704N489N208M810M492M275M039L836L750L535K888J985
50303E90801J249O75o9q83j221r02m58m18q07j517k625m028n203n710n670n487
50287E57727n366n394n713o255o464n804m429l008j966j242q07q98j527k046j701
50272E05107n99J93k43j608k663k554j622q85r66j730k680l403l713l746l925
50257D74963m579n456n921n681n124m764m611m341l935l727l817l756l110k090
$$ plain form
50357 604956 578377 554239 532470 512554 494228 477808 463555 451126 439991 430128 421809 414920
50345 414920 409041 404031 399986 396696 393777 391371 390118 390255 391281 392776 395099 398905 404265 410549
50331 410549 417071 423644 430655 438682 447831 457429 466558 474966 483220 491934 501134 510410 519316 527462
50317 527462 534587 540790 546494 551983 557191 562001 566493 570768 574807 578643 582393 585928 588816 590801
50303 590801 592050 592725 592656 591773 590552 589650 589192 588774 587967 586450 583825 579797 574594 568884 563214 557727
50287 557727 552361 546967 541254 534999 528535 522731 518302 515294 513328 512086 511279 510381 508854 506808 505107
50272 505107 504508 504701 504458 502850 500187 497633 496011 495126 494160 492430 489750 486347 482634 478888 474963
50257 474963 470384 464928 459007 453326 448202 443438 438827 434486 430551 426824 423007 419251 416141 414051
50243D14051j325j028p82k26M42R03J346K212L444M452M809M613M107L411K627
50228D43056J833Q81l62j479j798j437j413k335l588m249m345m527m937n168n119
50213D05013n128n334n553n775o160o534o504o093n693n350m752m032l818m201
50199C30086m353l560k216j237r45r60r30r01j017j280j584j799j825j663j400
50184C04416j073p21n36p79j423k152k701l039l155l081l138l729m713n367n260
50169B63549m780m523m537m493m332m212m061l629k916k178j587j208j149j409
50155B18535j637j419q53m15l48m12l67k01R7O73J473K129K289J907J083k4r04
50138B21606q37K69J432J595J013J011K272L876M444L757K818K624L311M378N194
$$ plain form
50243 414051 412726 411698 410916 410690 411132 412035 413381 415593 419037 423489 428298 432911 437018 440429 443056
50228 443056 444889 445770 445408 443929 442131 440694 439281 436946 433358 429109 424764 420237 415300 410132 405013
50213 405013 399885 394551 388998 383223 377063 370529 364025 357932 352239 346889 342137 338105 334287 330086
50199 330086 325733 322173 319957 318720 317775 316815 315885 314984 313967 312687 311103 309304 307479 305816 304416
50184 304416 303343 302622 302086 301307 299884 297732 295031 291992 288837 285756 282618 278889 274176 268809 263549
50169 263549 258769 254246 249709 245216 240884 236672 232611 228982 226066 223888 222301 221093 219944 218535
50155 218535 216898 215479 214626 214211 213863 213451 213084 212883 212980 213653 215126 217255 219544 221451 222534 222510 221606
50138 221606 220769 221038 222470 224065 225078 226089 228361 232237 236681 240438 243256 245880 249191 253569 258763
50123B58763N334M905M632N207O418P371P620P619P815P925P515O857O563O628
50109C51172O446N772N082M854M876M500L395J916Q39O80J217J732J749J380Q44
50094C96454J43n88p78nJ326K447L162L839M611N244N753O525P700Q945J0001
50079D54779J0920J1650J1942J1823J1741J1944J2183J2203J2107J2062J1999
50068E85353J1863J1734J1543J1068J0401R954R849R726R434R313R526R636R264
50055G18664Q697Q343Q017P308O298N321M299K905J279R5j09O21J725K403K136
50040G78002J296R10J365J696O63j781m664p374j0010j2515j4322j5152j5451
50027G02663j5725j5886j5629j5116j4852j5002j5091j4536j3366j2354j2257
$$ plain form
50123 258763 264097 269002 273634 278841 285259 292630 300250 307869 315684 323609 331124 337981 344544 351172
50109 351172 357618 363390 368472 373326 378202 382702 386097 388013 388852 389532 390749 392481 394230 395610 396454
50094 396454 396597 396009 395231 395226 396552 398999 402161 406000 410611 415855 421608 428133 435833 444778 454779
50079 454779 465699 477349 489291 501114 512855 524799 536982 549185 561292 573354 585353
50068 585353 597216 608950 620493 631561 641962 651916 661765 671491 680925 690238 699764 709400 718664
50055 718664 727361 735704 743721 751029 757327 762648 766947 769852 771131 771226 771117 771738 773463 775866 778002
50040 778002 779298 780208 781573 783269 783932 782151 777487 770113 760103 747588 733266 718114 702663
50027 702663 686938 671052 655423 640307 625455 610453 595362 580826 567460 555106 542849
50016E42849j2987j3718j3880j3595j3071j2161j0970j0262j0492j0874j0300
50005D10539q944p995p835p556o510n246m484m114l866m097n004n655m912l090
49991C31231j694j507j851j826j500j444j731j958j887j614j296j036r86j196
49977C09705j490j680j823k039k232k278k367k716k987k538j422o54j009j969
49963B82501k404k097j912k395k889k402q69P75J685J904K162L055M409N469N831
49948B92823O009O745P944Q860R428J0621J3079J6057J8280J9390J9885K0097
49936D49218J9955J9536J9072J8444J7409J6276J5660J5503J5120J4290J3666
49925F34149J3786J4248J4142J2816J0046O021J469k690o225r718j3546j7166
$$ plain form
50016 542849 529862 516144 502264 488669 475598 463437 452467 442205 431713 420839 410539
50005 410539 401595 393600 385765 378209 371699 366453 361969 357855 353989 349892 344888 339233 334321 331231
49991 331231 329537 328030 326179 324353 322853 321409 319678 317720 315833 314219 312923 311887 310901 309705
49977 309705 308215 306535 304712 302673 300441 298163 295796 293080 290093 287555 286133 285479 284470 282501
49963 282501 280097 278000 276088 273693 270804 268402 267533 268308 269993 271897 274059 277114 281523 286992 292823
49948 292823 298832 305577 313521 322381 331809 342430 355509 371566 389846 409236 429121 449218
49936 449218 469173 488709 507781 526225 543634 559910 575570 591073 606193 620483 634149
49925 634149 647935 662183 676325 689141 699187 705208 706677 703987 697762 688044 674498 657332
49913F57332j9744k1201k2180k3198k4231k4910k4914k4224k3201k2163k0884
49902D06482j8911j6551j4878j4400j4206j3039j0895q949q091q053p951p112
49890B63446n450l513k208k077k745l326l351l000k557k150j960k225k851l383
49876B22650l512l310k886k236j545j234j373j359o12N59J186P87l6l24J37O39
49860B07531M54l15r02p19R7R07J170Q22K93J39N46J077J130O87L51N70J078J299
49842B16215J033M67k24q85j180q22m2N74P90R49J425K099K498K357J920J833
49826B29007K669M394O285P594Q303R019J0135J1378J2273J2836J3498J4467J5314
49813C57172J5300J4099J2157J0255Q804P685O806O421O703P255P463P180O698
$$ plain form
49913 657332 637588 616387 594207 571009 546778 521868 496954 472730 449529 427366 406482
49902 406482 387571 371020 356142 341742 327536 314497 303602 294653 286562 278509 270558 263446
49890 263446 257996 254483 252275 250198 247453 244127 240776 237776 235219 233069 231109 228884 226033 222650
49876 222650 219138 215828 212942 210706 209161 207927 206554 205195 204583 205142 206328 207115 207079 206755 206892 207531
49860 207531 207985 207670 206768 206049 206146 207053 208223 209045 209338 209477 210023 211100 212230 212917 213268 213838 214916 216215
49842 216215 217248 217715 217491 216606 215426 214604 214562 215136 215926 216875 218300 220399 222897 225254 227174 229007
49826 229007 231676 236070 242355 249949 258252 267271 277406 288784 301057 313893 327391 341858 357172
49813 357172 372472 386571 398728 408983 417787 425472 432278 438699 445402 452657 460120 467300 473998
49800D73998O137N204L538R61k569o845j1209j4813j7222j8538j9056j9077j8984
49787C61525j8977j8671j7475j5433j3251j1410r792q298p210o601o017n144m351
49774B18895m044m002l736l131k237r63L79Q82J40p95n99M59Q99J97o09o79m93
49757B00563o66p47r8P75Q49J35l37JO98J237J707K250K508K161J612J590K208
49740B16446K786K656J822Q33K36L13R81J725J858J239O14Q39J700K082J450O06
49724B38186N34J033J161O93L05M73R13J169J053M51n43j165n44R98J991J626
49708B48334P53N21Q18Q16M39K88N26P48P63O93M51j00n14j76O95J225J145J095
49690B58520J539K073K093J489N31l89p03QJ313K162J977J140K32n19q66m49N00
$$ plain form
49800 473998 480135 485339 488877 489838 487269 480424 469215 454402 437180 418642 399586 380509 361525
49787 361525 342548 323877 306402 290969 277718 266308 256516 248218 241008 234407 228390 223246 218895
49774 218895 214851 210849 207113 203982 201745 200782 201161 202043 202183 201388 200789 201248 202147 202344 201735 201056 200563
49757 200563 199897 199150 199052 199827 200676 200811 200474 200475 201173 202410 204117 206367 208875 211036 212648 214238 216446
49740 216446 219232 221888 223710 224543 224779 225092 226073 227798 229656 230895 231509 232348 234048 236130 237580 238186
49724 238186 238720 239753 240914 241607 241912 242385 243298 244467 245520 245971 245428 244263 243719 244717 246708 248334
49708 248334 249087 249608 250426 251242 251681 251969 252495 253243 254006 254699 255150 255050 254536 254360 255055 256280 257425 258520
49690 258520 260059 262132 264225 265714 266245 265856 265153 265161 266474 268636 270613 271753 271985 271466 270600 270151 270651
49673B70651J049P77M29P92J396J100l12j847k457j908o36O65J345J220P14L58
49657B73336K03M6l0J99O02P42M52k8m06n15k55K49O39O74N58N69O33N50L95K48
49637B78861j58r34j470j030J13Q82P15O4m32n99m87r6M12Q16J220J824K288K053
49619B84042J408J300J880K184J798J741K844M176M292L437L094L658M041L696
49605C23591L547M348N355N522N073M904N042M856M480M818O070P252P545P335
49591C99738P416P880Q291Q560Q956R435R671R728J0190J1411J2915J3843J3841
49578E31875J3433J3517J4477J5781J6498J6388J6249J6901J8111J8927J9006
49567G11163J8975J9402J9999K0256K0315K0698K1398K1762K1260J9960J8350
$$ plain form
49673 270651 271700 272477 272906 273698 275094 276194 275882 274035 271578 269670 269034 269699 271044 272264 272978 273336
49657 273336 273539 273585 273555 273754 274356 275098 275550 275522 275116 274601 274346 274595 275234 275908 276466 277035 277668 278218 278613 278861
49637 278861 278703 277769 276299 275269 275382 276264 276979 277043 276611 276012 275525 275429 275841 276657 277877 279701 281989 284042
49619 284042 285450 286750 288630 290814 292612 294353 297197 301373 305665 309102 312196 315854 319895 323591
49605 323591 327138 331486 336841 342363 347436 352340 357382 362238 366718 371536 377606 384858 392403 399738
49591 399738 407154 415034 423325 431885 440841 450276 459947 469675 479865 491276 504191 518034 531875
49578 531875 545308 558825 573302 589083 605581 621969 638218 655119 673230 692157 711163
49567 711163 730138 749540 769539 789795 810110 830808 852206 873968 895228 915188 933538
49556I33538J6982J6197J5857J5351J4199J2639J1283J0182Q708O472L975K051
49544A067434Q74j31j488l076m409n267n844o281o386n983n378n124n267n180
49530A008494m268k629q14Q01K216L595N078O663Q148R308J0336J1696J3369J4647
49516A086640J5093J5256J5899J6807J7107J6466J5320J3956J2250J0285Q443
49505A243522O646M332J467j203l317n585q661j2038j4770j6832j8869k0948k2447
49492A131297k3205k3875k4946k6073k6650k6619k6350k6089k5860k5617k5248
49481H50765k4588k3680k2877k2378k1841k0768j9234j7900j7216j6874j6245
49470F27164j5114j3805j2711j2005j1703j1690j1637j1239j0585j0002r451q507
$$ plain form
49556 933538 950520 966717 982574 997925 1012124 1024763 1036046 1046228 1054936 1061408 1065383 1067434
49544 1067434 1068308 1068177 1066689 1063613 1059204 1053937 1048093 1041812 1035426 1029443 1024065 1018941 1013674 1008494
49530 1008494 1004226 1001597 1000783 1001584 1003800 1007395 1012473 1019136 1027284 1036592 1046928 1058624 1071993 1086640
49516 1086640 1101733 1116989 1132888 1149695 1166802 1183268 1198588 1212544 1224794 1235079 1243522
49505 1243522 1250168 1254500 1255967 1254764 1251447 1245862 1237201 1225163 1210393 1193561 1174692 1153744 1131297
49492 1131297 1108092 1084217 1059271 1033198 1006548 979929 953579 927490 901630 876013 850765
49481 850765 826177 802497 779620 757242 735401 714633 695399 677499 660283 643409 627164
49470 627164 612050 598245 585534 573529 561826 550136 538499 527260 516675 506673 497222 488715
49458D88715p078n743m982m607m313m362m950n345m504k568q54k34l24m89p83
49443D37579j388j864j668r48j95N75J611K648L090K920K943L881N627P399Q407
49428D70617Q265P066N217L188J353%p07q35n53J64J436L015M283M909N172N483
49412E18073N844O128O533P422Q832J0395J1597J2029J1700J1251J1465J2303
$$ plain form
49458 488715 481637 475894 470912 466305 461992 457630 452680 447335 442831 440263 439409 439175 438851 438362 437579
49443 437579 436191 434327 432659 431711 431516 432091 433702 436350 439440 442360 445303 449184 454811 462210 470617
49428 470617 478882 485948 491165 494353 495706 495706 494999 494164 493611 493775 495211 498226 502509 507418 512590 518073
49412 518073 523917 530045 536578 544000 552832 563227 574824 586853 598553 609804 621269 633572
$$ [...]
##END NTUPLES=NMR SPECTRUM
##END=
