##TITLE=NES1085_IP2_9884916_xXUE9NG3Dy
##JCAMPDX= 6.0         $$ Bruker NMR JCAMP-DX V2.0
##DATA TYPE= NMR SPECTRUM
##DATA CLASS= NTUPLES
##ORIGIN= BRUKER
##OWNER= Administrator
$$ 1.72 TOPSPIN		Version 2.1
$$ 2016-08-27 20:35:35.414 -0500  Administrator@X
$$ Compression mode = diff/dup
##.OBSERVE FREQUENCY= 400.02188249412
##.OBSERVE NUCLEUS= ^1H
##.ACQUISITION MODE= SIMULTANEOUS (DQD)
##.ACQUISITION SCHEME= undefined
##.AVERAGES= 8
##.DIGITISER RES= 22
##SPECTROMETER/DATA SYSTEM= spect
##.PULSE SEQUENCE= zg30
##.SOLVENT NAME= COFFEE_meoh
##.SHIFT REFERENCE= INTERNAL, COFFEE_meoh, 1, 14.98509
##AUDIT TRAIL= $$ (NUMBER, WHEN, WHO, WHERE, PROCESS, VERSION, WHAT)
$$ ##TITLE= Audit trail, TOPSPIN		Version 2.1
$$ ##JCAMPDX= 5.01
$$ ##ORIGIN= Bruker BioSpin GmbH
$$ ##OWNER= Administrator
$$ $$ E:\/data/COFFEE/nmr/NES1085_IP2_9884916_xXUE9NG3Dy/10/pdata/1/auditp.txt
$$ ##AUDIT TRAIL=  $$ (NUMBER, WHEN, WHO, WHERE, PROCESS, VERSION, WHAT)
(   1,<2016-08-27 20:35:28.226 -0500>,<Administrator>,<X>,<go>,<TOPSPIN 2.1>,
      <created by zg
	started at 2016-08-27 20:34:22.195 -0500,
	POWCHK enabled, PULCHK disabled,
       configuration hash MD5:
       21 0F 79 D6 B3 7B B4 F6 88 20 88 DB 03 48 BD 9F
       data hash MD5: 64K
       CF C0 67 0D 64 81 51 A8 09 D6 5D B9 B3 37 4C AC>)
(   2,<2016-08-27 20:35:31.336 -0500>,<Administrator>,<X>,<proc1d>,<TOPSPIN 2.1>,
      <Start of raw data processing
       efp LB = 0 FT_mod = 6 PKNL = 1 PHC0 = 0 PHC1 = 0 SI = 32K 
       data hash MD5: 32K
       29 CE 6E 67 89 00 C8 EB 33 63 36 E2 A8 F1 63 14>)
(   3,<2016-08-27 20:35:31.617 -0500>,<Administrator>,<X>,<proc1d>,<TOPSPIN 2.1>,
      <pk PHC0 = 91.14258 PHC1 = 0 
       data hash MD5: 32K
       02 18 6F C6 14 EF FC 62 E5 90 86 19 3C 50 D4 4D>)
(   4,<2016-08-27 20:35:31.726 -0500>,<Administrator>,<X>,<proc1d>,<TOPSPIN 2.1>,
      <abs ABSG = 1 
       data hash MD5: 32K
       FA 0A C4 63 C0 E8 E5 79 28 90 EE F0 4E 59 28 D6>)
(   5,<2016-08-27 20:35:31.789 -0500>,<Administrator>,<X>,<proc1d>,<TOPSPIN 2.1>,
      <abs ABSG = 2 
       data hash MD5: 32K
       47 2B DA 07 5B 5F 6A A3 A5 97 96 2C 66 D8 D4 72>)
(   6,<2016-08-27 20:35:31.851 -0500>,<Administrator>,<X>,<proc1d>,<TOPSPIN 2.1>,
      <abs ABSG = 3 
       data hash MD5: 32K
       D5 F7 8A ED F3 33 3D 6F 27 A2 F9 A2 13 4A 20 1F>)
(   7,<2016-08-27 20:35:31.898 -0500>,<Administrator>,<X>,<proc1d>,<TOPSPIN 2.1>,
      <abs ABSG = 4 
       data hash MD5: 32K
       F8 54 AA C6 9C D2 82 CB 7D 44 54 BB 13 AA 3F 48>)
(   8,<2016-08-27 20:35:31.961 -0500>,<Administrator>,<X>,<proc1d>,<TOPSPIN 2.1>,
      <abs ABSG = 5 
       data hash MD5: 32K
       CD E3 CF 68 D5 34 7F EC 29 93 6C A9 9F 9F 6D 9B>)
$$ ##END=
$$ 
$$ $$ hash MD5
$$ $$ 5F 2F 00 D1 BF 0B 63 14 BF 16 FA B6 F2 E9 B5 41
##$RELAX= 
##$RELAX= 
##$RELAX= 
##$RELAX= 
##$RELAX= 
##$RELAX= 
##$RELAX= 
$$ Bruker specific parameters
$$ --------------------------
##$DU= <E:\>
##$EXPNO= 10
##$NAME= <NES1085_IP2_9884916_xXUE9NG3Dy>
##$PROCNO= 1
$$ [...]
##$TP= (0..7)
150 150 150 150 150 150 150 150
##$TP07= 0
##$TPNAME0= <>
##$TPNAME1= <>
##$TPNAME2= <>
##$TPNAME3= <>
##$TPNAME4= <>
##$TPNAME5= <>
##$TPNAME6= <>
##$TPNAME7= <>
##$TPOAL= (0..7)
0.5 0.5 0.5 0.5 0.5 0.5 0.5 0.5
##$TPOFFS= (0..7)
0 0 0 0 0 0 0 0
##$TUNHIN= 0
##$TUNHOUT= 0
##$TUNXOUT= 0
##$USERA1= <user>
##$USERA2= <user>
##$USERA3= <user>
##$USERA4= <user>
##$USERA5= <user>
##$V9= 5
##$VALIST= <valist>
##$VCLIST= <CCCCCCCCCCCCCCC>
##$VD= 0
##$VDLIST= <DDDDDDDDDDDDDDD>
##$VPLIST= <PPPPPPPPPPPPPPP>
##$VTLIST= <TTTTTTTTTTTTTTT>
##$WBST= 1024
##$WBSW= 4
##$XGAIN= (0..3)
0 0 0 0
##$XL= 0
##$YL= 0
##$YMAX_a= 591838
##$YMIN_a= -501661
##$ZGOPTNS= <>
##$ZL1= 120
##$ZL2= 120
##$ZL3= 120
##$ZL4= 120
##$ABSF1= 14.98509
##$ABSF2= -5.573092
##$ABSG= 5
##$ABSL= 3
##$ALPHA= 0
##$AQORDER= 0
##$ASSFAC= 0
##$ASSFACI= 0
##$ASSFACX= 0
##$ASSWID= 0
##$AUNMP= <proc_prof1d_extract_pilot.lims>
##$AXLEFT= 0
##$AXNAME= <>
##$AXNUC= <1H>
##$AXRIGHT= 0
##$AXTYPE= 0
##$AXUNIT= <>
##$AZFE= 0.1
##$AZFW= 0.1
##$BCFW= 0
##$BC_mod= 0
##$BYTORDP= 0
##$COROFFS= 0
##$CY= 15
##$DATMOD= 1
##$DC= 0
##$DFILT= <>
##$DTYPP= 0
##$F1P= 0
##$F2P= 0
##$FCOR= 0.5
##$FTSIZE= 32768
##$FT_mod= 6
##$GAMMA= 0
##$GB= 0
##$INTBC= 1
##$INTSCL= 1
##$ISEN= 128
##$LB= 0
##$LEV0= 0
##$LPBIN= 0
##$MAXI= 10000
##$MC2= 0
##$MEAN= 0
##$ME_mod= 0
##$MI= 0
##$NCOEF= 0
##$NC_proc= -8
##$NLEV= 6
##$NOISF1= 0
##$NOISF2= 0
##$NSP= 0
##$NTH_PI= 0
##$NZP= 0
##$OFFSET= 14.98509
##$PC= 1
##$PHC0= 91.14258
##$PHC1= 0
##$PH_mod= 1
##$PKNL= yes
##$PPARMOD= 0
##$PPDIAG= 0
##$PPIPTYP= 0
##$PPMPNUM= 2147483647
##$PPRESOL= 1
##$PSCAL= 4
##$PSIGN= 0
##$PYNMP= <proc.py>
##$REVERSE= no
##$SF= 400.02
##$SI= 32768
##$SIGF1= 0
##$SIGF2= 0
##$SINO= 400
##$SIOLD= 32768
##$SPECTYP= <>
##$SREGLST= <1H.CDCl3>
##$SSB= 0
##$STSI= 32768
##$STSR= 0
##$SW_p= 8223.68421052631
##$SYMM= 0
##$S_DEV= 0
##$TDeff= 65536
##$TDoff= 0
##$TI= <>
##$TILT= no
##$TM1= 0
##$TM2= 0
##$TOPLEV= 0
##$USERP1= <user>
##$USERP2= <user>
##$USERP3= <user>
##$USERP4= <user>
##$USERP5= <user>
##$WDW= 1
##$XDIM= 32768
##$YMAX_p= 443121614
##$YMIN_p= -735039
##$CURPLOT= <Network HP LaserJet P1505>
##$CURPRIN= <$Network HP LaserJet P1505>
##$DFORMAT= <normdp>
##$LAYOUT= <+/1D_H.xwp>
##$LFORMAT= <normlp>
##$PFORMAT= <normpl>
##$SURQMSG= 1
$$ End of Bruker specific parameters
$$ ---------------------------------
##NTUPLES= NMR SPECTRUM
##VAR_NAME=  FREQUENCY,     SPECTRUM/REAL,   SPECTRUM/IMAG
##SYMBOL=    X,             R,               I
##VAR_TYPE=  INDEPENDENT,   DEPENDENT,       DEPENDENT
##VAR_FORM=  AFFN,          ASDF,            ASDF
##VAR_DIM=   32768,         32768,           32768
##UNITS=     HZ,            ARBITRARY UNITS, ARBITRARY UNITS
##FACTOR=    0.250966925370066, 1,           1
##FIRST=     8223.43324360094, 717,          -139563
##LAST=      0,             -188,            31036
##MIN=       0,             -735039,         0
##MAX=       8223.43324360094, 443121614,    0
$$ Real data points
##PAGE= N=1
##DATA TABLE= (X++(R..R)), XYDATA
$$ [...]
$$ plain form
19496 -149898 135352 37700 -37245 125966 -80775 176507 248843 234567 126661 40094 -144487
19484 168548 -298637 -104524 -147626 92426 -150813 23512 -2216 -370760 -216073 10038 109296
19473 109296 -376771 79947 -90939 -208999 86346 280756 -78009 -132666 88172 -168807 -3484
19461 106776 143767 -71503 -189698 155248 12632 -22569 45466 -104107 78465 120221 17341
19449 -523396 -42398 -130544 -40119 -36926 107043 -447224 -44964 205252 -370331 -156577 -343130
19438 -343130 -211046 -245433 -90256 59236 42284 -300256 39761 -292313 -182042 29502 136490
19427 136490 -140327 -154563 -166649 4604 -177311 -61155 -144601 -128326 27940 -420517 -61084
19415 -207257 -133731 -4483 140684 -251285 -675367 -209651 -256885 -444665 -154231 -21021
$$ packed form
19496a49898A35352C7700c7245A25966h0775A76507P2336j4276j07906D0094a44487
19484A68548b98637a04524m3102I2426a50813B3512b216l68544J54687A0038R9258
19473A09296c76771G9947i0939j18060H6346J94410g8009n4657H8172a68807c484
19461A06776L6991g1503j18195A55248A2632b2569D5466a04107G8465M1756A7341
19449e23396d2398q8146d0119L193A07043d47224d4964B05252c70331a56577j86553
19438c43130J32084l4387i0256E9236j6952c00256C9761b92313J10271B9502J06988
19427A36490a40327j4236j2086D604a77311f1155q3446J6275B7940d20517f1084
19415b07257P3526d483A40684b51285m24082b09651m7234j87780a54231b1021
$$ plain form
19404 -139103 -54132 -220111 -328367 82755 63219 232474 -177543 -73614 -277229 -506831
19394 -506831 -145992 10539 -87811 -100419 141420 256237 -382368 144178 96263 37732
19383 -44831 -127194 -228016 -193941 -176040 364642 -101250 81499 74606 256919 66902 68352
19372 68352 77235 -99668 56788 -154632 -353731 -368435 18796 390801 -64131 -20860 5128
19360 -295453 -232282 132686 -83546 -157533 26260 -303351 199477 -95701 -105009 -181704 -399286
19349 -399286 93343 -279476 64424 -94354 93174 -245715 -318746 -95658 -72127 -104076 -185374
19338 -185374 291951 -81144 -136668 75031 -52952 -164457 -239800 -112533 -94301 -5278 -415584
19327 -415584 -357042 19199 -402949 -367519 25672 -286308 128425 6066 -207561 -47048 -246848
$$ packed form
19404a39103e4132j65979j08256H2755j9536J69255a77543g3614k03615k29602
19394e06831a45992A0539h7811j2608A41420J14817c82368A44178m7915C7732
19383d4831q2363j00822L4075J7901C64642a01250H1499o893J82313F6902J450
19372F8352Q883i9668E6788a54632j99099j4704A8796L72005f4131b0860E128
19360b95453O3171A32686h3546p3987B6260c03351A99477i5701r308p6695k17582
19349c99286I3343b79476F4424i4354I3174b45715p3031i5658K3531l1949q1298
19338a85374B91951h1144n5524G5031e2952j11505p5343a12533J8232e278m10306
19327d15584N8542A9199d02949L5430B5672b86308A28425F066b07561d7048j99800
$$ plain form
19316 -246848 163507 -237562 344408 37232 -36449 -20247 -137307 -116406 -80871 -99400 303345
19304 -211515 -82052 -59643 -224458 -397460 -100706 -58542 46295 41281 159726 -156928 -69130
19292 2095 5184 -171435 101336 -161674 -62810 54362 -434180 36242 -149995 -271031 148755
19280 -127674 -20851 -377142 193126 74500 -202439 149878 -229404 -204321 149306 -149504
19269 -86205 96421 273230 -13841 55694 -20886 -38922 143684 175850 288727 -275549 20746
19257 108975 127702 -248819 -281502 12811 79153 -14724 -215400 -25176 38824 114222 -94073
19245 -257856 194221 -261398 11000 218627 -118903 77736 -37195 -338859 -248747 -75649
19234 -2875 -132413 196171 -10743 15620 28742 -8371 -137513 49477 -61566 211282 -49016
$$ packed form
19316b46848A63507b37562C44408C7232c6449J6202j17060K0901L5535j8529C03345
19304b11515h2052K2409j64815j73002a00706M2164D6295n014J18445a56928f9130
19292B095L089a71435A01336a61674f2810E4362d34180C6242a49995j21036A48755
19280a27674b0851l56291A93126G4500b02439A49878b29404K5083A49306a49504
19269h6205I6421J76809a3841E5694b0886j8036A43684L2166J12877b75549B0746
19257A08975J8727b48819l2683A2811O6342a4724k00676b5176C8824P5398i4073
19245b57856A94221b61398A1000K07627a18903G7736c7195l01664R0112g5649
19234b875j29538A96171a0743A5620J3122h371j29142D9477f1566B11282d9016
$$ plain form
19222 -115842 174482 37961 170546 -305203 -52171 6951 68631 -284573 -84734 -116696 -56475
19210 286566 141008 -172098 150209 -295705 342790 268784 -69616 228622 -132482 148588
19199 -66232 12121 -145525 12208 45649 -141701 -250590 -97234 -181090 -215767 135969 134405
19188 134405 -239483 128505 144084 94813 139112 42013 -49296 -197474 29418 -39885 49526
19176 3823 221760 82410 -392692 -62780 -99248 -167456 -109553 261176 -135457 -361693 284035
19164 -30262 -276248 -72478 -25215 -117574 16609 -88272 -182873 305079 -221000 -18335 152591
19152 178070 -165075 -101748 194248 59269 -304281 -365276 39170 69999 -35001 -168622 -16444
19140 -51248 59675 -366310 103941 -95686 -116559 42083 -58227 -17550 -26244 133296 270553
$$ packed form
19222a15842A74482C7961J32585c05203e2171F951O1680b84573h4734l1962e6475
19210B86566A41008a72098A50209b95705C42790p4006f9616B28622a32482A48588
19199f6232A2121a45525A2208L3441a41701j08889i7234q3856l4677A35969j564
19188A34405b39483A28505J5579m9271M4299D2013d9296j48178B9418c9885D9526
19176C823K17937H2410c92692f2780l6468o8208N7903B61176a35457k26236B84035
19164c0262k45986g2478b5215r2359A6609h8272r4601C05079b21000a8335A52591
19152A78070a65075O3327A94248E9269c04281o0995C9170L0829c5001j33621a6444
19140e1248E9675c66310A03941i5686k0873D2083e8227a7550q694A33296J37257
$$ plain form
19129 270553 265543 21035 -227307 -44579 -6821 65555 75307 -278953 -12857 230926 -59929
19117 -242698 421218 -209563 -11776 -145543 -168417 125629 -207673 7560 -322414 -143354
19106 144495 49896 -76401 -69035 180713 -97694 -131912 24742 -59363 -423745 47253 -203573
19094 136932 -270866 -318955 -200089 -304218 56001 -131997 2637 -90502 -68189 44818 -38203
19082 -362191 -91505 -75527 -304695 -49701 -410250 -237684 -15511 -10622 180355 -144737 -66704
19070 -299106 -13517 -276615 150227 47367 37519 -130993 101155 236015 -135394 -257696
19060 -257696 -74541 -54180 21801 -231452 -79333 55119 202 153771 83598 70796 60546
19049 60546 134721 129257 -30207 161843 -224968 12526 5155 257969 -395437 -110812 -178839
$$ packed form
19129B70553n010B1035b27307d4579f821F5555R752b78953a2857B30926e9929
19117b42698D21218b09563a1776j33767k2874A25629b07673G560c22414a43354
19106A44495D9896g6401P366A80713i7694l4218B4742e9363l64382D7253b03573
19094A36932b70866m8089J18866j04129E6001a31997B637i0502K2313D4818c8203
19082c62191i1505J5978k29168d9701l60549J72566a5511M889A80355a44737f6704
19070b99106a3517k63098A50227D7367r848a30993A01155J34860a35394j22302
19060b57696g4541K0361B1801b31452g9333E5119B02J53569p0173j2802j0250
19049F0546P4175n464c0207A61843b24968A2526E155K52814c95437a10812o8027
$$ plain form
19038 -178839 153125 97063 22020 -115679 -74095 -188312 18459 58085 -89810 90684 68193
19027 68193 228536 84575 -38040 364920 -91479 -23334 -123526 -89350 -120604 -103008 68421
19015 -345365 -318851 -128482 191704 -27492 106660 -257538 -314355 -17047 -141590 -278705
19005 -278705 106275 -252188 112980 -71058 94342 -2040 -6000 -15354 -221349 -95088 36740
18993 68201 -246962 -227 -267507 -17956 -72297 -46858 -365198 -87315 -113051 -294381 -53902
18981 -222633 273612 -125465 -266956 -233463 -35620 -91006 -13298 229639 136423 113567 158243
18970 158243 55214 -39459 -106811 -92349 -317222 -63307 -425405 -314085 -251126 -120617 -273278
18959 -273278 -169390 29827 -26966 194643 -59007 28360 -202996 -145014 -392694 -198529
$$ packed form
19038a78839A53125n6062B2020a15679M1584j14217A8459L9626h9810I0684k2491
19027F8193J60343H4575c8040C64920i1479b3334j00192L4176l1254J7596F8421
19015c45365K6514a28482A91704b7492A06660b57538n6817a7047j24543j37115
19005b78705A06275b52188A12980g1058I4342b040l960r354k05995i5088C6740
18993F8201b46962b27k67280a7956n4341K5439l18340h7315k5736j81330e3902
18981b22633B73612a25465j41491L3493c5620n5386a3298B29639r3216k2856M4676
18970A58243E5214c9459o7352J4462k24873f3307l62098J11320O2959a20617j52661
18959b73278J03888B9827b6966A94643e9007B8360b02996N7982k47680J94165
$$ plain form
18949 -198529 -33001 -110642 -311959 209088 36833 184949 -99791 119929 -35341 212312
18938 -3079 -164397 86307 271487 -54660 -12335 -59003 20591 53038 297637 -46903 72821
18926 -244469 92314 -145892 237650 -95665 33790 -116436 -296561 131132 -145627 -158051
18916 -158051 -139281 -23975 -125547 -95489 -124598 185804 325526 -121344 -29047 278820
18905 -338873 -41383 -105829 -3413 -49877 -30093 -74215 -464624 -22971 95901 -214883 16458
18893 -139435 -28149 -263628 8257 252756 190267 -37534 150460 232962 46075 303452 -16358
18881 1087 -203125 33483 194082 -211338 -113190 -340250 -114135 -175565 -135399 -201993 -217330
18870 -217330 -21100 -93324 -284712 412 10700 -136352 -60216 97960 193678 -44105 169307
$$ packed form
18949a98529c3001p7641k01317B09088C6833J48116i9791A19929c5341B12312
18938c079j61318H6307J85180e4660a2335m6668B0591L2447K44599d6903G2821
18926b44469I2314a45892B37650i5665C3790a16436j80125A31132a45627j2424
18916a58051J8770b3975j01572L0058k9109A85804J39722a21344b9047B78820
18905c38873d1383o4446c413m6464J9784m4122l90409b2971I5901b14883A6458
18893a39435b8149k35479H257K44499o2489c7534A50460Q2502D6075K57377a6358
18881A087b03125C3483J60599b11338R8148k27060a14135o1430M0166o6594j5337
18870b17330b1100p2224j91388D12J0288a36352f0216I7960R5718d4105A69307
$$ plain form
18858 68885 185870 -221262 -100341 -50853 83848 89600 160394 2696 -45303 -35088 -193893
18847 -193893 132706 -12919 84184 -134750 160157 -178303 -261888 -180979 314412 -15240
18836 27480 -90407 -35007 -309123 109051 224767 -288836 140306 -26256 24157 82250 176006
18825 176006 -271321 31360 79153 -178547 -20883 107922 65173 -83943 4778 26435 -241646
18813 94534 47660 447273 241350 217188 312145 -80530 -239805 -249861 -27912 -351438 -101980
18801 -216166 -132250 -156984 146573 285120 40386 230776 -141667 25463 -117306 -285722
18791 -285722 43325 63316 147140 -125707 -329549 -95844 -126216 -49152 163415 -172680 -92515
18780 -92515 9363 9733 -18344 -128793 -223813 -169751 -204139 12816 80093 -177444 41763 -242842
$$ packed form
18858F8885J16985b21262a00341M9488H3848N752P0794B696d5303J0215j58805
18847a93893A32706a2919H4184a34750A60157a78303q3585Q0909C14412a5240
18836B7480i0407c5007k74116A09051J15716b88836A40306b6256B4157N8093R3756
18825A76006b71321C1360M7793a78547b0883A07922m2749h3943D778K1657b41646
18813I4534m6874L99613k05923k4162R4957h0530j59275j0056b7912l23526a01980
18801b16166Q3916k4734A46573J38547D0386J90390a41667B5463a17306j68416
18791b85722D3325J9991Q3824a25707k03842i5844l0372d9152A63415a72680Q0165
18780i2515I363L70a8344j10449r5020N4062l4388A2816O7277a77444D1763b42842
$$ plain form
18767 -198801 -212653 -12466 105325 -88129 -187522 -111262 90305 -340762 230470 -279803 -432090
18756 -432090 -4234 276406 -117690 49734 -93197 202330 -83782 -29691 43073 -274748 -161520
18745 -161520 14023 -165898 132748 -73742 144548 -178985 -172569 -62793 -275086 8649 69273
18734 69273 257571 87735 -188458 39121 -318775 153448 -137308 -26209 -293919 -330180
18724 -330180 -67026 -202412 -247359 183768 -56244 -428889 -75165 -387115 -88503 -387569
18714 -387569 -203022 -4984 119295 -329552 86328 10006 -124003 78554 171411 110130 -47543
18702 -54943 -152286 -20970 -99468 -169429 42231 131246 20814 35858 44333 199607 84030 -113749
18689 -467069 211422 -387910 -162401 -90082 -293387 202440 -104448 237457 2158 -360183
$$ packed form
18767a98801j3852a2466A05325h8129r9393P6260I0305c40762B30470b79803j52287
18756d32090d234B76406a17690D9734i3197B02330h3782b9691D3073b74748J13228
18745a61520A4023a65898A32748g3742A44548a78985O416f2793k12293H649O0624
18734F9273J88298H7735a88458C9121c18775A53448a37308b6209k67710l6261
18724c30180f7026j35386m4947A83768e6244l72645g5165l11950h8503k99066
18714c87569J84547d984A19295c29552H6328A0006a24003G8554R2857o1281d7543
18702e4943r7343b0970p8498o9961D2231Q9015B0814J5044Q475J55274H4030a13749
18689d67069B11422c87910a62401P2319k03305B02440a04448B37457B158c60183
$$ plain form
18678 -181583 -77318 -109366 -209313 -107513 -149430 183551 -88200 -178035 383882 -42397 -206468
18667 -206468 17231 -121573 5483 255922 -310898 134059 6971 173045 -43463 193900 104199
18656 104199 -352831 -172320 -149148 -173178 -200623 -26714 -83352 -62051 115027 135885 -218248
18644 -310338 -121200 -112256 33564 115530 117811 10138 -222114 -311454 444535 202154 -141678
18632 -159711 107457 134900 -302193 77232 -183239 -279583 34667 -68728 -9782 197403 38064
18620 -128686 18114 -296215 170285 -43899 -69783 -197325 107894 -241836 -236444 -113381
18609 -38914 -26815 -242111 -186963 -194873 165693 7166 -230836 -61222 -109781 -13841 194011
18597 -96691 -471459 75398 -60788 -27281 19404 -120882 152283 -110254 49527 -36937 127735
$$ packed form
18678a81583g7318l2048r9947J01800m1917A83551h8200q9835C83882d2397j64071
18667b06468A7231a21573E483K50439c10898A34059F971J66074d3463A93900q9701
18656A04199c52831a72320K3172k4030k7445b6714n6638K1301A15027K0858b18248
18644c10338a21200Q944C3564Q1966K281A0138b22114q9340D44535B02154a41678
18632a59711A07457K7443c02193G7232a83239r6344C4667f8728i782A97403C8064
18620a28686A8114b96215A70285d3899k5884j27542A07894b41836N392a13381
18609c8914J2099k15296N5148p910A65693G166b30836f1222m8559a3841A94011
18597i6691l74768G5398f0788b7281A9404a20882A52283a10254D9527c6937A27735
$$ plain form
18585 35691 209681 -235804 -86220 158068 -76447 -114553 -234566 192247 305355 161284
18575 161284 226916 -89956 52481 -20510 18147 -304527 -407439 -124739 -186283 -97826 -316743
18564 -316743 98743 96653 -169908 -31586 257637 -173372 -10056 -145973 213054 -249933
18553 -72870 1746 -147466 -33634 8596 -99648 -98055 -170877 -34695 77033 102161 -92919 221869
18540 151155 106959 251229 -81280 -124108 -167171 -191145 63288 275395 -161853 -469838 4774
18528 -426076 -220053 -152209 288247 -98744 -335069 -57708 95663 267395 -151606 72920
18517 -113051 -363905 332781 -221102 -36572 927 -108313 -26050 100260 -346 -198888 -83979
18505 -235536 -406228 176266 -319499 5918 179411 -173972 -105778 78434 -99941 14934 34194
$$ packed form
18585C5691J73990b35804h6220A58068g6447l8106j20013A92247J13108j44071
18575A61284O5632h9956E2481b0510A8147c04527j02912a24739o1544Q8457k18917
18564c16743I8743k090a69908c1586B57637a73372a0056j35917B13054b49933
18553g2870A746a47466c3634H596i9648J593p2822c4695G7033K5128i2919B21869
18540A51155m4196J44270h1280m2828m3063k3974F3288K12107a61853l07985D774
18528d26076K06023O7844B88247i8744k36325e7708I5663J71732a51606G2920
18517a13051k50854C32781b21102c6572I27a08313b6050A00260c46j98542h3979
18505b35536j70692A76266c19499E918J73493a73972O8194G8434i9941A4934J9260
$$ plain form
18494 34194 3999 2628 79093 -23145 119523 -89353 225252 237474 -108696 -141320 -1048 -82216
18482 -82216 -155362 6234 55664 109405 -215874 62199 34364 382747 -56042 -6621 25034 102787
18470 102787 134974 -17785 -241910 -142455 -189391 -132529 27522 60749 -277802 227583 -191861
18458 14732 164373 15924 -41158 -202672 -146407 76135 141122 53597 -50565 -59906 284183
18446 62097 -28539 -136393 -18501 -118755 177037 -106055 -201108 -233530 48587 40344 -139143
18434 -90731 -6893 83809 -102731 39164 -77011 215745 168077 -60685 244420 276262 7952
18422 -364615 -210831 143780 -121384 -307777 155695 268583 -152675 106330 -262918 -230599
18412 -230599 -326860 151554 -2874 -270881 259163 44974 100677 196712 4347 36341 -256347
$$ packed form
18494C4194C999j371P6465b3145A19523h9353B25252J2222a08696l2624a048q1168
18482h2216p3146F234M9430N3741b15874F2199k7835L48383e6042f621B5034P7753
18470A02787L2187a7785k24125R9455m6936N6862B7522L3227b77802B27583a91861
18458A4732J49641A5924d1158j61514N6265G6135O4987E3597e0565r341B84183
18446F2097b8539j07854a8501j00254A77037a06055r5053l2422D8587q243a39143
18434i0731f893H3809a02731C9164g7011B15745m7668f0685B44420L1842G952
18422c64615J53784A43780a21384j86393A55695J12888a52675A06330b62918L2319
18412b30599r6261A51554b874k68007B59163D4974N5703R6035D347L1994b56347
$$ plain form
18400 -35132 84274 -208008 74409 -186255 -249961 89058 43642 240028 389772 -125393 -102731
18389 -102731 -72918 77147 104077 23587 -357614 -185711 -312967 -80519 -109443 -213307 -74090
18377 -339525 -12545 -400581 220629 81942 -6956 158059 -82933 88962 -28177 -181702 -32388
18365 49832 -110956 148227 22982 111260 -267972 229942 329855 -410081 -5806 160576 -270625
18353 -57458 -72585 -304660 -346002 -5579 -152298 193266 -167554 -102298 -223078 47660 246860
18342 246860 302559 -60710 149737 -43983 -218330 -54121 67155 290546 -15198 -5737 -87841
18331 -87841 -386057 61723 91778 -190248 382898 -12187 -115151 235581 196533 276089 -40425
18319 205910 -173520 -23685 255628 190968 59426 110092 -106216 -142587 186213 -129424
$$ packed form
18400c5132H4274b08008G4409a86255o3706H9058D3642J96386J49744a25393K2662
18389a02731K9813G7147K6930B3587c57614J71903j27256h0519k8924j03864g4090
18377c39525a2545l88036B20629H1942f956A58059h2933H8962b8177j53525c2388
18365D9832a10956A48227B2982Q8278b67972B29942R9913d10081e806A60576b70625
18353e7458j5127k32075m1342e579j46719A93266a67554O5256j20780D7660J99200
18342B46860N5699f0710A49737d3983j74347e4121F7155K23391a5198e737q2104
18331h7841k98216F1723L0055a90248C82898a2187j02964B35581l9048P9556d0425
18319B05910a73520b3685B55628o4660E9426N0666a06216l6371A86213a29424
$$ plain form
18308 -53688 -53114 79981 2905 -126967 132060 -204782 340580 -65513 -89699 -406682 142939
18296 -171947 -190465 -89206 -35667 -43045 24843 272066 74231 247910 -83386 -310073 55089
18284 -103707 160383 89589 -138629 12107 -114665 20369 28035 13715 -17875 228830 -164725
18272 6923 34731 -23919 -357889 20074 205485 37881 419601 68654 -267761 94954 169420
18261 169420 48349 8057 3942 172410 -86000 -62521 12126 -162842 -292214 35273 -29119
18249 -131016 -308765 -34651 8372 64782 -151694 208500 -381073 -402043 238639 -39131 -143728
18238 -143728 -418490 -162672 -56202 -26421 -62855 -4926 -40306 -5832 2607 -352602 -13914
18226 -35324 239093 -104644 217265 -57621 -6710 185857 -279076 -95229 -190570 69189 15457
$$ packed form
18308e3688N74G9981B905a26967A32060b04782C40580f5513k4186l16983A42939
18296a71947j8518h9206c5667p378B4843K47223G4231J73679h3386k26687E5089
18284a03707A60383p0794a38629A2107a14665B0369P666A3715a7875B28830a64725
18272F923K7808b3919l33970B0074J85411C7881L81720F8654b67761I4954P4466
18261A69420D8349H057C942J68468h6000K3479A2126a62842j29372C5273b9119
18249a31016j77749c4651H372N6410a51694B08500c81073k0970B38639c9131j04597
18238a43728k74762a62672e6202b6421l6434d926l5380e832B607c52602a3914
18226c5324B39093a04644B17265e7621f710A85857b79076i5229r5341F9189A5457
$$ plain form
18214 -134565 67078 -106573 57317 -82916 -234383 -114032 392205 -126772 24154 -105002
18203 -85037 126521 -70864 53567 -73373 12966 29491 -239663 -9344 43116 -427399 202614
18191 -235441 -204107 -178452 3418 -43614 414849 -33821 -166214 28068 -234202 -48799 -259625
18180 -259625 -186731 -30008 141459 -229862 -26092 -45162 -62939 -52943 -400041 -64810 -84025
18169 -84025 126387 -56438 -127309 148698 -231657 -66525 -280084 17046 239108 -53498 -222817
18158 -222817 -47146 -98224 -74724 340310 224445 101021 -264721 -37924 280340 29646
18147 222226 -262136 169861 -151450 -68604 83511 -153211 436835 139818 -93167 -103691
18137 -103691 -117720 -69436 263775 -33905 -106672 90088 -52319 -167509 311695 -256553 -375743
$$ packed form
18214a34565F7078a06573E7317h2916j51467a14032C92205a26772B4154a05002
18203h5037A26521g0864E3567g3373A2966J6525b39663i344D3116d27399B02614
18191b35441L1334K5655C418d3614D14849c3821j32393B8068b34202d8799k10826
18180b59625P2894c0008A41459b29862b6092j9070j7777R996l47098f4810j9215
18169h4025A26387e6438p0871A48698b31657f6525k13559A7046K22062e3498j69319
18158b22817d7146n1078K3500C40310j15865A01021b64721c7924B80340B9646
18147B22226b62136A69861a51450f8604H3511a53211D36835A39818i3167j0524
18137a03691j4029M8284B63775c3905p2767I0088e2319j15190C11695b56553j19190
$$ plain form
18126 -375743 118129 -58190 -405360 21247 -176329 -151740 -29787 -94636 70896 103207 13591
18114 -98376 6060 -149258 22559 -235862 209795 170343 -59187 -145906 156998 198737 77830
18102 -29254 -154999 -238064 213075 -203905 124786 274830 -61597 7246 323767 79891 -117541
18090 929 -73787 -32059 63235 34562 215298 -14516 -68548 -322652 -282298 -260644 -73654 433748
18077 27712 324820 -230145 134301 7711 168060 -217906 -158204 -335831 -115213 -264836
18067 -264836 -126444 104178 175494 89070 163062 188484 -90507 -263728 103628 -13346 80414
18055 -319303 160670 -63685 111771 111236 -128399 93173 -219845 5622 -117923 -336607 34959
18043 -318081 259171 169902 -164176 62702 116473 -222676 -226127 -80364 -89526 274496 205347
$$ packed form
18126c75743A18129e8190l47170B1247a76329K4589b9787o4849G0896L2311A3591
18114i8376F060a49258B2559b35862B09795l9452e9187q6719A56998M1739G7830
18102b9254j25745q3065B13075b03905A24786J50044f1597G246L16521G9891a17541
18090I29g3787c2059F3235k8673J80736a4516n4032k54104M0354K1654g3654D33748
18077B7712K97108b30145A34301G711J60349b17906N9702j77627a15213j49623
18067b64836a26444A04178P1316q6424P3992K5422i0507j73221A03628a3346H0414
18055c19303A60670f3685A11771n35a28399I3173b19845E622a17923k18684C4959
18043c18081B59171q9269a64176F2702N3771b22676l451h0364r162B74496o9149
$$ plain form
18032 205347 -118630 55732 125946 71123 -229274 83810 -20939 -97263 -62803 101852 -133301
18020 -321829 -323414 101088 22779 -59525 -25429 -121771 -9404 177583 -132393 -33625 -29011
18009 -29011 -103053 167379 -142287 -86546 110690 165451 81729 -63706 170518 13159 99858
17998 99858 274443 -63210 -243628 14097 -155862 82404 343298 -147388 -328774 176302
17987 -235940 -46066 -14601 90964 -357899 114346 -8856 -18822 -145830 -130036 -60960 363359
17975 66533 29388 -174191 169567 244960 170948 -378877 176100 -123410 197246 -220106
17964 -90177 270467 184713 -112175 -54746 -224569 -59830 -53468 52391 100080 -60325 207980
17952 -108482 233984 47337 318081 -112524 183758 70576 -135727 16717 -33734 -338844
$$ packed form
18032B05347a18630E5732P0214n4823b29274H3810b0939p6324L4460A01852a33301
18020c21829j585A01088B2779e9525b5429r6342i404A77583a32393c3625M614
18009b9011p4042A67379a42287N5741A10690N4761H1729f3706A70518A3159Q6699
17998I9858J74585f3210j80418A4097a55862H2404K60894a47388j81386A76302
17987b35940d6066a4601I0964c57899A14346h856r966j27008J5794f0960C63359
17975F6533B9388a74191A69567P5393p4012c78877A76100a23410A97246b20106
17964i0177B70467q5754a12175e4746j69823e9830O362E2391M7689f0325B07980
17952a08482B33984D7337K70744a12524A83758G0576a35727A6717c3734l05110
$$ plain form
17942 -338844 -45872 252172 -127300 -308018 102376 174562 168985 108493 -106544 -68216 -219457
17931 -219457 186609 -152604 115836 236172 236065 20589 -176062 61323 86460 -37738 -163791
17920 -163791 -92073 246243 53368 95520 319407 -372973 -216375 112424 95187 -201232
17909 109857 76238 131404 102560 336909 -21869 -72936 -45854 266181 -179682 -289217 350838
17897 59688 317192 -103889 -81439 168302 144839 -402684 57858 183551 444540 -261248
17886 143381 167883 -337629 122932 34727 95072 153056 239305 290096 -21457 160723 -47995
17874 439507 -10488 151336 109486 105268 193698 354920 -151996 -202749 114946 -198963 -126452
17863 -126452 209980 14918 -10971 -17352 7952 48929 -262008 274796 -87114 356984 -21593
$$ packed form
17942c38844d5872B52172a27300j80718A02376P2186n577o0492a06544L8328j51241
17931b19457A86609a52604A15836J20336j07B0589a76062F1323K5137c7738j26053
17920a63791P1718B46243E3368M2152K23887c72973J56598A12424j7237b01232
17909A09857l3619N5166k8844K34349b1869n1067K7082B66181a79682j09535C50838
17897E9688K57504a03889K2450A68302k3463d02684E7858J25693K60989b61248
17886A43381K4502c37629A22932C4727O0345N7984Q6249N0791b1457A60723d7995
17874D39507a0488A51336m1850m218Q8430J61222a51996n0753A14946a98963P2511
17863a26452B09980A4918a0971o381G952M0977b62008B74796h7114C56984b1593
$$ plain form
17851 42127 376850 -58464 -157442 140476 164395 -46493 273382 -234701 -407438 -14478 -83383
17840 -83383 240743 -26630 -113134 -227818 -131533 -88244 -108105 70801 113827 374597 -362217
17828 -29954 218740 350106 -66581 6806 11450 -154307 -112194 195956 -137676 124262 443589
17817 443589 25149 -458726 42546 137795 -19246 248374 -31839 382871 -89722 120146 -279694
17805 31468 -19566 157265 -189399 235561 -63710 106804 -162017 -5815 222707 -2002 19153
17793 -420461 -125066 184216 -231492 53393 57635 196288 44775 -115707 46919 -169450
17782 185401 -35263 -191216 -149287 47063 58765 -6832 -149061 -55401 -83562 -315046 40821
17770 -118568 -195061 -21141 -156871 171389 -27953 183889 -25531 -28450 -27794 -45668 39199
$$ packed form
17851D2127L34723e8464r8978A40476K3919d6493B73382b34701j72737a4478o8905
17840h3383B40743b6630q6504j14684R6285M3289j9861G0801M3026K60770c62217
17828b9954B18740J31366f6581F806M644a54307M2113A95956a37676A24262L19327
17817D43589B5149d58726D2546R5249a9246B48374c1839C82871h9722A20146b79694
17805C1468a9566A57265a89399B35561f3710A06804a62017e815B22707b002A9153
17793d20461a25066A84216b31492E3393M242J38653D4775a15707D6919a69450
17782A85401c5263j55953M1929D7063J1702f832j42229e5401k8161k31484D0821
17770a18568p6493b1141j35730A71389b7953A83889b5531k919O56j7874C9199
$$ plain form
17758 -6471 -5518 41362 -167947 -96297 92818 -104662 -297920 -66374 303636 -56292 -125240
17747 -125240 33665 21212 186365 47675 60477 -191502 -30146 -277908 -96674 -134380 191682
17735 148228 -6856 123706 -105506 -90359 249223 -251560 289534 17894 325806 131345
17724 -174830 -223474 -54222 -88260 72324 94824 177097 -40209 154235 28384 17288 -29213
17712 210333 201603 26607 289084 190533 -84143 -113230 676728 -140821 36169 143136 37537
17700 199385 34122 243256 -92582 -201434 69355 -154455 145978 -83349 36983 -14348 -19598
17689 -19598 398380 335653 6254 -32327 -281665 191810 53156 475604 253478 -105260 197908
17677 25267 -269434 170554 93806 -146219 -173889 210712 -70657 -40726 36022 -56170 -35485
$$ packed form
17758f471R53D1362a67947P1650I2818a04662j93258f6374C03636e6292o8948
17747a25240C3665j2453J65153D7675J2802a91502c0146k47762i6674l7706A91682
17735A48228f856A23706a05506J5147B49223b51560B89534A7894L07912A31345
17724a74830m8644e4222l4038G2324K2500Q2273d0209A54235B8384j1096b9213
17712B10333q730B6607K62477r8551h4143k9087F76728a40821C6169J06967C7537
17700A99385C4122K09134i2582j08852F9355a54455A45978h3349C6983a4348n250
17689a9598C98380o2727F254c2327k49338A91810E3156M22448k22126a05260A97908
17677B5267b69434A70554p6748a46219k7670B10712g0657K9931C6022e6170K0685
$$ plain form
17666 -35485 296081 196145 -125652 72470 309724 -8276 -186366 -32578 -33818 -179667 -41281
17654 97761 140695 -95843 93249 -81244 -94768 -115217 -96296 233818 -107534 -33679 120687
17642 73764 -226974 128566 256266 -50059 49428 330977 62781 -350812 198351 669656
17632 669656 17843 4755 -60597 29119 182816 383567 -78991 -256176 302478 -141595 243722
17620 6726 -35437 -157930 136177 150643 327617 -46668 219746 -9757 -39759 137833 -128869
17608 3179 229275 204238 44997 213181 -6523 226663 33966 181536 -133282 79045 261431
17597 261431 127126 123700 175968 -25035 -18308 -177920 12266 -76029 -18076 145539 134129
17586 134129 97715 23869 101915 -80413 365747 228271 155128 46530 -110200 -142868 -138296
$$ packed form
17666c5485B96081r9936a25652G2470K37254h276j78090c2578j240j45849d1281
17654I7761M2934i5843I3249h1244j3524k0449J8921B33818a07534c3679A20687
17642G3764b26974A28566J27700e0059D9428K81549F2781c50812A98351M71305
17632F69656A7843D755f0597B9119J53697K00751g8991j77185C02478a41595B43722
17620F726c5437j22493A36177J4466J76974d6668B19746i757l0002A37833a28869
17608C179K26096k5037D4997J68184f523B26663C3966J47570a33282G9045J82386
17597B61431A27126l426N2268b5035O727j59612A2266g6029a8076A45539j1410
17586A34129l6414B3869P8046h0413C65747j37476p3143D6530a10200l2668M572
$$ plain form
17575 -138296 29341 183291 3531 312454 80977 146898 83401 450514 -39948 275803 -359271
17563 -96796 198116 123603 181989 117949 182778 165473 210264 -99018 174548 57138 -35299
17551 -130526 121665 252137 195217 214894 176962 -132066 495599 233322 -24476 -244401
17541 -244401 -204526 89949 -25052 103349 302185 121135 303305 106853 170340 278959
17531 278959 424414 -54076 380640 201294 130863 -111588 -127444 23949 613628 389033
17521 389033 453415 412720 923174 257862 203760 442995 235342 78157 189845 118342
17511 118342 432111 -339300 719518 365020 651970 618199 365954 306919 361713 298340
17501 298340 473824 137804 -32701 424614 -70546 259387 589032 -5685 291673 56909
$$ packed form
17575a38296B9341J53950C531L08923H0977O5921o3497L67113c9948B75803c59271
17563i6796A98116p4513N8386o4040O4829j7305M4791i9018A74548E7138c5299
17551a30526A21665J30472n6920J9677l7932a32066D95599B33322b4476k19925
17541b44401L9875H9949b5052A03349J98836A21135J82170A06853O3487J08619
17531B78959J45455e4076C80640j79346p0431a11588j5856B3949N89679k24595
17521C89033O4382m0695N10454B57862n4102K39235k07653G8157J11688p1503
17511A18342L13769c39300G19518l54498K86950l3771k52245n9035N4794o3373
17501B98340J75484A37804c2701D24614g0546B59387L29645e685B91673E6909
$$ plain form
17490 138050 -159226 160835 93708 173808 49126 265505 190385 113008 -96786 98177 284102
17479 284102 245670 119958 222461 247494 160197 382172 222550 150905 228348 250091 191630
17468 191630 65252 293612 3818 101864 353925 179402 5475 27439 138669 76952 296205
17457 296205 133363 125865 -57882 205170 375595 184577 364805 349522 154649 146090 209236
17446 209236 376332 -76745 189480 -45572 355979 99769 19000 378158 236374 287375
17436 287375 175523 386275 185535 110076 -140782 -66125 144622 16083 205711 -26452
17425 169071 98187 295585 179296 449754 -183770 49880 -64876 289774 156524 281232
17415 281232 70729 184065 109139 368907 283688 201490 174743 -99621 2144 125450 213417
$$ packed form
17490A38050a59226A60835o7127Q0100D9126K16379p5120p7377i6786I8177J85925
17479B84102l8432A19958J02503K5033q7297K21975j59622p1645P7443K1743n8461
17468A91630F5252K28360C818R8046K52061j74523E475K1964J11230o1717K19253
17457B96205A33363p498e7882B05170J70425A84577J80228j5283A54649q559O3146
17446B09236J67096g6745A89480d5572C55979I9769A9000L59158j41784N1001
17436B87375j11852K10752A85535p5459a40782f6125A44622A6083J89628b6452
17425A69071p0884J97398j16289K70458a83770D9880f4876B89774j33250J24708
17415B81232G0729J13336p4926K59768q5219q2198k6747i9621B144J23306Q7967
$$ plain form
17404 213417 78040 -93972 -39526 181389 120043 -3869 -110678 194279 24446 189165 -163975
17392 195750 188434 390360 178731 43882 174222 144066 152454 249996 388272 381993 121054
17380 30019 36368 194727 294285 367804 185600 175419 387674 216209 307751 203096 259449
17369 259449 450350 62752 -125288 51663 220813 348 329343 74146 292345 127232 78627
17358 78627 -48343 -133132 202449 381807 131377 361176 34219 273038 -30044 -79504 331835
17346 134358 69735 -48606 -28683 336203 213723 221994 235000 -90224 154755 -55757 101524
17334 162064 316596 266988 -111303 146718 -127496 100821 -20429 218427 90195 261209
17324 261209 258716 115554 18298 -96451 129894 387523 -251780 142053 409694 285468
$$ packed form
17404B13417G8040i3972c9526A81389o1346c869j06809A94279B4446J64719a63975
17392A95750p316K01926A78731D3882J30340l0156Q388R7542J38276o279A21054
17380C0019O349J58359R9558P3519j82204j0181K12255j71465R1542j04655N6353
17369B59449J90901F2752a25288E1663J69150C48L28995G4146K18199A27232m8605
17358G8627d8343q4789B02449J79358A31377K29799C4219K38819c0044m9460C31835
17346A34358o4623d8606J9923C36203j22480Q271J3006i0224A54755e5757A01524
17334A62064J54532m9608a11303A46718a27496A00821b0429B18427I0195J71014
17324B61209k493A15554A8298i6451A29894K57629b51780A42053K67641j24226
$$ plain form
17314 285468 255328 222291 -87622 45352 208015 177544 349237 150342 141994 -60537 233742
17302 228140 83770 478022 382099 213853 199283 136469 1550 199576 -35772 189576 301021
17291 301021 288071 223278 285221 269296 195325 3104 209952 307149 4885 40756 364132
17280 364132 173500 -74847 18693 130526 -65116 105380 299886 -41026 322107 -84111
17269 70674 406036 204603 476872 25158 277347 387757 -111038 96128 419320 546088
17259 546088 152805 -31465 175549 181335 76090 260728 323416 204614 461179 -101733
17248 73384 230892 449943 142768 263304 233990 523703 76292 187732 221398 175496
17238 175496 182484 93852 332022 96849 148225 171698 323708 454210 206878 193119 -144863
$$ packed form
17314B85468l0140l3037h7622D5352J62663l0471J71693A50342q348f0537B33742
17302B28140H3770L94252r5923j68246j4570o2814A550J98026c5772A89576J11445
17291C01021j2950o4793O1943j5925p3971C104K06848R7197D885L5871L23376
17280C64132A73500g4847A8693J11833f5116A05380J94506d1026C22107h4111
17269G0674L35362k01433K72269B5158K52189J10410a11038I6128L23192J26768
17259E46088A52805c1465A75549N786G6090J84638O2688j18802K56565a01733
17248G3384J57508K19051A42768J20536k9314K89713G6292J11440L3666m5902
17238A75496O988q8632K38170I6849N1376K3473J52010J30502B06878j3759a44863
$$ plain form
17226 383626 295770 460547 155675 392729 418833 60815 217804 634118 216637 294313
17216 294313 16921 273927 373299 43999 248708 345715 487834 147937 437167 -163443
17205 315557 154418 205749 20508 77733 118483 129485 262836 335980 139339 31003 336022
17194 336022 521288 462394 -136706 548783 202109 291754 513923 344224 78521 217646
17184 217646 506761 182813 274230 562541 537911 393175 300993 517218 347510 177397
17174 177397 243099 464100 615284 308686 611363 247131 288782 351048 252400 378289
17164 378289 437797 336257 467156 682135 398200 206406 423635 502102 102049 296759
17154 296759 218041 309888 315399 59493 217805 234835 408961 351357 266272 419840 469121
$$ packed form
17226C83626q7856J64777A55675K37054K6104F0815J56989M16314B16637P7676
17216B94313A6921K57006R9372D3999K04709R7007J42119A47937K89230a63443
17205C15557A54418N1331B0508N7225M0750J1002J33351P3144A39339C1003L05019
17194C36022J85266n8894a36706E48783B02109Q9645K22169j69699G8521J39125
17184B17646K89115A82813R1417K88311k4630j44736r2182K16225j69708j70113
17174A77397O5702K21001J51184l06598L02677B47131M1651O2266r8648J25889
17164C78289N9508j01540J30899K14979k83935j91794K17229P8467A02049J94710
17154B96759p8718R1847N511E9493J58312J7030J74126n7604q5085J53568M9281
$$ plain form
17143 469121 177015 -37793 310473 297593 230787 322539 285869 359122 186911 114682 289389
17132 289389 320673 333953 263905 249454 382236 702887 198239 343054 224156 314694
17122 314694 374569 303994 428391 550366 445811 406684 188377 691522 395328 175897
17111 306622 182541 55863 523109 450740 285803 459549 783135 489283 556584 591594
17101 591594 207526 536121 536412 163305 439873 503801 692887 564714 109328 370161
17091 370161 423475 460009 561305 387205 383521 495889 131216 358562 437605 376264 428120
17080 428120 454931 305464 388075 431491 303074 767271 719715 509976 504701 536700 468199
17069 468199 560784 26009 688802 650544 431612 615873 637104 369335 339421 498407
$$ packed form
17143D69121A77015c7793C10473j2880o6806R1752l6670P3253j72211p2229J74707
17132B89389L1284J3280p0048j4451J32782L20651A98239J44815j18898R0538
17122C14694N9875p0575J24397J21975j04555l9127A88377N03145k96194A75897
17111C06622j24081E5863M67246p2369j64937J73746L23586k93852O7301L5010
17101E91594B07526L28595K91A63305K76568O3928J89086j28173A09328K60833
17091C70161N3314L6534J01296j74100l684J12368A31216K27346P9043o1341N1856
17080D28120K6811j49467Q2611M3416j28417M64197m7556k09739n275L1999o8501
17069D68199R2585B6009O62793l8258k18932J84261K1231k67769k9914J58986
$$ plain form
17059 498407 416973 335840 552577 557195 601053 567899 799005 895853 445717 712000 499979
17048 499979 510040 493429 741013 684080 615464 402202 650965 647483 583577 582008 921745
17037 921745 681749 827791 645389 569848 638543 701221 574493 857617 472798 548913
17027 548913 699321 702474 672978 783094 579891 614837 537663 725090 454655 770022
17017 770022 752317 473152 912814 803237 978799 611954 677624 821026 704345 695828
17007 695828 1130178 712669 862595 692528 972773 1113087 692270 937097 999357 610261
16997 610261 656987 721232 1182514 917793 1005659 849817 841835 805792 1180354 923102 535813
16986 535813 979455 1047884 920591 849655 1029742 942941 991075 747521 834630 1183267
$$ packed form
17059D98407q1434q1133K16737M618M3858l3154K31106R6848D45717K66283k12021
17048D99979J0061j6611K47584n6933o8616k13262K48763l482o3906j569L39737
17037I21745k39996J46042j82402p5541O8695O2678j26728K83124l84819P6115
17027E48913J50408L153k9496J10116k03203L4946p7174J87427k70435L15367
17017G70022j7705k79165M39662j09577J75562l66845O5670J43402j16681q517
17007F95828M34350m17509J49926j70067K80245J40314m20817K44827O2260l89096
16997F10261M6726O4245M61282k64721Q7866j55842p982l6043L74562k57252l87289
16986E35813M43642O8429j27293p0936J80087q6801M8134k43554Q7109L48637
$$ plain form
16976 1183267 1049736 1072520 830515 1060530 782816 987210 931038 1046672 1011110 1096758
16966 1096758 884497 1220068 1105874 1123699 1304856 897043 1072073 941946 1267089 742161
16956 742161 1286235 1230920 1765875 1118084 1285081 1235941 1140819 1405725 1472239 1181896
16946 1181896 1290223 1204724 1195602 1139617 1480370 1508744 1482139 1236293 1313638 1223315 1477457
16935 1477457 1405466 1155244 1491751 1500252 1669689 1542601 1459799 1551467 1405927 1462250
16925 1462250 1478387 2071441 1780412 1946038 1636417 1666176 1392131 1744136 1799924 1613943
16915 1613943 1619619 1930064 1519233 2313349 1765561 1897651 2208216 2301154 2095283 1988200
16905 1988200 1833334 1861033 2021375 2145440 2105892 1883372 2256339 2012536 1915312 2229532
$$ packed form
16976A183267j33531K2784k42005K30015k77714K04394n6172J15634l5562Q5648
16966A096758k12261L35571j14194J7825J81157m07813J75030j30127L25143n24928
16956G42161N44074n5315N34955o47791J66997m9140r5122K64906O6514k90343
16946A181896J08327q5499r122n5985L40753K8374k6605k45846P7345r0323K54142
16935A477457p1991k50222L36507Q501J69437j27088q2802R1668j45540N6323
16925A462250J6137N93054k91029J65626l09621K9759k74045L52005N5788j85981
16915A613943N676L10445m10831P94116n47788J32090L10565R2938k05871j07083
16905A988200j54866K7699J60342J24065l9548k22520L72967k43803r7224L14220
$$ plain form
16895 2229532 2345862 2551515 2542421 2360651 2545116 2407306 2240403 2415343 2558960 2590332
16885 2590332 2500130 2477199 2376067 2690171 2889925 2630407 2675062 3018525 2950452 2686494
16875 2686494 3013549 2934143 2927366 2891179 3312124 3145532 3425885 3270268 3296988 3313763
16865 3313763 3132296 3486319 3494691 3511885 3405916 3408554 3511374 3441917 3775488 3880364
16855 3880364 3645987 3787368 4110070 4019023 3846946 4280024 4279490 4079387 4403950 4345396
16845 4345396 4774938 4378383 4691266 4907486 4659819 5011033 4889448 5308370 5185434
16836 5185434 5118676 5474515 5308550 5414168 5501398 5586190 5906899 5905604 5768802 6434462
16826 6434462 6150056 6330380 6578626 6789186 7001270 6840896 7266292 7235653 7654758 7636404
$$ packed form
16895B229532J16330K05653r094j81770J84465j37810j66903J74940J43617L1372
16885B590332r0202k2931j01132L14104J99754k59518M4655L43463o8073k63958
16875B686494L27055p9406o777l6187M20945j66592K80353j55617K6720J6775
16865C313763j81467L54023Q372J7194j05969K638J02820o9457L33571J04876
16855C880364k34377J41381L22702r1047j72077M33078n34k00103L24563n8554
16845D345396M29542l96555L12883K16220k47667L51214j21585M18922j22936
16836E185434o6758L55839j65965J05618Q7230Q4792L20709j295j36802O65660
16826F434462k84406J80324K48246K10560K12084j60374M25396l0639M19105j8354
$$ plain form
16816 7636404 7790661 8000007 7853957 8058591 8265757 8580242 8882504 8774870 9490110
16807 9490110 9634994 9741623 10086165 10130536 10449996 10395721 10912843 11108562 11552184 11630670
16797 11630670 12336031 12011126 12526562 13047688 13056744 13417709 14007815 14354562 14740006 15223565
16787 15223565 15932560 16157063 16588594 17012981 17464916 18095277 18722869 19183912 19872281
16778 19872281 20371002 20977961 21764556 22319345 23110185 24016678 24323091 25624889 26606157
16769 26606157 27143462 28520634 29134369 30485370 31796748 32746957 33636892 35389480 36522177
16760 36522177 38525655 39526490 41047605 42906251 44570109 46325637 48777749 50196244
16752 50196244 52064888 54504583 57115365 59437216 61727995 64635962 66985646 69902668
$$ packed form
16816G636404J54257K09346j46050K04634K07166L14485L02262j07634P15240
16807I490110J44884J06629L44542M4371L19460n4275N17122J95719M43622P8486
16797A1630670P05361l24905N15436N21126R056L60965N90106L46747L85444M83559
16787A5223565P08995K24503M31531M24387M51935O30361O27592M61043O88369
16778A9872281M98721O06959P86595N54789P90840R06493L06413J301798R81268
16769B6606157N37305J377172O13735J351001J311378R50209Q89935J752588J132697
16760C6522177K003478J000835J521115J858646J663858J755528K452112J418495
16752E0196244J868644K439695K610782K321851K290779K907967K349684K917022
$$ plain form
16744 69902668 72866146 75906887 79414859 82675990 85798189 89087580 92850481 96006234
16736 96006234 99410395 103146936 106344256 109409416 112355376 115402005 118277016 120548212
16728 120548212 122886200 124375840 125551129 126716045 127339866 127503415 127284713 126570865
16720 126570865 125811235 124121961 122474922 119956709 117821987 114923793 112010044 109036097
16712 109036097 105539955 102103223 98935787 95616626 92394483 88866712 85616248 82252544
16704 82252544 79144283 75979703 73060461 70392494 67278396 64349406 61806675 59422383
16696 59422383 57092641 55142060 52505927 50375463 48741717 46338558 44975336 43231186
16688 43231186 41933465 39933359 38659582 36981102 35959942 34679541 33312451 32131040
$$ packed form
16744F9902668K963478L040741L507972L261131L122199L289391L762901L155753
16736I6006234L404161L736541L197320L065160K945960L046629K875011K271196
16728A20548212K337988J489640J175289J164916O23821J63549k18702p13848
16720A26570865p59630j689274j647039k518213k134722k898194k913749k973947
16712A09036097l496142l436732l167436l319161l222143l527771l250464l363704
16704H2252544l108261l164580k919242k667967l114098k928990k542731k384292
16696E9422383k329742j950581k636133k130464j633746k403159j363222j744150
16688D3231186j297721k000106j273777j678480j021160j280401j367090j181411
$$ plain form
16680 32131040 31092497 30152540 29191826 28298047 27043086 26354971 25648418 24516671 23803735
16671 23803735 22807947 22328489 21721102 21008835 20538448 19864681 19346467 18873413 18151212
16662 18151212 17698438 17232299 16240253 16267694 15856182 15452625 14982320 14586227 14179158
16653 14179158 13886943 13543375 13337869 13050802 12588349 12302674 11884343 11884722 11703561 11433864
16643 11433864 11020061 10607057 10277691 10279329 10200643 9965977 9448286 9405152 9190111 9152845
16633 9152845 8800834 8718725 8802741 8540623 8204808 7918549 7751511 7902349 7562422 7492574
16623 7492574 7348497 7102499 7456209 6793666 7102440 6679593 6669809 6643025 6314689 6447954
16613 6447954 6327104 6216353 6161699 5639638 6068285 5527133 5509976 5458351 5313765 5011311
$$ packed form
16680C2131040j038543r39957r60714q93779j254961o88115p06553j131747p12936
16671B3803735r95788m79458o07387p12267m70387o73767n18214m73054p22201
16662A8151212m52774m66139r92046K7441m11512m03557m70305l96093m07069
16653A4179158k92215l43568k05506k87067m62453k85675m18331L79j81161k69697
16643A1433864m13803m13004l29366J638p8686k34666n17691m3134k15041l7266
16633I152845l52011q2109Q4016k62118l35815k86259j67038J50838l39927o9848
16623G492574j44077k45998L53710o62543L08774m22847r784k6784l28336J33265
16613F447954j20850j10751n4654n22061M28647n41152j7157n1625j44586l02454
$$ plain form
16603 5011311 5153508 5189140 5294984 5060657 5276545 5026504 4833507 4531616 4538205 4605926
16593 4605926 4344166 4578591 4302252 4256514 4219751 4217777 4175314 4158033 4165068 4225920 3777984
16582 3777984 3751800 3858780 3575038 3821973 4005311 3648378 3801381 3420484 3506803 3225690
16572 3225690 3529684 3608696 3688225 3547160 3523919 3073918 3327455 3203335 3217623 3265776
16562 3265776 3075166 3160688 3254578 2675134 3090582 2626202 3059811 2868670 2884648 2909355
16552 2909355 2702257 2595202 3088421 2732038 2746837 2734649 2723251 2549547 2819811 2422120
16542 2422120 2496312 2546212 2226270 2604641 2227711 2241639 2254264 2288577 2393724 2311784
16532 2311784 2379888 2164329 2137679 2141126 2261107 2293531 1986357 2509252 2386163 2098998
$$ packed form
16603E011311J42197L5632J05844k34327K15888k50041j92997l01891O589O7721
16593D605926k61760K34425k76339m5738l6763j974m2463j7281P035O0852m47936
16582C777984k6184J06980k83742K46935J83338l56933J53003l80897Q6319k81113
16572C225690L03994P9012P9529j41065k3241m50001K53537j24120J4288M8153
16562C265776j90610Q5522R3890n79444M15448m64380M33609j91141J5978K4707
16552B909355k07098j07055M93219l56383J4799j2188j1398j73704K70264l97691
16542B422120P4192M9900l19942L78371l76930J3928J2625L4313J05147q1940
16532B311784O8104k15559k6650L447J19981L2424l07174N22895j23089k87165
$$ plain form
16522 2098998 1688738 2005898 2097713 2485943 2186221 1714933 1650624 2061798 2156872 1807197
16512 1807197 1918596 1998870 2047519 1614686 1936816 1895041 1893140 1818742 1959789 1417858
16502 1417858 1707631 2126571 1834483 1812455 1774325 2012203 1791409 1671533 1632012 1619188
16492 1619188 1566347 1705178 1590154 1709305 1573271 1774589 1949064 1757227 1652713 1604746
16482 1604746 1726041 1243284 1431134 1311825 1377807 1768861 1477612 1468718 1696898 1427171
16472 1427171 1522008 1750851 1708181 1755234 1652004 1655508 1626496 1485847 1352055 1509195
16462 1509195 1313369 1166080 1299318 1267540 1255362 1554459 1213224 1641122 1373830 1697348
16452 1697348 1267685 1581230 1324666 1368173 1021468 1295042 1035545 1338005 1770172 1238681
$$ packed form
16522B098998m10260L17160R1815L88230k99722m71288o4309M11174R5074l49675
16512A807197J11399Q0274M8649m32833L22130m1775j901p4398J41047n41931
16502A417858K89773M18940k92088k2028l8130K37878k20794j19876l9521j2824
16492A619188n2841J38831j15024J19151j36034K01318J74475j91837j04514m7967
16482A604746J21295m82757J87850j19309O5982L91054k91249q894K28180k69727
16472A427171R4837K28843m2670M7053j03230L504k9012j40649j33792J57140
16462A509195j95826j47289J33238l1778j2178K99097l41235M27898k67292L23518
16452A697348m29663L13545k56564M3507l46705K73574k59497L02460M32167n31491
$$ plain form
16442 1238681 1119173 1363383 1145951 1225439 1358889 1382302 1425954 1195229 1208333 1286571
16432 1286571 962865 1050901 1536427 1299665 1338590 1103518 943638 1140401 824126 1206059
16422 1206059 869233 996156 1353132 1096539 1040105 1268215 1303877 925481 1006913 1318769
16412 1318769 989779 1292131 1065206 1118315 1253328 984114 1017398 725371 904776 896077
16402 896077 949820 1266717 1018642 941491 1198720 913665 1131777 917844 1193310 825989
16392 825989 631871 887050 892046 883946 932048 752104 866926 564002 952654 984038 1050828
16381 1050828 972115 847502 734402 989222 690604 1109124 934444 1233683 1131798 1075376
16371 1075376 782769 1098095 1003365 1098306 1096893 808528 692685 696920 461855 1005247
$$ packed form
16442A238681j19508K44210k17432P9488J33450K3413M3652k30725J3104P8238
16432A286571l23706Q8036M85526k36762L8925k35072j59880J96763l16275L81933
16422A206059l36826J26923L56976k56593n6434K28110L5662l78396Q1432L11856
16412A318769l28990L02352k26925N3109J35013k69214L3284k92027J79405q699
16402H96077N3743L16897k48075p7151K57229k85055K18112k13933K75466l67321
16392H25989j94118K55179M996q100M8102j79944J14822l02924L88652L1384O6790
16381A050828p8713j24613j13100K54820k98618M18520j74680K99239j01885n6422
16371A075376k92607L15326r4730R4941j413k88365j15843M235k35065N43392
$$ plain form
16361 1005247 705667 671463 658460 762358 1021320 722767 598647 780084 789537 977260
16351 977260 709460 953291 1009451 702914 1032171 992270 905225 887881 823770 770806 752310
16340 752310 599624 563618 949884 881254 911077 860730 938250 712910 906870 849449 461346
16329 461346 791382 1080026 1205127 867191 599610 849831 613306 699829 764252 864082
16319 864082 650451 784990 799896 777657 831668 652546 833309 680282 908274 481022
16309 481022 435860 765069 624920 931672 712304 614774 1146835 665349 893257 735238
16299 735238 661289 819185 760787 831477 599310 750111 735707 575231 614751 850478
16289 850478 522945 600656 522312 504275 670746 669865 353320 668989 858169 763841 887579
$$ packed form
16361A005247k99580l4204j3003J03898K58962k98553j24120J81437R453J87723
16351I77260k67800K43831N6160l06537L29257l9901q7045j7344o4111n2964j8496
16340G52310j52686l6006L86266o8630K9823n0347P7520k25340J93960n7421l88103
16329D61346L30036K88644J25101l37936k67581K50221k36525Q6523O4423R9830
16319H64082k13631J34539J4906k2239N4011j79122J80763j53027K27992m27252
16309D81022m5162L29209j40149L06752k19368r7530N32061m81486K27908j58019
16299G35238p3949J57896n8398P0690k32167J50801j4404j60476L9520K35727
16289H50478l27533P7711p8344j8037J66471q81l16545L15669J89180r4328J23738
$$ plain form
16278 887579 580425 701767 539979 867314 909424 503063 662909 469675 565737 620405
16268 620405 332022 587896 310854 459917 569349 536438 589164 360573 356083 527500
16258 527500 773711 574940 557850 567556 558121 358571 475311 657534 469495 965744
16248 965744 422265 619684 539307 177714 437367 477758 683473 333694 354966 629416
16238 629416 620901 276704 515804 569042 436387 192392 336002 361914 681397 356441
16228 356441 427296 592265 568366 376040 413634 799246 519468 597968 663072 582993 683778
16217 683778 383687 651163 385262 193072 358518 317224 591943 220155 473560 231962
16206 641725 451292 556095 356329 302410 467993 554114 455520 348297 547079 356543
$$ packed form
16278H87579l07154J21342j61788L27335M2110m06361J59846j93234R6062N4668
16268F20405k88383K55874k77042J49063J09432l2911N2726k28591m490J71417
16258E27500K46211j98771j7090R706r435j99550J16740J82223j88039M96249
16248I65744D22265J97419q0377A77714K59653M0391K05715C33694K1272K74450
16238F29416q515B76704K39100N3238j32655A92392J43610K5912L19483l24956
16228C56441P0855J64969k3899j92326L7594L85612k79778P8500O5104q0079J00785
16217F83778l00091K67476k65901j92190J65446m1294K74719B20155K53405B31962
16206F41725j90433J04803j99766n3919J65583Q6121r8594j07223J98782j90536
$$ plain form
16196 356543 439353 426692 269778 454604 347313 491899 633160 521734 611649 389336
16186 389336 362374 746535 470942 387220 159651 99913 499597 413547 395398 502815
16176 502815 304912 587992 343681 41665 379515 392159 422187 236271 69414 276056
16166 276056 367023 195762 573004 307876 49546 48286 532668 209240 350829 577462
16156 577462 366730 272912 220200 513924 486785 200207 141252 368925 120600 431534
16146 431534 177896 320170 68324 521148 332977 -13776 474974 334425 171837 448394
16136 448394 350476 255643 384552 -5021 319245 35036 205156 -27060 154178 178104 203174
16125 203174 251399 102091 72272 306160 372307 426054 -238063 28366 446596 -51265 219441
$$ packed form
16196C56543Q2810j2661j56914J84826j07291J44586J41261j11426Q9915k22313
16186C89336k6962L84161k75593q3722A59651n9738L99684q6050j8149J07417
16176E02815j97903K83080k44311D1665L37850J2644L0028j85916F9414K06642
16166B76056R0967j71261L77242k65128D9546j260M84382B09240J41589K26633
16156E77462k10732r3818n2712K93724k7139B00207n8955K27673A20600L10934
16146D31534A77896J42274F8324M52824j88171a3776D74974j40549j62588K76557
16136D48394r7918r4833J28909e021C19245C5036J70120b7060A54178K3926K5070
16125B03174M8225A02091k9819K33888O6147N3747b38063B8366M18230e1265B19441
$$ plain form
16113 254185 29410 222836 213525 224375 195748 35245 187650 263431 397197 535899 272448
16102 272448 -16395 123782 176819 250061 -132113 718798 194873 215613 282121 430648
16092 430648 285047 602467 253766 331690 226353 234850 67235 439863 335863 441242
16082 441242 146694 153619 28297 157990 392440 303558 299198 122294 -60784 230591 86645
16070 457915 414898 299916 147875 215469 468817 99361 131822 20569 -302903 267698
16059 130819 111778 472389 -39790 -94186 -155439 30439 31578 74033 236383 -185963 -170994
16048 -170994 -1083 200409 224477 -421674 242596 185928 396570 239720 218656 88892 -148202
16036 -19116 79331 182315 268151 -55544 -166543 -73174 115184 387825 47992 355204 -165741
$$ packed form
16113B54185B9410J93426r311J0850k8627C5245J52405P5781J33766J38702k63451
16102B72448a6395A23782N3037P3242a32113G18798A94873K0740O6508J48527
16092D30648j45601L17420B53766P7924j05337Q497F7235L72628j04000J05379
16082D41242A46694O925B8297J29693K34450q8882m360A22294f0784B30591H6645
16070D57915m3017j14982A47875O7594K53348I9361L2461B0569c02903B67698
16059A30819j9041L60611c9790n4396o1253C0439J139M2455J62350a85963J4969
16048a70994a083B00409K4068d21674B42596n6668K10642j56850k1064H8892a48202
16036a9116G9331J02984Q5836e5544j10999g3174A15184K72641D7992L07212a65741
$$ plain form
16024 -183987 -28803 -198202 8556 476293 283459 282733 -198900 169779 361654 304364 126537
16012 -265135 -124401 147478 139915 335888 39492 32054 273629 -89143 -155910 342936 -128188
16000 -236320 264441 -210312 220034 252663 -111328 90640 264582 -86689 131648 -113415
15989 7031 155445 423232 735685 800147 585818 1028420 1005803 516466 390891 175044
15978 13741 154602 284126 176007 -80933 241764 156861 -20513 227204 -3540 -5592 -95209
15967 -95209 -412040 48603 -168615 18109 298803 4876 50077 -57678 145355 -73230 -160003
15956 -160003 -183375 74639 192712 53692 -142946 43070 -54529 49985 -24088 165054 19057
15944 67625 127487 -28579 -204415 -195171 448287 -168536 -46896 89474 -87638 130228 85929
$$ packed form
16024a83987b8803j69399H556M67737j92834p26a98900A69779J91875n7290A26537
16012b65135a24401A47478p563J95973C9492p438K41575h9143o6767C42936a28188
16000b36320B64441b10312B20034L2629a11328I0640J73942h6689A31648a13415
15989G031J48414K67787L12453O4462k14329M42602k2617m89337j25575A75044
15978A3741J40861J29524j08119h0933B41764q4903b0513B27204c540k052q9617
15967i5209l16831D8603a68615A8109K80694D876M5201e7678A45355g3230q6773
15956a60003k3372G4639J18073E3692a42946D3070e4529D9985b4088A65054A9057
15944F7625N9862b8579j75836R244D48287a68536d6896H9474h7638A30228m4299
$$ plain form
15933 85929 142811 -320963 42605 -90158 201710 -168149 -65314 -14575 -80151 -150043 -269075
15922 -269075 67807 292324 227308 328867 -44922 -128918 101411 148986 162277 20187 82367
15911 82367 -40022 70859 -13106 192443 45800 293655 -120075 103506 5162 368138 -126745
15899 -171723 470033 -65038 370762 -33256 58092 -81294 -176459 -68712 303003 -53442 8584
15887 -236202 -79714 200963 28082 54775 -62490 39409 -137047 -120205 -167100 -17055 101820
15875 -371811 217450 111316 -206205 -42469 64258 -106995 -21297 -219372 37474 6523 -35309
15863 -122956 14463 277 58096 177898 -29962 -238867 62776 -68514 248207 -53433 183531
15851 -123319 -99781 -16007 -142269 -193705 -134072 -156945 90391 24000 -237817 -49413 -149990
$$ packed form
15933H5929N6882c20963D2605i0158B01710a68149f5314a4575o5576o9892j19032
15922b69075F7807K24517o5016J01559d4922q3996A01411M7575J3291B0187O2180
15911H2367d0022G0859a3106A92443D5800K47855a20075A03506E162L62976a26745
15899a71723D70033f5038C70762c3256E8092h1294r5165f8712C03003e3442H584
15887b36202g9714B00963B8082K6693f2490C9409a37047J6842m6895a7055A01820
15875c71811B17450j06134b06205d2469F4258a06995b1297j98075C7474F523c5309
15863a22956A4463B77N7819J19802b9962k08905F2776f8514B48207e3433A83531
15851a23319K3538a6007j26262n1436N9633k2873I0391B4000b37817d9413j00577
$$ plain form
15840 -149990 185523 -227291 -95617 212307 -133869 223259 -12545 -352236 -23430 34477
15829 -116612 -297483 34492 -198177 -75061 -114813 -213156 -69730 -116043 -27733 13671 71332
15818 71332 -98748 40833 -88794 34834 -22518 1172 39094 59862 88073 389562 53543 -172103
15805 -63285 -297057 75911 37258 -218477 51633 -174117 261972 -310786 -305960 79884 -215207
15793 -379948 209658 -213049 59613 -33229 277302 11952 -373942 -32319 262453 -159516
15782 -183080 -155881 369267 -187479 -58810 40614 -519231 -245285 -92841 266701 -109571
15771 -122502 223780 40308 45886 121531 -231274 204857 201179 187002 407380 -111573 26097
15759 172587 -135016 -49900 276116 -225744 -52611 -331054 -206458 -86785 -206505 -132229
$$ packed form
15840a49990A85523b27291i5617B12307a33869B23259a2545l39691b3430C4477
15829a16612j80871C4492a98177g5061l9752r8343f9730m6313b7733A3671N7661
15818G1332i8748D0833h8794C4834b2518A172L7922K0768K8211L01489E3543a72103
15805f3285k33772G5911C7258b18477E1633a74117B61972c10786M826G9884b15207
15793c79948B09658b13049E9613c3229B77302A1952c73942c2319B62453a59516
15782a83080K7199C69267a87479e8810D0614e19231b45285i2841B66701a09571
15771a22502B23780D0308N578P5645b31274B04857l678j4177K20378a11573B6097
15759A72587a35016d9900B76116b25744e2611k78443J24596h6785j19720P4276
$$ plain form
15749 -132229 13285 -94068 146673 -114098 8101 -65438 -308358 -68812 -67065 -23427 28668
15737 -259001 -118756 140568 -22313 -262239 304363 -135555 273399 -115630 305856 -62719
15726 -50461 -86733 -14032 63520 -139402 33028 -41801 -116444 -243579 151615 -130223 19502
15714 -131721 -7055 -380572 -282551 189697 147574 20249 -287533 119176 74684 -326097 -46345
15702 -180017 -6903 -206094 20449 196317 69887 57059 7924 125580 -45351 -120038 90844
15690 33378 9482 76559 -95807 97982 -38441 -370473 -186732 -256451 31478 96841 -229041
15678 272721 108738 -24104 84803 97989 68367 121823 -41167 -73631 39429 93313 84868
15667 84868 -95941 159101 -220692 -148360 -77188 -315907 -261659 -84283 -43088 -102306 -134588
$$ packed form
15749a32229A3285i4068A46673a14098H101f5438k42920f8812J747b3427B8668
15737b59001a18756A40568b2313k39926C04363a35555B73399a15630C05856f2719
15726e0461l6272a4032F3520a39402C3028d1801p4643j27135A51615a30223A9502
15714a31721g055l73517R8021A89697m2123B0249b87533A19176m4492c26097d6345
15702a80017f903j99191B0449J75868F9887j2828G924J17656d5351p4687I0844
15690C3378I482O7077i5807I7982c8441l32032J83741o9719C1478O5363b29041
15678B72721A08738b4104H4803J3186k9622N3456d1167l2464C9429N3884q445
15667H4868i5941A59101b20692P2332P1172k38719N4248h4283M1195n9218l2282
$$ plain form
15656 -134588 83313 -8203 -102679 -104081 -82675 7471 -19986 256782 161706 -58074 297567 36614
15643 -340279 -108651 35915 -140564 -96681 13815 50985 160171 208470 -122539 1157 -31796
15631 -76325 98989 -60478 -20641 -198654 -1980 -94759 -16796 237358 -79980 56166 -174708
15619 -68043 38082 71469 -21768 -169565 19647 -105470 -122622 -103545 -203219 -41053 320041
15607 46795 -158103 -144783 -98109 -360404 -137698 115279 56787 201380 8607 -252555 59814
15595 -25714 -255218 5532 3223 -383 -163072 14168 -86863 175887 -100896 103278 -337513
15583 -28529 -1615 49904 77875 11020 132218 -402512 -3543 45310 -63453 -29799 174554
15571 247020 -9673 -200092 14600 226700 -170819 44138 -400466 -376130 146733 -231904
$$ packed form
15656a34588H3313h203r4476j402K1406G471a9986B56782r5076e8074B97567C6614
15643c40279a08651C5915a40564M3883A3815L7170J09186M8299a22539A157c1796
15631g6325I8989f0478b0641j78013a980r2779a6796B37358g9980E6166a74708
15619f8043C8082L3387b1768j47797A9647a05470j7152J9077r9674d1053C20041
15607D6795a58103J3320M6674k62295a37698A15279E6787J44593H607b52555E9814
15595b5714k29504E532k309c83j62689A4168h6863A75887a00896A03278c37513
15583b8529a615D9904K7971A1020J21198d02512c543D5310f3453b9799A74554
15571B47020i673j90419A4600K12100a70819D4138d00466K4336A46733b31904
$$ plain form
15560 157827 -279869 17763 -83795 64764 -170728 -267091 89173 -217026 42693 158263 -43912
15548 -157051 -88283 120598 37252 -65525 -273199 -255168 -39506 55729 79802 238476 -191685
15536 86594 -59304 -163244 -4505 208421 124899 -426928 113594 101965 204032 -170048 -316934
15525 -316934 16036 -488742 -59462 -170581 55835 -59066 -131445 -75971 137104 248538 -6216
15513 9656 81039 -25712 -9268 -177075 32852 260622 -147672 526389 -62286 -236391 -23423
15501 427720 6434 131283 -140762 -104760 184640 17612 6826 -45966 32583 181867 -319251
15489 -115515 -137982 137544 222163 194489 21297 -252823 -115377 1384 -96158 -92068 -217272
15478 -217272 34339 70345 -73572 355773 201041 626029 355689 470632 292860 63490
$$ packed form
15560A57827b79869A7763h3795F4764a70728r6363H9173b17026D2693J15570d3912
15548a57051O8768A20598C7252f5525k07674J8031c9506E5729K4073J58674a91685
15536H6594e9304j03940d505B08421q3522d26928A13594j1629J02067a70048j46886
15525c16934A6036d88742e9462j11119E5835e9066p2379N5474A37104J11434f216
15513I656P1383b5712i268j67807C2852K27770a47672E26389f2286j74105b3423
15501D27720F434J24849a40762L6002A84640A7612F826d5966C2583J49284c19251
15489a15515k2467A37544Q4619k7674B1297b52823a15377A384i6158M090j25204
15478b17272C4339L6006g3572C55773j54732M24988k70340J14943j77772F3490
$$ plain form
15467 99257 -78921 255792 362764 101661 131598 280329 -55485 -178380 174082 91076
15457 91076 -28896 -128025 -462716 -226751 -14524 -162746 -48046 -128267 -337162 221343 -308818
15445 -107886 -234423 360726 103328 153284 264944 499589 376307 495374 321305 56418
15434 78599 33610 154377 -368599 -60240 42270 -143291 -207422 -94086 245624 -148786 -158506
15423 -158506 -74373 -262050 -135089 166922 -362087 11546 177213 -33286 -156073 22779
15412 -195182 -23386 42661 282828 -138609 125252 68678 -308692 34849 137626 59995
15401 -6027 -278177 -192002 -236973 185074 181702 -79088 -134204 97725 -104185 -74921 -120198
15390 -120198 -153791 -92600 420965 -113829 26507 131764 25315 -281205 243591 16163
$$ packed form
15467I9257g8921B55792J06972A01661K9937J48731e5485j22895A74082q3006
15457I1076b8896r9129l34691b26751a4524j48222d8046q0221k08895B21343c08818
15445a07886j26537C60726A03328M9956J11660K34645j23282J19067j74069E6418
15434G8599C3610J20767c68599f0240D2270a43291o4131i4086B45624a48786r720
15423a58506g4373j87677J26961A66922c62087A1546J65667c3286j22787B2779
15412a95182b3386D2661K40167a38609A25252n6574c08692C4849J02777E9995
15401f027k72150Q6175m4971A85074l372g9088n5116I7725a04185K9264m5277
15390a20198l3593O1191D20965a13829B6507J05257B5315b81205B43591A6163
$$ plain form
15379 151606 -167305 263758 132101 -79349 -74939 53281 -144803 -40665 -44743 408178 7519
15367 -130453 -99462 24064 -275505 148968 103835 385389 177056 347296 -446400 242574
15356 -80971 284426 -161177 142713 237789 -37613 -120986 -142316 -521859 -197995 168734
15345 159712 279304 165171 126829 30393 310317 162792 -2731 59288 126691 188145 229099
15334 229099 -293615 -69389 51088 277417 -147100 178013 179601 9453 -121648 -115787 222113
15322 160128 206895 157866 55679 -33716 253909 -172533 -93736 65665 175933 323763 230330
15311 230330 84704 -62400 62175 111552 117241 256127 103860 -240992 -3011 -75204 -29539
15299 337690 188678 -75645 128721 -92431 -309769 -186576 -186210 36292 10992 -182282 76677
$$ packed form
15379A51606a67305B63758j31657g9349M410E3281a44803d0665m078D08178G519
15367a30453L0991B4064b75505A48968m5133K81554A77056J70240d46400B42574
15356h0971B84426a61177A42713R5076c7613q3373k1330l79543a97995A68734
15345A59712J19592j14133l8342C0393K79924j47525b731E9288O7403O1454M0954
15334B29099b93615f9389E1088K26329a47100A78013J588I453a21648N861B22113
15322A60128M6767m9029E5679c3716B53909a72533P8797F5665J10268J47830r3433
15311B30330H4704f2400F2175M9377N689J38886A03860b40992c011p2193b9539
15299C37690j49012g5645A28721i2431k17338J23193L66C6292A0992a82282G6677
$$ plain form
15287 10111 -132224 338119 -355916 -92875 -176019 -49282 168976 135081 -225609 -62795 -159284
15276 -159284 2584 389598 815 181479 -34584 94015 76486 204487 -147283 -94783 73868
15264 243579 -119895 407137 -62815 -43172 332380 109790 8558 21348 -87464 151638 58485
15252 -182487 81347 245609 269381 784589 705557 639263 942619 547354 264062 165819
15242 165819 6404 -15086 -217306 50386 221006 187699 51128 144104 -174867 251638 -35320
15230 210161 1980 -114620 134195 -287934 -77332 96793 193544 18066 50989 -61124 -222073
15219 -222073 143110 -125411 -178782 174764 141637 -113307 100886 -142441 -52541 -76314
15209 -76314 -2076 -51395 -229308 -94536 -140762 72359 -46216 -157469 -40573 -145782 67227
$$ packed form
15287A0111a32224C38119c55916i2875q3144d9282A68976l3895b25609f2795r6489
15276a59284B584L87014H15J80664c4584I4015j7529J28001a47283N2500G3868
15264B43579a19895D07137f2815J9643C32380A09790H558J2790h7464A51638E8485
15252a82487H1347J64262K3772N15208p9032o6294L03356l95265B64062r8243
15242A65819F404a5086k02220E0386J70620l3307E1128R2976a74867B51638c5320
15230B10161A980a14620A34195b87934g7332I6793R6751A8066L2923f1124j60949
15219b22073A43110a25411n3371A74764l3127a13307A00886a42441e2541k3773
15209g6314b076m9319j77913i4536m6226G2359d6216j11253d0573j05209F7227
$$ plain form
15197 53784 188244 -100607 -124561 -93274 -36275 -25498 70529 -54961 -91580 140084 231907
15186 231907 243921 110582 -88781 125045 -27381 -33592 269816 116811 154349 -110227 162300
15174 6036 343485 22920 45210 60131 -46194 -137230 -294383 247599 -163441 38969 103322
15163 103322 267448 -16222 -76023 31411 81032 -48628 -296659 -97173 -24027 30246 -12696
15151 95213 124599 -100640 96489 -294988 51230 -123987 -143252 211210 250186 -167014 -35044
15139 118388 -6250 129133 13759 -35905 -234882 161049 -127991 271847 109310 170927
15129 170927 -63433 -73454 168720 143479 -86327 128186 298299 216801 152811 246701 29468
15117 120703 -5988 -31151 87199 118992 -33627 64253 124928 102923 72635 301182 -142895
$$ packed form
15197E3784J34460a00607k3954L1287c6275J0777G0529e4961l6619A40084R1823
15186B31907J2014A10582h8781A25045b7381o211B69816A16811L7538a10227A62300
15174F036L37449B2920K2290J4921d6194r1036j57153B47599a63441C8969O4353
15163A03322J64126a6222n9801C1411M9621d8628k48031i7173b4027C0246a2696
15151I5213K9386a00640I6489b94988E1230a23987j9265B11210L8976a67014c5044
15139A18388f250A29133A3759c5905j98977A61049a27991B71847A09310O1617
15129A70927f3433j0021A68720k5241h6327A28186J70113q1498o3990R3890B9468
15117A20703e988k5163H7199L1793c3627F4253O0675k2005l0288K28547a42895
$$ plain form
15105 25809 103666 197545 -70830 112399 17044 134008 171072 -26236 -105806 187725 126249
15094 126249 -253109 -33451 42862 430531 62096 41542 251112 -1539 -79124 132612 240447
15083 240447 216569 234892 -107306 191047 183561 265553 -96895 -64718 85399 204157 186742
15072 186742 150243 217245 632610 134118 113034 204059 -102535 340382 87553 67840 142774
15061 142774 171700 -279013 -132489 82823 176409 1272 -40659 206037 227515 80384 212412
15050 212412 588748 258158 246988 429291 318404 90475 -82473 251797 88125 141074
15040 141074 181842 284641 -55062 110997 272116 409576 373905 385613 244819 12631
15029 -216568 525082 65658 637244 168270 408669 359125 471375 252208 121347 355679
$$ packed form
15105B5809P7857R3879g0830A12399A7044J16964L7064b6236p9570A87725o1476
15094A26249b53109c3451D2862L87669F2096k0554K09570a539p7585A32612J07835
15083B40447k3878J8323a07306A91047p486Q1992i6895L2177H5399J18758j7415
15072A86742l6499O7002M15365A34118k1084R1025a02535C40382H7553j9713P4934
15061A42774K8926b79013a32489H2823R3586A272d0659B06037K1478H0384J32028
15050B12412L76336B58158j1170J82303j10887I0475h2473B51797H8125N2949
15040A41074M0768J02799e5062A10997J61119J37460l5671J1708j40794A2631
15029b16568E25082F5658N71586A68270K40399m9544J12250k19167A21347K34332
$$ plain form
15019 355679 441211 84220 464909 51553 267572 434049 328491 154056 535062 343744
15009 343744 24909 279140 304076 200025 252626 504330 150228 59548 16586 274725
14999 274725 265945 382474 249511 250035 53450 326682 83278 478850 48214 205792 243418
14988 243418 252930 263576 194955 538075 451439 180508 339110 391671 412393 410420 465152
14977 465152 530836 372125 484564 457201 158223 82277 180297 389301 229032 149495
14967 149495 12460 361866 357723 312362 233303 204772 365336 126451 47037 311912 227658
14956 227658 327245 269340 128813 362709 76947 298500 601336 74144 220734 480059
14946 480059 322381 452848 223313 367603 177331 813987 457571 930169 192254 407654
$$ packed form
15019C55679Q5532H4220L80689E1553K16019J66477j05558A54056L81006j91318
15009C43744B4909K54231K4936j04051N2601K51704A50228E9548A6586K58139
14999B74725q780J16529j32963N24E3450K73232H3278L95572D8214J57578L7626
14988B43418R512J0646o8621L43120q6636A80508J58602N2561K0722j973N4732
14977D65152O5684j58711J12439k7363A58223p5946R8020K09004j60269p9537
14967A49495A2460L49406m143m5361p9059k8531J60564A26451D7037K64875q4254
14956B27658R9587n7905A28813K33896G6947K21553L02836G4144J46590K59325
14946D80059j57678J30467B23313J44290A77331O36656l56416M72598A92254K15400
$$ plain form
14936 407654 411319 179101 539650 356093 428278 189644 640510 641963 505245 786430
14926 786430 917545 665063 711376 980343 700390 623957 933792 813172 805442 816431
14916 816431 943416 1303465 1244380 1042074 1164276 853258 560251 986807 461698 294034
14906 294034 162239 542715 403867 275194 438782 438796 212199 254606 514909 345002
14896 345002 274530 268538 -11241 229522 342962 453589 447907 535085 565315 270959 878048
14885 878048 134505 204158 620375 736405 340111 493813 463188 470006 373173 491005
14875 491005 -137944 631385 797576 435019 340853 458516 508910 396102 212326 650508
14865 650508 624378 480657 379004 461182 482171 589004 453319 266374 451917 380895
$$ packed form
14936D07654L665A79101L60549j83557P2185A89644M50866J453j36718K81185
14926G86430J31115k52482M6313K68967k79953p6433L09835j20620p730J0989
14916H16431J26985L60049n9085k02306J22202l11018k93007M26556D61698j67664
14906B94034j31795L80476j38848j28673J63588J4B12199M2407K60303j69907
14896C45002p0472n992a1241B29522J13440J10627n682Q7178L0230B70959O07089
14885H78048A34505O9653M16217J16030C40111J53702l0625O818r6833J17832
14875D91005a37944F31385J66191l62557r4166J17663N0394j12808j83776M38182
14865F50508k6130j43721j01653Q2178K0989J06833j35685j86945J85543p1022
$$ plain form
14855 380895 247928 429648 438282 564652 643771 304039 225050 292811 305759 506645 425884
14844 425884 503556 479862 519563 570878 538295 738516 517961 532609 668668 905475 937058
14833 937058 552730 724559 728299 587493 260352 290716 72444 377651 441693 354089 784854
14822 784854 199503 417892 449323 525345 618038 355644 486156 894003 228163 566970
14812 566970 282405 675793 321111 710100 808989 488419 551693 447243 395579 208936
14802 208936 401524 766291 409181 468417 985809 445545 592730 783252 454949 477165
14792 477165 530043 620181 536822 701427 476231 384452 81377 729997 577907 467145
14782 467145 440329 526668 469132 632675 484363 693695 492681 415165 582281 703567
$$ packed form
14855C80895j32967J81720Q634J26370P9119C04039p8989O7761J2948K00886q0761
14844D25884P7672k3694L9701N1315l2583K00221k20555J4648J36059K36807L1583
14833I37058l84328J71829L740j40806B60352L0364G2444L05207O4042q7604M30765
14822G84854A99503K18389L1431P6022R2693k62394J30512M07847B28163L38807
14812E66970B82405L93388C21111L88989R8889l20570O3274j04450n1664j86643
14802B08936J92588L64767l57110N9236N17392D45545J47185J90522l28303K2216
14792D77165N2878R0138q3359J64605k25196r1779H1377O48620j52090j10762
14782D67145k6816Q6339n7536J63543j48312K09332k01014p7516J67116J21286
$$ plain form
14772 703567 472617 598864 518909 793338 463690 675630 703763 640056 347292 587948
14762 587948 554575 275573 370921 613912 416601 828296 362667 566370 442935 535720
14752 535720 663108 310715 291436 522507 562461 593280 390628 486687 550379 319858
14742 319858 480022 454388 459227 751336 395810 86294 297090 355770 759483 649180
14732 649180 675921 839314 728563 346110 600299 557094 744258 608456 1068257 1177170
14722 1177170 1188462 1411209 1055790 972783 976370 980304 831654 651197 776319 585304
14712 585304 580287 698269 935187 509143 565724 908353 481174 514642 494877 628154
14702 628154 844084 916018 1083329 968959 978562 1097278 1129174 1067756 1039664 1094531 890550
$$ packed form
14772G03567k30950J26247p9955K74429l29648K11940K8133o3707k92764K40656
14762E87948l3373B75573R5348K42991j97311M11695C62667K03703j23435R2785
14752E35720J27388C10715j9279K31071L9954L0819k02652R6059O3692k30521
14742C19858J60164k5634M839K92109l55526H6294K10796N8680M03713j10303
14732F49180K6741J63393j10751C46110K54189m3205J87164j35802M59801J08913
14722A177170J1292K22747l55419q3007L587L934j48650j80457J25122j91015
14712E85304n017J17982K36918m26044N6581L42629m27179L3468j9765J33277
14702F28154K15930P1934J67311j14370R603J18716L1896o1418k8092N4867k03981
$$ plain form
14691 890550 1096675 1024573 693586 1068439 892623 1152087 843367 509408 805342 878090
14681 878090 779228 855214 666330 740600 904625 832414 694493 649797 956292 893335 890571
14670 890571 429845 1083105 648653 880577 914578 894403 825804 919386 1123525 883630
14660 883630 742524 1219038 931809 1039995 1102067 1107445 1378359 605327 917947 711604
14650 711604 1178856 1064337 1135687 1103900 1180730 1305803 1260671 846339 937438 1184414
14640 1184414 1012524 1024086 1231786 1040879 1325757 1223240 1218353 1460878 758405 996351
14630 996351 1062505 1356469 1178026 1210036 1306926 884718 1359747 1135178 1041337 1160678
14620 1160678 1117370 1230905 884353 1158417 1329369 1211829 1418784 1360736 1407056 1406956
$$ packed form
14691H90550K06125p2102l30987L74853j75816K59464l08720l33959K95934P2748
14681H78090r8862P5986j88884P4270J64025p2211j37921m4696L06495o2957k764
14670H90571D29845O53260m34452K31924L4001k0175o8599R3582K04139k39895
14660H83630j41106M76514k87229J08186O2072N378K70914F05327L12620k06343
14650G11604M67252j14519P1350l1787P6830J25073m5132m14332R1099K46976
14640A184414j71890J1562K07700j90907K84878j02517m887K42525p02473K37946
14630I96351O6154K93964j78443L2010R6890m22208M75029k24569r3841J19341
14620A160678m3308J13535l46552K74064J70952j17540K06955n8048M6320j00
$$ plain form
14610 1406956 1294404 1204804 856083 1591105 1506273 1381131 1346663 1349654 1546966 1135179
14600 1135179 1144161 1710662 1394777 1401837 1364608 1330002 1507239 847810 1480892 1481367 1511672
14589 1511672 1317867 1719288 1731572 1489047 1612986 1848379 1631743 1851352 1550596 1871398
14579 1871398 1743252 1754148 2143032 2034069 1879352 1927205 1634125 1850963 1913543 1986848
14569 1986848 1891528 2161510 2086485 1837477 2233880 2082405 2203486 2239216 2143220 2271904
14559 2271904 2468002 2140984 2487547 2894015 3056378 3162899 3566103 3654749 4737251
14550 4737251 5497214 7277053 11053065 19517645 34045307 40250547 19429733 7738268
14541 4452998 2907806 2375152 1852085 1699730 1856683 1646576 1548875 1817490 1752412 1845514
$$ packed form
14610A406956j12552q9600l48721P35022q4832j25142l4468K991J97312m11787
14600A135179Q982N66501l15885P060l7229l4606J77237o59429O33082M75L0305
14589A511672j93805M01421J2284k42525J23939K35393k16636K19609l00756L20802
14579A871398j28146J0896L88884j08963j54717M7853k93080K16838O2580P3305
14569A986848r5320K69982p5025k49008L96403j51475J21081L5730r5996J28684
14559B271904J96098l27018L46563M06468J62363J06521M03204Q8646J082502
14550D737251P59963J779839L776012Q464580J4527662O205240A9429733G738268
14541D452998j545192n32654n23067j52355J56953k10107r7701K68615o5078R3102
$$ plain form
14531 1845514 1759536 2020763 2094073 1890352 1873230 1647983 2408734 2165103 1661562 2012118
14521 2012118 1876590 2073046 2377184 2125211 2042918 2198942 2313175 2252467 1868681 2349867
14511 2349867 2456541 1943748 2239607 2125261 2566186 2454550 2610934 2681623 2622516 2585605
14501 2585605 2970323 2703002 2903341 2899651 2862118 2704299 2951971 2893673 2682562 3089669
14491 3089669 3230852 2959644 3067252 3162082 3088538 3120194 2996405 3131068 3030672 3394505
14481 3394505 3267421 3245296 3328172 3368755 3589418 3633557 3252960 3668625 3854399 3651168
14471 3651168 3822781 3573595 3680276 3863157 4115180 4105380 3793685 3771863 3896350 4280869
14461 4280869 4432369 4179936 4027144 4145784 4281115 4273372 4490251 4649790 4607504 4525802
$$ packed form
14531A845514q5978K61227P3310k03721j7122k25247P60751k43631n03541L50556
14521B012118j35528J96456L04138k51973q2293J56024J14233o0708l83786M81186
14511B349867J06674n12793K95859j14346M40925j11636J56384P0689n9107l6911
14501B585605L84718k67321K00339l690l7533j57819K47672n8298k11111M07107
14491C089669J41183k71208J07608R4830p3544L1656j23789J34663j00396L63833
14481C394505j27084k2125Q2876M0583K20663M4139l80597M15665J85774k03231
14471C651168J71613k49186J06681J82881K52023r800l11695k1822J24487L84519
14461D280869J51500k52433j52792J18640J35331p743K16879J59539m2286q1702
$$ plain form
14451 4525802 4706981 4626785 4595176 5085964 4929813 5363705 5085143 5114963 5051381 5213278
14441 5213278 5402124 5241185 5372973 5581638 5566904 5565279 5774998 5827862 6077581 6133886
14431 6133886 6198826 5799148 6200807 6101478 6321682 6422303 6490463 6442668 6815091 6900907
14421 6900907 6702296 6656550 7043175 7410823 7266936 7434584 7739807 7836800 7732196 7701618
14411 7701618 8180969 7975132 8160771 7984985 8501834 8629563 8818277 8957102 9140534
14402 9140534 9259502 9632936 9578945 9559306 9735870 9873617 10010815 10067148 10215332 10547243
14392 10547243 10591701 11009712 11152326 11305255 11320854 11572847 11988490 11731052 12365322 12687862
14382 12687862 12910028 13073250 13547989 13497691 13890486 14100035 14512918 14344060 14653323
$$ packed form
14451D525802J81179q0196l1609M90788j56151M33892k78562K9820o3582J61897
14441E213278J88846j60939J31788K08665j4734j625K09719N2864K49719N6305
14431F133886O4940l99678M01659r9329K20204J00621O8160m7795L72423Q5816
14421F900907j98611m5746L86625L67648j43887J67648L05223R6993j04604l0578
14411G701618M79351k05837J85639j75786N16849J27729J88714J38825J83432
14402I140534J18968L73434n3991j9639J76564J37747J37198N6333J48184L31911
14392A0547243M4458M18011J42614J52929J5599K51993M15643k57438O34270L22540
14382A2687862K22166J63222M74739n0298L92795K09549M12883j68858L09263
$$ plain form
14373 14653323 14795610 15366039 15926106 16052768 16206851 16580174 17255003 17507961 17708204
14364 17708204 18099811 18431403 18878370 19364833 20045045 20298513 20483292 21179295 21653475
14355 21653475 21891171 22413419 23087604 23406772 24021859 24828035 25560575 25974725 26661920
14346 26661920 27660102 28134227 29036914 29542659 30348938 31299858 32406939 33019038 33883711
14337 33883711 35076628 36138015 37088306 38394998 39138257 40240964 42104813 43047225
14329 43047225 44456993 46045094 46968083 48832329 50572267 52666993 54269624 56103859
14321 56103859 58013454 60145909 62663091 64873899 67080212 69603897 72215306 75337868
14313 75337868 78158729 81430960 84745382 88388909 92325357 96268562 100396809 104892530
$$ packed form
14373A4653323J42287N70429N60067J26662J54083L73323O74829K52958K00243
14364A7708204L91607L31592M46967M86463O80212K53468J84779O96003M74180
14355B1653475K37696N22248O74185L19168O15087Q06176P32540M14150O87195
14346B6661920R98182M74125R02687N05745Q06279R50920J107081O12099Q64673
14337C3883711J192917J061387R50291J306692P43259J102707J863849R42412
14329D3047225J409768J588101R22989J864246J739938K094726J602631J834235
14321E6103859J909595K132455K517182K210808K206313K523685K611409L122562
14313G5337868K820861L272231L314422L643527L936448L943205M128247M495721
$$ plain form
14305 104892530 109265013 114943651 119961007 125797216 132114823 138495747 145075370 152412023
14297 152412023 160568131 168626682 177417544 186653080 196347624 206654262 217502920 228844795
14289 228844795 240958205 253524595 266800144 280548936 294531956 308992209 323445792
14282 323445792 338246268 352889754 367453518 381255325 394490570 406943396 418130853
14275 418130853 427494249 435560771 440986223 443121614 441807259 439220862 437655986 434273337
14267 434273337 428508584 420530776 410919119 399262489 386151224 371819743 356920905
14260 356920905 341465980 326303696 310901477 296138247 281896548 268108482 254610394
14253 254610394 241789383 229265188 217536262 206694672 196346187 186168523 176724082
$$ packed form
14305A04892530M372483N678638N017356N836209O317607O380924O579623P336653
14297A52412023Q156108Q058551Q790862R235536R694544J0306638J0848658J1341875
14289B28844795J2113410J2566390J3275549J3748792J3983020J4460253J4453583
14282C23445792J4800476J4643486J4563764J3801807J3235245J2452826J1187457
14275D18130853R363396Q066522N425452K135391j314355k586397j564876l382649
14267D34273337n764753p977808r611657j1656630j3111265j4331481j4898838
14260C56920905j5454925j5162284j5402219j4763230j4241699j3788066j3498088
14253B54610394j2821011j2524195j1728926j0841590j0348485j0177664r444441
$$ plain form
14246 176724082 168221146 159853942 152710579 145300187 138282590 131908313 125891050 120014019
14238 120014019 114945294 109978133 104997733 100647901 96345955 92197335 88678166 85124376
14230 85124376 81876330 78364589 75211150 72571536 69525635 67697511 64589986 62554278
14222 62554278 60489071 58105591 56467901 54532707 52635481 50585066 49071335 47989806
14214 47989806 46455481 44807978 43449811 42104248 40552092 39666915 38843688 37995732
14206 37995732 36720880 35758457 34673710 33489991 32573313 32018391 30957095 30301339 29220451
14197 29220451 28606995 27968079 27496189 26413217 25992825 25087193 24703336 23935213 23392300
14188 23392300 22713055 22543150 21624730 21480888 20782432 20407223 20086984 19464505 19186268
$$ packed form
14246A76724082q502936q367204p143363p410392p017597o374277o017263n877031
14238A20014019n068725m967161m980400m349832m301946m148620l519169l553790
14230H5124376l248046l511741l153439k639614l045901j828124l107525k035708
14222F2554278k065207k383480j637690j935194j897226k050415j513731j081529
14214D7989806j534325j647503j358167j345563j552156q85177q23227q47956
14206C7995732j274852r62423j084747j183719r16678n54922j061296o55756j080888
14197B9220451o13456o38916m71890j082972m20392r05632l83857p68123n42913
14188B3392300o79245j69905r18420j43842o98456l75209l20239o22479k78237
$$ plain form
14179 19186268 18802215 18279274 18183843 17695700 17343473 17168614 16494762 16460812 16248475 15720736
14169 15720736 15415226 14802193 14691513 14595475 14362289 13898096 13840979 13525836 13431703 13164932
14159 13164932 12923248 12679524 12509451 11807539 12025410 11720706 11370633 11535609 11162788
14150 11162788 10946817 10789743 10719611 10875015 10470910 10139828 10169024 9948041 9962318 9484716
14140 9484716 9562748 9231155 9128348 9164583 8994707 8758182 8592936 8206661 8393108 8227888
14130 8227888 8147596 7826761 7891213 7738457 7718685 7575202 7696387 7678364 7022326 7069698
14120 7069698 7124413 7097453 7166100 6630161 6630472 6576020 6709463 6308431 6487567 6302519 6372435
14109 6372435 6271428 6306639 6162919 5918331 5666526 5807732 5745179 6057329 5632910 5498563
$$ packed form
14179A9186268l84053n22941r5431m88143l52227j74859o73852l3950k12337n27739
14169A5720736l05510o13033j10680r6038k33186m64193n7117l15143r4133k66771
14159A3164932k41684k43724j70073p01912K17871l04704l50073J64976l72821
14150A1162788k15971j57074p0132J55404m04105l31082K9196k20983J4277m77602
14140I484716P8032l31593j02807L6235j69876k36525j65246l86275J86447j65220
14130H227888q0292l20835O4452j52756j9772j43483J21185j8023o56038M7372
14120G069698N4715k6960O8647n35939L11n4452J33443m01032J79136j85048O9916
14109F372435j01007L5211j43720k44588k51805J41206o2553L12150m24419j34347
$$ plain form
14099 5498563 5538918 5096428 5409100 5382757 5367539 5238543 5458546 5248522 4804927 4927873
14089 4927873 4705665 4555816 4918746 4919057 4814078 4612971 4551971 4307896 4569922 4105647
14079 4105647 4493561 4465560 4338363 4250117 4237788 4000071 4481741 4124765 4334345 4201831
14069 4201831 3890292 3949644 3761062 3762724 3939590 3927019 3712905 3380000 3772552 3785411
14059 3785411 3526972 4108243 3832073 3468599 3411204 3423566 3620350 3184341 3343797 3444874
14049 3444874 3250984 3465899 3392709 3171566 3372252 3102259 3100200 3242381 2922912 2932781
14039 2932781 2545391 2961500 2851112 3081220 2762022 2904634 2732014 3112689 2641407
14030 2641407 2711999 2554576 2891143 2829278 2610572 2496130 2567870 2466667 2761377 2537657
$$ packed form
14099E498563M0355m42490L12672k6343j5218j28996K20003k10024m43595J22946
14089D927873k22208j49849L62930L11j04979k01107o1000k44075K62026m64275
14079D105647L87914k8001j27197q8246j2329k37717M81670l56976K09580j32514
14069D201831l11539N9352j88582J662J76866j2571k14114l32905L92552J2859
14059C785411k58439N81271k76170l63474n7395J2362J96784m36009J59456J01077
14049C444874j93890K14915p3190k21143K00686k69993k059J42181l19469R869
14039B932781l87390M16109j10388K30108l19198J42612j72620L80675m71282
14030B641407P0592j57423L36567o1865k18706j14442P1740j01203K94710k23720
$$ plain form
14020 2537657 2501223 2618968 2396702 2304014 2161928 2479404 2152836 2479116 2237745 2417178
14010 2417178 2310316 2399434 2128982 2581529 2278571 1943784 1851339 2276566 2159648 2189737
14000 2189737 2148260 2125204 1811627 2142538 2164284 2090559 2160826 1954958 2424009 2307956
13990 2307956 2822633 3703974 6036082 12803538 26162203 39853206 26150701 13016446
13981 7896912 5713341 4523848 3738088 3582575 2987247 2881302 2586452 2594080 2736676
13972 2736676 2254227 2377730 2428557 2151183 2225133 2619976 1770928 2090509 2113900 1853419
13962 1853419 2189563 1907397 1819069 1891544 2064714 1959785 1767564 1883943 1595763 1826845
13952 1826845 1522307 1755006 1858324 1681909 1907361 1794787 1694942 1648204 1856918 1816748
$$ packed form
14020B537657l6434J17745k22266r2688j42086L17476l26568L26280k41371J79433
14010B417178j06862Q9118k70452M52547l02958l34787r2445M25227j16918L0089
14000B189737m1477k3056l13577L30911K1746p3725P0267k05868M69051j16053
13990B307956N14677Q81341K332108O767456J3358665J3691003j3702505A3016446
13981G896912k183571j189493p85760j55513n95328j05945k94850P628J42596
13972B736676m82449J23503N0827k77374P3950L94843q49048L19581K3391k60481
13962A853419L36144k82166q8328P2475J73170j04929j92221J16379k88180K31082
13952A826845l04538K32699J03318j76415K25452j12574r9845m6738K08714m0170
$$ plain form
13942 1816748 1777062 1540841 1653617 1677903 1816517 1402940 1559953 1492986 1789371 1383827
13932 1383827 1672679 1671582 1473212 1589672 1655679 1614929 1421726 1559451 1473232 1320203
13922 1320203 1363733 1448390 1049670 1424259 1492880 1433771 1686658 1545472 989922 1131537
13912 1131537 1549565 1522608 1348113 1088277 1170854 1336661 1191802 1164160 1091545 1268450
13902 1268450 1149694 1308421 1244794 797927 1291573 1085894 1237130 989488 1170823 1399093
13892 1399093 1009412 793760 957265 1229271 1089159 1224542 1189240 741083 1406933 1077684
13882 1077684 1438007 919946 1367856 1306054 1257664 1187197 1240218 1086462 909702 992007
13872 992007 1219002 1086619 1218512 1151698 1027383 1069542 843681 1149141 1036359 903132
$$ packed form
13942A816748l9686k36221J12776K4286J38614m13577J57013o6967K96385m05544
13932A383827K88852j097j98370J16460O6007m0750j93203J37725q6219j53029
13922A320203M3530Q4657l98720L74589O8621n9109K52887j41186n55550J41615
13912A131537M18028k6957j74495k59836Q2577J65807j44859k7642p2615J76905
13902A268450j18756J58727o3627m46867M93646k05679J51236k47642J81335K28270
13892A399093l89681k15652J63505K72006j40112J35383l5302m48157O65850l29249
13882A077684L60323n18061M47910o1802m8390p0467N3021j53756j76760Q2305
13872I92007K26995j32383J31893o6814j24315M2159k25861L05460j12782j33227
$$ plain form
13862 903132 1280290 880543 896406 925854 919193 964789 1027089 1040557 1233139 803237 998670
13851 998670 832356 1040649 941459 938471 892193 590604 837329 964712 1186542 685122
13841 685122 971791 1060088 444979 1049146 749483 1202017 884791 869761 450189 819213
13831 819213 953576 1066833 1222785 773632 792633 876607 895182 1016542 747267 847984
13821 847984 784229 789385 768805 945731 914270 865830 723909 702403 561244 930782 1035822
13810 1035822 548291 927488 1085594 937271 921109 741920 807052 781057 844432 670014
13800 670014 727573 287054 800075 769303 641695 848495 727664 859924 657006 501075
13790 501075 877153 615902 643247 701329 753733 648752 903292 622982 765199 593438
$$ packed form
13862I03132L77158l99747J5863K9448o661M5596O2300J3468J92582m29902J95433
13851I98670j66314K08293r9190k988m6278l01589K46725J27383K21830n01420
13841F85122K86669Q8297D44979O04167k99663M52534l17226j5030m19572L69024
13831H19213J34363J13257J55952m49153J9001Q3974J8575J21360k69275J00717
13821H47984o3755N156k0580J76926l1461m8440j41921k1506j41159L69538J05040
13810A035822m87531L79197J58106j48323j6162j79189O5132k5995O3375j74418
13800F70014N7559B87054N13021l0772j27608K06800j20831J32260k02918j55931
13790E01075L76078k61251K7345N8082N2404j04981K54540k80310J42217j71761
$$ plain form
13780 593438 592694 806645 641655 849710 867100 655199 528195 697349 875287 1039921
13770 1039921 773757 597944 919860 446296 665172 652689 716857 650579 665157 420888
13760 420888 604729 558946 774277 843502 216683 627522 572788 685108 825054 400973
13749 572869 615753 457187 678882 526670 699793 325828 506611 646587 763443 483967
13739 483967 519305 548613 368016 378547 467996 718826 780917 639003 237192 443954
13729 443954 445725 595491 371537 506240 513590 333323 603242 670780 849210 489760
13719 489760 483626 836710 498027 523432 437913 618134 436817 423170 315268 563666
13709 563666 697737 518293 353958 1072968 677461 835554 508417 207389 479601 126121
$$ packed form
13780E93438p44K13951j64990K08055J7390k11901j27004J69154J77938J64634
13770A039921k66164j75813L21916D46296K18876j2483O4168o6278J4578k44269
13760D20888J83841m5783K15331O9225B16683M10839n4734J12320J39946D00973
13749E72869M2884j58566K21695j52212J73123C25828J80783J39976J16856k79476
13739D83967L5338K9308j80597J0531Q9449K50830O2091j41914B37192K06762
13729D43954J771J49766k23954J34703P350j80267K69919O7538J78430l59450
13719D89760o134L53084l38683K5405q5519J80221j81317j3647j07902K48398
13709E63666J34071j79444j64335P19010l95507J58093l27137B07389K72212A26121
$$ plain form
13698 530172 280659 184662 496734 543007 144037 249493 587844 352050 559526 511973
13688 511973 582942 621392 358155 404749 523114 214651 500876 721336 532948 371902
13678 371902 220706 439441 608681 469781 290577 406412 273889 505244 310623 252257
13668 252257 791501 255285 586761 506156 328672 543479 363231 81355 755321 763547
13658 763547 573214 581386 528728 463025 337749 514065 472558 498058 599735 490161 373301
13647 373301 350038 821305 169909 329172 219978 395590 580697 196728 459394 180191
13636 670839 354971 511295 317560 504388 456913 205535 489405 71197 348325 283638
13626 283638 499590 187687 338504 404085 186941 289859 199533 273413 253956 673871
$$ packed form
13698E30172k49513r5997L12072M6273A44037J05456L38351k35794K07476m7553
13688E11973P0969L8450k63237M6594J18365B14651K86225K20460j88388j61046
13678C71902j51196K18735J69240j38900j79204J15835j32523K31355j94621n8366
13668B52257N39244B55285L31476q0605j77484K14807j80248H1355O73966Q226
13658G63547j90333Q172n2658o5703j25276J76316m1507K5500J01677j09574j16860
13647C73301k3263M71267A69909J59263j09194J75612J85107A96728K62666A80191
13636F70839l15868J56324j93735J86828m7475B05535K83870G1197K77128o4687
13626B83638K15952A87687J50817O5581A86941J02918r0326P3880j9457M19915
$$ plain form
13616 673871 460596 306159 365712 375050 417352 91136 349254 303668 467842 480067 302683
13605 302683 540146 338492 262084 258508 397752 264351 -105822 724385 433346 526492
13595 526492 127699 616875 217623 640433 314396 518442 207094 322194 346230 600258
13585 600258 196204 390263 163862 420567 390616 349610 -58726 45464 313983 366392
13575 366392 155677 364949 614367 409146 173847 -149793 454540 75284 362126 511787
13565 511787 306746 296070 575978 530125 197144 38089 245937 408676 255943 312916
13555 312916 317048 170679 368123 466850 399146 462982 36127 273871 108935 439000 280254
13544 280254 357977 282570 274603 -161191 278300 345463 405688 -38683 46264 599566 354687
$$ packed form
13616F73871k13275j54437N9553R338M2302I1136K58118m5586J64174J2225j77384
13605C02683K37463k01654p6408l576J39244j33401a05822G24385k91039R3146
13595E26492A27699M89176B17623M22810C14396K04046B07094J15100K4036K54028
13585F00258A96204J94059A63862K56705k9951m1006e8726D5464K68519N2409
13575C66392A55677K09272K49418k05221A73847a49793D54540G5284K86842J49661
13565E11787k05041j0676K79908m5853A97144C8089K07848J62739j52733N6973
13555C12916M132j46369J97444R8727o7704O3836C6127K37744A08935L30065j58746
13544B80254P7723p5407p967a61191B78300O7163O0225c8683D6264N53302k44879
$$ plain form
13533 354687 270246 -25820 122023 -140987 216687 320385 128653 250312 315024 444352
13523 444352 93946 278933 246995 446610 41201 447649 517268 335688 194851 506465
13513 506465 225677 -194444 187409 44053 162461 106484 565300 307184 196625 241365
13503 241365 342786 197597 -53423 382016 227808 193582 199024 -18675 249359 75703 315478
13492 315478 137901 123818 113475 184424 356177 436214 465748 359882 256806 284434 234330
13481 234330 246836 276305 227211 305345 332359 375258 206859 346395 436875 398627 209031
13470 209031 214573 288869 424539 183713 366755 45279 464740 172854 181178 171046 79803
13458 403161 390227 70021 277638 60378 277570 6821 434858 107792 393507 423389 362678
$$ packed form
13533C54687q4441b5820A22023a40987B16687J03698A28653J21659O4712J29328
13523D44352I3946J84987l1938J99615D1201M06448O9619j81580j40837L11614
13513E06465B25677a94444A87409D4053J18408n5977M58816k58116j10559M4740
13503B41365J01421j45189e3423C82016j54208l4226N442a8675B49359G5703K39775
13492C15478A37901j4083j0343P0949J71753Q0037K9534j05866j03076K7628n0104
13481B34330J2506K9469m9094P8134K7014M2899j68399J39536R0480l8248j89596
13470B09031N542P4296J35670A83713J83042D5279M19461A72854Q324j0132G9803
13458D03161j2934G0021K07617F0378K17192F821M28037A07792K85715K9882o0711
$$ plain form
13447 362678 153593 -93111 221819 175811 224951 296560 431725 131411 176868 140136 -39828
13435 377072 58494 206838 318322 81053 144084 290647 180223 173201 132668 201152 102980
13424 102980 287653 27539 132270 461878 -26113 -237809 244483 246201 286320 165763
13414 165763 191547 77064 90276 -72887 277395 17464 404292 56185 278793 -170327 217136
13402 166538 405543 79524 239600 117233 32600 160797 316478 277706 401288 360852
13392 360852 59860 42175 411383 51354 85517 222296 225636 194431 278086 -13760 226213
13380 74622 90878 -99939 309714 316286 274214 320370 289163 360684 67072 238466 175391
13369 175391 -110454 383911 171256 122803 522431 83112 350215 196265 99959 -274180
$$ packed form
13447C62678A53593i3111B21819m6008M9140P1609J35165A31411M5457l6732c9828
13435C77072E8494J48344J11484H1053O3031J46563j10424p022m0533O8484r8172
13424A02980J84673B7539J04731L29608b6113k11696B44483J718M0119j20557
13414A65763K5784G7064J3212g2887B77395A7464L86828E6185K22608a70327B17136
13402A66538K39005G9524J60076A17233C2600J28197J55681l8772J23582m0436
13392C60852E9860j7685L69208E1354L4163J36779L340l1205Q3655a3760B26213
13380G4622J6256i9939C09714O572m2072M6156l1207P1521F7072J71394o3075
13369A75391a10454C83911A71256m8453L99628H3112K67103j53950r6306b74180
$$ plain form
13358 217030 339959 387433 400519 280881 -12397 303696 199586 180917 97617 180506 307897
13347 307897 154053 408810 314496 64027 427338 182088 306024 435501 125394 241733
13337 241733 260889 409178 231505 32466 264748 406937 319518 55144 44489 236057
13327 236057 486807 212717 -240749 289533 164634 477 92437 84457 -166296 275034 241713
13316 241713 -20449 335264 243229 99212 -75999 370334 116586 357306 429412 138585
13305 -70116 -66784 -37035 209038 196413 224586 427963 214028 160383 55417 91726 329061
13294 329061 192004 359191 158879 350324 382735 64608 143408 -156137 -36714 153298
13283 -28908 200368 -144797 33041 -2316 125172 -239566 -114903 25238 187206 323901
$$ packed form
13358B17030J22929M7474J3086j19638a2397C03696j04110j8669q3300Q2889J27391
13347C07897j53844K54757r4314F4027L63311A82088J23936J29477A25394J16339
13337B41733J9156J48289j77673C2466K32282J42189q7419E5144j0655J91568
13327B36057K50750B12717b40749B89533j24899D77R1960p980a66296B75034l3321
13316B41713b0449C35264r2035I9212g5999C70334A16586K40720P2106A38585
13305g0116L332K9749B09038j2625K8173K03377k13935n3645E5417L6309K37335
13294C29061j37057J67187A58879J91445L2411F4608P8800a56137c6714A53298
13283b8908B00368a44797C3041b316A25172b39566a14903B5238J61968J36695
$$ plain form
13273 323901 121733 153474 -65400 -123663 258964 11709 206315 285664 246531 74156 107644
13262 107644 157889 177335 21276 661 140055 232155 161522 -48643 543141 -147737 221712
13250 -63702 484651 191208 174113 197691 -176277 64778 153543 -298300 232777 249482 185760
13239 185760 173525 93950 -89178 2177 189707 -111377 340610 207307 280610 105828 -89106
13227 82009 489310 -139564 -61523 -83203 49275 70857 23869 140938 291617 146387 64407
13215 -19341 255172 -125722 66142 -90247 311756 204263 321093 204986 -93810 101170
13204 199390 -94526 147151 -111521 -86880 162912 -68435 265479 178370 210991 -52521 101957
13192 182144 47995 129630 -23876 -205119 -242468 66380 19826 -25843 -9577 384208 159631
$$ packed form
13273C23901A21733L1741f5400n8263B58964A1709J94606P9349l9133G4156L3488
13262A07644N0245J9446B1276F61J39394R2100p0633d8643E43141a47737B21712
13250f3702D84651A91208j7095K3578a76277F4778Q8765b98300B32777J6705o3722
13239A85760j2235p9575h9178B177J87530a11377C40610j33303P3303A05828h9106
13227H2009M07301a39564f1523k1680D9275K1582B3869J17069J50679j45230F4407
13215a9341B55172a25722F6142i0247C11756j07493J16830j16107i3810A01170
13204A99390i4526A47151a11521K4641A62912f8435B65479q7109L2621e2521A01957
13192A82144D7995Q1635b3876j81243l7349F6380A9826b5843i577C84208A59631
$$ plain form
13180 75962 221599 -180440 -167126 203539 72227 204907 -142096 597950 -11942 -339272
13170 -339272 153583 -33821 -12819 80456 170634 -9420 137389 -309185 78543 196591 88791
13158 -239463 82974 2975 96092 -343357 183367 -12564 -51571 -51501 246804 75195 14561 190476
13146 190476 73011 21109 135668 -72009 -81256 123084 12193 106390 102094 1302 188604
13135 188604 411781 -242283 309800 23185 -47783 -38049 155965 -60297 -185447 -8370 124199
13123 -137973 8467 -103434 283102 222551 123597 -98016 27937 98478 -4960 -134136 82365
13111 132792 -182188 -23427 25369 78448 233161 -32063 -182551 -257663 150521 15138 373846
13100 373846 -203642 -103285 36219 212411 -39373 173380 -69826 -79230 125672 -20018 218643
$$ packed form
13180G5962J45637a80440J3314B03539G2227J32680a42096E97950a1942l27330
13170c39272A53583c3821a2819H0456R0178i420A37389c09185G8543J18048H8791
13158b39463H2974B975R3117c43357A83367a2564l9007P0B46804G5195A4561J75915
13146A90476G3011B1109J14559g2009r247A23084A2193R4197m296A302J87302
13135A88604K23177b42283C09800B3185d7783R734A55965f0297j25150h370A24199
13123a37973H467a03434B83102o0551r8954i8016B7937P0541d960j29176H2365
13111A32792a82188b3427B5369N3079J54713c2063j50488p5112A50521A5138L58708
13100C73846b03642J00357C6219J76192c9373A73380f9826r404A25672b0018B18643
$$ plain form
13088 -210447 -142801 131864 69188 139177 123699 4579 179400 40195 38506 -157238 178562
13076 95022 136589 -58659 -96471 241953 154779 120409 301488 348813 109487 33622 -119316
13064 62432 -187450 205632 112380 181358 149920 6780 184284 39109 -65417 275699 34697
13052 36467 266254 176957 89443 1914 168139 279982 27362 201855 312260 227949 200316
13041 200316 -290634 93109 118396 155695 119200 260997 23058 -70439 21825 113145 -287710
13029 -41745 -5506 225548 201422 53013 -156806 40288 -19787 93628 57116 -262204 318760
13017 273967 530101 5149 96382 142094 189309 -27407 151589 210851 141335 70674 -138630
13005 240138 -97543 31759 5773 54876 122318 -122561 27306 257154 101248 -1040 -85847
$$ packed form
13088b10447O7646A31864o2676O9989j5478D579J74821D0195j689a57238A78562
13076I5022M1567e8659l7812B41953q7174l4370J81079M7325A09487C3622a19316
13064F2432a87450B05632r3252O8978l1438F780J77504C9109f5417B75699C4697
13052C6467K29787q9297q7514A914J66225J11843B7362J74493J10405q4311k7633
13041B00316b90634I3109K5287L7299l6495J41797B3058g0439B1825R1320b87710
13029d1745e506B25548k4126E3013a56806D0288a9787I3628l6512b62204C18760
13017B73967K56134E149R1233M5712M7215b7407A51589N9262o9516p0661a38630
13005B40138i7543C1759E773M9103O7442a22561B7306K29848A01248a040q4807
$$ plain form
12994 -85847 179185 44404 101708 341768 64637 181083 189882 -162134 -71000 5171 -16049
12982 -62282 178355 -120625 1890 141354 -96498 166436 322152 318646 254151 52566 231705
12971 231705 -257647 -333728 122640 228927 444643 -75733 64213 585060 -259145 -106023
12960 111339 148260 -248506 316254 -124816 -174101 -189368 -35762 188621 13299 -3100 -151006
12949 -151006 369825 -17528 44037 -198872 128003 -132474 93344 -107871 -96260 249251
12938 116411 394915 33186 591 -161017 -229815 500105 92251 279917 -29023 243062 190135
12927 190135 -48167 -136850 -175290 -74197 314966 102385 -70477 -82193 370083 311292 -342998
12915 -106048 242824 15470 -49756 -26902 -257727 -131491 -40152 165874 82395 -199961
$$ packed form
12994h5847A79185D4404N7304K40060F4637J16446Q799a62134g1000E171a6049
12982f2282A78355a20625A890J39464i6498A66436J55716l506o4495E2566J79139
12971B31705b57647p6081A22640J06287K15716g5733F4213N20847b59145a06023
12960A11339L6921b48506C16254a24816m9285j5267c5762A88621A3299c100j47906
12949a51006C69825a7528D4037a98872A28003a32474I3344a07871J1611B49251
12938A16411K78504C3186E91a61017o8798E00105I2251J87666b9023B43062n2927
12927A90135d8167q8683l8440g4197C14966A02385g0477j1716C70083n8791c42998
12915a06048B42824A5470d9756K2854k30825J26236d0152A65874H2395a99961
$$ plain form
12904 -228994 39455 -46715 -132180 50400 122041 400182 150069 1988 178064 -223879 -55344
12892 113792 117583 39618 319633 280108 -399280 -2038 -298372 31211 -164395 -162944 14618
12880 31258 -256520 77857 -90821 -31234 45510 44908 150470 -52835 266325 -49599 92125
12868 54106 182734 345538 139681 32409 68047 -158418 277247 53302 1417 169398 330567
12857 330567 -182528 -194775 216660 79847 58855 -162745 -229743 -194471 -132644 155989 140196
12846 140196 -179574 27737 139745 -20696 -203866 -71182 89512 96992 -86202 -131539 -330570
12835 -330570 62155 -228096 -294591 78382 -102264 302544 -110854 60791 210180 -100431
12824 114865 204577 70730 -65408 -161610 43408 -477141 -213345 -205158 5920 105931 -136579
$$ packed form
12904b28994C9455d6715q5465E0400P1641K78141A50069A988J76076b23879e5344
12892A13792L791C9618K80015l9525c99280b038k96334C1211a64395J451A4618
12880C1258b56520G7857i0821c1234D5510o02J05562e2835B66325d9599I2125
12868E4106J28628J62804A39681C2409L5638a58418B77247E3302A417J67981J61169
12857C30567a82528j2247B16660G9847k0992a62745o6998L5272O1827A55989j5793
12846A40196a79574B7737J12008b0696j83170g1182H9512P480h6202m5337j99031
12835c30570F2155b28096o6495G8382a02264C02544a10854F0791J49389a00431
12824A14865Q9712G0730f5408r6202D3408d77141b13345Q187E920J00011a36579
$$ plain form
12812 -52118 72772 220965 60278 -277472 -253634 212345 7676 -39637 18678 179803 217061
12801 217061 84277 70541 -51108 87739 306274 -252605 -103702 19025 219118 -55161 -30439
12790 -30439 403959 40561 -116034 -112113 142262 25115 94831 -151768 41883 13752 173622
12779 173622 232871 -52841 -78821 6051 -3101 -121668 -26257 -52395 325456 326324 -48229 -217647
12767 -217647 -193448 -13477 250833 -349326 -133163 68699 262842 104577 -152443 52323
12756 74717 50619 67386 40721 -80181 -101980 399284 -239124 138067 -207896 133826 39960
12744 -67316 67522 54172 -105571 109265 40706 15508 253317 208444 -40612 119960 39204
12732 128508 -191427 -39875 -47877 -113182 -301493 -294565 -12978 -109509 -97092 -252271 -320228
$$ packed form
12812e2118G2772J48193F0278b77472K3838B12345G676c9637A8678J61125L7258
12801B17061H4277j3736e1108H7739K18535b52605a03702A9025K00093e5161K4722
12790c0439D03959D0561a16034L921A42262B5115O9716a51768D1883A3752J59870
12779A73622N9249e2841k5980F051c101j18567b6257k6138C25456Q68d8229j69418
12767b17647K4199a3477B50833c49326a33163F8699J94143A04577a52443E2323
12756G4717k4098J6767k6665h0181k1799C99284b39124A38067b07896A33826C9960
12744f7316F7522j3350a05571A09265D0706A5508K37809m4873d0612A19960C9204
12732A28508a91427c9875q002o5305j88311O928a2978r6531J2417j55179o7957
$$ plain form
12721 -320228 45589 52383 89303 45950 -23173 -190089 179585 205905 282952 237540 -172645
12709 129683 227944 997 -93483 140889 394842 353372 273099 -35716 146074 -82097 43038
12697 -394099 -312825 -73070 -222517 58498 239441 142613 75214 279793 170454 -169256
12686 -123429 304030 93774 -66125 12174 171861 71691 231898 -38928 67947 126823 57792
12674 -2479 75316 122399 -263183 -230344 52216 -249680 -56715 -111 345924 140986 46001
12662 -105806 146932 60528 31657 200010 -108386 -225047 341528 102901 373495 63327
12651 -143784 255916 -28480 36234 86073 231937 97985 38528 15067 34669 -27035 -128832
12640 -128832 65859 212683 156276 58371 207986 333834 -245085 89982 -93335 93077 383925
$$ packed form
12721c20228D5589O794L6920m3353b3173j66916A79585K6320P7047m5412a72645
12709A29683R8261I97i3483A40889K53953m1470q0273c5716A46074h2097D3038
12697c94099Q1274g3070j49447E8498J80943r6828o7399K04579j09339a69256
12686a23429C04030I3774f6125A2174J59687G1691J60207c8928F7947N8876E7792
12674b479G5316M7083b63183L2839E2216b49680e6715a11C45924A40986D6001
12662a05806A46932F0528k8871J68353a08386j16661C41528A02901K70594F3327
12651a43784B55916b8480C6234M9839J45864I7985C8528A5067J9602b7035j01797
12640a28832F5859J46824n6407E8371J49615J25848b45085H9982i3335I3077K90848
$$ plain form
12629 383925 464083 324951 -25231 180954 -22740 -75251 134487 138258 -41879 95594 -88766
12617 62524 -173437 42914 220482 -89698 -48065 216020 197258 -50857 -305986 59557 289773
12606 289773 -74391 31024 -19155 252885 333332 -156919 -83048 125795 -306311 -97439 -126955
12595 -126955 285901 338228 -275282 -29978 78626 -130716 41949 -168560 507836 -97055
12584 267866 374936 -37136 3496 263461 -8742 19696 -70246 -43364 154176 -93908 -94007 322604
12571 -50487 122708 156177 -43538 -1064 -138418 -288537 -10152 -217543 224558 140842 -144790
12559 -392954 -153106 190639 -26431 110862 -239831 209099 66403 -102035 -202118 118524
12548 -70169 -315948 -94212 -22497 96321 -962 137501 22469 -222561 121517 -109822 -152024
$$ packed form
12629C83925Q0158j39132b5231A80954b2740n2511A34487L771d1879I5594h8766
12617F2524a73437D2914J77568h9698M1633B16020j8762e0857k55129E9557K30216
12606B89773g4391C1024a9155B52885Q0447a56919P3871A25795c06311i7439k9516
12595a26955B85901N2327b75282b9978G8626a30716D1949a68560E07836i7055
12584B67866J07070c7136C496K59965h742A9696g0246K6882A54176i3908r9C22604
12571e0487A22708L3469d3538a064j37354j50119a0152k07391B24558q3716a44790
12559c92954a53106A90639b6431A10862b39831B09099F6403a02035j00083A18524
12548g0169k45779i4212b2497I6321i62A37501B2469b22561A21517a09822m2202
$$ plain form
12537 -152024 91172 -229541 -45343 -236354 -126376 33965 40877 63779 70384 -40077 184457
12525 -229101 288334 -214224 104953 120646 115730 285886 370462 -173454 50992 41758 110779
12514 110779 78761 -368798 55991 110421 35076 -290805 31545 173832 28997 -98208 -44568
12502 227754 36252 -71991 -91751 149555 174545 -88992 -191643 315342 246681 26159 107662
12491 107662 6232 17140 144073 20370 -45778 -106323 93915 51649 -296796 -254595 72693
12479 90434 97827 -194378 80847 49433 -205290 119187 -50510 -261509 -217844 46178 964
12467 205229 101529 31655 2390 -259049 -55575 129805 -67365 -58568 -86167 140642 158647
12456 158647 -220287 37111 -90692 -134530 -147607 43038 -110009 -37939 -19423 151865 -67348
$$ packed form
12537a52024I1172b29541d5343j91011J09978C3965O912K2902O605d0077A84457
12525b29101B88334b14224A04953J5693m916J70156Q4576a73454E0992r234O9021
12514A10779l2018c68798E5991N4430C5076b90805C1545J42287B8997i8208d4568
12502B27754C6252g1991j9760A49555K4990h8992j02651C15342o8661B6159Q1503
12491A07662F232J0908J26933B0370d5778o0545I3915m2266b96796M2201G2693
12479I0434P393a94378H0847l1414b05290A19187e0510k10999M3665D6178I64
12467B05229A01529C1655B390b59049e5575A29805f7365Q797k7599A40642J8005
12456A58647b20287C7111i0692m3838j3077D3038a10009c7939J8516A51865f7348
$$ plain form
12444 -48464 -70438 168977 -183310 43796 116156 -272805 288886 38341 -309660 -275510 44711
12432 -26221 66745 35614 -91394 -87933 -172976 54506 111104 211718 208366 -279236 -32913 -131224
12420 -131224 -436207 134716 170145 -170762 -541102 -198165 6920 -254757 23192 -60594
12409 146423 -95740 68728 -60428 -24848 -203585 -61152 -24266 202532 29052 136309 225572
12398 225572 35060 -336076 186715 118782 -191423 -22156 -113740 -80968 82035 -287286 -157410
12387 -157410 89171 -116020 -98029 -25778 -63993 3674 -13613 5710 226472 -2503 225052
12375 -161629 -170160 78547 -30321 -204107 -114188 348178 -549281 -131605 159010 37053 -229561
12363 106234 85786 -397927 126789 176895 125914 -404154 104028 151327 243681 -113885
$$ packed form
12444d8464k1974A68977a83310D3796P2360b72805B88886C8341c09660L4150D4711
12432b6221F6745l1131i1394L461q5043E4506N6598J00614l352b79236c2913r8311
12420a31224l04983A34716L5429a70762l70340a98165F920b54757B3192f0594
12409A46423i5740F8728f0428b4848j78737f1152b4266B02532B9052J07257Q9263
12398B25572C5060c36076A86715o7933a91423b2156r1584L2772H2035b87286J29876
12387a57410H9171a16020J7991b5778l8215C674a3613E710K20762b503B25052
12375a61629q531G8547c0321j73786Q9919C48178e49281a31605A59010C7053b29561
12363A06234k0448c97927A26789N0106n0981d04154A04028M7299R2354a13885
$$ plain form
12352 13954 24168 -34358 134751 -144930 -19453 116998 187192 -14843 -63610 -101952 -130701
12341 -130701 -25153 -261770 -39731 365006 185207 170523 426302 71929 150030 19565 212007
12330 212007 103095 -221918 -180165 107291 80238 -293424 198599 177189 -75773 20635
12319 -185200 152494 87454 132619 142110 6425 344912 -217732 -18917 -178392 322274 -26044
12307 125522 -26952 -222223 -143228 475826 -10120 -155873 -60715 141032 277496 73341
12296 -364815 213451 16689 157037 312446 -84660 241729 -132316 370215 51540 136021
12286 136021 104573 -247671 -125344 -6213 -137304 -17186 -39091 39703 128254 226779 78896
12274 321918 65701 -31882 -248031 193116 388234 -190438 -222286 -81074 -269636 96866
$$ packed form
12352A3954J0214c4358A34751a44930a9453A16998P0194a4843m8767l8342k8749
12341a30701b5153k36617c9731C65006j79799j4684K55779G1929P8101A9565J92442
12330B12007A03095b21918M1753A07291k7053b93424A98599k1410g5773B0635
12319a85200A52494o5040M5165R491F425L38487b17732a8917j59475C22274b6044
12307A25522b6952j95271P8995D75826a0120j45753f0715A41032J36464G3341
12296c64815B13451A6689J40348J55409h4660B41729a32316C70215E1540Q4481
12286A36021l1448b47671J22327f213j31091a7186k1905C9703Q8551R8525G8896
12274C21918F5701c1882k16149A93116J95118a90438l1848h1074j88562I6866
$$ plain form
12263 -9991 -13526 150629 -62675 -161594 10905 -85180 154510 126511 402810 196696 111845
12252 111845 48694 494262 31243 311387 48999 -33906 -164875 -135265 34601 125163 139640
12241 139640 66842 57699 310394 390261 -55461 51656 79653 -147927 -81196 -160704 57867
12229 32156 -88177 -184916 -4873 277520 214523 215340 -8378 135293 -157213 135064 330103
12218 330103 322304 33107 208302 -50132 -71677 -81635 100171 1344 12308 -355816 -16741
12206 -45128 151451 43116 57466 212981 100427 220947 134174 424270 130207 108540
12196 108540 -1419 255205 192861 210252 46894 380002 -40940 -13554 76861 -217582 -181200
12185 -181200 -52899 263677 -36317 -65694 31926 -402068 -33615 -203175 -75102 -472001 278225
$$ packed form
12263i991l535A50629f2675r8919A0905h5180A54510k7999K76299A96696q4851
12252A11845D8694M45568C1243K80144D8999c3906j30969K9610C4601R0562J4477
12241A39640F6842r143K52695P9867e5461E1656K7997a47927O6731p9508E7867
12229C2156h8177r6739d873B77520o2997Q17h378A35293a57213A35064J95039
12218C30103p799C3107J75195e0132k1545r958A00171A344J0964c55816a6741
12206d5128A51451D3116J4350J55515A00427J20520q6773K90096A30207k1667
12196A08540a419B55205o2344J7391D6894L33108d0940a3554G6861b17582L6382
12185a81200e2899B63677c6317k9377C1926d02068c3615j69560g5102l96899B78225
$$ plain form
12173 -158719 153942 270727 262416 48774 -376474 -122792 356455 242886 -120576 -72052
12163 -72052 202876 -52133 1295 143013 75201 135159 -74089 385115 142596 181104 -126880
12151 -317626 154975 70358 246421 1947 248497 -40690 72601 -225338 -115518 -118702 -168131
12140 -168131 -126195 -277278 -41468 8037 -266359 -44537 160451 -12708 21232 38944 -14104
12128 -31863 268580 -498341 -248561 270025 240617 -284926 434627 90247 6380 170762
12118 170762 -3491 -2087 -65698 134968 -15129 -54976 173237 268792 136032 55371 170527
12107 170527 312649 16503 -166581 -253407 31354 -47593 119663 266262 -14784 23897 -136687
12095 -243673 27098 118912 101034 186771 36144 162660 50694 -111828 -53195 131607 324563
$$ packed form
12173a58719A53942J16785q311D8774c76474a22792C56455j13569a20576M8524
12163g2052B02876e2133A295J41718o7812N9958g4089C85115A42596L8508a26880
12151c17626A54975G0358J76063A947K46550d0690G2601b25338J09820l184m9429
12140a68131M1936j51083d1468H037b66359d4537A60451a2708B1232J7712a4104
12128c1863B68580d98341b48561B70025k9408b84926D34627I0247F380J64382
12118A70762c491J404o3611A34968a5129l9847A73237R5555j32760E5371J15156
12107A70527J42122A6503a66581q6826C1354d7593A19663J46599a4784B3897a36687
12095b43673B7098R1814j7878Q5737C6144J26516E0694a11828e3195A31607J92956
$$ plain form
12084 324563 149483 74986 137787 -290612 -71678 -42092 118996 418751 -41811 -152691
12074 -152691 14477 89982 339300 9908 128707 -125093 63755 -132207 223917 226525 -26754
12062 -20114 469736 71223 136234 -56476 318545 -16596 -200612 -78882 71528 -70816 -71818
12051 -71818 -335313 27933 -77542 -324465 97813 -69542 23321 -19887 -234748 277239 -265333
12039 82454 44134 -96204 110507 24188 -6582 -85828 -140280 335691 -26915 -60285 105234
12027 8559 -108480 -71979 40978 94253 88495 -128265 180143 231558 130402 175047 212968
12016 212968 74253 77701 19761 -146804 31965 -120060 -181981 -395788 -170684 -31038 150361
12004 362138 57813 -65253 -117115 -123536 95518 140970 147966 -98860 180783 -208117 -118526
$$ packed form
12084C24563A49483p4497O2801b90612g1678K9586A18996K99755d1811j10880
12074a52691A4477P5505K49318I908J18799a25093F3755a32207B23917K608b6754
12062b0114D69736G1223O5011e6476C18545a6596j84016g8882G1528g0816j002
12051g1818k63495B7933g7542k46923I7813f9542B3321a9887k14861B77239b65333
12039H2454l8320i6204A10507B4188f582p9246n4452C35691b6915l3370A05234
12027H559a08480L6501D0978N3275n758a28265A80143N1415j01156M4645L7921
12016B12968G4253L448A9761a46804C1965a20060o1921k13807a70684c1038A50361
12004C62138E7813f5253n1862o421I5518M5452O996i8860A80783b08117Q9591
$$ plain form
11993 -118526 83631 -184895 -297428 294654 50250 -7586 -121236 -2568 -91807 -39609 -122302
11982 -122302 14657 -4501 -126162 83575 -35205 -249680 274358 44364 73055 124556 -221912
11970 97807 -293415 -3317 77694 -296529 113656 81101 -201592 -133783 124351 301415 -207358
11958 -48051 -115900 -146923 207448 -27864 216436 -2274 -170526 -391811 -149978 -232748 74724
11946 182887 77404 13142 -1224 -28895 175002 -279353 -56885 85834 10281 107100 -16098
11934 114444 43076 339660 43230 -191485 -15516 89348 -87254 -91531 172803 -46372 -29 80028
11921 182008 102874 -99518 -111125 -42412 -261887 -18283 -218877 -70657 192868 -59073 8469
11909 -177352 -97188 4563 74648 -22981 -196486 -157054 -269842 -195576 -160453 86419 -189920
$$ packed form
11993a18526H3631a84895j12533B94654E0250g586j13650b568q9239c9609q2693
11982a22302A4657d501j21661H3575c5205k14475B74358D4364K8691N1501b21912
11970I7807b93415c317G7694b96529A13656l2555b01592O7809A24351J77064b07358
11958d8051o7849l1023B07448b7864B16436b274j68252k21285a49978q2770G4724
11946A82887G7404A3142a224k7671A75002b79353e6885H5834A0281R6819a6098
11934A14444D3076K96584D3230a91485a5516H9348h7254m277A72803d6372b9H0028
11921A82008p9134i9518j1607d2412k19475a8283k00594g0657A92868e9073H469
11909a77352Q0164D563P0085b2981j73505L9432j12788P4266L5123H6419a89920
$$ plain form
11897 -148966 -186929 168566 -55669 -38063 131490 -231179 -163955 55903 -375564 97651 -70613
11885 -22314 28218 -177700 150014 -332466 215977 -92287 163438 -121683 136137 -342440
11874 -363932 -132952 -130593 -69031 327297 -179867 64059 19934 64866 113597 24723 -99896
11862 188613 -240467 -223853 -39779 -15892 -27190 99461 82408 -78342 -284268 114431 70257
11851 70257 -406861 382968 -111076 -209894 -64318 84651 -33503 52680 168625 -179576 159188
11839 32636 -29975 96023 35682 85879 -185004 212802 -83993 -223371 170768 -306012 -444241
11828 -444241 -191880 173868 -172939 100267 -140534 -44538 90335 85431 -151236 -88058
11818 -88058 -77251 -10044 101628 -193157 9807 -235253 -196145 -86208 -95587 136634 -172014
$$ packed form
11897a48966l7963A68566e5669J7606A31490b31179O7224E5903c75564I7651g0613
11885b2314B8218a77700A50014c32466B15977i2287A63438a21683A36137c42440
11874c63932a32952K359O1562C27297a79867F4059A9934M4932M8731B4723i9896
11862A88613b40467J6614c9779a5892j1298I9461j7053g8342k05926A14431m4174
11851G0257d06861C82968a11076r8818f4318H4651c3503E2680J15945a79576A59188
11839C2636b9975I6023C5682N0197a85004B12802h3993j39378A70768c06012j38229
11828d44241a91880A73868a72939A00267a40534d4538I0335m904a51236O3178
11818h8058J0807a0044A01628a93157I807b35253L9108h6208r379A36634a72014
$$ plain form
11806 -33077 25360 -95849 -110805 -252393 -32484 23802 180601 195534 291624 -121336 -130649
11795 -130649 -7010 -20406 274 -243816 -165637 209239 -167376 -252564 -91823 -96078 -95374 -177981
11783 -177981 -58330 113234 -38823 70014 126903 173250 -101101 -228010 -64223 79065 98534
11772 98534 -288652 -126544 -281866 -31698 56822 -250067 -41140 66556 288398 243363 65784
11760 -36517 91052 -274917 -107698 8770 -110209 -76110 278315 -128527 149324 72746 -166134
11748 49390 -105348 -58880 217366 -10976 -254728 -22826 24466 -501354 -218616 120365
11737 2092 162516 30979 -214651 100940 -40948 135802 -1033 210316 -55031 402278 -184137
11725 -80170 73579 268234 279057 -291378 -193801 194112 -289740 39658 -259450 -74112 219926
$$ packed form
11806c3077B5360i5849j4956j41588c2484B3802J56799J4933R6090a21336r313
11795a30649g010j3396B74b43816P8179B09239a67376q5188i1823m255P04q2607
11783a77981e8330A13234c8823G0014N6889M6347a01101j26909f4223G9065J9469
11772I8534b88652a26544j55322c1698E6822b50067d1140F6556K21842m5035F5784
11760c6517I1052b74917a07698H770a10209L4099B78315a28527A49324G2746a66134
11748D9390a05348M6468B17366a0976k43752b2826B4466e01354b18616A20365
11737B092J60424C0979b14651A00940d0948A35802a033B10316e5031D02278a84137
11725h0170G3579J94655J0823b91378R7577A94112b89740C9658b59450g4112B19926
$$ plain form
11713 -16530 233141 51734 -134012 -127013 -249332 -105623 -238399 78642 -162831 122098
11702 130966 -311451 259398 240005 206050 49778 161032 -53450 29427 -189884 -85011 192289
11690 -7630 -79690 -27468 148883 391146 -235943 100386 -111281 271665 41931 -217944
11679 -215032 297255 -81294 -25587 -67371 75985 -116033 -341711 -110653 78681 49303 110123
11668 110123 266926 -306375 -24979 -271084 164937 -46176 -32945 38693 47334 -9427 175432
11656 -135257 -90587 -71378 -165719 218268 245565 208177 253620 -59683 -270654 -2530 -228058
11645 -228058 89924 -151039 -135267 169066 45261 73587 -192217 -134877 163433 -9784 173570
11633 -31918 165599 -107107 173294 63257 -78823 141488 203038 72569 246200 -182264
$$ packed form
11713a6530B33141E1734a34012O999j22319a05623j32776G8642a62831A22098
11702A30966c11451B59398j9393l3955D9778J11254e3450B9427a89884h5011A92289
11690g630p2060b7468A48883K42263b35943A00386a11281B71665D1931b17944
11679b15032B97255h1294b5587m1784G5985a16033k25678a10653G8681k9378O0820
11668A10123J56803c06375b4979k46105A64937d6176J3231C8693Q641i427A75432
11656a35257M4670J9209r4341B18268K7297l7388M5443e9683k10971b530k25528
11645b28058H9924a51039J5772A69066D5261K8326a92217N7340A63433i784A73570
11633c1918A65599a07107A73294F3257g8823A41488O1550G2569J73631a82264
$$ plain form
11622 -131510 27648 29262 37126 236023 -96865 28720 96100 84540 101181 -155798 -146481 -97867
11610 -97867 67316 -25703 -139526 31320 -264779 299900 -266081 -90485 -75097 -61623 68380
11598 336910 -218411 211109 215083 11860 239062 -70422 63069 250611 -156427 -353721
11588 -353721 264657 243428 31530 -211223 270011 88583 -96189 155452 46589 -135587
11577 -101316 -50931 -33306 -84486 66519 -46441 -183074 132131 58252 206774 110697 -96068
11565 80728 -137487 112314 161421 -126562 411027 90737 -72014 -325069 119874 12133
11554 96131 -136045 135393 -40193 -63522 209731 -24954 -25417 39057 90758 217692 68594
11542 32124 -152846 39223 242240 65522 -66865 36100 69051 130500 354039 -52334 -98420
$$ packed form
11622a31510B7648J614P864J98897i6865B8720O7380j1560J6641a55798R317M8614
11610i7867F7316b5703j13823C1320b64779B99900b66081i0485J5388J3474F8380
11598C36910b18411B11109L974A1860K27202g0422F3069J87542a56427j97294
11588c53721B64657k1229C1530b11223B70011H8583i6189A55452D6589a35587
11577a01316N0385J7625n1180F6519d6441j36633A32131E8252J48522r6077i6068
11565H0728a37487A12314M9107a26562D11027I0737g2014k53055A19874A2133
11554I6131a36045A35393d0193k3329B09731b4954m63C9057N1701J26934F8594
11542C2124a52846C9223K03017F5522f6865C6100L2951O1449K23539e2334m6086
$$ plain form
11531 -98420 -65859 64435 -100002 -68697 34072 119868 221206 181184 -19003 143762 -66078
11519 206736 -37917 -27539 26450 -115595 65228 276472 -11233 -22364 -213613 95329 30756
11507 27612 11937 -7910 233877 -40209 -113677 146553 -50949 -235847 172261 433271 -51840
11495 129777 265829 -137336 234842 -202650 -19021 -151063 52542 81402 -228992 149434
11484 85998 28759 43749 218308 -26269 24272 414754 67156 -32347 -47999 70818 155445
11473 155445 286901 137951 -194985 144201 -26681 -266437 25666 320061 164531 182113
11463 182113 -4238 -129835 103858 -170168 -18153 -137687 112084 -161610 344732 7581
11452 -34227 329180 -95602 225913 142673 335579 336530 -256638 74449 -258 276625 -45017
$$ packed form
11531i8420L2561F4435a00002L1305C4072Q5796J01338m0022a9003A43762f6078
11519B06736c7917J0378B6450a15595F5228K11244a1233j1131j91249I5329C0756
11507B7612A1937g910B33877d0209p3468A46553e0949j84898A72261K61010e1840
11495A29777J36052a37336B34842b02650a9021j32042E2542K8860b28992A49434
11484H5998B8759J4990J74559b6269B4272L90482F7156c2347j5652G0818Q4627
11473A55445J31456A37951a94985A44201b6681k39756B5666K94395j55530J7582
11463A82113d238j25597A03858a70168a8153j19534A12084a61610C44732G581
11452c4227C29180i5602B25913q3240J92906R51b56638G4449b58B76625d5017
$$ plain form
11440 -182950 175962 145498 -141743 -129750 -11857 146503 -39066 430236 215822 67121
11429 -151982 120275 109817 301252 9555 -199003 157147 -207798 150209 54982 80687
11419 80687 -25424 -222529 126695 337303 108935 182164 19834 59666 219707 -159206
11408 -123308 -417894 176760 76877 -1470 70266 -145882 -97737 118785 -32700 -100950 37368
11396 -100074 100963 -179244 -17314 -48046 29865 -44574 10310 -22954 -200636 86922 -42360
11384 -33322 -227042 172174 -242915 -95554 -90241 18408 -78169 -204308 404179 19347 -30807
11372 -226508 270545 -26930 -14430 -89204 -146737 42851 -89828 -210745 -51595 314190 11556
11360 -264995 -312439 -154818 202150 -121957 39696 -220259 -93758 228184 74651 75855 97884
$$ packed form
11440a82950A75962l0464a41743J1993a1857A46503c9066D30236k14414F7121
11429a51982A20275j0458J91435I555a99003A57147b07798A50209E4982K5705
11419H0687b5424j97105A26695K10608A08935P3229A9834L9832J60041a59206
11408a23308k94586A76760G6877a470G0266a45882M8145A18785c2700o8250C7368
11396a00074A00963a79244a7314l0732B9865d4574A0310b2954j77682H6922d2360
11384c3322j93720A72174b42915i5554N313A8408g8169j26139D04179A9347c0807
11372b26508B70545b6930J2500p4774n7533D2851h9828j20917e1595C14190A1556
11360b64995m7444a54818B02150a21957C9696b20259i3758B28184G4651J204K2029
$$ plain form
11349 97884 -287625 62575 -256059 -188100 -46545 -189144 -135605 60016 30084 -204582 -6177
11337 86064 197580 179846 -217934 -53944 -426713 129675 -164557 -124418 15793 206067
11327 206067 -26551 -468867 -317080 -3924 126154 -167010 153625 -134393 67135 -96777
11316 -167371 -91121 269579 73200 -86441 224392 -373534 -39613 115417 -381217 -79158
11305 -342133 -144574 32280 131361 -76576 16124 -111972 -39155 -117271 -71788 232553 123796
11294 123796 -470427 89817 -73391 -23998 -249672 -323832 56231 395081 56709 -335665 106439
11282 -112647 70984 -276433 -63190 -232069 47958 19261 -117243 -396765 215674 71955
11271 -51785 -196597 -5917 99806 -127670 267345 201647 -98775 -113266 65203 200212 58930
$$ packed form
11349I7884b87625F2575b56059O7959d6545j42599N3539F0016k9932b04582f177
11337H6064J11516j7734b17934e3944l72769A29675a64557M0139A5793J90274
11327B06067b6551m42316J51787c924A26154a67010A53625a34393F7135i6777
11316a67371P6250B69579G3200h6441B24392c73534c9613A15417c81217g9158
11305c42133a44574C2280R9081g6576A6124a11972c9155p8116M5483B32553j08757
11294A23796d70427H9817g3391b3998k25674p4160E6231L38850E6709c35665A06439
11282a12647G0984b76433f3190j68879D7958A9261a17243k79522B15674G1955
11271e1785j44812e917I9806a27670B67345o5698i8775j4491F5203J35009E8930
$$ plain form
11259 -147594 104334 -360616 -162068 180062 315308 -62453 -199944 14743 172847 116227
11249 116227 53247 282399 129386 99878 163735 -201879 -128073 -260134 -237169 -272474 -55290
11237 -296660 90178 -147993 89974 -90029 -136125 102801 -232344 -75486 -189704 -274405 75118
11225 -86394 31953 -47812 -59551 -506459 83380 -126794 126299 -94967 -10331 377527 -14295
11213 72786 162761 176969 -968 -78033 -150971 -189312 14919 178162 125937 -202800 -50598 -364532
11201 -364532 226327 114559 105285 95113 -83557 -34638 379178 282163 73889 -32903 186076
11189 -46334 -226731 -81778 136162 164684 -166085 -16185 35010 -122406 -175826 -37130 16118
11177 -11626 81948 -146816 -9877 272555 -47479 -35171 -214707 33679 271342 -164069 -70573
$$ packed form
11259a47594A04334c60616a62068A80062J35246f2453j37491A4743J58104n6620
11249A16227E3247K29152A29386k9508O3857b01879P3806j32061K2965l5305e5290
11237b96660I0178a47993H9974i0029m6096A02801b32344g5486j14218q4701G5118
11225h6394C1953d7812j1739m46908H3380a26794A26299i4967a0331C77527a4295
11213G2786Q9975J4208i68p7065p2938l8341A4919J63243n2225b02800e0598l13934
11201c64532B26327j11768r274j0172h3557c4638C79178r7015G3889c2903A86076
11189d6334j80397h1778A36162K8522a66085a6185C5010a22406n3420c7130A6118
11177a1626H1948a46816i877B72555d7479J2308j79536C3679K37663a64069g0573
$$ plain form
11165 51875 -19724 -58480 84279 224066 -436191 214234 109347 -147878 329672 250549
11155 250549 -195670 54163 -56017 -148366 -76864 -106813 -124904 -332704 149134 -205603 -154667
11144 -154667 -302872 22007 -205825 -98803 -52344 12784 173145 -61587 74809 -199513 6928
11132 -166430 231349 -128651 213821 137166 -161347 69501 -83871 74132 -189919 -41608
11121 -137804 104761 -88782 109427 -25729 -168793 -3916 136551 169352 -65812 -64187 102965
11109 187996 1996 -54550 -33678 -97352 -206775 137035 75594 -275659 208694 -98040 57122
11097 4555 -111396 376594 145497 105463 -28112 -1214 -169409 -103232 -48226 -22500 267011
11085 -85699 -172665 -20981 -255570 1508 -9843 367023 144043 -124461 122731 96405 26727
$$ packed form
11165E1875a9724l8756H4279J39787d36191B14234j04887a47878C29672p9123
11155B50549a95670E4163e6017r2349P1502k9949j8091k07800A49134b05603N0936
11144a54667j48205B2007b05825i8803M6459A2784J60361f1587G4809a99513F928
11132a66430B31349a28651B13821p6655a61347F9501h3871G4132a89919d1608
11121a37804A04761h8782A09427b5729j43064c916A36551L2801f5812J625A02965
11109A87996A996e4550K0872o3674j09423A37035o1441b75659B08694i8040E7122
11097D555a11396C76594A45497m0034b8112a214j68195O6177d8226b2500B67011
11085h5699q6966b0981k34589A508i843C67023A44043a24461A22731k6326B6727
$$ plain form
11073 7740 366797 186413 168870 -107448 170675 161650 208524 268151 91518 388233 78195
11061 187349 252028 411922 311058 437405 89970 215010 274031 317935 229539 621597
11051 621597 443567 634169 188639 557254 289837 430124 410438 463007 403937 67508
11040 479199 409513 327833 555730 342783 551187 211798 481898 292318 375635 346178
11030 346178 533870 288386 168016 278355 365272 374691 69189 533305 179885 433817
11020 433817 593990 39861 455065 625685 184850 269099 436715 146948 36720 313183
11010 313183 54589 794327 386822 362505 423379 244455 298904 356933 195390 188333 420908
10999 420908 619504 219774 190078 280352 152554 130653 471256 593309 291213 286451
$$ packed form
11073G740L59057j80384j7543a07448A70675r025M6874N9627I1518K96715G8195
11061A87349O4679J59894j00864J26347H9970J25040N9021M3904q8396L92058
11051F21597j78030J90602A88639L68615k67417J40287j9686N2569n9070F7508
11040D79199o9686q1680K27897k12947K08404B11798K70100j89580Q3317k9457
11030C46178J87692k45484j20370J10339Q6917R419F9189M64116A79885K53932
11020D33817J60173C9861M15204J70620A84850Q4249J67616A46948C6720K76463
11010C13183E4589P39738C86822k4317O0874j78924N4449N8029j61543p057K32575
10999D20908J98596B19774k9696R0274j27798k1901L40603J22053B91213m762
$$ plain form
10989 286451 560068 346181 416632 486491 348701 156976 477752 858653 304159 696293
10979 696293 627559 931329 857449 816800 1034939 1389166 1475432 1651038 1801973 1462280
10969 1462280 1639371 1562814 1341097 1313606 1252403 990003 1462666 1040592 1124771 1044247
10959 1044247 1066534 1194167 1214756 1167981 1153675 1410540 1376364 907019 964117 957066 822938
10948 822938 697955 488704 561437 -5931 420258 359668 57528 169786 106974 277728 111764
10936 90883 460799 146467 259640 303410 -220053 278936 -120200 119360 117285 -96605
10925 -291399 -94227 137484 -72023 -44894 -125120 140974 108578 -87895 111589 150989 -247015
10913 236848 215169 81860 -17162 170724 141354 -167611 58754 145985 311191 328040 -316931
$$ packed form
10989B86451K73617k13887P0451O9859j37790A56976L20776L80901C04159L92134
10979F96293o8734L03770p3880m0649K18139L54227Q6266J75606J50935l39693
10969A462280J77091p6557k21717k7491o1203k62400M72663m22074Q4179q0524
10959A044247K2287J27633K0589m6775j4306K56865l4176m69345N7098p051j34128
10948H22938j24983k09251P2733e931D20258o0590E7528J12258o2812J70754A11764
10936I0883L69916A46467J13173M3770b20053B78936a20200A19360k075i6605
10925b91399i4227A37484g2023K7129q0226A40974l2396h7895A11589L9400b47015
10913B36848k1679H1860a7162A70724k9370a67611E8754Q7231J65206J6849c16931
$$ plain form
10901 -122787 105457 -49749 -5441 107841 -65292 -88538 -119259 -297943 54864 -137717 294580
10889 -69909 52855 -5163 -119437 -111197 1616 80424 -193194 215134 195259 -101614 -196739
10878 -196739 -269607 -20971 2240 -84508 267418 121376 51847 -73256 -33464 172787 -149689
10866 93207 23818 -142737 115234 -129831 142360 59396 55309 -164984 281382 181957 -50510
10854 -208815 -154157 292396 -242603 -228881 104438 -41944 -240783 193481 97863 240362
10844 240362 -10668 -54979 -298114 424751 -84725 35036 224227 -12365 -136699 317785
10833 32726 -291664 -277915 126653 -238843 93166 50212 86586 -45047 -227715 196129 -157663
10821 -236877 -105733 407670 -13877 38552 3219 -41167 28538 72597 -121602 -218093 172362
$$ packed form
10901a22787A05457d9749e441A07841f5292k3246l0721j78684E4864a37717B94580
10889f9909E2855e163j14274Q240A616P8808a93194B15134j9875a01614r5125
10878a96739p2868b0971B240h4508B67418A21376E1847g3256c3464A72787a49689
10866I3207B3818a42737A15234a29831A42360E9396m087a64984B81382r9425e0510
10854b08815N4658B92396b42603J3722A04438d1944j98839A93481r5618J42499
10844B40362a0668m4311k43135D24751h4725C5036J89191a2365j24334C17785
10833C2726b91664J3749A26653b38843I3166m2954L6374d5047j82668A96129a57663
10821b36877a05733D07670a3877C8552C219d1167B8538M4059a21602r6491A72362
$$ plain form
10809 -99639 41390 227654 -56336 -23810 -49468 -92291 -89089 -268272 -17705 149072 -82323
10797 71265 -67652 -22146 -95191 94530 -68559 -521718 -150412 -133388 -25898 -576382 50853
10785 -215139 184551 90350 60294 -133448 -469204 -131870 -26608 -86426 206126 68773
10774 -172648 -88192 -45601 -288674 384836 -15003 -464365 -186850 -76354 -61298 -381006
10764 -381006 -245760 -222378 -144365 -154458 15367 60269 -154654 208235 -252328 -399813
10754 -399813 -190616 85805 -328454 230036 292410 67602 -50513 -128149 107988 215982
10744 215982 -211913 -109641 -72335 -166726 87015 -140973 106861 -30169 -294777 -79131
10733 326927 -28518 277362 -74821 32480 -75476 -344019 24794 -34271 168536 -236801 -70535
$$ packed form
10809i9639D1390J86264e6336b3810k5658m2823L202j79183a7705A49072h2323
10797G1265f7652b2146p3045I4530f8559m53159a50412J7024b5898n50484E0853
10785b15139A84551I0350l0056a33448l35756a31870b6608n9818B06126F8773
10774a72648Q4456M2591k43073C84836a5003m49362a86850g6354J5056l19708
10764c81006J35246K3382P8013j0093A5367M4902a54654B08235b52328j47485
10754c99813a90616H5805c28454B30036O2374F7602e0513p7636A07988J07994
10744B15982b11913J02272L7306r4391H7015a40973A06861c0169k64608g9131
10733C26927b8518B77362g4821C2480g5476k68543B4794c4271A68536b36801g0535
$$ plain form
10721 43971 12012 -182769 357613 -138760 -50165 -25065 -345002 -25024 7295 184285 -3328
10709 381690 -52058 -1157 -98660 77540 -25775 25882 258747 -226779 -58476 -18153 -24173
10698 -24173 143502 -62373 -63434 -152576 -127299 5275 3585 -116583 -201513 101512 -206740
10686 -90221 39698 221343 -32718 -339321 8914 -20140 -108651 -7811 -80468 127764 78124
10675 78124 35235 -157615 -61141 -33664 -2533 75396 41 -113621 62430 -222632 -3249 -188639
10663 -188639 -99702 -156954 -243816 109401 -31614 -39308 -446358 53131 -303559 187687 -93285
10651 112169 -78162 44275 -174881 25589 13836 -318932 -101279 10382 -67637 -127714 -164580
10640 -164580 133227 -114345 -134463 43561 -227437 106142 -132240 -185293 -93953 96797
$$ packed form
10721D3971A2012a82769C57613a38760e0165b5065l19937b5024G295J76990c328
10709C81690e2058a157r7503G7540b5775B5882K32865b26779e8476a8153o020
10698b4173A43502f2373j061q9142K5277E275j690a16583q4930A01512b06740
10686i0221C9698J81645c2718l06603H914b0140q8511g811p2657A27764m9640
10675G8124C5235a57615f1141K7477b533G5396D1a13621F2430b22632c249j85390
10663a88639Q8937n7252q6862A09401c1614p694m07050E3131c03559A87687i3285
10651A12169g8162D4275a74881B5589j1753c18932a01279A0382f7637o0077l6866
10640a64580A33227a14345k0118D3561b27437A06142a32240n3053R1340I6797
$$ plain form
10629 1817 -95479 162645 -154078 314862 -222093 89 -43397 -154238 -14517 93483 -72142
10617 70459 -271432 -35877 199292 -3817 198744 -314492 5322 -222060 -210640 -209669 -299685
10606 -299685 -10964 -217791 -83744 -774 -195397 -9948 253172 -126013 -141728 73878 118488
10595 118488 367038 -143329 48032 -2715 325462 -1264 4524 -268197 53940 -40092 -96298
10584 -96298 31808 91841 -91754 -226367 73888 -210134 212079 97393 -84360 -30298 -89579
10573 -89579 -160184 -430793 -203210 -143029 -84687 -219924 -185837 323447 -235618 134697
10562 -35762 68955 -32098 125177 130673 -115762 -176411 -193160 -130436 119173 59900 287658
10551 287658 82599 70734 -86029 -81944 -108195 -49346 58193 -143334 289554 -101306 40710
$$ packed form
10629A817i5479A62645a54078C14862b22093H9d3397j10841a4517I3483g2142
10617G0459b71432c5877A99292c817A98744c14492E322b22060J1420R71r0016
10606b99685a0964k06827h3744g74j94623i948B53172a26013j5715G3878M4610
10595A18488K48550a43329D8032b715C25462a264D524b68197E3940d0092n6206
10584i6298C1808O0033i1754j34613G3888b10134B12079I7393h4360c0298n9281
10573h9579p0605k70609b03210O0181N8342j35237L4087C23447b35618A34697
10562c5762F8955c2098A25177N496a15762o0649j6749O2724A19173n9273K27758
10551B87658H2599j1865h6029M085k6251d9346E8193a43334B89554a01306D0710
$$ plain form
10539 116246 -166557 -59157 70237 112317 176276 40620 -354458 32022 -189085 149233 -120503
10527 4342 -109637 -485098 140668 67082 -117831 -2217 197123 98914 477311 1995 159831
10516 159831 -112505 -26806 -13614 -312109 -17127 -232130 -90656 -80134 -192028 -242428 -100927
10504 -114276 -177976 -89442 387802 73110 -45971 228766 -202411 -210166 36073 276309 -57167
10492 261487 182624 88061 -269868 -126774 -202747 279030 -393668 182439 -178473 110988
10481 178799 -202479 -51360 225287 155279 59013 186044 174615 310679 376551 -85793 67697
10469 -142784 135434 110523 -18397 -181131 54928 38044 -175037 138305 207988 72868 68751
10458 68751 -65806 226400 -165757 -106992 -366406 -2084 -190687 -64833 -75434 -132530 25594
$$ packed form
10539A16246a66557e9157G0237M2080O3959D0620c54458C2022a89085A49233a20503
10527D342a09637l75461A40668F7082a17831b217A97123r8209L78397A995J57836
10516A59831a12505b6806J3192k98495a7127k15003i0656J0522j11894n0400a00927
10504a14276o3700Q8534C87802G3110d5971B28766b02411p755C6073K40236e7167
10492B61487p8863H8061b69868a26774p5973B79030c93668A82439a78473A10988
10481A78799b02479e1360B25287p0008E9013J27031j1429J36064O5872h5793F7697
10469a42784A35434k4911a8397j62734E4928j6884a75037A38305O9683G2868m117
10458F8751f5806B26400a65757N8765k59414b084j88603f4833j0601n7096B5594
$$ plain form
10446 -20871 122667 227948 -112750 -266936 92770 -172233 -13071 -31526 47429 -130310
10435 126019 -177970 57564 -86148 -50364 -28492 -45750 -142468 -340171 -47885 23684 25370
10424 25370 138298 -153156 -66292 235895 64707 -42659 332048 -44985 -176429 -31060 65672
10412 -122809 -318935 -171329 -15885 -191227 -2761 -109467 -210313 -26315 -66262 -18846 76354
10400 -205810 -143674 -397456 -73423 1042 -425029 224233 86018 83505 191282 -337879 13368
10388 57769 251856 -154488 32732 119116 73948 20553 -37241 -85603 -380061 94532 103172
10377 103172 215223 156561 158643 -111776 126948 256885 11898 217872 122762 92382 360930
10366 360930 147550 246396 482794 -119460 129516 168313 187524 111033 379554 82106
$$ packed form
10446b0871A22667J05281a12750j54186I2770a72233a3071j8455D7429a30310
10435A26019a77970E7564h6148L5784K1872j7258r6718j97703d7885B3684J686
10424B5370J12928a53156f6292B35895F4707d2659C32048d4985j31444c1060F5672
10412a22809j96126J47606a5885j75342b761j06706j00846b6315l9947a8846G6354
10400b05810O2136k53782g3423A042d25029B24233H6018k513J07777c37879A3368
10388E7769J94087a54488C2732Q6384m5168B0553c7241m8362k94458I4532Q640
10377A03172J12051n8662K082a11776A26948J29937A1898K05974r5110l0380K68548
10366C60930A47550R8846K36398a19460A29516L8797J9211p6491K68521H2106
$$ plain form
10355 -161008 -150263 190703 93594 303245 439849 124785 349985 196996 210898 155523
10345 155523 275733 297026 35735 478872 51885 83115 104573 183978 9772 130262 97239
10334 97239 -68669 -74789 -184959 -108093 51104 16894 -147692 157903 4182 -105856 280291
10322 -188702 67762 355683 157182 116898 240337 64198 -72964 12688 -170634 -5723 103839
10310 97314 57248 74298 182162 -158910 304484 -230477 -77186 33392 -95716 28755 -82986
10298 298967 -67393 155009 -179360 49322 145950 -262420 67807 -192691 65223 -269394
10287 -220816 -210643 53478 -261306 -35543 106758 -145628 -263234 34117 179850 -125549
10276 -37008 -105568 123479 -120915 76093 289973 -96741 -220014 -126120 -137909 37461 -339149
$$ packed form
10355a61008J0745A90703I3594K09651J36604A24785K25200j52989J3902n5375
10345A55523J20210K1293C5735M43137E1885L1230K1458P9405I772J20490l3023
10334I7239f8669o120j10170P6866E1104A6894a47692A57903D182a05856B80291
10322a88702F7762K87921A57182m0284J23439F4198g2964A2688a70634e723A03839
10310I7314m0066J7050J07864a58910C04484b30477g7186C3392i5716B8755h2986
10298B98967f7393A55009a79360D9322R6628b62420F7807a92691F5223b69394
10287b20816J0173E3478b61306c5543A06758a45628j17606C4117J45733a25549
10276c7008o8560A23479a20915G6093K13880i6741j23273R3894j1789C7461c39149
$$ plain form
10264 -131569 142857 -42148 -9307 74761 41820 240038 51434 264097 345799 -44491 15065
10252 146648 23040 -22323 55059 120122 128314 246469 284059 73501 43594 -7288 -13691 287969
10239 74558 -278244 -780 14356 18977 -124771 40350 145018 -264963 80915 -360157 122786
10227 46369 -106643 -294291 -101534 440833 -83391 -139055 124069 156778 -318041 -369381
10217 -369381 44605 -424869 -65971 -65553 -42604 -52020 38492 31381 -162990 68763 19120 129275
10205 129275 -201270 -295890 -187440 57198 -80732 66405 1244 -62139 -61305 -317079 -24843
10193 -111045 255815 14199 -181908 -173943 88814 9081 -9520 -8407 -161110 -65583 -8214 211198
10180 86139 84460 -277907 -120565 -163489 -488050 -69562 83409 146760 -245723 54546 99588
$$ packed form
10264a31569A42857d2148i307G4761l2941J98218E1434K12663Q1702d4491A5065
10252A46648B3040b2323E5059O5063Q192J18155L7590G3501k9907g288o403B87969
10239G4558b78244g80A4356M621a24771D0350J04668b64963H0915c60157A22786
10227D6369a06643j87648a01534D40833h3391n5664A24069L2709c18041n1340
10217c69381D4605d24869f5971M18K2949r416C8492p111a62990F8763A9120J10155
10205A29275b01270r4620J08450E7198h0732F6405A244f2139Q34k55774b4843
10193a11045B55815A4199a81908P965H8814I081i520J113j52703f5583h214B11198
10180H6139j679b77907a20565m2924l24561f9562H3409O3351b45723E4546M5042
$$ plain form
10169 99588 94814 192068 -240788 -2805 57629 -105873 23209 -126892 -122696 180883 -4658 -29921
10157 -29921 106956 124591 -26095 -168591 282284 90219 258221 -49742 67895 -176646 1836
10145 266006 -184780 17176 -225405 -24762 -61649 27407 -115687 53598 205802 -377764
10134 -2485 142767 -219157 -41395 91065 -150095 -118586 -59415 110983 -136206 12787 -135600
10122 38331 -33459 103027 73406 -127420 43783 -166155 -316090 -366926 -186045 443058
10111 -218404 -130157 -60740 -105589 33874 -131059 -250629 -296778 42190 216720 646 -157180
10099 -105970 118875 58433 -200631 177539 -68775 146868 68937 174836 48721 94874
10089 94874 -181286 -114499 -177702 -64125 -199354 162060 234356 -79063 -372675 -139253 13117
$$ packed form
10169I9588m774R7254b40788b805E7629a05873B3209a26892M196A80883d658k5263
10157b9921A06956J7635b6095j42496B82284I0219J68002d9742F7895a76646A836
10145B66006a84780A7176b25405b4762l6887B7407a15687E3598J52204c77764
10134b485A42767b19157d1395I1065a50095L1509N9171A10983a36206A2787a35600
10122C8331c3459A03027k9621a27420D3783a66155j49935n0836J80881D43058
10111b18404Q8247f0740m4849C3874a31059j19570m6149D2190J74530F46a57180
10099a05970A18875E8433b00631A77539f8775A46868F8937J05899D8721M6153
10089I4874a81286O6787o3203f4125j35229A62060P2296g9063k93612a39253A3117
$$ plain form
10077 155247 -198948 143769 73124 194708 -241895 -52003 -54483 -17329 -255437 -172674 156795
10065 -41517 -115613 -183227 30737 160753 -130634 -52060 236200 -116079 -43119 -159123 -379994
10054 -379994 -41369 -74327 -52858 9116 -30543 -64804 -169107 -290612 122813 265166 86412
10042 69394 -176763 149284 -249621 -137195 -207414 -49711 25692 -234687 81647 -286273
10031 146181 134018 -194907 174110 -256877 77680 172115 -158969 -106872 -33320 -47868 157134
10019 -266255 133887 291491 -155999 -90962 42692 -170297 378259 257865 5655 -106830
10008 4719 -59082 97107 2214 70637 156544 -154312 -15141 56310 134257 124808 -123587 -16122
9995 -151659 32488 260199 -47834 -204846 19659 -281232 -205903 -125123 -175740 -229219 -220719
$$ packed form
10077A55247a98948A43769p0645J21584b41895e2003k480a7329k38108Q2763A56795
10065d1517p4096o7614C0737J30016a30634e2060B36200a16079d3119j16004k20871
10054c79994d1369l2958K1469I116c0543l4261j04303j21505A22813J42353H6412
10042F9394a76763A49284b49621J12426p0219d9711B5692b34687H1647b86273
10031A46181j2163a94907A74110b56877G7680R4435a58969N2097c3320j4548A57134
10019b66255A33887J57604a55999O5037D2692a70297C78259j20394E655a06830
10008D719e9082I7107B214O8423Q5907a54312a5141E6310P7947r449a23587a6122
9995a51659C2488K27711d7834j57012A9659b81232P5329Q0780n0617n3479Q500
$$ plain form
9984 -220719 41251 -126945 -8926 36025 -81090 -284681 -187813 -99800 -50478 -2415 41289 128818
9972 128818 -130311 -252080 -230340 -57851 -55618 113548 -170529 83882 -81722 5967 -221095
9960 -146383 33885 -179857 -59779 15527 -194384 210852 -63268 -281028 -66855 -151082 -8354
9948 448981 193182 -193808 -195820 124378 81192 -54986 -114670 170351 164041 -159036 -92844
9937 -92844 124637 -323918 13279 176866 -132853 123345 -150963 -130782 100339 -187250
9926 -122537 -74104 6649 -13441 93991 89380 32287 -172195 26908 283936 -236998 -278806
9915 -278806 51200 -368924 11287 64616 -181198 -164667 84314 -179415 -158917 -92501 147827
9903 -154220 -313993 217414 66697 -225081 -14004 -300943 -204429 -135840 75649 147659 -205285
$$ packed form
9984b20719D1251a26945h926C6025h1090k03591R6868Q8013M9322b415D1289Q7529
9972A28818a30311j21769K1740e7851K233A13548a70529H3882h1722E967b21095
9960a46383C3885a79857e9779A5527a94384B10852f3268k17760f6855q4227h354
9948D48981A93182a93808k012A24378m3186e4986n9684A70351o310a59036O6192
9937i2844A24637c23918A3279J63587a32853A23345a50963K0181A00339a87250
9926a22537M8433F649a3441I3991m611C2287a72195B6908K57028b36998m1808
9915b78806E1200c68924A1287N3329a81198J6531H4314a79415K0498O6416A47827
9903a54220j59773B17414F6697b25081a4004k86939R6514O8589G5649P2010b05285
$$ plain form
9891 -12579 -120932 127402 6058 269968 -181027 -48702 147987 -15992 -108726 43648 -596572
9879 9816 -186560 -28463 -213541 -286043 -411531 -59512 -181723 44926 130219 -238752 175242
9867 -1410 -92665 -41878 -204036 -166416 24680 18174 144587 10829 -372384 -118625 -13981
9855 171688 72061 101815 -90578 -90811 14664 -460462 208549 279144 16405 -330409 -317125
9844 -317125 -120753 -155209 -477672 182424 -274339 203038 120795 -279874 69848 -49537
9833 -252512 312538 -481300 106221 186911 147216 -265883 -209537 -174340 116114 2030 -134873
9821 179997 138869 -417670 216647 61294 191147 90653 -98637 -311368 20497 -340864 -321613
9810 -321613 283420 12011 -164913 -6202 -181637 -12461 74698 13708 -41626 352504 -92690
$$ packed form
9891a2579j08353A27402F058K63910a81027d8702A47987a5992r2734D3648e96572
9879I816a86560b8463j85078p2502j25488e9512j22211D4926Q5293b38752A75242
9867a410r1255d1878j62158L7620B4680o506J26413A0829c72384a18625a3981
9855A71688G2061K9754i0578k33A4664d60462B08549P0595A6405c30409J3284
9844c17125a20753l4456l22463A82424b74339B03038q2243b79874F9848d9537
9833b52512C12538d81300A06221Q0690l9695b65883N6346L5197A16114B030a34873
9821A79997m1128d17670B16647F1294J29853I0653i8637k12731B0497c40864J9251
9810c21613B83420A2011a64913f202j75435a2461G4698A3708d1626C52504i2690
$$ plain form
9798 -180863 132041 -1342 -108228 -212288 -43249 -71492 19411 125901 -34174 73201 55055
9787 55055 231429 56333 -101339 -56474 -359399 268779 -395724 40011 21715 -268915 335169
9775 -95849 -80338 -114433 -271115 -129139 393995 -14987 104242 -4458 27754 42421 42369 89702
9763 89702 -12114 -340044 65017 112339 164143 -155085 -36021 140932 185770 -328213 35135
9751 85035 -95246 -276369 72129 -120313 -92401 -121991 -159692 132108 138740 -164476 -140538
9740 -140538 -143726 -26207 82213 232599 24667 -129393 114970 66092 -50504 -352679 63941
9728 19072 -8084 -27268 120888 -97762 81362 -99779 -206852 -205250 -56187 -116424 117410 -167384
9715 -275341 -90865 -208618 19542 -92060 -57611 -159429 280699 102676 82396 74152 -39035
$$ packed form
9798a80863A32041a342j06886j04060d3249k8243A9411J06490c4174G3201j8146
9787E5055J76374E6333a01339M4865l02925B68779c95724D0011j8296b68915C35169
9775i5849J5511l4095j56682a29139C93995a4987A04242d458B7754J4667n2M7333
9763H9702a2114l27930F5017M7322N1804a55085c6021A40932M4838c28213C5135
9751H5035i5246j81123G2129a20313K7912k9590l7701A32108O632a64476K3938
9740a40538l188b6207H2213J50386B4667a29393A14970m8878e0504l02175F3941
9728A9072h084j9184A20888i7762H1362i9779j07073J602e6187o0237A17410a67384
9715b75341i0865j17753A9542i2060L4449j01818B80699A02676k0280q244c9035
$$ plain form
9703 -189942 -67094 210688 -87708 -283167 -70973 -526802 92286 -231841 154649 -23848 -368912
9692 -368912 141929 124543 -63207 37472 -344370 19171 -204292 -181103 201634 -327202 -49077
9680 6452 -5975 49134 -141222 -168578 -75386 -54440 208735 -100085 -432379 428 101550 -185741
9667 134483 -33682 -149303 32303 -145190 -168779 109163 50826 40621 -45070 -206817 -8850
9655 -169659 -60452 -213039 -27266 41568 -177511 -121464 -126134 -201075 -174250 -280517 140599
9643 -171030 -132709 158973 -131276 8046 -28239 -7046 -201054 -50843 -80531 -357529 -161988
9631 -424149 -119850 144306 51492 -348814 211016 -143581 160615 -301935 27873 162959
9621 162959 15819 -337206 -84136 -326807 81903 2552 -479907 -256814 280726 -29172 -287931
$$ packed form
9703a89942f7094B10688h7708j95459g0973m55829I2286b31841A54649b3848l45064
9692c68912A41929j7386f3207C7472c44370A9171b04292K3189B01634c27202d9077
9680F452e975D9134a41222k7356g5386K0946B08735a00085l32294D28J01122a85741
9667A34483c3682j15621C2303a45190k3589A09163E0826j0205d5070j61747h850
9655a69659f0452j52587b7266D1568a77511N6047m670p4941K6825j06267A40599
9643a71030L8321A58973a31276H046b8239g046j94008e0843k9688k76998a61988
9631d24149a19850A44306E1492c48814B11016a43581A60615c01935B7873J35086
9621A62959A5819c37206h4136k42671H1903B552d79907K23093B80726b9172k58759
$$ plain form
9610 -287931 -33136 145547 1974 67871 102150 13470 114323 -245755 61866 89246 -101843
9598 -35666 -209842 -63163 -469434 83494 -115726 -75422 -31366 311333 37588 -87839 -75294
9587 -75294 -33800 994 -357144 65187 124472 -49108 -71718 330560 12423 343957 30500 -101749
9574 -9198 166516 -95184 -904 200814 123009 157846 -62042 131622 -41992 -110097 -139478 -177559
9562 -177559 229194 40544 -219312 -124817 12369 88631 -192765 43673 -219922 -176536 -292634
9551 -292634 -11153 171954 214483 -82100 -115826 -128711 80890 178713 -72889 -281474 351579
9539 -277071 135593 112598 -4888 -201081 -351299 -226197 -286023 -30820 -193365 222773 -287499
9527 166363 107978 -86194 -12515 83790 -844 -111140 -150159 434887 295884 23631 -168869
$$ packed form
9610b87931c3136A45547A974O5897L4279A3470J00853b45755F1866K7380a01843
9598c5666j74176f3163m06271H3494a15726M0304c1366C11333C7588h7839J2545
9587g5294c3800I94c57144F5187N9285d9108k2610C30560A2423L31534C0500a01749
9574i198A66516i5184i04B00814p7805L4837f2042A31622d1992o8105k9381l8081
9562a77559B29194D0544b19312R4495A2369P6262a92765D3673b19922M3386j16098
9551b92634a1153A71954M2529h2100l3726j2885H0890R7823g2889k08585C51579
9539b77071A35593k2995d888j96193j50218J25102n9826c0820j62545B22773b87499
9527A66363n8385h6194a2515H3790h44j10296l9019D34887j39003B3631a68869
$$ plain form
9515 -127402 -139667 -125562 219216 -251122 -148585 -145075 37936 -23985 -100218 -364 -69274 49067
9502 -53328 -81053 -164158 -280580 -107458 -111145 117525 -14272 22645 160813 -17210 -303960
9491 -303960 -58096 204147 149214 -106308 -4186 89285 -374593 354672 -247066 -175293 -77831
9479 101076 -151085 -66605 -187957 -48631 189385 -78299 41218 -110260 -153341 18465 277689
9468 277689 -76501 -377685 62439 -181764 -307737 349427 -85601 -215101 38695 19373 23006
9457 23006 273919 -97565 -164365 84317 -267810 -168090 -45163 -26537 -28335 -91682 -226828
9446 -226828 174236 10770 -50209 -14104 -120343 81226 9765 -257379 -213055 22371 -141653
9434 -275861 226883 -293395 75009 32046 212724 -54080 -308395 -61392 -203535 -80150 17650
$$ packed form
9515a27402j2265J4105B19216b51122J02537L510C7936b3985p6233c64o8910D9067
9502e3328k7725q3105j16422a07458l687A17525a4272B2645J38168a7210k86750
9491c03960e8096B04147n4933a06308d186H9285c74593C54672b47066P1773g7831
9479A01076a51085f6605j21352d8631A89385g8299D1218a10260m3081A8465K59224
9468B77689g6501l01184F2439a81764j25973C49427h5601j29500C8695j9322L633
9457B3006K50913i7565o6800H4317b67810R9720d5163J8626j798o3347j35146
9446b26828A74236A0770e0209a4104j06239H1226I765b57379M4324B2371a41653
9434b75861B26883b93395G5009C2046J80678e4080k54315f1392j42143h0150A7650
$$ plain form
9422 -308743 -77987 -107160 -61167 169461 -206978 216563 -187232 -121716 -30332 -161338 -54527
9410 -87553 -7256 -34838 -19411 -334977 -58331 -174080 -287791 33986 212405 165064 -187677
9398 -482372 19365 -169273 301355 52684 -3375 -36137 379645 52424 -30690 157679 271416
9387 271416 128402 -186047 -20754 138118 99618 -40535 -59868 -94762 -44254 -247376 129176
9375 -285317 -279774 -71351 189703 -98028 -181931 34140 -105222 -23780 -89526 143249 -171466
9363 269664 -42505 -173165 -12961 33869 -71926 -169483 -233947 -28959 -233828 -230128 6773 123379
9351 123379 -107619 -9517 -261549 -48043 -208420 -31149 238292 -65211 -286666 -186032 -16975
9339 -329480 130471 -185799 -314694 -11305 -271969 -51074 69051 -248513 116636 -237125
$$ packed form
9422c08743g7987k9173M5993A69461b06978B16563a87232O5516c0332j31006e4527
9410h7553g256k7582J5427l15566e8331j15749j13711C3986J78419m7341a87677
9398d82372A9365a69273C01355E2684c375l2762C79645E2424c0690A57679J13737
9387B71416A28402a86047b0754A38118l8500d0535j9333l4894d4254k03122A29176
9375b85317N543g1351A89703i8028q3903C4140a05222b3780o5746A43249a71466
9363B69664d2505j30660a2961C3869g1926r7557o4464b8959k04869L700F773J16606
9351A23379a07619i517k52032d8043j60377c1149B38292f5211k21455J00634a6975
9339c29480A30471a85799j28895a1305k60664e1074F9051b48513A16636b37125
$$ plain form
9328 -46139 207305 138764 -67455 -305624 -179734 18967 69624 -243634 178735 -83993 46075
9316 -124807 -197226 26398 130938 -100894 -124091 -193550 -105529 -136918 50310 1633 52668
9305 52668 -183511 248380 -23242 -303390 19448 216248 -126329 -33082 -186930 -157407 73002
9293 151496 -180874 -169850 206006 140371 -553 -292159 -176101 -430390 302841 106542 -58114
9281 -174550 -90763 35465 -347 -383901 232467 -242814 -211840 -391818 -167693 -82702 -48163
9270 -48163 -62101 -175544 -212499 -188650 -175594 224739 -372517 69557 -182786 277044 -38272
9258 -160042 -116034 35292 -364742 -53572 -232248 -195458 -103792 186927 60375 -154924 145864
9246 121109 -143974 92183 160886 -238485 -149274 -82950 -125197 -300632 69061 -107172 -351919
$$ packed form
9328d6139B07305o8541f7455k38169J25890A8967N0657b43634A78735h3993D6075
9316a24807p2419B6398J04540a00894k3197o9459Q8021l1389E0310A633N1035
9305E2668a83511B48380b3242k80148A9448J96800a26329c3082j53848K9523G3002
9293A51496a80874J1024B06006o5635e53k91606J16058k54289C02841A06542e8114
9281a74550Q3787C5465c47l83554B32467b42814L0974j79978a67693h2702L4539
9270d8163j3938j13443l6955K3849J3056B24739c72517F9557a82786B77044c8272
9258a60042M4008C5292c64742e3572j78676L6790R1666A86927F0375a54924A45864
9246A21109a43974I2183O8703b38485Q9211O6324m2247j75435F9061a07172k44747
$$ plain form
9235 -351919 92551 -222141 97937 -82769 27124 -103143 36581 -168019 -178922 52729 325525
9224 325525 -130107 -230810 -65256 -152924 111155 80041 -175276 -121782 166819 -274601
9213 -139789 56312 -67229 232297 -9352 63209 -164822 195327 -173593 -100209 -125044 131189
9201 52728 -210274 -254610 -63176 -150104 -200546 -304572 -133852 -51785 197574 34096 -265662
9189 53267 -482340 130211 175491 135700 -42373 159947 -27207 201657 -72714 -225215 -165677
9178 -165677 -148378 58779 -13872 51568 -5910 321755 -222510 -36020 22946 251082 -32866
9166 122559 -141084 -82610 -136701 53078 55127 -167036 -174087 -153404 -274691 -54256 -329942
9155 -329942 -81095 21141 -256170 41738 -7652 105767 -156373 -247657 2624 31864 219709
$$ packed form
9235c51919I2551b22141I7937h2769B7124a03143C6581a68019j0903E2729K72796
9224C25525a30107j00703f5256q7668A11155l1114a75276N3494A66819b74601
9213a39789E6312f7229B32297i352F3209a64822A95327a73593P3384k4835A31189
9201E2728b10274m4336f3176q6928n0442j04026a33852e1785A97574C4096b65662
9189E3267d82340A30211M5280l9791d2373A59947b7207B01657g2714j52501N9538
9178a65677J7299E8779a3872E1568e910C21755b22510c6020B2946K28136c2866
9166A22559a41084N8474n4091E3078K049a67036p051K0683j21287e4256k75686
9155c29942h1095B1141b56170D1738g652A05767a56373r1284B624K9240J87845
$$ plain form
9144 219709 -7988 -111550 -138600 -112412 124731 209470 -290123 -7194 -31539 63205 23863
9132 -86125 -3614 64931 239866 181189 -131920 -128394 -87459 148009 -312070 -96540 -355538
9121 -355538 -43809 29669 51924 63444 -85159 -233308 -110260 -83546 -171400 55519 -94281
9109 -78634 -257054 166953 -214896 -193230 -32964 -134558 -172074 83400 -49768 96373 -235786
9097 12356 -82340 92612 122252 -30335 105032 84046 -117583 227679 -137746 -385481 -184051
9085 -238684 -153880 61791 -57332 -60553 105972 -399293 -280556 -250608 100059 243085 222857
9074 222857 -196941 -31081 -242515 14718 229754 -100877 71161 -103350 -243000 39489
9063 -132441 -52005 32562 214120 -53872 25017 122365 -10671 -31179 -33532 -185023 -190987 -109004
$$ packed form
9144B19709g988j03562k7050K6188A24731Q4739b90123g194k4345F3205B3863
9132h6125c614F4931J74935n8677a31920L526M0935A48009c12070i6540k58998
9121c55538d3809B9669K2255J1520h5159j48149a10260K6714q7854E5519i4281
9109g8634j78420A66953b14896K1666c2964j01594l7516H3400d9768I6373b35786
9097A2356h2340I2612K9640c0335A05032k0986a17583B27679a37746k47735a84051
9085b38684Q4804F1791e7332l221A05972c99293J18737K9948A00059J43026k0228
9074B22857a96941c1081k11434A4718K15036a00877G1161a03350j39650C9489
9063a32441e2005C2562J81558e3872B5017R7348a0671k0508k353j51491n964Q1983
$$ plain form
9051 -109004 85340 41123 31251 94322 290288 -301835 -86933 -126585 -220455 175078 -360677
9039 23414 -163403 298172 -314273 -204045 57392 -46868 81281 -117405 -68182 -145529 71794
9027 -86757 274453 -305635 -136827 -173529 -187491 331986 -189695 -184795 -195329 -6770 129208
9015 -40970 -37886 -381210 70110 -69818 -11199 102662 90790 -38119 124538 254318 24385
9003 -113430 -113492 -46060 -297448 -8437 -63960 258745 -94393 -397558 46270 57157 -190134 -276286
8991 -276286 148045 -131512 2240 170832 -91264 -125073 228864 48956 224928 94606 256486
8980 256486 -72975 156544 -140664 77512 6702 141192 132480 181580 -116875 -113983 -533354
8969 -533354 -156385 -108726 -64951 -138835 194839 93735 173527 -144031 -268960 76542 63970
$$ packed form
9051a09004H5340D1123r872O3071J95966c01835h6933l9652r3870A75078c60677
9039B3414a63403B98172c14273J10228E7392d6868H1281a17405M9223p7347G1794
9027h6757B74453c05635a36827l6702j3962C31986a89695M900j0534f770A29208
9015d0970L084l43324G0110f9818a1199A02662j1872c8119A24538J29780B4385
9003a13430o2d6060k51388h437n5523B58745i4393l03165D6270J0887a90134q6152
8991b76286A48045a31512B240J68592i1264l3809B28864D8956J75972I4606J61880
8980B56486g2975A56544a40664G7512F702J34490q712M9100a16875K892m19371
8969e33354a56385M7659M3775p3884A94839I3735P9792a44031j24929G6542j2572
$$ plain form
8958 63970 -208222 -45820 -220038 -100599 -255347 482420 -47252 137266 -117249 129157
8947 -250756 -26735 -51052 28247 -220481 -268315 935 183741 153464 9675 39262 -61598 -69220
8935 -69220 105278 75755 25376 -178094 -191878 68917 22997 347390 101601 -435231 137114
8923 207898 78445 140379 929198 2134867 866459 161119 -30894 -149981 -97212 128154
8912 -24821 -62136 -257691 -37725 -107266 -11574 68327 115099 -147562 -99108 259593 -43218
8900 -250995 -29550 -125814 -2045 361547 -90945 -28965 -207243 -221874 46740 -387728 53434
8888 73099 164931 -373418 100418 -105490 161365 -141470 -84045 102964 145734 32756 -63257
8876 225430 -123558 -53764 -230207 346617 -75524 6556 -37773 -411933 -269787 2541 56732
$$ packed form
8958F3970b08222d5820j74218a00599j54748D82420d7252A37266a17249A29157
8947b50756b6735k4317B8247b20481m7834I35J82806l0277I675K9587f1598p622
8935f9220A05278k9523B5376a78094j3784F8917B2997L24393A01601d35231A37114
8923B07898G8445O1934P88819J205669H66459A61119c0894j19087N2769A28154
8912b4821l7315j95555c7725o9541a1574F8327M6772a47562M8454B59593d3218
8900b50995b9550r6264b045C61547i0945b8965j78278j4631D6740c87728E3434
8888G3099R1832c73418A00418a05490A61365a41470N7425A02964M2770C2756f3257
8876B25430a23558e3764j76443C46617g5524F556c7773l74160J42146B541N4191
$$ plain form
8865 56732 -86222 91794 -101144 -124052 26085 47856 -122347 91755 152660 -366979 -112215
8853 -37098 310926 -138584 291465 112103 -125185 75545 436176 75112 -273837 -104391
8842 -18821 264902 -50407 -238246 85019 127566 -18762 -49868 -429789 -196619 -259459 247171
8830 16753 -50732 -74429 -14871 -235881 -291214 -251065 -280359 93431 103590 69089 -58540 -24437
$$ packed form
8865E6732h6222I1794a01144k2908B6085K1771a22347I1755O0905c66979a12215
8853c7098C10926a38584B91465A12103a25185G5545L60631G5112b73837a04391
8842a8821B64902e0407j87839H5019M2547a8762l1106l79921a96619o2840B47171
8830A6753e0732k3697a4871k21010n5333M0149k9294I3431J0159l4501e8540b4437
$$ [...]
##END NTUPLES=NMR SPECTRUM
##END=
