##TITLE=NES1085_IP2_9884916_xXUE9NG3Dy
##JCAMPDX= 6.0         $$ Bruker NMR JCAMP-DX V2.0
##DATA TYPE= NMR SPECTRUM
##DATA CLASS= NTUPLES
##ORIGIN= BRUKER
##OWNER= Administrator
$$ 1.72 TOPSPIN		Version 2.1
$$ 2016-08-27 20:48:39.273 -0500  Administrator@X
$$ Compression mode = diff/dup
##.OBSERVE FREQUENCY= 400.02188249412
##.OBSERVE NUCLEUS= ^1H
##.ACQUISITION MODE= SIMULTANEOUS (DQD)
##.ACQUISITION SCHEME= undefined
##.AVERAGES= 64
##.DIGITISER RES= 22
##SPECTROMETER/DATA SYSTEM= spect
##.PULSE SEQUENCE= noesygpps1d.comp
##.SOLVENT NAME= COFFEE_meoh
##.SHIFT REFERENCE= INTERNAL, COFFEE_meoh, 1, 14.96189
##AUDIT TRAIL= $$ (NUMBER, WHEN, WHO, WHERE, PROCESS, VERSION, WHAT)
$$ ##TITLE= Audit trail, TOPSPIN		Version 2.1
$$ ##JCAMPDX= 5.01
$$ ##ORIGIN= Bruker BioSpin GmbH
$$ ##OWNER= Administrator
$$ $$ E:\/data/COFFEE/nmr/NES1085_IP2_9884916_xXUE9NG3Dy/12/pdata/1/auditp.txt
$$ ##AUDIT TRAIL=  $$ (NUMBER, WHEN, WHO, WHERE, PROCESS, VERSION, WHAT)
(   1,<2016-08-27 20:48:34.101 -0500>,<Administrator>,<X>,<go>,<TOPSPIN 2.1>,
      <created by zg
	started at 2016-08-27 20:37:03.711 -0500,
	POWCHK enabled, PULCHK disabled,
       configuration hash MD5:
       21 0F 79 D6 B3 7B B4 F6 88 20 88 DB 03 48 BD 9F
       data hash MD5: 64K
       47 5E 99 F7 C6 F0 12 DE E0 B7 0E 53 61 5E 34 0B>)
(   2,<2016-08-27 20:48:37.226 -0500>,<Administrator>,<X>,<proc1d>,<TOPSPIN 2.1>,
      <Start of raw data processing
       efp LB = 0.3 FT_mod = 6 PKNL = 1 PHC0 = 0 PHC1 = 0 SI = 128K 
       data hash MD5: 128K
       52 F3 E4 4E B8 42 B8 96 62 70 C2 7E 7B 79 59 0C>)
(   3,<2016-08-27 20:48:38.086 -0500>,<Administrator>,<X>,<proc1d>,<TOPSPIN 2.1>,
      <pk PHC0 = -85.02319 PHC1 = 0 
       data hash MD5: 128K
       61 4E E6 C5 23 89 C4 5A 8F 74 7D C6 AC 21 56 F8>)
(   4,<2016-08-27 20:48:38.461 -0500>,<Administrator>,<X>,<proc1d>,<TOPSPIN 2.1>,
      <abs ABSG = 1 
       data hash MD5: 128K
       93 C2 CD 44 D2 6C CF 61 2E 90 6F 55 9A AE 85 3A>)
(   5,<2016-08-27 20:48:38.554 -0500>,<Administrator>,<X>,<proc1d>,<TOPSPIN 2.1>,
      <abs ABSG = 2 
       data hash MD5: 128K
       B2 87 91 A3 61 0F A0 EE 32 23 AF 08 2F 0C 7F 55>)
(   6,<2016-08-27 20:48:38.648 -0500>,<Administrator>,<X>,<proc1d>,<TOPSPIN 2.1>,
      <abs ABSG = 3 
       data hash MD5: 128K
       DE CB 18 C4 53 55 A9 BB 89 74 10 0E 17 29 87 22>)
(   7,<2016-08-27 20:48:38.742 -0500>,<Administrator>,<X>,<proc1d>,<TOPSPIN 2.1>,
      <abs ABSG = 4 
       data hash MD5: 128K
       BA 28 9E E1 6F EE 89 B3 7B 1E EF 29 A7 1C AA 0E>)
(   8,<2016-08-27 20:48:38.851 -0500>,<Administrator>,<X>,<proc1d>,<TOPSPIN 2.1>,
      <abs ABSG = 5 
       data hash MD5: 128K
       3F 5B C3 1E 20 07 31 89 8F E0 FA 87 AE D0 B8 25>)
$$ ##END=
$$ 
$$ $$ hash MD5
$$ $$ B6 C4 E8 47 B4 31 30 40 56 45 73 51 BB 95 38 0C
##$RELAX= 
##$RELAX= 
##$RELAX= 
##$RELAX= 
##$RELAX= 
##$RELAX= 
##$RELAX= 
##$RELAX= 
$$ Bruker specific parameters
$$ --------------------------
##$DU= <E:\>
##$EXPNO= 12
$$ [...]
##$TP07= 0
##$TPNAME0= <>
##$TPNAME1= <>
##$TPNAME2= <>
##$TPNAME3= <>
##$TPNAME4= <>
##$TPNAME5= <>
##$TPNAME6= <>
##$TPNAME7= <>
##$TPOAL= (0..7)
0.5 0.5 0.5 0.5 0.5 0.5 0.5 0.5
##$TPOFFS= (0..7)
0 0 0 0 0 0 0 0
##$TUNHIN= 0
##$TUNHOUT= 0
##$TUNXOUT= 0
##$USERA1= <user>
##$USERA2= <user>
##$USERA3= <user>
##$USERA4= <user>
##$USERA5= <user>
##$V9= 5
##$VALIST= <valist>
##$VCLIST= <CCCCCCCCCCCCCCC>
##$VD= 0
##$VDLIST= <DDDDDDDDDDDDDDD>
##$VPLIST= <PPPPPPPPPPPPPPP>
##$VTLIST= <TTTTTTTTTTTTTTT>
##$WBST= 1024
##$WBSW= 4
##$XGAIN= (0..3)
0 0 0 0
##$XL= 0
##$YL= 0
##$YMAX_a= 5775879
##$YMIN_a= -11387881
##$ZGOPTNS= <>
##$ZL1= 120
##$ZL2= 120
##$ZL3= 120
##$ZL4= 120
##$ABSF1= 14.96189
##$ABSF2= -5.596292
##$ABSG= 5
##$ABSL= 3
##$ALPHA= 0
##$AQORDER= 0
##$ASSFAC= 0
##$ASSFACI= 0
##$ASSFACX= 0
##$ASSWID= 0
##$AUNMP= <proc_prof1d_extract.lims>
##$AXLEFT= 0
##$AXNAME= <>
##$AXNUC= <1H>
##$AXRIGHT= 0
##$AXTYPE= 0
##$AXUNIT= <>
##$AZFE= 0.1
##$AZFW= 0.1
##$BCFW= 0
##$BC_mod= 0
##$BYTORDP= 0
##$COROFFS= 0
##$CY= 15
##$DATMOD= 1
##$DC= 0
##$DFILT= <>
##$DTYPP= 0
##$F1P= 0
##$F2P= 0
##$FCOR= 0.5
##$FTSIZE= 131072
##$FT_mod= 6
##$GAMMA= 0
##$GB= 0
##$INTBC= 1
##$INTSCL= 1
##$ISEN= 128
##$LB= 0.3
##$LEV0= 0
##$LPBIN= 0
##$MAXI= 10000
##$MC2= 0
##$MEAN= 0
##$ME_mod= 0
##$MI= 0
##$NCOEF= 0
##$NC_proc= -2
##$NLEV= 6
##$NOISF1= 0
##$NOISF2= 0
##$NSP= 0
##$NTH_PI= 0
##$NZP= 0
##$OFFSET= 14.96189
##$PC= 1
##$PHC0= -85.02319
##$PHC1= 0
##$PH_mod= 1
##$PKNL= yes
##$PPARMOD= 0
##$PPDIAG= 0
##$PPIPTYP= 0
##$PPMPNUM= 2147483647
##$PPRESOL= 1
##$PSCAL= 4
##$PSIGN= 0
##$PYNMP= <proc.py>
##$REVERSE= no
##$SF= 400.020009280381
##$SI= 131072
##$SIGF1= 0
##$SIGF2= 0
##$SINO= 400
##$SIOLD= 131072
##$SPECTYP= <>
##$SREGLST= <1H.CDCl3>
##$SSB= 0
##$STSI= 131072
##$STSR= 0
##$SW_p= 8223.68421052631
##$SYMM= 0
##$S_DEV= 0
##$TDeff= 65536
##$TDoff= 0
##$TI= <>
##$TILT= no
##$TM1= 0
##$TM2= 0
##$TOPLEV= 0
##$USERP1= <user>
##$USERP2= <user>
##$USERP3= <user>
##$USERP4= <user>
##$USERP5= <user>
##$WDW= 1
##$XDIM= 131072
##$YMAX_p= 384467070
##$YMIN_p= -10939
##$CURPLOT= <Network HP LaserJet P1505>
##$CURPRIN= <$Network HP LaserJet P1505>
##$DFORMAT= <normdp>
##$LAYOUT= <+/1D_H.xwp>
##$LFORMAT= <normlp>
##$PFORMAT= <normpl>
##$SURQMSG= 1
$$ End of Bruker specific parameters
$$ ---------------------------------
##NTUPLES= NMR SPECTRUM
##VAR_NAME=  FREQUENCY,     SPECTRUM/REAL,   SPECTRUM/IMAG
##SYMBOL=    X,             R,               I
##VAR_TYPE=  INDEPENDENT,   DEPENDENT,       DEPENDENT
##VAR_FORM=  AFFN,          ASDF,            ASDF
##VAR_DIM=   131072,        131072,          131072
##UNITS=     HZ,            ARBITRARY UNITS, ARBITRARY UNITS
##FACTOR=    0.0627417313425164, 1,          1
##FIRST=     8223.62146879497, 3247,         -39018
##LAST=      0,             4835,            -38866
##MIN=       0,             -10939,          0
##MAX=       8223.62146879497, 384467070,    0
$$ Real data points
##PAGE= N=1
##DATA TABLE= (X++(R..R)), XYDATA
$$ [...]
61182H91329o025q378r728r771r681j0498j1675j2091j1911j2196j2981j3127
61170G63267j2229j1335j1303j1609j1416j0854j0445r975q955p700p083p327
61158F43036p796p955p885p893q157q864j0247j2220j4207j5498j5752j5180j4306
61145D97076j3500j2730j1809j0781r825q893p812o749o117n922n603m756l677
61132C88902k939k699k655k329j298N02K460L646L788L572L796M651N959P615
61118D12971R364J0653J1193J1315J1376J1199J0568R826R373Q878P638N529L033
61105E32916N77j560k938l238k855k615k876l468m321n499o592o882o281n521
61091D78847n117m779m136l520l583m385n235n349m508l211k292k235k773l299
$$ y = [891329, 885304, 876926, 867198, 857427, 847746, 837248, 825573, 813482, 801571, 789375, 776394, 763267, 751038, 739703, 728400, 716791, 705375, 694521, 684076, 674101, 665146, 657446, 650363, 643036, 635240, 627285, 619400, 611507, 603350, 594486, 584239, 572019, 557812, 542314, 526562, 511382, 497076, 483576, 470846, 459037, 448256, 438431, 429538, 421726, 414977, 408860, 402938, 397335, 392579, 388902, 385963, 383264, 380609, 378280, 376982, 377484, 379944, 383590, 387378, 390950, 394746, 399397, 405356, 412971, 422335, 432988, 444181, 455496, 466872, 478071, 488639, 498465, 507838, 516716, 524354, 529883, 532916, 533493, 531933, 528995, 525757, 522902, 520287, 517411, 513943, 509622, 504123, 497531, 490649, 484368, 478847, 473730, 468951, 464815, 461295, 457712, 453327, 448092, 442743, 438235, 435024, 432732, 430497, 427724, 424425]
61077D24425l581l785l921l663k876j966j444j400j438j049n6J096J592J147N18
61062D03599P24J803K835L245L437L939M552M773M631M587M837N209N588O003
61048D59762O299O092N229M195L847M649O152P435Q099Q621R551J0805J2086J3644
61034E66466J5889J8469K0571K2106K3743K5591K6882K7354K8032K9930L2801
61023H37834L5917L9414M3960M9498N5302O1028O6884P2999P9543Q7391R8009
61012A527779J12757J32942J60221J96141K41754K98581L69448M56922N61553
61003D058098O83669Q25997R89236J159823J301421J361680J292921J075393P33355
60994A3481593L37647j1814k23965k58097j41792M6204K11510K73157J79961p5817
$$ y = [424425, 420844, 417059, 413138, 409475, 406599, 404633, 403189, 401789, 400351, 399302, 399246, 400342, 401934, 403081, 403599, 404323, 406126, 408961, 412206, 415643, 419582, 424134, 428907, 433538, 438125, 442962, 448171, 453759, 459762, 466061, 472153, 477382, 481577, 485424, 490073, 496225, 503660, 511759, 520380, 529931, 540736, 552822, 566466, 582355, 600824, 621395, 643501, 667244, 692835, 719717, 747071, 775103, 805033, 837834, 873751, 913165, 957125, 1006623, 1061925, 1122953, 1189837, 1262836, 1342379, 1429770, 1527779, 1640536, 1773478, 1933699, 2129840, 2371594, 2670175, 3039623, 3496545, 4058098, 4741767, 5567764, 6557000, 7716823, 9018244, 10379924, 11672845, 12748238, 13481593, 13819240, 13807426, 13583461, 13325364, 13183572, 13229776, 13441286, 13714443, 13894404, 13818587]
60984A3818587m47165q40446j152976j320412j339215j250672j106633r46019
60976E415049p91214o53521n37006m40521l60755k95045k41571j98368j63597
60967A733451j36307j15837j00658q8663p8508o9944o2956n7199n2167m7285m1952
60956H81975l6118l0721k6851k4527k2830k1160j9707j8715j8039j7524j7094
60945F28689j6365j4874j2868j1150r956q751p358o447o401o522o008n143m763
60932E12083n017n396n688o156o884p509p630p095o033m919m431m856n791o608
60918D28070o898o414n155l889l784m879n619m794l305k962l987m988n162n106
60904C61128n295n233m609m111m328m666m180k951j927j749k244k815k893k289
$$ y = [13818587, 13371422, 12530976, 11378000, 10057588, 8718373, 7467701, 6361068, 5415049, 4623835, 3970314, 3433308, 2992787, 2632032, 2336987, 2095416, 1897048, 1733451, 1597144, 1481307, 1380649, 1291986, 1213478, 1143534, 1080578, 1023379, 971212, 923927, 881975, 845857, 815136, 788285, 763758, 740928, 719768, 700061, 681346, 663307, 645783, 628689, 612324, 597450, 584582, 573432, 563476, 554725, 547367, 540920, 534519, 527997, 521989, 516846, 512083, 507066, 501670, 495982, 489826, 482942, 475433, 467803, 460708, 454675, 449756, 445325, 440469, 434678, 428070, 421172, 414758, 409603, 405714, 401930, 397051, 391432, 386638, 383333, 380371, 376384, 371396, 366234, 361128, 355833, 350600, 345991, 341880, 337552, 332886, 328706, 325755, 323828, 322079, 319835, 317020, 314127, 311838]
60890C11838j448j097j433j961k216k210j950j214j19O31N40j2k74J07J140K753
60874C03075M527N686N866N608N589N745N581N026M490M345M750N586O256O004
60860C78134M889L846L301K458P21r35j138j73M01l9o57r03j406k644l897m180
60844C77778l475k377j267m15l21j139k127k322j619o51J48Q48J551K201K861
60829C69674L681M537N115N446O027P166Q409Q905Q316P154O213N829N829O006
60815D58307O337O710O801O405N657M793L925L247L112L522L854L491K607J806
60801E20574J175K43j140k535l580m391n125n700o156o776p534p893p562p027
60787D56573o923p165p153o712o210n880n486m746l754k753j775o88M68J413J872
$$ y = [311838, 310390, 309293, 307860, 305899, 303683, 301473, 299523, 298309, 298190, 298821, 299361, 299349, 299075, 299182, 300322, 303075, 307602, 313288, 319154, 324762, 330351, 336096, 341677, 346703, 351193, 355538, 360288, 365874, 372130, 378134, 383023, 386869, 390170, 392628, 393349, 392414, 391276, 391103, 391504, 391465, 390808, 389905, 388499, 385855, 381958, 377778, 374303, 371926, 370659, 370244, 369923, 368784, 366657, 364335, 362716, 362065, 362213, 363061, 364612, 366813, 369674, 373355, 377892, 383007, 388453, 394480, 401646, 410055, 418960, 427276, 434430, 440643, 446472, 452301, 458307, 464644, 471354, 478155, 484560, 490217, 495010, 498935, 502182, 505294, 508816, 512670, 516161, 518768, 520574, 521749, 521992, 520852, 518317, 514737, 510346, 505221, 499521, 493365, 486589, 479055, 471162, 463600, 456573, 449650, 442485, 435332, 428620, 422410, 416530, 411044, 406298, 402544, 399791, 398016, 397328, 397796, 399209, 401081]
60772D01081J852J596J402J543K288L662N192O059N907N243M777M531L988L033
60758D52154K233K114K605L357M171M846N067M773M425M527N049N603O037O450
60744E13411O802O790O221N228M067K949K073J629J590J658J501J119Q82J152
60730E57072J786K156J756P93m9m17o86j401k541l520l882l767l698m033m718
60715E34851n477o094o471o536o269n851n611n719o031o277o328o225o098o097
60701D49767o207o099n445m547m196m625m983m324k848j552q59l41L09Q18J096
60686D05964J727L179M981O141O161N308M106K942K001J247M67n24j677k785l642
60671D35596m212m691n348o074o353o008n732o275p212p300o086m419l117j994
$$ y = [401081, 402933, 404529, 405931, 407474, 409762, 413424, 418616, 424675, 430582, 435825, 440602, 445133, 449121, 452154, 454387, 456501, 459106, 462463, 466634, 471480, 476547, 481320, 485745, 490272, 495321, 500924, 506961, 513411, 520213, 527003, 533224, 538452, 542519, 545468, 547541, 549170, 550760, 552418, 553919, 555038, 555920, 557072, 558858, 561014, 562770, 563563, 563514, 563097, 562411, 561010, 558469, 554949, 551067, 547300, 543602, 539569, 534851, 529374, 523280, 516809, 510273, 504004, 498153, 492542, 486823, 480792, 474515, 468187, 461962, 455864, 449767, 443560, 437461, 432016, 427469, 423273, 418648, 413665, 409341, 406493, 404941, 404082, 403741, 404050, 404868, 405964, 407691, 410870, 415851, 421992, 428153, 433461, 437567, 440509, 442510, 443757, 444224, 443700, 442023, 439238, 435596, 431384, 426693, 421345, 415271, 408918, 402910, 397178, 390903, 383691, 376391, 370305, 365886, 362769, 360775]
60657C60775p06K68K84l31n84l5R15J768K288K332J961J637J757J969J512K31
60641C76041j168j956k018j619r90k75L85Q83J176J307J509K102L040L798M014
60626C86229M041M485N338O076O491O938P729Q770R797J0661J1302J1806J2409
60613D92072J3095J3265J2319J0470Q532O860N093L011J054k58r51j389j830k504
60599E58839l613n043o283o978p249p314p183o915o794o907o877o410n744n252
60585D70277m835m184l331k496j611n58K60K54m23q44m07M76J000R14N51K76K26
60568D55545M64R61J483J748J827K172L171M705O177P000P069O809O812P409Q599
60553E21951J0210J2106J4205J6496J8992K1578K3875K5483K6364K6800K6726
$$ y = [360775, 360069, 360337, 360621, 360290, 359706, 359671, 360586, 362354, 364642, 366974, 368935, 370572, 372329, 374298, 375810, 376041, 374873, 372917, 370899, 369280, 368290, 368015, 368400, 369283, 370459, 371766, 373275, 375377, 378417, 382215, 386229, 390270, 394755, 400093, 406169, 412660, 419598, 427327, 436097, 445894, 456555, 467857, 479663, 492072, 505167, 518432, 530751, 541221, 549753, 556613, 561706, 564717, 565771, 565513, 564562, 563173, 561343, 558839, 555226, 550183, 543900, 536922, 529673, 522359, 515176, 508261, 501467, 494560, 487683, 481273, 475529, 470277, 465442, 461258, 457927, 455431, 453820, 453262, 453522, 453776, 453353, 452509, 452102, 452578, 453578, 454492, 455043, 455319, 455545, 456009, 456970, 458453, 460201, 462028, 464200, 467371, 472076, 478253, 485253, 492322, 499131, 505943, 513352, 521951, 532161, 544267, 558472, 574968, 593960, 615538, 639413, 664896, 691260, 718060, 744786]
60542G44786K5319K1518J5014O551k575j1089j7931k2504k4992k6072k6065k4610
60530F57350k1497j7487j3710j0466p200l681n51J558K882M024M983N263M804
60517F06272M267M353N240O815R117J2284J6255K0786K5839L1750L8883M7101
60505H28962N5765O4435P3538Q4093R6618J10526J24808J39228J54548J71566
60495A904087J89884K07533K21376K27689K22647K02981J67095J16142N4028j3781
60485C499681q1549j43556j94122k28700k45737k47251k37252k19692j97771j74242
60475A529809j51374j30473j11957r5889q2211p0533o0318n1422m4138l8542l4105
60464F58847l0138k6433k3248k0832j9133j7955j7147j6574j5933j4821j3146
$$ y = [744786, 770105, 791623, 806637, 813188, 810613, 799524, 781593, 759089, 734097, 708025, 681960, 657350, 635853, 618366, 604656, 594190, 586990, 583309, 582758, 584316, 587198, 591222, 596205, 601468, 606272, 610539, 614892, 620132, 626947, 636064, 648348, 664603, 685389, 711228, 742978, 781861, 828962, 884727, 949162, 1022700, 1106793, 1203411, 1313937, 1438745, 1577973, 1732521, 1904087, 2093971, 2301504, 2522880, 2750569, 2973216, 3176197, 3343292, 3459434, 3513462, 3499681, 3418132, 3274576, 3080454, 2851754, 2606017, 2358766, 2121514, 1901822, 1704051, 1529809, 1378435, 1247962, 1136005, 1040116, 957905, 887372, 827054, 775632, 731494, 692952, 658847, 628709, 602276, 579028, 558196, 539063, 521108, 503961, 487387, 471454, 456633, 443487]
60453D43487j1394j0205r594q920p734o393n538n223m933m318l527k890k572k567
60439C57679k676k509j854j067q30j365k158k623k778l091l808m599m854m288
60425C19179l155j923p52N25J884K871L078K619J890J029l4j140j893k058j644
60410C20476o62Q11K344L308L503L342L320L546L796L849L668L486L677M371N169
60395C68004N546N444N227N108M961M650M146L326K110R11M12P32J172J015K48
60380D13012o98j464j816j528p09k5j58j056j935k098j616j171j288j704j647
60365C94099p83L43J047J421K044K934L464L288K795K418K126J870J850J999J745
60350D22660Q32j11l86k40m70j249j960k101j749j261q88p65q40q34n85k99k04
$$ y = [443487, 432093, 421888, 412294, 403374, 395640, 389247, 383709, 378486, 373553, 369235, 365708, 362818, 360246, 357679, 355003, 352494, 350640, 349573, 348743, 347378, 345220, 342597, 339819, 336728, 332920, 328321, 323467, 319179, 316024, 314101, 313349, 313874, 315758, 318629, 321707, 324326, 326216, 327245, 327211, 326071, 324178, 322120, 320476, 319814, 320625, 322969, 326277, 329780, 333122, 336442, 339988, 343784, 347633, 351301, 354787, 358464, 362835, 368004, 373550, 378994, 384221, 389329, 394290, 398940, 403086, 406412, 408522, 409433, 409845, 410577, 411749, 412764, 413012, 412314, 410850, 409034, 407506, 406797, 406772, 406614, 405558, 403623, 401525, 399909, 398738, 397450, 395746, 394099, 393316, 393659, 394706, 396127, 398171, 401105, 404569, 407857, 410652, 413070, 415196, 417066, 418916, 420915, 422660, 423492, 423381, 422995, 422755, 422285, 421036, 419076, 416975, 415226, 413965, 413077, 412312, 411472, 410638, 410053, 409754, 409550]
60333D09550j32J56M52L73J1k28l34p19j464k089k181j822j266n70J75O85P78
60316D01375O88Q42J393K057K327J904J075N02M73N10L0p64j170j022q86j153
60300D08181j515j583j489j533j668j664j529j402j310j275j392j554j404r01
60286C87962o30j116j985k348j825q33J40R85J685K071K099K044K210K643L275
60271C96377M071M837N184M947M529M545N132N807N991N542M738L962L499L496
60257D62657L921M450M595M141L527L541M547O050P257P893Q329Q969R877J1047
60243E50801J2626J4642J6743J8456J9686K0817K2410K4911K8451L2661L6848
60232G99052M0614M4172M7884N1694N5353N8973O2766O6283O8491O8825O7679
$$ y = [409550, 409418, 409574, 410026, 410399, 410410, 410182, 409848, 409129, 407665, 405576, 403395, 401573, 400307, 399737, 399912, 400597, 401375, 402063, 402905, 404298, 406355, 408682, 410586, 411661, 412163, 412636, 413146, 413176, 412412, 411242, 410220, 409334, 408181, 406666, 405083, 403594, 402061, 400393, 398729, 397200, 395798, 394488, 393213, 391821, 390267, 388863, 387962, 387332, 386216, 384231, 381883, 380058, 379225, 379365, 380350, 382035, 384106, 386205, 388249, 390459, 393102, 396377, 400448, 405285, 410469, 415416, 419945, 424490, 429622, 435429, 441420, 446962, 451700, 455662, 459161, 462657, 466578, 471028, 475623, 479764, 483291, 486832, 491379, 497429, 504686, 512579, 520908, 529877, 539754, 550801, 563427, 578069, 594812, 613268, 632954, 653771, 676181, 701092, 729543, 762204, 799052, 839666, 883838, 931722, 983416, 1038769, 1097742, 1160508, 1226791, 1295282, 1364107, 1431786]
60221A431786O5617O2601N8300N2705M6066L8546L0424K2270J4396O416k023j0249
60209A816855j7005k1825k5316k7924k9193k8623k6583k3874k0699j6666j1613
60198A567534n850M09P357J5178K3528L1714L9340M6649N4117O1763O8847P4393
60186A984979P7795P8888P7599P3907O8080O0593N1702M1455L0221J8814P784
60175B571817l085j4276k5658l6458m5931n3765n9893o4201o6516o6706o4756
60164B070572o0830n5194m8019l9401k9694j9607r702j5R635J9060K7727L5250
60152A899782M1469M6057M8449M8288M5670M0912L4420K6930J9476J2663O176
60141B270292n92p441j3321j7447j9991k1375k1286j8929j4254q308k156M209
$$ y = [1431786, 1497403, 1560004, 1618304, 1671009, 1717075, 1755621, 1786045, 1808315, 1822711, 1829127, 1827104, 1816855, 1799850, 1778025, 1752709, 1724785, 1695592, 1666969, 1640386, 1616512, 1595813, 1579147, 1567534, 1561684, 1562093, 1569450, 1584628, 1608156, 1639870, 1679210, 1725859, 1779976, 1841739, 1910586, 1984979, 2062774, 2141662, 2219261, 2293168, 2361248, 2421841, 2473543, 2514998, 2545219, 2564033, 2571817, 2568732, 2554456, 2528798, 2492340, 2446409, 2392644, 2332751, 2268550, 2202034, 2135328, 2070572, 2009742, 1954548, 1906529, 1867128, 1837434, 1817827, 1808125, 1808110, 1817745, 1836805, 1864532, 1899782, 1941251, 1987308, 2035757, 2084045, 2129715, 2170627, 2205047, 2231977, 2251453, 2264116, 2270292, 2269700, 2262259, 2248938, 2231491, 2211500, 2190125, 2168839, 2149910, 2135656, 2127348, 2125192, 2129401]
60129B129401J1568K0346L0188M0538N1278O2735P5303Q9041J03533J18135J32531
60118B864597J46880J61198J74829J86843J96818K04728K10070K11660K08515
60109D566138K00544J88289J72313J53070J30926J06034P8427M8512J7164j4767
60099E646650m6693p7851j07003j32963j55021j72592j84856j91280j92247j88639
60089D197505j81027j69671j55211j38753j21235j03118q4726o6527m8995l2400
60079C095842j6799k106J1673K4134L4670M3045M9426N3579N4535N1668M5801
60068C445468L8475L0330K0903R979j716j3377k4801l5807m5646n3681o0296o6531
60056C243300p2831p8605q2959q5520q6465q6031q4206q0880p6132p0212o3293
$$ y = [2129401, 2140969, 2161315, 2191503, 2232041, 2283319, 2346054, 2421357, 2510398, 2613931, 2732066, 2864597, 3011477, 3172675, 3347504, 3534347, 3731165, 3935893, 4145963, 4357623, 4566138, 4766682, 4954971, 5127284, 5280354, 5411280, 5517314, 5595741, 5644253, 5661417, 5646650, 5599957, 5522106, 5415103, 5282140, 5127119, 4954527, 4769671, 4578391, 4386144, 4197505, 4016478, 3846807, 3691596, 3552843, 3431608, 3328490, 3243764, 3177237, 3128242, 3095842, 3079043, 3076937, 3088610, 3112744, 3147414, 3190459, 3239885, 3293464, 3347999, 3399667, 3445468, 3483943, 3514273, 3535176, 3545155, 3543439, 3530062, 3505261, 3469454, 3423808, 3370127, 3309831, 3243300, 3170469, 3091864, 3008905, 2923385, 2836920, 2750889, 2666683, 2585803, 2509671, 2439459, 2376166]
60045B376166n5445m6897l7982k8626j8334p047M245J4363K3279L2087M1591N1458
60033B348858O0747O8667P4735P8708Q0652Q0617P8146P2577O3955N3063M0439
60022C101164K6040J0238n689k0621l4632m8259o1157p2292q1100q7631r1612
60011B634449r2311q9575q4351p7805p0351o1846n2375m2452l2526k2671j2791
60000A995395k959O604J5924K5450L5640M6450N7435O8393P9401R0122R9508J06542
59988B623905J10872J12332J10314J04267R4542Q2046O7210N0064L1321J2490
59978C399363n426k2636l9634n6093p1064q3669r3096r8439r9302r6398r0926
59967B642680q3494p4108o3094n1350l9626k8106j6817n994M184J3851K3190L2222
$$ y = [2376166, 2320721, 2273824, 2235842, 2207216, 2188882, 2181835, 2186080, 2200443, 2223722, 2255809, 2297400, 2348858, 2409605, 2478272, 2553007, 2631715, 2712367, 2792984, 2871130, 2943707, 3007662, 3060725, 3101164, 3127204, 3137442, 3131753, 3111132, 3076500, 3028241, 2967084, 2894792, 2813692, 2726061, 2634449, 2542138, 2452563, 2368212, 2290407, 2220056, 2158210, 2105835, 2063383, 2030857, 2008186, 1995395, 1992436, 1999040, 2014964, 2040414, 2076054, 2122504, 2179939, 2248332, 2327733, 2417855, 2517363, 2623905, 2734777, 2847109, 2957423, 3061690, 3156232, 3238278, 3305488, 3355552, 3386873, 3399363, 3393937, 3371301, 3331667, 3275574, 3204510, 3120841, 3027745, 2929306, 2830004, 2733606, 2642680, 2559186, 2485078, 2421984, 2370634, 2331008, 2302902, 2286085, 2280091, 2284275, 2298126, 2321316, 2353538]
59955B353538M1018M9774N8317O5817P1284P4381P5440P4787P2362O8045O2010
59944C066773N4627M6133L6686K6694J6912Q111P24n113r167j1046j0446p377
59932C213511j922N979J6369K9103M4058O1332Q0779J01436J21975J41799J61179
59921C975598J80031J97119K10770K19907K23771K20997K09907J89828J61612
59912E789540J26759Q6543M2172m603n1333r5223j33627j64726j87943k03626
59902E203933k12227k14049k09675k00185j86801j70642j52873j34634j16446
59893C606401r8072p9260o0381m2058k4508p584Q793K4604L9892N4604O8352Q0517
59881C571300R0490R7561J00952J00206R5368Q6475P3133N5114L3122Q604j7069
$$ y = [2353538, 2394556, 2444330, 2502647, 2568464, 2639748, 2714129, 2789569, 2864356, 2936718, 3004763, 3066773, 3121400, 3167533, 3204219, 3230913, 3247825, 3255936, 3256660, 3251547, 3242380, 3231334, 3220888, 3213511, 3211589, 3217568, 3233937, 3263040, 3307098, 3368430, 3449209, 3550645, 3672620, 3814419, 3975598, 4155629, 4352748, 4563518, 4783425, 5007196, 5228193, 5438100, 5627928, 5789540, 5916299, 6002842, 6045014, 6040411, 5989078, 5893855, 5760228, 5595502, 5407559, 5203933, 4991706, 4777657, 4567982, 4367797, 4180996, 4010354, 3857481, 3722847, 3606401, 3508329, 3429069, 3368688, 3326630, 3302122, 3294538, 3303331, 3327935, 3367827, 3422431, 3490783, 3571300, 3661790, 3759351, 3860303, 3960509, 4055877, 4142352, 4215485, 4270599, 4303721, 4312325, 4295256]
59870D295256m2811o7507r0010j09415j24981j36007j42310j44718j44480j42095
59860C150922j37234j29820j20542j10187r9025q7181p5101o3415n2631m3266
59850B232520l5806l0339k6489k3970k2849k2985k3545k3485k2314k0099j7031
59839A963608j3437j0095q015p726q966j1088j3529j5840j7545j8303j8210j7762
59827A803092j7415j7204j6973j6941j7693j9476k1622k2984k2857k1350j9104
59816A589473j6811j4923j3395j1759r650p186m587j682J827N783R758J3750J8103
59803A558701K2699K6786K9751L1595L2437L2062L0195K6906K2543J7603J2734
59792A844012Q508M978J842r01k740l154j844J423O480J2325J7833K3235K9946
$$ y = [4295256, 4252445, 4184938, 4094928, 3985513, 3860532, 3724525, 3582215, 3437497, 3293017, 3150922, 3013688, 2883868, 2763326, 2653139, 2554114, 2466933, 2391832, 2328417, 2275786, 2232520, 2196714, 2166375, 2139886, 2115916, 2093067, 2070082, 2046537, 2023052, 2000738, 1980639, 1963608, 1950171, 1940076, 1932061, 1924335, 1915369, 1904281, 1890752, 1874912, 1857367, 1839064, 1820854, 1803092, 1785677, 1768473, 1751500, 1734559, 1716866, 1697390, 1675768, 1652784, 1629927, 1608577, 1589473, 1572662, 1557739, 1544344, 1532585, 1522935, 1515749, 1511162, 1509480, 1511307, 1517090, 1526848, 1540598, 1558701, 1581400, 1608186, 1637937, 1669532, 1701969, 1734031, 1764226, 1791132, 1813675, 1831278, 1844012, 1852520, 1857498, 1859340, 1858439, 1855699, 1852545, 1850701, 1852124, 1858604, 1870929, 1888762, 1911997, 1941943]
59779A941943L8625M8355N8346O9388Q2671R7999J14418J31956J51348J72186
59769B907235J92555K10521K24556K32136K29097K11300J76780J26523O4315l554
59759D571464o9293j25650j67738j93547k03629k00647j88454j70767j50361j29226
59749B972152j08811q9910p2751n7505m4298l2706k1868j1501k176N814J3303
59738B549743K1342K9862L7976M5382N2807O1052P0212P9935R0058J00794J12522
59727C251685J25476J39541J54510J70664J88821K09464K31963K55141K78426
59718E005691L02049L26084L49679L71243L88949M01138M06621M04859L95675
59709H351988L79069L55846L28454L00492K75087K53983K38046K27730K22416
$$ y = [1941943, 1980568, 2028923, 2087269, 2156657, 2239328, 2337327, 2451745, 2583701, 2735049, 2907235, 3099790, 3310311, 3534867, 3767003, 3996100, 4207400, 4384180, 4510703, 4575018, 4571464, 4502171, 4376521, 4208783, 4015236, 3811607, 3610960, 3422506, 3251739, 3101378, 2972152, 2863341, 2773431, 2700680, 2643175, 2598877, 2566171, 2544303, 2532802, 2530626, 2536440, 2549743, 2571085, 2600947, 2638923, 2684305, 2737112, 2798164, 2868376, 2948311, 3038369, 3139163, 3251685, 3377161, 3516702, 3671212, 3841876, 4030697, 4240161, 4472124, 4727265, 5005691, 5307740, 5633824, 5983503, 6354746, 6743695, 7144833, 7551454, 7956313, 8351988, 8731057, 9086903, 9415357, 9715849, 9990936, 10244919, 10482965, 10710695, 10933111]
59700A0933111K20006K18009K14918K09918K01591J87793J67160J40145J08446
59691A2601097P3859L7961K382l1158o1089q6100j05216j17875j23850j22852
59681A2067159j14408r8353p5292m6431j3015K4015O3994J06503J51273J97931
59671A2263376K45725K93512L39771L82643M20102M50184M70820M79298M72189
59662A5817620M46320L99831L32401K44990J40078K2251j01891k24784l39052
59653A6737764m38310n17722n74424o07449o17487o06840n79442n40193m93860
59644A1762037m44632l96602l54286l22406l05129l04994l21662l51132l86491
59635H574703m20031m45335m58253m57239m43452m20108l90869l58426l24574
$$ y = [10933111, 11153117, 11371126, 11586044, 11795962, 11997553, 12185346, 12352506, 12492651, 12601097, 12674956, 12712917, 12715299, 12684141, 12623052, 12536952, 12431736, 12313861, 12190011, 12067159, 11952751, 11854398, 11779106, 11732675, 11719660, 11743675, 11807669, 11914172, 12065445, 12263376, 12509101, 12802613, 13142384, 13525027, 13945129, 14395313, 14866133, 15345431, 15817620, 16263940, 16663771, 16996172, 17241162, 17381240, 17403491, 17301600, 17076816, 16737764, 16299454, 15781732, 15207308, 14599859, 13982372, 13375532, 12796090, 12255897, 11762037, 11317405, 10920803, 10566517, 10244111, 9938982, 9633988, 9312326, 8961194, 8574703, 8154672, 7709337, 7251084, 6793845, 6350393, 5930285, 5539416, 5180990, 4856416]
59626D856416k91058k59706k31643k06758j84247j63546j44716j28146j13966
59617C132630j01778r0830q0463p0429o0909n2305m4953l8891l3827k9442k5683
59606B503120k2774k0996k0602k1771k4385k7890l1619l5220l8555m1330m3235
59595B174743m4309m4764m4452m3070m0927l8855l7126l5048l2005k8403k5107
59584A760677k2347j9714j6914j4007j1030p962m948k191L44K796N148P330R466
59571A686648J1685J3790J5500J6851J8131J9576K1379K3734K6408K8642K9958
59560A912302L0996L2959L6271M0260M4195M8154N2690N8037O3900O9881P6050
59549B465695Q3000R1178J00164J09002J17388J25922J34762J42576J47460J48391
$$ y = [4856416, 4565358, 4305652, 4074009, 3867251, 3683004, 3519458, 3374742, 3246596, 3132630, 3030852, 2940022, 2859559, 2789130, 2728221, 2675916, 2630963, 2592072, 2558245, 2528803, 2503120, 2480346, 2459350, 2438748, 2416977, 2392592, 2364702, 2333083, 2297863, 2259308, 2217978, 2174743, 2130434, 2085670, 2041218, 1998148, 1957221, 1918366, 1881240, 1846192, 1814187, 1785784, 1760677, 1738330, 1718616, 1701702, 1687695, 1676665, 1668703, 1663755, 1661564, 1661908, 1664704, 1669852, 1677182, 1686648, 1698333, 1712123, 1727623, 1744474, 1762605, 1782181, 1803560, 1827294, 1853702, 1882344, 1912302, 1943298, 1976257, 2012528, 2052788, 2096983, 2145137, 2197827, 2255864, 2319764, 2389645, 2465695, 2548695, 2639873, 2740037, 2849039, 2966427, 3092349, 3227111, 3369687, 3517147, 3665538]
59539C665538J45082J37048J24104J07839R1307P6801O4461N3145M1739K9403
59529D536467J5637Q47j3677k6941l9048n0534o1408p1166p9149q4403q5930q3679
59517C957016p8878p2717o5021n4740m1428k5588p900J1254L1659N3203P5813
59506C782673R8891J21014J40665J57020J69494J76693J76626J68033J51057J26617
59496E268783R5741N9589J9711k1945o3084j01312j34762j62519j84076j98678
59486D577448k05716k05622j99697j89139j74963j58728j42196j25880j08810
59477C066697r0339p1450n3610l7040k0959n082J0145K4609L8708N2370O4787
59466B978836P5487Q4916R3543J00885J05934J08048J06889J01803R2039P7609
$$ y = [3665538, 3810620, 3947668, 4071772, 4179611, 4270918, 4347719, 4412180, 4465325, 4507064, 4536467, 4552104, 4552951, 4539274, 4512333, 4473285, 4422751, 4361343, 4290177, 4211028, 4126625, 4040695, 3957016, 3878138, 3805421, 3740400, 3685660, 3644232, 3618644, 3610744, 3621998, 3653657, 3706860, 3782673, 3881564, 4002578, 4143243, 4300263, 4469757, 4646450, 4823076, 4991109, 5142166, 5268783, 5364524, 5424113, 5443824, 5421879, 5358795, 5257483, 5122721, 4960202, 4776126, 4577448, 4371732, 4166110, 3966413, 3777274, 3602311, 3443583, 3301387, 3175507, 3066697, 2976358, 2904908, 2851298, 2814258, 2793299, 2788217, 2798362, 2822971, 2861679, 2914049, 2978836, 3054323, 3139239, 3232782, 3333667, 3439601, 3547649, 3654538, 3756341, 3848380, 3925989]
59456C925989N9432L8558J5588q964l4149n8686q1329j01040j17067j29222j37924
59445C371186j43624j46288j45723j42363j37285j31313j24582j17119j09397
59436B173492j01871r4302q6197p7829p0211o3888n8311n2658m6820m1243l6217
59425A443945l1719k7652k3730j9409j4432r301m662l32M382R297J2921J3644
59413A352952J1053N999J0n114p807p613n427k492O57M025P336R791J0481Q705
59399A382556M312j680p074r884r792p866m999j313L077P622J1972J6375K0979
59386A404285K5274K8701L1454L4317L7871M2197M7133N2400N7634O2628O7561
59375A891455P2920P9263Q7029R6282J06523J17126J28214J40898J56420J75151
$$ y = [3925989, 3985421, 4023979, 4039567, 4030603, 3996454, 3937768, 3856439, 3755399, 3638332, 3509110, 3371186, 3227562, 3081274, 2935551, 2793188, 2655903, 2524590, 2400008, 2282889, 2173492, 2071621, 1977319, 1891122, 1813293, 1743082, 1679194, 1620883, 1568225, 1521405, 1480162, 1443945, 1412226, 1384574, 1360844, 1341435, 1327003, 1317702, 1313040, 1312708, 1317090, 1326387, 1339308, 1352952, 1364005, 1370004, 1370014, 1364900, 1357093, 1349480, 1344053, 1341561, 1342218, 1346243, 1353579, 1363370, 1373851, 1382556, 1386868, 1385188, 1378114, 1368230, 1358438, 1350572, 1345573, 1344260, 1347337, 1354959, 1366931, 1383306, 1404285, 1429559, 1458260, 1489714, 1524031, 1561902, 1604099, 1651232, 1703632, 1761266, 1823894, 1891455, 1964375, 2043638, 2130667, 2226949, 2333472, 2450598, 2578812, 2719710, 2876130, 3051281]
59365C051281J96478K19382K42940K66526K89698L11718L31077L45937L55169
59356E610206L58646L56322L47654L32454L12008K88680K64457K40264K16397
59347H327088J92877J69226J44438J17486Q7634N4125J6005k7328p5408j26732
59337H879411j79519k32055k82112l26451l61723l86212m00266m04833m00235
59328E906005l86984l67153l43748l18800k92967k66866k41603k17747j95068
59319C275069j73815j55079j39190j24831j10676r7066q5027p4443o4416n4798
59309B195728m6099l8222l0544k3018j6032r379k635L556P772R582R895R614R114
59296B079332R182J0982J4526J8419K1705K4981K9007L3304L7050M0445M4122
$$ y = [3051281, 3247759, 3467141, 3710081, 3976607, 4266305, 4578023, 4909100, 5255037, 5610206, 5968852, 6325174, 6672828, 7005282, 7317290, 7605970, 7870427, 8110691, 8327088, 8519965, 8689191, 8833629, 8951115, 9038749, 9092874, 9108879, 9081551, 9006143, 8879411, 8699892, 8467837, 8185725, 7859274, 7497551, 7111339, 6711073, 6306240, 5906005, 5519021, 5151868, 4808120, 4489320, 4196353, 3929487, 3687884, 3470137, 3275069, 3101254, 2946175, 2806985, 2682154, 2571478, 2474412, 2389385, 2314942, 2250526, 2195728, 2149629, 2111407, 2080863, 2057845, 2041813, 2032434, 2029799, 2033355, 2041127, 2050709, 2060604, 2070218, 2079332, 2088514, 2099496, 2114022, 2132441, 2154146, 2179127, 2208134, 2241438, 2278488, 2318933, 2363055]
59285B363055M7745N0298N1535N2202N2919N3602N4080N4547N5221N5932N6355
59274B947491N6388N6167N5687N4552N2185M8401M3541L7876L1035K2450J2218
59263C417991J087j0435k2402l4821m7109n8269o7307p3502p6811p8028p8164
59252B872230p7533p5760p2494o7743o1629n4493m7097m0062l3247k6329j9786
59241B296057j4343r660m698N25M805P641R947J2403J4380J5244J5573J6095J6367
59228B380336J5561J3869J2175J0907J0066R816J0234J1024J2312J5091K0011
59217B521402K6440L3625M2128N2877O5537P9101R3687J10241J28650J47630J66345
59206C467663J84604K01253K13883K20670K21245K15236K01271J78310J47043
$$ y = [2363055, 2410800, 2461098, 2512633, 2564835, 2617754, 2671356, 2725436, 2779983, 2835204, 2891136, 2947491, 3003879, 3060046, 3115733, 3170285, 3222470, 3270871, 3314412, 3352288, 3383323, 3405773, 3417991, 3419078, 3408643, 3386241, 3351420, 3304311, 3246042, 3178735, 3105233, 3028422, 2950394, 2872230, 2794697, 2718937, 2646443, 2578700, 2517071, 2462578, 2415481, 2375419, 2342172, 2315843, 2296057, 2281714, 2272054, 2267356, 2267881, 2272686, 2280327, 2290274, 2302677, 2317057, 2332301, 2347874, 2363969, 2380336, 2395897, 2409766, 2421941, 2432848, 2442914, 2452730, 2462964, 2473988, 2486300, 2501391, 2521402, 2547842, 2581467, 2623595, 2676472, 2742009, 2821110, 2914797, 3025038, 3153688, 3301318, 3467663, 3652267, 3853520, 4067403, 4288073, 4509318, 4724554, 4925825, 5104135, 5251178]
59197E251178J09092O5646J7842l2037q0949j26536j67414k02146k28860k46241
59187D359575k54490k54973k49253k38685k24632k08501j91301j73426j55128
59178B409186j37183j20736j06443r4081q3077p3084o3978n5752m8682m3180l9071
59167A543919l5430l1583k7978k5488k4115k2925k1128j8692j6057j3670j1762
59156A295091j0112q168n769l479j777k64J707L952N843P566J0003J3301J6461
59143A324355J8665K0172K1640K3260K5009K7092K9615L2216L4483L6391L7984
59132A630882L9012L9291L9113L8855L8461L7630L6364L4909L3314L1400K9068
59121B028299K6370K3380K0258J7451J5418J4117J2958J1449R807Q744Q632R017
$$ y = [5251178, 5360270, 5425916, 5443758, 5411721, 5330772, 5204236, 5036822, 4834676, 4605816, 4359575, 4105085, 3850112, 3600859, 3362174, 3137542, 2929041, 2737740, 2564314, 2409186, 2272003, 2151267, 2044824, 1950743, 1867666, 1794582, 1730604, 1674852, 1626170, 1582990, 1543919, 1508489, 1476906, 1448928, 1423440, 1399325, 1376400, 1355272, 1336580, 1320523, 1306853, 1295091, 1284979, 1276811, 1271042, 1267563, 1265786, 1265522, 1267229, 1271181, 1277024, 1284590, 1294593, 1307894, 1324355, 1343020, 1363192, 1384832, 1408092, 1433101, 1460193, 1489808, 1522024, 1556507, 1592898, 1630882, 1669894, 1709185, 1748298, 1787153, 1825614, 1863244, 1899608, 1934517, 1967831, 1999231, 2028299, 2054669, 2078049, 2098307, 2115758, 2131176, 2145293, 2158251, 2169700, 2179507, 2188251, 2196883, 2205900]
59109B205900R086Q535P816P538P837Q440R177J0189J1749J3948J6558J9280K2294
59096B358347K6486L2684M0596M8905N6577O3596P0272P6377Q1395Q5044Q6992
59085C027271Q6508Q3061P7035O9138N9268M6684L1257J3941l983k1601l8241
59074C430338n3263o6224p6956q5427r1770r6333r9382j00860j00675r9148r6816
59063B463484r4060r1168q8453q5842q2737p8800p4559p0706o7215o3754o0516
59052A605674n7706n4684n0746m6485m3188m0910l8440l5323l2532l0695k8958
59041A146007k6287k2955j9896j7376j5114j3012j1085r149p294o112n867n937
59029I85923n775n850o823q268r092r017q718q629q429p808p023o435o007n472
$$ y = [2205900, 2214986, 2223521, 2231337, 2238875, 2246712, 2255152, 2264329, 2274518, 2286267, 2300215, 2316773, 2336053, 2358347, 2384833, 2417517, 2458113, 2507018, 2563595, 2627191, 2697463, 2773840, 2855235, 2940279, 3027271, 3113779, 3196840, 3273875, 3343013, 3402281, 3448965, 3480222, 3494163, 3490180, 3468579, 3430338, 3377075, 3310851, 3233895, 3148468, 3056698, 2960365, 2860983, 2760123, 2659448, 2560300, 2463484, 2369424, 2278256, 2189803, 2103961, 2021224, 1942424, 1867865, 1797159, 1729944, 1666190, 1605674, 1547968, 1493284, 1442538, 1396053, 1352865, 1311955, 1273515, 1238192, 1205660, 1174965, 1146007, 1119720, 1096765, 1076869, 1059493, 1044379, 1031367, 1020282, 1011133, 1003839, 997727, 991860, 985923, 980148, 974298, 967475, 959207, 950115, 941098, 932380, 923751, 915322, 907514, 900491, 894056, 888049, 882577]
59015H82577m711l713k410p76J003K479L198L118K840L113M011M868N121M959
59001I05677M897N011M935M395L475K474J829J969K901L938M103K916Q41j105
58987I48256k155k358k311k319k029j126j03L44M81J380L371N377O268O258O302
58972I65636O621O588N971N408N486N945O186O145O208O452O571O618P279Q940
58958A056054J0820J1613J1001R871R037Q482Q088Q190Q705Q633P410O200O658
58945A170762Q765J1036J2737J4464J6490J7957J8303J8304J8905J9998K1023
58934A348744K2075K3535K5289K6973K8628L0511L2712L5394L8855M2857M6478
58923A702051M9234N1773N4855N8295O1536O4707O8325P2442P6926Q2194Q8802
$$ y = [882577, 877866, 874153, 871743, 870967, 871970, 874449, 877647, 880765, 883605, 886718, 890729, 895597, 900718, 905677, 910574, 915585, 920520, 924915, 928390, 930864, 932693, 934662, 937563, 941501, 945604, 948520, 949361, 948256, 946101, 943743, 941432, 939113, 937084, 935958, 935855, 936199, 936680, 938060, 941431, 946808, 953076, 959334, 965636, 972257, 978845, 984816, 990224, 995710, 1001655, 1007841, 1013986, 1020194, 1026646, 1033217, 1039835, 1047114, 1056054, 1066874, 1078487, 1089488, 1099359, 1108396, 1116878, 1124966, 1133156, 1141861, 1150494, 1157904, 1164104, 1170762, 1179527, 1190563, 1203300, 1217764, 1234254, 1252211, 1270514, 1288818, 1307723, 1327721, 1348744, 1370819, 1394354, 1419643, 1446616, 1475244, 1505755, 1538467, 1573861, 1612716, 1655573, 1702051, 1751285, 1803058, 1857913, 1916208, 1977744, 2042451, 2110776, 2183218, 2260144, 2342338, 2431140]
58912B431140R6588J04966J13800J23256J33093J42988J53272J64542J76636J88880
58902C829161K01245K14461K28889K44101K59596K75196K90551L04775L16731
58893F164706L25163L28647L25978L16712L00678K76970K44246K02282J52670
58884H638052R7791L9758j9358p6999j30574j78304k19281k52927k78813k96936
58874G322409l07871l12532l11800l06411k97156k85168k71728k57630k42910
58865D729203k27577k12388j98482j86201j74843j63676j52788j42732j33667
58856C136849j25267j17193j09333j01607r3925q6436p9549p3560o8290o3255
58846B218434n8094n2700m7042m1162l5463l0561k6540k2661j8265j3747j0044
$$ y = [2431140, 2527728, 2632694, 2746494, 2869750, 3002843, 3145831, 3299103, 3463645, 3640281, 3829161, 4030406, 4244867, 4473756, 4717857, 4977453, 5252649, 5543200, 5847975, 6164706, 6489869, 6818516, 7144494, 7461206, 7761884, 8038854, 8283100, 8485382, 8638052, 8735843, 8775601, 8756243, 8679244, 8548670, 8370366, 8151085, 7898158, 7619345, 7322409, 7014538, 6702006, 6390206, 6083795, 5786639, 5501471, 5229743, 4972113, 4729203, 4501626, 4289238, 4090756, 3904555, 3729712, 3566036, 3413248, 3270516, 3136849, 3011582, 2894389, 2785056, 2683449, 2589524, 2503088, 2423539, 2349979, 2281689, 2218434, 2160340, 2107640, 2060598, 2019436, 1983973, 1953412, 1926872, 1904211, 1885946, 1872199, 1862155]
58835A862155p262m493j117K376N249P558R889J2442J4971J7399K0088K3446K7526
58822A990227L1942L6157M0043M4113M8897N4067N8760O2802O6990P1960P7599
58811B583557Q3847R1277J00170J09790J19486J29949J42388J56730J71682J86506
58801C875382K01765K18186K35660K53560K71340K88373L03689L16209L25015
58792F289179L29133L27352L18391L01228K75308K40686J98009J48314R2999L4099
58782H554698k5754q4048j38930j88793k31781k66326k92090l09882l20754l25547
58772F370793l25191l20703l12810l02004k88996k74641k59302k42897k25797
58763C818452k09208j94277j80967j68246j55342j42637j31154j21344j12579
$$ y = [1862155, 1854893, 1850400, 1849283, 1851659, 1856908, 1864466, 1874355, 1886797, 1901768, 1919167, 1939255, 1962701, 1990227, 2022169, 2058326, 2098369, 2142482, 2191379, 2245446, 2304206, 2367008, 2433998, 2505958, 2583557, 2667404, 2758681, 2858851, 2968641, 3088127, 3218076, 3360464, 3517194, 3688876, 3875382, 4077147, 4295333, 4530993, 4784553, 5055893, 5344266, 5647955, 5964164, 6289179, 6618312, 6945664, 7264055, 7565283, 7840591, 8081277, 8279286, 8427600, 8520599, 8554698, 8528944, 8444896, 8305966, 8117173, 7885392, 7619066, 7326976, 7017094, 6696340, 6370793, 6045602, 5724899, 5412089, 5110085, 4821089, 4546448, 4287146, 4044249, 3818452, 3609244, 3414967, 3234000, 3065754, 2910412, 2767775, 2636621, 2515277, 2402698]
58754B402698j03993r5533q7789q0933p4374o7609o0873n4672m9092m3931l9105
58743A644794l4569l0201k6104k2727k0240j8230j6333j4846j4218j4344j4854
58732A418128j5748j7174j8822k0131k0913k1278k1183k0594j9896j9546j9555
58721A203288j9726k0185k1116k2213k2981k3424k3855k4279k4466k4450k4354
58710I52239k3948k2987k1754k0671j9610j8240j6737j5430j4039j2133j0129
58699G56561q772p803o224m011k433k298k909l344l883n440q068j0812j2753j3656
58685F64155j3703j3063j1917j0610r563q898q183o861m966l219k141j413l94
58672E69224J072K699M236N498O282O694P127P491O971N202L108J723O99j032
$$ y = [2402698, 2298705, 2203172, 2115383, 2034450, 1960076, 1892467, 1831594, 1776922, 1727830, 1683899, 1644794, 1610225, 1580024, 1553920, 1531193, 1510953, 1492723, 1476390, 1461544, 1447326, 1432982, 1418128, 1402380, 1385206, 1366384, 1346253, 1325340, 1304062, 1282879, 1262285, 1242389, 1222843, 1203288, 1183562, 1163377, 1142261, 1120048, 1097067, 1073643, 1049788, 1025509, 1001043, 976593, 952239, 928291, 905304, 883550, 862879, 843269, 825029, 808292, 792862, 778823, 766690, 756561, 747789, 739986, 733762, 729751, 727318, 725020, 722111, 718767, 714884, 709444, 701376, 690564, 677811, 664155, 650452, 637389, 625472, 614862, 605299, 596401, 588218, 581357, 576391, 573172, 571031, 569618, 569224, 570296, 572995, 577231, 582729, 589011, 595705, 602832, 610323, 617294, 622496, 625604, 627327, 628026, 626994]
58658F26994l473n537o666p281p675p552o907o311o068n862n433m828l906k489
58644E47006j095o19r78j007J4J478K382K461K108J942K589M164N748O232N834
58629E78259N887O893P880Q044P970Q581R797J1013J2117J3266J4309J5202J6477
58616G15695J8529K0913K3025K5050K7585L0630L3645L6371L9005M1748M4791
58605A056987M8538N3381N9208O5507P1849P8028Q3883Q9220R3728R6825R7798
58594A894952R6237R2163Q5626P6486O4594M9922L2561J3061p206k6555m3940
58583B327901n9043p1469q0625q6470q9687r0751q9518q5948q0725p4681o8160
58572A450824o1280n4380m7801m1561l5554k9816k4478j9807j6212j3715j1417
$$ y = [626994, 623521, 617984, 611318, 604037, 596362, 588810, 581903, 575592, 569524, 563662, 558229, 553401, 549495, 547006, 545911, 545292, 544314, 543307, 543321, 544799, 547181, 549642, 551750, 553692, 556281, 560445, 566193, 572425, 578259, 584146, 591039, 598919, 606963, 614933, 623514, 633311, 644324, 656441, 669707, 684016, 699218, 715695, 734224, 755137, 778162, 803212, 830797, 861427, 895072, 931443, 970448, 1012196, 1056987, 1105525, 1158906, 1218114, 1283621, 1355470, 1433498, 1517381, 1606601, 1700329, 1797154, 1894952, 1991189, 2083352, 2168978, 2245464, 2310058, 2359980, 2392541, 2405602, 2398396, 2371841, 2327901, 2268858, 2197389, 2116764, 2030294, 1940607, 1849856, 1760338, 1674390, 1593665, 1518984, 1450824, 1389544, 1335164, 1287363, 1245802, 1210248, 1180432, 1155954, 1136147, 1119935, 1106220, 1094803]
58561A094803q319m789k438k161l072l826m356n690q534j2592j6982k0817k3556
58548I77671k5183k6044k6436k6469k6179k5391k3654k0878j7901j5674j4097
58537G29765j2355j0417r159q906q911q579q195q024p732p228p116p604p815o972
58523F10752n667n117n590o282o404n806m832m057l921m244m378m033l504k984
58509E43933k266j317m68K80J468L268N061O297P192Q111Q844Q919Q202O921N503
58494F09948M540M206L769K416O47j92J34M83L03M76J603K726K758K055J602J481
58478F38955J141M98k16j038j960k596k925l669n108o318o457o143o473p344p738
58463E82609p275o477n809n351n201n388n536n195m428l652l177l111l264l054
$$ y = [1094803, 1086484, 1081695, 1079257, 1077096, 1074024, 1070198, 1065842, 1060152, 1051618, 1039026, 1022044, 1001227, 977671, 952488, 926444, 900008, 873539, 847360, 821969, 798315, 777437, 759536, 743862, 729765, 717410, 706993, 697834, 688928, 680017, 671438, 663243, 655219, 647487, 640259, 633143, 625539, 617724, 610752, 605085, 599968, 594378, 588096, 581692, 575886, 571054, 566997, 563076, 558832, 554454, 550421, 546917, 543933, 541667, 540350, 539882, 540162, 541630, 544898, 549959, 556256, 563448, 571559, 580403, 589322, 597524, 604445, 609948, 614488, 618694, 622463, 624879, 625526, 625334, 625468, 625951, 626254, 626730, 628333, 631059, 633817, 635872, 637474, 638955, 640096, 640594, 640378, 639340, 637380, 634784, 631859, 628190, 623082, 616764, 610307, 604164, 597691, 590347, 582609, 575334, 568857, 563048, 557697, 552496, 547108, 541572, 536377, 531949, 528297, 525120, 522009, 518745, 515691]
58449E15691k062p94j19J62J040K474L208K886K848L973N279N709N889O808P964
58434E60956Q299P994P758P227N642L451J733N58o68j765k076j799j717j969k186
58419E91438k464k949l028k164j052o84p55k71P21J361J529J826K359K874L662
58404E92403N006O106N952N017M622M955N073M690M448M518M378M012M050M626
58390F59856N251N775O397O819O560O039O206P172Q240R111R877J0134R415Q344
58376G65196Q041Q351P974O392M478L152K482K203K005J334p5j514k054j886j911
58361H04168k245k166j367k16J071K431L375L492L276L439L740L617L636M826
58347H31077O908Q439Q741Q370P870P244O643O384O333O213O336O969P505P300
$$ y = [515691, 513629, 512835, 512716, 512878, 513918, 516392, 519600, 522486, 525334, 529307, 534586, 540295, 546184, 552992, 560956, 569255, 577249, 585007, 592234, 597876, 601327, 603060, 603618, 602950, 601185, 599109, 597310, 595593, 593624, 591438, 588974, 586025, 582997, 580833, 579781, 579097, 578342, 578071, 578792, 580153, 581682, 583508, 585867, 588741, 592403, 597409, 603515, 609467, 614484, 619106, 624061, 629134, 633824, 638272, 642790, 647168, 651180, 655230, 659856, 665107, 670882, 677279, 684098, 690658, 696697, 702903, 710075, 718315, 727426, 737303, 747437, 756852, 765196, 773237, 781588, 789562, 795954, 800432, 803584, 806066, 808269, 810274, 811608, 811533, 810019, 807965, 806079, 804168, 801923, 799757, 798390, 798174, 799245, 801676, 805051, 808543, 811819, 815258, 818998, 822615, 826251, 831077, 837985, 846424, 855165, 863535, 871405, 878649, 885292, 891676, 898009, 904222, 910558, 917527, 925032, 932332]
58333I32332O936P331Q151Q471Q483R054J0019J0502J0630J1289J2352J2778J2409
58320A060737J2210J2755J3740J4804J5649J5707J4938J4435J4959J5571J5202
58309A220707J4670J5271J6321J6178J5120J4828J5476J5652J4964J4429J4424
58298A388040J4477J5004J6969J9792K1763K2537K3116K3592K3258K2814K3986
58287A615348K6721K9212L0811L2549L4574L5633L5465L5349L5835L6194L6422
58276A984113L7442L9094M0167M0853M2690M5799M8550N0396N2565N5443N7657
58265B494769N8369N8305N8031N7325N6607N6840N7759N8290N8708O0325O3178
58254C138506O6335O9983P4695P9301Q2466Q5688R1453R8984J05444J10718J17029
$$ y = [932332, 939268, 946599, 954750, 963221, 971704, 980758, 990777, 1001279, 1011909, 1023198, 1035550, 1048328, 1060737, 1072947, 1085702, 1099442, 1114246, 1129895, 1145602, 1160540, 1174975, 1189934, 1205505, 1220707, 1235377, 1250648, 1266969, 1283147, 1298267, 1313095, 1328571, 1344223, 1359187, 1373616, 1388040, 1402517, 1417521, 1434490, 1454282, 1476045, 1498582, 1521698, 1545290, 1568548, 1591362, 1615348, 1642069, 1671281, 1702092, 1734641, 1769215, 1804848, 1840313, 1875662, 1911497, 1947691, 1984113, 2021555, 2060649, 2100816, 2141669, 2184359, 2230158, 2278708, 2329104, 2381669, 2437112, 2494769, 2553138, 2611443, 2669474, 2726799, 2783406, 2840246, 2898005, 2956295, 3015003, 3075328, 3138506, 3204841, 3274824, 3349519, 3428820, 3511286, 3596974, 3688427, 3787411, 3892855, 4003573, 4120602]
58243D120602J24209J29909J34476J41009J50075J58915J66492J74843J84730
58234E485260J94634K04786K17464K32410K46724K60273K76331K95877L16352
58225G730111L37175L61104L88898M18065M48312M82708N22135N64357O09852
58216A1862717O62500P23290P89900Q63740R50227J050681J161816J284900J426993
58207B0776764J591354J776295J986414K235326K534635K891359L320171L846938
58199D0959256M496968N294106O277549P505814R037525J0921300J3204461J5923313
58191A13620292J9067871K2571281K6324972L0123513L3498981L5595071L5285295
58184C16087276L1551270K3938226J2890298j70843j3141089k3904541l1089014
$$ y = [4120602, 4244811, 4374720, 4509196, 4650205, 4800280, 4959195, 5125687, 5300530, 5485260, 5679894, 5884680, 6102144, 6334554, 6581278, 6841551, 7117882, 7413759, 7730111, 8067286, 8428390, 8817288, 9235353, 9683665, 10166373, 10688508, 11252865, 11862717, 12525217, 13248507, 14038407, 14902147, 15852374, 16903055, 18064871, 19349771, 20776764, 22368118, 24144413, 26130827, 28366153, 30900788, 33792147, 37112318, 40959256, 45456224, 50750330, 57027879, 64533693, 73571218, 84492518, 97696979, 113620292, 132688163, 155259444, 181584416, 211707929, 245206910, 280801981, 316087276, 347638546, 371576772, 384467070, 384296227, 371155138, 347250597, 316161583]
58177C16161583l4442285l4620423l2649487k9487691k5859252k2247689j8923011
58170A17931745j5991650j3471464j1345790r575142q102621o875202n855753
58163D6714123n012116m309151l718359l223578k810737k461465k161684j906766
58155B1110267j692579j509297j348463j208402j087934r81545q85019p99493
58147A1597535p25823o60422o00294n46872n01439m61705m25949l95781l71638
58138F907612l49947l27678l05824k85884k66862k48106k31226k16858k03041
58129D472186j88895j76322j66220j56603j46352j37226j30217j23495j15900
58120C130956j09016j03817r8651r2563q7338q4158q1362p7462p3448p0139o6401
$$ y = [316161583, 281719298, 247098875, 214449388, 184961697, 159102445, 136854756, 117931745, 101940095, 88468631, 77122841, 67547699, 59445078, 52569876, 46714123, 41702007, 37392856, 33674497, 30450919, 27640182, 25178717, 23017033, 21110267, 19417688, 17908391, 16559928, 15351526, 14263592, 13282047, 12397028, 11597535, 10871712, 10211290, 9610996, 9064124, 8562685, 8100980, 7675031, 7279250, 6907612, 6557665, 6229987, 5924163, 5638279, 5371417, 5123311, 4892085, 4675227, 4472186, 4283291, 4106969, 3940749, 3784146, 3637794, 3500568, 3370351, 3246856, 3130956, 3021940, 2918123, 2819472, 2726909, 2639571, 2555413, 2474051, 2396589, 2323141, 2253002, 2186601]
58109B186601o1936n8779n7821n6735n3597m9885m7642m6219m4152m1892m0308
58098A627635l8644l6243l4381l4166l4347l3225l1115k9089k6992k4517k2571
58087A282345k1798k1277k0328j9986k1064k2404k2757k2860k3961k5676k6914
58076A033320k7505k7474k6150k3519k1104j9960j9228j7926j6679j6153j5401
58065H02221j3475j1275j0087r532q670p857p791p914p432o965p450q349q594
58052F86830q502r036r896r982r195q323p577o590n467m622l981l261k647k323
58038E95428j967j476j438k063k476j911q38j05J76R1p19k235l567m191m717n549
58022E62443n986n582n261n868o644o502n768n424n428n213n020n350n785n633
$$ y = [2186601, 2124665, 2065886, 2008065, 1951330, 1897733, 1847848, 1800206, 1753987, 1709835, 1667943, 1627635, 1588991, 1552748, 1518367, 1484201, 1449854, 1416629, 1385514, 1356425, 1329433, 1304916, 1282345, 1260547, 1239270, 1218942, 1198956, 1177892, 1155488, 1132731, 1109871, 1085910, 1060234, 1033320, 1005815, 978341, 952191, 928672, 907568, 887608, 868380, 850454, 833775, 817622, 802221, 788746, 777471, 767384, 757852, 749182, 741325, 733534, 725620, 718188, 711223, 703773, 695424, 686830, 678328, 669292, 659396, 649414, 640219, 631896, 624319, 617729, 612262, 607640, 603659, 600398, 597751, 595428, 593461, 591985, 590547, 588484, 586008, 584097, 583259, 583154, 583330, 583421, 582702, 580467, 576900, 572709, 567992, 562443, 556457, 550875, 545614, 539746, 533102, 526600, 520832, 515408, 509980, 504767, 499747, 494397, 488612, 482979]
58008D82979n132m828m457l613k820k677k701k213j621j435q84Q58K803L343K876
57993D60478L378N381P211P484O741O135N857N519N063M572L802K531J064L1k25
57978E25022J0mp92k068l098l632m016m271l927k973k071j390k35J556K903K975
57962E03989K408J965J034j307m475p006q493r540j0256j0169r471q952q728q135
57948D22864o922n574m360l096j852j119j098j486j921k076j626p49l83j200k583
57933C86819l370l309k943k482j737r25m89k38L52J094J294R63Q28J097J153N97
57917C78704k31r09j423j829k106k395k852l283l392l239k884j996n49N23L29
57902C52468n48p54j73m1r42j980k262k130k319k828l275l662m126m432m331m139
$$ y = [482979, 477847, 473019, 468562, 464949, 462129, 459452, 456751, 454538, 452917, 451482, 450598, 451456, 454259, 457602, 460478, 463856, 469237, 476448, 483932, 490673, 496808, 502665, 508184, 513247, 517819, 521621, 524152, 525216, 525247, 525022, 525032, 525028, 524236, 522168, 519070, 515438, 511422, 507151, 503224, 500251, 498180, 496790, 496555, 498111, 501014, 503989, 506397, 508362, 509396, 508089, 503614, 496608, 488115, 478575, 468319, 458150, 448679, 439727, 430999, 422864, 415942, 410368, 406008, 402912, 401060, 399941, 398843, 397357, 395436, 393360, 391734, 390985, 390602, 389402, 386819, 383449, 380140, 377197, 374715, 372978, 372053, 371564, 371326, 371678, 372772, 374066, 375029, 375857, 376954, 378107, 378704, 378473, 377564, 376141, 374312, 372206, 369811, 366959, 363676, 360284, 357045, 354161, 352165, 351616, 352139, 352468, 351920, 351166, 350993, 350952, 350010, 348030, 345768, 343638, 341319, 338491, 335216, 331554, 327428, 322996, 318665, 314526]
57886C14526m428n226n904n832m991l949l186k507j368P5Q67N83J78P78K073K860
57870B84549K885L050L838M671N023N141N244M966M150L369L050K688J663L19
57856C34606m34l89k82q15j920k970l390l045k254j546j273j449j929k598l374
57841C06938m083m470m296l537k524j753j418j295j173j193j564k171k751l254
57827B71456l786m305m662m813m804m701m647m698m502l573k158j316j756k979
57813B18756m010m516m636m233l096j643o71m14l92r7O33J713K822L513L806M309
57797B11844N293O109O223O254P075Q327Q994R141R818J1145J1877J1161R614
57784C22875Q134O585M283J098k532o096r042j0816j1335j1181j0955j0801j0653
$$ y = [314526, 310098, 304872, 298968, 293136, 288145, 284196, 281010, 278503, 277135, 277210, 278077, 278660, 278838, 279616, 281689, 284549, 287434, 290484, 294322, 298993, 304016, 309157, 314401, 319367, 323517, 326886, 329936, 332624, 334287, 334606, 334172, 333783, 333501, 332686, 330766, 327796, 324406, 321361, 319107, 317561, 316288, 314839, 312910, 310312, 306938, 302855, 298385, 294089, 290552, 288028, 286275, 284857, 283562, 282389, 281196, 279632, 277461, 274710, 271456, 267670, 263365, 258703, 253890, 249086, 244385, 239738, 235040, 230538, 226965, 224807, 223491, 221735, 218756, 214746, 210230, 205594, 201361, 198265, 196622, 195951, 195537, 195145, 195048, 195681, 197394, 200216, 203729, 207535, 211844, 217137, 223246, 229469, 235723, 242798, 251125, 260119, 269260, 279078, 290223, 302100, 313261, 322875, 331009, 337594, 341877, 342975, 340443, 334347, 325305, 314489, 303154, 291973, 281018, 270217, 259564]
57771B59564j0438r927q905p618o560n664m395k749j437q27m36J06M02P3m26m43
57755B00320o1K45M96J054J846K378K424K242K149K216K384K583K842L305M004
57740B30427M561M501L893L342L198L205L073K881K673K225J585J279J528J754
57726B70125J355N84R7Oj2K8L36P09O56J93q3J57N65P26P67J108J826K581L036
57707B84760L198L364L811M574N530O554P484Q037Q036P704P563P892Q582R485
57693C76574J0621J1906J3010J3776J4534J5736J7417J9310K1335K3681K6395
57682E64295K9255L2198L5768M0910M8187N7343O7835P9813R4121J11153J30127
57671A291005J49928J70117J90112K07165K15895K10391J87092J46528R3738L7319
$$ y = [259564, 249126, 239199, 230294, 222676, 216116, 210452, 206057, 203308, 201871, 201044, 200608, 200714, 201116, 201189, 200763, 200320, 200259, 200504, 201000, 202054, 203900, 206278, 208702, 210944, 213093, 215309, 217693, 220276, 223118, 226423, 230427, 234988, 239489, 243382, 246724, 249922, 253127, 256200, 259081, 261754, 263979, 265564, 266843, 268371, 270125, 271480, 272064, 272161, 272167, 272155, 272183, 272519, 273228, 273884, 274077, 273994, 274151, 274716, 275442, 276209, 277317, 279143, 281724, 284760, 287958, 291322, 295133, 299707, 305237, 311791, 319275, 327312, 335348, 343052, 350615, 358507, 367089, 376574, 387195, 399101, 412111, 425887, 440421, 456157, 473574, 492884, 514219, 537900, 564295, 593550, 625748, 661516, 702426, 750613, 807956, 875791, 955604, 1049725, 1160878, 1291005, 1440933, 1611050, 1801162, 2008327, 2224222, 2434613, 2621705, 2768233, 2861971, 2899290]
57661B899290j3446n2439p8669r4836j04483j10430j14529j17532j19019j18333
57651A975574j15678j11937j07563j02266r5893q8976q2145p5424o8459o1204
57641A066029n4118m7751m2312l7602l3183k8646k3824j8923j4538j1272r159
57630G44701p454n279k543Q1K079L689N423P396R375J1199J2866J4473J6417J9387
57616H31810K3719K8803L3574L7648M1640M6392N2084N8194O3959O8808P2517
57605A359148P5185P6891P7231P5173O9606O0130M7351L2295J5618k417k1092
57594A865119l8772n3747o5431p4305q0679q4176q4611q2761p9743p5987p1375
57583A073532o6170o1119n6597n2275m7827m3463l9564l6130l2944l0003k7412
$$ y = [2899290, 2885844, 2833405, 2754736, 2659900, 2555417, 2444987, 2330458, 2212926, 2093907, 1975574, 1859896, 1747959, 1640396, 1538130, 1442237, 1353261, 1271116, 1195692, 1127233, 1066029, 1011911, 964160, 921848, 884246, 851063, 822417, 798593, 779670, 765132, 753860, 744701, 737247, 731968, 729425, 729506, 731585, 735274, 740697, 748093, 757468, 768667, 781533, 796006, 812423, 831810, 855529, 884332, 917906, 955554, 997194, 1043586, 1095670, 1153864, 1217823, 1286631, 1359148, 1434333, 1511224, 1588455, 1663628, 1733234, 1793364, 1840715, 1873010, 1888628, 1886211, 1865119, 1826347, 1772600, 1707169, 1632864, 1552185, 1468009, 1383398, 1300637, 1220894, 1144907, 1073532, 1007362, 946243, 889646, 837371, 789544, 746081, 706517, 670387, 637443, 607440, 580028]
57572E80028k4966k2337j9682j7635j6511j5762j4563j2772j0930r440q198p088
57560D00144o332o058n906n477m929m671m613m259l396k356j552j134j087j195
57546C47179r65oJ411K552L072L304L693M384N387O604P627Q007P979Q394R699
57531D18321J1418J2881J3917J4627J5040J5438J6522J8674K1458K4233K6981
57520F09510L0094L3731L7813M2263M6730N0507N3344N5971N9123O2220O3781
57509A145087O2995O0184N5683M9132M0088K8875J6386L409r690k2711l5163m6033
57497A348242n4206n9347o2079o3079o2400o0095n6950n3785n0370m5958m0856
57486G39117l6353l3007k9934k6300k2543j9543j7258j4969j2384r769p354n201
$$ y = [580028, 555062, 532725, 513043, 495408, 478897, 463135, 448572, 435800, 424870, 415430, 407232, 400144, 393812, 387754, 381848, 376371, 371442, 366771, 362158, 357899, 354503, 352147, 350595, 349461, 348374, 347179, 346214, 346208, 347619, 350171, 353243, 356547, 360240, 364624, 370011, 376615, 384242, 392249, 400228, 408622, 418321, 429739, 442620, 456537, 471164, 486204, 501642, 518164, 536838, 558296, 582529, 609510, 639604, 673335, 711148, 753411, 800141, 850648, 903992, 959963, 1019086, 1081306, 1145087, 1208082, 1268266, 1323949, 1373081, 1413169, 1442044, 1458430, 1461839, 1452149, 1429438, 1394275, 1348242, 1294036, 1234689, 1172610, 1109531, 1047131, 987036, 930086, 876301, 825931, 779973, 739117, 702764, 669757, 639823, 613523, 590980, 571437, 554179, 539210, 526826, 517057, 509703, 504502]
57474E04502l506k347j253L91K488M325N606O903Q889J1432J3746J5304J6455
57461E82935J8157K1070K4920K8810L2170L5288L8760M2692M6648N0267N3573
57450I75290N6594N8874N9475N7455N2413M4714L5124K4143J1768j915j6028k9095
57438A328812m0040m8817n5952o1602o5258o6333o4950o2003n8506n4915n1056
57427F99380m6705m2136l8017l4825l2341k9824k6787k3556k0962j9384j8299
57416C66544j6886j4914j2819j1084r886r283r291r573r451q520p062n720m889
57403B37166m633m814n019m654l563k447k127k469k524j821r69p61j156j537j667
57388A97005j895k485l136l243k475j115J22O12L68o1k20j35%K57P89J422J761
$$ y = [504502, 500996, 498649, 497396, 497787, 500275, 504600, 510206, 517109, 525998, 537430, 551176, 566480, 582935, 601092, 622162, 647082, 675892, 708062, 743350, 782110, 824802, 871450, 921717, 975290, 1031884, 1090758, 1150233, 1207688, 1260101, 1304815, 1339939, 1364082, 1375850, 1373935, 1357907, 1328812, 1288772, 1239955, 1184003, 1122401, 1057143, 990810, 925860, 863857, 805351, 750436, 699380, 652675, 610539, 572522, 537697, 505356, 475532, 448745, 425189, 404227, 384843, 366544, 349658, 334744, 321925, 310841, 300955, 291672, 282381, 272808, 263357, 254837, 247775, 242055, 237166, 232533, 227719, 222700, 218046, 214483, 212036, 209909, 207440, 204916, 203095, 202126, 201365, 200209, 198672, 197005, 195110, 192625, 189489, 186246, 183771, 182656, 182778, 183390, 183758, 183697, 183477, 183342, 183342, 183599, 184388, 185810, 187571]
57371A87571J655J312R68P28O64P97J006J183J421J769J936J638J140J004J256
57356B06048J334R76N98N92P84R00J058J372J525J218P59O52Q93J153J375J691
57340B22928K005K226K665L520M138L631K222J264J655K890L895M188L949L489
57326B64665L114L088L345L473L238K914K799K816K760K699K836L240L916M787
57312C09690N456N357M518L827M121N253O391P035P278P334P245P109P160P517
57298C95291Q065Q625R117R584J0113J0689J1164J1407J1543J1797J2168J2537
57286E22100J3033J3914J4979J5600J5518J5154J4962J4886J4757J4618J4279
57275F83800J3127J0890Q157N591L075K52k530m554n786o740p579q055q238q382
$$ y = [187571, 189226, 190538, 191506, 192234, 192898, 193695, 194701, 195884, 197305, 199074, 201010, 202648, 203788, 204792, 206048, 207382, 208358, 208956, 209548, 210332, 211232, 212290, 213662, 215187, 216405, 217164, 217816, 218709, 219862, 221237, 222928, 224933, 227159, 229824, 233344, 237482, 241113, 243335, 244599, 246254, 249144, 253039, 257227, 261176, 264665, 267779, 270867, 274212, 277685, 280923, 283837, 286636, 289452, 292212, 294911, 297747, 300987, 304903, 309690, 315146, 320503, 325021, 328848, 332969, 338222, 344613, 351648, 358926, 366260, 373505, 380614, 387774, 395291, 403356, 411981, 421098, 430682, 440795, 451484, 462648, 474055, 485598, 497395, 509563, 522100, 535133, 549047, 564026, 579626, 595144, 610298, 625260, 640146, 654903, 669521, 683800, 696927, 707817, 715974, 721565, 724640, 724892, 722362, 717808, 712022, 705282, 697703, 689648, 681410, 673028]
57261F73028q140o865m867l422l176l282k590j033O49K000L089M018M755N334
57247F59498N790O090O369P000Q104R207R724R674R589R873J0507J1270J1935
57234G74630J2313J2382J2341J2396J2549J2708J2899J3204J3554J3834J4146
57223I16956J4777J5836J7030J7875J8147J8073J8058J8238J8391J8313J8073
57212A109767J7846J7702J7763J8298J9297K0132K0160J9586J9258J9597K0233
57201A319639K0749K1211K1758K2257K2712K3557K5024K6600K7591K8005K8473
57190A587576K9426L0811L2448L4167L5696L6886L8028L9441M0741M0987L9789
57179A985996L7860L6217L5113L4046L2550L0632K8592K6716K5212K4205K3686
$$ y = [673028, 664888, 658023, 653156, 649734, 646558, 643276, 640686, 639653, 640302, 642302, 645391, 649409, 654164, 659498, 665288, 671378, 677747, 684747, 692851, 702058, 711782, 721456, 731045, 740918, 751425, 762695, 774630, 786943, 799325, 811666, 824062, 836611, 849319, 862218, 875422, 888976, 902810, 916956, 931733, 947569, 964599, 982474, 1000621, 1018694, 1036752, 1054990, 1073381, 1091694, 1109767, 1127613, 1145315, 1163078, 1181376, 1200673, 1220805, 1240965, 1260551, 1279809, 1299406, 1319639, 1340388, 1361599, 1383357, 1405614, 1428326, 1451883, 1476907, 1503507, 1531098, 1559103, 1587576, 1617002, 1647813, 1680261, 1714428, 1750124, 1787010, 1825038, 1864479, 1905220, 1946207, 1985996, 2023856, 2060073, 2095186, 2129232, 2161782, 2192414, 2221006, 2247722, 2272934, 2297139, 2320825]
57168B320825K3569K3755K4060K4208K4142K4324K5358K7171K8829K9518K9479
57157B605238K9610L0276L1048L1572L2113L2884L3365L2876L1467K9844K8445
57146B948738K7209K6080K5246K4734K4319K3974K4041K4774K6060K7717K9692
57135C232584L1764L3439L4468L5210L6265L7829L9546M0819M1214M0811M0329
57124C644278M0588M1749M3314M4983M7062M9819N2925N5899N8818O2169O6239
57113D207843P1028P6704Q3687R2479J03622J17672J34845J54913J77824K04427
57103E425044K36308K75143L22527L80270M50394N34932O36073P56494Q99035
57094I916220J065947J258301J475539J714628J969380K230815K488246K730275
$$ y = [2320825, 2344394, 2368149, 2392209, 2416417, 2440559, 2464883, 2490241, 2517412, 2546241, 2575759, 2605238, 2634848, 2665124, 2696172, 2727744, 2759857, 2792741, 2826106, 2858982, 2890449, 2920293, 2948738, 2975947, 3002027, 3027273, 3052007, 3076326, 3100300, 3124341, 3149115, 3175175, 3202892, 3232584, 3264348, 3297787, 3332255, 3367465, 3403730, 3441559, 3481105, 3521924, 3563138, 3603949, 3644278, 3684866, 3726615, 3769929, 3814912, 3861974, 3911793, 3964718, 4020617, 4079435, 4141604, 4207843, 4278871, 4355575, 4439262, 4531741, 4635363, 4753035, 4887880, 5042793, 5220617, 5425044, 5661352, 5936495, 6259022, 6639292, 7089686, 7624618, 8260691, 9017185, 9916220, 10982167, 12240468, 13716007, 15430635, 17400015, 19630830, 22119076, 24849351]
57086B4849351K945854L125773L263505L354290L393432L374907L288379L113644
57078E0709135K818589K369819J754736R98823J62395o80984j467055k151094
57070E4514364k707052l123776l401965l550921l585159l522417l382811l187221
57062B8053042k954849k701849k441589k185091j940693j713679j506661j320336
57054A1288295j154207j007413q79259p68821o74070n92051n20266m57519m03204
57045D831485l56338l15766k80797k50865k24832k01366j79967j60837j43739
57036B716978j27699j12137r7432q3911p0882n7424m3772l1416k2241j8266k1736
57025B030062l3829n2508p2305q7269r4405r4407q9758q2755p4925o7199o0019
$$ y = [24849351, 27795205, 30920978, 34184483, 37538773, 40932205, 44307112, 47595491, 50709135, 53527724, 55897543, 57652279, 58651102, 58813497, 58132513, 56665458, 54514364, 51807312, 48683536, 45281571, 41730650, 38145491, 34623074, 31240263, 28053042, 25098193, 22396344, 19954755, 17769664, 15828971, 14115292, 12608631, 11288295, 10134088, 9126675, 8247416, 7478595, 6804525, 6212474, 5692208, 5234689, 4831485, 4475147, 4159381, 3878584, 3627719, 3402887, 3201521, 3021554, 2860717, 2716978, 2589279, 2477142, 2379710, 2295799, 2224917, 2167493, 2123721, 2092305, 2070064, 2051798, 2030062, 1996233, 1943725, 1871420, 1784151, 1689746, 1595339, 1505581, 1422826, 1347901, 1280702, 1220683]
57014A220683n3466m7605m2611l8585l5382l2755l0499k8399k6296k4260k2587
57003H38238k1437k0644j9978j9399j8894j8263j7382j6538j6225j6517j6940
56992F36021j6949j6313j5017j3077j0660q213o216m775l568k254r21j64p00k816
56978E34378o147r995j3663j6539j8077j8062j6859j5080j2999j0524p637m537
56966C84259j423J508L829N248O312Q151J1151J4356J6567J7593J7812J7036J4447
56953E16846R785L877k041p167j1233j4241j6220j7049j6610j5211j3618j2273
56941D04845j0728q355n350k435K31L150O551J0146J3805J7642K1183K3249K3026
56928D96960K0556J5927Q869k47r727j7692k3384k6803k7734k6178k3317k0890
$$ y = [1220683, 1167217, 1119612, 1077001, 1038416, 1003034, 970279, 939780, 911381, 885085, 860825, 838238, 816801, 796157, 776179, 756780, 737886, 719623, 702241, 685703, 669478, 652961, 636021, 619072, 602759, 587742, 574665, 564005, 555792, 549576, 544801, 541233, 538979, 538058, 537894, 537194, 534378, 528231, 518236, 504573, 488034, 469957, 451895, 435036, 419956, 406957, 396433, 388796, 384259, 382836, 384344, 388173, 393421, 399733, 407884, 419035, 433391, 449958, 467551, 485363, 502399, 516846, 526631, 530508, 528467, 521300, 510067, 495826, 479606, 462557, 445947, 430736, 417118, 404845, 394117, 385762, 380412, 377977, 378208, 381358, 387909, 398055, 411860, 429502, 450685, 473934, 496960, 517516, 533443, 542312, 542065, 532338, 514646, 491262, 464459, 436725, 410547, 387230, 366340]
56916C66340j9412j7908j5593j2996j1129j0162r407q285o903n754n086m561l572
56903B35572j993m49L90N91P23J062J473J980K827L939M972N999P551R695J1709
56888B86041J3035J4053J5308J6393J6241J4340J1062O894K119k707o621r050
56876C77108j0280j0847j0757r737p938n846l603r00K299N414P877R931J2505
56863C55226J6366K1437K6803L1224L3762L4084L2101K7367J9206P832m841j5977
56851E84590k3555k7322k8200k7226k5015k1812j7661j2659p121j441M186R837
56839D06601J5666K1869K8745L6364M4109N0789N5326N6983N4817M7484L4142
56828H52895J5664n213k4951m0559n0416n4378n3350m8763m2300l5603k9612k4117
$$ y = [366340, 346928, 329020, 313427, 300431, 289302, 279140, 269733, 261448, 254545, 248791, 243705, 239144, 235572, 233579, 233130, 233520, 234111, 234834, 235896, 237369, 239349, 242176, 246115, 251087, 257086, 264637, 274332, 286041, 299076, 313129, 328437, 344830, 361071, 375411, 386473, 393367, 395486, 392779, 386158, 377108, 366828, 355981, 345224, 335487, 327549, 321703, 318100, 317200, 319499, 324913, 332790, 342721, 355226, 371592, 393029, 419832, 451056, 484818, 518902, 551003, 578370, 597576, 605408, 600567, 584590, 561035, 533713, 505513, 478287, 453272, 431460, 413799, 401140, 394019, 392578, 396764, 406601, 422267, 444136, 472881, 509245, 553354, 604143, 659469, 716452, 771269, 818753, 852895, 868559, 863346, 838395, 797836, 747420, 693042, 639692, 590929, 548629, 513026, 483414, 459297]
56816D59297j8349j2074n751L70O644J3290J9829K5720L1029L5829L9223L9480
56804F34537L5171K5907J2474l215j8428l0648l8645m2537m3087m1175l7652l3111
56792D19591k7813k2083j6603j1914p824l723O05M914R049J3029J6646J9405K0911
56779D14190K0878J8829J4233P148j552j0516j8383k4162k7577k8970k8603k6376
56767C09139k2627j8767j6251j5046j3837j1826r552p867o863o137n536n102m691
56754A65037m043l139k289j880k001k216j948j260r08j279j744j570r97n71p3
56739A39119R31J803J502L88j11K36R6j070j957j517o80q18j604j788j195o41
56723A32694m14k08j30m78p53k10P60R67J69o89j046j381k024k364j792o39L39
$$ y = [459297, 440948, 428874, 423123, 423493, 430137, 443427, 463256, 488976, 520005, 555834, 595057, 634537, 669708, 695615, 708089, 704874, 686446, 655798, 617153, 574616, 531529, 490354, 452702, 419591, 391778, 369695, 353092, 341178, 333354, 329631, 330236, 335150, 344199, 357228, 373874, 393279, 414190, 435068, 453897, 468130, 475278, 473726, 463210, 444827, 420665, 393088, 364118, 335515, 309139, 286512, 267745, 251494, 236448, 222611, 210785, 201233, 193366, 186503, 180366, 174830, 169728, 165037, 160994, 157855, 155566, 153686, 151685, 149469, 147521, 146261, 145353, 144074, 142330, 140760, 139763, 139192, 139119, 140050, 141853, 143355, 143743, 143632, 143868, 143964, 142894, 140937, 139420, 138740, 137922, 136318, 134530, 133335, 132694, 132280, 132072, 131942, 131464, 130711, 130501, 131261, 132228, 132397, 131708, 130662, 129281, 127257, 124893, 123101, 122462, 122801]
56706A22801Q51J029R69P35N13L70R9m66j133j530j476j100p37o12n25m0Q04J269
56688A21821Q04j21n55k34K95N65N75L88L6j70J50P96J090P59K39qK9K37O56J205
56668A28557J538J467J222J149J322J553J580J316J038J159J582J581P84j72n19
56653A45157m98q13j242q72K76J042P50j1n43r35j284j065j25N73O5j196j974
56636A37305j841j350r35n03q6q8p04j599k224k196j494n52k4j29l76j95L67Q32
56618A24208R32P19L33j1p1M2j34o53q21j78N91M32n88j312r98j04N59P53P08
56599A24407O32O22P49R06P82J67p88j604j721q43O20J659J619J010R11J524J909
56582A32561J275O0o63m55K20Q03J205J504J519J029K90K7O98J893K724K822K622
$$ y = [122801, 123652, 124681, 125650, 126385, 126898, 127268, 127367, 126901, 125768, 124238, 122762, 121662, 120925, 120313, 119788, 119748, 120552, 121821, 122625, 122504, 121949, 121715, 122010, 122575, 123150, 123538, 123574, 123404, 123554, 124350, 125440, 126199, 126438, 126430, 126459, 126696, 127352, 128557, 130095, 131562, 132784, 133933, 135255, 136808, 138388, 139704, 140742, 141901, 143483, 145064, 145848, 145676, 145157, 144659, 143846, 142604, 141732, 142008, 143050, 143800, 143789, 143246, 142311, 141027, 139962, 139837, 140410, 140475, 139279, 137305, 135464, 134114, 133179, 132676, 132590, 132502, 131798, 130199, 127975, 125779, 124285, 123733, 123709, 123580, 123204, 123009, 123376, 124208, 125140, 125859, 126192, 126181, 126110, 126152, 126018, 125365, 124544, 124366, 124957, 125389, 124801, 123489, 122491, 122387, 122946, 123699, 124407, 125039, 125661, 126410, 127316, 128098, 128265, 127477, 125873, 124152, 123309, 123929, 125588, 127207, 128217, 129128, 130652, 132561, 133836, 133896, 133233, 132778, 132998, 133801, 135006, 136510, 138029, 139058, 139348, 139375, 140073, 141966, 144690, 147512, 150134]
56565A50134K635K806K853K933L480M456N250N372N013M788N082N687N963N371
56551B11823M011K579J652J160P25L09J64J88j55j089k084k477k351k417l087
56536B08951m030m703n073n464n946o206o093n806n360m333k555p33K32L40L27
56521A53548M98M29q4o13q71j159j597j640r61j81o0m01n76o12r42j360j224o03
56503A41591l11o63j071j032p51m95o7O21J066P98J24k71k26j67l35m36j11M93
56485A38757Q76Q27O61P13Q01N82K78N21J310J829J584J135J196J559J570J250
56469A55449J107J225J362J699K567L567L891L510L179L202L117K687K260K004
56455A90826J654J259J219J382J050K49q9L52O56J75m44n13n67j319k217k234
$$ y = [150134, 152769, 155575, 158428, 161361, 164841, 169297, 174547, 179919, 184932, 189720, 194802, 200489, 206452, 211823, 215834, 218413, 220065, 221225, 221950, 222259, 222423, 222611, 222456, 221367, 219283, 216806, 214455, 212038, 208951, 204921, 200218, 195145, 189681, 183735, 177529, 171436, 165630, 160270, 155937, 153382, 152649, 152881, 153221, 153548, 154046, 154475, 154391, 153778, 152907, 151748, 150151, 148511, 147550, 147369, 147309, 146908, 146332, 145720, 144778, 143418, 142194, 141591, 141280, 140617, 139546, 138514, 137763, 137268, 137201, 137822, 138888, 139686, 139810, 139539, 139313, 139146, 138811, 138375, 138264, 138757, 139633, 140460, 141121, 141834, 142635, 143217, 143495, 144016, 145326, 147155, 148739, 149874, 151070, 152629, 154199, 155449, 156556, 157781, 159143, 160842, 163409, 166976, 170867, 174377, 177556, 180758, 183875, 186562, 188822, 190826, 192480, 193739, 194958, 196340, 197390, 197639, 197550, 197902, 198558, 198733, 198289, 197776, 197209, 195890, 193673, 191439]
56439A91439j534j183j489j848j948k065k204k069j848k061k464k231j387j029
56425A66079j650k252j798q22o26j335j725r91J25M18j55n46r4O98J092J197J575
56408A59190K088J960J034K24L58J152J718J676J289Q58M98L07K93K80K06K78
56392A73409N21M94j26r21j273j192j157j245j076m90K68R76J552J735J264M22
56376A73161j19r0J05P9K0L68J191K072K493K297J823J524J415J142P00O48J265
56359A90094J900J700P62PJ6N29J006J113P50J45q8M53J313J721J689J989K873
56342B07972L603L425K504J559J058J043J307J431J046L62J11O95J705K466K733
56327B33020K611K264J982K150K660K686J633J36m12N51K168L242L532L583L663
$$ y = [191439, 189905, 188722, 187233, 185385, 183437, 181372, 179168, 177099, 175251, 173190, 170726, 168495, 167108, 166079, 164429, 162177, 160379, 159557, 158931, 157596, 155871, 154880, 155005, 155423, 155268, 154722, 154628, 155326, 156418, 157615, 159190, 161278, 163238, 164272, 164496, 164854, 166006, 167724, 169400, 170689, 171547, 172045, 172352, 172645, 172925, 173131, 173409, 173930, 174424, 174298, 173377, 172104, 170912, 169755, 168510, 167434, 166944, 167212, 168188, 169740, 171475, 172739, 173161, 173042, 172952, 173057, 173136, 173156, 173524, 174715, 176787, 179280, 181577, 183400, 184924, 186339, 187481, 188181, 188829, 190094, 191994, 193694, 194456, 194463, 194479, 195008, 196014, 197127, 197877, 198022, 197934, 198387, 199700, 201421, 203110, 205099, 207972, 211575, 215000, 217504, 219063, 220121, 221164, 222471, 223902, 224948, 225310, 225421, 226116, 227821, 230287, 233020, 235631, 237895, 239877, 242027, 244687, 247373, 249006, 249142, 248730, 249281, 251449, 254691, 258223, 261806, 265469]
56312B65469L407K634J981K227L188L828L555K983L060L839M502M475M119M214
56298C13481N007N827N699M446L096K870L780M618M537M023M004M543N003N039
56284C75973M790M413M093M311N383O823P820Q244Q564Q945R237R721J0997J2953
56270D82267J4722J5959J7423J9896K3126K6353K9408L2807L6953M1674M6475
56259G87063N1084N5800O1208O7476P4022Q0202Q6007R1704R6997J01122J03561
56248A656246J04116J02469R8379R2262Q4719P5583O4275N1110L7411K4162J1496
56237B402228l51j0679j9318k6941l3850l9410m3328m6666n0615n5039n9017o2305
56225A954709o5327o8115p0229p1558p2424p2951p2954p2359p1222o9478o7097
$$ y = [265469, 268876, 271510, 273491, 275718, 278906, 282734, 286289, 289272, 292332, 296171, 300673, 305148, 309267, 313481, 318488, 324315, 330014, 334460, 337556, 340426, 344206, 348824, 353361, 357384, 361388, 365931, 370934, 375973, 380763, 385176, 389269, 393580, 398963, 405786, 413606, 421850, 430414, 439359, 448596, 458317, 469314, 482267, 496989, 512948, 530371, 550267, 573393, 599746, 629154, 661961, 698914, 740588, 787063, 838147, 893947, 955155, 1022631, 1096653, 1176855, 1262862, 1354566, 1451563, 1552685, 1656246, 1760362, 1862831, 1961210, 2053472, 2138191, 2213774, 2278049, 2329159, 2366570, 2390732, 2402228, 2401877, 2391198, 2371880, 2344939, 2311089, 2271679, 2228351, 2181685, 2131070, 2076031, 2017014, 1954709, 1889382, 1821267, 1751038, 1679480, 1607056, 1534105, 1461151, 1388792, 1317570, 1248092, 1180995]
56214A180995o4332o1379n7988n3913m9497m5280m1269l7082l2716k8609k5062
56203F83868k2072j9633j7728j6063j4300j2602j1432j0734r810q138o055m394
56191E30907l648l655l982m367m663m567l746k375j214q02q27o64k66N3M95J591
56175D98270L128M134M186L949M037M207M107M119M796N952P031P846Q453Q751
56161E72966Q848R417J0940J2858J4211J4896J5675J7066J8937K1107K3777K7238
56149G67936L1610L6860M2808M9294N6593O5462P6204Q7779R8264J06064J10310
56138A529184J10356J05618R6216Q3439O9504N6875M7467M1850L8853L6144L1571
56127B247077K4218J4533L778o652j5583k2216k6545k9837l4355m1967n2941o6138
$$ y = [1180995, 1116663, 1055284, 997296, 943383, 893886, 848606, 807337, 770255, 737539, 708930, 683868, 661796, 642163, 624435, 608372, 594072, 581470, 570038, 559304, 549494, 541356, 535301, 530907, 527259, 523604, 519622, 515255, 510592, 506025, 502279, 499904, 498690, 497888, 497061, 496397, 496131, 496184, 496679, 498270, 501398, 505532, 509718, 513667, 517704, 521911, 526018, 530137, 534933, 540885, 547916, 555762, 564215, 572966, 581814, 591231, 602171, 615029, 629240, 644136, 659811, 676877, 695814, 716921, 740698, 767936, 799546, 836406, 879214, 928508, 985101, 1050563, 1126767, 1214546, 1312810, 1418874, 1529184, 1639540, 1745158, 1841374, 1924813, 1994317, 2051192, 2098659, 2140509, 2179362, 2215506, 2247077, 2271295, 2285828, 2289606, 2282954, 2267371, 2245155, 2218610, 2188773, 2154418, 2112451, 2059510, 1993372]
56115A993372p9934r2410j01288j04806j02923r7015q8372p7780o6379n5698m6484
56104A080283l8415l1291k5530k1046j6794j2184q036n314l682k106k72J434K860
56091I19907M205N588P126R061J1215J2826J3408J3403J3393J3306J2835J2076
56079A048349J1183R976Q472P203O398N526M213L030K716L227M132N277O532P558
56065A133792Q436R738J1396J2382J2196J1794J2224J3295J4432J5808J7590J9002
56053A292085J9319J9068J9223J9819K0503K1538K3202K4854K5805K6506K7733
56042A539655K9212L0120L0391L0543L0737L0987L1480L1935L1568L0643L0865
56031A878136L3062L5746L7316L8432M0619M3693M6372M8486N0788N3336N5754
$$ y = [1993372, 1913438, 1821028, 1719740, 1614934, 1512011, 1414996, 1326624, 1248844, 1182465, 1126767, 1080283, 1041868, 1010577, 985047, 964001, 947207, 935023, 926987, 921673, 917991, 915885, 915613, 917047, 919907, 924112, 929700, 936826, 945887, 957102, 969928, 983336, 996739, 1010132, 1023438, 1036273, 1048349, 1059532, 1069508, 1077980, 1085183, 1091581, 1097107, 1101320, 1104350, 1107066, 1110293, 1114425, 1119702, 1126234, 1133792, 1142228, 1151966, 1163362, 1175744, 1187940, 1199734, 1211958, 1225253, 1239685, 1255493, 1273083, 1292085, 1311404, 1330472, 1349695, 1369514, 1390017, 1411555, 1434757, 1459611, 1485416, 1511922, 1539655, 1568867, 1598987, 1629378, 1659921, 1690658, 1721645, 1753125, 1785060, 1816628, 1847271, 1878136, 1911198, 1946944, 1984260, 2022692, 2063311, 2107004, 2153376, 2201862, 2252650, 2305986, 2361740]
56020B361740N8301O1094O3240O4408O6142O9738P4006P7182P9863Q3684Q8182
56009C147580R1691R4510R8470J03765J08971J13919J19874J26942J33740J39700
55999D279162J45506J51378J57099J63504J71726J81246J90762K00591K12082
55990E853056K25267K39289K54463K71561K89916L08719L29271L53308L80173
55981H505023M08533M39618M75538N15598N57941O03754O56140P15906P82328
55972A3660379Q56958R42534J039385J147403J270438J414191J581247J773406
55964B3685941J997431K263248K578696K952925L403719L955454M633057N467043
55956E0937514O502902P796318R400047J1361533J3722760J6500999J9665150
$$ y = [2361740, 2420041, 2481135, 2544375, 2608783, 2674925, 2744663, 2818669, 2895851, 2975714, 3059398, 3147580, 3239271, 3333781, 3432251, 3536016, 3644987, 3758906, 3878780, 4005722, 4139462, 4279162, 4424668, 4576046, 4733145, 4896649, 5068375, 5249621, 5440383, 5640974, 5853056, 6078323, 6317612, 6572075, 6843636, 7133552, 7442271, 7771542, 8124850, 8505023, 8913556, 9353174, 9828712, 10344310, 10902251, 11506005, 12162145, 12878051, 13660379, 14517337, 15459871, 16499256, 17646659, 18917097, 20331288, 21912535, 23685941, 25683372, 27946620, 30525316, 33478241, 36881960, 40837414, 45470471, 50937514, 57440416, 65236734, 74636781, 85998314, 99721074, 116222073, 135887223]
55949A35887223K3134226K6762220L0242224L2964970L3995300L2291885K7109286
55942C42387334J8392287O985167n462425j6939090k5739220l1018765l2912783
55935B55692505l2203309k9845091k6654469k3217224j9902258j6899951j4277450
55928I2692753j2038646j0158541q592880p289572o204634n304353m556197l928457
55920C4619473l398525k952651k577279k257704j984301j752335j555283j384562
55912A6756833j235545j107652r98277r02172q16656p42050o76794o17194n62264
55903I098229n14111m73039m36470m02944l73176l46815l21982k98413k77578
55894E653701k59408k42095k25256k10103j96437j82588j68474j55808j45137
$$ y = [135887223, 159021449, 185783669, 216025893, 248990863, 282986163, 315278048, 342387334, 360779621, 367764788, 362302363, 345363273, 319624053, 288605288, 255692505, 223489196, 193644105, 166989636, 143772412, 123870154, 106970203, 92692753, 80654107, 70495566, 61902686, 54613114, 48408480, 43104127, 38547930, 34619473, 31220948, 28268297, 25691018, 23433314, 21449013, 19696678, 18141395, 16756833, 15521288, 14413636, 13415359, 12513187, 11696531, 10954481, 10277687, 9660493, 9098229, 8584118, 8111079, 7674609, 7271665, 6898489, 6551674, 6229692, 5931279, 5653701, 5394293, 5152198, 4926942, 4716839, 4520402, 4337814, 4169340, 4013532, 3868395]
55885C868395j35568j27276j21559j18173j15250j11830j08126j03649r7703r1560
55875B737701q7395q5235q3330q1120p9167p6696p2265o6682o2249n9108n5356
55864A929098n0831m7608m6288m4921m2406m0221l9754m0273m0534m0355l9776
55853A456131l8505l6890l5728l4710l2774l0222k8620k8319k8040k7215k6634
55842A108474k6488k5821k4430k3328k2762k1665j9707j8051j7435j7159j6520
55831H75108j5677j4681j3253j1805j1100j0643r203p085n991o341o764o628o859
55818G49078p769q285q198q965j1146j3087j3361j2840j2988j3605j3645j2970
55806F12219j2038j0874r485q396p847p300o420n582m843l584j761l60P8K59R16
$$ y = [3868395, 3732827, 3605551, 3483992, 3365819, 3250569, 3138739, 3030613, 2926964, 2829261, 2737701, 2650306, 2565071, 2481741, 2400621, 2321454, 2244758, 2172493, 2105811, 2043562, 1984454, 1929098, 1878267, 1830659, 1784371, 1739450, 1697044, 1656823, 1617069, 1576796, 1536262, 1495907, 1456131, 1417626, 1380736, 1345008, 1310298, 1277524, 1247302, 1218682, 1190363, 1162323, 1135108, 1108474, 1081986, 1056165, 1031735, 1008407, 985645, 963980, 944273, 926222, 908787, 891628, 875108, 859431, 844750, 831497, 819692, 808592, 797949, 788746, 781661, 775670, 769329, 762565, 755937, 749078, 741309, 733024, 724826, 715861, 704715, 691628, 678267, 665427, 652439, 638834, 625189, 612219, 600181, 589307, 579822, 571426, 563579, 556279, 549859, 544277, 539434, 535850, 534089, 533729, 533807, 534066, 534982]
55791E34982K043L819O854J0685J3422J3787J2266R446M740k085r340j4734j7537
55778E68348j8328j7587j5637j3282j1209r274p156n361m705n291o604q163r551
55765D36200j0303j0343j0034r534q681p676p096o894o366n457n091n724o592
55752C36409o975p228p915q762r118q802p925o608n275m548m481m543m553m730
55738B44946m881m536m007m031m255l580k228j741k451k760j767q84j677l582
55724B02566n001n331m767l407j837j390k474l620l443k460j832j495r06m93p59
55709A63351r84m10J97j84q64n41L65L64o00j265j421k136l606m591m340l586
55693A39749l147k849k298j677j292j159j232j419j232k52J052J748J764J977
$$ y = [534982, 537025, 540844, 547698, 558383, 571805, 585592, 597858, 607304, 612044, 609959, 600619, 585885, 568348, 550020, 532433, 516796, 503514, 492305, 483031, 475875, 470514, 465809, 460518, 453914, 445751, 436200, 425897, 415554, 405520, 395986, 387305, 379629, 372533, 365639, 359273, 353816, 348725, 343001, 336409, 329434, 322206, 314291, 305529, 296411, 287609, 279684, 273076, 267801, 263253, 258772, 254229, 249676, 244946, 240065, 235529, 231522, 227491, 223236, 219656, 217428, 215687, 213236, 210476, 208709, 207825, 206148, 202566, 197565, 192234, 187467, 184060, 182223, 180833, 178359, 174739, 171296, 168836, 167004, 165509, 164603, 164110, 163351, 162367, 161957, 162154, 161970, 161106, 160565, 160930, 161294, 160694, 159429, 158008, 155872, 152266, 147675, 143335, 139749, 136602, 133753, 131455, 129778, 128486, 127327, 126095, 124676, 123444, 123192, 124244, 125992, 127756, 129733]
55679A29733K881L904M253L825L051K298J591O98n36j767k357k152j642j183o45
55664A41952j18j64q47j269p63J26N65N74N39L54p9j74N42J587K342K974L719
55647A51860M083L832L803M609N365N096M457M498M586L424J491M25L55j12j283
55632A96489j916j545j286j880k702l173l583l911l449k248j493j794k436k813
55618A62260l267l925m139l815l923m847n521n105m258l884l702l114k402k043
55604A08315j800j523j876l140m182l786k434j532j522j834k258l017l803l936
55590G1672l390k740k200j576j020r30j142j038m96j6M3k44p52j323j523j045
55574E2280l23r5l86n95n37o82j246j699j487p57j22m7o00j471k083j988j322
$$ y = [129733, 132614, 136518, 140771, 144596, 147647, 149945, 151536, 152234, 151698, 149931, 147574, 145422, 143780, 142597, 141952, 141834, 141670, 140823, 139554, 138791, 138917, 139482, 140056, 140595, 140949, 140870, 140696, 141238, 142825, 145167, 148141, 151860, 155943, 159775, 163578, 168187, 173552, 178648, 183105, 187603, 192189, 195613, 197104, 197529, 197884, 197772, 196489, 194573, 193028, 191742, 189862, 187160, 183987, 180404, 176493, 173044, 170796, 169303, 167509, 165073, 162260, 158993, 155068, 150929, 147114, 143191, 138344, 132823, 127718, 123460, 119576, 115874, 112760, 110358, 108315, 106515, 104992, 103116, 99976, 95794, 92008, 89574, 88042, 86520, 84686, 82428, 79411, 75608, 71672, 68282, 65542, 63342, 61766, 60746, 59816, 58674, 57636, 57140, 57124, 57167, 56923, 56171, 54848, 53325, 52280, 51957, 51862, 51476, 50881, 50344, 49662, 48416, 46717, 45230, 44473, 44351, 44304, 43704, 42233, 40150, 38162, 36840]
55557C6840o14j98l1j06n07r43p37L25J447J593P39p5m4M84O47K75j4J06J21m34
55537C8874j037p22N64J759J921J247N93M04M17K54l4q8K37N76M41r1l37J57J056
55518D6191J753K180K605K862K519J745J313J583K094K366K488K651K653K352
55504G7355K015J873J687J244Q32Q04R29P89M66K87P9p54k312l840m477m098l341
55487F9538k948l130l477l508l222l010l055l141l090k978k737k044r70k82o02
55472C1344j487j893j454p60m73o27q90r74p06m5O93R75O31P7k45m44q79j446
55454B1397j508p10M17R13M03n35j088j004o00j89J34K60M2l72n46k88J5j34o82
55435A5925j084r45l70L00Q85J372J671J541Q82j2n91n48r8K48J37l80q96q97
$$ y = [36840, 36226, 36028, 35997, 35891, 35384, 34441, 33704, 34029, 35476, 37069, 37808, 37733, 37689, 38173, 38820, 39095, 39081, 39187, 39308, 38874, 37837, 37115, 37679, 39438, 41359, 42606, 43199, 43603, 44020, 44274, 44240, 44152, 44389, 44965, 45406, 45315, 44978, 45135, 46191, 47944, 50124, 52729, 55591, 58110, 59855, 61168, 62751, 64845, 67211, 69699, 72350, 75003, 77355, 79370, 81243, 82930, 84174, 85006, 85810, 86739, 87528, 87994, 88281, 88360, 87606, 85294, 81454, 76977, 72879, 69538, 66590, 63460, 59983, 56475, 53253, 50243, 47188, 44047, 40957, 37979, 35242, 33198, 32228, 31946, 31344, 29857, 27964, 26510, 25750, 25277, 24650, 23760, 22786, 22080, 22035, 22728, 23703, 24334, 24411, 24166, 23722, 22843, 21397, 19889, 19179, 19596, 20509, 20912, 20377, 19289, 18285, 17685, 17496, 17630, 17890, 17932, 17560, 17014, 16726, 16741, 16607, 15925, 14841, 13896, 13526, 13826, 14711, 16083, 17754, 19295, 20177, 20165, 19574, 19026, 18928, 19176, 19313, 18933, 18037, 17140]
55417A7140j69Q80J551J621J552J695J666R20l39j342j772j929j975j631q42r1
55401A6935K40L62N33N11Mp00j023q54n71m13k62n4K6j67m26l64J18O01N20j75
55381A4841q19p57j77J34j28l50M7P11Q12J63o12r13p97o51o56o98o36m73l17
55362H724k88m17n74n38k24J38J86j37m26k78J68L55K5n13q71r49p00LR05J274
55342E863Q11K93O05J384J438M49n62o63r4L37L16N0k21l07r3K52L43J07j20k00
55322I988l93p54q67n33k15l53o89p32m51j24J57L56K68j03k62J13O09O11J51
55303F777l04o08r07j123j037o90k55L25J017J302P78n2k97J79P48J082J394J659
55285I988J449P24P0j32j49k39j83J70M71M50M41Q60J440J493P94k25j042j480
$$ y = [17140, 16971, 17851, 19402, 21023, 22575, 24270, 25936, 26856, 26517, 25175, 23403, 21474, 19499, 17868, 17026, 16935, 17175, 17537, 18070, 18581, 18585, 17885, 16862, 16008, 15437, 15024, 14762, 14708, 14734, 14567, 14141, 13777, 13895, 14496, 15016, 14841, 14022, 13265, 13088, 13222, 13094, 12744, 12791, 13502, 14314, 14477, 13865, 12952, 12155, 11504, 10848, 10150, 9514, 9041, 8724, 8436, 8019, 7445, 6907, 6683, 6821, 7007, 6870, 6444, 6166, 6334, 6689, 6714, 6201, 5330, 4381, 3681, 3684, 4589, 5863, 6674, 6967, 7572, 8956, 10394, 10843, 10281, 9618, 9524, 9861, 10177, 10227, 10006, 9699, 9606, 9858, 10201, 10308, 10188, 9988, 9595, 8841, 7974, 7441, 7226, 6873, 6184, 5452, 5001, 4877, 5034, 5390, 5658, 5555, 5293, 5406, 6015, 6626, 6777, 6473, 5865, 4958, 3835, 2798, 2108, 1853, 2178, 3195, 4497, 5275, 5223, 4926, 5105, 5853, 6935, 8329, 9988, 11437, 12161, 12231, 12099, 11950, 11711, 11528, 11698, 12169, 12619, 13060, 13920, 15360, 16853, 17647, 17422, 16380, 14900]
55267A4900j629j546j154l48O74J329J109K02o83j077j071q60m47k0m4o22j135
55250G578j007n26l96o84p63k46N38J076J177R00L73j62m23m52n51p87q43n91
55232D211l79n04o84m62P7M77O19P63R21P53K66M8M96J189J444J175Q29O46M22
55213A2307j9n36q54q51o34m74n48o09j90O56J111N74l84o64j11L89K96J43N07
55194A0109R76P58p0n92k60M72Q01M99N5LL14M76J52m17p59p18m27N2O44R87P63
55173A3818L13L07O97O71j91j287j881j981j889j459m53P56J489J584J358R30
55157A2782K00n94q94m68K97Q62J022Q94O75M11k5o59j120r81m62k80n74n42L54
55138A0898J412J520O24m19j039j295j167n04L70P21L04l11n23k62K25O52O80
$$ y = [14900, 13271, 11725, 10571, 10223, 10897, 12226, 13335, 13537, 12854, 11777, 10706, 9846, 9399, 9379, 9335, 8713, 7578, 6571, 6045, 5649, 4965, 4202, 3956, 4494, 5570, 6747, 7647, 8020, 7858, 7435, 6983, 6432, 5645, 4802, 4211, 3832, 3328, 2644, 2182, 2259, 2736, 3355, 4118, 5039, 5792, 6058, 6106, 6602, 7791, 9235, 10410, 11239, 11885, 12307, 12288, 11752, 10898, 10047, 9413, 8939, 8391, 7782, 7592, 8248, 9359, 9933, 9549, 8885, 8774, 9163, 9459, 9602, 10109, 11085, 11843, 11773, 11181, 10921, 11393, 12194, 12693, 12748, 12751, 13065, 13541, 13693, 13276, 12517, 11799, 11372, 11424, 12068, 13055, 13818, 14131, 14438, 15135, 15806, 15615, 14328, 12447, 10466, 8577, 7118, 6665, 7421, 8910, 10494, 11852, 12782, 12982, 12388, 11494, 11026, 11323, 12185, 13207, 14101, 14776, 15187, 15162, 14503, 13383, 12402, 11940, 11660, 11086, 10544, 10898, 12310, 13830, 14454, 14035, 12996, 11701, 10534, 10030, 10400, 11121, 11425, 11114, 10591, 10329, 10554, 11206, 11886]
55121A1886J77m36n30p0M06N93O34O08L76N0j4J41Q8k02k46Q9L27K93M92J137
55101A5799J498R15r2n18k70n2r6J40Q69J387R65j26r14q27j67M30O50N51K51
55082B0393j04k44L5M61M84M9k13R6M26N0p66j081o85l36n05o81l21K75N17N08
55062A8358P56J262J475J092M18p8k41k51l35m99n27l59l17p09j193j052j61P51
55044A8390J001O24J7n62q06l62N68J099P38J25N5L24K56j6K26R32J125L17p63
55025B3288j167q28l22o4n7q4J32O42R95O90Mj24O40J431J306N32J52M91Q08M32
55005B8897l49p42l90L71R94J158Q52K69l05o23n94l56k37m84r34j020k77J039
54987B7269K001J839P19m23q11m94r6o8k89l37O2P98J497J753J346M12n97j151
$$ y = [11886, 12063, 11627, 11097, 11027, 11433, 12026, 12660, 13268, 13644, 13694, 13680, 13821, 13909, 13707, 13461, 13550, 13877, 14170, 14662, 15799, 17297, 18212, 18120, 17602, 17332, 17280, 17184, 17324, 18193, 19580, 20545, 20419, 19505, 18678, 18511, 18941, 19591, 20142, 20393, 20289, 20045, 20080, 20541, 21025, 21074, 20861, 20957, 21383, 21433, 20667, 19586, 18901, 18565, 18060, 17379, 17058, 17333, 17850, 18358, 19114, 20376, 21851, 22943, 23361, 23283, 23042, 22791, 22456, 21957, 21430, 21071, 20754, 20045, 18852, 17800, 17639, 18390, 19391, 20015, 20032, 19470, 18664, 18302, 18870, 19969, 20707, 20832, 20887, 21211, 21467, 21451, 21677, 22609, 23734, 24051, 23288, 22121, 21293, 20971, 20907, 20850, 20766, 20898, 21540, 22535, 23225, 23229, 23105, 23745, 25176, 26482, 27014, 27166, 27657, 28465, 28897, 28548, 27806, 27416, 27787, 28781, 29939, 30791, 31060, 30755, 30132, 29538, 29182, 28945, 28461, 27527, 26507, 26230, 27269, 29270, 31109, 31828, 31405, 30594, 30100, 30004, 29936, 29647, 29310, 29372, 30170, 31667, 33420, 34766, 35178, 34581, 33430]
54969C3430r96l81J02M8l39m83j36L15M13K29J30J15j19m31j46J007K288K732
54951C7778K342J985K287L020L649M012M327M880N876P353R046J0522J1617J2561
54937A21255J3422J3688J2780J0757Q096M858O18m479r189j2063j2809j2293j1458
54924A23183j0664r977r456q947q073o741n386m406l653k801j908j272r05n59
54910D8435k06l6j0J66N99J120J706K573L718M747N387N903O809Q259R953J1461
54894A10584J2461J2763J2292J1031Q963O118K654j264n518r715j2913j4119j3324
54881A20013j1678j0374r561q636p338o123n468n231m912m294l591l017k454j738
54867C5598j085r51j344j605j157k80J78j71q81j281j127n80J00O83J022J128
$$ y = [33430, 32434, 32053, 32155, 32203, 31864, 31381, 31245, 31560, 31973, 32202, 32332, 32447, 32328, 31897, 31751, 32758, 35046, 37778, 40120, 42105, 44392, 47412, 51061, 55073, 59400, 64280, 70156, 77509, 86555, 97077, 108694, 121255, 134677, 148365, 161145, 171902, 179998, 184856, 185474, 180995, 171806, 159743, 146934, 134641, 123183, 112519, 102542, 93086, 84139, 76066, 69325, 63939, 59533, 55880, 53079, 51171, 49899, 48994, 48435, 48229, 48193, 48183, 48349, 48948, 50068, 51774, 54347, 58065, 62812, 68199, 74102, 80911, 89170, 99123, 110584, 123045, 135808, 148100, 159131, 168094, 174212, 176866, 175602, 170084, 160369, 147456, 133337, 120013, 108335, 97961, 88400, 79764, 72426, 66303, 60835, 55604, 50692, 46398, 42807, 39790, 37336, 35598, 34513, 33562, 32218, 30613, 29456, 29176, 29354, 29183, 28302, 27021, 25894, 25314, 25414, 26097, 27119, 28247]
54851B8247J047O63p8q23j051p70n61p66j082j138j073j134j155q55m30l13n22
54834A8206o88o71o79p91p57l64K80R90J652K142K243J887J335R82R71J023O84
54817B8445j18q61r09k65L17J73n38j073r70l91K79Q84J438J831J846J527J363
54800C2978J816K638K957K321J405J268K068L015L558L979M664N457O120O937
54786H1181Q364J0306J2144J3218J3100J1741R678P635N602K718j400n708q701
54773A59878r995j0293j0130r498q540p733p196o524n533m584l999l688l498l403
54759F5264l124k155n41Q22J128O24K30M61J088J739K369L078L815M473N179O309
54743I0759Q025R891J1153J1495J1271J0854J0031Q334N734K657n46l695o528
$$ y = [28247, 29294, 29957, 29879, 29056, 28005, 27235, 26674, 25908, 24826, 23688, 22615, 21481, 20326, 19471, 19041, 18728, 18206, 17518, 16847, 16168, 15377, 14620, 14256, 14536, 15526, 17178, 19320, 21563, 23450, 24785, 25767, 26738, 27761, 28445, 28327, 27466, 26557, 26292, 26609, 26782, 26244, 25171, 24201, 23810, 24089, 24973, 26411, 28242, 30088, 31615, 32978, 34794, 37432, 40389, 42710, 44115, 45383, 47451, 50466, 54024, 58003, 62667, 68124, 74244, 81181, 89545, 99851, 111995, 125213, 138313, 150054, 159732, 167367, 172969, 175687, 174287, 168579, 159878, 149883, 139590, 129460, 119962, 111422, 103689, 96493, 89969, 84436, 79852, 75853, 72165, 68667, 65264, 62140, 59985, 59444, 60266, 61394, 62018, 62248, 62709, 63797, 65536, 67905, 70983, 74798, 79271, 84450, 90759, 98784, 108675, 119828, 131323, 142594, 153448, 163479, 171813, 177547, 180204, 179658, 175963, 169435]
54730A69435q743j0338j1457j1959j1576j0485r269q228p172o051n257n046n027
54717E8827m554l507k403j824j868k069j880j285q00p63q07m32J41K03m01j010
54701C5568r95l97L81J005J238R83N17K70K32j2n55r67r61p73o39m05N2M51N10
54682C5503L80L54M83O68Q20P33K77j54J06J010J682J630J413J642J962J712J051
54665E1272O41N38K63k44n67o00o80q62p77l34L7n5n48j183j754k068k001j661
54647C9417j208n86K24Q68R51O24L67L07K14L7m0J0J34N83J527K420K422J639
54629D9910J185J731K712L237L209L086L029K830K318J541P26L22O54J335J421
54614G9246M45j000k060k545k763k854k778k644k539k228j519p77o17j164j968
$$ y = [169435, 160692, 150354, 138897, 126938, 115362, 104877, 95608, 87380, 80208, 74157, 68900, 63854, 58827, 54273, 50766, 48363, 46539, 44671, 42602, 40722, 39437, 38637, 37874, 37067, 36635, 36776, 36979, 36578, 35568, 34573, 34176, 34557, 35562, 36800, 37783, 38300, 38570, 38802, 38790, 38235, 37268, 36307, 35534, 34895, 34490, 34542, 34993, 35503, 35883, 36237, 36720, 37388, 38208, 38941, 39218, 39064, 39170, 40180, 41862, 43492, 44905, 46547, 48509, 50221, 51272, 51913, 52451, 52714, 52470, 51903, 51303, 50623, 49761, 48984, 48650, 48687, 48632, 48084, 46901, 45147, 43079, 41078, 39417, 38209, 37623, 37847, 38715, 39666, 40290, 40657, 40964, 41178, 41215, 41175, 41185, 41319, 41902, 43429, 45849, 48271, 49910, 51095, 52826, 55538, 58775, 61984, 65070, 68099, 70929, 73247, 74788, 75514, 75836, 76490, 77825, 79246, 79691, 78691, 76631, 74086, 71323, 68469, 65691, 63047, 60508, 58280, 56761, 55984, 55367, 54203, 52235]
54599E2235k463k306j443l56N3o65j830k312j815r81l32K24P14O84j46j199j561
54582C6501j009j85K04O1k47m11m75o30q88j072j093j060j023q02k94J83J89j97
54564B7752m38k91p7j26k59j24K11L76L04L59P70J190J051K72n62q37n96m13n78
54545B7984p07l17M32Q99P75L20j32n10p18n02J49Q09J121J192J195R41K80l66
54527C2845m04N4L14J21l8K24O24P52P25Q54J028R23O49O23Q73R47O20K91M41
54508D2466R72J338J178O24N2k23j28J12J01l74j045j361j127q01j000j727k301
54491C6756k137j383o87m16m15l75j69K62R69J709J910J284L49l2L63Q93R12M70
54473D0263M1j34j88l00n08p52r26q56m43J30M93M67K77K74M97O34M33Q1J2L39
$$ y = [52235, 49772, 47466, 46023, 45667, 45720, 45055, 43225, 40913, 39098, 38117, 37785, 38009, 38723, 39407, 39261, 38062, 36501, 35492, 35307, 35511, 35572, 35325, 34914, 34439, 33809, 32921, 31849, 30756, 29696, 28673, 27871, 27577, 27760, 27949, 27752, 27314, 27023, 26946, 26820, 26561, 26437, 26648, 27024, 27328, 27687, 28457, 29647, 30698, 30970, 30408, 29571, 28975, 28562, 27984, 27277, 26960, 27392, 28291, 29066, 29386, 29254, 28744, 28026, 27524, 27673, 28482, 29603, 30795, 31990, 32931, 33211, 32845, 32441, 32495, 32809, 32930, 32892, 33116, 33740, 34492, 35217, 36071, 37099, 38022, 38671, 39294, 40167, 41114, 41734, 42025, 42466, 43438, 44776, 45954, 46578, 46630, 46407, 46279, 46391, 46492, 46118, 45073, 43712, 42585, 41784, 40784, 39057, 36756, 34619, 33236, 32549, 32133, 31718, 31343, 31174, 31436, 32405, 34114, 36024, 37308, 37657, 37625, 37988, 38881, 39793, 40263, 40304, 40170, 39982, 39682, 39174, 38422, 37496, 36640, 36197, 36327, 36820, 37287, 37564, 37838, 38335, 38969, 39402, 39483, 39495, 39834]
54453C9834O68O33M10L79M48J08p39j506j649j349j065p84k16M69O66K09l39l98
54435C5779q7J27J15J16K35K50k5m25o32n56m40n10o11m21L1L37M06P43J641K356
54415C8429J898N73j16N58J532J449M84j34J23Q16J667K816L859L825K576J350
54399F1705J267J994K443K234J744J224O50K23K07L45R8n34r97j014r11j055j451
54382F8172j925k228j981j083j87j67r69j587j411r46q71j017q33l37l4p8j74
54365E2344j32q0j31k49l70l53J1O18Q46J99r19j471q22P30K340L199K888J652
54347F0300L76j38J34O63J147J636J997J901J382Q79N53O8p63j600k082k231k116
54330F2106j646j026q75j419j938j688j010q28j240j380p40J17L44j87j002j657
$$ y = [39834, 40502, 41135, 41545, 41924, 42372, 42480, 41741, 40235, 38586, 37237, 36172, 35388, 35172, 35641, 36307, 36516, 36177, 35779, 35692, 35819, 35934, 36050, 36285, 36535, 36510, 36085, 35453, 34897, 34457, 33947, 33336, 32915, 32946, 33283, 33689, 34432, 36073, 38429, 40327, 40900, 40784, 41342, 42874, 44323, 44807, 44673, 44796, 45612, 47279, 50095, 53954, 57779, 60355, 61705, 62972, 64966, 67409, 69643, 71387, 72611, 73261, 73484, 73691, 74036, 74134, 73600, 72603, 71589, 70678, 69623, 68172, 66247, 64019, 62038, 60955, 60768, 60601, 59632, 58045, 56634, 55688, 54817, 53800, 52967, 52630, 52596, 52518, 52344, 52212, 52132, 52001, 51752, 51382, 51029, 51040, 51658, 52504, 52703, 51784, 50313, 49491, 50221, 52561, 55760, 58648, 60300, 60676, 60538, 60672, 61335, 62482, 64118, 66115, 68016, 69398, 70277, 70830, 70898, 70135, 68535, 66453, 64222, 62106, 60460, 59434, 58559, 57140, 55202, 53514, 52504, 51676, 50436, 49056, 48316, 48433, 48777, 48590, 47588, 45931]
54314D5931j889j528p13m5o7n94q93n73j3K46J61Q9J73J15l56j033j416j259q20
54295C5516n43o05q65j096j150r04k42O58J163O29p63j840j479J86J879K592K509
54278C5645K391K459K276J542M69o09j535k124k039j183oP64P31J43l27j56N11
54261C8952R97Q74M92L89M92L16n7J9O98J184Q17J7l67k33j48l82o67q36j030
54242D1527j190r41j88N97R08P41L70l7m05n60l69O7N24Q85J130J201J048P15
54224D6023K59l08q79j089o23L02R16O43k20p94o55l22m82j057j359j087o81n75
54206C8012o34n64m93p22j114j158n68M41J412J904J648P78j49o61q58j139j520
54189C4615j561j009k18K20J05k31l22j02J2l32q53r24m47k9o2j20K90Q94J124
$$ y = [45931, 44042, 42514, 41801, 41756, 41689, 41095, 40202, 39629, 39616, 39862, 40023, 40112, 40285, 40400, 40044, 39011, 37595, 36336, 35516, 34973, 34368, 33503, 32407, 31257, 30353, 30111, 30769, 31932, 32561, 31798, 29958, 28479, 28665, 30544, 33136, 35645, 38036, 40495, 42771, 44313, 44782, 44173, 42638, 40514, 38475, 37292, 37286, 38050, 38781, 38924, 38597, 38441, 38952, 39949, 40823, 41315, 41704, 42196, 42512, 42455, 42474, 43172, 44356, 45173, 45190, 44823, 44590, 44442, 44060, 43393, 42557, 41527, 40337, 39396, 39208, 39805, 40713, 41454, 41824, 41787, 41382, 40822, 40453, 40520, 41044, 41929, 43059, 44260, 45308, 46023, 46282, 45974, 45095, 44006, 43383, 43685, 44601, 45244, 45024, 44230, 43575, 43253, 42771, 41714, 40355, 39268, 38587, 38012, 37378, 36814, 36321, 35599, 34485, 33327, 32759, 33200, 34612, 36516, 38164, 38942, 38793, 38132, 37274, 36135, 34615, 33054, 32045, 31827, 32047, 32152, 31921, 31599, 31497, 31509, 31177, 30324, 29400, 28953, 28924, 28862, 28742, 29032, 29926, 31050]
54170C1050J097J314J620J352M68k61l85k78k94k28N6J48j89m93k58K82N26K65
54152C5792l46j128j665j333j21R14P77j42n56L6R06J199Q11J44m02n50l23j64
54134C3849m48q58p36q9L45K02PL07Q74J179J195J189J033L44p04j327r74L3Q66
54115C6287J072Q72O87N70K76k33n99o02n11o77r18p44j13M39N35L81L12K80J17
54096C7431k0J91P58J300J432J095N29J39K05O45J074J179R98Q27R65J514K280
54079E2542K795K700K119J502J055O20J24j99j08L56J113K093K934L019K207J166
54063G6038O04N05M39L03K74L14L42O15J291J831J554P27L07N57P12L04m2L97
54045H7072J399K325L132M115N133N811O300P004P723P809P246O769O750O608
$$ y = [31050, 32147, 33461, 35081, 36433, 36901, 36640, 36255, 35977, 35683, 35455, 35511, 35659, 35470, 34977, 34719, 35001, 35527, 35792, 35446, 34318, 32653, 31320, 31199, 32113, 32890, 32748, 32192, 32228, 33134, 34333, 35144, 35288, 34886, 34336, 34013, 33849, 33401, 32543, 31807, 31718, 32063, 32265, 32272, 32579, 33453, 34632, 35827, 37016, 38049, 38393, 37689, 36362, 35388, 35421, 36287, 37359, 38231, 38918, 39488, 39764, 39531, 38932, 38330, 37819, 37142, 36224, 35480, 35367, 35806, 36341, 36722, 37034, 37314, 37431, 37411, 37602, 38360, 39660, 41092, 42187, 42716, 42855, 43060, 43705, 44779, 45958, 46956, 47783, 48748, 50262, 52542, 55337, 58037, 60156, 61658, 62713, 63333, 63457, 63258, 63150, 63506, 64619, 66712, 69646, 72665, 74872, 76038, 76642, 77147, 77586, 77889, 78163, 78477, 78819, 79434, 80725, 82556, 84110, 84837, 85144, 85701, 86413, 86717, 86675, 87072, 88471, 90796, 93928, 98043, 103176, 108987, 115287, 122291, 130014, 137823, 145069, 151838, 158588, 165196]
54031A65196N719M381L389L004K823K529K254K184K182J986J596J224R39N13k42
54016A99677j180j978k584l228l994m575m698m508m334m308m442m880n568n873
54002A43527n148l747k893l229m029m237l790l352l125k674j926j503j807k292
53988I9775k146j432j057j570k417k594j830q71n51q55j087q62m87l34j90L44
53972H1836J047J196N60j36n9O65J083N17o88j576j579r15k03K38N30Q32J008
53955H4356Q40M71L39O29J046J257J291J338J312J052Q20J161K208L427M292M807
53939A10646N147N185M779M359M544N290N958O319O857P769Q361P977P074O655
53925A96920O826O748N951N008M600M655M733M791N054N457N740N927O216O477
$$ y = [165196, 170915, 175296, 178685, 181689, 184512, 187041, 189295, 191479, 193661, 195647, 197243, 198467, 199406, 199919, 199677, 198497, 196519, 193935, 190707, 186713, 182138, 177440, 172932, 168598, 164290, 159848, 154968, 149400, 143527, 138379, 134632, 131739, 128510, 124481, 120244, 116454, 113102, 109977, 107303, 105377, 103874, 102067, 99775, 97629, 96197, 95140, 93570, 91153, 88559, 86729, 85858, 85307, 84452, 83365, 82503, 82016, 81682, 81492, 81836, 82883, 84079, 84639, 84503, 84444, 85109, 86192, 86709, 86021, 84445, 82866, 81951, 81748, 81986, 82516, 83348, 84356, 85196, 85667, 86006, 86635, 87681, 88938, 90229, 91567, 92879, 93931, 94751, 95912, 98120, 101547, 105839, 110646, 115793, 120978, 125757, 130116, 134660, 139950, 145908, 152227, 159084, 166853, 175214, 183191, 190265, 196920, 203746, 210494, 216445, 221453, 226053, 230708, 235441, 240232, 245286, 250743, 256483, 262410, 268626, 275103]
53911B75103O211N117L439J735M74k48p40j413k303k979l095k856k723k850l144
53896B69728l670m585n691o529o945p199p443p457p086o571o237o065n868n689
53882A82693n709n817n614m903l994l371l194l263l496m102n067n669n064l524
53868A19906k475k868l840l702k125n72m51j469k225j962j187q47j307k144k594
53853I0138k211j241l48L1o2m64j153j961k422k275j856j604j365o45N04J336
53837G4402J260N33r7j99Q0L82N24N42N00L98K83K70M09N19M55M34Q87J807K592
53818H5981K695K262J820J659J786K258L105L992M445M483M560M878N133N114
53804A34171N127N498N978O046N661N369N611O187O445N914M747L546K789K403
$$ y = [275103, 281314, 286431, 289870, 291605, 292079, 291831, 291091, 289678, 287375, 284396, 281301, 278445, 275722, 272872, 269728, 266058, 261473, 255782, 249253, 242308, 235109, 227666, 220209, 213123, 206552, 200315, 194250, 188382, 182693, 176984, 171167, 165553, 160650, 156656, 153285, 150091, 146828, 143332, 139230, 134163, 128494, 123430, 119906, 117431, 114563, 110723, 107021, 104896, 104324, 103873, 102404, 100179, 98217, 97030, 96183, 94876, 92732, 90138, 87927, 86686, 86338, 86369, 86307, 85843, 84690, 82729, 80307, 78032, 76176, 74572, 73207, 72562, 73066, 74402, 75662, 76195, 76098, 75899, 75979, 76361, 76885, 77427, 77927, 78325, 78608, 78878, 79287, 79806, 80261, 80695, 81582, 83389, 85981, 88676, 90938, 92758, 94417, 96203, 98461, 101566, 105558, 110003, 114486, 119046, 123924, 129057, 134171, 139298, 144796, 150774, 156820, 162481, 167850, 173461, 179648, 186093, 192007, 196754, 200300, 203089, 205492]
53790B05492J978J339P24L28o5q13j885k938l809m656n540o184o267n848n261
53775A66595m779m542m651n018n147m485l203k286k502l457m063l839l250k782
53761A12591k263j468q08q80j500j843j546j120j136j475j683j703j841k141k200
53746H8984j648n92M90J123J102O01O7r1J31L54K84O6JM2j63o78j041r30p05r11
53726H6486j385j385o46J75M06J65mN3J12J19K07L58M83O79R52Q78J05q63j077
53707H5818l72L75L96j01m44k38O22K033L375L693K747J542J221J766K245K055
53691A06733J311L37n21p47l0J113J699J351O11R7j14j83j54r4j57k61p3M77J023
53672A12418J268J250J007L97m48r66q53n56o22q69o79M0O87P87N36M29O07P53
$$ y = [205492, 207470, 208809, 209533, 209861, 209796, 208983, 207098, 204160, 200351, 195695, 190155, 183971, 177704, 171856, 166595, 161816, 157274, 152623, 147605, 142458, 137973, 134770, 132484, 129982, 126525, 122462, 118623, 115373, 112591, 110328, 108860, 108052, 107172, 105672, 103829, 102283, 101163, 100027, 98552, 96869, 95166, 93325, 91184, 88984, 87336, 86744, 87234, 88357, 89459, 90060, 90127, 90036, 90167, 90521, 90805, 90871, 90872, 90914, 90751, 90073, 89032, 88102, 87397, 86486, 85101, 83716, 83070, 83245, 83651, 83816, 83812, 83865, 83977, 84096, 84303, 84661, 85144, 85823, 86775, 87653, 87758, 86895, 85818, 85446, 85821, 86217, 86116, 85672, 85434, 86056, 88089, 91464, 95157, 97904, 99446, 100667, 102433, 104678, 106733, 108044, 108381, 107860, 107113, 107083, 108196, 109895, 111246, 111857, 111954, 111840, 111657, 111503, 111409, 111252, 110991, 110918, 111395, 112418, 113686, 114936, 115943, 116340, 115892, 114926, 114073, 113517, 112895, 112026, 111347, 111387, 112074, 112861, 113397, 113826, 114433, 115186]
53654A15186M71k41r13j041o48k23l2J96P39J358J655J661J631J479R43K55N7
53637A22533M99R39P90K55l1J91O48R82J113J211J491J920K113J681Q27L53P63
53620A38278J580J849J302O23N65J121J731K072K308K626K910L062L310L850M286
53605A71473L923K744J714J742K623L404L562L398L316L276L046K624K129J690
53591B10664J505J739K150K170J647J193J459K220K585J986P66k36m36Q5O88P30
53575B30915P7q49j541j719j357o46j05k40r04j358j120m50K67J077J991K415
53559B26453J806N79k94m68l61k05K03P50Q35K99j55Q8O79Q55M91J17J56M80O52
53540B32960L50k69n21J87J524K363K047J195R44J719L075M386N222N314M738
$$ y = [115186, 115657, 115416, 114503, 113462, 112814, 112591, 112559, 112755, 113494, 114852, 116507, 118168, 119799, 121278, 122221, 122476, 122533, 123032, 123971, 124761, 125016, 124985, 125176, 125824, 126806, 127919, 129130, 130621, 132541, 134654, 136335, 137162, 137515, 138278, 139858, 141707, 143009, 143632, 144197, 145318, 147049, 149121, 151429, 154055, 156965, 160027, 163337, 167187, 171473, 175396, 178140, 179854, 181596, 184219, 187623, 191185, 194583, 197899, 201175, 204221, 206845, 208974, 210664, 212169, 213908, 216058, 218228, 219875, 221068, 222527, 224747, 227332, 229318, 230084, 229848, 229412, 229497, 230185, 230915, 230992, 230143, 228602, 226883, 225526, 224880, 224775, 224535, 223631, 222273, 221153, 220703, 220970, 222047, 224038, 226453, 228259, 228838, 228544, 228076, 227715, 227510, 227713, 228463, 229298, 229597, 229442, 229530, 230209, 231064, 231555, 231672, 231828, 232308, 232960, 233310, 233041, 232520, 232707, 234231, 236594, 238641, 239836, 240780, 242499, 245574, 249960, 255182, 260496, 265234]
53525B65234M157M312N252O326O922O968O753O645O920P533Q097Q405Q828R787
53511C62139J0881J1179J0497R825J0176J1480J2949J4156J5241J6284J6964J6930
53499E18701J6208J5205J4479J4465J5140J5977J6375J6145J5481J4563J3487
53488F86226J2534J2110J2305J2809J3387J4107J4918J5357J5107J4571J4371
53477H37802J4435J4145J3386J2754J2512J2109J1148J0109R486Q758P141N001
53465I68786L418K494J214p88k525l260l742n037o886q250q925r577j0415j0923
53451I05584j0906j0865j1126j1389j1398j1372j1487j1517j1314j1184j1413
53440G81613j1844j2164j2246j1961j1081r717q426p577o918o101n252m567l790
$$ y = [265234, 269391, 273703, 278955, 285281, 292203, 299171, 305924, 312569, 319489, 327022, 335119, 343524, 352352, 362139, 373020, 384199, 394696, 404521, 414697, 426177, 439126, 453282, 468523, 484807, 501771, 518701, 534909, 550114, 564593, 579058, 594198, 610175, 626550, 642695, 658176, 672739, 686226, 698760, 710870, 723175, 735984, 749371, 763478, 778396, 793753, 808860, 823431, 837802, 852237, 866382, 879768, 892522, 905034, 917143, 928291, 938400, 947886, 956644, 963785, 968786, 972204, 974698, 975912, 975124, 972599, 969339, 965597, 960560, 953674, 945424, 936499, 926922, 916507, 905584, 894678, 883813, 872687, 861298, 849900, 838528, 827041, 815524, 804210, 793026, 781613, 769769, 757605, 745359, 733398, 722317, 712600, 704174, 696597, 689679, 683578, 678326, 673759, 669969]
53427F69969k604j310n70n11o30n25k30K25J055K268L402M038M409N173O632Q368
53411F99159R741J0535J1037J1538J2014J2317J2578J3158J4277J5846J7601J9223
53399H59024K0346K0874K1272K2187K3661K5091K6134K7201K8747L0515L1928
53388A136980L2826L3375L3557L3306L2910L2617L2110L1039K9906K9549K9724
53377A487899K9276K7839K6358K5407K4056K1240J7503J4239J1751R145N948K689
53365A703350j80k882n602q124j0562j3589j7376k0976k3403k4843k6163k7661
53353A521989k9003l0084l1126l2013l2244l1722l0933l0220k9285k7724k5701
53342A191934k3815k2481k1674k1136k0715k0519k0687k0980k0757j9664j8188
$$ y = [669969, 667365, 666055, 665485, 664974, 664344, 663819, 663589, 663814, 664869, 667137, 670539, 674577, 678986, 684159, 690791, 699159, 708900, 719435, 730472, 742010, 754024, 766341, 778919, 792077, 806354, 822200, 839801, 859024, 879370, 900244, 921516, 943703, 967364, 992455, 1018589, 1045790, 1074537, 1105052, 1136980, 1169806, 1203181, 1236738, 1270044, 1302954, 1335571, 1367681, 1398720, 1428626, 1458175, 1487899, 1517175, 1545014, 1571372, 1596779, 1620835, 1642075, 1659578, 1673817, 1685568, 1694713, 1700661, 1703350, 1703170, 1700288, 1694686, 1686562, 1676000, 1662411, 1645035, 1624059, 1600656, 1575813, 1549650, 1521989, 1492986, 1462902, 1431776, 1399763, 1367519, 1335797, 1304864, 1274644, 1245359, 1217635, 1191934, 1168119, 1145638, 1123964, 1102828, 1082113, 1061594, 1040907, 1019927, 999170, 979506, 961318]
53331I61318j7169j6791j6435j5567j4336j3183j2207j1196r980q567p180o231
53319H12476n986o103n867n150m718n315o656p786q092p570o362m569k563r29
53305G34810K8M94P67R60J180J635K480L607M749N648O179O474O922P849R171
53290G92953J0500J1616J2629J3699J4813J5859J6709J7134J6834J5719J4071
53279I52536J2381J1036J0145R533Q855P833O416M723K869R23r80k710m273n790
53265A013497p299q707r889j0747j1221j1354j1353j1442j1738j2337j3349j4632
53253H79429j5642j5852j5408j5020j5204j5761j6124j5973j5440j4847j4349
53242G09809j3812j3067j2296j2021j2459j3035j2830j1580r969q886q597q709
$$ y = [961318, 944149, 927358, 910923, 895356, 881020, 867837, 855630, 844434, 834454, 825887, 818707, 812476, 806490, 800387, 794520, 789370, 784652, 779337, 772681, 764895, 756803, 749233, 742871, 738302, 735739, 734810, 734838, 735332, 736099, 737059, 738239, 739874, 742354, 745961, 750710, 756358, 762537, 769011, 775933, 783782, 792953, 803453, 815069, 827698, 841397, 856210, 872069, 888778, 905912, 922746, 938465, 952536, 964917, 975953, 986098, 995631, 1004486, 1012319, 1018735, 1023458, 1026327, 1027250, 1026270, 1023560, 1019287, 1013497, 1006198, 997491, 987602, 976855, 965634, 954280, 942927, 931485, 919747, 907410, 894061, 879429, 863787, 847935, 832527, 817507, 802303, 786542, 770418, 754445, 739005, 724158, 709809, 695997, 682930, 670634, 658613, 646154, 633119, 620289, 608709, 598740, 589854, 581257, 572548]
53230E72548q677q229p460o711o305o212o000n209l859k607k248k871l577l380
53216D99203k404j778k232l325m361n361o555p473p511p107p288q068q312p422
53202D20006o135n279m706m044l665m030m637m573l843l357l676m448n071n322
53188C57220n263n096n148n602o069n852m751l363k444k207k330k481k611k813
53174C01190l008k939k571k318k593l220l579l354k786k157j573j281j619k370
53160B65822k767k561k429k870l300k965k246k127k645k892k459j952j924k168
53146B30517k282k267k193j913j455j220j424j728j773j674j635j501j055n54
53132B07843n49j240k241k943k960k422j916k001k634l189l125k495j756j310
$$ y = [572548, 563871, 555642, 548182, 541471, 535166, 528954, 522954, 517745, 513886, 511279, 509031, 506160, 502583, 499203, 496799, 495021, 492789, 489464, 485103, 479742, 473187, 465714, 458203, 451096, 443808, 435740, 427428, 420006, 413871, 408592, 403886, 399842, 396177, 392147, 387510, 382937, 379094, 375737, 372061, 367613, 362542, 357220, 351957, 346861, 341713, 336111, 330042, 324190, 319439, 316076, 313632, 311425, 309095, 306614, 304003, 301190, 298182, 295243, 292672, 290354, 287761, 284541, 280962, 277608, 274822, 272665, 271092, 269811, 268192, 265822, 263055, 260494, 258065, 255195, 251895, 248930, 246684, 244557, 241912, 239020, 236561, 234609, 232685, 230517, 228235, 225968, 223775, 221862, 220407, 219187, 217763, 216035, 214262, 212588, 210953, 209452, 208397, 207843, 207294, 206054, 203813, 200870, 197910, 195488, 193572, 191571, 188937, 185748, 182623, 180128, 178372, 177062]
53118A77062j278j529j812j966k027k029j904j708j738k084k305j999j550j642
53104A51491k141k204j620j179j399j709j416p97n37o55p36q28j243j673j386
53089A31968l68M79M74j09o09p87p78o72n21m71o40r39j157j151q72m28j23k17
53071A23079n69p47n87l94m69p03q65r96j199j266r07l64k56p27j059n46N38J244
53053A13207J172Q42P60O71K25r3O05K241L574L603K662J798J431J212Q03L26
53037A35039k7l15o45r70j273j691k282k778k742k131j520j634k482l112k552
53022A08885j018J80R7q61j625j721j429j034o01l57o76j468k073j995j398p46
53006I2160k61Q7L82P08J112J410J302Q74O19P84J018R17O37N45M84o2j126k003
$$ y = [177062, 175784, 174255, 172443, 170477, 168450, 166421, 164517, 162809, 161071, 158987, 156682, 154683, 153133, 151491, 149350, 147146, 145526, 144347, 142948, 141239, 139823, 139026, 138489, 137834, 137098, 136270, 135027, 133354, 131968, 131600, 132079, 132553, 132444, 131835, 131048, 130270, 129598, 129077, 128606, 127966, 127027, 125870, 124719, 123847, 123419, 123296, 123079, 122510, 121763, 121176, 120782, 120313, 119610, 118745, 117749, 116550, 115284, 114377, 114013, 113757, 113030, 111971, 111425, 111963, 113207, 114379, 115221, 115981, 116652, 116877, 116784, 117389, 119630, 123204, 126807, 129469, 131267, 132698, 133910, 134713, 135039, 135012, 134697, 134052, 133082, 131809, 130118, 127836, 125058, 122316, 120185, 118665, 117031, 114549, 111437, 108885, 107867, 108047, 108144, 107283, 105658, 103937, 102508, 101474, 100873, 100516, 99840, 98372, 96299, 94304, 92906, 92160, 91899, 91986, 92368, 93076, 94188, 95598, 96900, 97774, 98393, 99177, 100195, 101112, 101749, 102294, 102778, 102716, 101590, 99587]
52988I9587j991j140j22M33M01N3l26o52r23j004p40k99p0j14k2M01O32M8j059
52969I3093j641j121MQ34R92P25M29L07K87J25k92o55n31M3N21N75N09P17J125
52950I6046J433J608J741J640J022M4p02q25n30l30n62j103j461j206m93Q4K21
52933I6627K66N79R10Q64O67R14J587K017J759J009J14p30j135o02P31J905K118
52916A09600J495O84J01j05J62P35J091R66P30P45Q05O67P28J463K448K773K328
52899A27416J908J940J936J487J036J261K056K673K593J904J066N35M91O89O85
52884A49676L61l4m33j146k233l000k704j554o28o50j236j451r03j08J34m29j282
52867A32380j668j370q91q94j533k331k673k304j469o65k29m5K87R57J645J881
$$ y = [99587, 97596, 96456, 96334, 96767, 97168, 97221, 96895, 96243, 95320, 94316, 93576, 93277, 93207, 93093, 93071, 93472, 94104, 94152, 93093, 91452, 90331, 90335, 91169, 92161, 92886, 93315, 93622, 93909, 94034, 93742, 93087, 92556, 92599, 93120, 93695, 94204, 94921, 96046, 97479, 99087, 100828, 102468, 103490, 103534, 102832, 102007, 101477, 101147, 100585, 99482, 98021, 96815, 96322, 96406, 96627, 96893, 97472, 98382, 99246, 99913, 100827, 102414, 104431, 106190, 107199, 107313, 106583, 105448, 104846, 105577, 107482, 109600, 111095, 111779, 111880, 111775, 111937, 112672, 113763, 114729, 115459, 116204, 117009, 117676, 118404, 119867, 122315, 125088, 127416, 129324, 131264, 133200, 134687, 135723, 136984, 139040, 141713, 144306, 146210, 147276, 147811, 148302, 148991, 149676, 150037, 150003, 149570, 148424, 146191, 143191, 140487, 138933, 138305, 137655, 136419, 134968, 134065, 133957, 134091, 133662, 132380, 130712, 129342, 128451, 127557, 126024, 123693, 121020, 118716, 117247, 116582, 116353, 116308, 116595, 117552, 119197, 121078]
52851A21078J528Q54J47m56p58m64L85J117R56j06j230j618j316r54q91r32p89
52834A16551n21m10o08r98j300j250q49m20k58k20P7N93P15K4j102j897k101k047
52816A03979k009j809j179k03P00J126R58L97k21o62q59p46k64L76O55K18o81
52799I9776j397j458q44R3P31M82n69j526j584j002p62j249j837j846j405j002
52783H4601o92j33P87J778K455K572K019R92J30M8O11R58M22o54j294r69r8N51
52765I4084O33L11j15l86l01K6M2o74j749k395k472k597l054l291k798j970j480
52748G1814j380j320j268j288j035k59M02L8j182k113k156j831j657j316l86P00
52732E5763J034K73r96j788j466k38R73J388J062M92k14j174j975j898r88j17
$$ y = [121078, 122606, 123460, 123607, 123151, 122393, 121929, 122314, 123431, 124387, 124281, 123051, 121433, 120117, 119163, 118272, 117340, 116551, 116030, 115620, 115012, 114014, 112714, 111464, 110615, 110195, 109937, 109717, 109794, 110387, 111102, 111126, 110024, 108127, 106026, 103979, 101970, 100161, 98982, 98779, 99479, 100605, 101563, 101960, 101739, 101077, 100218, 99472, 99208, 99584, 100239, 100457, 99776, 98379, 96921, 96077, 96170, 96901, 97383, 96814, 95288, 93704, 92702, 91940, 90691, 88854, 87008, 85603, 84601, 83909, 83776, 84563, 86341, 88796, 91368, 93387, 94379, 94509, 94557, 95168, 96126, 96548, 95894, 94600, 93631, 93533, 94084, 94717, 95028, 94913, 94527, 94226, 94252, 94294, 93620, 91871, 89476, 87004, 84407, 81353, 78062, 75264, 73294, 71814, 70434, 69114, 67846, 66558, 65523, 65264, 65666, 65704, 64522, 62409, 60253, 58422, 56765, 55449, 55063, 55763, 56797, 57070, 56074, 54286, 52820, 52582, 53555, 54943, 56005, 56497, 56283, 55109, 53134, 51236, 50248, 50131]
52716E0131K29M25P49P47Q9p58j192j271j256r39p6R02J302J019N14J95J59K95
52698E1264K42l17j051j108k24P81J029O15Q2m60j026j181n76K41M08p7m81l74
52680D7787J25Q48J588J866J416P82O26P09L70k25l07J68M47K99L21O58N32m83
52662E7527j604j864j301n63P7O70J038R13M39ml16o33q36n80J47Q08P46q2q65
52643E3717o48N60J625J588Q37N18R40J302J028N81O35J079J325J178R29Q34Q70
52626F8898R14R01Q77J018J385J742J760J479J204R98O58J49l34p98j368j805
52610G7678j683j166r30j110j062m94q5l86q70p26j31J11j70m26l76k64j90K6
52592F7746K38j8o86j019n48K47N96M54L89O44P57K31o41r16j5J515K434K050
$$ y = [50131, 50360, 50785, 51534, 52281, 52370, 51612, 50420, 49149, 47893, 46954, 46878, 47780, 49082, 50101, 50615, 50810, 50969, 51264, 51506, 51189, 50138, 49030, 48806, 49587, 50616, 51231, 51313, 50853, 49827, 48646, 48070, 48311, 48719, 48642, 48161, 47787, 47912, 48760, 50348, 52214, 53630, 54412, 55038, 55747, 56117, 55892, 55585, 55753, 56200, 56499, 56820, 57478, 58010, 57527, 55923, 54059, 52758, 52195, 52272, 52942, 53980, 54893, 55332, 55328, 55012, 54379, 53543, 52963, 53110, 53918, 54664, 54582, 53717, 53069, 53629, 55254, 56842, 57679, 58197, 59137, 60439, 61467, 62048, 62683, 63762, 65087, 66265, 67194, 68028, 68898, 69812, 70713, 71590, 72608, 73993, 75735, 77495, 78974, 80178, 81176, 81834, 81983, 81649, 80851, 79483, 77678, 75995, 74829, 73899, 72789, 71727, 71233, 71148, 70762, 69892, 69166, 69035, 69146, 68976, 68550, 68174, 67910, 67720, 67746, 67984, 67966, 67280, 66261, 65713, 65960, 66556, 67010, 67399, 68043, 68800, 69031, 68390, 67474, 67459, 68974, 71408, 73458]
52574G3458Q88j2k20j42k62n06m50M7O20P67L38l01n94k72M28R67R03K81l29l26
52554G5283K45O71M40q5j96J49L68K84M02R42J264Q26K08M25J438K117J737Q03
52536H7321J89J11L43Q42J599K048J528L48k72L38J380J589P20m18j103j235q17
52519I4511J86J307J640Q68k75r62j147j143r26n19m43j004j487j021M9N40Q1
52502I0255n34p12p07q15q45p38p81q74m35N16J062O66J3p9K40N13R77K000K985
52483I2707K967J985J001N47L27M8j28m6J63L56M83M37K21J58M53O74K75m95p77
52464A01356k68M42O78L52l07j063j551j393o57J05N21P25R38J063R16N92L77
52447A02826L93M56K88j32l21K61J379J950J275K7n50k48j8m89j155j245p09l0
$$ y = [73458, 74346, 74334, 74114, 73972, 73710, 73204, 72754, 72801, 73421, 74188, 74526, 74225, 73631, 73359, 73787, 74754, 75657, 75938, 75609, 75283, 75528, 76199, 76639, 76554, 76358, 76507, 76875, 77159, 77561, 78503, 79767, 80593, 80801, 81226, 82664, 84781, 86518, 87321, 87510, 87621, 87964, 88806, 90405, 92453, 93981, 94329, 94057, 94395, 95775, 97364, 98084, 97666, 96563, 95328, 94511, 94697, 96004, 97644, 98512, 98237, 97275, 96128, 94985, 94059, 93540, 93097, 92093, 90606, 89585, 89634, 90174, 90255, 89721, 89009, 88302, 87487, 86642, 85904, 85123, 84249, 83814, 84330, 85392, 86058, 86071, 85992, 86232, 86745, 87722, 89722, 92707, 95674, 97659, 98660, 99207, 99534, 99582, 99454, 99408, 99571, 99927, 100410, 100847, 101068, 101226, 101679, 102353, 102628, 102133, 101356, 101088, 101530, 102208, 102560, 102253, 101190, 99639, 98246, 97589, 97694, 98215, 98940, 99878, 100941, 101857, 102449, 102826, 103219, 103675, 103963, 103831, 103510, 103771, 105150, 107100, 108375, 108402, 107852, 107604, 107586, 107097, 105942, 104697, 103988, 103958]
52429A03958M51O51N88M42M31L53l06j489k267j873o90K67O19P63R30P74K1r43
52411A02680j460j306p58j59L76Q03R60O69P4l31j34N61J214J394J116O89M15
52394A06803M09N45N18K01p0K31J074J713J503O85N5O2N25J157J875K505K628
52377A22419K012J013K18j51k55j74K55J071J963K527K576K177J569J134J190
52362A39544J690K293K804L301L712L690L146K556K370K453K477K565K941L273
52348A78815L057K512K371K753L001K703K081J345M61j29L65J801K893K888K559
52333B09476K808L159K707J882J956L154M558N615O563P299P253O651O689P897
52319B77667R332J0088J0585J1635J2957J3621J3551J3530J3792J3612J2592J1638
$$ y = [103958, 104409, 105060, 105648, 106090, 106521, 106874, 106568, 105079, 102812, 100939, 100249, 100516, 101135, 101898, 102828, 103602, 103623, 102680, 101220, 99914, 99156, 98997, 99373, 100176, 101136, 101805, 101879, 101548, 101414, 101975, 103189, 104583, 105699, 106388, 106803, 107212, 107757, 108275, 108476, 108406, 108637, 109711, 111424, 112927, 113612, 113667, 113729, 114254, 115411, 117286, 119791, 122419, 124431, 125444, 125662, 125511, 125256, 125082, 125337, 126408, 128371, 130898, 133474, 135651, 137220, 138354, 139544, 141234, 143527, 146331, 149632, 153344, 157034, 160180, 162736, 165106, 167559, 170036, 172601, 175542, 178815, 181872, 184384, 186755, 189508, 192509, 195212, 197293, 198638, 199099, 198970, 199335, 201136, 204029, 206917, 209476, 212284, 215443, 218150, 220032, 221988, 225142, 229700, 235315, 241878, 249177, 256430, 263081, 269770, 277667, 286999, 297087, 307672, 319307, 332264, 345885, 359436, 372966, 386758, 400370, 412962, 424600]
52307D24600J1988J3507J4570J3873J1984J0645J0610J0864J0157Q645P449P030
52295E55922O805O191N175L919K552J462J016Q35J18j135k022k183k439l452m607
52280E68157m878m277l592l191k898k667k552k115p45J398L432M816N743O428
52266E63059O702O537O423O840P730Q726R652J0432J0808J0527R794R232R218
52253F75680R434R194Q252P132O516O421O196N377M215L194K299J105n23k146
52239G42346l238l733m108m911o210p396p751p312o951p370q194q416p675o687
52225F52394o332o665p007o769n933m871l922l226k788k531k223j557m71O06J052
52210E99757P35K76M53J410K569L275L290K781J997J226Q69J349K637L953M276
$$ y = [424600, 436588, 450095, 464665, 478538, 490522, 501167, 511777, 522641, 532798, 541443, 548892, 555922, 562727, 568918, 574093, 578012, 580564, 582026, 583042, 583877, 583995, 582860, 580838, 578655, 576216, 572764, 568157, 563279, 559002, 555410, 552219, 549321, 546654, 544102, 541987, 541242, 542640, 546072, 550888, 556631, 563059, 569761, 576298, 582721, 589561, 597291, 606017, 615669, 626101, 636909, 647436, 657230, 666462, 675680, 685114, 694308, 702560, 709692, 716208, 722629, 728825, 734202, 738417, 741611, 743910, 745015, 744492, 742346, 739108, 735375, 731267, 726356, 720146, 712750, 704999, 697687, 690736, 683366, 675172, 666756, 659081, 652394, 646062, 639397, 632390, 625621, 619688, 614817, 610895, 607669, 604881, 602350, 600127, 598570, 598099, 598705, 599757, 600492, 600768, 601221, 602631, 605200, 608475, 611765, 614546, 616543, 617769, 618638, 619987, 622624, 626577, 630853]
52195F30853L360K073J457J549J574J158P58P25O06q7r29j046m27l3n19j466k113
52178F37493k358k697l475m537n439n754n308m441l778l558l349k739k078k056
52164E85926k670l169l142k963k963k796k099j300j085j330j359j115j271k027
52150E56637k646k503j933j577j431j144q14p86r43q42m52j95l05o15r29j137
52134E38385j062o33j46J12M27J274K487L379L703L903M319M865N607O930Q769
52119E82319J0318J0944J0993J1241J1908J2636J3179J3613J4034J4335J4320
52108G19840J3913J3325J2985J2981J2716J1569R923Q876Q731Q478P136M954K839
52095H48266J216J1p37j082j618k931m695n978o346o180o003o031o317o741o845
$$ y = [630853, 634213, 636286, 637743, 639292, 640866, 642024, 642782, 643507, 644113, 644026, 643097, 642051, 641624, 641591, 641072, 639606, 637493, 635135, 632438, 628963, 624426, 618987, 613233, 607925, 603484, 599706, 596148, 592799, 590060, 587982, 585926, 583256, 580087, 576945, 573982, 571019, 568223, 566124, 564824, 563739, 562409, 561050, 559935, 558664, 556637, 553991, 551488, 549555, 547978, 546547, 545403, 544589, 543803, 542860, 542018, 541566, 541371, 541066, 540451, 539522, 538385, 537323, 536690, 536544, 536656, 537083, 538357, 540844, 544223, 547926, 551829, 556148, 561013, 566620, 573550, 582319, 592637, 603581, 614574, 625815, 637723, 650359, 663538, 677151, 691185, 705520, 719840, 733753, 747078, 760063, 773044, 785760, 797329, 807252, 816128, 824859, 833337, 840473, 845427, 848266, 849482, 849493, 848756, 847674, 846056, 843125, 838430, 832452, 826106, 819926, 813923, 807892, 801575, 794834, 787989]
52080G87989o238n155m247l772l412k858k045q82O86K253L101L116L046L649M859
52065G80090O047O835P319P706Q040Q272Q412Q494Q464Q178P540O660N741M821
52051H82619L774K588J428L23r13k319l568m444n241o377p831r261j0482j1472
52037H28824j2049j2025j1654j1466j1681j2102j2548j3041j3474j3528j3063
52026F92193j2346j1740j1352j1049j0679j0198r709r346r117q953q952r285r807
52013E59660j0015r718r348r326r418r228q979r214r903j0456j0570j0511j0532
52000D32442j0568j0603j0784j1077j1226j1109j0830j0412r881r521r534r519
51988C07378q918p971p514p725p832p327o667o376o174n554m631l841l241k674
$$ y = [787989, 781751, 776596, 772349, 768577, 765165, 762307, 760262, 759380, 760066, 762319, 765420, 768536, 771582, 775231, 780090, 786137, 792972, 800291, 807997, 816037, 824309, 832721, 841215, 849679, 857857, 865397, 872057, 877798, 882619, 886393, 888981, 890409, 890732, 889819, 887500, 883932, 879488, 874247, 867870, 860039, 850778, 840296, 828824, 816775, 804750, 793096, 781630, 769949, 757847, 745299, 732258, 718784, 705256, 692193, 679847, 668107, 656755, 645706, 635027, 624829, 615120, 605774, 596657, 587704, 578752, 569467, 559660, 549645, 539927, 530579, 521253, 511835, 502607, 493628, 484414, 474511, 464055, 453485, 442974, 432442, 421874, 411271, 400487, 389410, 378184, 367075, 356245, 345833, 335952, 326431, 316897, 307378, 298460, 290489, 282975, 275250, 267418, 260091, 253424, 247048, 240874, 235320, 230689, 226848, 223607, 220933]
51974B20933k349k577l153l545l540l320l045k776k625k594k389j798j091o98
51960A85433o39o74q09j239j882k349k368j892r78R9P07L55o76j550j789j596
51944A68153j358j222j178j204j204j185j397j973k392j899n43O95J043P43L73
51929A55452o3q39j644j770j098k88J33L43O73R43P55J44m39o80n94k27M05J022
51911A52228J132N88j01l17m0J97Nn22j129j747k385k843k810k199j340p28n66
51894A37423n78l10L00P84O67R1l38k90o9j24m96q89j151j321j299q79j69L42
51876A31694L91L37O61J240J473J166P87P78J019J227J451J800J970J634J069
51861A48697Q43Q91O29k1l78q7K81J32k07o7M94Q30O14Qq40j763k208j644l63
$$ y = [220933, 218584, 216007, 212854, 209309, 205769, 202449, 199404, 196628, 194003, 191409, 189020, 187222, 186131, 185433, 184794, 184120, 183311, 182072, 180190, 177841, 175473, 173581, 172603, 172702, 173409, 173764, 173088, 171538, 169749, 168153, 166795, 165573, 164395, 163191, 161987, 160802, 159405, 157432, 155040, 153141, 152598, 153293, 154336, 155079, 155452, 155389, 154550, 152906, 151136, 150038, 149750, 149883, 150226, 150899, 151842, 152597, 152741, 152302, 151622, 151028, 150801, 151206, 152228, 153360, 153948, 153847, 153530, 153490, 153687, 153692, 153170, 152041, 150294, 147909, 145066, 142256, 140057, 138717, 137989, 137423, 136845, 136535, 136835, 137619, 138286, 138377, 138039, 137749, 137680, 137556, 137060, 136171, 135020, 133699, 132400, 131521, 131352, 131694, 132085, 132422, 133083, 134323, 135796, 136962, 137749, 138527, 139546, 140773, 142224, 144024, 145994, 147628, 148697, 149540, 150431, 151060, 151039, 150661, 150574, 150855, 150987, 150780, 150713, 151207, 152037, 152651, 152659, 151819, 150056, 147848, 146204, 145841]
51842A45841P34J227J431J520J194M36j07JK70K3n26n73P5P04O74J96n4K28P13
51823A54007R13O13r5j006j805k085j644q02j76k1j10l00p60j302j115J58J427
51806A45897J205l85j494q33P45J444P00m14p19j36N23N89K07Q0N91J229J155
51789A50384L15l86k37M37Q70R08R70J149J002L40l08l25J83N91O87R52J729K525
51771A61786K577J992J641J858J978J562J360K241L679M283L633K583J745Q05
51757A93723l94j216j245j113j538k170k162j443p06m14m61o36p84o62j55M21
51741A79045O30M41J51q1k54l26k94l39n10n42k75l2j77n27o54n55n89q80j185
51722A73047j261j039n35O8M32M03J55j76o96j292j455r32j83K77N64R48J150
$$ y = [145841, 146575, 147802, 149233, 150753, 151947, 152383, 152276, 152277, 152547, 152570, 152044, 151471, 151546, 152250, 152924, 153120, 153066, 153294, 154007, 154920, 155533, 155438, 154432, 152627, 150542, 148898, 148096, 147920, 147899, 147789, 147489, 146729, 145427, 144312, 144470, 145897, 147102, 146717, 145223, 144390, 145135, 146579, 147279, 146865, 146146, 146010, 146533, 147122, 147329, 147409, 148000, 149229, 150384, 150699, 150313, 150076, 150513, 151383, 152291, 153261, 154410, 155412, 155752, 155444, 155119, 155302, 155893, 156580, 157532, 159261, 161786, 164363, 166355, 167996, 169854, 171832, 173394, 174754, 176995, 180674, 184957, 188590, 191173, 192918, 193723, 193329, 192113, 190868, 189755, 188217, 186047, 183885, 182442, 181736, 181322, 180861, 180225, 179441, 178779, 178624, 179045, 179675, 180116, 180267, 180186, 179932, 179606, 179312, 178973, 178463, 177921, 177646, 177614, 177437, 176910, 176256, 175701, 175112, 174232, 173047, 171786, 170747, 170212, 170280, 170712, 171115, 171270, 171094, 170398, 169106, 167651, 166719, 166536, 166813, 167377, 168325, 169475]
51705A69475P65R7j76P2M01N56N67L81K9j4O36J600K240K678L427M327M749M723
51687A96533M840N126N002M433L985L584K421M02j400k268k673l089l121k572
51673B11203k294k930l753l801l523l944m784m782l697k649k346k191j514o67
51659A68328l18m34n26m70n28q06j095j176j022p82o43n90l34L31J066J173M08
51642A62582o46j158r03m26l94r10j469j577j324j197j360j441j147p33o42q66
51626A46389j049r88p01k10L58O03K35l75n95l73k25l16k15K83O92O16M79R04
51608A45512J732K215K078J756J681J772J879K144K741L503M111M461M623M552
51594A84760M134L432K719K201J800J233L15q34j786k108j763j185r34j252j945
$$ y = [169475, 170240, 170337, 170161, 170233, 170634, 171190, 171757, 172138, 172167, 172153, 172789, 174389, 176629, 179307, 182734, 187061, 191810, 196533, 201373, 206499, 211501, 215934, 219919, 223503, 225924, 226326, 224926, 222658, 219985, 216896, 213775, 211203, 208909, 205979, 202226, 198425, 194902, 190958, 186174, 181392, 177695, 175046, 172700, 170509, 168995, 168328, 168010, 167576, 167050, 166580, 166052, 165246, 164151, 162975, 161953, 161171, 160528, 159938, 159604, 159935, 161001, 162174, 162582, 161936, 160778, 159875, 159449, 159055, 158145, 156676, 155099, 153775, 152578, 151218, 149777, 148630, 147897, 147255, 146389, 145340, 144352, 143651, 143441, 143799, 144402, 144637, 144262, 143667, 143294, 143069, 142753, 142538, 142821, 143513, 144129, 144608, 145512, 147244, 149459, 151537, 153293, 154974, 156746, 158625, 160769, 163510, 167013, 171124, 175585, 180208, 184760, 188894, 192326, 195045, 197246, 199046, 200279, 200594, 199760, 197974, 195866, 194103, 192918, 191984, 190732, 188787]
51579A88787k560k704k296j662j209r67n23M05J554K407K780K868K860K762K556
51564A95058K261J841J332J024J185J599J677J099O7j049j981k449k256j627j061
51549A96720p05k20N15J144J458J814K456K959K809K205J797J852K174K573K900
51534B22451K851K248J377N69l07j471k676l535m125m612m677m095l532l764m296
51519A92406l909k551j490j343j267n41K33K41k58n38n26m34r4M28L17q40j938
51502A77896j541J47J644K218K365K333J625K12r04r86m82j42O1N55J244J705
51486A87950J914K177K556K830K894K870K886L053L440L863L922L486K962K805
51472B29608K897K818K473K065J605R34J99k04l14p38j798k892l046k002m14Q79
$$ y = [188787, 186227, 183523, 181227, 179565, 178356, 177389, 176866, 177271, 178825, 181232, 184012, 186880, 189740, 192502, 195058, 197319, 199160, 200492, 201516, 202701, 204300, 205977, 207076, 207143, 206094, 204113, 201664, 199408, 197781, 196720, 196015, 195795, 196310, 197454, 198912, 200726, 203182, 206141, 208950, 211155, 212952, 214804, 216978, 219551, 222451, 225302, 227550, 228927, 229496, 229189, 227718, 225042, 221507, 217382, 212770, 208093, 203998, 200466, 196702, 192406, 188497, 185946, 184456, 183113, 181846, 181305, 181538, 181779, 181521, 180983, 180457, 180023, 179929, 180357, 180674, 179834, 177896, 176355, 176502, 178146, 180364, 182729, 185062, 186687, 186899, 185995, 185009, 184527, 184385, 184446, 185001, 186245, 187950, 189864, 192041, 194597, 197427, 200321, 203191, 206077, 209130, 212570, 216433, 220355, 223841, 226803, 229608, 232505, 235323, 237796, 239861, 241466, 242400, 242599, 242395, 242081, 241343, 239545, 236653, 233607, 231605, 231191, 232070]
51456B32070J441J233N17j18r9M70P10o7j457k396k376j923j781k087k478k796
51440B18863l279m097m888m937l964k672k263l144m370m667l823k669j775q97
51426A71418J78R77J019O72P18J282J744J667J291J067J161J505K017K558K797
51411A92071K371J248n6p54m78K06K71o77k003k908l397m025m906n459n172m227
51395A62105l285k819k793k831k662k400k319k356k102j399p11n47q46j196j458
51380A32381j719j841j593j170j038j190j125p07n13r83j710j917j409o05J27
51365A14988O94Q66K86q99j744j401k24M06l40j671k030r20O07J277R40L26K6
51348A11187J18N21J066J318Q77m7p95j055j034q01j5J398K705L018K369J751
$$ y = [232070, 233511, 234744, 235261, 235143, 235044, 235514, 236224, 236157, 234700, 232304, 229928, 228005, 226224, 224137, 221659, 218863, 215584, 211487, 206599, 201662, 197698, 195026, 192763, 189619, 185249, 180582, 176759, 174090, 172315, 171418, 171596, 172573, 173592, 174264, 174982, 176264, 178008, 179675, 180966, 182033, 183194, 184699, 186716, 189274, 192071, 194442, 195690, 195634, 194880, 194402, 194608, 194879, 194202, 192199, 189291, 185894, 181869, 176963, 171504, 166332, 162105, 158820, 156001, 153208, 150377, 147715, 145315, 142996, 140640, 138538, 137139, 136428, 135881, 135035, 133839, 132381, 130662, 128821, 127228, 126058, 125020, 123830, 122705, 121998, 121485, 120502, 118792, 116875, 115466, 114861, 114988, 115682, 116548, 116834, 115935, 114191, 112790, 112566, 112972, 112632, 110961, 108931, 108011, 108618, 109895, 110835, 111161, 111187, 111305, 111826, 112892, 114210, 115087, 115040, 114245, 113190, 112156, 111355, 111340, 112738, 115443, 118461, 120830, 122581]
51332A22581K070L215M285M541L994L089K130J249P87J124J935K077P66j382k954
51317A49507l311l059l031l408l861m070l839l155k359j924j911j957j897j975
51303A09750k304k549k473k337k413k465k141j560j054o10k2N20N83K01q6O2M07
51286I1509O29P85R85J002N31k60p46n12J86O94O21R0m99q16p02j94L62M77O2
51267I4204l10k2P83J307J085L99k59p07q89o66j62N8l47r41j018n47j03j5r2
51248I1758j61l53o71p80m23K26Q63J337J486J037Q4o82o68j93o6l53j77R92K367
51229I5623K673J731O54M02O62M78l72j099r53j81K85l9o37o43Q3P64P09J82k3
51210A00299K72M05n6n90m33L58J005R59K87p21j731k234j843q73j63j20l05j63
$$ y = [122581, 124651, 127866, 132151, 136692, 140686, 143775, 145905, 147154, 147941, 149065, 151000, 153077, 153843, 152461, 149507, 146196, 143137, 140106, 136698, 132837, 128767, 124928, 121773, 119414, 117490, 115579, 113622, 111725, 109750, 107446, 104897, 102424, 100087, 97674, 95209, 93068, 91508, 90454, 89844, 89822, 90342, 90925, 91126, 91040, 91102, 91509, 92138, 92923, 93908, 94910, 95441, 95181, 94435, 93923, 94109, 94803, 95424, 95514, 95015, 94199, 93497, 93303, 93665, 94142, 94204, 93894, 93872, 94655, 95962, 97047, 97446, 97187, 96480, 95591, 94925, 94763, 94821, 94474, 93533, 92515, 91968, 91865, 91850, 91758, 91597, 91244, 90573, 89793, 89370, 89596, 90459, 91796, 93282, 94319, 94403, 93721, 93053, 92860, 92794, 92441, 92264, 93256, 95623, 98296, 100027, 100681, 101083, 101745, 102223, 101851, 100752, 99799, 99618, 99903, 99864, 99227, 98584, 98667, 99431, 100140, 100322, 100299, 100571, 100976, 100920, 100330, 99897, 100255, 101260, 102219, 102506, 101785, 100054, 97820, 95977, 95104, 94941, 94821, 94516, 94353]
51192I4353K52N22M39R4l40o04m03K30Q02Q67N45K62J98J32j79p29j255j371r34
51173I2881l26k23q53j717k183k105j716j192o11j33J28K84N16P62P78L58n31
51156H4117j582k110j586l73N18P04Q96J707K636K830K409K145K147J809J000
51141I7267L43J63O2k08k44J50L45k77j330j913j771j391j161r93p71o74q81j296
51123H5420j660j797j650j238o32J9N10O50M12K2k09j01L25Q84J285J242Q00M01
51105H4683M14O93P89N74L04K00K63M83Q52J154J106Q07O51P83R73J046J010P79
51087I7564K86m3L76J320J688R06k43o40k75Jj62k26L40J301K012K069J541P65
51069A08580Q7l19l97j20M15Q05O68J92l0J32J90l9J1O63J196P06n80j583j709
$$ y = [94353, 94605, 95127, 95566, 95660, 95320, 94716, 94313, 94543, 95345, 96212, 96757, 97019, 97217, 97349, 97170, 96441, 95186, 93815, 92881, 92555, 92332, 91479, 89762, 87579, 85474, 83758, 82566, 81955, 81822, 81950, 82234, 82750, 83512, 84290, 84648, 84117, 82535, 80425, 78839, 78466, 78984, 79688, 80584, 82291, 84927, 87757, 90166, 92311, 94458, 96267, 97267, 97610, 97773, 97835, 97627, 97383, 97533, 97878, 97601, 96271, 94358, 92587, 91196, 90035, 89042, 88271, 87597, 86716, 85420, 83760, 81963, 80313, 79075, 78443, 78462, 78972, 79622, 80034, 80056, 79847, 79746, 80071, 80955, 82240, 83482, 84282, 84683, 85097, 85790, 86579, 87153, 87457, 87657, 87920, 88403, 89255, 90409, 91515, 92322, 92973, 93756, 94729, 95775, 96785, 97564, 97850, 97807, 98183, 99503, 101191, 102097, 101854, 101214, 100939, 100940, 100778, 100552, 100892, 102193, 104205, 106274, 107815, 108580, 108667, 108348, 107951, 107831, 108246, 109051, 109719, 109911, 109881, 110013, 110203, 110164, 110175, 110838, 112034, 112740, 112160, 110577, 108868]
51050A08868j245o32j02Q6j79m26l7P46R86K82o96j084o52K54J093J298P60J75
51032A09495L37R81J061K94m44n28m45o91p56k6R93J302R06P45J262J880J894
51015A18260J306O28L41N90J122J551J841K317K980L268K864K367K547L293L896
51000A49171M140M328M466M252L896M028M660N016M707M385M812N861O863P491
50986B18076P857Q138Q548R452J1007J2830J4406J5737J7342J9603K2394K5237
50974C90627K7663K9533L1122L2906L5134L7680M0237M2480M4029M4592M4286
50963H00289M3567M2672M1294L8954L5541L1297K6549K1641J6951J2737Q946N393
50951A125831K052q78l141m592n226n094m225k693q34P38J597J712R95j071m770
$$ y = [108868, 107623, 106991, 106889, 106975, 106796, 106370, 106333, 107079, 108065, 108347, 107651, 106567, 105915, 106169, 107262, 108560, 109320, 109495, 109832, 110813, 111874, 112168, 111724, 111196, 110751, 110060, 109304, 109278, 110271, 111573, 112479, 113224, 114486, 116366, 118260, 119566, 120194, 120535, 121125, 122247, 123798, 125639, 127956, 130936, 134204, 137068, 139435, 141982, 145275, 149171, 153311, 157639, 162105, 166357, 170253, 174281, 178941, 183957, 188664, 193049, 197861, 203722, 210585, 218076, 225933, 234071, 242619, 252071, 263078, 275908, 290314, 306051, 323393, 342996, 365390, 390627, 418290, 447823, 478945, 511851, 546985, 584665, 624902, 667382, 711411, 756003, 800289, 843856, 886528, 927822, 966776, 1002317, 1033614, 1060163, 1081804, 1098755, 1111492, 1120438, 1125831, 1127883, 1127005, 1123864, 1119272, 1114046, 1108952, 1104727, 1102034, 1101200, 1101938, 1103535, 1105247, 1106242, 1105171, 1100401]
50936A100401r271j3200j6256j9467k3562k7827l1170l3664l6239l9146m1609
50925H08990m2900m3041m2296m0686l8242l5316l2324k9383k6417k3460k0727
50914D34198j8432j6584j4978j3398j1874j0636r718q820p633o158m574l109k161
50901C06123k093k617k760j925o59J49M64Q32J224J062M36L08J217K502L209L213
50885C10685K996K884L012L640M793N909O416O554P067Q114R067R498R812J0621
50871D01068J1845J2908J3724J4988J7307K0252K2733K4332K5893K8559L2496
50860F26105L6930M1325M6014N1599N8135O5137P2060P8519Q4268Q9252R3640
50849A342984R7544J00741J02721J02947J01007R6652Q9858Q0795O9699N6954
$$ y = [1100401, 1091130, 1077930, 1061674, 1042207, 1018645, 990818, 959648, 925984, 889745, 850599, 808990, 766090, 723049, 680753, 640067, 601825, 566509, 534185, 504802, 478385, 454925, 434198, 415766, 399182, 384204, 370806, 358932, 348296, 338578, 329758, 322125, 315967, 311393, 308284, 306123, 304030, 301413, 298653, 296728, 296069, 296218, 296682, 297514, 298738, 299800, 300236, 300544, 301761, 304263, 307472, 310685, 313681, 316565, 319577, 323217, 328010, 333919, 340335, 346889, 353956, 362070, 371137, 380635, 390447, 401068, 412913, 425821, 439545, 454533, 471840, 492092, 514825, 539157, 565050, 593609, 626105, 663035, 704360, 750374, 801973, 860108, 925245, 997305, 1075824, 1160092, 1249344, 1342984, 1440528, 1541269, 1643990, 1746937, 1847944, 1944596, 2034454, 2115249, 2184948, 2241902]
50839B241902M3291K9690J6919N366m658j2576j7840k0345k0449j8651j5279j0511
50827B216859m549J998P956J1975J3226J1549P007l33j0061k1304l3294m5726
50815B155303n8252p0018q0177q8613r5559j00624j02880j02029r8918r4648q9606
50804A173979q3626p6732o9352o1995n5050m8726m2940l7381l1929k6949k2924
50793F16375j9901j7478j5302j3279j1415r717q297p334o746o241n675n198m861
50780D84931m396l676l184l561m726n815o105n680n070m544m023l475l088l105
50766D24483l592m282m587l957k425o56P49J779K747L713M533N304O325P692R237
50751D47063J0870J2621J4417J6120J7828J9766K1905K4089K6496K9588L3442
$$ y = [2241902, 2285193, 2314883, 2331802, 2337168, 2332510, 2319934, 2302094, 2281749, 2261300, 2242649, 2227370, 2216859, 2212310, 2214308, 2222264, 2234239, 2247465, 2259014, 2266021, 2265688, 2255627, 2234323, 2201029, 2155303, 2097051, 2027033, 1946856, 1858243, 1762684, 1662060, 1559180, 1457151, 1358233, 1263585, 1173979, 1090353, 1013621, 944269, 882274, 827224, 778498, 735558, 698177, 666248, 639299, 616375, 596474, 578996, 563694, 550415, 539000, 529283, 520986, 513652, 506906, 500665, 494990, 489792, 484931, 480535, 476859, 473675, 470114, 465388, 459573, 453468, 447788, 442718, 438174, 434151, 430676, 427588, 424483, 420891, 416609, 412022, 408065, 405640, 404984, 405733, 407512, 410259, 413972, 418505, 423809, 430134, 437826, 447063, 457933, 470554, 484971, 501091, 518919, 538685, 560590, 584679, 611175, 640763, 674205]
50740F74205L7567M1464M5008M8232N1127N3754N6151N7997N8807N8533N7521
50729A240366N5756N2732M8318M3003L6965K9595K0528J0536P14q585j7216k4155
50717A488557k8071k8837k7510k4871k0880j5644r917m344R76N792R270J0656
50705A355177R857P029K150m609j2676k1569l1109m0646m8750n4295n7500n9246
50693A043813n9734n8536n5723n2102m8232m3923l8917l3632k8947k5395k2739
50682E75933k0092j6627j2388q413n685m068k589p45J009K127K784L523M514N528
50668E24811O297O639O449N997N965O784Q071R111R817J0693J1980J3349J4646
50655F40609J6300J8663K1367K3869K6310K9276L2794L6196L9014M1441M3724
$$ y = [674205, 711772, 753236, 798244, 846476, 897603, 951357, 1007508, 1065505, 1124312, 1182845, 1240366, 1296122, 1348854, 1397172, 1440175, 1477140, 1506735, 1527263, 1537799, 1538513, 1529928, 1512712, 1488557, 1460486, 1431649, 1404139, 1379268, 1358388, 1342744, 1332827, 1328483, 1329459, 1335251, 1344521, 1355177, 1365034, 1372063, 1374213, 1369604, 1356928, 1335359, 1304250, 1263604, 1214854, 1160559, 1103059, 1043813, 984079, 925543, 869820, 817718, 769486, 725563, 686646, 653014, 624067, 598672, 575933, 555841, 539214, 526826, 518413, 512728, 508660, 506071, 505326, 506335, 508462, 511246, 514769, 519283, 524811, 531108, 537747, 544196, 550193, 556158, 562942, 571013, 580124, 589941, 600634, 612614, 625963, 640609, 656909, 675572, 696939, 720808, 747118, 776394, 809188, 845384, 884398, 925839, 969563]
50644I69563M5524M6280M5884M4615M2604L9837L6535L3034K9250K4636J8926
50633A376688J2650O669J371l481q218j2799j6801j9706k1172k1190k0078j8278
50621A255655j6063j3435j0321o834l352k63K337M615O615Q059Q652Q570Q330
50608A252565Q042O969M091q86p264j4084k0874k7534l3816l9162m3124m5629
50596A039294m6897m7224m6865m5816m3756m0543l6847l3790l1660k9462k6252
50585F10182k2548j9662j7863j6080j3503j0568q005n810l708j994j061n34L56
50572D89202J754L216M580O019P359Q166Q578R249J0270J0914J0743J0309J0387
50559E90746J1035J1910J2943J4114J4957J4991J4503J4295J4694J5270J5505
$$ y = [969563, 1015087, 1061367, 1107251, 1151866, 1194470, 1234307, 1270842, 1303876, 1333126, 1357762, 1376688, 1389338, 1396007, 1397378, 1393897, 1385679, 1372880, 1356079, 1336373, 1315201, 1294011, 1273933, 1255655, 1239592, 1226157, 1215836, 1209002, 1205650, 1205387, 1207724, 1212339, 1218954, 1227013, 1235665, 1244235, 1252565, 1260607, 1267576, 1271667, 1270781, 1263517, 1249433, 1228559, 1201025, 1167209, 1128047, 1084923, 1039294, 992397, 945173, 898308, 852492, 808736, 768193, 731346, 697556, 665896, 636434, 610182, 587634, 567972, 550109, 534029, 520526, 509958, 501953, 496143, 492435, 490441, 489380, 488846, 489202, 490956, 494172, 498752, 504771, 512130, 520296, 528874, 538123, 548393, 559307, 570050, 580359, 590746, 601781, 613691, 626634, 640748, 655705, 670696, 685199, 699494, 714188, 729458, 744963]
50548G44963J5452J5624J6557J8478K1150K4083K7075L0397L4302L8586M3014
50537A029681M7907N3790O0567O7560P4348Q0966Q7151R2141R5559R8000J00118
50526A887788J01540J01235R8682R4018Q7111P7345O4614M9953L4663J9148L029
50515B619126j3718l0245m5467n8793p0109p9341q6239r0468r1705q9755q4786
50504A878500p7461o8667n8917m8061l5762k2337r002K925J3076K2059L0413L7714
50492A664480M2856M4889M3322L7857K8333J5058j095j8898l6847n3154o6229
50481A700572p5487q1426q4712q5539q4029q0829p6847p2513o7711o2336n6548
50470H72595n0577m4617l8939l3824k9332k5322k1672j8360j5322j2483r855p466
$$ y = [744963, 760415, 776039, 792596, 811074, 832224, 856307, 883382, 913779, 948081, 986667, 1029681, 1077588, 1131378, 1191945, 1259505, 1333853, 1414819, 1501970, 1594111, 1689670, 1787670, 1887788, 1989328, 2090563, 2189245, 2283263, 2370374, 2447719, 2512333, 2562286, 2596949, 2616097, 2619126, 2605408, 2575163, 2529696, 2470903, 2400794, 2321453, 2235214, 2144746, 2053041, 1963286, 1878500, 1801039, 1732372, 1673455, 1625394, 1589632, 1567295, 1558293, 1561218, 1574294, 1596353, 1626766, 1664480, 1707336, 1752225, 1795547, 1833404, 1861737, 1876795, 1875700, 1856802, 1819955, 1766801, 1700572, 1625085, 1543659, 1458947, 1373408, 1289379, 1208550, 1131703, 1059190, 991479, 929143, 872595, 822018, 777401, 738462, 704638, 675306, 649984, 628312, 609952, 594630, 582147, 572292, 564826]
50458E64826n291l410k017r86K74K167M250N719O471P157Q133R014R408R590J0003
50443F25308J0586J0968J1089J1155J1105J0618R626Q525P729P278P011O962P363
50430G45323Q256R219R733R807J0114J1288J3260J5442J7473J9522K1905K4769
50418I16111K8190L2216L6614M0792M4198M6746M8710N0256N1122N0731M8709
50407A394395M5296M1111L6384L0676K3568J5325O469k999j3338k4128l4307m3235
50395A475217n1014n7553o2093o4077o3936o2393n9483n4889m8896m2408l6016
50384H72459k9628k2902j5695q149p09N975J1531J6153K0093K2984K4048K2891
50372I19051J9748J5044R072K186n149j2484j9451k5685l0894l4922l7490l8117
$$ y = [564826, 559535, 556125, 554108, 553122, 553396, 555563, 559813, 565532, 572003, 579160, 587293, 596307, 605715, 615305, 625308, 635894, 646862, 657951, 669106, 680211, 690829, 700455, 708980, 716709, 723987, 730998, 737960, 745323, 753579, 762798, 772531, 782338, 792452, 803740, 817000, 832442, 849915, 869437, 891342, 916111, 944301, 976517, 1013131, 1053923, 1098121, 1144867, 1193577, 1243833, 1294955, 1345686, 1394395, 1439691, 1480802, 1517186, 1547862, 1571430, 1586755, 1593224, 1590225, 1576887, 1552759, 1518452, 1475217, 1424203, 1366650, 1304557, 1240480, 1176544, 1114151, 1054668, 999779, 950883, 908475, 872459, 842831, 819929, 804234, 796085, 795376, 801351, 812882, 829035, 849128, 872112, 896160, 919051, 938799, 953843, 962915, 965101, 959952, 947468, 928017, 902332, 871438, 836516, 799026, 760909]
50360G60909l6680l3987l1278k9205k7570k5984k4294k2330j9808j6805j3941
50349D79027j1819j0415r222p903o632n804n412m814l370j383k7M1l21K69J973
50334D14188L653M531N016N710O355O388N892N416N253N481O357P940R477R939
50320E01596R205Q155P454O943O301N703N395N119M546L926L735L819L508K617
50306E78022J789J618J860J861J427Q96N73M42M26M44K45m39j374j909j819j791
50290E82271k629m138n221n182m535m274m613m769m026k618j484j206j536j842
50276E34198j771j376r06o98j056j894k615k673k262k079k462l128l772m464n266
50261D97776n945o305o449o442o123n557n282n602n989n722m908m261m062l906
$$ y = [760909, 724229, 690242, 658964, 629759, 602189, 576205, 551911, 529581, 509773, 492968, 479027, 467208, 456793, 447571, 439668, 433036, 427232, 421820, 417006, 413636, 412253, 412226, 412267, 411946, 412215, 414188, 417841, 422372, 427388, 433098, 439453, 445841, 451733, 457149, 462402, 467883, 474240, 482180, 491657, 501596, 510801, 518956, 526410, 533353, 539654, 545357, 550752, 555871, 560417, 564343, 568078, 571897, 575405, 578022, 579811, 581429, 583289, 585150, 586577, 587473, 588046, 588488, 588914, 589358, 589603, 589164, 587790, 585881, 584062, 582271, 579642, 575504, 570283, 565101, 560566, 556292, 551679, 546910, 542884, 540266, 538782, 537576, 536040, 534198, 532427, 531051, 530145, 529447, 528391, 526497, 523882, 521209, 518947, 516868, 514406, 511278, 507506, 503042, 497776, 491831, 485526, 479077, 472635, 466512, 460955, 455673, 450071, 444082, 438360, 433452, 429191, 425129, 421223]
50247D21223l459k748j719k09J481K603K884K893L149L415L288L010L122L578
50233D42511L817L569L054K460J748R48K09n61j645k970m003m414m562m978n694
50218D29489o397o986p577q022p920p213o475o341o843p424p472o714n304l754
50204C35047k667k295k340k354k229k147k116j912j421q83o29p74j180j573j694
50189C08833j548j451j706k199k537k557k438k341k216k027j780j377q65p49j531
50174B81511k795l436l073k633l068m170n157n804o210n956m629k976k419l232
50160B25953m171m168l534l043k667j904q38q5J14J52M37R79J529J792J494O48
50144B12688k33m91n2M24K46m71q60j79J370K784L193K599J757J470K126L540
$$ y = [421223, 417764, 415016, 413297, 413088, 414569, 417172, 420056, 422949, 426098, 429513, 432801, 435811, 438933, 442511, 446328, 449897, 452951, 455411, 457159, 458107, 458316, 457755, 456110, 453140, 449137, 444723, 440161, 435183, 429489, 423092, 416106, 408529, 400507, 392587, 385374, 378899, 372558, 365715, 358291, 350819, 344105, 338801, 335047, 332380, 330085, 327745, 325391, 323162, 321015, 318899, 316987, 315566, 314683, 314054, 313280, 312100, 310527, 308833, 307285, 305834, 304128, 301929, 299392, 296835, 294397, 292056, 289840, 287813, 286033, 284656, 283791, 283042, 281511, 278716, 275280, 272207, 269574, 266506, 262336, 257179, 251375, 245165, 239209, 234580, 231604, 229185, 225953, 221782, 217614, 214080, 211037, 208370, 206466, 205628, 205543, 205657, 205809, 206246, 207225, 208754, 210546, 212040, 212688, 212455, 211964, 211912, 212336, 212582, 212111, 211251, 211072, 212442, 215226, 218419, 221018, 222775, 224245, 226371, 229911]
50128B29911N059N916N823N285N067N442O078O555O704O540O220O107O532P409
50114C14648Q256Q663Q490P767O707N785N429N528N610N447N172M776L988K733
50100C98999J388L85j27k01j3N7k39n62k47P86J880K544L071L908M965N911O776
50083D29281P768Q773R538J0180J1017J2001J2649J2565J1840J0977J0604J1024
50071E58217J1857J2289J1844J0756R437P927O172M497L405L079L336L956M678
50058F51450N186N498O142P482Q987R691R373Q756Q436Q122P171N606M172L559
50044G49631L738M125M282M348M777N733O816P417P103N759L540Q41j980m957
50030H01173q381j2199j5761j8432k0169k1298k1988k2195k1959k1429k0659j9727
$$ y = [229911, 234970, 240886, 246709, 251994, 257061, 262503, 268581, 275136, 281840, 288380, 294600, 300707, 307239, 314648, 322904, 331567, 340057, 347824, 354531, 360316, 365745, 371273, 376883, 382330, 387502, 392278, 396266, 398999, 400387, 400772, 400645, 400444, 400431, 400488, 400249, 399687, 399440, 400226, 402106, 404650, 407721, 411629, 416594, 422505, 429281, 437049, 445822, 455360, 465540, 476557, 488558, 501207, 513772, 525612, 536589, 547193, 558217, 570074, 582363, 594207, 604963, 614400, 622327, 628499, 632996, 636401, 639480, 642816, 646772, 651450, 656636, 662134, 668276, 675758, 684745, 694436, 703809, 712565, 721001, 729123, 736294, 741900, 746072, 749631, 753369, 757494, 761776, 766124, 770901, 776634, 783450, 790867, 797970, 803729, 807269, 808110, 806130, 801173, 792792, 780593, 764832, 746400, 726231, 704933, 682945, 660750, 638791, 617362, 596703, 576976]
50018E76976j8817j7999j7033j5683j4128j2821j2043j1741j1660j1398j0612
50007D23041r411q359p793p410o834o283o157o203n713m552l378k776k597k404
49993C43171k120j950j968k079k276k638l142l543l610l384l195l283l476l398
49979C03109k932k337j874j643j744k248k901l287l373l449l399k742j676j276
49965B68228k030k907k749j917j534j533q05P73J821J363J44m89j72N99J384K056
49949B62232K650L453M807O416P425P639P987R281J1065J2445J3536J5179J7477
49936C81592J9548K0735K1227K1327K0878J9738J8344J7282J6621J6018J5292
49925E88602J4637J4281J4266J4542J4990J5216J4480J2069P872K475l315q907
$$ y = [576976, 558159, 540160, 523127, 507444, 493316, 480495, 468452, 456711, 445051, 433653, 423041, 413630, 405271, 397478, 390068, 383234, 376951, 370794, 364591, 358878, 354326, 350948, 348172, 345575, 343171, 341051, 339101, 337133, 335054, 332778, 330140, 326998, 323455, 319845, 316461, 313266, 309983, 306507, 303109, 300177, 297840, 295966, 294323, 292579, 290331, 287430, 284143, 280770, 277321, 273922, 271180, 269504, 268228, 266198, 263291, 260542, 258625, 257091, 255558, 254753, 255526, 257347, 258710, 258854, 258365, 258193, 258792, 260176, 262232, 264882, 268335, 273142, 279558, 286983, 294622, 302609, 311890, 322955, 335400, 348936, 364115, 381592, 401140, 421875, 443102, 464429, 485307, 505045, 523389, 540671, 557292, 573310, 588602, 603239, 617520, 631786, 646328, 661318, 676534, 691014, 703083, 710955, 713430, 710115, 701208]
49913G01208j3826j7539j9735k0778k1503k2487k3638k4503k4708k4090k2763
49902D65638k1201k0029j9463j9099j8300j6776j4754j2807j1449j0635r697q075
49890B83353o125m817m586m876m952m703m404m148l837l460l045k601k300k403
49876B27096k793k935k642k441k713k895k179q19K2l01j181j610j203l10M61O47
49860B04204K09k96j34Q08J838K212J830J142O18N15Q01J071P68j94j141j359
49844B12892j006r54j606k301k207j445q63q00o31K16J324J848J705J619K030
49829B09821K576K776K749K922L427M094M752N260N526N849O865Q788J0915J2403
49815B88723J3346J4460J5763J6304J5368J3390J1361R762Q568P865P838Q177
$$ y = [701208, 687382, 669843, 650108, 629330, 607827, 585340, 561702, 537199, 512491, 488401, 465638, 444437, 424408, 404945, 385846, 367546, 350770, 336016, 323209, 311760, 301125, 291428, 283353, 277228, 272411, 267825, 262949, 257997, 253294, 248890, 244742, 240905, 237445, 234400, 231799, 229499, 227096, 224303, 221368, 218726, 216285, 213572, 210677, 208498, 207679, 207701, 207400, 206219, 204609, 203406, 203096, 203557, 204204, 204413, 204117, 203983, 204791, 206629, 208841, 210671, 211813, 212431, 212946, 213747, 214818, 215586, 215392, 214251, 212892, 211886, 210932, 209326, 207025, 204818, 203373, 202510, 201710, 201079, 201295, 202619, 204467, 206172, 207791, 209821, 212397, 215173, 217922, 220844, 224271, 228365, 233117, 238377, 243903, 249752, 256617, 265405, 276320, 288723, 302069, 316529, 332292, 348596, 363964, 377354, 388715, 398477, 407045, 414910, 422748, 430925]
49803D30925Q144P495O905P112P808P901O825N083L239Q67k886p845j2606j6025
49789D52942j8253j9950k1052k1007j9877j8430j7092j5583j3778j2210j1249
49778B64461j0381q906p068n746n163m591l523k435k082k407k736k703k521k350
49764B01849j971j215l70J29J42p1j03L66J263J972J828Q92k3l46l49m94n92k13
49746B02694L84M80j5m05k43J21K45K86O43J377K307L279M015M108L503K672K044
49729B27495J568J141R55J053J032O93N72J156J917J900J097M39M95Q67J022R42
49713B44344P40K89m03r22q90l92L18J136J943K370K147J472Q22M75M11M60M75
49696B54795M58N85R32J179R58M42K10M17N77L61J46L87Q85J106R67Q09P78P34
$$ y = [430925, 439069, 446564, 453469, 460581, 468389, 476290, 483115, 488198, 491437, 492304, 489418, 481573, 468967, 452942, 434689, 414739, 393687, 372680, 352803, 334373, 317281, 301698, 287920, 275710, 264461, 254080, 245174, 238106, 232360, 227197, 222606, 219083, 216648, 214566, 212159, 209423, 206720, 204199, 201849, 199878, 198663, 198293, 198422, 198564, 198493, 198390, 198756, 200019, 201991, 203819, 204711, 204688, 204342, 203993, 203499, 202907, 202694, 203078, 203558, 203543, 203138, 202895, 203016, 203261, 203547, 204190, 205567, 207874, 211153, 215168, 219276, 222779, 225451, 227495, 229063, 230204, 231159, 232212, 233244, 233937, 234509, 235665, 237582, 239482, 240579, 241018, 241513, 242380, 243402, 244344, 245084, 245373, 244970, 244048, 243158, 242766, 243084, 244220, 246163, 248533, 250680, 252152, 252974, 253449, 253860, 254320, 254795, 255253, 255838, 256770, 257949, 258907, 259349, 259559, 259976, 260553, 260914, 261060, 261447, 262332, 263438, 264405, 265214, 265992, 266726]
49678B66726O49O69P75P55N45L63M06O73J052J344J254O84Mk71q5J55K14K93N29
49659B76734O27K50m00p40m41K81R23J093P13O8l85m64n02r00j422j275j37J186
49641B75209J487N49o14r91o46k98k70k92k24l30p14j002q54m42r2J97N41P45
49623B71959N73K64L09P44J165J423J812K387K661K286J680J588K263L363M390
49608B98867M920M679L873L302L614M443M767M242L658L911M866N661N847N894
49594C62544O525P773Q847Q873P808O564O110O593P472Q374R343J0279J0732J0516
49580D78353J0175J0414J1347J2668J4141J5560J6473J6632J6575J7113J8271
49569F37722J9323J9902K0388K1057K1527K1474K1270K1403K1701K1724K1610
$$ y = [266726, 267375, 268044, 268819, 269574, 270119, 270482, 270888, 271561, 272613, 273957, 275211, 275895, 275899, 275628, 275543, 275698, 275912, 276205, 276734, 277361, 277611, 277211, 276471, 276030, 276311, 277234, 278327, 279040, 279108, 278723, 278259, 277757, 276857, 275435, 274160, 274023, 275209, 276696, 277245, 276631, 275640, 274994, 274696, 274426, 274134, 273910, 273580, 272866, 271864, 271010, 270568, 270476, 270673, 271214, 271959, 272532, 272796, 273105, 273849, 275014, 276437, 278249, 280636, 283297, 285583, 287263, 288851, 291114, 294477, 298867, 303787, 308466, 312339, 315641, 319255, 323698, 328465, 332707, 336365, 340276, 345142, 350803, 356650, 362544, 369069, 376842, 385689, 394562, 402370, 408934, 415044, 421637, 429109, 437483, 446826, 457105, 467837, 478353, 488528, 498942, 510289, 522957, 537098, 552658, 569131, 585763, 602338, 619451, 637722, 657045, 676947, 697335, 718392, 739919, 761393, 782663, 804066, 825767, 847491, 869101]
49558H69101K1876K2502K2832K2485K1821K1284K0695J9471J7415J4999J2872
49547A087353J1235R682P677N146K549L56j461l281n295p248q650r161q863q263
49533A071776p957q106q218p660o326m791l675l021k226o27J802M404O546Q320
49519A040241J0319J2721J4976J6544J7633J8808K0103K0928K0791J9784J8359
49508A231207J6910J5609J4340J2706J0365P472M616K180p7k684n812r115j2112
49495A285605j4687j7098j9622k2195k4545k6522k8163k9394k9998l0002k9878
49484A013501l0040l0234k9813k8563k6950k5590k4689k4189k4020k4016k3652
49473G21745k2422k0485j8723j7783j7271j6218j4438j2843j2253j2273j1958
$$ y = [869101, 890977, 913479, 936311, 958796, 980617, 1001901, 1022596, 1042067, 1059482, 1074481, 1087353, 1098588, 1108270, 1115947, 1121093, 1123642, 1123998, 1122537, 1119256, 1113961, 1106713, 1098063, 1088902, 1080039, 1071776, 1063819, 1055713, 1047495, 1039835, 1033509, 1028718, 1025043, 1022022, 1019796, 1019169, 1020971, 1025375, 1031921, 1040241, 1050560, 1063281, 1078257, 1094801, 1112434, 1131242, 1151345, 1172273, 1193064, 1212848, 1231207, 1248117, 1263726, 1278066, 1290772, 1301137, 1308609, 1313225, 1315405, 1315328, 1312644, 1306832, 1297717, 1285605, 1270918, 1253820, 1234198, 1212003, 1187458, 1160936, 1132773, 1103379, 1073381, 1043379, 1013501, 983461, 953227, 923414, 894851, 867901, 842311, 817622, 793433, 769413, 745397, 721745, 699323, 678838, 660115, 642332, 625061, 608843, 594405, 581562, 569309, 557036, 545078]
49462E45078j1173j0568j0360j0007r174q194p254n990m433l534l954m925n148
49449D50364m445l662l231k798k111j408q89n68o49j292j996j960j156k74M53
49434D24378J547L212M865O054P101Q367R504R837Q988O809L443j85k594l083
49420D88243k381j577q68J52J552L038M442N661O414O625O707P042P547Q124R078
$$ y = [545078, 533905, 523337, 512977, 502970, 493796, 485602, 478348, 472358, 467925, 464391, 460437, 455512, 450364, 445919, 442257, 439026, 436228, 434117, 432709, 431820, 431252, 430603, 429311, 427315, 425355, 424199, 423925, 424378, 425925, 429137, 434002, 440056, 447157, 455524, 465028, 474865, 483853, 490662, 494105, 493920, 491326, 488243, 485862, 484285, 483417, 483569, 485121, 488159, 492601, 498262, 504676, 511301, 518008, 525050, 532597, 540721, 549799]
$$ [...]
##END NTUPLES=NMR SPECTRUM
##END=
