##TITLE=NES1086_santa_lucia_9885092_Txwg26jtW8
##JCAMPDX= 6.0         $$ Bruker NMR JCAMP-DX V2.0
##DATA TYPE= NMR SPECTRUM
##DATA CLASS= NTUPLES
##ORIGIN= BRUKER
##OWNER= Administrator
$$ 1.72 TOPSPIN		Version 2.1
$$ 2016-08-27 17:45:28.961 -0500  Administrator@X
$$ Compression mode = diff/dup
##.OBSERVE FREQUENCY= 400.02188249412
##.OBSERVE NUCLEUS= ^1H
##.ACQUISITION MODE= SIMULTANEOUS (DQD)
##.ACQUISITION SCHEME= undefined
##.AVERAGES= 64
##.DIGITISER RES= 22
##SPECTROMETER/DATA SYSTEM= spect
##.PULSE SEQUENCE= noesygpps1d.comp
##.SOLVENT NAME= COFFEE_meoh
##.SHIFT REFERENCE= INTERNAL, COFFEE_meoh, 1, 14.96133
##AUDIT TRAIL= $$ (NUMBER, WHEN, WHO, WHERE, PROCESS, VERSION, WHAT)
$$ ##TITLE= Audit trail, TOPSPIN		Version 2.1
$$ ##JCAMPDX= 5.01
$$ ##ORIGIN= Bruker BioSpin GmbH
$$ ##OWNER= Administrator
$$ $$ E:\/data/COFFEE/nmr/NES1086_santa_lucia_9885092_Txwg26jtW8/22/pdata/1/auditp.txt
$$ ##AUDIT TRAIL=  $$ (NUMBER, WHEN, WHO, WHERE, PROCESS, VERSION, WHAT)
(   1,<2016-08-27 17:45:23.804 -0500>,<Administrator>,<X>,<go>,<TOPSPIN 2.1>,
      <created by zg
	started at 2016-08-27 17:33:53.961 -0500,
	POWCHK enabled, PULCHK disabled,
       configuration hash MD5:
       21 0F 79 D6 B3 7B B4 F6 88 20 88 DB 03 48 BD 9F
       data hash MD5: 64K
       9D 2C A8 4E 9E 63 A8 04 AD 1C E3 AD 49 0C E9 FB>)
(   2,<2016-08-27 17:45:26.929 -0500>,<Administrator>,<X>,<proc1d>,<TOPSPIN 2.1>,
      <Start of raw data processing
       efp LB = 0.3 FT_mod = 6 PKNL = 1 PHC0 = 0 PHC1 = 0 SI = 128K 
       data hash MD5: 128K
       02 6F E4 90 D6 B2 BA 6F 94 77 58 7A 85 2C 8D E1>)
(   3,<2016-08-27 17:45:27.820 -0500>,<Administrator>,<X>,<proc1d>,<TOPSPIN 2.1>,
      <pk PHC0 = -82.6886 PHC1 = 0 
       data hash MD5: 128K
       BF 36 3E B3 0B BC 4D C6 6A 21 82 28 4A 03 5D 21>)
(   4,<2016-08-27 17:45:28.195 -0500>,<Administrator>,<X>,<proc1d>,<TOPSPIN 2.1>,
      <abs ABSG = 1 
       data hash MD5: 128K
       E7 E3 BE 49 E5 AE ED C8 B4 55 30 E8 5C 6F 4B A4>)
(   5,<2016-08-27 17:45:28.289 -0500>,<Administrator>,<X>,<proc1d>,<TOPSPIN 2.1>,
      <abs ABSG = 2 
       data hash MD5: 128K
       6E 30 5C 1D 10 C3 C9 05 7D 32 66 E7 59 9D 9E B9>)
(   6,<2016-08-27 17:45:28.383 -0500>,<Administrator>,<X>,<proc1d>,<TOPSPIN 2.1>,
      <abs ABSG = 3 
       data hash MD5: 128K
       57 79 3E 63 06 E2 7E 53 3F 02 C9 BA 5D E5 C2 A5>)
(   7,<2016-08-27 17:45:28.476 -0500>,<Administrator>,<X>,<proc1d>,<TOPSPIN 2.1>,
      <abs ABSG = 4 
       data hash MD5: 128K
       71 0C 67 49 14 2C 2F 58 D3 0F 9F A2 18 75 B1 C5>)
(   8,<2016-08-27 17:45:28.586 -0500>,<Administrator>,<X>,<proc1d>,<TOPSPIN 2.1>,
      <abs ABSG = 5 
       data hash MD5: 128K
       F8 C4 57 30 F4 CB DB 00 C4 8C CB 76 78 8E 44 6D>)
$$ ##END=
$$ 
$$ $$ hash MD5
$$ $$ 1C 00 4C 26 49 AE C4 AE 7F 11 87 44 B6 94 86 70
##$RELAX= 
##$RELAX= 
##$RELAX= 
##$RELAX= 
##$RELAX= 
##$RELAX= 
##$RELAX= 
##$RELAX= 
$$ Bruker specific parameters
$$ --------------------------
##$DU= <E:\>
##$EXPNO= 22
$$ [...]
##$TP07= 0
##$TPNAME0= <>
##$TPNAME1= <>
##$TPNAME2= <>
##$TPNAME3= <>
##$TPNAME4= <>
##$TPNAME5= <>
##$TPNAME6= <>
##$TPNAME7= <>
##$TPOAL= (0..7)
0.5 0.5 0.5 0.5 0.5 0.5 0.5 0.5
##$TPOFFS= (0..7)
0 0 0 0 0 0 0 0
##$TUNHIN= 0
##$TUNHOUT= 0
##$TUNXOUT= 0
##$USERA1= <user>
##$USERA2= <user>
##$USERA3= <user>
##$USERA4= <user>
##$USERA5= <user>
##$V9= 5
##$VALIST= <valist>
##$VCLIST= <CCCCCCCCCCCCCCC>
##$VD= 0
##$VDLIST= <DDDDDDDDDDDDDDD>
##$VPLIST= <PPPPPPPPPPPPPPP>
##$VTLIST= <TTTTTTTTTTTTTTT>
##$WBST= 2048
##$WBSW= 25
##$XGAIN= (0..3)
0 0 0 0
##$XL= 0
##$YL= 0
##$YMAX_a= 6344901
##$YMIN_a= -12115042
##$ZGOPTNS= <>
##$ZL1= 120
##$ZL2= 120
##$ZL3= 120
##$ZL4= 120
##$ABSF1= 14.96133
##$ABSF2= -5.596851
##$ABSG= 5
##$ABSL= 3
##$ALPHA= 0
##$AQORDER= 0
##$ASSFAC= 0
##$ASSFACI= 0
##$ASSFACX= 0
##$ASSWID= 0
##$AUNMP= <proc_prof1d_extract.lims>
##$AXLEFT= 0
##$AXNAME= <>
##$AXNUC= <1H>
##$AXRIGHT= 0
##$AXTYPE= 0
##$AXUNIT= <>
##$AZFE= 0.1
##$AZFW= 0.1
##$BCFW= 0
##$BC_mod= 0
##$BYTORDP= 0
##$COROFFS= 0
##$CY= 15
##$DATMOD= 1
##$DC= 0
##$DFILT= <>
##$DTYPP= 0
##$F1P= 0
##$F2P= 0
##$FCOR= 0.5
##$FTSIZE= 131072
##$FT_mod= 6
##$GAMMA= 0
##$GB= 0
##$INTBC= 1
##$INTSCL= 1
##$ISEN= 128
##$LB= 0.3
##$LEV0= 0
##$LPBIN= 0
##$MAXI= 10000
##$MC2= 0
##$MEAN= 0
##$ME_mod= 0
##$MI= 0
##$NCOEF= 0
##$NC_proc= -2
##$NLEV= 6
##$NOISF1= 0
##$NOISF2= 0
##$NSP= 0
##$NTH_PI= 0
##$NZP= 0
##$OFFSET= 14.96133
##$PC= 1
##$PHC0= -82.6886
##$PHC1= 0
##$PH_mod= 1
##$PKNL= yes
##$PPARMOD= 0
##$PPDIAG= 0
##$PPIPTYP= 0
##$PPMPNUM= 2147483647
##$PPRESOL= 1
##$PSCAL= 4
##$PSIGN= 0
##$PYNMP= <proc.py>
##$REVERSE= no
##$SF= 400.020009505859
##$SI= 131072
##$SIGF1= 0
##$SIGF2= 0
##$SINO= 400
##$SIOLD= 131072
##$SPECTYP= <>
##$SREGLST= <1H.CDCl3>
##$SSB= 0
##$STSI= 131072
##$STSR= 0
##$SW_p= 8223.68421052631
##$SYMM= 0
##$S_DEV= 0
##$TDeff= 65536
##$TDoff= 0
##$TI= <>
##$TILT= no
##$TM1= 0
##$TM2= 0
##$TOPLEV= 0
##$USERP1= <user>
##$USERP2= <user>
##$USERP3= <user>
##$USERP4= <user>
##$USERP5= <user>
##$WDW= 1
##$XDIM= 131072
##$YMAX_p= 347736589
##$YMIN_p= -12602
##$CURPLOT= <Network HP LaserJet P1505>
##$CURPRIN= <$Network HP LaserJet P1505>
##$DFORMAT= <normdp>
##$LAYOUT= <+/1D_H.xwp>
##$LFORMAT= <normlp>
##$PFORMAT= <normpl>
##$SURQMSG= 1
$$ End of Bruker specific parameters
$$ ---------------------------------
##NTUPLES= NMR SPECTRUM
##VAR_NAME=  FREQUENCY,     SPECTRUM/REAL,   SPECTRUM/IMAG
##SYMBOL=    X,             R,               I
##VAR_TYPE=  INDEPENDENT,   DEPENDENT,       DEPENDENT
##VAR_FORM=  AFFN,          ASDF,            ASDF
##VAR_DIM=   131072,        131072,          131072
##UNITS=     HZ,            ARBITRARY UNITS, ARBITRARY UNITS
##FACTOR=    0.0627417313425164, 1,          1
##FIRST=     8223.62146879497, -1526,        -48787
##LAST=      0,             760,             -49720
##MIN=       0,             -12602,          0
##MAX=       8223.62146879497, 347736589,    0
$$ Real data points
##PAGE= N=1
##DATA TABLE= (X++(R..R)), XYDATA
$$ [...]
63576B46611J384K624L593M096M349M733N332N969O539P239Q372R926J1442J2471
63562C34680J3225J4390J6183J7967J9121J9872K0809K1863K2355K1827K0278
63551E42570J7786J4520J1023P765M506R29k202l345k058L28K292L701N199O653
63537F09667O987N397K079k149o417j0100j3069j5756j8638k1593k4020k5548
63525D86840k6340k6619k6288k5101k3131k0806j8560j6572j4852j3441j2389
63514B62741j1500j0338q706o991n779n094m365l205k021j593k181l125l396k562
63500A91885j243n35q07j201n41J305L326M586N137N593O215O783P146P509Q195
63485B43353R237J0305J0965J1046J0720J0092Q890O797L980R16k205n426q287
$$ y = [246611, 247995, 250619, 254212, 258308, 262657, 267390, 272722, 278691, 285230, 292469, 300841, 310767, 322209, 334680, 347905, 362295, 378478, 396445, 415566, 435438, 456247, 478110, 500465, 522292, 542570, 560356, 574876, 585899, 593664, 598170, 599099, 596897, 593552, 591494, 591822, 594114, 597815, 603014, 609667, 616654, 622051, 624130, 621981, 615564, 605464, 592395, 576639, 558001, 536408, 512388, 486840, 460500, 433881, 407593, 382492, 359361, 338555, 319995, 303423, 288571, 275130, 262741, 251241, 240903, 232197, 225206, 219427, 214333, 209968, 206763, 204742, 203149, 200968, 197843, 194447, 191885, 190642, 190107, 189300, 188099, 187558, 188863, 192189, 196775, 201912, 207505, 213720, 220503, 227649, 235158, 243353, 252590, 262895, 273860, 284906, 295626, 305718, 314608, 321405, 325385, 326301, 324096, 318670, 310383]
63472C10383r901j0062r752r966j0516j0495r651q570p681o822n854m995m321
63459B01797l474k249j032k75J69P77J583K151K256K243K582L317M134M794N363
63444B24136O031O896P906Q939R916J0830J1779J2907J4302J5924J7613J9198
63432C66377K0579K1838K3236K5022K7130K9189L0936L2450L3738L4156L2690
63421F77341K8925K3492J7319J0817M120k091o663r023r808j0095j0301j0104
63409G03929r404q879r471j1496j4493j7765k0766k3078k4397k4786k4708k4520
63397D90166k4049k2920k1211j9440j7884j6253j4248j2150j0504r305p863n624
63385C08715k934o76P39J775K987M193M920N472O871R431J2063J3599J4407J5842
$$ y = [310383, 300482, 290420, 280668, 270702, 260186, 249691, 240040, 231470, 223789, 216967, 211113, 206118, 201797, 198323, 196074, 195042, 194767, 194936, 195713, 197296, 199447, 201703, 203946, 206528, 209845, 213979, 218773, 224136, 230167, 237063, 244969, 253908, 263824, 274654, 286433, 299340, 313642, 329566, 347179, 366377, 386956, 408794, 432030, 457052, 484182, 513371, 544307, 576757, 610495, 644651, 677341, 706266, 729758, 747077, 757894, 762014, 759923, 753260, 744237, 734429, 724334, 714033, 703929, 694525, 685646, 676175, 664679, 650186, 632421, 611655, 588577, 564180, 539394, 514686, 490166, 466117, 443197, 421986, 402546, 384662, 368409, 354161, 342011, 331507, 322202, 314339, 308715, 305781, 305105, 305844, 307619, 310606, 314799, 319719, 325191, 332062, 341493, 353556, 367155, 381562, 397404]
63371C97404J8236K0417K1490K2149K3572K5615K6933K6723K5538K4246K2836
63360F55159K0546J6894J2206P255K602j584n208p961r541j0026r790r162q413
63347F52977q139r100j1515j4770j8059k0960k3250k4631k5098k5227k5553k5755
63335D20920k5006k3006k0297j7674j5660j4453j3854j3285j2309j1109j0064
63324B44203q957p251n168l715l382l472l141k579k525k982l107k386j312o63
63310A93563n23l37J75N87M45O7K49J146J966K054J803J936K297K116J318O72
63294B09534N22K29o94j724k154k158k319k527k202j444j094j611k426k669k061
63279A85202j036k34k7l05o14o38m10l2N56J203J398Q92K73K95Q04R98O72M88
$$ y = [397404, 415640, 436057, 457547, 479696, 503268, 528883, 555816, 582539, 608077, 632323, 655159, 675705, 692599, 704805, 712060, 714662, 713078, 707870, 699909, 690368, 680342, 670552, 661390, 652977, 644838, 635738, 624223, 609453, 591394, 570434, 547184, 522553, 497455, 472228, 446675, 420920, 395914, 372908, 352611, 334937, 319277, 304824, 290970, 277685, 265376, 254267, 244203, 235246, 227995, 222827, 219112, 215730, 212258, 209117, 206538, 204013, 201031, 197924, 195538, 194226, 193563, 193040, 192703, 192878, 193465, 193910, 193977, 194226, 195372, 197338, 199392, 201195, 203131, 205428, 207544, 208862, 209534, 210056, 210285, 209591, 207867, 205713, 203555, 201236, 198709, 196507, 195063, 193969, 192358, 189932, 187263, 185202, 184166, 183932, 183905, 183600, 182986, 182348, 181938, 181906, 182462, 183665, 185063, 185955, 186228, 186523, 187327, 188325, 188997, 189485]
63261A89485R02J541J934K211K657L147L421L533L583L411L115L418M827O636
63247B33821P482O924N891N491N931O828P947R243J0472J1278J1743J2387J3566
63234C49004J4925J5678J5351J4277J3264J2886J3097J3490J3770J3916J4038
63223E03696J4210J4384J4387J4110J3635J3072J2157J0365P646M758K525Q56
63211F25801j072l776p076j0653j4359j7753j9932k0360j9553j8432j7183j5272
63199D60380j2523r621p387n943m769l286j270J107L412N310O912Q594J0466J2205
63185D63587J3500J4363J4857J4885J4538J4267J4324J4340J3955J3595J3953
63174F20164J4792J5000J4015J2441J0888Q986O147K800j2k090m385p764j2038
$$ y = [189485, 190387, 191928, 193862, 196073, 198730, 201877, 205298, 208831, 212414, 215825, 218940, 222358, 227185, 233821, 241303, 248227, 254118, 259609, 265540, 272368, 280315, 289558, 300030, 311308, 323051, 335438, 349004, 363929, 379607, 394958, 409235, 422499, 435385, 448482, 461972, 475742, 489658, 503696, 517906, 532290, 546677, 560787, 574422, 587494, 599651, 610016, 617662, 622420, 624945, 625801, 624729, 620953, 613877, 603224, 588865, 571112, 551180, 530820, 511267, 492835, 475652, 460380, 447857, 438236, 430849, 424906, 420137, 416851, 415581, 416688, 420100, 425410, 432322, 440916, 451382, 463587, 477087, 491450, 506307, 521192, 535730, 549997, 564321, 578661, 592616, 606211, 620164, 634956, 649956, 663971, 676412, 687300, 696286, 702433, 705233, 705221, 703131, 698746, 690982, 678944]
63161F78944j6307j9764k2003k3042k3329k3358k3169k2441k1193j9905j8785
63150D45648j7419j5460j3327j1732j0813j0085r081p699o100m623l717l552l799
63137C28241m020m109m082l678k683j460o55m29m29m14l85j84L96J003R75L96
63121C08483J92P81J349J053L34K57R02J295R18M04N73J315J854J724J175Q10
63105C23419J008J663K365K825L075L162K911K285J786K044K985L831M003L694
63091C61056L449L489L642L681L562L501L792M375M677M294L740L918M760N178
63077D17114M639M089M601N800O469O343O339P048Q014Q636R012R513J0261J1388
63063E19266J3166J5356J7053J7753J8161J9284K1023K2446K3266K4274K6130
$$ y = [678944, 662637, 642873, 620870, 597828, 574499, 551141, 527972, 505531, 484338, 464433, 445648, 428229, 412769, 399442, 387710, 376897, 366812, 357731, 350032, 343932, 339309, 335592, 332040, 328241, 324221, 320112, 316030, 312352, 309669, 308209, 307554, 307125, 306696, 306282, 305897, 305713, 306109, 307112, 308087, 308483, 308675, 309456, 310805, 311858, 312192, 312449, 313351, 314646, 315564, 315968, 316541, 317856, 319710, 321434, 322609, 323419, 324427, 326090, 328455, 331280, 334355, 337517, 340428, 342713, 344499, 346543, 349528, 353359, 357362, 361056, 364505, 367994, 371636, 375317, 378879, 382380, 386172, 390547, 395224, 399518, 403258, 407176, 411936, 417114, 421753, 425842, 430443, 436243, 442712, 449055, 455394, 462442, 470456, 479092, 488104, 497617, 507878, 519266, 532432, 547788, 564841, 582594, 600755, 620039, 641062, 663508, 686774, 711048, 737178]
63052G37178K8445L0294L1196L1262L0801L0135K9561K9148K8708K8145K7735
63041A062608K7813K8362K9066K9661K9937K9556K8178K5837K2890J9535J5532
63030A348975J0443M101l161j0613j7462k3320k8382l2945l6707l8787l8679l6999
63018A096464l5002l3343l1583k8929k5160k0646j5809j0908o241k120J523N153
63006H93399R027J2760J5779J8003J9788K1319K2462K3224K3903K4610K5009K4884
62994A134167K4568K4484K4412K3704K2217K0497J8888J6888J3707R162L692k346
62982A334040q943j5970k2881k9153l4748l9863m4369m7816m9954n0920n0842
62971I38581m9596m7192m4120m0974l7944l4909l1920k9175k6671k4299k2272
$$ y = [737178, 765623, 795917, 827113, 858375, 889176, 919311, 948872, 978020, 1006728, 1034873, 1062608, 1090421, 1118783, 1147849, 1177510, 1207447, 1237003, 1265181, 1291018, 1313908, 1333443, 1348975, 1359418, 1363519, 1360358, 1349745, 1332283, 1308963, 1280581, 1247636, 1210929, 1172142, 1133463, 1096464, 1061462, 1028119, 996536, 967607, 942447, 921801, 905992, 895084, 888843, 886723, 888246, 893399, 902426, 915186, 930965, 948968, 968756, 990075, 1012537, 1035761, 1059664, 1084274, 1109283, 1134167, 1158735, 1183219, 1207631, 1231335, 1253552, 1274049, 1292937, 1309825, 1323532, 1332694, 1336386, 1334040, 1325097, 1309127, 1286246, 1257093, 1222345, 1182482, 1138113, 1090297, 1040343, 989423, 938581, 888985, 841793, 797673, 756699, 718755, 683846, 651926, 622751, 596080, 571781, 549509]
62960E49509k0889j9832j8308j6161j4199j3090j2468j1620j0535r617q796p781
62948C86213o886o665o812o397n315m539m623m876m459l559k846k471k212k094
62934C22459k131j925j228n96p43j492k035k030j776j494j224j204j636k062j876
62919B99007j407j619k573l143k615j663j186j003m34L80O79L29N5L72Q71Q32
62903B86882J08p76j219j069o31k16J79O63J065J090Q05O20P11Q64R68J206J530
62886B92780J471Q77L35L91P75Q58O32N66P65R28R65R99P48k64j766k687k402
62869B95971j484q90q46r56r52q84p52m78j68j3M4K47N46N67J43l27k62M69J411
62850B91386K026K108J781J257P79N82P29R44R35P89Q41J049J006O53N80J201
$$ y = [549509, 528620, 508788, 490480, 474319, 460120, 447030, 434562, 422942, 412407, 402790, 393994, 386213, 379327, 372662, 365850, 359453, 354138, 349599, 344976, 340100, 335641, 332082, 329236, 326765, 324553, 322459, 320328, 318403, 317175, 316579, 315836, 314344, 312309, 310279, 308503, 307009, 305785, 304581, 302945, 300883, 299007, 297600, 295981, 293408, 290265, 287650, 285987, 284801, 283798, 283364, 283744, 284423, 284752, 284807, 285179, 286050, 286882, 286990, 286214, 284995, 283926, 283295, 283079, 283258, 283921, 284986, 286076, 286881, 287501, 288212, 289076, 290044, 291250, 292780, 294251, 295128, 295463, 295854, 296629, 297487, 298119, 298685, 299450, 300378, 301343, 302342, 303090, 302826, 301060, 298373, 295971, 294487, 293597, 292751, 291795, 290843, 289959, 289207, 288729, 288561, 288548, 288592, 288839, 289385, 289952, 290095, 289768, 289506, 289975, 291386, 293412, 295520, 297301, 298558, 299337, 299919, 300648, 301592, 302527, 303316, 304157, 305206, 306212, 306865, 307445, 308646]
62834C08646J969J999J242N41M42O42O98P99J406K476L336L320K298P68m84q96
62818C29202n03K10P97J024P72J02n80q16o78o94r69q76J66J868L457M531N185
62801C42198N529N594N676O229P398Q954J0684J2506J4223J5595J6822J8507K0922
62788D90837K3618K6124K8742L2180L6456M0642M3900M6439M9103N2140N4695
62777I24876N5664N4727N2396M9263M5470M0784L4863K7394J8371Q411j431j0431
62765A300357j8664k6565l4119m0761m5922m9489n1682n2768n2948n2399n1227
62754H23813m9397m6809m3459l9596l5665l2069k8939k6268k4119k2518k1069
62743D53905j9109j6433j3691j1762j0800j0212r413q299p013n716m661m123m003
$$ y = [308646, 310615, 312614, 313856, 314397, 314839, 315481, 316179, 316978, 318384, 320860, 324196, 327516, 329814, 330582, 330098, 329202, 328699, 328909, 329706, 330730, 331502, 331604, 331024, 330208, 329530, 328836, 327867, 326991, 327157, 329025, 332482, 337013, 342198, 347727, 353321, 358997, 365226, 372624, 381578, 392262, 404768, 418991, 434586, 451408, 469915, 490837, 514455, 540579, 569321, 601501, 637957, 678599, 722499, 768938, 818041, 870181, 924876, 980540, 1035267, 1087663, 1136926, 1182396, 1223180, 1258043, 1285437, 1303808, 1312219, 1310788, 1300357, 1281693, 1255128, 1221009, 1180248, 1134326, 1084837, 1033155, 980387, 927439, 875040, 823813, 774416, 727607, 684148, 644552, 608887, 576818, 547879, 521611, 497492, 474974, 453905, 434796, 418363, 404672, 392910, 382110, 371898, 362485, 354186, 347173, 341457, 336796, 332673, 328670]
62730C28670l786l133k324j784j380n57Q38K291L343M176N264O571P579Q047Q395
62715C62210R160J0342J1617J2956J4696J6970J9458K1821K4103K6571K9324L2272
62703E91500L5300L8317M1288M4338M7640N0998N3682N4936N4570N2877N0091
62692A115537M6173M0954L4249K5962J6345O099m084j3982k3563l2376l9701m5270
62680A126343m9441n2461n4095n4141n2946n1098m8872m6270m3329m0121l6660
62669E96909l3116k9928k7380k5197k2895k0434j8232j6561j5290j4140j2971
62658C60765j1748j0538r501q692p833o597n139m018l504l238k770k167j866k061
62644B81093k506k865k986k831k392j811j409j435j686j617r14M9N29J74n82r83
$$ y = [328670, 324884, 321751, 319427, 317643, 316263, 315706, 316544, 318835, 322178, 326354, 331618, 338189, 345768, 353815, 362210, 371370, 381712, 393329, 406285, 420981, 437951, 457409, 479230, 503333, 529904, 559228, 591500, 626800, 665117, 706405, 750743, 798383, 849381, 903063, 957999, 1012569, 1065446, 1115537, 1161710, 1202664, 1236913, 1262875, 1279220, 1285319, 1281235, 1267253, 1243690, 1211314, 1171613, 1126343, 1076902, 1024441, 970346, 916205, 863259, 812161, 763289, 717019, 673690, 633569, 596909, 563793, 533865, 506485, 481288, 458393, 437959, 419727, 403166, 387876, 373736, 360765, 349017, 338479, 328978, 320286, 312453, 305856, 300717, 296699, 293195, 289957, 287187, 285020, 283154, 281093, 278587, 275722, 272736, 269905, 267513, 265702, 264293, 262858, 261172, 259555, 258641, 258690, 259219, 259393, 258811, 257828]
62628B57828o79P4Q07J260J485J683J966K257K386K360K412K784L479M334N205
62613B89641N955O431O580O569O617O840P379Q474J0118J1796J2909J3447J3929
62600D06685J4818J6283J8464K1330K4238K6224K6989K7122K7055K6346K4415
62589F59969K1505J8296J4871J0783N968R15l993q756j3222j6938j9768k2078
62577F47552k4076k5385k5625k5124k4586k4255k3736k2583k0828j8911j7287
62566C95156j6067j5008j3827j2523j1260r991q529o978n749n012m494l941l467
62553B78310l194k926k535k379k877l837m521m378l452k267j483j501k024k228
62539B38708j633n93L71J332K556L714M209M190M395N027N564N829O381P546Q866
$$ y = [257828, 257149, 257223, 258030, 259290, 260775, 262458, 264424, 266681, 269067, 271427, 273839, 276623, 280102, 284436, 289641, 295596, 302027, 308607, 315176, 321793, 328633, 336012, 344486, 354604, 366400, 379309, 392756, 406685, 421503, 437786, 456250, 477580, 501818, 528042, 555031, 582153, 609208, 635554, 659969, 681474, 699770, 714641, 725424, 731392, 732307, 728314, 719558, 706336, 689398, 669630, 647552, 623476, 598091, 572466, 547342, 522756, 498501, 474765, 452182, 431354, 412443, 395156, 379089, 364081, 350254, 337731, 326471, 316480, 307951, 300973, 295224, 290212, 285718, 281777, 278310, 275116, 272190, 269655, 267276, 264399, 260562, 256041, 251663, 248211, 245944, 244461, 242960, 240936, 238708, 237075, 236482, 236853, 238185, 240741, 244455, 248664, 252854, 257249, 262276, 267840, 273669, 280050, 287596, 296462]
62524B96462R989J1406J3622J6130J7955J8969J9919K1386K3303K5393K7371K8691
62512E30596K8732K7450K5503K3556K1684J9404J6058J1302N508l86n778j0985
62500F92644j6431k1514k4981k6440k6753k6772k6408k5367k4025k2974k2105
62489D28874k0908j9339j7782j6270j4476j2483j0913j0084r522q566p128n576
62477B75827m216l162k547k434k560k479k025j505j331j571j894j913j509q88
62463B45793l58q6j7N0L14Q25J418J781J681J229Q45R66J697K726L526L788L689
62446B69867L780M375N143N451N129M619M215L490J903k03j767k312k506l125
62432B98059l948m173l645l025k866l094l447l807l941l519k630j788j162l48
$$ y = [296462, 306451, 317857, 331479, 347609, 365564, 384533, 404452, 425838, 449141, 474534, 501905, 530596, 559328, 586778, 612281, 635837, 657521, 676925, 692983, 704285, 709793, 709407, 703629, 692644, 676213, 654699, 629718, 603278, 576525, 549753, 523345, 497978, 473953, 450979, 428874, 407966, 388627, 370845, 354575, 340099, 327616, 316703, 306619, 297097, 288531, 281403, 275827, 271611, 268449, 265902, 263468, 260908, 258429, 256404, 254899, 253568, 251997, 250103, 248190, 246681, 245793, 245435, 245349, 245332, 245382, 245696, 246521, 247939, 249720, 251401, 252630, 253475, 254441, 256138, 258864, 262390, 266178, 269867, 273647, 278022, 283165, 288616, 293745, 298364, 302579, 306069, 307972, 307769, 306002, 303690, 301184, 298059, 294111, 289938, 286293, 283268, 280402, 277308, 273861, 270054, 266113, 262594, 259964, 258176, 257014, 256666]
62418B56666P16J225N25p18j203n98K27N11L70K17J82L77J014J867K229J884J685
62401B67176K619M559O394P235P027O221N348M948N322O158O655O306N411M744
62387C46123M806N459O242O776O892O535N773M951M560M773N273N707O169O968
62373D27007Q041R018R898J1234J3514J6600J9932K3100K6092K9145L2468L5936
62361F61985L9113M1663M3552M4605M4087M1339L6671L1030K4853J8018J0977
62350A037893M933M72l194o996j0870j4420j7948k1849k5548k8047k9273k9991
62338H55162l0605l0928l0916l0712l0038k8486k6447k4799k3719k2620k1293
62327E54599k0175j9351j8381j7309j6837j7017j6826j5628j4166j3372j2938
$$ y = [256666, 257382, 258607, 259132, 258414, 257211, 256613, 256840, 257351, 257721, 257938, 258120, 258497, 259511, 261378, 263607, 265491, 267176, 269795, 274354, 280748, 287983, 295010, 301231, 306579, 311527, 316849, 323007, 329662, 335968, 341379, 346123, 350929, 356388, 362630, 369406, 376298, 382833, 388606, 393557, 398117, 402890, 408163, 413870, 420039, 427007, 435048, 444066, 453964, 465198, 478712, 495312, 515244, 538344, 564436, 593581, 626049, 661985, 701098, 742761, 786313, 830918, 875005, 916344, 953015, 984045, 1008898, 1026916, 1037893, 1042826, 1043298, 1040104, 1033108, 1022238, 1007818, 989870, 968021, 942473, 914426, 885153, 855162, 824557, 793629, 762713, 732001, 701963, 673477, 647030, 622231, 598512, 575892, 554599, 534424, 515073, 496692, 479383, 462546, 445529, 428703, 413075, 398909, 385537, 372599]
62316C72599j1884j0005p944o154m629l364k468j869j403j078q30l18O53J745
62302C23051K548L084L527L751L688L699M064M427M339M016L854L529K458J016
62288C71051L57R07J771J961J509J089J031J223J557K062K703L374M067M952O196
62273D05810P789R497J1125J2798J4821J7211J9725K2399K5656K9586L3537L6854
62261F46808L9637M2291M4676M6276M6847M6243M3878L9172L2401K4455J5947
62250A068631P235q81p642j3464j9514k5924l1436l5203l7867m0254m1994m2277
62238G79410m1257l9737l7907l5395l2292k9233k6493k3753k0828j8007j5557
62227D58951j3424j1484r819q577p810p445p224o776n977n082m316l536k537j441
$$ y = [372599, 360715, 350710, 342766, 336612, 331983, 328619, 326151, 324282, 322879, 321801, 320971, 320653, 321306, 323051, 325599, 328683, 332210, 335961, 339649, 343348, 347412, 351839, 356178, 360194, 364048, 367577, 370035, 371051, 371408, 372315, 374086, 376047, 377556, 378645, 379676, 380899, 382456, 384518, 387221, 390595, 394662, 399614, 405810, 413599, 423096, 434221, 447019, 461840, 479051, 498776, 521175, 546831, 576417, 609954, 646808, 686445, 728736, 773412, 819688, 866535, 912778, 956656, 995828, 1028229, 1052684, 1068631, 1075866, 1074985, 1067343, 1053879, 1034365, 1008441, 977005, 941802, 903935, 863681, 821687, 779410, 738153, 698416, 660509, 625114, 592822, 563589, 537096, 513343, 492515, 474508, 458951, 445527, 434043, 424224, 415647, 407837, 400392, 393168, 386392, 380415, 375333, 371017, 367481, 364944, 363503]
62213C63503m18O57J835K613K478J823J742K749M248N380N992O503P205P968Q542
62198D22820Q889R338J0366J2132J4177J5830J6936J8042J9777K2184K4610K6146
62186F21247K6121K4473K1685J8340J4714J0859O944L338M66j244j403M1K673
62173G48254O004R978J4736J9928K4657K8203L0403L1272L0578K8083K3926J8630
62161A014652J2883P459L009l75l253o254r527j2919j6418k0058k3446k5836k6790
62148H93127k6583k5788k4674k3160k1166j8812j6270j3683j1272r361q106p273
62136F86979o394n250m027l018k223j419m61N24J330J948K602L491M560N520O177
62121F90339O644P202P899Q422Q329P417N940M638M381N520P422Q890R164Q392
$$ y = [363503, 363085, 363742, 365577, 368190, 370668, 372491, 374233, 376982, 381230, 386610, 392602, 399105, 406310, 414278, 422820, 431709, 441047, 451413, 463545, 477722, 493552, 510488, 528530, 548307, 570491, 595101, 621247, 647368, 671841, 693526, 711866, 726580, 737439, 744383, 747721, 748187, 746943, 745540, 745581, 748254, 754258, 764236, 778972, 798900, 823557, 851760, 882163, 913435, 944013, 972096, 996022, 1014652, 1027535, 1034994, 1038003, 1037628, 1034375, 1028121, 1018594, 1005675, 989257, 969199, 945753, 919917, 893127, 866544, 840756, 816082, 792922, 771756, 752944, 736674, 722991, 711719, 702358, 694252, 686979, 680585, 675335, 671308, 668290, 666067, 664648, 664187, 664711, 666041, 667989, 670591, 674082, 678642, 684162, 690339, 696983, 704185, 712084, 720506, 728835, 736252, 742192, 746830, 751211, 756731, 764153, 773043, 782207, 790599]
62107G90599P099N553L857K416J868K472L825N262O469P648R197J1243J3450J5299
62093H86257J6507J7193J7692J8379J9615K1545K3806K5745K7126K8450L0387
62082A132702L3011L5829L8353M0319M1486M1612M0721L9180L7454L5866L4532
62071A551065L3392L2262L1019K9685K8291K6742K4808K2183J8588J4056R186
62060A821277M749R82k435n610q174j0016j1744j3884j6128j7906j9286k0613
62048A701212k1540k1331k0033j8519j7240j5732j3521j0874q309n994l923k197
62036A541999q70J16O55O25M66R97K364L683M090L637K882K077J258O25L28J97
62020A565129J22L54R44J299Q97J94K14J401L332N395P222Q593R540J0515J1921
$$ y = [790599, 797698, 803251, 807108, 809524, 811392, 813864, 817689, 822951, 829420, 837068, 846265, 857508, 870958, 886257, 902764, 919957, 937649, 956028, 975643, 997188, 1020994, 1046739, 1073865, 1102315, 1132702, 1165713, 1201542, 1239895, 1280214, 1321700, 1363312, 1404033, 1443213, 1480667, 1516533, 1551065, 1584457, 1616719, 1647738, 1677423, 1705714, 1732456, 1757264, 1779447, 1798035, 1812091, 1821277, 1826026, 1827008, 1824573, 1818963, 1810789, 1800773, 1789029, 1775145, 1759017, 1741111, 1721825, 1701212, 1679672, 1658341, 1638308, 1619789, 1602549, 1586817, 1573296, 1562422, 1554113, 1548119, 1544196, 1541999, 1541129, 1541245, 1541900, 1542525, 1542991, 1543988, 1546352, 1550035, 1554125, 1557762, 1560644, 1562721, 1563979, 1564604, 1564932, 1565129, 1565251, 1565605, 1566549, 1567848, 1568745, 1568939, 1569153, 1570554, 1573886, 1579281, 1586503, 1595096, 1604636, 1615151, 1627072]
62005A627072J3421J4156J3800J2939J2301J1929J1281R920P921N710L526J053
61993A745029k316o715j1443j5495j8269j9740k0193k0100j9895j9534j8553j6861
61981A555915j5201j4347j4108j3652j2618j1374j0328r601r274r306r173q308
61969A418625o971o117o188o686p065p386p738p688o914n891n384n485n680n647
61955A327785n483n210m638l833l268l296l638l616k860j708p82j88P07K461M640
61940A297073O123O352N922N695N755N590N007M385M100M092M052L740L053K010
61926A362949P70m19j306j642j198R5K094M624P635J1015J4461J7686K0755K3926
61912A461445K7324L0959L4938L9290M3584M7212N0246N3667N8402O4288P0393
$$ y = [1627072, 1640493, 1654649, 1668449, 1681388, 1693689, 1705618, 1716899, 1726819, 1734740, 1740450, 1743976, 1745029, 1742713, 1735998, 1724555, 1709060, 1690791, 1671051, 1650858, 1630758, 1610863, 1591329, 1572776, 1555915, 1540714, 1526367, 1512259, 1498607, 1485989, 1474615, 1464287, 1454686, 1445412, 1436106, 1426933, 1418625, 1411654, 1405537, 1399349, 1392663, 1385598, 1378212, 1370474, 1362786, 1355872, 1349981, 1344597, 1339112, 1333432, 1327785, 1322302, 1317092, 1312454, 1308621, 1305353, 1302057, 1298419, 1294803, 1291943, 1290235, 1289453, 1289265, 1289972, 1292433, 1297073, 1303196, 1309548, 1315470, 1321165, 1326920, 1332510, 1337517, 1341902, 1346002, 1350094, 1354146, 1357886, 1360939, 1362949, 1363719, 1363300, 1361994, 1360352, 1359154, 1359249, 1361343, 1365967, 1373602, 1384617, 1399078, 1416764, 1437519, 1461445, 1488769, 1519728, 1554666, 1593956, 1637540, 1684752, 1734998, 1788665, 1847067, 1911355, 1981748]
61901A981748P6253Q2476Q9977R8912J08503J17714J25781J32115J36119J37222
61891C086820J34972J28737J17551J00566P7770N0001J8371j5904n0847q3544
61881C564493j11298j33007j48972j59491j64281j63546j58835j52206j44687
61872B228170j36151j26477j16182j05858r5725q6015p7221o9508o2340n5237
61862A297456m8569m2975l8179l3108k7325k1614j6911j3241j0111p383n234l496
61850A029310j742O2J455K090K046J486L25j582m134o973r599j1487j2276j2002
61836I76979j1006r591p854n830l626j338J026L390N401O501O291M879K824N86
61822I68632j885m823p881j0175j1345j2151j3526j5262j6243j5902j4744j3365
$$ y = [1981748, 2058001, 2140477, 2230454, 2329366, 2437869, 2555583, 2681364, 2813479, 2949598, 3086820, 3221792, 3350529, 3468080, 3568646, 3646416, 3696417, 3714788, 3698884, 3648037, 3564493, 3453195, 3320188, 3171216, 3011725, 2847444, 2683898, 2525063, 2372857, 2228170, 2092019, 1965542, 1849360, 1743502, 1647777, 1561762, 1484541, 1415033, 1352693, 1297456, 1248887, 1205912, 1167733, 1134625, 1107300, 1085686, 1068775, 1055534, 1045423, 1038040, 1032806, 1029310, 1027568, 1027630, 1029085, 1031175, 1033221, 1034707, 1035032, 1033450, 1029316, 1022343, 1012744, 1001257, 988981, 976979, 965973, 956382, 948528, 942698, 939072, 937734, 938760, 942150, 947551, 954052, 960343, 965222, 968046, 968632, 966747, 961924, 954043, 943868, 932523, 920372, 906846, 891584, 875341, 859439, 844695, 831330]
61810H31330j1713r616p424n541l737j540R06L007M634O264Q156R943J1241J2267
61796H48177J3552J5304J7356J9441K1349K3025K4839K7501L1280L5382L8625
61785A115831M0824M3122M6731N1695N7111O2327O7543P3463Q0681Q9335R9054
61774A827717J09238J19650J30655J42741J55947J70011J84861K00384K15825
61765C257029K29982K41970K51286K57024K57664K51773K38293K15960J83468
61756E384449J40873R0405L5265k1776p8083j30375j75472k11735k38919k56906
61746D537726k65638k66192k60792k51414k39139k24854k09638j94145j78485
61737B447429j63064j48716j35654j23181j10964r9766r0261q1894p3718o5804
$$ y = [831330, 819617, 810001, 802577, 797036, 793299, 791759, 792665, 795672, 800306, 806570, 814726, 824669, 835910, 848177, 861729, 877033, 894389, 913830, 935179, 958204, 983043, 1010544, 1041824, 1077206, 1115831, 1156655, 1199777, 1246508, 1298203, 1355314, 1417641, 1485184, 1558647, 1639328, 1728663, 1827717, 1936955, 2056605, 2187260, 2330001, 2485948, 2655959, 2840820, 3041204, 3257029, 3487011, 3728981, 3980267, 4237291, 4494955, 4746728, 4985021, 5200981, 5384449, 5525322, 5615727, 5650992, 5629216, 5551133, 5420758, 5245286, 5033551, 4794632, 4537726, 4272088, 4005896, 3745104, 3493690, 3254551, 3029697, 2820059, 2625914, 2447429, 2284365, 2135649, 1999995, 1876814, 1765850, 1666084, 1575823, 1493929, 1420211, 1354407]
61727A354407n8890n3062m7677m2425l7564l3226k9232k5680k3058k1591k0950
61716I61052k0736k0836k1252k1889k2592k3174k3365k3001k2145k0873j9147
61705G22042j7168j5527j4599j3940j2823j1290j0145r877j0052r866q988p794
61693E79973p004p090p769q159p675o691o059o090o392o478o136n350m419m019
61679D90642m585n574n950n388m534l976l678l544l790m385m716m359l727l430
61665D29006l374k991k143j185l62L58Q30P03j5p83j042p22r0N70J044J161R73
61648D21938Q44J129J781K422K794K937K896K506J701Q29L71L33L13K04M46J284
61632D44728K204K521K330K373L040M007M857N546O062O126N571M755M196L952
$$ y = [1354407, 1295517, 1242455, 1194778, 1152353, 1114789, 1081563, 1052331, 1026651, 1003593, 982002, 961052, 940316, 919480, 898228, 876339, 853747, 830573, 807208, 784207, 762062, 741189, 722042, 704874, 689347, 674748, 660808, 647985, 636695, 626550, 616673, 606621, 596755, 587767, 579973, 572969, 565879, 558110, 549951, 542276, 535585, 529526, 523436, 517044, 510566, 504430, 499080, 494661, 490642, 486057, 480483, 474533, 469145, 464611, 460635, 456957, 453413, 449623, 445238, 440522, 436163, 432436, 429006, 425632, 422641, 420498, 419313, 418951, 419309, 420139, 420842, 420827, 420044, 419002, 418280, 418190, 418760, 419804, 420965, 421938, 422782, 423911, 425692, 428114, 430908, 433845, 436741, 439247, 440948, 441777, 442148, 442481, 442794, 442998, 443444, 444728, 446932, 449453, 451783, 454156, 457196, 461203, 466060, 471606, 477668, 483794, 489365, 494120, 498316, 502268]
61618E02268L587K689J132r81l409n755p608q841r686j0415j0979j1008j0245
61605D30749q999p986p622p598p298o538n636m872m166l382k659k302k455k926
61591C56310l217k807j653m51m0n02j077j066n36K7M13Q14J381J954K243K196
61575C53989K159K636L685M673M924M624M671N496O438O650O239O091O720P745
61561D26740Q491Q699Q619Q663R057R656J0009R799R206Q712Q507Q293P748P066
61547E49265O775P042P337O960N822M553L760L410L097K655K143J361j16k254
61533F01810m313n576o065o294o575o766o610o010n055m003l137k497j823q57
61519E36229M16K006M026O363Q439R780J0665J1886J3804J6062J8209K0279K2587
$$ y = [502268, 505855, 508544, 509676, 508695, 505286, 499531, 491923, 483082, 473396, 462981, 452002, 440994, 430749, 421750, 413764, 406142, 398544, 391246, 384708, 379072, 374200, 370034, 366652, 363993, 361691, 359236, 356310, 353093, 350286, 348633, 348182, 348142, 347640, 346563, 345497, 344961, 344988, 345401, 346215, 347596, 349550, 351793, 353989, 356148, 358784, 362469, 367142, 372066, 376690, 381361, 386857, 393295, 399945, 406184, 412275, 418995, 426740, 435231, 443930, 452549, 461212, 470269, 479925, 489934, 499733, 508939, 517651, 526158, 534451, 542199, 549265, 556040, 563082, 570419, 577379, 583201, 587754, 591514, 594924, 598021, 600676, 602819, 604180, 604064, 601810, 597497, 591921, 585856, 579562, 572987, 566221, 559611, 553601, 548546, 544543, 541406, 538909, 537086, 536229, 536645, 538651, 542677, 549040, 557479, 567259, 577924, 589810, 603614, 619676, 637885, 658164, 680751]
61506F80751K5287K8285L1411L4537L7622M0792M4281M8184N2315N6271N9551
61495A139287O1696O2575O2424O1341N8681N3395M5214L5206K4827J4595M024
61484A623265p189j8296k7936l5200m0168m3525m5805m6998m6779m5090m2407
61473A223872l9369l6241l2895k9290k5622k2000j8268j4425j0957q407o686n136
61461I74576l292j170J142L813O832R641J1579J2646J3500J4739J6344J7822J8747
61448A096919J9148J9493K0165K0961K1236K0734J9999J9722J9870J9780J8934
61437A316961J7335J5195J2814J0697R252Q212O767M561K213O30l1m38j218k235
61423A400715k834k788k848l997o059p663p980p934q823j0309j0915j0448j0319
$$ y = [680751, 706038, 734323, 765734, 800271, 837893, 878685, 922966, 971150, 1023465, 1079736, 1139287, 1200983, 1263558, 1325982, 1387323, 1446004, 1499399, 1544613, 1579819, 1604646, 1619241, 1623265, 1616076, 1597780, 1569844, 1534644, 1494476, 1450951, 1405146, 1358148, 1311369, 1266279, 1223872, 1184503, 1148262, 1115367, 1086077, 1060455, 1038455, 1020187, 1005762, 994805, 986398, 979712, 974576, 971284, 970114, 971256, 975069, 981901, 991542, 1003121, 1015767, 1029267, 1044006, 1060350, 1078172, 1096919, 1116067, 1135560, 1155725, 1176686, 1197922, 1218656, 1238655, 1258377, 1278247, 1298027, 1316961, 1334296, 1349491, 1362305, 1373002, 1382254, 1390466, 1397233, 1401794, 1404007, 1404637, 1404606, 1404168, 1402950, 1400715, 1397881, 1395093, 1392245, 1388248, 1382189, 1374526, 1366546, 1358612, 1349789, 1339480, 1328565, 1318117, 1307798]
61410A307798j1091j1315r808p823p398q438r073q568q099q559r249r340r216
61397A189821r513r808r316q162o998n762l780r24K137M927P756J1163J5233J9624
61383A196398K3964K8097L2079L6048M0064M4195M8745N4032N9711O4625O7729
61372A695687O9006O9113O8284O5999O1638N5008M6241L5695K4158J2656J776
61361B205261q629j8735k8031l5588m1036m5000m8610n2664n7150o1324o4205
61350A744289o5286o4859o3653o2085o0005n7106n3433m9306m4995m0691l6738
61339A146132l3534l0993k8330k4766k0448j6371j3282j0920q502n727k936m85
61327I49838J652L586N311O971Q910J1149J3096J4185J4679J5333J6369J7268
$$ y = [1307798, 1296707, 1285392, 1275584, 1267761, 1260363, 1251925, 1242852, 1234284, 1226185, 1217626, 1208377, 1199037, 1189821, 1180308, 1170500, 1161184, 1153022, 1146024, 1140262, 1136482, 1135558, 1137695, 1142622, 1150378, 1161541, 1176774, 1196398, 1220362, 1248459, 1280538, 1316586, 1356650, 1400845, 1449590, 1503622, 1563333, 1627958, 1695687, 1764693, 1833806, 1902090, 1968089, 2029727, 2084735, 2130976, 2166671, 2190829, 2203485, 2205261, 2196632, 2177897, 2149866, 2114278, 2073242, 2028242, 1979632, 1926968, 1869818, 1808494, 1744289, 1679003, 1614144, 1550491, 1488406, 1428401, 1371295, 1317862, 1268556, 1223561, 1182870, 1146132, 1112598, 1081605, 1053275, 1028509, 1008061, 991690, 978408, 967488, 958986, 953259, 950323, 949838, 951490, 955076, 960387, 967358, 976268, 987417, 1000513, 1014698, 1029377, 1044710, 1061079, 1078347]
61315A078347J7620J7645J7640J7429J6718J5627J4341J2540R734O157K707o5
61303A226440k497n075p622r487j0395j0708j0920j1197j1431j1598j1856j2301
61291A111353j2777j3009j2894j2537j1997j1255j0438r721q909p568n851m708
61279I89689m683m912m163k646j759j973k126j328m69r06k311k998k156o91J56
61264I56724R4n13j411k419l177l408l206k742j876m19J424L254N030P199J0131
61249I64685J3672J7317K0719K3855K6701K8958L0221L0352K9434K7506K4547
61238A237967K0804J6751J2559P782J813n413j3168k0392k6353l1135l5283l8839
61226A127093m0868m0515l8389l6135l4538l2841l0318k7580k5600k4266k2822
$$ y = [1078347, 1095967, 1113612, 1131252, 1148681, 1165399, 1181026, 1195367, 1207907, 1217641, 1223798, 1226505, 1226440, 1223943, 1218868, 1211246, 1201759, 1191364, 1180656, 1169736, 1158539, 1147108, 1135510, 1123654, 1111353, 1098576, 1085567, 1072673, 1060136, 1048139, 1036884, 1026446, 1016725, 1007816, 1000248, 994397, 989689, 985006, 980094, 975931, 973285, 971526, 969553, 967427, 966099, 965630, 964724, 962413, 959415, 957259, 956568, 956724, 956818, 956305, 954894, 952475, 949298, 945890, 942684, 939942, 938066, 937647, 939071, 942325, 947355, 954554, 964685, 978357, 995674, 1016393, 1040248, 1066949, 1095907, 1126128, 1156480, 1185914, 1213420, 1237967, 1258771, 1275522, 1288081, 1295863, 1297676, 1292263, 1279095, 1258703, 1232350, 1201215, 1165932, 1127093, 1086225, 1045710, 1007321, 971186, 936648, 903807, 873489, 845909, 820309, 796043, 773221]
61215G73221k1234j9957j8708j6651j3813j1178r185p184m702k279n57O99K064
61202F50536L695N525P665R907J1352J1147R405O958M525K509J141K79p39k348
61188G21557m143n347n787n843n799n726n930o740p846q438q198p738p831q537
61174F27654r257r373q688p518o505o226o704p386p661p384o821o284n810n225
61160E26812m392l414k546j913j367q00m58q33k205m371o840r185j1132j2439
61146D64917j2918j2637j2047j1677j1603j1324j0311q678p135o266n895n259
61134C49167l825j920m96r3j94J25R35J385J021O52J310K797L957M277M417N097
61118C68612O170P065P559P842Q183Q812R701J0296R880Q494O994N927M831L050
$$ y = [773221, 751987, 732030, 713322, 696671, 682858, 671680, 662495, 655311, 650609, 648330, 647773, 648472, 650536, 654231, 659756, 667421, 677328, 688680, 699827, 709232, 716190, 720715, 723224, 724365, 724644, 723905, 721557, 717414, 712067, 706280, 700437, 694638, 688912, 682982, 676242, 668396, 659958, 651760, 644022, 636191, 627654, 618397, 609024, 600336, 592818, 586313, 580087, 573383, 565997, 558336, 550952, 544131, 537847, 532037, 526812, 522420, 519006, 516460, 514547, 513180, 512380, 511922, 511089, 508884, 504513, 497673, 488488, 477356, 464917, 451999, 439362, 427315, 415638, 404035, 392711, 382400, 373722, 366587, 360321, 354426, 349167, 345342, 343422, 342926, 342833, 342639, 342764, 343699, 345084, 346105, 346757, 348067, 350864, 354821, 359098, 363515, 368612, 374782, 381847, 389406, 397248, 405431, 414243, 423944, 434240, 444120, 452614, 459608, 465535, 470366, 473416]
61104D73416Q17j044k177k911l582m166m565m821m986n072n137n248n333n215
61090D19976m757l943k974k337k488l223l641k997j526k16J13m87j186j122k16
61075C88976P25R59P14O79Q77P07J86J92J155K285K685K542K599L005L407L675
61059D15368L900L995M029M494N582O588O786O563O824P584Q021P764P213O807
61045E01518O813P673R554J1557J2441J2295J2551J4135J6501J8774K0867K3044
61033F67723K5142K6843K8193K9414L0583L1799L3287L5215L7887M2037M8215
61022A036338N5777O3313P0305P7652Q6388R6960J10168J27704J50996J80187
61012B055788K14841K54991L01056L53757M14699M86170N70359O71247P97616
$$ y = [473416, 474233, 473189, 471012, 468101, 464519, 460353, 455788, 450967, 445981, 440909, 435772, 430524, 425191, 419976, 415219, 411276, 408302, 405965, 403477, 400254, 396613, 393616, 392090, 391874, 391987, 391500, 390314, 389192, 388976, 389701, 390660, 391374, 392053, 392930, 393637, 393823, 394015, 395170, 397455, 400140, 402682, 405281, 408286, 411693, 415368, 419268, 423263, 427292, 431786, 437368, 443956, 450742, 457305, 464129, 471713, 479734, 487498, 494711, 501518, 508331, 516004, 525558, 537115, 549556, 561851, 574402, 588537, 605038, 623812, 644679, 667723, 692865, 719708, 747901, 777315, 807898, 839697, 872984, 908199, 946086, 988123, 1036338, 1092115, 1155428, 1225733, 1303385, 1389773, 1486733, 1596901, 1724605, 1875601, 2055788, 2270629, 2525620, 2826676, 3180433, 3595132, 4081302, 4651661, 5322908, 6120524]
61003F120524R57521J139664J297113J357840J264645J014284O62252K92929j4775
60994A4091997k03683k44063j45458L1322J86211K22781R5169j75052n18451q52357
60984A2488416j108976j251047j276299j210031j088628r44228p98962o66372
60976D143873n52991m58954l80790l15418k61339k17108j80857j51449j28465
60967A496502j10712r6228q4024p4365o6984o0397n3629m7255m1928l7034l1780
60956G92166k6747k3250k1633k1149k1099k1281k1511k1456k0913j9861j8310
60945E54956j6379j4387j2567j0989r861r477r620r570r051q642q808r118q969
60932D17518q567q474q574q331p771p431p410p268o822o341n852n014l862l025
$$ y = [6120524, 7078045, 8217709, 9514822, 10872662, 12137307, 13151591, 13813843, 14106772, 14091997, 13888314, 13644251, 13498793, 13530115, 13716326, 13939107, 14034276, 13859224, 13340773, 12488416, 11379440, 10128393, 8852094, 7642063, 6553435, 5609207, 4810245, 4143873, 3590882, 3131928, 2751138, 2435720, 2174381, 1957273, 1776416, 1624967, 1496502, 1385790, 1289562, 1205538, 1131173, 1064189, 1003792, 950163, 902908, 860980, 823946, 792166, 765419, 742169, 720536, 699387, 678288, 657007, 635496, 614040, 593127, 573266, 554956, 538577, 524190, 511623, 500634, 490773, 481296, 471676, 462106, 453055, 444413, 435605, 426487, 417518, 408951, 400477, 391903, 383572, 375801, 368370, 360960, 353692, 346870, 340529, 334677, 329663, 325801, 322776]
60918C22776k874k966k703k102j603j358j173r95j046j474k092k542k609k344
60904B94895j862j214n19j62n37j429k044j937j576j597j760j285j72N61J48r68
60888B78542j736j619q19J52P44N93q5m89r5O95J075Q67O06Q22J630K891M199
60871B87973M818M222K825J712J471J743J985K098K132J860J137K80l43p71j141
60856C12001j261r54n31l34o8P05J597J723J010L77M41Q14R99J165J501J550R07
60839C21642J31O8O25J023J106J447K158K563K263J822J929K499L010L241L258
60824C48785L105L021L516M683N709N680M728L850L652L795L677L170K528J976
60810D01875J589J322R98M69j32n35p39j026j517j992k260k434k642k772k680
$$ y = [322776, 319902, 316936, 314233, 312131, 310528, 309170, 307997, 307002, 305956, 304482, 302390, 299848, 297239, 294895, 293033, 291819, 291300, 291138, 290601, 289172, 287128, 285191, 283615, 282018, 280258, 278973, 278801, 279362, 279510, 278542, 276806, 275187, 274368, 274520, 275264, 275857, 275772, 275283, 275188, 275883, 276958, 277825, 278431, 279253, 280883, 283774, 287973, 292791, 297013, 299838, 301550, 303021, 304764, 306749, 308847, 310979, 312839, 313976, 314256, 313913, 313142, 312001, 310740, 309786, 309255, 308921, 308853, 309558, 311155, 312878, 313888, 314265, 314706, 315520, 316519, 317684, 319185, 320735, 321642, 321773, 321841, 322466, 323489, 324595, 326042, 328200, 330763, 333026, 334848, 336777, 339276, 342286, 345527, 348785, 351890, 354911, 358427, 363110, 368819, 374499, 379227, 383077, 386729, 390524, 394201, 397371, 399899, 401875, 403464, 404786, 405784, 406253, 406121, 405586, 404847, 403821, 402304, 400312, 398052, 395618, 392976, 390204, 387524]
60795C87524k470k331k258k142k052k155k423k607k564k400k229j899j150m3Q88
60780C59689J082N83J07L25J209K192K854L211L430L627L953M463M843M655M073
60765D00296L875M413M938M545L483K943L473M321M495L983L482L353L316L139
60751D54055L087L467M012M078L446K593K018J503M81r52j986k166k017k126k244
60736D67249j893j499j885k817l077k319j759k433l627l898l006j911j202o92
60722D35231l98p80j731k333k068j584j659k085k127j678j250j096r76p09m08
60707D14349j99j01j87m64o74o05n29r02j637k158k164j904j614j297j143j549
60691C97222k337k622j982j250j419k154k234j306l56l08r85j723k237k511k543
$$ y = [387524, 385054, 382723, 380465, 378323, 376271, 374116, 371693, 369086, 366522, 364122, 361893, 359994, 358844, 358801, 359689, 360771, 361354, 361461, 361786, 362995, 365187, 368041, 371252, 374682, 378309, 382262, 386725, 391568, 396223, 400296, 404171, 408584, 413522, 418067, 421550, 424493, 427966, 432287, 436782, 440765, 444247, 447600, 450916, 454055, 457142, 460609, 464621, 468699, 472145, 474738, 476756, 478259, 478740, 477788, 475802, 473636, 471619, 469493, 467249, 465356, 463857, 461972, 459155, 456078, 453759, 452000, 449567, 445940, 442042, 439036, 437125, 435923, 435231, 434833, 434053, 432322, 429989, 427921, 426337, 424678, 422593, 420466, 418788, 417538, 416442, 415466, 414757, 414349, 414150, 414049, 413862, 413398, 412724, 412119, 411590, 410688, 409051, 406893, 404729, 402825, 401211, 399914, 398771, 397222, 394885, 392263, 390281, 389031, 387612, 385458, 383224, 381918, 381562, 381254, 380269, 378546, 376309, 373798, 371255]
60676C71255k673l575n193o245n551l678k374k511l298l582l113k366j797j594
60662C23705j659j527p69K79P02J80m92m58J95Q56J390K096L006L811M338M552
60646C40205M292L485K535J931J585J082N00L53P14J067J189J602K776M299N226
60631C72841N097M335L744L823M490N360O256P314Q458R109Q806Q025P866Q847
60617D64371J0370J1427J1405J0218Q203O096M601L665K478N41j614l065l577
60604E25119l741m142m793n318n469n388n431n689n846n686n540n867o428o409
60590D49372n544m571m311m658m832m253k925j327j96m7n58p83k91L32M81M49
60574D16338P71J229J263J118J560K603L357L358L172L394L713L525K962K813
$$ y = [371255, 368582, 365007, 359814, 353569, 348018, 344340, 341966, 339455, 336157, 332575, 329462, 327096, 325299, 323705, 322046, 320519, 319750, 320029, 320731, 320911, 320419, 319961, 320156, 321012, 322402, 324498, 327504, 331315, 335653, 340205, 344497, 347982, 350517, 352448, 354033, 355115, 355615, 355968, 356682, 357749, 358938, 360540, 363316, 367615, 372841, 377938, 382273, 386017, 389840, 394330, 399690, 405946, 413260, 421718, 430827, 439633, 447658, 455524, 464371, 474741, 486168, 497573, 507791, 515994, 522090, 526691, 530356, 532834, 533375, 531761, 528696, 525119, 521378, 517236, 512443, 507125, 501656, 496268, 490837, 485148, 479302, 473616, 468076, 462209, 455781, 449372, 443828, 439257, 434946, 430288, 425456, 421203, 418278, 416951, 416755, 416708, 416150, 415367, 415076, 415408, 415889, 416338, 417109, 418338, 419601, 420719, 422279, 424882, 428239, 431597, 434769, 438163, 441876, 445401, 448363, 451176]
60560D51176L556M845N956O506O761P298Q304R336R970J0527J1731J3635J5388
60547E64989J6309J6736J7483J8748J9830J9860J8431J5619J1663O788J219m642
60535G23033j0144j4611j7672j9266j9399j8059j5513j2432r560p261n449l907
60523E69760k560j517q73n58m16l88m67m47J07J426L257N222P298R744J2669J5964
60507F18221J9592K3588K7833L2229L7005M2417M8127N3323N7663O1702O6194
60496A087894P1444P7657Q5509R5822J08764J23668J39416J54418J66141J71198
60486B281931J66447J50124J22072Q3349L6144j5812o7320j13005j49050j73876
60476B321004j87418j90304j83982j71101j54903j37936j21511j06228r2528q0537
$$ y = [451176, 454732, 459577, 465533, 472039, 478800, 486098, 494402, 503738, 513708, 524235, 535966, 549601, 564989, 581298, 598034, 615517, 634265, 654095, 673955, 692386, 708005, 719668, 726456, 727675, 723033, 712889, 698278, 680606, 661340, 641941, 623882, 608369, 595937, 586377, 579116, 573667, 569760, 567200, 565683, 564810, 564252, 563836, 563448, 562981, 562534, 562641, 564067, 567324, 572546, 579844, 589588, 602257, 618221, 637813, 661401, 689234, 721463, 758468, 800885, 849012, 902335, 959998, 1021700, 1087894, 1159338, 1236995, 1322504, 1418326, 1527090, 1650758, 1790174, 1944592, 2110733, 2281931, 2448378, 2598502, 2720574, 2803923, 2840067, 2824255, 2756935, 2643930, 2494880, 2321004, 2133586, 1943282, 1759300, 1588199, 1433296, 1295360, 1173849, 1067621, 975093, 894556]
60466H94556o9930o0359n1885m4758l8995l4387l0675k7508k4407k1123j7934
60455D72595j5348j3511j2134j0919r782q711p700o886o472o404o260n673m781
60442C58014m088l880l911l665k921j899j011n88q61j892l375m624n023m523l645
60427C12108k977k732k683k391j564l57P08J275J496J686J781J431N73l79j004
60412C06971j224j125o99L4Q03J234J217J053J210J890K834L588L957M083M095
60397C29921L911L508L123K926K779K492K052J386K72j069j720j008N05J500J303
60382C51881K25j170k394k846k258j378j280j862j985j318q90j330j676q24O83
60367C31578J384Q67Km13l25J09Q10J581K235K805L273L271K695K224K571L513
$$ y = [894556, 824626, 764267, 712382, 667624, 628629, 594242, 563567, 536059, 511652, 490529, 472595, 457247, 443736, 431602, 420683, 410901, 402190, 394490, 387604, 381132, 374728, 368468, 362795, 358014, 353926, 350046, 346135, 342470, 339549, 337650, 336639, 336051, 335190, 333298, 329923, 325299, 320276, 315753, 312108, 309131, 306399, 303716, 301325, 299761, 299404, 300112, 301387, 302883, 304569, 306350, 307781, 308354, 307975, 306971, 305747, 304622, 303923, 303957, 304760, 305994, 307211, 308264, 309474, 311364, 314198, 317786, 321743, 325826, 329921, 333832, 337340, 340463, 343389, 346168, 348660, 350712, 352098, 352370, 351301, 349581, 348573, 349078, 350578, 351881, 352106, 350936, 348542, 345696, 343438, 342060, 340780, 338918, 336933, 335615, 334725, 333395, 331719, 330895, 331578, 332962, 333829, 333831, 333418, 333093, 333202, 334012, 335593, 337828, 340633, 343906, 347177, 349872, 352096, 354667, 358180]
60351C58180M294M675M811M467L370K140J764K067J781L66j161j601r55p0M11
60336C84539K94l21r47j008n48k65m94p50o59o67j345k411l125l275l192l014
60320C62812k501j576n84M1J25j25k33J78R69J618J837J786J643J384J047P71
60304C69192L55o38k060l037l072k771k928l403l517l180k860k701k409j932j500
60289C33539j032j53J029J785J636R38M45N40R93J195P23p5k59N52J462J425Q02
60272C45545R28K103L118L116K843L324M152M135L230K709L357M483M957M555
60258C92555L850L264K721K137J787K034K789L463L578L380L502M018M259L930
60244D37267L884N198P614R735J0775J1408J2556J4058J5144J5781J6802J8788
$$ y = [358180, 362474, 367149, 371960, 376427, 379797, 381937, 383701, 385768, 387549, 387915, 386754, 385153, 384198, 384128, 384539, 384833, 384512, 383565, 382557, 382009, 381744, 381250, 380500, 379841, 379174, 377829, 375418, 372293, 369018, 365826, 362812, 360311, 358735, 358151, 358192, 358317, 358192, 357959, 358137, 359106, 360724, 362561, 364347, 365990, 367374, 368421, 369192, 369547, 368909, 366849, 363812, 360740, 357969, 355041, 351638, 348121, 344941, 342081, 339380, 336971, 335039, 333539, 332507, 332354, 333383, 335168, 336804, 337742, 338187, 338727, 339720, 340915, 341638, 341563, 341304, 341856, 343318, 344743, 345545, 346473, 348576, 351694, 354810, 357653, 360977, 365129, 369264, 372494, 375203, 378560, 383043, 388000, 392555, 396405, 399669, 402390, 404527, 406314, 408348, 411137, 414600, 418178, 421558, 425060, 429078, 433337, 437267, 441151, 446349, 453963, 463698, 474473, 485881, 498437, 512495, 527639, 543420, 560222, 579010]
60232E79010K1382K3857K5870K7580K9336L1405L3669L5566L6557L6787L6948
60221I17967L7303L7148L5564L2485K8663K4780K0867J6682J2226P708L264j089
60209A173568n262r031j2197j4669j6426j7433j7609j6834j5025j2268q925n526
60197A022363k397O77M316Q924J4128J9004K2972K6365L0027L4318L8698M2223
60185A261618M4410M5443M5611M4716M2218L8028L2894K7717K2571J6714R704
60174A631644K092n232j2081j8879k5611l1389l5221l6861l6786l5667l4036l2119
60162A329854k9652k6064k1173j5586j0053m602J254P476J3205J7793K1580K5206
60150A309238K8406L0100K9681K7638K4743K1177J6843J2146P866M290J034k234
$$ y = [579010, 600392, 624249, 650119, 677699, 707035, 738440, 772109, 807675, 844232, 881019, 917967, 955270, 992418, 1027982, 1060467, 1089130, 1113910, 1134777, 1151459, 1163685, 1171393, 1174657, 1173568, 1168306, 1159275, 1147078, 1132409, 1115983, 1098550, 1080941, 1064107, 1049082, 1036814, 1027889, 1022363, 1019966, 1020643, 1024959, 1033883, 1048011, 1067015, 1089987, 1116352, 1146379, 1180697, 1219395, 1261618, 1306028, 1351471, 1397082, 1441798, 1484016, 1522044, 1554938, 1582655, 1605226, 1621940, 1631644, 1633736, 1628504, 1616423, 1597544, 1571933, 1540544, 1505323, 1468462, 1431676, 1396009, 1361973, 1329854, 1300202, 1274138, 1252965, 1237379, 1227326, 1222724, 1223978, 1231454, 1244659, 1262452, 1284032, 1309238, 1337644, 1367744, 1397425, 1425063, 1449806, 1470983, 1487826, 1499972, 1507838, 1512128, 1513162, 1510928]
60138A510928n284p744r567j0769j1023r877p286l608Q35N898J1387J7073K2974
60125A503937K9321L6167M3220N0211N7209O4455P2000P9648Q7143R4254J00735
60114B218300J06279J10545J13209J14061J13089J10356J05748R8849Q9216P6910
60104C256562O2738M7899L3190J8554L389j2682k9399m6022o1574p4943q5200
60093C112512r2178r6583r9224j00208r9040r5363q9313q1462p2656o3719n4850
60082B167916m5466l5146k4645j5356p806j315M775J0276J4820J8546K1554K3320
60070B131473K3347K2045K0219J7908J4480R770M377j215p101j3290j9174k4078
60058B178761k7988l1467l5040l8853m2629m5720m7546m8203m8394m8497m7973
$$ y = [1510928, 1505644, 1497900, 1488333, 1477564, 1466541, 1456664, 1449378, 1445770, 1446605, 1452503, 1463890, 1480963, 1503937, 1533258, 1569425, 1612645, 1662856, 1720065, 1784520, 1856520, 1936168, 2023311, 2117565, 2218300, 2324579, 2435124, 2548333, 2662394, 2775483, 2885839, 2991587, 3090436, 3179652, 3256562, 3319300, 3367199, 3400389, 3418943, 3422332, 3409650, 3380251, 3334229, 3272655, 3197712, 3112512, 3020334, 2923751, 2824527, 2724319, 2625279, 2529916, 2440603, 2359141, 2286485, 2222766, 2167916, 2122450, 2087304, 2062659, 2047303, 2039497, 2038182, 2042957, 2053233, 2068053, 2086599, 2108153, 2131473, 2154820, 2176865, 2197084, 2214992, 2229472, 2239242, 2243619, 2242404, 2235303, 2222013, 2202839, 2178761, 2150773, 2119306, 2084266, 2045413, 2002784, 1957064, 1909518, 1861315, 1812921, 1764424, 1716451]
60047A716451m5972m2359l7746l2749k7587k2350j7229j2279p251j788M281J0857
60035A484279J7568K3830K9170L3594L7475M0969M3744M5366M5667M4490M1369
60024A887521L5893K8438K0082J1679L270n368j4000k2033k9161l5477m0977m5355
60012A794512m8399n0241n0994n0402m8127m4257l9266l3573k7443k1270j5547
60001A364993j0380n305J54N885J1415J6600K1773K7219L2888L8702M4787N1027
59989A599758N6720O1055O3756O4826O3825O0096N3843M6282L8304K9570J9461
59978B157496Q495j999j1423k0328k9199l7545m4519m9818n3488n5294n4831n2164
59966A755383m7985m3086l7838l2126k5687j8639j1665n412L20O329J2795J8801
$$ y = [1716451, 1670479, 1628120, 1590374, 1557625, 1530038, 1507688, 1490459, 1478180, 1470929, 1469141, 1473422, 1484279, 1501847, 1525677, 1554847, 1588441, 1625916, 1666885, 1710629, 1755995, 1801662, 1846152, 1887521, 1923414, 1951852, 1971934, 1983613, 1986883, 1981515, 1967515, 1945482, 1916321, 1880844, 1839867, 1794512, 1746113, 1695872, 1644878, 1594476, 1546349, 1502092, 1462826, 1429253, 1401810, 1380540, 1364993, 1354613, 1349308, 1349462, 1355347, 1366762, 1383362, 1405135, 1432354, 1465242, 1503944, 1548731, 1599758, 1656478, 1717533, 1781289, 1846115, 1909940, 1970036, 2023879, 2070161, 2108465, 2138035, 2157496, 2165991, 2163992, 2152569, 2132241, 2103042, 2065497, 2020978, 1971160, 1917672, 1862378, 1807547, 1755383, 1707398, 1664312, 1626474, 1594348, 1568661, 1550022, 1538357, 1532945, 1533265, 1539594, 1552389, 1571190]
59954A571190K3514K7344L1307L5483L8847M0615M1055M0755L9705L7528L4285
59943A961628L0579K6870K3015J8543J3380Q244M259J982R00Q3o04j57K622Q023
59929B099367J5282K3355L1620M0050M8917N8368O8173P7832Q6827R4766J01338
59918B745895J06273J09233J09617J06567R9483Q8504P4291N7365L7948J6505
59908C551681n979k8343m9571o8574q4171r5693j03442j08127j09942j08599j04213
59897B685027r7629q9789q1108p1674o1736n1702m1830l2183k2814j3759m937
59886B115866L704J1920J9352K5979L2143L7886M2518M5136M5456M3835M0492
59875B464287L5147K7557J8050P211m646j7284l0023m1883n2334o1419o9032p4545
$$ y = [1571190, 1594704, 1622048, 1653355, 1688838, 1727685, 1768300, 1809355, 1850110, 1889815, 1927343, 1961628, 1992207, 2019077, 2042092, 2060635, 2074015, 2082259, 2086518, 2088500, 2089400, 2089483, 2088879, 2088722, 2091344, 2099367, 2114649, 2138004, 2169624, 2209674, 2258591, 2316959, 2385132, 2462964, 2549791, 2644557, 2745895, 2852168, 2961401, 3071018, 3177585, 3277068, 3365572, 3439863, 3497228, 3535176, 3551681, 3545702, 3517359, 3467788, 3399214, 3315043, 3219350, 3115908, 3007781, 2897839, 2789240, 2685027, 2587398, 2497609, 2416501, 2344827, 2283091, 2231389, 2189559, 2157376, 2134562, 2120803, 2115866, 2119570, 2131490, 2150842, 2176821, 2208964, 2246850, 2289368, 2334504, 2379960, 2423795, 2464287, 2499434, 2526991, 2545041, 2552252, 2547606, 2530322, 2500299, 2458416, 2406082, 2344663, 2275631, 2201086]
59863B201086p7445p8058p7182p5234p2129o7931o3141n8214n3170m7818m2161
59852A488603l6325l0287k4096j8343j4163j2375j2555j3092j2490j0673q938
59841A295266q478r196j0110j0660j1161j2043j3223j4371j5337j5994j6033j5395
59829A143265j4605j4240j4213j4034j3606j3133j2395j0849q667o912o273o315
59817A008023o337o339o483o212m827k753j133k50P55K423M196N485O660Q341
59803A001549J0382J2217J3801J5484J7221J8594J9475K0064K0362K0127J9325
59792A188601J8122J6542J4564J2512J0753R149P369N745N102N595O501P394Q898
59779A316847J1780J5896K0581K5596L1089L6938M2842M8927N5606O2852P0226
$$ y = [2201086, 2123641, 2045583, 1968401, 1893167, 1821038, 1753107, 1689966, 1631752, 1578582, 1530764, 1488603, 1452278, 1421991, 1397895, 1379552, 1365389, 1353014, 1340459, 1327367, 1314877, 1304204, 1295266, 1286788, 1277592, 1267482, 1256822, 1245661, 1233618, 1220395, 1206024, 1190687, 1174693, 1158660, 1143265, 1128660, 1114420, 1100207, 1086173, 1072567, 1059434, 1047039, 1036190, 1027523, 1020611, 1014338, 1008023, 1001686, 995347, 988864, 982652, 977825, 975072, 973939, 973689, 974444, 976867, 981063, 986548, 993208, 1001549, 1011931, 1024148, 1037949, 1053433, 1070654, 1089248, 1108723, 1128787, 1149149, 1169276, 1188601, 1206723, 1223265, 1237829, 1250341, 1261094, 1270243, 1277612, 1283357, 1288459, 1294054, 1300555, 1307949, 1316847, 1328627, 1344523, 1365104, 1390700, 1421789, 1458727, 1501569, 1550496, 1606102, 1668954, 1739180]
59768A739180P7630Q5542R4297J03507J12299J19637J24115J23756J16444J00715
59758B797122P6389M4999R805k5024n5861q0554r8127j08123j10608j06628r8189
59747B245201q7530p6400o5743n5718m6038l6570k7677j9869j3170p125j339M280
59735A812302R831J5582K1594K7533L3097L8411M3778M9310N5082O1449O8771
59724B236740P6914Q5437R4195J03405J13113J23177J33824J45668J58824J72444
59714C443741J85539J97958K10035K21450K31008K37484K40179K38704K32797
59705E438895K22751K09626J94717J78897J62756J47175J33324J22022J13179
59696F923342J05938R9293R2582Q5528P7878O9122N8665M6251L2172J7043J584
$$ y = [1739180, 1816810, 1902352, 1996649, 2100156, 2212455, 2332092, 2456207, 2579963, 2696407, 2797122, 2873511, 2918510, 2928315, 2903291, 2847430, 2766876, 2668749, 2560626, 2450018, 2343390, 2245201, 2157671, 2081271, 2015528, 1959810, 1913772, 1877202, 1849525, 1829656, 1816486, 1809361, 1808022, 1812302, 1822133, 1837715, 1859309, 1886842, 1919939, 1958350, 2002128, 2051438, 2106520, 2167969, 2236740, 2313654, 2399091, 2493286, 2596691, 2709804, 2832981, 2966805, 3112473, 3271297, 3443741, 3629280, 3827238, 4037273, 4258723, 4489731, 4727215, 4967394, 5206098, 5438895, 5661646, 5871272, 6065989, 6244886, 6407642, 6554817, 6688141, 6810163, 6923342, 7029280, 7128573, 7221155, 7306683, 7384561, 7453683, 7512348, 7558599, 7590771, 7607814, 7609398]
59685G609398j3306k6512l7067m4614m9388n1679n1366m7935m0867l0077j6121
59674G200466N8J7721L6788N7508P9672J02298J24290J45176J64996J83556K00039
59663H312568K13252K21893K24580K20126K07971J88028J59948J22991P7174K4317
59653I972848l2509r0341j46761j99209k44811k81134l06817l21463l25546l20532
59643G703725l08404k90686k68464k43597k19105j97773j81095j70321j67631
59634E656649j74757j90323k09739k28063k42244k50728k52406k47027k35931
59625C625431k21267k04605j86770j68614j51102j34720j19557j06013r4686q5389
59615B152708p6872o8035n9107n1237m5055m0060l5385l0756k6517k2927j9772
$$ y = [7609398, 7596092, 7569580, 7532513, 7487899, 7438511, 7386832, 7335466, 7287531, 7246664, 7216587, 7200466, 7200524, 7218245, 7255033, 7312541, 7392213, 7494511, 7618801, 7763977, 7928973, 8112529, 8312568, 8525820, 8747713, 8972293, 9192419, 9400390, 9588418, 9748366, 9871357, 9948531, 9972848, 9940339, 9849998, 9703237, 9504028, 9259217, 8978083, 8671266, 8349803, 8024257, 7703725, 7395321, 7104635, 6836171, 6592574, 6373469, 6175696, 5994601, 5824280, 5656649, 5481892, 5291569, 5081830, 4853767, 4611523, 4360795, 4108389, 3861362, 3625431, 3404164, 3199559, 3012789, 2844175, 2693073, 2558353, 2438796, 2332783, 2238097, 2152708, 2075836, 2007801, 1948694, 1897457, 1852402, 1812342, 1776957, 1746201, 1719684, 1696757, 1676985]
59604A676985j6763j4058j2201j1506j1704j2264j2973j4068j5774j7813j9488
59593A518373k0330k0526k0596k0733k0696k0386k0111k0085j9941j9113j7558
59582A298298j5786j4236j2964j1822j0650r304p794o351n098l819k373j110l18
59569A196673N70K439N131P374Q323Q505Q893R815J1203J3138J5436J7245J7986
59556A322731J8390J9756K2289K5040K7405K9896L3219L7341M1735M6019N0103
59545A673924N4154N8714O4371P0928P7102Q1289Q2434Q0225P4976O7754O0216
59534B446087N3768M8753M4608M0638L6407L1675K6339K0523J4414P964R93o425
59522B765744j3770k0507k6546l2167l7423m1884m4975m6551m6816m5845m3415
$$ y = [1676985, 1660222, 1646164, 1633963, 1622457, 1610753, 1598489, 1585516, 1571448, 1555674, 1537861, 1518373, 1498043, 1477517, 1456921, 1436188, 1415492, 1395106, 1374995, 1354910, 1334969, 1315856, 1298298, 1282512, 1268276, 1255312, 1243490, 1232840, 1223536, 1215742, 1209391, 1204293, 1200474, 1198101, 1196991, 1196673, 1197243, 1199682, 1204813, 1212187, 1220510, 1229015, 1237908, 1247723, 1258926, 1272064, 1287500, 1304745, 1322731, 1341121, 1360877, 1383166, 1408206, 1435611, 1465507, 1498726, 1536067, 1577802, 1623821, 1673924, 1728078, 1786792, 1851163, 1922091, 1999193, 2080482, 2162916, 2243141, 2318117, 2385871, 2446087, 2499855, 2548608, 2593216, 2633854, 2670261, 2701936, 2728275, 2748798, 2763212, 2771176, 2772169, 2765744, 2751974, 2731467, 2704921, 2672754, 2635331, 2593447, 2548472, 2501921, 2455105, 2409260, 2365845]
59511B365845l9447l4189k7760j9838j0270J85J0374K0084L0276M1660N3440O3944
59499B454304P2312P9096Q5120R0078R2515R0986Q5049P5177O2047M6126K7847
59488C260657P887j2895l3590n3168p0498q4642r5174j02021j05106j04434j00477
59477B506539r4280q6982p9181p0772o1365n1040m0636l1061k2236j3199l539
59466A952248N831J3811K0576K7085L3348L8237M1108M2617M3487M3341M1361
59455B303050L7484L2148K5340J6721O472m639j5925k6962l7291m6575n4969o2655
59443B172199o8993p2860p3997p3485p2621p1766p0503o8368o5214o1220n6945
59432A416227n3040m9603m6042m1869l7327l2984k9052k5450k2240j9529j7030
$$ y = [2365845, 2326398, 2292209, 2264449, 2244611, 2234341, 2234526, 2244900, 2264984, 2295260, 2336920, 2390360, 2454304, 2526616, 2605712, 2690832, 2780910, 2873425, 2964411, 3049460, 3124637, 3186684, 3232810, 3260657, 3268544, 3255649, 3222059, 3168891, 3098393, 3013751, 2918577, 2816556, 2711450, 2607016, 2506539, 2412259, 2325277, 2246096, 2175324, 2113959, 2062919, 2022283, 1991222, 1968986, 1955787, 1952248, 1958079, 1971890, 1992466, 2019551, 2052899, 2091136, 2132244, 2174861, 2218348, 2261689, 2303050, 2340534, 2372682, 2398022, 2414743, 2421215, 2416576, 2400651, 2373689, 2336398, 2289823, 2234854, 2172199, 2103206, 2030346, 1956349, 1882864, 1810243, 1738477, 1667974, 1599606, 1534392, 1473172, 1416227, 1363187, 1313584, 1267542, 1225673, 1188346, 1155362, 1126310, 1100860, 1078620, 1059091, 1042061]
59421A042061j4256j1078p694m100p8M161P697R490R073O671L000q61l791n182
59407A035113n115l826j304K284N947Q221Q172N931K223k184o527r975j1877j2069
59393A015014j0837q711o281l905j400J645N073Q011R886J1236J3042J5438J7711
59380A065922J9487K1212K3271K5423K7473K9862L3024L6569L9770M2631M5840
59369A410484M9835N4535N9852O5824P2164P8449Q4995R2949J03083J14935J27409
59358B314514J39844J52115J64122J75670J86574J96293K03691K07635K07833
59349C948291K04759J98763J89827J78131J64327J49024J32404J14572R5979P7181
59339E453258N8305L8996J8761k716k5489m9312p3749r8397j22964j46917j69097
$$ y = [1042061, 1027805, 1016727, 1009033, 1004933, 1004855, 1009016, 1016713, 1026203, 1035276, 1041947, 1044947, 1044086, 1040295, 1035113, 1029998, 1026172, 1024868, 1027152, 1033099, 1041320, 1049492, 1055423, 1057646, 1055462, 1048935, 1038960, 1027083, 1015014, 1004177, 995466, 989185, 985280, 983880, 985525, 990598, 998609, 1008495, 1019731, 1032773, 1048211, 1065922, 1085409, 1106621, 1129892, 1155315, 1182788, 1212650, 1245674, 1282243, 1322013, 1364644, 1410484, 1460319, 1514854, 1574706, 1640530, 1712694, 1791143, 1876138, 1969087, 2072170, 2187105, 2314514, 2454358, 2606473, 2770595, 2946265, 3132839, 3329132, 3532823, 3740458, 3948291, 4153050, 4351813, 4541640, 4719771, 4884098, 5033122, 5165526, 5280098, 5376077, 5453258, 5511563, 5550559, 5569320, 5566604, 5541115, 5491803, 5418054, 5319657, 5196693, 5049776, 4880679]
59328D880679j87943k02181k11368k15667k15319k10475k01641j89997j76940
59319C069148j63244j48959j34185j19621j06025r3504q1728p0669o0623n1532
59309B039058m2918l4548k6672j9391j2421n878p35K090K950L140L460L613L183
59296A914931K633K968M677P248R713J1475J2566J3258J3603J3434J2747J1873
59284B031126J1224J1037J1324J1826J1981J1306J0094R393J0010J1702J3686
59273B154709J5615J7636J9696K1415K2628K3521K4087K4041K3302K2150K0528
59262B389328J7715J3076O984O69m849r504j4016j9022k4314k8837l1686l3057
59250B262487l3860l4423l4080l2241k9353k6379k3728k1198j8746j6713j5335
$$ y = [4880679, 4692736, 4490555, 4279187, 4063520, 3848201, 3637726, 3436085, 3246088, 3069148, 2905904, 2756945, 2622760, 2503139, 2397114, 2303610, 2221882, 2151213, 2090590, 2039058, 1996140, 1961592, 1934920, 1915529, 1903108, 1897230, 1896495, 1898585, 1901535, 1904675, 1908135, 1911748, 1914931, 1917564, 1920532, 1925209, 1932457, 1942170, 1953645, 1966211, 1979469, 1993072, 2006506, 2019253, 2031126, 2042350, 2053387, 2064711, 2076537, 2088518, 2099824, 2109918, 2119311, 2129321, 2141023, 2154709, 2170324, 2187960, 2207656, 2229071, 2251699, 2275220, 2299307, 2323348, 2346650, 2368800, 2389328, 2407043, 2420119, 2427103, 2427772, 2422923, 2413419, 2399403, 2380381, 2356067, 2327230, 2295544, 2262487, 2228627, 2194204, 2160124, 2127883, 2098530, 2072151, 2048423, 2027225, 2008479, 1991766, 1976431]
59239A976431j4448j3741j2949j1856j0499r406r241j0111j1412j2511j3277j3878
59227A833102j4379j4729j4961j5108j5006j4384j3158j1513r637p435m634j150
59215A697008K733O658J0595J4857J9730K5216L1205L7758M5086N3319O2329P1765
59203B078259Q1198R0351R9154J07504J14871J20278J22674J21311J15874J06459
59193C157933R3385P6853N6800L3473Q087j7608m2515o6471q9019j08541j23161
59182B979216j32325j36913j37992j36055j31376j24438j15849j06187r6062q6009
59172A776010p6276o7056n8833n2059m6393m0862l5010k9427k4882k1298j7917
59161A305997j4269j0573p279m603k509r15K25J061K014L664O174Q895J0854J1778
$$ y = [1976431, 1961983, 1948242, 1935293, 1923437, 1912938, 1903532, 1894291, 1884180, 1872768, 1860257, 1846980, 1833102, 1818723, 1803994, 1789033, 1773925, 1758919, 1744535, 1731377, 1719864, 1710227, 1702792, 1698158, 1697008, 1699741, 1706399, 1716994, 1731851, 1751581, 1776797, 1808002, 1845760, 1890846, 1944165, 2006494, 2078259, 2159457, 2249808, 2348962, 2456466, 2571337, 2691615, 2814289, 2935600, 3051474, 3157933, 3251318, 3328171, 3384971, 3418444, 3426531, 3408923, 3366408, 3299937, 3210918, 3102377, 2979216, 2846891, 2709978, 2571986, 2435931, 2304555, 2180117, 2064268, 1958081, 1862019, 1776010, 1699734, 1632678, 1573845, 1521786, 1475393, 1434531, 1399521, 1370094, 1345212, 1323914, 1305997, 1291728, 1281155, 1273876, 1269273, 1266764, 1265849, 1266074, 1267135, 1269149, 1272813, 1278987, 1287882, 1298736, 1310514]
59147A310514J2349J3321J4695J6016J7153J8420J9953K1460K2535K3101K3370
59136A512887K3590K3850K4021K3820K3076K1982K1022K0474K0061J9154J7420
59125A751357J5253J3500J2732J2765J2920J2710J2297J2331J3332J5116J6858
59114A901171J7909J8534J9579K1323K2974K3604K3264K2704K2197K1281J9693
59103B134233J7960J6690J5764J4629J3195J2000J1621J2288J4019J6755K0212
59092B299366K3842K7165K9995L2319L4032L4930L4933L4224L3037L1322K8730
59081B643895K4940K0020J4318Q087J288o228j4451k3177l2122m0989m9413n6986
59069B489182o3383o8540p2571p5506p7190p7537p6768p5206p2951p0004o6677
$$ y = [1310514, 1322863, 1336184, 1350879, 1366895, 1384048, 1402468, 1422421, 1443881, 1466416, 1489517, 1512887, 1536477, 1560327, 1584348, 1608168, 1631244, 1653226, 1674248, 1694722, 1714783, 1733937, 1751357, 1766610, 1780110, 1792842, 1805607, 1818527, 1831237, 1843534, 1855865, 1869197, 1884313, 1901171, 1919080, 1937614, 1957193, 1978516, 2001490, 2025094, 2048358, 2071062, 2093259, 2114540, 2134233, 2152193, 2168883, 2184647, 2199276, 2212471, 2224471, 2236092, 2248380, 2262399, 2279154, 2299366, 2323208, 2350373, 2380368, 2412687, 2446719, 2481649, 2516582, 2550806, 2583843, 2615165, 2643895, 2668835, 2688855, 2703173, 2711260, 2712548, 2706320, 2691869, 2668692, 2636570, 2595581, 2546168, 2489182, 2425799, 2357259, 2284688, 2209182, 2131992, 2054455, 1977687, 1902481, 1829530, 1759526, 1692849]
59058A692849o3443o0345n6912n2866m8508m4268m0311l6800l4083l2163l0439
59047A192711k8457k6506k4846k2913k0102j7052j5089j4356j3471j1292q142
59036I90485n037k523o69O00J777L674O473R269J1096J1920J2225J2168J1738
59023A063196J1192J0595R327O865L794J277l52j708l153m302m806m874m774m393
59009A077884l584k517j450m90J74K10m41j307j851k057k442l562n576q138j0657
58994A034196j2728j4308j5464j6041j5820j4901j3708j2620j1765j1061j0276
58983H85504r183p936p077o826o513n234l074j136k63j81j53O5K52L54N74J020
58967H40193J605K291L106L928M462M558M388M265M383M720N059N099M613L668
$$ y = [1692849, 1629406, 1569061, 1512149, 1459283, 1410775, 1366507, 1326196, 1289396, 1255313, 1223150, 1192711, 1164254, 1137748, 1112902, 1089989, 1069887, 1052835, 1037746, 1023390, 1009919, 998627, 990485, 985448, 982925, 982256, 982856, 984633, 988307, 994780, 1004049, 1015145, 1027065, 1039290, 1051458, 1063196, 1074388, 1084983, 1094310, 1101175, 1104969, 1106246, 1105894, 1104186, 1101033, 1096731, 1091925, 1087051, 1082277, 1077884, 1074300, 1071783, 1070333, 1069843, 1070017, 1070227, 1069786, 1068479, 1066628, 1064571, 1062129, 1058567, 1052991, 1044853, 1034196, 1021468, 1007160, 991696, 975655, 959835, 944934, 931226, 918606, 906841, 895780, 885504, 876321, 868385, 861308, 854482, 847969, 842735, 839661, 838525, 838262, 838081, 837928, 837993, 838245, 838599, 839173, 840193, 841798, 844089, 847195, 851123, 855585, 860143, 864531, 868796, 873179, 877899, 882958, 888057, 892670, 896338]
58953H96338K636J859J289N56m44j147p72P76K682M058M767N248N867O680P659
58938I38052Q677R386R519R328R380R850J0354J0582J0721J1107J1801J2775J4195
58925A075727J6206J8561K0829K2890K4982K7246K9541L1726L3933L6406L9179
58914A377226M2054M4854M7570N0383N3576N7418O1964O6947P1955P6798Q1671
58903B032416Q6902R2543R8299J03829J09083J14310J19790J25567J31456J37323
58893C151518J43172J48859J53779J57134J58557J58131J55695J50526J42026
58884D519397J30276J15487R7329P5519N0992K5581M41k4476m9130p2403r2943
58873D776070j10344j24918j36675j45304j50862j53863j54723j53656j51034
$$ y = [896338, 898974, 900833, 902122, 902678, 902234, 901087, 900315, 901091, 903773, 907831, 912598, 917846, 923713, 930393, 938052, 946729, 956115, 965634, 974962, 984342, 994192, 1004546, 1015128, 1025849, 1036956, 1048757, 1061532, 1075727, 1091933, 1110494, 1131323, 1154213, 1179195, 1206441, 1235982, 1267708, 1301641, 1338047, 1377226, 1419280, 1464134, 1511704, 1562087, 1615663, 1673081, 1735045, 1801992, 1873947, 1950745, 2032416, 2119318, 2211861, 2310160, 2413989, 2523072, 2637382, 2757172, 2882739, 3014195, 3151518, 3294690, 3443549, 3597328, 3754462, 3913019, 4071150, 4226845, 4377371, 4519397, 4649673, 4765160, 4862489, 4938008, 4989000, 5014581, 5015022, 4990546, 4941416, 4869013, 4776070, 4665726, 4540808, 4404133, 4258829, 4107967, 3954104, 3799381, 3645725, 3494691]
58864C494691j47312j42571j36590j29471j21884j14621j08067j02060r6073q9726
58854B306316q3338p7789p3537p0042o6460o2627n8850n5076n0934m6481m2208
58843A618974l8247l4222l0047k6258k3238k0619j7803j4750j1925r620p631n575
58831A379039l365j345J12J116K178L479M537N058N708P427J0061J2440J3946
58818A440391J5292J7469K0490K3632K6464K9134L1805L4396L6917L9791M3626
58807A759407M8643N4309N9751O4635O9507P5007Q1000Q6973R3076J00124J08410
58796B600842J17222J25691J33613J41091J47914J53743J58451J61753J62767
58787C903087J60542J54921J46453J35429J21448J03978Q3033N9139L2976N310
$$ y = [3494691, 3347379, 3204808, 3068218, 2938747, 2816863, 2702242, 2594175, 2492115, 2396042, 2306316, 2222978, 2145189, 2071652, 2001610, 1935150, 1872523, 1813673, 1758597, 1707663, 1661182, 1618974, 1580727, 1546505, 1516458, 1490200, 1466962, 1446343, 1428540, 1413790, 1401865, 1392245, 1384614, 1379039, 1375674, 1374329, 1374441, 1375557, 1377735, 1381214, 1385751, 1390809, 1396517, 1403944, 1414005, 1426445, 1440391, 1455683, 1473152, 1493642, 1517274, 1543738, 1572872, 1604677, 1639073, 1675990, 1715781, 1759407, 1808050, 1862359, 1922110, 1986745, 2056252, 2131259, 2212259, 2299232, 2392308, 2492432, 2600842, 2718064, 2843755, 2977368, 3118459, 3266373, 3420116, 3578567, 3740320, 3903087, 4063629, 4218550, 4365003, 4500432, 4621880, 4725858, 4808891, 4868030, 4901006, 4906316]
58777D906316k2741m9793p4773r7412j17875j35862j50436j60928j67651j71345
58767C757500j72207j70119j65618j59938j53927j47467j40111j31837j22986
58758B393290j13975j05291r7361r0163q3349p6881p1126o6089o1151n5886n0644
58747A521374m5887m1431l6866l2343k8365k4998k1877j8862j6172j3937j2056
58736A228580j0571r692r463r661j0162j1115j2708j4896j7381j9709k1449k2410
58724A059363k2727k2665k2365k1865k1166k0179j8759j7037j5618j5169j5812
58713H46001j6935j7661j7487j6602j5694j5354j5607j6021j6170j5857j5048
58702F67565j3876j2680j1727j0891r910q899q217p854p383o641n990n714n616
$$ y = [4906316, 4883575, 4833782, 4759009, 4661597, 4543722, 4407860, 4257424, 4096496, 3928845, 3757500, 3585293, 3415174, 3249556, 3089618, 2935691, 2788224, 2648113, 2516276, 2393290, 2279315, 2174024, 2076663, 1986500, 1903151, 1826270, 1755144, 1689055, 1627904, 1572018, 1521374, 1475487, 1434056, 1397190, 1364847, 1336482, 1311484, 1289607, 1270745, 1254573, 1240636, 1228580, 1218009, 1208317, 1198854, 1189193, 1179031, 1167916, 1155208, 1140312, 1122931, 1103222, 1081773, 1059363, 1036636, 1013971, 991606, 969741, 948575, 928396, 909637, 892600, 876982, 861813, 846001, 829066, 811405, 793918, 777316, 761622, 746268, 730661, 714640, 698470, 682613, 667565, 653689, 641009, 629282, 618391, 608481, 599582, 591365, 583511, 576128, 569487, 563497, 557783, 552167]
58689E52167n396n045m668m263l953m021m479m934n115n208n387n365m696l309
58675D86328j509K55J564K361L149M433N872O612O604O793P677Q505Q423P637
58661E54704O664N226K820q9k513m270n846p217p773p450o961o791o727o532o297
58646E00948n955n118l722k240j026N2J119J891K072J799J495J526K030K763L075
58631E00709K470J268L76L31R37J845K959M121M895N025M850M998N790P054Q356
58616E55984R389J0210J1156J2350J3415J3936J4046J4349J5292J6896J8959K1238
58604G27220K3476K5593K7772L0126L2439L4543L6658L8974M1165M2821M4181
58593A104968M5852M7846M9486N0099M9279M6624M1987L5936K9253K1916J3311
$$ y = [552167, 546771, 541726, 537058, 532795, 528842, 524821, 520342, 515408, 510293, 505085, 499698, 494333, 489637, 486328, 484819, 485074, 486638, 488999, 492148, 496581, 502453, 509065, 515669, 522462, 530139, 538644, 547067, 554704, 561368, 566594, 569414, 569325, 566812, 562542, 556696, 549479, 541706, 534256, 527295, 520504, 513777, 507245, 500948, 494993, 489875, 486153, 483913, 482887, 482939, 484058, 485949, 488021, 489820, 491315, 492841, 494871, 497634, 500709, 503179, 504447, 504823, 505154, 506091, 507936, 510895, 515016, 519911, 524936, 529786, 534784, 540574, 547628, 555984, 565373, 575583, 586739, 599089, 612504, 626440, 640486, 654835, 670127, 687023, 705982, 727220, 750696, 776289, 804061, 834187, 866626, 901169, 937827, 976801, 1017966, 1060787, 1104968, 1150820, 1198666, 1248152, 1298251, 1347530, 1394154, 1436141, 1472077, 1501330, 1523246, 1536557]
58582A536557L536o270j5141k3024l0001l5612l9480m1994m3686m4384m3550m1217
58570A175734l8035l4532l0804k6819k2654j8474j4545j1165q387n921l518j303
58558I59577M05J471J950J883J200k78k770o278j0310j4124j7261j9657k1252
58545H74556k1916k1831k1545k1393k1154k0435j9094j7173j4787j2288j0275
58534F72665r038q246p340o121m794l672k963k641k390j951j570j797k678l534
58520F13930l735l396l067l061l404m117n136o061o392o055n487n171n221n303
58506E48324m895l693j927k27R46J642K169K646K958L078L295M019N266O408O731
58491E76740O336O191O958Q026Q195P186O009N770O554P531P747O773M965L213
$$ y = [1536557, 1540093, 1533823, 1518682, 1495658, 1465657, 1430045, 1390565, 1348571, 1304885, 1260501, 1216951, 1175734, 1137699, 1103167, 1072363, 1045544, 1022890, 1004416, 989871, 978706, 970319, 964398, 960880, 959577, 959982, 961453, 963403, 965286, 966486, 966208, 963438, 957160, 946850, 932726, 915465, 895808, 874556, 852640, 830809, 809264, 787871, 766717, 746282, 727188, 710015, 695228, 682940, 672665, 663627, 655381, 648041, 641920, 637126, 633454, 630491, 627850, 625460, 623509, 621939, 620142, 617464, 613930, 610195, 606799, 603732, 600671, 597267, 593150, 588014, 581953, 575561, 569506, 564019, 558848, 553627, 548324, 543429, 539736, 537809, 537582, 538528, 540170, 542339, 544985, 547943, 551021, 554316, 558335, 563601, 570009, 576740, 583076, 589267, 596225, 604251, 612446, 619632, 625641, 631411, 637965, 645496, 653243, 660016, 664981, 668194]
58477F68194K134J486O86k86r89j461k312l732n053n665n808o074o528o766o555
58462F21271o025n400m824m335l836l288k953l081l285k765j384n4L16q1l39J6
58446E79953O95J299J801K401L155L884M384M721N256O199P235P861Q035Q164
58432F45043Q517R006R487R872R964R669R362R434R424Q315N896L181J188p4j074
58417G47210j865k251k306k170j689o78O94K096L347M232M528M503M876N876O830
58402G73233P214P537Q483R654R974R186Q104P385O721N440L426J265k51o94l25
58387H56352R6J9l36k74N78J867K898L325L496M104N325O502O892O619O367O298
58371I10128N858M850L995M128N201O444P175P203O828O582O679O737O374O077
$$ y = [668194, 670328, 671814, 672500, 672214, 671225, 669764, 667452, 663720, 658667, 653002, 647194, 641120, 634592, 627826, 621271, 615246, 609846, 605022, 600687, 596851, 593563, 590610, 587529, 584244, 581479, 580095, 580041, 580357, 580276, 579937, 579953, 580648, 581947, 583748, 586149, 589304, 593188, 597572, 602293, 607549, 613748, 620983, 628844, 636879, 645043, 653560, 662566, 672053, 681925, 691889, 701558, 710920, 720354, 729778, 738093, 743989, 747170, 748358, 748284, 747210, 745345, 743094, 740788, 738618, 736929, 736251, 736945, 739041, 742388, 746620, 751148, 755651, 760527, 766403, 773233, 780447, 787984, 796467, 806121, 816095, 825281, 833385, 840770, 847491, 852931, 856357, 857622, 857371, 856677, 856352, 856448, 856467, 856131, 855857, 856435, 858302, 861200, 864525, 868021, 872125, 877450, 883952, 890844, 897463, 903830, 910128, 915986, 920836, 924831, 928959, 934160, 940604, 947779, 954982, 961810, 968392, 975071, 981808, 988182, 994259]
58357I94259O719Q231R553J0110J0449J1098J1775J2237J2962J4209J5177J5102
58345A131881J4527J4588J5410J6102J6090J5534J4643J3417J2062J1010J0419
58334A285683J0084R723R123Q238P508P702R009J0607J1581J1941J2288J2904
58322A406391J3681J4537J5398J6069J6653J7693J9399K1163K2361K3233K4335
58311A610913K5522K6185K6250K6298K6763K7510K8028K7734K6412K4612K3320
58300A899547K2871K2686K2267K1889K1957K2391K3058K4130K5542K6806K7779
58289B160923K8910L0273L1298L1966L3198L5267L6965L7272L6902L7162L8239
58278B538375L9726M1884M5127M9048N3184N7868O3066O7335O9483P0528P2360
$$ y = [994259, 1000978, 1009209, 1018762, 1028872, 1039321, 1050419, 1062194, 1074431, 1087393, 1101602, 1116779, 1131881, 1146408, 1160996, 1176406, 1192508, 1208598, 1224132, 1238775, 1252192, 1264254, 1275264, 1285683, 1295767, 1305490, 1314613, 1322851, 1330359, 1338061, 1347070, 1357677, 1369258, 1381199, 1393487, 1406391, 1420072, 1434609, 1450007, 1466076, 1482729, 1500422, 1519821, 1540984, 1563345, 1586578, 1610913, 1636435, 1662620, 1688870, 1715168, 1741931, 1769441, 1797469, 1825203, 1851615, 1876227, 1899547, 1922418, 1945104, 1967371, 1989260, 2011217, 2033608, 2056666, 2080796, 2106338, 2133144, 2160923, 2189833, 2220106, 2251404, 2283370, 2316568, 2351835, 2388800, 2426072, 2462974, 2500136, 2538375, 2578101, 2619985, 2665112, 2714160, 2767344, 2825212, 2888278, 2955613, 3025096, 3095624, 3167984]
58267C167984P5102P7442P9014Q0607Q2337Q3363Q3462Q3302Q3135Q2614Q1991
58256D060353Q2186Q3580Q5850Q8884R2831R7413J02238J07516J13496J19681
58246E034028J25666J32108J39735J48025J56164J64482J73596J83021J92249
58237F449074K02330K14511K28059K41359K54514K68927K84987L02218L21013
58228H766992L42042L64572L87680M12551M41295M74007N09388N47730N90782
58219A2837039O39086O92058P50273Q15270Q87730R68358J059905J165563J286192
58210B1101474J422003J576129J753654J958747K196478K476469K811122L211964
58202C8508040L691789M268053M958544N774782O723973P814611R055380J0454713
$$ y = [3167984, 3243086, 3320528, 3399542, 3480149, 3562486, 3645849, 3729311, 3812613, 3895748, 3978362, 4060353, 4142539, 4226119, 4311969, 4400853, 4493684, 4591097, 4693335, 4800851, 4914347, 5034028, 5159694, 5291802, 5431537, 5579562, 5735726, 5900208, 6073804, 6256825, 6449074, 6651404, 6865915, 7093974, 7335333, 7589847, 7858774, 8143761, 8445979, 8766992, 9109034, 9473606, 9861286, 10273837, 10715132, 11189139, 11698527, 12246257, 12837039, 13476125, 14168183, 14918456, 15733726, 16621456, 17589814, 18649719, 19815282, 21101474, 22523477, 24099606, 25853260, 27812007, 30008485, 32484954, 35296076, 38508040, 42199829, 46467882, 51426426, 57201208, 63925181, 71739792, 80795172, 91249885]
58194I1249885J2030887J3817870J5850848J8150430K0720158K3504832K6251181
58187B21576091K8352523K8886725K6947483K2088800J4575888N309079m463919
58180C43272670j3471269k0692171k5551944k7983564k8327303k7133282k4977847
58173A75135290k2352865j9619448j7004007j4624541j2528559j0721154r180838
58166F9103878p874037o768172n834927n046810m378052l809232l326636k917187
58158B9148825k567629k267763k010311j787838j593178j422286j273220j142686
58150A5083914j026669r23652q33816p55460o85473o22973n69195n23822m84379
58141H658475m49316m18744l91917l66738l42234l19159k97760k77187k57456
$$ y = [91249885, 103280772, 117098642, 132949490, 151099920, 171820078, 195324910, 221576091, 249928614, 278815339, 305762822, 327851622, 342427510, 347736589, 343272670, 329801401, 309109230, 283557286, 255573722, 227246419, 200113137, 175135290, 152782425, 133162977, 116158970, 101534429, 89005870, 78284716, 69103878, 61229841, 54461669, 48626742, 43579932, 39201880, 35392648, 32066012, 29148825, 26581196, 24313433, 22303122, 20515284, 18922106, 17499820, 16226600, 15083914, 14057245, 13133593, 12299777, 11544317, 10858844, 10235871, 9666676, 9142854, 8658475, 8209159, 7790415, 7398498, 7031760, 6689526, 6370367, 6072607, 5795420, 5537964]
58132E537964k39872k24978k11795j99462j87981j77189j66552j56252j47086
58123C826797j39098j31586j24415j18065j12502j07198j02058r7233r2448q7680
58113B714514q3808q1105p7976p2943o7228o3235o0956n8150n4006n0326m8558
58102A996223m7781m6314m3759m0672l7484l4346l1215k7795k4200k1568k1071
58091A620018k2367k4101k5565k6821k7610k7640k7622k8437k9513k9608k9053
58080A321681k9397l0886l2125l2297l1902l1088k9261k6710k4842k4047k3081
58069A006045k1188j9183j7747j6335j4610j3355j2921j2296j0856r653r740j0389
58057H37772j0283r534r195r558j0115j0647j1165j1240j0479r327q543q155p646
$$ y = [5537964, 5298092, 5073114, 4861319, 4661857, 4473876, 4296687, 4130135, 3973883, 3826797, 3687699, 3556113, 3431698, 3313633, 3201131, 3093933, 2991875, 2894642, 2802194, 2714514, 2630706, 2549601, 2471625, 2398682, 2331454, 2268219, 2207263, 2149113, 2095107, 2044781, 1996223, 1948442, 1902128, 1858369, 1817697, 1780213, 1745867, 1714652, 1686857, 1662657, 1641089, 1620018, 1597651, 1573550, 1547985, 1521164, 1493554, 1465914, 1438292, 1409855, 1380342, 1350734, 1321681, 1292284, 1261398, 1229273, 1196976, 1165074, 1133986, 1104725, 1078015, 1053173, 1029126, 1006045, 984857, 965674, 947927, 931592, 916982, 903627, 890706, 878410, 867554, 857901, 848161, 837772, 827489, 817955, 808760, 799202, 789087, 778440, 767275, 756035, 745556, 736229, 727686, 719531, 711885]
58044G11885o862o120n696n719o215o732o440n121l594k727k550k752l403m504
58030F43450n441n632n312n063m937m714m563m815n315n658n722n518m839l715
58016E72206k844k864l395l456k764k017j922k484l252l874m252m437m522m499
58002E25624m251l719k937j938p69L53J193J839K550L219L337K634J426K94m09
57987E28446o02n04o76j541k803l654l722l372l092k946k789k492j914j097n49
57972D96693p69j467j842j669j466j463j283p77m03l90l47j39l69j418k700l456
57956D76735l733l939l950l389k422j605j098n57M09J933L764N165N414M712M082
57941D81521M019L859K897J465L14n07j446k562l518m203m725n099n396n882o570
$$ y = [711885, 705023, 698903, 693207, 687488, 681273, 674541, 668101, 662980, 659386, 656659, 654109, 651357, 647954, 643450, 638009, 632377, 627065, 622002, 617065, 612351, 607788, 602973, 597658, 592000, 586278, 580760, 575921, 572206, 569362, 566498, 563103, 559647, 556883, 554866, 552944, 550460, 547208, 543334, 539082, 534645, 530123, 525624, 521373, 517654, 514717, 512779, 512010, 512363, 513556, 515395, 517945, 521164, 524501, 527135, 528561, 528855, 528446, 527844, 527340, 526664, 525123, 522320, 518666, 514944, 511572, 508480, 505534, 502745, 500253, 498339, 497242, 496693, 495924, 494457, 492615, 490946, 489480, 488017, 486734, 485957, 485554, 485164, 484817, 484678, 484309, 482891, 480191, 476735, 473002, 469063, 465113, 461724, 459302, 457697, 456599, 456042, 456451, 458384, 462148, 467313, 472727, 477439, 481521, 485540, 489399, 492296, 493761, 494075, 493568, 492122, 489560, 486042, 481839, 477114, 472015, 466619, 460737, 454167]
57926D54167p010p006p046p459p734p258o282n366m367k836j065J93P76J102J287
57911C94096J113P98R16J577K327K847L132L130K853K663K865L106K900K548K763
57896D29634L521M060L862K986J573q9j290j649j976l303n194o144n729n021m681
57881D10560m118l000k178k226k269j336Q1R12J213J812K840L768M527N444O305
57866D22335O624O626O913P196O599N241M400M622M778L629J485m27j635k611
57852D75775l654m409m578m392m259m273m305m264m155l970l637l091k395j779
57838D22614j403j100n35K24O27M19J57N45J420J871J397L61p27j823k987l935
57822D17125m380m407m178l602k785k425l087m322n151n307n273n148m391k900
$$ y = [454167, 447157, 440151, 433105, 425646, 417912, 410654, 404372, 399006, 394639, 391803, 390738, 390931, 391707, 392809, 394096, 395209, 396007, 396923, 398500, 400827, 403674, 406806, 409936, 412789, 415452, 418317, 421423, 424323, 426871, 429634, 433155, 437215, 441077, 444063, 445636, 445547, 444257, 442608, 440632, 437329, 432135, 425991, 420262, 415241, 410560, 406442, 403442, 401264, 399038, 396769, 395433, 395514, 396426, 397639, 399451, 402291, 406059, 410586, 416030, 422335, 428959, 435585, 442498, 449694, 456293, 461534, 465934, 470556, 475334, 478963, 480448, 480021, 478386, 475775, 472121, 467712, 463134, 458742, 454483, 450210, 445905, 441641, 437486, 433516, 429879, 426788, 424393, 422614, 421211, 420111, 419576, 419800, 420427, 420846, 421003, 421548, 422968, 424839, 426236, 426597, 425870, 424047, 421060, 417125, 412745, 408338, 404160, 400558, 397773, 395348, 392261, 387939, 382788, 377481, 372208, 367060, 362669, 359769]
57808C59769j503q64n85K6Q33J211J184J440K295L307L972M360M843N564O356
57793C92208P002P514Q106Q842R331R089Q283P729P824P894P087N514L985K786
57779D93194J452l28k206l747m948n976o811p371p662p617p101o198n257m457
57765D24967l692k948k461k346k301j981j386p34j33M10Q32J151J530K020K411
57750D15339K564K651K800K727K174J620J924L166M278M324L726L688M558N381
57736D60920N274M558M086L958L608K964K683L068L467L171K419K048K442L249
57722E07915L936M193M016L762L976M828N780O171N981N699N602N618N745O114
57708E79336O626P012P257P732Q762J0355J2235J3808J4290J3326J1530R861Q453
$$ y = [359769, 358266, 357402, 356817, 356843, 357676, 358887, 360071, 361511, 363806, 367113, 371085, 375445, 380288, 385852, 392208, 399210, 406724, 414830, 423672, 433003, 442092, 450375, 458104, 465928, 473822, 480909, 486423, 490408, 493194, 494646, 494318, 492112, 488365, 483417, 477441, 470630, 463259, 455597, 447980, 440879, 434681, 429424, 424967, 421275, 418327, 415866, 413520, 411219, 409238, 407852, 407118, 406985, 407395, 408227, 409378, 410908, 412928, 415339, 417903, 420554, 423354, 426081, 428255, 429875, 431799, 434965, 439243, 443567, 447293, 450981, 455539, 460920, 466194, 470752, 474838, 478796, 482404, 485368, 488051, 491119, 494586, 497757, 500176, 502224, 504666, 507915, 511851, 516044, 520060, 523822, 527798, 532626, 538406, 544577, 550558, 556257, 561859, 567477, 573222, 579336, 585962, 592974, 600231, 607963, 616725, 627080, 639315, 653123, 667413, 680739, 692269, 702130, 710583]
57695G10583O570L903J316k4O1P55J335J890L048N258Q390J1937J5538J9280K3421
57680H13261K8028L2938L8016M3296M9133N6249O5278P6028Q7770J00643J15867
57669A506507J33157J48020J52958J42263J15557P7173L3588q218m1831o3193
57659B195981p1988p0865o3346n2695m1849l3073k7293k4284k3670k5324k8804
57648A732790l3084l7166m0622m3406m5374m6221m5746m4069m1638l9003l6477
57637A279984l3984l1315k8444k5459k2417j9388j6590j4224j2251j0484q808
57626A056620p171n529l964k667j625m94R90K641M112N408O730Q089R403J0934
57612A083477J3103J5780J8239K0009K1488K3460K6128K8976L1466L3641L5843
$$ y = [710583, 717153, 721056, 722372, 722348, 722409, 723164, 724499, 726389, 729437, 734695, 743085, 755022, 770560, 789840, 813261, 841289, 874227, 912243, 955539, 1004672, 1060921, 1126199, 1202227, 1289997, 1390640, 1506507, 1639664, 1787684, 1940642, 2082905, 2198462, 2275635, 2309223, 2301005, 2259174, 2195981, 2123993, 2053128, 1989782, 1937087, 1895238, 1862165, 1834872, 1810588, 1786918, 1761594, 1732790, 1699706, 1662540, 1621918, 1578512, 1533138, 1486917, 1441171, 1397102, 1355464, 1316461, 1279984, 1246000, 1214685, 1186241, 1160782, 1138365, 1118977, 1102387, 1088163, 1075912, 1065428, 1056620, 1049449, 1043920, 1039956, 1037289, 1035664, 1035170, 1036160, 1038801, 1042913, 1048321, 1055051, 1063140, 1072543, 1083477, 1096580, 1112360, 1130599, 1150608, 1172096, 1195556, 1221684, 1250660, 1282126, 1315767, 1351610]
57601A351610L8024L9647M0389M0636M0816M0489L8645L4965L0149K4693J8162
57590A738225J0268K030n129j1184j7375k4216l0598l5149l7642l8582l8213l6681
57578A475754l4641l2825l1183k9150k6695k4446k2640k0711j8226j5699j3952
57567A205586j2910j1596r360o675m566l496l055k615j954j236n65J18Q71J617
57553A150164K214K579K753K929L394M241N167N708N761N691N836O132O384O687
57539A215640P263P953Q292Q180Q116Q553R300R894J0320J0882J1525J1841J1876
57526A339635J2298J3405J4467J4708J4566J5259J7101J9080K0263K0938K1878
57515A523598K3156K4294K5264K6561K8369L0312L2058L3666L5236L6697L8084
$$ y = [1351610, 1389634, 1429281, 1469670, 1510306, 1551122, 1591611, 1630256, 1665221, 1695370, 1720063, 1738225, 1748493, 1750523, 1745394, 1734210, 1716835, 1692619, 1662021, 1626872, 1589230, 1550648, 1512435, 1475754, 1441113, 1408288, 1377105, 1347955, 1321260, 1296814, 1274174, 1253463, 1235237, 1219538, 1205586, 1192676, 1181080, 1171720, 1165045, 1160479, 1156983, 1153928, 1151313, 1149359, 1148123, 1147558, 1147676, 1148547, 1150164, 1152378, 1154957, 1157710, 1160639, 1164033, 1168274, 1173441, 1179149, 1184910, 1190601, 1196437, 1202569, 1208953, 1215640, 1222903, 1230856, 1239148, 1247328, 1255444, 1263997, 1273297, 1283191, 1293511, 1304393, 1315918, 1327759, 1339635, 1351933, 1365338, 1379805, 1394513, 1409079, 1424338, 1441439, 1460519, 1480782, 1501720, 1523598, 1546754, 1571048, 1596312, 1622873, 1651242, 1681554, 1713612, 1747278, 1782514, 1819211, 1857295]
57504A857295L9472M0416M0031L7975L4929L1611K7787K2858J7148J1676O726
57493B167924J502m481j0394j5024j8075j9961k0824k0575j9651j8792j7976j6428
57481A987245j3881j1134q978p247n415l522j889l72J404L305M886O149P447Q743
57467A966741R685J0437J1634J3333J4775J5507J6122J7403J9255K0952K2129
57456B137973K2983K3740K4461K5352K6785K8864L1200L3244L4761L6032L7540
57445B462935L9365M0938M1631M1562M1387M1220M0173L7326L2720K7115K1083
57434B867455J4790Q449K459k935p685j1709j4857j7071j8292j8274j6891j4672
57422B770767j2632j1351j0388q818o288l443j262l7Q46K123L830N498O925Q294
$$ y = [1857295, 1896767, 1937183, 1977214, 2015189, 2050118, 2081729, 2109516, 2132374, 2149522, 2161198, 2167924, 2169426, 2164945, 2154551, 2139527, 2121452, 2101491, 2080667, 2060092, 2040441, 2021649, 2003673, 1987245, 1973364, 1962230, 1953252, 1946005, 1940590, 1937068, 1935179, 1934807, 1936211, 1939516, 1944402, 1950551, 1957998, 1966741, 1976426, 1986863, 1998497, 2011830, 2026605, 2042112, 2058234, 2075637, 2094892, 2115844, 2137973, 2160956, 2184696, 2209157, 2234509, 2261294, 2290158, 2321358, 2354602, 2389363, 2425395, 2462935, 2502300, 2543238, 2584869, 2626431, 2667818, 2709038, 2749211, 2786537, 2819257, 2846372, 2867455, 2882245, 2890694, 2893153, 2890218, 2882533, 2870824, 2855967, 2838896, 2820604, 2802330, 2785439, 2770767, 2758135, 2746784, 2736396, 2727578, 2721290, 2717847, 2716585, 2716548, 2717394, 2719517, 2723347, 2728845, 2735770, 2744064]
57408B744064R594J0510J1046J1679J2607J3396J3766J4198J5143J6159J6539
57397B888701J6447J6633J7204J7549J7498J7669J8375J8984J8785J8008J7471
57386C083324J7626J8338J9315K0293K0953K1026K0535J9794J9231J9257K0058
57375C299750K1290K2212K2321K1927K1843K2498K3476K3960K3636K3057K3026
57364C548996K3676K4361K4458K3974K3331K2869K2856K3552K4814K5875K6045
57353C814807K5491K4905K4588K4366K4253K4507K5021K5342K5360K5413K5570
57342D089623K5460K5013K4738K4931K5207K5127K4809K4578K4525K4717K5278
57331D364006K5862K5653K4577K3883K4733K6513K7446K6751K5396K4638K4655
$$ y = [2744064, 2753658, 2764168, 2775214, 2786893, 2799500, 2812896, 2826662, 2840860, 2856003, 2872162, 2888701, 2905148, 2921781, 2938985, 2956534, 2974032, 2991701, 3010076, 3029060, 3047845, 3065853, 3083324, 3100950, 3119288, 3138603, 3158896, 3179849, 3200875, 3221410, 3241204, 3260435, 3279692, 3299750, 3321040, 3343252, 3365573, 3387500, 3409343, 3431841, 3455317, 3479277, 3502913, 3525970, 3548996, 3572672, 3597033, 3621491, 3645465, 3668796, 3691665, 3714521, 3738073, 3762887, 3788762, 3814807, 3840298, 3865203, 3889791, 3914157, 3938410, 3962917, 3987938, 4013280, 4038640, 4064053, 4089623, 4115083, 4140096, 4164834, 4189765, 4214972, 4240099, 4264908, 4289486, 4314011, 4338728, 4364006, 4389868, 4415521, 4440098, 4463981, 4488714, 4515227, 4542673, 4569424, 4594820, 4619458, 4644113]
57320D644113K4787K4531K3905K3240K2909K3089K3543K3834K3791K3635K3623
57309D905000K3791K4049K4274K4277K3914K3317K2805K2578K2654K3033K3643
57298E163335K4147K4171K3750K3285K3051K3017K3115K3327K3439K3222K2973
57287E420832K3410K4670K5869K6058K5372K4696K4492K4462K4270K3981K3616
57276E691728K2848K1502K0065J9261J9255J9472J9173J7994J6013J3594J1216
57265E892121R242P759O639N727M943M245L624L177L024L197L614M115M428M245
57251E960100L584K952K905L361L643L257K420J701J387J278R58J17j184k432
57237E984047l070l105l119l516m039m207l935l462k931k420k107k009j778j138
$$ y = [4644113, 4668900, 4693431, 4717336, 4740576, 4763485, 4786574, 4810117, 4833951, 4857742, 4881377, 4905000, 4928791, 4952840, 4977114, 5001391, 5025305, 5048622, 5071427, 5094005, 5116659, 5139692, 5163335, 5187482, 5211653, 5235403, 5258688, 5281739, 5304756, 5327871, 5351198, 5374637, 5397859, 5420832, 5444242, 5468912, 5494781, 5520839, 5546211, 5570907, 5595399, 5619861, 5644131, 5668112, 5691728, 5714576, 5736078, 5756143, 5775404, 5794659, 5814131, 5833304, 5851298, 5867311, 5880905, 5892121, 5901363, 5909122, 5915761, 5921488, 5926431, 5930676, 5934300, 5937477, 5940501, 5943698, 5947312, 5951427, 5955855, 5960100, 5963684, 5966636, 5969541, 5972902, 5976545, 5979802, 5982222, 5983923, 5985310, 5986588, 5987546, 5987663, 5986479, 5984047, 5980977, 5977872, 5974753, 5971237, 5967198, 5962991, 5959056, 5955594, 5952663, 5950243, 5948136, 5946127, 5944349, 5943211]
57223E943211l94o7j83m15p51j451k419l249l899m620n223n162m667m988o908
57208E898815r574j1479j2239j2696j3492j4352j4802j4960j5321j6095j7063
57197E746742j7842j8106j7743j7022j6578j6930j7958j8965j9321j8977j8262
57186E549038j7419j6579j6128j6554j7754j8903j9376j9510k0002k0849k1468
57175E344496k1735k2238k3426k5036k6478k7403k7804k8040k8786l0407l2323
57164E050820l3543l3952l4418l5527l6852l7795l8357l8692l8544l7779l6890
57153D648471l6378l6035l5381l4425l3347l1986l0255k8711k7871k7250k5913
57142D300919k3864k2111k1351k1354k1601k1847k1933k1752k1617k2089k3176
$$ y = [5943211, 5942817, 5942750, 5942567, 5942152, 5941401, 5939950, 5937531, 5934282, 5930383, 5925763, 5920540, 5915378, 5910711, 5905723, 5898815, 5889241, 5877762, 5865523, 5852827, 5839335, 5824983, 5810181, 5795221, 5779900, 5763805, 5746742, 5728900, 5710794, 5693051, 5676029, 5659451, 5642521, 5624563, 5605598, 5586277, 5567300, 5549038, 5531619, 5515040, 5498912, 5482358, 5464604, 5445701, 5426325, 5406815, 5386813, 5365964, 5344496, 5322761, 5300523, 5277097, 5252061, 5225583, 5198180, 5170376, 5142336, 5113550, 5083143, 5050820, 5017277, 4983325, 4948907, 4913380, 4876528, 4838733, 4800376, 4761684, 4723140, 4685361, 4648471, 4612093, 4576058, 4540677, 4506252, 4472905, 4440919, 4410664, 4381953, 4354082, 4326832, 4300919, 4277055, 4254944, 4233593, 4212239, 4190638, 4168791, 4146858, 4125106, 4103489, 4081400, 4058224]
57131D058224k4118k4114k2933k0784j8022j5073j2152q956n079p97L026N973
57119C915195Q530J1302J4272J7124J9956K3356K7998L4431M2981N3599O5909
57108D234653P9683R5162J12884J33540J58123J88007K24507K68399L20082L80165
57098F195205M49748N29933O20897P21320Q28619R39711J051604J161457J266518
57089A3765012J364009J450587J521448J569974J588162J567081J497397J371695
57081B5695365J188727R56128O88084L99529J02210j94874m83159p53589r97255
57072B6601166j206197j374066j496932j573805j606357j598414j555648j485164
57064A4704583j394588j291226j181661j071411r64462q63166p68804o82147o03526
$$ y = [4058224, 4034106, 4009992, 3987059, 3966275, 3948253, 3933180, 3921028, 3912072, 3906993, 3906196, 3909222, 3915195, 3923725, 3935027, 3949299, 3966423, 3986379, 4009735, 4037733, 4072164, 4115145, 4168744, 4234653, 4314336, 4409498, 4522382, 4655922, 4814045, 5002052, 5226559, 5494958, 5815040, 6195205, 6644953, 7174886, 7795783, 8517103, 9345722, 10285433, 11337037, 12498494, 13765012, 15129021, 16579608, 18101056, 19671030, 21259192, 22826273, 24323670, 25695365, 26884092, 27840220, 28528304, 28927833, 29030043, 28835169, 28352010, 27598421, 26601166, 25394969, 24020903, 22523971, 20950166, 19343809, 17745395, 16189747, 14704583, 13309995, 12018769, 10837108, 9765697, 8801235, 7938069, 7169265, 6487118, 5883592]
57055E883592n32796m69586m13536l64317l21588k84897k53404k25758k00782
57046B816928j78295j58781j42179j27484j13773j01075q9901q0233p1382o2582
57036A691243n3433m3944l4313k4631j4946o077k46j9o137j6757k8995m0704n0514
57023A370527n7119n9622n8412n4965n0707m6326m1967l7554l3056k8883k5888
57012H76028k4507k4060k3335k1854k0077j8491j7021j5473j4021j3011j2476
57001F71702j2068j1418j0455r400q418p402o187m987m252m000l695k944j971
56988E84505j115l08O22J405J631J318P40j59j658l723o021q408j0891j3124j4541
56973E30273j5024j4987j4666j3777j2091r909p812o084m615l167j578J63K015
$$ y = [5883592, 5350796, 4881210, 4467674, 4103357, 3781769, 3496872, 3243468, 3017710, 2816928, 2638633, 2479852, 2337673, 2210189, 2096416, 1995341, 1905440, 1825207, 1753825, 1691243, 1637810, 1593866, 1559553, 1534922, 1519976, 1513899, 1513653, 1513634, 1507497, 1490740, 1461745, 1421041, 1370527, 1313408, 1253786, 1195374, 1140409, 1089702, 1043376, 1001409, 963855, 930799, 901916, 876028, 851521, 827461, 804126, 782272, 762195, 743704, 726683, 711210, 697189, 684178, 671702, 659634, 648216, 637761, 628361, 619943, 612541, 606354, 601367, 597115, 593115, 589420, 586476, 584505, 583390, 583082, 583704, 585109, 586740, 588058, 588798, 588639, 586981, 583258, 577237, 568829, 557938, 544814, 530273, 515249, 500262, 485596, 471819, 459728, 449819, 442007, 435923, 431308, 428141, 426563, 426726, 428741]
56960D28741M085O536R069J0673J0418Q500O010L649J162j822m940p505r272j0403
56946D54901j0931j0760j0027q949p412n230k830j062o7J113L374O290Q531R483
56932D26424R857J0572J1547J1782J0350P027K276l006p903j1987j5359j7929
56920D33651j9017j8132j5962j3940j2722j1696j0115q193o735o137o146o235
56908B98621n928m976l634k534k032j835j555j319j425j614j191J03J720K881
56894B75282L317L342L375L535L725M046M873O340P850Q471P825O251M184J758
56880C44174p89k938m413n481o370o689n873l958j599N19K019K964L886N430P653
56865C28535J0072J2500J5352J8689K1635K3346K3978K3905K2406J8227J1404
$$ y = [428741, 432826, 439362, 448431, 459104, 469522, 478022, 484032, 487681, 488843, 487021, 482081, 474576, 465304, 454901, 443970, 433210, 423183, 414234, 406822, 401592, 398762, 397700, 397633, 398746, 402120, 408410, 416941, 426424, 436281, 446853, 458400, 470182, 480532, 487559, 489835, 486829, 478926, 466939, 451580, 433651, 414634, 396502, 380540, 366600, 353878, 342182, 332067, 323874, 317139, 311002, 304856, 298621, 292693, 287717, 284083, 281549, 279517, 277682, 276127, 274808, 273383, 271769, 270578, 270681, 272401, 275282, 278599, 281941, 285316, 288851, 292576, 296622, 301495, 307835, 315685, 324156, 331981, 338232, 342416, 344174, 343385, 340447, 336034, 330553, 324183, 317494, 311621, 307663, 306064, 306583, 308602, 311566, 315452, 320882, 328535, 338607, 351107, 366459, 385148, 406783, 430129, 454107, 478012, 500418, 518645, 530049]
56854E30049L608l490r320j3786j6450j6917j5574j3367j1036q756o269l195O33
56841D16130M963R393J3810J8398K3136K7692L1781L5318L7946L8624L5958K9136
56829G22285J8606N921p109j9055k8719l4900l7066l6190l4108l1664k8211k3262
56817D66528j7675j2526p667k438K824P261J1036J5175J9915K4348K7561K8978
56805E63320K7577K2310J3656L664o048j5237k3590k9669l2235l1749k9623k6626
56793D35750k2825j8559j4497j1058q302o169m223j659J847N580Q656J0991J2863
56780C88395J3936J3493J1323P721K872l064r313j4668j8368k0403k1067k0687
56768C30170j9614j8045j5917j3393j1200r956r310q384o947n592m775m301l834
$$ y = [530049, 533657, 530167, 520847, 507061, 490611, 473694, 458120, 444753, 433717, 424961, 418692, 415497, 416130, 421093, 430486, 444296, 462694, 485830, 513522, 545303, 580621, 618567, 657191, 693149, 722285, 740891, 746812, 739703, 720648, 691929, 657029, 619963, 583773, 549665, 518001, 489790, 466528, 448853, 436327, 428660, 426222, 429046, 436307, 447343, 462518, 482433, 506781, 534342, 563320, 590897, 613207, 626863, 630527, 624479, 609242, 585652, 555983, 523748, 491999, 462376, 435750, 412925, 394366, 379869, 368811, 360509, 354340, 350117, 348458, 350305, 355885, 364541, 375532, 388395, 402331, 415824, 427147, 434868, 437740, 434676, 425363, 410695, 392327, 371924, 350857, 330170, 310556, 292511, 276594, 263201, 252001, 242045, 232735, 224351, 217404, 211812, 207037, 202736, 198902]
56755A98902l328k831k328j955j951k171k117j620j109j018j197j239j088r55
56741A73995q35m85P2M01J15o62j385j572j101k02O67J063R08O39P32J085J144
56724A74579P09K20Jk32p44j130r46n74o83j076j003n37n39j157j407p37L5j2
56706A64767n43o94m66m73p63q54o59m93k99J99O72L53p57j641j519p77l35n16
56688A55202q82r22n36J0L83M14J56k22n10n00j80J36M8m70j055j418j483j103
56670A47068j68Q91J268Q23L85O12J103J133P88O88R55J191J196J042O32q7o56
56653A58864n25N0K93J1k07lK49J35j93l59k62n4O8o2m32p18o68m13j49L05J110
56632A57040J728J323o3j423j946j723j213o31j51j11o16j234j425j044l57J55
$$ y = [198902, 195574, 192743, 190415, 188460, 186509, 184338, 182221, 180601, 179492, 178474, 177277, 176038, 174950, 173995, 173160, 172675, 172747, 173148, 173263, 172601, 171216, 169644, 168543, 168341, 169008, 170071, 170979, 171618, 172350, 173435, 174579, 175288, 175508, 175509, 175277, 174533, 173403, 172457, 171883, 171200, 170124, 169121, 168584, 168045, 166888, 165481, 164744, 164779, 164767, 164224, 163530, 163064, 162591, 161828, 160974, 160315, 159822, 159523, 159722, 160394, 160747, 159990, 158349, 156830, 156053, 155718, 155202, 154320, 153398, 152862, 152872, 153255, 153669, 153825, 153603, 153093, 152593, 152413, 152549, 152597, 152127, 151072, 149654, 148171, 147068, 146900, 147791, 149059, 149882, 150267, 150879, 151982, 153115, 153903, 154591, 155546, 156737, 157933, 158975, 159607, 159520, 158864, 158339, 158389, 158682, 158693, 158486, 158483, 158732, 158867, 158674, 158315, 158053, 157999, 158067, 158005, 157573, 156855, 156187, 155774, 155625, 155930, 157040, 158768, 160091, 160028, 158605, 156659, 154936, 153723, 153092, 152941, 152830, 152214, 150980, 149555, 148511, 148154, 148309]
56616A48309M5o75j245q56K65R95P20P4o1K98N08K82j50n27p40o29j41M04N26
56597A47402J72k17k08K16P35J004R28P45Q00J159J463J319P51K02M1J94K81J22
56579A57109m8R7N51J070J625K415L321L780L506K975K834L087L280L274L320
56564A92196L496L570L480L472L719M110M507M867N211N565N960O176N764M658
56550B56751L459K669J950P50n97j260j288j621k622l489l552l317l621m380m839
56535B34993m728m567m916n749o515o598n843m735l875l292k589j740j215j173
56521A77458j152q36o14r42j603k021k025j781j330o64r2Qk78m69l31j07p6k00
56503A62945k73k54k89m63n56k45M74J131J289J021P24N19L11K35O27J436K087
$$ y = [148309, 148354, 147679, 146434, 145578, 145843, 146838, 147558, 147632, 147571, 147869, 148377, 148659, 148509, 147982, 147242, 146613, 146472, 146876, 147402, 147574, 147357, 147149, 147365, 148100, 149104, 150032, 150777, 151577, 152736, 154199, 155518, 156269, 156471, 156512, 156706, 156987, 157109, 157061, 157158, 157709, 158779, 160404, 162819, 166140, 169920, 173426, 176401, 179235, 182322, 185602, 188876, 192196, 195692, 199262, 202742, 206214, 209933, 214043, 218550, 223417, 228628, 234193, 240153, 246329, 252093, 256751, 260210, 262879, 264829, 265579, 264982, 263722, 262434, 260813, 258191, 254702, 251150, 247833, 244212, 239832, 234993, 230265, 225698, 220782, 215033, 208518, 201920, 196077, 191342, 187467, 184175, 181586, 179846, 178631, 177458, 176306, 175470, 174856, 173914, 172311, 170290, 168265, 166484, 165154, 164490, 164398, 164406, 164128, 163659, 163328, 163221, 163145, 162945, 162672, 162418, 162129, 161666, 161110, 160865, 161339, 162470, 163759, 164780, 165504, 166023, 166334, 166569, 167196, 168632, 170719]
56486A70719K060J364L89m32p80n94j27L41O91P55K46o34r33o8J062J049j8n69
56468A74521L25J864K873L166L087K682K075J906K575L528L956L777L400L023
56454B12758K663K346J772M41j317k213j574m26j54p00j031p81m13j10L13N99
56438B12173K49n36j079j383k028k923l166k415j491j253j550j668j283o82l65
56423A90600o12j163j364r66n08m97n13J11R82J020J58l71K56J352J769J362Q32
56406A92448O98Q75J004Q25M03J70M31Q72R43P34Q37J271J314O77R7K87R22J221
56388B06029J049Q08O42L77M3j32j51k03k80k79k69k94o1O42J325J178K41m17
56370B10248O1J201J739J133J60o4O84J675K190K143J737R63j42r85p36O28K013
$$ y = [170719, 172779, 174143, 174532, 174100, 173320, 172726, 172599, 172940, 173631, 174386, 174632, 173998, 173065, 172997, 174059, 175108, 175090, 174521, 174846, 176710, 179583, 182749, 185836, 188518, 190593, 192499, 195074, 198602, 202558, 206335, 209735, 212758, 215421, 217767, 219539, 219980, 218663, 216450, 214876, 214450, 214296, 213596, 212565, 211784, 211371, 211261, 211574, 212173, 212422, 211886, 210807, 209424, 207396, 204473, 201307, 198892, 197401, 196148, 194598, 192930, 191647, 190965, 190600, 189988, 188825, 187461, 186495, 185987, 185490, 184977, 185088, 186070, 187090, 187248, 186877, 187133, 188485, 190254, 191616, 192448, 193146, 194021, 195025, 195850, 196253, 196423, 196854, 197726, 198669, 199403, 200240, 201511, 202825, 203502, 203599, 203886, 204808, 206029, 207078, 207886, 208528, 208905, 208948, 208816, 208665, 208462, 208182, 207903, 207634, 207340, 207279, 207921, 209246, 210424, 210665, 210248, 210309, 211510, 213249, 214382, 214542, 214478, 215162, 216837, 219027, 221170, 222907, 223870, 223728, 222743, 222007, 222635, 224648]
56353B24648K309J613J108J640K810L504L179K257J396P58K60J17O33J517K018
56338B49767J864J553J542J640J572J562J875K121J707P43k5o4O39J863L144L708
56322B75211L110J924J212J307J699J996K238K306J902J347J511K556L509L507
56308C05335K909K589K764L125L547L971L974L262K446K498L460M359M519M329
56294C53087M511N132N727N980N922N590M977M312M076M487N156N478N370N367
56280D25172N881O652P149P272P355P612P964Q420R199J0406J1903J3593J5469
56267E44047J7338J8898K0240K1926K4269K6992K9828L3094L7197M1842M6241
56256H61912M9953N3116N5917N8297O0219O1770O2823O2965O1867N9524N5977
$$ y = [224648, 226957, 228570, 229678, 231318, 234128, 237632, 240811, 243068, 244464, 245222, 245482, 245599, 246232, 247749, 249767, 251631, 253184, 254726, 256366, 257938, 259500, 261375, 263496, 265203, 265946, 265921, 265857, 266496, 268359, 271503, 275211, 278321, 280245, 281457, 282764, 284463, 286459, 288697, 291003, 292905, 294252, 295763, 298319, 301828, 305335, 308244, 310833, 313597, 316722, 320269, 324240, 328214, 331476, 333922, 336420, 339880, 344239, 348758, 353087, 357598, 362730, 368457, 374437, 380359, 385949, 390926, 395238, 399314, 403801, 408957, 414435, 419805, 425172, 431053, 437705, 444854, 452126, 459481, 467093, 475057, 483477, 492676, 503082, 514985, 528578, 544047, 561385, 580283, 600523, 622449, 646718, 673710, 703538, 736632, 773829, 815671, 861912, 911865, 964981, 1020898, 1079195, 1139414, 1201184, 1264007, 1326972, 1388839, 1448363, 1504340]
56245A504340N1107M4868L7518K9430K0876J2172L843l671j0340j6317k1442k5365
56233A627019k8138l0313l2323l4107l5541l6881l8370l9726m0474m0687m0866
56222A229593m1107m0957m0229l9463l9212l9167l8379l6251l3139l0055k7903
56211H23731k6772k5857k4236k1790j9191j7030j5306j3760j2249j0632q798p001
56199F21109n720m883l834k383j310j271j732j666r31k12J22L51O83R64J124J427
56183F01838K080L073M244N217N443M794L975L844M505N478O481P478Q305Q915
56169F75670R724J0909J1696J1348J0653J1248J3397J5554J6535J6925J7950J9826
56157H41435K2021K4339K6989L0104L3886L8796M5027N2017N9094O6428P4900
$$ y = [1504340, 1555447, 1600315, 1637833, 1667263, 1688139, 1700311, 1704154, 1700483, 1690143, 1673826, 1652384, 1627019, 1598881, 1568568, 1536245, 1502138, 1466597, 1429716, 1391346, 1351620, 1311146, 1270459, 1229593, 1188486, 1147529, 1107300, 1067837, 1028625, 989458, 951079, 914828, 881689, 851634, 823731, 796959, 771102, 746866, 725076, 705885, 688855, 673549, 659789, 647540, 636908, 628110, 621109, 615389, 610506, 606672, 604289, 602979, 601708, 599976, 598310, 597379, 597167, 597289, 597640, 598323, 599287, 600411, 601838, 603918, 606991, 611235, 616452, 621895, 626689, 630664, 634508, 639013, 644491, 650972, 658450, 666755, 675670, 685394, 696303, 707999, 719347, 730000, 741248, 754645, 770199, 786734, 803659, 821609, 841435, 863456, 887795, 914784, 944888, 978774, 1017570, 1062597, 1114614, 1173708, 1240136, 1315036]
56146A315036Q5246R7568J11365J25593J38757J49238J55526J56201J50307J38208
56136B623045J22019J04918Q9925P8929P2115O7910O3798N7576M8047L4988J9171
56125C382441K408j3235k6751l8630n0103o2473p6988r4234j13095j30807j44557
56114B633976j52771j54887j50876j41576j28854j14619r9885q5162p1294n9240
56104A474812m9228m0745l3340k7014k1881j7751j4155j0728p543n049l360j838
56092A242180K86K889N115O518P462Q340R101R746J0619J1803J2897J3745J4832
56079A355533J6496J8330J9738K0647K1209K1329K0926K0271J9632J8848J7691
56068A570650J6349J5156J4194J3367J2693J2301J2418J3359J5155J7146J8546
$$ y = [1315036, 1400282, 1497850, 1609215, 1734808, 1873565, 2022803, 2178329, 2334530, 2484837, 2623045, 2745064, 2849982, 2939907, 3018836, 3090951, 3158861, 3222659, 3280235, 3328282, 3363270, 3382441, 3384849, 3371614, 3344863, 3306233, 3256130, 3193657, 3116669, 3022435, 2909340, 2778533, 2633976, 2481205, 2326318, 2175442, 2033866, 1905012, 1790393, 1690508, 1605346, 1534052, 1474812, 1425584, 1384839, 1351499, 1324485, 1302604, 1284853, 1270698, 1259970, 1252427, 1247378, 1244018, 1242180, 1242466, 1245355, 1250470, 1256988, 1264450, 1272790, 1281891, 1291637, 1302256, 1314059, 1326956, 1340701, 1355533, 1372029, 1390359, 1410097, 1430744, 1451953, 1473282, 1494208, 1514479, 1534111, 1552959, 1570650, 1586999, 1602155, 1616349, 1629716, 1642409, 1654710, 1667128, 1680487, 1695642, 1712788, 1731334]
56057A731334J9409K0400K1645K2598K3193K4093K5479K6607K7100K7699K9055
56046A998612L0604L1481L1830L2370L3159L3676L3828L4094L4904L6434L8742
56035B369734M1605M4458M6983M9540N2607N6109N9476O2158O3922O5030O6244
56024B977866O8115P0245P1847P3057P4923P7916Q1394Q4650Q7686R0706R3692
56013C852097R6733R9992J03309J06679J10973J16954J23695J29504J34414J40036
56003E014386J46857J53696J60178J67498J76005J84239J91590J99810K10506
55994F604765K22973K35908K49463K64188K79660K95712L13422L33480L55203
55985I154774L78426M04435M33774M65267M98759N36454N79794O27453O78475
$$ y = [1731334, 1750743, 1771143, 1792788, 1815386, 1838579, 1862672, 1888151, 1914758, 1941858, 1969557, 1998612, 2029216, 2060697, 2092527, 2124897, 2158056, 2191732, 2225560, 2259654, 2294558, 2330992, 2369734, 2411339, 2455797, 2502780, 2552320, 2604927, 2661036, 2720512, 2782670, 2846592, 2911622, 2977866, 3045981, 3116226, 3188073, 3261130, 3336053, 3413969, 3495363, 3580013, 3667699, 3758405, 3852097, 3948830, 4048822, 4152131, 4258810, 4369783, 4486737, 4610432, 4739936, 4874350, 5014386, 5161243, 5314939, 5475117, 5642615, 5818620, 6002859, 6194449, 6394259, 6604765, 6827738, 7063646, 7313109, 7577297, 7856957, 8152669, 8466091, 8799571, 9154774, 9533200, 9937635, 10371409, 10836676, 11335435, 11871889, 12451683, 13079136, 13757611]
55976A3757611P34864P98877Q70472R50023J040815J145993J265815J401240J557616
55967B3523326J741489J956707K207518K502948K854421L272222L768535M360285
55959D6187451N063515N887416O838141P924594R156452J0543762J2106401J3876944
55951A17584676J5883370J8129147K0577580K3094582K5325161K6607860K6096478
55944B73298854K3107055J7477306R693868P43012q176057j5940057k1741098
55937B78462883k5236890k6551830k6127465k4518198k2239535j9697854j7171700
55930A16919411j4821428j2720123j0889641r322921p994133o869398n917580
55923D8384187n112842m431569l852650l360016k940989k582925k274440k008370
$$ y = [13757611, 14492475, 15291352, 16161824, 17111847, 18152662, 19298655, 20564470, 21965710, 23523326, 25264815, 27221522, 29429040, 31931988, 34786409, 38058631, 41827166, 46187451, 51250966, 57138382, 63976523, 71901117, 81057569, 91601331, 103707732, 117584676, 133468046, 151597193, 172174773, 195269355, 220594516, 247202376, 273298854, 296405909, 313883215, 323577083, 324320095, 316144038, 300203981, 278462883, 253225993, 226674163, 200546698, 176028500, 153788965, 134091111, 116919411, 102097983, 89377860, 78488219, 69165298, 61171165, 54301767, 48384187, 43271345, 38839776, 34987126, 31627110, 28686121, 26103196, 23828756, 21820386]
55915B1820386j779992j583268j411613j261179j130292j016367r16112q27904
55907A1893659p51281o84470o24805n71120n23561m81419m43196m08456l77669
55898G027682l50417l25370l01880k80197k60398k42355k26269k12013j98426
55889D630357j84553j71068j59413j50093j42850j37636j34083j30709j26055
55880C293897j20183j13962j07548j00780r4390q9413q5857q3083q0947p9304
55870B338430p7114p3410o8735o4256o0018n5493n1356m9025m8456m7977m6386
55859A696204m4012m1545l9035l6316l3525l0967k9075k8398k8905k9602k9655
55848A325169k9538l0186l1367l2009l1803l1282l0459k8790k6546k4928k4359
$$ y = [21820386, 20040394, 18457126, 17045513, 15784334, 14654042, 13637675, 12721563, 11893659, 11142378, 10457908, 9833103, 9261983, 8738422, 8257003, 7813807, 7405351, 7027682, 6677265, 6351895, 6050015, 5769818, 5509420, 5267065, 5040796, 4828783, 4630357, 4445804, 4274736, 4115323, 3965230, 3822380, 3684744, 3550661, 3419952, 3293897, 3173714, 3059752, 2952204, 2851424, 2757034, 2667621, 2581764, 2498681, 2417734, 2338430, 2261316, 2187906, 2119171, 2054915, 1994897, 1939404, 1888048, 1839023, 1790567, 1742590, 1696204, 1652192, 1610647, 1571612, 1535296, 1501771, 1470804, 1441729, 1413331, 1384426, 1354824, 1325169, 1295631, 1265445, 1234078, 1202069, 1170266, 1138984, 1108525, 1079735, 1053189, 1028261, 1003902]
55837A003902k3854k2512k0756j9570j9208j9096j8507j7065j5024j3275j2569
55826H02466j2618j2500j1938j1492j1451j1383j1056j0982j1571j2233j1969
55815F73273j0584q935q063q278q973r187q554p627p138p093p001o807o959p489
55801E60585p694p039n945n208m975m731m155l537l233l055k435j051R67L377
55787E11871N872P677P610N123J137k708n556p549q804r032q334p470o944o465
55773D76428n772n315n594o455p537q852j0300j1215j1129j0512r997r380q140
55760C66230o549n373m768m285l787l450l175k794k788l827n635p145p795p895
55746B96964p744p245o509n968n779n732n777n949n795m795l369k518k363k054
$$ y = [1003902, 980048, 957536, 936780, 917210, 898002, 878906, 860399, 843334, 828310, 815035, 802466, 789848, 777348, 765410, 753918, 742467, 731084, 720028, 709046, 697475, 685242, 673273, 662689, 653754, 645691, 637413, 628440, 619253, 610699, 603072, 595934, 588841, 581840, 575033, 568074, 560585, 552891, 545852, 539907, 534699, 529724, 524993, 520838, 517301, 514068, 511013, 508578, 507527, 508494, 511871, 517743, 525420, 533030, 538153, 539290, 536582, 531026, 523477, 514673, 505641, 497307, 489837, 482893, 476428, 470656, 465341, 459747, 453292, 445755, 436903, 426603, 415388, 404259, 393747, 383750, 374370, 366230, 359681, 354308, 349540, 345255, 341468, 338018, 334843, 332049, 329261, 325434, 319799, 312654, 304859, 296964, 289220, 281975, 275466, 269498, 263719, 257987, 252210, 246261, 240466, 235671, 232302, 229784, 227421, 225367]
55732B25367j343j068j637k195k036j817k502l817m726m862m609m228l820l716
55718A82991l948l718k485j286j664l281l939k473l96J66p54j359p30J19r6j262
55702A55885k311k657k619k711k981l134k929k419j879j534j355j179r96r86j185
55687A25010j391j465j462j335q50j08K64o0m17N6J062J385N39n85j009q15n89
55670A18230m34j49R9j0l22m13k41qL61J037J691J768J290R13J077J542J842J770
55652A30043J381Q92O67R48J524J945J978J634Q71k26j068q72L44J600J950J489
55636A45100J078J270J749J818J254N38K17K82L75M12N43N30j81j537k652k934
55620A47862k845l003l079k416j297p15r96j512j781j988k379k782k978k939k629
$$ y = [225367, 224024, 222956, 221319, 219124, 217088, 215271, 212769, 208952, 204226, 199364, 194755, 190527, 186707, 182991, 179043, 175325, 172840, 171554, 169890, 166609, 162670, 160197, 159801, 159967, 159213, 157854, 157124, 157243, 157147, 155885, 153574, 150917, 148298, 145587, 142606, 139472, 136543, 134124, 132245, 130711, 129356, 128177, 127181, 126195, 125010, 123619, 122154, 120692, 119357, 118507, 118399, 118663, 118603, 118186, 118242, 119304, 120689, 121228, 120643, 119634, 118819, 118230, 117796, 117647, 117746, 117736, 117414, 117001, 116760, 116752, 117113, 118150, 119841, 121609, 122899, 123812, 124889, 126431, 128273, 130043, 131424, 132316, 132983, 133931, 135455, 137400, 139378, 141012, 141883, 141657, 140589, 139717, 140061, 141661, 143611, 145100, 146178, 147448, 149197, 151015, 152269, 152807, 153024, 153306, 153681, 154093, 154636, 155166, 154985, 153448, 150796, 147862, 145017, 142014, 138935, 136519, 135222, 134507, 133511, 131999, 130218, 128230, 125851, 123069, 120091, 117152, 114523]
55605A14523k069j606j523j458q73p9oq16j589j632j270j065j015r78j140j485
55589I5919j441o33M81J278J760K162K398K488L066M597O426P441P639Q219J0049
55574A51849J2650J4837J5840J5586J4320J2173R006M639o32n874j0127j3143
55562B21124j5235j6501j6623j5552j3991j2832j2244j1531j0002p885o140n369
55550G7219n104m433l194k172k103k851l640l821l215k095j060o63q44r45m76
55535D0603K76O61M23j62p16j002q76l99J14L44L27L66O43J042J321J358J235
55518D5558J167J167Q82Kj098j481o36Q84K010K184J683J139R58J074J079P30
55502E7302L41M31R33J166P68K15J22L93N23L98K87K02j78r19j628j957j984k043
$$ y = [114523, 112454, 110848, 109325, 107867, 106994, 106915, 106909, 106093, 104504, 102872, 101602, 100537, 99522, 98544, 97404, 95919, 94478, 93845, 94326, 95604, 97364, 99526, 101924, 104412, 107478, 112075, 118501, 125942, 133581, 141800, 151849, 164499, 179336, 195176, 210762, 225082, 237255, 246261, 250900, 250268, 244394, 234267, 221124, 205889, 189388, 172765, 157213, 143222, 130390, 118146, 106615, 96613, 88728, 82588, 77219, 72115, 67682, 64488, 62316, 60213, 57362, 53722, 49901, 46686, 44591, 43531, 42868, 42024, 41079, 40603, 40879, 41540, 41963, 41801, 41085, 40083, 39207, 38808, 38922, 39266, 39593, 39959, 40602, 41644, 42965, 44323, 45558, 46725, 47892, 48774, 48776, 47678, 46197, 45561, 46445, 48455, 50639, 52322, 53461, 54419, 55493, 56572, 57302, 57643, 58074, 59007, 60173, 60941, 61156, 61278, 61671, 62194, 62592, 62879, 63081, 62903, 61984, 60356, 58399, 56415, 54372]
55484E4372k286k538k484k051j602j623k078k371k079j464j042q96p58o03p01
55469B9796j155j635j698j271p94q42j462j949j615p70m08q15j160p12J93Q65
55453A4568J205J286O81p69j956j581p7O96r0j203j221l99P4r4j56L14Q05P29
55435A2812K59J8K20M06K4q63j596j656j151n02Q4N72Q42Q91J063J560J915J532
55417A6430P04L40O72R38N87O7L4L43L83n9p35j410j863j736r59j53j18q56j503
55398A1106j257j73R50J304P55o6l97j35K58M30M54L33k31j265k137k184j417
55381F328l40O41J261J243O73K12L89Q39P71lr32j472j394o27N22J151O13m46
55363I429p00J05Q22N82j01m01m59q39j318j224n85r1J2J28M09M59J37j03K6J16
$$ y = [54372, 52086, 49548, 47064, 45013, 43411, 41788, 39710, 37339, 35260, 33796, 32754, 31858, 31100, 30497, 29796, 28641, 27006, 25308, 24037, 23243, 22401, 20939, 18990, 17375, 16605, 16197, 15382, 14222, 13510, 13703, 14568, 15773, 17059, 17740, 16971, 15015, 13434, 13357, 14053, 13963, 12760, 11539, 11140, 11214, 11120, 10964, 11278, 12083, 12812, 13071, 13089, 13309, 13715, 13739, 12876, 11280, 9624, 8473, 7971, 8055, 8627, 9469, 10360, 11423, 12983, 14898, 16430, 17134, 17474, 18146, 19084, 19671, 19738, 19772, 20115, 20498, 20439, 19704, 18294, 16431, 14695, 13736, 13583, 13465, 12609, 11106, 9849, 9676, 10626, 11930, 12685, 12619, 12222, 12087, 12345, 12775, 13229, 13562, 13331, 12066, 9929, 7745, 6328, 5988, 6629, 7890, 9133, 9806, 10018, 10407, 11246, 12017, 12014, 11082, 9610, 8216, 7589, 8111, 9262, 9875, 9429, 8729, 8834, 9656, 10238, 10137, 9736, 9277, 8438, 7120, 5896, 5311, 5220, 5232, 5360, 5769, 6228, 6365, 6262, 6288, 6404]
55343F404k78r21j278j262j092o64K83J421J869J253K33l31l97n53j008j343A106
55325B06d12k20a46I96J233R22Q87J255J366Q10J88K71Q70J094O01n0k66o8J94
55306A0303K48r8q57j541j429n10K56P6o47q88m03N8j05n95p55m19M2K86L35M22
55286C779O67Q74O69o8r58j471j433r81k41O14J100P76k6l58J69Q58Q91M07J21
55267E389K15K53K8r3J27L85L37J41J27K16Kn81r97o42M04J302J230K71n80m49
55247G085M53J102Q69J73j88n5L5l22q12q35l01J92L5o47j059n88M76J189R39
55228G741P2m81k07M68O66Jj047j675j562j008l97J56O32Q20N56R5m5L50R02J069
55208G106P10J77l4K62Q21J160R55L17l27n91m24r8m7n71j520k208j882n12R43
$$ y = [6404, 6126, 5205, 3927, 2665, 1573, 909, 1192, 2613, 4482, 5735, 5968, 5637, 5240, 4687, 3679, 2336, 1106, 206, -412, -632, -146, 996, 2229, 3151, 4038, 5293, 6659, 7469, 7657, 7928, 8798, 9892, 10493, 10443, 10177, 10109, 10303, 10551, 10453, 9596, 8055, 6626, 6116, 6372, 6448, 5801, 4913, 4510, 4568, 4463, 3868, 3113, 2694, 2736, 3022, 3357, 3779, 4446, 5320, 5989, 5921, 4963, 3492, 2059, 1078, 837, 1451, 2551, 3327, 3301, 2943, 3112, 3970, 4861, 5268, 5389, 5604, 5857, 5885, 5792, 5919, 6304, 6641, 6782, 6909, 7125, 7127, 6546, 5549, 4907, 5311, 6613, 7843, 8114, 7534, 7085, 7538, 8640, 9509, 9682, 9494, 9439, 9474, 9152, 8340, 7505, 7204, 7396, 7431, 6784, 5725, 5137, 5613, 6802, 7741, 7813, 7332, 7125, 7593, 8259, 8260, 7213, 5538, 3976, 2968, 2571, 2727, 3359, 4179, 4735, 4830, 4785, 5135, 6037, 7106, 7816, 7993, 7959, 8221, 9042, 10202, 11157, 11474, 11147, 10556, 10132, 10034, 9987, 9416, 7896, 5688, 3806, 3294, 4237]
55189D237J290K91j093j700j328p23D44a85n69k52J13d21D83J311J464J407J356
55172F021J216P02pk83O0L88J75k37k94j88m79j035j144o40j76k19m19k56J85
55153C370M04J97k16n04m85k05J02K53L48N36O27L23j60k11K38M70J6n51l81L97
55133D568Q33M61j56k87O0L77M06L21K40K1l64n30j10N96Q09K74k73mR03J529
55113I674J448J154J176J353J248Q73O40Q15J288J624J330L34o53p21J21Q43P06
55096B3253J51j6K16K50j28o05r26j018o67K17J089J156L82m28o37l78j24j10
55078B1677l12n66n78j47M53O33J38p21j407j547j062k86J57n1m53l77J78O89
55060A6418R37J065R55L61m03o61l85j98k29M5N87N04m60j227r45l75o64j491
$$ y = [4237, 5527, 5818, 4725, 3025, 1697, 974, 444, -185, -754, -1006, -893, -421, 483, 1794, 3258, 4665, 6021, 7237, 7939, 7932, 7649, 7709, 8097, 8272, 8035, 7741, 7553, 7074, 6039, 4895, 4255, 4079, 3860, 3441, 3185, 3370, 3774, 3971, 3755, 3251, 2766, 2561, 2663, 2916, 3264, 3800, 4427, 4750, 4590, 4379, 4617, 5087, 5103, 4552, 4171, 4568, 5401, 5862, 5706, 5419, 5479, 5856, 6262, 6583, 6823, 6844, 6480, 5950, 5840, 6436, 7245, 7519, 7246, 7242, 8145, 9674, 11122, 12276, 13452, 14805, 16053, 16926, 17566, 18381, 19669, 21293, 22623, 22957, 22304, 21583, 21704, 22547, 23253, 23404, 23388, 23604, 23854, 23726, 23121, 22195, 21177, 20510, 20727, 21816, 22972, 23354, 22926, 22289, 21911, 21787, 21677, 21365, 20799, 20221, 20074, 20527, 21160, 21298, 20577, 19170, 17623, 16561, 16275, 16432, 16381, 15928, 15551, 15729, 16418, 17355, 18420, 19375, 19736, 19333, 18672, 18287, 18089, 17860, 17905, 18492, 18996, 18536, 17309, 16364, 15989, 15325, 13834]
55042A3834j618q39j30L7K36Q73J466J481J076O76M18L10L88M29O2o16r96p46
55024A6341k19J26K81M06M70M34M95Q27J271J507J348Q03Q9l75l16P0L88O17R74
55005B5537J290J147O56M40O67P70M01J2N0K02kl54l16P0L04J96J8J6J96M86O85
54984C2471M95m6l60m6N20P37P06R59J443J470P36k05o56n50l22l33n58o61l64
54965C5436J46L46J08mM63J038R37K88J2M99J060Q84K5p75r00k92N97J186J345
54946D2399J533K060K535K555K620L423M431M359L302L085M867P490R119R699
54932A03477J0593J2316J3826J3920J2327R402N695J963j156l732o297q865j0770
54919A52699j1490j1166j0212q982p942p523p587p413o532n169l795k697k117
$$ y = [13834, 12216, 11377, 11247, 11284, 11520, 12393, 13859, 15340, 16416, 17092, 17510, 17820, 18208, 18637, 18699, 18083, 17087, 16341, 16122, 16248, 16529, 16935, 17405, 17839, 18334, 19161, 20432, 21939, 23287, 24090, 24179, 23804, 23488, 23558, 23946, 24563, 25537, 26827, 27974, 28630, 29070, 29737, 30507, 30908, 30920, 30970, 31172, 31170, 30816, 30500, 30570, 30874, 31070, 31088, 31104, 31300, 31786, 32471, 32966, 32920, 32560, 32514, 33034, 33771, 34477, 35436, 36879, 38349, 39085, 38880, 38224, 37674, 37352, 37019, 36461, 35800, 35436, 35582, 35928, 36036, 36032, 36495, 37533, 38470, 38758, 38770, 39269, 40329, 41213, 41238, 40463, 39563, 39271, 39868, 41054, 42399, 43932, 45992, 48527, 51082, 53702, 57125, 61556, 65915, 69217, 72302, 77169, 84659, 93778, 103477, 114070, 126386, 140212, 154132, 166459, 175861, 181556, 183519, 182363, 178631, 172334, 163469, 152699, 141209, 130043, 119831, 110849, 102907, 95384, 87797, 80384, 73852, 68683, 64888, 62191, 60074]
54906F0074k272k888l136k453j117K24J292K138K724K992L155L572M412N628P074
54891H1419Q382R071R141R371J0449J1817J1979J0022O501K686o78l600o222q471
54877A51867j0217j1459j2159j2151j1291r723p870o225n118m579m298l845l059
54864D9873k266j895j922j854j349o01k4K02N1n05j268j599j041j13N1r31k127
54847C2682k377j560n14K9K1k17m49o36q35j043j086p48j04M65P26P94P48L29
54829B6225n68j395j411o55J0j08q73j668k025j728p80M49J326J509J317J264
54813B0889J409J371R66N51O24J224J784J598M98q67j534j091m0P56Q67N71M38
54796C0014P80J384J697J369P06M78J150K373L367L746L829M151M863N687O363
$$ y = [60074, 57802, 54914, 51778, 49325, 48208, 48432, 49724, 51862, 54586, 57578, 60733, 64305, 68717, 74345, 81419, 89801, 98872, 108013, 117384, 127833, 139650, 151629, 161651, 168152, 170838, 170160, 166560, 160338, 151867, 141650, 130191, 118032, 105881, 94590, 84867, 76997, 70772, 65654, 61075, 56777, 52932, 49873, 47607, 45712, 43790, 41936, 40587, 39986, 39962, 40164, 40215, 39710, 38442, 36843, 35802, 35689, 35740, 34809, 32682, 30305, 28745, 28231, 28260, 28281, 28064, 27615, 26979, 26144, 25101, 24015, 23267, 23163, 23628, 24354, 25148, 25896, 26225, 25657, 24262, 22851, 22196, 22206, 22098, 21225, 19557, 17532, 15804, 15024, 15473, 16799, 18308, 19625, 20889, 22298, 23669, 24635, 25186, 25810, 27034, 28818, 30416, 30914, 30047, 28513, 27422, 27382, 28138, 29005, 29576, 30014, 30794, 32178, 33875, 35244, 35950, 36428, 37578, 39951, 43318, 47064, 50893, 55044, 59907, 65594, 71957]
54781G1957O977P772Q682R330R540R663J0035J0228R341P083M171J401j182l855
54767A61143o357q143r212j0002j0447r902q263o517n666n486m892l439j914j330
54753F9573j709k085j669p03m4J1J08Q64J870K201J804J749K891M755O224O963
54737I2803P672R065J0975J2587J3239J2910J2012J0728Q705N574J672k075n103
54724A90764p580r744j1338j2053j2089j1868j1536j1095j0648j0042q725o537
54712F7509m310l018k560k142j598j483j932k296k072j406n99R2J95o01j639j789
54696D0351j020m64n83m41O22J679J617Q48N43P44N70j14n42m74m97p96p20M4
54678D1367Q10Q59M45L13P27J353J773J794J488J149J033J041Q68M76Q7k08m84
$$ y = [71957, 78934, 86706, 95388, 104718, 114258, 123921, 133956, 144184, 153525, 160608, 164779, 166180, 164998, 161143, 154786, 146643, 137431, 127429, 116982, 107080, 98817, 92300, 86634, 81148, 76256, 72817, 70903, 69573, 67864, 65779, 64110, 63407, 63363, 63374, 63482, 64346, 66216, 68417, 70221, 71970, 74861, 79616, 85840, 92803, 100475, 109540, 120515, 133102, 146341, 159251, 171263, 181991, 190696, 196270, 197942, 195867, 190764, 183184, 173440, 162102, 150049, 137960, 126092, 114556, 103461, 92813, 82771, 74046, 67509, 63199, 60181, 57621, 55479, 53881, 52398, 50466, 48170, 46098, 44692, 44093, 44185, 44380, 43779, 42140, 40351, 39331, 38867, 38284, 37843, 38465, 40144, 41761, 42609, 43152, 43896, 44466, 44352, 43810, 43336, 42839, 42043, 41323, 41367, 42177, 43036, 43481, 43794, 44521, 45874, 47647, 49441, 50929, 52078, 53111, 54152, 55020, 55496, 55583, 55375, 54891]
54661E4891o64o04m69n61p81p50n19n78r96j147n52M06R58Q19L09j36l51m62o74
54642D8139q85o68J24R20J051P07O45R93J115P64N63J030J891K758L786N071O070
54625G4074O289O101O162O424O412O125N908N636M748L053R46j146k928m059m396
54610A19349m388m592m864m708m298m339m826m819l840k662k206k324k275j978
54596F7230j997k519l037l080k720k207j584q13q0K94J45l40p08o10k04j7k86
54579D7467n96m72j05o9m05n22j53J58j68r47j543j678j458r07n6O78P87L75N7
54560D0443O8O7j33k41j41k12o51j005q59m97l99m54k30K72P06R36R61O61J22
54541C9414j07K30M56r4q25o18L98R42N43J98P40J610J830J321O52K29K85R83
$$ y = [54891, 54227, 53623, 53154, 52593, 51812, 51062, 50543, 49965, 48969, 47822, 47270, 47676, 48634, 49453, 49762, 49626, 49275, 48813, 48139, 47254, 46586, 46710, 47630, 48681, 49388, 50033, 51026, 52141, 52905, 53468, 54498, 56389, 59147, 62933, 68004, 74074, 80363, 86464, 92626, 99050, 105462, 111587, 117495, 123131, 127879, 130932, 131878, 130732, 127804, 123745, 119349, 114961, 110369, 105505, 100797, 96499, 92160, 87334, 82515, 78675, 76013, 73807, 71483, 69208, 67230, 65233, 62714, 59677, 56597, 53877, 51670, 50086, 49273, 49193, 49487, 49632, 49292, 48584, 47974, 47770, 47753, 47467, 46871, 46399, 46294, 46225, 45820, 45298, 45145, 45303, 45135, 44188, 42645, 40967, 39509, 38602, 38546, 39224, 40011, 40386, 40443, 40511, 40578, 40445, 40204, 40063, 39851, 39200, 38195, 37336, 36839, 36440, 35986, 35756, 36028, 36734, 37670, 38631, 39292, 39414, 39307, 39537, 39993, 39899, 39074, 38456, 38854, 39796, 40339, 40537, 41277, 42887, 44717, 46038, 46690, 46919, 47204, 48187]
54523D8187J994K517K248J735J413J050O27Q04J805K685K576J969J785J949J886
54508G5230J717J752J390k5j660k064j365j052j526j625q73m57j273k440k774
54493F2955k482k268j843o54O42Q82K03j39L38Q64Q54O92P32M88n43j850k365
54476E6506j728n69L13O77P27O70N82N37O02O56M38j32p84j221j390j317q33J28
54458E3862J081J318P84J95J35L96M78L33K75L63K97r0o02r31r67p70m41r9Kl95
54438E5224j201j723j163M20J872K077J162J98j57j97l59n56n49l94j82K15P85
54421E5472J124R67O31M75L13j34m96j54O69R99M48j27L02J560K438K160J243
54404F7890Q64J517K527K820K069R42K70J92K25J8k66k64M4L03J61m01j095j571
$$ y = [48187, 50181, 52698, 54946, 56681, 58094, 59144, 59771, 60575, 62380, 65065, 67641, 69610, 71395, 73344, 75230, 76947, 78699, 80089, 80064, 78404, 76340, 74975, 73923, 72397, 70772, 69899, 69442, 68169, 65729, 62955, 60473, 58205, 56362, 55708, 56350, 57232, 57435, 57296, 57634, 58498, 59352, 60044, 60776, 61264, 60721, 58871, 56506, 54778, 54209, 54522, 55199, 55926, 56596, 57178, 57715, 58317, 58973, 59411, 59279, 58495, 57274, 55884, 54567, 53734, 53862, 54943, 56261, 57045, 57240, 57375, 57771, 58249, 58582, 58857, 59220, 59517, 59427, 58825, 57894, 56927, 56157, 55716, 55617, 55619, 55224, 54023, 52300, 51137, 51557, 53429, 55506, 56668, 56866, 56709, 56512, 56153, 55597, 55048, 54654, 54472, 54687, 55472, 56596, 57563, 58194, 58669, 58982, 58848, 58352, 58198, 58867, 59866, 60314, 60187, 60489, 62049, 64487, 66647, 67890, 68754, 70271, 72798, 75618, 77687, 78629, 78899, 79091, 79316, 79334, 79068, 78804, 78848, 79151, 79312, 78911, 77816, 76245]
54386G6245j591j129m22J17K64K61M90Q22N82n60j985k750k632k077j318k12R47
54369F5052J250K99j022j460q78k41k28n23n17j98N9J76L97P41Q46N39K23L70
54351F4885Q34R84N98K80P38J877K793K685J581K13o60q42p37q34j157j324j097
54334G0817o20j17L33N43J75p59j704k202k401k554k459j864j149q93j049j140
54318E2957j091j114j045n77p3j90o58n58N6qj145j998j311J95Q53L44j85K9M90
54299D4971N77M90P61J330J589J090Jj044j463j173n80j44ONK0J32L00M06M70
54280D7744O71R55Q54J25o64p62k98j6n5J33O67J028J109J358J619J075j29n25
54262E4889N31J570J064k99p86k59j9m67o65j49K91K5n29p71o86m30K7M87M96
$$ y = [76245, 74654, 73525, 73103, 73220, 73484, 73745, 74235, 75057, 75639, 75079, 73094, 70344, 67712, 65635, 64317, 64105, 65052, 66302, 66601, 65579, 64119, 63241, 63000, 62772, 62249, 61732, 61534, 61593, 61769, 62166, 62907, 63753, 64292, 64515, 64885, 65719, 66703, 67301, 67581, 68319, 70196, 72989, 75674, 77255, 77468, 76808, 75966, 75229, 74395, 73238, 71914, 70817, 70197, 70080, 70413, 70956, 71131, 70372, 68668, 66466, 64065, 61511, 59052, 57188, 56039, 55146, 54097, 52957, 51866, 50752, 49707, 49130, 49057, 48867, 48209, 47651, 47707, 47699, 46554, 44556, 43245, 43440, 44293, 44637, 44452, 44481, 44971, 45548, 46038, 46799, 48129, 49718, 50808, 50809, 49765, 48302, 47129, 46549, 46405, 46411, 46416, 46436, 46568, 46868, 47274, 47744, 48415, 49370, 50224, 50349, 49685, 48923, 48625, 48609, 48554, 48687, 49354, 50382, 51491, 52849, 54468, 55543, 55414, 54889, 55420, 56990, 58054, 57755, 56969, 56710, 56691, 56224, 55559, 55410, 55701, 55726, 55197, 54426, 53740, 53310, 53337, 53824, 54320]
54243E4320l0o55j094j416j581j463j223j108q80k29M38M55L1j9L51M09M7LM44
54224D6800N17k28j013j043o34m22l27M2N51Q09P62N31J10l41m30j47n9m49q67
54205D4162q76o42l95k4M14M27j15o16o43n25n48l34K91N97Lq86j149r03q14q49
54185C6575n44j74m24j090j175l89M77P40O12N06L41j72r54j546j422m09R17J498
54167C3367Q67j96o40m67n08j047j483j334q66n22l08%M64R19J103Q11J68l31
54149B9997l72j55P6N32J348J948J665P26rk42l96o64p19m65l40n96r42j032q41
54130B9519m24J45N04K48l61n78j47M32P04P52P77P24N79M49K09l03p69o09R0
54111C1941N80N25L69M48N23M13L23K21k30p91o53K08O99L16P9Q56J792J629P64
$$ y = [54320, 54290, 53635, 52541, 51125, 49544, 48081, 46858, 45750, 44870, 44641, 45079, 45534, 45565, 45546, 45897, 46306, 46353, 46356, 46800, 47317, 47089, 46076, 45033, 44399, 43977, 43650, 43692, 44243, 45052, 45814, 46345, 46455, 46114, 45684, 45537, 45478, 45029, 44162, 43286, 42644, 42249, 42225, 42639, 43066, 42951, 42335, 41692, 41167, 40619, 40285, 40576, 41173, 41176, 40290, 39141, 38238, 37424, 36575, 36031, 35857, 35433, 34343, 33168, 32779, 33256, 33996, 34608, 35114, 35455, 35283, 34329, 32783, 31361, 30952, 31869, 33367, 34234, 34038, 33398, 32931, 32423, 31376, 29893, 28559, 27693, 27171, 26863, 26863, 27327, 28246, 29349, 30160, 30328, 29997, 29625, 29470, 29546, 30078, 31426, 33374, 35039, 35765, 35756, 35514, 35118, 34454, 33735, 33270, 32930, 32334, 31392, 30360, 29519, 29095, 29240, 29744, 29992, 29631, 29053, 28906, 29338, 30042, 30794, 31571, 32295, 32874, 33323, 33532, 33229, 32460, 31851, 31941, 32521, 33046, 33415, 33863, 34386, 34799, 35122, 35343, 35113, 34322, 33669, 33877, 34576, 34892, 34971, 35827, 37619, 39248, 40012]
54092D0012N37R91R56J57l74j67k4m03n07K58J007O23m94r29j38J137K084K589
54074D7315K711K241J180J50j54J92M22Q8l49j85M57P31K99j11K55J034J287Q39
54056E8402M04M45O81P29N90K72l09p72l74Q97J957J938J366J341J989K421K087
54039G4064J349Q54Q89J436K255K852K880K625K643K859K588J626P21O66J333
54024A01640J948J938J285K70p21j438j944k416k610k026r12n00j602l310l892
54009H5710k956j844j801k476k713k182j541j320j342j269j111r83p61l07J31
53994F3235R2n51j385j868j800j335o88nM99N18p0r55j564j478o75N16J578K040
53976E6104J829J407J365J782K104J773Q49m2l67k06o8l09p32q06l27L11N94M96
$$ y = [40012, 40549, 41540, 42496, 42653, 42279, 42112, 42088, 41685, 41178, 41436, 42443, 43066, 42572, 41643, 41505, 42642, 44726, 47315, 50026, 52267, 53447, 53597, 53443, 53635, 54057, 54145, 53796, 53611, 54068, 54799, 55098, 54987, 55242, 56276, 57563, 58402, 58806, 59251, 59932, 60661, 61251, 61523, 61214, 60442, 60068, 60965, 62922, 64860, 66226, 67567, 69556, 71977, 74064, 75413, 76267, 77156, 78592, 80847, 83699, 86579, 89204, 91847, 94706, 97294, 98920, 99641, 100307, 101640, 103588, 105526, 106811, 107081, 106360, 104922, 102978, 100562, 97952, 95926, 95014, 94514, 92912, 89602, 85710, 82754, 80910, 79109, 76633, 73920, 71738, 70197, 68877, 67535, 66266, 65155, 64172, 63411, 63104, 63235, 63327, 62776, 61391, 59523, 57723, 56388, 55700, 55695, 56194, 56712, 56642, 55687, 54123, 52645, 51970, 52486, 54064, 56104, 57933, 59340, 60705, 62487, 64591, 66364, 67213, 67171, 66804, 66598, 66530, 66221, 65489, 64683, 64356, 64667, 65261, 65757]
53958F5757M57P27J064J100Q51P16R82J444J506Q27j54m92K28J371K041K179K474
53941H3078L235L967M109L724L253L052L385M290N184N209M348L653L765L857
53927A38109K803R41l70o86q53j423j819j478p98l05K55J218J993J661L70p34
53911A38884r57o92n10l58K0L36Mj003j983k300k098k028k397k815k809k487k358
53894A14449k621k985l147l103k936k640k302k143k164k091j801j506j291r01
53880H2818l42k54j126k333k679j882r34p79j228j422r72j97M54P64O24k0r28
53863F9564j565j576j177q74q11o49j72K30K7o01q37k39O44R73N76l2l51k70L9
53844F2899K70J40k52l90j9L68J97k47k07L13N10J01j77K57R39J160J046J168
$$ y = [65757, 66214, 66941, 68005, 69105, 69956, 70672, 71654, 73098, 74604, 75431, 75277, 74785, 75013, 76384, 78425, 80604, 83078, 86313, 90280, 94389, 98113, 101366, 104418, 107803, 112093, 117277, 122486, 126834, 130487, 134252, 138109, 140912, 141853, 141483, 140797, 139944, 138521, 136702, 135224, 134426, 134121, 134376, 135594, 137587, 139248, 139618, 138884, 137927, 137235, 136725, 136367, 136387, 136723, 136727, 135724, 133741, 131441, 129343, 127315, 124918, 122103, 119294, 116807, 114449, 111828, 108843, 105696, 102593, 99657, 97017, 94715, 92572, 90408, 88317, 86516, 85010, 83719, 82818, 82476, 82222, 81096, 78763, 76084, 74202, 73268, 72489, 71261, 69839, 68867, 68670, 69124, 69888, 70512, 70492, 69564, 67999, 66423, 65246, 64372, 63561, 62912, 62740, 62970, 62997, 62396, 61559, 61320, 61964, 62937, 63513, 63481, 63130, 62860, 62899, 63169, 63309, 63057, 62667, 62648, 63016, 63213, 62966, 62759, 63072, 63582, 63683, 63506, 63763, 64702, 65862, 66908, 68076]
53826F8076J503J542J193Q87Q66J005J225J492J525J113O47O79J021R46M26L56
53810H4502J212K276K623K259J790J470J255J372K072K947L177K516J533Q51O53
53795A12508Q94J432J795J367J15j131j478r04j41J68Kk61l72m28o13q63q99o33
53777A10558m13o47j244j694j679j413j333j560j820j783j441j155j295j760k032
53762H9289j823j435j305j318r95k25N48R14Q24L14o20j720k412k373j879j367
53746G4417r03l29L31R13J350J631J703J671J871K338K478J666J83r08q99j03
53730H7410O50R07P95N93L86J77O3K57Q36J619K300K653K582K137J624J525J949
53713A08463K305J936J025L88L83N85O94J023J731K324K445K596L317M136M200
$$ y = [68076, 69579, 71121, 72314, 73201, 74067, 75072, 76297, 77789, 79314, 80427, 81074, 81753, 82774, 83720, 84146, 84502, 85714, 87990, 90613, 92872, 94662, 96132, 97387, 98759, 100831, 103778, 106955, 109471, 111004, 111855, 112508, 113402, 114834, 116629, 117996, 118111, 116980, 115502, 114598, 114457, 114625, 114627, 114366, 113994, 113566, 112953, 112090, 111191, 110558, 110145, 109498, 108254, 106560, 104881, 103468, 102135, 100575, 98755, 96972, 95531, 94376, 93081, 91321, 89289, 87466, 86031, 84726, 83408, 82413, 82188, 82736, 83650, 84474, 84788, 84168, 82448, 80036, 77663, 75784, 74417, 73514, 73185, 73516, 74429, 75779, 77410, 79113, 80784, 82655, 84993, 87471, 89137, 89320, 88412, 87513, 87410, 88060, 88967, 89762, 90355, 90741, 90918, 90981, 91238, 92074, 93693, 95993, 98646, 101228, 103365, 104989, 106514, 108463, 110768, 112704, 113729, 114117, 114500, 115085, 115779, 116802, 118533, 120857, 123302, 125898, 129215, 133351, 137551]
53698A37551L608L209L299L454L476L497L184J969L22l94K44J049R60M99O47J208
53682A67782J277Q03N44P72J023J052J072J065O61q4n81n12j94J5J14Q0k55p56
53664A73878r17n52j17n0j98k16j59l42q28j412j888k028j543m61O27R84M55m08
53646A64825r47r59p06n32m75k35M05J216J689J575J063M62mj21K37Q44J297J552
53628A71186J965K600K989K886K757L022L289K964K353K346L026L438K941K136
53614B09898K000K633L360L697L781L898M065M148M134M248M718N383N637N037
53600B66637L946L185K997K814K287J950K383L175L408K892K284K020J852J537
53586C03367J278J218J041M40l80j073j628k173k570k650k611k696k692k207j438
$$ y = [137551, 141159, 144368, 147667, 151121, 154597, 158094, 161278, 163247, 163569, 163175, 163419, 164468, 165428, 165927, 166574, 167782, 169059, 169862, 170406, 171178, 172201, 173253, 174325, 175390, 176051, 175967, 175386, 174874, 174680, 174695, 174809, 174889, 174634, 173878, 172961, 172409, 172292, 172242, 172044, 171828, 171669, 171327, 170499, 169087, 167199, 165171, 163628, 163167, 163794, 164778, 165233, 164825, 163878, 162919, 162213, 161681, 161206, 160971, 161376, 162592, 164281, 165856, 166919, 167381, 167377, 167256, 167493, 168337, 169634, 171186, 173151, 175751, 178740, 181626, 184383, 187405, 190694, 193658, 196011, 198357, 201383, 204821, 207762, 209898, 211898, 214531, 217891, 221588, 225369, 229267, 233332, 237480, 241614, 245862, 250580, 255963, 261600, 266637, 270583, 273768, 276765, 279579, 281866, 283816, 286199, 289374, 292782, 295674, 297958, 299978, 301830, 303367, 304645, 305863, 306904, 307344, 306964, 305891, 304263, 302090, 299520, 296870, 294259, 291563, 288871, 286664, 285226]
53571B85226j092j463k008k077j679j248r42n97k14o7k66n60p18q60j181j542
53555B68712j584j218p05k99m6L5j22l77l52J22P15J048J203J505J948K277K528
53538B75390L034L813M358M295L907L806M238M910N407N666O088P136Q660R782
53524C50490R835R334R516J0842J2508J3619J4209J4750J5267J5575J5971J6939
53512E08855J8278J9243J9578J9813K0435K1280K1917K2330K2859K3674K4449
53501G42711K4567K3717K2380K1555K1740K2394K2653K2395K2199K2407K2776
53490I91494K3040K3319K3774K4245K4411K4132K3494K2692K1889K1035J9935
53479A243460J8651J7636J7101J6565J5480J4100J3090J2343J1089R221P647O927
$$ y = [285226, 284134, 282671, 280663, 278586, 276907, 275659, 274717, 274120, 273906, 273839, 273573, 273013, 272295, 271435, 270254, 268712, 267128, 265910, 265205, 264906, 264860, 264895, 264773, 264396, 264044, 264166, 264881, 265929, 267132, 268637, 270585, 272862, 275390, 278424, 282237, 286595, 290890, 294797, 298603, 302841, 307751, 313158, 318824, 324912, 332048, 340708, 350490, 360325, 369659, 379175, 390017, 402525, 416144, 430353, 445103, 460370, 475945, 491916, 508855, 527133, 546376, 565954, 585767, 606202, 627482, 649399, 671729, 694588, 718262, 742711, 767278, 790995, 813375, 834930, 856670, 879064, 901717, 924112, 946311, 968718, 991494, 1014534, 1037853, 1061627, 1085872, 1110283, 1134415, 1157909, 1180601, 1202490, 1223525, 1243460, 1262111, 1279747, 1296848, 1313413, 1328893, 1342993, 1356083, 1368426, 1379515, 1388736, 1396383, 1403310]
53467A403310O309M675J944j075l742n894p503q639r697j1060j2635j4114j5522
53454A326357j7036j8432j9276j9648k0096k0802k1331k1364k1194k1232k1386
53443A104560k1316k1016k0767k0538j9890j8537j6748j5010j3518j2178j1006
53432I14036j0148r553q925q094p098n811l900j447P92K219L200M548O394Q241
53418H84454R976J1998J4271J6133J7303J8422K0014K1630K2542K2906K3521K4800
53406A107970K6479K8214K9856L1336L2768L4541L6804L9014M0478M1316M2410
53395A491186M4326M6715M8896N0589N1948N3135N4099N4723N5044N5312N5672
53384B061645N5809N5166N3689N2088N1008N0145M8476M5338M1048L6464L2177
$$ y = [1403310, 1409619, 1414294, 1416238, 1415163, 1411421, 1405527, 1398024, 1389385, 1379688, 1368628, 1355993, 1341879, 1326357, 1309321, 1290889, 1271613, 1251965, 1231869, 1211067, 1189736, 1168372, 1147178, 1125946, 1104560, 1083244, 1062228, 1041461, 1020923, 1001033, 982496, 965748, 950738, 937220, 925042, 914036, 903888, 894335, 885410, 877316, 870218, 864407, 860507, 859060, 859852, 862071, 865271, 869819, 876213, 884454, 894430, 906428, 920699, 936832, 954135, 972557, 992571, 1014201, 1036743, 1059649, 1083170, 1107970, 1134449, 1162663, 1192519, 1223855, 1256623, 1291164, 1327968, 1366982, 1407460, 1448776, 1491186, 1535512, 1582227, 1631123, 1681712, 1733660, 1786795, 1840894, 1895617, 1950661, 2005973, 2061645, 2117454, 2172620, 2226309, 2278397, 2329405, 2379550, 2428026, 2473364, 2514412, 2550876, 2583053]
53373B583053K8082K3688J8894J4411J1112Q980P059M515J266k558p039j1941
53361B679522j6455k0237k4174k9361l5571m1537m6518n0729n4391n7230n9040
53350B244279n9948n9986n9041n7433n5883n4712n3588n2238n0841m9577m8351
53339A642681m7238m6629m6649m6791m6425m5228m3103m0195l7171l4908l3509
53328A174835l2071k9757k6742k3842k1595k0037j8841j7425j5329j2906j1176
53317I45114j0543j0094q738o634m874l933l147j768M2J476K001J895J979K895
53303I05671M496O086P275Q371R781J1377J2811J4185J5861J7723J9255K0430
53291A053322K1991K4441K7078K8583K8468K7618K7178K7246K6985K5880K4333
$$ y = [2583053, 2611135, 2634823, 2653717, 2668128, 2679240, 2688220, 2695279, 2699794, 2701060, 2698502, 2691463, 2679522, 2663067, 2642830, 2618656, 2589295, 2553724, 2512187, 2465669, 2414940, 2360549, 2303319, 2244279, 2184331, 2124345, 2065304, 2007871, 1951988, 1897276, 1843688, 1791450, 1740609, 1691032, 1642681, 1595443, 1548814, 1502165, 1455374, 1408949, 1363721, 1320618, 1280423, 1243252, 1208344, 1174835, 1142764, 1113007, 1086265, 1062423, 1040828, 1020791, 1001950, 984525, 969196, 956290, 945114, 934571, 924477, 915739, 909105, 904231, 900298, 897151, 895383, 895425, 896901, 898902, 900797, 902776, 905671, 910167, 916253, 923528, 931899, 941680, 953057, 965868, 980053, 995914, 1013637, 1032892, 1053322, 1075313, 1099754, 1126832, 1155415, 1183883, 1211501, 1238679, 1265925, 1292910, 1318790, 1343123]
53280A343123K2875K1271J8938J5965J3112J0819Q782O699M849L610K769J789
53268A474601N00q56k151l606n467p712j0127j2509j4787j7007j9230k1484k3781
53255A336384k6130k8370l0155l1301l2062l2782l3447l3865l4145l4440l4346
53244I85341l3197l1076k8927k7406k6198k4779k3264k2119k1501k1338k1621
53233G03915k2139k2297k1703k0668j9654j8566j7080j5351j3815j2523j1287
53222E08832j0311r985j0111r929r076q020p463p714q649r861j0733j0795j0129
53209C86056r195q270p338o477n938n775n743n640n455n169m786m512m613m980
53195C02165n213n157n035m982m890m751m745m828m634m028l362k891k355j427
$$ y = [1343123, 1365998, 1387269, 1406207, 1422172, 1435284, 1446103, 1454885, 1461584, 1466433, 1470043, 1472812, 1474601, 1475101, 1474245, 1472094, 1468488, 1463021, 1455309, 1445182, 1432673, 1417886, 1400879, 1381649, 1360165, 1336384, 1310254, 1281884, 1251729, 1220428, 1188366, 1155584, 1122137, 1088272, 1054127, 1019687, 985341, 952144, 921068, 892141, 864735, 838537, 813758, 790494, 768375, 746874, 725536, 703915, 681776, 659479, 637776, 617108, 597454, 578888, 561808, 546457, 532642, 520119, 508832, 498521, 488536, 478425, 468496, 459420, 451400, 443937, 436223, 427574, 417713, 406980, 396185, 386056, 376861, 368591, 361253, 354776, 348838, 343063, 337320, 331680, 326225, 321056, 316270, 311758, 307145, 302165, 296952, 291795, 286760, 281778, 276888, 272137, 267392, 262564, 257930, 253902, 250540, 247649, 245294, 243867]
53181B43867m22kl30q61j106j177j390j648j540j052p63j083j654j839j649j626
53165B25725j856j741j005k73j58l04j6N38N80M3l03q8R3k84q11p80k45R9j80
53146B19034r32j790k452k669k364j766j244r59q34p63p25p04n99k43M11J118
53130B02519J425J156O43K94L3n00j265j836k086k370k780k803k087j147q44j344
53114A87008k046k428k528k574k570k334j827j301j117j382j790j992k062k324
53100A58733k665k476j568o45m62p85p82k89L8k53q41j282j616k021k339k308
53084A38439j950j390o10K14M77j68j084j253o18j64n49j238j387j001p26p93
53068A26199q50o97n70o28o62m78k44j80k75m11n47o10m45j07M3k47q15j313j526
$$ y = [243867, 243445, 243443, 243113, 242252, 241146, 239969, 238579, 236931, 235391, 234339, 233576, 232493, 230839, 229000, 227351, 225725, 223869, 222128, 221123, 220850, 220692, 220388, 220372, 220910, 221490, 221533, 221230, 221142, 221235, 220951, 220140, 219360, 219115, 219214, 219034, 218102, 216312, 213860, 211191, 208827, 207061, 205817, 204858, 204024, 203261, 202536, 201832, 201233, 200990, 201401, 202519, 203944, 205100, 205743, 206037, 206070, 205570, 204305, 202469, 200383, 198013, 195233, 192430, 190343, 189196, 188352, 187008, 184962, 182534, 180006, 177432, 174862, 172528, 170701, 169400, 168283, 166901, 165111, 163119, 161057, 158733, 156068, 153592, 152024, 151379, 150917, 150132, 149350, 149061, 149099, 148846, 148005, 146723, 145107, 143086, 140747, 138439, 136489, 135099, 134489, 134703, 135180, 135012, 133928, 132675, 132057, 131893, 131344, 130106, 128719, 127718, 126992, 126199, 125349, 124652, 124082, 123454, 122792, 122314, 122070, 121890, 121615, 121204, 120657, 120047, 119602, 119495, 119538, 119291, 118476, 117163, 115637]
53049A15637j354q11l12m77j290j784j133J50P29R8q64j049k99O93J196R71L45
53032A10446L0M78J251J370N21m88p04j24N32P97P83P00N90N14N95P32N64r3r21
53013A17573j371j206p11l76m69r04j453j944k288k463k568k696k658j996o61
52998I3809N82Q66K97j40J06N22L91j94o12o47n98o55p28q04j041j371j490j279
52980H7014r38n81p2N61Q98O31J10K9N95J270J383Q29R8k38J1O19J194J458J307
52961I6178P89P9n22p63o75n36m78k79K79R16J048N75J35L17R20J320J381J450
52943A02134J561J259M62j48M9P49J205J199J064R31O20J76n8k0j13o07j267j662
52925A07534j566r91j17O85J096J196J340J550J512J152Q56Q60Q84O75M93O98
$$ y = [115637, 114283, 113472, 113160, 112683, 111393, 109609, 108476, 108626, 109355, 109453, 108589, 107540, 107241, 107934, 109130, 110101, 110446, 110476, 110954, 112205, 113575, 114096, 113608, 112904, 112780, 113312, 114109, 114892, 115592, 116182, 116696, 117291, 118023, 118587, 118494, 117573, 116202, 114996, 114285, 113909, 113440, 112536, 111083, 109139, 106851, 104388, 101820, 99124, 96466, 94470, 93809, 94391, 95257, 95554, 95414, 95520, 96042, 96433, 96239, 95627, 94980, 94382, 93727, 92999, 92195, 91154, 89783, 88293, 87014, 86076, 85495, 85423, 85984, 86882, 87513, 87623, 87652, 88247, 89517, 90900, 91729, 91827, 91589, 91600, 92219, 93413, 94871, 96178, 96967, 97046, 96524, 95761, 95086, 94550, 94072, 93793, 94072, 94988, 96036, 96611, 96746, 97063, 97983, 99303, 100684, 102134, 103695, 104954, 105416, 105268, 105317, 106066, 107271, 108470, 109534, 110465, 111085, 111261, 111203, 111183, 111070, 110463, 109196, 107534, 105968, 104977, 104860, 105545, 106641, 107837, 109177, 110727, 112239, 113391, 114247, 115107, 115991, 116666, 117159, 117857]
52909A17857J098J181Q30M33L26M07L69J08j73k02K6K37K74L60P19J096J091Q84
52891A26921J063J620J805J206L34k09n23q16o75K94J460J745J065L51K11L48
52875A36200L94N33J058J823K468K705K312J299K33j81l7j91j008j765j689j022
52859A43132m89k72j17j13o08j388j706j211l76J35J70Np8LJ13l3n21r93r97o42
52839A34014o09j326k400l068k951k222j225k72L25L65n5n59q28p95n79l39j93
52822A17283j92k92l80l14nM28O01J37q83j916k491k615k435j821o61N25Q42M0
52804A05851j083j551j218o85m88o43q79r75q78p13o21n50l05O0J92o7l85m49
52786I4613m39o30p94n38j30l40j347k380k612k013j103k96K26L93L01K23K30
$$ y = [117857, 118955, 120136, 120966, 121399, 121725, 122132, 122501, 122609, 122436, 122234, 122260, 122497, 122771, 123131, 123850, 124946, 126037, 126921, 127984, 129604, 131409, 132615, 132949, 132740, 132217, 131401, 130726, 131020, 132480, 134225, 135290, 135641, 135852, 136200, 136594, 137127, 138185, 140008, 142476, 145181, 147493, 148792, 149025, 148844, 148807, 148616, 147608, 145843, 144154, 143132, 142643, 142371, 142254, 142141, 141533, 140145, 138439, 137228, 136852, 136987, 137157, 137162, 137084, 137087, 137200, 137167, 136646, 135653, 134656, 134014, 133405, 132079, 129679, 126611, 123660, 121438, 120213, 119941, 120266, 120631, 120576, 120017, 119189, 118394, 117815, 117476, 117283, 117091, 116799, 116419, 116105, 116100, 116528, 117129, 117266, 116383, 114467, 111976, 109361, 106926, 105105, 104444, 104969, 105811, 105851, 104768, 103217, 101999, 101314, 100826, 100183, 99304, 98329, 97451, 96738, 96117, 95567, 95262, 95322, 95514, 95447, 95062, 94613, 94174, 93544, 92750, 92212, 92082, 91742, 90395, 88015, 85403, 83390, 82287, 81991, 82217, 82610, 82911, 83134, 83364]
52769H3364O4m16r28j117r99p77m77l3M25P24Q86J000R99Q62Q03R30R25M90j9
52750H6706N5O75R49K42r28j471j030l55l52j016j576j510j108q63p33l89O8J70
52732G7534j53m90p45j289k070k339j776j208j442j871j331j0O40j2r26r83m55
52715F1074k61n40p85q58j025j171r02l64k71q82j555j488o12N05J258J357Q91
52698E4371K73p2j85m89j064j329q32n6J28k73l07M82J259J013On87k95J64P8
52679E2285k83k44K86Q65J216J381J356J058O23L60K87O2n55j305j617j092J49
52662E4832J513K309K220J462N42p0j56Q4J09m83j410j925j676j007l24L65J030
52645E7415J252Q27L10L76Q36R65O37M50O91R28Q46Q08J150J482J148J84o58q07
$$ y = [83364, 83428, 83012, 82084, 80967, 79968, 79191, 78714, 78681, 79106, 79830, 80716, 81716, 82715, 83577, 84380, 85310, 86235, 86725, 86706, 86761, 87436, 88385, 88627, 87699, 86228, 85198, 84843, 84491, 83475, 81899, 80389, 79281, 78418, 77685, 77296, 77364, 77534, 77381, 76891, 76146, 74857, 72787, 70448, 68672, 67464, 66022, 64151, 62820, 62810, 63450, 63438, 62512, 61529, 61074, 60813, 60273, 59488, 58630, 57605, 56434, 55532, 55168, 54897, 54015, 52460, 50972, 50360, 50865, 52123, 53480, 54371, 54644, 54572, 54387, 53898, 52834, 51505, 50673, 50617, 50745, 50472, 50165, 50647, 51906, 52919, 52925, 52338, 52043, 52207, 52285, 52002, 51758, 52044, 52909, 54125, 55506, 56862, 57920, 58543, 58903, 59190, 59252, 58697, 57392, 55775, 54683, 54832, 56345, 58654, 60874, 62336, 62878, 62808, 62652, 62736, 62845, 62362, 60952, 59027, 57351, 56344, 56020, 56385, 57415, 58667, 59494, 59804, 60180, 61016, 61981, 62618, 63068, 63759, 64687, 65533, 66341, 67491, 68973, 70121, 70305, 69647, 68840]
52627F8840m65l04o68j176j167n29P1L8l46l70K7J94j40l37K48J338K128K284
52609F9666K112J938J773J538J314J241J349J499J489J240R43Q82J088J252J111
52594I0435P06K03l15p94j091j090q18l85Q5L45J72l23o70n31n3L72N32M39J67
52575H7386k05n11n64k88K58Q28R96M87l39o16J24J387K231K213J614Q75K21k18
52557I5879l63l31m10o68p37k25O81J241R32N4m98j73P12J354J277P21K69K91
52539A00006O73J017J081J010J011R28M00m85j064q57k13J76Q7j83m05n81o49
52522A01952m78j22K37M98N45J52o29j247j255r03n82j10P14J228O32n84j108
52505I8940p37n88j088j213k85P71R44P07R50J255O92l44n65J58O39K48l28l93
$$ y = [68840, 68375, 68071, 67403, 66227, 65060, 64531, 64602, 64640, 64294, 63924, 63951, 64145, 64005, 63668, 63916, 65254, 67382, 69666, 71778, 73716, 75489, 77027, 78341, 79582, 80931, 82430, 83919, 85159, 86102, 86984, 88072, 89324, 90435, 91141, 91344, 91029, 90235, 89144, 88054, 87236, 86851, 86936, 87281, 87453, 87130, 86460, 85929, 85876, 86248, 86780, 87219, 87386, 87181, 86670, 86106, 85818, 86076, 86904, 87900, 88387, 88048, 87432, 87556, 88943, 91174, 93387, 95001, 95876, 96097, 95879, 95516, 95185, 94775, 94107, 93370, 93145, 93826, 95067, 95999, 96053, 95555, 95382, 96094, 97448, 98725, 99446, 99715, 100006, 100679, 101696, 102777, 103787, 104798, 105726, 106126, 105641, 104577, 103720, 103507, 103683, 103770, 103587, 103182, 102601, 101952, 101474, 101352, 101589, 102087, 102632, 102784, 102155, 100908, 99653, 98750, 98168, 98058, 98772, 100000, 100632, 100048, 98940, 98203, 97615, 96527, 95314, 95029, 95800, 96744, 97451, 98401, 99656, 100348, 100004, 99439, 99597, 100236, 100484, 100156, 99763]
52487I9763j94j90k72j76Q4M30Q48J134J016P22P38R81Q33K10j88Q9N89P33N31
52468A07681K17k17o79p58k28N56J172J541J596J114K95j13K33P09O46K43Rj87
52450A13830o52j006o97j07j02n81n29L52J117J032N92M87M14l22j528k277k125
52433A07898j423o05J43N64L98j10l50j69pj08j00K68N46K47k90k41N61J359J332
52414A09913L82q68j552j121J43J166J054J6r34j190r91p43m99k42q3P8N44J182
52396A06255J354Q98O09J163K015K066J175J77l51n69o03j49Q71J925K458K498
52380A21792K328J979J419R29Q39J034J089Q91Q43J349K192K661K324J645J564
52365A44878K389L343L447K667J829J574J757J881J708J342J069J212J904K867
$$ y = [99763, 99569, 99379, 99107, 98931, 99015, 99445, 100293, 101427, 102443, 103165, 103903, 104884, 105717, 105927, 105739, 105828, 106417, 107150, 107681, 107898, 107681, 107002, 106244, 106016, 106572, 107744, 109285, 110881, 111995, 112290, 112177, 112410, 113119, 113765, 114008, 114017, 113830, 113178, 112172, 111475, 111368, 111266, 110685, 110156, 110508, 111625, 112657, 113249, 113736, 114150, 113828, 112300, 110023, 107898, 106475, 105870, 106013, 106577, 106975, 106865, 106515, 106346, 106339, 106231, 106131, 106399, 106945, 107192, 106902, 106661, 107222, 108581, 109913, 110295, 109427, 107875, 106754, 106897, 108063, 109117, 109133, 108199, 107009, 106018, 105275, 104776, 104534, 104451, 104529, 105073, 106255, 107609, 108507, 109116, 110279, 112294, 114360, 115535, 115712, 115361, 114792, 114189, 114040, 114911, 116836, 119294, 121792, 124120, 126099, 127518, 128447, 129286, 130320, 131409, 132300, 133143, 134492, 136684, 139345, 141669, 143314, 144878, 147267, 150610, 154057, 156724, 158553, 160127, 161884, 163765, 165473, 166815, 167884, 169096, 171000, 173867]
52351A73867L595L802L502K802J890J184J010J136J086R22J258K296L392L919
52337B05661M048M303M687M790M626M783N690P002P931Q113Q021Q468R625J0770
52323B98518J1204J1187J1454J1998J2059J1457J1014J1311J1747J1613J1387
52312D24949J2005J3132J3337J2068J0437R766J0081J0488J0369R627Q256O397
52300E50912M627L576L190K781J863N85o64j710k516k999l152l202l331l384l101
52285E43475k713k873l734m422l864k129m67J59J66O25J844L245M420N609O961
52270E46302Q058Q599R030R898J0901J1221J0686R984R640R374Q696P670O770
52257F66829O359O512P017P316O789N450M003K977K099Q97n00j649k535l400m158
$$ y = [173867, 177462, 181264, 184766, 187568, 189458, 190642, 191652, 192788, 193874, 194796, 196054, 198350, 201742, 205661, 209709, 214012, 218699, 223489, 228115, 232898, 238588, 245590, 253521, 261634, 269655, 278123, 287748, 298518, 309722, 320909, 332363, 344361, 356420, 367877, 378891, 390202, 401949, 413562, 424949, 436954, 450086, 463423, 475491, 485928, 495694, 505775, 516263, 526632, 536259, 544515, 550912, 555539, 559115, 562305, 565086, 566949, 567534, 566870, 565160, 562644, 559645, 556493, 553291, 549960, 546576, 543475, 540762, 537889, 534155, 529733, 525869, 523740, 523273, 523432, 523598, 524223, 526067, 529312, 533732, 539341, 546302, 554360, 562959, 571989, 581887, 592788, 604009, 614695, 624679, 634319, 643693, 652389, 660059, 666829, 673188, 679700, 686717, 694033, 700822, 706272, 710275, 713252, 715351, 716248, 715748, 714099, 711564, 708164, 704006]
52242G04006m611m997n598o065n947n748o404p707q362p815o884o206n348m119
52228F18195l483m110n009m857l864l040k329r85N82J107N34K48R38J711J757
52213E97395J579J976K878L836M729N381N317M580M007M094M290L944L244K592
52199F49842J913J228J099J659J990J360M47K65N00J11q45j318j057r71j561k124
52183F52538j949j394j308j954k924l646l765l394l188l734m691n004m186k970
52169F08431k498l062l890m023l276k410k301k942l470l289k704k238j855j467
52155E69006j507k207k768k368j668k018l182l329j698J09K48r91j947j811r79
52140E42890J08J263J914J435K53l45K95J610K885M103N421O465O805O689O774
$$ y = [704006, 699395, 694398, 688800, 682735, 676788, 671040, 664636, 656929, 648567, 640752, 633868, 627662, 622314, 618195, 614712, 610602, 605593, 600736, 596872, 593832, 591503, 590518, 591100, 592207, 592741, 592989, 593927, 595638, 597395, 598974, 600950, 603828, 607664, 612393, 617774, 623091, 627671, 631678, 635772, 640062, 644006, 647250, 649842, 651755, 652983, 654082, 655741, 657731, 659091, 659538, 659803, 660303, 660414, 659569, 658251, 657194, 656223, 654662, 652538, 650589, 649195, 647887, 645933, 643009, 639363, 635598, 632204, 629016, 625282, 620591, 615587, 611401, 608431, 605933, 602871, 598981, 594958, 591682, 589272, 586971, 584029, 580559, 577270, 574566, 572328, 570473, 569006, 567499, 565292, 562524, 560156, 558488, 556470, 553288, 549959, 548261, 548370, 548618, 547627, 545680, 543869, 542890, 542998, 544261, 546175, 547610, 547863, 547518, 547813, 549423, 552308, 556411, 561832, 568297, 575102, 581791, 588565]
52125E88565P313Q015Q616R204R960J0909J1937J2775J2990J2319J1182J0538
52113G14323J0903J1675J1823J1150J0421J0157R875Q861P236N695M398K910J139
52100H20566k88r10j104j528k317l156l859m500n134n765o366o706o370n350m378
52085G62835m214m704n019m691l884k681q22J562L568M420M491M860O012P431
52071G69164Q438Q917R088R077R003R114R524R970J0099R911R530Q782P392N634
52057H93643M279L722L421K516P83j187k720l693m493n444o395p048p627q908
52043H60849j1189j3552j4665j4349j3723j3724j4154j4408j4408j4314j3945
52032G08418j3192j2545j2493j2708j2532j1974j1457j0833r654q337p975q800
$$ y = [588565, 595878, 603893, 612509, 621713, 631673, 642582, 654519, 667294, 680284, 692603, 703785, 714323, 725226, 736901, 748724, 759874, 770295, 780452, 790327, 799188, 806424, 812119, 816517, 819427, 820566, 820278, 819368, 818264, 816736, 814419, 811263, 807404, 802904, 797770, 792005, 785639, 778933, 772563, 767213, 762835, 758621, 753917, 748898, 744207, 740323, 737642, 736820, 738382, 741950, 746370, 750861, 755721, 761733, 769164, 777602, 786519, 795607, 804684, 813687, 822801, 832325, 842295, 852394, 862305, 871835, 880617, 888009, 893643, 897922, 901644, 905065, 907581, 908364, 907177, 904457, 900764, 896271, 890827, 884432, 877384, 869757, 860849, 849660, 836108, 821443, 807094, 793371, 779647, 765493, 751085, 736677, 722363, 708418, 695226, 682681, 670188, 657480, 644948, 632974, 621517, 610684, 601030, 592693, 584718, 575918]
52020E75918r730r807r270q811q577q435q522q894r075q671q015p724p815p892
52006D54680p873q106q763r571j0063r941r368r077r729j0968j1604j1052j0039
51993C28526r433r109q621q343q824r431q901p261o027o216p105p419o928o294
51979B18614n955n729n237m257k954j949j859k515l074l078k963l153l364l190
51965A69337k927l091l488l480k957k374j928j461j133j454k414l205l148k417
$$ y = [575918, 566188, 556381, 547111, 538300, 529723, 521288, 512766, 503872, 494797, 486126, 478111, 470387, 462572, 454680, 446807, 438701, 429938, 420367, 410304, 400363, 390995, 381918, 372189, 361221, 349617, 338565, 328526, 319093, 309984, 301363, 293020, 284196, 274765, 265864, 258603, 252576, 246360, 239255, 231836, 224908, 218614, 212659, 206930, 201693, 197436, 194482, 192533, 190674, 188159, 185085, 182007, 179044, 175891, 172527, 169337, 166410, 163319, 159831, 156351, 153394, 151020, 149092, 147631, 146498, 145044, 142630, 139425, 136277, 133860]
$$ [...]
##END NTUPLES=NMR SPECTRUM
##END=
