##TITLE=NES1087_JR_9885180_06UVmLNAy4
##JCAMPDX= 6.0         $$ Bruker NMR JCAMP-DX V2.0
##DATA TYPE= NMR SPECTRUM
##DATA CLASS= NTUPLES
##ORIGIN= BRUKER
##OWNER= Administrator
$$ 1.72 TOPSPIN		Version 2.1
$$ 2016-08-27 16:59:58.383 -0500  Administrator@X
$$ Compression mode = diff/dup
##.OBSERVE FREQUENCY= 400.02188249412
##.OBSERVE NUCLEUS= ^1H
##.ACQUISITION MODE= SIMULTANEOUS (DQD)
##.ACQUISITION SCHEME= undefined
##.AVERAGES= 8
##.DIGITISER RES= 22
##SPECTROMETER/DATA SYSTEM= spect
##.PULSE SEQUENCE= zg30
##.SOLVENT NAME= COFFEE_meoh
##.SHIFT REFERENCE= INTERNAL, COFFEE_meoh, 1, 14.98509
##AUDIT TRAIL= $$ (NUMBER, WHEN, WHO, WHERE, PROCESS, VERSION, WHAT)
$$ ##TITLE= Audit trail, TOPSPIN		Version 2.1
$$ ##JCAMPDX= 5.01
$$ ##ORIGIN= Bruker BioSpin GmbH
$$ ##OWNER= Administrator
$$ $$ E:\/data/COFFEE/nmr/NES1087_JR_9885180_06UVmLNAy4/10/pdata/1/auditp.txt
$$ ##AUDIT TRAIL=  $$ (NUMBER, WHEN, WHO, WHERE, PROCESS, VERSION, WHAT)
(   1,<2016-08-27 16:59:51.148 -0500>,<Administrator>,<X>,<go>,<TOPSPIN 2.1>,
      <created by zg
	started at 2016-08-27 16:58:45.554 -0500,
	POWCHK enabled, PULCHK disabled,
       configuration hash MD5:
       21 0F 79 D6 B3 7B B4 F6 88 20 88 DB 03 48 BD 9F
       data hash MD5: 64K
       6B A2 78 61 54 9D 0D 17 2A F3 23 0B DF 63 DA F3>)
(   2,<2016-08-27 16:59:54.289 -0500>,<Administrator>,<X>,<proc1d>,<TOPSPIN 2.1>,
      <Start of raw data processing
       efp LB = 0 FT_mod = 6 PKNL = 1 PHC0 = 0 PHC1 = 0 SI = 32K 
       data hash MD5: 32K
       93 09 3A 44 0D 04 DF CD 7B D3 39 C4 D1 3E A9 2E>)
(   3,<2016-08-27 16:59:54.570 -0500>,<Administrator>,<X>,<proc1d>,<TOPSPIN 2.1>,
      <pk PHC0 = 92.46643 PHC1 = 0 
       data hash MD5: 32K
       87 A1 73 BD 9E DB 2C 12 71 7B FE EA 00 53 C0 53>)
(   4,<2016-08-27 16:59:54.679 -0500>,<Administrator>,<X>,<proc1d>,<TOPSPIN 2.1>,
      <abs ABSG = 1 
       data hash MD5: 32K
       F8 49 10 D0 12 5F 8D 81 64 B5 FF 58 29 BE FC A7>)
(   5,<2016-08-27 16:59:54.742 -0500>,<Administrator>,<X>,<proc1d>,<TOPSPIN 2.1>,
      <abs ABSG = 2 
       data hash MD5: 32K
       3A BE 0B 54 A6 C8 BC 44 39 D9 9E D7 6A EE 0D 16>)
(   6,<2016-08-27 16:59:54.804 -0500>,<Administrator>,<X>,<proc1d>,<TOPSPIN 2.1>,
      <abs ABSG = 3 
       data hash MD5: 32K
       65 2E 53 7A 47 7D 8A 53 1F FF 02 50 FA EA CA CE>)
(   7,<2016-08-27 16:59:54.867 -0500>,<Administrator>,<X>,<proc1d>,<TOPSPIN 2.1>,
      <abs ABSG = 4 
       data hash MD5: 32K
       52 C4 0A 55 6B F0 36 99 18 33 D3 0D 9F D1 67 F8>)
(   8,<2016-08-27 16:59:54.929 -0500>,<Administrator>,<X>,<proc1d>,<TOPSPIN 2.1>,
      <abs ABSG = 5 
       data hash MD5: 32K
       FE 57 72 F7 D8 39 84 F6 BF B9 07 6E 1A BC F6 F8>)
$$ ##END=
$$ 
$$ $$ hash MD5
$$ $$ 05 59 2D DB DE BC F2 4C DB 69 DF C4 1E CD EC 71
##$RELAX= 
##$RELAX= 
##$RELAX= 
##$RELAX= 
##$RELAX= 
##$RELAX= 
##$RELAX= 
$$ Bruker specific parameters
$$ --------------------------
##$DU= <E:\>
##$EXPNO= 10
##$NAME= <NES1087_JR_9885180_06UVmLNAy4>
##$PROCNO= 1
$$ [...]
150 150 150 150 150 150 150 150
##$TP07= 0
##$TPNAME0= <>
##$TPNAME1= <>
##$TPNAME2= <>
##$TPNAME3= <>
##$TPNAME4= <>
##$TPNAME5= <>
##$TPNAME6= <>
##$TPNAME7= <>
##$TPOAL= (0..7)
0.5 0.5 0.5 0.5 0.5 0.5 0.5 0.5
##$TPOFFS= (0..7)
0 0 0 0 0 0 0 0
##$TUNHIN= 0
##$TUNHOUT= 0
##$TUNXOUT= 0
##$USERA1= <user>
##$USERA2= <user>
##$USERA3= <user>
##$USERA4= <user>
##$USERA5= <user>
##$V9= 5
##$VALIST= <valist>
##$VCLIST= <CCCCCCCCCCCCCCC>
##$VD= 0
##$VDLIST= <DDDDDDDDDDDDDDD>
##$VPLIST= <PPPPPPPPPPPPPPP>
##$VTLIST= <TTTTTTTTTTTTTTT>
##$WBST= 2048
##$WBSW= 25
##$XGAIN= (0..3)
0 0 0 0
##$XL= 0
##$YL= 0
##$YMAX_a= 519292
##$YMIN_a= -434981
##$ZGOPTNS= <>
##$ZL1= 120
##$ZL2= 120
##$ZL3= 120
##$ZL4= 120
##$ABSF1= 14.98509
##$ABSF2= -5.573092
##$ABSG= 5
##$ABSL= 3
##$ALPHA= 0
##$AQORDER= 0
##$ASSFAC= 0
##$ASSFACI= 0
##$ASSFACX= 0
##$ASSWID= 0
##$AUNMP= <proc_prof1d_extract_pilot.lims>
##$AXLEFT= 0
##$AXNAME= <>
##$AXNUC= <1H>
##$AXRIGHT= 0
##$AXTYPE= 0
##$AXUNIT= <>
##$AZFE= 0.1
##$AZFW= 0.1
##$BCFW= 0
##$BC_mod= 0
##$BYTORDP= 0
##$COROFFS= 0
##$CY= 15
##$DATMOD= 1
##$DC= 0
##$DFILT= <>
##$DTYPP= 0
##$F1P= 0
##$F2P= 0
##$FCOR= 0.5
##$FTSIZE= 32768
##$FT_mod= 6
##$GAMMA= 0
##$GB= 0
##$INTBC= 1
##$INTSCL= 1
##$ISEN= 128
##$LB= 0
##$LEV0= 0
##$LPBIN= 0
##$MAXI= 10000
##$MC2= 0
##$MEAN= 0
##$ME_mod= 0
##$MI= 0
##$NCOEF= 0
##$NC_proc= -8
##$NLEV= 6
##$NOISF1= 0
##$NOISF2= 0
##$NSP= 0
##$NTH_PI= 0
##$NZP= 0
##$OFFSET= 14.98509
##$PC= 1
##$PHC0= 92.46643
##$PHC1= 0
##$PH_mod= 1
##$PKNL= yes
##$PPARMOD= 0
##$PPDIAG= 0
##$PPIPTYP= 0
##$PPMPNUM= 2147483647
##$PPRESOL= 1
##$PSCAL= 4
##$PSIGN= 0
##$PYNMP= <proc.py>
##$REVERSE= no
##$SF= 400.02
##$SI= 32768
##$SIGF1= 0
##$SIGF2= 0
##$SINO= 400
##$SIOLD= 32768
##$SPECTYP= <>
##$SREGLST= <1H.CDCl3>
##$SSB= 0
##$STSI= 32768
##$STSR= 0
##$SW_p= 8223.68421052631
##$SYMM= 0
##$S_DEV= 0
##$TDeff= 65536
##$TDoff= 0
##$TI= <>
##$TILT= no
##$TM1= 0
##$TM2= 0
##$TOPLEV= 0
##$USERP1= <user>
##$USERP2= <user>
##$USERP3= <user>
##$USERP4= <user>
##$USERP5= <user>
##$WDW= 1
##$XDIM= 32768
##$YMAX_p= 416149589
##$YMIN_p= -708157
##$CURPLOT= <Network HP LaserJet P1505>
##$CURPRIN= <$Network HP LaserJet P1505>
##$DFORMAT= <normdp>
##$LAYOUT= <+/1D_H.xwp>
##$LFORMAT= <normlp>
##$PFORMAT= <normpl>
##$SURQMSG= 1
$$ End of Bruker specific parameters
$$ ---------------------------------
##NTUPLES= NMR SPECTRUM
##VAR_NAME=  FREQUENCY,     SPECTRUM/REAL,   SPECTRUM/IMAG
##SYMBOL=    X,             R,               I
##VAR_TYPE=  INDEPENDENT,   DEPENDENT,       DEPENDENT
##VAR_FORM=  AFFN,          ASDF,            ASDF
##VAR_DIM=   32768,         32768,           32768
##UNITS=     HZ,            ARBITRARY UNITS, ARBITRARY UNITS
##FACTOR=    0.250966925370066, 1,           1
##FIRST=     8223.43324360094, -266806,      -234427
##LAST=      0,             235,             -44662
##MIN=       0,             -708157,         0
##MAX=       8223.43324360094, 416149589,    0
$$ Real data points
##PAGE= N=1
##DATA TABLE= (X++(R..R)), XYDATA
$$ [...]
19500e1773j148m37801h0048j37436d5108m0058b2508j1564o7673j59931R5797
19489a65879C9290b61973I4667d63049e2978j24342l73396A0931J57571a39734
19478g9626A68230m3496c24691I378a18984C23486g5039A94953c6268j38070n617
19467a79955k8861A56016c4143l12547j1881a04323N1409D1019Q1908h1941c0014
19455f5032k02171B34223b3411k21494h2414m918H8199R3339b3977k0005E3133
19443b84982i5069n4421A4039J26045D608J73373c6255C7996M5631a14758M7907
19432f6851L2201j3936k2017b9715J2135E3778F379f9404k06253A6955L21760
19421C38715c63H0671M0669L1413a77468O9370L4831D7568K6420e4037l4116k6634
$$ plain form
19500 -51773 -52921 -490722 -80048 -217484 -45108 -85166 -22508 -34072 -101745 -261676 -165879
19489 -165879 39290 -261973 94667 -463049 -52978 -177320 -550716 10931 168502 -139734
19478 -79626 168230 124734 -324691 9378 -118984 323486 -75039 194953 -36268 -174338 -179955
19467 -179955 -208816 156016 -34143 -346690 -358571 -104323 -52914 41019 122927 -81941 -30014
19455 -65032 -267203 234223 -23411 -244905 -82414 -87332 88199 181538 -23977 -43982 53133
19443 -284982 -95069 -149490 14039 140084 4608 177981 -36255 37996 83627 -114758 -66851
19432 -66851 -34650 -48586 -70603 -29715 -17580 53778 6379 -69404 -275657 16955 338715
19421 338715 -363 80671 121340 152753 -177468 -108098 -73267 47568 73988 -54037 -88153 -114787
19409a14787d4310H6375L5813a94181i562k7517r0349G5592a22327k8884M701
19398a46510a7092j89049e9557p4386P824k1620a5338q9726J4172E2247D072d0522
19385a29927L3169j8198d0663l9203C8518J028J2167b89140J19585f3851j32082
19374a95933A96467C7200j7959g3236j15146P5805A09803a68369A89099b40595
19363c68238i7696G1735a99584f2072p6143m1609j00394H5885b50850A70412R0857
19352B61269f8206r9100e5356j90633O8205A43888a49430j37805C4488a8481A31579
19340I4121h1008k82080H2417a16397P472D9912c15522J7094a29049E6035a35457
19328a37790j09207m6043J07053A32684C7960a1458j16809k60271a0678k7405
$$ plain form
19409 -114787 -44310 86375 122188 -194181 -9562 -37079 -127428 75592 -122327 -151211 -146510
19398 -146510 -17092 -206141 -59557 -133943 -126119 -147739 -15338 -105064 -90892 52247 4072 -40522
19385 -129927 -96758 -114956 -40663 -79866 38518 39546 51713 -289140 -169555 -63851 -195933
19374 -195933 196467 37200 19241 -73236 -188382 -112577 109803 -168369 189099 -240595
19363 -368238 -97696 71735 -199584 -62072 -138215 -179824 -280218 85885 -250850 170412 261269
19352 261269 -68206 -167306 -55356 -245989 -177784 143888 -149430 -287235 34488 -18481 131579
19340 94121 -81008 -363088 82417 -116397 -108925 49912 -315522 -298428 -129049 56035 -135457
19328 -137790 -246997 -293040 -185987 132684 37960 -11458 -128267 -388538 -10678 -38083
19318c8083q3389c8060q9339j95815a07657j46227b6272r6202A23139b12327A70413
19306b47317e2869o9711j07591H3894a61913a5331k08005f401j06613r6477C0402
19294f4067C73444d9415l13633B12866C3326c19517N905a34753A54955B5905c01090
19282a16889L8764l7507j06477l8797h7516n2274j4123j8062A17627L7440b82730
19270B78909j1629b27355C2111a77813A09624K3183a92939e7403J3142j69231
19260b13492N144n1147d5205k5218k5891j42315M4690R6115C50860F1839c09486
19248A00956b61888A01405M816a09548B5488n554L2241i6584m2419c3329j70787
19237b04116R7152D0443e9706D3779a35682l00554A76897a53365d2245j76586
$$ plain form
19318 -38083 -121472 -38060 -127399 -323214 -107657 -253884 -26272 -122474 123139 -212327 170413
19306 -247317 -52869 -122580 -230171 83894 -161913 -15331 -223336 -6401 -113014 -209491 30402
19294 -64067 373444 -49415 -363048 212866 33326 -319517 -313612 -134753 154955 25905 -301090
19282 -116889 -78125 -115632 -222109 -260906 -87516 -139790 -153913 -171975 117627 155067 -282730
19270 278909 267280 -227355 32111 -177813 109624 132807 -192939 -57403 -44261 -213492
19260 -213492 -208348 -259495 -45205 -70423 -96314 -238629 -193939 -97824 350860 61839 -309486
19248 100956 -261888 101405 106221 -109548 25488 19934 52175 -96584 -139003 -33329 -204116
19237 -204116 -106964 40443 -59706 43779 -135682 -436236 176897 -153365 -42245 -218831
19227b18831n9008A72439A8660J75670e3732k5036k04781M2362b7206k0949l95038
19216d43193B06409a7716I2268c93637e4247j19693A25807A5540b07293M8225
19206a59068G1510B6692N7784b15487Q2863O0312a3786A49102a36607D7392a75241
19194C8915J96084g0597k62463I6462K9298c83388J42337A69004c35729C8325
19183c22696e267r9370L2075a7203A11071d5804j27094O2384G8432E27a57252
19171a02739B92156j17753D4827c18009L5110A80664f9205A922J83171a61936
19160H6554a23920n0510P1702r4936h7603A28540g7996A3558J34706g864j03852
19149a11716o3626d3409j12678O8149e918k43457e7725B67935a13688o2393c4060
$$ plain form
19227 -218831 -277839 172439 18660 194330 -53732 -78768 -283549 -241187 -27206 -48155 -443193
19216 -443193 206409 -17716 92268 -393637 -54247 -173940 125807 15540 -207293 -159068
19206 -159068 71510 26692 84476 -215487 -132624 -72312 -13786 149102 -136607 47392 -175241
19194 38915 234999 -70597 -333060 96462 125760 -383388 -241051 169004 -335729 38325
19183 -322696 -5267 -104637 -72562 -17203 111071 -45804 -172898 -110514 78432 527 -157252
19171 -102739 292156 174403 44827 -318009 -282899 180664 -69205 1922 185093 -161936
19160 86554 -123920 -174430 -102728 -197664 -87603 128540 -77996 13558 148264 -7864 -111716
19149 -111716 -175342 -43409 -156087 -87938 -5918 -249375 -57725 267935 -113688 -176081 -34060
19137D22273e7560K1146C74413b67114M6092b3890A10157J35729b21287A23554
19126g6400j69262A05064a28653i033A0921b21877j08216g29I7883G207a74775
19114d41j15502F0992b62251L7535J09975E2621P1382g0172k47572k3004G5548
19102B10924i0808f239l06447i8139C1647a60270B25027h7059k53902A29826j6180
19091A13646c4393A19701a51246o3362A8327b05954C87903f7070j31641a8773
19080A64439b06084g8282A29765P7388d3396a8748B89989i4974K1130j06511Q9031
19069i1324j41245d0419k27151a3625l8010j46095G8000i7598M7540A4693j362
19058A3331a19234G5400g8764b6037k88953k52782B1098H691a07128r4218a3887
$$ plain form
19137 422273 -57560 -36414 374413 -267114 -221022 -23890 110157 245886 -221287 123554
19126 -76400 -245662 105064 -128653 -9033 10921 -221877 -330093 -729 97883 7207 -174775
19114 -441 -115943 60992 -262251 -224716 -114741 52621 124003 -70172 -317744 -340748 75548
19102 210924 -90808 -6239 -312686 -98139 31647 -160270 225027 -87059 -340961 129826 113646
19091 113646 -34393 119701 -151246 -214608 18327 -205954 387903 -67070 -198711 -18773
19080 164439 -206084 -78282 129765 207153 -43396 -18748 289989 -94974 -73844 -180355 -91324
19069 -91324 -232569 -40419 -267570 -13625 -51635 -197730 78000 -97598 -50058 14693 13331
19058 13331 -119234 75400 -78764 -26037 -314990 -567772 21098 8691 -107128 -201346 -13887
19046A27109f5804D9441g4195b9992k66998A12303K093b85778J30482C8136h772
19034A4632a30958A745c83744a02646G1648a55101B39003O5863j38462a89605
19023A49830l365J4080a01481C0724a70235l11399F3098J33770D8858c2963J1832
19012b1131m8786j47356B6885K38871q9155i2670A84058b6237A5357a11882B3162
19000a5988F9645a70387p3996I8067e624k02239c0395q5899b9998j12477F6448
18988A71143a30553c0141q0546j36295p5955K5699e3502K4479j42935B6708f424
18976b46641G7930a18634D00508j83889b5783G2770a26647j964N6857j32865C8998
18964c63517a31779L6574K2355j76610Q3888B05K45817a65155E3913b6544j05264
$$ plain form
19046 127109 -65804 49441 -74195 -29992 -296990 112303 114396 -285778 -155296 38136 -8772
19034 14632 -130958 1745 -383744 -102646 71648 -155101 239003 304866 166404 -189605
19023 149830 146465 160545 -101481 30724 -170235 -481634 63098 196868 48858 -32963 -21131
19012 -21131 -69917 -217273 26885 265756 176601 -92670 184058 -26237 15357 -111882 23162
19000 -15988 69645 -170387 -244383 98067 -5624 -207863 -30395 -116294 -29998 -142475 66448
18988 171143 -130553 -30141 -110687 -246982 -322937 -297238 -53502 -29023 -171958 26708 -6424
18976 -246641 77930 -118634 400508 216619 -25783 72770 -126647 -128611 -71754 -204619 38998
18964 -363517 -131779 -95205 -72850 -249460 -165572 205 246022 -165155 53913 -26544 -131808
18953a31808m9976H1372b29882B2196b24548E7396J46424J4083c09528a43687
18942c83402K816h4936l0168B41215q5294G2082f3514l09656f003o9320A4358
18930b41499j2742B01900b52337e5770B6538M2512a74772j4189B9828a9424K487
18919a6937k98683A9843J5577b89762B13134A8907a17035A93953P4653p9475P8278
18908B67409C2851e867B82940b38028j1899K635F9499L4727g8801E7925a5535
18896f1431G5653a18217j31214d9084A60365a5308j5179k90569A81796a91560
18885b3785k2539A69929n8193f3207F9196c39925i9749C5253h4908C9516a53441
18873a15761M9346A55354A5241b45975O9556A83587a23137c4594C9456J38976
$$ plain form
18953 -131808 -181784 81372 -229882 22196 -224548 57396 203820 217903 -309528 -143687
18942 -383402 -380586 -84936 -115104 241215 155921 72082 -63514 -373170 -6003 -75323 14358
18930 -241499 -254241 201900 -252337 -55770 26538 69050 -174772 -188961 29828 -19424 -16937
18919 -16937 -315620 19843 35420 -289762 213134 18907 -117035 193953 268606 189131 267409
18908 267409 32851 -5867 282940 -238028 -249927 -247292 69499 104226 -78801 57925 -15535
18896 -61431 75653 -118217 -249431 -49084 160365 -15308 -30487 -321056 181796 -191560
18885 -23785 -46324 169929 111736 -63207 69196 -339925 -99749 35253 -84908 39516 -153441
18873 -115761 -66415 155354 15241 -245975 -176419 183587 -123137 -34594 39456 178432
18863A78432a20477j1796a6536k94744K5777B6701a35373A18198E4750n007d3364
18851f6007j04215j42409B19154E6260O4576a53287j8219C09741a59705M3105
18841a16600E6001L60859b37706H3668l5401g7863A05081a53617m9238r9734A1153
18829i6753F0155b63953A8518a63602d6984k50504E4519b34106B05900c23685
18818a00169J7648r7461H5036d4150A47908m5752g3858A71360b26945G4934e2064
18806A42646h4538A21986k2452B2686b10756k0794A17391b53361J00035L3259
18796a20067q0044l4765d3452j67770l2889B69503A28300D1289c11697B61437
18785a8088m2951j04609H0031A6828a60505C28969j27072D5729b72063D8895O6513
$$ plain form
18863 178432 -120477 -132273 -16536 -311280 -285503 26701 -135373 118198 54750 49743 -43364
18851 -66007 -170222 -312631 219154 56260 120836 -153287 -171506 309741 -159705 -116600
18841 -116600 56001 416860 -237706 83668 48267 -77863 105081 -153617 -202855 -302589 11153
18829 -96753 60155 -263953 18518 -163602 -46984 -297488 54519 -234106 205900 -323685
18818 -100169 -82521 -179982 85036 -44150 147908 102156 -73858 171360 -226945 74934 -52064
18806 142646 -84538 121986 99534 22686 -210756 -231550 117391 -253361 -153326 -120067
18796 -120067 -200111 -234876 -43452 -211222 -244111 269503 128300 41289 -311697 261437
18785 -18088 -61039 -165648 80031 16828 -160505 328969 201897 45729 -272063 48895 115408
18774A15408k3778K1119A8133a47311f429o5533L0082k49043J06341J4406C1770
18762I8141a41047J1889e9590r3171J7731C74286a35694E982f375D4535d2366
18750A03751A6488a64200A28958a11722A55056a45078p3982A28050d3872j26332
18740a70204A76193b4155j17200a5117j29040A0848i227m3966p8254H6156K5822
18729A11978h8166C2356R0885e2251a4807o1298n1337N4407k66658A69014e0363
18717H4367h6642l166G6445J09748J65940h7288k5904k71064a43184I0143d4053
18705a25095A82795D2215L8965M8375c54366G7256a52853p8993I5295C1035a11689
18693c8140A64432E5485b10672B7293k979r921a68505F2950i2066c5421j78622
$$ plain form
18774 115408 91630 112749 18133 -147311 -6429 -71962 -41880 -290923 -184582 -170176 31770
18762 98141 -141047 -129158 -59590 -152761 -135030 374286 -135694 5982 -6375 44535 -42366
18750 103751 16488 -164200 128958 -111722 155056 -145078 -219060 128050 -43872 -170204
18740 -170204 176193 -24155 -141355 -15117 -144157 10848 -9227 -53193 -131447 86156 111978
18729 111978 -88166 32356 123241 -52251 -14807 -76105 -127442 -73035 -339693 169014 -50363
18717 84367 -86642 -89808 76445 186193 352133 -87288 -113192 -384256 -143184 90143 -44053
18705 -125095 182795 42215 81180 129555 -354366 77256 -152853 -231846 95295 31035 -111689
18693 -38140 164432 55485 -210672 27293 24314 14393 -168505 62950 -92066 -35421 -214043
18682b14043b566j35152E9580Q1039d08942B2216g4236p6450j86420h0590k68552
18671c49142A26609m9119C6938c26143a21813c3318B1591a48126j83164G6917
18660c4211a4321j04344j2821d9524G6808e9727A52586o8616l2463i5784j24204
18649b19988f8075B7869j0403b6063b126k34634A2733a68862K0896R446a6580
18637A85399b80707K626R1652h2821D7078a07982j54357a06839A55355j5755b54141
18625a10108A65730b74101d0642D4902K63813b07316A10094a42789j53180m6517
18615c42486f3366B94180D9651c1354E9113K611d8624j59414k58935B10857p5802
18604A35055n5937b2112H7668c8760j59256B55987A13324a31115A01785J07278
$$ plain form
18682 -214043 -2566 -137718 59580 140619 -408942 22216 -74236 -150686 -337106 -80590 -349142
18671 -349142 126609 77490 36938 -326143 -121813 -33318 21591 -148126 -331290 76917
18660 -34211 -14321 -118665 -131486 -49524 76808 -59727 152586 83970 51507 -95784 -219988
18649 -219988 -68075 27869 17466 -26063 -2126 -236760 12733 -168862 -147966 -138520 -16580
18637 185399 -280707 -278081 -186429 -82821 47078 -107982 -262339 -106839 155355 139600 -254141
18625 -110108 165730 -274101 -40642 44902 308715 -207316 110094 -142789 -295969 -342486
18615 -342486 -63366 294180 49651 -31354 59113 61724 -48624 -208038 -466973 210857 135055
18604 135055 79118 -22112 87668 -38760 -198016 255987 113324 -131115 101785 209063
18594B09063A1034a17505r3873j59622C9685O2714b79223R8549g5582H1643c21327
18582c00800A06844N2503M0004A096g1095j3560j8864j6049E0764P2495D3880
18570a39009A19555d6501p4982k5109C4376e3143o1147I6198j6337p655C5729
18558b60913p0914q0290A791N2328L2934a93663A41284i4590G8350J24990a49149
18546E5578a85985H310b66430d7716I2236h9508A19753O3a40312e7461B01372
18534E3634L639a55145A85953b18123l5320A26777E7794K1408a92890o5270N5479
18523b02681A19340P2586a94692H8439c38020h646k340l2213H9313J14987d57210
18511C9421g08157C6801a12583F6143h2400c4643B1427J3387b7454A16890L2887
$$ plain form
18594 209063 11034 -117505 -211378 -371000 39685 102399 -279223 -180674 -75582 81643 -321327
18582 -300800 106844 159347 199351 1096 -71095 -84655 -103519 -119568 50764 123259 43880
18570 -139009 119555 -46501 -121483 -146592 34376 -53143 -114290 96198 79861 72206 35729
18558 -260913 -331827 -412117 1791 54119 87053 -193663 141284 -94590 78350 203340 -149149
18546 55578 -185985 8310 -266430 -47716 92236 -89508 119753 119816 -140312 -57461 201372
18534 53634 57273 -155145 185953 -218123 -253443 126777 57794 79202 -192890 -258160 -202681
18523 -202681 119340 191926 -194692 88439 -338020 -8646 -10986 -43199 89313 204300 -457210
18511 39421 -708157 36801 -112583 66143 -82400 -34643 21427 34814 -27454 116890 149777
18500A49777E9204c86667e176k25546p3562B659a85148j37186a21621B51322g3008
18488a7076p1743A61885c34652A65108B0789B292J52904b52786D07210A13428
18477a12800e2192j00625O1299k52486h1568n0667G6710a9265a645m45112D6988
18465a15416j54482A78133b7315j41276P065m7329h4666p216d1334j93442F6286
18453A69613E4334J26576D5778b01076A4993R361a61403A09031e10490B4481J60345
18442A84826C1120K5551J53115a44876O5756n721j7106p3541D6293P9171c14897
18430a34614j93022e9231o5456P97c3070A55952E0346b53437P3118D683c01901
18418a97D6058f6956E0460e3763b3702n863n0777N31p5799b4514b182H5778a03123
$$ plain form
18500 149777 59204 -386667 -5176 -230722 -304284 2659 -185148 -322334 -121621 251322 -73008
18488 -17076 -88819 161885 -334652 165108 20789 2292 155196 -252786 407210 113428
18477 -112800 -52192 -152817 -91518 -344004 -81568 -132235 76710 -19265 -1645 -446757 46988
18465 -115416 -269898 178133 -27315 -168591 -161526 -208855 -84666 -91882 -41334 -234776 66286
18453 169613 54334 180910 45778 -201076 14993 24354 -161403 109031 -510490 24481 184826
18442 184826 31120 56671 209786 -144876 -79120 -84841 -101947 -175488 46293 125464 -314897
18430 -134614 -327636 -59231 -124687 -123890 -33070 155952 50346 -253437 -180319 4683 -301901
18418 -197 46058 -66956 50460 -53763 -23702 -29565 -80342 -79811 -155610 -24514 -2182 85778 -103123
18404c98770a73179A50765P6694e6242A89012m7268B2805g3121j3413k61841i1369
18392a00981j02618P0415A24884J0521b09879k41138A01627j5225C6350B017J08081
18381A10098K53391c210B85684j29721F9734a9979r495E0529b17246Q438J8915
18370a89893A24281c6329k4045l47245A61499d2987k2638k61417e0865r108J9863
18359d0110B43082C506f9513C690L37052d6108B10090G2087k7355h7192r4927
18348a82119A7678R4215K2496o502E5246L407a83392j21179g5808j7859k4691
18337a18358D7706d92446K43241A0469a52875k4483c8858D16244j82855e6501
18326a31800B78997a09401D0284i6943m5914M0298D3630i0905A70058a20974p1260
$$ plain form
18404 -398770 -173179 150765 227459 -56242 189012 141744 22805 -73121 -86534 -348375 -91369
18392 -100981 -203599 -133184 124884 135405 -209879 -451017 101627 86402 36350 2017 110098
18381 110098 363489 -3210 285684 155963 69734 -19979 -29474 50529 -217246 -208808 -189893
18370 -189893 124281 -36329 -60374 -407619 161499 -42987 -65625 -327042 -50865 -59973 -40110
18359 -40110 243082 3506 -69513 3690 340742 -46108 210090 72087 44732 -87192 -182119
18348 -182119 17678 111893 134389 127887 55246 58653 -183392 -304571 -75808 -93667 -118358
18337 -118358 47706 -492446 -249205 10469 -152875 -177358 -38858 416244 233389 -56501
18326 -131800 278997 -109401 40284 -96943 -142857 -102559 43630 -90905 170058 -120974 -192234
18315a92234B40636f2914J5202C40857b75494a05789H0146M0384H520k246d82240
18303C29252c79450c520a390k4300j82660H6914C4152R5748m1986j559b02452
18291d707k45826c1300C3655A5087M7105a10142k35736a30222B7921J57887C6146
18279F6860j6335e6721b5265m7865j50819B00232J77648r2944a291B4066R3093
18268A17159A7460M3210a44500k24601E6170b89119I5511f8071j49867j29370
18258c47308i9023d6864A03599k3582g6440A50447B3919J55224G6040b29910g3002
18246b3121k1146r3705o9357E7143b45970I3794a5231k20020A17437E8597a6594
18234f5016j6408l44432B72953D1366b81041h1894j71085m6782i1422F1799L0422
$$ plain form
18315 -192234 240636 -62914 -47712 340857 -275494 -105789 80146 120530 8520 6274 -482240
18303 329252 -379450 -3520 -1390 -25690 -208350 86914 34152 129900 87914 86355 -202452
18291 -4707 -250533 -31300 33655 15087 62192 -110142 -345878 -130222 27921 185808 36146
18279 66860 50525 -56721 -25265 -73130 -223949 200232 377880 284936 -1291 24066 117159
18268 117159 17460 60670 -144500 -369101 56170 -289119 95511 -68071 -217938 -347308
18258 -347308 -99023 -46864 103599 80017 -76440 150447 23919 179143 76040 -229910 -73002
18246 -23121 -44267 -137972 -207329 57143 -245970 93794 -15231 -235251 117437 58597 -16594
18234 -65016 -81424 -425856 272953 41366 -281041 -81894 -252979 -299761 -91422 61799 92221
18223I2221a12574B8923M1928b53250C27160a30615C7958d4258h861m6A95156
18211A22719M260e7649A02206g5900j23881O1576A36298L9831b0973A74613E9616
18199C35221G2381N4445n9051a05263p2716H2707N4175m8477J84566A30886b30797
18187a76574J5746k1649A88958A6989g0115A35608o0746C6385a14716I1302J3285
18176A04587a22367j13708J7437P4384f2505j52733m8236c7983A59057A4384d9436
18164B215f7365j83022b3690j71301Q4666A4141c07307i6527G3830a4552j24977
18153a39529j87914g5759A9554a18608C52604g0592B4263b29633h9817j53389
18143b43206j59174B08167a93629d2178a0876A37489o8217a25439A9774c28260
$$ plain form
18223 92221 -112574 28923 70851 -253250 327160 -130615 37958 -44258 -8861 -8907 195156
18211 122719 126979 -57649 102206 -75900 -199781 -138205 136298 176129 -20973 174613 59616
18199 335221 72381 126826 67775 -105263 -177979 82707 136882 88405 272971 130886 -230797
18187 -176574 -160828 -182477 188958 16989 -70115 135608 74862 36385 -114716 91302 104587
18176 104587 -122367 -236075 -218638 -144254 -62505 -215238 -263474 -37983 159057 14384 -49436
18164 2215 -67365 -250387 -23690 -194991 -110325 14141 -307307 -96527 73830 -14552 -139529
18153 -139529 -327443 -75759 19554 -118608 352604 -70592 24263 -229633 -89817 -243206
18143 -243206 -402380 208167 -193629 -42178 -10876 137489 69272 -125439 19774 -328260
18132A48613k3248j4755c59563J57828k66717a78995f7623j36199A17534d56303
18121c8510l90396a44855C19867h8744j44829d5158A29186a37248A7512b23026
18110A43171a33347d9423A35599a61128M3439r4415A46039a78604e8427j13716
18100a72143o6454A28730a18373A39599c26149J46077N7814A49715J20905J95930
18090D66550a01415j65443C36597b01324G0966i4290B52164a01139M3341G9547
18079a28009c8716j45010e4449E407J32484g5147B39416J48686j42680d60210
18068b89140h5227r3833K6480O4806B4481K41915H5423b24015G8112L3533J0074
18057A21719a68452c7652A36378h0907J8769l0015N575F773K35602d7483G3474
$$ plain form
18132 148613 125365 110610 -359563 -201735 -468452 -178995 -67623 -203822 117534 -456303
18121 -38510 -428906 -144855 319867 -88744 -233573 -45158 129186 -137248 17512 -223026
18110 143171 -133347 -49423 135599 -161128 -117689 -212104 146039 -178604 -58427 -172143
18100 -172143 -238597 128730 -118373 139599 -326149 -180072 -122258 149715 270620 466550
18090 466550 -101415 -266858 336597 -201324 70966 -94290 252164 -101139 -57798 79547
18079 -128009 -38716 -183726 -54449 5407 137891 -75147 239416 388102 245422 -460210
18068 -289140 -85227 -179060 -152580 -87774 24481 266396 85423 -224015 78112 111645 121719
18057 121719 -168452 -37652 136378 -80907 -62138 -92153 -86578 6773 242375 -47483 73474
18045h7438k4535E1294G466d73894c2452A03109B5293B614f2148l5086a2340D09838
18032f6370B15980D904J09239f5776m0456e787k88742E2224J39222a05566j61382
18021b66948E4458b53666D8097M9897h0090p5750j4522j35855A84962b65676G7698
18009e64432g7293G6788b2967j44796P0562e622p7800C4665K94014a82670A85335
17997A44992j1185a89640G4092a25790A1680b72997J12707n0727A02594E709P4719
17986H0428b52648L1103f4373c726q7420D07569a81295A72033a09383G0623K3501
17975I4124b32442O7410B83410a46333j04000B8655J42399J11674A08860e0479
17964b36837j978B23282b72960D50676A81081c672H1773M3547f1589k47319H6601
$$ plain form
18045 -87438 -111973 51294 7466 -473894 -32452 103109 25293 2614 -62148 -97234 -12340 409838
18032 -66370 215980 4904 114143 -65776 -106232 -5787 -294529 52224 191446 -105566 -266948
18021 -266948 54458 -253666 48097 97994 -80090 -155840 -170362 -306217 184962 -265676 77698
18009 -564432 -77293 76788 -22967 -167763 -97201 -5622 -83422 34665 328679 -182670 185335
17997 144992 133807 -189640 74092 -125790 11680 -272997 -160290 -211017 102594 5709 80428
17986 80428 -252648 -221545 -64373 -3726 -91146 407569 -181295 172033 -109383 70623 94124
17975 94124 -232442 -165032 283410 -146333 -250333 28655 171054 282728 108860 -50479
17964 -236837 -238815 223282 -272960 450676 181081 -3672 81773 125320 -61589 -308908 86601
17952f8804B17727b77453C73463d21349a13640j57687J26198r7938J01982N0394
17942i0691A94908d3657A26094d3028k6347G0065K0173a07434A86939q8366a0887
17930a52960j69685A61249E6361M59082G6541a12239K5668o4022A18812N0319
17920A69131E4756K61497A4027a19920K203B52123a43829D3708a21285b0980A271
17908C7601M6157a99267B34474b49152d1565J5027j7573j9464A14220f1715K0637
17897d1078E3281a12250A33802h7057A24198D0468a20905B07201A2828K49174
17887B62002I1486K15546j10087H8596D0603g0789L0589A47385J06829i585j39985
17876a49570E0160K3815c5301j09641C5550a40898B067M36483A38825H915L12901
$$ plain form
17952 -68804 217727 -277453 373463 -421349 -113640 -271327 -145129 -243067 -141085 -90691
17942 -90691 194908 -43657 126094 -43028 -69375 70065 90238 -107434 186939 98573 -10887
17930 -152960 -322645 161249 56361 515443 76541 -112239 -86571 -150593 118812 169131
17920 169131 54756 316253 14027 -119920 -117717 252123 -143829 43708 -121285 -20980 1271
17908 37601 83758 -199267 234474 -249152 -41565 -26538 -44111 -63575 114220 -61715 -41078
17897 -41078 53281 -112250 133802 -87057 124198 40468 -120905 207201 12828 262002
17887 262002 91486 307032 196945 88596 40603 -70789 -40200 147385 254214 -9585 -149570
17876 -149570 50160 73975 -35301 -144942 35550 -140898 2067 438550 138825 8915 321816
17865C21816k8753e2423q461G3995b54627b6780G200a19860C5418A42K10226i230
17852a13815A11019A9799J9728g6923j95903d2306r882B28999e6284j16812j01286
17841b74382A61901L70g4638k23664A55484D3224B617J83875m4745k9636k8315
17830H3796b39070a9598N854D757Q1389a75399A7303J5364e3572A10713b6654
17818B61207A02023B2007K53620j09429p8495d8136C1413K29771i1040F8977a43633
17806F5160L64804a62770H2563i5221G2458B9644L3231L14356C4152d12682D9103
17794C26550G6703a71577O8924k65049C7898b07288a2007l29764a0919k28045
17784b38964d6714C01899e4097A11553a86215A07259c8479R246D8150K8701k7826
$$ plain form
17865 321816 293063 -52423 -60884 73995 -254627 -26780 7200 -119860 35418 142 210368 -9230
17852 -113815 111019 19799 39527 -76923 -272826 -42306 -52188 228999 -56284 -173096 -274382
17841 -274382 161901 162271 -74638 -298302 155484 43224 2617 186492 141747 112111 83796
17830 83796 -239070 -19598 -13744 4757 86146 -175399 17303 32667 -53572 110713 -26654
17818 261207 102023 22007 275627 166198 87703 -48136 31413 261184 -91040 68977 -143633
17806 65160 429964 -162770 82563 -95221 72458 29644 62875 377231 34152 -412682 49103
17794 326550 76703 -171577 -102653 -367702 37898 -207288 -12007 -341771 -10919 -238964
17784 -238964 -46714 301899 -54097 111553 -186215 107259 -38479 -29233 48150 76851 49025
17773D9025c6548H4881a14033J8559L5057l40656A4930d3083j49520H8107K37674
17762C25781G4440h985A02398a79328A7165a87169j48941G8612L14148i8863r4199
17751a93062D2039K8627K5099A511K8920Q9629b6439j86692A38666F4353a10548
17739b52660I5319B7934R1177b29262A9242a34715N2949A62223M679a13850L3703
17728h0147l2810D15928A51729K802a96165F9052c6176i158q9924I4122R6257
17717A90379a17605C75880b28514C50395H0208B6424e0936B40996a30757A32351
17706F4498J8639J3256B6832J8117h380G0401J94792n2478a60471C64688j47081
17695B17607a69162B20805K2398a55510A41961q728D9522J92128C4628a9449A38708
$$ plain form
17773 49025 -36548 84881 -114033 -95474 -60417 -401073 14930 -43083 -192603 88107 325781
17762 325781 74440 -8985 102398 -179328 17165 -187169 -336110 78612 392760 -98863 -193062
17751 -193062 42039 70666 95765 1511 30431 120060 -26439 -213131 138666 64353 -110548
17739 -252660 95319 27934 119111 -229262 19242 -134715 -81766 162223 166902 -113850 -80147
17728 -80147 -112957 415928 151729 154531 -196165 69052 -36176 -9158 -99082 94122 190379
17717 190379 -117605 375880 -228514 350395 80208 26424 -50936 240996 -130757 132351
17706 64498 83137 96393 26832 44949 -8380 70401 265193 212715 -160471 364688 217607
17695 217607 -169162 220805 243203 -155510 141961 133233 49522 241650 34628 -19449 138708
17683a07590H6846B2425O3279K9257B8508J52096J12495A16371D6591h2411J7857
17672f4554o5405D29242k03892c2284k9274j18438A25575J01116D0632f5560A24379
17660E1022a90438B51668j15540K7506o2959K40009K9355p0299g3800C35130r1376
17649B43754j08215e0130q0858A82998J0445I298Q2256h415j84654B06687a24041
17637B72483L695h039A26161D4594J9494e1839C76469g6286A06367J9461j9362
17626A06466L01952H5550a65354m6066L0961B82955n4178m9813C6927J94128M0280
17615B71335A9529L5992J78672b08824B75675A4243J10700B1242J5052b8803B26147
17603c40599B88595a07881c7562C31372a74446E2029M39285a81485B39017H975
$$ plain form
17683 -107590 86846 22425 85704 114961 28508 180604 293099 116371 46591 -82411 -64554
17672 -64554 -129959 429242 225350 -32284 -61558 -179996 125575 226691 40632 -65560 124379
17660 51022 -190438 251668 136128 163634 100675 340684 370039 299740 -73800 335130 243754
17649 243754 135539 -50130 -130988 182998 193443 9298 91554 -8415 -193069 206687 -124041
17637 272483 276178 -8039 126161 44594 64088 -51839 376469 -76286 106367 125828 106466
17626 106466 408418 85550 -165354 -211420 -180459 282955 228777 178964 36927 231055 271335
17615 271335 19529 55521 234193 -208824 275675 14243 124943 21242 36294 -28803 226147
17603 -340599 288595 -107881 -37562 331372 -174446 52029 491314 -181485 239017 8975
17592H7983J47621m8480o7312Q3349r5454J60103c94328g3751B08470g029C0641
17580C8191b9370k46814E8461c5695A99987P7597I279d6186k33082a21363d2566
17568C02826A30679K29069j54029f4059A6742a29626d1700k04668C47747n2168
17558B95579K0749A06815L8430a4177I7214M9522c5831f696A34360a39573B32672
17546A10179L52824f4972B48810h4532B23023A2497K1238K30038e0778E4820a20459
17534A03810L7587J86875K41314A62252K34443n2934J01504m6535K34352L55471
17524I88553k45229K65746M8415k58138l11001j17260j5032j28134L32066B56189
17513B89700J1569J97621j1120L94755m4417m2840J8913k75951j66981J00916
$$ plain form
17592 87983 235604 187124 119812 203161 107707 267810 -394328 -73751 208470 -7029 30641
17580 38191 -29370 -276184 58461 -35695 199987 277584 9279 -46186 -279268 -121363 -42566
17568 302826 130679 359748 205719 -64059 16742 -129626 -41700 -246368 347747 295579
17558 295579 316328 106815 145245 -14177 97214 146736 -35831 -6696 134360 -139573 232672
17546 110179 463003 -64972 248810 -84532 223023 12497 33735 263773 -50778 54820 -120459
17534 103810 141397 328272 569586 162252 396695 343761 445265 398730 633082 988553
17524 988553 743324 1009070 1057485 799347 488346 371086 356054 227920 559986 256189
17513 289700 301269 498890 487770 882525 838108 795268 814181 538230 371249 472165
17503D72165j57210A07246K03077C1814L24387p4264J12451A31247m6026a140
17492A40644L05073j48710B840J45981N3171H2550h1432C4283L79243A69786F4680
17480i7042C86357G9846K20772A22444J28271M4464M9242j22444G4312J02785
17470A77097J3161o5482J81347a85316C17339K5978j18576j08547R5187F9639
17459A57227a03961A64552C9820K4980J270K34022j25137J61399j7056J00476
17449D19774j6689j1311o9643n9707k4907J24906J09182k01337a20638C75949
17438B86879l6807M8687J95490J44317I2967P2064N3668L12420h0771E39548k33546
17427C06002A22202K59898j74574L3908R0024A5448M4818P5852J67771q938Q8182
$$ plain form
17503 472165 314955 107246 310323 31814 356201 281937 394388 131247 85221 -1140
17492 140644 445717 297007 2840 148821 201992 82550 -81432 34283 413526 169786 64680
17480 -97042 386357 79846 300618 122444 250715 295179 344421 221977 74312 177097
17470 177097 190258 124776 306123 -185316 317339 343317 224741 116194 211381 69639
17459 157227 -103961 164552 39820 64800 66070 300092 174955 336354 319298 419774
17449 419774 403085 391774 322131 262424 237517 362423 471605 270268 -120638 375949
17438 286879 250072 298759 494249 638566 92967 165031 218699 531119 -80771 539548 306002
17427 306002 122202 382100 207526 241434 331458 15448 60266 136118 303889 294951 383133
17416C83133A54624J25406m8212a13775C55579q6650k7214K9419q4975R8198K30401
17405E14758B43832b90B72767F4695L3290a26986A30187J56853f3342C05838n9329
17394B46509J67313I6888D8110J85832R8761E4276L39837j00974A25550A8908
17383B76242Q1934n8367j32113L62176j58648J1404j73533P8077A14672K34207
17373C48879q6386L869p6913L70200b87056C66434F8982M2586I19J05001L25417
17362D31337L4207k15606J31526j37093H9199K20542J5538e2172j02399C33145
17351B32344R5060C0154K58325K47659j63153O4824F1223L744B0648M8596K27783
17340B97027K18230L3884B66428l610B6445K02638r452f2149A96496A1370J32029
$$ plain form
17416 383133 154624 280030 231818 -113775 355579 268929 241715 271134 186159 284357 514758
17405 514758 243832 -290 272767 64695 97985 -126986 130187 287040 -63342 305838 246509
17394 246509 413822 96888 48110 233942 332703 54276 394113 293139 125550 18908
17383 276242 358176 299809 167696 529872 371224 382628 209095 287172 114672 348879
17373 348879 262493 266362 189449 559649 -287056 366434 68982 111568 919 105920 431337
17362 431337 465544 249938 381464 244371 89199 309741 325279 -52172 -154571 333145
17351 232344 327404 30154 288479 536138 372985 437809 61223 64967 20648 69244 297027
17340 297027 515257 549141 266428 262818 26445 229083 219631 -62149 196496 11370 143399
17329A43399J78690E8801J28021p9157J10266I8103k0831J83545I1847j1221K6036
17318A06662J8075b68698I5854a38750D6916K7863O3445K57295j17958J29005
17308D06566A62299L14865B35741J4532J52351p0352H2567J79953l5451L23430
17298E50499A85045i8367K0544A83160J21723A36156J16151A23549J32069G2175
17287A07379L3349K87315a4453B85193J81260k09097a8994D62617A36110J0680
17277A46790G873K49842J02492q798j35103l7277J92890j35129R3899A51741K3119
17266A74860L50354o5718p375l4754p5605J04231A06649M46308A04748J43345
17256B48093L8104a626C86404A92679q0446J11633J58991m8969j25822G7910l8145
$$ plain form
17329 143399 322089 58801 186822 107665 217931 98103 77272 260817 91847 80626 106662
17318 106662 124737 -268698 95854 -138750 46916 74779 138224 395519 277561 406566
17308 406566 162299 477164 235741 250273 402624 332272 82567 262520 227069 550499
17298 550499 185045 -98367 -77823 183160 304883 136156 252307 123549 255618 72175
17287 107379 140728 428043 -14453 285193 466453 257356 -18994 462617 136110 146790
17277 146790 7873 257715 360207 351409 216306 179029 371919 236790 330689 151741 174860
17266 174860 525214 459496 452121 417367 341762 445993 106649 552957 104748 248093
17256 248093 286197 -1626 386404 192679 112233 223866 382857 333888 208066 77910 39765
17245C9765L34504C8125K62261J88312J45920E7564K54895D3772J56419J98529
17235C98720j76824h4384C44729r4914L97661A39873m0004K82325A83659M52887
17225F36546j27039a61155C31302F1405L37291F1639N648M64970A18059j3418
17215A04641L12783J83057G7079M39444B12562R2947l1335j14855K75155N7149
17205D91623K64498B46360Q2181n2783O3144q897m4503l9056K65409q717k00311
17194C02827G8513L56574k14712K82970P7546k53756N6587J24241p2449G1019
17183A22896J95195J46351H3941J56973Q2421L33322l10997J48932j18078p3086
17173C03428A39100M18677j24322r8226j18116K28440o2556n4397A52503L82092
$$ plain form
17245 39765 374269 38125 300386 488698 634618 57564 312459 43772 200191 398720
17235 398720 221896 -84384 344729 249815 647476 139873 99869 382194 183659 636546
17225 636546 509507 -161155 331302 61405 398696 61639 67287 532257 118059 104641
17215 104641 417424 600481 77079 516523 212562 305509 274174 159319 434474 491623
17205 491623 756121 246360 328541 275758 338902 330005 285502 246446 511855 503138 302827
17194 302827 78513 435087 220375 503345 580891 327135 383722 507963 435514 71019
17183 122896 318091 464442 83941 240914 323335 656657 345660 494592 376514 303428
17173 303428 139100 557777 433455 335229 217113 445553 382997 328600 152503 534595
17163E34595q7290k10429K17882J47989k26928q4151J32703J75066k00620J48635
17153E47452k32873L47614k52297j45156L14696j04161J29915j19789L4745j7792
17143E02354B49557K36565k1096A913L14119p8006J98393j67672M84026j87021
17133E65752k09276j39549O1164K52359M14105l15832B94662N5571M34617C52046
17122E73407J12285J43498R0070C62191K62973j66733q2243O9929p7500J17830
17112D86447j10601L14517C32553p4138L98916j91986J06358M80054m33510o980
17102F11267j17235k14656L1484K15688n3520K99962r6806q8233l8446j70604
17092C78901K30992J42672j93379K19869l17459j61973M10178j28830B53593J55940
$$ plain form
17163 534595 447305 236876 454758 602747 375819 291668 424371 599437 398817 547452
17153 547452 314579 662193 409896 264740 579436 475275 605190 485401 520146 502354
17143 502354 249557 486122 465026 1913 316032 238026 436419 268747 752773 565752
17133 565752 356476 216927 278091 530450 944555 628723 294662 350233 784850 352046
17122 573407 685692 829190 919260 362191 625164 458431 376188 446117 368617 486447
17112 486447 375846 690363 332553 258415 657331 465345 571703 1051757 618247 611267
17102 611267 494032 279376 310860 526548 473028 772990 676184 587951 549505 378901
17092 378901 609893 752565 559186 779055 461596 299623 709801 580971 253593 409533
17082D09533Q0700Q0916R9275P1306J3500L873J85465p8984B25046N75703j99606
17071F01143m6803m0006L1547J68129q1876l294k65065L34521j34407o4060O9504
17060E69333J28701J43848k12376R3494j63493J97462o3239O3734Q4285k0231
17050H21518q2811J24704j35316J27606R1107j37517J13430J15429n0926k46565
17040G40659r12K0910J47737p0297Q8549j870K31Q7424k68915M6945L98909j86685
17028A002685j03275j5726L81054n25560L33133j15614j5120L52832l25375K7393
17018I96427M8041m4912n3064J37110Q4773k70734j54645L83617j11507k45021
17008G70085K3223K75194k00751K62489j24842q5041J68221j29723K54683j26953
$$ plain form
17082 409533 490233 571149 670424 741730 755230 759103 944568 865584 225046 800749 601143
17071 601143 554340 514334 545881 714010 632134 628840 363775 698296 563889 499829 569333
17060 569333 698034 841882 629506 723000 559507 756969 693730 757464 841749 821518
17050 821518 738707 863411 728095 855701 946808 809291 922721 1038150 987224 740659
17040 740659 739747 760657 908394 838097 926646 924776 925007 1012431 743516 790461 1189370 1002685
17028 1002685 899410 883684 1264738 739178 1072311 956697 941577 1294409 969034 996427
17018 996427 1044468 999556 946492 1083602 1168375 897641 742996 1126613 1015106 770085
17008 770085 793308 1068502 867751 1130240 1005398 920357 1088578 958855 1213538 1086585
16998A086585R8721j18646l7928K06402l65031K47357j68295J41901J91726j9397
16988A263395J4379m9798k38233L53172J41617l57235k50563K17569J00189J89856
16978A384348k12341l951K24944k35802K28125J68560k46982L69501l40714O95052
16968B030740n08061r1335j55072L16731J7790j84868K03443l51493O5177K37052
16958A580104K49051k90574L2647L59484j13274l60794K11324r0766l1948J278
16948A546532J64010k1473M0860l23085L46629J79304j9165l03816K94099p4253
16938A829642m6117j90142J81614J22076K00165j77891N4566j00507k21100N56536
16928B208842j02100O1196j06112n5343L01133l64795K66217o5183j11192N5947
$$ plain form
16998 1086585 1185306 1066660 1028732 1235134 870103 1117460 949165 1091066 1282792 1263395
16988 1263395 1277774 1227976 989743 1342915 1484532 1127297 876734 1094303 1194492 1384348
16978 1384348 1172007 1168056 1393000 1157198 1385323 1553883 1306901 1676402 1335688 2030740
16968 2030740 1522679 1431344 1276272 1593003 1610793 1425925 1629368 1277875 1343052 1580104
16958 1580104 1829155 1538581 1571228 1930712 1817438 1456644 1667968 1577202 1545254 1546532
16948 1546532 1710542 1689069 1729929 1406844 1753473 1932777 1913612 1609796 1903895 1829642
16938 1829642 1783525 1593383 1774997 1897073 2097238 1919347 1973913 1873406 1652306 2208842
16928 2208842 2106742 2167938 2061826 2006483 2307616 1942821 2209038 2143855 2032663 2088610
16918B088610Q5308L23955k45238l8780M39973k67713J36328R0042j38113k15439
16908B258933K62383R7606q0740m8101L72773k58261j15708L58278k10712R9146
16898B735597k30921K55240j59457L90383J90853l78899J0948K0588J67543j29606
16888B872269O96564q82153M28105n500J66071k01513M67848l03740j07803K48570
16878C378718K05071R6143k90201l9320N64379m01299K46924L91121n35923J25431
16868C741044K51229K13036K15491O0329j18435n2056o4022J26324J12242J59524
16858D644706l04647K79037k25247N74217q5729L4203m0133O13552j31988j8570
16848E339401M7767p2357J60763m137m7986K38547M28121j41351N482K30469k40069
$$ plain form
16918 2088610 2173918 2497873 2252635 2213855 2653828 2386115 2522443 2612485 2474372 2258933
16908 2258933 2521316 2618922 2538182 2490081 2862854 2604593 2488885 2847163 2636451 2735597
16898 2735597 2504676 2759916 2600459 2990842 3181695 2802796 2813744 2834332 3001875 2872269
16888 2872269 3568833 2686680 3114785 3109285 3275356 3073843 3541691 3237951 3130148 3378718
16878 3378718 3583789 3679932 3389731 3350411 3914790 3513491 3760415 4151536 3615613 3741044
16868 3741044 3992273 4205309 4420800 4481129 4362694 4310638 4246616 4372940 4485182 4644706
16858 4644706 4340059 4619096 4393849 4968066 4882337 4916540 4876407 5489959 5357971 5339401
16848 5339401 5387168 5314811 5475574 5471437 5423451 5661998 6090119 5948768 5954250 6184719 5944650
16837E944650L92874J31356O3771K68424j91475L35132J93340L12932k65410K30715
16827G416309J69360R3671K38137K56402j68909L75311J56397L05180k40236J93347
16817H794969K90157K76721j57137L90700M13344J27986J72738P3437K46966Q7370
16807A0717251M55675K48124L93684K79424K51837J88466r0288Q62169j45751
16798A3160591J05416Q71146j5839M55081L1255M68961L49386N80379J67768O32792
16788A6806936J71815P06083K19855M48769L30024P52171L05188M20121J055592
16779B1216554L94008L55366R92453M28020M99061R17660N85185O38795O73112
16770B6700214R55005Q65002N04392P00802J046718R50327J301143N12991J066084
$$ plain form
16837 5944650 6337524 6468880 6532651 6801075 6609600 6944732 7138072 7451004 7185594 7416309
16827 7416309 7585669 7679340 7917477 8173879 8004970 8380281 8536678 8841858 8601622 8794969
16817 8794969 9085126 9361847 9204710 9595410 10008754 10136740 10309478 10382915 10629881 10717251
16807 10717251 11172926 11421050 11814734 12094158 12345995 12534461 12444173 13306342 13160591
16798 13160591 13266007 14137153 14121314 14576395 14607650 15076611 15425997 16006376 16174144 16806936
16788 16806936 16978751 17684834 17904689 18353458 18683482 19435653 19740841 20160962 21216554
16779 21216554 21610562 21965928 22958381 23386401 23885462 24803122 25388307 26027102 26700214
16770 26700214 27655219 28520221 29024613 29725415 30772133 31722460 33023603 33536594 34602678
16761C4602678P44712J203368J331632P41632J570180Q04394J477032J374862
16753D3850490R14177J050652K008081J458788J133648J424443J439356J657805
16745E4937440J583311J460540J511067J340207J509895J594218J633610J404245
16737F6974533J643389J601870J208556J064050J245214J394518Q45362Q12807
16729G6790299J288448L75471R62703L50708M71559O11560O1896j72668m04124
16720H0335852j5360m26196m76155n55397j036937p14924q80391j039599j211162
16711G3979731j332903j347363j207056j493297j602831j501288j174379j417883
16703F2902731j829264j743749q76502j907316j460511j538693j306020j808777
$$ plain form
16761 34602678 35347390 36550758 37882390 38624022 40194202 40998596 42475628 43850490
16753 43850490 44764667 45815319 47823400 49282188 50415836 51840279 53279635 54937440
16745 54937440 56520751 57981291 59492358 60832565 62342460 63936678 65570288 66974533
16737 66974533 68617922 70219792 71428348 72492398 73737612 75132130 75977492 76790299
16729 76790299 78078747 78454218 79416921 79767629 80239188 80850748 80912644 80739976 80335852
16720 80335852 80320492 79894296 79418141 78862744 77825807 77110883 76230492 75190893 73979731
16711 73979731 72646828 71299465 70092409 68599112 66996281 65494993 64320614 62902731
16703 62902731 61073467 59329718 58453216 56545900 55085389 53546696 52240676 50431899
16695E0431899j261954j197137j214498j349359j867916j025403q03790j336647
16687D0375195j090120j004145j581865o56322j290743o02199j226013r57246
16679C1966542o36851r45626j170903m33471q89130r16816n43202j095718l35163
16670B4999662o36911n01263q81115n75307p23507k51668m72175m99576o11261
16661A9846879n31578k62527o22667m86919m74967m68101j16273n95913O8374
16652A6356308o86797M0979p97725n37202j19429k50417l71205k63790j57003
16643A3213719k51944n20089j65365j05634l7587n97586K730k19379k31549j23848
16633A0963468n58950m1255l93738l3747k71130K47867m83442l5999j65638j32833
$$ plain form
16695 50431899 49169945 47972808 46758310 45408951 43541035 42515632 41711842 40375195
16687 40375195 39285075 38280930 36699065 36042743 34752000 34149801 32923788 31966542
16679 31966542 31329691 30384065 29213162 28779691 27890561 26973745 26430543 25334825 24999662
16670 24999662 24362751 23861488 22980373 22405066 21681559 21429891 20957716 20458140 19846879
16661 19846879 19315301 19052774 18430107 17943188 17468221 17000120 16883847 16287934 16356308
16652 16356308 15669511 15710490 14912765 14375563 14256134 14005717 13634512 13370722 13213719
16643 13213719 12961775 12441686 12276321 12170687 12133100 11535514 11538244 11318865 11087316 10963468
16633 10963468 10404518 10363263 9969525 9935778 9664648 9912515 9429073 9393074 9227436 9094603
16623I094603k73549m11007M7523l04582M4315l12898j8742N210j10200n34538
16613G226135o1922J75306K82694p00216p2579J77742q9479m02497j22731K80780
16603F693233k82587k5195R5943k22080j5843l04312J65418k47236j76418J60841
16593E841764k12974k78013k45409K10133j10967j2733o246j38541J4970q8645
16583D973339k14962n10843M21255M2536J51926j31362j1824m48622j06256j5125
16573D150062J43207q1k28955n3144J53835j31308j65171K08175j11203l6318
16563C929099l73868N28131q6331l63164l4355q6204J82017m40485J20138k00626
16553C174352m1762M29333o0694j62368J96810j16804l84078N81872p18012J65690
$$ plain form
16623 9094603 8821054 8410047 8457570 8152988 8197303 7884405 7865663 7870873 7760673 7226135
16613 7226135 7164213 7339519 7622213 6921997 6849418 7027160 6937681 6535184 6412453 6693233
16603 6693233 6410646 6385451 6481394 6259314 6243471 5939159 6104577 5857341 5680923 5841764
16593 5841764 5628790 5350777 5105368 5315501 5204534 5191801 5185555 5047014 5061984 4973339
16583 4973339 4758377 4247534 4668789 4711325 4863251 4731889 4720065 4271443 4165187 4150062
16573 4150062 4293269 4293188 4064233 4011089 4164924 4033616 3868445 4076620 3965417 3929099
16563 3929099 3555231 4083362 3997031 3633867 3599512 3513308 3695325 3254840 3374978 3174352
16553 3174352 3132590 3561923 3501229 3338861 3535671 3418867 3034789 3616661 2898649 3064339
16543C064339m2773k2972J76694k87403j02281P3349K5939q4252j02882K01973
16533B899731Q36j2260j36462l1385j05016j10847k1876M4373J84365o17841K75018
16522B368636L87843l90061L2444J5686l9564J62888m1177r933k81989J37847
16512B342620l402Q0756k02147j00175K04287p4540j61134L70844l55021q1909
16502B020179j20420K40984j91910Q6416k74299L60036j01795N3778j16895j55418
16492A800656j42736L43712n4462K34735j91110L3644J3803m31898J05538O2114
16482A773996k79708L7321J7238K83083J59653k82285l2214J2550o830q6991K89894
16471A885707m3076p9443J08127l75379n579K23344l43181K46856l25611L92073
$$ plain form
16543 3064339 3021566 2998594 3175288 2887885 2785604 2858953 2884892 2800640 2697758 2899731
16533 2899731 2900567 2888307 2751845 2720460 2615444 2504597 2482721 2527094 2711459 2093618 2368636
16522 2368636 2756479 2366418 2398862 2414548 2374984 2537872 2496695 2486762 2204773 2342620
16512 2342620 2339218 2419974 2217827 2117652 2321939 2247399 2086265 2457109 2102088 2020179
16502 2020179 1899759 2140743 1948833 2035249 1760950 2120986 2019191 2072969 1956074 1800656
16492 1800656 1657920 2001632 1947170 2181905 1990795 2024439 2038242 1606344 1711882 1773996
16482 1773996 1494288 1531609 1548847 1831930 1991583 1709298 1677084 1689634 1682804 1595813 1885707
16471 1885707 1842631 1763188 1871315 1495936 1490357 1713701 1370520 1617376 1291765 1683838
16461A683838l83424J41567L84449k31259N3052r7560j01576J8424J53304j18775
16451A502040m3123j89212O00256p70016p580J51490K64571Q2207m51300M52221
16441A591554k10230l58006K05320j19641p523M45901j15937n65164L87521k49120
16431A004675K84391o0695K07393k97515J68697P2293J3234m33897L59579R4097
16421A412252k42548J7637M2286M94889m26732r2313k45844J11660q2417P4190
16411A063060J52602o0862J67014m18028O4598j2098L08088l1960K9935J9490
16401A281839q5855J08711n88397L23694j79124K78024j10893K41455j56601j51013
16391I61840M21706m91792L41363n99178K79581k7716K5063P8062K41308l42501
$$ plain form
16461 1683838 1300414 1441981 1826430 1595171 1648223 1550663 1449087 1467511 1620815 1502040
16451 1502040 1458917 1269705 1869961 1099945 1092365 1243855 1508426 1590633 1139333 1591554
16441 1591554 1381324 1023318 1228638 1108997 1101474 1547375 1431438 866274 1253795 1004675
16431 1004675 1289066 1228371 1435764 1138249 1306946 1379239 1392473 958576 1318155 1412252
16421 1412252 1169704 1187341 1229627 1724516 1297784 1205471 959627 1071287 988870 1063060
16411 1063060 1215662 1154800 1321814 903786 968384 956286 1264374 1232414 1262349 1281839
16401 1281839 1195984 1304695 716298 1039992 860868 1138892 1027999 1269454 1112853 961840
16391 961840 1383546 891754 1233117 633939 913520 885804 910867 988929 1230237 887736
16381H87736l3465k86640M50686R1113k81122O10057m97969L9682q9828Q1026
16371I71276j92172R6833j6144C35783P50131j67637O9482M5392j56127j15240
16361G61784l4152q0451J78250L51779m20066J01603k26297L0895J84732j94407
16351F53670J61536l60391M4390K37305m051N7845q6208J35475j37636l2543J10709
16340G80101K72575n12458O9984L09698j5801j87901q4336r1215K49526r9689
16330F90484j92211L03805k07910R7533n3091k73224L64929J04701l09702J02577
16320F27891K93899k2059l15157j17581P4608r156j33255Q8360j07103M28810
16310H09257j86639q6350k2667K80450J86652m77116J7140j27499J31132J19080
$$ plain form
16381 887736 854271 567631 1018317 1109430 828308 1438365 940396 980078 890250 971276
16371 971276 779104 875937 859793 335783 1085914 918277 987759 1033151 877024 761784
16361 761784 727632 647181 825431 1177210 757144 858747 632450 663345 848077 653670
16351 653670 815206 454815 499205 736510 732459 790304 704096 839571 701935 669392 780101
16340 780101 1052676 540218 610202 919900 904099 716198 631862 540647 790173 690484
16330 690484 498273 802078 594168 691701 638610 365386 730315 835016 525314 627891
16320 627891 921790 899731 584574 466993 541601 532445 399190 487550 380447 809257
16310 809257 622618 536268 513601 794051 980703 503587 520727 393228 524360 643440
16300F43440p1351K3586k18851K83647C00609J33544J98901p2246Q6688J01427
16290G48923j86315m2968k07707K14441B57898M19623L322r0470k8860K4660J81300
16279G67473j37501R3439k89067J64655k38391K21739M5720l01048o3921J53653
16269D16751J93638j48830l5146K79534L4916k57416B06248K94167J60324k59314
16259D01425A90227K71763L5861K30860j77754j78357l8932K44269j01568K19708
16249F96077j62028J41668E2044P67155A78233L28100l1627B32314K69875n9356
16239D42833m1066J1369O512J06474R709q5662J88632C18355F8991L10451m449
16228C74993K32483o1336B48431P0228N5820j10943j15831K7139J42177K88765
$$ plain form
16300 643440 572089 595675 376824 660471 300609 434153 633054 560808 647496 748923
16290 748923 562608 519640 311933 526374 257898 677521 680843 590373 561513 586173 767473
16279 767473 629972 723411 434344 598999 360608 582347 628067 327019 263098 416751
16269 416751 610389 461559 426413 705947 740863 483447 206248 500415 660739 401425
16259 401425 190227 461990 497851 728711 550957 372600 333668 577937 476369 696077
16249 696077 534049 675717 52044 819199 178233 506333 474706 232314 502189 442833
16239 442833 401767 413136 419648 526122 535831 450169 638801 318355 68991 379442 374993
16228 374993 607476 546140 248431 318659 374479 263536 147705 174844 317021 605786
16218F05786m6894B26608J41662K1660c241D83528J08411k14451A46862K11040
16208C57902j61935Q8663M0956j48221K98917k16536J43657Q5080K30314k70784
16198D48013L43363C37668J97508k223j2508A19045n1892L05239j01644L91796
16188F62544C30267H5660L39040l4195J44969A44368L18597J20621B80162A25559
16177C79307p4332e7736B47596J52634J63426B44654r0713J45844K35283B17670
16166A85297J62217A04094K48283j69678N055J30812m2402j14921K06811H3397
16155C33760C5419L59426r3591A03204K2607M36480k28431j56954K29248J90a1981
16143A98662P0786R1884A08403C4482f8184C53968A25500N38738A46935E3148
$$ plain form
16218 605786 558892 226608 368270 389930 -3241 483528 591939 377488 146862 357902
16208 357902 195967 284630 325586 177365 476282 259746 403403 488483 718797 448013
16198 448013 791376 337668 535176 532953 520445 119045 67153 372392 270748 662544
16188 662544 330267 85660 424700 390505 535474 144368 462965 583586 280162 125559
16177 379307 304975 -57736 247596 400230 563656 244654 153941 299785 535068 217670
16166 185297 347514 104094 352377 182699 187754 318566 276164 161243 368054 83397
16155 333760 35419 394845 301254 103204 125811 562291 333860 176906 406154 406344 -11981
16143 198662 269448 361332 108403 34482 -68184 353968 125500 664238 146935 53148
16132B97293C3038P2527J52598I0020K7681O6456B2042Q9883L28288A31543L03898
16121D35441A56565J77633n9748A24729R7963o0076Q6312G2492J59759J45548
16111C77799N695o3372A44952L8740F5985K28195j1267i6765B72069p217j14644
16100A50208j5852Q893E7007E106b5927F4807Q2833L00307m0195J9505D8458M6007
16088I4465k5287K33663I5547i894E8433J10935J38087A52929k6409c3982B28158
16076a6854B67006b06865B30437n7459F6173K92364g6440A98831C0263M13736
16066D43999a24798E830K96704Q148a23836A75927J68308a17323B31219P0426
16056C01645J04042I9272k9531a97518K7340f281A82463A1247a16201C15840a93437
$$ plain form
16132 297293 33038 105565 258163 90020 117701 184157 22042 111925 440213 131543 435441
16121 435441 156565 334198 274450 124729 222692 162616 248928 72492 232251 377799
16111 377799 383494 320122 144952 183692 65985 294180 282913 -96765 272069 264852 150208
16100 150208 134356 143249 57007 5106 -25927 64807 147640 447947 407752 427257 48458 94465
16088 94465 69178 302841 95547 -9894 58433 169368 307455 152929 126520 -33982 228158
16076 -16854 267006 -206865 230437 172978 66173 358537 -76440 198831 30263 443999
16066 443999 -124798 5830 302534 310682 -123836 175927 344235 -117323 231219 301645
16056 301645 405687 99272 69741 -197518 -170178 -6281 182463 11247 -116201 315840 -193437
16044B15455m411r1590m7200J01075D2338a0241B42032H372K36999m7599E0660
16032A38127b5368C2372J75506k5142D9813R6089n0538K26022o4110B6962L9498
16021F6460a62228I3894q158L16262a96809A75153j9105L05253A31169L3642p9097
16010H5714J56839C2643J54365C0855f8714A89109i8211B71064h4709l5377C7284
15998A28729m7767O5053Q4046b18917g5689A54510K78929p0455o1837J4404L21635
15987F37186M76022K31117r5531k0973m21314j19434k48163C1559N5242J81150
15977B67951R1882n0532d6367A9576J7233a51976D07910E6762O7430f4777B867
15965C4285J21436C4548J48873o4185i1188I7288D2846a97646e4735D09504c5518
$$ plain form
16044 215455 211044 119454 72254 173329 42338 -10241 242032 8372 245371 197772 50660
16032 138127 -25368 32372 207878 182736 49813 145902 95364 321386 257276 26962 66460
16021 66460 -162228 93894 85736 401998 -196809 175153 156048 461301 131169 164811 85714
16010 85714 242553 32643 187008 30855 -68714 189109 -98211 271064 -84709 -120086 37284
15998 128729 80962 146015 230061 -218917 -75689 154510 433439 362984 301147 315551 637186
15987 637186 1113208 1344325 1248794 1227821 806507 687073 438910 31559 86801 267951
15977 267951 359833 309301 -46367 19576 36809 -151976 407910 56762 124192 -64777 2867
15965 34285 155721 34548 183421 119236 -91188 97288 42846 -197646 -54735 409504 -35518
15953B33894F8084a75009A4682J85861a00723G299J87635E2747Q6640R1707J82912
15942D14006b35847D5708b39265a633j92042C96303I5803f3411F5883b25990D29672
15930c6573r3367e4333j04011A61429J79489b38999A57993m0968P0974b38763
15919h4612E5308J58171k5744K0120G8144P5257L4766J68597m7138c69990G4633
15907A47157a7353r0506b1267M058n8557r2491e5851j3288A81271c4949E7518
15895a3996m63604K30459H1113b95047B66055e5132o4970C30991a73790b9522
15884B27031D02J35418m0566d474n7969A40504i6819A4379e7993m0633a0538I9048
15871d9227E9850M94G131a16266G0319d2636k37281B1851a0612A92509C4860J36164
$$ plain form
15953 233894 68084 -175009 14682 200543 -100723 7299 194934 52747 139387 231094 414006
15942 414006 -235847 45708 -239265 -1633 -193675 396303 95803 -63411 65883 -225990 429672
15930 -36573 -129940 -54333 -158344 161429 340918 -238999 157993 117025 187999 -238763
15919 -84612 55308 213479 187735 207855 78144 153401 188167 356764 309626 -369990 74633
15907 147157 -17353 -107859 -21267 -17209 -75766 -168257 -55851 -69139 181271 -34949 57518
15895 -13996 -477600 -247141 81113 -295047 266055 -55132 -120102 330991 -173790 -29522
15884 227031 402 135820 95254 -4474 -62443 140504 -96819 14379 -57993 -98626 -10538 99048
15871 -49227 59850 60344 7131 -116266 70319 -42636 -279917 21851 -10612 192509 34860 171024
15859A71024a15629A5552J45875b6166n1109B21812C4435I668J02196b20888g8570
15847h9124j28864j2160i6707D3026h5379j13699i4069p6092j03042I1092d1439
15835B54840a1351L874o0452A68578b0563I3151K10472b02564A07375Q5714b10105
15823e5276a1028A86599e2395F3439a90846I83c0959k04688B1676J26585j8860
15812A29401b38896D4988R7949b75315d1137A23d63894b15319b4451o50I4875
15800a30195A96055b71979G8162h2921E3964b1142F3281R9847a47756B13301G6739
15788B2657h2446k29587a44819C039K11399I0031m0784k2475d6006A86487P3875
15777B60362q3896c73081A38624a74302K198A391a67795A453a21545b8382B80981
$$ plain form
15859 171024 -115629 15552 161427 -26166 -77275 221812 34435 9668 111864 -220888 -78570
15847 -89124 -217988 -230148 -96707 43026 -85379 -199078 -94069 -170161 -273203 91092 -41439
15835 254840 -11351 -7477 -67929 168578 -20563 93151 303623 -202564 107375 193089 -210105
15823 -55276 -11028 186599 -52395 63439 -190846 983 -30959 -235647 21676 148261 129401
15812 129401 -238896 44988 142937 -275315 -41137 123 -463894 -215319 -24451 -25101 94875
15800 -130195 196055 -271979 78162 -82921 53964 -21142 63281 163128 -147756 213301 76739
15788 22657 -82446 -312033 -144819 3039 214438 90031 49247 26772 -46006 186487 260362
15777 260362 176466 -373081 138624 -174302 -172104 1391 -167795 1453 -121545 -28382 280981
15765b22714P8632A89102k2719q0145j1546K63681H6115a67296j8121C5023K09704
15754B44727D1817c14101a28740a6043H8488a67337A77251A0904K28315m2195
15744A97024b1474j07779B6633i8963d5492H020M7496K62778c70080G7131M257
15733H1388e2120b207l9996A13326o811h7855j55664P3337F1523R2485a29320
15721i4293A38324K70375a42592k26701B18017a70731H767i6089G3065f0677C8317
15709A80136a7874A9045d24082H5993N8432F3409P3480M9340b62619J23844I1475
15697c9750D6575d8227r7598C67407b738C4677J86586N5872a76398o3656E483
15685B5242J15710a58934P1298m8430k3669k4569O5510j32741a01435A25132F13
$$ plain form
15765 -222714 -144082 189102 166383 86238 74692 338373 86115 -167296 -185417 35023 244727
15754 244727 41817 -314101 -128740 -16043 88488 -167337 177251 10904 239219 197024
15744 197024 -21474 -129253 26633 -98963 -45492 8020 55516 318294 -370080 77131 81388
15733 81388 -52120 -2207 -42203 113326 106515 -87855 -243519 -170182 61523 154008 -129320
15721 -94293 138324 408699 -142592 -369293 218017 -170731 8767 -96089 73065 -60677 38317
15709 180136 -17874 19045 -424082 85993 144425 63409 136889 186229 -262619 -138775 91475
15697 -39750 46575 -48227 -145825 367407 -2738 34677 221263 277135 -176398 -240054 5483
15685 25242 140952 -158934 -87636 -136066 -159735 -184304 -118794 -251535 -101435 125132 613
15673F7227b83815C09832r7639i6979D02035A01011b15215p4348e2038l53982
15663d06020B5178a44667j7079f6971H1938C8917b12676A5605J460d2513l7916
15652h0429I7569c20978a08161A98546p8308b07935A08244B7016c5348I5840b28245
15640B76924K56221a63976l1J0513B07770a62165o3516g3820l30124f1089b6339
15628a34148K3393k7471c4129k24231A0486K85146F6046Q194a16334F3157A7560
15616a3413k8940A46876P8543C6646K33443H2534K94706D1626a45060n514k444
15605a53018A41775a07233A21305R9403h481o1887j7622j94873a24581D466J77334
15594A81800q5995e6315J9321j82005B81070A2608J43975a45304B5283J83702
$$ plain form
15673 67227 -283815 309832 212193 -96979 402035 101011 -215215 -289563 -52038 -406020
15663 -406020 25178 -144667 -161746 -66971 81938 38917 -212676 15605 17065 -42513 -80429
15652 -80429 97569 -320978 -108161 198546 120238 -207935 108244 27016 -35348 95840 -228245
15640 276924 533145 -163976 -164007 -153494 207770 -162165 -225681 -73820 -403944 -61089 -26339
15628 -134148 -110755 -138226 -34129 -258360 10486 295632 66046 74240 -116334 63157 17560
15616 -13413 -42353 146876 225419 36646 270089 82534 377240 41626 -145060 -150574 -153018
15605 -153018 141775 -107233 121305 220708 -8481 -70368 -87990 -282863 -124581 4466 181800
15594 181800 95805 -56315 -36994 -218999 281070 12608 156583 -145304 25283 208985
15584B08985A1724J59964c0332A21151f7445B21484K0179g0914k33107p2059J04864
15573b71216A09250a63697D2992a06181j6771A3127R0341c85740a48843A88429
15562a41619B88662a11990r6542A08739b86660O6985a6240j21983D508P6232a11433
15550H282d41935J9428a5845B01022a88340j56216A75120d147p285q5947C32436
15538h034j20393l49859a3467A18436a12367j76407B40492A8738a37115A00933
15527A02877f5109L1881f556k05218B00994E4952b52366e2908j00463A90921J33277
15516C24198e4694A28191K03562H1171a46220G7485J92452q0505J10811E5957
15505A44348R4957j09966O6230q7277c7165B30789r2213l4221a08108E5686j8323
$$ plain form
15584 208985 11724 171688 -30332 121151 -67445 221484 241663 -70914 -304021 -376080 -271216
15573 -271216 109250 -163697 42992 -106181 -122952 13127 103468 -385740 -148843 188429
15562 -141619 288662 -111990 -208532 108739 -286660 -219675 -16240 -138223 4508 80740 -111433
15550 8282 -441935 -422507 -15845 201022 -188340 -344556 175120 -4147 -11432 -97379 332436
15538 -8034 -128427 -478286 -13467 118436 -112367 -288774 240492 18738 -137115 100933
15527 102877 -65109 -33228 -6556 -211774 200994 54952 -252366 -52908 -153371 190921 324198
15516 324198 -54694 128191 331753 81171 -146220 77485 269937 189432 300243 55957
15505 144348 239305 129339 195569 108292 -37165 230789 138576 104355 -108108 55686 37363
15494C7363b61834c7978F0527f4653j22445B38119j13687B4437k471c182n1288
15483e4470k04595A73025G3998a8681j16189B44920L5884J69699A00213M58696
15473E58909A72432J12371J66377A59685E8229K113a47560A32544n8659K55563
15463C29448a42986E065b06424L7074b079C27595C8015o541K18743B4240K20909
15452B45149L0306c6075B84920D6672d3806A24797L2569k0121L20318J31630L39317
15441I28510J4508m56004j21284j13529p5243e702I9345D3060j0384M027R2479
15430A29182J07192L2882A09111h6968K6975G9593a5635E485L01655H4127F192
15418a54194O381K3901B13167a9314k22558C27150d7094j68804A0268c2305p0342
$$ plain form
15494 37363 -261834 -37978 60527 -64653 -187098 238119 124432 24437 21966 -3182 -54470
15483 -54470 -259065 173025 73998 -18681 -134870 244920 280804 450503 100213 558909
15473 558909 172432 284803 451180 159685 58229 60342 -147560 132544 73885 329448
15463 329448 -142986 5065 -206424 -169350 -2079 327595 38015 31474 250217 24240 245149
15452 245149 275455 -36075 284920 46672 -43806 124797 157366 137245 457563 589193 928510
15441 928510 943018 487014 365730 252201 176958 -5702 99345 43060 32676 36703 129182
15430 129182 236374 269256 109111 -86968 -59993 79593 -15635 5485 307140 84127 6192
15418 -154194 -147813 -123912 213167 -19314 -241872 327150 -47094 -215898 10268 -32305 -102647
15407a02647C03346D7811b03664A51662N2630b03689f7708B43437h6936b4052
15396b67586B48777L6287a30867f4054j56818d7667A3928b19941a5042B0814M0126
15385F0940R6584r258c1421j04023A03924K20423D4525a6584A73528B8562c70866
15373A41424J27844k0837K82222B10647D8821A7954K05194f5881C20772A22128
15362A0337a3849B03744a02335H4675J44692j3205r0544a91369I8771J25622p0739
15351A53654E8198a39250A04199O122l4463J94580H9456J28004a33878I6142N4664
15340A50806E958L27943P2001j69975L1817D8561C392a9857A23047J06658G2331
15328A24947h5779C6124J89043k458G0650a06511p8664A93748f1460K8689A70605
$$ plain form
15407 -102647 303346 47811 -203664 151662 204292 -203689 -67708 243437 -86936 -24052
15396 -267586 248777 285064 -130867 -64054 -220872 -47667 13928 -219941 -15042 20814 60940
15385 60940 157524 148266 -31421 -135444 103924 324347 44525 -16584 173528 28562 -370866
15373 141424 269268 248431 530653 210647 48821 17954 223148 -65881 320772 122128
15362 10337 -13849 203744 -102335 84675 229367 216162 125618 -191369 98771 224393 153654
15351 153654 58198 -139250 104199 110321 75858 270438 89456 217460 -133878 96142 150806
15340 150806 5958 333901 405902 235927 267744 48561 3392 -19857 123047 229705 72331
15328 124947 -85779 36124 225167 222709 70650 -106511 -185175 193748 -61460 -32771 170605
15316c47298A78686q1234c4440A35854J19158B0663K64643j40152K82526I0128
15305A13552a99743d8463q821o5023f801E1288a16626J3351q560B4834R9054E3679
15292E7187a0398A16193f0272n150g967j44392g3173A48752D7637H409b8731A46685
15279G6015B685i8135b0203O262H6740p242Q6158k9202J37622b62220C1866a35004
15266A08711K51442a42150B21774h1375A6257J10460k7142L7414b11955A34473
15255E3680i1334A52161J99377F7487J3087d1390j58683K7841J2417b9658B50830
15243E84953Q59172k20115k793j92049C17461j0427H9706a28522N9354a7134D9593
15231b00405B53466e7391n8586J4596A72236a71951I4746c52216J8824A7291a36222
$$ plain form
15316 -347298 178686 97452 -34440 135854 255012 20663 285306 145154 427680 90128
15305 113552 -199743 -48463 -57284 -122307 -6801 51288 -116626 -103275 -111835 24834 123888 53679
15292 57187 -10398 116193 -60272 -65422 -7967 -152359 -73173 148752 47637 8409 -28731 146685
15279 76015 2685 -98135 -20203 -13941 86740 79498 165656 136454 274076 -262220 31866 -135004
15266 108711 360153 -142150 221774 -81375 16257 126717 99575 136989 -211955 134473
15255 53680 -91334 152161 351538 67487 80574 -41390 -200073 -172232 -159815 -29658 250830
15243 584953 1444125 1224010 1221217 1029168 317461 307034 89706 -128522 -69168 -17134 49593
15231 -200405 253466 -57391 -115977 -101381 172236 -171951 94746 -352216 -333392 17291 -136222
15219d74573A89566g2881E7949i0833B09837B3903e4229c144l8786A58985a21471
15207A71998b08612Q3218A51304A6175g9456A7192d1275l1133B88604i4869i562
15195a81443B46038g5678B44049A8367q174O8280K5625a60568d4542B350a60411
15183E1400M3404a8910E4842a15123A52993K7730A0251D558N8939J45281a9872
15171a84762H7765b53088g6659E2282K80191j60102a90017o8963p6804B47323
15160b46789F4472L24594E5558k3520J3296f1139q0144d4817B90880a83469B31906
15148A70414i9189A42047b8543A58247b98366B08317H7057L2816a30229e2444
15137B14697i0001L568A81393b2965o9505A58024a69697B08150E5132M8595b24310
$$ plain form
15219 -474573 189566 -72881 57949 -90833 209837 23903 -54229 -3144 -41930 158985 -121471
15207 171998 -208612 -125394 151304 16175 -79456 17192 -41275 -72408 288604 -94869 -9562
15195 -181443 246038 -75678 244049 18367 10193 78473 104098 -160568 -44542 2350 -160411
15183 51400 94804 -18910 54842 -115123 152993 180723 10251 4558 63497 208778 -19872
15171 -184762 87765 -253088 -76659 52282 332473 172371 -190017 -258980 -335784 247323
15160 -246789 64472 389066 55558 32038 45334 -61139 -141283 -44817 290880 -183469 231906
15148 170414 -99189 142047 -28543 158247 -298366 208317 87057 119873 -130229 -52444
15137 214697 -90001 -86433 181393 -22965 -92470 158024 -169697 208150 55132 103727 -224310
15125a85369A15563J94724A20426N6460F1956K96330n5195a12844N5788A34514
15114b23568H9698m1848A9502J75376a19934c5793m2787A35706J18969a60093
15103I2946L7982C0633J36631b306A67519N8822a5354D16205A33462K20258I3071
15091B33935b91369E0752K14898c711E3009g2118A3503c1329A02665J6219J21731
15080B40615A06084a74951b0727D4148J61145h9935l7949D4143a7336B85898G4922
15068A12191K6619J50398F7862I969h5991C10242j4199H1697K50493K8893d7353
15056g5443C55799q1347j31511j6156K16919B1837N1586a68792A79772M7458O4712
15045B91942M8836p8801B0711J96797b00296D35009j38602K79028B01169b38086
$$ plain form
15125 -185369 115563 310287 120426 176886 61956 358286 303091 -112844 -57056 134514
15114 -223568 89698 47850 19502 194878 -119934 -35793 -78580 135706 254675 -160093
15103 92946 130928 30633 167264 -2306 167519 226341 -15354 416205 133462 353720 93071
15091 233935 -291369 50752 265650 -3711 53009 -72118 13503 -31329 102665 118884 240615
15080 240615 106084 -174951 -20727 44148 205293 -89935 -127884 44143 -17336 285898 74922
15068 112191 138810 289208 67862 9969 -85991 310242 296043 81697 332190 361083 -47353
15056 -75443 355799 274452 142941 126785 343704 21837 73423 -168792 179772 227230 291942
15045 291942 340778 261977 20711 217508 -200296 435009 296407 575435 201169 -238086
15034B74513p3327G1716M16524j00216j26531J69166J80106j01075k3431M7238
15024E33497A23653J37782l93K51025J50689k38062A6500L89116j34833j11379
15014A59404d5483B21374q200e8517D32394K72212j50768q2454A74511J64197
15004C38708D7952J73567P5662N0990A62224M7229N3233O2630m611M7263k9738
14993C38230D9952M04356D8015J08823N3885I4333J51718J15583A17923K93261
14983D11184N4197o657K80809l0191k29641K95203A54515M90738j66631k17776
14973B60846K00978p7287L08729k82870O6780k2214a20037B70978J62359k9799
14963D03538q301n3248m4p4282B2681N9227J29058J44947J27340A98187B0938
$$ plain form
15034 274513 201186 71716 488240 388024 261493 430659 610765 509690 486259 533497
15024 533497 123653 261435 261042 512067 662756 424694 16500 405616 270783 159404
15014 159404 -45483 221374 213174 -58517 432394 704606 553838 471384 174511 338708
15004 338708 47952 221519 297181 348171 162224 209453 262686 325316 320705 367968 338230
14993 338230 49952 454308 48015 156838 210723 94333 246051 361634 117923 411184
14983 411184 465381 458724 739533 709342 479701 774904 154515 645253 478622 260846
14973 260846 461824 384537 693266 410396 477176 454962 -120037 270978 433337 403538
14963 403538 395237 341989 341945 267663 22681 81908 210966 355913 483253 198187 20938
14951C81830A28745L297J28750J55845j19361J29916M31842k74669p6824B14384
14940B50724J12936P4948q0163E5107N06142j40269J3379O0230J31389m6936J26197
14929G05239M16334j40781q1488N45113k84648J54973j18957q4417j56683K93559
14919A248244J52153L95691k46426l5891l38253k16532K42465E68902o3134j31360
14909C74408A27628K06085J71764k9983H095K40972K11670J17733G0196K67316
14899C37512j36583Q3940k067p3952E7376L25831A56281L42775J94977k10391
14889D83642L23920C54297K12296Q8441K77629j24048k39569J00278k08189K57
14879D61392q312J85485r2118K8175k80680A46206K75762B03348J34984J16313
$$ plain form
14951 381830 128745 132042 260792 416637 297276 427192 859034 584365 507541 214384
14940 250724 363660 438608 358445 55107 561249 420980 434359 494589 625978 579042 705239
14929 705239 1121573 980792 899304 1444417 1159769 1314742 1195785 1111368 954685 1248244
14919 1248244 1400397 1796088 1549662 1513771 1175518 958986 1201451 568902 505768 374408
14909 374408 127628 333713 505477 475494 8095 249067 460737 578470 70196 337512
14899 337512 200929 284869 282802 208850 57376 383207 156281 499056 694033 483642
14889 483642 807562 354297 566593 655034 932663 808615 569046 669324 461135 461392
14879 461392 453080 638565 546447 574622 293942 146206 421968 203348 338332 454645
14869D54645r6184L64566A56680K81876q7994j72902K20059J1100A57901J85254
14859C43155Q9034A96390K2495O2922J3022L9769C685K13627D8439J94155J5345
14848B57939j16625K31770K6491L86943l89389M67674K9251k14794K89027C81036
14837D42556L00576k21306m4333A53304R6182n6492J2832J70406K02212j46859
14827D31585j94657L11142L6125j16885J74772l02857J29490N5265J33047m6001
14817F11026k11404J57240j60227G7511M73663j39196J08424J93423j90313B47842
14806A057428m40368L6151j33192K57828B16178J77626J21990j50176j74196M5072
14796B36494K68428q4393r2641J32545l562A85478L64274k16378J62878K64809
$$ plain form
14869 454645 358461 723027 156680 438556 350562 177660 397719 408819 157901 343155
14859 343155 432189 196390 218885 281807 294829 334598 3685 217312 48439 242594 257939
14848 257939 141314 373084 399575 786518 397129 864803 894054 679260 968287 381036
14837 442556 743132 521826 477493 153304 249486 192994 205826 376232 578444 431585
14827 431585 236928 548070 584195 467310 642082 339225 468715 523980 657027 611026
14817 611026 399622 556862 396635 77511 551174 411978 520402 713825 523512 247842
14806 1057428 617060 653211 520019 777847 216178 393804 515794 365618 191422 236494
14796 236494 504922 420529 327888 460433 456871 185478 549752 333374 496252 761061
14786G61061C74200K26144o3354K22951B44492M33524o468j07701J98583m8313
14776G14117K16020J34352E16513m1757k852K19960k14560E1756M04689P435l4458
14765D29422R0848j04540P3420j58771J88092J91663C29782j37838K68453m8726
14755D11671J68446k56185j14136J98685J20878K0118j46346K25521k43180N28546
14745I14018k87393B24201M07841L06093l30064B92107O2097J81043P2565j27421
14735D80391j13373L91947n7146j15955J98808M33801m95760K52607J80998n7183
14725A099135J13893j12463J14249n05189k9365L7182k0255L9083k45396J55500
14715F46374J50738j3015J9790n2187k74565K06233J47785J73898m41309J0418
$$ plain form
14786 761061 374200 600344 536990 759941 244492 678016 671548 563847 762430 714117
14776 714117 930137 1064489 516513 474756 471904 691864 477304 51756 456445 463880 429422
14765 429422 520270 415730 489150 330379 518471 710134 329782 191944 460397 411671
14755 411671 580117 323932 209796 408481 529359 549477 403131 628652 385472 914018
14745 914018 626625 224201 632042 938135 608071 292107 354204 535247 607812 480391
14735 480391 367018 758965 701819 585864 784672 1218473 722713 975320 1156318 1099135
14725 1099135 1213028 1100565 1214814 709625 680260 717442 697187 736270 490874 646374
14715 646374 797112 784097 803887 751700 477135 683368 831153 1005051 563742 574160
14705E74160J79643K50740J32748L3279J06797K04861k20971k44695j5968k88247
14695G12347K393k26877K07913M678k49474K49065k83896J78873B95967L38219
14685F34186J4070j08018q8981J83899J41461B39867M22510k69997L07864L2653
14675G32897J4962k62118O37801l98374j9088j67396J71930J68663k73164l1581
14665E74532p608J50870j19809J32071j11945J49296k03996K31446n7501k05008
14655E32348L28961K5269L1709L45674k99113M2755p0136k84901L17689q361k92153
14644F69741J58090K29045k63571Q8615k60086L0066J09232j10306P7142r8839
14634F29129j69927M91295m36760K06484M63798m20858k82630L30858O2937K40464
$$ plain form
14705 574160 753803 1004543 1137291 1170570 1277367 1482228 1261257 1016562 1000594 712347
14695 712347 714740 487863 695776 700454 450980 700045 416149 595022 295967 634186
14685 634186 648256 540238 451257 635156 776617 239867 662377 392380 700244 732897
14675 732897 747859 485741 1123542 725168 706080 538684 710614 879277 606113 574532
14665 574532 566924 717794 597985 730056 618111 767407 563411 794857 737356 532348
14655 532348 861309 886578 918287 1263961 964848 1007603 937467 652566 970255 961894 669741
14644 669741 827831 1056876 793305 881920 621834 651900 761132 650826 727968 629129
14634 629129 459202 950497 513737 720221 1184019 763161 480531 811389 874326 1114790
14624A114790l28118l553q1434K37839J03944k54352K49320l40472J38316N44191
14614A380471m89177J80540k46476j48007K73157P2544M1769M51991n79022J38189
14604A075979l40346N26062p6157j41976P0133J24197P3840E95224M60065Q0459
14594A135748j5781Q0876k40378K71995r7105L05342k69568J69278r4374n7397
14584A188636J83763j90546J53237J75667K2616j5021k57660J29002n6084j3364
14574A320246J89582p2784O9821k6810K17579k60611J23312j98349l3903K97815
14564A625898K69671j01043j76077J67020M7186J26595J7246R8145K3404J17633
14554B215678n523N43162K7856l5098P56773J319736K552428P137554J4255102
$$ plain form
14624 1114790 786672 783119 701685 939524 1043468 789116 1038436 697964 836280 1380471
14614 1380471 891294 1071834 825358 677351 950508 1023052 1064821 1516812 937790 1075979
14604 1075979 735633 1261695 1185538 1043562 1113695 1237892 1311732 595224 1055289 1135748
14594 1135748 1119967 1200843 960465 1232460 1135355 1440697 1171129 1340407 1246033 1188636
14584 1188636 1372399 1181853 1335090 1510757 1533373 1518352 1260692 1389694 1333610 1320246
14574 1320246 1509828 1437044 1506865 1480055 1697634 1437023 1560335 1361986 1328083 1625898
14564 1625898 1895569 1794526 1618449 1785469 1832655 1959250 1976496 2074641 2098045 2215678
14554 2215678 2210155 2753317 2781173 2746075 3502848 4822584 7375012 14512566 28767668
14545B8767668P346893j5378124H118563C681424j093351J94106J006094q98714
14537B889559j346970k90913j20515P12490l14881m64299N58844k67853M51585
14528A807047n83694K43457l0039j10692L19958k65233J35051J79546P0618k7733
14518A738286k03627J47497N4070j48999J98342m8416r252L84239j04220J30863
14508B138783j55321Q6947j64635K16401j61455p0006L01644j40550K24364J8872
14498B295044J18485l77133K68488J90486r1262j68705J31915j11538N5933J81486
14488B493199k39353K22063J45583l62717N57898l52749M4321J69315p8568J61559
14478B760551O9062J33656k43321J17806M12738n11804r8248O14568j9612j95838
$$ plain form
14545 28767668 36114561 20736437 8118563 3681424 2588073 2782179 3788273 2889559
14537 2889559 1542589 1251676 1131161 1843651 1528770 1064471 1623315 1355462 1807047
14528 1807047 1223353 1466810 1436771 1326079 1646037 1380804 1515855 1695401 1766019 1738286
14518 1738286 1534659 1682156 1736226 1587227 1785569 1737153 1727901 2112140 2007920 2138783
14508 2138783 1983462 2070409 1905774 2122175 1960720 1890714 2192358 2051808 2276172 2295044
14498 2295044 2413529 2036396 2304884 2495370 2404108 2235403 2367318 2255780 2311713 2493199
14488 2493199 2253846 2475909 2621492 2258775 2816673 2463924 2508245 2677560 2598992 2760551
14478 2760551 2829613 2963269 2719948 2837754 3250492 2738688 2640440 3255008 3235396 3039558
14468C039558j35867o3006M01157j02311J40662m1251q1945J69050L4885j44673
14458C216259L72540k79214R1349J0327J20008J84067j80100L79960l51402K33050
14448C796844p7818K80236j58581L06900m2970R1258J06041N6953J48395k21487
14438D285771O3691m1637J85606N9363K18219r9910K94481o6168l59894N98277
14428E137799j64397R7368M4452l4481J16065J84645K86912J36744j80734O46130
14418F270503j84427J19180P5758L208J19040J17824J4812n14228P56547j10935
14408F667282L47573J19647j88180J90926n8827L45066j58072K18828m87193O22240
14398G619290M564L09271L37436k85113L3481M40796K05329J61872L12612k53157
$$ plain form
14468 3039558 2903691 2840685 3241842 3139531 3280193 3238942 3156997 3326047 3360932 3216259
14458 3216259 3588799 3309585 3400934 3411261 3531269 3715336 3535236 3915196 3563794 3796844
14448 3796844 3719026 3999262 3840681 4147581 4104611 4195869 4301910 4358863 4507258 4285771
14438 4285771 4349462 4307825 4493431 4552794 4771013 4671103 4965584 4899416 4539522 5137799
14428 5137799 4973402 5070770 5115222 5080741 5196806 5381451 5668363 5805107 5624373 6270503
14418 6270503 6086076 6205256 6281014 6284222 6403262 6521086 6535898 6021670 6778217 6667282
14408 6667282 7014855 7134502 6946322 7137248 7078421 7423487 7265415 7484243 6997050 7619290
14398 7619290 7623854 7933125 8270561 7985448 8018929 8459725 8665054 8826926 9139538 8886381
14388H886381N3116L82248J15517N12881K4589K14923J63775J06075K26499K8943
14378A0714947J10071N1347L49304J58306L99118R0216L59763Q5955M37007M96324
14368A3252358J30837L43702o4887M25483J0610N78373L82772M28012j61904O44658
14358A5970014K46120L21948O79115J72583N02170O94687J97207N13504R38134
14349B0235482N023N16585M86694Q05834N63890L68786M46758Q17647Q81675M70980
14339B5599354N47324J335922M15583Q03930Q24433N99490J345321O20843J251442
14330C3343642J205768R20323J154293J312435J080103J750363J201470J394684
14322D3363081J968765J316458J224052K064431K066503J532027K269414K665117
$$ plain form
14388 8886381 8939497 9321745 9437262 9950143 9974732 10189655 10353430 10459505 10686004 10714947
14378 10714947 10825018 10876365 11225669 11383975 11783093 11873309 12233072 12319027 12756034 13252358
14368 13252358 13383195 13726897 13662010 14087493 14098103 14676476 15059248 15487260 15325356 15970014
14358 15970014 16216134 16538082 17217197 17389780 17891950 18586637 18783844 19297348 20235482
14349 20235482 20240505 20757090 21243784 22049618 22613508 22982294 23429052 24246699 25128374 25599354
14339 25599354 26146678 27482600 27898183 28702113 29526546 30126036 31471357 32092200 33343642
14330 33343642 34549410 35469733 36624026 37936461 39016564 40766927 41968397 43363081
14322 43363081 45331846 46648304 47872356 49936787 52003290 53535317 55804731 58469848
14314E8469848J834372K701412K490871K878393K871731L120333L450202L487415
14306H1304577L503131M270931M000300M847812M783907N179414M976462O104543
14298A18971077O184342O486671P481656P686563P660060Q926160Q864502R943101
14290A82204132J0375670J0760703J1718150J2367223J2698823J3378149J4143916
14283B67646766J4182778J4887789J5089515J4928114J4783553J4677299J3817110
14276C70012924J2990847J1635478J0106968P946169L457203j798370k993881
14269D11357338l864198l518624l239156p389341r343664j1529659j2662878j4325142
14261C45484676j5567710j5999358j5909887j5687119j4891166j4758466j3711276
$$ plain form
14314 58469848 60304220 63005632 65496503 68374896 71246627 74366960 77817162 81304577
14306 81304577 84807708 89078639 93078939 97926751 102710658 107890072 112866534 118971077
14298 118971077 125155419 131642090 139123746 146810309 154470369 163396529 172261031 182204132
14290 182204132 192579802 203340505 215058655 227425878 240124701 253502850 267646766
14283 267646766 281829544 296717333 311806848 326734962 341518515 356195814 370012924
14276 370012924 383003771 394639249 404746217 412692386 416149589 414351219 411357338
14269 411357338 407493140 403974516 400735360 393346019 384002355 372472696 359809818 345484676
14261 345484676 329916966 313917608 298007721 282320602 267429436 252670970 238959694
14254B38959694j3244187j2704964j1985356j1457357r981778r319246r283434
14247A60983372q765844q228651p614091o454786o854986o081899o112768n307881
14239A05562466n072035m529479m241095m481777m060636l546997l557053k915455
14231G3157939l006516l069193k486912k677339k533774k265425k238039j991021
14223E2889720k086319k019800j622996j286759j800569j249680j759755j151633
14215C9912209j375131j051334j034284j377328j116151j267865q00307j064752
14207C0825057j13738r09657j012126r23625j119969m95431k74756q64016n84951
14198B4526788j251379j26830j050581k70964l44872n92928m73988o89629l34843
$$ plain form
14254 238959694 225715507 213010543 201025187 189567830 179586052 170266806 160983372
14247 160983372 152217528 143988877 136374786 129920000 123065014 116983115 110870347 105562466
14239 105562466 100490431 95960952 91719857 87238080 83177444 79630447 76073394 73157939
14231 73157939 70151423 67082230 64595318 61917979 59384205 57118780 54880741 52889720
14223 52889720 50803401 48783601 47160605 45873846 44073277 42823597 41063842 39912209
14215 39912209 38537078 37485744 36451460 35074132 33957981 32690116 31889809 30825057
14207 30825057 30711319 29801662 28789536 27865911 26745942 26250511 25975755 25111739 24526788
14198 24526788 23275409 23148579 22097998 21827034 21482162 20889234 20415246 19725617 19390774
14189A9390774p35756k90840o01328r2257p54131K7060n26099m53472l36038q4528
14179A5543385o30387l41997J77355m91955n45741k6997n45254L2994m84382k6802
14169A2660219m83007p2770j3122o12237K18874l35794n06972K10662n32137J09173
14159A0642889l77671q0773l07130j49802m52n26801M95342p01031J6997m15095
14149H596473j63392Q1407k23676k56733r7100O8457l87343J41087k84073R4791
14139G569898q9154m76412k1201j22760K58566m13777J86234j11470k50281j84680
14129F344963J50354n18740K55449J33144l63809k33242R8533n6408q5038J76084
14119E901290k22276k63775K00303j29881q5689k20633j31357k06286K33121k46331
$$ plain form
14189 19390774 18655018 18364178 17762850 17670593 16916462 16943522 16417423 15963951 15627913 15543385
14179 15543385 14912998 14571001 14748356 14256401 13710660 13683663 13138409 13171403 12687021 12660219
14169 12660219 12177212 12104442 12091320 11479083 11697957 11362163 10855191 11065853 10533716 10642889
14159 10642889 10265218 10184445 9877315 9727513 9727061 9200260 9695602 8994571 9011568 8596473
14149 8596473 8433081 8514488 8290812 8034079 7936979 8005436 7618093 7759180 7475107 7569898
14139 7569898 7480744 7004332 6983131 6860371 7118937 6705160 6891394 6779924 6529643 6344963
14129 6344963 6495317 5976577 6232026 6365170 6001361 5768119 5866652 5810244 5725206 5901290
14119 5901290 5679014 5415239 5615542 5485661 5399972 5179339 5047982 4841696 5074817 4828486
14109D828486J52188o0831M9730j56213k26048o9771j80161Q1691m5244L8716
14099D412543L7265k23756J35416m644j38663j1852J92809j98266l77281k21568
14089C602003M08023k90221M5390j78930L22567l7435j79790j86191J99222p9721
14079C624917j46930j63581K08875k87199M26589l13154K23361R2966m12329j80410
14069C073105M53431l51469k67512K36255l16714M6913M41091m0872J75313l10219
14059C139322r7130j98607O2365j24742m7021l53240J96307j29488L907L22346
14049B774019r0593l89930j20454N06052r0757l15815L51111j13442j75073j98165
14039B136953j33827M20358k02534n8788M63390m33746J405J59952l2522o9635
$$ plain form
14109 4828486 4980674 4919843 4969573 4813360 4587312 4517541 4337380 4419071 4373827 4412543
14099 4412543 4449808 4226052 4361468 4356824 4218161 4206309 4399118 4200852 3823571 3602003
14089 3602003 4010026 3719805 3765195 3586265 3908832 3871397 3691607 3505416 3704638 3624917
14079 3624917 3477987 3314406 3523281 3236082 3662671 3349517 3572878 3665844 3253515 3073105
14069 3073105 3526536 3175067 2907555 3143810 2827096 2874009 3315100 3274228 3449541 3139322
14059 3139322 3042192 2843585 2905950 2781208 2734187 2380947 2577254 2447766 2451673 2774019
14049 2774019 2683426 2293496 2173042 2679094 2588337 2272522 2623633 2510191 2335118 2136953
14039 2136953 2003126 2423484 2220950 2162162 2625552 2191806 2193211 2353163 2320641 2251006
14029B251006k41208M6960m26722L2778M63485M07967o39183m7548J42694N1316
14019B041545l01204n4219P10937l79505n3700k6027l12702K05658p3109R9400
14009A857074L7200R3378l62820J89164l42010J46958K01885Q822j33599Q2870
13999A778922k43319k0644J07264l4115M1359j95238K76430n1805k8354K42718
13989A873218K74692J332311M767502J2245199J6123179r247879A3128974o122035
13981G006939k314096o86013q07491m28141p5945l19769p6492j23009j70453o0782
13971A944748j47154J1903r8307J59284j95738q96q6628P3578K15330j50699l98702
13960A326719O10085m41837P0499k52820J93826J9142m1670n6697K11992J31994
$$ plain form
14029 2251006 2009798 2056758 1630036 1662814 2126299 2534266 1895083 1847535 1990229 2041545
14019 2041545 1740341 1686122 2397059 2017554 1963854 1937827 1625125 1830783 1757674 1857074
14009 1857074 1894274 1987652 1624832 1813996 1471986 1618944 1820829 1829651 1696052 1778922
13999 1778922 1535603 1514959 1622223 1588108 1629467 1434229 1710659 1658854 1630500 1873218
13989 1873218 2147910 3480221 8247723 20492922 36616101 27368222 13128974 7006939
13981 7006939 4692843 4006830 3199339 2771198 2695253 2375484 2298992 2175983 2005530 1944748
13971 1944748 1797594 1809497 1711190 1870474 1674736 1673840 1587212 1660790 1876120 1725421 1326719
13960 1326719 1936804 1494967 1565466 1312646 1506472 1525614 1483944 1427247 1639239 1771233
13950A771233l54591K43171k04908m8500N8853j80695k4674J49047m0983m5632
13940A322321K1905K06620j74776j50043k0288J37605J39843j22819j23758o9559
13930A167051m1650K82357k24251j82836J65107J2095J8108J5975J94323m70530
13920I35749K67273J06645l61697J31619j42196L15939j38625j95562k9460J51101
13910A040786J02706P2936J3740l82266L01016j57688k40240M63999k12947k92666
13900G09376K92581J88334l04990J9544J69959J58611l97528J36860m7828K26048
13890A150967E25138P57481l46977j20439K94049n4498j28221j40342P4960k24389
13880F36762M15896j45004N0232P4251l37817P8449k3289J79288j24933l6918
$$ plain form
13950 1771233 1416642 1659813 1454905 1406405 1465258 1284563 1259889 1408936 1367953 1322321
13940 1322321 1344226 1550846 1376070 1226027 1205739 1343344 1483187 1360368 1236610 1167051
13930 1167051 1125401 1407758 1183507 1000671 1165778 1177873 1195981 1211956 1406279 935749
13920 935749 1203022 1309667 947970 1079589 937393 1253332 1114707 919145 889685 1040786
13910 1040786 1143492 1216428 1230168 847902 1148918 991230 750990 1214989 1002042 709376
13900 709376 1001957 1190291 885301 904845 1074804 1233415 835887 972747 924919 1150967
13890 1150967 525138 1282619 935642 815203 1109252 1054754 926533 786191 861151 636762
13880 636762 1052658 907654 957886 1032137 694320 772769 749480 928768 803835 766917
13870G66917N7866l10374L50772k10506N93215n94026j42903J16395M35972j93218
13860H70110j08881j38743J78596N9595j04733B32027L39558r4346L34028k50140
13850E61127K45343P1183J30753j88213j93402K29695k50419L98552B41855Q9970
13840C31825N90112j8646Q279O5936j92749o3274k52265K59288j70537M12600
13830I70569l48587k8927p0267J817L60573j39307p5235j58075K48374k33050
13820E27885p757K53178J18509Q7375k78749o0822k05594L53938k62899m7285
13810D77779j3768J19797j9509j30389r7641M03750j91586Q9829C15685N24635
13800H40320C53848N5846K44136j66744K89159j29017K2795r9903m3498J38537
$$ plain form
13870 766917 824783 514409 865181 654675 1247890 653864 510961 627356 1063328 870110
13860 870110 761229 622486 801082 860677 755944 232027 571585 477239 811267 561127
13850 561127 806470 877653 1008406 820193 626791 856486 606067 1004619 241855 331825
13840 331825 921937 903291 911570 977506 784757 721483 469218 728506 557969 970569
13830 970569 621982 593055 522788 524605 885178 745871 670636 512561 760935 527885
13820 527885 520128 773306 891815 979190 700441 639619 434025 787963 525064 477779
13810 477779 464011 583808 564299 433910 336269 740019 548433 638262 315685 840320
13800 840320 353848 409694 653830 487086 776245 647228 670023 570120 526622 665159
13790F65159M0122m7272B89044Q2063J25238J62889j2547k56490L58418l43699
13780D04916K30675O0998q5953K38082B89185K05748j27211J7696r6721K99408
13770E88105j01567j23625J04998O5348k36468q2616J08804J92597Q1043A28579
13759A97923M92917K8837k68785j750K59996j00993q018B29588K14439J96299
13749F40326O2175k22959N7172K4883H5922K64654N2538l3321J82709k14697R7069
13738D34874m4316K1785K10867k16299j51905R3850l6526J64674j69916K23016
13728E30104P4236B55448K11228K40886l01300J25527B12236L52338j99728m9646
13718C15200K18893j02802o2586j17227P3073o8296J33202A78929M39903B50355
$$ plain form
13790 665159 705281 658009 289044 371107 496345 659234 646687 390197 748615 404916
13780 404916 635591 696589 610636 848718 289185 494933 367722 385418 288697 588105
13770 588105 486538 362913 467911 533259 296791 214175 322979 515576 596619 128579
13759 197923 690840 719677 450892 449142 709138 608145 600127 229588 444027 640326
13749 640326 702501 479542 536714 561597 85922 350576 403114 369793 552502 337805 434874
13738 434874 390558 412343 623210 406911 255006 348856 312330 477004 307088 530104
13728 530104 604340 255448 466676 707562 406262 531789 212236 564574 364846 315200
13718 315200 534093 431291 368705 251478 324551 256255 389457 178929 618832 250355
13707D31597A5653R9538O33193k59563j10941K03319k11724K75378j42570K7715
13697E29998j35598j55194K11477A32394L03871m1865J18474J07763J85627C59116
13686E36451J8479M0787k63387n1882M46944k20263A79762m2776P8965G4803K93603
13675C68406E4635K64403l4727J29731j44221k0595J18897J00998E7986O9558
13665A27544L79803k18511K31959j84743A18852K91717A84492J07895j29085K30124
13655C93426A35755K59328A71514F0754N72190k10193J18571j85284J65268N414
13645E26720K0691A87684L14659j11160I7859K82235J60739A62511C2533L38621
13635C71154A17873K04611m2140J40024j76019K0126r6239J39374j52502E5711
$$ plain form
13707 431597 15653 115191 748384 488821 377880 581199 369475 644853 502283 529998
13697 529998 394400 239206 450683 132394 436265 394400 512874 620637 806264 359116
13686 536451 554930 595717 332330 280448 727392 507129 179762 136986 215951 74803 368406
13675 368406 54635 319038 284311 414042 269821 249226 368123 469121 57986 127544
13665 127544 507347 288836 520795 336052 118852 410569 184492 292387 163302 393426
13655 393426 135755 395083 171514 60754 632944 422751 541322 356038 521306 526720
13645 526720 547411 187684 502343 391183 97859 380094 540833 162511 32533 371154
13635 371154 117873 322484 280344 420368 244349 264475 168236 307610 155108 55711
13624B12207o0145L9399O2955O0383K28436B67955R3480O289J11393A83142J84279
13613C67421K61045B72654l3082K19483A72297J29564J54613j29625l2119j25589
13603A69141G4477J49244n3637E1598K01656P4952A05561K28822o878I2764J60270
13592B53034r604J36128K5929j88931K6382f0067B93101J24210A89567C1506g1284
13580B81469A33099J33587K74816A50294o6310K18734j11267K60995m0030n0023
13570C62393G2056K81752j35767A01201L11245h1752B95857J36213F2824j6756
13560D6068P6787K76624p9219K7674A9119K2708J06362n3083N57041B29656a9445
13548C01698K41754B5172N6821N18804E2243J58126A1301L21098j33425a30903
$$ plain form
13624 212207 152062 191461 254416 314799 543235 267955 361435 367724 479117 183142 367421
13613 367421 628466 272654 239572 459055 172297 301861 456474 326849 294730 169141
13603 169141 74477 223721 170084 51598 253254 328206 105561 334383 327505 92764 253034
13592 253034 243430 379558 405487 216556 242938 -60067 293101 417311 189567 31506 -71284
13580 281469 133099 266686 541502 150294 83984 302718 191451 452446 412416 362393
13570 362393 72056 353808 218041 101201 412446 -81752 295857 432070 62824 46068
13560 46068 122855 399479 320260 347934 19119 41827 148189 95106 652147 229656 -19445
13548 301698 543452 25172 81993 600797 52243 210369 11301 332399 198974 -130903
13537B08624i696A88701l734J30994J2059q3485q7072m6787a4626D6485J18353
13526A64838M63021A57957C5411K07926b518C89137A85360Q3434j06428J80198
13516C42564j50875a53899B84529p3481G374L35683K27269k51477n6975K72845
13506E34719k47648K0238A27820J21960L8823L8491I9680m2717J09357J52425
13496C18745n3146j05699F9584J69932r9841K02548F6785A6002M3133L0991J10976
13485B01102p5306K60416J38422B4700O8500K22625I5588O1374J31237A36439
13474D28660F2455Q058K43453j11735R4404A01322j4831a58793B13247b01650
13463E8477J58867L5968n6600Q33n4622F039K18814l4161J50471g7172B10007
$$ plain form
13537 208624 -9696 188701 184967 315961 328020 244535 157463 110676 -14626 46485 164838
13526 164838 627859 157957 35411 243337 -2518 389137 185360 268794 162366 342564
13516 342564 191689 -153899 284529 211048 7374 343057 570326 318849 261874 534719
13506 534719 287071 307309 127820 249780 288603 327094 99680 56963 166320 318745
13496 318745 265599 159900 69584 239516 139675 342223 66785 16002 59135 90126 201102
13485 201102 125796 386212 524634 24700 93200 315825 95588 156962 288199 136439
13474 428660 62455 70513 313966 202231 296635 101322 86491 -158793 213247 -201650
13463 58477 217344 253312 196712 197545 142923 6039 224853 190692 341163 -77172 210007
13451a5332E6990a3526k1003C73643C0914f4417F7541L89033k10380a10208e4813
13439B47760H9411L13835j84698q2048K12366n5736J90526a20256A68220a4527
13428a0131C54473D2921L15903j10954J21957c4795I0021L8805j2765i4402J5594
13417g8808a1896B99914J65885f9349B07458r2001m1960i3271g600k19389O7257
13406a59732B16726G8714g0184B6289i6085A18474a307C24050p8781A22402J40283
13395B62685H4870L7730a58107K0035B67028M2994C8021L6460h9115M902M1730
13384d2483B84243L067j2597r1618K37638h8831A49460J2160K24408j02081F0585
13372D01798j28374E5139P873j5638O9891K25070j46775J57716m7506b1706B74272
$$ plain form
13451 -15332 56990 -13526 -34529 373643 30914 -64417 67541 456574 246194 -110208 -54813
13439 247760 89411 403246 218548 136500 348866 293130 483656 -120256 168220 -14527
13428 -10131 354473 42921 358824 247870 369827 -34795 90021 128826 116061 -94402 -78808
13417 -78808 -11896 299914 465799 -69349 207458 115457 73497 -93271 -7600 -226989 -159732
13406 -159732 216726 78714 -70184 26289 -96085 118474 -1307 324050 245269 122402 262685
13395 262685 84870 122600 -158107 -138072 267028 310022 38021 74481 -89115 -84213 -42483
13384 -42483 284243 287310 274713 183095 420733 -88831 149460 161620 386028 283947 60585
13372 401798 273424 55139 63012 47374 117265 342335 195560 353276 305770 -21706 274272
13360B40360m896e201o2277A37781a24825q2000h1316C3624J23906L70870I1762
13348A01142N8572M2100A0595L09080A51345n6224J26829F9363J5769b436B88953
13336C34713q1823K49343D2998O0186J4823k3837K66034g9973A64248N8164a7175
13324A89878q0515a7067A49706b3503D23544A9648Q4808A8209M02988A95288J09524
13313C04812o0969m8385o9298K21103G1385a1987j57627A46745b6031C05579q391
13302B97188k2897G6770a5277n3760B44807f9940j2304B07402f049A49125a19642
13290C64409j49258l9599F4699J61995A04787b8358A09813a70088g039C59389
13279A37704M946F4034h9893j46089J13596G0182c654C7473J11382d0780k00778
$$ plain form
13360 240360 235464 -5201 -67478 137781 -124825 -206825 -81316 33624 157530 528400 91762
13348 101142 159714 201814 10595 319675 151345 95121 221950 69363 85132 -2436 288953
13336 334713 252890 502233 42998 103184 118007 94170 360204 -79973 164248 222412 -17175
13324 189878 109363 -17067 149706 -23503 423544 19648 104456 18209 421197 195288 304812
13313 304812 243843 195458 126160 347263 71385 -11987 -169614 146745 -26031 305579 297188
13302 297188 274291 76770 -15277 -69037 244807 -69940 -82244 207402 -6049 149125 -119642
13290 364409 215151 175552 64699 226694 104787 -28358 109813 -170088 -7039 359389
13279 137704 142650 64034 -89893 -235982 -122386 70182 -3654 37473 148855 -40780 -241558
13268b41558A23023f1030Dd8530A72060J5106J29828j21236J28951A01868D1155
13256A99701J76866A57881l7282d20584B2381i1656p680A17152P7278a39133A47203
13244B30756m06J46845j71755a99143B6276a5600B21508J03833I8684a85276e9817
13232g6002C3616a52387A83888J289a45621l00054H22c21409h480A33413f3426
13220a79743G0664h2906l68540B92254E6657B5501K91811A07146J12263E5504
13209f1113A36369a17835B42117a99681c7003A24383a33293l2909L616H385K59909
13198B68294Q7322d4552A1994a05204p5024F54657F2580c5202C1376K42987O5949
13187C40312M262j00543m1673A6503a64926D1180K71732C7870a86352R025e4136
$$ plain form
13268 -241558 123023 -61030 4 -48530 172060 187166 316994 195758 324709 101868 41155
13256 199701 376567 157881 120599 -420584 22381 -91656 -99336 117152 194430 -139133 147203
13244 230756 230350 377195 205440 -199143 26276 -15600 221508 325341 98684 -185276 -59817
13232 -76002 33616 -152387 183888 185177 -145621 -445675 822 -321409 -8480 133413 -63426
13220 -179743 70664 -82906 -451446 292254 56657 25501 317312 107146 219409 55504
13209 -61113 136369 -117835 242117 -199681 -37003 124383 -133293 -166202 -162586 8385 268294
13198 268294 355616 -44552 11994 -105204 -180228 654657 62580 -35202 31376 274363 340312
13187 340312 344574 244031 202358 16503 -164926 41180 312912 37870 -186352 -177327 -54136
13175H9962J09414K62996k09517e261F8080J92208D1630a28434D3034N3072B1508
13163D3556K20019a1696D2654K64497M1188b0952j10918A41848b95017b1144A53556
13151g1283A72993a21751a6491E527J71716a09503B50565b59315C9328M7947C5020
13139F4184c4164H2417d4798F2244E909R677i0047A09033m8943b53118i9509k31636
13127c31145g8478A65335b02021A37656m1464J86751a05005C1588i1173A5769
13116F4234J36131q4551O3212D5016L13447A50784d2979j32951c6517F61709e7313
13104A07746m6963J34623h8432L99c9503E22042B48752a97904Q9249B9138e5237
13092h4426b6265D48558a5127C1563e2919A22600A710M52338g8697K0731B71338
$$ plain form
13175 89962 199376 462372 252855 -5261 68080 260288 41630 -128434 43034 96106 21508
13163 43556 263575 -11696 42654 307151 348339 -20952 -131870 141848 -295017 -21144 153556
13151 -71283 172993 -121751 -16491 5527 177243 -109503 250565 -259315 39328 87275 35020
13139 64184 -34164 82417 -44798 62244 5909 15586 -90047 109033 60090 -253118 -99509 -331145
13127 -331145 -78478 165335 -202021 137656 96192 282943 -105005 31588 -91173 15769
13116 64234 200365 115814 179026 45016 358463 150784 -42979 -175930 -36517 661709 -57313
13104 107746 60783 195406 -88432 -88033 -39503 522042 248752 -197904 -108655 29138 -55237
13092 -84426 -26265 448558 -15127 31563 -52919 122600 1710 454048 -78697 -57966 271338
13080C139K86660j14921o5601a54874A48794J42548b02609i9125B13338b72810
13069a05109A10001h2429c6115A78387o6087J08670a11725A1831d1029k08971
13059b50000A98668k6115d1925C14366b01605D6350J79K8749c6784i397o5896
13048g5293B07714B3407b93025I5098O387b42607A12460Q0166E1538a10366B01981
13036a44061C54749a64820j73299A20427a7506B8947b42703K9574a03889A45038
13025a79148B34118b74934F3651k1290a67020j5141b58j14268A91141p9886K9746
13014A41001B1461b8641C18826L4937b97j69312A43158F1432L4071J8153E0552
13002B86146j00626J21397j06222B2625L1681n778i3943B381O6833C2631j6219
$$ plain form
13080 3139 289799 174878 109277 -154874 148794 291342 -202609 -99125 213338 -272810
13069 -105109 110001 -82429 -36115 178387 112300 220970 -111725 11831 -41029 -250000
13059 -250000 198668 172553 -41925 314366 -201605 46350 46529 75278 -36784 -9397 -75293
13048 -75293 207714 23407 -293025 95098 101485 -242607 112460 192626 51538 -110366 201981
13036 -144061 354749 -164820 -338119 120427 -17506 28947 -242703 -213129 -103889 145038
13025 -179148 234118 -274934 63651 42361 -167020 -182161 -258 -114526 191141 111255 141001
13014 141001 21461 -28641 318826 353763 -297 -169609 143158 61432 95503 113656 50552
13002 286146 185520 306917 200695 22625 54306 48528 -93943 2381 69214 32631 16412
12991A6412L04485B3505e2719n3577C5425c46776J67956j28389g6916r1382F0324
12979a42747k77590j80566A0146a67343L2902c8513H2L83362a18864k36959H0790
12967a52558E8621P6940a27672K4151A38605b19115A5155M10852B4794K03895
12957B28689a37917P34A29748J24523N4628e425l05312B65621F2890Q7718b96335
12945C27031j26214c24725a28884F3245b70689H4549R7717b28262A31855J4751
12935A46606F3459g0450A33372Q1888D7873J99503f729j39956j88158A8792l259
12924A5533N0139O8326K4200O21c03133D4312c99736A72790k2161a25732a3350
12912f9344e272H242P705Q0891c30139A45536L53948H2521J699J077k1459N1429
$$ plain form
12991 16412 320897 23505 -52719 -106296 35425 -346776 -178820 -307209 -76916 -168298 60324
12979 -142747 -420337 -600903 10146 -167343 -134441 -38513 82 383444 -118864 -355823 80790
12967 -152558 58621 135561 -127672 -103521 138605 -219115 15155 426007 24794 228689
12957 228689 -137917 -137183 129748 254271 308899 -5425 -310737 265621 62890 150608 -296335
12945 327031 200817 -324725 -128884 63245 -270689 84549 182266 -228262 131855 146606
12935 146606 63459 -70450 133372 215260 47873 247376 -6729 -146685 -334843 18792 15533
12924 15533 65672 133998 158198 158819 -303133 44312 -399736 172790 150629 -125732 -13350
12912 -69344 -5272 8242 15947 96838 -330139 145536 499484 82521 84220 85297 63838 115267
12900A15267K72954A18773O8836P6425g3071B18511b43702a8410o3187r4808J2924
12889a63481F698c4296B85503b1568A69841F3823g2711A33331c56988G9086M6175
12878A25261J9465P1929h8747A30072j1797j099K65105I6501P0504a05454m9741
12867a55195d4381j92773G3432a58976j3977A1456a12017B49621A24509R5764
12857B20273a69182C03705c78971J89032E9965b1617l38317i2136D39599c6545
12846b71016I2318J5553i0151A787l82b30409A02297g5354k0625n1941G3863a942
12833g0619F2041j4680A2774b14397B17778I6907a38249C6573j6298a19154K7080
12822i2074C1774c8448A97231a478B24930a42875J3737D4993A7569a08298j1090
$$ plain form
12900 115267 388221 118773 187609 264034 -73071 218511 -243702 -18410 -81597 -176405 -163481
12889 -163481 6698 -34296 285503 -21568 169841 63823 -72711 133331 -356988 79086 125261
12878 125261 144726 216655 -88747 130072 118275 117176 382281 96501 167005 -105454 -155195
12867 -155195 -44381 -237154 73432 -158976 -172953 11456 -112017 249621 124509 220273
12857 220273 -169182 303705 -378971 -189939 59965 -21617 -359934 -92136 439599 -36545
12846 -271016 92318 107871 -90151 1787 1405 -230409 102297 -75354 -95979 -147920 73863 -1942
12833 -70619 62041 47361 12774 -214397 217778 96907 -138249 36573 20275 -119154 -92074
12822 -92074 31774 -38448 197231 -1478 224930 -142875 -129138 44993 17569 -108298 -119388
12811a19388B28052k6876a45400H3850d3242A44495E4382K84798d2328j07524
12801a49852a6448j31587c9579A13881e1492k8729A7498a22892B5867L43459D0381
12789a52158m2136b0797j0820j50547F69J97089a74550P2023j30832e7188B20729
12777c8373H8216b63223M7163A40425m7104b30750J381i578n10j85725O6580A29096
12764c8062k48138A40138a02733A83362m9618i3058B54652g4642j38598A5865
12753C53138C9755a31933C7263i9662B30259r8296a59152I6751a30757A14113
12742A04468a90160d0194k6158j98373A6127M0520b31061i6301B96686A39810
12731F2300J18526J93476b46384a02848j19093d037k67848D8581c21851J37835
$$ plain form
12811 -119388 228052 201176 -145400 83850 -43242 144495 54382 339180 -42328 -149852
12801 -149852 -16448 -148035 -39579 113881 -51492 -80221 17498 -122892 25867 369326 40381
12789 -152158 -194294 -20797 -31617 -182164 669 197758 -174550 -102527 -233359 -57188 220729
12777 -38373 88216 -263223 -216060 140425 93321 -230750 -229369 -9578 -10088 -195813 -129233 129096
12764 -38062 -286200 140138 -102733 183362 133744 -93058 254652 -74642 -213240 15865
12753 353138 39755 -131933 37263 -99662 230259 131963 -159152 96751 -130757 114113
12742 104468 -190160 -40194 -66352 -264725 16127 56647 -231061 -96301 296686 139810
12731 62300 180826 374302 -246384 -102848 -221941 -4037 -271885 48581 -321851 -184016
12721a84016A67486a67324A05766O344d0853j03937H4414N6727K23b9215A9538
12709g1400a1160D23503b88497b9110B4049a93217H9905Q3701A7705K8337M1314
12698H7356Q2991e9151A60875l7538f9916D5115c10920i9786k4124e305G5556
12686a12378B70259j08921J52099b83267a4141E5487M9577A5979J89872G1557
12675a97729E3715K00318r0229a13299K2920j44615B37844b77783J36527a2119
12664a07834j10410D1306a72108c8451A3655n273J81435d8956n1608B59938A00224
12652A2072c0837B04705J7155r9165e1446A58513j1833f7508f160j04825n6125
12641a67110D7365b45764F6430K485R3965E3067J1344K34564e7922j86356B30103
$$ plain form
12721 -184016 167486 -167324 105766 112110 -40853 -144790 84414 141141 141364 -29215 19538
12709 -71400 -11160 423503 -288497 -29110 24049 -193217 89905 173606 17705 46042 87356
12698 87356 170347 -59151 160875 123337 -69916 45115 -310920 -99786 -123910 -5305 75556
12686 -112378 270259 161338 313437 -283267 -14141 55487 105064 15979 205851 71557
12675 -197729 53715 254033 163804 -113299 -90379 -234994 237844 -277783 -141256 -12119
12664 -107834 -218244 41306 -172108 -38451 13655 8382 189817 -48956 -100564 259938 100224
12652 12072 -30837 204705 221860 122695 -51446 158513 146680 -67508 -6160 -110985 -167110
12641 -167110 47365 -245764 66430 68915 162880 53067 64411 298975 -57922 -244278 230103
12629C42380B4671i0159n9424j80557B33851a51449A25074a17201b0039J414j16210
12618a34835q974f3432A46001b38924l4646F2203R9071C895M084K5817L9771p376
12606F6191b5225j19267A37373B8260L1581h5646J4463j61827C06335A28565b7417
12594H2456L2543K3046g1817A6508b03936j03272h5204C41016h5769A12720i9444
12582a4541j08393B49597c9785a5946j67694B5249P940J71476a38402B45434b98973
12570A55687a36552A37600A1800a22672j30920B07359a11027B77506m865j16535
12560A56106a70050r4984g5930j37436f8604J7625k20176A73091N0262b12525
12549a85038c7983l40987b5357l32993C58227A31834e2279l6648B10709J64703
$$ plain form
12629 342380 24671 -90159 -149583 -330140 233851 -151449 125074 -117201 -20039 -18625 -134835
12618 -134835 -143809 -63432 146001 -238924 -273570 62203 161274 3895 7979 33796 73567 66191
12606 66191 -25225 -144492 137373 28260 59841 -85646 -71183 -233010 306335 128565 -27417
12594 82456 114999 138045 -71817 16508 -203936 -307208 -85204 341016 -85769 112720 -99444
12582 -14541 -122934 249597 -39785 -15946 -183640 25249 33189 204665 -138402 245434 -298973
12570 155687 -136552 137600 11800 -122672 -253592 207359 -111027 277506 272641 156106
12560 156106 -170050 -265034 -75930 -213366 -68604 -50979 -271155 173091 223353 -212525
12549 -185038 -37983 -378970 -25357 -358350 358227 131834 -52279 -88927 210709 375412
12539C75412a49380H6068h1801A5991O0039c6700E6202a98611F7525c14849A26224
12527G3967J83690p6127M2039o0047m6150D0633Q0251a56917K1267A69404h288
12515C47099e5443j22101A65547a59789f7627j75684H9057L12706a40240A99638
12504A62903p0215D3854a08903a0552D9481J07624d53427N6644E62962A6038b21293
12492G6439e8388C31047b63771m1440J01181B72665e8386J9043j57515A39910
12481D4076c89805A71067b15765a3501F5082P5183J38802r0111b1238B09154J16424
12470C25578A2815J41677g9069K0282l5333D2287j1347a00384I0576i7433B71040
12458C4240J63516a1003m3233E0038a22370B3154R9919P9355a72975A18623a09768
$$ plain form
12539 375412 -149380 86068 -81801 15991 76030 -36700 56202 -198611 67525 -314849 126224
12527 73967 257657 181530 223569 163522 117372 40633 120884 -156917 -135650 169404 -8288
12515 347099 -55443 -177544 165547 -159789 -67627 -243311 89057 401763 -140240 199638
12504 162903 92688 43854 -108903 -10552 49481 157105 -453427 -396783 562962 16038 -221293
12492 76439 -58388 331047 -263771 -305211 -204030 272665 -58386 -39343 -196858 139910
12481 44076 -389805 171067 -215765 -13501 65082 140265 279067 188956 -21238 209154 325578
12470 325578 12815 154492 -79069 -58787 -94120 42287 30940 -100384 90576 -97433 271040
12458 34240 197756 -11003 -54236 50038 -122370 23154 123073 202428 -172975 118623 -109768
12446G2384a36513N8256I4106D886b65591D7928J39981C4459K18878a55274A81500
12434A53202a31391C9475c6008K070k21387i0763j69380A22115a26276a1980p6993
12423h8973M3388A85517b18913R1917A78997h069B32478b03791J3859I874i3386
12411a300k38207I4188a47478B08598A2504c61568O6739J21320k31724e556o4670
12400g0226j64629j39272B43468c47847K5563i5051j78110D23263k10529D036
12389g6849b4630k15311D4520a47004B28741q0154d7911C08933G0741c25113a36943
12377B58703q3737n5496j9611J08996o8312o6660O3530f2584H2560C051J15924
12366A18975a86412H3606b66858a2853k0044E36b47761C77389a50260B65201a72735
$$ plain form
12446 72384 -136513 -78257 94106 4886 -265591 47928 187909 34459 253337 -155274 181500
12434 153202 -131391 39475 -36008 -33938 -255325 -90763 -260143 122115 -126276 -11980 -88973
12423 -88973 -45585 185517 -218913 -126996 178997 -8069 232478 -203791 -189932 9874 -93386
12411 -1300 -239507 94188 -147478 208598 12504 -361568 -294829 -173509 -405233 -5556 -70226
12400 -70226 -234855 -374127 243468 -347847 -322284 -95051 -273161 423263 212734 4036
12389 -76849 -24630 -239941 44520 -147004 228741 148587 -47911 308933 70741 -325113 -136943
12377 258703 174966 119470 99859 208855 140543 73883 137413 -62584 82560 3051 118975
12366 118975 -186412 83606 -266858 -12853 -32897 536 -247761 377389 -150260 265201 -172735
12354H7883e4653C04595D4198c7017i924B33020I4257b11570b967j03726B3678
12342a91857A48670n4719K89784a23456n1183A50216n2344A291K66298n9182K4317
12331B32724K23325H5506J55495a16314A12844b04081J00718d453j39704E8375
12320H1316M1384O5998G8974a04271A80428g627A8850b36651C2147b41833B39881
12308e8282B74874A14440b52424A94664a0756F8207k7772f4537N895j33154G5001
12296B30017j02988b11436A19130Q5351I1412k4406d1746I5489h3602G1680a16682
12284A70208C9675a1919B6614K31502l855a14536b1064A24526L66365A49704a57380
12272A2572J7219K21347Q175J62067A72488M1435l1303K6052O4219J3797b7140
$$ plain form
12354 87883 -54653 304595 44198 -37017 -9924 233020 94257 -211570 -2967 -106693 23678
12342 -191857 148670 93951 383735 -123456 -174639 150216 97872 1291 267589 208407 232724
12331 232724 456049 85506 241001 -116314 112844 -204081 -103363 -4453 -144157 58375
12320 81316 122700 188698 78974 -104271 180428 -7627 18850 -236651 32147 -241833 239881
12308 -58282 274874 114440 -252424 194664 -10756 68207 40435 -64537 -58642 -191796 75001
12296 230017 127029 -211436 119130 204481 91412 67006 -41746 95489 -83602 71680 -116682
12284 170208 39675 -11919 26614 258116 254261 -114536 -21064 124526 490891 149704 -157380
12272 12572 29791 251138 259313 421380 172488 213923 182620 208672 272891 286688 -27140
12260A49013Q1683F0901k4487L6301K0180K48829A40758O3592E5714a56989M933
12249a52056B00310a9428j32397B67054b08187h6488m2117A73294p0906b45436
12238c8499C70400d0055n9793A23208i2752H1902J65430a07020D33274I5135L5822
12227A30957a13228C58331j08711A08422J37555k43C5233K54514a81694B19162
12216b18438B01698N7486Q3509K6093m1462j59399A4455o465K86316d57038A89673
12204B18952I3402l2764c5803F0235b33052A59506p5151K97882C2130i1340B02072
12192F2013J8379J76357h276C3207o601q822i5005G7953M236g671B26124d6606
12179I8338B3326R1835J25322g1105B28094q2917L158d0149A9098b7362f641A42885
$$ plain form
12260 149013 230696 60901 36414 72715 92895 341724 140758 204350 55714 -156989 -152056
12249 -152056 200310 -19428 -151825 267054 -208187 -86488 -128605 173294 102388 -245436
12238 -38499 370400 -40055 -99848 123208 -92752 81902 247332 -107020 433274 95135 130957
12227 130957 -113228 358331 249620 108422 245977 245734 35233 289747 -181694 219162
12216 -218438 201698 259184 342693 368786 327324 167925 14455 7990 294306 -457038 189673
12204 218952 93402 60638 -35803 60235 -233052 159506 84355 382237 32130 -91340 202072
12192 62013 80392 256749 -8276 33207 26606 17784 -95005 77953 82189 -7671 226124 -46606
12179 98338 23326 115161 240483 -71105 228094 145177 148335 -40149 19098 -27362 -6641 142885
12166A05394J78609h8982A54992B8602P005P5508g8961F1642M52271E776M53425
12155D59201a29616O0050A47750J02372a80835B72267I9914a18875C04334e0298
12144A43468Q1347B5507h1952B0274M8890M6498E99N0420K8759N284a24095o2761
12132a86856O3795H6106a35180A89407C8296R1813K7820f0584B99637G7607J61655
12121B39262d5584C23824R008G4737L499k0615a83784e3673A64150i7324L1123
12110f6201p1893B95388I6831N3160E7066J05056a2471l38721E8900h8998H1107
12098i0492j04845c0704H2916M5371J06756a97213D97054a4088B59343d3527B30991
12086F7488L30817g8002A88463i773A65600P5753a15774k2669C20271b24491A79438
$$ plain form
12166 105394 284003 -88982 154992 28602 35607 111115 -78961 61642 513913 5776 459201
12155 459201 -129616 -69566 147750 250122 -180835 272267 99914 -118875 304334 -50298
12144 143468 224815 25507 -81952 20274 69164 115662 599 51019 79778 85062 -124095 -186856
12132 -186856 -123061 86106 -135180 189407 38296 130109 157929 -60584 299637 77607 239262
12121 239262 -45584 323824 332832 74737 78236 57621 -183784 -53673 164150 -97324 -66201
12110 -66201 -138094 295388 96831 149991 57066 162122 -12471 -351192 58900 -88998 81107
12098 -90492 -195337 -30704 82916 128287 235043 -197213 497054 -14088 259343 -43527 230991
12086 67488 398305 -78002 188463 -9773 165600 241353 -115774 -138443 320271 -224491 179438
12074A16286a9286m7221C26890q6716h8973A60058b933C04770b86137C95668j87259
12063B08409K8764a95648C42325A0046R9899J98294A22680m2486J49714O9270
12053B99178a76826A51281h5292o757C9279J7248i042p1812k4284j890A2152K95209
12041C07361q7460q7507b7636k86571B45142g5532A07358a71770q4107b9345B8117
12029H5117O9709o7602a49295D5727i9490A39734l8204R7865f3681A80407J24586
12018C04993j10092l9282C1158c47822a26959c6783D8584a46420B38317H884J0643
12007A9527c79664A5270J77802J05644j41851l4664K38297f0599D1802A8874J7781
11996C6655M831H385O6420J08336G4374J63474r9900B8408c7192h902A66160b633
$$ plain form
12074 116286 -19286 -66507 326890 240174 -88973 160058 -2933 304770 -286137 395668 208409
12063 208409 237173 -195648 342325 10046 109945 308239 122680 80194 229908 299178
12053 299178 -176826 151281 -85292 -92049 39279 56527 -9042 -80854 -105138 -107028 12152 307361
12041 307361 219901 132394 -27636 -314207 245142 -75532 107358 -171770 -255877 -29345 28117
12029 85117 154826 87224 -149295 45727 -99490 139734 101530 199395 -63681 180407 304993
12018 304993 194901 155619 31158 -347822 -126959 -36783 48584 -146420 238317 8884 19527
12007 19527 -379664 15270 193072 298716 156865 122201 360498 -60599 41802 18874 36655
11996 36655 41486 8385 74805 183141 74374 237848 137948 28408 -37192 -8902 166160 -2633
11983A1733K09480d648C10635B4479d2538o8298j74936g1960f101A8943a23983
11971a69673A61996m5292a35598B22662l1396k5214g276D253a58114A7449M1972
11960E9421F506b78912G3642b4909j58078f1784l723P701j12735r4776J05150
11949a60167B35808b3140k21200H6082a60214j26634E0116a59286j6638B5831
11938a19524J9771G6497a53727O8327A65649c2605A57844m4893P0679G0081p543
11927F2538B2316J00801j8309b72415D5601i4915a6941l17760D2496N8293a32549
11915A01311l8054b73879Q1123g1658A40738A5296b38076K0447B10779G4076M8657
11904A22733a48261L7808K6580J4541o2746A51264m0512a23945A3250A806K0638
$$ plain form
11983 11733 221213 -4648 310635 24479 -42538 -110836 -285772 -71960 -6101 18943 -123983
11971 -169673 161996 116704 -135598 222662 191266 166052 -7276 4253 -158114 17449 59421
11960 59421 6506 -278912 73642 -24909 -182987 -61784 -65507 -57806 -170541 -265317 -160167
11949 -160167 235808 -23140 -244340 86082 -160214 -286848 50116 -159286 -175924 25831
11938 -119524 -99753 76497 -153727 -85400 165649 -32605 157844 112951 183630 70081 62538
11927 62538 22316 123117 104808 -272415 45601 -94915 -16941 -334701 42496 100789 -132549
11915 101311 63257 -273879 -192756 -71658 140738 15296 -238076 -217629 210779 74076 122733
11904 122733 -148261 -110453 -83873 -69332 -132078 151264 110752 -123945 13250 1806 22444
11893B2444c87501i1602B9812b30194b5857l18397L3648A08373J42880a00551
11882A12675E0294i0185D1837a16804G4676J18656i4794B1149J61237c28209A13296
11870A80109G9874b65057f891H5321a89004c5953D3706O8363a11120n1723b7347
11858a4314k17120N1894E0800O237b96371C51450g7621j54773g3889o349j06677
11847a86915C4753J3060R6975b7564B42514a30610q2520A32235J03391b03963
11836c2642j07769O6628j38214A12150R0430B9653a69105O9159A77076q0178c75586
11824d5881E9135a17879a7294r8583A29931k2095a36236A8781h4493A12415b66215
11812D0084K90015r7076i003B35264b38559q8351G0524J9713d3059l28868e6098
$$ plain form
11893 22444 -387501 -91602 29812 -230194 -25857 -344254 -310606 108373 251253 -100551
11882 112675 50294 -90185 41837 -116804 74676 193332 -94794 21149 182386 -328209 113296
11870 180109 79874 -265057 -6891 85321 -189004 -35953 43706 112069 -111120 -162843 -27347
11858 -14314 -231434 -179540 50800 57037 -296371 351450 -77621 -232394 -73889 -80238 -186915
11847 -186915 34753 47813 144788 -27564 242514 -130610 -213130 132235 235626 -203963
11836 -32642 -140411 -73783 -211997 112150 202580 29653 -169105 -99946 177076 96898 -375586
11824 -45881 59135 -117879 -17294 -115877 129931 107836 -136236 18781 -84493 112415 -266215
11812 40084 330099 233023 -9003 235264 -238559 -326910 70524 90237 -43059 -371927 -56098
11800h7743j81724e5286j2074L2904D4563b30109E4969d9605C58977i1967n2335
11789a44302f901A06599A4294J32329A1204J7989K09446b7882r6270C487f4687
11777a38993M1931l8860b9901I2584M1492K1650L62E1114e4617Q653j1411k1098
11765g8473A64484A2832J57042b79165J37771A78609b29557H819D84J67289J43301
11754C11074d0666C3240a49877A15811M1480a10552B97682o9328D1394c0722k9345
11743f0067A20386a59446L1632A62153i9236A70903B0765R5667J71081d4707m5969
11732i0676l0502A82526a16481o5622K8399o6835j77224e9108C47593b3914A8808
11720G9187b24404A03162l0160a2163j82129A60243J15381j05271G3548d7115
$$ plain form
11800 -87743 -269467 -55286 -67360 -34456 44563 -230109 54969 -49605 358977 -91967 -144302
11789 -144302 -6901 106599 14294 146623 11204 29193 238639 -27882 -124152 3487 -64687
11777 -138993 -97062 -135922 -29901 92584 134076 155726 156088 51114 -54617 -45964 -57375 -78473
11765 -78473 164484 12832 169874 -279165 -141394 178609 -229557 8819 484 167773 311074
11754 311074 -40666 33240 -149877 115811 157291 -110552 297682 228354 41394 -30722 -60067
11743 -60067 120386 -159446 -127814 162153 -99236 170903 20765 116432 287513 -44707 -90676
11732 -90676 -121178 182526 -116481 -182103 -153704 -220539 -397763 -59108 347593 -23914 18808
11720 79187 -224404 103162 73002 -12163 -194292 160243 275624 170353 73548 -47115
11709b327H3283c45249e7297j27923O6354C34511g3156Q627E9247K7476f1267
11697b54463A50426P6446e1374k4108J3599A48790D0062a6176G5301a46256p5753
11686b22009i6997B02031C6675O6545a14416A04535J20494o1697p6548f6286A72408
11674B2971J01694j619B0794O9863c4102E4701K24537F7125i9313b3863D5188
11662A01847O4398h0755C1188e5320F7251L00936b89938A54441a83470C57211
11651A37090b22102B25323H2290O6740D2014J6346a03985G1351e7684E9201a7372
11639b54336D5683B2105K1864b66606I6020C971J08177N1036f2645F0992k4835
11628C6157d04105f0519n2399B32047B2401b2606E4525J43411d2987A95459A8853
$$ plain form
11709 -2327 83283 -345249 -57297 -185220 -118866 334511 -73156 -64529 59247 86723 -61267
11697 -254463 150426 226872 -51374 -75482 -61883 148790 40062 -16176 75301 -146256 -222009
11686 -222009 -96997 202031 36675 103220 -114416 104535 225029 163332 86784 -66286 172408
11674 22971 124665 123046 20794 90657 -34102 54701 279238 67125 -99313 -23863 45188
11662 101847 166245 -80755 31188 -55320 67251 368187 -289938 154441 -183470 357211
11651 137090 -222102 225323 82290 149030 42014 58360 -103985 71351 -57684 59201 -17372
11639 -254336 45683 22105 43969 -266606 96020 3971 112148 163184 -62645 60992 36157
11628 36157 -404105 -60519 -112918 232047 22401 -22606 54525 197936 -42987 195459 18853
11616E9502a28227Q713a3935A25759e3627C5603b69270R0112E7617a6498r6087
11605a12585a3782A02508b2665m7566l58347h0394B8338Q7656J53523b0059j19558
11594a39617c7234A87530H9622N3180c34949A48388a23356a5949F9668i3130A16922
11582a8463j82702O3768N2159a5560I4019O1913c40886B50996C3821L276b29797
11570a91008O7005D5404J50647H85a76714I4278J0887J95299f6833o8308g856
11558c6413A53842o8522C9593Q8278a447j04187a4710l066j18061B65704p3948
11547A91756O2420n7563H5554a40884A04110a51549E9544a20866N1853B50242
11536A75449g2668B15366f3377k63709A49716f6336K072b5700m2001R126I6307
$$ plain form
11616 59502 -128227 -119514 -13935 125759 -53627 35603 -269270 -179158 57617 -16498 -112585
11605 -112585 -13782 102508 -22665 -70231 -428578 -80394 28338 115994 269517 -20059 -139617
11594 -139617 -37234 187530 89622 142802 -334949 148388 -123356 -15949 69668 -93130 116922
11582 -18463 -201165 -137397 -85238 -15560 94019 155932 -340886 250996 33821 37097 -229797
11570 -191008 -124003 45404 196051 885 -176714 94278 105165 300464 -66833 -135141 -7856
11558 -36413 153842 85320 39593 127871 -1447 -105634 -14710 -17776 -135837 265704 191756
11547 191756 254176 196613 85554 -140884 104110 -151549 59544 -120866 -69013 250242
11536 175449 -72668 215366 -63377 -327086 149716 -66336 -64264 -25700 -67701 -58575 96307
11524C10447l201a33762C7289b0542B67419A06247c5100j52975d3894C46245i403
11512B25666h7169G2327b1923C7848J89658j8418F7904P8291j9618a4226A67383
11500I3194l7752h6566j4471L0566l32082C8449f3588c986A94337J3242f054C0930
11487D06533A46612G2274a71403D97522g9512D6869J27321j1427K5365c7870C02095
11475B99469D8928P3277i7830m001B23917b16670A89388B3444a95619I90J682
11464B672J3564J45321a17006B78585b9215j33843A18179a03778k8285b62B08169
11452e2423A63163f043B76208b69803g7242j11727D0887g4044C86050j07018B4424
11440B21122i5428M4613m3359B18669A01179J93793a27416F26524A65658i0414
$$ plain form
11524 310447 307246 -133762 37289 -20542 267419 106247 -35100 -188075 -43894 346245 -9403
11512 225666 -87169 72327 -21923 37848 227506 209088 67904 146195 126577 -14226 167383
11500 93194 55442 -86566 -101037 -70471 -402553 38449 -63588 -3986 194337 207579 -6054 30930
11487 406533 146612 72274 -171403 497522 -79512 46869 174190 162763 188128 -37870 302095
11475 299469 48928 122205 -97830 -101831 223917 -216670 189388 23444 -195619 990 2672
11464 2672 16236 161557 -117006 278585 -29215 -163058 118179 -103778 -132063 -262 208169
11452 -52423 163163 -6043 276208 -269803 -77242 -188969 40887 -74044 386050 279032 24424
11440 221122 -95428 -50815 -94174 218669 101179 294972 -127416 626524 165658 -90414
11429a15561B08710A127M2773a55886B480M8217R6681A3172J34231K7580g5456
11417A23440E3118b9469D9781J81691c09912e7099E202c52001e2796A59284o8494
11406I0790f6619k8599b7151k04857g2296B12376G4796M7625A218a61778d5787
11394A30a84526P9268l76594f0890D3440a00625B21662p1226c4569k9419B01313
11382a43632G0156b0382B15101a32151b7002j25417O3507j99597a14079j30883
11372b44962J19196l8958A55162G1190O7646A2622a2654A25435a490I1185R7649
11361A88834B2837a57239c4141j15995A81172E1298b59372B20326i944p7361l4131
11350a21436C2444a50132N3658n3450j50786C20605d8868A38534F5132R6574B0229
$$ plain form
11429 -115561 208710 1127 43900 -155886 2480 50697 147378 13172 147403 174983 -75456
11417 123440 53118 -29469 49781 231472 -309912 -57099 5202 -352001 -52796 159284 90790
11406 90790 -66619 -95218 -27151 -232008 -72296 212376 74796 122421 1218 -161778 -45787
11394 130 -184526 -105258 -481852 -60890 43440 -100625 221662 150436 -34569 -63988 201313
11382 -143632 70156 -20382 215101 -132151 -27002 -152419 -88912 -288509 -114079 -244962
11372 -244962 -125766 -164724 155162 71190 138836 12622 -12654 125435 -1490 91185 188834
11361 188834 22837 -157239 -34141 -150136 181172 51298 -259372 220326 -9944 -87305 -121436
11350 -121436 32444 -150132 -96474 -149924 -300710 320605 -48868 138534 65132 161706 20229
11338F7002a65649B15392a35028A60573g3388B37832A16970g344B8485c09163
11327e5813r949p2017D3758i7390M3335d094A59463C7089J01647C1455j4153P6762
11315I4064g9866p9020e4900n26a6950L583j43309j31973J13869n5397g5451n7581
11303a33032k43146J80013A38621a82622d4492B26086a12504G9801c24638a3033
11292a35025e1759j42205M0868j0174A24088n3767c29848B53148N3949j37914
11282A69183a59839K4113c0716j26244L052Q136O5252K7378B23874i4008l1424
11271a25432A1506K51900G0015J98585b41406o2409k3775O9229I5642c53625M6184
11260c07441P7655A58061Q2569J58867b1018p0402j07614A64384c45828G4442
$$ plain form
11338 67002 -165649 215392 -135028 160573 -73388 237832 116970 -7344 28485 -309163
11327 -55813 -65762 -137779 43758 -97390 -54055 -4094 159463 37089 138736 31455 17302 94064
11315 94064 -79866 -158886 -54900 -55426 -16950 -13367 -156676 -288649 -174780 -230177 -75451 -133032
11303 -133032 -376178 -196165 138621 -182622 -44492 226086 -112504 79801 -324638 -13033
11292 -135025 -51759 -193964 -153096 -163270 124088 70321 -329848 253148 307097 169183
11282 169183 -159839 -135726 -30716 -156960 -153908 -145772 -80520 -53142 223874 -94008 -125432
11271 -125432 11506 263406 70015 268600 -241406 -303815 -327590 -258361 95642 -353625 -307441
11260 -307441 -229786 158061 240630 399497 -21018 -91420 -199034 164384 -345828 74442
11249a43069A88257D5231A3465a42527O8007n9935p6415D0616b78499a8751A90735
11237e762C73869j44453A09560a82563J1929l380l4446O9402K0835k03514b0302
11225A43464b85086a14088d9727D15730b06100b9375F6299L9507b33040G7876
11214a44549a4906G2695b35994K221j70175L7193J79235h4792A59020l6104a97423
11202b5121B000c04606i8781M5167k0475j88360E046K09101a35526o1084C84811
11190H9821e06015b09643J4970H0233a38368a8735m8150A03806b994k1113j40525
11179a64632g5095K6944k6396A190b30584c6328C23269o1303j02653A8621a8124
11167b08197e5801b1160j86993N6607p7146C0610a01642c7578p6235e6475o7399
$$ plain form
11249 -143069 188257 45231 13465 -142527 -74520 -134455 -210870 40616 -278499 -18751 190735
11237 -5762 373869 229416 109560 -182563 -170634 -174014 -208460 -139058 -118223 -321737 -20302
11225 143464 -285086 -114088 -49727 415730 -206100 -29375 66299 105806 -233040 77876
11214 -144549 -14906 72695 -235994 -233773 -403948 -366755 -187520 -84792 159020 122916 -197423
11202 -25121 2000 -304606 -98781 -53614 -74089 -262449 5046 214147 -135526 -196610 384811
11190 89821 -506015 -209643 -194673 80233 -138368 -18735 -66885 103806 -2994 -24107 -164632
11179 -164632 -75095 -48151 -74547 1190 -230584 -36328 323269 261966 159313 18621 -18124
11167 -208197 -55801 -21160 -208153 -151546 -228692 30610 -101642 -37578 -113813 -56475 -123874
11156a23874B37149b16213M5076N7572j11132n7388a9599j21338B92646j29997
11146A62649b6821j0221j08482o7768A54536G1455a19892B03529e8275j13619
11136a71894o3219H2257Q7486m5125L6666g4808a1351E3622g5269b3438p1193
11125i4631D5998a37187r2828A41235j3252a11495a7280j04414m5346A54857a13327
11113a64630K8042J0166j06435f0433j36183h3142j39911a5889A43896a64115
11102C11942A44898b48337a504C8317K88446A59295m5149A5801O099J26294b7720
11090E0722K4260G445C140J14496J545K55668G9975N2365K55485b7147B13938
11078a31591B62677o9985d989B58259q4621C6116a73264A74947k3588G4702d0697
$$ plain form
11156 -123874 237149 -216213 -171137 -113565 -224697 -282085 -19599 -140937 292646 162649
11146 162649 -26821 -37042 -145524 -213292 154536 71455 -119892 203529 -58275 -171894
11136 -171894 -235113 82257 169743 124618 161284 -74808 -11351 53622 -75269 -23438 -94631
11125 -94631 45998 -137187 -230015 141235 127983 -111495 -17280 -121694 -167040 154857 -113327
11113 -164630 -136588 -126422 -232857 -60433 -196616 -83142 -223053 -15889 143896 -164115
11102 311942 144898 -248337 -1504 38317 326763 159295 114146 15801 21900 148194 -27720
11090 50722 74982 7445 3140 117636 119181 374849 79975 132340 387825 -27147 213938
11078 -131591 262677 192692 -4989 258259 173638 36116 -173264 174947 151359 74702 -40697
11066A47680J88699P3415A58575a02919C29486r8197j04424d4606D09438A95926
11055A94732K41741A77963L14312B17426J45892L09021C10228j3964L03148j56618
11045D42794P3227j55456l4066J65963L5726k39023O8911J51016P2287B27022
11034B63198r8737M54740j63416e169C57490J30943J9673J67534k35491K84177
11024G24326j43601k73635J87157J86599k36649p0915H5316N7783J59400l9935
11014B62564K95214J34602B69776H1968K26542j37551L41551a9171B60324J95472
11004D55796A98896J31402L8163N1077j04j51435p3323K12888G8718J75581K51704
10993E06003j45085L2037n2567Q8292K6131m5659K01176B49664M53119o3291B65767
$$ plain form
11066 147680 336379 409794 158575 -102919 329486 231289 126865 -44606 409438 195926
11055 194732 436473 177963 492275 217426 363318 672339 310228 296264 599412 442794
11045 442794 516021 360565 326499 492462 528188 289165 358076 509092 581379 227022
11034 263198 164461 619201 455785 -5169 357490 488433 508106 675640 440149 724326
11024 724326 580725 307090 494247 680846 444197 373282 85316 143099 302499 262564
11014 262564 557778 692380 269776 81968 308510 170959 512510 -19171 260324 455796
11004 455796 198896 330298 368461 419538 419434 267999 194676 407564 78718 254299 506003
10993 506003 360918 392955 340388 428680 454811 409152 610328 249664 702783 639492 265767
10981D74067K39332j40406k3994J70340k88647k6879L23040j73311K74800L68129
10971A196471l07964N67274j45653L81949l61574M05115k04527K63355k11027
10962A583419M63950q87802K73978l46304J6407n96K57460l79086N9175K43656
10952A284257j93640K52918j01370j94337L17156l76260j33196k50771k11608
10943C93149j60405p8288J18535J28822E0088J63437o0577J24491a49919A24387
10932C19853g5119A4023a49681D2472a29998B08310G5801Q4821g106j7097B59553
10920H5426F771J77742F9531b17730P7647L7676A33160a86398B05902a68413o1614
10909b30027e1917N197F5985j0120c3861C5722J03681b9361m7552i37A97084a62073
$$ plain form
10981 474067 713399 572993 548999 719339 430692 403813 726853 553542 828342 1196471
10971 1196471 888507 1455781 1310128 1692077 1330503 1735618 1531091 1794446 1583419
10962 1583419 2047369 1159567 1433545 1087241 1103648 1103052 1360512 981426 1040601 1284257
10952 1284257 1090617 1343535 1242165 1047828 1364984 988724 855528 604757 393149
10943 393149 232744 154456 272991 401813 50088 213525 152948 277439 -149919 124387
10932 319853 -75119 14023 -149681 42472 -129998 208310 75801 160622 -7106 -24203 259553
10920 85426 6771 184513 69531 -217730 -140083 -102407 133160 -186398 205902 -168413 -230027
10909 -230027 -51917 -46720 65985 55865 -33861 35722 139403 -29361 -76913 -937 197084 -162073
10896d1863H1224C3170K8758a10966E0117o060a83452C4688d5936O711A06078
10884b67227A46950o6215a97781P3461j17811h7657H9735a21398b698A12923H67
10872B57142j23626M3601a32623H3043b95454A57988a53619j7421P3213A50102
10861a67233D6257P5154a76606m7506J9118C57267j2411a82929B19519a45803
10850H3284a36572j32782a2603A08095a82995B62610j02889r085g1725c3984A98822
10838I6460e0982j38507A50623q440b92962a22j96709H1588J34385a12336c1626
10826C9297A564a48021n7062e6493F2215b00252A06614i8065L0396A20129a7553
10814b60915i2260a7393I1711J46870a32251k50796A7414a3802E7786a33502B07074
$$ plain form
10896 -41863 81224 33170 61928 -110966 50117 44057 -183452 34688 -45936 -39225 106078
10884 -267227 146950 80735 -197781 -124320 -242131 -87657 89735 -121398 -2698 112923 867
10872 257142 133516 177117 -132623 83043 -295454 157988 -153619 -171040 -97827 150102
10861 -167233 46257 121411 -176606 -224112 -204994 357267 344856 -182929 219519 -145803
10850 83284 -136572 -269354 -12603 108095 -182995 262610 159721 150636 -71725 -33984 198822
10838 96460 -50982 -189489 150623 142183 -292962 -122 -196831 81588 215973 -112336 -31626
10826 39297 1564 -148021 -205083 -56493 62215 -200252 106614 -98065 -67669 120129 -17553
10814 -260915 -92260 -17393 91711 238581 -132251 -383047 17414 -13802 57786 -133502 207074
10802b62702i1595k53781b459D4950d9782n219J7590j61720i2819c6938A0427
10790a08430B8155N019b58876H5562b21078d2327k46371L0601C4018A1699h3788
10778B19546c19068J38743B01304l1193b72688R7811h3257l2205F3699a72894
10767A02662b08331k7188A94429a88875a0106F2859a41927C85049i5624k8898
10757a24522B54519a45610j03021A98157a46621j03866i0830G6411j6726a03843
10746A8855a61521O163C28153D2684O7819F775c2023C94826f1478j56098H3281
10734c7554m11985B2048b52672J8385O1103g1732p8814o2385I28L2135d13462
10722f7839o7691j36216a16732M720k2733A79009l3072F2837i1432k70961a2536
$$ plain form
10802 -262702 -91595 -345376 -2459 44950 -49782 -55001 -37411 -199131 -92819 -36938 10427
10790 -108430 28155 33174 -258876 85562 -221078 -42327 -288698 -258097 34018 11699 -83788
10778 219546 -319068 -180325 201304 170111 -272688 -174877 -83257 -115462 63699 -172894
10767 102662 -208331 -235519 194429 -188875 -10106 62859 -141927 385049 -95624 -124522
10757 -124522 254519 -145610 -248631 198157 -146621 -250487 -90830 76411 59685 -103843
10746 18855 -161521 -155358 328153 42684 110503 6775 -32023 394826 -61478 -217576 83281
10734 -37554 -449539 22048 -252672 -234287 -173184 -71732 -150546 -212931 928 33063 -413462
10722 -67839 -135530 -271746 -116732 -112012 -134745 179009 145937 62837 -91432 -362393 -12536
10710b86246a33262m2560A9243a36069A59725d9500h922B01099a67339A37544
10699D38574E3046K04993a96103M3887B5827j0656g9606b0010l8844p8424l9566
10688a76844g1600A82713a68945j73564b7293Q0k03029k32874e7907E9262Q2607
10677A41869b21402h527k2355m4969j520H1654a44304B06559D8698f1238E345
10665b09566B20891a21417A9381e9279k7067a9478D4926J88630K27483c69624
10654b37911A14101a91452J755F8337P915A1697P8315h9965A19419a38678d8168
10642b90465e9522k91694D0785c63637h4087l02730A28039a7205m7213p0863p7235
10631b12516A28364e337E6618h4070j32654D0280i0992j42782f6078A52328a16839
$$ plain form
10710 -286246 -133262 -175822 19243 -136069 159725 -49500 -8922 201099 -167339 137544
10699 438574 53046 258039 -196103 -152216 25827 15171 -79606 -20010 -58854 -137278 -176844
10688 -176844 -71600 182713 -168945 -342509 -27293 -27213 -230242 -463116 -57907 59262 141869
10677 141869 -221402 -8527 -30882 -75851 -77371 81654 -144304 206559 48698 -61238 5345
10665 -209566 220891 -121417 19381 -59279 -86346 -19478 44926 233556 461039 -369624
10654 -237911 114101 -191452 -189697 68337 76252 11697 90012 -89965 119419 -138678 -48168
10642 -290465 -59522 -351216 40785 -363637 -84087 -386817 128039 -17205 -64418 -135281 -212516
10631 -212516 128364 -5337 56618 -84070 -216724 40280 -90992 -233774 -66078 152328 -116839
10619a45042A9312Q0901E962c0658n843j9194A2521a32203B9950e1359j16025
10608a67384N2050c3083J1156A46439b68046B5659b06181K3463F8490c11248A27379
10596c4022F5663Q4259F8173J3403a0724m7149A8798J32781p5475a10176J2560
10585i7616k13270A19787b07301A42775a82494h7064q1050j61338B48830I882
10574a99129M4146A84538L9298c38932a21580k9C44142e1129j8912j98156A63622
10562e7805m9319b0373n2224B3326a81949e5905A27266a22234C29959a80381n3833
10551b34214C5040R1303J8494b94246i7965C7024O1519g899m86934a25599E414
10539B27509a97697c7720j17214c7954C13912D1758c55110I8306b17725A66690
$$ plain form
10619 -145042 19312 100213 5962 -30658 -36501 -55695 12521 -132203 29950 -51359 -167384
10608 -167384 -115334 -33083 -21927 146439 -268046 25659 -206181 -182718 68490 -311248 127379
10596 -34022 65663 149922 68173 81576 -10724 -57873 18798 151579 76104 -110176 -97616
10585 -97616 -310886 119787 -207301 142775 -182494 -87064 -168114 -329452 248830 9882
10574 -199129 -154983 184538 223836 -338932 -121580 -121609 344142 -51129 -70041 -268197 163622
10562 -57805 -107124 -20373 -72597 23326 -181949 -55905 127266 -122234 329959 -180381 -234214
10551 -234214 35040 126343 144837 -294246 -97965 37024 98543 -7899 -494833 -125599 5414
10539 227509 -197697 -37720 -154934 -37954 313912 41758 -355110 98306 -217725 166690
10528D4094a1468E1450a53575b5779j14479p1764a03406j36856B41298a0470q4935
10517i5405B8590e5493B94047G5001a52234A54108a41795k03970g4692b4671A13829
10505a83140M1777A22741a48280c9418A44722J6935b33476R163A91744f6343C68834
10493B42202A16266l7384a7033p8133q7169G9825a54824J4365l40052A85362a2051
10481b27343h6062c2449F3183f4116C02705F5614j7559J96222L43847k51889j08253
10470B27982R5814j33591d21483C29089A45137a83424B02399a06283E0674J18707
10460A69381e2899B5383L12178A54820O4747a34759n3084C10965A73g1935B07344
10448a62690L0630A34024b32473A57846a19243A48862E9415P9419C4386b88036
$$ plain form
10528 44094 -11468 51450 -153575 -25779 -140258 -212022 -103406 -240262 241298 -10470 -95405
10517 -95405 28590 -55493 294047 75001 -152234 154108 -141795 -345765 -74692 -24671 113829
10505 -183140 -141363 122741 -148280 -39418 144722 161657 -233476 -224313 191744 -66343 368834
10493 242202 116266 78882 -17033 -95166 -182335 79825 -154824 -140459 -480511 185362 -12051
10481 -227343 -86062 -32449 63183 -64116 302705 65614 48055 244277 588124 336235 227982
10470 227982 323796 190205 -421483 329089 145137 -183424 202399 -106283 50674 169381
10460 169381 -52899 25383 337561 154820 219567 -134759 -187843 310965 173 -71935 207344
10448 -162690 -132060 134024 -232473 157846 -119243 148862 59415 138834 34386 -288036
10437c218j83607N7696A08728a13077A6029R1099J66909a39644G3651J7793a03807
10425b0806A3152b63938L8283c8327A10721b6791k71249P8275M4607M6704j37632
10414b66086q4088a8533A11109f0074C2542P6879a94486B96725a83128c9450k64835
10403c04285A59483a56620N2533C818g2785A44077e270k62972a1366E0204j9503
10392C0701a94781H0783K12914l1284b21896G6459a86651a7211I2185R4424d0171
10380A63613K51036A72400a07921b6018N925C19112h720A3573R1796i0790A1036
10368f7194B83418N381i5525G6764M6524L95544o1649j91019l1331r5989c2369
10356D96897n3830A19581a54402L6290C12924l2126E3272J63404L3546A20322
$$ plain form
10437 -3218 -186825 -129129 108728 -113077 16029 107128 274037 -139644 73651 91444 -103807
10425 -20806 13152 -263938 -225655 -38327 110721 -26791 -298040 -219765 -175158 -128454 -266086
10414 -266086 -350174 -18533 111109 -60074 32542 109421 -194486 296725 -183128 -39450 -304285
10403 -304285 159483 -156620 -104087 3818 -72785 144077 -5270 -268242 -11366 50204 30701
10392 30701 -194781 80783 293697 262413 -221896 76459 -186651 -17211 92185 186609 -40171
10380 163613 414649 172400 -107921 -26018 -20093 319112 -8720 13573 105369 -90790 11036
10368 -67194 283418 288799 -95525 76764 123288 518832 457183 266164 234833 138844 -32369
10356 496897 443067 119581 -154402 -118112 312924 280798 53272 216676 250222 120322
10345A03709K59642M902A00361K03872A25325m6408J33643J04941a70034A44736
10334i2772F0838P2857N8033M2413G944J07454J28156a29363j22992A00410C5050
10322H5199L4589b1535B1236K27890G5264O527K75163j35515g2114D0826J28376
10311A69202E9217K10682A5292e3748k91665d799k98506f4001k74073B41243g5297
10299F8543J205L05296A62696f5568j2424l59221J95794A23448D731b47821Q2862
10288a64959j7427d4807p3734n1285j92707a8867F0054a13014a0913p942n0291
10277f9146h670F5299e975A00179g308l40864a29581F1494o2P7738a8152H2974
10264A13523c4260B41475a66690E8054K1475d9262B08145a51117J3565f4214A56775
$$ plain form
10345 103709 363351 368253 100361 304233 125325 78917 212560 317501 -170034 144736
10334 -92772 60838 133695 191728 234141 7944 115398 243554 -129363 -252355 100410 35050
10322 85199 119788 -21535 21236 249126 75264 81791 356954 221439 -72114 40826 169202
10311 169202 59217 269899 15292 -53748 -345413 -4799 -303305 -64001 -338074 241243 -75297
10299 68543 69748 375044 162696 -65568 -77992 -437213 -241419 123448 4731 -247821 -164959
10288 -164959 -182386 -44807 -118541 -169826 -362533 -18867 60054 -113014 -10913 -18855 -69146
10277 -69146 -8670 65299 -5975 100179 -7308 -348172 -129581 61494 61432 139170 -18152 82974
10264 113523 -34260 241475 -166690 58054 79529 -49262 208145 -151117 -137552 -64214 156775
10252A11179H9K76510B5557K12199N3892A43617n2025Q4649a11355b675H6454
10240f9400H810b82540I512c7682H3598J21041E2641b99356A38860a78189A17721
10228B92149G9581a53876I933d8742l8895A25457a14584F1256k5678a42266L1629
10217a10637B21614e419o9180J6471k47448g2630F4774a67798j11631q1052a24509
10205a84475g9354B52940a6805A68494c9750A5175f2039B29443g9355j56080E1800
10193a24132B54245a58503O695d0025J3957k27324J00306A81035a68513I8181
10182A69627j9338a71580H5410i3184d2416b1007j50447e4640B3153f5352j43707
10171b09059G2104D008h2878B02045c65844j22884C19063i1604j71729a09203
$$ plain form
10252 111179 89 276599 25557 237756 291648 143617 91592 176241 -111355 -2675 86454
10240 -69400 8810 -282540 9512 -37682 83598 204639 52641 -299356 138860 -178189 117721
10228 292149 79581 -153876 9933 -48742 -87637 125457 -114584 61256 35578 -142266 -110637
10217 -110637 221614 -5419 -74599 -58128 -305576 -72630 64774 -167798 -279429 -360481 -124509
10205 -184475 -79354 252940 -16805 168494 -39750 15175 -62039 229443 -79355 -235435 51800
10193 -124132 254245 -158503 -151808 -40025 -26068 -253392 -153086 181035 -168513 98181
10182 169627 150289 -171580 85410 -93184 -42416 -21007 -171454 -54640 23153 -65352 -209059
10171 -209059 72104 4008 -82878 202045 -365844 -488728 319063 -91604 -263333 -109203
10160I377Q2751b74046a7279p0752N276I2768B2657c99940C1290g018D20029b49357
10147d7686l4153l4246j94722a9295H9946a55589J0847C18182a9240B03865b62440
10135b15762A8666N6375J27912h052r6795A90160b11507B384J73681J70653a04364
10123A80833a95606l0099I7273a14152e4301J401m53923E8091c9873n1385B09791
10111a74848P1122E15074H3030f9112j48178A4514M8449J22039a21567J9117C8275
10099d27665R8128i259l76498A78387a29391N6300c1929k88245A47911g270j82053
10088a89323K2645C4140d4526j24685e16l18628D25430b13937c0738i282k52175
10077b61457m2979O4544g3092C3441f3063m5795A83770a02754j38032Q203C94848
$$ plain form
10160 9377 92128 -274046 -17279 -88031 -82755 92768 22657 -399940 31290 -7018 420029 -249357
10147 -47686 -81839 -116085 -310807 -19295 89946 -155589 -144742 318182 -19240 203865 -262440
10135 -215762 18666 75041 202953 -8052 -104847 190160 -211507 2384 176065 346718 -104364
10123 180833 -195606 -225705 97273 -114152 -54301 -52900 -506823 58091 -39873 -91258 209791
10111 -174848 -103726 515074 83030 -69112 -217290 14514 62963 185002 -121567 -102450 38275
10099 -427665 -329537 -9259 -385757 178387 -129391 -73091 -31929 -320174 147911 -7270 -189323
10088 -189323 -166678 34140 -44526 -169211 -516 -319144 425430 -213937 -30738 -9282 -261457
10077 -261457 -304436 -239892 -73092 33441 -63063 -108858 183770 -102754 -240786 -232583 394848
10065c87381J52814i0651j95734a36108m3137A4959a73487K3278B74045i1691
10054A9388G028J02358a28805A6086J34406k8738c93659J78268A10556k1456b33756
10042a95591h2306A13793j5271h4246B2985N4762e3204l13125B14304e5219n80218
10031f35437K23064A552a9190j39135p2569A52005K48433A4193a97900l6278P9529
10020a54649P2467I8194J25956A0405a85971N8627j43608J05801C48095a5667
10009f9455j77786a0175B64950e4698A57174b18659A60168n3279b02628R7645
9999a04983b8635d860o0718p9917B0656R1802l633d18175a4283q202j51439n5711
9987b29635f274j25776A27515E5376b40704f2320I2108a89717C91705i7933j72848
$$ plain form
10065 -387381 -234567 -90651 -286385 -136108 -179245 14959 -173487 -150209 274045 -91691
10054 19388 7028 109386 -128805 16086 150492 121754 -393659 -215391 110556 89100 -233756
10042 -195591 -82306 113793 98522 -84246 22985 77747 -53204 -366329 214304 -55219 -635437
10031 -635437 -412373 1552 -19190 -158325 -230894 152005 400438 14193 -197900 -234178 -154649
10020 -154649 -82182 98194 224150 10405 -185971 -127344 -270952 -165151 348095 -15667
10009 -69455 -247241 -10175 264950 -54698 157174 -218659 160168 106889 -202628 -104983
9999 -104983 -28635 -4860 -65578 -145495 20656 112458 108825 -418175 -14283 -22485 -173924 -229635
9987 -229635 -6274 -132050 127515 55376 -240704 -62320 92108 -189717 391705 -97933 -270781
9976b70781A58334A3506P5043g069E4471d25675R9984h9199D9402J8088A4997
9964b58098N1285O5156F3576A2590J9933c6006k04099A08303J01461c4237N522
9953b8715k28859l851Q271c56A0129b61344a10345r0514m6027K7059Q1206j84847
9941c23468a14278q2142g7148a9307o0609J329B39360a83604A09999A5565c030
9929C6950k362K78859A17308g9851k34384d6906k50288C2790g0571A15105a11875
9917a77702o7417o9257g4771j30312q8544a6976A59193L8184n9545K4399b48785
9905e9691l86817a30837O1507a0559a629C0198a03496C0072c70463Q5423J08375
9894a76665M589L6797k55481f8556j1749f778A74500d8916j67755G5938a5841
$$ plain form
9976 -270781 158334 13506 88549 -7069 54471 -425675 -325691 -89199 49402 67490 14997
9964 -258098 -206813 -141657 63576 12590 32523 -36006 -240105 108303 209764 -34237 -28715
9953 -28715 -257574 -261425 -253154 -356 10129 -261344 -110345 -200859 -246886 -219827 -138621 -323468
9941 -323468 -114278 -196420 -77148 -19307 -79916 -78587 239360 -183604 109999 15565 -3030
9929 36950 34588 313447 117308 -79851 -314235 -46906 -297194 32790 -70571 115105 -111875
9917 -177702 -245119 -314376 -74771 -205083 -293627 -16976 159193 197377 137832 162231 -248785
9905 -59691 -446508 -130837 -69330 -10559 -1629 30198 -103496 30072 -370463 -285040 -176665
9894 -176665 -172076 -135279 -390760 -68556 -80305 -6778 174500 -48916 -216671 75938 -15841
9882A63983a54195n6181O7759N1662j75371I021J18380m0376b05416A08740l892
9871A04848j8400b15861K3587M3158j09653h395j10161j8915A19720g2849B42886
9859b2300E160K00205k0039a01575o2613C2574a49188j95447J51847D030a64255
9847h9829B4986M524J22919M8305E299a07840l689M4208p7718p8324B73716j36262
9835A37454f8850l43241a00064C4565d1631r0300j2345A43391g5957A33633c19632
9823H3319b04641A64714C9077b37883h4454j85583B45061i8224n4473P2935L6956
9812d2806A46511F7754f0699j53095j23322b5891j08857d5873J8927l0407k57143
9801c14496c7897j34659Q3052D5009O8063a2559j09386d3517l1887k73105a16031
$$ plain form
9882 163983 -154195 -210376 -142617 -90955 -266326 9021 127401 87025 -205416 108740 104848
9871 104848 86448 -215861 -192274 -149116 -258769 -8395 -118556 -137471 119720 -72849 242886
9859 -22300 5160 205365 185326 -101575 -164188 32574 -149188 -344635 -192788 4030 -164255
9847 -89829 24986 29510 152429 200734 5299 -107840 -111529 -67321 -145039 -223363 273716 137454
9835 137454 -68850 -412091 -100064 34565 -41631 -131931 -144276 143391 -75957 133633 -319632
9823 83319 -204641 164714 39077 -237883 -84454 -270037 245061 -98224 -152697 -79762 -42806
9812 -42806 146511 67754 -60699 -213794 -337116 -25891 -134748 -45873 -26946 -57353 -314496
9801 -314496 -37897 -172556 -89504 45009 113072 -12559 -121945 -43517 -75404 -348509 -116031
9789A9263b0588G0969c17863a04158o8358d0991j56620a7390j91282I8262i060
9777a51408b2187k55800A56207a34949r8341j59892d8086k19055i1168K0320E0578
9765A59746a77674A18126k6573e4465H8387a94233K3974G3603c45929I6201J84746
9754B80947a67925K9212c3790q5966c9425D8357b42187c7643l82099f0609A91784
9742c98912H9516K72522E8056c7089q3678J1190n3180O0774A32920O2544a75131
9730b8157k44028A47800d00042h7726a8392D4026J20817E590e284o589D9532a91913
9717D7006K63190A24923f7944D5293a24216j95415B39265k5393j04600k7495h9520
9705B62249r7828l6685j6147a33181k1407O1509H7604b02479h3959k31643I4582
$$ plain form
9789 19263 -20588 70969 -317863 -104158 -172516 -40991 -197611 -17390 -208672 98262 -9060
9777 -151408 -22187 -277987 156207 -134949 -233290 -393182 -48086 -267141 -91168 -70848 50578
9765 159746 -177674 118126 91553 -54465 88387 -194233 -170259 73603 -345929 96201 280947
9754 280947 -167925 -138713 -33790 -119756 -39425 48357 -242187 -37643 -419742 -60609 191784
9742 -398912 89516 362038 58056 -37089 -120767 -109577 -162757 -101983 132920 195464 -175131
9730 -28157 -272185 147800 -400042 -87726 -18392 44026 164843 5590 -5284 -11873 49532 -191913
9717 47006 310196 124923 -67944 45293 -124216 -319631 239265 213872 109272 81777 -89520
9705 262249 164421 127736 111589 -133181 -154588 -93079 87604 -202479 -83959 -315602 94582
9693i3791G1501g1073j82249C96566a85622j31080A88542e1327R419k02048m6088
9682b90044a05762d0210C8425J01524e53559C1907a19051E5831c34408a09557
9671c22287a16477B8204a26394J3641B3214a28019K92B59000o6578b64780B83666
9659A10722d60087e0671r058Q998j71223r578b5144q8074E2416b93608B12055
9647a50870G5612a29733l31006A03191C1655d8678E3966c96462N117I145J59339
9636A68484a629j59373I4853a07274E5022a62681O5796A201K90967F9912O4350
9625A34262i3392I4487I593a14877F0091K4646L24897C4904J02607F725P2263
9614G8988e7858K0856p3441F5902a10152A31155j3294a57278k00041J04783q3122
$$ plain form
9693 -93791 71501 -71073 -253322 396566 -185622 -316702 188542 -51327 -41908 -243956 -290044
9682 -290044 -105762 -40210 38425 139949 -553559 31907 -119051 55831 -334408 -109557
9671 -322287 -116477 28204 -126394 -112753 23214 -128019 -127727 259000 192422 -264780 283666
9659 110722 -460087 -50671 -59729 -50731 -221954 -231532 -25144 -113218 52416 -293608 212055
9647 -150870 75612 -129733 -460739 103191 31655 -48678 53966 -396462 -391345 9145 168484
9636 168484 -1629 -161002 94853 -107274 55022 -162681 -96885 1201 292168 69912 134262
9625 134262 -93392 94487 9593 -114877 60091 84737 409634 34904 137511 6725 78988
9614 78988 -57858 -37002 -110443 65902 -110152 131155 117861 -157278 -357319 -252536 -335658
9603c35658a22705D3775Q7337a64277E670a88957A04348e2183A8673L7885a26973
9591b32134H0123K678c3973l19896C30854A21697I414a34417C62619a69439H2873
9579a02441A62960i6026r6548r2100r711h3709o6968G0550h8203J3788j37539
9568b11954f4821c714m23349B6364a28163A69849g2764k38148A80000A1154L27359
9557C38513c28525L3785C6937b90056g5111r7244o9800A15502d69225g635A20521
9545a57484n644A21709g0241A1695a90958j12548b6637H243c09791P3713a00350
9533A05055K36587g4118E7191J24684G6948K33129a67178H545J36977b18378F4050
9521b84878C0510h6746j4263C33961b17317A61882R1627q6780P6729g4432B33675
$$ plain form
9603 -335658 -122705 43775 131112 -164277 5670 -188957 104348 -52183 18673 56558 -126973
9591 -232134 80123 82801 -33973 -353869 330854 121697 9414 -134417 362619 -169439 82873
9579 -102441 162960 -96026 -192574 -284674 -294385 -83709 -150677 70550 -88203 -74415 -211954
9568 -211954 -64821 -3714 -427063 26364 -128163 169849 -72764 -310912 180000 11154 338513
9557 338513 -328525 -294740 36937 -290056 -75111 -172355 -242155 115502 -469225 -7635 120521
9545 -157484 -163128 121709 -70241 11695 -190958 -303506 -26637 8243 -309791 -236078 -100350
9533 105055 341642 -74118 57191 181875 76948 310077 -167178 8545 145522 -218378 64050
9521 -284878 30510 -86746 -101009 333961 -217317 161882 253509 166729 243458 -74432 233675
9509b08229F0847p642a51926m6101a9891B90836A38496k5066l935a73542K1444
9498a52098G5985J90684f4257j18817M7008B7361g3396D9986j1378a99894a4833
9486a68605A39724a30555o72o1442L3954l5209f6686l8414K1177A0249a80958
9474A61658b24037A25255l2124Q8882a79858o2226P9579A6367f056j1250B16940
9462h2444f028C65P1383K87158i9742q6798K6170o980B18055n8123a79472H9342
9449B45912J07381c52891A67670G8690Q6819a80021k5933A75071D2235J27398
9439A69633F9430d7952j03468l6424d189o1172b5643j64240G593J35741n8362
9428H4972M1728N307a1170q8574J6816q6056B7733a51332K4960a9643n3065F4256
$$ plain form
9509 -208229 60847 53205 -151926 -198027 -19891 290836 138496 113430 109495 -173542 -152098
9498 -152098 75985 266669 -64257 -183074 -136066 27361 -73396 49986 38608 -199894 -14833
9486 -168605 139724 -130555 -131227 -192669 -158715 -193924 -66686 -105100 -83923 10249 -180958
9474 161658 -224037 125255 93131 182013 -179858 -242084 -162505 16367 -6056 -17306 216940
9462 -82444 -6028 365 71748 358906 -99742 -186540 -160370 -167350 218055 159932 -179472 89342
9449 245912 353293 -352891 167670 78690 165509 -180021 -205954 175071 42235 169633
9439 169633 69430 -47952 -151420 -187844 -4189 -65361 -25643 -189883 7593 143334 84972
9428 84972 126700 132007 -11170 -99744 -82928 -168984 27733 -151332 -126372 -19643 -72708 64256
9415c2243D5846a63324N7222a8974j03196M1721r5975B947R9541O1119b29606
9403A89883b80456K4173I5648a57767A13562a99567O5319O0798b5887G166a89705
9391F3145K16815B3981a59297B15995E7298a39887B4741d0568p2036C4625R9388
9380A34013a76743A06977L4285F6224c09868i9081k26276a05077o9944p5379j09149
9369c59549C3542L4498O8724C4278a98260C9103J2655b83871E5768a22979p6307
9358a99286B85328e2145J262r207j92706B5646g3043l4416F7944k0294J9005J15477
9346A82132a88756B50134c49270a14051A16386a4586k69633a09120q1745A2995
9335a11626B4755M1398k4567F242L2479a87806l4973a00146A41490a8133l6045
$$ plain form
9415 -32243 45846 -163324 -106102 -18974 -122170 -80449 -176424 2947 102488 163607 -229606
9403 189883 -280456 -256283 95648 -157767 113562 -199567 -134248 -73450 -25887 7166 -189705
9391 63145 279960 23981 -159297 215995 57298 -139887 24741 -40568 -112604 34625 134013
9380 134013 -176743 106977 141262 66224 -309868 -99081 -325357 -105077 -175021 -250400 -359549
9369 -359549 33542 68040 136764 34278 -198260 39103 51758 -283871 55768 -122979 -199286
9358 -199286 285328 -52145 -50883 -60090 -252796 25646 -73043 -107459 67944 47650 66655 182132
9346 182132 -188756 250134 -349270 -114051 116386 -14586 -284219 -109120 -190865 12995
9335 -111626 24755 66153 41586 6242 38721 -187806 -222779 -100146 141490 -18133 -54178
9324e4178G580a11453j88723C70030g4937j56076h6893A03677a26226k07464A0974
9312f0121m1591l02223B27712r4969J87581G0236b34185B70839a01659m2086n1211
9301a94956A54273b00914E5962h010k2937K334j4639k44103a31357j09342h4879
9289A94392D7503P6321d60961a61018k21735c9389k26289i0004C5094r178c4824
9277B07864b64398C35688a04521m9356p6387A02026J17499e47A05657c89984c1464
9265b28598A61174b1748l03572a24597H7710M2740c33983A08552K10956E4465
9254b26107J02138H0049g4920A72261E0864J32454E9892d0186j39713p2571Q319
9243b44151g0273b1159j73267C4960a40982c3950H1788a33235K3976G7706J49072
$$ plain form
9324 -54178 7580 -111453 -300176 370030 -74937 -231013 -86893 103677 -126226 -333690 10974
9312 -60121 -101712 -403935 227712 132743 320324 70236 -234185 270839 -101659 -143745 -194956
9301 -194956 154273 -200914 55962 -8010 -30947 -28613 -43252 -287355 -131357 -240699 -84879
9289 194392 47503 123824 -460961 -161018 -382753 -39389 -265678 -90004 35094 25916 -34824
9277 207864 -264398 335688 -104521 -153877 -230264 102026 219525 -547 105657 -389984 -31464
9265 -228598 161174 -21748 -325320 -124597 87710 130450 -333983 108552 319508 54465
9254 -226107 -123969 80049 -74920 172261 50864 183318 59892 -40186 -179899 -252470 -244151
9243 -244151 -70273 -21159 -194426 34960 -140982 -33950 81788 -133235 -109259 77706 226778
9232B26778J8142o3098b03916L4549B94857c93908a26101n0199D6475L0741a45667
9220e3492j62214A84209A4541g8043p1520L6433j10754Q3055j19107j53054a10770
9208B0585a93479i3242m5058e5734A34231P3042a1110l01972H7674l3908a70764
9196b61389c0282j58470G123b05571k73680J26858C9463a76667B01833B7215b47918
9184A14221b18018p413b5370R777A1d0023j73384J1486D7714J10225A8546a31893
9171a3594j11183k203A45025b27063q3155J00808g9521A26347d2623j60461o5907
9160b68991f2961E0159J34354D9228b33653i7380A67311f7087A1277a63419C3418
9148d4720o3617A12556a68893C98433D0167c49303J48873B19904a60668I5540
$$ plain form
9232 226778 244920 181822 -203916 -169367 294857 -393908 -126101 -176300 46475 77216 -145667
9220 -53492 -215706 184209 14541 -78043 -149563 -113130 -223884 -140829 -259936 -412990 -110770
9208 20585 -193479 -93242 -138300 -55734 134231 207273 -11110 -313082 87674 53766 -170764
9196 -261389 -30282 -188752 7123 -205571 -479251 -352393 39463 -176667 201833 27215 -247918
9184 114221 -218018 -225431 -25370 -15593 11 -40023 -213407 -201921 47714 157939 18546 -131893
9171 -13594 -124777 -126980 145025 -227063 -310218 -209410 -79521 126347 -42623 -203084 -268991
9160 -268991 -62961 50159 184513 49228 -233653 -97380 167311 -67087 11277 -163419 33418
9148 -44720 -108337 112556 -168893 398433 40167 -349303 -200430 219904 -160668 95540
9137c3944A46092m6657a35454N3644A0064b66254i8918A36386e16947b1560k60214
9126b81774G36O4236a41148D1983a61896J449O9153B51925f6370L854A9342H83
9113i1662L9475C7980J58956a62146B92592B3828J90680l238G6622c58669A16825
9101g2072b8543D7188h0231m1978j24956C51575g9995N370I8695k426k4223b8268
9088a74859g2954k12393I8872L8124b78511a36883j4714A58571b05473G1605a41076
9076A45729O5521i0452c3822E3256b34812a11843H1795h5397j46626l6799A9247
9064d20098B6798N83b07063j25062a60906A40051a05275c5885A3166c2686n0558
9053h3244o4964l0056G7536b11594d9684n2244j39884e6373A83827i1232j3378
$$ plain form
9137 -33944 146092 99435 -135454 -81810 10064 -266254 -98918 136386 -516947 -21560 -281774
9126 -281774 736 64972 -141148 41983 -161896 -160447 -91294 251925 -66370 -62516 19342 883
9113 -91662 -52187 37980 196936 -162146 292592 23828 214508 211270 76622 -358669 116825
9101 -72072 -28543 47188 -80231 -122209 -247165 351575 -79995 -74625 98695 96269 72046 -28268
9088 -174859 -72954 -285347 98872 136996 -278511 -136883 -151597 158571 -205473 71605 -141076
9076 145729 211250 -90452 -33822 53256 -234812 -111843 81795 -85397 -232023 -268822 19247
9064 -420098 26798 27381 -207063 -332125 -160906 140051 -105275 -35885 13166 -32686 -83244
9053 -83244 -148208 -178264 77536 -211594 -49684 -101928 -241812 -56373 183827 -91232 -104610
9042a04610K6208j63194a1220l9819j4401L1427B23592d60570a30689j04898P9936
9031a55651a5997k11478D371h4188B2237J73211b5851j26188A05957d1541j29086
9020a70627D1588Q1855b98024H9451b09286B54885A26610O7191m6180B6813c73879
9008b50032A91122b16615q4764c6298J3504j30121H5350b61221A02748a21109
8997c55997A14695J79723B5558e5194A09153g3498Q134I3321g7824B44362F1796
8985b24558D35092F6297a11185j64221Q1949A4034a13955K2908A2112a80294j40151
8974c20445D7786L24684e24580I7365f3241j77869A08054e6232l8010A29533i435
8962b46204K7629J5960j5273a1750j60538O5810D33J52869b88014b175G5277g8554
$$ plain form
9042 -104610 -78402 -241596 -11220 -51039 -65440 -34013 223592 -460570 -130689 -235587 -155651
9031 -155651 -15997 -227475 4371 -84188 22237 195448 -25851 -152039 105957 -41541 -170627
9020 -170627 41588 123443 -298024 89451 -209286 254885 126610 193801 147621 26813 -373879
9008 -250032 191122 -216615 -301379 -36298 -22794 -152915 85350 -261221 102748 -121109
8997 -355997 114695 294418 25558 -55194 109153 -73498 -65364 93321 -77824 244362 61796
8985 -224558 435092 66297 -111185 -275406 -193457 14034 -113955 -91047 12112 -180294 -320445
8974 -320445 47786 372470 -524580 97365 -63241 -241110 108054 -56232 -94242 129533 -9435
8962 -246204 -218575 -202615 -217888 -11750 -172288 -106478 433 153302 -288014 -2175 75277 -78554
8949a20158A35213a04204A25851a19A47705a11034A4274o422i0500A26140i6762
8937d7772j81849A43136I735J74206a87321K5501e376k52887a19662f701l18532
8926c25233H9668J685a60442A39590E6727a49k16560B85741J422936p54054A15171
8914f9518a4206k51102a17322C77736A71741o1274d17064I005f7685F0663B7284
8902b04494P6192k4285R768f6862l60714f292I4213q43f5767H4742k6428d93742
8889A33261a93100R3531D9743a74218f5426A40435a77892B43660j08950a56449
8878a53171G500b04877H8018b08329c3575F1920B1461a28731G92K93891a06354
8866b48713B71012b30652d948k50609J17387B44939E7208k6708N6368k0020a70709
$$ plain form
8949 -120158 135213 -104204 125851 -119 147705 -111034 14274 7852 -90500 126140 -96762
8937 -47772 -229621 143136 9735 183941 -187321 -161820 -5376 -258263 -119662 -6701 -325233
8926 -325233 89668 91353 -160442 139590 56727 -149 -216709 285741 1708677 954623 115171
8914 -69518 -14206 -265308 -117322 377736 171741 110467 -417064 9005 -67685 60663 27284
8902 -204494 -128302 -152587 -142819 -66862 -427576 -6292 94213 93370 -65767 84742 58314 -493742
8889 133261 -193100 -99569 49743 -174218 -65426 140435 -177892 243660 134710 -156449
8878 -153171 7500 -204877 88018 -208329 -33575 61920 21461 -128731 792 294683 -106354
8866 -248713 271012 -230652 -4948 -255557 -138170 244939 57208 30500 86868 66848 -170709
8854a19451M1066A11687a84735B73663F6495J05550L7688b32458B01666e7694
8843C6742b58359O0598G0070a89923C9119h3049A01812k3557J03795b2395A85050
8831b2679r2447m87785e938B23895b2118j34481A31533a3421A25081b72060F9921
8819c07244d8805n4799M9340m06912g4853E5621B635K36678e1532A15675K20691
8808C36366b6618j00273c5705j11D3519L77320A18663J81758b6723k6281A53655
$$ plain form
8854 -119451 -78385 111687 -184735 273663 66495 172045 209733 -232458 201666 -57694
8843 36742 -258359 -197761 70070 -189923 39119 -83049 101812 78255 182050 -22395 185050
8831 -22679 -115126 -602911 -5938 223895 -22118 -156599 131533 -13421 125081 -272060 69921
8819 -307244 -48805 -103604 -54264 -461176 -74853 55621 2635 239313 -51532 115675 336366
8808 336366 -26618 -126891 -35705 -35816 43519 420839 118663 300421 -26723 -53004 153655
$$ [...]
##END NTUPLES=NMR SPECTRUM
##END=
