##TITLE=NES1087_JR_9885180_06UVmLNAy4
##JCAMPDX= 6.0         $$ Bruker NMR JCAMP-DX V2.0
##DATA TYPE= NMR SPECTRUM
##DATA CLASS= NTUPLES
##ORIGIN= BRUKER
##OWNER= Administrator
$$ 1.72 TOPSPIN		Version 2.1
$$ 2016-08-27 19:30:53.508 -0500  Administrator@X
$$ Compression mode = diff/dup
##.OBSERVE FREQUENCY= 400.02188249412
##.OBSERVE NUCLEUS= ^1H
##.ACQUISITION MODE= SIMULTANEOUS (DQD)
##.ACQUISITION SCHEME= undefined
##.AVERAGES= 8
##.DIGITISER RES= 22
##SPECTROMETER/DATA SYSTEM= spect
##.PULSE SEQUENCE= zg30
##.SOLVENT NAME= COFFEE_meoh
##.SHIFT REFERENCE= INTERNAL, COFFEE_meoh, 1, 14.98509
##AUDIT TRAIL= $$ (NUMBER, WHEN, WHO, WHERE, PROCESS, VERSION, WHAT)
$$ ##TITLE= Audit trail, TOPSPIN		Version 2.1
$$ ##JCAMPDX= 5.01
$$ ##ORIGIN= Bruker BioSpin GmbH
$$ ##OWNER= Administrator
$$ $$ E:\/data/COFFEE/nmr/NES1087_JR_9885180_06UVmLNAy4/20/pdata/1/auditp.txt
$$ ##AUDIT TRAIL=  $$ (NUMBER, WHEN, WHO, WHERE, PROCESS, VERSION, WHAT)
(   1,<2016-08-27 19:30:46.351 -0500>,<Administrator>,<X>,<go>,<TOPSPIN 2.1>,
      <created by zg
	started at 2016-08-27 19:29:40.054 -0500,
	POWCHK enabled, PULCHK disabled,
       configuration hash MD5:
       21 0F 79 D6 B3 7B B4 F6 88 20 88 DB 03 48 BD 9F
       data hash MD5: 64K
       B6 06 DF AD 92 F9 CC 3E A1 B2 24 44 1B 12 A7 19>)
(   2,<2016-08-27 19:30:49.476 -0500>,<Administrator>,<X>,<proc1d>,<TOPSPIN 2.1>,
      <Start of raw data processing
       efp LB = 0 FT_mod = 6 PKNL = 1 PHC0 = 0 PHC1 = 0 SI = 32K 
       data hash MD5: 32K
       9A 91 69 51 75 33 4A DD 5A 5A E3 1C B6 8E 83 50>)
(   3,<2016-08-27 19:30:49.758 -0500>,<Administrator>,<X>,<proc1d>,<TOPSPIN 2.1>,
      <pk PHC0 = 94.70764 PHC1 = 0 
       data hash MD5: 32K
       F8 CB 95 CD 3D 0D 39 84 A3 ED 04 79 54 9E 1E B2>)
(   4,<2016-08-27 19:30:49.883 -0500>,<Administrator>,<X>,<proc1d>,<TOPSPIN 2.1>,
      <abs ABSG = 1 
       data hash MD5: 32K
       E9 B5 A8 EB A2 3D AA 6B C3 0B CD 03 EB 87 97 EC>)
(   5,<2016-08-27 19:30:49.945 -0500>,<Administrator>,<X>,<proc1d>,<TOPSPIN 2.1>,
      <abs ABSG = 2 
       data hash MD5: 32K
       81 56 25 5E 74 FD 92 17 6D 49 89 62 16 98 36 D3>)
(   6,<2016-08-27 19:30:50.008 -0500>,<Administrator>,<X>,<proc1d>,<TOPSPIN 2.1>,
      <abs ABSG = 3 
       data hash MD5: 32K
       5D C2 76 04 49 96 A8 F3 E0 77 88 D2 32 01 C4 60>)
(   7,<2016-08-27 19:30:50.054 -0500>,<Administrator>,<X>,<proc1d>,<TOPSPIN 2.1>,
      <abs ABSG = 4 
       data hash MD5: 32K
       DE 12 55 F0 F6 1F 26 43 75 DF 68 77 29 F9 FC 85>)
(   8,<2016-08-27 19:30:50.117 -0500>,<Administrator>,<X>,<proc1d>,<TOPSPIN 2.1>,
      <abs ABSG = 5 
       data hash MD5: 32K
       B6 6E D4 2F 44 0C 49 AC CC 6C F6 47 9A 63 0F E3>)
$$ ##END=
$$ 
$$ $$ hash MD5
$$ $$ B2 74 72 18 10 A9 BC 70 FC 28 63 E2 B4 1D C1 2F
##$RELAX= 
##$RELAX= 
##$RELAX= 
##$RELAX= 
##$RELAX= 
##$RELAX= 
##$RELAX= 
$$ Bruker specific parameters
$$ --------------------------
##$DU= <E:\>
##$EXPNO= 20
##$NAME= <NES1087_JR_9885180_06UVmLNAy4>
##$PROCNO= 1
$$ [...]
150 150 150 150 150 150 150 150
##$TP07= 0
##$TPNAME0= <>
##$TPNAME1= <>
##$TPNAME2= <>
##$TPNAME3= <>
##$TPNAME4= <>
##$TPNAME5= <>
##$TPNAME6= <>
##$TPNAME7= <>
##$TPOAL= (0..7)
0.5 0.5 0.5 0.5 0.5 0.5 0.5 0.5
##$TPOFFS= (0..7)
0 0 0 0 0 0 0 0
##$TUNHIN= 0
##$TUNHOUT= 0
##$TUNXOUT= 0
##$USERA1= <user>
##$USERA2= <user>
##$USERA3= <user>
##$USERA4= <user>
##$USERA5= <user>
##$V9= 5
##$VALIST= <valist>
##$VCLIST= <CCCCCCCCCCCCCCC>
##$VD= 0
##$VDLIST= <DDDDDDDDDDDDDDD>
##$VPLIST= <PPPPPPPPPPPPPPP>
##$VTLIST= <TTTTTTTTTTTTTTT>
##$WBST= 1024
##$WBSW= 4
##$XGAIN= (0..3)
0 0 0 0
##$XL= 0
##$YL= 0
##$YMAX_a= 585201
##$YMIN_a= -488868
##$ZGOPTNS= <>
##$ZL1= 120
##$ZL2= 120
##$ZL3= 120
##$ZL4= 120
##$ABSF1= 14.98509
##$ABSF2= -5.573092
##$ABSG= 5
##$ABSL= 3
##$ALPHA= 0
##$AQORDER= 0
##$ASSFAC= 0
##$ASSFACI= 0
##$ASSFACX= 0
##$ASSWID= 0
##$AUNMP= <proc_prof1d_extract_pilot.lims>
##$AXLEFT= 0
##$AXNAME= <>
##$AXNUC= <1H>
##$AXRIGHT= 0
##$AXTYPE= 0
##$AXUNIT= <>
##$AZFE= 0.1
##$AZFW= 0.1
##$BCFW= 0
##$BC_mod= 0
##$BYTORDP= 0
##$COROFFS= 0
##$CY= 15
##$DATMOD= 1
##$DC= 0
##$DFILT= <>
##$DTYPP= 0
##$F1P= 0
##$F2P= 0
##$FCOR= 0.5
##$FTSIZE= 32768
##$FT_mod= 6
##$GAMMA= 0
##$GB= 0
##$INTBC= 1
##$INTSCL= 1
##$ISEN= 128
##$LB= 0
##$LEV0= 0
##$LPBIN= 0
##$MAXI= 10000
##$MC2= 0
##$MEAN= 0
##$ME_mod= 0
##$MI= 0
##$NCOEF= 0
##$NC_proc= -8
##$NLEV= 6
##$NOISF1= 0
##$NOISF2= 0
##$NSP= 0
##$NTH_PI= 0
##$NZP= 0
##$OFFSET= 14.98509
##$PC= 1
##$PHC0= 94.70764
##$PHC1= 0
##$PH_mod= 1
##$PKNL= yes
##$PPARMOD= 0
##$PPDIAG= 0
##$PPIPTYP= 0
##$PPMPNUM= 2147483647
##$PPRESOL= 1
##$PSCAL= 4
##$PSIGN= 0
##$PYNMP= <proc.py>
##$REVERSE= no
##$SF= 400.02
##$SI= 32768
##$SIGF1= 0
##$SIGF2= 0
##$SINO= 400
##$SIOLD= 32768
##$SPECTYP= <>
##$SREGLST= <1H.CDCl3>
##$SSB= 0
##$STSI= 32768
##$STSR= 0
##$SW_p= 8223.68421052631
##$SYMM= 0
##$S_DEV= 0
##$TDeff= 65536
##$TDoff= 0
##$TI= <>
##$TILT= no
##$TM1= 0
##$TM2= 0
##$TOPLEV= 0
##$USERP1= <user>
##$USERP2= <user>
##$USERP3= <user>
##$USERP4= <user>
##$USERP5= <user>
##$WDW= 1
##$XDIM= 32768
##$YMAX_p= 430979157
##$YMIN_p= -758299
##$CURPLOT= <Network HP LaserJet P1505>
##$CURPRIN= <$Network HP LaserJet P1505>
##$DFORMAT= <normdp>
##$LAYOUT= <+/1D_H.xwp>
##$LFORMAT= <normlp>
##$PFORMAT= <normpl>
##$SURQMSG= 1
$$ End of Bruker specific parameters
$$ ---------------------------------
##NTUPLES= NMR SPECTRUM
##VAR_NAME=  FREQUENCY,     SPECTRUM/REAL,   SPECTRUM/IMAG
##SYMBOL=    X,             R,               I
##VAR_TYPE=  INDEPENDENT,   DEPENDENT,       DEPENDENT
##VAR_FORM=  AFFN,          ASDF,            ASDF
##VAR_DIM=   32768,         32768,           32768
##UNITS=     HZ,            ARBITRARY UNITS, ARBITRARY UNITS
##FACTOR=    0.250966925370066, 1,           1
##FIRST=     8223.43324360094, -114038,      -106144
##LAST=      0,             -79752,          -156311
##MIN=       0,             -758299,         0
##MAX=       8223.43324360094, 430979157,    0
$$ Real data points
##PAGE= N=1
##DATA TABLE= (X++(R..R)), XYDATA
$$ [...]
19500a11330A07315a72504k9505F2799a06922C0015a20115c975B839K17450a51463
$$ -111330 107315 -172504 -202009 62799 -106922 30015 -120115 -3975 2839 220289 -151463
19488b29176e4383J3285B39971A14614b68862H49a81925n3193b6281A23865c7937
$$ -229176 -54383 -41098 239971 114614 -268862 849 -181925 -235118 -26281 123865 -37937
19476a22066A10859a5492r5277A24062l3653c68172c6724k25599A35648b40463
$$ -122066 110859 -15492 -110769 124062 90409 -368172 -36724 -262323 135648 -240463
19465f3968k06155J1834c3060l70832a21300j71928M7778A80187b592l44943a7950
$$ -63968 -270123 -258289 -33060 -403892 -121300 -293228 -245450 180187 -2592 -347535 -17950
19453b35974J11662a7302m6226j52674h0418l10671A79219b01438P854b6310k31217
$$ -235974 -124312 -17302 -63528 -216202 -80418 -391089 179219 -201438 -193584 -26310 -257527
19442b57527a60m6086B6456f7383r353A25935J80130a81177J0478B08603h6102
$$ -257527 -160 -46246 26456 -67383 -76736 125935 306065 -181177 -170699 208603 -86102
19430a5266D1271c45642J65894a112G1150B0560a83405A776i8585C15246b18562
$$ -15266 41271 -345642 -179748 -1112 71150 20560 -183405 1776 -98585 315246 -218562
19418c71502O9533G6a86331f8013c91A73517m8023b66057G2945c56653h9503A45202
$$ -371502 -301969 76 -186331 -68013 -391 173517 125494 -266057 72945 -356653 -89503 145202
19405A10004J42541h5791c7431A09376h5349F9326b39443B48080H6993a65563
$$ 110004 252545 -85791 -37431 109376 -85349 69326 -239443 248080 86993 -165563
19394h6587G5038a75207M218A20873h280k68497f7715k1178r567k6710A21045
$$ -86587 75038 -175207 -170989 120873 -8280 -276777 -67715 -88893 -98460 -125170 121045
19382B06050g7674c785m86255a61114j33023i2514J2676L1518C0073a71128r2775
$$ 206050 -77674 -3785 -490040 -161114 -294137 -92514 -79838 -48320 30073 -171128 -263903
19371b63903a3040A11925e8740r1556o2941F4009c50807E7455g4286B39211a36746
$$ -263903 -13040 111925 -58740 -150296 -213237 64009 -350807 57455 -74286 239211 -136746
19359B01107r0657h6949r4163B52344l0939b60463H9789J28025b50620p8257a28395
$$ 201107 110450 -86949 -181112 252344 221405 -260463 89789 217814 -250620 -328877 -128395
19347a49804A27550a66598P2391o0253N8396A13210b2706A53625a5798A47680
$$ -149804 127550 -166598 -94207 -154460 -96064 113210 -22706 153625 -15798 147680
19336E7924L40572c9914A28974e7258j47451J0404D631a21963A8365M31306a94201
$$ 57924 398496 -39914 128974 -57258 -204709 -194305 4631 -121963 18365 449671 -194201
19324A07992a19129k09560R6525F3698b01674g9574j68201P9382O5831d634B05968
$$ 107992 -119129 -328689 -232164 63698 -201674 -79574 -247775 -168393 -102562 -4634 205968
19312A20629a50323J0863d6558C5253a61097n0388P7913j4820a1625k19684n9982
$$ 120629 -150323 -139460 -46558 35253 -161097 -211485 -133572 -148392 -11625 -231309 -291291
19301b91291L2213Q9401P9399j28236c1908J2948j58320K6629K9827H5844O4905
$$ -291291 -259078 -169677 -90278 -218514 -31908 -18960 -177280 -150651 -120824 85844 150749
19290A50749b03471p7778f9475A19841f3590j55511A86118F6583b31893f8059
$$ 150749 -203471 -281249 -69475 119841 -63590 -219101 186118 66583 -231893 -68059
19279a90061Q679b7935p4539B5201i2715p1492j0531K8606k29577h1733j47100
$$ -190061 -181382 -27935 -102474 25201 -92715 -164207 -174738 -146132 -375709 -81733 -228833
19268b28833A03605h5883k85779A56815G1301P4928a75089j77074a21337a9066
$$ -228833 103605 -85883 -371662 156815 71301 146229 -175089 -352163 -121337 -19066
19257h6906o1276j67838d8097a5881D0973a69695n4447a03296G4897N8188j910
$$ -86906 -148182 -316020 -48097 -15881 40973 -169695 -224142 -103296 74897 133085 131175
19246A31175I644a83796j22097e7012A94085b5136A56430a6655m8537o3451A92596
$$ 131175 9644 -183796 -305893 -57012 194085 -25136 156430 -16655 -65192 -128643 192596
19234d8362m2716F4130L228J69079q3091a03787L8766C4762M3896B7645b1285
$$ -48362 -91078 64130 67358 236437 153346 -103787 -65021 34762 78658 27645 -21285
19222A78567D0972h0603k03257j3053a01850A3264g9491c4237k1958C06823L0170
$$ 178567 40972 -80603 -283860 -296913 -101850 13264 -79491 -34237 -56195 306823 336993
19211C36993i3483A77007b91710n8925a70692e7417k42838A62982K03332a87526
$$ 336993 -93483 177007 -291710 -350635 -170692 -57417 -300255 162982 366314 -187526
19200G5677J46425Q1615a15825B04625d795j02461j54789g0779K6786q9290M2765
$$ 75677 222102 303717 -115825 204625 -4795 -107256 -262045 -70779 -43993 -133283 -90518
19189i0518A07139a53993A3961a21441A69528a29178c0831l43a2618l29452q0442
$$ -90518 107139 -153993 13961 -121441 169528 -129178 -30831 -31174 -12618 -342070 -422512
19178d22512c5414r5849a5352A43757c8237l79479e9738A84872d5260N736f910
$$ -422512 -35414 -131263 -15352 143757 -38237 -417716 -59738 184872 -45260 -39524 -6910
19166D7130K58338A2106N95a27497D1966J6355a26013j59820c6349A33708c34304
$$ 47130 305468 12106 12701 -127497 41966 58321 -126013 -285833 -36349 133708 -334304
19154b4085l48954b3195j98710L8953B4880a14913r4057A83531D63c54736J54810
$$ -24085 -373039 -23195 -221905 -182952 24880 -114913 -208970 183531 463 -354736 -199926
19143a99926C9515b21390a02827E3998b3245N011j15663j15861d1105B1724b4053
$$ -199926 39515 -221390 -102827 53998 -23245 -18234 -133897 -249758 -41105 21724 -24053
19131c7006j57557E6149a95270e5033J7820k99591g9168j75954Q2568e1588j16273
$$ -37006 -194563 56149 -195270 -55033 -37213 -336804 -79168 -255122 -172554 -51588 -167861
19120a67861k6768F7517E488a19783c4761F8166h9779j1361C9361J51530a41363
$$ -167861 -194629 67517 5488 -119783 -34761 68166 -89779 -101140 39361 190891 -141363
19108g5817j0034A25540a74124g7475k75457A9622a24964F8317Q0505i443C31645
$$ -75817 -85851 125540 -174124 -77475 -352932 19622 -124964 68317 148822 -9443 331645
19096C33110A2101a95231G8534A9641a47342f8432l39064a75396E6776a50962
$$ 333110 12101 -195231 78534 19641 -147342 -68432 -407496 -175396 56776 -150962
19085A36086B5244b32793O2648J2873G341a88913l84616a74432b1404n1938A25987
$$ 136086 25244 -232793 -170145 -157272 7341 -188913 -573529 -174432 -21404 -73342 125987
19073A31281k824i0645J4654A05406b667C5818c18511a55791l2049O843B34829
$$ 131281 128457 -90645 -75991 105406 -2667 35818 -318511 -155791 -187840 -180997 234829
19061d8576k5793J6565H0005d8754m243o6655F4738J79152b76357J08232q1643
$$ -48576 -74369 -57804 80005 -48754 -52997 -119652 64738 243890 -276357 -168125 -249768
19050b49768R9167r826l5868M5816P559B50545F913b85473J38003a6149o7117
$$ -249768 -150601 -160427 -196295 -150479 -142920 250545 6913 -285473 -147470 -16149 -83266
19039h3266q8666a1900r1586l8560D3460K01539c4527A48346A6038P9995a55645
$$ -83266 -171932 -11900 -103486 -142046 43460 244999 -34527 148346 16038 96033 -155645
19027B08855d8714A60241F6247a71054J6169M8014j59597i274A5273b26104i8525
$$ 208855 -48714 160241 66247 -171054 -154885 -106871 -266468 -9274 15273 -226104 -98525
19015b30123p0920J27596c4384D2848K58959e3909B7428b4028a0025D48354a06452
$$ -230123 -301043 -173447 -34384 42848 301807 -53909 27428 -24028 -10025 448354 -106452
19003e912K599k77112J9226J20204g419j3749j36252e9810e692A18357a67114
$$ -5912 -3313 -280425 -261199 -140995 -7419 -21168 -157420 -59810 -5692 118357 -167114
18991a88267A00364M7202F882K7119a62567O2291D38377a92466M0742J2625q6469
$$ -188267 100364 147566 6882 34001 -162567 -100276 438377 -192466 -151724 -139099 -225568
18980b25568N3827D6465a68675m1746G7787J74863I7939L51968o1457B1214b26798
$$ -225568 -171741 46465 -168675 -210421 77787 252650 97939 449907 388450 21214 -226798
18968A94701n5733C3418K4579b23980r1147o1102J55499e1646b3434p1236j35368
$$ 194701 138968 33418 57997 -223980 -315127 -376229 -220730 -51646 -23434 -94670 -230038
18957b30038M7141c0802k04980P7176F355N4318J6418a70933h957B6889L04969
$$ -230038 -182897 -30802 -235782 -158606 6355 60673 77091 -170933 -8957 26889 331858
18946C31858f925m1440n7961p1361d0278J2174l51718a41192L4378A81265c3610
$$ 331858 -6925 -48365 -106326 -177687 -40278 -28104 -379822 -141192 -106814 181265 -33610
18934G6972J24723b72462j8995B27799H1523r915K48529i0182K268M2536E4984
$$ 76972 201695 -272462 -291457 227799 81523 71608 320137 -90182 -87914 -45378 54984
18922a36184m1100A01720a00516G6101b35718m728B54769b39627A89756J11782
$$ -136184 -177284 101720 -100516 76101 -235718 -240446 254769 -239627 189756 301538
18912C01538I0544K88742L44663k96285b95815c5394H076a01670B72130a51887
$$ 301538 90544 379286 723949 427664 -295815 -35394 8076 -101670 272130 -151887
18901d0713G2210b98086B37026h109l2121A10577d78559P4215a19144n4987B47745
$$ -40713 72210 -298086 237026 -8109 -40230 110577 -478559 -404344 -119144 -174131 247745
18889B08571a67445l2143C585O0434b21172O3536L8503B9054J4523a13859E6655
$$ 208571 -167445 -199588 3585 64019 -221172 -157636 -119133 29054 43577 -113859 56655
18877A2721d986I1806c77326a00044d1630B18863h2891L9466o9265Q795f305A06834
$$ 12721 -4986 91806 -377326 -100044 -41630 218863 -82891 -43425 -112690 -103895 -6305 106834
18864D50341A55935A7741D690a34839D2785a70978E05169b4265m6222A03631P9850
$$ 450341 155935 17741 4690 -134839 42785 -170978 505169 -24265 -70487 103631 183481
18853A83481a55990D37271c11787R6485A87025a66899B93918a32962C51711G4415
$$ 183481 -155990 437271 -311787 -215302 187025 -166899 293918 -132962 351711 74415
18842F631P1393b15215A6162b33854M8581m2460a6697j19045J9768A05430l2464
$$ 6631 78024 -215215 16162 -233854 -185273 -227733 -16697 -135742 -115974 105430 72966
18831G2966J98490c84840j9231e4329q763A20509n9950K11686b57028R2674B012
$$ 72966 271456 -384840 -404071 -54329 -63092 120509 60559 272245 -257028 -164354 2012
18819G5210B9439M1257e5495B17134b42522c2982g133o7112B45961b8596j67809
$$ 75210 29439 70696 -55495 217134 -242522 -32982 -7133 -74245 245961 -28596 -196405
18808a96405c9674A05540p573c4739C2994c1596o939D6238J0658g022C5362c80178
$$ -196405 -39674 105540 97967 -34739 32994 -31596 -38535 46238 56896 -7022 35362 -380178
18795i7554j00110j41329b7460j56470D7392a23851k20203a25159k10116C52143
$$ -97554 -197664 -338993 -27460 -183930 47392 -123851 -344054 -125159 -335275 352143
18784h7868F8460j4529b56951B8195d35568A11776b258k6125j60100p7684l4813
$$ -87868 68460 53931 -256951 28195 -435568 111776 -2258 -28383 -188483 -266167 -300980
18773c00980a1844j2033b039B55962F0784a97722B65404b49905A56707H63c343
$$ -300980 -11844 -23877 -2039 255962 60784 -197722 265404 -249905 156707 863 -3343
18761f0145q203j17408A56481P6910c14736g9917L8478k06685h7040A56690b1783
$$ -60145 -68348 -185756 156481 233391 -314736 -79917 -41439 -248124 -87040 156690 -21783
18749f2403A58943g6316A10840G875M0291e6174q3370r2389D5969a16412B62377
$$ -62403 158943 -76316 110840 7875 48166 -56174 -139544 -231933 45969 -116412 262377
18737E11203a02424M665j06346j35211J03280A5853f06912b06254j30526D5688
$$ 511203 -102424 -97759 -204105 -339316 -236036 15853 -606912 -206254 -336780 45688
18726G7900f3297F3036a75048B4580J8833b61147J02632F9946k014a43336j17927
$$ 77900 -63297 63036 -175048 24580 43413 -261147 -158515 69946 67932 -143336 -261263
18715b61263A0386g3708I0672a44051f9856j38573Q5710k2975O1957b6650n8730
$$ -261263 10386 -73708 90672 -144051 -69856 -208429 -122719 -145694 -83737 -26650 -85380
18704h5380b0204A07693P4985F2571a81529A87865b46996i8430c8574r8617j58696
$$ -85380 -20204 107693 182678 62571 -181529 187865 -246996 -98430 -38574 -137191 -295887
18693b95887A84296a71379C0598a24480r5448d1760l5391D3676Q3238b3586j34468
$$ -295887 184296 -171379 30598 -124480 -219928 -41760 -77151 43676 126914 -23586 -158054
18682a58054L0332A87540c2271k51554J34511A64444P2184a35269A53094f486
$$ -158054 -127722 187540 -32271 -283825 -149314 164444 236628 -135269 153094 -6486
18671c8343K715j09042F8681k0598c962l8554A24320E6598A8107h6950C8444b40219
$$ -38343 -35628 -144670 68681 48083 -3962 -42516 124320 56598 18107 -86950 38444 -240219
18658d0917A07836f1267L765j51741F1147d8046l27777J63543e1221B92623D6112
$$ -40917 107836 -61267 -57502 -209243 61147 -48046 -375823 -212280 -51221 292623 46112
18646b57244c1075o1644A97850g3712C52954b04035K517n8670i1938F0634J37419
$$ -257244 -31075 -92719 197850 -73712 352954 -204035 -201518 -260188 -91938 60634 198053
18635A98053r6988D494i3490n3484A63203N5063a60184N4294l2991K439E7830
$$ 198053 101065 4494 -93490 -146974 163203 218266 -160184 -105890 -138881 -136442 57830
18623f2331n1985c3261E9773K9691J39037a31461r0774j92104B24894c73314e809
$$ -62331 -114316 -33261 59773 89464 228501 -131461 -222235 -414339 224894 -373314 -5809
18611B2458a55766B84124G5436b99200a40623A47559b75593e9111B04813b44662
$$ 22458 -155766 284124 75436 -299200 -140623 147559 -275593 -59111 204813 -244662
18600a76587P4836k68120c1747j56173J6176L4867j14260p320p2982J32141C11612
$$ -176587 -101751 -369871 -31747 -187920 -171744 -136877 -251137 -258457 -331439 -199298 311612
18588F9373h0075D5488r183N032j8138J28499a7618E277J16447a88368B01445
$$ 69373 -80075 45488 36305 41337 23199 151698 -17618 5277 121724 -188368 201445
18576g170A05358a22529I0663B7719b00821B42240c15299o3648j56538b46511
$$ -7170 105358 -122529 90663 27719 -200821 242240 -315299 -378947 -535485 -246511
18565b68540J05930j00033i6943A85163a24576F4685a47375A36161a76201F692
$$ -268540 -162610 -262643 -96943 185163 -124576 64685 -147375 136161 -176201 6692
18554B10496g5232j49414B04878c32722A31945D227a60918j35222b8348d860p3301
$$ 210496 -75232 -224646 204878 -332722 131945 4227 -160918 -296140 -28348 -4860 -78161
18543g8161P403A88100b63028g2793H2889J62775b65188M756g3878A16961a25720
$$ -78161 -70758 188100 -263028 -72793 82889 245664 -265188 -260432 -73878 116961 -125720
18531b39563I7403c19582A3608%c09155J40256o6320e0903B1082d1620H5152D1297
$$ -239563 97403 -319582 13608 13608 -309155 -168899 -235219 -50903 21082 -41620 85152 41297
18518e4048A47973K36236j02753a25227J1602c5195a0868q14G9721b4560q2171
$$ -54048 147973 384209 281456 -125227 -113625 -35195 -10868 -11682 79721 -24560 -106731
18507a06731M8703A21966J68980a94053n1802l1866R7182B03418i2260k39210
$$ -106731 -58028 121966 290946 -194053 -245855 -277721 -180539 203418 -92260 -331470
18497c31470A95241a4446B30120d7962Q907n82367a54258A63929A340J29831e0368
$$ -331470 195241 -14446 230120 -47962 -39055 -621422 -154258 163929 1340 131171 -50368
18485C39439a91385Q2996j75262J25765H6930g080F3593J97839j7190b9907a3792
$$ 339439 -191385 -108389 -283651 -157886 86930 -7080 63593 261432 244242 -29907 -13792
18473d6243B2053K20493b14031k2110f5764j00391A4073a65934q3250C95576j95341
$$ -46243 22053 242546 -214031 -236141 -65764 -166155 14073 -165934 -249184 395576 200235
18462B00235a74681C22421c90834C9302a53082J1531N3627m7030L6174l946A6753
$$ 200235 -174681 322421 -390834 39302 -153082 -141551 -87924 -134954 -98780 -102726 16753
18450B6608P922J37512a75228l8053A52746k6571a50514N7950n6877a6694k1492
$$ 26608 34530 172042 -175228 -213281 152746 126175 -150514 -92564 -149441 -16694 -38186
18439c8186C4202b43272f2700h701m7816A54710D4824J13098a44100j26106J21576
$$ -38186 34202 -243272 -62700 -8701 -56517 154710 44824 157922 -144100 -270206 -148630
18428a48630j31394A9995a09454A19524B6406a01646A01502g2068k24711Q8575
$$ -148630 -280024 19995 -109454 119524 26406 -101646 101502 -72068 -296779 -208204
18418b08204e5308A23845Q8312a81970d2318a661B45833C2808K2147a87741D6657
$$ -208204 -55308 123845 212157 -181970 -42318 -1661 245833 32808 54955 -187741 46657
18406A7332c95880A1172a47220f0253K2979A42681J71744A44955c20389A05438
$$ 17332 -395880 11172 -147220 -60253 -37274 142681 314425 144955 -320389 105438
18395E4561a04136e1567D8047a18168j31277A19473d0101B09596A01690a87772
$$ 54561 -104136 -51567 48047 -118168 -249445 119473 -40101 209596 101690 -187772
18384b9796C4566J71312c7103j16330B12477a64219E3555h7484m2530j33815L2278
$$ -29796 34566 205878 -37103 -153433 212477 -164219 53555 -87484 -130014 -263829 -231551
18373b31551b0275l2683G9414m068a08474G2554a19584E1216e9916B56424j18918
$$ -231551 -20275 -52958 79414 75346 -108474 72554 -119584 51216 -59916 256424 137506
18362A37506j0013l3212J74601d7526A23270d5909D6124a08514J7302I4984b3281
$$ 137506 127493 94281 268882 -47526 123270 -45909 46124 -108514 -91212 94984 -23281
18350a44395O8800j4587j57788e9834I714a95418j33826j9209a666l86654a84117
$$ -144395 -75595 -90182 -247970 -59834 9714 -195418 -329244 -348453 -1666 -388320 -184117
18338H4915L4581o802b71113A6738f8718R662p414B18341Q1708A25403b17758
$$ 84915 119496 112694 -271113 16738 -68718 -59056 -66470 218341 300049 125403 -217758
18326a57157O5678C87475A0871a2422p168j00797M4291K4229j12161l2017f7793
$$ -157157 -91479 387475 10871 -12422 -19590 -120387 -76096 -51867 -164028 -196045 -67793
18314a66750q4867B38323f9174J8835a7658m9657i543A33b5332A51194E4077b96063
$$ -166750 -251617 238323 -69174 -50339 -17658 -67315 -9543 133 -25332 151194 54077 -296063
18301d69810A07925f4348F1006b40181F1682J03929m8496A9339H297a00710A03668
$$ -469810 107925 -64348 61006 -240181 61682 165611 117115 19339 8297 -100710 103668
18289H6223k9226G608c12860a35146A69733E7872i5145A2491d2966A38720E4904
$$ 86223 56997 7608 -312860 -135146 169733 57872 -95145 12491 -42966 138720 54904
18277G0061c55166E223b02160P7484q3006A57888P1345B3439O4479d68694a21097
$$ 70061 -355166 5223 -202160 -124676 -207682 157888 229233 23439 87918 -468694 -121097
18265H793a13653A79951h0358A5172a05633H6420C3527b86563E5859N8577B4386
$$ 8793 -113653 179951 -80358 15172 -105633 86420 33527 -286563 55859 114436 24386
18253d26048K07920q891F8504g3662j59279B03588H2477a51630Q94A45713a73920
$$ -426048 -218128 -227019 68504 -73662 -232941 203588 82477 -151630 -150736 145713 -173920
18241c80572A70620q086b92313A04622b13706I4829a12301q477j9956n1878B05831
$$ -380572 170620 162534 -292313 104622 -213706 94829 -112301 -120778 -140734 -192612 205831
18229A4970d3269B33227I9742J1827E108K18976m2777C4990a22755C34661a12339
$$ 14970 -43269 233227 99742 111569 5108 224084 181307 34990 -122755 334661 -112339
18217A66871a35861j53227b0348R556e83n6582b105p4399D00946I2905b56781
$$ 166871 -135861 -289088 -20348 -10792 -583 -57165 -2105 -76504 400946 92905 -256781
18205b66990J11667b418k91192O0596g9736I307e3132c191B3550R8383e0331d04
$$ -266990 -155323 -2418 -293610 -233014 -79736 9307 -53132 -3191 23550 121933 -50331 -404
18192c96870D1337j5284K5147M1536b18791A18663a48439d5125m1914j77834O7315
$$ -396870 41337 26053 51200 92736 -218791 118663 -148439 -45125 -87039 -264873 -197558
18181a97558b4898G6660a02126H7345c5806l0002a1411G8684b27888a06765b5145
$$ -197558 -24898 76660 -102126 87345 -35806 -65808 -11411 78684 -227888 -106765 -25145
18169B83760A34605a98938l7680B65496I3339J01079a8041k33756e4803g590p0939
$$ 283760 134605 -198938 -236618 265496 93339 194418 -18041 -251797 -54803 -7590 -78529
18158g8529k84788J06110D3358b04832D0157J62411r6961b76634B87104A1536
$$ -78529 -363317 -257207 43358 -204832 40157 202568 105607 -276634 287104 11536
18147d1240D1915a2569B67b12731N9582l2116F9539a30057O032o9470J4416A96881
$$ -41240 41915 -12569 267 -212731 -153149 -185265 69539 -130057 -124025 -193495 -179079 196881
18134C74731a18894k03931J16445A09586J14535C8779b39505l3478g9099m02635
$$ 374731 -118894 -322825 -206380 109586 224121 38779 -239505 -272983 -79099 -481734
18124d81734i2013N656L9548G8867e8242k9612a4316q3379A20396f6018r8885
$$ -481734 -92013 -86357 -46809 78867 -58242 -87854 -14316 -97695 120396 -66018 -164903
18113a64903H5539R5936d0755j7869H8300B702e9104j62093k0282A66287C869
$$ -164903 85539 181475 -40755 -58624 88300 2702 -59104 -221197 -241479 166287 3869
18101A99966O7434d12503c7439j50601m3475g7083B5375d39717H7431a96810O5097
$$ 199966 267400 -412503 -37439 -188040 -231515 -77083 25375 -439717 87431 -196810 -131713
18090a31713A93137o9638J4950a33514A14271i5526c3467A53688a47737B7218
$$ -131713 193137 123499 138449 -133514 114271 -95526 -33467 153688 -147737 27218
18079F7992J03530C1396a95889R5099B90121e4179C6405M2492g1649A39695c5934
$$ 67992 171522 31396 -195889 -100790 290121 -54179 36405 78897 -71649 139695 -35934
18067A47216d30636a12163C5798a48195d2569G0577R4486p6711a84556B22816
$$ 147216 -430636 -112163 35798 -148195 -42569 70577 165063 88352 -184556 222816
18056c61964J00161A03b3658B46517Q0962A18041c2558n2995J9570j3422B06719
$$ -361964 -261803 103 -23658 246517 327479 118041 -32558 -85553 -65983 -79405 206719
18044g9299H1834A3093a15054G3408b7259A1386K45894j24148a4078j24654d9635
$$ -79299 81834 13093 -115054 73408 -27259 11386 257280 133132 -14078 -138732 -49635
18032a0275A77860a08040k5060B37112c20117G1579a15927l9914c0200j53892
$$ -10275 177860 -108040 -133100 237112 -320117 71579 -115927 -155841 -30200 -184092
18022a84092M2452a2600k62478A44826d7881E6885J31844A7190J14026c38855
$$ -184092 -141640 -12600 -275078 144826 -47881 56885 188729 17190 131216 -338855
18011A6189K45194a435j47961r6248A16976a86889F254h0253j37557B81762g2923
$$ 16189 261383 -1435 -149396 -245644 116976 -186889 6254 -80253 -217810 281762 -72923
17999b25298B09377E042Q4870a3733j00706E3627Q0147o5959e0021A10169a22213
$$ -225298 209377 5042 89912 -13733 -114439 53627 133774 67815 -50021 110169 -122213
17987E1331f2096H7455b8506H9604b46837D21733A15386R3490H0563C5400a4099
$$ 51331 -62096 87455 -28506 89604 -246837 421733 115386 208876 80563 35400 -14099
17975D9635P3499m8009B2462K65583A32974J5405n7091J08262D9745J71858a16300
$$ 49635 123134 75125 22462 288045 132974 148379 91288 199550 49745 221603 -116300
17963b51286F7934R9586c6136k11661e3473k03486A25645d334A41412L01114H9819
$$ -251286 67934 167520 -36136 -247797 -53473 -256959 125645 -4334 141412 442526 89819
17951b88469E8332a14232g922n0057A37734F6360c81943A61864a4609D9635K3259
$$ -288469 58332 -114232 -7922 -57979 137734 66360 -381943 161864 -14609 49635 72894
17940G2894K1764b1944D498a78601a832A00709J16121a51752I0434A6770Q4282
$$ 72894 94658 -21944 4498 -178601 -1832 100709 216830 -151752 90434 16770 101052
17929A01052C404a35192C31413G2472O2180i5536J080b7872j35631A26412d9079
$$ 101052 3404 -135192 331413 72472 134652 -95536 -94456 -27872 -163503 126412 -49079
17917a02568o643a6472B55818a5069A68162K6829G9094b405A8109b72443B03850
$$ -102568 -109211 -16472 255818 -15069 168162 194991 79094 -2405 18109 -272443 203850
17905b6809B29516r0639a68759H02K61243A8379J10910D5790Q5247J4783b83395
$$ -26809 229516 138877 -168759 802 262045 18379 129289 45790 131037 145820 -283395
17893D8269g9185K3715l4553l7992b614E8761Q9569n9418a51909O8807p1173R284
$$ 48269 -79185 -55470 -90023 -128015 -2614 58761 148330 88912 -151909 -83102 -154275 -144991
17881a44991B37750a31254B37074a27728A34979b08093f2507n58818A73930f0311
$$ -144991 237750 -131254 237074 -127728 134979 -208093 -62507 -621325 173930 -60311
17870A32313m4141J97186G4838a29460O181J9962D6718J3135h949A7073J35150
$$ 132313 88172 285358 74838 -129460 -123279 -103317 46718 59853 -8949 17073 152223
17859A52223m0963N8340D2564b6241l36972A68324E2110Q262N8388n3385a3849
$$ 152223 111260 169600 42564 -26241 -363213 168324 52110 60372 118760 65375 -13849
17847C4059b33997A08046P959b3196B34763l7190b21029R8014N6732E0902f3277
$$ 34059 -233997 108046 116005 -23196 234763 197573 -221029 -123015 -66283 50902 -63277
17835B37205G0673f2462A00027b18382A61214J43714f4691K6376A27458A2540
$$ 237205 70673 -62462 100027 -218382 161214 304928 -64691 -38315 127458 12540
17824C37100G8162c7593J4262k48305A96987J29332a26871J5876L7916r6378e639
$$ 337100 78162 -37593 -23331 -271636 196987 326319 -126871 -110995 -73079 -169457 -5639
17812e2909A5809K67755D559N3293O0045b4203j79755g2976C10678i8627A16099
$$ -52909 15809 283564 4559 57852 117897 -24203 -203958 -72976 310678 -98627 116099
17800c368A77253B1392d3388j92115c950G7172Q3278n4252J75181b40123b8952
$$ -3368 177253 21392 -43388 -235503 -3950 77172 160450 106198 281379 -240123 -28952
17788A90130a07086k7100A29390m7236C8195M846J27825f3743H5770J02066p8817
$$ 190130 -107086 -134186 129390 82154 38195 43041 170866 -63743 85770 187836 109019
17777A09019c2468A70978p4111J11558j7227E7468J23312c832j25805k1669d3334
$$ 109019 -32468 170978 96867 208425 191198 57468 180780 -3832 -129637 -151306 -43334
17765a24608D0203a4226k29841F1388O2058g3486D38450A29343A7501J6299A6280
$$ -124608 40203 -14226 -244067 61388 123446 -73486 438450 129343 17501 33800 16280
17753b49607B2218N7152L46644f1212A48570l7222b0210B09467a37566C2901J09317
$$ -249607 22218 79370 426014 -61212 148570 111348 -20210 209467 -137566 32901 142218
17742A42218b38006B17978A03678L3797J45319c16003A48745f2993B76654a2075
$$ 142218 -238006 217978 103678 137475 282794 -316003 148745 -62993 276654 -12075
17731A32073L51302A2298L59421j41874D9062h4719A31812A8806H809f0902A26244
$$ 132073 483375 12298 371719 229845 49062 -84719 131812 18806 8809 -60902 126244
17719a01106A11678m2411J02932b9525j18732C336J02186N1945p0974c5859B69242
$$ -101106 111678 69267 172199 -29525 -148257 3336 105522 157467 86493 -35859 269242
17707a66948C0576J13251N6705A3488c0363B52989A7675b06303P9909K6128G2959
$$ -166948 30576 143827 200532 13488 -30363 252989 17675 -206303 -126394 -100266 72959
17695H248K76279p7533J71463d8567n0152A74018F530J48403g2756B35450P483
$$ 8248 284527 206994 378457 -48567 -98719 174018 6530 154933 -72756 235450 242933
17684B42933j05137Q5653J88501j73320k7128g4006P574M695C4598a36234k2088
$$ 242933 137796 223449 411950 238630 211502 -74006 -66432 -61737 34598 -136234 -158322
17673a58322f2121C0548K11334D8585L51500A02817k1102B9968O6853a77712B82939
$$ -158322 -62121 30548 241882 48585 400085 102817 81715 29968 96821 -177712 282939
17661g2809B26631a7457C91530c3169A4356J49719l9481j8582A4071f5532A7118
$$ -72809 226631 -17457 391530 -33169 14356 164075 124594 106012 14071 -65532 17118
17649A00142L9304a12332N5766A60091B1953O6398J1708A2873P0151a20956B97318
$$ 100142 139446 -112332 -56566 160091 21953 88351 100059 12873 83024 -120956 297318
17637b8513D24060F3895a97935B54776J0309N3439m2094j26954K47806H7875b2455
$$ -28513 424060 63895 -197935 254776 265085 318524 276430 149476 397282 87875 -22455
17625D2356a29110B31869J24059j60364J78154b00607B52158I2467J75289L0808
$$ 42356 -129110 231869 355928 195564 373718 -200607 252158 92467 267756 298564
17615B98564j18683K76009l6205E3307L8634K4041J47469r904H6871B3368b3785
$$ 298564 179881 455890 419685 53307 91941 115982 263451 253547 86871 23368 -23785
17603a80858A61533J63886a13331b5673G104J29604b77313E1524K40846c3328
$$ -180858 161533 325419 -113331 -25673 7104 136708 -277313 51524 292370 -33328
17592C80293a88225B86145i704A94915p7503J20267J3759g9598A86454k1424J6454
$$ 380293 -188225 286145 -9704 194915 117412 237679 251438 -79598 186454 165030 181484
17581A81484J15497J63899I5701L7822N203O2372H8697J39619e7519C15053A12944
$$ 181484 296981 460880 95701 133523 138726 201098 88697 228316 -57519 315053 112944
17569F8787L3212K3664j3728L08314d3401o0349L6032F9031b06578B7183M3185
$$ 68787 101999 125663 111935 420249 -43401 -103750 -67718 69031 -206578 27183 70368
17558G0368J93396j28033N1159n8621J94530b62569A4027J0356J56892k1580K78989
$$ 70368 263764 135731 186890 128269 322799 -262569 14027 24383 181275 159695 438684
17547D38684C6973K68962E3758L22940F5730K12825C2418J19708C0517K76943
$$ 438684 36973 305935 53758 376698 65730 278555 32418 152126 30517 307460
17537C07460j01144J55578m7413j42873l5085J65777m3473K83727k30343M61653
$$ 307460 206316 361894 314481 171608 136523 302300 258827 542554 312211 773864
17527G73864C78965J06757J40972L53950k92133j05987L5947j70400k06878J34320
$$ 773864 378965 485722 626694 980644 688511 582524 618471 448071 241193 375513
17517C75513a17529E5208J88595R8913J56453R0092p7075L82074P3441n3240K83278
$$ 375513 -117529 55208 243803 342716 499169 589261 512186 894260 967701 914461 1197739
17506A197739n86434K8091l04949j35258K83983B25561E8809J58577R7746g1363
$$ 1197739 611305 639396 334447 199189 483172 225561 58809 217386 315132 -71363
17495D10055q2479K3240m5916r5892J1221j8668K5385n7353J96724A79142R8656
$$ 410055 327576 350816 304900 209008 220229 201561 226946 169593 366317 179142 277798
17484B77798r9153j2301K6381n0990M58935k76984E1343J22669M18389k21119
$$ 277798 178645 166344 192725 141735 600670 323686 51343 174012 592401 371282
17474C71282j36921o9029D5260J99474N6574R2392m2655K0444P0601C9457P9387
$$ 371282 234361 165332 45260 244734 301308 393700 351045 371489 442090 39457 118844
17463A18844M95576A78242Q3877n3449a44476j2435A69648J02256I1926P2214
$$ 118844 614420 178242 262119 208670 -144476 -156911 169648 271904 91926 164140
17453A64140K93624A71323J5573Q9915j4963J20916j88072L61710k07587M4599
$$ 164140 457764 171323 186896 276811 261848 382764 194692 556402 348815 393414
17443C93414O1968A18126d168C96970A91481K54619R3682j73605H5762K95533
$$ 393414 455382 118126 -4168 396970 191481 446100 539782 366177 85762 381295
17433C81295e9319B56576n715K4439o9727K2260l2937G5918L75736r6033I2661
$$ 381295 -59319 256576 250861 275300 205573 227833 194896 75918 451654 355621 92661
17421C22416p162N7802j55482j03395K19166A57332L26526A92077J02647I8358
$$ 322416 315254 373056 217574 114179 333345 157332 483858 192077 294724 98358
17410A82193N8213J27559F7022K87487J8376A56864J74486G1262a9715D17753
$$ 182193 240406 367965 67022 354509 372885 156864 331350 71262 -19715 417753
17399c145C53986J32096E3387J01849J99652j8363m7146A33664M10164k40829
$$ -3145 353986 486082 53387 155236 354888 336525 289379 133664 543828 302999
17389C02999N1471J42843H5766K08545J47381j15543p5671A09349C3114J13127
$$ 302999 354470 497313 85766 294311 441692 326149 250478 109349 33114 146241
17379A46241L52298A13181a61018C61751M7909A76272H7713K78811J23988o0776
$$ 146241 498539 113181 -161018 361751 409660 176272 87713 366524 490512 429736
17369D29736O2008j21892A78979n6554n1996L60281A51651f2194B35999O3935
$$ 429736 491744 369852 178979 122425 70429 430710 151651 -62194 235999 299934
17359B99934r3357L4879i426B7088J51738R0946j3669l0127L703p02a9614B74524
$$ 299934 206577 241456 -9426 27088 178826 269772 256103 225976 229679 228977 -19614 274524
17346A66069J21179A39324L53001I5871K80907j45787A12682K03696j7621M6018
$$ 166069 287248 139324 492325 95871 376778 230991 112682 316378 298757 344775
17336C44775E8166J37886q504K83269j61064P765K20193d5622B51256n1795K08594
$$ 344775 58166 196052 187548 470817 309753 317518 537711 -45622 251256 199461 408055
17325D08055G9994L23665k0568D7084K77682j21717I0385J40887J0335m8229A285
$$ 408055 79994 403659 383091 47084 324766 203049 90385 231272 241607 193378 1285
17313E46985F2586J81454J19988j14785H8176J72955A13829N6155G482M40831
$$ 546985 62586 244040 364028 249243 88176 261131 113829 169984 7482 448313
17303D48313I9766i7766C92309j72104R54m7514K2362N6111I5404M66914j22660
$$ 448313 99766 -97766 392309 220205 221159 173645 196007 252118 95404 562318 439658
17292D39658B02025n324o5501f9643B11702K51708q4091q1215j28721l2206K02667
$$ 439658 202025 196701 131200 -69643 211702 463410 379319 298104 169383 137177 339844
17281C39844j4691K0752K19490B09443F3760R0885M1912k0117O8682Q8930A51020
$$ 339844 325153 345905 565395 209443 63760 154645 196557 176440 245122 334052 151020
17269D36058J9216G3983K85455o375j34244j07689N15739F7401L23863m0454Q1461
$$ 436058 455274 73983 359438 353063 218819 111130 626869 67401 391264 350810 432271
17258D32271a08057A62358K25340B5199J68524I3341J57178A10476K89914J06137
$$ 432271 -108057 162358 387698 25199 193723 93341 250519 110476 400390 506527
17248E06527A41813J62296O0926l5674J48611r5073J22799k07542J98627A88312
$$ 506527 141813 304109 365035 329361 477972 382899 505698 298156 496783 188312
17237A78111A1508L76401J40779k0366A53070O40245l92506A70679K51792M0791
$$ 178111 11508 387909 528688 508322 153070 793315 400809 170679 422471 463262
17227D63262j31124M0055A83334N62919B86284J94290j66008K50043A81502M59846
$$ 463262 332138 372193 183334 746253 286284 480574 314566 564609 181502 641348
17217F41348j47390k4146j37685J59389o8248L7178J58005L352O4832l36303K36560
$$ 641348 493958 469812 332127 491516 423268 460446 618451 621803 686635 350332 586892
17206E86892k76402j00377M05397B11520L08363m2460N1905j45281J658n542l1438
$$ 586892 310490 210113 615510 211520 519883 477423 529328 384047 385705 380163 348725
17195C48725M0512p6243R6309K07409j97253A46683M1030L05678j08533P9921
$$ 348725 389237 312994 409303 616712 419459 146683 187713 493391 384858 464779
17185D64779N1022r4378E0863L84034J52599j44440L24269l52359L7199J56797
$$ 464779 515801 421423 50863 434897 587496 443056 767325 414966 452165 608962
17175F08962j02208L1194j57173K80897k0376B66693K44048L8688L2940n2686
$$ 608962 506754 537948 380775 661672 641296 266693 510741 549429 582369 529683
17165E29683K37304C20660L58284l16479N8202K39198B11200M91734C02798K89019
$$ 529683 766987 320660 678944 362465 420667 659865 211200 702934 302798 591817
17155E91817j29921l72n5011P5777j5125Q6603R905O3874o6657k10736H8459O11129
$$ 591817 461896 461524 406513 482290 467165 553768 563673 627547 560890 350154 88459 699588
17143F99588o5158j94154O479N5344P160r7547K97259j59389K78568B88741K84488
$$ 699588 634430 440276 446755 502099 509259 411712 708971 549582 828150 288741 573229
17132E73229j02023K98683k83352K63149n1543j99055L8582K3726j52832Q1527
$$ 573229 471206 769889 486537 749686 698143 499088 537670 561396 408564 490091
17122D90091K64173m8712K32703D41975L86864j48660K82810l14590r2148R7246
$$ 490091 754264 705552 938255 441975 828839 680179 962989 648399 556251 653497
17112F53497K1924J95102j95740k2208J61158j90761j50248K12059p6831K88805
$$ 653497 675421 870523 674783 652575 813733 622972 472724 684783 607952 896757
17102H96757j64649L07315k55319j93433J38920J93325l83494K54906j43491l642
$$ 896757 732108 1039423 784104 590671 729591 922916 539422 794328 650837 647195
17092F47195L05609k8456J24535l99051k46959L6716K46810j45320k977K63996
$$ 647195 952804 924348 1048883 649832 402873 439589 686399 541079 538102 802098
17082H02098B54455N39212L00766m69567J63191J58732k49954J27779R0811q6876
$$ 802098 254455 793667 1094433 624866 788057 946789 696835 824614 915425 828549
17072H28549j03742K53409J6488l34314J86889l2422J44098k88466K01779k40555
$$ 828549 724807 978216 994704 660390 847279 814857 958955 670489 872268 631713
17062F31713M63210l50349J58167j24635R4634K14439j58407k79052L8463N09829
$$ 631713 1094923 744574 902741 778106 872740 1087179 928772 649720 688183 1198012
17052A198012l80937j28662J42691r0019J45448j75665n2865J82745O8309j24976
$$ 1198012 817075 688413 831104 741085 886533 710868 658003 840748 909057 784081
17042G84081l4945j56493M56880K59603k89246n4526J0717p5920J69926J04388
$$ 784081 749136 592643 1049523 1309126 1019880 965354 976071 900151 1070077 1174465
17032A174465j84852J4255J3983J52175l14296J22219J97686k63028j12619J52856
$$ 1174465 989613 1003868 1017851 1170026 855730 977949 1175635 912607 799988 952844
17022I52844K77619k65723n7591J08773K49948O7544n78600M94340k32848K59382
$$ 952844 1230463 964740 907149 1015922 1265870 1333414 754814 1249154 1016306 1275688
17012A275688o07645L71404J30779K46090k97835l04592K97294j25107J42612
$$ 1275688 668043 1039447 1170226 1416316 1118481 813889 1111183 986076 1128688
17003A128688L59125k56184j7189m3916K86036p0223N9671K2204k97680J11017
$$ 1128688 1487813 1231629 1214440 1170524 1456560 1386337 1446008 1468212 1170532 1281549
16993A281549J11492L22357k63526n9935j31903Q3375K15880K34738l12442q7044
$$ 1281549 1393041 1715398 1451872 1391937 1260034 1343409 1559289 1794027 1481585 1394541
16983A394541M14499n22048r8265J52487n5290N34733n8322k69978M8461J91861
$$ 1394541 1809040 1286992 1188727 1341214 1285924 1820657 1762335 1492357 1540818 1732679
16973A732679j53490j3475K93904k03889j99873K30706J05308J47977l35627r6997
$$ 1732679 1579189 1565714 1859618 1655729 1455856 1686562 1791870 1939847 1604220 1507223
16963A507223J61215J51474k62002O6064J00000j90565L25284R6905k01811K5533
$$ 1507223 1668438 1819912 1557910 1623974 1723974 1533409 1858693 1955598 1753787 1779320
16953A779320m8509K80495j29635K9497J06513J73950l36553r1814K70898j12259
$$ 1779320 1730811 2011306 1881671 1911168 2017681 2191631 1855078 1763264 2034162 1921903
16943A921903J79961K21250n58075L74159J04456j67454J28365j05215K64562
$$ 1921903 2101864 2323114 1765039 2139198 2243654 2076200 2204565 2099350 2363912
16934B363912J66853m93319K24245J26700j25613j61030J13014j0610m8477K3181
$$ 2363912 2530765 2037446 2261691 2388391 2262778 2101748 2214762 2204152 2155675 2178856
16924B178856M63425k73589K72282J5359j69562N2605O5654J11984p3752J25549
$$ 2178856 2642281 2368692 2640974 2656333 2486771 2539376 2605030 2717014 2643262 2768811
16914B768811K54934l49464N0117J62008l209J36502j5002k9368j77830P3463
$$ 2768811 3023745 2674281 2724398 2886406 2883197 3019699 3004697 2975329 2797499 2870962
16904B870962j57335N01694l98258K62619J80966j16195q6858J14641M54822k15632
$$ 2870962 2713627 3215321 2817063 3079682 3260648 3144453 3057595 3172236 3627058 3411426
16894C411426j47744J29496o4850k32454N31214l2980J9747J42802R7359J80437
$$ 3411426 3263682 3393178 3328328 3095874 3627088 3594108 3613855 3756657 3854016 4034453
16884D034453j73517K5605J2383q1022n28949R21292k72853R0230J3693K77732
$$ 4034453 3860936 3886541 3898924 3817902 3288953 4210245 3937392 4027622 4041315 4319047
16874D319047l38848K23619K32665M67126j36453l96959K14496m1265K93480K28701
$$ 4319047 3980199 4203818 4436483 4903609 4767156 4370197 4584693 4543428 4836908 5065609
16864E065609j72078j95711K88637K4499j7153Q6968M50417k62249J72613J03371
$$ 5065609 4893531 4697820 4986457 5010956 4993803 5080771 5531188 5268939 5441552 5544923
16854E544923j6740L68061l50089M94689r4691n5448j5709M94089k34110K57860
$$ 5544923 5528183 5896244 5546155 6040844 5946153 5890705 5874996 6369085 6134975 6392835
16844F392835K563P4633J50772M95629k66111K33896j76961K85900O77746j63372
$$ 6392835 6395398 6470031 6620803 7116432 6850321 7084217 6907256 7193156 7870902 7707530
16834G707530P2696k77028J343K39928M61012O1942K61095L7858K48595J86500
$$ 7707530 7780226 7503198 7504541 7744469 8205481 8267423 8528518 8566376 8814971 9001471
16824I001471J05887o793L68307R2642m9674M55834K51039N8760J42248J89052
$$ 9001471 9107358 9100565 9468872 9561514 9511840 9967674 10218713 10277473 10419721 10608773
16814A0608773R4505K63789K63907P2779J99907O22685P2695L15374L50249K78691
$$ 10608773 10703278 10967067 11230974 11303753 11503660 12126345 12199040 12514414 12864663 13143354
16804A3143354m8977N71033O0455Q42777j03461L27986J67104O30825K93585K52611
$$ 13143354 13094377 13665410 13725865 14568642 14465181 14793167 14960271 15591096 15884681 16137292
16794A6137292M43847M57426Q1155O46468O53110K24629K74010L87734Q35699
$$ 16137292 16581139 17038565 17119720 17766188 18419298 18643927 18917937 19305671 20141370
16785B0141370N75022Q8793O26036N72581N03800O63214P30712J17336Q19585
$$ 20141370 20716392 20805185 21431221 22003802 22507602 23170816 23901528 24018864 24838449
16776B4838449R28567J53973J270118N88362N87125J102902M05082Q67803J311302
$$ 24838449 25767016 25920989 27191107 27779469 28366594 29469496 29874578 30742381 32053683
16767C2053683O81373R56762Q95566J111227R31477R40097J130521J023796J585578
$$ 32053683 32735056 33691818 34587384 35698611 36630088 37570185 38700706 39724502 41310080
16758D1310080N57834J499670J451257R72683J432414J395980J491920J344857
$$ 41310080 41867914 43367584 44818841 45791524 47223938 48619918 50111838 51456695
16750E1456695J486339J917452J357611J135731K055549J310349J246805J779689
$$ 51456695 52943034 54860486 56218097 57353828 59409377 60719726 61966531 63746220
16742F3746220J730758J515761J518119J910670J172831J907785J312252J829555
$$ 63746220 65476978 66992739 68510858 70421528 71594359 73502144 74814396 76643951
16734G6643951J172140J030537J811756J150048Q93627J107577R22964O57421
$$ 76643951 77816091 78846628 80658384 81808432 82702059 83809636 84732600 85390021
16726H5390021N69836P13891M39754J59540N91266n1124n62517m10265k02671
$$ 85390021 85959857 86673748 87113502 87273042 87864308 87813184 87250667 86840402 86637731
16717H6637731n44403m42714r74258q51322j125108j147894j098717j127962j627174
$$ 86637731 86093328 85650614 84676356 83825034 82699926 81552032 80453315 79325353 77698179
16708G7698179j353320j507211j434330j486937j348710j590289j706013j176810
$$ 77698179 76344859 74837648 73403318 71916381 70567671 68977382 67271369 66094559
16700F6094559j661707j715679j708097j570682j370749j907855j426568j144038
$$ 66094559 64432852 62717173 61009076 59438394 58067645 56159790 54733222 53589184
16692E3589184j652776j652614j335156j278086j331258j005949j440971j248388
$$ 53589184 51936408 50283794 48948638 47670552 46339294 45333345 43892374 42643986
16684D2643986j148507j193747j210432r68590j218949o49028j045185r01680
$$ 42643986 41495479 40301732 39091300 38122710 36903761 36254733 35209548 34307868
16676C4307868q37178j218538q13821k06995j597858n87099q12576p44438m80524
$$ 34307868 33470690 32252152 31438331 31231336 29633478 29046379 28233803 27489365 27008841
16667B7008841o83945q70107p51233j3923r06993m98413j92399j008523m61417
$$ 27008841 26324896 25454789 24703556 24689633 23782640 23284227 23091828 22083305 21621888
16658B1621888q21015k03744n63141m74268l41875n29266l18185n17170m60102
$$ 21621888 20800873 20597129 20033988 19559720 19217845 18688579 18370394 17853224 17393122
16649A7393122j53812k69305n10057m36551k48955l16602j62331p24351q0793
$$ 17393122 17239310 16970005 16459948 16023397 15774442 15457840 15295509 14571158 14490365
16640A4490365k05736k90109m96591N6624o31257m0070l36772m95469K34905l46237
$$ 14490365 14284629 13994520 13497929 13554553 12923296 12883226 12546454 12050985 12285890 11939653
16630A1939653k55691l05938o5204k15476k21604j78534m29438N0679k13738k7980
$$ 11939653 11683962 11378024 11312820 11097344 10875740 10697206 10267768 10318447 10104709 10076729
16620A0076729j07897l03911O9998m86995J48217n9043m54959j28926j5623J5012
$$ 10076729 9968832 9664921 9734919 9247924 9396141 9337098 8882139 8753213 8737590 8752602
16610H752602m02781m02734R9383l9792k00017J33438l16567k47157o3554r8029
$$ 8752602 8349821 7947087 8046470 8006678 7806661 7940099 7623532 7376375 7312821 7214792
16600G214792j03105o7712j97806j23093O5453j85917l41482L46472k51975l46613
$$ 7214792 7111687 7043975 6846169 6723076 6788529 6602612 6261130 6607602 6355627 6009014
16590F009014J70872j66511L25509m17433r177j10527j6900k73486J30249o8151
$$ 6009014 6179886 6013375 6338884 5921451 5912274 5801747 5784847 5511361 5641610 5573459
16580E573459p3556o7153l23574L5574j44224O6612J38913l38387j5274K76431
$$ 5573459 5499903 5432750 5109176 5144750 5000526 5067138 5206051 4867664 4852390 5128821
16570E128821j68217k30519j18590K50659j22482j54853k6734k6263k6993m56693
$$ 5128821 4960604 4730085 4611495 4862154 4739672 4584819 4558085 4531822 4504829 4048136
16560D048136J33284k19925K78410q4590k08757K50409J9484j66012l17313K47826
$$ 4048136 4181420 3961495 4239905 4155315 3946558 4196967 4216451 4050439 3733126 3980952
16550C980952l79520L14059r8938p7645j00875N4357m39514N23202j77366J2498
$$ 3980952 3601432 3915491 3816553 3738908 3638033 3692390 3252876 3776078 3598712 3611210
16540C611210k68104n2523k5323m1874l7397K36531M4262l21140m9039r8244K87959
$$ 3611210 3343106 3290583 3265260 3223386 3185989 3422520 3466782 3145642 3096603 2998359 3286318
16529C286318n6429m33838L63224l45600R2262L83168m36130q3117L4379j56748
$$ 3286318 3229889 2796051 3159275 2813675 2905937 3289105 2852975 2769858 2804237 2647489
16519B647489L49326p3784l22094J29400k59717K69137k11044k50618N56812j37605
$$ 2647489 2996815 2923031 2600937 2730337 2470620 2739757 2528713 2278095 2834907 2697302
16509B697302k48049M40427j91906k00593K23766l46457j50702O7985J39660k4035
$$ 2697302 2449253 2889680 2697774 2497181 2720947 2374490 2223788 2291773 2431433 2407398
16499B407398l33165M38630n14900O30473l36737o7649l6301L07239n96344L48494
$$ 2407398 2074233 2512863 1997963 2628436 2291699 2224050 2187749 2494988 1898644 2247138
16489B247138R7351m39922M32108l71416j43297K19196J39840j99415L70220n10474
$$ 2247138 2344489 1904567 2336675 1965259 1821962 2041158 2180998 1981583 2351803 1841329
16479A841329K95649Q8921m83304M12402j51365j28861M7107m8301J48113O6597
$$ 1841329 2136978 2225899 1742595 2154997 2003632 1874771 1921878 1873577 2021690 2088287
16469B088287k89734k9649m9711j04455N34039q26288M56907j71472N74290l95402
$$ 2088287 1798553 1768904 1719193 1614738 2148777 1322489 1779396 1607924 2182214 1786812
16459A786812J53673j75160k06893R0681K09801k56766o1109L33433j39072j14247
$$ 1786812 1940485 1765325 1558432 1649113 1858914 1602148 1541039 1874472 1735400 1621153
16449A621153K8071L41757n54212J91519Q0836o5317k59709K51335k70602J44434
$$ 1621153 1649224 1990981 1436769 1628288 1709124 1643807 1384098 1635433 1364831 1509265
16439A509265m539k25247K0334M8264R1759J93308J23984M9765l18047m5939J31971
$$ 1509265 1504726 1279479 1299813 1348077 1439836 1633144 1757128 1806893 1488846 1442907 1574878
16428A574878k78441J14965J02895m79127M73101k73041j4040K76176j30350l1549
$$ 1574878 1296437 1411402 1514297 1035170 1508271 1235230 1221190 1497366 1367016 1335467
16418A335467O7885k02878k8554K69358k5340j73894o0401K71836p399j36696
$$ 1335467 1403352 1200474 1171920 1441278 1415938 1242044 1181643 1453479 1446080 1309384
16408A309384K93236n26887M06799L9023k34858j73345j19577J55092K019k274
$$ 1309384 1602620 1075733 1482532 1521555 1286697 1113352 993775 1148867 1150886 1148612
16398A148612j61191K56239j70412P8198q0242J74309r8627l7392K2447K81809
$$ 1148612 987421 1243660 1073248 1151446 1071204 1245513 1146886 1109494 1131941 1413750
16388A413750m67685M6811k14368L79358j95394L71135l74482J12271o9347K64407
$$ 1413750 946065 992876 778508 1157866 962472 1333607 959125 1071396 1002049 1266456
16378A266456k6854j33089l49711K50802Q6315J7116p537K18717l28744j0504
$$ 1266456 1239602 1106513 756802 1007604 1093919 1111035 1103498 1322215 993471 982967
16368I82967J97510k34973L4611j17874O0553J19293j77686K73804q4375k10566
$$ 982967 1180477 945504 980115 862241 922794 1042087 864401 1138205 1053830 843264
16358H43264M0813L5471j71579J10489j42828L21202l27413L77402l9218k3136
$$ 843264 884077 919548 747969 858458 715630 1036832 709419 1086821 1047603 1024467
16348A024467L2370k33952J18965L065q102j01781k823j02908K51468Q79K9745
$$ 1024467 1056837 822885 941850 944915 936813 835032 832209 729301 980769 981648 1011393
16337A011393k71876l2007K47986J30501j95349l98405L50400P8061J19437m70271
$$ 1011393 739517 707510 955496 1085997 890648 492243 842643 920704 1040141 569870
16327E69870M12315j62969m04891N46267J5773k6323D69674L00194B47418Q25442
$$ 569870 982185 819216 414325 960592 976365 950042 469674 769868 247418 1072860
16317A072860m36405K50631l29467J51831L23424j94171k40484K68038J61176
$$ 1072860 636455 887086 557619 709450 1032874 838703 598219 866257 1027433
16308A027433k22768R8693C96428J74134K4317J19163J07586K9803K3008r8074
$$ 1027433 804665 903358 396428 570562 594879 714042 821628 851431 874439 776365
16298G76365k36801k49854K87596j37007K28645K8684O249K4717n3943B58755
$$ 776365 539564 289710 577306 440299 668944 697628 703877 728594 674651 258755
16287D01715K66193M6253J23076m08385J89301J23873L0379j31906K14331C83684
$$ 401715 667908 714161 837237 428852 618153 742026 772405 640499 854830 383684
16276G25812o6606k44039m4398M83743C64158A46693N52515J91808k56680k16632
$$ 725812 659206 415167 370769 854512 364158 146693 699208 891016 634336 417704
16266D17704L71014o4663r0685K61910l27685N530K2592J65240l12815F1173O71178
$$ 417704 788718 724055 633370 895280 567595 573125 595717 760957 448142 61173 732351
16255G32351l44831N22100l53211p2929g1145F49947B89920L03606l4010O5368
$$ 732351 387520 909620 556409 483480 -71145 649947 289920 593526 559516 624884
16245F24884j49362K90609C27899K40660K34838j43964j24964m6266j2521L0277
$$ 624884 475522 766131 327899 568559 803397 659433 534469 488203 475682 505959
16235E05959H2291P39515l14711O2903k7277M8255k4490k16739L18727m5883K3448
$$ 505959 82291 821806 507095 569998 542721 590976 566486 349747 668474 622591 646039
16224F46039k98746P2558l4337j28988M73337l39933K10950j83794K63330C31827
$$ 646039 347293 419851 385514 256526 729863 389930 600880 417086 680416 331827
16213C12180P021J20462A17332M64156k63277J94302k38519L55708n9113p7268
$$ 312180 319201 439663 117332 581488 318211 512513 273994 629702 570589 493321
16203D93321J00443D8211M83788k37588M0492j1979p8778j1411e1351E01239k23969
$$ 493321 593764 48211 531999 294411 334903 322924 244146 232735 -51351 501239 277270
16192B77270J90920J29740m5562B22958D8386K19639L3382J08403J30414m2647
$$ 277270 468190 597930 552368 222958 48386 268025 301407 409810 540224 497577
16182D97577j03949m0296A01150J44349J62576M7857Q121k13359M3669J64999
$$ 497577 393628 353332 101150 245499 408075 455932 464053 250694 294363 459362
16172D59362n7121j59195K26101j44647J58002o6174j70531J01640N8723J47910
$$ 459362 402241 243046 469147 324500 482502 416328 245797 347437 406160 554070
16162E54070j04482M3322B02552g5460B62294M5129J24522A60964N33163k84730
$$ 554070 449588 492910 202552 -75460 262294 307423 431945 160964 694127 409397
16152D09397j10934j29865L9400H3283P4109P8143K05031j67611l8893j13376
$$ 409397 298463 168598 207998 83283 157392 235535 440566 272955 234062 120686
16142A20686K21656n6200j15778J35619A23623K29535R46j61976R0199Q9583e1881
$$ 120686 342342 286142 170364 305983 123623 353158 354104 192128 282327 371910 -51881
16130A92186L32535K483J84339l27113r1916r4412J27997A60631K71476j16072
$$ 192186 524721 527204 711543 384430 292514 198102 326099 160631 432107 316035
16120C16035A33851M82309A05267J53613M0039A05363J63098D637L68640p3702
$$ 316035 133851 616160 105267 258880 298919 105363 268461 4637 373277 299575
16110B99575C0679K56789K05L15492B94759j26457J87481l7151o1816J63263k0203
$$ 299575 30679 287468 287673 603165 294759 168302 355783 318632 256816 420079 399876
16099C99876j69285J63341r5267q6971a02176C1352M04875A79311D4225c6363
$$ 399876 230591 393932 298665 211694 -102176 31352 436227 179311 44225 -36363
16088C07381D2356L14785j12284A298L06588a01326B51447J7896p217A30126M372
$$ 307381 42356 357141 244857 1298 307886 -101326 251447 269343 262126 130126 134498
16077A34498K48149a17139B64954P5808A24204J79185j17549g2005B44969J0839
$$ 134498 382647 -117139 264954 340762 124204 303389 185840 -72005 244969 255808
16067B55808J34199H5061M5977J96519L7816c5614B7389K02300a05338C09560
$$ 255808 390007 85061 131038 327557 365373 -35614 27389 229689 -105338 309560
16056A84532O9333b6257D3874L12516K30373A44495L2139D5585O0403J07214K18671
$$ 184532 253865 -26257 43874 356390 586763 144495 176634 45585 105988 213202 431873
16045D31873j07005e7027F0947M68677D8206K60694i210B80184J94505k20468
$$ 431873 324868 -57027 60947 529624 48206 308900 -9210 280184 474689 254221
16035B54221R6187A58030J49389R744A56240a17476F8601j2966c1525r8507c5152
$$ 254221 350408 158030 307419 317163 156240 -117476 68601 55635 -31525 -130032 -35152
16023C3321K99107H3793A3484a40531B00855K0714L37756A71661J76116c49439
$$ 33321 332428 83793 13484 -140531 200855 221569 559325 171661 347777 -349439
16012A1513a90332B18842r0339M7825D3008K76020J58554i2361A08903N0183a55616
$$ 11513 -190332 218842 128503 176328 43008 319028 477582 -92361 108903 159086 -155616
16000A99752k5412A3118K02570I1996J11929O7990m1094K10285e3786A75073J22310
$$ 199752 174340 13118 215688 91996 203925 271915 230821 441106 -53786 175073 297383
15989B97383M59043J94483L43307l6397L17060j30560l79217l82984l9303a358
$$ 297383 756426 950909 1294216 1257819 1574879 1444319 1065102 682118 642815 -1358
15978e3781B53448q6404i0874A12632K36083j64611K1832a0479G3817J23943a60190
$$ -53781 253448 167044 -90874 112632 348715 184104 205936 -10479 73817 197760 -160190
15966B0245Q8421c81416i5878B3965h2600G0793J63695Q2566j30111K60984A20920
$$ 20245 108666 -381416 -95878 23965 -82600 70793 234488 317054 186943 447927 120920
15954A82315a47340L7523j36162H0027b21563A23074a77572h7397d1249m7328
$$ 182315 -147340 -109817 -245979 80027 -221563 123074 -177572 -87397 -41249 -88577
15944h8577E7802R3160K43482r6382K3920D2099a72467l6931f3529A69598O6324
$$ -88577 57802 150962 394444 298062 321982 42099 -172467 -209398 -63529 169598 235922
15933B35922m7221G6476K81755q3052a73470M4896e1719r2246I732b5103I7771
$$ 235922 188701 76476 358231 275179 -173470 -128574 -51719 -143965 9732 -25103 97771
15921B56752m964a09231B92423c0110B59219a46602B41610K12951a89267Q8716
$$ 256752 251788 -109231 292423 -30110 259219 -146602 241610 454561 -189267 -100551
15911a00551r3496C32076b59915Q7557A036a59471C27215h6322A3443P4432J29579
$$ -100551 -194047 332076 -259915 -172358 1036 -159471 327215 -86322 13443 87875 217454
15900B17454b8066j25925A3955L60310a36173H8525b79586C64405a9084B7364
$$ 217454 -28066 -153991 13955 374265 -136173 88525 -279586 364405 -19084 27364
15889B42474c84286A12463m9775K3698a28209q9349A23653L02180c03127B81966
$$ 242474 -384286 112463 62688 86386 -128209 -217558 123653 425833 -303127 281966
15878f300k04458D3701k789d2592C544K3382i7077j4876A15298K12536E9991a48812
$$ -6300 -210758 43701 40912 -42592 3544 26926 -97077 -111953 115298 327834 59991 -148812
15865A04693P3154d28715r4144a78425j5105D7698N4385m7500a17353B27144a44131
$$ 104693 177847 -428715 -522859 -178425 -193530 47698 102083 54583 -117353 227144 -144131
15853c5548D3070h1331B37284g1985K8327c471k03795g7293l7081F4248J33327
$$ -35548 43070 -81331 237284 -71985 -43658 -3471 -207266 -77293 -114374 64248 197575
15842A97575l6996F3705J31158b7977C8497i0364E3978O3868R7055N5804A02597
$$ 197575 160579 63705 194863 -27977 38497 -90364 53978 117846 214901 270705 102597
15830d6454A25621e4901A90890C5793A0109c7537j9557j96839B20058n8793b83483
$$ -46454 125621 -54901 190890 35793 10109 -37537 -57094 -253933 220058 161265 -283483
15818e9997O823k4131l5707l151E1038R1215m8138A2552a50302D47672A13a094
$$ -59997 -53174 -77305 -113012 -116163 51038 142253 94115 12552 -150302 447672 113 -1094
15805D0170g6782F2625K32470A42603F5696M0667f7139A21K32596b0216H7432
$$ 40170 -76782 62625 295095 142603 65696 106363 -67139 121 232717 -20216 87432
15793H0486h0842B02193A4948A407L55616d9912C88444b12534O0409j46756B44396
$$ 80486 -80842 202193 14948 1407 357023 -49912 388444 -212534 -152125 -298881 244396
15781F1393a15342A87678a37455B6262M6780B9295c2264B02521b5199j05065G3082
$$ 61393 -115342 187678 -137455 26262 73042 29295 -32264 202521 -25199 -130264 73082
15769H2489a88281B8410L44126A49154G1323i7640A163J42102c31634B26868c36977
$$ 82489 -188281 28410 372536 149154 71323 -97640 1163 143265 -331634 226868 -336977
15757B4580f1069A56949K044L41449A48086b17570C6485M14620C7636K88630A3484
$$ 24580 -61069 156949 158993 500442 148086 -217570 36485 451105 37636 326266 13484
15745B64949E539O4957k1129J15074l6129b88119B0609L16002C7624J7374M9858
$$ 264949 5539 70496 49367 164441 128312 -288119 20609 336611 37624 54998 104856
15734A04856K66176a5901B17381h9656m9457j36963Q835C10160E2450b47720E7117
$$ 104856 371032 -15901 217381 -89656 -139113 -276076 -267241 310160 52450 -247720 57117
15722G3805l1117Q7680g2204A76228a90264e9177k7081m4051F2939J41062P8808
$$ 73805 42688 130368 -72204 176228 -190264 -59177 -86258 -130309 62939 204001 282809
15711B82809E2238c7785j59186B44958C5507a80585k200P3297A09835i0808b8899
$$ 282809 52238 -37785 -196971 244958 35507 -180585 -182785 -109488 109835 -90808 -28899
15699A866a74409k88297a17669d0498J5713A36910F7181g4491A31952k7357k1960
$$ 1866 -174409 -462706 -117669 -40498 -24785 136910 67181 -74491 131952 104595 82635
15688H2635J14817q6377c8887B7625g9269B93471A27892a56684B5662K92414d5883
$$ 82635 197452 111075 -38887 27625 -79269 293471 127892 -156684 25662 318076 -45883
15676b7187A91274g7336k141G8740K68039b03858B7935L53073C3711K61233G6533
$$ -27187 191274 -77336 -79477 78740 346779 -203858 27935 381008 33711 294944 76533
15664I7690D2655j5641i6359c5050m10905a97452h3157B02601a4389p4204a9264
$$ 97690 42655 27014 -96359 -35050 -445955 -197452 -83157 202601 -14389 -88593 -19264
15652h1585p151n066c3440A89421a01991A17092b60182e1212j0523C32006E0342
$$ -81585 -88736 -93802 -33440 189421 -101991 117092 -260182 -51212 -61735 332006 50342
15640C39870e2665k35399D3664a6847A06303P8344b78275F4286o421b72403F9779
$$ 339870 -52665 -288064 43664 -16847 106303 184647 -278275 64286 57865 -272403 69779
15628a40790o7850b5340j8631q3407j04080A58646k6135b60207a14035j03491
$$ -140790 -208640 -25340 -43971 -127378 -231458 158646 132511 -260207 -114035 -217526
15618b17526b3631k12170A59620g4469A92535q4218b68914a13062A14990L086
$$ -217526 -23631 -235801 159620 -74469 192535 108317 -268914 -113062 114990 118076
15608A18076N0077l7923a29057f0618o3469o0771Q862j5585R0596k37503a5633
$$ 118076 168153 130230 -129057 -60618 -124087 -184858 -175996 -191581 -100985 -338488 -15633
15596c7635j36041A88878b20972A17804m7321h2759E6845J87411b21858B1558
$$ -37635 -173676 188878 -220972 117804 70483 -82759 56845 244256 -221858 21558
15585B54977j13498p0388a60617f208E7365B5632c54551l12276I7682a08099C00319
$$ 254977 141479 71091 -160617 -6208 57365 25632 -354551 -666827 97682 -108099 300319
15573D2757h9044f751k0887A16471g7723C52137j40911C1641Q2472a90042k5723
$$ 42757 -89044 -6751 -27638 116471 -77723 352137 211226 31641 114113 -190042 -215765
15562b15765R3845c9721E8618j3961c59901d5055B5999L52855b38314A53628a46427
$$ -215765 -121920 -39721 58618 44657 -359901 -45055 25999 378854 -238314 153628 -146427
15550b77081E6523a86938m2560c3998r8665A62049G7280j5383J59582b05305F2399
$$ -277081 56523 -186938 -229498 -33998 -132663 162049 77280 61897 221479 -205305 62399
15538B09422a0191E3112J90091C627J06956b97283a30794d9062I3266C6920e8550
$$ 209422 -10191 53112 243203 3627 110583 -297283 -130794 -49062 93266 36920 -58550
15526a99673J8953A67481a15588I971a8367D28953H1043e5348r3246M8623A68963
$$ -199673 -180720 167481 -115588 9971 -18367 428953 81043 -55348 -148594 -99971 168963
15514A94925d7482n1643A59215l8173a95996B98003A42142L9713A2935f2522j56636
$$ 194925 -47482 -99125 159215 121042 -195996 298003 142142 181855 12935 -62522 -219158
15503b19158A31988J77846B4469J88376o4566K02115I1193J56040a44614A79087
$$ -219158 131988 309834 24469 212845 148279 350394 91193 247233 -144614 179087
15492B6224L38303a14359A7297O9177M2894g4160j12371C11765C6447M3989a23331
$$ 26224 364527 -114359 17297 86474 129368 -74160 -186531 311765 36447 80436 -123331
15480i3850A50116m9022k2180a60253F84378N6126l38729K2276J09754A50586
$$ -93850 150116 101094 78914 -160253 684378 740504 401775 424051 533805 150586
15469c83814c5437o9984b1396n3294a3040I8345b31551A65832b9379j3992r0973
$$ -383814 -35437 -105421 -21396 -74690 -13040 98345 -231551 165832 -29379 -43371 -134344
15458a34344A39582J61927I0637b34951H2715J11148K0152Q859l8799L1249d9903
$$ -134344 139582 301509 90637 -234951 82715 193863 214015 222874 184075 215324 -49903
15446A25805K38550P4181j59757K09919P99071l66430j2734C28465A30795A0848
$$ 125805 364355 438536 278779 488698 1287769 921339 908605 328465 130795 10848
15435C0977A3804K37029P142h9658C2862L3526a62492B82313g8330A51623a23937
$$ 30977 13804 250833 257975 -89658 32862 66388 -162492 282313 -78330 151623 -123937
15423I320O989g3058B07082a43590E0727i4395A7377J2474d20j59542D28501a69761
$$ 9320 16309 -73058 207082 -143590 50727 -94395 17377 29851 -420 -159962 428501 -169761
15410G2392R0640A1194K2796A2385L48328b09267d1159A37992b2354I5505A5560
$$ 72392 163032 11194 33990 12385 360713 -209267 -41159 137992 -22354 95505 15560
15398a94264A45963J32732A14608a0953B4915b82517a00691L6494I3937J26309
$$ -194264 145963 278695 114608 -10953 24915 -282517 -100691 -64197 93937 220246
15388B20246G6323J67168r8958l9133O8258J80011C5612K2146K63942A02706k6582
$$ 220246 76323 243491 144533 105400 173658 353669 35612 57758 321700 102706 76124
15377G6124a65453A9610J50508M1054K03360G55k89J39762K61747a22699A79176
$$ 76124 -165453 19610 170118 211172 414532 755 466 140228 401975 -122699 179176
15365A80295K43079d9604B16242a9076C22221R5843A9125L28518b26232e1784
$$ 180295 423374 -49604 216242 -19076 322221 418064 19125 347643 -226232 -51784
15354C19740j14954c1293j18412A40187h1901D28650b07326C45470B9620K44524
$$ 319740 204786 -31293 -149705 140187 -81901 428650 -207326 345470 29620 274144
15344B74144J87598j63086I6081J33161R3422r295j35114M1267p7961L5515p5457
$$ 274144 461742 298656 96081 229242 322664 313369 178255 219522 141561 177076 101619
15333A01619l9721L67575j50210h5420j14811B11965a19988C11914h437B44308
$$ 101619 61898 429473 279263 -85420 -200231 211965 -119988 311914 -8437 244308
15322d3136B19576A4141K33202F6397J54539G4458P0221J23002B9230a54396j41970
$$ -43136 219576 14141 247343 66397 220936 74458 144679 267681 29230 -154396 -296366
15311b96366A60134L32823c5314B71190j3581a07093A38013L9144a10287A12309
$$ -296366 160134 492957 -35314 271190 257609 -107093 138013 177157 -110287 112309
15300D7521c15975E2169g7630k19329G848d5171r6529c6337c861A24048J24271
$$ 47521 -315975 52169 -77630 -296959 7848 -45171 -141700 -36337 -3861 124048 248319
15289B48319a61258c9786E3678P3656A1934J07570l9686Q2438a05328L4086j6896
$$ 248319 -161258 -39786 53678 127334 11934 119504 79818 162256 -105328 -71242 -88138
15278h8138L7678H5041b12965B53880A6754O2797c37468b2728o4467l5515C2181
$$ -88138 -50460 85041 -212965 253880 16754 79551 -337468 -22728 -87195 -122710 32181
15266c12364L8845h0554k41019A50448D7643J0436d5073B35434a88492H071Q0478
$$ -312364 -273519 -80554 -321573 150448 47643 58079 -45073 235434 -188492 8071 88549
15255H8549M5648K24271a47763E6848J59399p6856J50717r3669l2467f771A84949
$$ 88549 134197 358468 -147763 56848 216247 139391 290108 196439 163972 -6771 184949
15243F79332P25029k49958K697j24100l32099B65803L521C4834K29941Q1020E1223
$$ 679332 1404361 1154403 1157100 1033000 700901 265803 269324 34834 264775 345795 51223
15231B55729a29536r166J67A54392D5416P2752a8807l8189B02492j00457Q1512
$$ 255729 -129536 -138702 -138535 154392 45416 118168 -18807 -56996 202492 102035 183547
15220A83547a13521B55579i157A39748k9025C0461J66300a427q852p3546o0267
$$ 183547 -113521 255579 -9157 139748 110723 30461 196761 -1427 -10279 -83825 -144092
15209a44092F6917j2943a85353o0894D3558b50434A79474A5658J05337n2632H488
$$ -144092 66917 53974 -185353 -246247 43558 -250434 179474 15658 120995 68363 8488
15197C1687a22213B71632I7992a12456j9574A31490g2495k00707B03491J3814
$$ 31687 -122213 271632 97992 -112456 -132030 131490 -72495 -273202 203491 217305
15187B17305I2191i1702D7074J6909a69743B49313o8099i4837B42114G4407B4243
$$ 217305 92191 -91702 47074 63983 -169743 249313 181214 -94837 242114 74407 24243
15175D02932A87824B0928J44261i1612D0407a25110A61983p3151b37657A4751
$$ 402932 187824 20928 165189 -91612 40407 -125110 161983 88832 -237657 14751
15164H5180L0451f567B19394J35888j05055B1556g280n1131B92204E2198L3519
$$ 85180 115631 -6567 219394 355282 250227 21556 -7280 -58411 292204 52198 85717
15153H5717a73531D37916a118A24653P9607j0886j1664H0122L4074B1143J83712
$$ 85717 -173531 437916 -1118 124653 204260 193374 181710 80122 114196 21143 204855
15142B04855a4963k04906c9656I3274L1136A0944K07079J52682f6932A93932R5880
$$ 204855 -14963 -219869 -39656 93274 124410 10944 218023 370705 -66932 193932 289812
15131B89812N9725j24481k4541K08980A96502m0218e6816H2091N5372K15997r3869
$$ 289812 349537 225056 200515 409495 196502 156284 -56816 82091 137463 353460 259591
15120B59591D802L66596O6131A84769j6367J16864a15582A64641J74352B874b16156
$$ 259591 4802 371398 437529 184769 168402 285266 -115582 164641 338993 2874 -216156
15108B84792E7115A0617M4553d1466A16497i1455F9914i5583C31400f1389K2979
$$ 284792 57115 10617 55170 -41466 116497 -91455 69914 -95583 331400 -61389 -38410
15097c8410A91069J40587j43463A3439g2589D6379N54279l2369A36263E8991h3052
$$ -38410 191069 331656 188193 13439 -72589 46379 600658 568289 136263 58991 -83052
15085D2994i0886r774C64994j30268f8860B35089J37233F698R050K0282K10974
$$ 42994 -90886 -100660 364994 234726 -68860 235089 372322 6698 15748 36030 247004
15074B47004a56765B04864P1465I9961a91913c9393B64581J91940a42600A38493
$$ 247004 -156765 204864 276329 99961 -191913 -39393 264581 456521 -142600 138493
15063A66616l5895L16H596J45122J86245Q912H2439L57599j45345l061R5866A62230
$$ 166616 130721 131037 8596 153718 339963 348875 82439 440038 294693 291632 387498 162230
15050F5191K59301q3626L00139B66963A2289P4717L4039Q1960K39257j98501J89312
$$ 65191 324492 240866 541005 266963 12289 87006 121045 203005 442262 243761 433073
15039D33073K6790j80430E8916J84906C12J75691b4029A009926C59614J20546
$$ 433073 459863 279433 58916 243822 312 176003 -24029 1009926 359614 480160
15029D80160m7981J43514j33260J6178K54578C29172Q7765m327q5806M3891j1752
$$ 480160 432179 575693 442433 458611 713189 329172 416937 412610 326804 370695 358943
15018C58943A48855N87624B36649K39988J06753B70416L35561q5701j31858q2070
$$ 358943 148855 736479 236649 476637 583390 270416 605977 520276 388418 306348
15008C06348P7774A51008L55041j79577J21010A20751J79137K8610j38446L61501
$$ 306348 384122 151008 506049 326472 447482 120751 299888 328498 190052 551553
14998E51553B21281K34455R1635A39261J45103L4376m7958J97722J4990m8459
$$ 551553 221281 455736 547371 139261 284364 318740 270782 468504 483494 435035
14988D35035o4585A30762L31903N065B15616K08118q620N45746m4250l6384j68498
$$ 435035 370450 130762 462665 467730 215616 423734 415114 960860 916610 880226 711728
14977G11728J03635l29640K2343k13225L24938Q560j37K29496k22061j78895N5767
$$ 711728 815363 485723 508066 294841 619779 628339 628202 857698 635637 456742 512509
14966E12509a29373C21411J0203J02987j14230K09138j14133A30793K46106j56410
$$ 512509 -129373 321411 331614 434601 320371 529509 415376 130793 376899 220489
14956B20489R3815J3565o8639J31827j12348J46900r1374J56589J20237n0693
$$ 220489 314304 327869 259230 391057 278709 425609 334235 490824 611061 560368
14946E60368k1811L8808K08734C62758O3749O1790q6096P711J18643j76095J94047
$$ 560368 538557 577365 786099 362758 426507 488297 402201 409912 528555 352460 546507
14935E46507j21252m5216M23906k06108L88755j53527k06328P69137p1020J97561
$$ 546507 425255 380039 803945 597837 986592 833065 626737 1395874 1324854 1522415
14925A522415l6754m58946J98408J3451j0707L93653L73576O6489j6172o31288
$$ 1522415 1485661 1026715 1225123 1238574 1227867 1621520 1995096 2061585 2045413 1414125
14915A414125j68754j8794j59651m45760k95675o7384K07192r6391j39048K0274
$$ 1414125 1245371 1226577 1066926 621166 325491 258107 465299 368908 229860 250134
14905B50134K71730M6801j10364j64379j01298L83192k20624J45530k07792j33017
$$ 250134 521864 568665 458301 293922 192624 575816 355192 500722 292930 159913
14895A59913L64868A56907R5430Q9099r410M54113J395j88334B69750L45371J07491
$$ 159913 524781 156907 252337 341436 332026 786139 787534 599200 269750 615121 722612
14884G22612O5509J46530l67633K22533N6827j44869o7495M7272C07644J58447
$$ 722612 788121 934651 567018 789551 846378 701509 634014 681286 307644 466091
14874D66091k1096J85020p9863j39185l1850M2464O5793J18682m4408J18496k35906
$$ 466091 444995 630015 550152 410967 379117 421581 487374 606056 561648 680144 444238
14863D44238I7755K63148j50162N2936N2906A13569K6034J98907J89762l6924
$$ 444238 97755 360903 210741 263677 316583 113569 139603 338510 528272 491348
14853D91348l1665l9783K56372K7226k77381n7625J63725K10793K63507K6086
$$ 491348 459683 419900 676272 703498 426117 368492 532217 743010 1006517 1032603
14843A032603K27709n16739J6231K95028O5632m53375J7160J1721P6545j96277
$$ 1032603 1260312 743573 759804 1054832 1120464 667089 684249 695970 772515 576238
14833E76238k80414J19290A75864K62199n9170N7939J12244j37973J36223O7064
$$ 576238 295824 415114 175864 438063 378893 436832 549076 411103 547326 614390
14823F14390o8558K3256o1533R3202J97149j62993R2187m6840k67814Q6379J13759
$$ 614390 545832 569088 507555 600757 797906 634913 727100 680260 412446 498825 612584
14812F12584J92670m9418j92978j05174J92582P7777L13370j16485J03674k93911
$$ 612584 805254 755836 562858 457684 650266 728043 1041413 924928 1028602 734691
14802G34691j08810C11600J73827q8769J01385l9874M282j68887K389M70320k07123
$$ 734691 625881 311600 485427 396658 498043 458169 462451 293564 295953 766273 559150
14791E59150K205k39380L41440B23673L22560J72480j85101M93075C11972L95437
$$ 559150 561355 321975 663415 223673 546233 718713 533612 1026687 311972 707409
14781G07409B77228M44835q4958j10378K08453k80014K19633k5410k4205J6585
$$ 707409 277228 722063 637105 526727 735180 455166 674799 649389 625184 641769
14771F41769l10635P2404L15015j04290B44950L50653L2583B85671J49903J26682
$$ 641769 331134 403538 718553 614263 244950 595603 628186 285671 435574 562256
14761E62256Q9311j97950J54522R2419k98421p825J25373J94985p1269k81893
$$ 562256 651567 453617 608139 700558 402137 394312 519685 714670 643401 361508
14751C61508L69399o4127p0007N9420n5200L62501C75514K00033J2098j3584O8454
$$ 361508 730907 666780 596773 656193 600993 963494 375514 575547 587645 574061 642515
14740F42515O731o1457J03972L292K22954C16126O08637k21711r1573N13218J03587
$$ 642515 649246 587789 691761 695053 918007 316126 924763 703052 611479 1124697 1228284
14729A228284j46794K27668N87542l01811j96966l08336L8561j769o7597k72911
$$ 1228284 1081490 1309158 1896700 1594889 1397923 1089587 1128148 1126379 1058782 785871
14719G85871J5782j73535J86484k0859P7355k03769K91408j28269j44526r0370
$$ 785871 801653 628118 814602 793743 871098 667329 958737 830468 685942 595572
14709E95572K06436k4306L6290M44405M5515k79410O64372k89692K06009k39565
$$ 595572 802008 777702 813992 1258397 1303912 1024502 1688874 1399182 1605191 1365626
14699A365626J82530F80623N28599m99101l325Q0907L4061L18832m60417P1613
$$ 1365626 1548156 680623 1209222 710121 706796 787703 821764 1140596 680179 751792
14689G51792j10777L39313j946J3524j39461J54923n8322j49587j249K30044j79885
$$ 751792 641015 980328 978382 991906 852445 1007368 949046 799459 798210 1028254 848369
14678H48369k42290K98686l24803J58261j57177K75921m7927j44478R9681M60404
$$ 848369 606079 904765 579962 738223 581046 856967 809040 664562 764243 1224647
14668A224647k67335L2640l72846M56029k33099K3266l4671q4227K88881M4655
$$ 1224647 957312 989952 617106 1073135 840036 863302 828631 744404 1033285 1077940
14658A077940k02220n6512k98887L27192J64457n1245N13219j72997M4994J8981
$$ 1077940 875720 819208 520321 847513 1011970 960725 1473944 1300947 1345941 1364922
14648A364922m11361M679K41106k2209q6669J4729L40278n67193J26456K63425
$$ 1364922 953561 958240 1199346 1177137 1090468 1105197 1445475 878282 1004738 1268163
14638A268163J8909j15179k14023N3515K96006k66866n0946j60116L70275l30404
$$ 1268163 1287072 1171893 957870 1011385 1307391 1040525 989579 829463 1199738 869334
14628H69334L09261M2248k80163J90349j48506P3665M2735j98717J4493P1049
$$ 869334 1178595 1220843 940680 1131029 982523 1056188 1098923 900206 914699 985748
14618I85748J29530r27J35370J32203n7327k85898J40085M8544r5373J69901K33291
$$ 985748 1115278 1114351 1249721 1381924 1324597 1038699 1178784 1227328 1131955 1301856 1535147
14607A535147l10065K06245j03376k27643L26421m3690o4876K63285k61973j31128
$$ 1535147 1225082 1431327 1327951 1100308 1426729 1383039 1318163 1581448 1319475 1188347
14597A188347j97537J98593L819o1082M27750q135p3188R7316o7914l02998K30526
$$ 1188347 990810 1189403 1193222 1132140 1559890 1551755 1478567 1575883 1507969 1204971 1435497
14586A435497k0810J147l2617n3163M70339j95927k74411M30569J7257q3421j5029
$$ 1435497 1414687 1415834 1383217 1330054 1800393 1604466 1330055 1760624 1777881 1694460 1679431
14575A679431K77993l32672j37535M65022l17899M03907N3799P4071l48891M7879
$$ 1679431 1957424 1624752 1487217 1952239 1634340 2038247 2092046 2166117 1817226 1865105
14565A865105J20097k83646J44972J11968J62288j76735N56269j51635P5330J38620
$$ 1865105 1985202 1701556 1846528 1958496 2120784 1944049 2500318 2348683 2424013 2562633
14555B562633l8598K24255J49615L08819K80431Q79317J346461L107431O967664
$$ 2562633 2524035 2748290 2897905 3206724 3487155 4366472 5712933 8820364 15788028
14546A5788028J6682893J0351458A8821878I149968l671331j344579j90301J203754
$$ 15788028 32470921 42822379 18821878 9149968 5478637 4134058 3943757 5147511
14538E147511k280061p34332k12339j92519Q3467j26013L983K96980l19355j65017
$$ 5147511 2867450 2133118 1920779 1728260 1811727 1685714 1689697 1986677 1667322 1502305
14528A502305L71521j22790J3148N6523p829p8302K49939k07224L24052J79870
$$ 1502305 1873826 1751036 1764184 1820707 1812878 1734576 1984515 1777291 2101343 2281213
14518B281213m6455k12760Q0835J09319J42253k1664m51842L06063L91092j04516
$$ 2281213 2234758 2021998 2102833 2212152 2354405 2332741 1880899 2186962 2578054 2473538
14508B473538J75527j08217p6299J11929n7173J39152k05169j58561O43053k06618
$$ 2473538 2649065 2540848 2464549 2576478 2519305 2658457 2453288 2294727 2937780 2731162
14498B731162l4884R2152n20995M36733K68152r2888j44215J96279l0101J43389
$$ 2731162 2696278 2788430 2267435 2704168 2972320 2879432 2735217 2931496 2901395 3044784
14488C044784K2246k14151K33036j50364k37941J98773R4022L94576K76724k74073
$$ 3044784 3067030 2852879 3085915 2935551 2697610 2896383 2990405 3384981 3661705 3387632
14478C387632j9329J85325K9885k79562J34184N3280k91689K91108R1746j01815
$$ 3387632 3368303 3553628 3583513 3303951 3438135 3491415 3199726 3490834 3582580 3480765
14468C480765J80632q3429M61814j36055J90909J79870n82415J6879M08981k71465
$$ 3480765 3661397 3577968 4039782 3903727 4094636 4274506 3692091 3708970 4117951 3846486
14458C846486L72874J07694j41352L9299J13088K63292j04479p2457J53889J90565
$$ 3846486 4219360 4327054 4185702 4225001 4338089 4601381 4496902 4424445 4578334 4768899
14448D768899j12350J28647o2724K76787j9893J4079R7904l85054L24883K58991
$$ 4768899 4656549 4785196 4722472 4999259 4979366 4993445 5091349 4706295 5031178 5290169
14438E290169q5237m12J07958K74415n380J19046k4181j6551l8725L76434k26150
$$ 5290169 5204932 5204520 5312478 5586893 5581513 5700559 5676378 5659827 5621102 5997536 5771386
14427E771386L14506K14826k58238M63426N68780j37957L0428k80719M17457r5673
$$ 5771386 6085892 6300718 6042480 6505906 7074686 6936729 6967157 6686438 7103895 7008222
14417G008222P12176o81480J88038K49971k7838L60729o9986j0097R2347N47006
$$ 7008222 7720398 7038918 7226956 7476927 7449089 7809818 7739832 7729735 7822082 8369088
14407H369088j57145K35356M57714l02973j2763o0289K60285M16124l28526L87760
$$ 8369088 8211943 8447299 8905013 8602040 8589277 8528988 8789273 9205397 8876871 9264631
14397I264631R1159L70804m91197O74413k43083J99382M43216M01671J25410j2354
$$ 9264631 9355790 9726594 9235397 9909810 9666727 9866109 10309325 10710996 10836406 10824052
14387A0824052L95849K14376K63422K31229L48452J80946l3853J33556K45806
$$ 10824052 11219901 11434277 11697699 11928928 12277380 12458326 12424473 12558029 12803835
14378A2803835J04489J61327K32607K06792P33184n2449L57734K33080L78859
$$ 12803835 12908324 13069651 13302258 13509050 14242234 14189785 14547519 14780599 15159458
14369A5159458J79460N84647L97630r32O39212P3736L97952L50305J75944M99450
$$ 15159458 15338918 15923565 16321195 16320263 16959475 17033211 17431163 17781468 17957412 18456862
14359A8456862K87550O56176L41036O20149K82557M44492P87703K60794P84994
$$ 18456862 18744412 19400588 19741624 20361773 20644330 21088822 21876525 22137319 22922313
14350B2922313J30459R01430L25748N36865P33440Q44600O18244O80423J140160
$$ 22922313 23052772 23954202 24279950 24816815 25550255 26394855 27013099 27693522 28833682
14341B8833682M15994O71986J123709O10295J091539Q59207J314434M85158J212645
$$ 28833682 29249676 29921662 31045371 31655666 32747205 33606412 34920846 35406004 36618649
14332C6618649R98702J555675J201069R96866J506296J193357J744252J627090
$$ 36618649 37617351 39173026 40374095 41370961 42877257 44070614 45814866 47441956
14324D7441956J374325J614234J903559J846161J812563J934933K076244K036386
$$ 47441956 48816281 50430515 52334074 54180235 55992798 57927731 60003975 62040361
14316F2040361K366098K450575K560765K663953L094905K908081L460371L124211
$$ 62040361 64406459 66857034 69417799 72081752 75176657 78084738 81545109 84669320
14308H4669320M325645L572728M304908M367900M422616M942556N225219N589468
$$ 84669320 88994965 92567693 96872601 101240501 105663117 110605673 115830892 121420360
14300A21420360N941530O139356O766907P458646P325502Q171438Q274152R326493
$$ 121420360 127361890 133501246 140268153 147726799 155052301 163223739 171497891 180824384
14292A80824384R468951J0216863J0612432J1518873J1917189J2634573J2989255
$$ 180824384 190293335 200510198 211122630 222641503 234558692 247193265 260182520
14285B60182520J3313434J4308864J4045752J4936995J4915722J4644358J4727456
$$ 260182520 273495954 287804818 301850570 316787565 331703287 346347645 361075101
14278C61075101J4145464J3730618J2383939J1197015R231093O925716K290211
$$ 361075101 375220565 388951183 401335122 412532137 421763230 428688946 430979157
14271D30979157j83080j18508q73068m940968q139856o577258n843423p471571
$$ 430979157 430796077 430677569 429804501 424863533 416723677 410146419 404302996 396831425
14263C96831425j0194629j2551749j3894354j4967928j5361208j5587109j5223356
$$ 396831425 386636796 374085047 360190693 345222765 329861557 314274448 299051092
14256B99051092j4810099j4717138j3887548j3603983j2546060j2250875j0762475
$$ 299051092 284240993 269523855 255636307 242032324 229486264 217235389 206472914
14249B06472914r999444j0153674r665590r548939q093374p353407p603867o936628
$$ 206472914 196473470 186319796 176654206 167105267 159011893 151658486 144054619 137117991
14241A37117991p078375n779736o115455m734603n152701m964740m581436m621780
$$ 137117991 130039616 124259880 118144425 113409822 108257121 103292381 98710945 94089165
14233I4089165l876998l553384k906005l755622l215087l376773k764110k767012
$$ 94089165 90212167 86658783 83752778 79997156 76782069 73405296 70641186 67874174
14225F7874174k623424k231576k223401k508510j755214k027475j674475k091851
$$ 67874174 65250750 63019174 60795773 58287263 56532049 54504574 52830099 50738248
14217E0738248j512067j773794j048097k070965q60490j378390j371153j377861
$$ 50738248 49226181 47452387 46404290 44333325 43472835 42094445 40723292 39345431
14209C9345431j318749r64729m47570j303473j095470j385730n80936q58342r01947
$$ 39345431 38026682 37061953 36614383 35310910 34215440 32829710 32248774 31390432 30488485
14200C0488485l85755j018262q77248q41267k04698j194459o86681j13220j010955
$$ 30488485 30102730 29084468 28207220 27365953 27161255 25966796 25280115 25166895 24155940
14191B4155940n81067o17782m15025o09782m02949o96327k19614q07040k35826
$$ 24155940 23574873 22957091 22542066 21932284 21529335 20833008 20613394 19806354 19570528
14182A9570528o28612p21783Q5591o01935j76319n74035P8067n45489M7631n89205
$$ 19570528 18941916 18220133 18305724 17703789 17527470 16953435 17031502 16486013 16533644 15944439
14172A5944439n54957p8078k27362j33186o28812m2971n09225k33421l42043l0042
$$ 15944439 15389482 15311404 15084042 14950856 14322044 14279073 13769848 13536427 13194384 13164342
14162A3164342l75201r8272m25124m73666J84071m4204m74513k06192K14419m51456
$$ 13164342 12789141 12690869 12265745 11792079 11976150 11931946 11457433 11251241 11465660 11014204
14152A1014204m06137R9102j29893k07377j99052k19028l93824l51198L19501
$$ 11014204 10608067 10707169 10577276 10369899 10170847 9951819 9557995 9206797 9526298
14143I526298j8101j77829L3120o84880K34342K9662o40473K20052j11347l56203
$$ 9526298 9508197 9330368 9363488 8678608 8912950 8942612 8302139 8522191 8410844 8054641
14133H054641M16483o94259N5063l13303K70325k77087K59411m51281k36737N9736
$$ 8054641 8471124 7776865 7831928 7518625 7788950 7511863 7771274 7319993 7083256 7142992
14123G142992N19j36832j74168J15460k48227J9461k30282j28684j06033k95962
$$ 7142992 7143511 7006679 6832511 6947971 6699744 6719205 6488923 6360239 6254206 5958244
14113E958244K5058K93152j52525k75677J34118k9314j46641l23275R5059m0842
$$ 5958244 5983302 6276454 6123929 5848252 5982370 5953056 5806415 5483140 5578199 5537357
14103E537357l86060k20723J95900K53819l18181K86094n83554K10730P9947k58120
$$ 5537357 5151297 4930574 5126474 5380293 5062112 5348206 4764652 4975382 5055329 4797209
14093D797209K38511k51525j07151Q8900l30233L56681m25656j42543J21350p1221
$$ 4797209 5035720 4784195 4677044 4765944 4435711 4792392 4366736 4224193 4345543 4274322
14083D274322J21961l870j28874j28581J85178k80895K839J76530j29310k01504
$$ 4274322 4396283 4392413 4263539 4134958 4320136 4039241 4042080 4218610 4089300 3887796
14073C887796P4167l86997J27049n0277O7599Q8713j41142j41355L58885j86720
$$ 3887796 3961963 3574966 3702015 3651738 3719337 3808050 3666908 3525553 3884438 3697718
14063C697718n7077R020J6967P4761l9177j19792m20642M04499m06794L53004
$$ 3697718 3640641 3649661 3666628 3741389 3702212 3582420 3161778 3566277 3159483 3512487
14053C512487O456k99323l1064l67956K46125k40241l664L58117k4083q1679l34519
$$ 3512487 3518943 3219620 3188556 2820600 3066725 2826484 2822820 3180937 3156854 3075175 2740656
14042B740656K91269j71051J11682j2692o67734K15829r3250L68179k14471K75764
$$ 2740656 3031925 2860874 2972556 2959864 2292130 2507959 2414709 2782888 2568417 2844181
14032B844181j7807q1717k42886K42040j84918k75076J00868q1876N373J96393
$$ 2844181 2826374 2744657 2501771 2743811 2558893 2283817 2384685 2302809 2308182 2504575
14022B504575K07451n42367L13706r4598l69150O23633m63625p9181r3500K508
$$ 2504575 2712026 2169659 2483365 2388767 2019617 2643250 2179625 2100444 2006944 2009452
14012B009452r979j08805l9943j8301n3034L1202n0129J97146J34448k67312O6536
$$ 2009452 1999473 1890668 1850725 1832424 1779390 1810592 1760463 1957609 2092057 1824745 1891281
14001A891281j48040K95649N7742m28901K23515o1166n9099P9254m6911k3006
$$ 1891281 1743241 2038890 2096632 1667731 1891246 1830080 1770981 1850235 1803324 1780318
13991A780318K2314K94001J40798K075453M687035J3148508K2729232j8384438
$$ 1780318 1802632 2096633 2237431 4312884 8999919 22148427 44877659 26493221
13983B6493221j2259207n188271k772976j170240j238693p37967j65358l43038
$$ 26493221 14234014 9045743 6272767 5102527 3863834 3125867 2960509 2617471
13975B617471j11341q0542j27616l32166J54707J30604l50335M2671J7868L4229
$$ 2617471 2506130 2425588 2297972 1965806 2120513 2251117 1900782 1943453 1961321 1995550
13965A995550o7795K11956j10970j74575J20264n2849k56295K2198J06665M8174
$$ 1995550 1927755 2139711 2028741 1854166 1974430 1921581 1665286 1687484 1794149 1842323
13955A842323k71842L30209j66070M3358j61348L23486r628l22891L65430l99443
$$ 1842323 1570481 1900690 1734620 1777978 1616630 1940116 1930488 1607597 1973027 1573584
13945A573584R2833R2771L1703l79653J16336R8964m7297p1146k36693J75166
$$ 1573584 1666417 1759188 1790891 1411238 1527574 1626538 1579241 1508095 1271402 1446568
13935A446568r7331k29926J42261J42671k7142J21453q4511l16759N2826K65797
$$ 1446568 1349237 1119311 1261572 1404243 1377101 1498554 1414043 1097284 1150110 1415907
13925A415907L90078l73539K9737k3100k96959K62076m96486N56205j08285K18856
$$ 1415907 1805985 1432446 1462183 1439083 1142124 1404200 907714 1463919 1355634 1574490
13915A574490k37750K71591k83140L2834j97575L42357n77084K18046j80767J93182
$$ 1574490 1336740 1608331 1325191 1358025 1160450 1502807 925723 1143769 963002 1156184
13905A156184J45747q7506j1658O6645j54572k8964j1840o487j5883k8159k0748
$$ 1156184 1301931 1214425 1202767 1269412 1114840 1085876 1074036 1067549 1051666 1023507 1002759
13894A002759O2831K59506r2356k22872L87580k04969j72252j05865P7234q053
$$ 1002759 1065590 1325096 1232740 1009868 1397448 1192479 1020227 914362 991596 983543
13884I83543J61630J13839m7931j46948j2946j02963j6451K34441r9195J13645
$$ 983543 1145173 1259012 1211081 1064133 1051187 948224 931773 1166214 1067019 1180664
13874A180664k02976L48428m86036K94589O0461K6701j07620j35497K80312k17175
$$ 1180664 977688 1326116 840080 1134669 1195130 1221831 1114211 978714 1259026 1041851
13864A041851j71144J98413o5667J1866j06994j45320L56917r2701k30731J91450
$$ 1041851 870707 1069120 1003453 1015319 908325 763005 1119922 1027221 796490 987940
13854I87940j60125J65577n4506J90462k66756p0127R0499k25450J59333p9076
$$ 987940 827815 993392 938886 1129348 862592 792465 882964 657514 816847 737771
13844G37771j5118j34006J24050J42451p6880k36900K82279j86758L03526j75121
$$ 737771 722653 588647 712697 855148 778268 541368 823647 636889 940415 765294
13834G65294N7123R7759j79202J71368K8332k82607j08609L5195o0312M69961
$$ 765294 822417 920176 740974 912342 940674 658067 549458 584653 524341 994302
13824I94302k28637k18082j06734L30111k22947R9060l7897J50749q7097k88265
$$ 994302 765665 547583 440849 770960 548013 647073 609176 759925 672828 384563
13814C84563K07271K54712k28009K07079j45666J42319l41631K67613k403j20109
$$ 384563 591834 846546 618537 825616 679950 822269 480638 748251 745848 625739
13804F25739o909Q4079R9325j83052k11116L30577J04110J50109m33301j65558
$$ 625739 618830 702909 802234 619182 408066 738643 842753 992862 559561 394003
13794C94003J64190L88853j24987j65067M7028r9679j14432J22327j24201J13906
$$ 394003 558193 947046 822059 656992 704020 604341 489909 612236 488035 601941
13784F01941J78743C19026J98256J11398j52490J66405j31889L74502C99199K42150
$$ 601941 780684 319026 517282 628680 476190 642595 510706 885208 399199 641349
13774F41349j24286N7111J94402j62967q8627J6040M01581C38092M64165k78573
$$ 641349 517063 574174 768576 605609 516982 533022 934603 338092 802257 523684
13764E23684J21859A67575L86806M0821k18511K74931Q3439k25568r1872J62641
$$ 523684 645543 167575 554381 595202 376691 651622 735061 509493 417621 580262
13754E80262Q874p4085k25169J98951J25961k81157K06306n9147j81316E5869
$$ 580262 589136 515051 289882 488833 614794 333637 539943 480796 299480 55869
13743F47071p8014P5485p7814k03831J4347J69708J46527l32089K33522j80110
$$ 647071 569057 644542 566728 362897 377244 546952 693479 361390 594912 414802
13733D14802q547J02761j7342J67948j26539j58918J43903J33313A53417N15158
$$ 414802 406255 509016 491674 659622 533083 374165 518068 651381 153417 668575
13723F68575J1172k46334A81399L83799B01959K24479A18282K26582O72031C53482
$$ 668575 679747 433413 181399 565198 201959 426438 118282 344864 1016895 353482
13712B30316O34752k25556O934k79710J23942K41707p8194k29468J56688k736
$$ 230316 865068 639512 646446 366736 490678 732385 654191 424723 581411 578675
13702E78675A46267J62763J89234j42627N3523P2109o9939K05177j67430J18392
$$ 578675 146267 309030 498264 355637 409160 481269 411330 616507 449077 567469
13692E67469A74194K67556J9966j34324K45804M7345j31167p1476j53700K7460
$$ 567469 174194 441750 461716 327392 573196 620541 489374 417898 264198 291658
13682B91658L5800K3985A50872L76150B27165L19943k36020K57376B06323K43651
$$ 291658 327458 351443 150872 527022 227165 547108 311088 568464 206323 449974
13672D49974K25507B97651o5611O36109r6774C10901j8208J33028q5299j38495
$$ 449974 675481 297651 232040 868149 771375 310901 292693 425721 340422 201927
13662B01927M13636j09727j40887K9729O0899j01273A07951P43211C03254G0248
$$ 201927 615563 505836 364949 394678 455577 354304 107951 851162 303254 70248
13651B04195r496L06921m0887C6050M10082j25692C8381K66875q8585K77791j26695
$$ 204195 194699 501620 460733 36050 446132 320440 38381 305256 216671 494462 367767
13640C67767K1868j61396O2371J21807A77308J54910R2306j32108J85002Q0791
$$ 367767 389635 228239 290610 412417 177308 332218 424524 292416 477418 558209
13630E58209k58601l3932P6737K142O0196m7388J40539J94997k76692J32937B28049
$$ 558209 299608 265676 342413 344555 404751 357363 497902 692899 416207 549144 228049
13618D44750E1046K95540j72440K15899A3464K69291h0130F03940B94255k6389
$$ 444750 51046 346586 174146 390045 13464 282755 -80130 603940 294255 267866
13608B67866J51208A71405J78674j20400J34690j48568C8076J52110L27298A9859
$$ 267866 419074 171405 350079 229679 364369 215801 38076 190186 517484 19859
13597A05984J36644j18402l743K17416q9412J21463C7800K85728d4475B92578
$$ 105984 242628 124226 120483 337899 248487 369950 37800 323528 -44475 292578
13586F71860B71302n6932L7222p4244K47802A99584J65052K42000B57984E9640
$$ 671860 271302 214370 251592 177348 425150 199584 364636 606636 257984 59640
13575A79534p9771J54318l6725a7368F9600J70810L7195h7124A13591r611L3696
$$ 179534 99763 254081 217356 -17368 69600 240410 277605 -87124 113591 103980 137676
13564A37676B2343M61299j44424A41244J89595q0985J05928j11132o4097N9551
$$ 137676 22343 483642 339218 141244 330839 249854 355782 244650 180553 240104
13554B40104L59584B44612J20230h3150H7047J89082A17009J91444b08700A54495
$$ 240104 599688 244612 364842 -83150 87047 276129 117009 308453 -208700 154495
13543D75412L1896k43975l1721Q0341o0998J40385p9851J19696j72806R4209l064
$$ 475412 507308 263333 231612 311953 250955 391340 311489 431185 258379 352588 349524
13532C49524a1169k1437E3913J66575a61047D42054j04653a27223G9048r269r215
$$ 349524 -11169 -32606 53913 220488 -161047 442054 337401 -127223 79048 69779 60564
13521F0564d9281B90658E2560O3413J24920J51117B4847h7190B52897J7163K33069
$$ 60564 -49281 290658 52560 115973 240893 392010 24847 -87190 252897 270060 503129
13510E03129A75754Q3040J26908C9058K29093j08983J33361k63m2565c6835D03575
$$ 503129 175754 258794 385702 39058 268151 159168 292529 292266 249701 -36835 403575
13498C9818J1160K45154E0689L15003a27273B67456l5366A00135R3878A4304L68476
$$ 39818 50978 296132 50689 365692 -127273 267456 232090 100135 194013 14304 382780
13487C82780f2645C42600r7365j13501J46914H3861J40162L80518A74251b07533
$$ 382780 -62645 342600 245235 131734 278648 83861 224023 604541 174251 -207533
13476C82349A51415J4727K17594l5290j08171k243o6193k5495J98163H5214n100
$$ 382349 151415 166142 383736 348446 240275 238032 171839 146344 344507 85214 80114
13465H0114F194L0145J34312j0407M97543A03826f3087B94944A01202k1669K24167
$$ 80114 6194 36339 170651 160244 657787 103826 -63087 294944 101202 79533 303700
13454C03700r0686I3888j7817M2216b5815B36845J35446n5367J15888A41687L90113
$$ 303700 213014 93888 76071 118287 -25815 236845 372291 316924 432812 141687 531800
13443E31800A15979K87988c3946p9420C95000d4324J16E49005k34251q4870C187
$$ 531800 115979 403967 -33946 -113366 395000 -44324 -44208 549005 314754 229884 3187
13431D53238n0920a8816B33795P274m4088p41G2947R6244p8134Q2593O9529A06967
$$ 453238 402318 -18816 233795 241069 196981 196240 72947 169191 91057 173650 243179 106967
13418B58791a47372G1105O9786J54171A32059J03981D295P9644K33108G3742L96627
$$ 258791 -147372 71105 140891 295062 132059 236040 4295 83939 317047 73742 470369
13407D70369B30406H9462J37802I5390J8169l6204k565n886Q704a27688C73256
$$ 470369 230406 89462 227264 95390 113559 77355 74790 68904 77608 -127688 373256
13395C6356J5048K32819A14200J05443a23567M3326B87030B7543Q2212K32869
$$ 36356 51404 284223 114200 219643 -123567 -80241 287030 27543 109755 342624
13385C42624a99569A97143l8997f9861I7203K90J25177h8831A82602i5185B76283
$$ 342624 -199569 197143 158146 -69861 97203 97493 222670 -88831 182602 -95185 276283
13373c297C5103c8889C42641b6416C0738P0779J77554o9139G6502B8371J8933
$$ -3297 35103 -38889 342641 -26416 30738 101517 279071 209932 76502 28371 47304
13362D7304M29934C3127b3696D91723j82688A27628R5717P1934j12895l2968j1969
$$ 47304 477238 33127 -23696 491723 309035 127628 223345 295279 182384 149416 137447
13351A37447n5480K43594o4372G0355K10898r1183J21790A7648Q7870J56837A13332
$$ 137447 81967 325561 261189 70355 281253 190070 311860 17648 105518 262355 113332
13339E07637k14608j26830M2931F4350L02339j26540l5793k9582b06315A70026
$$ 507637 293029 166199 209130 64350 366689 240149 204356 174774 -206315 170026
13328B57115C532f8496B90855n7227L45727A99289K80265j48952j37354R3735
$$ 257115 3532 -68496 290855 233628 579355 199289 479554 330602 193248 286983
13318B86983k2365O450m3674K2684l8197P9176r4159b23119C62822D7470J54436
$$ 286983 264618 271068 227394 250078 211881 291057 196898 -223119 362822 47470 201906
13307B01906m5481o5432Q3662J46350j35884K6207l3922i287m9008K0704D84222
$$ 201906 156425 90993 174655 321005 185121 211328 177406 -9287 -58295 -37591 484222
13295a03596A64209D1639R9901O5996a50281A8767J13019K32122a22443F5069
$$ -103596 164209 41639 141540 207536 -150281 18767 131786 363908 -122443 65069
13284b07156C2825K21624d8264b1049F1787B2369M01545A8518J40715k6944a08743
$$ -207156 32825 254449 -48264 -21049 61787 22369 423914 18518 159233 132289 -108743
13272A52669d7896k0809A13507K27242i0497H2684P3517b54957G502N5029g5587
$$ 152669 -47896 -68705 113507 340749 -90497 82684 156201 -254957 7502 62531 -75587
13260D8287a8260l39435C23660A41984h7008C67004j53455j00780J73554A22171
$$ 48287 -18260 -357695 323660 141984 -87008 367004 213549 112769 286323 122171
13249B144J49735a15867I6849K37476b3304B99021A35405d8006C09919n4852a01160
$$ 2144 151879 -115867 96849 334325 -23304 299021 135405 -48006 309919 255067 -101160
13237G6690Q0888A5780C699J59064H1323J27755D4876K1098K35709a13840A25348
$$ 76690 157578 15780 3699 162763 81323 209078 44876 65974 301683 -113840 125348
13225C71588a17062D31867H6816a12730A18459d0343l113A83508F8494J17735
$$ 371588 -117062 431867 86816 -112730 118459 -40343 -43456 183508 68494 186229
13215A86229C2993J44519E4797c8676a8197I5832D0547a54017j26595Q8727C8524
$$ 186229 32993 177512 54797 -38676 -18197 95832 40547 -154017 -280612 -191885 38524
13203F2823d5718B56536I0978J8961l7889C0907J34730Q4784K11822f3976C1892
$$ 62823 -45718 256536 90978 109939 72050 30907 165637 250421 462243 -63976 31892
13191D04781d47994B00144a066k9077l14082a48801k5068b0770k92661C2133J48335
$$ 404781 -447994 200144 -1066 -30143 -344225 -148801 -173869 -20770 -313431 32133 180468
13180A80468d26630C8233A5308M683c9110k0909R00k05511B06343I2350B0913
$$ 180468 -426630 38233 15308 19991 -39110 -60019 -59119 -264630 206343 92350 20913
13168I316K857M0425J08442G4539a79822C88289A66738j8579D5751f9433G9222
$$ 9316 12173 52598 161040 74539 -179822 388289 166738 148159 45751 -69433 79222
13156C99973j92840G6677b57122J12720e4753A08387K17712C6744L8862i1409
$$ 399973 207133 76677 -257122 -144402 -54753 108387 326099 36744 75606 -91409
13145e1658A79193c22576E4481F194J39378K32828j55295O0183p8168B8160D406
$$ -51658 179193 -322576 54481 6194 145572 378400 223105 283288 205120 28160 4406
13133A45737R656A0513C576P2902a59233O2036m8786l1536A15763a09303A35838
$$ 145737 155393 10513 3576 76478 -159233 -97197 -145983 -177519 115763 -109303 135838
13121b90140R9871D72429e5117m0708B97370I5869P0779o6079R317D1557P2935
$$ -290140 -190269 472429 -55117 -95825 297370 95869 166648 100569 109886 41557 114492
13110A14492a10486D5633R2187L170l0810f7926b3702j13745B93651A40248J04152
$$ 114492 -110486 45633 137820 140990 110180 -67926 -23702 -137447 293651 140248 244400
13099B44400j07374Q6079c03815P8867B06992J9864h083A45560C4193a45998C8263
$$ 244400 137026 223105 -303815 -224948 206992 226856 -8083 145560 34193 -145998 38263
13087A55256P3626b42183J12313D0810L553Q1304m8155a65400A39175n3342C4518
$$ 155256 228882 -242183 -129870 40810 44363 125667 77512 -165400 139175 85833 34518
13075C21402p618a24828a7969B76236o0936P8340d948k15773e2312C29442a5595
$$ 321402 313784 -124828 -17969 276236 215300 293640 -4948 -220721 -52312 329442 -15595
13063b25363A21156C7742K00829f8083C24803j44424a9740C68766g1239F6588
$$ -225363 121156 37742 238571 -68083 324803 180379 -19740 368766 -71239 66588
13052B12071K9965J19579j64895B9869J34504a24289j9054A98783C9782L7263
$$ 212071 242036 361615 196720 29869 164373 -124289 -143343 198783 39782 77045
13042G7045J11063C6123a06907q5684h0739m9006A71332p1910L59145A52433e3723
$$ 77045 188108 36123 -106907 -192591 -80739 -129745 171332 99422 458567 152433 -53723
13030C35052E4605B0428b7084m0870B62965L08386F081d5729H8375J35575b61905
$$ 335052 54605 20428 -27084 -67954 262965 571351 6081 -45729 88375 223950 -261905
13018H8127M5806L90621g9022B04874J01021c7849f68C14070j38396n3800J65063
$$ 88127 133933 524554 -79022 204874 305895 -37849 -668 314070 175674 121874 286937
13007B86937c6594j824l98114c0852P481o3549j27392n2680A57853o3114J788
$$ 286937 -36594 -38418 -436532 -30852 -23371 -86920 -214312 -266992 157853 94739 96527
12996I6527J6287c42033H3044A5081J81833c20680J27134A3037J94698C0651M8847
$$ 96527 112814 -342033 83044 15081 196914 -320680 -193546 13037 207735 30651 79498
12985G9498L08104A82576P2356a37156o4050A0954N8529J62218A10036j4154a86032
$$ 79498 387602 182576 254932 -137156 -201206 10954 69483 231701 110036 95882 -186032
12973B55147a05687A0584a6621C0248J19466C4472K69597A45748a42325A33437
$$ 255147 -105687 10584 -16621 30248 149714 34472 304069 145748 -142325 133437
12962b256C379N8680C0704a65001K75c5048B4141K50551j01247g2983D9267a36151
$$ -2256 3379 62059 30704 -165001 -164726 -35048 24141 274692 173445 -72983 49267 -136151
12949I648L20663A34546F0449j7365b9961A11343c07458B44425b18383Q9555A473
$$ 9648 330311 134546 60449 43084 -29961 111343 -307458 244425 -218383 -128828 1473
12937E2019J23594J65825h5730a4932A51099a95186j04888d1957D5671K33193
$$ 52019 175613 341438 -85730 -14932 151099 -195186 -300074 -41957 45671 278864
12927B78864g0084k37554j6886A48200f2341C2886g7987j05542H124K27275B0707
$$ 278864 -70084 -307638 -324524 148200 -62341 32886 -77987 -183529 8124 235399 20707
12915c47719c971j46227e6556j75597a08872o7475L3036k59651a27628d7923p8539
$$ -347719 -3971 -150198 -56556 -232153 -108872 -176347 -143311 -402962 -127628 -47923 -126462
12904a26462D5719J71406a96108A6489O6884c13452N1558h1418A02883a07986
$$ -126462 45719 217125 -196108 16489 83373 -313452 -261894 -81418 102883 -107986
12893a48324B14235c00369B59412j06998E7608e7893j31346C09981b85254L1697
$$ -148324 214235 -300369 259412 152414 57608 -57893 -189239 309981 -285254 -253557
12883b53557C13785B5762c28306A7624R9930D4383J28199a91053A41694b34276
$$ -253557 313785 25762 -328306 17624 117554 44383 172582 -191053 141694 -234276
12872A26476g5350j2229A0891N7564B4545J4444I965J22066a36486E5288b43624
$$ 126476 -75350 -87579 10891 68455 24545 38989 9965 132031 -136486 55288 -243624
12860G6830J18808b00700b5570A64385a14396A49526i5474A90450c9012j47538
$$ 76830 195638 -200700 -25570 164385 -114396 149526 -95474 190450 -39012 -186550
12850a86550b7020C83974a69635B32044J08452e0495g21G7749a21603j8598G29
$$ -186550 -27020 383974 -169635 232044 340496 -50495 -721 77749 -121603 -140201 729
12838A03582K70472G7624M3948b66488B26001f2289D8823e9480A84815e0018B5775
$$ 103582 374054 77624 121572 -266488 226001 -62289 48823 -59480 184815 -50018 25775
12826A72196i0113j32033A88731a93072f0648K6163A11842b44066C52963e3899
$$ 172196 -90113 -222146 188731 -193072 -60648 -34485 111842 -244066 352963 -53899
12815D8394b23463C98805j40908c21502d0333m330E4968N7876i8130j41038L7431
$$ 48394 -223463 398805 257897 -321502 -40333 -44663 54968 112844 -98130 -239168 -201737
12804b01737A83868D3372L7112B4737a16853I8773D1267L7532a59405J9339A22542
$$ -201737 183868 43372 80484 24737 -116853 98773 41267 78799 -159405 -140066 122542
12792a38313A12186L4144b21945P2405b8764r8715M4026C9785a15547l5454E3163
$$ -138313 112186 146330 -221945 -149540 -28764 -127479 -83453 39785 -115547 -151001 53163
12780C00191h3741A33193a83367j01425f2185A82578k3449B0555e6244o0347A01880
$$ 300191 -83741 133193 -183367 -284792 -62185 182578 159129 20555 -56244 -116591 101880
12768A70802a33179B79454C5297a13599r3803B35871e36999a57462n6620d1591
$$ 170802 -133179 279454 35297 -113599 -207402 235871 -536999 -157462 -214082 -41591
12757b07559b2926D01036A13830C8344R805P3254C3303j6243J6088R1814a57530
$$ -207559 -22926 401036 113830 38344 48149 121403 33303 17060 33148 124962 -157530
12745a63399l4502m0997A03979K15542a13418k26304E3199a67668H5516B8243
$$ -163399 -197901 -238898 103979 319521 -113418 -339722 53199 -167668 85516 28243
12734e9410H9652l0378b50227B9040J07345J08763G1056b1162k528H7355J34029
$$ -59410 89652 59274 -250227 29040 136385 245148 71056 -21162 -23690 87355 221384
12723B21384L1584J2020j14682a7760G028h5207j74742b6484d877F8686K47078
$$ 221384 252968 264988 150306 -17760 7028 -85207 -259949 -26484 -4877 68686 315764
12712C15764a0321j60332O6898d2379A67507P2030g318j8222o6986A70752a08165
$$ 315764 -10321 -170653 -103755 -42379 167507 239537 -7318 -25540 -92526 170752 -108165
12700a96477P8027B56016R9725g1267j3049j71134P8641b1185B83779A27071a75613
$$ -196477 -118450 256016 355741 -71267 -84316 -255450 -176809 -21185 283779 127071 -175613
12688H9108i8482A2592J71215b17814B15555b7991B51043f3153A88944b89511
$$ 89108 -98482 12592 183807 -217814 215555 -27991 251043 -63153 188944 -289511
12677A680a67289H6268B3424d1396D50136a50732l0274P4897p449k2394j41540
$$ 1680 -167289 86268 23424 -41396 450136 -150732 -181006 -106109 -113558 -135952 -277492
12666b77492C0954q40a56147J9235c7223G3693A0405a15018B4725L0323P5581
$$ -277492 30954 30114 -156147 -136912 -37223 73693 10405 -115018 24725 55048 130629
12655A30629b28646i5610E5537J31836e063j4882B56564c1980k04946F4668A3022
$$ 130629 -228646 -95610 55537 187373 -5063 -19945 256564 -31980 -236926 64668 13022
12643b40100G7816b08061A31213a43688p3897j1699i6930A64234D3038J57811
$$ -240100 77816 -208061 131213 -143688 -217585 -229284 -96930 164234 43038 200849
12633B00849a34393B9857K5358a67913A77457N4481l9650G5483K51862A18663
$$ 200849 -134393 29857 55215 -167913 177457 231938 192288 75483 327345 118663
12622E9814a12949D2232J2402Q5389e1193E2090J03188i3453l6929D2734K21573
$$ 59814 -112949 42232 54634 140023 -51193 52090 155278 -93453 -130382 42734 264307
12611B64307A21236J44870b4718A87991K99082a57446I8170C1370J53259q7107
$$ 264307 121236 266106 -24718 187991 487073 -157446 98170 31370 184629 97522
12601I7522K27466h9412A11840E4822L37538A88666g0558Q559m891C00569I2200
$$ 97522 324988 -89412 111840 54822 392360 188666 -70558 -61999 -66890 300569 92200
12589G9136R0366J62446h2723j00281Q2190o0875a6284j40622A79204E5143k4122
$$ 79136 169502 331948 -82723 -183004 -100814 -161689 -16284 -156906 179204 55143 31021
12578C1021F751a59959O9643K99A04222Q5272D2807a6706d070k46056I5721N354
$$ 31021 6751 -159959 -90316 -90017 104222 189494 42807 -16706 -4070 -250126 95721 101075
12566A01075B6144L7743J6937g4647j60190f7527B14401a54140F7947C097b75680
$$ 101075 26144 63887 80824 -74647 -234837 -67527 214401 -154140 67947 3097 -275680
12554C09115a10258k37965d2479p4378F8543N1506n0352b94869i5276H006a15849
$$ 309115 -110258 -348223 -42479 -116857 68543 120049 69697 -294869 -95276 8006 -115849
12542B25106E6849d70611C39355a40888A47281K8619B213J5371c06703L5887R7243
$$ 225106 56849 -470611 339355 -140888 147281 175900 2213 17584 -306703 -270816 -173573
12531a73573g8396n5197q6334I7782a90306Q5845j24212h0776r1506H4449g2408
$$ -173573 -78396 -133593 -219927 97782 -190306 -104461 -228673 -80776 -172282 84449 -72408
12519a90757A03587M0647m846e532o3457K9484g597r6443c9575E3958P788M6752
$$ -190757 103587 144234 139388 -5532 -68989 -39505 -7597 -104040 -39575 53958 61746 108498
12507A08498G755a89261N9589J2069j4409G0085a83362K0717A05962e9393B37450
$$ 108498 7755 -189261 -129672 -117603 -132012 70085 -183362 -162645 105962 -59393 237450
12495a66251B97647j04393D7220f5658k09139B22158j9745q8846a55181E5236
$$ -166251 297647 193254 47220 -65658 -274797 222158 202413 113567 -155181 55236
12484F075c6861D5742a22950j7147k10913A17061a9599C2402d52633K00939g2554
$$ 6075 -36861 45742 -122950 -140097 -351010 117061 -19599 32402 -452633 -251694 -72554
12472d02914A079a15882F7613J1045a91013J5170g1935L2018G6475d02368C7865
$$ -402914 1079 -115882 67613 78658 -191013 -175843 -71935 -39917 76475 -402368 37865
12460b29203G751J35704C8010a72487k58752e8228E6647b05563E3580b42409L124
$$ -229203 7751 143455 38010 -172487 -431239 -58228 56647 -205563 53580 -242409 -239285
12449b39285J7215A09049a06972B4067L4092d3231j35974A57872d8579l84997
$$ -239285 -222070 109049 -106972 24067 58159 -43231 -179205 157872 -48579 -433576
12439d33576I6983a41921G1789f2935A4180a32119M7660q4645B59076D8249e6378
$$ -433576 96983 -141921 71789 -62935 14180 -132119 -84459 -169104 259076 48249 -56378
12427D7634f5017j73496A25471o2409K1428N2505g2330q9647B37020r915L579
$$ 47634 -65017 -238513 125471 63062 84490 136995 -72330 -161977 237020 227105 230684
12416B30684f6259j39992n2163j49067J48230b7151A85055h6804k22308M5108
$$ 230684 -66259 -206251 -258414 -407481 -259251 -27151 185055 -86804 -309112 -264004
12406b64004i3229C4696L5045N3080b23537c4891B7534K7953L9971h7187r8421
$$ -264004 -93229 34696 69741 122821 -223537 -34891 27534 55487 95458 -87187 -185608
12395a85608J9829i939B21591f8281A01056g1755A30840b9330B65733p9598e1523
$$ -185608 -165779 -9939 221591 -68281 101056 -71755 130840 -29330 265733 186135 -51523
12383a23377C14615b5283k8010r5755d4554j55458g7356J0174B18461Q6910L2816
$$ -123377 314615 -25283 -53293 -149048 -44554 -200012 -77356 -67182 218461 305371 338187
12372C38187e3610M5a4391O41j30164B44382n579f9285E1770P871e3315p9782
$$ 338187 -53610 -53565 -14391 -13750 -143914 244382 238803 -69285 51770 59641 -53315 -133097
12360a33097A67636b69743c9749a153F9503b136l1712r4682A2008b22158g9145
$$ -133097 167636 -269743 -39749 -1153 69503 -2136 -33848 -128530 12008 -222158 -79145
12348E798a19582a1639j16218H6162N5762h5242K5136B46986F8222c0892B63925
$$ 5798 -119582 -11639 -127857 86162 141924 -85242 -60106 246986 68222 -30892 263925
12336c4607H341b24985G5022R3838N8645h3305E9820k0144J88428r8285l7172
$$ -34607 8341 -224985 75022 168860 227505 -83305 59820 39676 228104 129819 92647
12325I2647K43293b48941a2951H6193a48772B96175E8088J21733e204H200K08395
$$ 92647 335940 -248941 -12951 86193 -148772 296175 58088 179821 -5204 8200 216595
12314B16595J41233j20121D6947J32861h968r6795A71221B1126d2928B6166Q6770
$$ 216595 357828 237707 46947 179808 -8968 -105763 171221 21126 -42928 26166 112936
12303A12936e5640j7653L3645j4583B12355g8175D3575M2988i7905B35333o1138
$$ 112936 -55640 -73293 -39648 -54231 212355 -78175 43575 86563 -97905 235333 174195
12292A74195e233l6937B45381K414b80606a31459j8617A37471J19383c53216a4210
$$ 174195 -5233 -42170 245381 247795 -280606 -131459 -150076 137471 256854 -353216 -14210
12280A70044a30126B89649J09356j06741H5337J97104a8689H5713J85963G7726
$$ 170044 -130126 289649 399005 292264 85337 282441 -18689 85713 271676 77726
12269E2517J38889K14427j50455A4569J16123J14446J8534K23571f2414C31274
$$ 52517 191406 405833 255378 14569 130692 245138 263672 487243 -62414 331274
12258B48277G6947L00650K7959j19541J9872j44022a03526o3323A77436J22420
$$ 248277 76947 377597 405556 286015 305887 161865 -103526 -166849 177436 299856
12248B99856k2991A19858a89970B19371D3827Q4513e2931A33896O8320b36397
$$ 299856 276865 119858 -189970 219371 43827 128340 -52931 133896 202216 -236397
12237G537d00913E3007N29698G9512d9213j26058A22146L016P0700H3150Q4896
$$ 7537 -400913 53007 582705 79512 -49213 -175271 122146 125162 195862 83150 168046
12226A68046G8260J61751H3009p779A5182P1898J65353j03519J70844K3201a40030
$$ 168046 78260 240011 83009 75230 15182 87080 252433 148914 319758 342959 -140030
12214C0658J62423o2783b09270b0297A25491B1748e790B87674H2996J3223l171
$$ 30658 193081 130298 -209270 -20297 125491 21748 -5790 287674 82996 96219 93048
12203I3048h556j00542B81883c8167a8224B28009J09295D7862h7477H7008a26518
$$ 93048 -8556 -109098 281883 -38167 -18224 228009 337304 47862 -87477 87008 -126518
12191A61914J50241k1108P5971D2385c4528n1011B81590m8907j6243h754B86337
$$ 161914 312155 291047 367018 42385 -34528 -85539 281590 232683 216440 -8754 286337
12179A46763c5080B31913K0423H0766K63163a4828j9988C21162j1156f0125p5357
$$ 146763 -35080 231913 252336 80766 343929 -14828 -34816 321162 310006 -60125 -135482
12168a35482O4248B8636K56983l4148J0905a9312A03742D8671b09055B33214F07
$$ -135482 -71234 28636 285619 251471 262376 -19312 103742 48671 -209055 233214 607
12156F7294B9584L2594b9299G8284J05335b2958E9686A8123f3717C5726G156a24356
$$ 67294 29584 62178 -29299 78284 183619 -22958 59686 18123 -63717 35726 7156 -124356
12143A01837C8788A1326a2749A17968c9007C20586A34211P9165E6104a38958C39235
$$ 101837 38788 11326 -12749 117968 -39007 320586 134211 213376 56104 -138958 339235
12131b06178R5919E9255K22025c2852A57646a26551c5012B66120B9908K22988
$$ -206178 -110259 59255 281280 -32852 157646 -126551 -35012 266120 29908 252896
12121B52896L6413r3550L39406B15567o220J0559a9549A27876l6595B9379J51943
$$ 252896 289309 195759 535165 215567 209347 219906 -19549 127876 91281 29379 181322
12110A81322p8474m4862K71185A38901L4129p16d5854j4079J9538F8727L2763
$$ 181322 102848 57986 329171 138901 173030 172314 -45854 -59933 -40395 68727 101490
12099A01490J07763d8476E0766c5820A17235a24560j54062g0568B53310j22977
$$ 101490 209253 -48476 50766 -35820 117235 -124560 -278622 -70568 253310 130333
12089A30333Q3180l0607J09991m1614I0739Q6480b18377E7182K29204a89492K9337
$$ 130333 213513 182906 292897 251283 90739 177219 -218377 57182 286386 -189492 -160155
12078a60155P6355j19308b3928A0562L34569a0114A80553k9852L24353H2212J573
$$ -160155 -83800 -203108 -23928 10562 345131 -10114 180553 150701 475054 82212 83785
12067H3785g4559A57071J55056a37052C9038a15562m9066j720a9890A60860b9865
$$ 83785 -74559 157071 312127 -137052 39038 -115562 -164628 -166348 -19890 160860 -29865
12055a48193A20709a11215B33227A9032f0714A28394a5487p9610E5480Q3752a6139
$$ -148193 120709 -111215 233227 19032 -60714 128394 -15487 -95097 55480 139232 -16139
12043a47823B28886a39B83693C2284K46209a89818B80365f3809B49211G77M41280
$$ -147823 228886 -139 283693 32284 278493 -189818 280365 -63809 249211 777 442057
12032D42057G7542K9649f8624k28554A80152d40021I9273b51121J10532C882a11763
$$ 442057 77542 107191 -68624 -297178 180152 -440021 99273 -251121 -140589 3882 -111763
12020E0540J80708G1815K90051j05891j09902M3430q2432K05965A22014J33135
$$ 50540 231248 71815 361866 255975 146073 189503 107071 313036 122014 255149
12010B55149c6467B8411K52770A08749a63097B42069c52771k9871A73528D5825
$$ 255149 -36467 28411 281181 108749 -163097 242069 -352771 -382642 173528 45825
11999g057j68369c4899A54607J94610a2460C1711J85942j5943a04936H2132a18500
$$ -7057 -175426 -34899 154607 349217 -12460 31711 217653 201710 -104936 82132 -118500
11987a02244I1088O7346i4018A67975b56132h3413K512p9464B4452F393i8975
$$ -102244 91088 158434 -94018 167975 -256132 -83413 -80901 -160365 24452 6393 -98975
11975a69304k017q0214B0171P1580b70127a09407i094j26465j43496a0241j72684
$$ -169304 -171321 -251535 20171 91751 -270127 -109407 -9094 -135559 -279055 -10241 -182925
11964a82925j5418a1944A2346N9478J020b16593N6896e150j62558B155J22441
$$ -182925 -198343 -11944 12346 71824 72844 -216593 -159697 -5150 -167708 2155 124596
11953A24596a18213A85464D1122O4406g6558k75785A94901C4256K22710a38551
$$ 124596 -118213 185464 41122 105528 -76558 -352343 194901 34256 256966 -138551
11942C5994e70001a54728A50429m4366O9985Q2650a60095B10374G9262C3196L722
$$ 35994 -570001 -154728 150429 106063 176048 258698 -160095 210374 79262 33196 36918
11931C6918b01085j09116a37860A63045a27063j16118A9J08626a54238J0461a6506
$$ 36918 -201085 -310201 -137860 163045 -127063 -243181 19 108645 -154238 -143777 -16506
11919a35131A38819a51652q6513h5960A5120e4379A26053b11785A03653b38119
$$ -135131 138819 -151652 -238165 -85960 15120 -54379 126053 -211785 103653 -238119
11908a36583C3402A1046J35570a20250m3677F4519b23045B12167L4235g3927h618
$$ -136583 33402 11046 146616 -120250 -163927 64519 -223045 212167 246402 -73927 -8618
11896A7272J45303a7100l29220g2707p1091e558j4844A6980J318b71012F359Q9109
$$ 17272 162575 -17100 -346320 -72707 -143798 -5558 -20402 16980 18298 -271012 6359 95468
11884I5468B4355b24081J03913k09824B44870c32805B1366c18484c9413B2967
$$ 95468 24355 -224081 -120168 -329992 244870 -332805 21366 -318484 -39413 22967
11873g0763l81259i5081o5717g2696D4165M3032a33678C8148N35J37718d9246
$$ -70763 -452022 -95081 -160798 -72696 44165 87197 -133678 38148 38683 176401 -49246
11861h8182m897C1338K6303j3998a68630C4255c93940E7775a34457b4963B26658
$$ -88182 -93079 31338 57641 43643 -168630 34255 -393940 57775 -134457 -24963 226658
11849a30325G5519h5226m9850A57695D9510a73908A58212c1601j1664o4014D7154
$$ -130325 75519 -85226 -135076 157695 49510 -173908 158212 -31601 -43265 -107279 47154
11837d3667A84582c1250r110J1234k4094f60q7835j54242A37133a0774j8868k2816
$$ -43667 184582 -31250 -40360 -29126 -53220 -660 -88495 -242737 137133 -10774 -29642 -52458
11825e2458j32584o3087D4612a82639A43045d6487d044q2839A1505a47899d5969
$$ -52458 -185042 -248129 44612 -182639 143045 -46487 -4044 -86883 11505 -147899 -45969
11813b85746d8804a4078k0591D45943A48160o2194m924K49418a11309B2335P9129
$$ -285746 -48804 -14078 -34669 445943 148160 85966 81042 330460 -111309 22335 101464
11802A01464k1869A8362K72994b622A04131R1772b2332C325a8359k85744B68151
$$ 101464 79595 18362 291356 -2622 104131 195903 -22332 3325 -18359 -304103 268151
11790c6963B35052l4278a5060A58138f914j93634M4303f9085j26223M3947b4709
$$ -36963 235052 200774 -15060 158138 -6914 -200548 -156245 -69085 -195308 -151361 -24709
11778b6126j3082j20132b8921F0924a38935N2692E9473N9471c08178i512A33141
$$ -26126 -39208 -159340 -28921 60924 -138935 -86243 59473 118944 -308178 -9512 133141
11766H2532a23724B94072i5123j85091A8155M5857a26782A40005a6574m41245
$$ 82532 -123724 294072 -95123 -280214 18155 64012 -126782 140005 -16574 -457819
11756d57819C09159i6833G2459C610Q9704c7061k3369j42519e222j59023A10296
$$ -457819 309159 -96833 72459 3610 93314 -37061 -60430 -202949 -5222 -164245 110296
11744c07307i4825M926G9511h5323k25381B53999b44964H2891b07361d4000p424
$$ -307307 -94825 -89899 79511 -85323 -310704 253999 -244964 82891 -207361 -44000 -51424
11733e1424k1411k58080B013g8229K0833C60048a69420F0888B0011L4782a25075
$$ -51424 -72835 -330915 2013 -78229 -57396 360048 -169420 60888 20011 54793 -125075
11721E5060a4540A83671I439a47302m3728B79666j18910F08a82924D975P7541
$$ 55060 -14540 183671 9439 -147302 -191030 279666 160756 608 -182924 4975 82516
11710H2516L54634A62818E7683a25499A76542a8910G6773N7633K2796a19925B49214
$$ 82516 437150 162818 57683 -125499 176542 -18910 76773 134406 157202 -119925 249214
11698a32360I3561a08484h298j04039f80l382A12169D3853C990J30159b5663l83926
$$ -132360 93561 -108484 -8298 -112337 -680 -4062 112169 43853 3990 134149 -25663 -409589
11686d09589F2648c6687A46584E8010J42947R3943a22561B03974i6480F8135a18146
$$ -409589 62648 -36687 146584 58010 200957 294900 -122561 203974 -96480 68135 -118146
11674A12160q339B21h4452A26872a00537D13214A0507m746J68294b21821A8929
$$ 112160 103821 221 -84452 126872 -100537 413214 10507 5761 174055 -221821 18929
11662c06911m3732A6059R4096Q7789N7r0902b20791A11056a42931A21610f6008
$$ -306911 -350643 16059 110155 197944 198001 107099 -220791 111056 -142931 121610 -66008
11650b1555k74893Q0493n5185i2840A3076d8785j6129G4510a37463q7877B0829
$$ -21555 -296448 -215955 -271140 -92840 13076 -48785 -64914 74510 -137463 -225340 20829
11638e0364q0105j05701e0483m8918A72197b02396c4841j1918I8957J68996h8617
$$ -50364 -130469 -236170 -50483 -99401 172197 -202396 -34841 -46759 98957 267953 -88617
11626E9952J50324E7688e7535a3665B52775a24583F1674M747b09379B05420h4058
$$ 59952 210276 57688 -57535 -13665 252775 -124583 61674 66421 -209379 205420 -84058
11614b59756A08339B0912c18648H5344L1689d8146H6257P0273f9201j44325A10287
$$ -259756 108339 20912 -318648 85344 117033 -48146 86257 156530 -69201 -213526 110287
11602E2643k2338J78017r4170a96798a3074n3486D416K40760E3082K35637b1761
$$ 52643 30305 208322 114152 -196798 -13074 -66560 4416 245176 53082 288719 -21761
11590i9069A9347J16148C106b62342A15159m4216R096J05152L5709j01482L4228
$$ -99069 19347 135495 3106 -262342 115159 70943 80039 185191 220900 119418 153646
11579A53646e9713C56071D3472J406f3390J6169B17172j06777m38m3870K04064
$$ 153646 -59713 356071 43472 44878 -63390 -47221 217172 110395 109957 66087 270151
11568B70151j08501e0069C9885c8489k98380F2956J83499E6571A8373J80563H9138
$$ 270151 161650 -50069 39885 -38489 -336869 62956 246455 56571 18373 198936 89138
11556d30C91207A1290e7551b2266k15965e8576j34724j26310A26776M3727i6416
$$ -430 391207 11290 -57551 -22266 -238231 -58576 -193300 -319610 126776 170503 -96416
11544A33410E3473J56844F9174K11286a3834B0048a4616A19738B162a98019A21726
$$ 133410 53473 210317 69174 280460 -13834 20048 -14616 119738 2162 -198019 121726
11532a64250A27104g7981j68846a03548M5115j67022b7126j51679B49470q6740
$$ -164250 127104 -77981 -246827 -103548 -58433 -225455 -27126 -178805 249470 162730
11522A62730a7993k9657l1009A65288A2126f2082J3397H5985e4043A49527i6970
$$ 162730 -17993 -47650 -78659 165288 12126 -62082 -48685 85985 -54043 149527 -96970
11510a78424J1243B4059J70841I5443Q3446G6400B6056K37819h9712Q399A31444
$$ -178424 -167181 24059 194900 95443 178889 76400 26056 263875 -89712 -81313 131444
11498A53021O9252i7197l4196K0489I2393c10597C30126a40332G3802A0823J01843
$$ 153021 222273 -97197 -131393 -110904 92393 -310597 330126 -140332 73802 10823 112666
11487A12666M34823A02519L08574d6660B11692B6835c69574f8180b1669I8548
$$ 112666 547489 102519 411093 -46660 211692 26835 -369574 -68180 -21669 98548
11476B71168B5389b36139F3074J01292c9649B7547c4924k8748m0542F7404n007
$$ 271168 25389 -236139 63074 164366 -39649 27547 -34924 -63672 -104214 67404 62397
11465F2397a67209F784a09722E3235N7668R5065e1785A96462c15541B3008R7140
$$ 62397 -167209 6784 -109722 53235 110903 205968 -51785 196462 -315541 23008 120148
11454A20148K3365F6105B9582a13888L5179b041D2047D87a60810b7144C5763b44247
$$ 120148 143513 66105 29582 -113888 -78709 -2041 42047 487 -160810 -27144 35763 -244247
11441F644d1664j65121a9039k78115C34023E5955a01002L3796C73741g1492A64203
$$ 6644 -41664 -206785 -19039 -297154 334023 55955 -101002 -67206 373741 -71492 164203
11429B48774b56490B65315O4451a84696C8750c3786j51524B06365B352L69559
$$ 248774 -256490 265315 329766 -184696 38750 -33786 -185310 206365 2352 371911
11419C71911a58448a9784j37921a2357E4844g548B26102j01329B3955J72010i2479
$$ 371911 -158448 -19784 -157705 -12357 54844 -7548 226102 124773 23955 195965 -92479
11407A64770c91826d1612H2614B837b5382C38934c03520H174c2287B17826i1617
$$ 164770 -391826 -41612 82614 2837 -25382 338934 -303520 8174 -32287 217826 -91617
11395C77150d1068B10250l5469F4995A1210J22316J96000D7463K36848h6371c2241
$$ 377150 -41068 210250 174781 64995 11210 133526 329526 47463 284311 -86371 -32241
11383g2658l324p1795k2790A42220j1678c5419J86E8204a10537A01160b93796
$$ -72658 -75982 -147777 -170567 142220 130542 -35419 -35233 58204 -110537 101160 -293796
11371b1282C7282J45620D2993A6830c42059J51579G082L1032M32281c5220A80850
$$ -21282 37282 182902 42993 16830 -342059 -190480 7082 38114 470395 -35220 180850
11359a78853H6943I934J7133h7340A20197c24388B047a56137B7905J50823c26014
$$ -178853 86943 9934 27067 -87340 120197 -324388 2047 -156137 27905 178728 -326014
11347c15406B8878i3664A62819a3939B2360J487R0885J61202c6684B7462i2339
$$ -315406 28878 -93664 162819 -13939 22360 23847 114732 275934 -36684 27462 -92339
11335a77420j24458D253i3610o1936a1291D6880J96709h1953o4725H4482f0385
$$ -177420 -301878 4253 -93610 -155546 -11291 46880 243589 -81953 -146678 84482 -60385
11323A49340B7267J34477G0754a9892E572K05144a66733B45959a73179B3870O2237
$$ 149340 27267 161744 70754 -19892 5572 210716 -166733 245959 -173179 23870 86107
11312H6107j449d07529B5307e3593r0488D9447m750L738b01873a2313E9936f255
$$ 86107 84658 -407529 25307 -53593 -144081 49447 44697 48435 -201873 -12313 59936 -6255
11299A1727K24959G614a77280A52635c74212C73599a39687B09579a72238e8303
$$ 11727 236686 7614 -177280 152635 -374212 373599 -139687 209579 -172238 -58303
11288b8442B39040d1644o5513D6426b20890a9753E4238K983a18004A20301a09743
$$ -28442 239040 -41644 -107157 46426 -220890 -19753 54238 57221 -118004 120301 -109743
11276c89506D8150d9345j01151I0915J95690c32662N8707A177N1369g5233Q308
$$ -389506 48150 -49345 -150496 90915 286605 -332662 -273955 1177 52546 -75233 -66925
11265f6925D7262e6597g0A62247a74345h793n4104A23553M1448d325m1512E2967
$$ -66925 47262 -56597 -70 162247 -174345 -8793 -62897 123553 165001 -4325 -45837 52967
11252a60600f410j78789E7401a38686d4078m918n7776j34317E8643b98915i6031
$$ -160600 -6410 -185199 57401 -138686 -44078 -48996 -106772 -241089 58643 -298915 -96031
11240b6086D6821k0420a70208h941j65509A00743h5976k08884I4705d94963I1471
$$ -26086 46821 26401 -170208 -8941 -174450 100743 -85976 -294860 94705 -494963 91471
11228F9272c1119k5799o345D9123c8228H3546k552J44809O1513c7766A01661d24984
$$ 69272 -31119 -56918 -63263 49123 -38228 83546 80994 225803 287316 -37766 101661 -424984
11215B99797F8231b44443B8289a27995I9284b41743e2792R262p2220k38473J44003
$$ 299797 68231 -244443 28289 -127995 99284 -241743 -52792 -43530 -115750 -354223 -210220
11204b10220Q7794K0455k80844B29686a9829H9613j5536J47295d14312A54917
$$ -210220 -122426 -101971 -382815 229686 -19829 89613 74077 221372 -414312 154917
11193D8946g5558A53497b82174Q6310j45252a62381A7857b70846A40435h6811
$$ 48946 -75558 153497 -282174 -195864 -341116 -162381 17857 -270846 140435 -86811
11182a55943L1158D34485g0751K6738G9560a79495L5901F493a83519p3259M2022
$$ -155943 -124785 434485 -70751 -44013 79560 -179495 -143594 6493 -183519 -256778 -214756
11171b14756R0803A04641a62659j7038e6633B60635b05065B78225c18770J26040
$$ -214756 -123953 104641 -162659 -179697 -56633 260635 -205065 278225 -318770 -192730
11161a92730b0283j22432r3072j58038h8701B545a15522c6654C03610a4794o7450
$$ -192730 -20283 -142715 -235787 -393825 -88701 2545 -115522 -36654 303610 -14794 -82244
11150h2244B72679j8057a43021N6763E1330b51457Q740H8761c16172A31627B4241
$$ -82244 272679 254622 -143021 -86258 51330 -251457 -242717 88761 -316172 131627 24241
11138a42767B39968a2411j26874A80213b33061i1358B59177a34454m398N5915
$$ -142767 239968 -12411 -139285 180213 -233061 -91358 259177 -134454 -138852 -82937
11128h2937F6119a82123b3500n9895k11345B27212m6460M6426a25693b7318n1602
$$ -82937 66119 -182123 -23500 -83395 -294740 227212 180752 227178 -125693 -27318 -78920
11117g8920j92272h3563m9085m8735C44160A62205D4690J15227i6283j07259A04075
$$ -78920 -271192 -83563 -132648 -181383 344160 162205 44690 159917 -96283 -203542 104075
11105A48160a65315j83186A54386a1059A00387e1699A85206o099m6617l9225Q0746
$$ 148160 -165315 -348501 154386 -11059 100387 -51699 185206 179107 132490 93265 174011
11094A74011O96E6227a66844E70864B70817a14470B34262j13034L25509F734K52198
$$ 174011 174707 56227 -166844 570864 270817 -114470 234262 121228 446737 6734 258932
11083B58932A24070C0487e2752A0362K5010L88730H451b03708B63338H7126b47721
$$ 258932 124070 30487 -52752 10362 35372 424102 8451 -203708 263338 87126 -247721
11071B27147J04500E2113R216K49857f9163b4990B48219A02095K309K05780B5395
$$ 227147 331647 52113 61329 311186 -69163 -24990 248219 102095 104404 310184 25395
11059A53744k8014h8179A19488L48744k09723k0491N4795M5792A58654K37518
$$ 153744 125730 -88179 119488 468232 258509 238018 292813 338605 158654 396172
11049C96172j8406K6007J77843k86142M95347C87523L25320B97541K32747j9611
$$ 396172 377766 403773 581616 295474 790821 387523 712843 297541 530288 510677
11039E10677K04615j1039B18919M66168B72037R2362q4682K83602n8418N6605
$$ 510677 715292 704253 218919 685087 272037 364399 279717 563319 504901 561506
11029E61506k35144J4777J21841M2649B44262K39832L12662J1793B59754l3924
$$ 561506 326362 341139 462980 505629 244262 484094 796756 808549 259754 225830
11019B25830J92494p1520j31913l3186K84062k7345N5637K4668J53022l3160C06611
$$ 225830 418324 346804 214891 181705 465767 438422 494059 518727 671749 638589 306611
11007A97608L40052j98241A56697L04537L6906k48771J87025j05916k840J45234
$$ 197608 537660 339419 156697 461234 498140 249369 436394 330478 327638 472872
10997D72872n7174J65458j75163R7767r0346K10597l00062K42516j76275L45104
$$ 472872 415698 581156 405993 503760 413414 624011 323949 566465 390190 735294
10987G35294a6345F32620j44835O2397j97797J40422J31377J7751L92759k49862
$$ 735294 -16345 632620 487785 550182 352385 492807 624184 641935 1034694 784832
10977G84832p7089k20310J71274J29839m1313K23316J4464N59247j07985K8681
$$ 784832 707743 487433 658707 788546 747233 970549 985013 1544260 1436275 1464956
10967A464956M04457j8975L043l5736k704K47785m20178m85566j04835O8259J41851
$$ 1464956 1869413 1850438 1853481 1817745 1815041 2062826 1642648 1157082 1052247 1120506 1262357
10956A262357j39695l4904R9408J00872P2410n0477k32834M8654K5910k78182
$$ 1262357 1122662 1087758 1187166 1288038 1360448 1309971 1077137 1125791 1151701 873519
10946H73519J45893k69263K01912B81102N39706l82425j28634e2683A73531r733
$$ 873519 1019412 750149 952061 281102 820808 438383 309749 -52683 173531 163798
10936A63798b2172A08918h4326F657b33292p3117D3192J44059j5812k3915J62720
$$ 163798 -22172 108918 -84326 6657 -233292 -306409 43192 187251 171439 147524 310244
10925C10244f5908A98895d9858E7383M6896m3829L45390i7832B6118b08574E4269
$$ 310244 -65908 198895 -49858 57383 104279 60450 405840 -97832 26118 -208574 54269
10913G8157a98764A57902K10901k3481b7738j52296F4392J00880F3519a3302B3416
$$ 78157 -198764 157902 368803 345322 -27738 -180034 64392 165272 63519 -13302 23416
10901A13478i2807k40014f1688j92899Q3539A79068a08527j87151A74215e0327
$$ 113478 -92807 -332821 -61688 -254587 -171048 179068 -108527 -295678 174215 -50327
10890B59103D6557h2541I8470D8483g2045I8342D3605b7434j7404k26844d7871
$$ 259103 46557 -82541 98470 48483 -72045 98342 43605 -27434 -44838 -271682 -47871
10878e9744q0254o9201g5697c3211j73984C32156I8074A0185Q4893J10312a76191
$$ -59744 -139998 -209199 -75697 -33211 -207195 332156 98074 10185 95078 205390 -176191
10866b05589H2239d3766j54564o5092G2207n583e2689A04741a2821l10764A52820
$$ -205589 82239 -43766 -198330 -263422 72207 66624 -52689 104741 -12821 -323585 152820
10854a98972B201g4081E0165g4086G2179h4205R564A30557a297j95130g9838H4321
$$ -198972 2201 -74081 50165 -74086 72179 -84205 -74641 130557 -1297 -196427 -79838 84321
10841a37275p779d0997p5130E6220c37163O9056B2140K14310N1045f0584j49552
$$ -137275 -145054 -40997 -116127 56220 -337163 -268107 22140 236450 287495 -60584 -210136
10830b10136O0695A07861a90959O9632A20648a22024d3687k59189A17756D291
$$ -210136 -149441 107861 -190959 -121327 120648 -122024 -43687 -302876 117756 4291
10819a32507b3514m536A27536a1475E748J38254g1993A25176a50181k6697N2909
$$ -132507 -23514 -28050 127536 -11475 5748 144002 -71993 125176 -150181 -176878 -123969
10808a23969B0220a33079B06865b17320H263b32163Q0698D3905a22112c7946D9385
$$ -123969 20220 -133079 206865 -217320 8263 -232163 -151465 43905 -122112 -37946 49385
10796A4331R5985b39626a912j36472a3942A18048h2938m64464g1574j5562n3068
$$ 14331 110316 -239626 -1912 -138384 -13942 118048 -82938 -547402 -71574 -87136 -140204
10785a40204B16868a99137A16193k2763c781j06734n7282N2857J3913A2900a72938
$$ -140204 216868 -199137 116193 93430 -3781 -110515 -167797 -114940 -101027 12900 -172938
10773C30623b65362p1562F1390J77474f0487F8450A6130b58551e5246B2382M2123
$$ 330623 -265362 -336924 61390 238864 -60487 68450 16130 -258551 -55246 22382 64505
10762F4505c24582H5554b31990E2218a6994B31972G2225L8967C4417b8801k23629
$$ 64505 -324582 85554 -231990 52218 -16994 231972 72225 111192 34417 -28801 -252430
10751b52430A91483b07372A1755L0803A9424N8982Q3422b15182h152k4752j41214
$$ -252430 191483 -207372 11755 42558 19424 78406 161828 -215182 -8152 -32904 -174118
10740a74118A32590b86239A14542R8370a699j01148E4797b21607e8182k23635
$$ -174118 132590 -286239 114542 212912 -1699 -102847 54797 -221607 -58182 -281817
10730b81817p2632A88325a77180A02468g7981G0145J372k9389a66125a0494l50292
$$ -281817 -354449 188325 -177180 102468 -77981 70145 71517 42128 -166125 -10494 -360786
10719c60786R2413C2921a2665j04990a2227A11323a38816K5436b8319D9872K29581
$$ -360786 -268373 32921 -12665 -117655 -12227 111323 -138816 -113380 -28319 49872 279453
10708B79453i5652m9871q9463B907g9333C5815f9291D1442a79810A4216J75863
$$ 279453 -95652 -145523 -234986 2907 -79333 35815 -69291 41442 -179810 14216 190079
10697A90079o4042J44593i5411k52367a63238A86785a31096A89302c05994g0856
$$ 190079 126037 270630 -95411 -347778 -163238 186785 -131096 189302 -305994 -70856
10686h74G150N3854N4467j6576c95324H706b82412P6204L7191A37518g0772j48880
$$ -874 7150 61004 115471 98895 -395324 8706 -282412 -206208 -169017 137518 -70772 -219652
10674b19652E342J1168l503a39579j76760e3654B08814b36476I5230A688a35239
$$ -219652 5342 16510 13007 -139579 -316339 -53654 208814 -236476 95230 1688 -135239
10662A41286O522b85415c5831l75026a37784E0143i5288k30190A29185f9743B88134
$$ 141286 147808 -285415 -35831 -410857 -137784 50143 -95288 -325478 129185 -69743 288134
10650a02788k76585J63951A53996I25f0460j86508A36994a35451K2017N2621J7989
$$ -102788 -379373 -215422 153996 925 -60460 -246968 136994 -135451 -113434 -60813 -42824
10639d2824A4597a76267D4179a35585A03260J52978a76454g8009B9209O6714d22591
$$ -42824 14597 -176267 44179 -135585 103260 256238 -176454 -78009 29209 95923 -422591
10627A2289O3192a79915j39378e9937j23654D5670a17843F0325b2078j50341l4970
$$ 12289 75481 -179915 -319293 -59937 -183591 45670 -117843 60325 -22078 -172419 -207389
10616b07389A77681a23408n5779j55948G0054K433a00831A28018b47965J10460
$$ -207389 177681 -123408 -179187 -335135 70054 72487 -100831 128018 -247965 -137505
10606a37505B78813b6657j48200c4588A59138D0318a10429H0004O3147a10208
$$ -137505 278813 -26657 -174857 -34588 159138 40318 -110429 80004 143151 -110208
10595A0358a7537j31842G7664j7950e7288q806l88647B08523c17508i1240K1914
$$ 10358 -17537 -149379 77664 59714 -57288 -66094 -454741 208523 -317508 -91240 -69326
10584f9326J905D9885a03312j2906A01465J34273g1814c355j18285j76496D317
$$ -69326 -67421 49885 -103312 -116218 101465 235738 -71814 -3355 -121640 -298136 4317
10572c9704j90271J01927E9962A6884K36810i0413A17931e2726c684D3311b69311
$$ -39704 -229975 -128048 59962 16884 253694 -90413 117931 -52726 -3684 43311 -269311
10560B18895b72293F8941L2538a44752B3621J25638a67593d0220A90093g7910
$$ 218895 -272293 68941 101479 -144752 23621 149259 -167593 -40220 190093 -77910
10549B90463d7383m3510l0391M0477D70004a75516p7471m7305b8478l81047c0024
$$ 290463 -47383 -90893 -121284 -80807 470004 -175516 -252987 -300292 -28478 -409525 -30024
10537D595N1895f9249j16820h6462q5373l725e0B49396a994A26457b84125a36574
$$ 4595 56490 -69249 -186069 -86462 -171835 -175560 -50 249396 -1994 126457 -284125 -136574
10524b26483H4327a79702Q1365A32420l8285K32571d2856D8908a60736j95706
$$ -226483 84327 -179702 -98337 132420 94135 326706 -42856 48908 -160736 -356442
10514c56442a21442l8163j53580B9978a2546k42235O8656c3308k18131e4243j54068
$$ -356442 -121442 -159605 -313185 29978 -12546 -254781 -186125 -33308 -251439 -54243 -208311
10503b08311A16986H898i508A2927a05196E4150r710i2307l0694A79323q3787
$$ -208311 116986 8898 -9508 12927 -105196 54150 44440 -92307 -123001 179323 95536
10492I5536b61644A74731B5137d18396H7935i2620B0919f820B5270b02773A81881
$$ 95536 -261644 174731 25137 -418396 87935 -92620 20919 -6820 25270 -202773 181881
10480B89884a08996m8948f8143F4309J45116b6464D58884q0692l9916j11553G8775
$$ 289884 -108996 -157944 -68143 64309 209425 -26464 458884 378192 338276 226723 78775
10468A87967a1674C39649j44918F3628e5769I2103J21738i870k36328J07782A91708
$$ 187967 -11674 339649 194731 63628 -55769 92103 213841 -9870 -246198 -138416 191708
10456a93283B90430F2050N9396a3739A27157n3907a53446j11224j5472p7595a21488
$$ -193283 290430 62050 121446 -13739 127157 73250 -153446 -264670 -280142 -357737 -121488
10444b91773a32846B83992g5686A17393i8013O012m2886k6409f7091k23342O5827
$$ -291773 -132846 283992 -75686 117393 -98013 -92001 -134887 -161296 -67091 -290433 -224606
10433b24606A86845F6567a25701E2494b35068a09086B34959a17045B6405J45504
$$ -224606 186845 66567 -125701 52494 -235068 -109086 234959 -117045 26405 171909
10423A71909d08731B5156C407a93273k52940J88823Q6457j64403a37763j43700
$$ 171909 -408731 25156 3407 -193273 -446213 -257390 -170933 -335336 -137763 -281463
10413b81463E7408j6844d5122E396c45290c2320D9575b23103F1317f6568j59293
$$ -281463 57408 40564 -45122 5396 -345290 -32320 49575 -223103 61317 -66568 -225861
10402b25861O235q9205B49641a15921E6832a08116d6934A04549a15048K9451D8342
$$ -225861 -219626 -308831 249641 -115921 56832 -108116 -46934 104549 -115048 -85597 48342
10390A67164P0887j04993R5567C8359J33041L3199J16399c7343H318b16471m7612
$$ 167164 238051 133058 228625 38359 171400 204599 320998 -37343 8318 -216471 -264083
10379b64083P4263g9255A93647a12092j1988A75680J24355L7453j41811g3976
$$ -264083 -189820 -79255 193647 -112092 -124080 175680 300035 337488 195677 -73976
10368G4199h9705A59439p8609l0966K49154J80726A03748F067i6505A50309e7662
$$ 74199 -89705 159439 80830 49864 299018 479744 103748 6067 -96505 150309 -57662
10356D3947K13888Q9116a45344B10585a7588C36376o8164r306A03175k2998J36908
$$ 43947 257835 346951 -145344 210585 -17588 336376 268212 258906 103175 80177 217085
10345B17085J24516j35780K65314A922K35322O3534I9032K43622b6133C90360
$$ 217085 341601 205821 471135 1922 237244 300778 99032 342654 -26133 390360
10334A62458b5594B36674j10729a11078A20475A9818K00182f5757k3053E733J59556
$$ 162458 -25594 236674 125945 -111078 120475 19818 220000 -65757 -88810 5733 165289
10323A65289a33584A41798p0381a44481A31106M9470k2132J36435H2948Q2863
$$ 165289 -133584 141798 71417 -144481 131106 180576 158444 294879 82948 165811
10313A65811a850B03501p7427f2498B52b80520E6680b80957a00167B80716a0107
$$ 165811 -1850 203501 126074 -62498 252 -280520 56680 -280957 -100167 280716 -10107
10301g8174J5442E3867M307P4873K10616A51108G3596j2617e3861l10737A0247
$$ -78174 -62732 53867 58174 133047 343663 151108 73596 60979 -53861 -364598 10247
10289A05136c6149B7208K14231a38089o0959O7364J3866k66677a0154A53378A9540
$$ 105136 -36149 27208 241439 -138089 -199048 -131684 -117818 -384495 -10154 153378 19540
10277A14918b34719F0435K4874b42827P7582K7543j4831j36716D7849D36c1773
$$ 114918 -234719 60435 85309 -242827 -165245 -137702 -152533 -289249 47849 436 -31773
10265b04830A47451a16322o962A6493a0927j9520F9694O4032F6624a67028J651
$$ -204830 147451 -116322 -123284 16493 -10927 -30447 69694 133726 66624 -167028 -165377
10254a65377B86005e1464A29940J57774J1395M3687g9766p4216B80635a10226
$$ -165377 286005 -51464 129940 287714 299109 342796 -79766 -153982 280635 -110226
10243a1442l6051o5085o7256B06434h0823J2510o3191b8287p588A78974a9744
$$ -11442 -47493 -112578 -179834 206434 -80823 -68313 -131504 -28287 -35875 178974 -19744
10231b58825p7721B08390c37970J50495m7145a06511A0081a45107A72570b01393
$$ -258825 -336546 208390 -337970 -187475 -234620 -106511 10081 -145107 172570 -201393
10220A82195p021f0612A94194q1424l9411d07009G6230b86124E2907a88070A33852
$$ 182195 175174 -60612 194194 112770 73359 -407009 76230 -286124 52907 -188070 133852
10208H832b18561B6083n774K3059R7772a61677e9655A37185c6492D1802b74253
$$ 8832 -218561 26083 20309 43368 141140 -161677 -59655 137185 -36492 41802 -274253
10196a08061N973q3744A52679J9889i3987k3458G4311b054j28557c509G005d4058
$$ -108061 -102088 -185832 152679 172568 -93987 -117445 74311 -2054 -130611 -3509 7005 -44058
10183a49829B34852r2510a15708k71832J79654f7349k73222b5838j10336j36310
$$ -149829 234852 142342 -115708 -387540 -207886 -67349 -340571 -25838 -136174 -272484
10173b72484f6514a2335j48427k56579b3448A38868a1634A94596f9989B37301
$$ -272484 -66514 -12335 -160762 -417341 -23448 138868 -11634 194596 -69989 237301
10162c90869B9699q028i9765k30442B56863A5520a20332J7570j3342j65674c8
$$ -390869 29699 21671 -99765 -330207 256863 15520 -120332 -102762 -116104 -281778 -38
10150B54012A00665e9765G1784i4486A14112a52170H1188a20439Q789A01391b92374
$$ 254012 100665 -59765 71784 -94486 114112 -152170 81188 -120439 -111650 101391 -292374
10138H9445c84934A63092e38738g788k45961a00987r6064r9486f4600A20652a59750
$$ 89445 -384934 163092 -538738 -7788 -253749 -100987 -197051 -296537 -64600 120652 -159750
10126h242j12239j29183e061B44217a8621A14674d4003n7939m41625a79458G7766
$$ -8242 -120481 -249664 -5061 244217 -18621 114674 -44003 -101942 -543567 -179458 77766
10114A08765h0252A12081h526l35256R5934B3462c25661n115C6410c34040e3950
$$ 108765 -80252 112081 -8526 -343782 -247848 23462 -325661 -330776 36410 -334040 -53950
10102a01907a6635j62487B23744I3895b84674h877m7516j2984b911D7725f1569
$$ -101907 -16635 -179122 223744 93895 -284674 -8877 -56393 -69377 -2911 47725 -61569
10090G186J55491i2619I6692b02287A47466a77759M6892A84329h0742A46275a14096
$$ 7186 162677 -92619 96692 -202287 147466 -177759 -130867 184329 -80742 146275 -114096
10078a38515j12163a03579n1534k19945G7086b14280N5551b0975A65395e3882
$$ -138515 -250678 -103579 -155113 -375058 77086 -214280 -158729 -20975 165395 -53882
10067A58441a72950h541l15600f1697a1542H3806i581k2373A39391a17634j47324
$$ 158441 -172950 -8541 -324141 -61697 -11542 83806 -9581 -31954 139391 -117634 -264958
10056b64958a21983b6714j70330K1055J302G7496h2451k33042d128A02655a45561
$$ -264958 -121983 -26714 -197044 -175989 -174687 77496 -82451 -315493 -4128 102655 -145561
10044e8895A01003B4728A194d54587A08670c53714E6177h2040l3422j32809f6159
$$ -58895 101003 24728 1194 -454587 108670 -353714 56177 -82040 -115462 -248271 -66159
10032B9010J18159J12877a32200l1216j9152B15133b20736B34916f1492n8081
$$ 29010 147169 260046 -132200 -163416 -182568 215133 -220736 234916 -61492 -119573
10022a19573l6687l4091E0878J03904A0417J98600a87518P8804B4502d0095j75540
$$ -119573 -156260 -190351 50878 154782 10417 209017 -187518 -108714 24502 -40095 -215635
10011b15635e7543j6949G0038J6586J6865a55154A90535B4371a41858M0246L360
$$ -215635 -57543 -74492 70038 86624 103489 -155154 190535 24371 -141858 -101612 -98252
10000i8252F172J7311J5974O0302H762b55626j29732J8448b1892j27170a34j6028
$$ -98252 6172 23483 39457 99759 8762 -255626 -385358 -366910 -21892 -149062 -134 -16162
9988a6162I1259a90349D8895b29900E3560b38558N0324A36273c41356F3405c36900
$$ -16162 91259 -190349 48895 -229900 53560 -238558 -188234 136273 -341356 63405 -336900
9976B84651d7163m57657a02845m8826A21649b32433a5864k09628o8423d7387j81883
$$ 284651 -47163 -504820 -102845 -151671 121649 -232433 -15864 -225492 -293915 -47387 -229270
9965b29270Q0288B79190c92372G9793c2357A13413J37519A3042J07071a86432
$$ -229270 -148982 279190 -392372 79793 -32357 113413 250932 13042 120113 -186432
9954A44270D2957J7688a89982l3944d8280C3855b36461J15056F4324P377K217
$$ 144270 42957 60645 -189982 -223926 -48280 33855 -236461 -121405 64324 71701 73918
9943G3918a45691O0919n8404p1466e2616r2776M756f2316B58832a07516C387J40238
$$ 73918 -145691 -84772 -143176 -214642 -52616 -145392 -140636 -62316 258832 -107516 3387 143625
9931A43625c7483r6355L5273p7755b0046o7848a7254G638a79264j03493L5278
$$ 143625 -37483 -133838 -98565 -176320 -20046 -87894 -17254 7638 -179264 -282757 -247479
9920b47479b8985I2491b08610R7298m5340A28401b66015O3326j10491A38109n1998
$$ -247479 -28985 92491 -208610 -111312 -156652 128401 -266015 -202689 -313180 138109 86111
9909H6111a12773j31875p0752d4139j44696a363r64j79190j3473O568J1173B25940
$$ 86111 -112773 -244648 -315400 -44139 -188835 -1363 -2327 -181517 -194990 -188422 -177249 225940
9896D9023K7436c73974H1588N6213j496d0841F2552i7595I076B350a8722E2339
$$ 49023 76459 -373974 81588 137801 136305 -40841 62552 -97595 9076 2350 -18722 52339
9883A65400d51817f3300o5119j2020p8503B0887a50156A29483h5944n3163A91435
$$ 165400 -451817 -63300 -128419 -140439 -218942 20887 -150156 129483 -85944 -139107 191435
9871i9782A85325b60289h1669B0578b4399n1425B3772b06030b2860r4649H2817
$$ -99782 185325 -260289 -81669 20578 -24399 -75824 23772 -206030 -22860 -117509 82817
9859b65873r5028D4358N25683A33976c29336B6236b11767c9658j06162E0034b38867
$$ -265873 -360901 44358 570041 133976 -329336 26236 -211767 -39658 -145820 50034 -238867
9847b1081j94464B18833d0079j22705e4712M520o5673A14714d74013K34536d8669
$$ -21081 -215545 218833 -40079 -162784 -54712 -50192 -115865 114714 -474013 -239477 -48669
9835b5874p4345l83982d8869k6414H2681c58085K8958f4239j0308A53407d7823
$$ -25874 -100219 -484201 -48869 -75283 82681 -358085 -329127 -64239 -74547 153407 -47823
9823e2121J2677j920j20073j18756J20434a7395m06143a11391A16443Q12b12396
$$ -52121 -39444 -41364 -161437 -280193 -159759 -17395 -423538 -111391 116443 117255 -212396
9811a40438j0083f0311B33997h4770q3146N400A98802b52434B21392A3269a72522
$$ -140438 -150521 -60311 233997 -84770 -167916 -162516 198802 -252434 221392 13269 -172522
9799e673p9126j4413j47456A18187c97709D5047P8068g3617k46719l3386B16179
$$ -5673 -84799 -99212 -246668 118187 -397709 45047 123115 -73617 -320336 -353722 216179
9787a19086o4156Q4136r803b0000l7895n5358J4353k55976B30265e9953Q821G1329
$$ -119086 -183242 -99106 -108909 -20000 -57895 -113253 -98900 -354876 230265 -59953 -51132 71329
9774B2117a015C1636N2208N8572o3232a66534c3755C2542a54788l3663A9897J22197
$$ 22117 -1015 31636 83844 142416 79184 -166534 -33755 32542 -154788 -188451 19897 142094
9762A42094L8587b77236g8015B16550i6656j16975P8069l9846n2P5908A7037K10409
$$ 142094 180681 -277236 -78015 216550 -96656 -213631 -135562 -175408 -175460 -99552 17037 227446
9750B27446c0554b17p7820m0443A45184a0388D6145a25C30603a36382C22963J65259
$$ 227446 -30554 -217 -78037 -118480 145184 -10388 46145 -125 330603 -136382 322963 488222
9738D88222F7661l2233a66106k02749a5560k12144Q7278j49267j4091l2925a42532
$$ 488222 67661 35428 -166106 -368855 -15560 -227704 -140426 -289693 -303784 -336709 -142532
9726d9678C2346c02328J42945B48342A16140d1153j46291p7226a3402j68950f0643
$$ -49678 32346 -302328 -159383 248342 116140 -41153 -187444 -264670 -13402 -182352 -60643
9714A34546a70267p1068F5972L7831a33137G1700Q4976F8864d44288P3992a73623
$$ 134546 -170267 -241335 65972 103803 -133137 71700 156676 68864 -444288 -370296 -173623
9702b02232M7523a6923j06158A05982O0835e0354j78013A69868c88299I058L17191
$$ -202232 -154709 -16923 -123081 105982 166817 -50354 -228367 169868 -388299 9058 326249
9691C26249d3452F5561K7888a3170k44830j3289a23480A53455D4392a59934q265
$$ 326249 -43452 65561 93449 -13170 -258000 -271289 -123480 153455 44392 -159934 -168199
9680a68199A30769d47959B65635g4507A43285j3995a35915N3894m4369b512k77676
$$ -168199 130769 -447959 265635 -74507 143285 129290 -135915 -82021 -126390 -2512 -280188
9669b80188B6212P890h8585I9607A2113l071d50148j88328h1675q0025c7953j1672
$$ -280188 26212 34102 -88585 99607 12113 9042 -450148 -638476 -81675 -161700 -37953 -49625
9657d9625k7338B1878D029a06153J6291L8612B46317D0656i7843B2915l293J60587
$$ -49625 -76963 21878 4029 -106153 -89862 -51250 246317 40656 -97843 22915 19622 180209
9645A80209i8215m3520A06437d87072a2794k8352D34100H236J31912b62919B20533
$$ 180209 -98215 -141735 106437 -487072 -12794 -41146 434100 8236 140148 -262919 220533
9633A7707a70794A26860a64252r6883a16202B63855a10477j6141k2850a0755j6293
$$ 17707 -170794 126860 -164252 -261135 -116202 263855 -110477 -126618 -149468 -10755 -27048
9622b7048j1413k49248G5805d4902A2630a6002j22173N775j2315b8628H9270R9964
$$ -27048 -38461 -287709 75805 -44902 12630 -16002 -138175 -132400 -144715 -28628 89270 189234
9610A89234a79538k4828A1040L7639b07064B56874a00928j81765A42899b06167
$$ 189234 -179538 -204366 11040 48679 -207064 256874 -100928 -282693 142899 -206167
9599b3912l9696o7232O566j72470a11386C7146a64190L4683A61418e9257I20b11850
$$ -23912 -63608 -130840 -124274 -296744 -111386 37146 -164190 -129507 161418 -59257 920 -211850
9586c21424b9332A70403b9485k37842A0429N8998j4177a00618C0415d13020A11083
$$ -321424 -29332 170403 -29485 -267327 10429 69427 55250 -100618 30415 -413020 111083
9574a21375b3990o693H6248f7604B90348b45474A56033h7118j79636c8885j39611
$$ -121375 -23990 -30683 86248 -67604 290348 -245474 156033 -87118 -266754 -38885 -178496
9563a78496A46694k2748A9570a05794A9315M54390A05087b6495A6660K09700a60323
$$ -178496 146694 123946 19570 -105794 19315 473705 105087 -26495 16660 226360 -160323
9551a90304N2339N6831f917j39418Q604G6862e29989B02258n5872d1786k01919
$$ -190304 -137965 -81134 -6917 -146335 -137731 76862 -529989 202258 146386 -41786 -243705
9540b43705d2212k19148J10161C767a78215o0219b5098B75769E3481c47234E0470
$$ -243705 -42212 -261360 -151199 3767 -178215 -238434 -25098 275769 53481 -347234 50470
9528a90884a3434G3060a61669A0224M6429J07752g4695k09272j14996F6691J43849
$$ -190884 -13434 73060 -161669 10224 56653 164405 -74695 -283967 -398963 66691 210540
9517B10540a85997Q5305A26221a64652D4766a07466C8728i8142j27282g9861k41636
$$ 210540 -185997 -100692 126221 -164652 44766 -107466 38728 -98142 -225424 -79861 -321497
9506c21497E9111K58263I4516c67093B23223a04139F7133a83371O6246j68634
$$ -321497 59111 317374 94516 -367093 223223 -104139 67133 -183371 -117125 -285759
9496b85759A35485b7638k86148C7550e4354D557K62583K27345A28653e2123H9331
$$ -285759 135485 -27638 -313786 37550 -54354 4557 267140 494485 128653 -52123 89331
9484c01554c7995G0242K1216a61208H7780f4277o7721L3380k0408k72734e0858
$$ -301554 -37995 70242 91458 -161208 87780 -64277 -131998 -98618 -119026 -391760 -50858
9472e3800j60813e7856j45912K0082P1244D4588b54406E731b70920A75621a11197
$$ -53800 -214613 -57856 -203768 -183686 -112442 44588 -254406 5731 -270920 175621 -111197
9460d4063k00370b0395H2957A6044K5911b5100k7111n57055e683A22707E28h349
$$ -44063 -244433 -20395 82957 16044 41955 -25100 -52211 -609266 -5683 122707 528 -8349
9447B10843B4444a16940A25517R2335b25172B2486a24237o2786D6971O6573m0716
$$ 210843 24444 -116940 125517 217852 -225172 22486 -124237 -187023 46971 113544 72828
9436G2828f493j11214H2062d267A63762c1068E3988i0558k28389J5550B10414
$$ 72828 -6493 -117707 82062 -4267 163762 -31068 53988 -90558 -318947 -303397 210414
9424b2729m9708k99345J55574q2730g7772F9663a82688A0028a65921j76785g4340
$$ -22729 -72437 -371782 -216208 -298938 -77772 69663 -182688 10028 -165921 -342706 -74340
9412D3004b24005g1274j68758d5249j78680P844g496C8314L695b2973l31359A34670
$$ 43004 -224005 -71274 -240032 -45249 -223929 -216085 -7496 38314 42009 -22973 -354332 134670
9399e4068j20261A88472F1506g1199A21186f5512B56505a01940A17787a22272
$$ -54068 -174329 188472 61506 -71199 121186 -65512 256505 -101940 117787 -122272
9388f796B9066b9804k06620H7310a31295B63410j12175A0073b37976J11192B78003
$$ -6796 29066 -29804 -236424 87310 -131295 263410 151235 10073 -237976 -126784 278003
9376b21939o9926A73692b9007A59599b09303A44309j5487b80109L3330g3323C3096
$$ -221939 -291865 173692 -29007 159599 -209303 144309 128822 -280109 -246779 -73323 33096
9364d97k17782a595o3654B48564b82717B36767a45917G2925h0780q5763n8597
$$ -497 -218279 -1595 -65249 248564 -282717 236767 -145917 72925 -80780 -166543 -225140
9353b25140a03113A25198l6247K21796h6560B43028c5741k88209F0606a14287
$$ -225140 -103113 125198 88951 310747 -86560 243028 -35741 -323950 60606 -114287
9342a13427l1259D210j52d6467k74171h9482j67829J09808D2023b29506B12812
$$ -113427 -144686 4210 4058 -46467 -320638 -89482 -257311 -147503 42023 -229506 212812
9330C0233b58650A30317A9670c12133E1807a09917j8323L0053A57993A3122c3763
$$ 30233 -258650 130317 19670 -312133 51807 -109917 -128240 -98187 157993 13122 -33763
9318A5134m910a21014j52751f4064C07856a11012G2359b15541p932j0453g6646
$$ 15134 10224 -121014 -273765 -64064 307856 -111012 72359 -215541 -223473 -233926 -76646
9306i5014E6634J2327J14120a74053f5426k19272g9320k31011r3017J22659d0851
$$ -95014 56634 68961 183081 -174053 -65426 -284698 -79320 -310331 -403348 -280689 -40851
9294A12025b2115k44215n7751a7603k25536j4698N3767b8074K309P082G8643N5316
$$ 112025 -22115 -266330 -324081 -17603 -243139 -257837 -204070 -28074 -25765 -18683 78643 133959
9282A33959b70252C30652A7897b66202J04708j02859B45770c0130F3402c18650
$$ 133959 -270252 330652 17897 -266202 -161494 -264353 245770 -30130 63402 -318650
9271b07511p048J8460E8660N3285g5197c1616B0352d6797E3030E589a55630A59650
$$ -207511 -214559 -196099 58660 111945 -75197 -31616 20352 -46797 53030 5589 -155630 159650
9258A0220J167a03444J664C24120b14626A61948a51740k6925g4250A12195a15418
$$ 10220 11387 -103444 -101780 324120 -214626 161948 -151740 -178665 -74250 112195 -115418
9246a95914A133b47343Q725F3733C965c17148g7103A22209p549a16756e0449q2852
$$ -195914 1133 -247343 -238618 63733 3965 -317148 -77103 122209 114660 -116756 -50449 -133301
9234a33301k96321g5792p5176B60909a72510h4496n5158l4384j17565B94605e1634
$$ -133301 -429622 -75792 -150968 260909 -172510 -84496 -139654 -174038 -291603 294605 -51634
9222c45647B70547G0114J38649a70267k6608K0874A74686e3306A71749q0899g9764
$$ -345647 270547 70114 208763 -170267 -196875 -176001 174686 -53306 171749 90850 -79764
9210a57390I2852a66739E7418b19091A6961e5535q9509d2317B42101F4329B7672
$$ -157390 92852 -166739 57418 -219091 16961 -55535 -145044 -42317 242101 64329 27672
9198a04124M5644A59776c9397i927j90930o8738a22760p2566j40263o3480P3383
$$ -104124 -58480 159776 -39397 -9927 -200857 -269595 -122760 -195326 -335589 -399069 -325686
9187c25686f4710A10502c92224a74653A83208A0389K68166E9587a13673A8999
$$ -325686 -64710 110502 -392224 -174653 183208 10389 278555 59587 -113673 18999
9176a30558H4183a27091a5000D8753c057k83832J6283Q7971A02820k226J03080
$$ -130558 84183 -127091 -15000 48753 -3057 -286889 -270606 -182635 102820 100594 203674
9165B03674c4093B10202b71836M0654l1970A51978a57236E1483a4571k75591a06692
$$ 203674 -34093 210202 -271836 -231182 -263152 151978 -157236 51483 -14571 -290162 -106692
9153b38410e8524J9528H3503i1762k18917J7084C0013J81154J08555r9472c373
$$ -238410 -58524 -38996 83503 -91762 -310679 -293595 30013 211167 319722 220250 -3373
9141a25118l36452A31008K13280j00497b2592F076a75720d0075B20930A1134D102
$$ -125118 -461570 131008 344288 243791 -22592 6076 -175720 -40075 220930 11134 4102
9129a44627I921b34140R6107K5196B46030b26680c0240l60788g5494B97600a36539
$$ -144627 9921 -234140 -138033 -112837 246030 -226680 -30240 -391028 -75494 297600 -136539
9117h5697B39526j17066K9311p5047b69896N4374j71212c6714j9277D3446d4449
$$ -85697 239526 122460 151771 76724 -269896 -215522 -386734 -36714 -55991 43446 -44449
9105a6320e967j4704j86558l4714J02357o3715A26774h7117e685k38572d2044
$$ -16320 -5967 -20671 -207229 -241943 -139586 -203301 126774 -87117 -5685 -244257 -42044
9093a84848F6369d2243p2108k50316G3086b78932A2570K2701b22818B14166G879
$$ -184848 66369 -42243 -114351 -364667 73086 -278932 12570 35271 -222818 214166 7879
9081a35904B95537b68803c9664j37421h1599k74017J61601C6251L4481a49463
$$ -135904 295537 -268803 -39664 -177085 -81599 -355616 -194015 36251 70732 -149463
9070A37877i5294p7953D9801E356a23754r3858B14866I966P6439i0721m887j25975
$$ 137877 -95294 -173247 49801 5356 -123754 -217612 214866 9966 86405 -90721 -95608 -221583
9058b21583f9503C7837g2638A43544n3179L0765e78735E8353a83625a190k50904
$$ -221583 -69503 37837 -72638 143544 90365 121130 -578735 58353 -183625 -1190 -252094
9047b52094B6220e112k20477l24113a85930d4612E0534c40138B31053a85295E7749
$$ -252094 26220 -5112 -225589 -549702 -185930 -44612 50534 -340138 231053 -185295 57749
9035E1322a18083d4215q4012k26N6200o9010F6091C2318b29725D1500c66485A85753
$$ 51322 -118083 -44215 -128227 -128453 -72253 -141263 66091 32318 -229725 41500 -366485 185753
9022B35971j13178b60997k78610a69828r0011h4358p7380G1028a05183B7670a0710
$$ 235971 122793 -260997 -539607 -169828 -259839 -84358 -161738 71028 -105183 27670 -10710
9010B92090c88686H0465i4742k15029k82128A93719c44546f9610F152b06956B66332
$$ 292090 -388686 80465 -94742 -309771 -591899 193719 -344546 -69610 6152 -206956 266332
8998A92355f6020m36015b6495p6523j72311a04195j07460A44160j965b67566g1985
$$ 192355 -66020 -502035 -26495 -103018 -275329 -104195 -211655 144160 142195 -267566 -71985
8986b30526C4398c02562a8810r1994A28965a30260j48926A89216R2923c38221
$$ -230526 34398 -302562 -18810 -110804 128965 -130260 -279186 189216 282139 -338221
8975H1231a44249j06415R119Q3345i826j74665c9093j04271A96082a8005E8388
$$ 81231 -144249 -250664 -241545 -158200 -9826 -184491 -39093 -143364 196082 -18005 58388
8963a53393e1257B29775m1371B6681a49928c8110j63620c0904I4933a61134q4072
$$ -153393 -51257 229775 188404 26681 -149928 -38110 -201730 -30904 94933 -161134 -245206
8952b45206j32898A18045g2078K1176j51592j25234A51654a59939B8273b4044
$$ -245206 -378104 118045 -72078 -50902 -202494 -327728 151654 -159939 28273 -24044
8941a75249f7915q7809G8880i6132p4654A08972C506K73186A32267b55225A02597
$$ -175249 -67915 -155724 78880 -96132 -170786 108972 3506 276692 132267 -255225 102597
8929E9457a29235O0021D1791b68806C9705K82425o6897c0149B8870J21362L3922
$$ 59457 -129235 -69214 41791 -268806 39705 322130 255233 -30149 28870 150232 184154
8918A84154K147240r88656A71174n2720J307a9751A38331F0175e8728B5827K85393
$$ 184154 2331394 1342738 171174 118454 119761 -19751 138331 60175 -58728 25827 311220
8907C11220j11516e5884k33817A91572L7619c0571A52554l2164h4930k1531A20728
$$ 311220 199704 -55884 -289701 191572 229191 -30571 152554 120390 -84930 -106461 120728
8895a00499c4194k4546J1220A31315b29404H9524P4928D482f0454j92823d9171
$$ -100499 -34194 -58740 -47520 131315 -229404 89524 164452 4482 -60454 -253277 -49171
8883e6450b775k95800A59651c2614B71639H5670i1444k51049I6110a97836B59524
$$ -56450 -2775 -298575 159651 -32614 271639 85670 -91444 -342493 96110 -197836 259524
8871e5883D8641b61650A36219a68146I6336c97075A25028a5316l64728J88569
$$ -55883 48641 -261650 136219 -168146 96336 -397075 125028 -15316 -380044 -191475
8861a91475A43716d7574l9157n7857A43039b05252j6917n6064R7007p9813K27
$$ -191475 143716 -47574 -86731 -144588 143039 -205252 -222169 -278233 -181226 -261039 -260812
8850b60812c522F8374P2878a04534d8427k92659B55719j01843c25403d5628A42115
$$ -260812 -3522 68374 141252 -104534 -48427 -341086 255719 153876 -325403 -45628 142115
8838b76852D4991a00195D3215q523J86129a33970A30989d2398j58454D3704P1574
$$ -276852 44991 -100195 43215 34692 220821 -133970 130989 -42398 -200852 43704 115278
8827A15278M9914B5434J2822K9020j9202b60327N5002i9153m3859F5004D916d7461
$$ 115278 165192 25434 38256 67276 48074 -260327 -205325 -99153 -143012 65004 4916 -47461
$$ [...]
##END NTUPLES=NMR SPECTRUM
##END=
