##TITLE=NES1087_JR_9885180_06UVmLNAy4
##JCAMPDX= 6.0         $$ Bruker NMR JCAMP-DX V2.0
##DATA TYPE= NMR SPECTRUM
##DATA CLASS= NTUPLES
##ORIGIN= BRUKER
##OWNER= Administrator
$$ 1.72 TOPSPIN		Version 2.1
$$ 2016-08-27 19:43:56.617 -0500  Administrator@X
$$ Compression mode = diff/dup
##.OBSERVE FREQUENCY= 400.02188249412
##.OBSERVE NUCLEUS= ^1H
##.ACQUISITION MODE= SIMULTANEOUS (DQD)
##.ACQUISITION SCHEME= undefined
##.AVERAGES= 64
##.DIGITISER RES= 22
##SPECTROMETER/DATA SYSTEM= spect
##.PULSE SEQUENCE= noesygpps1d.comp
##.SOLVENT NAME= COFFEE_meoh
##.SHIFT REFERENCE= INTERNAL, COFFEE_meoh, 1, 14.96316
##AUDIT TRAIL= $$ (NUMBER, WHEN, WHO, WHERE, PROCESS, VERSION, WHAT)
$$ ##TITLE= Audit trail, TOPSPIN		Version 2.1
$$ ##JCAMPDX= 5.01
$$ ##ORIGIN= Bruker BioSpin GmbH
$$ ##OWNER= Administrator
$$ $$ E:\/data/COFFEE/nmr/NES1087_JR_9885180_06UVmLNAy4/22/pdata/1/auditp.txt
$$ ##AUDIT TRAIL=  $$ (NUMBER, WHEN, WHO, WHERE, PROCESS, VERSION, WHAT)
(   1,<2016-08-27 19:43:51.429 -0500>,<Administrator>,<X>,<go>,<TOPSPIN 2.1>,
      <created by zg
	started at 2016-08-27 19:32:22.133 -0500,
	POWCHK enabled, PULCHK disabled,
       configuration hash MD5:
       21 0F 79 D6 B3 7B B4 F6 88 20 88 DB 03 48 BD 9F
       data hash MD5: 64K
       56 57 CC F8 C4 B4 EB 50 94 97 7C 24 BE 28 3D 20>)
(   2,<2016-08-27 19:43:54.554 -0500>,<Administrator>,<X>,<proc1d>,<TOPSPIN 2.1>,
      <Start of raw data processing
       efp LB = 0.3 FT_mod = 6 PKNL = 1 PHC0 = 0 PHC1 = 0 SI = 128K 
       data hash MD5: 128K
       04 5C 8C 86 26 CC 41 DB 36 DA 16 99 2F 54 2F A8>)
(   3,<2016-08-27 19:43:55.445 -0500>,<Administrator>,<X>,<proc1d>,<TOPSPIN 2.1>,
      <pk PHC0 = -83.38623 PHC1 = 0 
       data hash MD5: 128K
       68 B1 5C C4 8E BA 08 81 BD 0B CB 9C 0F 86 B7 50>)
(   4,<2016-08-27 19:43:55.820 -0500>,<Administrator>,<X>,<proc1d>,<TOPSPIN 2.1>,
      <abs ABSG = 1 
       data hash MD5: 128K
       27 C6 B2 CA C1 C6 7C 29 BE A6 C8 90 31 3E 98 06>)
(   5,<2016-08-27 19:43:55.914 -0500>,<Administrator>,<X>,<proc1d>,<TOPSPIN 2.1>,
      <abs ABSG = 2 
       data hash MD5: 128K
       B2 43 64 7E DA AA E2 78 68 83 6A 26 EF 4D CF 21>)
(   6,<2016-08-27 19:43:55.992 -0500>,<Administrator>,<X>,<proc1d>,<TOPSPIN 2.1>,
      <abs ABSG = 3 
       data hash MD5: 128K
       6A 4C C0 AA C0 4F C8 AC 9E 8F 3B A5 BA AF 3C 5F>)
(   7,<2016-08-27 19:43:56.086 -0500>,<Administrator>,<X>,<proc1d>,<TOPSPIN 2.1>,
      <abs ABSG = 4 
       data hash MD5: 128K
       35 D8 A9 71 46 AA 17 07 D0 64 E9 F4 C3 01 32 20>)
(   8,<2016-08-27 19:43:56.164 -0500>,<Administrator>,<X>,<proc1d>,<TOPSPIN 2.1>,
      <abs ABSG = 5 
       data hash MD5: 128K
       41 A9 D3 AF F7 2D 46 3D C2 F7 03 13 29 E1 FE A5>)
$$ ##END=
$$ 
$$ $$ hash MD5
$$ $$ 53 9D AD 74 DF A5 F3 3A 71 0F A3 F8 A6 F8 B2 2A
##$RELAX= 
##$RELAX= 
##$RELAX= 
##$RELAX= 
##$RELAX= 
##$RELAX= 
##$RELAX= 
##$RELAX= 
$$ Bruker specific parameters
$$ --------------------------
##$DU= <E:\>
##$EXPNO= 22
$$ [...]
##$TP07= 0
##$TPNAME0= <>
##$TPNAME1= <>
##$TPNAME2= <>
##$TPNAME3= <>
##$TPNAME4= <>
##$TPNAME5= <>
##$TPNAME6= <>
##$TPNAME7= <>
##$TPOAL= (0..7)
0.5 0.5 0.5 0.5 0.5 0.5 0.5 0.5
##$TPOFFS= (0..7)
0 0 0 0 0 0 0 0
##$TUNHIN= 0
##$TUNHOUT= 0
##$TUNXOUT= 0
##$USERA1= <user>
##$USERA2= <user>
##$USERA3= <user>
##$USERA4= <user>
##$USERA5= <user>
##$V9= 5
##$VALIST= <valist>
##$VCLIST= <CCCCCCCCCCCCCCC>
##$VD= 0
##$VDLIST= <DDDDDDDDDDDDDDD>
##$VPLIST= <PPPPPPPPPPPPPPP>
##$VTLIST= <TTTTTTTTTTTTTTT>
##$WBST= 1024
##$WBSW= 4
##$XGAIN= (0..3)
0 0 0 0
##$XL= 0
##$YL= 0
##$YMAX_a= 6970056
##$YMIN_a= -15200350
##$ZGOPTNS= <>
##$ZL1= 120
##$ZL2= 120
##$ZL3= 120
##$ZL4= 120
##$ABSF1= 14.96316
##$ABSF2= -5.595022
##$ABSG= 5
##$ABSL= 3
##$ALPHA= 0
##$AQORDER= 0
##$ASSFAC= 0
##$ASSFACI= 0
##$ASSFACX= 0
##$ASSWID= 0
##$AUNMP= <proc_prof1d_extract.lims>
##$AXLEFT= 0
##$AXNAME= <>
##$AXNUC= <1H>
##$AXRIGHT= 0
##$AXTYPE= 0
##$AXUNIT= <>
##$AZFE= 0.1
##$AZFW= 0.1
##$BCFW= 0
##$BC_mod= 0
##$BYTORDP= 0
##$COROFFS= 0
##$CY= 15
##$DATMOD= 1
##$DC= 0
##$DFILT= <>
##$DTYPP= 0
##$F1P= 0
##$F2P= 0
##$FCOR= 0.5
##$FTSIZE= 131072
##$FT_mod= 6
##$GAMMA= 0
##$GB= 0
##$INTBC= 1
##$INTSCL= 1
##$ISEN= 128
##$LB= 0.3
##$LEV0= 0
##$LPBIN= 0
##$MAXI= 10000
##$MC2= 0
##$MEAN= 0
##$ME_mod= 0
##$MI= 0
##$NCOEF= 0
##$NC_proc= -2
##$NLEV= 6
##$NOISF1= 0
##$NOISF2= 0
##$NSP= 0
##$NTH_PI= 0
##$NZP= 0
##$OFFSET= 14.96316
##$PC= 1
##$PHC0= -83.38623
##$PHC1= 0
##$PH_mod= 1
##$PKNL= yes
##$PPARMOD= 0
##$PPDIAG= 0
##$PPIPTYP= 0
##$PPMPNUM= 2147483647
##$PPRESOL= 1
##$PSCAL= 4
##$PSIGN= 0
##$PYNMP= <proc.py>
##$REVERSE= no
##$SF= 400.020008773055
##$SI= 131072
##$SIGF1= 0
##$SIGF2= 0
##$SINO= 400
##$SIOLD= 131072
##$SPECTYP= <>
##$SREGLST= <1H.CDCl3>
##$SSB= 0
##$STSI= 131072
##$STSR= 0
##$SW_p= 8223.68421052631
##$SYMM= 0
##$S_DEV= 0
##$TDeff= 65536
##$TDoff= 0
##$TI= <>
##$TILT= no
##$TM1= 0
##$TM2= 0
##$TOPLEV= 0
##$USERP1= <user>
##$USERP2= <user>
##$USERP3= <user>
##$USERP4= <user>
##$USERP5= <user>
##$WDW= 1
##$XDIM= 131072
##$YMAX_p= 411854067
##$YMIN_p= -13545
##$CURPLOT= <Network HP LaserJet P1505>
##$CURPRIN= <$Network HP LaserJet P1505>
##$DFORMAT= <normdp>
##$LAYOUT= <+/1D_H.xwp>
##$LFORMAT= <normlp>
##$PFORMAT= <normpl>
##$SURQMSG= 1
$$ End of Bruker specific parameters
$$ ---------------------------------
##NTUPLES= NMR SPECTRUM
##VAR_NAME=  FREQUENCY,     SPECTRUM/REAL,   SPECTRUM/IMAG
##SYMBOL=    X,             R,               I
##VAR_TYPE=  INDEPENDENT,   DEPENDENT,       DEPENDENT
##VAR_FORM=  AFFN,          ASDF,            ASDF
##VAR_DIM=   131072,        131072,          131072
##UNITS=     HZ,            ARBITRARY UNITS, ARBITRARY UNITS
##FACTOR=    0.0627417313425164, 1,          1
##FIRST=     8223.62146879497, -2715,        -44263
##LAST=      0,             -1984,           -45623
##MIN=       0,             -13545,          0
##MAX=       8223.62146879497, 411854067,    0
$$ Real data points
##PAGE= N=1
##DATA TABLE= (X++(R..R)), XYDATA
$$ [...]
60999A527170P3581Q3383R4957J07370J18950J29574J40921J54975J74048K01733
60989B806662K41394K93923L58925M37216N29721O35973P58759R09454J102984
60980H075011J347345J642258J979327K318531K552311K520771K113673J386889
60972B3936116N67835p8181m00938m03183j68519K01122N71822P57111N85036
60963B5568221K4112p64393j520199k042798k276235k275444k126438j900480
60955A2686346j649712j409888j197618j014029q56087p22458o10802n16653m37168
60946D271931l72324l21271k80749k47891k21593k00360j81705j64545j49648
60937B131845j36879j24376j11252r8814q8229p9090p1107o5149o1535n9107n6896
$$ plain form
60999 1527170 1600751 1684134 1779091 1886461 2005411 2134985 2275906 2430881 2604929 2806662
60989 2806662 3048056 3341979 3700904 4138120 4667841 5303814 6062573 6972027 8075011
60980 8075011 9422356 11064614 13043941 15362472 17914783 20435554 22549227 23936116
60972 23936116 24503951 24425770 24024832 23621649 23453130 23654252 24226074 24983185 25568221
60963 25568221 25592333 24827940 23307741 21264943 18988708 16713264 14586826 12686346
60955 12686346 11036634 9626746 8429128 7415099 6559012 5836554 5225752 4709099 4271931
60946 4271931 3899607 3578336 3297587 3049696 2828103 2627743 2446038 2281493 2131845
60937 2131845 1994966 1870590 1759338 1660524 1572295 1493205 1422098 1356949 1295414 1236307 1179411
60926A179411n5086n3498n0895m6772m2341l8715l5433l1728k7972k4938k2655
60915G49378k0824j9369j7950j5926j3391j1291j0021r002p953p383p325o946
60903F01997n996n388n615n814n205m308l842l470k568j409o03jR96K486M014
60888E65274N125N560N421N340N895O662O667N904N434N724N944N407M599M244
60874F43200M160L781L048K155R92n48k248l869n315o309o505o189o129o599p154
60859F06471p436p423o814n210l049j395n31K40J229J956K377L304N013O585P278
60844F02595P529P959Q343Q328Q363R076J0361J1689J2763J3382J3254J2448J1519
60831G37609J0857J0432J0308J0570J0622R598P721O310O003O074N825N498N270
$$ plain form
60926 1179411 1124325 1070827 1019932 973160 930819 892104 856671 824943 796971 772033 749378
60915 749378 728554 709185 691235 675309 661918 650627 640606 631604 623651 616268 608943 601997
60903 601997 596001 590613 584998 579184 573979 569671 565829 562359 559791 558382 557779 557778 558774 561260 565274
60888 565274 570399 575959 581380 586720 592615 599277 605944 611848 617282 623006 628950 634357 638956 643200
60874 643200 647360 651141 654189 656344 657336 656788 654540 650671 645356 639047 632542 626353 620224 613625 606471
60859 606471 599035 591612 584798 579588 576539 575144 574613 574853 576082 578038 580415 583719 588732 595317 602595
60844 602595 610124 618083 626426 634754 643117 652193 662554 674243 687006 700388 713642 726090 737609
60831 737609 748466 758898 769206 779776 790398 799996 807717 814027 820030 826104 831929 837427 842697
60818H42697M604L371K529K777L350L083J850K19j609l590n271o344p253q532
60804H31881r969j0968j1278j0911j0003r122q960r235q744o999m888l208j624
60791G25972J70J404J407Q16N29K37p72k028k446k077j969k491l001l064k928
60776G09759k724k117j032LN20P35J315K653M359N482N519N170N586O840P782
60761G49850P651P065P008P630Q489R359J0231J1036J1815J2640J3066J2452J1079
60748H79371J0124J0043R917Q936P536O403N375M191L360L226L093K359J716J991
60734I57641K449J617o14l027m986p043r688j2607j5243j7243j8330j8538j8506
60721H35882j8895j9540j9778j9402j8699j7843j6898j6175j5769j5072j3500
$$ plain form
60818 842697 847301 850672 853201 855978 859328 862411 864261 864480 862871 859281 854010 847666 840413 831881
60804 831881 821912 810944 799666 788755 778752 769630 760670 751435 742691 735692 730804 727596 725972
60791 725972 726142 727546 728953 729769 730298 730535 729763 727735 725289 723212 721243 718752 715751 712687 709759
60776 709759 707035 704918 703886 703889 704409 705144 706459 709112 713471 718953 724472 729642 735228 742068 749850
60761 749850 757501 764566 771574 779204 787693 797052 807283 818319 830134 842774 855840 868292 879371
60748 879371 889495 899538 909455 918391 925927 932330 937705 941896 945256 948482 951575 953934 955650 957641
60734 957641 960090 961707 961093 958066 953080 946037 936349 923742 908499 891256 872926 854388 835882
60721 835882 816987 797447 777669 758267 739568 721725 704827 688652 672883 657811 644311
60710F44311j1497j0004r091p921n990l696j693k38Q31K049L996O535Q607R373
60696F25572R277R398J0027J0561J0492R773Q354O180L599J170r28k821m472n828
60682F90354p198q889j0568j1595j1831j1641j1292j0776j0061r024p424n444
60670E74611l857l149k776j940p29J81O26J071J718K204K139J483N92J23N38J372
60654E74207J569J008R24K107L532L751L008K698L191L527L154K720K977L963
60640F12336N309O573P203P061O953P702Q839R206Q804Q807R593J0039R332Q213
60626G25970P723P639P136O299N971O328O642O421O116O356P011P373P061O391
60612H20437N845N494N121M623L948K885J434K82J87P57N74j093l417n296o779
$$ plain form
60710 644311 632814 622810 613719 605798 599808 596112 594419 594181 595012 597061 601057 607592 616199 625572
60696 625572 634849 644247 654274 664835 675327 685100 693454 699634 703233 704403 703475 700654 696182 690354
60682 690354 683156 674267 663699 652104 640273 628632 617340 606564 596503 587479 580055 574611
60670 574611 570754 567605 564829 562889 562160 562341 562967 564038 565756 567960 570099 571582 572174 572297 572835 574207
60654 574207 575776 576784 577708 579815 583347 587098 590106 592804 595995 599522 602676 605396 608373 612336
60640 612336 617645 624218 631421 638482 645435 653137 661976 671182 679986 688793 698386 708425 717757 725970
60626 725970 733693 741332 748468 754767 760738 767066 773708 780129 786245 792601 799612 806985 814046 820437
60612 820437 826282 831776 836897 841520 845468 848353 849787 850069 850256 851013 851587 850494 847077 841781 835002
60597H35002q522j0310j1142j0518r008p518o550o027n474m452l146k283k128
60584G47924k020j279j56O93J203J702K119K057J446M80q41k535m300n841p267
60569G33385q571r151q592p554p127p515p996p980p368o190m588l042j879p42
60555F45090Q59K713M262N501O830Q303R792J1589J4038J6822J9437K2194K5882
60542G93312L0585L5706M1075M7015N3239N8400O0877N9384N3088M2029K7531
60531A302241J1567m357j9093l1086l8807m2070m2027l9695l5289k9153k2350
60520A009881j5933j0163m853J8M297P774J0083J0877J0382R487R028R158R544
60507A059580J0153J1771J5597K2006K9949L8156M6879N7533P0547Q4769R9550
$$ plain form
60597 835002 826480 816170 805028 794510 785502 777984 771434 765407 759933 755481 752335 750052 747924
60584 747924 745904 744625 744469 745162 746365 748067 750186 752243 753689 754169 753328 750793 746493 740652 733385
60569 733385 724814 715663 707071 699517 692390 684875 676879 668899 661531 655341 650753 647711 645832 645090
60555 645090 645949 648662 652924 658425 665255 673558 683350 694939 708977 725799 745236 767430 793312
60542 793312 823897 859603 900678 947693 1000932 1059332 1120209 1179593 1232681 1274710 1302241
60531 1302241 1313808 1309451 1290358 1259272 1220465 1178395 1136368 1096673 1061384 1032231 1009881
60520 1009881 993948 983785 978932 978950 983247 991021 1001104 1011981 1022363 1031850 1040878 1050036 1059580
60507 1059580 1069733 1081504 1097101 1119107 1149056 1187212 1234091 1291624 1362171 1446940 1546490
60496A546490J16047J35450J56944J78769K00466K22709K45567K68530K91740
60487C362712L15190L36079L48081L43631L16698K64408J88016R3049j2152j18285
60477E437427k15544k94036l46531l71756l74212l60523l36528l06916k75305
60468B556076k43869k13859j86749j63840j44722j27624j11570r7103q4697p3913
60458A108130o4510n6985n1309m6397m1427l6717l2674k8983k5488k2792k1254
60447F79594k0217j8931j7460j6066j4488j2471j0338q469o849n606n143n280
60435E38276n036l888k569k060k425l150m014m991n809o055n390l518n58K448
60421D91261M140M293L918L711L361K667K290K713L387L564L297L048K898K821
$$ plain form
60496 1546490 1662537 1797987 1954931 2133700 2334166 2556875 2802442 3070972 3362712
60487 3362712 3677902 4013981 4362062 4705693 5022391 5286799 5474815 5567864 5555712 5437427
60477 5437427 5221883 4927847 4581316 4209560 3835348 3474825 3138297 2831381 2556076
60468 2556076 2312207 2098348 1911599 1747759 1603037 1475413 1363843 1266740 1182043 1108130
60458 1108130 1043620 986635 935326 888929 847502 810785 778111 749128 723640 700848 679594
60447 679594 659377 640446 622986 606920 592432 579961 569623 561154 554305 548699 543556 538276
60435 538276 533240 529352 526783 524723 522298 519148 515134 510143 504334 498279 492889 489371 488813 491261
60421 491261 495401 499694 503612 507323 510684 513351 515641 518354 521741 525305 528602 531650 534548 537369
60407E37369L043L584L965L871L601L431L193K878K938L505M027M165M382N023
60393E88975N499N039L792K566J871J687J718J480O06m54o23N05J910K196J043
60378F17810o68j788j832j360j508k629l566l008j392l98n62p40j51M94N31N68
60362E99801J265K081K345K570L523M742N186M825M515M629M807M764M571M348
60348F53972M248M433M568L885K349J048P46P16q4j342j901j540j111j136j260
60333F67591j122q54o54m34p4N02J354K323K917K844K446K218K128J762R75J0
60317F83932p72j099r86r33j466k361k809k573k279k257j924q91N8n6j045j850
60301F60689j895j425q32l53k54o97j519k434l244l664l378k572j899j586j147
$$ plain form
60407 537369 540412 543996 547961 551832 555433 558864 562057 564935 567873 571378 575405 579570 583952 588975
60393 588975 594474 599513 603305 605871 607742 609429 611147 612627 613233 612779 612156 612661 614571 616767 617810
60378 617810 617142 615354 613522 612162 610654 608025 604459 601451 600059 599661 599099 598359 598208 598702 599233 599801
60362 599801 601066 603147 605492 608062 611585 616327 621513 626338 630853 635482 640289 645053 649624 653972
60348 653972 658220 662653 667221 671106 673455 674503 675249 675965 675881 674539 672638 671098 669987 668851 667591
60333 667591 666469 665615 664961 664527 664453 664955 666309 668632 671549 674393 676839 679057 681185 682947 683922 683932
60317 683932 683160 682061 681075 680142 678676 676315 673506 670933 668654 666397 664473 663582 663640 663584 662539 660689
60301 660689 658794 657369 656537 656184 655930 655233 653714 651280 648036 644372 640994 638422 636523 634937 633790
60286F33790l29M01P22J115K034L049L556L768M287N131N869O335O606O605O373
60271F89312O339O823P597Q357R191J0117J0773J1156J1994J3731J5674J6939
60259H18003J7787J9089K0940K2647K3962K5489K7873L1100L4729L8419M2260
60248A122298M6698N1935N7465O2634O7737P3719Q0693Q7581R3582R9052J04406
60237A947800J09161J12632J14718J15171J13089J07971J00524R1589Q1043O8703
60227B962401N5427M2177K8657J4118r15j4912k6889l6672m4003m8533n0453n0151
60215B830252m7402m1864l4118k5300j5931n932M557J5235K6273L7968M9977O1781
60203B855496P3556Q5696R7683J08317J16758J22572J25089J23734J18783J10845
$$ plain form
60286 633790 633461 633862 634584 635699 637733 640782 644338 648106 652393 657524 663393 669728 676334 682939 689312
60271 689312 695651 702474 710071 718428 727619 737736 748509 759665 771659 785390 801064 818003
60259 818003 835790 854879 875819 898466 922428 947917 975790 1006890 1041619 1080038 1122298
60248 1122298 1168996 1220931 1278396 1341030 1408767 1482486 1563179 1650760 1744342 1843394 1947800
60237 1947800 2056961 2169593 2284311 2399482 2512571 2620542 2721066 2812655 2893698 2962401
60227 2962401 3017828 3060005 3088662 3102780 3101865 3086953 3060064 3023392 2979389 2930856 2880403 2830252
60215 2830252 2782850 2740986 2706868 2681568 2665637 2659705 2664262 2679497 2705770 2743738 2793715 2855496
60203 2855496 2929052 3014748 3112431 3220748 3337506 3460078 3585167 3708901 3827684 3938529
60193C938529R9905Q5744O8997N0810L1695J1733q342k7384m5016o1524p6561
60182D068586q8922r7661j02546j03444j00250r3538q4437p3679o1362m7606l2841
60171C182300j7538k182J2698K6958M0971N4668O6878P6279Q2520Q5611Q4922
60160C694085P9833P1056O0060M7598L3896J9935P122m255j4894k4777l2754l7935
60148C898970m0362m0208l7388l2198k5349j7139p388L765J5915K9283M4658O2369
60136C854928Q2043J03356J26158J49962J74190J98823K23848K48297K70872K91330
60126E723807L09987L25974L37391L43349L44450L41057L32369L17664K97203
60117H673251K71438K40425K04606J65164J23055P8594L2407j4219o0341j05789
$$ plain form
60193 3938529 4038434 4124178 4193175 4243985 4275680 4287413 4279071 4251687 4206671 4145147 4068586
60182 4068586 3979664 3882003 3779457 3676013 3575763 3482225 3397788 3324109 3262747 3215141 3182300
60171 3182300 3164762 3162580 3175278 3202236 3243207 3297875 3364753 3441032 3523552 3609163 3694085
60160 3694085 3773918 3844974 3905034 3952632 3986528 4006463 4013585 4009330 3994436 3969659 3936905 3898970
60148 3898970 3858608 3818400 3781012 3748814 3723465 3706326 3698938 3702703 3718618 3747901 3792559 3854928
60136 3854928 3936971 4040327 4166485 4316447 4490637 4689460 4913308 5161605 5432477 5723807
60126 5723807 6033794 6359768 6697159 7040508 7384958 7726015 8058384 8376048 8673251
60117 8673251 8944689 9185114 9389720 9554884 9677939 9756533 9788940 9774721 9714380 9608591
60107I608591j49989j91164k27267k56967k79346k93495k99041k96439k86270
60098G328613k68959k45575k18230j89037j59134j29068r9486p0989m3851j8139
60088E886145O312L0109N3695P6200R5609J10371J20022J24026J21030J10172
60078F733691R2424O9975M4710J7904r149l5151n9403q1921j02917j22393j40098
60067F407672j55621j68512j78389j84788j87178j85403j80013j71768j60934
60058D835066j47559j32192j15742r8656q0867o2425m3578k4295m454J5507L4749
60047D175554N2936P0294Q6829J01972J14931J24716J30039J29955J24614J14806
60037E226646J00941Q3283O2787M0684J7411o969l1448n4454p5556r5364j13535
$$ plain form
60107 9608591 9458602 9267438 9040171 8783204 8503858 8210363 7911322 7614883 7328613
60098 7328613 7059654 6814079 6595849 6406812 6247678 6118610 6019124 5948135 5904284 5886145
60088 5886145 5892457 5922566 5976261 6052461 6148070 6258441 6378463 6502489 6623519 6733691
60078 6733691 6826115 6896090 6940800 6958704 6949555 6914404 6855001 6773080 6670163 6547770 6407672
60067 6407672 6252051 6083539 5905150 5720362 5533184 5347781 5167768 4996000 4835066
60058 4835066 4687507 4555315 4439573 4340917 4260050 4197625 4154047 4129752 4125298 4140805 4175554
60047 4175554 4228490 4298784 4385613 4487585 4602516 4727232 4857271 4987226 5111840 5226646
60037 5226646 5327587 5410870 5473657 5514341 5531752 5524783 5493335 5438881 5363325 5267961 5154426
60026E154426j28288j38384j44287j46726j45395j39928j31181j20524j08461
60017C951252r4778p9598o3604m7458l1442j5418J146J8719L7147N5838P4486
60006C806290R3065J11194J28299J44317J59337J72400J81599J85563J84001J76702
59996E342767J63217J43998J20796R5262O7899L8844Q836k1165n0616p8955j05000
59985E725883j27226j44250j54916j58623j55945j48314j36797j21755j03767
59976D474290q4180o4449m5566k8179j2545J763J5313K7960L9373N0238O1684
59965D435702P3407Q3704R1604R7580J01777J03012J00290R3966Q4780P2955N9082
59954E397859M4629L0554J6508K368j0597k1091k9209l5284l8253l6500k9697
$$ plain form
60026 5154426 5026138 4887754 4743467 4596741 4451346 4311418 4180237 4059713 3951252
60017 3951252 3856474 3776876 3713272 3665814 3634372 3618954 3620100 3638819 3675966 3731804 3806290
60006 3806290 3899355 4010549 4138848 4283165 4442502 4614902 4796501 4982064 5166065 5342767
59996 5342767 5505984 5649982 5770778 5866040 5933939 5972783 5981619 5960454 5909838 5830883 5725883
59985 5725883 5598657 5454407 5299491 5140868 4984923 4836609 4699812 4578057 4474290
59976 4474290 4390110 4325661 4280095 4251916 4239371 4241134 4256447 4284407 4323780 4374018 4435702
59965 4435702 4509109 4592813 4684417 4781997 4883774 4986786 5087076 5181042 5265822 5338777 5397859
59954 5397859 5442488 5473042 5489550 5491918 5481321 5460230 5431021 5395737 5357484 5320984 5291287
59943E291287j8548l281J6323L9718O5623R3264J22771J54516J88667K25143K63448
59932F438931L02576L41487L79087M13515M42014M61957M71254M67454M47459
59923A0165734M09066L52233K78543J90584R2755q429j06238j95701k73252l35580
59913A0569715l80269m07243m18437m16290m03245l81983l54931l23600k89143
59904G194574k53094k16718j80153j43196j06508p1103l7053l730K8971O0644
59894F272634R1317J21165J49295J73798J93087K06365K12657K10166J96989J72232
59884G999705J36549R1942M1017j3730o9686j23374j70943k09944k39971k61149
59874G180416k72983k75557k70896k61894k50323k36974k23129k10559k00129
$$ plain form
59943 5291287 5272739 5269458 5285781 5325499 5391122 5484386 5607157 5761673 5950340 6175483 6438931
59932 6438931 6741507 7082994 7462081 7875596 8317610 8779567 9250821 9718275 10165734
59923 10165734 10574800 10927033 11205576 11396160 11488915 11480486 11374248 11178547 10905295 10569715
59913 10569715 10189446 9782203 9363766 8947476 8544231 8162248 7807317 7483717 7194574
59904 7194574 6941480 6724762 6544609 6401413 6294905 6223802 6186749 6183019 6211990 6272634
59894 6272634 6363951 6485116 6634411 6808209 7001296 7207661 7420318 7630484 7827473 7999705
59884 7999705 8136254 8228196 8269213 8255483 8185797 8062423 7891480 7681536 7441565 7180416
59874 7180416 6907433 6631876 6360980 6099086 5848763 5611789 5388660 5178101 4977972
59865D977972j91390j83567j75944j67521j57412j45739j33357j20560j06809
59856C595673r1795p6094o0643m6162l3114k1820j2539n875k908m392r881j8075
59844C212375k7764l8058m7914n6126o1858o4814o5086o3126n9661n5213m9855
59833B622900m3583l6584k8889k0275j0825j153Q229J7160K5157L1317L5567L9290
59821B638311M3963M9652N5391O0405O4118O5549O3638N8021M8991L7201K3951
59810C209191J1156K38q537j5113j8870j9494j7813j4733r864k212Q256K0659
59798C142864L4342M9140O5055Q2669J03257J27470J54455J83268K14555K49514
59788D406589K87650L26715L64063L96162M16681M16842L88686L28282K37394
$$ plain form
59865 4977972 4786582 4603015 4427071 4259550 4102138 3956399 3823042 3702482 3595673
59856 3595673 3503878 3427784 3367141 3320979 3287865 3266045 3253506 3247631 3244723 3240331 3230450 3212375
59844 3212375 3184611 3146553 3098639 3042513 2980655 2915841 2850755 2787629 2727968 2672755 2622900
59833 2622900 2579317 2542733 2513844 2493569 2482744 2481591 2489820 2506980 2532137 2563454 2599021 2638311
59821 2638311 2682274 2731926 2787317 2847722 2911840 2977389 3041027 3099048 3148039 3185240 3209191
59810 3209191 3220347 3220585 3212048 3196935 3178065 3158571 3140758 3126025 3116161 3113949 3122205 3142864
59798 3142864 3177206 3226346 3291401 3374070 3477327 3604797 3759252 3942520 4157075 4406589
59788 4406589 4694239 5020954 5385017 5781179 6197860 6614702 7003388 7331670 7569064
59779G569064J24363L539j08694j99711k63736l00710l13840l08172k89460k62825
59769E649818k32232k00945j71453j44794j20825r9485q1162o5844n2771m1155
59759D439152l0551k0424j0052R64J2646K5090L8393N2260O6405Q1138R6765J12750
59747D864536J28444J44570J62818J83854K06849K31122K57105K85315L15449
59738F780062L47070L80335M15379M51406M86780N19474N47139N67189N77283
59729A1072117N75642N61099N33566M94753M48168L98420L50741L10635K82832
59720A5027973K70110K73269K91801L23947L66420M15229M66921N18356N65476
59711A8519502O03330O27512O34784O22414N88198N31905M56128L65303K64424
$$ plain form
59779 7569064 7693427 7696966 7588272 7388561 7124825 6824115 6510275 6202103 5912643 5649818
59769 5649818 5417586 5216641 5045188 4900394 4779569 4680084 4598922 4533078 4480307 4439152
59759 4439152 4408601 4388177 4378125 4379089 4391735 4416825 4455218 4507478 4573883 4655021 4751786 4864536
59747 4864536 4992980 5137550 5300368 5484222 5691071 5922193 6179298 6464613 6780062
59738 6780062 7127132 7507467 7922846 8374252 8861032 9380506 9927645 10494834 11072117
59729 11072117 11647759 12208858 12742424 13237177 13685345 14083765 14434506 14745141 15027973
59720 15027973 15298083 15571352 15863153 16187100 16553520 16968749 17435670 17954026 18519502
59711 18519502 19122832 19750344 20385128 21007542 21595740 22127645 22583773 22949076 23213500
59702B3213500J58845N4533m2202j25307j89751k32585k53576k54246k36165k00550
59692B1892496j49258q5087j0648P2419J62960K59650L61133M66163N73144O79796
59682B4222768P83340Q80371R66017J033288J073363J076646J034286R39996P91648
59673C2801723N92124L49864P9275k00267m67795p04803q97567j037773j122914
59664B9391867j156324j145663j100797j033252r56781q86563q36278q14879q24354
59655B0636976q58566r04361r46247r72509r78294r64220r33449q90077q38505
59646A2350748p82683p25591o69442o15815n65371n17935m73283m31625l93256
59637G175747l58076l25552k95001k65956k38490k13018j89545j67525j46749
$$ plain form
59702 23213500 23372345 23426878 23384676 23259369 23069618 22837033 22583457 22329211 22093046 21892496
59692 21892496 21743238 21658151 21647503 21719922 21882882 22142532 22503665 22969828 23542972 24222768
59682 24222768 25006108 25886479 26852496 27885784 28959147 30035793 31070079 32010075 32801723
59673 32801723 33393847 33743711 33822986 33622719 33154924 32450121 31552554 30514781 29391867
59664 29391867 28235543 27089880 25989083 24955831 23999050 23112487 22276209 21461330 20636976
59655 20636976 19778410 18874049 17927802 16955293 15976999 15012779 14079330 13189253 12350748
59646 12350748 11568065 10842474 10173032 9557217 8991846 8473911 8000628 7569003 7175747
59637 7175747 6817671 6492119 6197118 5931162 5692672 5479654 5290109 5122584 4975835
59628D975835j27804j11054r5851q1471o8306n7115m7722l9635l3585l1013l2115
59617D250164l5637m0672m7353n5622o4518p3060q0843q7448r2294r5276r6666
59606C480775r6209r3312q8328q2563p6696p0248o2943n5411m8104m0666l2961
59595B733334k5735j9424j3273o493L71O095J0297J3578J6414J8635J9848J9891
59583B773538J8997J7716J6569J5796J5591J6468J8854K2431K6550L1278L7278
59572C011066M4610N2412N9986O7484P5397Q4093R4086J05932J19472J33793J48336
59561C996667J63436J79503J96243K13043K29578K45634K60682K73948K84624
59552F043358K91865K94962K93690K88328K79316K67071K51994K34398K14763
$$ plain form
59628 4975835 4848031 4736977 4641126 4559655 4491349 4434234 4386512 4346877 4313292 4282279 4250164
59617 4250164 4214527 4173855 4126502 4070880 4006362 3933302 3852459 3765011 3672717 3577441 3480775
59606 3480775 3384566 3291254 3202926 3120363 3043667 2973419 2910476 2855065 2806961 2766295 2733334
59595 2733334 2707599 2688175 2674902 2668409 2668780 2674875 2685172 2698750 2715164 2733799 2753647 2773538
59583 2773538 2792535 2810251 2826820 2842616 2858207 2874675 2893529 2915960 2942510 2973788 3011066
59572 3011066 3055676 3108088 3168074 3235558 3310955 3395048 3489134 3595066 3714538 3848331 3996667
59561 3996667 4160103 4339606 4535849 4748892 4978470 5224104 5484786 5758734 6043358
59552 6043358 6335223 6630185 6923875 7212203 7491519 7758590 8010584 8244982 8459745
59543H459745J94082J73225J51457J26618R8063O8964M4447K7671J8699J6713
59533I379684K1527L2918M9960P1464R5876J20410J41405J55914J62003J57488
59523A0388649J39905J08514O5211J2936m6002j09430j74183k36366k92494l40140
59513I516600l77996m05628m22830m29299m25456m13303l95539l73891l49102
59504E923556l22241k94813k67615k40646k14244j89186j65703j43542j22969
59495C962597j04469q7427p0500n3369l6812k0960m986J1263K7043M2417N8639
59484C723436P6311R4669J13185J32383J52398J72274J91345K09875K27646K43230
59474E336752K55387K63674K66915K62591K48772K25472J93383J52762J04548
$$ plain form
59543 8459745 8653827 8827052 8978509 9105127 9203190 9272154 9316601 9344272 9362971 9379684
59533 9379684 9401211 9434129 9484089 9555553 9651429 9771839 9913244 10069158 10231161 10388649
59523 10388649 10528554 10637068 10702279 10715215 10669213 10559783 10385600 10149234 9856740 9516600
59513 9516600 9138604 8732976 8310146 7880847 7455391 7042088 6646549 6272658 5923556
59504 5923556 5601315 5306502 5038887 4798241 4583997 4394811 4229108 4085566 3962597
59495 3962597 3858128 3770701 3700201 3646832 3610020 3589060 3584074 3595337 3622380 3664797 3723436
59484 3723436 3799747 3894416 4007601 4139984 4292382 4464656 4656001 4865876 5093522 5336752
59474 5336752 5592139 5855813 6122728 6385319 6634091 6859563 7052946 7205708 7310256
59465G310256N1228m383o0108j13425j61166k01310k33901k59151k76130k84446
59455E767464k85791k82374k74960k63762k49985k34979k18969k02000j85230
59446C569414j69799j55327j40953j27073j14548j03032r1631q0560p0628o1596
59436B454267n2498m3352l5101k8115k1912j6112j0673n483n81L493O442Q861
59424B259236J1381J3690J5222J6289J7743K0054K3257K6880K9309K8427K4056
59413B485544J8978J6374J7050K0057K4883L1671M0236N0270O1822P4102Q4653
59402B925640R1388R5165R9081J05660J15911J30334J49089J71420J96335K23825
59392D303848K54378K87714L23157L60763M00750M42038M82453N19911N52246
$$ plain form
59465 7310256 7361484 7357101 7296993 7183568 7022402 6821092 6587191 6328040 6051910 5767464
59455 5767464 5481673 5199299 4924339 4660577 4410592 4175613 3956644 3754644 3569414
59446 3569414 3399615 3244288 3103335 2976262 2861714 2758682 2667051 2586491 2515863 2454267
59436 2454267 2401769 2358417 2323316 2295201 2273289 2257177 2246504 2241021 2240440 2243933 2250375 2259236
59424 2259236 2270617 2284307 2299529 2315818 2333561 2353615 2376872 2403752 2433061 2461488 2485544
59413 2485544 2504522 2520896 2537946 2558003 2582886 2614557 2654793 2705063 2766885 2840987 2925640
59402 2925640 3017028 3112193 3211274 3316934 3432845 3563179 3712268 3883688 4080023 4303848
59392 4303848 4558226 4845940 5169097 5529860 5930610 6372648 6855101 7375012 7927258
59383G927258N76387N89193N89036N75761N49807N12776M68261M20467L72055
59374A2581001L24373K79192K38488K02677J70474J40395J11093Q0437M5919O267
59364A4180316l8315q7237j39528j92696k42909k86543l21012l44709l57688l62321
59354A1807358l62097l59634l56712l55498l57972l64068l71777l79239l85478
59345H514883l89242l88790l83259l73082l58864l40952l20299k98420k76098
59336E385877k53193k29992k07660j86911j67252j47993j29288j11839r6200q2544
59326C773005p0492n9114m7818l7156k8098k0527j3242n315L274J2186K1001K9180
59314C556884L6644M4257N2740O1292O8311P3287P6949P9585Q0437P8799P4651
$$ plain form
59383 7927258 8503645 9092838 9681874 10257635 10807442 11320218 11788479 12208946 12581001
59374 12581001 12905374 13184566 13423054 13625731 13796205 13936600 14047693 14128130 14174049 14180316
59364 14180316 14142001 14054764 13915236 13722540 13479631 13193088 12872076 12527367 12169679 11807358
59354 11807358 11445261 11085627 10728915 10373417 10015445 9651377 9279600 8900361 8514883
59345 8514883 8125641 7736851 7353592 6980510 6621646 6280694 5960395 5661975 5385877
59336 5385877 5132684 4902692 4695032 4508121 4340869 4192876 4063588 3951749 3855549 3773005
59326 3773005 3702513 3643399 3595581 3558425 3530327 3509800 3496558 3491243 3494517 3506703 3527704 3556884
59314 3556884 3593528 3637785 3690525 3751817 3820128 3893415 3970364 4049949 4130386 4209185 4283836
59303D283836O8105N9332M9173L8861K8930J9303J0499L715m21k222j858J151
59291D558404P200J6084K7412M0697N4980O9213Q3157R7102J10615J22417J31486
59280E318767J37445J39784J37521J29765J15845R5033O7278L4632J046k9636
59270F147480n5136p4452q7306r4275r6724r5987r2782q7415q0117p1238o1488
59259E250560n1930m3273l5426k8134k1761j6872j3473j1288j0428j1017j2518
59248D994440j4083j5225j5469j3853r580k740O470J8667L4573N4014P6570J02539
59236E216323J32164J64560J98687K34673K72595L10354L44231L71304L89753
59227G634644L97130L90165L66639L26334K70294K00510J20245L3270n7304j48251
$$ plain form
59303 4283836 4351941 4411273 4460446 4499307 4528237 4547540 4558039 4561754 4561333 4559111 4557253 4558404
59291 4558404 4565604 4581688 4609100 4649797 4704777 4773990 4857147 4954249 5064864 5187281 5318767
59280 5318767 5456212 5595996 5733517 5863282 5979127 6074160 6141438 6176070 6177116 6147480
59270 6147480 6092344 6017892 5930586 5836311 5739587 5643600 5550818 5463403 5383286 5312048 5250560
59259 5250560 5198630 5155357 5119931 5091797 5070036 5053164 5039691 5028403 5017975 5006958 4994440
59248 4994440 4980357 4965132 4949663 4935810 4926230 4923490 4929960 4948627 4983200 5037214 5113784 5216323
59236 5216323 5348487 5513047 5711734 5946407 6219002 6529356 6873587 7244891 7634644
59227 7634644 8031774 8421939 8788578 9114912 9385206 9585716 9705961 9739231 9681927 9533676
59217I533676k34692l10954l73125m19611m49610m62963m61631m49387m29432
59208E942271m03547l73681l42520l11972k82414k54055k27723k03897j82316
59199C360146j62995j46351j31990j18763j06425r5918q7503q0064p2812o6248
59189B291077o0729n5415m9561m3657l8437l3714k9116k4974k1587j8347j4406
59178A901134r805n208j062K561N790Q985J2496J6124J9350K2175K5145K8518
59166B026203L2072L5689L9407M3025M6530N0676N6094O2047O7307P2009P7227
59155B608286Q2761Q7071Q9607R1479R3221R3517R0918Q5515P8059O8648N7263
59144C526345M4538L1149J7221L095j0069k1214l0337l7889m3742m7262m7977
$$ plain form
59217 9533676 9298984 8988030 8614905 8195294 7745684 7282721 6821090 6371703 5942271
59208 5942271 5538724 5165043 4822523 4510551 4228137 3974082 3746359 3542462 3360146
59199 3360146 3197151 3050800 2918810 2800047 2693622 2597704 2510201 2430137 2357325 2291077
59189 2291077 2230348 2174933 2125372 2081715 2043278 2009564 1980448 1955474 1933887 1915540 1901134
59178 1901134 1891329 1886121 1885059 1887620 1893410 1902395 1914891 1931015 1950365 1972540 1997685 2026203
59166 2026203 2058275 2093964 2133371 2176396 2222926 2273602 2329696 2391743 2459050 2531059 2608286
59155 2608286 2691047 2778118 2867725 2959204 3052425 3145942 3236860 3322375 3400434 3469082 3526345
59144 3526345 3570883 3602032 3619253 3622348 3612279 3591065 3560728 3522839 3479097 3431835 3383858
59133C383858m5938m1814l6674l1013k4099j4979l980P697J9680L2566M6487O0811
59121C352602P5334R0507J06270J21941J37367J52925J68243J82297J94996K07279
59111D789761K19217K29491K37065K41920K43569K40214K30110K12625J87459
59102F831431J54102J12938O6018J6259l3408q0079j21431j56705j86193k09656
59092F393276k26493k37409k44249k47881k47830k44388k39249k33415k26172
59083D246190k17003k06945j97079j87158j76661j65960j55443j44757j33821
59074B661363j23445j14053j04949r5597q6487p7965o9477o0808n2781m5876l9316
59063A790609l2455k5832k0012j4614r432n423l562l779n811r929j5863k2109
$$ plain form
59133 3383858 3337920 3296106 3259432 3228419 3204320 3189341 3185361 3193058 3212738 3245304 3291791 3352602
59121 3352602 3427936 3518443 3624713 3746654 3884021 4036946 4205189 4387486 4582482 4789761
59111 4789761 5008978 5238469 5475534 5717454 5961023 6201237 6431347 6643972 6831431
59102 6831431 6985533 7098471 7164489 7180748 7147340 7067261 6945830 6789125 6602932 6393276
59092 6393276 6166783 5929374 5685125 5437244 5189414 4945026 4705777 4472362 4246190
59083 4246190 4029187 3822242 3625163 3438005 3261344 3095384 2939941 2795184 2661363
59074 2661363 2537918 2423865 2318916 2223319 2136832 2058867 1989390 1928582 1875801 1829925 1790609
59063 1790609 1758154 1732322 1712310 1697696 1688264 1682841 1679279 1675500 1669689 1659760 1643897 1621788
59051A621788k7295l1332l4414l6072l6122l5414l4666l3468l1316k8638k5919
59040A267132k2855j9168j5320j1581p475k887J345M668P483R929J1248J1250
59028A233769J1004J1127J0627Q551N557K809M81j559k733k671k171k109k233
59015A270449j944j385q39lJ233K241K659K978L380L178K169J276J080R43M17
59000A287832J79O93J293J564K125L214L951M117M936O969Q862R564J0018J1175
58986A356492J2025J1402J0331J0534J1842J2922J3593J4601J5945J7145J8364
58975A505196J9849K1129K2184K4282K8116L2308L5434L8359M2606M7460N0767
58964A867690N1842N1616N0463M8005M4658M1448L8326L4380K9708K5738K3673
$$ plain form
59051 1621788 1594493 1563161 1528747 1492675 1456553 1421139 1386473 1353005 1321689 1293051 1267132
59040 1267132 1244277 1225109 1209789 1198208 1190733 1187846 1189191 1193859 1201342 1211271 1222519 1233769
59028 1233769 1244773 1255900 1266527 1275078 1280635 1283444 1283925 1282366 1279633 1276962 1274791 1272682 1270449
59015 1270449 1268505 1267120 1266281 1266278 1267511 1269752 1272411 1275389 1278769 1281947 1284116 1285392 1286472 1287415 1287832
59000 1287832 1288011 1288704 1289997 1291561 1293686 1296900 1300851 1304968 1309904 1316873 1325735 1335299 1345317 1356492
58986 1356492 1368517 1379919 1390250 1400784 1412626 1425548 1439141 1453742 1469687 1486832 1505196
58975 1505196 1525045 1546174 1568358 1592640 1620756 1653064 1688498 1726857 1769463 1816923 1867690
58964 1867690 1919532 1971148 2021611 2069616 2114274 2155722 2194048 2228428 2258136 2283874 2307547
58953B307547K3649K5220K7721L0549L3816L8267M3940M9793N5257O0987O7270
58942B764016P3196P8492Q4657R2877J02201J11372J21002J32353J45272J59194
58932C864632J74874J93156K13142K33612K55233K79448L06166L34503L64900
58923F219666L98370M34551M72499N12622N55603O00121O43661O84877P22875
58914A1244845P54753P75998P83010P73190P43133O89175O09926N06806L82622
58905A7263458K41589R0396o2863k10973l47744m67031n63990o37204o87989p17972
58895A3899677p28908p23888p06448o78807o42792o01736n59277n16862m74650
58886H266309m34395l98888l68790l42464l18926k98610k81255k65347k50039
$$ plain form
58953 2307547 2331196 2356416 2384137 2414686 2448502 2486769 2530709 2580502 2635759 2696746 2764016
58942 2764016 2837212 2915704 3000361 3093238 3195439 3306811 3427813 3560166 3705438 3864632
58932 3864632 4039506 4232662 4445804 4679416 4934649 5214097 5520263 5854766 6219666
58923 6219666 6618036 7052587 7525086 8037708 8593311 9193432 9837093 10521970 11244845
58914 11244845 11999598 12775596 13558606 14331796 15074929 15764104 16374030 16880836 17263458
58905 17263458 17505047 17595443 17532580 17321607 16973863 16506832 15942842 15305638 14617649 13899677
58895 13899677 13170769 12446881 11740433 11061626 10418834 9817098 9257821 8740959 8266309
58886 8266309 7831914 7433026 7064236 6721772 6402846 6104236 5822981 5557634 5307595
58877E307595k35515k21331k06428j90990j76293j62538j48791j35209j23223
58868C707277j13176j03758r4226q5299p7413o9796o1875n4112m6993m0435l4409
58857B925785k8948k3477j7402j1280o031j249M302J0659J6774K2426K8390L4753
58845B954702M0703M5993N1215N6824O3100P0716P9798Q8987R7158J05429J15578
58834C770203J27195J38587J49983J63381J79376J96672K14774K34824K57432
58825E432427K82034L08742L38672L72018M07755M45633M86421N29733N73509
58816I176944O16036O56508O93032P21905P39390P42601P28286O92656O33267
58807A5400625N49989M44041L17876J76486K7364j21469k62744l89899m97767
$$ plain form
58877 5307595 5072080 4850749 4644321 4453331 4277038 4114500 3965709 3830500 3707277
58868 3707277 3594101 3490343 3396117 3310818 3233405 3163609 3101734 3047622 3000629 2960194 2925785
58857 2925785 2896837 2873360 2855958 2844678 2838647 2837398 2841700 2852359 2869133 2891559 2919949 2954702
58845 2954702 2995405 3041398 3092613 3149437 3212537 3283253 3363051 3452038 3549196 3654625 3770203
58834 3770203 3897398 4035985 4185968 4349349 4528725 4725397 4940171 5174995 5432427
58825 5432427 5714461 6023203 6361875 6733893 7141648 7587281 8073702 8603435 9176944
58816 9176944 9792980 10449488 11142520 11864425 12603815 13346416 14074702 14767358 15400625
58807 15400625 15950614 16394655 16712531 16889017 16916381 16794912 16532168 16142269 15644502
58798A5644502n83741o47271o88569p09141p12885p04495o86806o61206o30099
58789I620289n96738n62771n28080m92930m58346m24517l90994l58396l27981
58780E479536k99606k72227k46148k22794k02594j85343j72156j64289j60146
58771C554233j56147j50647j44451j37661j29065j18910j09150j00356r1119q1139
58761B335588p2055o4452n6847m8516m0720l4244k8259k2595j8591j6598j5014
58750A917697j2855j1097j0553j0582j0816j2072j4600j7539k0754k5074l0004
58739A741751l3559l5067l5898l6790l6885l6033l5430l5211l4005l1722l0140
58728A361011k9836k9305k7993k7317k7590k6919k4605k2640k2235k1680j9523
$$ plain form
58798 15644502 15060761 14413490 13724921 13015780 12302895 11598400 10911594 10250388 9620289
58789 9620289 9023551 8460780 7932700 7439770 6981424 6556907 6165913 5807517 5479536
58780 5479536 5179930 4907703 4661555 4438761 4236167 4050824 3878668 3714379 3554233
58771 3554233 3398086 3247439 3102988 2965327 2836262 2717352 2608202 2507846 2416727 2335588
58761 2335588 2263533 2199081 2142234 2093718 2052998 2018754 1990495 1967900 1949309 1932711 1917697
58750 1917697 1904842 1893745 1883192 1872610 1861794 1849722 1835122 1817583 1796829 1771755 1741751
58739 1741751 1708192 1673125 1637227 1600437 1563552 1527519 1492089 1456878 1422873 1391151 1361011
58728 1361011 1331175 1301870 1273877 1246560 1218970 1192051 1167446 1144806 1122571 1100891 1081368
58717A081368j7167j6281j6042j5081j4014j3927j4208j3821j3094j2607j1935
58706I23191j0894j0270j0045q931o902n969o948p817o924n567n569o430o874
58693H24051p209q167r128r438r826j0752j1039r825q283p648p244o076m654l613
58679G11149k252j31J590K034K187L033L893M181M994P251J0027J2367J4931J8212
58665G93466K0947K2047K2082K1145J7352R673N17o800j1592j4819j6301j5326
58653H42391j2727j0042p453m373j089J814M619P509R715J0954J2459J5089J7917
58640H86783K0044K2281K5455K8748L1315L4016L7844M2225M6475N1442N7988
58629A284616O5330P2533Q0194Q9192R9310J10492J23833J39710J56585J73037
$$ plain form
58717 1081368 1064201 1047920 1031878 1016797 1002783 988856 974648 960827 947733 935126 923191
58706 923191 912297 902027 891982 883051 876149 870180 863232 855415 848491 842924 837355 830925 824051
58693 824051 816842 808675 799547 790109 780283 769531 758492 748667 740384 732736 725492 719416 714762 711149
58679 711149 708897 708766 710356 712390 714577 717610 721503 725684 730678 737929 747956 760323 775254 793466
58665 793466 814413 836460 858542 879687 897039 906712 907229 900429 888837 874018 857717 842391
58653 842391 829664 819622 812169 807796 806707 808521 813140 820649 830364 841318 853777 868866 886783
58640 886783 906827 929108 954563 983311 1014626 1048642 1086486 1128711 1175186 1226628 1284616
58629 1284616 1349946 1422479 1502673 1591865 1691175 1801667 1925500 2065210 2221795 2394832
58619B394832J89321K05534K20064K31214K38317K39838K32522K14268J85877
58610D351787J48707J03107N1048k341n2080r6075j32934j60016j76348j84842
58600C850013j88743j87966j81700j72257j63046j54521j45385j36200j28590
58591B391605j22065j14771j06531r8450r0529q2146p3886o6509n9209n1267m4106
58580A482136l9345l6075l2468k8850k6660k5620k4319k2579k0881j8701j5568
58569A191070j2646j1079j0085q764q233r702j2046j3607j4886j6962j8802j8740
58557A035518j7205j5501j3283r753n955l428j892n81k93j796l795m846n618o888
58543I44684p363o086m965n988p864q458q500r696j1126j1042j0538j1753j3916
$$ plain form
58619 2394832 2584153 2789687 3009751 3240965 3479282 3719120 3951642 4165910 4351787
58610 4351787 4500494 4603601 4654649 4652308 4600228 4504153 4371219 4211203 4034855 3850013
58600 3850013 3661270 3473304 3291604 3119347 2956301 2801780 2656395 2520195 2391605
58591 2391605 2269540 2154769 2048238 1949788 1859259 1777113 1703227 1636718 1577509 1526242 1482136
58580 1482136 1442791 1406716 1374248 1345398 1318738 1293118 1268799 1246220 1225339 1206638 1191070
58569 1191070 1178424 1167345 1157260 1148496 1140263 1130561 1118515 1104908 1090022 1073060 1054258 1035518
58557 1035518 1018313 1002812 989529 979776 973821 970393 968501 967920 967627 965831 962036 957190 951572 944684
58543 944684 937321 931235 926270 920282 912418 903960 895460 885764 874638 863596 853058 841305 827389
58530H27389j4759j4547j5084j5941j5358j3853j3374j3601j2672j0789r780r708
58518F67923r093p878p131o522n073l586l464l938l348k153j821j858q91L84L65
58503F11916m26l79K96N89J303L575O139P081O947P167P072N623M379N223O785
58488F73290O688N694N927O728O196N221N941P590P993P737Q703R836Q664N768
58474G71976L509J573j831n702p724q705j0989j3605j3880j2737j3316j5184j5057
58461F58328j2743j1228j1237j0687r337r000r331q148n895n041n275m072j795
58448E54539j245k270j872L03J536J247J697L219L658K813K728L358K636R98R68
58433E74313K210J997O03J069L397M373L584M169O880Q755Q649Q871J0305J0950
$$ plain form
58530 827389 812630 798083 782999 767058 751700 737847 724473 710872 698200 687411 677631 667923
58518 667923 658830 650952 643821 637299 632226 628640 625176 621238 617890 615737 613916 612058 611167 611551 611916
58503 611916 611490 611111 611407 611996 613299 616874 623013 630094 637041 644208 651280 656903 661282 666505 673290
58488 673290 679978 685672 691599 698327 704523 709744 715685 723275 731268 739005 747708 757544 766208 771976
58474 771976 775485 777058 775227 769525 761801 753096 742107 728502 714622 701885 688569 673385 658328
58461 658328 645585 634357 623120 612433 603096 594096 584765 576617 570722 565681 560406 556334 554539
58448 554539 553294 551024 549152 549455 550991 552238 553935 557154 560812 563625 566353 569711 572347 573345 574313
58433 574313 576523 578520 579123 580192 583589 587962 591546 595715 602595 611350 619999 628870 639175 650125
58419F50125J0312J0385J1283J0656Q428P215P322O088L076R14K39j235l834n190
58405G15784n086n853p271o481l845l224n322o366m725l223l316k722o39K10j139
58390F56782j745J1J824K037K101K768K530J446J787L522L825K341J930L097L027
58375F87283J336J146K999L484J601P55K487L869L251K967M197M656L585L594
58361G27210N336N743L750K461L455M299L711L768M969M607K171Q72J786K063
58347G76201P70O73K310K427M76L53L354N617N084M779O616Q171Q185R041J1179
58332H45236J1326Q893P748R103R213O768N716P825R363Q275P822R773J0870R389
58318I67320Q438R471R360P113O482Q618R417P443O956R614J0981R099Q545J1759
$$ plain form
58419 650125 660437 670822 682105 692761 701189 708404 715726 721814 724890 725804 726043 724808 720974 715784
58405 715784 710698 704845 697574 691093 687248 684024 678702 672336 667611 664388 661072 658350 657711 657921 656782
58390 656782 655037 655048 656872 658909 661010 663778 666308 667754 669541 673063 676888 679229 681159 684256 687283
58375 687283 688619 689765 692764 696248 697849 698604 701091 704960 708211 711178 715375 720031 723616 727210
58361 727210 732546 738289 742039 744500 747955 752254 755965 759733 764702 769309 771480 772352 774138 776201
58347 776201 776971 777644 779954 782381 782857 783210 786564 792181 797265 802044 808660 816831 825016 834057 845236
58332 845236 856562 865455 873203 882306 891519 898287 904003 911828 921191 929466 937288 947061 957931 967320
58318 967320 975758 985229 994589 1001702 1008184 1016802 1026219 1033662 1040618 1050232 1061213 1070312 1078857 1090616
58304A090616J4295J3197J2274J4367J6051J4896J4343J6550J7875J6252J5471
58293A256187J7497J8302J6043J5361J8681K1445K0870K1162K4804K7304K6018
58282A483674K5564K8874L1475L0345K9685L2144L3296L0789K9840L3429L6260
58271A825375L4651L3123L4896L5579L2775L2009L6256L9729L8787L8701M2640
58260B224521M4952M2681M2395M7725N1808N0341N0246N6577O2868O3703O4694
58249B802511P0460P5100P4623P6171Q4472R1897R2680R4021J02013J09949J12079
58238C785976J15260J25025J34163J37334J42568J55572J67759J72976J80352
58229E116985J96813K13216K22443K34031K55551K77352K91901L09802L39483
$$ plain form
58304 1090616 1104911 1118108 1130382 1144749 1160800 1175696 1190039 1206589 1224464 1240716 1256187
58293 1256187 1273684 1291986 1308029 1323390 1342071 1363516 1384386 1405548 1430352 1457656 1483674
58282 1483674 1509238 1538112 1569587 1599932 1629617 1661761 1695057 1725846 1755686 1789115 1825375
58271 1825375 1860026 1893149 1928045 1963624 1996399 2028408 2064664 2104393 2143180 2181881 2224521
58260 2224521 2269473 2312154 2354549 2402274 2454082 2504423 2554669 2611246 2674114 2737817 2802511
58249 2802511 2872971 2948071 3022694 3098865 3183337 3275234 3367914 3461935 3563948 3673897 3785976
58238 3785976 3901236 4026261 4160424 4297758 4440326 4595898 4763657 4936633 5116985
58229 5116985 5313798 5527014 5749457 5983488 6239039 6516391 6808292 7118094 7457577
58220G457577L70324L93918M21923M63779N08047N45917N90854O53553P21270
58211A2127162P84764Q60501R61960J076144J194727J339198J526950J744749
58203B1616155J987356K288475K680055L159724L737144M471330N419445O591808
58195E1951492P998580R686091J1684963J4004221J6746016K0135889K4342042
58188A56549294K9323999L4838079M0216516M3770101M2713858L4609906J9577159
58181D01598912J022406j6196416k8565049l5209134l7143878l5910269l2859650
58174B16736922k9030874k5111249k1428810j8100715j5189963j2708970j0588230
58167H4578111q740439p118861n677205m337365l040062j778864n80987M46603
$$ plain form
58220 7457577 7827901 8221819 8643742 9107521 9615568 10161485 10752339 11405892 12127162
58211 12127162 12911926 13772427 14734387 15810531 17005258 18344456 19871406 21616155
58203 21616155 23603511 25891986 28572041 31731765 35468909 39940239 45359684 51951492
58195 51951492 59950072 69636163 81321126 95325347 112071363 132207252 156549294
58188 156549294 185873293 220711372 260927888 304697989 347411847 382021753 401598912
58181 401598912 402621318 386424902 357859853 322650719 285506841 249596572 216736922
58174 216736922 187706048 162594799 141165989 123065274 107875311 95166341 84578111
58167 84578111 75837672 68718811 63041606 58704241 55664179 53885315 53304328 53750931
58159E3750931J027678Q19921k57219j833369l314113m287258m683239m634183
58151C6589149m303011l833006l337992k876229k458228k090584j786595j540722
58143A4362782j330934j149084j000981q79821p68508o65825n83692n21155m65458
58134F997324m15204l78783l53329l27592l02025k84899k72385k53036k28286
58125D181785k08819j94313j75782j54381j39141j29155j15920j00702r2595r1753
58115B779224r0510q8423r0661r4222r1125q3020p8264p6811p1892o4044n9720
58104A890532n8263n3585m6626m3356m2656l8587l2482l0702l2554l2147k9918
58093A449656l0848l3674l3232l0989l2080l4395l1913k6414k4608k5959k4576
$$ plain form
58159 53750931 54778609 55598530 55341311 53507942 50193829 45906571 41223332 36589149
58151 36589149 32286138 28453132 25115140 22238911 19780683 17690099 15903504 14362782
58143 14362782 13031848 11882764 10881783 10001962 9233454 8567629 7983937 7462782 6997324
58134 6997324 6582120 6203337 5850008 5522416 5220391 4935492 4663107 4410071 4181785
58125 4181785 3972966 3778653 3602871 3448490 3309349 3180194 3064274 2963572 2870977 2779224
58115 2779224 2688714 2600291 2509630 2415408 2324283 2241263 2162999 2086188 2014296 1950252 1890532
58104 1890532 1832269 1778684 1732058 1688702 1646046 1607459 1574977 1544275 1511721 1479574 1449656
58093 1449656 1418808 1385134 1351902 1320913 1288833 1254438 1222525 1196111 1171503 1145544 1120968
58082A120968k1007k0831k3348k2785j9319j8140j9022j7360j4230j4794j7852
58071I12280j7346j3350j1437j2101j0835p914p995j0421r835o251m951o451n993
58058G87400l075k306m461n539n006o379r263r310o571n649p057o541l484j989
58044G10770k901k529p3J097L69Q92K932L258J738J801L734M178K739K406L120
58029G33531J598k060m196m395n892q908j0144r342r680j1315j1019q726p870
58016F41582q700p876n238m351n570n193k456q42j318p58J652K731J454P45J652
58001F07514J500o94k561l356n079p416p271m650l335m384m462k107n0K90J077
57986E65016L064L704K163J170J889J834k32k042k275k701m141m776m130m285
$$ plain form
58082 1120968 1099961 1079130 1055782 1032997 1013678 995538 976516 959156 944926 930132 912280
58071 912280 894934 881584 870147 858046 847211 839297 831302 820881 811046 804795 799844 793393 787400
58058 787400 784325 782019 777558 772019 767013 760634 751371 742061 735490 729841 722784 716243 712759 710770
58044 710770 707869 705340 705267 706364 706733 707625 710557 713815 715553 717354 721088 725266 728005 730411 733531
58029 733531 735129 733069 728873 724478 718586 709678 699534 690192 680512 669197 658178 649452 641582
58016 641582 632882 625006 619768 615417 609847 604654 602198 601356 600038 599280 600932 603663 605117 605862 607514
58001 607514 609014 608320 605759 602403 597324 589908 582637 577987 574652 570268 565806 563699 563649 563939 565016
57986 565016 568080 571784 573947 575117 577006 578840 578608 576566 574291 571590 567449 562673 558543 554258
57972E54258n526n329l242k143l006l028q87Q13M13J49J830L639L623K787K466
57957E46817J979R02M71R97R14r5j91J193K194J968K040L062L535K766J812O54
57941E71018k080n794q003q507r730j2086j3047j1787j0609j0490r444o776m899
57928D57766n154n653m910m018l648k563o66J32l17N18L391N637N568M910N161
57913D56154N247M605M877O570P531O715N989O317N721L117O59J9l84k205m424
57898E06508n924p704j0233j1665j0940r859r932r909q527o927o268n620m248
57885C98752l265l161k301J12K364L269M105N709O605N994N652O739P625P034
57871D45233O497P402Q335P729O503N835M921L164J947J899J131j449l713l791
$$ plain form
57972 554258 548732 543403 540161 538018 535012 531984 531097 531910 532323 532472 534302 537941 541564 544351 546817
57957 546817 548796 549698 550169 551166 552080 551985 551794 552987 555181 557149 559189 562251 565786 568552 570364 571018
57941 571018 568938 563144 555141 546634 536904 524818 511771 499984 489375 478885 469441 462665 457766
57928 457766 452612 446959 442049 438031 434383 431820 431154 431286 430969 431487 434878 440515 446083 450993 456154
57913 456154 461401 466006 470883 477453 484984 491699 497688 504005 509726 512843 513502 513521 513137 510932 506508
57898 506508 500584 492880 482647 470982 460042 450183 440251 430342 421815 414888 408620 403000 398752
57885 398752 395487 392326 390025 390137 392501 395770 399875 405584 412189 418183 423835 430574 438199 445233
57871 445233 451730 459132 467467 475196 481699 487534 492455 495619 497566 499465 500596 499147 495434 491643
57857D91643l381m822p180q142p802p721q018p956p889q234p949o245m303l404
57843C98597k927j986j312j664k149j872j496j645j711j684k903n428p090o891
57829C57839o781q220r609r278q282q004p553o071m960n223n129l298j612k074
57815B71745l117k337o78n13j365j074L19J159J485K435L532L660L742N421P923
57800B92337R195R273R671J0247R624Q148P518P872P783O900O193N864N238M359
57786D00222L757L041J555k10j662l610o775r767j0730j0159r933j0356j0295
57773C35078r502q603p358n161k779j538j205n42N53J291J781K690L657L820L514
57758C15696L734M500N202N814O351O014M527L261L379L965L704L225L747M620
$$ plain form
57857 491643 488262 483440 476260 468118 460316 452595 444577 436621 428732 420498 412549 406304 402001 398597
57843 398597 395670 393684 392372 390708 388559 386687 385191 383546 381835 380151 377248 371820 364730 357839
57829 357839 351058 342838 333229 323951 315669 307665 300112 294041 289081 283858 278729 275431 273819 271745
57815 271745 268628 266291 265613 265100 263735 262661 262980 264139 265624 268059 271591 275251 278993 284414 292337
57800 292337 301532 310805 320476 330723 340347 348495 356013 363885 371668 378568 384761 390625 395863 400222
57786 400222 403979 407020 408575 408365 406703 403093 396318 386551 375821 365662 355729 345373 335078
57773 335078 325576 316973 309615 304454 301675 300137 298932 298390 298943 300234 302015 304705 308362 312182 315696
57758 315696 319430 323930 329132 334946 341297 347311 351838 355099 358478 362443 366147 369372 373119 377739
57744C77739M420L466L080L174K923K904M233O172O954O535O330O666O674O376
57730D47646O694P652Q475R268J0767J2720J4206J5222J6392J7609J8499J9618
57718F04768K1501K3343K4285K5179K7257K9973L2077L3959L6934M1006M5468
57707I45750N0828N7990O6255P4407Q3041R3558J05601J17941J31148J46679J63740
57696B036938J79845J94374K08822K23258K34871K40237K36982K23189J97605
57687C976121J61112J16431O6350J3832l6539p9634j12661j35439j48048j50206
57677C671319j42857j28227j07918q2404n2244j8044K0661O4515J11599J55802
57667C492202J86567J89797J52969P5076k7434j27907k04731k49951k66205k60273
$$ plain form
57744 377739 382159 385625 388705 391879 394802 397706 401939 408111 415065 421600 427930 434596 441270 447646
57730 447646 454340 461992 470467 479735 490502 503222 517428 532650 549042 566651 585150 604768
57718 604768 626269 649612 673897 699076 726333 756306 788383 822342 859276 900282 945750
57707 945750 996578 1054568 1120823 1195230 1278271 1371829 1477430 1595371 1726519 1873198 2036938
57696 2036938 2216783 2411157 2619979 2843237 3078108 3318345 3555327 3778516 3976121
57687 3976121 4137233 4253664 4320014 4333846 4297307 4217673 4105012 3969573 3821525 3671319
57677 3671319 3528462 3400235 3292317 3209913 3157669 3139625 3160286 3224801 3336400 3492202
57667 3492202 3678769 3868566 4021535 4096611 4069177 3941270 3736539 3486588 3220383 2960110
57657B960110k40066k13066j84142j55362j28343j04931q5281o7567n0558l4805
57647A695989k0732p501N573J8278L0814M4091N8212P2345Q6542J01924J18539
57636B204074J34863J49974J64388J78139J89610J96859J98448J92519J76807
57627C785681J50433J14509P0917K2089k7902p4177j13760j46122j70982j87429
57617C423257j95542j96901j93020j84974j74703j64510j54719j43868j31728
57608A883292j20003j09588r9505q9436q0849p4451o8709o2267n5917n0765m6293
57597A025509m1677l7436l4211l1388k8241k5241k2980k1006j8867j7076j5964
57586G31422j4809j3141j1650j0909j0372r664r326r356q562o555m875m729n009
$$ plain form
57657 2960110 2720044 2506978 2322836 2167474 2039131 1934200 1848919 1781352 1730794 1695989
57647 1695989 1675257 1667756 1673329 1691607 1722421 1766512 1824724 1897069 1983611 2085535 2204074
57636 2204074 2338937 2488911 2653299 2831438 3021048 3217907 3416355 3608874 3785681
57627 3785681 3936114 4050623 4121540 4143629 4115727 4041550 3927790 3781668 3610686 3423257
57617 3423257 3227715 3030814 2837794 2652820 2478117 2313607 2158888 2015020 1883292
57608 1883292 1763289 1653701 1554196 1464760 1383911 1309460 1240751 1178484 1122567 1071802 1025509
57597 1025509 983832 946396 912185 880797 852556 827315 804335 783329 764462 747386 731422
57586 731422 716613 703472 691822 680913 670541 660877 651551 642195 633633 627078 622203 617474 612465
57573F12465m037k078m54P38K348M355N963P071Q305R880J1458J2817J3933J4810
57559F97574J5832J7633K0168K2648K4942K7973L2182L6717M0930M5527N1386
57548A033512N8250O5527P3427Q2320R1957J02101J13066J24731J36028J46158
57538B027077J55190J62512J65878J63127J53768J37871J14701Q3985M7692R092
57528C220893k9294o5534r7022j21194j37388j46777j50635j49711j44993j37833
57518B040512j29292j20038j10709j01650r2575q3164p3727o4834n6770m9787
57508A157966m4218l9705l5072k9675k4228j9648j5807j2172q862o055l080Q12
57496I20256N220R125J2341J5535J9268K3743K9135L5331M1732M8085N5108O3533
$$ plain form
57573 612465 608428 606350 605896 606634 608982 613337 619300 626371 634676 644556 656014 668831 682764 697574
57559 697574 713406 731039 751207 773855 798797 826770 858952 895669 936599 982126 1033512
57548 1033512 1091762 1157289 1230716 1313036 1404993 1507094 1620160 1744891 1880919 2027077
57538 2027077 2182267 2344779 2510657 2673784 2827552 2965423 3080124 3164109 3211801 3220893
57528 3220893 3191599 3126065 3029043 2907849 2770461 2623684 2473049 2323338 2178345 2040512
57518 2040512 1911220 1791182 1680473 1578823 1486248 1403084 1329357 1264523 1207753 1157966
57508 1157966 1113748 1074043 1038971 1009296 985068 965420 949613 937441 928579 922524 919444 920256
57496 920256 925476 934601 946942 962477 981745 1005488 1034623 1069954 1111686 1159771 1214879 1278412
57484A278412P2953Q2513R2292J03069J14886J26724J37462J46365J52540J54571
57474B461787J50965J40668J23231R8723O7650L1078q834m8608q4425j13660j35354
57463B683221j49582j57059j59155j57242j51878j43440j33392j23658j14728
57454A393087j05606r5983q6961p9227p1994o4539n7483n1632m6699m2103l8061
57443F52799l4859l1938k8690k5405k2656k0481j8759j7564j6507j4776j2585
57432D08579j1344j1612j1996j1155r701q908q669q087p279p057p362p442p130
57419B90837o812o440n689m758m077l497k660j801j349j153q25m51l04l31m31
57404B50259o82q40m42J55j24j348k102j567p63p99j120p26J2K26J44L94N96J55
$$ plain form
57484 1278412 1351365 1433878 1526170 1629239 1744125 1870849 2008311 2154676 2307216 2461787
57474 2461787 2612752 2753420 2876651 2975374 3043024 3074102 3065268 3016660 2932235 2818575 2683221
57463 2683221 2533639 2376580 2217425 2060183 1908305 1764865 1631473 1507815 1393087
57454 1393087 1287481 1191498 1104537 1025310 953316 888777 831294 779662 732963 690860 652799
57443 652799 617940 586002 557312 531907 509251 488770 470011 452447 435940 421164 408579
57432 408579 397235 385623 373627 362472 352771 343863 335194 327107 319828 312771 305409 297967 290837
57419 290837 284025 277585 271896 267138 263061 259564 256904 255103 253754 252601 251776 251325 251021 250690 250259
57404 250259 249577 248737 248295 248450 248326 246978 244876 243309 242546 241747 240627 239901 239913 240139 240283 240677 241273 241428
57386B41428l11J62J176J604J310Q80K83p27j486j217m71l39p13p83p16j288k158
57369B36634k252j588j243j504j572j041l86L1L39N53O63J060J939K593K388J929
57353B38543K104K548K353J748J601J760J484J154J808L188L924L584L010K662
57339B71471K208J786K117L113L768L629L160K662K102J961K848M274N097N151
57325C15347N196N423N417N407N966O624O435N848O284P744Q680Q477Q251Q810
57311D09909R589J0144J0982J2289J3418J4226J5494J7352J8786J9430K0353K2328
57299E94300K4602K6143K6921K7264K7178K7012K7525K8490K8400K6304K2948
57288H87087J9397J5697J1555P160K493l086r638j5931k0716k3859k5638k6027
$$ plain form
57386 241428 241117 241279 242455 244059 245369 246249 246532 245805 244319 243102 242631 242292 241579 240796 240080 238792 236634
57369 236634 234382 232794 231551 230047 228475 227434 227048 227079 227418 227971 228634 229694 231633 234226 236614 238543
57353 238543 240647 243195 245548 247296 248897 250657 252141 253295 255103 258291 262215 265799 268809 271471
57339 271471 273679 275465 277582 280695 284463 288092 291252 293914 296016 297977 300825 305099 310196 315347
57325 315347 320543 325966 331383 336790 342756 349380 355815 361663 367947 375691 384371 392848 401099 409909
57311 409909 419498 429642 440624 452913 466331 480557 496051 513403 532189 551619 571972 594300
57299 594300 618902 645045 671966 699230 726408 753420 780945 809435 837835 864139 887087
57288 887087 906484 922181 933736 940896 943389 940303 930665 914734 894018 870159 844521 818494
57276H18494k5378k4771k4673k4182k2411j9837j7431j5317j3146j1109r617q502
57264F02120p275n765l967j850J74J365J623J757K271K782L022L534M664N746
57250F10201O026N734N606N916O577P497Q413Q985R437J0307J1281J1315J0286
57237G17581R435R560R867R403Q542Q152Q345Q894R976J1504J2615J2874J3159
57224H49907J4275J5521J5826J5596J6061J7257J8026J7919J7745J8185J8865
57213A035183J9039J8480J7457J6366J5491J4924J4680J4936J5816J6913J7566
57202A216851J7803J8353J9474K0538K1172K1943K3307K4670K5207K5024K4720
57191A459062K4429K4020K3808K4177K4842K5132K4805K4075K3153K2282K1827
$$ plain form
57276 818494 793116 768345 743672 719490 697079 677242 659811 644494 631348 620239 610622 602120
57264 602120 594845 589080 585113 583263 583437 584802 586425 588182 590453 593235 596257 599791 604455 610201
57250 610201 616227 621961 627567 633483 640060 647557 655970 664955 674392 684699 695980 707295 717581
57237 717581 727016 736576 746443 755846 764388 772540 780885 789779 799755 811259 823874 836748 849907
57224 849907 864182 879703 895529 911125 927186 944443 962469 980388 998133 1016318 1035183
57213 1035183 1054222 1072702 1090159 1106525 1122016 1136940 1151620 1166556 1182372 1199285 1216851
57202 1216851 1234654 1253007 1272481 1293019 1314191 1336134 1359441 1384111 1409318 1434342 1459062
57191 1459062 1483491 1507511 1531319 1555496 1580338 1605470 1630275 1654350 1677503 1699785 1721612
57180A721612K1789K1630K1076K0740K1464K3327K5665K7728K9086K9817L0554
57169A994488L1846L3357L4306L4833L5935L7875L9658M0555M1096M1855M2306
57158B408110M1660M0047L8026L5779L3596L2335L2434L3067L3213L2970L2971
57147B794208L3122L2872L2287L1950L2143L2858L4186L5898L7115L7159L6479
57136C170277L6072L6426L7491L9135M0933M1933M1336L9196L6137L2863L0122
57125C581921K8418K7477K6850K7273L0338L6332M3683N1130N9195O8640P8893
57114D060150Q9017R9141J09750J20722J32335J46216J64062J86271K12924K45102
57104E565690K84132L30694L86161M53958N38508O44107P76235R42642J151397
$$ plain form
57180 1721612 1743401 1765031 1786107 1806847 1828311 1851638 1877303 1905031 1934117 1963934 1994488
57169 1994488 2026334 2059691 2093997 2128830 2164765 2202640 2242298 2282853 2323949 2365804 2408110
57158 2408110 2449770 2489817 2527843 2563622 2597218 2629553 2661987 2695054 2728267 2761237 2794208
57147 2794208 2827330 2860202 2892489 2924439 2956582 2989440 3023626 3059524 3096639 3133798 3170277
57136 3170277 3206349 3242775 3280266 3319401 3360334 3402267 3443603 3482799 3518936 3551799 3581921
57125 3581921 3610339 3637816 3664666 3691939 3722277 3758609 3802292 3853422 3912617 3981257 4060150
57114 4060150 4149167 4248308 4358058 4478780 4611115 4757331 4921393 5107664 5320588 5565690
57104 5565690 5849822 6180516 6566677 7020635 7559143 8203250 8979485 9922127 11073524
57095A1073524J408706J719745K089589K520588L009075L545661M116617M702363
57087C4185868N275742N804007O250765O573583O723165O651852O325834N729394
57079H3520210M863567L752351K454936J064505l15506j599963k733192l682974
57071H7323934m433276m982654n342180n529132n561808n460154n248939m957712
57063D5808079m616247m249200l874119l503391l146899k812082k502650k219460
57055A8884031j963279j735453j535633j360720j207162j073096r57241q56935
57047H194512p68584o89465o18002n52973m93524m39559l91200l48083l09685
57038C583437k75790k46071k19764j96273j75555j57415j41176j26496j13787
$$ plain form
57095 11073524 12482230 14201975 16291564 18812152 21821227 25366888 29483505 34185868
57087 34185868 39461610 45265617 51516382 58089965 64813130 71464982 77790816 83520210
57079 83520210 88383777 92136128 94591064 95655569 95340063 93740100 91006908 87323934
57071 87323934 82890658 77908004 72565824 67036692 61474884 56014730 50765791 45808079
57063 45808079 41191832 36942632 33068513 29565122 26418223 23606141 21103491 18884031
57055 18884031 16920752 15185299 13649666 12288946 11081784 10008688 9051447 8194512
57047 8194512 7425928 6736463 6118461 5565488 5071964 4632405 4241205 3893122 3583437
57038 3583437 3307647 3061576 2841812 2645539 2469984 2312569 2171393 2044897 1931110
57029A931110j03236r4135q5724p7964p0924o4290n8066n2871m8782m4762l9964
57018A190392l4817l0083k5594k0728j5202q672m47R482K0148L1406M5044O2899
57006A223828Q4883J09725J35531J56619J61010J35969P9201L884o8763j22114
56996A899773j50703j58156j51761j38483j22995j07313r1915p7292o4221n2816
56986G84118m2058l0792j8947p538K138Q901J1539R222K582n948j3504j8532k1043
56973F60138k1608k0739j9018j7068j5068j2835j0491q562p251o095m561k488
56961E14354K09L795Q295J3302J8394K3210K6654K6534K0866R810l858j6299k4736
56948F20530k8647k9339k8460k6726k3969k0111j5761j1796q629o004l299o3L605
$$ plain form
57029 1931110 1827874 1733739 1648015 1570051 1499127 1434837 1376771 1323900 1275118 1230356 1190392
57018 1190392 1155575 1125492 1099898 1079170 1063968 1055296 1054849 1064331 1084479 1115885 1160929 1223828
57006 1223828 1308711 1418436 1553967 1710586 1871596 2007565 2086766 2090650 2021887 1899773
56996 1899773 1749070 1590914 1439153 1300670 1177675 1070362 978447 901155 836934 784118
56986 784118 742060 711268 692321 684783 686921 695822 707361 716583 719165 713217 699713 681181 660138
56973 660138 638530 617791 598773 581705 566637 553802 543311 534749 527498 521403 516842 514354
56961 514354 514563 518358 526653 539955 558349 581559 608213 634747 655613 665423 661565 645266 620530
56948 620530 591883 562544 534084 507358 483389 463278 447517 435721 427092 421088 417789 417726 421331
56935D21331P271J0864J5032K0513K7243L4101L9080L9482L2895J9164J464j5404
56923F53036k8038l5647l8931l8846l6470l2965k9162k5516k2436k0137j8240
56912C26648j6179j3996j2138j0625r191p983p293o690n406l551j993j028k27
56899B30348M24M43N1K88J587L336N081P077R304J1198J2790J4970J8006K0959
56885C35862K3055K4400K4613K2104J5895P313j096p788j2518j5317j6234j5679
56873C84610j4174j1909r097o219l543q09K224N522R285J3919J9189K4418K9938
56860D43354L7108M5957N3593N5884N0255L6670J7333l608k1191l2222l6857l7253
56848F09023l5224l1657k7107k1920j6219j0387m964M41P037J5068K3245L0897
$$ plain form
56935 421331 428602 439466 454498 475011 502254 536355 575435 614917 647812 666976 668440 653036
56923 653036 624998 589351 550420 511574 475104 442139 412977 387461 365025 344888 326648
56912 326648 310469 296473 284335 273710 264519 256536 249243 242553 237147 233596 231603 230575 230348
56899 230348 230772 231215 231266 231554 233141 236477 241558 248635 257939 269137 281927 296897 314903 335862
56885 335862 358917 383317 407930 430034 445929 453242 452146 444358 431840 416523 400289 384610
56873 384610 370436 358527 349430 343211 339668 338859 341083 346605 355890 369809 388998 413416 443354
56860 443354 480462 526419 580012 635896 686151 722821 740154 736546 715355 683133 646276 609023
56848 609023 573799 542142 515035 493115 476896 466509 461545 461986 469023 484091 507336 538233
56836E38233L9435N0481O3479P6309Q6731R1624Q6152O6692L5205p96l3018n6534
56824A043993p0113p4842p3119o7641o0238n1800m3095l4847k7101j9374j1592
56813E10231m115L144J0884J9579K9134L9410N0202O0264O6585O5137N2977L0641
56801I34073K918k3312m2872n4322n8820n8233n4527m9573m4202l8028l0915k3976
56789D58211j8301j3525q693l837M52M486R355J5528K2488K9219L4056L4537K8709
56776E92685J6826J305j4614k7753l5653l7849l6309l3687l1136k8460k5580k2772
56764C17003j9941j6781j3576j0969r146p921p274p103o863o148n206m346l466
56751A98263k764k961m062m824m357l324k620k013j225j092k136l119k638j273
$$ plain form
56836 538233 577668 628149 691628 767937 854668 946292 1032444 1099136 1134341 1133545 1100527 1043993
56824 1043993 973880 899038 825919 758278 698040 646240 603145 568298 541197 521823 510231
56813 510231 506116 509260 520144 539723 568857 608267 658469 718733 785318 850455 903432 934073
56801 934073 936991 913679 870807 816485 757665 699432 644905 595332 551130 513102 482187 458211
56789 458211 439910 426385 417692 413855 414307 418793 428148 443676 466164 495383 529439 563976 592685
56776 592685 609511 610816 596202 568449 532796 494947 458638 424951 393815 365355 339775 317003
56764 317003 297062 280281 266705 255736 246590 238669 231395 224292 217429 211281 206075 201729 198263
56751 198263 195499 192538 188476 183652 179295 175971 173351 171338 170113 169021 166885 163766 161128 159855
56737A59855m92l71j29l4q02j701j359l3P81O52K70k98j385k149j370K97Q96k4
56719A52604j102j541j794j914j337m51l76r51q87p6K28k23k27N61R26K54n10
56702A43184o59o65p60l28O37J190J092J134J355P37p54j713j510j149j237r46
56686A39608J02Q63P15N56J016J219M45n44r45j192j744k013j592j202j319j230
56670A32743m82J28N1R3Q08J239N91j23L88J605K054J525R48P97P83P07N11Oo39
56651A43733p13rN57J52q10j312r70o0R30J338P30k92n37J33N88J88m04n63o23
56632A42056q59q24m15l53r01j263r15m26k72k7N79J010R56Q54P95K57n32m64
56614A39256N61J199Q54O10J161J526R56L54N59Q10K58m80o27o48r19n71Q78K183
$$ plain form
56737 159855 159363 158992 158863 158829 158027 156326 154967 154934 155715 156367 156637 156339 154954 152805 151435 151732 152628 152604
56719 152604 151502 149961 148167 146253 144916 144465 144089 143138 142251 142175 142403 142180 141953 142514 143440 143694 143184
56702 143184 142525 141860 141100 140772 141409 142599 143691 144825 146180 146917 146163 144450 142940 141791 140554 139608
56686 139608 139710 140573 141288 141844 142860 144079 144524 143980 143035 141843 140099 138086 136494 135292 133973 132743
56670 132743 132261 132389 132440 132533 133341 134580 135171 135048 135436 137041 139095 140620 141568 142365 143148 143855 144366 144372 143733
56651 143733 143020 143011 143568 143720 142910 141598 140628 140568 141498 142836 143566 143274 142737 142870 143458 143646 143242 142679 142056
56632 142056 141197 140373 139958 139605 138704 137441 136526 136100 135828 135801 136380 137390 138346 139200 139995 140252 139720 139256
56614 139256 139817 141016 141870 142480 143641 145167 146123 146477 147036 147846 148104 147624 146997 146349 145430 144859 145737 147920
56596A47920K221J803K024K199J239j98p80o78q29j046o38LK37O43J893L014K687
56579A61714J500J038J413J562J414J843K859L658M177M883N393M955M043L845
56565B04297M414M820M891N276O017O531O812P321P874P913P588P306O654N075
56551B92789L214K121J524L25j505l038m060n052n731n288m100l618m314n127
56537B58140n234n093n361n796n790n290m751m546m534m146l077j967j830k574
56523A98151l006k617k308k740l150k649j659j053q89r25j365k053k047j055k39
56508A70396m80j005q68n79q83j240r92q12j426k061j824j386j542j417m5J539
56492A55375J903J748K534L585L198J802J292J772J618O29M01J447K457K708K921
$$ plain form
56596 147920 150141 151944 153968 156167 157406 157208 156428 155750 154921 153875 153237 153240 153477 154120 156013 159027 161714
56579 161714 163214 164252 165665 167227 168641 170484 173343 177001 181178 186061 191454 196409 200452 204297
56565 204297 208711 213531 218422 223698 229715 236246 243058 250379 258253 266166 273754 281060 287714 292789
56551 292789 296003 298124 299648 299973 298468 295430 291370 286318 280587 275299 271199 267581 263267 258140
56537 258140 252906 247813 242452 236656 230866 225576 220825 216279 211745 207599 204522 202555 200725 198151
56523 198151 195145 192528 190220 187480 184330 181681 180022 178969 178080 177155 175790 173737 171690 170635 170396
56508 170396 169916 168911 168043 167464 166581 165341 164349 163537 162111 160050 158226 156840 155298 153881 153836 155375
56492 155375 157278 159026 161560 165145 168343 170145 171437 173209 174827 175456 175857 177304 179761 182469 185390
56477A85390L348L162K262J783K234K773K779K596K408J835J028Q26J469K296
56463B16189K779K838K332J399R29J446J917J143k23n92Q5M67M5n30j012j661
56447B27551k020j384k30M30P72J531K148J470o5r73j090j470k194k455k487l202
56431B16332m067l638k164j380j649j658r96p14j034r16k89m07j476k087j601
56416A92256j073j216j390j149r25o42M07J847K204J244M59P29J219J118P34M57
56400A96279J95K50J040J806J363K86L59J669K356J601O65N22N77L71M86J011
56384B10836J088O38P07J497J950J767J856K269J837M80k06M77J259J193J036
56369B28684J421J601J039N04N63O55M70O47J281J415Q19N97J297J953J797J323
$$ plain form
56477 185390 188738 191900 194162 195945 198179 200952 203731 206327 208735 210570 211598 212424 213893 216189
56463 216189 218968 221806 224138 225537 226466 227912 229829 230972 230749 230157 230242 230709 230754 230224 229212 227551
56447 227551 225531 224147 223917 224347 225119 226650 228798 230268 230203 229230 228140 226670 224476 222021 219534 216332
56431 216332 212265 208627 206463 205083 203434 201776 200780 200066 199032 198116 197827 197420 195944 193857 192256
56416 192256 191183 189967 188577 187428 186503 185861 186268 188115 190319 191563 192022 192751 193970 195088 195822 196279
56400 196279 196474 196724 197764 199570 200933 201219 201578 203247 205603 207204 207869 208391 208968 209339 209825 210836
56384 210836 211924 212562 213269 214766 216716 218483 220339 222608 224445 224925 224719 225196 226455 227648 228684
56369 228684 230105 231706 232745 233249 233812 234467 234937 235584 236865 238280 239099 239696 240993 242946 244743 246066
56353B46066J078Q96Q58J463K348K529K198K526L436L617L028L134M172M501L440
56338B85290K479K775L536L829M003M342M253L673L509L943M070L791M053M795
56324C38341M741L856L627M356M585L880L578L979L474J588J07kk15j463k209
56309C72223j214J99M37J46N47J247J407J470K003K464K452K686L554M266M486
56294C98373N056O130O630O488P258R413J1234J1632J1819J2924J4163J4860J6015
56281E31995J8283K0473K1584K2483K4131K6094K8095L1090L5458M0037M4171
56270H43894M8806N4533O0716O7456P5984Q6045R5503J03762J12827J23694J34450
56259A807670J43499J51754J59852J66044J68805J68867J66756J60981J50694
$$ plain form
56353 246066 247144 248040 248898 250361 252709 255238 257436 259962 263398 267015 270043 273177 277349 281850 285290
56338 285290 287769 290544 294080 297909 301912 306254 310507 314180 317689 321632 325702 329493 333546 338341
56324 338341 343082 346938 350565 354921 359506 363386 366964 370943 374417 376005 376112 376110 375895 374432 372223
56309 372223 371009 371208 371645 371791 372338 373585 374992 376462 378465 380929 383381 386067 389621 393887 398373
56294 398373 403429 409559 416189 422677 429935 439348 450582 462214 474033 486957 501120 515980 531995
56281 531995 550278 570751 592335 614818 638949 665043 693138 724228 759686 799723 843894
56270 843894 892700 947233 1007949 1075405 1151389 1237434 1332937 1436699 1549526 1673220 1807670
56259 1807670 1951169 2102923 2262775 2428819 2597624 2766491 2933247 3094228 3244922
56250C244922J37507J22670J05080Q4227O2520M2458K3965O640p956j8718k7276
56239C776039l5526m3117m9483n5896o3255p0370p6629q3826r2956j01877j08586
56228B994518j14168j20010j24791j27013j27849j28614j27951j24500j19894
56219A879728j16049j11759j05133r7178q9904q2945p5144o7457o1202n5350m8578
56208I69029m2181l7983l5182l2048k8872k6500k4047k0779j8201j7425j6582
56197F69229j3782j0451q815q221o968n570n165m744l075j347r94r44J48J244
56183F00545J277J592L183M209L372K814M349N851M998L524L818M357K838R56
56169F47683J399K708J960K74P16K732L510L196L969N518O038O283Q072J0254
$$ plain form
56250 3244922 3382429 3505099 3610179 3694406 3756926 3799384 3823349 3829989 3822033 3803315 3776039
56239 3776039 3740513 3697396 3647913 3592017 3528762 3458392 3381763 3297937 3204981 3103104 2994518
56228 2994518 2880350 2760340 2635549 2508536 2380687 2252073 2124122 1999622 1879728
56219 1879728 1763679 1651920 1546787 1449609 1359705 1276760 1201616 1134159 1072957 1017607 969029
56208 969029 926848 888865 853683 821635 792763 766263 742216 721437 703236 685811 669229
56197 669229 655447 644996 636181 627960 620992 615422 610257 605513 602438 601091 600097 599153 599301 600545
56183 600545 601822 603414 606597 610806 614178 616992 621341 627192 632190 635714 639532 643889 646727 647683
56169 647683 649082 651790 653750 654024 654740 657472 660982 664178 668147 673665 679703 685986 694058 704312
56155G04312J0628J0411J2303J5606J7799J9484K3223K8742L3890L9150M6818
56144I62366N6770O7310P8977R3309J09114J23905J37376J49357J56188J53834
56134B088506J43174J28141J10644R1906P6342O8371O6390O4733O0321N2969M1354
56123B992851K4492O190p514j4965j8912k1569k4461l1315m5539o5425q6232j05621
56111B601980j22839j34847j38707j36202j31110j23781j13194j01828r2789q4440
56101A422243p3757o2724n5243m9998m3011l5181l0408k7998k3944j8367j4746
56090I86866j2995j0188o959o226o835n302k614k297l138j109K781M061L029L819
56076I42893O268O541M965N454P782Q172O989P942J0454J0616R064R833J2184
$$ plain form
56155 704312 714940 725351 737654 753260 771059 790543 813766 842508 876398 915548 962366
56144 962366 1019136 1086446 1165423 1258732 1367846 1491751 1629127 1778484 1934672 2088506
56134 2088506 2231680 2359821 2470465 2562371 2638713 2707084 2773474 2838207 2898528 2951497 2992851
56123 2992851 3017343 3023533 3016019 3001054 2982142 2960573 2936112 2904797 2859258 2793833 2707601 2601980
56111 2601980 2479141 2344294 2205587 2069385 1938275 1814494 1701300 1599472 1506683 1422243
56101 1422243 1348486 1285762 1230519 1180521 1137510 1102329 1071921 1043923 1019979 1001612 986866
56090 986866 973871 963683 956724 950498 943663 938361 935747 933450 930312 929203 931984 936045 939074 942893
56076 942893 949161 955702 960667 966121 973903 982075 989064 997006 1007460 1018076 1027140 1036973 1049157
56063A049157J1789R408R840J2843J3598J1817J1754J3617J3652J2302J3516J6353
56051A199646J6331J4471J5811J9557K0269J8263J8892K2031K2573K0946K2517
56040A411307K6644K7320K4752K5164K8775K9500K7084K7873L2622L5291L4958
56029A731290L7066M1723M2942M0740M1752M6312M7545M4785M4998M9150N0364
56018B218667M7649M8078N3030N5716N4806N6888O2999O6489O6694P0547P8256
56007B879819Q1946Q1050Q3972R1969R6981R7936J02976J12772J18522J19477
55997C867420J24914J35564J41397J41348J46158J57854J66218J69754J79358
55988E229985J96553K09713K17103K31272K54910K75622K90808L13349L45943
$$ plain form
56063 1049157 1060946 1070354 1080194 1093037 1106635 1118452 1130206 1143823 1157475 1169777 1183293 1199646
56051 1199646 1215977 1230448 1246259 1265816 1286085 1304348 1323240 1345271 1367844 1388790 1411307
56040 1411307 1437951 1465271 1490023 1515187 1543962 1573462 1600546 1628419 1661041 1696332 1731290
56029 1731290 1768356 1810079 1853021 1893761 1935513 1981825 2029370 2074155 2119153 2168303 2218667
56018 2218667 2266316 2314394 2367424 2423140 2477946 2534834 2597833 2664322 2731016 2801563 2879819
56007 2879819 2961765 3042815 3126787 3218756 3315737 3413673 3516649 3629421 3747943 3867420
55997 3867420 3992334 4127898 4269295 4410643 4556801 4714655 4880873 5050627 5229985
55988 5229985 5426538 5636251 5853354 6084626 6339536 6615158 6905966 7219315 7565258
55979G565258L75353L99386M32914M79289N23743N63641O15830O84806P54774
55970A2394994Q23184R09274J018896J136069J260769J417264J613292J832651
55962B2406393K081895K399929K807638L298937L898757M674667N671587O893362
55954E4133165Q363834J0134812J2223615J4646543J7547170K1173501K5669370
55947A63892010L0966871L6778622M2245593M5319869M2994117L3117050J6539935
55940D11854067k696325j9661684l1251136l7047955l8294513l6570665l3213659
55933B13118130k9236701k5282225k1635193j8393442j5612111j3290802j1348702
55926G8318954r700136q312838p161560o186636n338145m611382m004630l485012
$$ plain form
55979 7565258 7940611 8339997 8772911 9252200 9775943 10339584 10955414 11640220 12394994
55970 12394994 13218178 14127452 15146348 16282417 17543186 18960450 20573742 22406393
55962 22406393 24488288 26888217 29695855 32994792 36893549 41568216 47239803 54133165
55954 54133165 62496999 72631811 84855426 99501969 117049139 138222640 163892010
55947 163892010 194858881 231637503 273883096 319202965 362197082 395314132 411854067
55940 411854067 409157742 389496058 358244922 321196967 282902454 246331789 213118130
55933 213118130 183881429 158599204 136964011 118570569 102958458 89667656 78318954
55926 78318954 68618818 60305980 53144420 46957784 41619639 37008257 33003627 29518615
55918B9518615l024680k629603k304614k026036j773533j555407j379082j227245
55910A3598415j084744r60363q61705p75078o89231o14148n58240n10068m59468
55901G085370m14852l83509l55537l22619k93114k74000k56569k33769k13758
55892D337643k02947j92870j76646j61877j54887j48237j35865j24991j21201
55883B918122j16782j05565r4922r1530q9044q1102p3290p1117o8968o1913n6278
55872B007611n7660n9966n6772n2502n2265n1374m4967l7760l4560l0954k2622
55861A506209j4500j1759j1074r150j0490j8034k5410k6956k6706k9369l1420
55850A291341k9333k7653l0433l3148l1393k9324l1245l3035l0236k6742k7013
$$ plain form
55918 29518615 26493935 23864332 21559718 19533682 17760149 16204742 14825660 13598415
55910 13598415 12513671 11553308 10691603 9916525 9227294 8613146 8054906 7544838 7085370
55901 7085370 6670518 6287009 5931472 5608853 5315739 5041739 4785170 4551401 4337643
55892 4337643 4134696 3941826 3765180 3603303 3448416 3300179 3164314 3039323 2918122
55883 2918122 2801340 2695775 2600853 2509323 2420279 2339177 2265887 2194770 2125802 2063889 2007611
55872 2007611 1949951 1889985 1833213 1780711 1728446 1677072 1632105 1594345 1559785 1528831 1506209
55861 1506209 1491709 1479950 1468876 1459726 1449236 1431202 1405792 1378836 1352130 1322761 1291341
55850 1291341 1262008 1234355 1203922 1170774 1139381 1110057 1078812 1045777 1015541 988799 961786
55839I61786k7379k3445j8956j8853k0296j8696j6195j6243j6105j2631r307r963
55827G53717j1231q701m777l352k393R99L899L051J471K747M100J963j053j487
55813G38953j840n251q895r502j0074j4037j7963j7377j4776j4676j5320j2724
55801E96518q652p174p296n947m665o328q833q691p596q937j1009j0108p265n768
55787D88249m879j944K051M474N554N747K229o382j5303j9274j9729k0871k2195
55774C97727k0745j7477j5222j3176r228n244m359n493n822o041q067j0264j0232
55761B66357r486j0238j0472p578l961l382m456l462j081o25j802j852j056j648
55747B05258l026l037k358k854l514k554j453k317l548k705j264j782k876j961
$$ plain form
55839 961786 934407 910962 892006 873153 852857 834161 817966 801723 785618 772987 763680 753717
55827 753717 742486 733785 729008 725656 723263 724262 728161 731212 732683 735430 739530 741493 740440 738953
55813 738953 737113 731862 722967 713465 703391 689354 671391 654014 639238 624562 609242 596518
55801 596518 587866 580692 573396 567449 562784 556456 547623 538932 531336 522399 511390 501282 494017 488249
55787 488249 483370 481426 483477 487951 493505 499252 501481 495099 479796 460522 440793 419922 397727
55774 397727 376982 359505 344283 331107 321879 316635 312276 306783 300961 294920 286853 276589 266357
55761 266357 256871 246633 236161 228583 224622 221240 216784 213322 212241 211616 209814 207962 206906 205258
55747 205258 202232 199195 196837 193983 190469 187915 186462 184145 180597 177892 176628 174846 171970 170009
55733A70009m08q72j960q71R43K80j774j860n87j160l273l885k854k555k974k169
55717A44030o50m69r42N3J651J382r4j23J275K131K634M158N603N101L965M487
55701A74192N290L462q5k039k212k983m397m529l727l847m252k933p21j7l75L59
55685A51186J674J555P96J675L496L935L662M980P025P089N720N683O776O428
55671B11680M667L715L407J812k46k21J178R26q77j349k34k9r78r08O9m37k302
55654B19873k969k434l344n846p106o402o069o829o751n536n309o394o503n055
55640A43326m205m772n031m349m198m829m657l651l653m753m906l749l098l226
55626H4249k384n37K21m51n93J43j64j791k611k010j839k613k513j091l56j037
$$ plain form
55733 170009 169601 168729 166769 165898 166841 167121 165347 163487 162900 161740 158467 154582 151728 149173 146199 144030
55717 144030 143380 142911 141969 142022 143673 145055 144961 144838 146113 148244 150878 155036 160639 165740 169705 174192
55701 174192 179482 182944 182859 180820 178608 175625 171228 166699 162972 159125 154873 151940 151219 151202 150827 151186
55685 151186 152860 154415 155211 156886 160382 164317 167979 172959 179984 187073 192793 198476 205252 211680
55671 211680 216347 220062 223469 225281 225035 224814 225992 226918 226041 224692 224458 224429 223451 222543 222612 222175 219873
55654 219873 216904 214470 211126 205280 198174 191772 185703 178874 172123 166587 161278 154884 148381 143326
55640 143326 139121 134349 129318 124969 120771 115942 111285 107634 103981 99228 94322 90573 87475 84249
55626 84249 81865 81328 81549 81098 80505 80648 80484 78693 76082 74072 72233 69620 67107 66016 65660 64623
55610F4623j318l70J98n15j172r13n86m50L70J439J078m44r07J25O99J60J20J033
55592F3170J176o0r90p65n94j113j397j284j720k289j514k2j46j880k679j769
55576D6124j082j224m14J619K478J244J79R00K137K689L232L838L022Q18l85L89
55560F5564J131N08n1N29R07J48l55L68R43L13l05J16N24Q8q4Q28J642J402J084
55541G5300J625K370K793L486M337M007K508J790K556K958J799M33J19Kp84j381
55525A03918j175j151j907k518k695l618n372o043m838l613l788m182l513k588
55511E6917k332j960q70k12q70j872k303k734l367l014j414k81n28p66j20l9j508
55494C2727k840k328j011p07j149j107o51l81M7Q58J161M53l58o87j290k315k396
$$ plain form
55610 64623 63305 62935 63133 62618 61446 60533 59947 59497 59867 61306 62384 61940 61033 61158 61857 62017 62137 63170
55592 63170 64346 64286 63296 62531 61937 60824 59427 58143 56423 54134 52620 52598 52452 50572 47893 46124
55576 46124 45042 43818 43404 45023 47501 48745 48924 49824 51961 54650 57882 61720 64742 65560 65175 65564
55560 65564 66695 67203 67152 67681 68588 68736 68381 68749 69692 70005 69700 69816 70340 70428 70344 71172 72814 74216 75300
55541 75300 76925 79295 82088 85574 89911 93918 96426 98216 100772 103730 105529 105962 106081 106083 105299 103918
55525 103918 102743 101592 99685 97167 94472 90854 85482 79439 74601 70988 67200 63018 59505 56917
55511 56917 54585 52625 51755 51543 50673 48801 46498 43764 40397 37383 35969 35688 35160 34394 34274 34235 32727
55494 32727 29887 27559 26548 25841 24692 23585 22934 22553 22600 23458 24619 25072 24714 24027 22737 20422 18026
55477A8026j056L1k84p36m6P75L03r48j710j785j258K71K199K616J029m84l45
55460A6598L57K34o9K90L57p82k038k146j640j244k30J728K997K285Q34K72J07
55443A7910p08j453j072k39NJ92R96J450O40l48j84M58L97J12M28O07j60q57l15
55424A7859O50Q06O62J033J016k84j560j233k12k33p82k24J043J307N25J15L65
55407B0853M18K95P02J261J031K85n3k06r50j771j577o71k43m29n10m83p00o48
55389A6604K16J030N93o51j365j402j533j723j319m38K76P68J162R78K5p00l75
55372A2146K64J99k03j56J3k01j55P83J741J612Q14K89j70j013j615j426j252
55355A1670j667j538j8J442J240M00P73J637Q42j375k538j629j01P45J116J305
$$ plain form
55477 18026 16970 17001 16717 15981 15935 16710 17013 16065 14355 12570 11312 11583 13782 16398 17427 16943 16598
55460 16598 16955 17189 17120 17410 17767 16985 14947 12801 11161 9917 9687 11415 14412 16697 17531 17803 17910
55443 17910 17202 15749 14677 14438 14443 14635 15631 17081 17721 17373 17189 17647 18044 18156 18584 19191 19031 18174 17859
55424 17859 18509 19315 19977 21010 22026 21742 20182 18949 18737 18504 17722 17498 18541 19848 20373 20488 20853
55407 20853 21271 21566 22268 23529 24560 24845 24792 24586 23636 21865 20288 19617 19374 18945 18435 17952 17252 16604
55389 16604 16820 17850 18443 17792 16427 15025 13492 11769 10450 10012 10288 11056 12218 13196 13221 12521 12146
55372 12146 12410 12609 12406 12250 12263 12062 11907 12690 14431 16043 16857 17146 16976 15963 14348 12922 11670
55355 11670 10003 8465 8447 9889 11129 11529 12302 13939 14781 13406 10868 9239 9138 9883 10999 12304
55339A2304R81K18l66o32q34p60j58M17M67O25J473K059J196m77j379j306j224
55322A2604j389j297r34m73N45K155K880J555n59j344p37j97m4N26J333J370P66
55305A6760N67P36L27n83j013q91r58j092n08N16Q27K20m87r29j247j109k32M93
55287A1397N4r73j256p24j45N57J740K498J701R4o00k69j34l60nR52J530J481
55269A7538J219M65j125k441k127r35o94j329j202j19M41L6j81K84P08R37J497
55252A2972J903J041n46j078m34k91j139j492o18L13M49M68Q14P83J31k66j17
55235A2893k77r32j072m20j22o72r79l22M18M67M91J155J767J389L01n90r32q55
55217A1708m75j1L72R73J983K648K083P51j07l41p37j206q93n7k0r68j569j111
$$ plain form
55339 12304 13285 13503 13137 12505 11671 10911 10753 11170 11637 12262 13735 15794 16990 16513 15134 13828 12604
55322 12604 11215 9918 8984 8511 9056 11211 14091 15646 15087 13743 13006 12809 12765 13291 14624 15994 16760
55305 16760 17327 18063 18390 17807 16794 15903 14945 13853 13345 13861 14688 14908 14421 13492 12245 11136 10904 11397
55287 11397 11451 10478 9222 8498 8353 8910 10650 13148 14849 14943 14343 14074 13940 13580 13575 14527 16057 17538
55269 17538 18757 19222 18097 15656 13529 12594 11900 10571 9369 9250 9691 9727 9546 9830 10538 11475 12972
55252 12972 14875 15916 15370 14292 13858 13567 12428 10936 10318 10631 11080 11548 12362 13145 13276 13010 12893
55235 12893 12616 11684 10612 10192 10070 9398 8419 8097 8515 8982 9473 10628 12395 13784 14085 13495 12563 11708
55217 11708 11233 11222 11594 12567 14550 17198 19281 20032 19925 19584 18847 17641 16748 16691 16671 15703 14134 13023
55199A3023l29J75O33R13M69j99J72J350J580L43p31n03O3r9l95l3K95m10j678
55180A4639k250j719n94N08J056P46J8k80j05j50m95m36Q4K10k59m22J91Q95J114
55161A2751J096R37K44o85p35L13J193R42J28l48m78n47l79R1M64N62O61P41N10
55142A7461L12P62J380R77l10r32k85M74M77M08R43J482J391J180J403J593J153
55125B9869L67k85q35j232j038l60l8l33n02j75Ml24m98r9K18p9m50k74J84M20
55105B4540M31L37J22P9N16Q26J58q95p55O31J496R45J92L98R80J111J166J550
55087C3828J592Q95M06R31J686J630J086Q78Q22L50k74n38o42q91r10l57L31P35
55069D1558J088J415J141L16l6M18N61k51r17m66K27J0n03j58N21K12q69j264
$$ plain form
55199 13023 12694 12869 13502 14415 14884 14685 14857 16207 17787 18130 17399 16896 16959 16860 16465 16432 16727 16317 14639
55180 14639 12389 10670 10076 10584 11640 12386 12404 12124 12019 11869 11374 10938 11022 11232 10973 10551 10742 11637 12751
55161 12751 13847 14784 15028 14343 13608 13921 15114 16056 16184 15836 15358 14811 14432 14523 14987 15549 16210 16951 17461
55142 17461 17773 18535 19915 20892 20582 19650 19365 19839 20316 20724 21667 23149 24540 25720 27123 28716 29869
55125 29869 30236 29951 29116 27884 26846 26486 26448 26115 25613 25438 25442 25118 24620 24521 24739 24660 24210 23936 24120 24540
55105 24540 24971 25308 25430 25509 26025 26851 27009 26114 25359 25990 27486 28431 28623 29021 30001 31112 32278 33828
55087 33828 35420 36315 36721 37652 39338 40968 42054 42932 43754 44104 43830 43292 42650 41759 40849 40492 40823 41558
55069 41558 42646 44061 45202 45518 45482 45900 46461 46210 45293 44827 45054 45064 44561 44403 44924 45136 44267 43003
55051D3003o07M5kl31m38k53K25Q60J081N72L7L86J361J874J549J026Q83J012
55033E2283J036P65K78l9K06P68Q80L66J0L88R47Q27P0o52j032j281j544j758
55015E2518j848j716j329r30q05q27p07o06q07r05k95O66J041P91O96Q31N74J99
54997D6541P27J906K121Q91k68k97o5m64p73k48K91k0m14J47J119J498J745K813
54979E7250M146M338L399K786L437N023O870Q510R611J0273J1152J2603J4207
54966A53605J5721J7768K0809K4128K6594K7701K7175K4531J9873J4213Q093R15
54954C81126p424j5293k0830k3794k4934k4482k2558k0094j8054j6362j4667j3321
54942A59313j2457j1162q787o245m705l877k875j831j221n62P35K070K739L511
$$ plain form
55051 43003 42396 42441 42439 42108 41670 41417 41642 42502 43583 44155 44192 44578 45939 47813 49362 50388 51271 52283
55033 52283 53319 54084 54362 54323 54529 55297 56177 56543 56553 56941 57888 58715 58785 58133 57101 55820 54276 52518
55015 52518 50670 48954 47625 46695 45890 45063 44356 43750 42943 42038 41743 42409 43450 44241 44937 45768 46342 46541
54997 46541 47268 49174 51295 52186 51918 51621 51556 51092 50319 50071 50362 50342 49928 50075 51194 52692 54437 57250
54979 57250 61396 65734 69133 71919 75356 80379 87249 95759 105370 115643 126795 139398 153605
54966 153605 169326 187094 207903 232031 258625 286326 313501 338032 357905 372118 380211 381126
54954 381126 373702 358409 337579 313785 288851 264369 241811 221717 203663 187301 172634 159313
54942 159313 146856 135694 126907 120662 115957 112080 109205 107374 106153 105591 106326 108396 111135 114646
54928A14646N389P642Q861R397J0877J3630J6469J8711K0679K2384K3286K3263
54916B95234K2347J9689J4431P342J43o632j3359j9286k2701k3335k2818k2336
54904B28719k1445j9563j7146j4838j2711j0901r838r367q581p019n117l346j782
54891H7065p41p26j409j702j172n63n71r55j239j490j886k143j912j404j250j846
54875F6056k888l478k904j537n93o89j163j230j141j441j799j547r19o89q72p98
54859D2368l18J9p3k86k92l0N06J132J365J018N61L62J11m40q02o33n69j161j612
54840D1226p75J090K602L002K579J813J137J126J873K471K188J689K016K902L263
54825G0202K924K587K447K191K061K625L643M485N362O958R014J0629J1731J3047
$$ plain form
54928 114646 120035 127677 136538 145935 156812 170442 186911 205622 226301 248685 271971 295234
54916 295234 317581 337270 351701 359043 359186 352554 339195 319909 297208 273873 251055 228719
54904 228719 207274 187711 170565 155727 143016 132115 122277 112910 104329 97310 92193 88847 87065
54891 87065 86324 85598 84189 82487 81315 80752 80181 79226 77987 76497 74611 72468 70556 69152 67902 66056
54875 66056 63168 59690 56786 55249 54656 53967 52804 51574 50433 48992 47193 45646 44727 44038 43166 42368
54859 42368 42050 42069 41996 41710 41418 41388 41894 43026 44391 45409 45970 46332 46443 46003 45201 44568 43999 42838 41226
54840 41226 40451 41541 44143 47145 49724 51537 52674 53800 55673 58144 60332 62021 64037 66939 70202
54825 70202 73126 75713 78160 80351 82412 85037 88680 93165 98527 105485 114499 125128 136859 149906
54811A49906J4825J6879J9444K2610K5164K5606K4101K1841J8679J3277N736j841
54799C56227p872j2743j7138k0466k1772k1102j9247j6963j4913j3499j2428j1125
54787A66959r713q805q292p400n956m507l202j680j07Q96J522K663M351N532N772
54772A38033N912O723Q021R548J1524J3918J6249J8519K1271K4162K5496K3807
54760C23183J9211J2863N885r17p138j2890j8168k1980k3110k1789j9581j7460
54748B18109j5160j2661j0883j0341j0190r448q260p379p017o860o664o385o105
54735A00756o000n925n204l535j892j562k411l129l096k750k230j089M25J255
54721F3613J093P68O74J78q75j440q16K45P71Q40R09Q53N14L00M46M44p6o10o03
$$ plain form
54811 149906 164731 181610 201054 223664 248828 274434 298535 320376 339055 352332 358068 356227
54799 356227 348355 335612 318474 298008 276236 255134 235887 218924 204011 190512 178084 166959
54787 166959 157246 148441 140149 132749 126793 122286 119084 117404 117297 118193 119715 122378 126729 132261 138033
54772 138033 143945 150668 158689 168237 179761 193679 209928 228447 249718 273880 299376 323183
54760 323183 342394 355257 361142 360225 353087 340197 322029 300049 276939 255150 235569 218109
54748 218109 202949 190288 179405 169064 158874 149426 141166 133787 126770 119910 113246 106861 100756
54735 100756 94756 88831 83627 80092 78200 76638 74227 71098 68002 65252 63022 61933 62358 63613
54721 63613 64706 65474 66148 66326 65451 64011 63195 63440 64211 65051 65960 66813 67327 67627 68073 68517 68441 67831 67228
54702F7228k77n4J73O12J060J298J466J555J226N26N6N6P0j63k76j24j62n13n42
54683G3215N6O17M89k2k54qO35J556K242K071J441J656L125M550M619L678K973
54666A02639L004L438L946M309M232L712L242L019K534J464L97n7k63r31j899
54651A32786k352k038j582j608k040k315k032j389r40q68o96o6N97P35O49R73
54635A17814J438J220M19K8L21L89m12j619k619l415m034m118l596k909k281j528
54619I5098q30o84q77n19N33J395J659K008K833L429L213K653K314K004J625J737
54603A17591K447K677J514m68k028k689k688k281j851k002k783l425l466l409
54589I7139l691l839l435l020l241l740l684k889j717n24K79K51l89p89p06q82
$$ plain form
54702 67228 66951 66897 67070 67682 68742 70040 71506 73061 74287 74813 74869 74925 74995 74832 74556 74432 74270 73757 73215
54683 73215 73271 73888 74377 74355 74101 74093 74728 76284 78526 80597 82038 83694 86819 91369 95988 99666 102639
54666 102639 105643 109081 113027 117336 121568 125280 128522 131541 134075 135539 135936 135879 135616 134685 132786
54651 132786 130434 128396 126814 125206 123166 120851 118819 117430 116490 115622 114926 114860 115457 116192 116841 117814
54635 117814 119252 120472 120891 120919 121240 121629 121217 119598 116979 113564 109530 105412 101816 98907 96626 95098
54619 95098 94268 93584 92707 92188 92721 94116 95775 97783 100616 104045 107258 109911 112225 114229 115854 117591
54603 117591 120038 122715 124229 123761 121733 119044 116356 114075 112224 110222 107439 104014 100548 97139
54589 97139 93448 89609 86174 83154 79913 76173 72489 69600 67883 67359 67638 67889 67500 66711 66005 65123
54573F5123j674k246j840r67n18m90m32l69m67m93l76n40j027j038k37M49J72
54556E3030m58l36M90J109J101O37j90j147j525r01J40P96J019J120R90N51K28
54539E6654K77K36k13n72m51k55k33K73J511K338J746O22N84J616K298J912J068
54522F9411M26R7R3L47L10m35j383j747j601j569j680j492j028p08n88m98n10
54505E7445o05k85N58J009L17p51q74j00M33L54L90R03J318J143O18J90J7K6o
54486F2100l38p37n46K18N10k17r70o48K00L68R6N72J718K123J279K31j97l95
54468F5367p64q22k46L27K84K7K67R34J347J141M75l10r02j052p47l02r4k73p15
54449F3942j118j215j022p69n08o7N02P62M00l41r34j069p22j31K27M3l80n09
$$ plain form
54573 65123 63449 61203 59363 58396 57878 57388 56956 56587 56120 55627 55251 54711 53684 52646 52409 52858 53030
54556 53030 52572 52236 52726 53835 54936 55573 55383 54236 52711 51810 51950 52746 53765 54885 55875 56426 56654
54539 56654 56931 57167 56954 56382 55931 55676 55443 55716 57227 59565 61311 61933 62517 64133 66431 68343 69411
54522 69411 69837 69934 70027 70374 70684 70249 68866 67119 65518 63949 62269 60777 59749 59041 58453 57955 57445
54505 57445 56840 56555 57113 58122 58439 57688 56814 56714 57147 57501 57891 58794 60112 61255 61873 62063 62080 62106 62100
54486 62100 61762 61025 60479 60697 61207 60990 60020 59372 59572 59940 60036 60608 62326 64449 65728 65959 65762 65367
54468 65367 64603 63781 63535 63862 64146 64173 64440 65374 66721 67862 68337 68027 67125 66073 65326 65024 64930 64657 63942
54449 63942 62824 61609 60587 59818 59310 59243 59745 60507 60907 60566 59632 58563 57841 57710 57937 57980 57600 57091
54431E7091l43j92J30R82J805J582N08o4K64L21n28j174n53O74J373J649K045
54414F5570K206J645J016J179J795K044K048K298K459K133J990K803M024M646
54400I7856M783N011M964M116L181L047L100K355J590K273L834M145K606O89n36
54385A43014j439k242k468k342k931m291n102m651l779l318l033k593k290k290
54371A00245k292k314k735l305l261k618k171k018j427l40L88N35Q26J356J211
54356H2080K49k94L74J410J800J784J953K041J574R17P98J336K162K944L391L331
54340A07850L104L314L922M262M027L479K644J308j21q75j109j763k896l427k932
54325A20787k449k930l997m861n367n477m782l326k084j878k384k788k793k486
$$ plain form
54431 57091 56748 56556 56686 57668 59473 61055 61563 61499 61763 62084 61556 60382 59829 60503 61876 63525 65570
54414 65570 67776 69421 70437 71616 73411 75455 77503 79801 82260 84393 86383 89186 93210 97856
54400 97856 102639 107650 112614 116730 119911 122958 126058 128413 130003 132276 136110 140255 142861 143550 143014
54385 143014 141575 139333 136865 134523 131592 127301 122199 117548 113769 110451 107418 104825 102535 100245
54371 100245 97953 95639 92904 89599 86338 83720 81549 79531 78104 77764 78152 78687 79513 80869 82080
54356 82080 82329 82035 82409 83819 85619 87403 89356 91397 92971 93888 94686 96022 98184 101128 104519 107850
54340 107850 110954 114268 118190 122452 126479 129958 132602 133910 133789 132914 131805 130042 127146 123719 120787
54325 120787 118338 115408 111411 106550 101183 95706 90924 87598 85514 83636 81252 78464 75671 73185
54311G3185j983j572j562j651j197l64q1n42q42m55n9l11q66j265j711k307k422
54294E3995j688q18n87p01n09j27r3l74n13l61k0M93R93R92L24m19n59r5N21R27
54274E1381R02L92k63n81n85o00m62L42J546K131J733J131R20O74k5o48n30O7
54256E7525L88J82k75o74q09n96k79k12l06k48k15o13j075q04P4N42L25K86Q13
54237E4029J101N54k21n49o66q88q29k86P8j69l79P7O93O80J82k21m83p04m98
54218E1501L32J136J294J118J125J024L55n29r29p99m33K18J129J689J467R67
54202F0665Q16O92m1j072j504j127n11j09Jk13o02o76k37J44j01o57q28n27j64
54183E3949P3J75l4n38p52k09P41J421J680J702J442Q50K95J55L15M62N61N70
$$ plain form
54311 73185 71202 69630 68068 66417 65220 64856 64775 64233 63391 62936 62877 62566 61700 60435 58724 56417 53995
54294 53995 52307 51489 50902 50201 49692 49565 49472 49098 48585 48224 48204 48697 49690 50682 51006 50587 50028 49933 50454 51381
54274 51381 52283 52675 52412 51831 51246 50646 50184 50526 52072 54203 55936 57067 57987 58661 58636 57988 57458 57525
54256 57525 57913 58095 57820 57146 56337 55741 55462 55250 54944 54696 54481 53868 52793 51989 52063 52605 52930 53216 54029
54237 54029 55130 55684 55463 54914 54248 53360 52531 52245 52323 52154 51775 51852 52545 53225 53407 53186 52703 51999 51501
54218 51501 51833 52969 54263 55381 56506 57530 57885 57356 56427 55628 55195 55413 56542 58231 59698 60665
54202 60665 61481 62173 62132 61060 59556 58429 57918 57809 57810 57597 56995 56319 56082 56226 56125 55468 54640 54113 53949
54183 53949 54022 54197 54163 53625 52873 52664 53405 54826 56506 58208 59650 60500 60795 60950 61265 61727 62288 62858
54165F2858K60k17k68J99L82j88q09o89k23k89q31j055p16k82j19j99m61p95r10
54146E5648p73p59r77r02k53L39J99l63o35n81o00o41l35K93Q87J215J046J11
54128E2919j266k062j790j236j250j516j271o65l57l13J8O98J322J781K084J877
54112D8973R55j19p25j096j653j967j391l68K6l63p16n95l39k11n4J82M07P45
54094D1691J280J527J022J32l62l55k69j13M04J072J363J311J309J209N32m94
54078E1259j032q17l91j35J26M87O64N25L29L19N04P83R65Q03M19L71Q18J069
54060E7066N34k64m26J7K99J77R9M01J033J903K722K827J963R47P48J169J313
54043G2528J042J077J806K896L950M698M730L969L242L462M394N012M939M611
$$ plain form
54165 62858 63118 62901 62633 62832 63214 63026 62217 61528 61305 61016 60185 59130 58414 58132 58013 57814 57353 56558 55648
54146 55648 54875 54116 53139 52237 51984 52323 52522 52159 51524 50943 50343 49702 49367 49660 50547 51762 52808 52919
54128 52919 51653 49591 47801 46565 45315 43799 42528 41863 41506 41193 41211 41909 43231 45012 47096 48973
54112 48973 49928 49809 49084 47988 46335 44368 42977 42609 42635 42272 41556 40961 40622 40411 40357 40539 40946 41691
54094 41691 42971 44498 45520 45652 45290 44935 44666 44553 44957 46029 47392 48703 50012 51221 51753 51259
54078 51259 50227 49410 49019 48884 49010 49497 50161 50686 51015 51334 51838 52621 53586 54389 54808 55179 55997 57066
54060 57066 57600 57336 56910 56927 57226 57403 57502 57903 58936 60839 63561 66388 68351 69298 70046 71215 72528
54043 72528 73570 74647 76453 79349 83299 87997 92727 96696 99938 103400 107794 112806 117745 122356
54029A22356M373M346M927O261P376P057N578M438M291M336L886L324L177L245
54015A88971L131K831K451J972J534J287Q98p6j297j984k161k616l501l901l179
54000A84360j866r61r48j799l180m364m679m310m077m273m325l764k823j910j202
53985A39879r25j351k241k914l043k860k491j755q26l78p19j278j266m88N75J160
53969A19079P78k38q75n81k4j12o43p16k11J46J06K30Q73J692K354K838K985K595
53951A30276K033J900K049J826J338J497K617L942M823N500O397P463Q433Q962
53937A89056Q540P111N889O341Q087R005P825N542L675K312P08j164k653l521
53923B46753m042m335m242l679k686j345Q1J190J819K093K122K069K425L463M590
$$ plain form
54029 122356 126729 131075 136002 142263 149639 156696 162274 166712 171003 175339 179225 182549 185726 188971
54015 188971 192102 194933 197384 199356 200890 202177 203075 202999 201702 199718 197557 194941 191440 187539 184360
54000 184360 182494 181533 180585 178786 175606 171242 166563 162253 158176 153903 149578 145814 142991 141081 139879
53985 139879 138954 137603 135362 132448 129405 126545 124054 122299 121473 121095 120376 119098 117832 117344 117919 119079
53969 119079 119857 119619 118744 118163 118139 118027 117384 116668 116457 116603 116709 116939 117812 119504 121858 124696 127681 130276
53951 130276 132309 134209 136258 138084 139422 140919 143536 147478 152301 157801 164198 171661 180094 189056
53937 189056 197596 204707 210596 216937 225024 234029 241854 247396 251071 253383 254091 252927 250274 246753
53923 246753 242711 238376 234134 230455 227769 226424 226505 227695 229514 231607 233729 235798 238223 241686 246276
53908B46276M967M853N230O111O327N377M291M028M056L302J688r7j689l046l899
53893B87775l999l671l468l546l817m362n169n823n990n957o224o781p159p044
53879B14765o535n963n616n496n316m916m544m447m393m049l647l698m178m678
53865A47289n061n299m920l587k038j459j962k692l220l646l519k215n43k86j680
53850A05162k920k799k238k324k496j851r54q41j232j165o89n90r27j098r54p75
53834H1309m74J61P37O77J13m05p26r05o67J15Q67J001P58N81K59m28q01o6J327
53815H3433K193K188J866J492R23N02R00J992K882L126L108L157L124K979L003
53800A16868L232L383L459L828M543N182N480N543N366M731L710K776K230J977
$$ plain form
53908 246276 251243 256096 261326 267437 273764 279141 283432 287460 291516 294818 296506 296409 294720 291674 287775
53893 287775 283776 280105 276637 273091 269274 264912 259743 253920 247930 241973 235749 228968 221809 214765
53879 214765 208230 202267 196651 191155 185839 180923 176379 171932 167539 163490 159843 156145 151967 147289
53865 147289 142228 136929 132009 128422 126384 124925 122963 120271 117051 113405 109886 107671 107128 106842 105162
53850 105162 102242 99443 97205 94881 92385 90534 89580 88739 87507 86342 85653 85063 84136 83038 82084 81309
53834 81309 80835 80996 81733 82410 82523 82118 81392 80487 79820 79935 80802 81803 82561 83142 83401 82973 82172 82106 83433
53815 83433 85626 87814 89680 91172 92095 92597 93497 95489 98371 101497 104605 107762 110886 113865 116868
53800 116868 120100 123483 126942 130770 135313 140495 145975 151518 156884 161615 165325 168101 170331 172308
53786A72308J944K223K716L057L006K653K126J445P29J51l28q78j479j941k231
53771A85501k512k847l221l694m203m291l537k294j536j808k673l378l733m011
53757A41763m231m041l330k536k056j628p77K15M04n13j672k169k172k197j970
53742A13090j002O3l5j263k070j423k3R32J260J491J842K186K422K345J738R70
53726A22523Q61J427J556N66o31p83l1M96L56L5k01o81j519k192k145j349k84
53709A18004L94K54n86j639k616l483l859l034r20J561L510M814N493N045L249
53694A26187J047k42l59k5K41N01P89R61J095J407J813K067K264K734L444L962
53678A47886L925L303K429J932K364L484M241L852K596J287M10L9K17Q20J428
$$ plain form
53786 172308 174252 176475 179191 182248 185254 187907 190033 191478 192207 192358 192030 191152 189673 187732 185501
53771 185501 182989 180142 176921 173227 169024 164733 161196 158902 157366 155558 152885 149507 145774 141763
53757 141763 137532 133491 130161 127625 125569 123941 123164 123379 123783 123270 121598 119429 117257 115060 113090
53742 113090 112088 112151 112116 110853 108783 107360 107337 108269 109529 111020 112862 115048 117470 119815 121553 122523
53726 122523 123384 124811 126367 126933 126302 125519 125488 125984 126340 126375 126174 125493 123974 121782 119637 118288 118004
53709 118004 118398 118652 118066 116427 113811 110328 106469 103435 102515 104076 107586 112400 117893 122938 126187
53694 126187 127234 126992 126633 126608 126849 127350 128139 129100 130195 131602 133415 135482 137746 140480 143924 147886
53678 147886 151811 155114 157543 159475 161839 165323 169564 173416 176012 177299 177709 177748 177965 178785 180213
53663A80213J701J628J228M25n47j224j681k516l694m171l252j629m58n3q4l96
53647A65490r06j303j435j552j668j430j042j309k149k210q45N81N47m93j086
53632A49190r43o77k34P81J754J750J154J027J252Q76J7k81Q5L12M70J410K847
53615A60790L384K686J914J634J166M81P90K363L523L007J868J746K488K865K669
53600A93374K611K833K826K598K674L118L434L394L234L133L051L009L026K953
53586B35268K768K779L199L675L700L273K829K614K482K174J660J221J264J872
53572B70778K606K983L029L004K773K015J026N71Q53J260J253R94Q17P28O40O45
53556B95975Q01J016J245J409J173L51n17o54r6M41P57J302K044K184J425N49
$$ plain form
53663 180213 181914 183542 184770 185195 184648 183424 181743 179227 175533 171362 168110 166481 166023 165970 165886 165490
53647 165490 164584 163281 161846 160294 158626 157196 156154 154845 152696 150486 149641 150222 150769 150276 149190
53632 149190 148247 147570 147336 148117 149871 151621 152775 153802 155054 155930 155947 155666 155751 156063 156533 157943 160790
53615 160790 164174 166860 168774 170408 171574 172055 172845 175208 178731 181738 183606 185352 187840 190705 193374
53600 193374 195985 198818 201644 204242 206916 210034 213468 216862 220096 223229 226280 229289 232315 235268
53586 235268 238036 240815 244014 247689 251389 254662 257491 260105 262587 264761 266421 267642 268906 270778
53572 270778 273384 276367 279396 282400 285173 287188 288214 288785 289638 290898 292151 293145 293962 294690 295330 295975
53556 295975 296776 297792 299037 300446 301619 301970 301453 300799 300703 301144 301901 303203 305247 307431 308856 309405
53540C09405K63K96J92J64M33N45J46j36M11J328J581J199J265K242L229L181
53524C25744K210J250Q82R63J176J453J775J982K086K509L607N011N915O181O492
53509C69236P247P908P996Q031Q691R549R687R296R536J0847J2386J3308J3595
53496D97313J3481J3066J2834J3513J5038J6382J6944J7241J7818J8335J8422
53485F70387J8605J9525K0722K1080K0292J9142J8517J8571J8812J8672J8070
53474H82395J7520J7484J7663J7415J6831J6695J7223J7673J7543J7340J7608
53463A073390J7897J7427J6189J4691J3101J1379R835Q786P971O959N898N161
53451A208684M519L355J663J1j353k769m479o242p753q964r924j0702j1534j2622
$$ plain form
53540 309405 309668 309964 310156 310320 310753 311298 311444 311308 311719 313047 314628 315827 317092 319334 322563 325744
53524 325744 327954 329204 330086 331049 332225 333678 335453 337435 339521 342030 345637 350648 356563 362744 369236
53509 369236 376483 384391 392387 400418 409109 418658 428345 437641 447177 458024 470410 483718 497313
53496 497313 510794 523860 536694 550207 565245 581627 598571 615812 633630 651965 670387
53485 670387 688992 708517 729239 750319 770611 789753 808270 826841 845653 864325 882395
53474 882395 899915 917399 935062 952477 969308 986003 1003226 1020899 1038442 1055782 1073390
53463 1073390 1091287 1108714 1124903 1139594 1152695 1164074 1173909 1182695 1190666 1197625 1203523 1208684
53451 1208684 1213203 1216558 1218221 1218232 1216879 1214110 1209631 1203389 1195636 1186672 1176748 1166046 1154512 1141890
53437A141890j3753j4429j4525j4463j4669j5115j5569j6013j6602j7267j7620
53426I71865j7358j6658j6045j5763j5552j5132j4690j4474j4128j2945j0846
53415H08274q641p067o058n147m266l717l595l585l267k428j132L81J956L646
53401G65354N474P128Q207Q759R293J0214J1545J3178J4995J6664J7708J7974
53389I06493J7850J7892J8503J9843K1710K3530K4830K5788K6933K8329K9514
53378A161215L0248L0837L1673L2908L4558L6409L7756L7923L7156L6493L6608
53367A543784L7243L7856L8135L7794L6619L4990L3611L2488L0776K8028K4858
53356A916182K2001J9388J6580J3562J0572P628M681J810j061m168p346j0025
$$ plain form
53437 1141890 1128137 1113708 1099183 1084720 1070051 1054936 1039367 1023354 1006752 989485 971865
53426 971865 954507 937849 921804 906041 890489 875357 860667 846193 832065 819120 808274
53415 808274 799633 792566 786508 781361 777095 773378 769783 766198 762931 760503 759371 759752 761708 765354
53401 765354 770828 777956 786163 794922 804215 814429 825974 839152 854147 870811 888519 906493
53389 906493 924343 942235 960738 980581 1002291 1025821 1050651 1076439 1103372 1131701 1161215
53378 1161215 1191463 1222300 1253973 1286881 1321439 1357848 1395604 1433527 1470683 1507176 1543784
53367 1543784 1581027 1618883 1657018 1694812 1731431 1766421 1800032 1832520 1863296 1891324 1916182
53356 1916182 1938183 1957571 1974151 1987713 1998285 2005913 2010594 2012404 2011343 2007175 1999829 1989804
53344A989804j2082j4061j6230j8214j9979k2300k5599k9019l1487l3026l4245
53333A733562l5156l5339l4887l4206l3245l1771l0186k9253k9103k9230k9336
53322A381850k9422k9259k8477k7188k5828k4455k2829k1130j9943j9396j8911
53311A115012j7894j6253j4196j2008j0123q984q694q973r463r834r727q957p751
53298I72155o570n728n270n029m667l895k882k124j757j373o91O2O97J461K508
53283I36897L526M347N343O672P775Q296Q909J0343J2079J3030J3256J3851J5188
53270A059512J6367J6669J6535J6715J7071J6808J5539J3750J2320J1705J1481
53259A224472J0729R080P139N696M754L777K595J473M76o45j990l413m855o320
$$ plain form
53344 1989804 1977722 1963661 1947431 1929217 1909238 1886938 1861339 1832320 1800833 1767807 1733562
53333 1733562 1698406 1663067 1628180 1593974 1560729 1528958 1498772 1469519 1440416 1411186 1381850
53322 1381850 1352428 1323169 1294692 1267504 1241676 1217221 1194392 1173262 1153319 1133923 1115012
53311 1115012 1097118 1080865 1066669 1054661 1044538 1035554 1026860 1017887 1008424 998590 988863 979906 972155
53298 972155 965585 959857 954587 949558 944891 940996 938114 935990 934233 932860 932169 932231 932928 934389 936897
53283 936897 940423 944770 950113 956785 964560 972856 981765 992108 1004187 1017217 1030473 1044324 1059512
53270 1059512 1075879 1092548 1109083 1125798 1142869 1159677 1175216 1188966 1201286 1212991 1224472
53259 1224472 1235201 1244281 1251420 1257116 1261870 1265647 1268242 1269715 1270191 1269546 1267556 1264143 1259288 1252968
53245A252968p645q784j0099j1835j3500j4343j4419j4509j5090j6008j7065j8171
53233A091500j8929j8857j8174j7648j7522j7251j6537j5780j5271j4648j3706
53222I07177j2947j2805j2793j2179j1071j0228r943r810r516r233r140q997q449
53209G70066p455o308n338m763m621m788n088n457n967o575p065p324p616q347
53195F83354r438j0163r902q983q491r096j0293j0950j0514r479q760q727q964
53182E59594q912q571q432q781r422j0181j1215j2456j3178j2746j1559j0609
53170D33532j0215r914r507r343r424r168q410p781p643p394o513n531n266n562
53156C21861n592n074m444m090l989m002l985l781l467l366l430l113k293j812
$$ plain form
53245 1252968 1245323 1236539 1226440 1214605 1201105 1186762 1172343 1157834 1142744 1126736 1109671 1091500
53233 1091500 1072571 1053714 1035540 1017892 1000370 983119 966582 950802 935531 920883 907177
53222 907177 894230 881425 868632 856453 845382 835154 825211 815401 805885 796652 787512 778515 770066
53209 770066 762611 756303 750965 746202 741581 736793 731705 726248 720281 713706 706641 699317 691701 683354
53195 683354 673916 663753 653851 644868 636377 627281 616988 606038 595524 586045 577285 568558 559594
53182 559594 550682 542111 533679 524898 515476 505295 494080 481624 468446 455700 444141 433532
53170 433532 423317 413403 403896 394553 385129 375961 367551 359770 352127 344733 338220 332689 327423 321861
53156 321861 316269 311195 306751 302661 298672 294670 290685 286904 283437 280071 276641 273528 271235 269423
53142B69423k334l225l321k529j772j519j298o30L61J383K276K785K676K208J938
53127B66422J909J642R73L90K27J11n26j670k747l274l248l041l081l527m248
53112B46312m990n487n482m938m211l710l439l262l522m611n908o021m553k727
53098A83451j805j738j959k508l411l870l274k417k430l034l081k479k147k239
53084A47059j997j338j187j801k195j687r15p02r18j086j265j673k001j842j342
53069A25110r77r34j002q73l89J87K56l96j060r14k11J00k20n43n41n66p31o55
53051A15641l61l84p41p53k96j18m56m68L07R66O30j11j73K93L10k48n65k75R0
53032A13288J02NJ22L51M43M02L85M80O54P70P21O81R36J406J567J167O43M95
$$ plain form
53142 269423 267089 263864 260543 258014 256242 254723 253425 252795 253156 254539 256815 259600 262276 264484 266422
53127 266422 268331 269973 270946 271336 271563 271674 271148 269478 266731 263457 260209 257168 254087 250560 246312
53112 246312 241322 235835 230353 225415 221204 217494 214055 210793 207271 202660 196752 190731 186178 183451
53098 183451 181646 179908 177949 175441 172030 168160 164886 162469 160039 157005 153924 151445 149298 147059
53084 147059 145062 143724 142537 140736 138541 136854 135939 135237 134319 133233 131968 130295 128294 126452 125110
53069 125110 124133 123199 122197 121324 120935 121122 121378 120982 119922 119008 118797 118897 118677 118134 117593 117027 116296 115641
53051 115641 115280 114896 114155 113402 113106 112988 112532 112064 112371 113337 113967 113856 113683 113976 114286 114038 113473 113198 113288
53032 113288 113390 113395 113517 113868 114311 114713 115098 115578 116232 117002 117723 118404 119340 120746 122313 123480 124123 124618
53014A24618O16O52O57Q86J067O11m04j044n80N37J134O40k90o38k45J49J33L33
52996A28832J480L118L953L429K295J495J188J207J734K949M330N024M824M295
52982A70153L946L737L524L496L816M050L371J587m19j562j752j764k034k132
52968A88017j732j321j506k098k460k477k499k576k503k382k457k486j992j146
52954A58382o36p01r20j050j311j663j549o53N66J319J169K59p39r78k97M17K97
52937A51912k81k71M62J074J148J152J361J408J193J166J354J108L11j37L48J066
52921A64374J074M66p0l29m03j11O87J512J685J041p8j158j511o45R26J873J551
52904A70884P46M38N44M66J96J12K10L17N58R03Q18J14l76J15J011J147M74p5
$$ plain form
53014 124618 125234 125886 126543 127429 128496 129107 128703 127659 127079 127616 128750 129390 129100 128462 128217 128366 128499 128832
52996 128832 130312 133430 137383 140812 143107 144602 145790 146997 148731 151680 156010 161034 165858 170153
52982 170153 174099 177836 181360 184856 188672 192722 196093 197680 197261 195699 193947 192183 190149 188017
52968 188017 186285 184964 183458 181360 178900 176423 173924 171348 168845 166463 164006 161520 159528 158382
52954 158382 157746 157045 156125 155075 153764 152101 150552 149899 150465 151784 152953 153212 152473 151495 151198 151615 151912
52937 151912 151631 151360 151822 152896 154044 155196 156557 157965 159158 160324 161678 162786 163097 162960 163308 164374
52921 164374 165448 165914 165844 165515 165112 165001 165688 167200 168885 169926 169848 168690 167179 166534 167460 169333 170884
52904 170884 171630 172068 172612 173078 173274 173386 173596 173913 174471 175374 176192 176306 175930 176045 177056 178203 178677 178602
52886A78602j24j93m98n13M4P11J032J120J138Q74K86j06K16J039J690J870J897
52869A89085K161K613K905K862K609K257J762J291J356K144K986L130K888L214
52855B23263M073M215K912J071k2k39k72l96l99l31l79l12J06L19n55k385l956
52838B26713m352l883l429l452l845m380m889n145m873m030k981k235j870j445
52824A75904o94q5k71j092j715j706j375j022n80j85l57j226k173k590k449j870
52808A56514r14q3k09j253k022j686r03o55p37l01N90J049O89l8o98j243j580
52791A46520j524j231j102j262j428j247n61M28J000M00j130k310k221j224j40
52776A32968P44J279R49k54j160p27M28Q35J96n72r85j434k023k188j733j251
$$ plain form
52886 178602 178478 178285 177787 177274 177318 178029 179061 180181 181319 182193 182479 182373 182589 183628 185318 187188 189085
52869 189085 191246 193859 196764 199626 202235 204492 206254 207545 208901 211045 214031 217161 220049 223263
52855 223263 227336 231551 234463 235534 235512 235273 235001 234605 234206 233875 233496 233184 233290 233609 233054 230669 226713
52838 226713 222361 218478 215049 211597 207752 203372 198483 193338 188465 184435 181454 179219 177349 175904
52824 175904 175210 175125 174854 173762 172047 170341 168966 167944 167364 167179 166822 165596 163423 160833 158384 156514
52808 156514 155600 155517 155308 154055 152033 150347 149444 148789 148052 147751 148341 149390 150079 150041 149343 148100 146520
52791 146520 144996 143765 142663 141401 139973 138726 138165 138593 139593 139993 138863 136553 134332 133108 132968
52776 132968 133712 134991 135940 135686 134526 133799 134227 135062 135258 134686 133701 132267 130244 128056 126323 125072
52760A25072j233j560k061k767l446l559l029k332j735j002j30L16l8q19j374
52745A00303j452j172p16k98j58l62o84p79l79M81J319J476Q34O6j57O2J39k12
52727I8311p94j261j333r18l35m0Q3O76J819K716K861K804L083L231K715K145
52711A15763K350K820K378J079J77J83K38l86j289j761j722j557j572j867k325
52696A12509k635k712k858l143l011k212j555j857k544k416j426o61o52r43j172
52681H2712j430j512j052m70n79j199j318p81n83j166j637j199k20N41Q61P15
52665G1683J3r54j550j695j850j979j454l00N86P31N98M32j54j007j090o9R45
52648F2886R84N73N90Q07O09K75M42Q34O72p5p40r85r78q42o11m89o21p99q17
$$ plain form
52760 125072 123839 122279 120218 117451 114005 110446 107417 105085 103350 102348 102218 102534 102496 101677 100303
52745 100303 98851 97679 96963 96665 96507 96145 95461 94682 94303 94784 96103 97579 98413 98479 98322 98384 98523 98311
52727 98311 97517 96256 94923 94005 93670 93630 93713 94389 96208 98924 101785 104589 107672 110903 113618 115763
52711 115763 118113 120933 123311 124390 124567 124750 124988 124602 123313 121552 119830 118273 116701 114834 112509
52696 112509 109874 107162 104304 101161 98150 95938 94383 92526 89982 87566 86140 85479 84827 83884 82712
52681 82712 81282 79770 78718 78248 77669 76470 75152 74371 73788 72622 70985 69786 69566 70107 70968 71683
52665 71683 71696 70742 69192 67497 65647 63668 62214 61914 62500 63231 63829 64261 64107 63100 62010 61941 62886
52648 62886 63870 64443 65033 65840 66449 66724 67166 68000 68672 68597 67857 66872 65894 65052 64441 63952 63331 62532 61715
52629F1715p33n11J15R94J449J246J030J277J478R91M9p36j264j628j516p48Q4
52612F3292L27K36M08P00N26m6l57j50K19M46M89K91q3j75L80J165J364P56j29
52593F9659o97p29k97K56M20M5l79l18J49O01R19J190J265R69N69M85O93Q43Q81
52574G6524J051J327J337Q77K21j47L7O13J127J232J013P89O65N83O17Q29R37
52557H9632O87M35P15J272J353R48P73Q87N16m11p42J94J464J970J934K039K011
52540A05677J266K60k1N06J148J566J763J378J76j062j286o29j58k97m99l72q7
52523A09329K40O64R11O57K69L84Q03P35J25k11J13N59O62O46P83R36J030J265
52505A19900J562J378M38q25j715j853j249k66M44M74P9k48m51o90p52m23k03
$$ plain form
52629 61715 60982 60471 60586 61580 63029 64275 65305 66582 68060 69051 69100 68364 67100 65472 63956 63208 63292
52612 63292 63619 63855 64263 64963 65489 65443 65086 64936 65155 65601 66090 66381 66298 66123 66503 67668 69032 69788 69659
52593 69659 68962 68233 67936 68192 68612 68657 68278 67960 68109 68710 69629 70819 72084 73053 73622 74107 74800 75643 76524
52574 76524 77575 78902 80239 81116 81337 81190 81227 81840 82967 84199 85212 86001 86666 87249 87866 88695 89632
52557 89632 90319 90754 91469 92741 94094 95042 95815 96702 97218 96807 96065 96259 97723 99693 101627 103666 105677
52540 105677 106943 107203 107182 107688 108836 110402 112165 113543 113719 112657 111371 110742 110584 110287 109788 109416 109329
52523 109329 109569 110233 111144 111801 112070 112454 113257 113992 114117 113906 114019 114578 115240 115886 116669 117605 118635 119900
52505 119900 121462 122840 123278 122453 120738 118885 117636 117370 117814 118288 118367 118119 117668 116978 116226 115803 115600
52488A15600p20j527j474l68P22J001Q49Q30P18J39n40o24k2P09J048Q92M96K18
52470A17947K04K38K04M17J116J800J779J269J104J409J490J099Q77J109J162
52455A33224O51K32N02Q89N17l97q82o04n2L49N39M08j66q16r60n42m7K90O82
52436A33817J198J487J302Q89O68P64J015J185J053O14K81N90J483K166J944J056
52420A51512L12O8j0j64p3N04J021O82n10j699k214k174j989j798j583j395j222
52403A39268j021j047j664k600k962k364j468r34n14J61O00J90n48n64Q9L99L2
52386A25053l25l30n06j000j039j95P65R97P21N21L02k15o12l42J91J62k64j08
52368A23776R03J848J965J660J774K331K561J902O54l35l92M72J596K220K115
$$ plain form
52488 115600 114880 113353 111879 111511 112233 113234 114083 114913 115631 115770 115230 114606 114584 115293 116341 117233 117729 117947
52470 117947 118151 118389 118593 119010 120126 121926 123705 124974 126078 127487 128977 130076 130953 132062 133224
52455 133224 133875 134107 134609 135498 136015 135618 134736 134132 134080 134429 134968 135376 135210 134394 133434 132892 132845 133135 133817
52436 133817 135015 136502 137804 138693 139361 140125 141140 142325 143378 143992 144273 144863 146346 148512 150456 151512
52420 151512 151824 151892 151882 151718 151645 152149 153170 153852 153342 151643 149429 147255 145266 143468 141885 140490 139268
52403 139268 138247 137200 135536 132936 129974 127610 126142 125208 124694 124855 125455 125645 125097 124533 124622 125021 125053
52386 125053 124728 124398 123892 122892 121853 121658 122423 123420 124141 124662 124964 124749 124137 123795 123986 124148 123884 123776
52368 123776 124679 126527 128492 130152 131926 134257 136818 138720 139374 139039 138647 139119 140715 142935 145050
52353A45050J708J638K152K885L229K917K281J871J816J766J487J296J609K261
52339A73966K577K205J600J507K159L081L657L602K956J989J231J199J787K105
52325B05621J434K46k11O13J987K889L031K653J955J236J100J862K990L720M017
52310B35143M328M645M558M143M003M301M504M314M183M622N478O285O846P204
52296C04557P358P428P724Q371R072R543R880J0242J0442J0272J0038J0341J1333
52283D26601J2505J3282J3612J3895J4443J5104J5478J5468J5418J5632J5896
52272E87334J5704J4853J3634J2518J1930J2104J2788J3194J2722J1673J0845
52261G29299J0390R696Q465P265O681O368N470L695J608j6q25j075j376k146l153
$$ plain form
52353 145050 146758 148396 150548 153433 156662 159579 161860 163731 165547 167313 168800 170096 171705 173966
52339 173966 176543 178748 180348 181855 184014 187095 190752 194354 197310 199299 200530 201729 203516 205621
52325 205621 207055 207301 207090 207703 209690 212579 215610 218263 220218 221454 222554 224416 227406 231126 235143
52310 235143 239471 244116 248674 252817 256820 261121 265625 269939 274122 278744 284222 290507 297353 304557
52296 304557 311915 319343 327067 335438 344510 354053 363933 374175 384617 394889 404927 415268 426601
52283 426601 439106 452388 466000 479895 494338 509442 524920 540388 555806 571438 587334
52272 587334 603038 617891 631525 644043 655973 668077 680865 694059 706781 718454 729299
52261 729299 739689 749385 757850 765115 771796 778164 783634 787329 788937 788921 788096 787021 785645 783499 780346
52246G80346l704l460k786k214j783j222m82K41R20J724K665L476L988M477N400
52231G87586O781Q050Q683Q899R402J0351J1075J1056J0842J1277J2173J2382
52219I08557J1282R463P830O630N664M868M283L745L062K266J486P30M0n17j181
52204I68208k487m552o670p977q332q224q089q072q287q833r511r889r768r401
52190H58116r192r238r243q832p981p094o582o437o359o146n771n177m402l814
52176G61848l778m070m149l973m056m503m685m244l744l772l854l099j688q53
52162G11380j307k366k891k633k230k186k344k291j958j608j418j281j075r10
52148F84882r31j022r13o08m16n49q94j265j664k211k923l602l847l335k354j856
$$ plain form
52246 780346 776642 773182 770396 768182 766399 765177 764695 764936 765856 767580 770245 773721 777709 782186 787586
52231 787586 794367 802417 811100 819999 829401 839752 850827 861883 872725 884002 896175 908557
52219 908557 919839 929302 937132 943762 949426 954294 958577 962322 965384 967650 969136 969866 969906 969389 968208
52204 968208 965721 961169 954499 946522 938190 929966 921877 913805 905518 896685 887174 877285 867517 858116
52190 858116 848924 839686 830443 821611 813630 806536 799954 793517 787158 781012 775241 770064 765662 761848
52176 761848 758070 754000 749851 745878 741822 737319 732634 728390 724646 720874 717020 713921 712233 711380
52162 711380 710073 707707 704816 702183 699953 697767 695423 693132 691174 689566 688148 686867 685792 684882
52148 684882 683951 682929 682016 681408 680992 680443 679549 678284 676620 674409 671486 667884 664037 660702 658348 656492
52132F56492k558l999m919m660l735l041k974l413m058m468m259l584l037k908
52118F04879k941k991l277l680l488k437j356j063j126n63N81J399J681K187L212
52103E91017L929L703L166L354M286N126N516O015P173Q786J0236J1203J1811
52090F75321J2278J2729J3320J4277J5571J6734J7210J6974J6638J6762J7219
52079H45033J7368J6794J5691J4589J3900J3748J3968J4142J3755J2613J1105
52068A002706R903R264Q683P412N307K976J074l27j518k629l591m466n419o397
52054A022978p223p907q527q809q295p153o346o668p807q667q513p620o805o497
52040I16141o293n490m110l048k921l054k264n19R85J540J881K934M350N063M870
$$ plain form
52132 656492 653934 649935 645016 640356 636621 633580 630606 627193 623135 618667 614408 610824 607787 604879
52118 604879 601938 598947 595670 591990 588502 586065 584709 583646 582520 581957 582538 583937 585618 587805 591017
52103 591017 594946 598649 601815 605169 609455 614581 620097 626112 633285 642071 652307 663510 675321
52090 675321 687599 700328 713648 727925 743496 760230 777440 794414 811052 827814 845033
52079 845033 862401 879195 894886 909475 923375 937123 951091 965233 978988 991601 1002706
52068 1002706 1012609 1021873 1030556 1037968 1043275 1046251 1047325 1046998 1045480 1042851 1039260 1034794 1029375 1022978
52054 1022978 1015755 1007848 999321 990512 982217 975064 968718 962050 954243 945576 937063 929443 922638 916141
52040 916141 909848 904358 900248 897200 894279 891225 888961 888442 889427 890967 892848 895782 900132 905195 910065
52025I10065M595M808N212N368N334N305N123M559L822L442L641M066M094L378
52011I72812K031M09j212k643l696m288m700n517p105r224j1189j2436j2963j3340
51997H86939j4181j5467j6480j6649j6254j6029j6196j6364j6342j6457j6963
51986G09557j7674j8339j8961j9487j9595j9069j8097j7029j6108j5545j5453
51975E14200j5579j5536j5312j5100j4605j3309j1511j0242r818r417q572q052
51963C67147q453q917q359p201o635o653o157m885l793l445l312k958k819l277
51949B90283l850l879l341k580j789j197j159j647k092k103j923j911j983j935
51935B58894j828j746j583j405j565k089k325j754p81k89n10q90q85m72P2M46
$$ plain form
52025 910065 914660 919468 924680 930048 935382 940687 945810 950369 954191 957633 961274 965340 969434 972812
52011 972812 974843 975252 974040 971397 967701 963413 958713 953196 946091 936867 925678 913242 900279 886939
51997 886939 872758 857291 840811 824162 807908 791879 775683 759319 742977 726520 709557
51986 709557 691883 673544 654583 635096 615501 596432 578335 561306 545198 529653 514200
51975 514200 498621 483085 467773 452673 438068 424759 413248 403006 393188 383771 375199 367147
51963 367147 358694 349777 341418 334217 327582 320929 314772 309887 306094 302649 299337 296379 293560 290283
51949 290283 286433 282554 279213 276633 274844 273647 272488 270841 268749 266646 264723 262812 260829 258894
51935 258894 257066 255320 253737 252332 250767 248678 246353 244599 243818 243529 243019 242129 241244 240772 240844 241290
51919B41290L20m79j627k387k257j455o69m13o53j052j326j348j129q76r73j613
51903B23353k419k793k686k597k684k382j358k88q1n93q91o50m53o73q99p42m90
51886B00674n01n66l07J81N64P81Q50N59r3m97m0R58J518J235P03O16R37J174
51868B08746J124R86R59J054J228J397J346Q73J73j94P0O34R77J067J216J438
51852B23094J338P88K11m0j19k36j63L36R39J118R32R13J305J897K491L007L189
51835B41000K821K226J939J857J360M42o8K88Q06N96k02p76q04o46o17p08q91
51818B48623j199j474j522j480j570j567j054k36J19k61o10r9J073J934J936J393
51802B44006Q82O58O96R30J196J234R48N59K91L1m28r67j195r34l71K31P13Q83
$$ plain form
51919 241290 241610 241131 239504 237117 234860 233405 232736 232323 231670 230618 229292 227944 226815 225939 224966 223353
51903 223353 220934 218141 215455 212858 210174 207792 206434 206146 206065 205472 204581 203931 203478 202805 201906 201164 200674
51886 200674 200173 199607 199300 199481 200045 200826 201676 202235 202142 201645 201605 202563 204081 205316 206019 206635 207572 208746
51868 208746 209870 210856 211815 212869 214097 215494 216840 217713 217886 217692 217762 218396 219373 220440 221656 223094
51852 223094 224432 225220 225431 225391 225272 225036 224873 225209 226148 227266 228198 229111 230416 232313 234804 237811 241000
51835 241000 243821 246047 247986 249843 251203 251645 251577 251865 252671 253267 253065 252289 251485 250839 250222 249514 248623
51818 248623 247424 245950 244428 242948 241378 239811 238757 238521 238640 238379 237769 237670 238743 240677 242613 244006
51802 244006 244888 245546 246242 247172 248368 249602 250550 251109 251400 251431 251003 250036 248841 247907 247536 247767 248480 249363
51784B49363N45j94q73j085q19l40J0j31r42k051k633k223j224l38K37P16J062
51767B39080R22J94p39j400j586j313p32r6L58N31M02n9o52q67m06L38O81M67
51749B35123J48N9L5j69m48m73j3R00J909K433K105J157J70m94q08p98m99j83
51731B40154k20o17j050j297j348j149o48j39p5m70q82j045j050q82l01O33J391
51714B31005J591J365R30K44o41j338j577j577j637j688j532j296j281j608k195
51699B18765k883l326l148k385j580j165j067j089j231j354r88K6J082J480J319
51684B02456J244J552K098K781L506L788L052J429l28j709k738l377l300k507
51670B07947j593j058p61l31K14O83J182J979K971L785M290M746N357O011O482
$$ plain form
51784 249363 249908 249714 248841 247756 246937 246597 246607 246476 245534 243483 240850 238627 237403 237065 237302 238018 239080
51767 239080 240002 240196 239457 238057 236471 235158 234426 234330 234688 235219 235621 235562 234910 234043 233637 233975 234656 235123
51749 235123 235271 235330 235365 235196 234748 234275 234262 235162 237071 239504 241609 242766 242936 242442 241634 240836 240337 240154
51731 240154 239934 239317 238267 236970 235622 234473 233825 233686 233611 233141 232259 231214 230164 229282 228981 229614 231005
51714 231005 232596 233961 234891 235135 234494 233156 231579 230002 228365 226677 225145 223849 222568 220960 218765
51699 218765 215882 212556 209408 207023 205443 204278 203211 202122 200891 199537 198549 198575 199657 201137 202456
51684 202456 203700 205252 207350 210131 213637 217425 220477 221906 221578 219869 217131 213754 210454 207947
51670 207947 206354 205296 204535 204204 204418 205101 206283 208262 211233 215018 219308 224054 229411 235422 241904
51655B41904O641O387N663M685L945L744L807L526K576J163k43j294j957k480
51641B78067l163m035m770n094n167n384n782n987n761n285m788m292l891l820
51627B10848l968l695k691j643j512k221k787k690k420k479k533j981r88l09l30
51612A78601o59p19m13j08j35m07n93n19l57k83k01N0L58M47L04J67J76L13O19
51593A76641J137J632J708J281O67J93J8K90J043J944K510K644K585K423K167
51578A98883K234L142M544N320M987M389M534N327N978O241O495O934P291P283
51564B73582O860O110N296M717M230L198J339o70k017k825l688m427m220l024
51550B84461j899j628j737j330l40O09J164J539K012K659L469M422N403O251O827
$$ plain form
51655 241904 248545 254932 260595 265280 269225 272969 276776 280302 282878 284041 283798 282504 280547 278067
51641 278067 274904 270869 266099 261005 255838 250454 244672 238685 232924 227639 222851 218559 214668 210848
51627 210848 206880 203185 200494 198851 197339 195118 192331 189641 187221 184742 182209 180228 179240 178931 178601
51612 178601 177942 177223 176810 176702 176567 176160 175567 175048 174691 174408 174207 174257 174615 175062 175366 175533 175709 176022 176641
51593 176641 177778 179410 181118 182399 183066 183259 183277 183567 184610 186554 189064 191708 194293 196716 198883
51578 198883 201117 204259 208803 214123 219110 223499 228033 233360 239338 245579 252074 259008 266299 273582
51564 273582 280442 286552 291848 296565 300795 303993 305332 304662 302645 299820 296132 291705 287485 284461
51550 284461 282562 280934 279197 277867 277527 278136 279300 280839 282851 285510 288979 293401 298804 305055 311882
51535C11882O924O300N120M154M141M904N441M955L584K076J015M76J59l47j252
51520C59532k212k496j733m46M17M84K08K21O51J106R89j06j917l383l520k596
51504C45199j989k647m101n329o063o639p055o931o277n558n016m495l997l788
51490B75314l856l751l241k634k360k504k864l138k915j978o69L40P42P42N78
51475B47806L17J16J94L96K64k77p85q80n46J92J317K421K833K391J622R80M37
51458B58798mnO05J548K617L882N181N968O058N920N907N770N315M913M881M919
51442C22273M655M193L703K980J964J125P92O22K38j38l23p16j510j991j429k93
51426C36145L58K55j22o03j389k359l215m108n289o390o891p066p528q061p938
$$ plain form
51535 311882 318806 325106 330226 334380 338521 343425 348866 353821 357405 359481 360496 360972 361131 360784 359532
51520 359532 357320 354824 353091 352645 353062 353546 353754 353975 354626 355732 356721 356615 354698 351315 347795 345199
51504 345199 343210 340563 336462 331133 325070 318431 311376 304445 298168 292610 287594 283099 279102 275314
51490 275314 271458 267707 264466 261832 259472 256968 254104 250966 248051 246073 245404 245744 246486 247228 247806
51475 247806 248123 248239 248433 248829 249093 248816 248031 247151 246605 246797 248114 250535 253368 255759 257381 258361 258798
51458 258798 258794 258789 259394 260942 263559 267441 272622 278590 284648 290568 296475 302245 307560 312473 317354 322273
51442 322273 326928 331121 334824 337804 339768 340893 341685 342307 342545 342407 342084 341368 339858 337867 336438 336145
51426 336145 336503 336758 336636 336033 334644 332285 329070 324962 319673 313283 306392 299326 291798 283737 275799
51411B75799p234o732o566o031m970m167m024l842k892j510n30k00j36O1N17J126
51395B28669J631J857J883J850J789J950K876M532N748N417M032L023K738K164
51381B70159O98r97k252l337m617n720o193o291o492o839p210p621p878p541o725
51366A91144o201o281o297n659m690l890l177k451k121k288k185j346o03r56j930
51351A41069k234j668j168j137r68l32J50j14q41j385j480j193o92k66j74k49
51335A27318j61j4j98n69m30L81J058Q74J44k89j32L42R60J720K293K177J480
51318A36954J070J621K768L562L576L315L444L962M314M174L843L874M452N228
51304A86157N751N908N957O046N804M676K677O06p76j512k109k715l104l355l860
$$ plain form
51411 275799 268565 261833 255267 249236 244266 240099 236075 232233 229341 227831 227301 227101 226965 227026 227543 228669
51395 228669 230300 232157 234040 235890 237679 239629 242505 247037 252785 258202 262234 265257 267995 270159
51381 270159 270857 269860 267608 264271 259654 253934 247741 241450 234958 228119 220909 213288 205410 197869 191144
51366 191144 184943 178662 172365 166706 162016 158126 154949 152498 150377 148089 145904 144558 143955 142999 141069
51351 141069 138835 137167 135999 134862 133894 133562 133712 133598 132757 131372 129892 128699 128007 127741 127567 127318
51335 127318 127157 127143 126945 126376 125946 126327 127385 128259 128403 128114 127982 128324 129284 131004 133297 135474 136954
51318 136954 138024 139645 142413 145975 149551 152866 156310 160272 164586 168760 172603 176477 180929 186157
51304 186157 191908 197816 203773 209819 215623 220299 222976 223582 222806 221294 219185 216470 213366 210011 206151
51289B06151m556m840m560m441n087n957n981m966l786l253l333l538l576l409
51275A44868l037k494j939j572j435j389j279j097j032j255j655j924j928j824
51261A21008j735j476q74j70J57l3l53l69q1J78K51L54P64J360J712J646J579
51244A23918J969K596K638J633J06r00p50K92J402J822J415O55Q1k35n12p47p34
51227A34649n56n78q05p48k28J18m05j553k365k210j236K0J058J470J120L68j59
51210A27960k01oJ26J63J38o6m92q82r22n97k08PO9J06J36O4j80n77j020j356
51190A22262j381r94m09r5l45r33j367j387j143r60j046j385j687j578j030n15
51174A06007m58o76o31k20J67L52O21J100J348J001L98K49P33J364J609J367Q60
$$ plain form
51289 206151 201595 196755 192195 187754 182667 176710 170729 165763 161977 158724 155391 151853 148277 144868
51275 144868 141831 139337 137398 135826 134391 133002 131723 130626 129594 128339 126684 124760 122832 121008
51261 121008 119273 117797 116923 116753 116910 116877 116524 116155 116074 116252 116503 116857 117621 118981 120693 122339 123918
51244 123918 125887 128483 131121 132754 132860 131960 131210 131502 132904 134726 136141 136796 136877 136642 136130 135383 134649
51227 134649 134093 133515 132710 131962 131734 131852 131447 129894 127529 125319 124083 124103 125161 126631 127751 128119 127960
51210 127960 127759 127753 127879 128042 128180 128114 127622 126740 125818 125221 125013 125020 125089 125195 125331 125395 125215 124638 123618 122262
51190 122262 120881 119887 119478 119383 119038 118105 116738 115351 114208 113248 112202 110817 109130 107552 106522 106007
51174 106007 105549 104873 104242 104022 104189 104541 105162 106262 107610 108611 109009 109258 109991 111355 112964 114331 115191
51157A15191K86k42n68m53J28O86N45l10j005q82m72p58j649j995j302m54l50
51140A06396o66n58N8O29Q27O07j16j051j254j76J271J683J045O83J314K183K355
51123A15230J890J351R79Q74J320K307L194L374K894K052R16k67p41j24P21N31
51107A36501o95j679j552q57n26o49p02n30m70o37o95m19m6J23J48K36L09J18
51089A27978k83m68k17J80K62l3m25p11r26j033q28k05N58J063J117Q12L41j36
51071A27046m67n95o20p22r41j092r64n79k13k07o23j148j310q66n1O26Q15N89
51053A18678L17L35P47J385J883J854J260N90M95J131J971K450K603K858L314
51038A41871L559L283K789K627K848K913K318J195K17oN71J446K012K008J623
$$ plain form
51157 115191 115477 115235 114667 114214 114342 115028 115573 115263 114258 113376 112904 112146 110497 108502 107200 106746 106396
51140 106396 105730 105172 105230 105859 106686 107293 107177 106126 104872 104696 105967 107650 108695 109378 110692 112875 115230
51123 115230 117120 118471 119450 120324 121644 123951 127145 130519 133413 135465 136381 136114 135373 135249 135970 136501
51107 136501 135806 134127 132575 131718 131192 130543 129841 129311 128841 128204 127509 127090 127044 127167 127315 127551 127860 127978
51089 127978 127695 127227 127010 127190 127452 127419 126994 126283 125357 124324 123496 123291 123849 124912 126029 126841 127182 127046
51071 127046 126579 125984 125364 124642 123701 122609 121645 121066 120853 120646 120023 118875 117565 116699 116648 117274 118089 118678
51053 118678 118995 119330 120077 121462 123345 125199 126459 127049 127544 128675 130646 133096 135699 138557 141871
51038 141871 145430 148713 151502 154129 156977 159890 162208 163403 163620 163614 164185 165631 167643 169651 171274
51023A71274J134N77j80r98j392j040k97R7q9k79Q5P97J232J283J393J794K218
51006A77609K481K767L127L252L095L164L746M325M421M502N304O516P073O760
50992B38142O571P273Q433R321R974J0932J2355J4051J5934J7898J9530K0534
50980C90948K1363K2945K5707K9268L2987L6544L9929M3213M6419M9445N2064
50969G90832N4099N5609N6716N7258N6758N4812N1412M6878M1542L5627K9487
50958A331030K3610J8210J2832O874N24n183r470j2509j4685j5760j5377j4075
50946A306021j2878j2075j1130r849q891q962j0186j2411j5441j8758k1709k4257
50934A139474k6954l0002l2971l5651l8271m0637m2016m2332m2465m2733m2057
$$ plain form
51023 171274 172408 172985 172805 171807 170415 169375 169078 169175 169086 168807 168892 169689 170921 172204 173597 175391 177609
51006 177609 180090 182857 185984 189236 192331 195495 199241 203566 207987 212489 217793 224309 231382 238142
50992 238142 244713 251986 260419 269740 279714 290646 303001 317052 332986 350884 370414 390948
50980 390948 412311 435256 460963 490231 523218 559762 599691 642904 689323 738768 790832
50969 790832 844931 900540 957256 1014514 1071272 1126084 1177496 1224374 1265916 1301543 1331030
50958 1331030 1354640 1372850 1385682 1392556 1393080 1387897 1378427 1365918 1351233 1335473 1320096 1306021
50946 1306021 1293143 1281068 1269938 1260089 1251198 1242236 1232050 1219639 1204198 1185440 1163731 1139474
50934 1139474 1112520 1082518 1049547 1013896 975625 934988 892972 850640 808175 765442 723385
50923G23385l9585l6234l3480l1288k8534k5041k1843j9520j7563j5533j3651
50912D41113j2057j0491q995q044p582o854n576m515m324m438l786k116j35J355
50898C63555K012J874J284P83P67J201J815K427K964L346L532L631L893M594N829
50883D03507P257Q184Q237P910Q115R242J0890J2456J3621J4266J4483J4764J5741
50870E48673J7546J9753K2118K4976K8689L3104L7821M2713M7905N3453N9433
50859I36184O6168P4039Q2975R2313J01188J09034J15718J21374J26098J29783
50849A954874J32024J32097J29073J22286J11752R8078Q1924O3888M4909K6274
50839B897179Q902p079k1526l3463m1638m5832m6978m5982m2967l7756l0686k2753
$$ plain form
50923 723385 683800 647566 614086 582798 554264 529223 507380 487860 470297 454764 441113
50912 441113 429056 418565 409570 401526 393944 387090 381514 376999 372675 368237 364451 362335 362200 363555
50898 363555 365567 367441 368725 369508 370275 371476 373291 375718 378682 382028 385560 389191 393084 397678 403507
50883 403507 410764 418948 427185 435095 443210 452452 463342 475798 489419 503685 518168 532932 548673
50870 548673 566219 585972 608090 633066 661755 694859 732680 775393 823298 876751 936184
50859 936184 1002352 1076391 1159366 1251679 1352867 1461901 1577619 1698993 1825091 1954874
50849 1954874 2086898 2218995 2348068 2470354 2582106 2680184 2762108 2825996 2870905 2897179
50839 2897179 2906081 2899002 2877476 2844013 2802375 2756543 2709565 2663583 2620616 2582860 2552174 2529421
50827B529421j5340r876p372q034j1463j7224k4982l4124m3766n3299o2705p2159
50815B169077q1446q9835r6359j00257j01389j00332r7907r4539r0138q4473p7614
50804A154788p0130o2986n6887n1528m5909l9668l3635k8596k4177j9719j5697
50793G05856j3075j1490r421o358l551k107j482o22L12L35p44k087k959l307l330
50778F45970l222l360m126n377o495p068p280p486p668p379o316m866l939m039
50764E67349m527m205k684p87N54J360K276L599N115O684Q575J1107J4181J7278
50750F25875J9815K1700K3542K6149K9718L3667L7420M1090M5270N0324N6056
50739A010626O1925O7465P2544P7247Q1466Q4665Q6270Q6110Q4135P9936P2980
$$ plain form
50827 2529421 2514081 2504205 2496833 2488799 2477336 2460112 2435130 2401006 2357240 2303941 2241236 2169077
50815 2169077 2087631 1997796 1901437 1801180 1699791 1599459 1501552 1407013 1316875 1232402 1154788
50804 1154788 1084658 1021672 964785 913257 867348 827680 794045 765449 741272 721553 705856
50793 705856 692781 681291 671870 665512 661961 659854 658372 657750 658062 658397 657653 655566 652607 649300 645970
50778 645970 642748 639388 635262 629885 623390 616322 609042 601556 593888 586509 580193 575327 571388 567349
50764 567349 562822 558617 555933 555146 555700 557060 559336 562935 568050 574734 583309 594416 608597 625875
50750 625875 645690 667390 690932 717081 746799 780466 817886 858976 904246 954570 1010626
50739 1010626 1072551 1140016 1212560 1289807 1371273 1455938 1542208 1628318 1712453 1792389 1865369
50728A865369O3429N2079L9383K5152R569o021j9852l0958l9322m5057m8005m8071
50716A817695m5577m1218l5848l0237k4821j9673j4795j0500p483o594q307j2312
50704A560330j7687k3780l0669l8402m6118n2480n6889n9619o0803o0147n7789
50693A055947n4635n1406m7922m3794l9257l4864l0782k6896k3221j9779j6400
50682F66991j3032r931p221m654k061L65K654N293Q453J1389J3226J3968J4221
50669F99661J4293J4081J3557J2781J1695J0400R367Q879Q579Q090P649P550P441
50656H34023O885O249O237O834P621Q821J1021J3855J6130J7389J8529K0517K3308
50643I97419K6321K9264L1950L3919L4769L4583L3750L2536L0956K8743K5454
$$ plain form
50728 1865369 1928798 1980877 2020260 2045412 2054981 2048960 2029108 1998150 1958828 1913771 1865766 1817695
50716 1817695 1772118 1730900 1695052 1664815 1639994 1620321 1605526 1595026 1587543 1580949 1572642 1560330
50704 1560330 1542643 1518863 1488194 1449792 1403674 1351194 1294305 1234686 1173883 1113736 1055947
50693 1055947 1001312 949906 901984 858190 818933 784069 753287 726391 703170 683391 666991
50682 666991 653959 644028 636807 632153 630092 630457 633111 638404 646857 658246 671472 685440 699661
50669 699661 713954 728035 741592 754373 766068 776468 785835 794714 803293 811383 819032 826582 834023
50656 834023 840908 847157 853394 860228 867849 876670 887691 901546 917676 935065 953594 974111 997419
50643 997419 1023740 1053004 1084954 1118873 1153642 1188225 1221975 1254511 1285467 1314210 1339664
50632A339664K1057J6369J2355R053N874K905R38Mr69k483l400k496k41J947L611
50617A404188N186O429O357M933L415K567J580m78l086m997n973o725p602q434
50603A397360r637j2279j6695k1897k6808l1326l5679l9462m2090m3694m4713
50592A073080m4992m4121m2502m1019l9720l7757l4839l1753k9083k6326k2926
50581F78042j9401j6680j4835j3200j1391r372o917l855q01J176J808J976K673
50568E89223M109N913P776R643J1606J3716J5816J7604J8993K0290K1664K2704
50556G59057K2992K2961K3602K5173K6770K7345K6751K5543K4212K2974K2008
50545A029388K1430K1101K0827K0755K1326K2698K4517K6360K8298L0694L3491
$$ plain form
50632 1339664 1360721 1377090 1389445 1398498 1404372 1407277 1408215 1408219 1407250 1404767 1401367 1398871 1398630 1400577 1404188
50617 1404188 1409374 1415803 1422160 1427093 1430508 1433075 1434655 1434177 1431091 1426094 1420121 1413396 1405794 1397360
50603 1397360 1387723 1375444 1358749 1336852 1310044 1278718 1243039 1203577 1161487 1117793 1073080
50592 1073080 1028088 983967 941465 900446 860726 822969 788130 756377 727294 700968 678042
50581 678042 658641 641961 627126 613926 602535 593163 586246 582391 581590 582766 584574 586550 589223
50568 589223 593332 599245 607021 616664 628270 641986 657802 675406 694399 714689 736353 759057
50556 759057 782049 805010 828612 853785 880555 907900 934651 960194 984406 1007380 1029388
50545 1029388 1050818 1071919 1092746 1113501 1134827 1157525 1182042 1208402 1236700 1267394 1300885
50534A300885L6139L8496M1346M5537N0747N5752N9845O3334O6507O8888O9877
50523A897353O9513O8043O5220O0575N4044M5818L5987K4854J3192J563j0282
50512B325880k2606l4582m4823n2823n9146o4178o7506o8585o7352o4022n8856
50501A721401n2261m4658l6220k7200j8418j0740m228J661P008J1425J5064J8629
50489A581463K2162K4567K4672K2011J6398P720l299j4998k6127l6683m6851n5801
50477A515234o2302o5947o7121o6224o3777o0838n8297n5855n2512m7978m2921
50466H71462l7953l3168k8691k4882k1721j8632j5229j1817q905o607m694k880
50454F56283r30J235L399N303P075R057J1143J2833J3992J5080J6364J7530J8420
$$ plain form
50534 1300885 1337024 1375520 1416866 1462403 1513150 1568902 1628747 1692081 1758588 1827476 1897353
50523 1897353 1966866 2034909 2100129 2160704 2214748 2260566 2296553 2321407 2334599 2336162 2325880
50512 2325880 2303274 2268692 2223869 2171046 2111900 2047722 1980216 1911631 1844279 1780257 1721401
50501 1721401 1669140 1624482 1588262 1561062 1542644 1531904 1527676 1529337 1536345 1547770 1562834 1581463
50489 1581463 1603625 1628192 1652864 1674875 1691273 1698993 1695694 1680696 1654569 1617886 1571035 1515234
50477 1515234 1452932 1386985 1319864 1253640 1189863 1129025 1070728 1014873 962361 914383 871462
50466 871462 833509 800341 771650 746768 725047 706415 691186 679369 670464 663857 659163 656283
50454 656283 655353 656588 659987 665290 672365 681422 692565 705398 719390 734470 750834 768364 786784
50441G86784J9509K1063K2355K2508K1908K1753K2325K2642K2018K0935J9863
50430A023663J8291J5812J3457J2659J3150J3147J1727R948R262R878J1272J3361
50418A175627J6215J9167K1267K2489K3668K5215K6564K7067K6839K6526K6570
50407A437214K6799K6445K4575K0792J5562R685L555k811r317j5831k2500k9537
50395A484631l6677m3281m8913n3389n6394n7645n7360n6003n3533m9560m4307
50384I27569l8657l3122k7465k1621j6193j1559p178k402K511O836J0466J3836
50372H03021J6913J8969J9359J7985J5004J0600N285o4m759q839j2809j6835k0344
50359H43486k2542k3301k3341k3329k3097k2074k0323j8594j7303j6066j4517
$$ plain form
50441 786784 806293 827356 849711 872219 894127 915880 938205 960847 982865 1003800 1023663
50430 1023663 1041954 1057766 1071223 1083882 1097032 1110179 1121906 1131854 1141116 1150994 1162266 1175627
50418 1175627 1191842 1211009 1232276 1254765 1278433 1303648 1330212 1357279 1384118 1410644 1437214
50407 1437214 1464013 1490458 1515033 1535825 1551387 1561072 1564627 1561816 1552499 1536668 1514168 1484631
50395 1484631 1447954 1404673 1355760 1302371 1245977 1188332 1130972 1074969 1021436 971876 927569
50384 927569 888912 855790 828325 806704 790511 778952 771774 769372 771883 778719 789185 803021
50372 803021 819934 838903 858262 876247 891251 901851 907136 907072 902313 893474 880665 863830 843486
50359 843486 820944 797643 774302 750973 727876 705802 685479 666885 649582 633516 618999
50348F18999j2984j1945j1210j0260r075q114p509o848n788m486l223k007o60
50335E24890Q20K195L210L854M437N327O580P822Q666R150R628J0345J1230J2143
50321F20297J3053J3922J4531J4724J4693J4828J5147J5058J4058J2473J1136
50310G73920J0287R337P927O619O106O147N905N092M035K900J523J6j258k303
50296H36253l379m211m205l634l748n223p269q775r686j0612j1741j2785j3609
50283G37376j4200j4400j4290j4504j5380j6133j5624j3893j2156j1329j1209
50272E84258j1158j0894j0410r662q672p656o838o304n994n700n174m498m092
50259D87206m052l729k519q47K92O64R14J335J401Q80O26J577L451N077N851O150
$$ plain form
50348 618999 606015 594070 582860 572600 563525 555411 547902 541054 535266 530780 527557 525550 524890
50335 524890 525710 527905 531115 534969 539406 544733 551313 559135 567801 576951 586579 596924 608154 620297
50321 620297 633350 647272 661803 676527 691220 706048 721195 736253 750311 762784 773920
50310 773920 784207 793544 801471 808090 814196 820343 826248 831340 835375 838275 839798 839814 838556 836253
50296 836253 832874 828663 824458 820824 817076 811853 804584 795809 786123 775511 763770 750985 737376
50283 737376 723176 708776 694486 679982 664602 648469 632845 618952 606796 595467 584258
50272 584258 573100 562206 551796 542134 533462 525806 518968 512664 506670 500970 495796 491298 487206
50259 487206 483154 479425 476906 476059 476351 477015 477929 479264 480665 481545 482171 483748 487199 492276 498127 504277
50243E04277O391O324N533M287L369L184L352L298K958K625K276J487J43j220
50229E48284k119k838l932n218n787n186m095l584l997m727m945m329l192k150
50215D92185j603j417j162o15Q1P51J454K279L076L574L729L777L993M423M823
50200E19348M863M482M076M154M703N016M398K994J666J023P52J08j192k774m229
50185E49388n596p027q255q756q357p460o554n729m818l846l101k715k384j666
50171D73124o16L9m20j874l430m377m834n318n975o516o739o667o323n700m986
50156D09388m385l818l081k351k100k399k797k904k777k581k323k102k177k543
50142C71050k730k424j936j732j769j587r45r1N37P33P28J032J896K934L569L757
$$ plain form
50243 504277 510668 516992 522525 526812 530181 533365 536717 540015 542973 545598 547874 549361 549504 548284
50229 548284 546165 543327 539395 534177 528390 523204 519109 515525 511528 506801 501856 497527 494335 492185
50215 492185 490582 489165 488003 487388 487469 488220 489674 491953 495029 498603 502332 506109 510102 514525 519348
50200 519348 524211 528693 532769 536923 541626 546642 551040 554034 555700 556723 557475 557583 556391 553617 549388
50185 549388 543792 536765 528510 519754 511397 503937 497383 491654 486836 482990 479889 477174 474790 473124
50171 473124 472508 472547 472127 470253 466823 462446 457612 452294 446319 439803 433064 426397 420074 414374 409388
50156 409388 405003 401185 398104 395753 393653 391254 388457 385553 382776 380195 377872 375770 373593 371050
50142 371050 368320 365896 363960 362228 360459 358872 357927 357836 358373 359106 359834 360866 362762 365696 369265 373022
50126C73022L899M050L865L398L241L640M111M368M814N630O078N562M685M365
50112D34728M355L727K543J870K088K320J774P50j8k58pP01J524J750J051k1o98
50095D58179p68m10K65J096J698J886K041K579L369M052M738N874P400Q615Q994
50080E09608Q843Q926R626J0641J1424J1741J1814J1973J2280J2516J2417J1818
50068F43627J0705R226P783O851O628O836O898O365N269M119L469L393L470L290
50054G27929K831K253J599R45O60J049J834K342K293K126K350K875L091K598J671
50039G58446J008R69J166R48K75k22k13k46r67k086k715k596k329k314k182j465
50023G45477k90R70K286L802N461P289R782J3423J7772K1614K4155K5758K7280
$$ plain form
50126 373022 376921 380971 384836 388234 391475 395115 399226 403594 408408 414038 420116 425678 430363 434728
50112 434728 439083 442810 445353 447223 449311 451631 453405 454155 454137 453879 453872 454573 456097 457847 458898 458877 458179
50095 458179 457411 457001 457266 458362 460060 461946 463987 466566 469935 473987 478725 484599 491999 500614 509608
50080 509608 518451 527377 537003 547644 559068 570809 582623 594596 606876 619392 631809 643627
50068 643627 654332 663558 671341 678192 684820 691656 698554 704919 710188 714307 717776 721169 724639 727929
50054 727929 730760 733013 734612 735557 736217 737266 739100 741442 743735 745861 748211 751086 754177 756775 758446
50039 758446 759454 760423 761589 762537 762812 762590 762377 762131 761164 759078 756363 753767 751438 749124 746942 745477
50023 745477 745187 746157 748443 752245 757706 764995 774777 788200 805972 827586 851741 877499 904779
50010I04779K8901K9848K9189K6643K2729J8361J4522J1930J0751J0518J0632
49999A118803J0948J1621J2364J2198J0189O241R15n314j2279j9738k7118l3735
49987A085095l9036m2696m4634m5064m4299m2505l9729l6193l2431k9087k6540
49976F62881k4667k2968k1075j9047j7074j5045j2844j0969j0158j0232r981q676
49964D80145p015o010n524m802l968l850m537n155n212n086n004m561l729l309
49950D12383l676l880k923j342n44r24j571j710j496j229p53k8L54r7q69q45L81
49933C91231K116L445M085M236M089L758L539L646L813L581L090L064L774M448
49919D41915M230L399L057L694M599M837M335L826M014N099O847Q890J0877J2553
$$ plain form
50010 904779 933680 963528 992717 1019360 1042089 1060450 1074972 1086902 1097653 1108171 1118803
49999 1118803 1129751 1141372 1153736 1165934 1176123 1182364 1183279 1177965 1165686 1145948 1118830 1085095
49987 1085095 1046059 1003363 958729 913665 869366 826861 787132 750939 718508 689421 662881
49976 662881 638214 615246 594171 575124 558050 543005 530161 519192 509034 498802 488821 480145
49964 480145 473130 467120 461596 456794 452826 448976 444439 439284 434072 428986 423982 419421 415692 412383
49950 412383 408707 404827 401904 400562 400018 399094 397523 395813 394317 393088 392335 392307 392661 392564 391695 390850 391231
49933 391231 393347 396792 400877 405113 409202 412960 416499 420145 423958 427539 430629 433693 437467 441915
49919 441915 446145 449544 452601 456295 460894 465731 470066 473892 477906 483005 489852 498742 509619 522172
49905E22172J3864J5135J7003J9953K3830K8009L2172L6461M0778M4388M6619
49894H40384M7529M7457M6225M3478L9549L5386L1734K8888K7063K6318K6214
49883A240225K6221K6396K6885K6889K4992K0623J4381O818k102j1973k1458k9391
49871A348506l5676m0574m3903m5593m6360m6942m7201m6731m5787m4799m3429
49860H61511m1101l8237l5892l4227l2289k9448k6264k3599k1571j9699j7662
49849E41522j5547j3664j2366j1753j1457j0864r803q725q185q269q548q443p633
49836D06265o383n416n279n728o058n884n363m717l944l110k467k140j940j641
49822C46195j276r63p05n34n84q02p44m1J052J786J758J266Q59P82R94J515K383
$$ plain form
49905 522172 536036 551171 568174 588127 611957 639966 672138 708599 749377 793765 840384
49894 840384 887913 935370 981595 1025073 1064622 1100008 1131742 1160630 1187693 1214011 1240225
49883 1240225 1266446 1292842 1319727 1346616 1371608 1392231 1406612 1413430 1411328 1399355 1377897 1348506
49871 1348506 1312830 1272256 1228353 1182760 1136400 1089458 1042257 995526 949739 904940 861511
49860 861511 820410 782173 746281 712054 679765 650317 624053 600454 578883 559184 541522
49849 541522 525975 512311 499945 488192 476735 465871 456068 447343 439158 430889 422341 413898 406265
49836 406265 399882 394466 389187 383459 377401 371517 366154 361437 357493 354383 351916 349776 347836 346195
49822 346195 344919 343956 343251 342717 342133 341331 340587 340546 341598 343384 345142 346408 347267 348049 349043 350558 352941
49805C52941L336L869L685K928J920R12J25k77m01n51p19m89L20J212J653J823
49789C72287K276L045L718M279N189O581Q071R535J1423J3989J6757J9247K1646
49776D98043K4422K7587L0762L3598L5636L6193L4950L2421K9338K5797K1579
49765H30326J7131J3468J1079R610Q800R071J0759J3167J4878J4900J3056R308
49753I75553L285n083j4729k3778l0892l6013l9592m1613m1758m0208l7596l4244
49741F33332l0126k5678k1939j9503j7816j5925j3526j1049q988p581o776o233
49729D48192n493m516l774l602l738l737l532l291l012k626k134j482n70K70L25
49714D07280n81j594j763j116l74L9J33n0l05q3Q15J608J380M49M9O72J541J801
$$ plain form
49805 352941 356277 360146 363831 366759 368679 369591 369716 369439 369038 368487 367768 367279 367599 368811 370464 372287
49789 372287 374563 377608 381326 385605 390794 397375 405446 414981 426404 440393 457150 476397 498043
49776 498043 522465 550052 580814 614412 650048 686241 721191 753612 782950 808747 830326
49765 830326 847457 860925 872004 881614 890414 899485 910244 923411 938289 953189 966245 975553
49753 975553 978838 973755 959026 935248 904356 868343 828751 787138 745380 705172 667576 633332
49741 633332 603206 577528 555589 536086 518270 502345 488819 477770 468782 461201 454425 448192
49729 448192 442699 438183 434409 430807 427069 423332 419800 416509 413497 410871 408737 407255 406685 406955 407280
49714 407280 406699 405105 403342 402226 401852 401891 402024 401974 401669 401586 402401 404009 405389 405838 405887 406559 408100 409901
49696D09901J462R35M67K89O55J291J424P09k50o92n44j69K94Q87J445J778K035
49679D21917K437K797K622J715M27o53j066p15N3O01M98p6n07l95O8L72K70J00
49661D30465L73J170K002K371K269J996J681J282R36Q99J174J462J563J518J349
49646D52510R22K50l68o20n02k45n7l1p3J01P56J805K803L331L302K911K468K218
49628D71481K191K113J714J164J013J495K091J983R93j29m17L57J573K515L022
49613D93159L279L365L372L762M963O539P468P439P322P906Q835R381R676J0364
49599E86830J1386J2089J2383J2865J3702J4310J4381J4373J4687J5088J5401
49588G37495J6071J7447J9101K0440K1618K3150K4980K6524K7548K8320K9074
$$ plain form
49696 409901 411363 412298 412765 413054 413709 415000 416424 417133 416883 416191 415647 415478 415772 416659 418104 419882 421917
49679 421917 424354 427151 429773 431488 431915 431262 430196 429481 429534 430135 430633 430557 430050 429655 429723 430095 430365 430465
49661 430465 430838 432008 434010 436381 438650 440646 442327 443609 444545 445444 446618 448080 449643 451161 452510
49646 452510 453432 453682 453314 452694 452192 451947 451890 451859 451786 451887 452643 454448 457251 460582 463884 466795 469263 471481
49628 471481 473672 475785 477499 478663 479676 481171 483262 485245 486238 486109 485692 486049 487622 490137 493159
49613 493159 496438 499803 503175 506937 511900 518439 525907 533346 540668 548574 557409 566790 576466 586830
49599 586830 598216 610305 622688 635553 649255 663565 677946 692319 707006 722094 737495
49588 737495 753566 771013 790114 810554 832172 855322 880302 906826 934374 962694 991768
49577I91768K9832L0805L2322L4250L5941L6968L7606L8380L9463M0680M1830
49566A389845M2757M3265M3202M2664M1925M1167M0388L9470L8219L6323L3465
49555A832690K9613K5131K0486J5861J1094O032Q41m033q165j1360j3724j5549
49543A888917j7144j8643j9960k0876k1174k0740j9681j8260j6633j4698j2337
$$ plain form
49577 991768 1021600 1052405 1084727 1118977 1154918 1191886 1229492 1267872 1307335 1348015 1389845
49566 1389845 1432602 1475867 1519069 1561733 1603658 1644825 1685213 1724683 1762902 1799225 1832690
49555 1832690 1862303 1887434 1907920 1923781 1934875 1940907 1941748 1937715 1929550 1918190 1904466 1888917
49543 1888917 1871773 1853130 1833170 1812294 1791120 1770380 1750699 1732439 1715806 1701108 1688771
$$ [...]
##END NTUPLES=NMR SPECTRUM
##END=
