##TITLE=NES1098_CD3_9886922_Iyb4cjCL7v
##JCAMPDX= 6.0         $$ Bruker NMR JCAMP-DX V2.0
##DATA TYPE= NMR SPECTRUM
##DATA CLASS= NTUPLES
##ORIGIN= BRUKER
##OWNER= Administrator
$$ 1.72 TOPSPIN		Version 2.1
$$ 2016-08-28 16:36:00.758 -0500  Administrator@X
$$ Compression mode = diff/dup
##.OBSERVE FREQUENCY= 400.02188249412
##.OBSERVE NUCLEUS= ^1H
##.ACQUISITION MODE= SIMULTANEOUS (DQD)
##.ACQUISITION SCHEME= undefined
##.AVERAGES= 8
##.DIGITISER RES= 22
##SPECTROMETER/DATA SYSTEM= spect
##.PULSE SEQUENCE= zg30
##.SOLVENT NAME= COFFEE_meoh
##.SHIFT REFERENCE= INTERNAL, COFFEE_meoh, 1, 14.98509
##AUDIT TRAIL= $$ (NUMBER, WHEN, WHO, WHERE, PROCESS, VERSION, WHAT)
$$ ##TITLE= Audit trail, TOPSPIN		Version 2.1
$$ ##JCAMPDX= 5.01
$$ ##ORIGIN= Bruker BioSpin GmbH
$$ ##OWNER= Administrator
$$ $$ E:\/data/COFFEE/nmr/NES1098_CD3_9886922_Iyb4cjCL7v/20/pdata/1/auditp.txt
$$ ##AUDIT TRAIL=  $$ (NUMBER, WHEN, WHO, WHERE, PROCESS, VERSION, WHAT)
(   1,<2016-08-28 16:35:53.711 -0500>,<Administrator>,<X>,<go>,<TOPSPIN 2.1>,
      <created by zg
	started at 2016-08-28 16:34:47.617 -0500,
	POWCHK enabled, PULCHK disabled,
       configuration hash MD5:
       21 0F 79 D6 B3 7B B4 F6 88 20 88 DB 03 48 BD 9F
       data hash MD5: 64K
       4A 16 31 07 B3 9D CB 57 5D 2A 22 92 B2 FE B2 21>)
(   2,<2016-08-28 16:35:56.758 -0500>,<Administrator>,<X>,<proc1d>,<TOPSPIN 2.1>,
      <Start of raw data processing
       efp LB = 0 FT_mod = 6 PKNL = 1 PHC0 = 0 PHC1 = 0 SI = 32K 
       data hash MD5: 32K
       F0 93 EF A5 21 B0 1D F5 A0 5A 6C 84 B6 0D 86 2D>)
(   3,<2016-08-28 16:35:57.039 -0500>,<Administrator>,<X>,<proc1d>,<TOPSPIN 2.1>,
      <pk PHC0 = 92.19727 PHC1 = 0 
       data hash MD5: 32K
       CC E4 67 5E 07 55 D8 63 62 8E 7B FC A6 66 64 B7>)
(   4,<2016-08-28 16:35:57.148 -0500>,<Administrator>,<X>,<proc1d>,<TOPSPIN 2.1>,
      <abs ABSG = 1 
       data hash MD5: 32K
       F8 5F 42 66 F1 FB CE 1E 34 CD B3 11 3E F4 95 E3>)
(   5,<2016-08-28 16:35:57.195 -0500>,<Administrator>,<X>,<proc1d>,<TOPSPIN 2.1>,
      <abs ABSG = 2 
       data hash MD5: 32K
       46 F6 9F B4 98 70 6C AB 09 30 09 EC 60 A6 57 A3>)
(   6,<2016-08-28 16:35:57.273 -0500>,<Administrator>,<X>,<proc1d>,<TOPSPIN 2.1>,
      <abs ABSG = 3 
       data hash MD5: 32K
       7C 2C 2D 31 84 81 97 76 B0 94 25 57 E0 7E 6C DD>)
(   7,<2016-08-28 16:35:57.336 -0500>,<Administrator>,<X>,<proc1d>,<TOPSPIN 2.1>,
      <abs ABSG = 4 
       data hash MD5: 32K
       35 7D E1 2B 0C 33 5D 3B F8 EA 48 1B E3 81 FC A1>)
(   8,<2016-08-28 16:35:57.383 -0500>,<Administrator>,<X>,<proc1d>,<TOPSPIN 2.1>,
      <abs ABSG = 5 
       data hash MD5: 32K
       BA CC A9 DD AA 1D 7A 21 27 42 A5 11 A0 D0 1D 77>)
$$ ##END=
$$ 
$$ $$ hash MD5
$$ $$ 00 56 7A E1 56 AD 61 DF 19 33 F0 62 3C 88 32 04
##$RELAX= 
##$RELAX= 
##$RELAX= 
##$RELAX= 
##$RELAX= 
##$RELAX= 
##$RELAX= 
$$ Bruker specific parameters
$$ --------------------------
##$DU= <E:\>
##$EXPNO= 20
##$NAME= <NES1098_CD3_9886922_Iyb4cjCL7v>
##$PROCNO= 1
$$ [...]
##$TP= (0..7)
150 150 150 150 150 150 150 150
##$TP07= 0
##$TPNAME0= <>
##$TPNAME1= <>
##$TPNAME2= <>
##$TPNAME3= <>
##$TPNAME4= <>
##$TPNAME5= <>
##$TPNAME6= <>
##$TPNAME7= <>
##$TPOAL= (0..7)
0.5 0.5 0.5 0.5 0.5 0.5 0.5 0.5
##$TPOFFS= (0..7)
0 0 0 0 0 0 0 0
##$TUNHIN= 0
##$TUNHOUT= 0
##$TUNXOUT= 0
##$USERA1= <user>
##$USERA2= <user>
##$USERA3= <user>
##$USERA4= <user>
##$USERA5= <user>
##$V9= 5
##$VALIST= <valist>
##$VCLIST= <CCCCCCCCCCCCCCC>
##$VD= 0
##$VDLIST= <DDDDDDDDDDDDDDD>
##$VPLIST= <PPPPPPPPPPPPPPP>
##$VTLIST= <TTTTTTTTTTTTTTT>
##$WBST= 2048
##$WBSW= 25
##$XGAIN= (0..3)
0 0 0 0
##$XL= 0
##$YL= 0
##$YMAX_a= 537834
##$YMIN_a= -448672
##$ZGOPTNS= <>
##$ZL1= 120
##$ZL2= 120
##$ZL3= 120
##$ZL4= 120
##$ABSF1= 14.98509
##$ABSF2= -5.573092
##$ABSG= 5
##$ABSL= 3
##$ALPHA= 0
##$AQORDER= 0
##$ASSFAC= 0
##$ASSFACI= 0
##$ASSFACX= 0
##$ASSWID= 0
##$AUNMP= <proc_prof1d_extract_pilot.lims>
##$AXLEFT= 0
##$AXNAME= <>
##$AXNUC= <1H>
##$AXRIGHT= 0
##$AXTYPE= 0
##$AXUNIT= <>
##$AZFE= 0.1
##$AZFW= 0.1
##$BCFW= 0
##$BC_mod= 0
##$BYTORDP= 0
##$COROFFS= 0
##$CY= 15
##$DATMOD= 1
##$DC= 0
##$DFILT= <>
##$DTYPP= 0
##$F1P= 0
##$F2P= 0
##$FCOR= 0.5
##$FTSIZE= 32768
##$FT_mod= 6
##$GAMMA= 0
##$GB= 0
##$INTBC= 1
##$INTSCL= 1
##$ISEN= 128
##$LB= 0
##$LEV0= 0
##$LPBIN= 0
##$MAXI= 10000
##$MC2= 0
##$MEAN= 0
##$ME_mod= 0
##$MI= 0
##$NCOEF= 0
##$NC_proc= -8
##$NLEV= 6
##$NOISF1= 0
##$NOISF2= 0
##$NSP= 0
##$NTH_PI= 0
##$NZP= 0
##$OFFSET= 14.98509
##$PC= 1
##$PHC0= 92.19727
##$PHC1= 0
##$PH_mod= 1
##$PKNL= yes
##$PPARMOD= 0
##$PPDIAG= 0
##$PPIPTYP= 0
##$PPMPNUM= 2147483647
##$PPRESOL= 1
##$PSCAL= 4
##$PSIGN= 0
##$PYNMP= <proc.py>
##$REVERSE= no
##$SF= 400.02
##$SI= 32768
##$SIGF1= 0
##$SIGF2= 0
##$SINO= 400
##$SIOLD= 32768
##$SPECTYP= <>
##$SREGLST= <1H.CDCl3>
##$SSB= 0
##$STSI= 32768
##$STSR= 0
##$SW_p= 8223.68421052631
##$SYMM= 0
##$S_DEV= 0
##$TDeff= 65536
##$TDoff= 0
##$TI= <>
##$TILT= no
##$TM1= 0
##$TM2= 0
##$TOPLEV= 0
##$USERP1= <user>
##$USERP2= <user>
##$USERP3= <user>
##$USERP4= <user>
##$USERP5= <user>
##$WDW= 1
##$XDIM= 32768
##$YMAX_p= 440126843
##$YMIN_p= -610001
##$CURPLOT= <Network HP LaserJet P1505>
##$CURPRIN= <$Network HP LaserJet P1505>
##$DFORMAT= <normdp>
##$LAYOUT= <+/1D_H.xwp>
##$LFORMAT= <normlp>
##$PFORMAT= <normpl>
##$SURQMSG= 1
$$ End of Bruker specific parameters
$$ ---------------------------------
##NTUPLES= NMR SPECTRUM
##VAR_NAME=  FREQUENCY,     SPECTRUM/REAL,   SPECTRUM/IMAG
##SYMBOL=    X,             R,               I
##VAR_TYPE=  INDEPENDENT,   DEPENDENT,       DEPENDENT
##VAR_FORM=  AFFN,          ASDF,            ASDF
##VAR_DIM=   32768,         32768,           32768
##UNITS=     HZ,            ARBITRARY UNITS, ARBITRARY UNITS
##FACTOR=    0.250966925370066, 1,           1
##FIRST=     8223.43324360094, -252754,      -6221
##LAST=      0,             130976,          -58704
##MIN=       0,             -610001,         0
##MAX=       8223.43324360094, 440126843,    0
$$ Real data points
##PAGE= N=1
##DATA TABLE= (X++(R..R)), XYDATA
$$ [...]
19517g3498r4571B01609d184k67147J33416K7557j12312Q5731A63789a85208A45312
19505I9506b57325a26315r7819q6608E805a29693k66101M435A64049i3317j59261
19494b52578L4151B2162i1940I747e2146A06811d9605A24142b4919j30683a0407
19482a46677c2997G1812b36890n3613M7637D9663c77003a55760E5413b26562A72953
19470a07955C34a30030k6033b4137m4298j54349G5244d06305A7742d18768A91265
19458A26991k3218a00915A50317J00042h2236k01652a39490A24205N2612a93290
19447a08503C879a01461P654H3232b58858f6380m3637o364j92359J2541a45312
19435C31640a88202H841a60145N7140q1595o6017B77505d7570j09221k06786a63320
$$ plain form
19517 -73498 -168069 201609 -4184 -271331 -137915 -110358 -222670 -136939 163789 -185208 145312
19505 99506 -257325 -126315 -224134 -310742 5805 -129693 -395794 -391359 164049 -93317 -252578
19494 -252578 -218427 22162 -91940 9747 -52146 106811 -49605 124142 -24919 -155602 -10407
19482 -146677 -32997 71812 -236890 -290503 -242866 49663 -377003 -155760 55413 -226562 172953
19470 -107955 334 -130030 -156063 -24137 -68435 -222784 75244 -406305 17742 -418768 191265
19458 126991 103773 -100915 150317 250359 -82236 -283888 -139490 124205 176817 -193290
19447 -108503 3879 -101461 -93807 83232 -258858 -66380 -110017 -116381 -308740 -296199 -145312
19435 331640 -188202 8841 -160145 -103005 -184600 -250617 277505 -47570 -156791 -363577 -163320
19423G9494g4367l02773B2738a46935j27215f8877j55450C0678E523a23832O173
19412a17659k02535a27319j10853C867d9081j69628K7839m5770F2669J41795g2760
19400d6948A69466b08241A12627a85602P633a2602j94175p133j8514c7415j85995
19389b23410i518l3518J7319q0070G6850a08101C29782A40464a91480D87709g4927
19377a69959o214I9529b16466D7054g9904A34850a97239e5599B5119b97153P0375
19366b26778h5008C230J48770a94862M2315C3261a83549a3167E2010d746j55368
19355a60114P6804q5300k2695B2810f6931A00178l4225k103B8523b66383G4188
19343c08792A63007j1437b4389A0399a43208o6992j07829A30117a78519o6234
$$ plain form
19423 79494 -74367 -377140 22738 -146935 -274150 -68877 -224327 30678 5523 -123832 -117659
19412 -117659 -320194 -127319 -238172 3867 -49081 -218709 -190870 -236640 62669 204464 -72760
19400 -46948 169466 -208241 112627 -185602 -177969 -12602 -206777 -213910 -232424 -37415 -223410
19389 -223410 -9518 -43036 -25717 -105787 76850 -108101 329782 140464 -191480 487709 -74927
19377 -169959 -176173 99529 -216466 47054 -79904 134850 -197239 -55599 25119 -297153 -226778
19366 -226778 -85008 3230 152000 -194862 -152547 33261 -183549 -13167 52010 -4746 -160114
19355 -160114 -83310 -168610 -191305 22810 -66931 100178 65953 63850 28523 -266383 74188
19343 -308792 163007 151570 -24389 10399 -143208 -210200 -318029 130117 -178519 -244753
19333b44753n2434e94C1995a62963j04438A72720F1973e9823a6627k1623l6103
19322g4353C5217J13064n3328a44352c1780C6611b02983e0148m8054E052Q5335
19311I0387l3428b10311J8322O7178l51837i1337A1660c0179G4823K0423D766
19299a5425c729B59435j02605l9105b18326e2831A9598a45696C3791j515e7995
19287a93013A49716c26272a09281j24285K1713E8298N4057A7668a35165A11579
19276A48752a70683A01915k3834a61391l1675c0653P034k65769A55412g5762C0023
19264d9606H1127f8060j17017h5895j75180Q3462m5359A98812a39144A07265M4488
19253A51753g6574c2805A11095D9042h9454k14445J16301O4827d7300k13275m0812
$$ plain form
19333 -244753 -297187 -594 31995 -162963 -267401 172720 61973 -59823 -16627 -38250 -74353
19322 -74353 35217 148281 94953 -144352 -31780 36611 -202983 -50148 -98202 5052 90387
19311 90387 56959 -210311 -191989 -124811 -476648 -91337 11660 -30179 74823 95246 4766
19299 -15425 -3729 259435 156830 117725 -218326 -52831 19598 -145696 33791 32276 -57995
19287 -193013 149716 -326272 -109281 -233566 -211853 58298 112355 17668 -135165 111579
19276 148752 -170683 101915 78081 -161391 -193066 -30653 -23619 -289388 155412 -75762 30023
19264 -49606 81127 -68060 -185077 -85895 -261075 -177613 -222972 198812 -139144 107265 151753
19253 151753 -76574 -32805 111095 49042 -89454 -303899 -187598 -122771 -47300 -260575 -301387
19242c01387F9912A2379f4220n1132k6670n3249D921K3726a55675d9995A16068
19230b08224E7010B6094a60577H3479a25623k00777a51996K990I6547k5989b90159
19218a55374c3870j16794j75505Q5654f7488A1028J19765d19019a25840B4374
19207c6307H2730R0575d5432l20192A25498i327G7644b16116L3316p5200A59027
19195a8760N488j41516f0903b663k79658M5506l0757A2463M77706b17872L678
19184b14194k0353j97143J54174Q7140B06020Q3996a86826a2199j05431q5311
19174b02941f03o8708A08149a56322M5852j55802H1342Q3851a19778J7330A62826
19162a22262m08441O9372b11664B8889J55404D8279d71745a15508A08662i2785
$$ plain form
19242 -301387 69912 12379 -64220 -115352 -142022 -195271 4921 28647 -155675 -49995 116068
19230 -208224 57010 26094 -160577 83479 -125623 -326400 -151996 -149006 96547 70558 -290159
19218 -155374 -33870 -150664 -326169 -240515 -67488 11028 130793 -419019 -125840 24374
19207 -36307 82730 173305 -45432 -365624 125498 -9327 77644 -216116 -182800 -258000 159027
19195 -18760 -13272 -154788 -60903 -2663 -282321 -236815 -267572 12463 490169 -217872 -214194
19184 -214194 -234547 -431690 -277516 -190376 206020 290016 -186826 -12199 -117630 -202941
19174 -202941 -603 -69311 108149 -156322 -110470 -266272 81342 165193 -119778 -102448 162826
19162 -122262 -530703 -461331 -211664 28889 184293 48279 -471745 -115508 108662 -92785
19151B86023b39704a0366A03500k2680h5492A90471a47235H8453b75546k6461
19141c02007h3511H1957j8951a91069G1631l5455a12805l8662A94233c2223N59
19130c1664p9471A51383h1456q7956k0349j25557a233j18247B10606I43J29650
19119A30593k1509j8073J37963B9090c51928a29570d4065j7682l28344k4025b8532
19107a24164l01426A02572k0952A5559i8529B03055d40231b12649d3262j72286
19097b15548k0775f541j68617m8559A25659a79463c5684j62984A54138a73576
19086I4131m4415l41K60866b13552P8409J7641K2644C60009a77864C2185g8269
19074B49897a21597n8542G3076J41371C0245c30594a3053B43451A8795h2260B06081
$$ plain form
19151 286023 -239704 -10366 103500 80820 -85492 190471 -147235 88453 -275546 -302007
19141 -302007 -83511 81957 63006 -191069 71631 36176 -112805 -151467 194233 -32223 -31664
19130 -31664 -111135 151383 -81456 -169412 -189761 -315318 -1233 -119480 210606 943 130593
19119 130593 109084 91011 228974 29090 -351928 -129570 -44065 -61747 -390091 -414116 -28532
19107 -124164 -425590 102572 81620 15559 -98529 203055 -440231 -212649 -43262 -215548
19097 -215548 -236323 -6541 -175158 -223717 125659 -179463 -35684 -198668 154138 -173576
19086 94131 49716 49375 310241 -213552 -135143 -117502 -94858 360009 -177864 32185 -78269
19074 249897 -121597 -180139 73076 214447 30245 -330594 -13053 243451 18795 -82260 206081
19062A01218J25835c66775a59903B70749o4847c3139j03960n0930m789H530L7378
19051D5908c88418D45917b74837d4089A29241c02550n895J44632G7225i3039j92020
19040b85059a03623k3301M3864A79628a1537C23625G8144b89238N6641P9200j10297
19029b63694f2218E9427d6071b0041n0171j8144g348k311j08649n8385D6480J93044
19017B39524a08257r2390Q3802N1583j65057B07543q1686b71753B34529N0943
19007B85472B7069h6801B04629G6464e5110n7752j43365F2191a57651A28879l7084
18996I1795I342a16134A64948e150A62222n0552A8609J27561C1446A969P4866
18985G6835a56557A74723E7209b1004j02155k2172k00270a03750N0451A02186
$$ plain form
19062 101218 227053 -366775 -159903 270749 205902 -33139 -137099 -188029 -192818 8530 45908
19051 45908 -388418 445917 -274837 -44089 129241 -302550 -308445 -163813 77225 -93039 -285059
19040 -285059 -103623 -126924 -83060 179628 -11537 323625 78144 -289238 -232597 -153397 -263694
19029 -263694 -62218 59427 -46071 -20041 -70212 -88356 -7348 -9659 -118308 -176693 46480 239524
19017 239524 -108257 -200647 -116845 -65262 -230319 207543 125857 -271753 234529 285472
19007 285472 27069 -86801 204629 76464 -55110 -112862 -256227 62191 -157651 128879 91795
18996 91795 9342 -116134 164948 -5150 162222 111670 18609 146170 31446 1969 76835
18985 76835 -156557 174723 57209 -21004 -123159 -145331 -345601 -103750 -53299 102186
18974B62153p8349L57513j0035k61441C6709b6932m10942a51491B92565a25330
18963c8872j73682A1466L94931D0694c33975E2555b27222a12629j958L8994A03480
18951h9151A88624d7206Q148j62055f6791G3593f6566h519D4445g5218e880n6786
18939f2666K0846q3749A75129b41757J3512F5519b78450D1070Q9016d5303k10279
18928b55582i2160C8378c49021a26997A23992a62305B434g1958k36428a13905
18917B0649J99288i5454A63144p3008Q2320h845r21A19948J57788m6229F3693
18905f3443A09414c8985j65897g5405o0073I4502M5655b25243L0961D923c14907
18893h1605B22036q2281a96969r3777L8398B53629b4849E7273f6247j70464B68482
$$ plain form
18974 262153 183804 541317 531282 269841 36709 -26932 -437874 -151491 292565 -125330
18963 -38872 -212554 11466 406397 40694 -333975 52555 -227222 -112629 -114587 -75593 103480
18951 -89151 188624 -47206 -39058 -201113 -66791 73593 -66566 -8519 44445 -75218 -5880 -62666
18939 -62666 -41820 -125569 175129 -241757 -228245 65519 -278450 41070 130086 -45303 -255582
18928 -255582 -92160 38378 -349021 -126997 123992 -162305 2434 -71958 -308386 -113905
18917 20649 219937 -95454 163144 90136 172456 -8845 -9766 119948 277736 231507 63693
18905 -63443 109414 -38985 -204882 -75405 -135478 94502 140157 -225243 -194282 4923 -314907
18893 -81605 222036 139755 -196969 -290746 -252348 253629 -24849 57273 -66247 -236711 268482
18881a22302N1535r9515A71598a42424n5709G0028J16427a66722A87088a34619
18870b34198A76304f2005B2398K41862b42112C7482i6098A76659a86765d03k34438
18859b34841n5296a9844l05876A44113h3525q701j9106I4610b29438J11237N3423
18848f4778C2771J25806e2105l056D379i318C17311d23731C3746b56760a09474
18836B03939c72306a15107G9686a10989r2821c0415G295a1528D6058b14926g7030
18824C3017c60567a71629M5164M0131p8865K3742B14058l9841a9005C74074a34043
18812A81528i5247A69196G5298J36281H0562A800a05300J6486p0665j7111O9408
18801a07182l9706q2703i1841D40919H678e5490j6513o5817f1388M789k44674
$$ plain form
18881 -122302 -70767 -170282 171598 -142424 -198133 70028 186455 -166722 187088 -134619
18870 -234198 176304 -62005 22398 264260 -242112 37482 -96098 176659 -186765 -403 -234841
18859 -234841 -290137 -19844 -325720 144113 -83525 -92226 -111332 94610 -229438 -118201 -64778
18848 -64778 32771 158577 -52105 -55161 4379 -9318 317311 -423731 33746 -256760 -109474
18836 203939 -372306 -115107 79686 -110989 -203810 -30415 7295 -11528 46058 -214926 -77030
18824 33017 -360567 -171629 -126465 -86334 -165199 -141457 214058 174217 -19005 374074 -134043
18812 181528 -95247 169196 75298 211579 80562 1800 -105300 -88814 -159479 -176590 -107182
18801 -107182 -146888 -229591 -91841 440919 8678 -55490 -72003 -137820 -61388 -56599 -301273
18790c01273Q2209k26319a04300j13312C5706B023K64233C6539K172g586G426
18778a89090j49754Q0356c2896j12484L5143A16578f6645B33758c4653j928j00116
18767a36697c3043p9076C0974b53140j31679B23907c6200o5324E8071A7094K1778
18756C8872M7494j6721b0529l01569A61308L1879D6373b05618N1015c7375C6898
18744a59057o6836f1175B26946d34462H0343P9712A1006a62107m312h0885B69123
18732F6092B8402b02405N1338j9014m9807H1565b55755A49302b13936g7947A94136
18720A29703F0692e9760j46936Q7151D8054c42069a22605e0395B99495a4766l50772
18709c65538a13703H4605J62355F6610a20033B57008h6892q2382B19472b01805
$$ plain form
18790 -301273 -219064 -445383 -104300 -217612 35706 2023 266256 36539 38711 -7586 7426
18778 -189090 -338844 -258488 -32896 -145380 -110237 116578 -66645 233758 -34653 -36581 -136697
18767 -136697 -33043 -112119 30974 -253140 -384819 223907 -36200 -101524 58071 17094 38872
18756 38872 86366 69645 -20529 -322098 161308 193187 46373 -205618 -154603 -37375 36898
18744 -159057 -225893 -61175 226946 -434462 80343 160055 11006 -162107 -166419 -80885 269123
18732 66092 28402 -202405 -151067 -170081 -219888 81565 -255755 149302 -213936 -77947 194136
18720 129703 60692 -59760 -206696 -119545 48054 -342069 -122605 -50395 299495 -14766 -365538
18709 -365538 -113703 84605 246960 66610 -120033 257008 -86892 -169274 219472 -201805
18698a36384M475I4399a91315G8322P9709c0851k55276c7427F7026J97838a92216
18686E1408K4814J80439a82903H6746l3888a09673Q960r5669l5085A21179a77453
18674F5071K5705i6606p1783B2804O6713b04751J4603L5256j41698J11630h7876
18662A09315m2398c31978P2432g2668j5691p9563C4575J6215b20521q9767d5857
18650c07260J1575b0560A08568b9038k36200A15948O1117B1700R0020b56444j6837
18639b73281e7259A54926a70198C75835h3762J2266m0759c1470j99288L999D098
18627a61852E2237a52270p330f0369C2734a32483A67904p4570m1662J24230e3505
18615d37147A84670c6893j28606J4737A20720b00883C1489e679B76968B0860K81130
$$ plain form
18698 -136384 -131909 94399 -191315 78322 158031 -30851 -286127 -37427 67026 264864 -192216
18686 51408 76222 256661 -182903 86746 52858 -109673 -100713 -196382 -231467 121179 -177453
18674 65071 90776 -96606 -168389 22804 89517 -204751 -190148 -154892 -296590 -184960 -87876
18662 109315 66917 -331978 -259546 -72668 -88359 -167922 34575 50790 -220521 -310288 -45857
18650 -307260 -295685 -20560 108568 -29038 -265238 115948 177065 21700 111720 -256444 -273281
18639 -273281 -57259 154926 -170198 375835 -83762 -71496 -112255 -31470 -230758 -226759 4098
18627 -161852 52237 -152270 -159600 -60369 32734 -132483 167904 93334 51672 175902 -53505
18615 -437147 184670 -36893 -165499 -150762 120720 -200883 31489 -5679 276968 20860 301990
18604C01990d60572B13038a05177m8806L9500B32926H240Q1471b81265a24038
18593a91466D3188c90355J28873r1500J43342l0904c3178j18807d6430l2281A69269
18581G0908k0487a84294n4460G5434A5961a57425A58747O573K7046p1845b53887
18569a30531B52832a39525C15963a02493I679b16898L7446h9269j9974K1921j06127
18558a93449J6072C5663c82347f1281O96j14502O8649m6784N0089k03580a06931
18546b25660J04687a1714q2507j42957K3173D2222a06944c2450O520B59429f9553
18534A90942i889m59570f2545j666j8455E4732b05655C1421K60893b86136a00611
18522A61484d21594A07925Q3639c1984C33679c03534c3406k20886C5085d1426
$$ plain form
18604 301990 -460572 213038 -105177 -153983 -114483 232926 8240 89711 -281265 -124038
18593 -191466 43188 -390355 -261482 -352982 -209640 -240544 -33178 -151985 -46430 -78711 169269
18581 70908 50421 -184294 -238754 75434 15961 -157425 158747 165320 192366 120521 -253887
18569 -130531 252832 -139525 315963 -102493 9679 -216898 -179452 -89269 -109243 -87322 -193449
18558 -193449 -177377 35663 -382347 -61281 -60585 -175087 -106438 -153222 -103133 -306713 -106931
18546 -225660 -120973 -11714 -94221 -237178 -214005 42222 -106944 -32450 -25930 259429 -69553
18534 190942 -9889 -469459 -62545 -64211 -82666 54732 -205655 31421 292314 -286136 -100611
18522 161484 -421594 107925 191564 -31984 333679 -303534 -33406 -254292 35085 -41426
18511a51003B52782b69794F6789B9793J14042b73926D7976J97481a33721a1542
18500B22129a13017A73093D5386a08382B56324b69900R8101B29924G3817L6458
18490A10275a47979C1511f1374C8665b59055g956l31845a51494A3243M6533a35685
18478a3774A99515F327d2240n7644k14033J17098f2039j10902g0686l8437K1125
18467h7998A0505f7383l79818C7371A2275b237r488H1894a37259o7923E03087
18455A12936c598q8589k17857A51176c9652j68965i7388j29998P4471L0201D3941
18443H2369N6289l7317a75225K7846P308B5224g8491C30471a05842B02248a85348
18431b86156c1685j6906p0468j5199H6180a23705M6827j48211M7201A7623b17331
$$ plain form
18511 -151003 252782 -269794 66789 29793 143835 -273926 47976 245457 -133721 -11542
18500 222129 -113017 173093 45386 -108382 256324 -269900 -171799 229924 73817 110275
18490 110275 -147979 31511 -61374 38665 -259055 -7956 -339801 -151494 13243 59776 -135685
18478 -13774 199515 6327 -42240 -99884 -313917 -196819 -62039 -172941 -70686 -109123 -87998
18467 -87998 10505 -67383 -447201 37371 12275 -2237 -11725 81894 -137259 -205182 503087
18455 112936 -3598 -92187 -310044 151176 -39652 -208617 -97388 -227386 -152915 -122714 43941
18443 82369 138658 101341 -175225 -147379 -140071 25224 -78491 330471 -105842 202248 -185348
18431 -286156 -31685 -48591 -119059 -134258 86180 -123705 -76878 -225089 -177888 17623 -217331
18419f5787G8436c00037A00467I453c5326j35190M0480a2340l24289J42621G471
18407A00935a6688G3856j7154i0145m6339k497K1133G2379a58395A12629d7579
18395A1373M6715J32453h1301A9675a45399A95694E984J1311O7271a55364P7196
18384g8168m7459h458B17059a44276A55635J53254E4870h16n0114l19513D4818
18372a6411j39409K4582A19951e5198j34495d8197E8277B8248L3338a72260p0290
18361b42550I8011J47614E0060p711j4085e4808l56080a71693C7187J38053h0419
18349F9447g0809j8707j6457j65212a7651k47080B55864B9752f1252l40263a49079
18337C0388J89169a0661k26008P4207B239L9615a86366A95915a3456n9721B76806
$$ plain form
18419 -65787 78436 -300037 100467 9453 -35326 -170516 -130036 -12340 -336629 -194008 7471
18407 100935 -16688 73856 56702 -90145 -136484 -138981 -117848 72379 -158395 112629 -47579
18395 11373 58088 190541 -81301 19675 -145399 195694 5984 17295 84566 -155364 -78168
18384 -78168 -125627 -8458 217059 -144276 155635 308889 54870 -816 -50930 -370443 44818
18372 -16411 -155820 -131238 119951 -55198 -189693 -48197 58277 28248 61586 -172260 -242550
18361 -242550 98011 245625 50060 42349 28264 -54808 -410888 -171693 37187 175240 -80419
18349 69447 -70809 -89516 -105973 -271185 -17651 -264731 255864 29752 -61252 -401515 -149079
18337 30388 219557 -10661 -236669 -162462 2239 41854 -186366 195915 -13456 -73177 276806
18325B17914g6898D3400b13022E9278f8038k13945A6446a45045c8138q5396k49618
18314c73152g0344B7382N8382b42390a13898L5605a1089k07916D45382i3392o4591
18303a57983A03669d458B06791b1690A12637a76494B87459j36381p3718h5401
18292G2928J80008a25905C2592a36441n1874N0376B0373K47301o0924q0237a93083
18280d9394q8071A4175J38614a08267B76411J8667a49546g0111c1208B87421a70842
18268a80393k1386R2247j48017A54835a09076j89101D2693J08289a68836q3322
18258b52158A91004B1843J17848n9153e7793J3104k30399e0482k59291J28136
18248a81637B47915d6925m9955B89353b36764d575k87435D04338I7021j9510Q96
$$ plain form
18325 217914 -76898 43400 -213022 59278 -68038 -281983 16446 -145045 -38138 -123534 -373152
18314 -373152 -70344 27382 85764 -242390 -113898 -78293 -11089 -219005 445382 -93392 -157983
18303 -157983 103669 -4458 206791 -21690 112637 -176494 287459 151078 77360 -85401
18292 72928 252936 -125905 32592 -136441 -188315 -137939 20373 267674 206750 126513 -193083
18280 -49394 -137465 14175 152789 -108267 276411 295078 -149546 -70111 -31208 287421 -170842
18268 -180393 -201779 -109532 -257549 154835 -109076 -298177 42693 150982 -168836 -252158
18258 -252158 191004 21843 139691 80538 -57793 -44689 -275088 -50482 -309773 -181637
18248 -181637 247915 -46925 -96880 289353 -236764 -4575 -292010 404338 97021 77511 78407
18237G8407K67885a3786B28201d1087j23360E6693k2572a83083D4531J41686b1416
18225a50495a2839n6567o6440A03558l7403a71951f608I6423Q6531b84774J15706
18214a69068L7324b8651F0234a1765A0877a99238p7662e4819k64922j5031G6519
18202A1049a58073D18398a26244F5283a25563E7669E449J05702c53831Q0598Q7437
18191a85796E3906K85966j38443a45873A26918l7752L5324a9679B47065M7230
18181B94295a71611A24456d9582c337j32817j30801J16903e0556k95673D1309
18170i8673m9496B79396j30949a87920A68734H4181g7089E4365P575b17080P4045
18159a43035E7462b0616B83416a44943l3980j49536a8074q4866A9793K5703J26472
$$ plain form
18237 78407 346292 -13786 228201 -41087 -164447 56693 34121 -183083 44531 186217 -21416
18225 -150495 -12839 -69406 -135846 103558 66155 -171951 -6608 96423 182954 -284774 -169068
18214 -169068 -131744 -28651 60234 -11765 10877 -199238 -276900 -54819 -319741 -334772 76519
18202 11049 -158073 418398 -126244 65283 -125563 57669 5449 111151 -353831 -273233 -185796
18191 -185796 53906 339872 201429 -145873 126918 89166 124490 -19679 247065 294295
18181 294295 -171611 124456 -49582 -3337 -136154 -266955 -150052 -50556 -346229 41309
18170 -98673 -148169 279396 148447 -187920 168734 84181 -77089 54365 61940 -217080 -143035
18159 -143035 57462 -20616 283416 -144943 -178923 -328459 -18074 -102940 19793 45496 171968
18148A71968h5048D5471J20344B6188b74680B6748Q4235m4813b24946A41345a07459
18136a88150F6617b09777b2896R148B09706a06822B48606a64193H4604e9634B36196
18124A58413c39233A78618p4039b99279G9581J00914B3756c2759C0740e7680A76406
18112B9758J59628B1133a15715A98947I2304c29772e9161k09964B02263b00320
18101A35918b75158A67210b09564P2208B64253j09680d5484A44648a39258A12397
18090A57698B3308e4122A5497J20197B3671b31937l2741A72985c90949E2193K76943
18079C29136A13858O3156b3355n314q5068l85506I8364a64563A87857M7834a28959
18067h0228J630D600b7668k76953a560l3385l8467B3899a18499p6990A53722F783
$$ plain form
18148 171968 -85048 45471 165815 26188 -274680 26748 110983 66170 -224946 141345 -107459
18136 -188150 66617 -209777 -22896 -13748 209706 -106822 248606 -164193 84604 -59634 236196
18124 158413 -339233 178618 104579 -299279 79581 180495 23756 -32759 30740 -57680 176406
18112 29758 189386 21133 -115715 198947 92304 -329772 -59161 -269125 202263 -200320
18101 135918 -275158 167210 -209564 -137356 264253 154573 -45484 144648 -139258 112397
18090 157698 23308 -54122 15497 135694 23671 -231937 -264678 172985 -390949 52193 329136
18079 329136 113858 177014 -23355 -28669 -113737 -499243 98364 -164563 187857 235691 -128959
18067 -80228 -78598 4600 -27668 -304621 -1560 -34945 -73412 23899 -118499 -195489 153722 6783
18054a58652A33041j7917a62563M4989k05832A56887D1079K14772b03942l2494
18044b36436g143H5346e5073I8576J10429J59133e8872H5879J0217a21510B6019
18032c44422d2272n2661a0883o0519A08404D0106a08970A5352g5883H4744A9744
18020D0736f386l63324A79964a95026A43181a35141m4814B60484a39302o5694
18010b04996A72610C4708a93911A0672N9334e5210j72972F5224b22368A07449
17999b9481p1038K7659h93A21390d867k01954B25523b3262o7490j37769E7586
17987e7744n7097F6436k6874a33504K8333A41641J1165a95576K9698A56329a87326
17975E0022L7965b05790B04720a74152G3479b13874q2737A77484A6285J01044
$$ plain form
18054 -158652 133041 115124 -162563 -117574 -323406 156887 41079 255851 -203942 -236436
18044 -236436 -7143 85346 -55073 98576 209005 368138 -58872 85879 96096 -121510 26019
18032 -344422 -42272 -94933 -10883 -71402 108404 40106 -108970 15352 -75883 84744 19744
18020 40736 -6386 -369710 179964 -195026 143181 -135141 -179955 260484 -139302 -204996
18010 -204996 172610 34708 -193911 10672 70006 -55210 -228182 65224 -222368 107449
17999 -29481 -100519 -72860 -893 121390 -4867 -206821 225523 -23262 -90752 -228521 57586
17987 -57744 -114841 66436 39562 -133504 -105171 141641 152806 -195576 -165878 156329 -187326
17975 50022 87987 -205790 204720 -174152 73479 -213874 -296611 177484 16285 117329
17965A17329J0646d6415j88578J03795j05772A9799a08323j84899b2693H0643
17954g258C3550a23984C43995g1040D72496k22445b0294j11556N1625B07993A3960
17942i6314A13882B4129K6245M3864a28523D3651J13266b34285c9998A88238b6562
17930D0204M5959b41313E6699d7842E6133a00322m4988O9993B217b46046O7516
17919a78530B23400E4743a63920H1094J1830P6692D2792a4378B51731b08355D3990
17907a28789d3505H2145c6944r0031B5045b92483g012k98245I2438e5901C3634
17895A17428b52317Q0823B9853k139b98154g6113H8759J275a88984P8393A41289
17883A20489n0753M3241p524Q4540g2731a840B19643c65609a5009m3811A26886
$$ plain form
17965 117329 127975 -46415 -234993 -131198 -236970 19799 -108323 -293222 -22693 80643
17954 -7258 33550 -123984 343995 -71040 472496 250051 -20294 -131850 -80225 207993 13960
17942 -96314 113882 24129 50374 94238 -128523 43651 156917 -234285 -39998 188238 -26562
17930 40204 86163 -241313 56699 -47842 56133 -100322 -145310 -75317 2217 -246046 -178530
17919 -178530 223400 54743 -163920 81094 92924 169616 42792 -14378 251731 -208355 43990
17907 -128789 -43505 82145 -36944 -126975 25045 -292483 -7012 -305257 92438 -55901 33634
17895 117428 -252317 -171494 29853 27714 -298154 -76113 88759 90034 -188984 -110591 141289
17883 120489 69736 112977 105453 189993 -72731 -1840 219643 -365609 -15009 -58820 126886
17871a40384n4015A0305J30238a51229D4049M6018a41642B56928n2850h2011O64
17860h1347B43901a34744A10978O0054a6931B33366c3495D7460g0748A24736m6055
17849G8681K66365o2725A15835k1672b3992A25112n4076l2395i2515B98263a03410
17837b16233Q4783f100n350j7218F4622n6a32838E4368J52359n2552B7825a80574
17824B46979C5016a4392n0880l6763B25897n6982m1711a42899m620B9027O1153
17813I0180g0152o5831E8160J73955c6535A12392a0805A76289b0621j14106n8154
17802a92881o0190A39946a23262I5664e2313A38569a00436M675F5046J2696M2164
17791A19906a45708m5431g168q6213A54497a04349B34095j7439i4966J4444H6550
$$ plain form
17871 -140384 -194399 10305 140543 -151229 44049 90067 -141642 256928 204078 -82011 -81347
17860 -81347 243901 -134744 110978 171032 -16931 233366 -33495 47460 -70748 124736 78681
17849 78681 345046 282321 115835 94163 -23992 125112 71036 38641 -92515 298263 -103410
17837 -216233 -131450 -6100 -11450 -28668 64622 64566 -132838 54368 206727 154175 27825 -180574
17824 246979 35016 -14392 -65272 -102035 225897 168915 127204 -142899 -147519 29027 90180
17813 90180 -70152 -135983 58160 232115 -36535 112392 -10805 176289 -20621 -134727 -192881
17802 -192881 -253071 139946 -123262 95664 -52313 138569 -100436 -95761 65046 77742 119906
17791 119906 -145708 -191139 -7168 -93381 154497 -104349 234095 216656 -94966 -80522 86550
17779C20430A5483Q722J58440b01937O0470B07793c56877C8399J7289B6449K4372
17768E0821K21078M665j12981a03300A07148c6783B6439a49379b0436k31109h3217
17756A71038a61798A31118g6390B18337e5566k89758R3212J07152B10674G3101
17745B66052A2846b84859A88156b79099B14696a34155b3474p2722F8544B7529
17734A06707j0700a00994a2593C33115a11737C33693j14335b8836j30907A52027
17723a15483a6088B07280E0321c188l9454C7470b1127b046A61633p4614i2456
17711D3645K8462O3380l9379d938D5465J14690a25019K4749C6539g1518A87944
17699B09892e6498A30281l6277i2244a4388A36217C3004K8693J24406a0595m8057
$$ plain form
17779 320430 15483 24205 182645 -201937 -141467 207793 -356877 38399 55688 26449 50821
17768 50821 271899 276564 163583 -103300 107148 -36783 26439 -149379 -20436 -251545 -83217
17756 171038 -161798 131118 -76390 218337 -55566 -345324 -252112 -144960 210674 73101
17745 266052 12846 -284859 188156 -279099 214696 -134155 -23474 -96196 68544 27529
17734 106707 96007 -100994 -12593 333115 -111737 333693 219358 -28836 -159743 152027
17723 -115483 -16088 207280 50321 -3188 -42642 37470 -21127 -2046 161633 87019 -92456
17711 43645 72107 135487 96108 -4938 45465 160155 -125019 -100270 36539 -71518 187944
17699 209892 -56498 130281 94004 -92244 -14388 136217 33004 61697 186103 -10595 -58652
17688e8652r8767A68390N8043b0361k54077A16123m1519J28183h5223k63147c3045
17676A92740f8527A51811i5621D1709d5494G5765P8519a78663b2766g588I2633
17664C05245A46618a38615O1865A05313b1029A98325E3915b66558A68698K3434
17654A92132h4973A65645J48574A48774f8268A974M46652A86569b6913A29663
17643B88267b3714k10575A31201J26269J14334b86E2608A3092K70375j12731K333
17632A73069a17652A40575h2288B94599a43560H2044b43757B4646a04025B34416
17621a18435K470D9282O7979b2913j6389D6785K17286G8888J36083J78377Q4302
17610D77650e8890A85253J07021J84414D3811j1806i9829b9075p3936C42195e669
$$ plain form
17688 -58652 -157419 168390 226433 -20361 -274438 116123 74604 202787 -85223 -348370 -33045
17676 192740 -68527 151811 -95621 41709 -45494 75765 154284 -178663 -22766 -7588 92633
17664 305245 146618 -138615 -76750 105313 -21029 198325 53915 -266558 168698 192132
17654 192132 -84973 165645 314219 148774 -68268 1974 448626 186569 -26913 129663
17643 288267 -23714 -234289 131201 257470 371804 -286 52608 13092 283467 170736 173069
17632 173069 -117652 140575 -82288 294599 -143560 82044 -243757 24646 -104025 234416
17621 -118435 -115965 49282 117261 -22913 -39302 46785 264071 78888 214971 393348 477650
17610 477650 -58890 185253 292274 476688 43811 32005 -99829 -29075 -103011 342195 -5669
17598b4594H0273a29827l4563A20466B7968L16471I095h6271J8438G5567a08408
17586A9487a29589I1500D4014N0542b50782M5527B26819j09662J86644l1747R114
17575B81168p3662m6304f1512B51158h5801G9859L09863D9215h1339C16175a44802
17563H2194F625J0029K77462a56360D1824d3813q4518A36202n2729O856L40197
17552D30526a88805A13166D1810J70318H3013b6519D1606j5026M13113d9719H4247
17540B00094P0728H761M17434G9166L9181K88925I0504B9839J19651J25816A10360
17528B43999L2608j01988M62929K92836J65917k57107k09768n0940K67265l24820
17518E20931B48725P696m0504G9126J30923K15870J55325K4280M4161K19598k08977
$$ plain form
17598 -24594 80273 -129827 -164390 120466 27968 344439 9095 -86271 -67833 75567 -108408
17586 19487 -129589 91500 44014 94556 -250782 -205255 226819 117157 303801 272054 281168
17575 281168 207506 161202 -61512 251158 -85801 79859 389722 49215 -81339 316175 -144802
17563 82194 6625 16654 294116 -156360 41824 -43813 -128331 136202 83473 90329 430526
17552 430526 -188805 113166 41810 212128 83013 -26519 41606 26580 439693 -49719 84247
17540 200094 270822 8761 426195 79166 118347 407272 90504 29839 149490 275306 110360
17528 243999 276607 174619 637548 930384 1096301 839194 629426 578486 845751 520931
17518 520931 248725 256421 215917 79126 210049 425919 581244 605524 649685 869283 660306
17507F60306Q432r7365B78630J4220M2340j02337a09627D71928f9876A59219D2134
17495F8411J24043K13951A30417J35875n6238K08439j63789J25532A32251K91040
17485D23291j33486E1185k1261R6908M9108b1700B53532q6373q049J716F5904
17473G4665K72811j53584n2726e2758B28318R1236M628n2017a87608A3172K62980
17462B76152G244J33561D2123K10664q1364K62677k16610E5230K5682R6316h8764
17450C06865p2848K11909j48375R7506j17390p3939N8395Q3756K2109Q9955A13062
17438A08588M5742B3091K11422o6663d07B25395O5144J37254q0915g7477G7630
17426D31233A07983K09352J01323r3264M917r8036K1537K27538j56333n7920J02426
$$ plain form
17507 660306 668738 571373 278630 292850 335190 232853 -109627 471928 -69876 159219 42134
17495 68411 192454 406405 130417 266292 210054 418493 254704 380236 132251 423291
17485 423291 289805 51185 29924 126832 175940 -21700 253532 167159 159110 160826 65904
17473 74665 347476 193892 141166 -52758 228318 319554 324182 272165 -187608 13172 276152
17462 276152 7244 140805 42123 252787 171423 434100 217490 55230 80912 177228 -88764
17450 306865 234017 445926 297551 395057 277667 203728 262123 345879 367988 457943 113062
17438 108588 154330 23091 234513 167850 -407 225395 290539 427793 346878 -77477 77630
17426 431233 107983 317335 418658 325394 330311 232275 253812 481350 325017 267097 369523
17415C69523C0434L28940J29266C8597R628K24654A31693P0421J69598A34435
17404D3744i1961A69342A3454K89442D9631N0337L67318B18913B5607J59129K85602
17393D70338G1448a59347C42491J46098l7340A17044B004K63497J32118j703F0596
17381D77145A07027j4082Q8066H8808J10443R6291C1536N4319a03851B97676D9163
17369C27459o4902J39226j46479J35560A61490L48253k48123j5454c4087B15738
17358B46313Q7506a7190C3978j0495J68628H0434K15135h5362q832d4034A16630
17346B96217e1012C74008j78505J4219k2842e8604A57719K41649A10468B5606
17335B75102j24280J65361m5038o5798Q2665Q9800j64272I4259P7364a15764B79670
$$ plain form
17415 369523 30434 359374 488640 38597 48225 272879 131693 202114 371712 134435
17404 43744 -91961 169342 13454 302896 49631 99968 467286 218913 25607 184736 470338
17393 470338 71448 -159347 342491 488589 451249 117044 2004 265501 397619 395916 60596
17381 477145 107027 92945 181011 88808 199251 295542 31536 85855 -103851 297676 49163
17369 327459 262557 401783 255304 390864 161490 509743 261620 246166 -34087 215738
17358 246313 333819 -17190 33978 23483 192111 80434 295569 -85362 -94194 -44034 116630
17346 296217 -51012 374008 195503 209722 186880 -58604 157719 399368 110468 25606
17335 275102 150822 316183 271145 205347 288012 377812 213540 94259 171623 -115764 279670
17323a63812h699B96263n1730L01461A59703r798J90259j50503j4492A4147L98098
17312D12245k00095M7136k5938L68268j55717K4255k22840B0588K9219J13347
17302A63154J05438m7597C966J34618K06745a46413G4622M9320J27666M5027J79384
17291D76019A96221J094j0566J93292A17535J5699K57601H8193N0179K19033j40538
17280B16867O2614a46309A92287J63269I5309J74161l0042J32251o1107J39945
17270D50517j96080D041K24543m2277Q2557j2640E4167K88398o0708J00166b00125
17258A68407L0160Q0162k8725N5988F4328J6441K77679r4086r7424L48686B55152
17246C13492p0752K25250K047j26720J46497B29757J24493J02821j20530A50062
$$ plain form
17323 -163812 -8699 296263 244533 545994 159703 149905 340164 189661 175169 14147 412245
17312 412245 212150 259286 233348 601616 445899 470154 247314 20588 49807 163154
17302 163154 268592 220995 3966 138584 345329 -146413 74622 123942 251608 296635 476019
17291 476019 196221 197315 186749 380041 117535 133234 390835 88193 138372 357405 216867
17280 216867 279481 -146309 192287 355556 95309 269470 239428 371679 310572 450517
17270 450517 254437 4041 228584 186307 268864 256224 54167 342565 281857 382023 -200125
17258 168407 198567 278729 250004 305992 64328 80769 358448 264362 166938 515624 255152
17246 313492 242740 467990 470037 343317 489814 229757 354250 457071 336541 150062
17235B89166K70268J00257A68034J93313O795q585j76656K0889K20126n0322n2366
17224C21228j07082M5920K61214k8436J15999A66425J14746K42115j09280M8381
17214D62387p3490j55831j4087J48971J27867A53790A1432M95202O0762A10503
17203B95534J47372j40614R2825J11688A96460J72166j15478r9705L36715n5210
17193D34948F9405N81265r1095F6847M46416j10909O3260P4605B01721K46285
17183D48006j16004J50815j35491n1287N4730R9263r8291k7999J02405B5847L52138
17172C77985e775A67127K09519K49262j35418J4768M6939j78791j19005j05885
17162A48516K89062j26646j0003N4239j1847J7851A48361a47245B53502L24361
$$ plain form
17235 289166 559434 659691 168034 361347 368142 359557 182901 203790 423916 373594 321228
17224 321228 214146 260066 521280 492844 608843 166425 281171 523286 414006 462387
17214 462387 388897 233066 218979 367950 495817 153790 11432 506634 567396 110503
17203 295534 442906 302292 395117 506805 196460 368626 253148 153443 490158 434948
17193 434948 69405 650670 559575 66847 513263 402354 465614 540219 201721 448006
17183 448006 332002 482817 347326 296039 350769 450032 351741 323742 426147 25847 377985
17172 377985 -5775 167127 376646 625908 490490 505258 552197 373406 254401 148516
17162 148516 437578 310932 300929 355168 343321 361172 148361 -147245 253502 577863
17152E77863j39435j33854J27900j5921J0739j42766J95227j12721A74128L18436
17142D92564l154A76663K61540J05679A21062K73030N02437D22450J91533N9668
17132F73651o6636q6240L656B54631K26947K20835J43349l46530J21146B79158
17121E01865l062J50105A14082K24710L20747k01353J13280K41994j10301l44024
17111C59135L24732B56261J66516K79098n2638j86925M91013D42150l3885R5629
17101E03894m9665J11706J57682C13848K85292m4711L22805k91019A81908K31235
17091D13143K64665L15405j89946k06722k55052K04636J883K9641j21659J10335
17081E66329K24909C23898J97720k8692J6285K90305k2491l7063j14338O601n3111
$$ plain form
17152 577863 438428 304574 432474 416553 427292 284526 479753 367032 174128 492564
17142 492564 489410 176663 438203 543882 121062 394092 896529 422450 613983 673651
17132 673651 607015 520775 524431 254631 481578 702413 845762 499232 620378 279158
17121 501865 498803 648908 114082 338792 659539 458186 571466 813460 703159 359135
17111 359135 683867 256261 422777 701875 649237 462312 953325 442150 408265 503894
17101 503894 454229 565935 723617 313848 599140 554429 877234 586215 181908 413143
17091 413143 677808 993213 803267 596545 341493 546129 548012 577653 455994 566329
17081 566329 791238 323898 521618 492926 509211 799516 777025 739962 625624 632225 579114
17070E79114K13095j56310M4558k01148K20432k31860J32600K58270Q174k5415
17060H41510j11234k3389J7643j48813M09733l90776O20365n38951K71437j15329
17050H32196L8866k8101N0783K96536l19825m3267R7550j12171L50236m24978
17040G37825J47263N9407j63939P6595L2016o830J13250j10378J55703r2268L5115
17029I83759j57594l9197K98701q847l30406N07567q9078j98119O8623Q0032m61034
17018F54407L77784Q9999q061l64816J00233k8225l1341M22481l1095k9906k30246
17007I21214m0673K09781m9917K88844l46926p1779N08307J4983m19430L36678
16997A351082k07068L11507l72401L23914m76049M11486k30083J27270J0834j94867
$$ plain form
17070 579114 792209 635899 680457 479309 699741 467881 600481 858751 866925 841510
17060 841510 730276 706887 724530 575717 985450 594674 1215039 676088 947525 832196
17050 832196 871062 842961 893744 1190280 870455 827188 924738 812567 1162803 737825
17040 737825 885088 944495 780556 857151 889167 882337 995587 885209 1040912 948644 983759
17029 983759 826165 786968 1085669 1076822 746416 1253983 1164905 966786 1035409 1115441 654407
17018 654407 1032191 1122190 1114129 749313 849546 821321 789980 1212461 1181366 1151460 921214
17007 921214 880541 1090322 1040405 1329249 982323 910544 1418851 1433834 1014404 1351082
16997 1351082 1144014 1455521 1083120 1407034 930985 1342471 1112388 1239658 1250492 1055625
16987A055625L37148j27197K19112j31024j30432M61390l81079k17020J35727
16978A222250R8919J37497j62247n2318K60319k81520K33300k12757K551j04465
16968A141529L24179p3918O742k31527M24529p5467L3984J46666k73125J7972
16958A441564Q9763J03661N0915J6919j4147l4577l31734M31697j9623j25751
16948A608687l8688K81870o4416K59069o1117j76257l5190p5986J25304j28410
16938A694866L10623J52512k40057k71335M95645j65545J21549J08273k05549
16929B000982k46555M61125l5406J31395r5174j77405j45542M31446Q612o345
16919B327133P587j24612q7701K69905J08708J46761o0288J81089l07435K43236
$$ plain form
16987 1055625 1392773 1265576 1484688 1353664 1223232 1684622 1303543 1086523 1222250
16978 1222250 1321169 1458666 1296419 1244101 1504420 1222900 1456200 1243443 1245994 1141529
16968 1141529 1465708 1391790 1398532 1167005 1591534 1516067 1550051 1696717 1423592 1441564
16958 1441564 1531327 1634988 1685903 1702822 1688675 1654098 1322364 1754061 1734438 1608687
16948 1608687 1569999 1851869 1787453 2046522 1985405 1809148 1773958 1697972 1823276 1694866
16938 1694866 2005489 2158001 1917944 1646609 2142254 1976709 2098258 2206531 2000982
16929 2000982 1754427 2215552 2180146 2311541 2216367 2038962 1893420 2324866 2333478 2327133
16919 2327133 2334720 2210108 2122407 2392312 2501020 2647781 2587493 2768582 2461147 2704383
16909B704383k68056Q3505j11094J91390J72802j63763P5184j86674N32929J35942
16899C166548l70407M8969K23432m7658L56542n29671J41132M34991o19816M89626
16889C293688j69373M7893j03121J71942K19258p3715k27038K04059K20903K21512
16879C806008p1305j15876L21352j37778K1516M3628j6466n8622K49559k61746
16869C780270L79202J63726O4937j98185J36248J66232j9559K8378P531J62770
16859D671550J03819k28243M45914k83105L65410j18234M06803m02171J75918
16850E137661K21670J76442q821N58672l62974l1328r7040J77619L90416J85364
16840F347681L161J08458K42412J50021J57775l14050L13600M4628J17988j2243
$$ plain form
16909 2704383 2436327 2519832 2408738 2600128 2772930 2609167 2684351 2497677 3030606 3166548
16899 3166548 2796141 2845110 3068542 3020884 3377426 2847755 2988887 3423878 2804062 3293688
16889 3293688 3124315 3172208 3069087 3241029 3460287 3386572 3159534 3363593 3584496 3806008
16879 3806008 3734703 3618827 3940179 3802401 3823917 3867545 3851079 3792457 4042016 3780270
16869 3780270 4159472 4323198 4388135 4189950 4326198 4492430 4472871 4501249 4508780 4671550
16859 4671550 4775369 4547126 4993040 4709935 5075345 4957111 5363914 4961743 5137661
16850 5137661 5359331 5535773 5526952 6085624 5722650 5691322 5594282 5771901 6162317 6347681
16840 6347681 6350842 6459300 6701712 6851733 7009508 6695458 7009058 7053686 7171674 7159431
16830G159431J94838M87637K5839K57043j05375J36457K34393L15144o211M68060
16820I167256j73030N01053l78625O05862j1809J34604M74333K83748j94451N03006
16810A0911947J81167p7109k74792O45305L40251K72774L41239J41007O15435
16801A3097224K13042J77405J29914N79581K82337J28920L18917M34899N59160
16792A5921399O61580j19720N06919K80390L24083J005714j54121M53494Q08207
16783A9687945O6641Q30596M61926L38467N84739Q24661P95339M15200Q74837
16774B4880351N77448N01432O91020N68234J391199L35283Q35823Q77808J428040
16765C2086638N79183R27280J022964N56303J160266J472539J062291O90414J586445
$$ plain form
16830 7159431 7354269 7841906 7867745 8124788 8019413 8155870 8390263 8705407 8699196 9167256
16820 9167256 8994226 9495279 9116654 9722516 9710707 9845311 10319644 10603392 10408941 10911947
16810 10911947 11093114 11016005 10741213 11386518 11726769 11999543 12340782 12481789 13097224
16801 13097224 13310266 13487671 13617585 14197166 14479503 14608423 14927340 15362239 15921399
16792 15921399 16582979 16463259 16970178 17250568 17574651 18580365 18426244 18879738 19687945
16783 19687945 19754586 20585182 21047108 21385575 21970314 22794975 23590314 24005514 24880351
16774 24880351 25457799 25959231 26650251 27218485 28609684 28944967 29780790 30658598 32086638
16765 32086638 32665821 33593101 34616065 35172368 36332634 37805173 38867464 39557878 41144323
16756D1144323P93415J471310J201990J240186J397477J614326J075258J652373
16748E1590658J412105J126262J772783J878791J191110J565583J604092J346169
16740F3487553J502764J503112J563590J588955J283034J307827J331460J110400
16732G4678695J107811J396400P82397R37356O67034J074380J23647P59545J99417
16723H1726682J70165J4005k33327k34497m81372k79709j86087j426771o24633
16714G8444456o87192j200426r55176j216734j037467j609935j197265j151847
16706F9388414j547115j721315j376845j469159j583680j234393j540751j400572
16698E7514584j600857j363029j429970j493076j439976j259430j378628j224141
$$ plain form
16756 41144323 41937738 43409048 44611038 45851224 47248701 48863027 49938285 51590658
16748 51590658 53002763 54129025 55901808 57780599 58971709 60537292 62141384 63487553
16740 63487553 64990317 66493429 68057019 69645974 70929008 72236835 73568295 74678695
16732 74678695 75786506 77182906 77965303 78902659 79569693 80644073 80767720 81527265 81726682
16723 81726682 81896847 81910852 81677525 81443028 80961656 80681947 80495860 79069089 78444456
16714 78444456 77757264 76556838 75601662 74384928 73347461 71737526 70540261 69388414
16706 69388414 67841299 66119984 64743139 63273980 61690300 60455907 58915156 57514584
16698 57514584 55913727 54550698 53120728 51627652 50187676 48928246 47549618 46325477
16690D6325477j685491j143112p83357j406658r70998j695562j024408n97866
16682C7018025r31860q82184j195127j085613p66419j040046p22841q65992p84621
16673B8743322q09728n03050q90407n90733p54983l97586o12052q69952p45407
16664B2569424k18818l80576p86852n71481k18617p40026k78073p79754p3140
16655A8522087l51114o12753j96061k46010k64961r09810l08661o63154M4706
16646A5014269J90824p44224k99164l50141k20344k85782m90827j06386r9643
16637A2608582k75928k69550j7971k55885o29186K22968r2669m54703l32953j39459
16627A0363246n22623j82416J91151k5646j72638o82085J45295L1583k08414k42021
$$ plain form
16690 46325477 44639986 43496874 42713517 41306859 40335861 38640299 37615891 37018025
16682 37018025 36086165 35203981 34008854 32923241 32156822 31116776 30393935 29527943 28743322
16673 28743322 27933594 27430544 26540137 25949404 25194421 24796835 24184783 23314831 22569424
16664 22569424 22350606 21970030 21183178 20611697 20393080 19653054 19374981 18595227 18522087
16655 18522087 18170973 17558220 17362159 17116149 16851188 15941378 15632717 14969563 15014269
16646 15014269 15205093 14460869 14161705 13811564 13591220 13305438 12814611 12708225 12608582
16637 12608582 12332654 12063104 12045133 11789248 11160062 11383030 11290361 10835658 10502705 10363246
16627 10363246 9840623 9658207 9849358 9823712 9651074 8968989 9114284 9145867 8937453 8695432
16617H695432n5j38966j22043K01901n91786M02359m89348m9040l07574j06899
16607G493981O3933k53094J4629k54294J59796n60244m5771m1756J80819k92991
16597F465008j78981k32171R5756L73495o67763L3391N6574K8907M5467l45463
16587E674220K47051l52097K2158j35744k93559K28755l15339k3180p1986m5425
16577D934854l19174M02688l03759j77469N7407j79341M4387L32319o24707K70433
16567D437638J27440l22827j44887N0427j329k2212j42411J79448j10675k45992
16557C804620J78881l60653M23l531l2635N9417J25426k42485P2358J49777j25296
16546C626302r6642p9696j27006J4099r7149j17635L20910j79308l30562q2291
$$ plain form
16617 8695432 8695377 8556411 8434368 8636269 8044483 8446842 7957494 7908454 7600880 7493981
16607 7493981 7557914 7304820 7319449 7065155 7224951 6664707 6618936 6577180 6757999 6465008
16597 6465008 6286027 6053856 6149612 6523107 5855344 5888735 5945309 5974216 6019683 5674220
16587 5674220 5921271 5569174 5591332 5455588 5162029 5390784 5075445 5052265 4980279 4934854
16577 4934854 4615680 5018368 4714609 4537140 4594547 4415206 4459593 4791912 4167205 4437638
16567 4437638 4565078 4242251 4097364 4147791 4146462 4124250 3981839 4161287 4050612 3804620
16557 3804620 3983501 3622848 3623271 3619740 3587105 3646522 3771948 3529463 3601821 3751598 3626302
16546 3626302 3529660 3449964 3322958 3337057 3239908 3122273 3443183 3263875 2933313 2851022
16536B851022N75445m61601J93868N8419l13471J78781J05084r3860K02264k43375
16526C052576l31981N1729M9529l07436K96289J05534j71067K26859j48716N5111
16516B878427l28990j51155Q3779l6161J76025m3682m49480M99089l16642j49832
16506B161378L36373m66974K36863j6844j17917J06200r0569j70507Q8166L49340
16496B415509j89251K8789l85268K37804J01334k5215J64447n48831M33752j00981
16486B132089k65488L79941l02810J33610j06653j94386M7244K0236Q9511k71856
16476A661438K34932R4564j9206j82321J51802j71458K30850k19891O7841k63867
16466A584684K4421K36402o695l89087M17573m0195N9960m95247M26495n53701
$$ plain form
16536 2851022 3426467 2964866 3158734 3217153 2903682 3082463 3187547 3093687 3295951 3052576
16526 3052576 2720595 2772324 2821853 2514417 2810706 2916240 2745173 2972032 2823316 2878427
16516 2878427 2549437 2398282 2482061 2445900 2621925 2578243 2128763 2627852 2311210 2161378
16506 2161378 2497751 2030777 2267640 2250796 2132879 2239079 2148510 1978003 2066169 2415509
16496 2415509 2226258 2255047 1869779 2107583 2208917 2183702 2348149 1799318 2233070 2132089
16486 2132089 1866601 2246542 1943732 2077342 1970689 1776303 1823547 1843783 1933294 1661438
16476 1661438 1896370 1990934 1971728 1789407 1941209 1769751 2000601 1780710 1848551 1584684
16466 1584684 1609105 1845507 1838812 1449725 1867298 1827103 1887063 1391816 1818311 1264610
16456A264610K60129q6918K039P9742K06206j20519k04956K34186j1448P9111
16446A702182p5307j19401J01065r0707K55695m01201K75444m2153l2735j7304
16436A555578r4289k57711K95864K07014m41738j50569L28833l0998l471p4698
16426A333815j39339j53904Q4315K76769r8760J92574k977k63565J12513K20140
16416A561581m4604k53265J84349l72164J53914k65578J66563K62784k2141l04181
16406A067258J7768J58712k15007j3417j01071M77053j62117K03705m13343k01993
16396H17548K61170N3003L69110n59061K86522m04106K19529J71729j30237K23737
16386A308944k76682k58986J46595J18155r3747O8389J71013k81563J49501l04566
$$ plain form
16456 1264610 1524739 1437821 1439860 1519602 1725808 1605289 1400333 1634519 1623071 1702182
16446 1702182 1626875 1507474 1608539 1517832 1773527 1372326 1647770 1605617 1572882 1555578
16436 1555578 1461289 1203578 1499442 1706456 1264718 1114149 1442982 1411984 1408513 1333815
16426 1333815 1194476 1040572 1124887 1401656 1302896 1495470 1492493 1228928 1341441 1561581
16416 1561581 1516977 1263712 1448061 1075897 1229811 964233 1130796 1393580 1371439 1067258
16406 1067258 1085026 1243738 1028731 1015314 914243 1391296 1229179 1432884 1019541 817548
16396 817548 1078718 1131721 1500831 941770 1228292 824186 1043715 1215444 1085207 1308944
16386 1308944 1032262 773276 919871 1038026 944279 1012668 1183681 902118 1051619 747053
16376G47053L49562P0482j91793O5474j11099K29135j32857j25295Q8686j09655
16366H79693k8921K73098j66009K41001l82709o1775K65172N6734l27507K25664
16356I74441P1723m6074j52612K83906k85670J70170J77841k18010M0107l48874
16346F66948K04923j71374L94380l24005J08561J05662l06837L18646p8110k6851
16336H91943j27699k16925J85184L39711j48386k24108o223N1701l5610l8043
16326F71545m05J61012Q8429j54897M5862m4286k26245P3578B78009K2184N50896
16315H51089M3834J4141C56502L12427P5118k63737N27001k0985j22836n1221
16305H12269j15448m7559J9857R2836k2157m8021r3652J51300k52574K11098P1000
$$ plain form
16376 747053 1096615 1167097 975304 1040778 929679 1158814 1025957 900662 989348 879693
16366 879693 850772 1123870 957861 1198862 816153 754378 1019550 1076284 748777 974441
16356 974441 1046164 1000090 847478 1131384 845714 1015884 1193725 975715 1015822 666948
16346 666948 871871 700497 1094877 770872 879433 985095 678258 996904 918794 891943
16336 891943 764244 547319 732503 1072214 923828 699720 693497 745198 709588 671545
16326 671545 671140 832152 920581 765684 811546 767260 541015 614593 278009 300193 851089
16315 851089 894923 909064 356502 668929 744047 480310 1007311 986326 863490 812269
16305 812269 696821 649262 669119 761955 739798 691777 598125 749425 496851 707949 778949
16294G78949m5048n3960J84535k57523J41232M04924E74449r4791N0475K768L03294
16283H36195l24341K8339K5315N3317n9253N55003D84033J47257j09931j71944
16273C49415O6756J06078n1096J49819j94393J2288K03697n376J54369K17921
16263A009478m46392B57024J45241J19652L4081K02195C12402j25128L01508Q8907
16253E77689M9712J53207J7375C68515J50762p8669K71289R789C39979A48243
16242C02704K61721o3418Q1060A40482N30228l7841l5306j06668l3859K28251
16232F85287o2543A96623M23200L8116n6043J87823C68540M4228o6851j12011
16222B33906J46039I0297J93397q2326M79938l8452B67365r4812K71620J17386
$$ plain form
16294 778949 733901 679941 864476 606953 748185 1153109 574449 479658 530133 532901 836195
16283 836195 511854 540193 565508 618825 559572 1114575 484033 631290 521359 349415
16273 349415 416171 522249 471153 620972 426579 438867 642564 637188 791557 1009478
16263 1009478 563086 257024 402265 521917 555998 758193 312402 187274 488782 577689
16253 577689 627401 780608 797983 368515 519277 440608 711897 721686 339979 148243
16242 302704 564425 501007 582067 140482 670710 632869 597563 490895 457036 685287
16232 685287 622744 196623 619823 657939 601896 789719 368540 412768 345917 233906
16222 233906 379945 90297 283694 201368 681306 642854 267365 172553 444173 561559
16212E61559j57959L18157C59209A21368K03162n2981K63090k28582J40010j41444
16202C04623n163j40124K31514J20204k01488J67572J22536k10808j21267J93918
16192D61517o8670j46482N9630a13942B30139L0226B12K76140b2380p9395E27946
16180D43877q2455p587j41918a0673B61647k4333K21885q2274K4841j41689A28398
16168E92584j25236A97425b18651A4329K94827P0242A83754N2827r3046K54491
16158C98026J9061A76080P1425J09181j46627L14704B49278K48348A63726K19288
16148C83014j11775l6122Q7016j04704L67369A96743k291J83775A13802Q1659
16138A95461J10979O2650j69121k4042j8899o0868C5046J6265K39379m8955J73006
$$ plain form
16212 561559 403600 721757 359209 121368 324530 271549 534639 306057 446067 304623
16202 304623 299460 159336 390850 511054 309566 477138 599674 388866 267599 461517
16192 461517 392847 246365 305995 -113942 230139 260365 212 276352 -22380 -101775 527946
16180 443877 361422 353835 211917 -10673 261647 237314 459199 376925 401766 260077 128398
16168 592584 467348 197425 -218651 14329 309156 379398 183754 236581 143535 398026
16158 398026 417087 176080 247505 356686 210059 524763 249278 497626 163726 383014
16148 383014 271239 235117 322133 217429 584798 196743 194452 378227 113802 195461
16138 195461 306440 369090 199969 175927 157028 96160 35046 51311 290690 241735 414741
16127D14741j1348d5302A37813K24417A53846j4881D8020Q5512R1646J4368A00475
16115F8256K73438J7697j29695J27533J10589B17075F8161C0840L10702G2278
16104B48118A16233J72215l103j41853O9360K6191J12548N2848C1419M56828k9497
16093D58750I4123R0346L46433j42233j80578O1746J19337j6687j74169k4475
16083A73843p398G1438c4049C16632a10795C29022c8167j7019C09084K45234A18653
16071B35437R4035d3373A23919b6455D26380j12514a3537B11910O6641O9395F8901
16059A06779c5914B88516E1076Q4532D2310J43666k6143K38366G9109d2691A12890
16047D46602G4598J1442J28452A01526J41929E8212L7719N9437k5560L2932L1640
$$ plain form
16127 414741 403393 -45302 137813 362230 153846 138965 48020 133532 225178 239546 100475
16115 68256 341694 359391 229696 357229 467818 217075 68161 30840 341542 72278
16104 248118 116233 288448 285345 143492 212852 239043 351591 404439 31419 488247 458750
16093 458750 94123 184469 530902 388669 208091 269837 389174 372487 198318 173843
16083 173843 166445 71438 -34049 316632 -110795 329022 -38167 -55186 309084 554318 118653
16071 235437 329472 -43373 123919 -26455 426380 313866 -13537 211910 278551 347946 68901
16059 106779 -35914 288516 51076 135608 42310 185976 159833 398199 79109 -42691 112890
16047 446602 74598 86040 214492 101526 243455 58212 95931 155368 129808 162740 194380
16036A94380F7632h7690F6941I897J88100m4351c057C49983A36512m2854R5517
16025A89175g0516K5909k80511B63822b03969B42433c432k0026l4764G755M1512
16014D9267r393a22098l0577I7340c555j67209B87081j1806l0249I2116k8187
16003F3929J85094I2213j7581J30707f1714A17636m0881d5009l7125B32424E0218
15991B13860C6989L20494J92781M34281k05290N85306l56799k6849k41251j61418
15981E78244k00027G0972K92101j29519H1781L1249K3355K51361C9208J23101
15971A62309b1927B07664L3597K3761a483E5525L02541a43522k9979D4653K33163
15960B77816c7105A36420h3923j0802A53945f6424j15324A91574l3028n5250b94340
$$ plain form
16036 194380 67632 -87690 66941 9897 197997 153646 -3057 349983 136512 93658 189175
16025 189175 -70516 -44607 -325118 263822 -203969 242433 -3432 -23458 -58222 7755 49267
16014 49267 39874 -122098 -152675 97340 -3555 -170764 287081 275275 245026 92116 63929
16003 63929 249023 92213 74632 205339 -61714 117636 76755 -45009 -82134 232424 50218
15991 213860 36989 357483 550264 984545 779255 1364561 1007762 980913 739662 578244
15981 578244 378217 70972 363073 233554 81781 113030 136385 387746 39208 162309
15971 162309 -21927 207664 241261 265022 -1483 55525 358066 -143522 -173501 44653 277816
15960 277816 -37105 136420 -83923 -94725 153945 -66424 -181748 191574 158546 103296 -294340
15948A5500c1893k00796A22698N6916J88257K0616A51187m5257a12422p4921A78921
15936E7547L67184b93827a21510B5141c6007p3712A75864O1754G7788b32967I1953
15924B41739B677J0081K26450r5524k4077R4592a16811B23828o7849J79562a01214
15912c037j33352B1863Q4484a49654D1497K41380b49492H5803e8491l8389k61826
15901c58706A73651k8619J21590r9077D3062P2617a64861B08929A2268c2044D0622
15889h4393B39192b12233J05905G9127K38321A6997b25729l4782C11815j43697
15879A68118m4118J26930b87619E6427a08227A6419J39480L63056h1754H7939
15868B36628b4775l7697b2217I5299b17151p5369a39630A529a49560H1407a08898
$$ plain form
15948 15500 -31893 -232689 122698 179614 367871 388487 151187 105930 -112422 -187343 178921
15936 57547 424731 -293827 -121510 25141 -36007 -109719 175864 237618 77788 -232967 91953
15924 241739 2677 12758 239208 143684 119607 214199 -116811 223828 155979 335541 -101214
15912 -3037 -136389 21863 106347 -149654 41497 282877 -249492 85803 -58491 -96880 -358706
15901 -358706 173651 145032 266622 167545 43062 115679 -164861 208929 12268 -32044 40622
15889 -84393 239192 -212233 -106328 79127 317448 16997 -225729 -260511 311815 168118
15879 168118 124000 250930 -287619 56427 -108227 16419 155899 518955 -81754 87939
15868 236628 -24775 -62472 -22217 95299 -217151 -292520 -139630 1529 -149560 81407 -108898
15856F2745b63197C01698A23743f6523A49280a50409O903r7864A6891a52406j11079
15845b63485a00049C2253a77347J6955P7253n8576B63951C0289a7420C76469E2124
15833a69578B67995a04747q5336a5408m7083m4534o8780A125a26877I157b88861
15821i8248D49440A60950b11023B06999D2570c15148B96646a96290q4895G4549
15810e650j26868e2686p8991D0427b1244G0971b6244K86D2369K87965J6913n0481
15798B96766E6348i4325E4678e1732A74435E0418M8192K8296O2891d9185A27926
15786B45149l1104a98059A57325E9062B2677c28255c4955j0770E0886c20716f0394
15774B02741D2402i245B5408K7751h2899H9572K6473b72580m7458G6659K21675
$$ plain form
15856 62745 -263197 301698 123743 -66523 149280 -150409 -143506 -241370 16891 -152406 -263485
15845 -263485 -100049 32253 -177347 -160392 -83139 -141715 263951 30289 -17420 376469 52124
15833 -169578 267995 -104747 -190083 -15408 -62491 -107025 -175805 1125 -126877 9157 -288861
15821 -98248 449440 160950 -211023 206999 42570 -315148 296646 -196290 -281185 74549
15810 -5650 -132518 -52686 -131677 40427 -21244 70971 -26244 -25958 42369 330334 347247 296766
15798 296766 56348 -94325 54678 -51732 174435 50418 98610 126906 189797 -49185 127926
15786 245149 214045 -198059 157325 59062 22677 -328255 -34955 -45725 50886 -320716 -60394
15774 202741 42402 -9245 25408 53159 -82899 89572 116045 -272580 -320038 76659 298334
15763B98334G5796a78836A77720a8576n2630A78458K03563e2020H2425a35769
15752A18130f2810k07017A27464c07855B67587p3435a91249k3512A97697m6973
15742A50724l9624b14822B9907J03100D7824b4142j98865A06794L3692a86209
15731A37490a25169c1137B42663b61932A88976b26485A94891I3975a94159n6535
15721b50694A40832K49454D2400L27466A3460a0395A3421b32770c9078m9432K9346
15710e9164I0275b12576R0354L697A96411a07534L8332m4831J8277j27882k35462
15699d59100a1139C1469a58874A53920N358J1649b38510R2022F8705c9298A53371
15687A15594n1739J36437a04117j17580g3423k1702K5907A18319b23529F288J75734
$$ plain form
15763 298334 75796 -178836 177720 -18576 -71206 178458 382021 -52020 82425 -135769
15752 118130 -62810 -269827 127464 -307855 267587 194152 -191249 -214761 197697 150724
15742 150724 111100 -214822 29907 133007 47824 -24142 -223007 106794 140486 -186209
15731 137490 -125169 -31137 242663 -261932 188976 -226485 194891 93975 -194159 -250694
15721 -250694 140832 390286 42400 369866 13460 -10395 13421 -232770 -39078 -88510 -59164
15710 -59164 90275 -212576 -122222 -118525 196411 -107534 -69202 -114033 -95756 -223638 -459100
15699 -459100 -11139 31469 -158874 153920 159278 170927 -238510 -146488 68705 -39298 153371
15687 115594 63855 200292 -104117 -221697 -73423 -95125 -69218 118319 -223529 6288 182022
15676A82022D7404h4244L3017D07429A36734l0276E2443c7613B36288f1454B05227
15664d3038n7451o1571d9983q5013n3153k35281a8600A79360b27566d6877j76402
15653b23279A39145a72475o5656D3408N6042h9661A60064N9876O7683j1552O4844
15642C40915b91335H2928K93069b86556i9989b319k8156n3968A29875b11772A28948
15630b0708m9794K6724l4098n7112q454F8152M5046k438O7195k2144a58690E415
15617C0327M0657a48766N6015A32766b73860j62476J88084C2880Q8422b1396k59623
15606b81019A67572b7852k6100D2350J5000c54809A52689N2709a34438L4581D4417
15594A82367b15277E3906a36567A10016c22898i5239A21135b1205B02953h0901
$$ plain form
15676 182022 47404 -84244 -51227 407429 136734 106458 52443 -37613 236288 -61454 205227
15664 -43038 -100489 -162060 -49983 -134996 -188149 -423430 -18600 179360 -227566 -46877 -223279
15653 -223279 139145 -172475 -238131 43408 99450 -89661 160064 219940 287623 276071 340915
15642 340915 -291335 82928 375997 -286556 -99989 -2319 -30475 -84443 129875 -211772 128948
15630 -20708 -70502 -43778 -77876 -134988 -143442 68152 113198 110760 177955 155811 -158690 5415
15617 30327 70984 -148766 -92751 132766 -273860 -436336 -248252 32880 121302 -21396 -281019
15606 -281019 167572 -27852 -53952 42350 57350 -354809 152689 205398 -134438 -99857 44417
15594 182367 -215277 53906 -136567 110016 -322898 -95239 121135 -21205 202953 -80901
15583e4611A6705a62224k32986a13223c3224M94l5882a2849A69048a08401E2765
15571i5324k61330A26126c4782k30191c5431E7407h6643C29593a40215O8527k4638
15560i6326A17945b5578n4183C70971B2905b19303A00228Q8670D7876a71020A32227
15548H6342a40433B43573q6314h3724A3873a81247d4576r232C0473M3268a05714
15536B57394a45598A19111J35476r9476g6519c3978A37788h5307I1745a40009
15525a92065A73821a5663p6293C68610a75488C93415A83677K20976A49165D9052
15514B8941A2395K59627C8039Q5239c8076a5278C29864j60539o9482K35238g4552
15502B8456K05612j03973i194j6412K119I7827M0740C148K55387c50814H3743
$$ plain form
15583 -54611 16705 -162224 -395210 -113223 -33224 -32730 -68612 -12849 169048 -108401 52765
15571 -95324 -356654 126126 -34782 -264973 -35431 57407 -86643 329593 -140215 -71688 -96326
15560 -96326 117945 -25578 -79761 370971 22905 -219303 100228 188898 47876 -171020 132227
15548 86342 -140433 243573 157259 -83724 13873 -181247 -44576 -53808 30473 73741 -105714
15536 257394 -145598 119111 254587 155111 -76519 -33978 137788 -85307 91745 -140009
15525 -192065 173821 -15663 -91956 368610 -175488 393415 183677 404653 149165 49052
15514 28941 12395 272022 38039 123278 -38076 -15278 329864 169325 99843 335081 -74552
15502 28456 234068 130095 -9194 -25606 -23487 97827 138567 3148 258535 -350814 83743
15490g1667C3987k371J14380a49595C9408K84290o5548c06581F5285K45883C264
15478a07969C27433K12727B60589K99195k56591j27204J49736m8400a33942C39953
15467B6250M5055a72201A0967b64125A50611a13324A1103a60472f0542A92963
15456C80013A03887n0724a88991c379A46969A2386J13124c0865B71232j00638
15446A70594m5727M99770K17926J17784K05075n30705j78005A6291K71126a03892
15435b02391F4172a19734j6921p5326J8366A32706a93116J5695E138e2004A69375
15423b50426I3409a44848A23898m8730b83146a39364q3909A22745h883B73187
15412A07547e4320B72571c31982c8269B41798n3597a9485k4321A45972l9001B3134
$$ plain form
15490 -71667 33987 31616 145996 -149595 39408 323698 258150 -306581 65285 311168 3264
15478 -107969 327433 540160 260589 559784 303193 175989 325725 277325 -133942 339953
15467 26250 71305 -172201 10967 -264125 150611 -113324 11103 -160472 -60542 192963
15456 380013 103887 53163 -188991 -3379 146969 12386 125510 -30865 271232 170594
15446 170594 124867 624637 842563 960347 1165422 634717 456712 16291 287417 -103892
15435 -202391 64172 -119734 -136655 -211981 -193615 132706 -193116 -177421 5138 -52004 169375
15423 -250426 93409 -144848 123898 75168 -283146 -139364 -223273 122745 -8883 273187
15412 107547 -54320 272571 -331982 -38269 241798 188201 -19485 -43806 145972 106971 23134
15400A06698l5965a3857p9316G6258b32700E447a23507B9297J54510A5991J09434
15389A25425M1794J7251A7012d3723F2938i8399L1018L2206B3058R112C485c2914
15376F6909a12570C4889J79740K252q0092M65401E3271j6204K06250K126A4138
15364B01426C1207J16742e8221I3741J74234c3412E4984e2074A18229C2323J58023
15353A90346c4978j03213A9981K12134g1134A24439A7569J70342J29778n7763
15343B59926R8768j20730L03344G5920K02345J0821a57880L5294A40652Q1298
15333B21950E3605B5922L39215a20099B84066a73473q7029D90242A86559k5755
15323A60804e2208j83647A83687f5223D10476F9883L0009r549J61457D3028j6608
$$ plain form
15400 106698 70733 -13857 -93173 76258 -232700 5447 -123507 29297 183807 15991 125425
15389 125425 167219 184470 17012 -43723 62938 -98399 -67381 -35175 23058 32170 3485 -32914
15376 66909 -112570 34889 214629 216881 136789 602190 53271 37067 243317 245443 14138
15364 201426 31207 147949 -58221 93741 267975 -33412 54984 -52074 118229 32323 190346
15353 190346 -34978 -138191 19981 232115 -71134 124439 17569 187911 317689 259926
15343 259926 358694 237964 541308 75920 278265 289086 -157880 -122586 140652 221950
15333 221950 53605 25922 365137 -120099 284066 -173473 -260502 490242 186559 160804
15323 160804 -52208 -235855 183687 -65223 410476 69883 99892 90343 251800 43028 26420
15312B6420J21599o6692M951J34407J4732q4778J8032R7066J25575B1374i070
15300e7860B11618J15895b1661j53408A73094b12280C8385i8969a5285D06470
15289b5419G358i4568B28160A01249a49477D9068M7886a23658l1978o8132E8489
15277c0877A55015d18555F6413J31419a64028A5325J47542a58618B27759b47905
15266g1560B29789B4726N8201M8625C9419e0437D3452c9483B5954a02731A45218
15254a51212B7398L2703j3286c6228j73037O7295r7376A27722C9868K78291K58118
15243E76277Q94157m55146K41074J43920C21035L3390A8587O7212K69513a01849
15232A6504J07475d42405E9303L1648g6001F1964b39628a06276g884l9485C16326
$$ plain form
15312 26420 148019 81327 86278 220685 235417 150639 168671 265737 391312 21374 -9070
15300 -57860 211618 327513 -21661 -175069 173094 -212280 38385 -98969 -15285 406470
15289 -25419 7358 -94568 228160 101249 -149477 49068 96954 -123658 -155636 -223768 58489
15277 -30877 155015 -418555 66413 197832 -164028 15325 162867 -158618 227759 -247905
15266 -71560 229789 24726 82927 131552 39419 -50437 43452 -39483 25954 -102731 145218
15254 -151212 27398 60101 46815 -36228 -209265 -141970 -239346 127722 39868 318159 576277
15243 576277 1470434 1015288 1256362 1400282 321035 354425 18587 85799 355312 -101849
15232 16504 123979 -442405 59303 90951 -76001 61964 -239628 -106276 -7884 -47369 316326
15220b1965A89735a57304A02844a6296B38693h7234A2106b1033G1131k0255b8045
15208B41051O6347a02765D2467J43532a35356A95050J9971D7460a31551M8530
15198h3021A5304O0750E560R4779b05959L154A00578D6753K7002b7507k278E8200
15185b39047B74690d29239B34217A06446B4868e9688A96352b8159a830G354M65329
15174D72683k5199a25460J0379B15861f6752j07079O9902B8049e19H134K30318
15163B38452b72151F0169k1087d8655j76486B3330P7116a41225F0074b28873C9273
15151a36923B0220d4839C1487P1033L04456a52077B06757M7650I5472J14696F6052
15139A12896f0094D7866c4317A14041c10170B50237h6192C52768j45892H6494
$$ plain form
15220 -21965 189735 -157304 102844 -16296 238693 -87234 12106 -21033 71131 50876 -28045
15208 241051 307398 -102765 42467 185999 -135356 195050 215021 47460 -131551 -83021
15198 -83021 15304 76054 5560 100339 -205959 -202805 100578 46753 73755 -27507 -29785 58200
15185 -239047 274690 -429239 234217 106446 24868 -59688 196352 -28159 -1830 7354 472683
15174 472683 447484 -125460 -115081 215861 -66752 -173831 -103929 28049 -519 8134 238452
15163 238452 -272151 60169 39082 -48655 -225141 23330 100446 -141225 60074 -228873 39273
15151 -136923 20220 -44839 31487 102520 406976 -152077 206757 254407 95472 210168 66052
15139 112896 -60094 47866 -34317 114041 -310170 250237 -86192 352768 206876 86494
15128e8625B9519a8014B13648E1263L9954K0178a31286a9541E8068L09766q1673
15117B86161e5625A73239A5353K85147A2814L54684a34103A55907O6923C5625
15106b9451A57799C877O3952c5622d190B88807F887J02594K94970g7751E8820
15094A57857J355a96012B29210n5343G4940P7436p3957R4408H3900L47166A97016
15082a3666n8222M938l43402a34994A20722b55419G3420L3000J37065B4166J32403
15071A56569D8835J80248O4596j09650H4913K20394q7267R1164K2802C191K36163
15060B39354j05719J85447D8551J28461L2490A02671d9747A31885d649I4444J5211
15049A09655J11616N3389K84129j49475A9255K89394k3390j26812J4719K32626
$$ plain form
15128 -58625 29519 -18014 213648 51263 91217 111395 -131286 -19541 58068 367834 286161
15117 286161 -55625 173239 15353 300500 12814 367498 -134103 155907 222830 35625
15106 -29451 157799 3877 67829 -35622 -4190 288807 6887 109481 404451 -77751 58820
15094 157857 159212 -196012 229210 173867 74940 152376 78419 172827 83900 431066 197016
15082 -13666 -71888 -66950 -410352 -134994 120722 -255419 73420 106420 243485 24166 156569
15071 156569 48835 229083 293679 184029 84913 305307 218040 309204 332006 3191 239354
15060 239354 133635 319082 48551 177012 209502 102671 -49747 131885 -4649 94444 109655
15049 109655 221271 274660 558789 409314 19255 308649 285259 158447 173166 405792
15039D05792a3078B90661H6030D2479K24440o1776J68677l6632q548J37473m1592
15028D24521J46703n2703R1916j57665a17554D20332j02494K9215N6935J42909
15018E46897o7982B23112L59978F5069K55095m3519n5547L19219L8933k85151
15008B94099R4913j08728J10729A33087J08109q9208J46248N1654j0873j65349
14998A73668J14919M6042D7133M02880l8250J0684k03090J8159J91883m5439j6391
14987C67569J95208B21542n9995K45879r3378R796M00802J85473j09997C78494
14976A95631J67847J46476k13744K69756K72245C19508J28806R2508j82063J85895
14966E44654B32113k1568R4780G8376Q2073O3665r5302K87318c1313n1909B36842
$$ plain form
15039 405792 -13078 290661 86030 42479 266919 205143 373820 337188 328640 466113 424521
15028 424521 571224 518521 610437 452772 -117554 420332 317838 347053 403988 546897
15018 546897 478915 223112 583090 65069 320164 276645 221098 540317 579250 294099
15008 294099 389012 280284 391013 133087 241196 151988 298236 349890 339017 173668
14998 173668 288587 334629 47133 450013 411763 422447 219357 237516 429399 383960 367569
14987 367569 562777 221542 161547 407426 314048 323844 724646 910119 800122 378494
14976 195631 363478 509954 296210 565966 838211 319508 448314 540822 358759 544654
14966 544654 232113 210545 305325 78376 160449 224114 128812 416130 -31313 -83222 236842
14954E48859B01355J20135J33161M2740p0274I1286L72811j62953j41398K30347
14944C90093A11531K41440A56013p2258J04374E1647N4787K40643A59289K79988
14934D39277J957J62302k50906O78544l91394K56980K2512J01110L74694m52854
14924I42222N2802P2668k40866L49711K79702M15123k62858k381j95037l19388
14914A091698l08368K5330B88331K0097J17563L26565o4684C41925e8619C83518
14903G21691C36155r5694m2480l9534K21790R1484k17584A09856L30450B19407
14892C48415r506j42280R8455n5624M065M23803r9984K83536l94369R6661P2760
14881F25932Q6084Q2097k48200J7517K62748B41548J57124L3876j65348O8817
$$ plain form
14954 548859 201355 321490 454651 497391 427117 91286 464097 301144 159746 390093
14944 390093 111531 352971 156013 83755 188129 51647 106434 347077 159289 439277
14934 439277 441234 603536 352630 1031174 639780 896760 919272 1020382 1395076 942222
14924 942222 995024 1067692 826826 1176537 1456239 1871362 1608504 1606123 1411086 1091698
14914 1091698 783330 808660 288331 308428 425991 752556 687872 341925 -58619 383518
14903 721691 336155 240461 197981 158447 380237 471721 254137 109856 440306 219407
14892 348415 338909 196629 295084 239460 243525 667328 567344 850880 456511 553172 625932
14881 625932 712016 794113 545913 563430 826178 241548 398672 432548 267200 336017
14871C36017B4104J67401J42401J40167J72075k87082A63193L2418N11383B45245
14860C94135J53007e534B91451B2682K74962d1440H3331K83769K5155q1848K15709
14849E26116k26817J10743J34001K3603O1111K64768k25144K61607k91273K02488
14839H41203r3317j71035B73018M58323B06202J41904R7336K46546j23718o9551
14829D98719j67798O648N6935K91635j99021J1586M7367O3126j04815k00660J18450
14818D22172J51727O2599B20505L36691P8930j67290A69204J41247K77748K40415
14808H28614l43331M4410J81564l6806J97976O658k41800k50750J81908J42566
14798G11009j96251M6613B36221O3757K94174j78472J58642k24937j27181K99772
$$ plain form
14871 336017 24104 191505 333906 474073 646148 359066 163193 195611 706994 245245
14860 394135 547142 -5534 291451 22682 297644 -41440 83331 367100 392255 310407 526116
14849 526116 299299 410042 544043 567646 628757 893525 668381 929988 638715 841203
14839 841203 747886 576851 273018 731341 206202 348106 445442 691988 568270 498719
14829 498719 330921 337569 394504 686139 487118 498704 546071 609197 504382 303722 422172
14818 422172 573899 636498 220505 557196 636126 468836 169204 310451 588199 828614
14808 828614 485283 529693 711257 674451 872427 879085 637285 386535 568443 711009
14798 711009 514758 561371 236221 299978 594152 415680 574322 349385 222204 521976
14788E21976j31545L87209C72816A18893L77408B18132J88412A74388L94126P7522
14778F46036M2698N6877O8415n9512k68474L77980C18576J42784J24164k35094
14768C50430J81630j67615l2950p1620L28255k73647Q3227N9030j1847L6805l3997
14757D47701o2379J11283k15971J7794P1279j15957J75127k08250m1270L21054
14747E00411j11334K80659j87977j53846A51193N55628j73820J48096o6475K4639
14737F39261K48247A66533L10299K43067L0870J33384j38067M9393R4057R5972
14727I85508K83765J52072n05938J25640j64158l4256n5043K24093A30923O04128
14717G35051q0823l7622j38354m5948Q6994J71813q4239J68981j02783l10359
$$ plain form
14788 521976 390431 777640 372816 118893 496301 218132 406544 174388 568514 646036
14778 646036 688734 745611 814026 754514 486040 864020 318576 461360 585524 350430
14768 350430 532060 364445 331495 259875 588130 314483 397710 456740 444893 481698 447701
14757 447701 385322 496605 280634 298428 369707 253750 428877 220627 179357 500411
14747 500411 389077 669736 481759 327913 151193 706821 533001 681097 614622 639261
14737 639261 887508 166533 476832 719899 750769 884153 746086 795479 889536 985508
14727 985508 1269273 1421345 915407 1041047 876889 842633 787590 1011683 130923 735051
14717 735051 654228 616606 478252 432304 519298 691111 606872 775853 673070 362711
14707C62711P29401l63028K46635J13900L9718K01891L48761m0498p29732r6787
14697H12972p5495J95550k20268K4752J12960l31393k3085K49693J26046p7361
14687G94371j57296N7254l13784L55480p2574q8092K22070j65286m4069j09445
14677D78629J65507L01778m60066M4521N6707J97343j95893J2824k35518K57299
14667F23131K69080m14512M20641k86596j81576J72485J79295j71858j16271M64091
14657I57910p9417k54998L27000m5711j55974m2530L5760J23921k31908M4133
14647F78186o0425Q7674O1162j23218P2684J91637K04333k24027k63435J42794
14637G67365n2778j9379M00343n2057l33720L05551j40423K62491j07404k76873
$$ plain form
14707 362711 1092112 729084 975719 1089619 1129337 1331228 1679989 1639491 909759 812972
14697 812972 737477 933027 712759 737511 850471 519078 495993 745686 871732 794371
14687 794371 637075 694329 380545 736025 663451 575359 797429 632143 588074 478629
14677 478629 644136 945914 485848 530369 587076 784419 588526 601350 365832 623131
14667 623131 892211 477699 898340 611744 430168 602653 781948 610090 493819 957910
14657 957910 878493 623495 950495 904784 748810 706280 742040 865961 634053 678186
14647 678186 617761 705435 766597 643379 716063 907700 1112033 888006 624571 767365
14637 767365 714587 695208 1095551 1043494 709774 1015325 874902 1137393 1029989 753116
14627G53116N1485K08143k48798R8724j54742Q6322N42999n67054M60717j53529
14617A077383l96004M01243l26196L12215l93697j19471M96504o8243K4680J13357
14607A121771m51623L56587n66j98824M33320m0440k15506K15395j81906k48777
14597G89431L82456Q1112l90692K98716L5190N9057Q4179l13683M8561J57954
14587A232281j88109J00333j96824L13235j78563L75394j55499q6274K68192k78263
14577A205903O1234J10636r3707J55955M22626j42215l47124K94920j71528J1793
14567A508493l9051L0339K28432J1012K0115j23995P8012M12106j75838k42355
14557A707270L91518K8079j16843P20525m7913l6392J075812L15132J482486L415978
$$ plain form
14627 753116 804601 1012744 763946 862670 707928 794250 1337249 770195 1230912 1077383
14617 1077383 681379 1082622 756426 1068641 674944 555473 1051977 983734 1008414 1121771
14607 1121771 670148 1026735 1026169 827345 1260665 1220225 1004719 1220114 1038208 789431
14597 789431 1171887 1252999 862307 1161023 1196213 1255270 1339449 1025766 1074327 1232281
14587 1232281 1044172 1144505 947681 1260916 1082353 1457747 1302248 1215974 1484166 1205903
14577 1205903 1267137 1377773 1284066 1440021 1862647 1720432 1373308 1668228 1496700 1508493
14567 1508493 1469442 1499781 1728213 1739225 1759340 1635345 1713357 2125463 1949625 1707270
14557 1707270 2098788 2126867 2010024 2730549 2682636 2646244 3722056 4037188 5519674 8935652
14547H935652R784909J9596849p946521A3179667o504524k597193j051342M14978
14539C441586J001604j445852j205998j41403r6538k20106O5786l07575N31782
14530A623286M792k02069J83027K4348j89730K33788n3657L4038j63803N3745
14520A547765L97523k05145m3059j04803M09721l14527Q8785P9834j61990M22569
14510B116673j78619m787J11677j15512q0482J16591K3993P9438J71547m9807
14500B190712k01249n5561M27704p9721j97830L05865Q2694M866j53510j05472
14490B218498L97907j82018J55350j64076o6674K05069k29137r2298L86383j19260
14480B509744J28120P3529p8109K57873l46274N19063j33557k07794K75054l4185
$$ plain form
14547 8935652 18720561 38317410 30370889 13179667 6675143 4077950 3026608 3441586
14539 3441586 4443190 2997338 1791340 1649937 1553399 1333293 1399079 1091504 1623286
14530 1623286 1628078 1426009 1609036 1633384 1443654 1677442 1623785 1657823 1494020 1547765
14520 1547765 1945288 1740143 1697084 1592281 2002002 1687475 1776260 1856094 1694104 2116673
14510 2116673 1938054 1933267 2044944 1929432 1848950 1965541 1989534 2068972 2240519 2190712
14500 2190712 1989463 1933902 2361606 2281885 2084055 2389920 2472614 2477480 2323970 2218498
14490 2218498 2616405 2434387 2589737 2425661 2358987 2564056 2334919 2242621 2629004 2509744
14480 2509744 2637864 2711393 2633284 2891157 2544883 3063946 2930389 2722595 2997649 2963464
14470B963464J04479l7143N1355j03301K20549j87104J74950J00020n7907J49766
14460C379128k19006P597L84877j62258L96086j95444j5165J1502K1109k06361
14450C402065M29649l1915l60898O61656l63115R4235L39080j30229n9922L63899
14440D344505J53614j96389J78925j5001Q1045q3425K61457M3506K49819m78459
14430D539597N26714q7148j97202L62254M66440k82516J69376Q6795L27009m8438
14420E862881l915j93683J53380K28949J88169j52645K7318l684J23489J31053
14410F361312L48938m11090O15327n2823l2892J99700K80870m33792M53670L59045
14400G688265m62333M46414J99928J34835j24442L30225J64833N280P9552M38291
$$ plain form
14470 2963464 3067943 3030800 3082155 2978854 3199403 3012299 3187249 3287269 3229362 3379128
14460 3379128 3160122 3167719 3552596 3390338 3786424 3590980 3575815 3587317 3608426 3402065
14450 3402065 3831714 3799799 3438901 4100557 3737442 3831677 4170757 4040528 3980606 4344505
14440 4344505 4498119 4301730 4480655 4465654 4546699 4463274 4724731 4768237 5018056 4539597
14430 4539597 5066311 4979163 4781961 5144215 5610655 5328139 5497515 5584310 5911319 5862881
14420 5862881 5858966 5665283 5818663 6047612 6235781 6083136 6110454 6106770 6230259 6361312
14410 6361312 6710250 6299160 6914487 6861664 6828772 7028472 7309342 6875550 7329220 7688265
14400 7688265 7225932 7672346 7872274 8007109 7882667 8212892 8377725 8383005 8462557 8900848
14390H900848k82771L24397M49342K32834K78976J34019J74708K72371K4902J13444
14380A0623070L02639Q2977j21782K29686K90950K14734J75347J76410L12121
14371A2286152M19711J25383O80416Q9415J60984M30170M5831M91425j56542N80828
14361A5153773N21479J49925P35309L73882K16340J23053L45328N81123O84848
14352A8885060K42088M47960L21739P25180N63848O04306O53097M50319O77910
14343B3571507M95360L21513J066992Q59029O12301Q72196P37394R55552P09652
14334C0201496P98810Q38527J305706R91308Q47531J544753R61242J149716J405288
14325D0044377J388554R33029K043438J373819J536389J687871K032867J469559
$$ plain form
14390 8900848 8618077 8942474 9391816 9624650 9903626 10037645 10212353 10484724 10509626 10623070
14380 10623070 10925709 11008686 10886904 11116590 11407540 11622274 11797621 11974031 12286152
14371 12286152 12705863 12831246 13511662 13601077 13762061 14192231 14238062 14729487 14572945 15153773
14361 15153773 15675252 15825177 16560486 16934368 17150708 17273761 17619089 18200212 18885060
14352 18885060 19127148 19575108 19896847 20622027 21185875 21790181 22443278 22893597 23571507
14343 23571507 24066867 24388380 25455372 26314401 26926702 27798898 28536292 29491844 30201496
14334 30201496 31000306 31838833 33144539 34135847 34983378 36528131 37489373 38639089 40044377
14325 40044377 41432931 42365960 44409398 45783217 47319606 49007477 51040344 52509903
14317E2509903K021927K473020J894908K478922K698436K684800K651218L412150
14309G2825284L341909L014571L119650M346355M172741M389609M610847M987576
14301A04808542N690211N613496O090468O692285P107767P149916Q194897Q556277
14293A59903859R304566R782631J0148188J1216306J1523856J2957811J2907804
14286B37745021J3598767J4587109J4804887J6080046J5890502J6544861J6699456
14279C45950649J6461139J5903582J5238602J4160331J2366645J0201453P163244
14272D37445645K681198j306170j747225n701209q337451p691139q270327j0737284
14264C96336038j1431927j2698660j4478792j5583751j7264457j7022009j6775212
$$ plain form
14317 52509903 54531830 57004850 58899758 61378680 64077116 66761916 69413134 72825284
14309 72825284 76167193 79181764 82301414 86647769 90820510 95210119 99820966 104808542
14301 104808542 110498753 116112249 122202717 128895002 136002769 143152685 151347582 159903859
14293 159903859 169208425 178991056 189139244 200355550 211879406 224837217 237745021
14286 237745021 251343788 265930897 280735784 296815830 312706332 329251193 345950649
14279 345950649 362411788 378315370 393553972 407714303 420080948 430282401 437445645
14272 437445645 440126843 438820673 437073448 431372239 423034788 415343649 407073322 396336038
14264 396336038 384904111 372205451 357726659 342142908 324878451 307856442 291081230
14257B91081230j6271811j5537335j4270133j4195596j3043296j2826812j1538715
14250A93397532j0455989r485586r296874r099026q370268p455215o914470p181360
14242A25138744o156910o065991n625039n267623m489834m429013m075156m448376
14234H4580802l909316l378895l172480k937065l019654k781602k716936k606325
14226F0058529k173620k193396k362432j313880k319911j686207j528991j877914
14218D4602178j715175j346221j568726r25633j283644j139959j290284j355439
14210C3977097r09500r27044q91078k93543j248937q67943q86389q61290p92590
14201B6298783n20838o77546l89545j062493p25200p24444m19157n76297n0443
$$ plain form
14257 291081230 274809419 259272084 245001951 230806355 217763059 204936247 193397532
14250 193397532 182941543 173455957 164159083 155060057 146689789 139234574 132320104 125138744
14242 125138744 118981834 112915843 107290804 102023181 97533347 93104334 89029178 84580802
14234 84580802 80671486 77292591 74120111 71183046 68163392 65381790 62664854 60058529
14226 60058529 57884909 55691513 53329081 52015201 49695290 48009083 46480092 44602178
14218 44602178 42887003 41540782 39972056 39046423 37762779 36622820 35332536 33977097
14210 33977097 33067597 32140553 31249475 30955932 29706995 28839052 27952663 27091373 26298783
14201 26298783 25777945 25100399 24710854 23648361 22923161 22198717 21779560 21203263 21152820
14192B1152820q57494l78625m40688m35356m33986o74815l58577l25411l72145
14183A6875723m90902l04258m81304n07879r6904k20915n04405l42315J13582
14174A4040423l37743j14385l31608k97591j10816m06306l64392j84508k6859
14165A1866215r0599j62237m62835k45206k4269l39344k47426Q275m01497j55206
14155I745871Q4864k81028l88821Ok99345n4265J95926m68843j31209q1401K8197
14144H349952l61109l6566j31926k97455N8455o3977j75417j16622j0705K9669
14134G244299l23003J39761m79486K18248m58375L40491n75300M40761m38359
14125F109037L02027l78404k0146k57960M713K08299m27297K24053m65034K33870
$$ plain form
14192 21152820 20295326 19916701 19476013 19040657 18606671 17931856 17573279 17247868 16875723
14183 16875723 16384821 16080563 15599259 15091380 14994476 14773561 14269156 13926841 14040423
14174 14040423 13702680 13588295 13256687 12959096 12848280 12441974 12077582 11893074 11866215
14165 11866215 11775616 11613379 11150544 10905338 10881069 10541725 10294299 10302574 9901077 9745871
14155 9745871 9830735 9549707 9160886 9160892 8861547 8807282 9003208 8534365 8403156 8321755 8349952
14144 8349952 7988843 7952277 7820351 7522896 7581351 7517374 7341957 7225335 7214630 7244299
14134 7244299 6921296 7061057 6581571 6799819 6341444 6681935 6106635 6547396 6109037
14125 6109037 6411064 6032660 6012514 5754554 5759267 5967566 5540269 5764322 5299288 5533158
14115E533158m49937N07567m93552r1640J33084j90267N7281R72l27616n1852
14105D627198j01364J83960k49350K22334j20814k93890M0580M05789m55796J15147
14095D373794j87819j97004J02782L57239j24090j20683k82457L67512m66286
14086C822988r3071K96643j22672l15236K46705l03309Q5631k84001K44702j94982
14076C383398k26926L40578j24113q7528j555j87511P1613J84750k12961O5548
14066C205293M9200J20685L7436j77038q154j71297M45660n85082K44163k24157
14056B936709K55702j99307o2349o3814P4535l02440J53511K69205m22459j00167
14046B539126L23286k99551l92853K53411K81576k45116j09082k91832K35071
$$ plain form
14115 5533158 5083221 5590788 5097236 5005596 5138680 4948413 5005694 5006666 4679050 4627198
14105 4627198 4525834 4709794 4460444 4682778 4561964 4268074 4308654 4714443 4258647 4373794
14095 4373794 4185975 3988971 4091753 4448992 4324902 4204219 3921762 4289274 3822988
14086 3822988 3729917 4026560 3903888 3588652 3835357 3532048 3617679 3333678 3578380 3383398
14076 3383398 3156472 3497050 3372937 3285409 3283854 3096343 3167956 3352706 3139745 3205293
14066 3205293 3254493 3375178 3412614 3235576 3227422 3056125 3501785 2916703 3160866 2936709
14056 2936709 3192411 2993104 2930755 2866941 2941476 2639036 2792547 3061752 2639293 2539126
14046 2539126 2862412 2562861 2170008 2423419 2704995 2459879 2350797 2058965 2294036
14037B294036L46271k73938r7340J76715M1291m14968N45359q2372J85026o23997
14027B096083Q2518K31508m03552R0123k51772J81711J02979r2409R5444j73267
14017A959366r6110J9010l6416J39617o9436m97061K87616M13874k74567k23604
14007A622289k8207r9896p58L18388J20271k78933l6308K63464k30550j1599J21226
13996A759387m47028J52043J23557j16791j44719J20792N35075M60087K097162
13987D539565O746525J8915306O529292j7314493q732952l634112k212806j030080
13979C806245m91871o21967J1973k78191k71636K21665m38357j30890L8604l54078
13969A491497J74474r0205m7416J36124k3977M69997m75721j48948J96117j47664
$$ plain form
14037 2294036 2640307 2366369 2269029 2445744 2487035 2072067 2617426 2535054 2720080 2096083
14027 2096083 2178601 2410109 2006557 2096680 1844908 2026619 2129598 2037189 2132633 1959366
14017 1959366 1863256 1882266 1845850 1985467 1916031 1418970 1706586 2120460 1845893 1622289
14007 1622289 1594082 1494186 1493428 1811816 1932087 1653154 1616846 1880310 1649760 1638161 1759387
13996 1759387 1312359 1464402 1587959 1471168 1326449 1447241 1982316 2442403 4539565
13987 4539565 11286090 30201396 36730688 19416195 10683243 7049131 4836325 3806245
13979 3806245 3314374 2692407 2704380 2426189 2154553 2376218 1937861 1806971 1845575 1491497
13969 1491497 1665971 1575766 1528350 1664474 1640497 2110494 1634773 1485825 1681942 1534278
13959A534278r1739Q6681q1802L6828K9420Q7060j28539k35486L45665j82232
13949A400134j1923o722K56218k41675p1880Q634J57572j98664j47283K33008
13939A377419k60143O6260o4234K18075J93257J01982n01207J12284O9500j50094
13929A163099J36060j30883n0418j7091k4195k1267J67764j9406J60113m17582
13919I46194Q7169L228l363K04036l3009m20237M62741l06285l509J27594Q2964
13908A147523l71915K82412k5611R7476N3228m56815K62490q4325O4684j54202
13898H14945l73803O12557j39905J65313k99910L16390l03111M4381K28727l1048
13888A034536j50098l29344K72914L81040k95233j34439K82256l08514K70983
$$ plain form
13959 1534278 1442539 1529220 1447418 1484246 1513666 1600726 1472187 1236701 1582366 1400134
13949 1400134 1388211 1381489 1637707 1396032 1324152 1332786 1490358 1291694 1144411 1377419
13939 1377419 1117276 1183536 1119302 1337377 1530634 1632616 1131409 1243693 1313193 1163099
13929 1163099 1299159 1168276 1117858 1100767 1076572 1055305 1223069 1203663 1363776 946194
13919 946194 1033363 1036591 1033228 1237264 1204255 784018 1246759 940474 936965 1064559 1147523
13908 1147523 775608 1058020 1032409 1129885 1183113 726298 988788 904463 969147 814945
13898 814945 441142 1053699 913794 1079107 779197 1095587 792476 836857 1065584 1034536
13888 1034536 884438 555094 828008 1209048 913815 779376 1061632 753118 1024101
13879A024101n3283k19836R1497M2659j0698K8071C70889L42757L50029l36286
13869G27389j86443N89468m33704L4947j27455J94635j5944j37193K24976L26904
13859A197580m90553J68153J27991k29936J4872R1568o7226M9148p3468k67347
13849E20782K31353J24832m25679L12689M9238j19719j47269J38523K2804k57855
13839D49699L24819j04528K03482q6748j82770J09352Q893K4887j23951J47968
13829G71103j00912m1744N9158M1911J15538j97588j834P5397l29038o8893M56919
13818G80017k01469K49372k92421J26679l00999J34014R6282K63556C64204O1072
13808D25276J86085J52081m6187k39163K89667j67436L6560j94240M03011j71583
$$ plain form
13879 1024101 970818 750982 842479 885138 874440 902511 370889 713646 1063675 727389
13869 727389 540946 1130414 696710 731657 604202 798837 782893 645700 870676 1197580
13859 1197580 707027 875180 1003171 773235 788107 879675 812449 861597 788129 520782
13849 520782 752135 876967 451288 763977 813215 693496 546227 684750 707554 449699
13839 449699 774518 669990 873472 786724 603954 713306 722199 747086 623135 771103
13829 771103 670191 628447 687605 729516 845054 647466 645632 721029 391991 323098 780017
13818 780017 578548 827920 535499 662178 361179 495193 591475 855031 364204 425276
13808 425276 611361 763442 717255 478092 767759 600323 636883 442643 845654 674071
13798F74071k46238J63360o88j3323m4153k8245L55247n5848k27121j41943j86336
13787B48783K58852J71643j21452J46723m6684n3513j87977L06941j10594j88837
13777D23885A89520N19178Q85C50399L97670j25331J48765B01432L62544r2706
13767D71270p5756N4511K19650l11992J16932k08113J70527J40773k09541J39321
13757E07582J7618O2281m3200k15351J88461G6243L82479j09669J82566k37906
13747B93713k8133K46910j9882J40999j77125J02442k28463L61018B67681N08005
13737G75686C83552k6025K84189q7610j72000r8807L50417k8259k55815M40266
13727G89908j25161B42026K87816J02897C07538J96610B51885L64269k21654L5796
$$ plain form
13798 674071 427833 591193 590505 577182 533029 504784 860031 804183 577062 435119 248783
13787 248783 507635 679278 557826 704549 657865 604352 416375 723316 612722 423885
13777 423885 189520 708698 709583 350399 748069 622738 771503 201432 563976 471270
13767 471270 395514 450025 669675 357683 474615 266502 437029 577802 368261 507582
13757 507582 525200 587481 544281 328930 517391 76243 458722 349053 531619 293713
13747 293713 265580 512490 492608 633607 456482 558924 330461 691479 267681 775686
13737 775686 383552 357527 641716 554106 382106 283299 633716 605457 349642 789908
13727 789908 664747 242026 529842 632739 307538 504148 251885 616154 394500 430296
13717D30296A66199K04039J87915J8797M5639j52019A68892m6590J66218p9381
13707B09139K09932k09327K81908k28685j1348J01464K74557k80298L76185C10678
13696C55705L70727l59232A38494L40055l6286j43360J86115A50000N2559M90280
13686F92839j49157l3044I0463R8237K83149k14553L13699B31096J82736j53481
13676B60351I1839K26389B6041K84426N7581K6052J60379B40210o1040K94161
13666D73331p6509J20816j20454j30419K43083A39851J56869Q4887j50629K06595
13656D37573o9912l673J51865B07663j03744J48855K43825A77406N03044A10983
13645B85920M8181O2187q4286L37581N5880l52359c3398D91993j42080j20900
$$ plain form
13717 430296 166199 370238 558153 576950 622589 470570 168892 122302 288520 209139
13707 209139 419071 209744 491652 262967 251619 353083 627640 347342 723527 310678
13696 355705 726432 367200 138494 478549 442263 298903 485018 150000 202559 692839
13686 692839 543682 510638 90463 188700 471849 257296 570995 231096 413832 260351
13676 260351 91839 318228 26041 310467 368048 394100 554479 240210 179170 473331
13666 473331 396822 517638 397184 266765 509848 139851 296720 381607 230978 437573
13656 437573 367661 363988 515853 207663 103919 252774 496599 177406 680450 110983
13645 285920 334101 396288 312002 649583 705463 353104 -33398 491993 349913 229013
13635B29013E4307L35244A62892J81876a21516C70800G938J99413K57091A60243
13624D17297A39865M8625L20837k38315K16804k08816a7689D92345A61067K58120
13614D19187D8583J45281Q9393K90430A82699J25150p5411M173J29841j11924
13604B54528K4171J2184P5797G5188R1215J64819N4347j18924G5885K66437J1442
13593C53764J43800B37152J34481K22037k51216A29905k2202N0896G8235J10587
13583A88822J41524G2897K1496L20148A10023J33937K09488k22099g078B11675
13572A49752p0431K66950L8031P6784j24401j68037a39184A56960B7913N42402
13562E70315A68518J1070O2063n3670M7223N7897i1031C57872B1378K78442O6934
$$ plain form
13635 229013 54307 389551 162892 344768 -121516 370800 7938 207351 464442 160243
13624 417297 139865 188490 509327 271012 487816 279000 -17689 492345 161067 419187
13614 419187 48583 193864 283257 573687 182699 307849 232438 236611 366452 254528
13604 254528 278699 290883 366680 75188 166403 331222 385569 266645 75885 342322 353764
13593 353764 497564 237152 371633 593670 342454 129905 107703 158599 78235 188822
13583 188822 330346 72897 94393 414541 110023 243960 453448 231349 -7078 211675
13572 149752 79321 346271 384302 461086 336685 168648 -139184 156960 27913 570315
13562 570315 168518 179588 241651 187981 235204 293101 -91031 357872 21378 299820 366754
13551C66754A45605J03884q3187q2845Q3632J50945o3318p812r6603L2684m7747
13540A35238J54203G1625b2164H8382K56416E8311B4444b15342B75050H8727K51557
13529C40284j69621K79817D4913J94534P0743o114o0360j01587a5151I5707R3596
13518A89303J00540E0438L99885a66060A23532J99618j48989J40031J7079R8728
13508D29999A25709N0654N6634I4362D2846l981O6583K4356k576A360N40494b28727
13495H5285J03455p7957K53214A52800A6313J83074G2688K71520f6263D8641d8928
13483A10230J30375l9497O7218j06085A743K03690H0673J60979C3078N2500J14105
13472A99683F3173a53776A36007J17325n6859C500K77466a2533n0834j4764C67747
$$ plain form
13551 366754 145605 249489 166302 83457 167089 318034 254716 246904 150301 182985 135238
13540 135238 289441 71625 -22164 88382 344798 58311 24444 -215342 275050 88727 340284
13529 340284 170663 450480 44913 239447 310190 304076 243716 142129 -15151 95707 189303
13518 189303 289843 50438 450323 -166060 123532 323150 174161 314192 331271 429999
13508 429999 125709 176363 232997 94362 42846 38865 105448 129804 127228 1360 541854 -228727
13495 85285 188740 110783 363997 152800 16313 199387 72688 344208 -66263 48641 -48928
13483 110230 240605 201108 268326 162241 1743 205433 80673 241652 33078 85578 199683
13472 199683 63173 -153776 136007 253332 196473 3500 280966 -12533 -63367 -78131 367747
13460C05641k472a43042B43663b37160B30264j14602a43449A87709C2385a51318
13449B37744A17028b33760D70292A72024O3675l9648a00731C76514r0234l1240
13439B55040B6731K00499r4714R7436L244N6157C5406K3074J92613H5715B9057
13427E70126A08241A5418O5388b5892C27190d5724B17709J49464a12116A99905
13416C35520e6979A80881N8850J53964E3297B6264J92189G5036j7191J06722E6791
13404e2189A72287J00721c1066G6432l5539K71095n7969j06927a40885A90113
13393C45668I7304P4956L42701a27940A60223A0578M1643K68067j57798K66892
13383D29382j43030j01116J75314n1401A02814a45459C46031j42661P5942a1150
$$ plain form
13460 305641 303169 -143042 243663 -237160 230264 115662 -143449 187709 32385 -151318
13449 237744 117028 -233760 470292 172024 235699 196051 -100731 376514 286280 255040
13439 255040 26731 227230 132516 229952 233196 289353 35406 58480 251093 85715 29057
13427 570126 108241 15418 80806 -25892 327190 -45724 217709 367173 -112116 199905
13416 335520 -56979 180881 239731 393695 53297 26264 218453 75036 57845 164567 56791
13404 -52189 172287 273008 -31066 76432 40893 311988 254019 147092 -140885 190113
13393 345668 97304 172260 514961 -127940 160223 10578 52221 320288 162490 429382
13383 429382 286352 185236 360550 309149 102814 -145459 346031 203370 279312 -11150
13372C09337j40205a66624b6370B05369K29978A57701K0122a4181D30237r4812
13362C35425q4754J11969O9408a04535A17268J36732F2177P7501P3442J76370
13352C89490a45727B22494A07047b74263B03263C8669b1431j2297D48207m8124
13342D00083A06256J59563J16515A88323j5093l6562J2924J03912c5301C27551
13331A4211J13141J90659A11485K36180A69269o2284i3356B73219r4164G5362
13320C50335A32158J52608j04535F517N53733B2979B399J34369E1348J02024e8567
13308i5311C40809q1335j7483A8452K67286I9609J30218I2692b48237A3895a84871
13296B77838b8768m274B95328a46034B2842a96207A9925J59217K60640A90887
$$ plain form
13372 309337 169132 -166624 -26370 205369 435347 157701 177823 -14181 430237 335425
13362 335425 250671 362640 432048 -104535 117268 254000 62177 139678 213120 389490
13352 389490 -145727 222494 107047 -274263 203263 38669 -21431 -33728 448207 400083
13342 400083 106256 265819 382334 188323 173230 136668 149592 253504 -35301 327551
13331 14211 127352 318011 111485 347665 169269 106985 -93356 273219 179055 75362
13320 350335 132158 284766 180231 6517 560250 22979 2399 136768 51348 153372 -58567
13308 -95311 340809 259474 241991 18452 285738 99609 229827 92692 -248237 13895 -184871
13296 277838 -28768 -33042 295328 -146034 22842 -196207 19925 179142 439782 190887
13285D38148F9448b62617A98160J01436m2394d6071B2019J55075M96056E043K50722
13274B55765e386G3253M1655D7560P86f234A72908H4386O8685F7274b02241G5765
13261A83477h6188m3758E6961J5709b71713g15k15030q7800I8093K29084E9044
13249h5591D5384h910f56D22165A53723f8907C93474A32896J0865j6537o2807
13238F4417F047J86424i2493C38590a94871m7473A18273J33646A9174K9443K48187
13227B96804E1029e6306P347J5882A60695h3579A33592j3678D6092L75260d767
13215B49899b1372B22421J0623d9065i299n5502j28000A50989D7241J55407n1622
13204A51026i0659G6112J0327a88498D17381d5820l85833A02613c17480a27657
$$ plain form
13285 438148 69448 -262617 198160 299596 257202 -46071 22019 177094 673150 5043 255765
13274 255765 -5386 73253 114908 47560 48346 -6234 172908 84386 153071 67274 -202241 75765
13261 183477 -86188 -129946 56961 72670 -271713 -715 -215745 -303545 98093 327177 59044
13249 -85591 45384 -8910 -656 422165 153723 -68907 393474 132896 143761 127224 64417
13238 64417 6047 192471 -92493 338590 -194871 -242344 118273 251919 19174 48617 296804
13227 296804 51029 -56306 -48959 -33077 160695 -83579 133592 119914 46092 421352 -4767
13215 249899 -21372 222421 233044 -49065 -9299 -64801 -192801 150989 47241 202648 151026
13204 151026 -90659 76112 86439 -188498 417381 -45820 -431653 102613 -317480 -127657
13193E2706J12901b6266F0038C087d942A12071L59037A8215L80614g3000B63385
13181A27666a95215l3126B61539j10508m6981O0871e9394H5020J02779e2546j75325
13170b27871G2564h1582G1167N4346J57071l7667J04873A12055N0612L8233g0354
13158h594A97476J5330D0789Q6279F910J26932e8204B78895l1874q0829l2247
13147A33945g1212b2475B31874A8607L34517d0610l1943B22482N3147A31536b48953
13135b1004g861D8458A3716K5560a44590B96846a4007j84149e0033A19125k881
13124A16244i3294A52292c1128l623l10414E671N4812c7984A7790J64136C6998
13112a47622e3824C16704H1779J2727N3868K4365E7319a24365B48925F0219K01819
$$ plain form
13193 52706 165607 -26266 60038 3087 -4942 112071 471108 18215 398829 -73000 263385
13181 127666 -195215 -228341 261539 151031 104050 164921 -59394 85020 187799 -52546 -227871
13170 -227871 72564 -81582 71167 125513 282584 244917 349790 112055 162667 200900 -70354
13158 -8594 197476 212806 40789 127068 6910 133842 -58204 278895 247021 166192 133945
13147 133945 -71212 -22475 231874 18607 353124 -40610 -72553 222482 275629 131536 -248953
13135 -21004 -7861 48458 13716 39276 -144590 296846 -14007 -198156 -50033 119125 116244
13124 116244 -93294 152292 -31128 -34751 -345165 5671 60483 -37984 17790 181926 36998
13112 -147622 -53824 316704 81779 94506 148374 172739 57319 -124365 248925 60219 262038
13101B62038G6342Q5935h1062b3010R370A8104P6467d3688b1565A22976n9460
13090F3516K7151K80633b442C1894a5501A71470g1983F1718e4527I7074l1515
13079F5559b7394p2074M8112M80a1125n5130A07573Q9515a28964F6250a21763
13067h2135q7471E2528b8143A03106J39210C9732e5672I1437b1912r2265A47874
13055F8157k9638c54440a14939M8905o9403A62805J16110H2665K3859J27875B6363
13043B16445c5882n5693j4302L8286A6577d1114B5204M7584a31825m9566a4517
13031D34643A28600J32610k0717A1338J39080a60580B08770l4951o9843B903a06784
13019D0185J4726J85196J45521A40028A3550K38572a47057B50162A08540a7708
$$ plain form
13101 262038 76342 162277 -81062 -23010 -13640 18104 94571 -43688 -21565 122976 63516
13090 63516 90667 371300 -2442 31894 -15501 171470 -71983 61718 -54527 97074 65559
13079 65559 -27394 -99468 -51356 -50876 -11125 -66255 107573 197088 -128964 66250 -121763
13067 -82135 -169606 52528 -28143 103106 242316 39732 -55672 91437 -21912 -114177 147874
13055 68157 38519 -354440 -114939 -66034 -135437 162805 278915 82665 106524 234399 26363
13043 216445 -35882 -91575 -105877 -67591 16577 -41114 25204 72788 -131825 -181391 -14517
13031 434643 128600 261210 240493 11338 150418 -160580 208770 173819 103976 2903 -106784
13019 40185 54911 240107 385628 140028 13550 252122 -147057 250162 108540 -17708
13008B46061m185A10905g7540j55599A83936J15615L8215q7658j04611b7355C30110
12996F3843J39279D6530j3123L567g1567A35072Q1971G0139g1325B63199a46097
12984B03405R3529C6458b78074a18619B42380E9796c7498C04436q1665I2837a59971
12972e3582j25224q739j0057H365Q7878a5163r6319A32924b352B3039a87704H8918
12959b30434A87658e515j68531C22866I1236M32771a17703m466C43089d5053C46785
12947A35251C7292L20540b8552j04404B19481O1991d46222d6290A26471e18973
12936a9248A63088G6333c41314b1097i783o6471G8952J16393q0461J7925F4571
12924B00446b42823b2856k2116a0670B1815Q0940l6404P7032a36304N1577C24234
$$ plain form
13008 246061 241876 110905 -77540 -233139 183936 299551 337766 250108 145497 -27355 330110
12996 63843 203122 46530 33407 36974 -71567 135072 217043 70139 -71325 263199 -146097
12984 203405 296934 36458 -278074 -118619 242380 59796 -37498 304436 222771 92837 -159971
12972 -53582 -178806 -187545 -197602 8365 96243 -15163 -111482 132924 -2352 23039 -187704 88918
12959 -230434 187658 -5515 -174046 322866 91236 524007 -117703 -122169 343089 -45053 346785
12947 135251 37292 357832 -28552 -132956 219481 281472 -446222 -46290 126471 -518973
12936 -19248 163088 76333 -341314 -21097 -9783 -76254 78952 195345 114884 132809 64571
12924 200446 -242823 -22856 -44972 -10670 21815 102755 66351 143383 -136304 -84727 324234
12912d2375l24972G3147a28248c7123B6415J50092c49912i2374A21064L078n4068
12901G0074A4785L10503j45565p9850D7705J01898e783B22875b42412A16370J46073
12890B62443D7267A9519a65065B14155D2118J02268J2182m3890a03489k3308R630
12879a17167m00k62969B38612j03045h0083j23136N2603k4907e7976F1809a34251
12867A54271n6921a45090e6952C04661a39046e204H2169B4669a41698k3264m0500
12856b05462H923a33595J835H4154J7385b64795j7520a33732a2955l16275D5118
12844A70411D9959Q1585a86963L4911B7742f6868H9822c00601a07743j27703d1171
12832i5210K6765j96517b0243j50425e3241A20340a58315A01616M7442a17227
$$ plain form
12912 -42375 -367347 73147 -128248 -37123 26415 176507 -349912 -92374 121064 124142 70074
12901 70074 14785 325288 179723 99873 47705 149603 -5783 222875 -242412 116370 262443
12890 262443 47267 19519 -165065 214155 42118 144386 156568 112678 -103489 -126797 -117167
12879 -117167 -117567 -380536 238612 135567 -80083 -203219 -150616 -175523 -57976 61809 -134251
12867 154271 97350 -145090 -56952 304661 -139046 -5204 82169 24669 -141698 -164962 -205462
12856 -205462 8923 -133595 -131760 84154 101539 -264795 -282315 -133732 -12955 -329230 45118
12844 170411 49959 131544 -186963 -152052 27742 -66868 89822 -300601 -107743 -235446 -41171
12832 -95210 -68445 -264962 -20243 -170668 -53241 120340 -158315 101616 149058 -117227
12821G3471a29825m730A20179a16350k4039H3894j8642a32969A92202K3608a62527
12809b40886A82607a93721L2151A29340J58480F5297C0692N1640M338L7016b32336
12797b38839F1471j7529N8481e5789D05381b7190B70748B7804L2396B0265L3524
12786E3789a68322A18982b7615D0274a29105B58133a86422j29696f8299J6619
12776e1680A26404f9237M856j80951C6241b37177a1024A61681a01467D8558d6112
12764c4586E7518c4719B44314c5050A03932f5001D17512C0771a25043A30394B3130
12752C6834K07022J43510B8576d4740C400M8207J56667a29342G692c066A60389
12740b5839h343j07561H0244a38016m4388A33108K55314A31760a81585B34189
$$ plain form
12821 73471 -129825 -134555 120179 -116350 -140389 83894 65252 -132969 192202 215810 -162527
12809 -240886 182607 -193721 -161570 129340 287820 65297 30692 82332 86670 123686 -232336
12797 -238839 61471 43942 102423 -55789 405381 -27190 270748 27804 60200 20265 53789
12786 53789 -168322 118982 -27615 40274 -129105 258133 -186422 -316118 -68299 -51680
12776 -51680 126404 -69237 -64381 -245332 36241 -237177 -11024 161681 -101467 48558 -46112
12764 -34586 57518 -34719 244314 -35050 103932 -65001 417512 30771 -125043 130394 23130
12752 36834 243856 387366 28576 -44740 3400 51607 208274 -129342 7692 -3066 160389
12740 -25839 -8343 -115904 80244 -138016 -182404 133108 388422 131760 -181585 234189
12729a72652G9642J0357b58087b3307F4881b770E1634f6022a0973A82920a40539
12717D7278O9816e1994A77558B487e8085B87107P4594j61030B8299J55035e215
12705B14960H2087e6746n2938k50200A69407a46572A69781o3987b19295J01694
12695a17601M1054B67578C556c6655o3023K6810A81040d5097A47483a9444j06872
12684a26316k6717A24437k1260b9736B17159a89971N8015A1669K598J24017g4727
12672C30692j47361p8009a05088N0219o3206B27321a03934B67973A05191a28081
12661B63091a74316k70536E0527J40717D4506J75255D0155b14025J03029G4055
12650B87581A27236l9435a04728I1665d973A5404a07631J0577p1089e1046A05970
$$ plain form
12729 -172652 79642 89999 -258087 -23307 64881 -2770 51634 -66022 -10973 182920 -140539
12717 47278 117094 -51994 177558 2487 -58085 287107 361701 200671 28299 183334 -5215
12705 214960 82087 -56746 -109684 -359884 169407 -146572 169781 105794 -219295 -117601
12695 -117601 -76547 267578 3556 -36655 -99678 -72868 181040 -45097 147483 -19444 -126316
12684 -126316 -153033 124437 103177 -29736 217159 -189971 -131956 11669 14267 138284 -74727
12672 330692 183331 105322 -105088 -54869 -118075 227321 -103934 267973 105191 -128081
12661 263091 -174316 -444852 50527 191244 44506 219761 40155 -214025 -110996 74055
12650 287581 127236 87801 -104728 91665 -4973 15404 -107631 -97054 -168143 -51046 105970
12638g478I8801Q8612a18803C00645a6523C98573F6915J61108a58691A61713K9523
12627A91236L06409A57101E9935j7822N6228e69H6721k3103A9923f6869B92533
12615A93007c53206E660a67791C44205A0476K42060j17339J17870b40176h5484
12604B1738a60123A34962c8755D71049B00466a66614A37915F5997a07370D8926
12593a03588G3237c3207o4409n647k05089a29219D2340j0389b53752E6587c0779
12581a25018r802j63648a03426K832D4247j8069a12198p6490a118k24562n043
12570b30723f1095B51676b3066l9856C57142c38510C74150G8624c62974A14208
12559A71865F8839a65137O0232G1402d7632o1426F9060K7169B01J6858J83900
$$ plain form
12638 -7478 98801 187413 -118803 300645 -16523 398573 66915 228023 -158691 161713 191236
12627 191236 497645 157101 59935 42113 98341 -569 86721 63618 19923 -66869 292533
12615 193007 -353206 5660 -167791 344205 10476 252536 135197 253067 -240176 -85484
12604 21738 -160123 134962 -38755 471049 200466 -166614 137915 65997 -107370 48926
12593 -103588 73237 -33207 -97616 -103263 -308352 -129219 42340 31951 -253752 56587 -30779
12581 -125018 -134820 -298468 -103426 -100594 44247 26178 -112198 -188688 -1118 -225680 -230723
12570 -230723 -61095 251676 -23066 -62922 357142 -338510 374150 78624 -362974 114208
12559 171865 68839 -165137 -104905 71402 -47632 -109058 69060 96229 201 17059 200959
12548B00959p0287g7791h914m3609B62315b44752B7789M44467A07089k4184h1503
12536a42748H1163N805b53331j28462a30664o0195O2794C24643g6760C3475a46172
12524H5737a72231a1986m2304j72450p4753C39338A734Q5476C0734b9032l7941
12513f6973c3090j23315q2752B44261C9339J84404p8710k1083K3485c93249B15691
12501b35439A12483D0506J18114J84530a62587K0356A43899a06297B78229a02303
12490a50075b4605n3513j28830A38026J28122a84847B80541i8710B6367J39993
12480A66360B1200J42719m0216J44852E6549K17997d12058F0730b13184e4906
12469A36459R990J54127a17616N207L8953G731a30761B58103a87330A2595d63028
$$ plain form
12548 200959 130672 -77791 -8914 -52523 262315 -244752 27789 472256 107089 82905 -81503
12536 -142748 81163 86968 -253331 -381793 -130664 -190859 -128065 324643 -76760 33475 -146172
12524 85737 -172231 -11986 -54290 -226740 -301493 339338 1734 87210 30734 -29032 -66973
12513 -66973 -33090 -156405 -239157 244261 39339 223743 145033 123950 147435 -393249 215691
12501 -235439 112483 40506 158620 343150 -162587 -142231 143899 -106297 278229 -102303
12490 -150075 -24605 -78118 -206948 138026 266148 -184847 280541 -98710 26367 166360
12480 166360 21200 163919 123703 268555 56549 274546 -412058 60730 -213184 -54906
12469 136459 146449 300576 -117616 -112409 -73456 7731 -130761 258103 -187330 12595 -463028
12457a82873j12634B63698H7988O6973E6535g7434E4411O6659a7835k46315G6216
12445G2379a18669r3714B85910b5979p4327M2883k62314J59103l4929K0403g0136
12433b05803j08043A32709b13947k54354a81966L9235A42799a57183L6318c7302
12422a02103e0214k1214A73865C0945c9532k02844a09975i838j768j05033K0264
12411i6375o4060H7788b90165A83180a75271g7040k63111b8141l6150K4970r1473
12400a30794C2944J76731R8707j16753a14546L7265A57818C3095f8660F9968b34329
12388a21482A77679a13360F2245M4759B6760P0145d02343A76719C7896J3043h7263
12376B19158c4651H1625b55042a21479c8077j3140A62253b3824D68889a32801
$$ plain form
12457 -182873 -295507 263698 87988 154961 56535 -77434 54411 121070 -17835 -264150 76216
12445 72379 -118669 -212383 285910 -25979 -100306 -57423 -319737 -160634 -195563 -175160 -70136
12433 -205803 -313846 132709 -213947 -468301 -181966 -142731 142799 -157183 -120865 -37302
12422 -102103 -50214 -71428 173865 30945 -39532 -242376 -109975 -9838 -11606 -116639 -96375
12411 -96375 -160435 87788 -290165 183180 -175271 -77040 -340151 -28141 -64291 -39321 -130794
12400 -130794 32944 209675 308382 191629 -114546 -77281 157818 33095 -68660 69968 -234329
12388 -121482 177679 -113360 62245 107004 26760 96905 -402343 176719 37896 50939 -87263
12376 219158 -34651 81625 -255042 -121479 -38077 -51217 162253 -23824 468889 -132801
12365B06326q553g113A24363b08785A54589a31429j92222o1562b6686B830R8435
12354A01265a42093A77709a903r3170H5700a02206D1775a03881l8565A02403h4456
12342I011a11467n9390C46120q7616e2849D9912c55734A15527R5256J2068m4227
12331A78624K58209a66304B42083n6769N5071E1031J15279J7596a1585j19162
12321a30747a9716B39837j9742N2863A32928k581J0089M582L64836b93655b5709
12309c4983C5881a63425o556a0695n1636H2975K42338J75635c8002H5128L52699
12298D37827a35865B3429e6098A96669o3352a06829B89330Q8585a14007I9287
12287a11710B39871r5292J61856n9774D1043b33982C34435j30771L8209l5039
$$ plain form
12365 206326 197773 -7113 124363 -208785 154589 -131429 -323651 -385213 -26686 2830 101265
12354 101265 -142093 177709 -1903 -95073 85700 -102206 41775 -103881 -142446 102403 -84456
12342 9011 -111467 -170857 346120 258504 -52849 49912 -355734 115527 210783 222851 178624
12331 178624 436833 -166304 242083 185314 240385 51031 166310 183906 -11585 -130747
12321 -130747 -19716 239837 220095 272958 132928 130347 140436 145018 509854 -293655 -25709
12309 -34983 35881 -163425 -169981 -10695 -62331 82975 325313 500948 -38002 85128 437827
12298 437827 -135865 23429 -56098 196669 133317 -106829 289330 377915 -114007 99287
12287 -111710 239871 144579 306435 246661 41043 -233982 334435 203664 241873 206834
12277B06834J27675b50918B4680R7833J95045n8974D1007J61416k8246j9192J65157
12266C20142C8528Q5892J1012d5818A39794a56504h527A42331e9994C62785g7585
12254A7205R5885L02183a71606A16055n856h3358H9601M5644o1213k2774J54248
12243B05506a43524F8427Q5923L7009H9047P1010b7513A27967R854c1410m2678
12232g4088F8827a55878L8501A0836K4573a86252D59549n8544l4249j53138N9672
12221B73290j06278J70891A935K29678f6669D327L15650H7597C7143M71440j82710
12210C25873O4097I7812a67236A83227a50518A10862e0500l57784a26687A49189
12199B97555j18354a1068A34765A2800J73357j5410Q415J54278j16278a61717
$$ plain form
12277 206834 334509 -250918 24680 122513 317558 258584 41007 202423 174177 154985 320142
12266 320142 38528 124420 135432 -45818 139794 -156504 -8527 142331 -59994 362785 -77585
12254 17205 113090 415273 -171606 116055 110199 -83358 89601 135245 74032 51258 205506
12243 205506 -143524 68427 154350 191359 89047 160057 -27513 127967 137821 -31410 -74088
12232 -74088 68827 -155878 -117377 10836 35409 -186252 459549 401005 366756 213618 273290
12221 273290 167012 337903 1935 231613 -66669 4327 319977 87597 37143 508583 325873
12210 325873 389970 97812 -167236 183227 -150518 110862 -50500 -408284 -126687 149189
12199 297555 179201 -11068 134765 12800 186157 170747 179162 333440 217162 -161717
12188A57414j8648K75371i2700G0266K99888D1489O3900D8734a33727C71784G3613
12176a02944b3458I9174a12377B93749o0339p9834E0490A1016K05361Q3077j44897
12165A54557J8820i6518C89421A79981q0106m3074J07390B9248n687a21795D08876
12153h1069j12168A93591k8123Q6698f0339C22345A56125g996F8932b27531A76784
12141A21900R4919D1012O5120C8724P5315M3841D4362e4173a3205j25699K7375
12130a11529I8236i1386H1248J8084J28060p4362P5526r3477J20115J20777A23714
12118D92681k23637K5208g5184A34544a01036g340D0311j4491o095J74690N2704
12107B47119a2237B3340f0324G8566J17473d7234A03730M7724J01099b6947H1529
$$ plain form
12188 157414 138766 414137 -92700 70266 370154 41489 105389 48734 -133727 371784 73613
12176 -102944 -23458 99174 -112377 293749 233410 153576 50490 11016 216377 299454 154557
12165 154557 173377 -96518 389421 179981 99875 56801 164191 29248 23561 -121795 408876
12153 -81069 -193237 193591 165468 252166 -60339 322345 156125 -7996 68932 -227531 176784
12141 121900 216819 41012 106132 38724 114039 157880 44362 -54173 -13205 -138904 -111529
12130 -111529 98236 -91386 81248 99332 227392 153030 228556 135079 255194 375971 123714
12118 492681 269044 294252 -75184 134544 -101036 -7340 40311 25820 19725 194415 247119
12107 247119 -12237 23340 -60324 78566 196039 -47234 103730 151454 252553 -26947 81529
12095B85394f0612j6435N424C24984j04622A7592J43497d2336B59659C8913c6022
12083A503L46778C2311h0398d357H2405J72811a78427L2233a8256j17046B88017
12071E7460M30879B31950g803B76013r8554b11718C6150e0780k0036A1571M980
12060A6551K32521q4348e9496D9516a29197A45117E8388K53503a67533D5728J9908
12049F5636L28273D4365F701a37964c6636G1852a6209A90319c7244C8417b39803
12037C170O0074b08822E5794a92760I6837a32149A25087c63727a53411A67612
12026b42065A9469a27126G8418J3763b0394p8053A57558b91552A39794C0279b33858
12014D2587L25712a01544H2879J69357a08933A10076a38550B36141i570B45140
$$ plain form
12095 285394 -60612 -77047 -71623 324984 220362 17592 161089 -42336 259659 38913 -36022
12083 1503 348281 32311 -80398 -4357 82405 255216 -178427 -146194 -18256 -135302 288017
12071 57460 488339 231950 -7803 276013 177459 -211718 36150 -50780 -70816 11571 16551
12060 16551 249072 164724 -59496 49516 -129197 145117 58388 311891 -167533 45728 65636
12049 65636 393909 44365 6701 -137964 -36636 71852 -16209 190319 -37244 38417 -239803
12037 3170 63244 -208822 55794 -192760 96837 -132149 125087 -363727 -153411 167612
12026 -242065 19469 -127126 78418 92181 -20394 -98447 157558 -291552 139794 30279 -233858
12014 42587 368299 -101544 82879 252236 -108933 110076 -138550 236141 -9570 245140
12003e7806m1982n4908N776f2396C32118A26716i0303a5642p890l19896J48735
11992a94693h8944L6362a5453A89997I3981c35474A65557a13545F1579a07449
11981c8831F9556b77680k8229h8616E0910j605b02316J0367g3534m8155e5327
11969B70643B3150c11136C4525a51923A06381J60226g9619A7819g6843A06366
11958d7131j19369j78673E3253a82781p6363f0806R940l313k6195J658A00664
11946a63679j42908D08230A47197o6192M9967F1168H907a97848B3670J64412H5930
11934A11766f9971E0484b13540d4911m5221j30181R9026C56522K02833G6404M8696
11923A25100d1396q734F8626J83089A185g4634A32294Q6409M0831G5606l3067
$$ plain form
12003 -57806 -99788 -154696 -148920 -62396 332118 126716 -90303 -15642 -23532 -343428 -194693
11992 -194693 -88944 -52582 -15453 189997 93981 -335474 165557 -113545 61579 -107449
11981 -38831 69556 -277680 -305909 -88616 50910 49305 -202316 -191949 -73534 -121689 -55327
11969 270643 23150 -311136 34525 -151923 106381 266607 -79619 17819 -76843 106366
11958 -47131 -166500 -345173 53253 -182781 -259144 -60806 -50866 -54179 -80374 -78716 100664
11946 -163679 -306587 408230 147197 81005 130972 61168 8907 -197848 23670 188082 85930
11934 111766 -69971 50484 -213540 -44911 -90132 -220313 -121287 356522 559355 76404 125100
11923 125100 -41396 -50130 68626 251715 1185 -74634 132294 218703 259534 75606 42539
11912D2539b34486a00926G2092a49149I912a477j14896E56147b50418A17292J00008
11901B17300e9784k74611A54441b17340P0463A6126b43251J17729N0351j93299
11891b68470i6184A92971d2086E9288Q0933c07124A99897b163j69501C09791h5487
11879c11869g6514o9552C9265a26924E8244f0942j96611i2148k755q0959g6913
11867F3695b66079a00780A05695b29755a12986K7942J2261I630L7309A6279b6483
11855A69716k2922k1148a01730l3866F2571J69443d98311G6292a16455F8872g0120
11843h7447a4491A11662a40701o368C05a61052A58060a08381k1374a1207j45149
11832a56356k03117a17565A12297b38983a07766j63440L8080A43067c44949A1849
$$ plain form
11912 42539 -234486 -100926 72092 -149149 9912 -1477 -116373 556147 -250418 117292 217300
11901 217300 -59784 -334395 154441 -217340 -146877 16126 -243251 -125522 -75171 -268470
11891 -268470 -96184 192971 -42086 59288 140221 -307124 199897 -2163 -171664 309791 -85487
11879 -311869 -76514 -146066 39265 -126924 58244 -60942 -257553 -92148 -94903 -175862 -76913
11867 63695 -266079 -100780 105695 -229755 -112986 -85044 -72783 9630 46939 16279 -26483
11855 169716 146794 125646 -101730 -135596 62571 232014 -498311 76292 -116455 68872 -70120
11843 -87447 -14491 111662 -140701 -147069 305 -161052 158060 -108381 -129755 -11207 -156356
11832 -156356 -359473 -117565 112297 -238983 -107766 -271206 -233126 143067 -344949 11849
11821d9961j07928G1478b04746r5923G4381a18567e7401B2466a80312J6184c5285
11809H3904J08799a03833j14216A70733N4856G5633B9628b6780b897m5845j9813
11798f8555L1537b461B16829a050p8011A53119i6355p0999A44715A216J12694
11787A13910a3037m6196m29185B00740d0795B84371e2994j99655F3732c2980a2633
11775d17761g792j17114k95211A36272D9813a44432f0413k1931A62479d01156
11764A41176c31655A62623a19166B63875D9927J5579a29941k0190P2011A24649
11753A40590j3038E5624b9412A46175a13776H7127a15280M034C07591f8265B72289
11741a66981j63990a08485a7074C25860a16903A518a68745B94728a49505q404
$$ plain form
11821 -49961 -157889 71478 -204746 -300669 74381 -118567 -57401 22466 -180312 -164128 -35285
11809 83904 192703 -103833 -218049 170733 225589 75633 29628 -26780 -2897 -48742 -68555
11798 -68555 -37018 -2461 216829 -1050 -79061 153119 -96355 -167354 144715 1216 113910
11787 113910 -13037 -59233 -488418 200740 -40795 284371 -52994 -252649 63732 -32980 -12633
11775 -417761 -7792 -124906 -420117 136272 49813 -144432 -60413 -82344 162479 -401156
11764 141176 -331655 162623 -119166 263875 49927 65506 -129941 -150131 -78120 124649
11753 140590 127552 55624 -29412 146175 -113776 87127 -115280 -111246 307591 -68265 272289
11741 -166981 -330971 -108485 -17074 325860 -116903 1518 -168745 294728 -149505 -157909
11731a57909A08456K1305a12660j3665J542b88p3396D1334e4771C635c57994E3206
11718a50033d493j16365E0294a3446n798B94723e7408A58670A7355J35e537k13615
11706b19152L7668i148C9390G652a33720D0293f0760A53645k9930c15646e7442
11694B33139c67066a28669m926f3133A66796D9132K48281b17800G2396n923K75697
11683C42170p3022K911j30186B0062c12261A85594R3065a8273l0293J6171A22712
11671E9704f6282j55194F9866E359K7725J35726b09640R3162J5962A92777I0924
11659A57542L5162a86066D0855f6192E5534M4049j5725e1897B8506h9052A66004
11647a15518C29134c72792h2465o4750L2301A71024O7499j6661q4821d9374j50041
$$ plain form
11731 -157909 108456 129761 -112660 -126325 -124783 -288 -73684 41334 -54771 3635 -357994 53206
11718 -150033 -4493 -120858 50294 -13446 -19244 294723 -57408 158670 17355 17490 -5537 -219152
11706 -219152 -181484 -9148 39390 7652 -133720 40293 -60760 153645 123715 -315646 -57442
11694 233139 -367066 -128669 -133595 -63133 166796 49132 297413 -217800 72396 66473 342170
11683 342170 269148 272059 141873 20062 -312261 185594 278659 -18273 -48566 -32395 122712
11671 59704 -66282 -221476 69866 5359 33084 168810 -209640 -116478 -100516 192777 90924
11659 157542 192704 -186066 40855 -66192 55534 99583 83858 -51897 28506 -89052 166004
11647 -115518 329134 -372792 -82465 -147215 -114914 171024 238523 221862 137041 -49374 -199415
11636a99415A54841b30908Q0200a5009G7923a03346M9954C3743g274o4384G5906
11624g6395j94900A5601L8089J8016d7498l2101B88484k0024g8509j33651I2974
11612E8862b44218O6636q5653D7962J50497a96664B5899J83218a20186G4379J03535
11601A77914b55516B16b74083A20751K3885e677C72967c11715C6572B430e7734
11589a2999B29578a1593B5969i9596H4325K12176m2276A7069a65622D88975A84519
11577B018L65445b56759A55347b35797H1950M9393j3599a2621B31152j05925a72362
11565a36795c5302k9355a9121m1657A18188O420k9220c4886C66803j40728m8944
11554A77131a5648B07149e025m3498k93452C21154c6939C9957e2002j222j4083
$$ plain form
11636 -199415 154841 -230908 -150708 -15009 77923 -103346 -53392 33743 -7274 -71658 75906
11624 -76395 -271295 15601 53690 71706 -47498 -79599 288484 268460 -78509 -212160 92974
11612 58862 -244218 -177582 -263235 47962 198459 -196664 25899 209117 -120186 74379 177914
11601 177914 -255516 216 -274083 120751 144636 -5677 372967 -311715 36572 2430 -57734
11589 -12999 229578 -11593 25969 -99596 84325 296501 254225 17069 -165622 488975 184519
11577 2018 367463 -256759 155347 -235797 81950 131343 117744 -12621 231152 125227 -172362
11565 -136795 -35302 -64657 -19121 -60778 118188 124608 95388 -34886 366803 226075 177131
11554 177131 -15648 207149 -5025 -48523 -341975 321154 -36939 39957 -52002 -53224 -67307
11543f7307K3494m2768A52589C2419j5928a06904A05613d3413D63774c0743A8092
11531a91570H7988a23956I4402m3318J30823n5471J2323O8931o1379O7789a194
11519a40861o0165I4151c3015H3780c61472F6631C1062L4891b05816H2189g7269
11507c5419j70465A681O4884K53885E8951e4330A36767K26550G0212B123J74350
11496A76473A4655M09078G6185C0386I559K94348j51320K63034a06006A93045
11485g5483C52051n4227e8482I6402A7150b32744A54785B5859K60527I7173b06047
11473C65734b77542A69644b4612A33334L98756k27731D4396b7516B83972n6057
11463B27915H310K83502r8786k8458J70079H7539N4908J64813A53511j6967a60060
$$ plain form
11543 -67307 -43813 -86581 152589 32419 16491 -106904 105613 -43413 463774 -30743 18092
11531 -191570 87988 -123956 94402 51084 181907 126436 138759 207690 146311 214100 -1194
11519 -140861 -201026 94151 -33015 83780 -361472 66631 31062 65953 -205816 82189 -77269
11507 -35419 -205884 1681 66565 320450 58951 -54330 136767 363317 70212 2123 176473
11496 176473 14655 423733 76185 30386 9559 303907 152587 415621 -106006 193045
11485 -75483 352051 297824 -58482 96402 17150 -232744 154785 25859 286386 97173 -206047
11473 365734 -277542 169644 -24612 133334 532090 304359 44396 -27516 283972 227915
11463 227915 8310 291812 193026 164568 334647 87539 142447 307260 153511 136544 -160060
11451A48159m7498Q5069i5825K6672p2264A16062B5156a15432j97155C43337d52799
11439A99718a24696L8014D4258a08610J3444j64297A58730c2934B48141b464F6321
11427A98578L5772A06969L5566a19665o699d9608A65344a05984a7353A91491d13007
11415e9876l0110D25191F0046F600b61747J26685A59961m9072J6430D6592c8882
11403G3008a16642I7304M8602d736j34174A6659a8490B85000D2364a76137A92944
11391B59927b6491q8960b5702B64689b39903A16482e34667a7587A98546G8816
11380c37803g6958b0769A28280E6207f0792c839D0076A1109L78949A05357m822
11369A00535C388b6064H7250l8178d3811B66720a89884N207f6032k0549C1984
$$ plain form
11451 148159 100661 185730 -95825 -69153 -141417 116062 25156 -115432 -312587 343337 -452799
11439 199718 -124696 -86682 44258 -108610 -95166 -259463 158730 -32934 248141 -2464 66321
11427 198578 234350 106969 142535 -119665 -126364 -49608 165344 -105984 -17353 191491 -413007
11415 -59876 -89986 425191 60046 6600 -261747 -135062 159961 110889 127319 46592 -38882
11403 73008 -116642 97304 145906 -4736 -138910 16659 -18490 285000 42364 -176137 192944
11391 259927 -26491 -115451 -25702 264689 -239903 116482 -534667 -17587 198546 78816
11380 -337803 -76958 -20769 128280 56207 -60792 -3839 40076 11109 390058 105357 100535
11369 100535 3388 -26064 87250 49072 -43811 266720 -189884 -184677 -66032 -86581 31984
11357b81545d8148A66615a24503B42971b71D2058f7737C5096B830M1252h4342
11345A34478E410L33868a56555a453B19475a13697r0804B16402F7014M5611b92696
11333b08732F1037h9059G2213g2331j49478j2302C4203K25439f785j74993k32698
11322d14476c0438k99398A10672i3358j32033e5109k38872A85616l0920K3507
11312A78203d4637j2165j2972B31366a03011C99199b96397A39046h6890k19353
11302c06243h070F4019B4779J60973h4257j80255B21842A7526N2225O0449J18585
11291B48785h5058A00525N7807J06187b5934j80777J3997A36831o944B1046N9718
11280H0764e3232l16928a39314J6655A63717a45688j56099B00514h5997l0880
$$ plain form
11357 -281545 -48148 166615 -124503 242971 -271 42058 -67737 35096 2830 44082 -84342
11345 134478 5410 339278 -156555 -1453 219475 -113697 -204501 216402 67014 112625 -292696
11333 -208732 61037 -89059 72213 -72331 -221809 -234111 34203 259642 -6785 -181778 -414476
11322 -414476 -30438 -329836 110672 -93358 -225391 -55109 -293981 185616 154696 178203
11312 178203 -44637 -56802 -69774 231366 -103011 399199 -296397 139046 -86890 -306243
11302 -306243 -8070 64019 24779 185752 -84257 -264512 221842 17526 69751 130200 248785
11291 248785 -85058 100525 158332 264519 -25934 -206711 -192714 136831 129887 21046 80764
11280 80764 -53232 -370160 -139314 -122659 163717 -145688 -301787 200514 -85997 -116877
11270a16877k25333d4062D824N2531a0264B05914b78354A84997a6354C74842c4465
11258F3767b89327F1143f557A8349b60670a02866D7036b25443a09520j91573A4651
11246A74715K5895i6868O785C0645P0197q426J67254a42443H2450b35479A88446
11234a54467p8164q230Q7016b5884A64256a49335N8632j38632m0633G9038R9306
11223A78344K8794g2232A81495C8220b9840B13776a64273j10635j08632a35984
11212d45059a89137o473A55888e6897j03786N6003G0539c1123j92846j69747c6174
11200b01877c5366j07297l70383a30319F0864h3772C5887K11129I9949a42244
11189b5907j26640M9924I6864C5952J19164a4304p3169A45294A1813f5828m3015
$$ plain form
11270 -116877 -342210 -44062 4824 57355 -10264 205914 -278354 184997 -16354 374842 -34465
11258 63767 -289327 61143 -6557 18349 -260670 -102866 47036 -225443 -109520 -301093 14651
11246 174715 200610 -96868 -90083 30645 100842 92416 259670 -142443 82450 -235479 188446
11234 -154467 -232631 -240861 -153845 -25884 164256 -149335 -90703 -229335 -269968 79038 178344
11223 178344 207138 -72232 181495 38220 -29840 213776 -164273 -274908 -383540 -135984
11212 -445059 -189137 -195610 155888 -56897 -160683 -104680 70539 -31123 -223969 -393716 -36174
11200 -201877 -35366 -142663 -513046 -130319 60864 -83772 35887 247016 99949 -142244
11189 -25907 -152547 -102623 96864 35952 155116 -14304 -87473 145294 11813 -65828 -108843
11178a08843A7769b0505j8214H862b84956A97542a63100O4635K5902m8859a0164
11166a14969o8066c06A30580a07551A57344e3417k98235O3184D0325K16750A09359
11154b19038A09095a17285A14138m8321a08605A29120e2605j48944C9105J14257
11144A53362b17455B44458c1738I55b37120a14566B5289J61521J30256B7282b28277
11132A16709b11111a9105E9553K8009M193e6977j06581m0813A54100h8462j33866
11121b22328j3111A10627a4294F8961a93538A64899l155E1670O1424N8764E1669
11109a2692H300J07287K39449a89920B80588a91799A18379K97383B8826K09113
11099B37939J9452J44417A14951l5174P4467O8002F2895J4837J81767A5807J02937
$$ plain form
11178 -108843 17769 -20505 -38719 8862 -284956 197542 -163100 -98465 -72563 -121422 -10164
11166 -114969 -183035 -306 130580 -107551 157344 -53417 -351652 -288468 40325 257075 109359
11154 -219038 109095 -117285 114138 65817 -108605 129120 -52605 -201549 39105 153362
11144 153362 -217455 244458 -31738 955 -237120 -114566 25289 186810 317066 27282 -228277
11132 116709 -211111 -19105 59553 87562 91755 -56977 -163558 -204371 154100 -88462 -222328
11121 -222328 -235439 110627 -14294 68961 -193538 164899 161744 51670 113094 171858 51669
11109 -12692 8300 115587 355036 -189920 280588 -191799 118379 415762 28826 237939
11099 237939 257391 401808 114951 79777 154244 222246 62895 77732 259499 15807 118744
11088A18744J7197b50521A10258l6607O7459E0419b1832i875D8497K87494j43989
11077A92002b0850A49672M13647F1792f8593D78257e1177A86381m3325L34424
11067D77480B35884m8020J37525R7126A05453L72628A52264L42270O0551J796
11057E56881j43714j24123N1259m6132J45388j69971J62896L31514k15467J3887
11047E62418p2031K4456J15052K60282l00780k67254L66682P8493j94362R8349
11037F71305J1954j84310l6100K99062C14910L78900P1700j15555K13760B00883
11026E21588J47539k32608L28109l40367K26734k367K5856p0757k57353n7404
11016B88970p9074M11119B62141J98538P6683p635A86750J62371p816L12337k94129
$$ plain form
11088 118744 135941 -250521 110258 73651 141110 50419 -21832 -9875 48497 335991 192002
11077 192002 -20850 149672 563319 61792 -68593 478257 -51177 186381 143056 477480
11067 477480 235884 187864 325389 422515 105453 478081 152264 494534 555085 556881
11057 556881 413167 289044 340303 294171 439559 269588 432484 763998 548531 562418
11047 562418 490387 514843 629895 890177 589397 322143 688825 767318 572956 671305
11037 671305 683259 498949 462849 761911 314910 693810 765510 649955 863715 200883
11026 521588 669127 436519 764628 424261 650995 648628 674484 603727 346374 288970
11016 288970 209896 621015 262141 460679 537362 529727 186750 349121 341305 653642 359513
11005C59513q434K53464q6997K91572l35074J62107o0787L6993j49666J73419
10995F36110R9494B89728L69605k39850N6091j05657M30034l83060R2770K1273
10985E30934J86220J66489k43605m2574Q1007L2331L24967l5550k05105P3343
10975H68457j27K92896j77345N46831r4937K33216n7682R7290O21991M2564n6221
10964B316933L84966k79528P2595o17411K71912m90854K91473k15036j14831n2191
10954A568028r0776j03470J21544k36191o8410j36166J30916m5466m37301m4400
10944F58308N9038k69450J16592j49507j09260r5057n4318J17078K53737k60640
10934B66521g1855f623B33692E4167Q7585C8132a38792e4947B66033c9502l7159
$$ plain form
11005 359513 351079 604543 517546 809118 474044 636151 575364 612357 462691 636110
10995 636110 735604 289728 659333 419483 475574 369917 799951 416891 509661 530934
10985 530934 717154 883643 640038 597464 678471 710802 1035769 1000219 795114 868457
10975 868457 868330 1161226 983881 1530712 1435775 1668991 1611309 1708599 2330590 2373154 2316933
10964 2316933 2701899 2422371 2494966 1877555 2149467 1658613 1950086 1735050 1620219 1568028
10954 1568028 1477252 1373782 1495326 1259135 1190725 1054559 1185475 1140009 702708 658308
10944 658308 717346 447896 564488 414981 305721 210664 156346 273424 527161 266521
10934 266521 -71855 -6623 233692 54167 141752 38132 -138792 -54947 266033 -39502 -76661
10923g6661C0331Q7302k601J07953A5870J46668n91M81b6263A17174O6043A23
10910e7889J2545B99440a25385j0092C8950e9541C4250h6711B84793h3505A64930
10898a25087B57166J81356A08472Q0921a20288A48388b4185r2664k49450E6922
10887I552J07246a46410b3618E4071J93800a17548k29951A23797m7532a84025
10876b8162A39471H69P14J28220a08364B35716n0319G0984a64957A76470a78226
10864g1815A79179b80386g8888E5296a36752p4415j07295A02292J64275a55122
10853b41270A47168g5015q9690i045A70593a13339M1729j45033C28747b77741
10842i9021B19400b44700N8674j43074J52835k1388k8614O4625d8476N976a9380
$$ plain form
10923 -76661 30331 117633 115032 222985 15870 162538 161947 162428 -26263 117174 183217 123
10910 -57889 -45344 299440 -125385 -135477 38950 -59541 34250 -86711 284793 -83505 164930
10898 -125087 257166 438522 108472 189393 -120288 148388 -24185 -116849 -366299 56922
10887 9552 116798 -146410 -23618 54071 247871 -117548 -347499 123797 76265 -184025
10876 -28162 139471 869 1583 129803 -108364 235716 185397 70984 -164957 176470 -178226
10864 -71815 179179 -280386 -78888 55296 -136752 -211167 -318462 102292 266567 -155122
10853 -241270 147168 -75015 -164705 -9045 170593 -113339 -71610 -216643 328747 -277741
10842 -99021 219400 -244700 -186026 -329100 -176265 -197653 -226267 -161642 -48476 -42500 -19380
10830A6656J67269L7903F619J83474a01213j74264B57599a58581h279j53060N7372
10819a03967K8812l6883A9902a46949B92078a75799K9909j09150J11789N924l247
10808a40574l1824A66090F2530c84230J05699J05475E8787B7782J9386O309A4668
10796I823R7155d0986l1964j41331M5694j27654B5448a23097j57783A88956e4176
10784a2940j87405b8737A02302f5523j49399A30054j0312C8026a9191D5975K8351
10773G4326a69055c9561D6026a21582j8881A53513B9743g8999k3695A65569f6255
10761C1426b7859l6578q1074C58103e6663b5600D873a88327b6138j15940L6413
10750a05665j75830R5844e132r8074p4043a663C3776h4887K0177B2133a49501
$$ plain form
10830 16656 183925 221828 6619 190093 -101213 -275477 257599 -158581 -8279 -161339 -103967
10819 -103967 -75155 -112038 19902 -146949 292078 -175799 -145890 -255040 -143251 -137327 -140574
10808 -140574 -172398 166090 62530 -384230 -278531 -173056 58787 27782 47168 53477 14668
10796 9823 106978 -40986 -72950 -214281 -168587 -296241 25448 -123097 -280880 188956 -54176
10784 -12940 -200345 -28737 102302 -65523 -214922 130054 119742 38026 -19191 45975 74326
10773 74326 -169055 -39561 46026 -121582 -140463 153513 29743 -78999 -102694 165569 -66255
10761 31426 -27859 -64437 -145511 358103 -56663 -25600 4873 -188327 -26138 -142078 -105665
10750 -105665 -281495 -185651 -5132 -103206 -177249 -1663 33776 -84887 -64710 22133 -149501
10738B68336f532k27046A6143k947g2259l8798j47477a2271A13410a19588A61468
10726i1198j1596j8715m1322B00203k9791K4942b58495R220B38750B0983K92516
10715C13499n9910b54776j47294A13048b83696f5902A164P4926a34788n3069n5181
10704b43038a02941G5872b0001p7905A37944d0971k03661B82243k1649a92698
10693c28548e6802C7498a44816n8353D2286f2811k48958B00366g8679D4304L29809
10682C74113F7037a07450j97556a10150L1496q2620n4143i9654j84181A76963
10671C3570c01814q7066A53892g5583K3586b1710P041k83P397B28894h1798j94130
10659b75928d4949K0536B69981h9798g356A53704i6745j73670Q3010p5849B62580
$$ plain form
10738 268336 -6532 -233578 16143 13196 -72259 -111057 -258534 -12271 113410 -119588 161468
10726 -91198 -102794 -121509 -162831 200203 170412 195354 -258495 -249275 238750 20983 313499
10715 313499 253589 -254776 -402070 113048 -283696 -65902 1164 76090 -134788 -187857 -243038
10704 -243038 -102941 75872 -20001 -97906 137944 -40971 -244632 282243 260594 -192698
10693 -328548 -56802 37498 -144816 -203169 42286 -62811 -311769 200366 -78679 44304 374113
10682 374113 67037 -107450 -305006 -110150 -78654 -161274 -215417 -99654 -283835 176963
10671 33570 -301814 -388880 153892 -75583 -51997 -21710 -14669 -14952 -7555 228894 -81798 -275928
10659 -275928 -44949 -24413 269981 -89798 -7356 153704 -96745 -270415 -187405 -263254 262580
10647a29257d478j00113E1977Q5697n3962a52270C7463b45778e2309A09998a9684
10635b05237j66257c9514k55320a25933A8530a13864m7399M7926G2422p171A5036
10623F2428m492P5991A3944a17755C44211B389b51856j1808g9894r1043C8306
10611A18467A9519e3920C75532f1865b2850G4282L7300e4355D0189d4103A18455
10599b32071r878O3746o521k10751g3691j18257g978m27987a49327l1514a0544
10587c4517q6111A238O5459c33251N6918g3863n7182F5051h5949A62803a66478
10575a46041A83776m1637l5248f8078p9655k8226L0750c2371A29402c57446B31513
10563e5061p9846j76989B5148a9200l23442a53448E8542b08495c1397j21282L3148
$$ plain form
10647 -129257 -4478 -104591 51977 137674 83712 -152270 37463 -245778 -52309 109998 -19684
10635 -205237 -371494 -39514 -294834 -125933 18530 -113864 -161263 -113337 72422 65251 15036
10623 62428 57936 133927 13944 -117755 344211 2389 -251856 -263664 -79894 -170937 38306
10611 118467 19519 -53920 375532 -61865 -22850 74282 111582 -54355 40189 -44103 118455
10599 -232071 -241949 -178203 -184724 -395475 -73691 -191948 -7978 -435965 -149327 -180841 -10544
10587 -34517 -120628 1238 66697 -333251 -276333 -73863 -131045 65051 -85949 162803 -166478
10575 -146041 183776 142139 106891 -68078 -147733 -175959 -145209 -32371 129402 -357446 231513
10563 -55061 -134907 -311896 25148 -19200 -342642 -153448 58542 -208495 -31397 -152679 -119531
10552a19531j6926A91329a07698o3937g2185K6087m04031I8261P3952F6115N372
10541G1487L2183k4756b93470Q4642N1771N7853B17360e4682f452k07169G5484
10529A54232a73931O9716C32018c94039a15636m0461F4284B1837J18833a83886
10518i1444b7514q8275k0982A04631a41424j49471C13729a59754I352a65107N2602
10507a12505M3736l62363A71839b20661A31675a12324A32736a96399J7864N9689
10497a18846B38633i5296A45067b32420P7081C1367f367C6417Q94L8821J85529
10486B61661d31536B4404D78J69855b02718B27729O0811j28523d9215A49879n7699
10475I2180Q5901Q3416H1712J95317E9445J56654q954h6265r410i864B24615E4877
$$ plain form
10552 -119531 -136457 191329 -107698 -171635 -72185 -46098 -450129 98261 172213 66115 71487
10541 71487 103670 78914 -293470 -208828 -157057 -99204 217360 -54682 -6452 -213621 75484
10529 154232 -173931 -104215 332018 -394039 -115636 -156097 64284 21837 140670 -183886
10518 -91444 -27514 -115789 -136771 104631 -141424 -290895 313729 -159754 9352 -165107 -112505
10507 -112505 -68769 -431132 171839 -220661 131675 -112324 132736 -196399 -178535 -118846
10497 -118846 238633 -95296 145067 -232420 -155339 31367 -6367 36417 37311 76132 261661
10486 261661 -431536 24404 478 170333 -202718 227729 288540 160017 -49215 149879 92180
10475 92180 178081 261497 81712 277029 59445 216099 207145 -86265 -95675 -9864 224615 54877
10462E9072c13582H5966a60853B5672a7831C6371b91549b2214i462A5736a23366
10450A25734F693b04603A06422b44563n4128M3932A41393a24718j00498A12339
10439F195b47095a05406k03937B3283J41945F0820b31663K6483H2576j010h940
10427a96491B10287b2185n1551k5525A28163f9366j4071n395D02388A71045c5932
10415A50830c1422B33046a10628A59489k2505E1760a40350e6174B6317K534i0287
10403A30885B2101b11166A02518B2118N650J75777a66019p7003c2902n9511G6325
10391A24571m0763J26944h5640F5841g5594B17118F7234b1497D0730b00276A94671
10379b9545F6535a6752A22374A7306M1847a36832C17865h4005B6020K29463l9417
$$ plain form
10462 59072 -313582 85966 -160853 25672 -17831 36371 -291549 -22214 -9462 15736 -123366
10450 125734 6693 -204603 106422 -244563 -298691 -254759 141393 -124718 -225216 112339
10439 6195 -247095 -105406 -309343 23283 165228 60820 -231663 -205180 82576 81566 -8940
10427 -196491 210287 -22185 -73736 -99261 128163 -69366 -83437 -88832 402388 171045 -35932
10415 150830 -31422 233046 -110628 159489 136984 51760 -140350 -56174 26317 28851 -90287
10403 130885 22101 -211166 102518 22118 27768 203545 -166019 -243022 -32902 -92413 76325
10391 124571 83808 210752 -85640 65841 -75594 217118 67234 -21497 40730 -200276 194671
10379 -29545 66535 -16752 122374 17306 59153 -136832 317865 -84005 26020 255483 216066
10368B16066h124B57642A18992C6M01566J6647j90811K03442c874C34808A65125
10356B19649J180J0472C3923J82918Q2253A29720a15417A75977Q5483M01104j56371
10345E06193p219p621j62625o580J3220L3107K51192B74103K91607B02031b2880
10333B38084D8880J00762N2865d829l5565A92820M6717j18759k1766i2412C1302
10321b47856Q103D35587D3427J07667J69817A58109j6090f5288A36717L0348R8
10310A67163j5707A5012R2530r926A7273a37043d182C3948N8835f1087j33016
10299a94103C8760a69063L2408C67083A41129F0724N8326a92743j57758a37746
10288h0369j47292J7915R1292j05673C16368a14698K458H5526a80588I2851b2962
$$ plain form
10368 216066 -8124 257642 118992 36 401602 418249 227438 430880 -3874 334808 165125
10356 219649 220829 231301 33923 216841 299094 129720 -115417 175977 261460 662564 506193
10345 506193 498974 491353 328728 322148 335368 368475 619667 274103 565710 202031 -22880
10333 238084 48880 149642 202507 -4829 -40394 192820 239537 120778 99012 -92412 31302
10321 -247856 -239753 435587 43427 151094 320911 158109 142019 -65288 136717 167065 167163
10310 167163 151456 15012 107542 97616 17273 -137043 -4182 33948 92783 -61087 -194103
10299 -194103 38760 -169063 -136655 367083 141129 60724 119050 -192743 -350501 -137746
10288 -80369 -227661 -209746 -118454 -224127 316368 -114698 -112240 85526 -180588 92851 -22962
10276B2197a90312O1354d2488a4506j77138Q5305b3546F4677a31867A20528N0530
10265A71058a70446A53439A6167h6284j18876J02012A58324b21938A16937J85289
10255C02226L3560a1268D8053L76745j25269J04313A19055L88200j96449j29761
10245A81045L3097O4921H0985b82754G7885L5287a40029i578k23881E25836B08405
10233a91031n0072A36186J0707c60233L3445J53678M9625A14935b2085B5793b70302
10221c6151A26534a27222b7304A15074d13976J25730c3224k3154G4291n941K6834
10210I5184a03943b3986j15447A6522d16969D11300A38662M8044e4848A90053
10199b2113j75419F3399e3447J0560e075n3542C0319J39245a30850L1040l14792
$$ plain form
10276 22197 -190312 -128958 -42488 -14506 -191644 -106339 -23546 64677 -131867 120528 171058
10265 171058 -170446 153439 16167 -86284 -205160 -103148 158324 -221938 116937 302226
10255 302226 335786 -11268 48053 424798 299529 403842 119055 507255 310806 181045
10245 181045 214142 279063 80985 -282754 77885 113172 -140029 -9578 -233459 525836 208405
10233 -191031 -241103 136186 146893 -360233 -326788 -173110 -123485 114935 -22085 25793 -270302
10221 -36151 126534 -127222 -27304 115074 -413976 -288246 -33224 -56378 74291 68350 95184
10210 95184 -103943 -23986 -139433 16522 -416969 411300 138662 186706 -54848 190053
10199 -22113 -197532 63399 -53447 -42887 -5075 -58617 30319 169564 -130850 -99810 -414602
10188d14602a11572j20482g775H653J9363b95244b5811q5826E8987B5984a99960
10176f1801n1968B2396J57068a10521j24365H3690J26905j01168c4633j91254
10166b25887b4902A21028e1875k12204O2487l3235j4206P7428N453B4453L5824
10155F0277a23702K5604K689A39859a10093L0147C9604b6596I4267j7623a97859
10143b63447A55562a72646j41069N1539i9419n9143K4824e8706A03525C7247j6796
10132B0451a32964c8010j33523A83416B527c04012h0750l4475D3536a80828b5509
10120b60421h0573c95l00777J27161G2905b21074J03041j43439j05575a52600
10109A86397a82231L0998a7946r4434j10075B43220A11028J90651a6290j74610
$$ plain form
10188 -414602 -111572 -232054 -7775 8653 28016 -295244 -25811 -111637 58987 25984 -199960
10176 -61801 -113769 22396 179464 -110521 -234886 83690 210595 109427 -34633 -225887
10166 -225887 -24902 121028 -51875 -264079 -201592 -234827 -249033 -171605 -166152 24453 60277
10155 60277 -123702 -98098 -95409 139859 -110093 -79946 39604 -26596 94267 76644 -197859
10143 -263447 155562 -172646 -313715 -262176 -99419 -158562 -133738 -58706 103525 37247 20451
10132 20451 -132964 -38010 -171533 183416 2527 -304012 -80750 -115225 43536 -180828 -25509
10120 -260421 -80573 -395 -301172 -174011 72905 -221074 -118033 -261472 -367047 -152600
10109 186397 -182231 -151233 -17946 -112380 -222455 243220 111028 301679 -16290 -190900
10099a90900k2643C10766c821A5997a3539j34138D1930b16626R7076b3357j06186
10088a29543k49674A2395a8330A05746f5104k65462F148a77026N0101A11871O5964
10077A77835i2847a9418k42412a244p8952A3096O8558b055r4260B93629G8914
10065c32324a14694k73919J23180Q1045h8819j9716G7315R5690a02860n5130r2880
10054b50870A03377a78197C0599a98297e8864a1386j58885E7173j4550a38141
10043d82399J59562a25954B5668K01247a1420A39733c41110J56483M8749Q811
10033a27067k62643a07620C11263i0699k28031a14663j08018A25428A2343h9659
10022G5457M6509O0970a7471F0771a56525B002N1716B2677a0145m6817A65410
$$ plain form
10099 -190900 -213543 310766 -3821 15997 -13539 -147677 41930 -216626 -119550 -23357 -129543
10088 -129543 -379217 12395 -18330 105746 -65104 -330566 6148 -177026 -126925 111871 177835
10077 177835 -92847 -19418 -261830 -1244 -80196 13096 81654 -2055 -96315 293629 78914
10065 -332324 -114694 -388613 -265433 -184388 -88819 -108535 77315 173005 -102860 -157990 -250870
10054 -250870 103377 -178197 30599 -198297 -58864 -11386 -170271 57173 42623 -138141
10043 -482399 -322837 -125954 25668 226915 -11420 139733 -341110 -184627 -135878 -127067
10033 -127067 -389710 -107620 311263 -90699 -318730 -114663 -222681 125428 12343 -89659
10022 75457 121966 182936 -17471 60771 -156525 2002 53718 22677 -10145 -56962 165410
10010D0046O3259b16760R4573A19139b11627m6935a00060D3085a93452M4966A67810
9998b06137D9008a57596c4422A33868h362p2061A14550L1944F0932K2595P3508
9987A57035b40559h0209B59799f044E3786L96275A1363c71989a09851l15668a18467
9975B24606G1245J75352c28457J55467M1414e7484A8337h898B7567h4847j13235
9964a98082r7177O7437g9733E5384a66019A48222a77662O1273D0071f0352C9356
9952A13910g5352A9355c4328j8519A33438a82402k8062e380k26523H2297j8748
9941F3549a61412O9363j12848C4722L7759a5070j38213I548b52315Q9821M454
9930a58040g612n7579D1303b16785O2966j6505A2724a63909G4429R805b14163
$$ plain form
10010 40046 103305 -216760 -122187 119139 -211627 -258562 -100060 43085 -193452 -148486 167810
9998 -206137 49008 -157596 -34422 133868 -8362 -80423 114550 146494 60932 83527 157035
9987 157035 -240559 -80209 259799 -6044 53786 450061 11363 -371989 -109851 -425519 -118467
9975 224606 71245 246597 -328457 -172990 -131576 -57484 18337 -8898 27567 -84847 -198082
9964 -198082 -295259 -227822 -79733 55384 -166019 148222 -177662 -116389 40071 -60352 39356
9952 113910 -75352 19355 -34328 -52847 133438 -182402 -210464 -5380 -231903 82297 63549
9941 63549 -161412 -92049 -204897 34722 72481 -15070 -153283 9548 -252315 -162494 -158040
9930 -158040 -7612 -65191 41303 -216785 -153819 -170324 12724 -163909 74429 84234 -214163
9918d2369l28433b1827E7257N8327J51221f6688j52319j25325b7738B00637o6110
9907A34527l9891b79557J02541B2146a5653k70387A67319b44620G4061b12257
9896f1991H188J25057n5841g1872A36084l2005a63229K3178A03791b01290k33051
9885d34341B1781i3711j6467A0014a49286c7781E0347g9839j42358A08298J8995
9874A27293d28449A93838a3304o8509L5292f641B022O2978f1491l811l55365J13141
9862c07526C52403d34812a91518C24308A42770c36982E0017K73442b94608R3992
9852b00616h9296C4034R9178L0517b95271R1133A81952B4306b94158A54059g7731
9840a85814J4050p8988p0253g2840B54368J2418e738j25028A2359d9093j21499
$$ plain form
9918 -42369 -370802 -21827 57257 115584 266805 -66688 -219007 -344332 -27738 200637 134527
9907 134527 94636 -279557 -177016 22146 -15653 -286040 167319 -244620 74061 -212257
9896 -61991 8188 133245 77404 -71872 136084 104079 -163229 -140051 103791 -201290 -434341
9885 -434341 21781 -93711 -110178 10014 -149286 -37781 50347 -79839 -222197 108298 127293
9874 127293 -428449 193838 -13304 -81813 -46521 -6641 2022 65000 -61491 -65302 -420667 -307526
9862 -307526 352403 -434812 -191518 324308 142770 -336982 50017 323459 -294608 -200616
9852 -200616 -89296 34034 133212 163729 -295271 -204138 181952 24306 -294158 154059 -77731
9840 -185814 -171764 -250752 -321005 -72840 254368 266786 -5738 -130766 12359 -49093 -170592
9829a70592G2793l4038a96959j18598L0300N9976H668a07422j48126A11341a63432
9817A28630a84554M2435r2576c3256k62823L2086h8233n0182r7950a2799F7278
9805a18529G6785a3299n873d700j95918g3034j7852j24237A81585a56982G8243
9793a57485N9037k5046j20735b5977k40557p134i9854B84029b86323O6028D3999
9781I091a60423e63D385a86592g0166F0237i6243J4554j53961A75316f5378m448
9769f9826D7696d36275h6940J5097l7192k56362a9901m04488A25202N4729a03927
9757a03078k29843A07946B1152b86714A4491K0648K15911c24484e4841j14711
9747a69552o8802c2157j15672L0634H4855a10435d14l44690C64856i1617B28084
$$ plain form
9829 -170592 72793 38755 -196959 -315557 -285257 -225281 8668 -107422 -255548 111341 -163432
9817 128630 -184554 -142119 -234695 -33256 -296079 -263993 -88233 -138415 -236365 -12799 67278
9805 -118529 76785 -13299 -19172 -4700 -200618 -73034 -90886 -215123 181585 -156982 78243
9793 -157485 -98448 -123494 -244229 -25977 -266534 -273668 -99854 284029 -286323 -220295 43999
9781 9091 -160423 -563 4385 -186592 -70166 60237 -96243 -81689 -235650 175316 -65378 -69826
9769 -69826 47696 -436275 -86940 -71843 -109035 -365397 -19901 -424389 125202 179931 -103927
9757 -103078 -332921 107946 21152 -286714 14491 35139 251050 -324484 -54841 -169552
9747 -169552 -238354 -32157 -147829 -117195 84855 -110435 -414 -345104 364856 -91617 228084
9735A60282B5158g6194A54962f8703J1241n2460m0576f8869D6627L9904a96593
9723a5912l28893a13764A61018F7033A7182L20945a90566c292l5867j77914M6701
9712a70372j4881h8626F7454J00126A5168a95633k0768A42178O5502J76182C5226
9700a19594l7266g2681A64347a23853H2832G457J64796L6557c7904J3762j08569
9689a32711A18676a52718j18562c5511k51051b8609B91132j34033a79961D5655
9678i2597A42312b53741B42043n3986M8967j00094a83938B25229a8379B817h5185
9666h8157c7709C23097a51213a7404B0530e2141A08658m132i7401i45B28559a45406
9653b709B02496a77588L9102B3719i019l16714g3323B8022O8312j9294g2462q0325
$$ plain form
9735 160282 25158 -76194 154962 -68703 -57462 -109922 -150498 -68869 46627 86531 -196593
9723 -15912 -344805 -113764 161018 67033 17182 338127 -190566 -3292 -39159 -217073 -170372
9712 -170372 -185253 -88626 67454 167580 15168 -195633 -216401 142178 207680 383862 35226
9700 -119594 -156860 -72681 164347 -123853 82832 7457 172253 208810 -37904 -24142 -132711
9689 -132711 118676 -152718 -271280 -35511 -286562 -28609 291132 157099 -179961 45655
9678 -92597 142312 -253741 242043 188057 237024 136930 -183938 225229 -18379 2817 -85185
9666 -88157 -37709 323097 -151213 -17404 20530 -52141 108658 104526 -97401 -945 228559 -145406
9653 -2709 202496 -177588 -138486 23719 -9019 -325733 -73323 28022 96334 77040 -72462 -152787
9641a52787e8773p0975K9602M3082p042o715K1088j50188j0197A96340a6893C8746
9628c04644D6451a9755A8504b77806B15322Q7382b35110F4964e101m4765A79359
9616H3358a91820H7993O5716b5469k6782n4645F9717c11367i0175A3186b34530
9604C01354a63457P3924d0331D7312A5777e4119F2417J99596a54952b2581n8001
9593h0582B46006G5338l0918b19324c3803I483a44609G7055C3992Q6741a79885
9581A84338a81080A25189b62987e9029J5592D2220a82397A54727c96171a56509
9570h1152O794j24208h8707D9785A4862a96979N3214A12422D6763b7428m8112
9559g5540c6511j60353r9033a0417m18880B73546B6081I43J29706d47706g928
$$ plain form
9641 -152787 -58773 -129748 -100146 -57064 -64106 -70821 -49733 -199921 -210118 196340 -16893 38746
9628 -304644 46451 -19755 18504 -277806 215322 302704 -235110 64964 -5101 -49866 179359
9616 83358 -191820 87993 153709 -25469 -52251 -106896 69717 -311367 -90175 13186 -234530
9604 301354 -163457 -89533 -40331 47312 15777 -54119 62417 262013 -154952 -22581 -80582
9593 -80582 246006 75338 44420 -219324 -33803 9483 -144609 77055 33992 120733 -179885
9581 184338 -181080 125189 -262987 -59029 -43437 42220 -182397 154727 -396171 -156509
9570 -81152 -74358 -198566 -88707 49785 14862 -196979 -143765 112422 46763 -27428 -75540
9559 -75540 -36511 -196864 -295897 -10417 -429297 273546 26081 943 130649 -447706 -7928
9547b20114j85564j4923A46363a8567j24413O2452j14775j2049A20337d30007
9536a17972j06475P4723f1531O360G4499C2678b73028b0321j16496C6927a76653
9524a8735F0197c2898A47083p1938a75577A5224a13153L565A32749F0115a84767
9512c10822D2691e10954b53029b6686n03371i6122j24567A33755n2695a1870F0820
9500A09281O8880i2487p2134H823J39526c3935R027C4475c0776j34258A43351
9488d5564a2903I6475b94663D59697i4664j02948M7618j9404k92788A474O5250
9477F6724j3764a04781H7033a58910A15873j9481e30684a12212G43K9796g764
9465a21128A45785Q3911E0729a8026j88672A20572a81265j7705c3782j32285j1866
$$ plain form
9547 -220114 -405678 -420601 146363 -18567 -142980 -80528 -195303 -207352 120337 -430007
9536 -117972 -224447 -149724 -61531 -55171 74499 32678 -273028 -20321 -136817 36927 -176653
9524 -18735 60197 -32898 147083 75145 -175577 15224 -113153 -109588 132749 60115 -184767
9512 -310822 42691 -510954 -253029 -26686 -530057 -96122 -220689 133755 81060 -11870 60820
9500 109281 178161 -92487 -164621 8823 148349 -33935 -24908 34475 -30776 -165034 143351
9488 -45564 -12903 96475 -294663 459697 -94664 -197612 -149994 -169398 -462186 1474 66724
9477 66724 52960 -104781 87033 -158910 115873 96392 -530684 -112212 743 30539 -7764
9465 -121128 145785 229696 50729 -18026 -206698 120572 -181265 -198970 -33782 -166067 -177933
9454a77933M7195b5774A57202b88899c3309p5894b1443o8651k97033B78394A05316
9442A71646c4892k06150j74184J94167e0836A40572L6473O9282a90787A36003
9431B62740b78254h7845a5746k70837L7191G5205b38806i9650J3618d2251j22902
9420a65153j75699J05784O8706e124q5788b9854j69218j55564J24572P1786j11144
9409b69422a32680c6023k70916a08192L5439A2268a18511d0904l05347a70902
9398e5361j90801A38448h5028F9272L3549c9840H1509j3553e2527q2321c3632
9386G3761c9948k59202A67025o0105l835a46470A03290J16044G1924a91195B02249
9374g5635B46075c57940b7862A6426a89770B3555c4586j51254A8346E772a75551
$$ plain form
9454 -177933 -130738 -25774 157202 -288899 -33309 -109203 -21443 -90094 -387127 278394 105316
9442 171646 -34892 -241042 -415226 -221059 -50836 140572 177045 246327 -190787 136003
9431 262740 -278254 -87845 -15746 -286583 -249392 75205 -238806 -99650 -86032 -42251 -165153
9420 -165153 -340852 -235068 -166362 -5124 -90912 -29854 -199072 -354636 -230064 -158278 -269422
9409 -269422 -132680 -36023 -306939 -108192 -72753 12268 -118511 -40904 -346251 -170902
9398 -55361 -246162 138448 -85028 69272 102821 -39840 81509 67956 -52527 -134848 -33632
9386 73761 -39948 -299150 167025 106920 103085 -146470 103290 219334 71924 -191195 202249
9374 -75635 246075 -357940 -27862 16426 -189770 23555 -34586 -185840 18346 5772 -175551
9362h7711j94905B8093h7538n0264K7589A3225N5757a72136I5907C1334J79795
9351B11129b70103E4688h1761J3009E293K7426O4255a57D96J01878c4794B22497
9338c08912c6169q1694E92K33519A3850J05570R42m5450b39801c0832A5214n068
9326A0146a31512E0852a03266A83727a18188K1530F8121p37b30973O8487A39738
9314h0401j40722R1902N064C14528e7314B33938d7930E9705h3851A8665L2327
9303E0992a13441E2442O1108a61138B5270Q1506a25610p4817j37720e5985j96554
9292b52539J6668N506I5622b55705h1828h018G4473b46592A63576a98745A06961
9280A36906i7179A9772K07315a37384c1406m7615b2492D6874c2222A55849l3738
$$ plain form
9362 -87711 -282616 28093 -87538 -137802 -110213 13225 68982 -172136 95907 31334 211129
9351 211129 -270103 54688 -81761 -68752 5293 32719 96974 -157 496 102374 -34794 222497
9338 -308912 -36169 -117863 592 234111 13850 119420 120362 74912 -239801 -30832 15214 10146
9326 10146 -131512 50852 -103266 183727 -118188 -96658 68121 67384 -230973 -162486 139738
9314 -80401 -221123 -129221 -124157 314528 -57314 233938 -47930 59705 -83851 18665 50992
9303 50992 -113441 52442 113550 -161138 25270 106776 -125610 -200427 -338147 -55985 -252539
9292 -252539 -235871 -230365 95622 -255705 -81828 -8018 74473 -246592 163576 -198745 106961
9280 136906 -97179 19772 227087 -137384 -31406 -79021 -22492 46874 -32222 155849 122111
9269A22111c5931n8091A21601a49689D7140A5789g5284l0034d4634A3954a97655
9257B5216c06056A06135a17179j24561c0116C64395h3037K7052f018m44755K1360
9246d29413b7136j32514C60761j72239G7803a57089L9793N72J6621j33669a14906
9234I034J266J1489a65447M3743j15762E7104a72417E3629h0711e219j98752F7532
9221b77910A8253g6381G4811a07243c1128H6541d5828r0981A0778f1503D4580
9209b4615j64999j74011A75160d4218C2422a3186k87482B20787g6527j96201l9705
9198c12433J32180A06406J1843d65437b15227C07735A14986b01060i1216C0588
9187b11966C5174R6300D0854a55241j5573q477Q5134E2220a67868d1011q1943
$$ plain form
9269 122111 -35931 -94022 121601 -149689 47140 15789 -75284 -105318 -44634 13954 -197655
9257 25216 -306056 106135 -117179 -241740 -30116 364395 -83037 -55985 -6018 -450773 -429413
9246 -429413 -27136 -159650 360761 188522 77803 -157089 -117296 -116724 -100103 -233772 -114906
9234 9034 10300 21789 -165447 -121704 -237466 57104 -172417 53629 -80711 -5219 -203971 67532
9221 -277910 18253 -76381 74811 -107243 -31128 86541 -45828 -136809 10778 -61503 44580
9209 -24615 -189614 -363625 175160 -44218 32422 -13186 -300668 220787 -76527 -272728 -312433
9198 -312433 -180253 106406 118249 -465437 -215227 307735 114986 -201060 -91216 30588
9187 -211966 35174 131474 40854 -155241 -170814 -179291 -94157 52220 -167868 -41011 -122954
9176a22954A65592H0512J71042A22098a02031k98612C89171I0135i5603A49924
9165b6483A06717a65762Q2726A2236b00095Q6555m8872A02263a4481A50668b06443
9153b32542a9612C09038a32445a7344k5019B37503j13923a00505o0927B81527
9142i4170m5848N6048A51206a57023A07311B64c01791A25685d19217a77829j92815
9131c70644A93636p8814P3674b18437H4252e5130A32979b51047A00340a9109A38803
9119G5799l3068a02803A17213a67013d7019K0294k94349G2351a22621b6639A17245
9107C26423b29225n4060e9663A29855d8157l38065P4229j8601L2436a05360k8238
9096a33598b4163A3669L0954i86l33064A55634o8250Q9870h6168L598A14632f5158
$$ plain form
9176 -122954 165592 80512 251554 122098 -102031 -400643 389171 90135 -95603 149924
9165 -26483 106717 -165762 -83036 12236 -200095 -113540 -162412 102263 -14481 150668 -206443
9153 -232542 -19612 309038 -132445 -17344 -42363 237503 123580 -100505 -161432 281527
9142 -94170 -140018 -83970 151206 -157023 107311 264 -301791 125685 -419217 -177829 -370644
9131 -370644 193636 114822 188496 -218437 84252 -55130 132979 -251047 100340 -19109 138803
9119 75799 42731 -102803 117213 -167013 -47019 -26725 -321074 72351 -122621 -26639 117245
9107 326423 -229225 -283285 -59663 129855 -48157 -386222 -311993 -330594 -298158 -105360 -133598
9096 -133598 -24163 13669 44623 -986 -334050 155634 87384 177254 -86168 -82570 114632 -65158
9083a23396b1132F5088O9089i4662j87742a37572E1676r74a1219j83966A36773
9071B04301a02962k67312A77188k8731a10313j6584a1028N89G1228h0368b5274
9059a60260a9509B06704a68172N5513e1680a7491m5349A16160l2110R2015d7063
9047g1286p0375A9478J29420B1706a55509r2082e28q2325C8170b29379B2517L6799
9035E9316b79800A33640n0647b00119p2804C4719c79569m1333e4667b6173A36607
9023a76125P7468B36805b22700d9978b232j56695o1295F7130b53613R6436e8230
9011a29566j23516j75898C3584K03977n6467F2800f177j50621N1084E1973d3072
8999b168D3588b20654A01081C2040L02656i7451c249p8857K8823m34890a20151
$$ plain form
9083 -123396 -21132 65088 134177 -94662 -282404 -137572 51676 50702 -11219 -195185 136773
9071 204301 -102962 -370274 177188 148457 -110313 -126897 -11028 -10439 71228 -80368 -25274
9059 -160260 -19509 206704 -168172 -112659 -51680 -17491 -62840 116160 84050 176065 -47063
9047 -71286 -141661 19478 148898 21706 -155509 -247591 -528 -82853 38170 -229379 22517 59316
9035 59316 -279800 133640 82993 -200119 -272923 34719 -379569 -420902 -54667 -26173 136607
9023 -176125 -98657 236805 -222700 -49978 -2232 -158927 -220222 67130 -253613 -157177 -58230
9011 -129566 -253082 -428980 33584 237561 181094 62800 -6177 -156798 -105714 51973 -43072
8999 -2168 43588 -220654 101081 32040 334696 -97451 -3249 -82106 -53283 -488173 -120151
8987d5430k30163a16865h864j1898I1921A6515J15716c3290j54026j50791B61186
8975A22175a41586r8337A46773b57385D5526M088b66870m5795B9161d53682K06776
8964b46906r1166A28187e22H7249A8851C441K03772a97935i2466B51856b6726
8952b45917B30330b93816B4911j0775b3251C03600A529L31640A28189J04719I6931
8940e24012D5891a19521j44373k6907H2613b55080g2405j06738E926e469A75035
8928A30281c1579j40910m1220d4235C3943c03683J43219f1351i100D14285N14598
8917I28883B10309L7257i325j25456B49117H3401K56991C1689K16133O0452A15854
8905B59059a4723n8838B77968l9591A06809J3816a99162A31852K1671a14545R153
$$ plain form
8987 -45430 -275593 -116865 -8864 -20762 91921 16515 132231 -33290 -187316 -338107 261186
8975 122175 -141586 -239923 146773 -257385 45526 49614 -266870 -312665 29161 -453682 -246906
8964 -246906 -338072 128187 -522 87249 18851 3441 207213 -197935 -92466 251856 -26726
8952 -245917 230330 -293816 24911 14136 -23251 303600 1529 333169 128189 232908 96931
8940 -524012 45891 -119521 -263894 -290801 82613 -255080 -72405 -179143 5926 -5469 175035
8928 130281 -31579 -172489 -213709 -44235 33943 -303683 -160464 -61351 -9100 414285 928883
8917 928883 210309 247566 -9325 -134781 249117 83401 340392 31689 247822 308274 115854
8905 259059 -14723 -73561 277968 238377 106809 120625 -199162 131852 153523 -114545 -105392
8894a05392A23103n4756c2218B5663b56282A0257J09335b92846A08983a21881
8883a33943I3345c5494l5776a2295j66323f9661b2020B4486M1370J55592A05557
8871B5743d16634g2023K120A8231b07955B56127C6180a54833H9383M2766b10883
8859a68641P4369A63528d5457B01476I2768b24961D341c18465A98436d0802j93402
8848b34204b4020o3553j84395J6096B13057F6458c67991J9642J29656E6721d645
8836a40604A19345c8842B23450a9882D0809a87522A29935C5206b03337Q5715c1188
$$ plain form
8894 -105392 123103 68347 -32218 25663 -256282 10257 119592 -292846 108983 -121881
8883 -133943 93345 -35494 -71270 -12295 -178618 -69661 -22020 24486 65856 221448 105557
8871 25743 -416634 -72023 -69903 18231 -207955 256127 36180 -154833 89383 132149 -210883
8859 -168641 -94272 163528 -45457 201476 92768 -224961 4341 -318465 198436 -40802 -234204
8848 -234204 -24020 -87573 -271968 -255872 213057 66458 -367991 -348349 -218693 56721 -4645
8836 -140604 119345 -38842 223450 -19882 40809 -187522 129935 35206 -203337 -117622 -31188
$$ [...]
##END NTUPLES=NMR SPECTRUM
##END=
