##TITLE=NES1098_CD3_9886922_Iyb4cjCL7v
##JCAMPDX= 6.0         $$ Bruker NMR JCAMP-DX V2.0
##DATA TYPE= NMR SPECTRUM
##DATA CLASS= NTUPLES
##ORIGIN= BRUKER
##OWNER= Administrator
$$ 1.72 TOPSPIN		Version 2.1
$$ 2016-08-28 16:49:03.648 -0500  Administrator@X
$$ Compression mode = diff/dup
##.OBSERVE FREQUENCY= 400.02188249412
##.OBSERVE NUCLEUS= ^1H
##.ACQUISITION MODE= SIMULTANEOUS (DQD)
##.ACQUISITION SCHEME= undefined
##.AVERAGES= 64
##.DIGITISER RES= 22
##SPECTROMETER/DATA SYSTEM= spect
##.PULSE SEQUENCE= noesygpps1d.comp
##.SOLVENT NAME= COFFEE_meoh
##.SHIFT REFERENCE= INTERNAL, COFFEE_meoh, 1, 14.96285
##AUDIT TRAIL= $$ (NUMBER, WHEN, WHO, WHERE, PROCESS, VERSION, WHAT)
$$ ##TITLE= Audit trail, TOPSPIN		Version 2.1
$$ ##JCAMPDX= 5.01
$$ ##ORIGIN= Bruker BioSpin GmbH
$$ ##OWNER= Administrator
$$ $$ E:\/data/COFFEE/nmr/NES1098_CD3_9886922_Iyb4cjCL7v/22/pdata/1/auditp.txt
$$ ##AUDIT TRAIL=  $$ (NUMBER, WHEN, WHO, WHERE, PROCESS, VERSION, WHAT)
(   1,<2016-08-28 16:48:58.539 -0500>,<Administrator>,<X>,<go>,<TOPSPIN 2.1>,
      <created by zg
	started at 2016-08-28 16:37:28.726 -0500,
	POWCHK enabled, PULCHK disabled,
       configuration hash MD5:
       21 0F 79 D6 B3 7B B4 F6 88 20 88 DB 03 48 BD 9F
       data hash MD5: 64K
       A4 E8 F6 89 C9 22 B9 29 6D 30 FF E9 D8 A4 C7 22>)
(   2,<2016-08-28 16:49:01.633 -0500>,<Administrator>,<X>,<proc1d>,<TOPSPIN 2.1>,
      <Start of raw data processing
       efp LB = 0.3 FT_mod = 6 PKNL = 1 PHC0 = 0 PHC1 = 0 SI = 128K 
       data hash MD5: 128K
       B5 D4 D8 6B 54 65 63 D7 10 BA 3B 6B E1 8F B1 E5>)
(   3,<2016-08-28 16:49:02.476 -0500>,<Administrator>,<X>,<proc1d>,<TOPSPIN 2.1>,
      <pk PHC0 = -85.23743 PHC1 = 0 
       data hash MD5: 128K
       9A 68 C4 99 11 9B 2F F4 F7 5C FB 62 57 5E 23 7E>)
(   4,<2016-08-28 16:49:02.851 -0500>,<Administrator>,<X>,<proc1d>,<TOPSPIN 2.1>,
      <abs ABSG = 1 
       data hash MD5: 128K
       70 17 B3 99 B1 41 41 CC 20 64 8A 6D 70 37 F2 9A>)
(   5,<2016-08-28 16:49:02.961 -0500>,<Administrator>,<X>,<proc1d>,<TOPSPIN 2.1>,
      <abs ABSG = 2 
       data hash MD5: 128K
       A9 D2 50 FA D8 E9 B8 DD 17 CB A0 38 1B BC 6E 26>)
(   6,<2016-08-28 16:49:03.023 -0500>,<Administrator>,<X>,<proc1d>,<TOPSPIN 2.1>,
      <abs ABSG = 3 
       data hash MD5: 128K
       2E 1E 4A 9A 2A 17 77 A7 8D 3C 95 59 26 53 9C 7B>)
(   7,<2016-08-28 16:49:03.117 -0500>,<Administrator>,<X>,<proc1d>,<TOPSPIN 2.1>,
      <abs ABSG = 4 
       data hash MD5: 128K
       27 BA B3 B6 83 BF 64 F4 E1 0B 9F 49 C4 9F 4E 00>)
(   8,<2016-08-28 16:49:03.242 -0500>,<Administrator>,<X>,<proc1d>,<TOPSPIN 2.1>,
      <abs ABSG = 5 
       data hash MD5: 128K
       B2 9A A7 CF 2F EA 24 91 38 4E 2D D8 D4 30 D2 75>)
$$ ##END=
$$ 
$$ $$ hash MD5
$$ $$ 7D 55 90 37 9F 54 0F 81 A8 FF 31 D1 E6 AA BE 8B
##$RELAX= 
##$RELAX= 
##$RELAX= 
##$RELAX= 
##$RELAX= 
##$RELAX= 
##$RELAX= 
##$RELAX= 
$$ Bruker specific parameters
$$ --------------------------
##$DU= <E:\>
##$EXPNO= 22
$$ [...]
##$TP07= 0
##$TPNAME0= <>
##$TPNAME1= <>
##$TPNAME2= <>
##$TPNAME3= <>
##$TPNAME4= <>
##$TPNAME5= <>
##$TPNAME6= <>
##$TPNAME7= <>
##$TPOAL= (0..7)
0.5 0.5 0.5 0.5 0.5 0.5 0.5 0.5
##$TPOFFS= (0..7)
0 0 0 0 0 0 0 0
##$TUNHIN= 0
##$TUNHOUT= 0
##$TUNXOUT= 0
##$USERA1= <user>
##$USERA2= <user>
##$USERA3= <user>
##$USERA4= <user>
##$USERA5= <user>
##$V9= 5
##$VALIST= <valist>
##$VCLIST= <CCCCCCCCCCCCCCC>
##$VD= 0
##$VDLIST= <DDDDDDDDDDDDDDD>
##$VPLIST= <PPPPPPPPPPPPPPP>
##$VTLIST= <TTTTTTTTTTTTTTT>
##$WBST= 2048
##$WBSW= 25
##$XGAIN= (0..3)
0 0 0 0
##$XL= 0
##$YL= 0
##$YMAX_a= 6977973
##$YMIN_a= -14907460
##$ZGOPTNS= <>
##$ZL1= 120
##$ZL2= 120
##$ZL3= 120
##$ZL4= 120
##$ABSF1= 14.96285
##$ABSF2= -5.595332
##$ABSG= 5
##$ABSL= 3
##$ALPHA= 0
##$AQORDER= 0
##$ASSFAC= 0
##$ASSFACI= 0
##$ASSFACX= 0
##$ASSWID= 0
##$AUNMP= <proc_prof1d_extract.lims>
##$AXLEFT= 0
##$AXNAME= <>
##$AXNUC= <1H>
##$AXRIGHT= 0
##$AXTYPE= 0
##$AXUNIT= <>
##$AZFE= 0.1
##$AZFW= 0.1
##$BCFW= 0
##$BC_mod= 0
##$BYTORDP= 0
##$COROFFS= 0
##$CY= 15
##$DATMOD= 1
##$DC= 0
##$DFILT= <>
##$DTYPP= 0
##$F1P= 0
##$F2P= 0
##$FCOR= 0.5
##$FTSIZE= 131072
##$FT_mod= 6
##$GAMMA= 0
##$GB= 0
##$INTBC= 1
##$INTSCL= 1
##$ISEN= 128
##$LB= 0.3
##$LEV0= 0
##$LPBIN= 0
##$MAXI= 10000
##$MC2= 0
##$MEAN= 0
##$ME_mod= 0
##$MI= 0
##$NCOEF= 0
##$NC_proc= -2
##$NLEV= 6
##$NOISF1= 0
##$NOISF2= 0
##$NSP= 0
##$NTH_PI= 0
##$NZP= 0
##$OFFSET= 14.96285
##$PC= 1
##$PHC0= -85.23743
##$PHC1= 0
##$PH_mod= 1
##$PKNL= yes
##$PPARMOD= 0
##$PPDIAG= 0
##$PPIPTYP= 0
##$PPMPNUM= 2147483647
##$PPRESOL= 1
##$PSCAL= 4
##$PSIGN= 0
##$PYNMP= <proc.py>
##$REVERSE= no
##$SF= 400.020008897558
##$SI= 131072
##$SIGF1= 0
##$SIGF2= 0
##$SINO= 400
##$SIOLD= 131072
##$SPECTYP= <>
##$SREGLST= <1H.CDCl3>
##$SSB= 0
##$STSI= 131072
##$STSR= 0
##$SW_p= 8223.68421052631
##$SYMM= 0
##$S_DEV= 0
##$TDeff= 65536
##$TDoff= 0
##$TI= <>
##$TILT= no
##$TM1= 0
##$TM2= 0
##$TOPLEV= 0
##$USERP1= <user>
##$USERP2= <user>
##$USERP3= <user>
##$USERP4= <user>
##$USERP5= <user>
##$WDW= 1
##$XDIM= 131072
##$YMAX_p= 368977613
##$YMIN_p= -13022
##$CURPLOT= <Network HP LaserJet P1505>
##$CURPRIN= <$Network HP LaserJet P1505>
##$DFORMAT= <normdp>
##$LAYOUT= <+/1D_H.xwp>
##$LFORMAT= <normlp>
##$PFORMAT= <normpl>
##$SURQMSG= 1
$$ End of Bruker specific parameters
$$ ---------------------------------
##NTUPLES= NMR SPECTRUM
##VAR_NAME=  FREQUENCY,     SPECTRUM/REAL,   SPECTRUM/IMAG
##SYMBOL=    X,             R,               I
##VAR_TYPE=  INDEPENDENT,   DEPENDENT,       DEPENDENT
##VAR_FORM=  AFFN,          ASDF,            ASDF
##VAR_DIM=   131072,        131072,          131072
##UNITS=     HZ,            ARBITRARY UNITS, ARBITRARY UNITS
##FACTOR=    0.0627417313425164, 1,          1
##FIRST=     8223.62146879497, 2,            -53817
##LAST=      0,             2578,            -54160
##MIN=       0,             -13022,          0
##MAX=       8223.62146879497, 368977613,    0
$$ Real data points
##PAGE= N=1
##DATA TABLE= (X++(R..R)), XYDATA
$$ [...]
61002A218454M8790N3083N8453O4868P2639Q1852R1715J01021J09313J17417J26935
60991B144540J39779J58125J84144K19487K65410L23506L96163M86791O00703
60982D918648P45558R29305J156884J428404J735169K045319K284800K342115
60974A7586202K120374J613472R41053K99073j40820l02876k07839O3677L92345
60965B2364661O25984O13750K79793l18779j012264j610180j992177k136536k089401
60956A4724851j919698j691309j452475j232144j041262q79768p44381o31578
60948E132236n37165m56939l88611l31905k86548k50951k22779j99862j80386
60939B277090j63035j47317j33323j20816j08937r6992q5257p4728o6253n9986
$$ y = [1218454, 1267244, 1320327, 1378780, 1443648, 1516287, 1598139, 1689854, 1790875, 1900188, 2017605, 2144540, 2284319, 2442444, 2626588, 2846075, 3111485, 3434991, 3831154, 4317945, 4918648, 5664206, 6593511, 7750395, 9178799, 10913968, 12959287, 15244087, 17586202, 19706576, 21320048, 22261101, 22560174, 22419354, 22116478, 21908639, 21972316, 22364661, 22990645, 23604395, 23884188, 23565409, 22553145, 20942965, 18950788, 16814252, 14724851, 12805153, 11113844, 9661369, 8429225, 7387963, 6508195, 5763814, 5132236, 4595071, 4138132, 3749521, 3417616, 3131068, 2880117, 2657338, 2457476, 2277090, 2114055, 1966738, 1833415, 1712599, 1603662, 1506670, 1421413, 1346685, 1280432, 1220446]
60929A220446n5577n2610n0739m9425m7770m4999m1127l6947l3175k9915k6986
60918G51176k4352k1900j9215j6069j2934j0547r139q367p812p103n869m040k180
60905F01649r58m30j37J91N40J027J883L057M267N353O109O054N019L757L215
60890F40596L211K629R77j065k804m324n950p645r282j0783j1700j1482j0465
60877E71913r779r832r695q573o950n665m650l519k595k315k127j126N31J871
60863E07489K614L300M163M837N303O102P416Q771R860J0953J2279J3622J4798
60850F11507J5900J6938J7706J8164J8382J7988J6360J3595J0730Q688P445O460
60838G79863N444M455L666L253L177K940J993M78r27k003l210m726o009o725p426
$$ y = [1220446, 1164869, 1112259, 1061520, 1012095, 964325, 919326, 878199, 841252, 808077, 778162, 751176, 726824, 704924, 685709, 669640, 656706, 646159, 637020, 628653, 620841, 613738, 607869, 603829, 601649, 600691, 600261, 600124, 600315, 600855, 601882, 603765, 606822, 611089, 616442, 622551, 628605, 633624, 637381, 640596, 643807, 646436, 647413, 646348, 643544, 639220, 633270, 625625, 616343, 605560, 593860, 582378, 571913, 562134, 552302, 542607, 534034, 527084, 521419, 516769, 513250, 510655, 508340, 506213, 505087, 505618, 507489, 510103, 513403, 517566, 522403, 527706, 533808, 541224, 549995, 559855, 570808, 583087, 596709, 611507, 627407, 644345, 662051, 680215, 698597, 716585, 732945, 746540, 757270, 765958, 773403, 779863, 785307, 789762, 793428, 796681, 799858, 802798, 804791, 805269, 804342, 802339, 799129, 794403, 788394, 781669, 774243]
60823G74243q710j0210j1073j1121j0918j0824j0635j0126r383q497p364n960
60811F59422m516l241k007n47J053K218K454K069K027K851L942M353M059L868
60797F78005M131M218L488K164R29L7o80j338j873k215k261j866j138m59J7O52
60781F81811J827L421N072O642Q121R387J0433J1553J2840J3765J3699J2714J1419
60768H02704J0103Q588O866N327M187L217K182J271Q07P77Q57Q13P17P89J129
60753H50334J538J663J301N62l15j234k264l471m783o099p363q575r672j0402
60739H01220j0503j0160j0090j0836j2053j2852j2891j2644j2523j2311j1696
60728F72661j0845j0053r216q196p301o869o579n777m383k947j832q72R7R34J520
$$ y = [774243, 765533, 755323, 744250, 733129, 722211, 711387, 700752, 690626, 681243, 672746, 665382, 659422, 654906, 651665, 649658, 649111, 650164, 652382, 654836, 656905, 658932, 661783, 665725, 670078, 674137, 678005, 682136, 686354, 689842, 692006, 692935, 692972, 692292, 690954, 689081, 686866, 684605, 682739, 681601, 681142, 681159, 681811, 683638, 687059, 692131, 698773, 706894, 716281, 726714, 738267, 751107, 764872, 778571, 791285, 802704, 812807, 821395, 828261, 833588, 837775, 840992, 843174, 844445, 845252, 846029, 846886, 847699, 848416, 849205, 850334, 851872, 853535, 854836, 855398, 855083, 853849, 851585, 848114, 843331, 837232, 829869, 821294, 811622, 801220, 790717, 780557, 770467, 759631, 747578, 734726, 721835, 709191, 696668, 684357, 672661, 661816, 651763, 642547, 634351, 627050, 620181, 613602, 607825, 603442, 600495, 598663, 597791, 597888, 598822, 600342]
60713F00342K033K690L458M181M754N097N124M811M164L105J597j74j938l630
60699F35614n308o866q135r187j0231j1158j1541j1215j0521r879r357q787q109
60686E15320p428o857o393n883n099l988k778j706o98L87J378K010K576L754N604
60671D90199P169P534O949O454O559O804O629O107N639N327N055M909N116N623
60657E76073O174O778P724Q957R874J0012R691R602R944J0346J0512J0514J0478
60644F96679J0391J0301J0304J0182R538Q350P177O524O350O271N916N010L491
60631G96484J757L41q58k519m759o605p185o962p126q029q920r194r107r139r169
60616G09010q634p204n183l320k185j550m98J604M413P075R098J0437J1067J0985
$$ y = [600342, 602375, 605065, 608523, 612704, 617458, 622555, 627679, 632490, 636654, 639759, 641356, 641182, 639244, 635614, 630306, 623440, 615305, 606118, 595887, 584729, 573188, 561973, 551452, 541573, 532216, 523429, 515320, 507892, 501035, 494642, 488759, 483660, 479672, 476894, 475188, 474490, 474877, 476255, 478265, 480841, 484595, 490199, 497368, 504902, 511851, 518305, 524864, 531668, 538297, 544404, 550043, 555370, 560425, 565334, 570450, 576073, 582247, 589025, 596749, 605706, 615580, 625592, 635283, 644885, 654829, 665175, 675687, 686201, 696679, 707070, 717371, 727675, 737857, 747395, 755745, 762922, 769446, 775796, 782067, 787983, 792993, 796484, 798241, 798582, 797724, 795205, 790446, 783841, 776656, 769694, 762568, 754539, 745619, 736425, 727318, 718179, 709010, 700376, 693172, 687989, 684669, 682484, 680934, 680436, 682040, 686453, 693528, 702626, 713063, 724130, 735115]
60602G35115J0484R792Q670O892N007L831L278K440J057j8o7M16M69j33r26j637
60586G84670k351l009l419l743m551o147q073r517j0160j0568j1456j2677j3216
60573F85783j2482j1236j0715j0982j0837r469p533o208n757n435m632l578k940
60560E83979k955l071k429q09J037K165K478K696L341M235M991N487N795O044
60546F12984O612Q017J0407J3462J6927K0790K4900K8964L3215L8331M4179M9065
60534I07853N0890M8795M3255L4945K4274J2000l93j1234j9441k4747k7395k7641
60522A011161k5538k1238j5532r720m830j141J469L088L885M124L879L033J884
60509I54524J221J430K039K661L893O636J0878J5849K1143K6876L2978L9240M6091
$$ y = [735115, 745599, 755391, 764061, 770953, 775960, 779791, 783069, 785509, 786566, 786548, 786481, 786897, 787366, 787233, 786307, 784670, 782319, 779310, 775891, 772148, 767597, 761450, 753377, 743860, 733700, 723132, 711676, 698999, 685783, 673301, 662065, 651350, 640368, 629531, 620062, 612529, 606321, 600564, 595129, 590497, 586919, 583979, 581024, 577953, 575524, 574715, 575752, 577917, 580395, 583091, 586432, 590667, 595658, 601145, 606940, 612984, 619596, 627613, 638020, 651482, 668409, 689199, 714099, 743063, 776278, 814609, 858788, 907853, 958743, 1007538, 1050793, 1085738, 1110012, 1122012, 1121619, 1110385, 1090944, 1066197, 1038802, 1011161, 985623, 964385, 948853, 939133, 934303, 933162, 934631, 937719, 941604, 945728, 949607, 952640, 954524, 955745, 957175, 959214, 961875, 965768, 972404, 983282, 999131, 1020274, 1047150, 1080128, 1119368, 1165459]
60496A165459N4339O3821P2965Q0221Q5536R0163R5391J01946J10409J21867J38006
60485B180123J60466J89932K25731K66071L08070L46978L75723L86185L71758
60476D811037L29284K59572J67264O0354n1057j56629k47138l15385l57446l73920
60466D125936l69584l51051l24407k94244k63641k34216k06585j81209j58750
60457A742249j39464j22773j07872r4533q2957p3155o4813n7540n0949m4728l8931
60446H64534l3915k9765k6084k2673j9960j8331j7336j6133j4491j2823j1432
60435F41591j0295r516r305r533r768r826r739r218p721n284k704p50M49J045
60421E49426J139J020J176J625J677R06L6J75J358K448K610K290K440L209L817
$$ y = [1165459, 1219798, 1283619, 1356584, 1436805, 1522341, 1612504, 1707895, 1809841, 1920250, 2042117, 2180123, 2340589, 2530521, 2756252, 3022323, 3330393, 3677371, 4053094, 4439279, 4811037, 5140321, 5399893, 5567157, 5627511, 5576454, 5419825, 5172687, 4857302, 4499856, 4125936, 3756352, 3405301, 3080894, 2786650, 2523009, 2288793, 2082208, 1900999, 1742249, 1602785, 1480012, 1372140, 1277607, 1194650, 1121495, 1056682, 999142, 948193, 903465, 864534, 830619, 800854, 774770, 752097, 732137, 713806, 696470, 680337, 665846, 653023, 641591, 631296, 621780, 612475, 602942, 593174, 583348, 573609, 564391, 556670, 551386, 548682, 547932, 548381, 549426, 550565, 551585, 552761, 554386, 556063, 556969, 557005, 557180, 558538, 560986, 563596, 565886, 568326, 571535, 575352]
60406E75352L626K969K709L179L755L632K816K109K139K735L368L825M110M063
60392F20387L538K908K839L399L768L147J672K29o27j197j999k869l068k425j969
60377F27733k858m732n822n085l512k743k813k383r31M73Q39N97O47R80J130J246
60361F02766J753K282K073J275Q81J353K192K991L911M900N389N167M818M708
60347F46459M301L153J948J707K366K944K896K519K112J592J064J012J629K459
60333F78161K890K704K008J067L77M28J091J601J442R30O32M88k0j034k112k817
60317F87836l217l607m033m232l993l441k935k695k533k075j226l12L29P00R57
60302F55523J049Q05L82K38N68R50P90qr75j646j925j939j723j293q23n36l25
$$ y = [575352, 578978, 581947, 584656, 587835, 591590, 595222, 598038, 600147, 602286, 605021, 608389, 612214, 616324, 620387, 623925, 626833, 629672, 633071, 636839, 639986, 641658, 641887, 641260, 640063, 638064, 635195, 632127, 629702, 627733, 624875, 620143, 614321, 609236, 605724, 602981, 600168, 597785, 596854, 597327, 598166, 598763, 599410, 600390, 601520, 602766, 604519, 606801, 608874, 610149, 611030, 612383, 614575, 617566, 621477, 626377, 631766, 636933, 641751, 646459, 650760, 653913, 655861, 657568, 659934, 662878, 665774, 668293, 670405, 671997, 673061, 674073, 675702, 678161, 681051, 683755, 685763, 686830, 687207, 687635, 688726, 690327, 691769, 692699, 693331, 693819, 693799, 692765, 690653, 687836, 684619, 681012, 676979, 672747, 668754, 665313, 662378, 659683, 657150, 655075, 653849, 653537, 653866, 654566, 655523, 656572, 657377, 657759, 657997, 658565, 659515, 660305, 660297, 659322, 657676, 655751, 653812, 652089, 650796, 649973, 649437, 649112]
60285F49112K77J589L288M534M693L968L313L588M759N925O313O096O068O550
60271G10073P031P018O818P165Q233R521J0636J1712J3003J4482J5986J7433J8732
60258H57843J9849K1153K3241K6090K8824L0809L2653L5513L9592M4066M8460
60247A208093N3225N8750O4625P0421P6539Q3499R0756R7011J01536J04515J06050
60236B115020J05651J02942R8242R2087Q4534P5242O4017N1061L6963K2638R038
60225B857435l361j4632k4805l3466m0028m4209m5996m5469m2823l8416l2557
60214B491673k5470j7587r464j119Q162J8966L0920M3112N5097O6961P8594Q9405
60202B829250R8775J06325J11671J14346J14004J10542J03983R4497Q2444O8194
$$ y = [649112, 649389, 650978, 654266, 658800, 663493, 667461, 670774, 674362, 679121, 685046, 691359, 697455, 703523, 710073, 717104, 724122, 730940, 738105, 746338, 755859, 766495, 778207, 791210, 805692, 821678, 839111, 857843, 877692, 898845, 922086, 948176, 977000, 1007809, 1040462, 1075975, 1115567, 1159633, 1208093, 1261318, 1320068, 1384693, 1455114, 1531653, 1615152, 1705908, 1802919, 1904455, 2008970, 2115020, 2220671, 2323613, 2421855, 2513942, 2598476, 2673718, 2737735, 2788796, 2825759, 2848397, 2857435, 2854074, 2839442, 2814637, 2781171, 2741143, 2696934, 2650938, 2605469, 2562646, 2524230, 2491673, 2466203, 2448616, 2439152, 2438033, 2446195, 2465161, 2496081, 2539193, 2594290, 2661251, 2739845, 2829250, 2928025, 3034350, 3146021, 3260367, 3374371, 3484913, 3588896, 3683393, 3765837, 3834031]
60192C834031N1992L4255J5755k772k0975l8438n4216o7434p8091q6553r2407
60181C495147r4617r2891q8091q1070p1877o0439m7410l3781k0050o108Q282K3139
60169B930234L7946N1569O2908P1712P8288Q2300Q2682P8974P1983O2628N1046
60158C662270L7471K3202R631l184j5933k8227l8428m5250m8660m9095m6676m1538
60146C415583l4261k5523j5623m578P635K1100L5922N2082O9536Q8378J08621
60135C718872J29798J51231J72723J94625K17035K39188K59718K77396K91602
60126E652188L02337L09660L12977L11087L03203K89706K71504K48968K22028
60117H223658J91131J57294J21194Q3003M3268L120l6677p6168j15099j52057
$$ y = [3834031, 3886023, 3920278, 3936033, 3933261, 3912286, 3873848, 3819632, 3752198, 3674107, 3587554, 3495147, 3400530, 3307639, 3219548, 3138478, 3066601, 3006162, 2958752, 2924971, 2904921, 2898813, 2907095, 2930234, 2968180, 3019749, 3082657, 3154369, 3232657, 3314957, 3397639, 3476613, 3548596, 3611224, 3662270, 3699741, 3722943, 3732574, 3729390, 3713457, 3685230, 3646802, 3601552, 3552892, 3503797, 3457121, 3415583, 3381322, 3355799, 3340176, 3335598, 3343233, 3364333, 3400255, 3452337, 3521873, 3610251, 3718872, 3848670, 3999901, 4172624, 4367249, 4584284, 4823472, 5083190, 5360586, 5652188, 5954525, 6264185, 6577162, 6888249, 7191452, 7481158, 7752662, 8001630, 8223658, 8414789, 8572083, 8693277, 8776280, 8819548, 8822668, 8785991, 8709823, 8594724, 8442667]
60107H442667j85336k14225k38500k56980k67607k69355k63397k51995k36614
60098F258658k17531j94878j69424j42251j14208q5931n8052l0940m353K2172
60088E263262M8331P2721R3619J09921J21071J26423J25095J16635J01623Q1550
60078F260251N8121L2707O337j9916m4751o7127q6845j04417j20253j34260j46277
60067E633570j56370j64365j69416j70641j68030j62361j54246j43661j30468
60058D214012j15027r8227q1046o4027m7012k9443j1119P468K5723M3572O1103
60047C905977P7807R2585J04479J12982J17784J18621J15406J08047R6278Q0133
60037D930099O0646L9492J7809m244k6675m8880o9974q9353j06642j21243j32289
$$ y = [8442667, 8257331, 8043106, 7804606, 7547626, 7280019, 7010664, 6747267, 6495272, 6258658, 6041127, 5846249, 5676825, 5534574, 5420366, 5334435, 5276383, 5245443, 5241090, 5263262, 5311593, 5384314, 5477933, 5587854, 5708925, 5835348, 5960443, 6077078, 6178701, 6260251, 6318372, 6351079, 6357416, 6337500, 6292749, 6225622, 6138777, 6034360, 5914107, 5779847, 5633570, 5477200, 5312835, 5143419, 4972778, 4804748, 4642387, 4488141, 4344480, 4214012, 4098985, 4000758, 3919712, 3855685, 3808673, 3779230, 3768111, 3775579, 3801302, 3844874, 3905977, 3983784, 4076369, 4180848, 4293830, 4411614, 4530235, 4645641, 4753688, 4849966, 4930099, 4990745, 5030237, 5048046, 5043802, 5017127, 4968247, 4898273, 4808920, 4702278, 4581035, 4448746]
60026D448746j39027j41176j39112j33729j25928j16120j04348r0846p6243o1198
60016C321019m6099l1063j5910k10J6370L3638N1108O8530Q5878J02892J19137
60005C705290J34476J48855J61488J70734J75115J74032J67381J55064J37352
59996E129787J15349R0654O4576L7831J0725j6691m4314p1487r6789j18478j35166
59985D965997j46084j51108j50702j45627j36516j23896j08589r1785p4507n7235
59975C779948m0206k3789q367N974J9544L2914M6621O0603P3879Q5154R3782R9778
59963D225835J02941J02608R8578R1626Q2662P1830N8981M4665L0064J6081K952
59952D928823r313k0514l0213l7647m1749m1583l6907k8154j5908n51J7682L8576
$$ y = [4448746, 4309719, 4168543, 4029431, 3895702, 3769774, 3653654, 3549306, 3458460, 3382217, 3321019, 3274920, 3243857, 3227947, 3227737, 3244107, 3277745, 3328853, 3397383, 3483261, 3586153, 3705290, 3839766, 3988621, 4150109, 4320843, 4495958, 4669990, 4837371, 4992435, 5129787, 5245136, 5335790, 5400366, 5438197, 5448922, 5432231, 5387917, 5316430, 5219641, 5101163, 4965997, 4819913, 4668805, 4518103, 4372476, 4235960, 4112064, 4003475, 3911690, 3837183, 3779948, 3739742, 3715953, 3707586, 3713560, 3733104, 3766018, 3812639, 3873242, 3947121, 4032275, 4126057, 4225835, 4328776, 4431384, 4529962, 4621588, 4704250, 4776080, 4835061, 4879726, 4909790, 4925871, 4928823, 4919510, 4898996, 4868783, 4831136, 4789387, 4747804, 4710897, 4682743, 4666835, 4666284, 4683966, 4722542]
59940D722542O1941Q7636J15597J45786J77987K11644K46126K81064L16060L49909
59930F716292L80385M04836M20713M25505M16807L92876L53009K97392K27259
59921A0035074J45659N7590l1259j15956j92422k56965l06716l40727l60070l66689
59911H267519l62463l49245l29123l04166k75998k45796k14536j83102j52060
59902E851030j21474r1044o0560l0190k78K9051N7849Q5973J12921J37911J59760
59891F130949J76768J87237J90214J85380J72231J49937J18363P8863L3885j3831
59881G409996o1542j06569j46581j79664k04278k19809k27447k29792k28998k25684
59871E579632k19986k12889k05781j99140j92487j85316j77293j67857j56585
$$ y = [4722542, 4784483, 4872119, 4987716, 5133502, 5311489, 5523133, 5769259, 6050323, 6366383, 6716292, 7096677, 7501513, 7922226, 8347731, 8764538, 9157414, 9510423, 9807815, 10035074, 10180733, 10238323, 10207064, 10091108, 9898686, 9641721, 9335005, 8994278, 8634208, 8267519, 7905056, 7555811, 7226688, 6922522, 6646524, 6400728, 6186192, 6003090, 5851030, 5729556, 5638512, 5577952, 5547762, 5547484, 5576535, 5634384, 5720357, 5833278, 5971189, 6130949, 6307717, 6494954, 6685168, 6870548, 7042779, 7192716, 7311079, 7389942, 7423827, 7409996, 7348454, 7241885, 7095304, 6915640, 6711362, 6491553, 6264106, 6034314, 5805316, 5579632, 5359646, 5146757, 4940976, 4741836, 4549349, 4364033, 4186740, 4018883, 3862298]
59862C862298j43984j31133j18359j04953r0363p5151o0496m7115l5003k4022
59852C031719j4592p804m761n695r896j6475k4848l4198m3081n0120n4833n7331
59840B708085n7546n5395n1478m6822m1917l6548l0526k3943j6779q946p60P280
59828B344705J5308K4013L3447M2508M9864N4948N7904N9032N8776N7685N5915
59817B854105N2909M7974M0979L2231K1924J0315j484j1421j7689j9990j9296
59806B990557j6443j1296l541O198J6725K7730M0137N4907P2133R1711J14149
59795C382967J40127J69692K02504K38418K76863L15598L50433L75816L85260
59786E837678L71889L30395K59911J65637N8134m9225j43709k16595k64684k89209
$$ y = [3862298, 3718314, 3587181, 3468822, 3363869, 3273506, 3198355, 3137859, 3090744, 3055741, 3031719, 3017127, 3009323, 3004562, 2998867, 2988971, 2972496, 2947648, 2913450, 2870369, 2820249, 2765416, 2708085, 2650539, 2595144, 2543666, 2496844, 2454927, 2418379, 2387853, 2363910, 2347131, 2338185, 2337425, 2344705, 2360013, 2384026, 2417473, 2459981, 2509845, 2564793, 2622697, 2681729, 2740505, 2798190, 2854105, 2907014, 2954988, 2995967, 3028198, 3050122, 3060437, 3058953, 3047532, 3029843, 3009853, 2990557, 2974114, 2962818, 2959277, 2965475, 2982200, 3009930, 3050067, 3104974, 3177107, 3268818, 3382967, 3523094, 3692786, 3895290, 4133708, 4410571, 4726169, 5076602, 5452418, 5837678, 6209567, 6539962, 6799873, 6965510, 7023644, 6974419, 6830710, 6614115, 6349431, 6060222]
59776F060222k93745k83107k62780k37571k10327j82496j55563j30974j08967
59767D194692q8849p0634n5254m2841l1952k1050r951P79J0972K0868L0681M0804
59755C978265N1859O4005P6727Q9744J03509J18364J33913J49848J66796J85621
59745E118651K06456K29057K53630K80480L09311L39609L71262M03885M35771
59736G948112M64363M87639N04175N12013N08539M92028M62906M23567L77590
59727A2180932L29341K83597K44930K17188K03204K04258K19650K47156K84236
59718A4414492L28649L77995M29106M78135N21097N54316N74673N79675N67334
59709A8825472N36243M86234M19145L38678K49514J56749O6006j6850q6881j41065
$$ y = [6060222, 5766477, 5483370, 5220590, 4983019, 4772692, 4590196, 4434633, 4303659, 4194692, 4105843, 4035209, 3979955, 3937114, 3905162, 3884112, 3874161, 3874940, 3885912, 3906780, 3937461, 3978265, 4030124, 4094129, 4170856, 4260600, 4364109, 4482473, 4616386, 4766234, 4933030, 5118651, 5325107, 5554164, 5807794, 6088274, 6397585, 6737194, 7108456, 7512341, 7948112, 8412475, 8900114, 9404289, 9916302, 10424841, 10916869, 11379775, 11803342, 12180932, 12510273, 12793870, 13038800, 13255988, 13459192, 13663450, 13883100, 14130256, 14414492, 14743141, 15121136, 15550242, 16028377, 16549474, 17103790, 17678463, 18258138, 18825472, 19361715, 19847949, 20267094, 20605772, 20855286, 21012035, 21078041, 21061191, 20974310, 20833245]
59699B0833245j77999j96952j97664j80946j48740j03202m5858K2080R8988J82896
59689B0085848K72260L66145M63490N62508O60830P55498Q42127R14279R64238
59680B5887223R84440R67909R08183Q00609O45118M47985K20897k1249k61965
59671C0579150m84407o73630q19407r17660r69780r81220r60797r20253q73078
59662B2978918q32335q08271q06245q25301q58091q93145r19120r28786r20300
59653A5187324q95713q58793q13752p64535p14137o64277o15895n69726n26197
59644H764299m85239m46661m10574l77077l45815l16321k88565k62693k38477
59635E592877k15555j93971j73855j54804j36322j18706j02669q8180p4563o1795
$$ y = [20833245, 20655246, 20458294, 20260630, 20079684, 19930944, 19827742, 19781884, 19803964, 19902952, 20085848, 20358108, 20724253, 21187743, 21750251, 22411081, 23166579, 24008706, 24922985, 25887223, 26871663, 27839572, 28747755, 29548364, 30193482, 30641467, 30862364, 30841115, 30579150, 30094743, 29421113, 28601706, 27684046, 26714266, 25733046, 24772249, 23851996, 22978918, 22146583, 21338312, 20532067, 19706766, 18848675, 17955530, 17036410, 16107624, 15187324, 14291611, 13432818, 12619066, 11854531, 11140394, 10476117, 9860222, 9290496, 8764299, 8279060, 7832399, 7421825, 7044748, 6698933, 6382612, 6094047, 5831354, 5592877, 5377322, 5183351, 5009496, 4854692, 4718370, 4599664, 4496995, 4408815, 4334252, 4272457]
59625D272457n0801m2292l6136l2195l0773l1884l4862l9244m5320n3200o1926
59614C813824p0107p6944q2179q5646q7451q8062q7562q5287q0797p4820o8562
59603B926407o2395n5870m8767m1490l4562k8222k2481j7089j1649o057o73M145
59591B601297Q271J1446J3225J3700J3635J3404J2541J0939R780J0304J2205J4228
59579B744975J6053J8482K2111K6799L2387L8801M5540N2033N8666O6464P5654
59568C197965Q5544R5876J07274J20038J33626J47742J62840J78907J94746K09324
59558D633882K22963K36182K47973K56483K61125K62817K62109K58177K50094
59549F891805K38217K23750K07538J89886J71043J51018J29111J04608P8355N3132
$$ y = [4272457, 4221656, 4179364, 4143228, 4111033, 4080260, 4048376, 4013514, 3974270, 3928950, 3875750, 3813824, 3743717, 3666773, 3584594, 3498948, 3411497, 3323435, 3235873, 3150586, 3069789, 2994969, 2926407, 2864012, 2808142, 2759375, 2717885, 2683323, 2655101, 2632620, 2615531, 2603882, 2597825, 2597152, 2601297, 2609568, 2621014, 2634239, 2647939, 2661574, 2674978, 2687519, 2698458, 2708238, 2718542, 2730747, 2744975, 2761028, 2779510, 2801621, 2828420, 2860807, 2899608, 2945148, 2997181, 3055847, 3122311, 3197965, 3283509, 3379385, 3486659, 3606697, 3740323, 3888065, 4050905, 4229812, 4424558, 4633882, 4856845, 5093027, 5341000, 5597483, 5858608, 6121425, 6383534, 6641711, 6891805, 7130022, 7353772, 7561310, 7751196, 7922239, 8073257, 8202368, 8306976, 8385331, 8438463]
59539H438463L2036J6881Q374P083J3299K6322M4857O8007R4737J22155J45647
59528I017861J61417J68065J65048J50738J23441Q3690L4220k2063q2771j44836
59518I654810k04231k57592l03215l40140l67235l83765l90253l88103l78860
59509F641416l64082l45267l23396k98974k72895k46720k21690j97932j75093
59500D195367j53331j33172j14863r8246q2949o8190n2970l7022k1237o508P502
59489C434381K1860L6953N2344O7791Q3676J00366J17812J35813J54130J72210
59479D377336J89328K04987K18721K29453K35599K35869K29483K15609J93404
59470F329789J62887J25248Q1935L4231j5944o5526j11458j52075j86721k14513
$$ y = [8438463, 8470499, 8487380, 8495754, 8502837, 8516136, 8542458, 8587315, 8655322, 8750059, 8872214, 9017861, 9179278, 9347343, 9512391, 9663129, 9786570, 9870260, 9904480, 9882417, 9799646, 9654810, 9450579, 9192987, 8889772, 8549632, 8182397, 7798632, 7408379, 7020276, 6641416, 6277334, 5932067, 5608671, 5309697, 5036802, 4790082, 4568392, 4370460, 4195367, 4042036, 3908864, 3794001, 3695755, 3612806, 3544616, 3491646, 3454624, 3433387, 3426879, 3434381, 3456241, 3493194, 3545538, 3613329, 3697005, 3797371, 3915183, 4050996, 4205126, 4377336, 4566664, 4771651, 4990372, 5219825, 5455424, 5691293, 5920776, 6136385, 6329789, 6492676, 6617924, 6699859, 6734090, 6718146, 6652620, 6541162, 6389087, 6202366, 5987853]
59460E987853k34452k46653k52465k53153k49207k41186k30371k18044k04691
59451C857631j90440j75826j61542j47822j34690j22466j11368j00917r0485q0376
59441B541699p1472o3751n6004m7406l8652l1118k5341k0751j6483j2012p340
59430B151369k953N36L049N123P167Q982J0342J1679J3761J6839K0393K3444K4844
59417B294575K3723K0344J6467J4378J5352J9151K4749L1334L8865M7866N8375
59406B605179O8875P6888Q1264Q3646Q7063R3490J03335J16640J33536J53554
59396C603470J75797K00159K27494K58258K91851L27664L65761M05738M45542
59387F301734M82212N13294N36807N50368N51539N39345N14971M80990M40378
$$ y = [5987853, 5753401, 5506748, 5254283, 5001130, 4751923, 4510737, 4280366, 4062322, 3857631, 3667191, 3491365, 3329823, 3182001, 3047311, 2924845, 2813477, 2712560, 2622075, 2541699, 2470227, 2406476, 2350472, 2303066, 2264414, 2233296, 2207955, 2187204, 2170721, 2158709, 2151369, 2148416, 2148952, 2152001, 2157124, 2164291, 2173273, 2183615, 2195294, 2209055, 2225894, 2246287, 2269731, 2294575, 2318298, 2338642, 2355109, 2369487, 2384839, 2403990, 2428739, 2460073, 2498938, 2546804, 2605179, 2674054, 2750942, 2832206, 2915852, 3002915, 3096405, 3199740, 3316380, 3449916, 3603470, 3779267, 3979426, 4206920, 4465178, 4757029, 5084693, 5450454, 5856192, 6301734, 6783946, 7297240, 7834047, 8384415, 8935954, 9475299, 9990270, 10471260, 10911638]
59378A0911638L96128L51038L07420K67067K31257K00320J73197J47836J22193
59369A3108094R4568O3258K6729j5324o1545j09803j58161k04569k46107k79547
59359A2217593l03001l16794l22751l23166l20510l17404l15974l17062l20240
59350I360691l24558l29041l32594l33829l31375l24349l12702k97186k78934
59341F496123k58849k37342k14698j91538j68643j46454j25028j04524q5483o8508
59331D895056n3975m2045l2765k6111k2149k1024k2603k6180l0963l6751m3714
59320D536776n1507n9173o5903p1401p5400p7533p7874p6906p4678p0691o5057
59309C770653n8960n3381m7985m1980l5427k8871k2135j4592o322J972J0207J9098
$$ y = [10911638, 11307766, 11658804, 11966224, 12233291, 12464548, 12664868, 12838065, 12985901, 13108094, 13202662, 13265920, 13292649, 13277325, 13215780, 13105977, 12947816, 12743247, 12497140, 12217593, 11914592, 11597798, 11275047, 10951881, 10631371, 10313967, 9997993, 9680931, 9360691, 9036133, 8707092, 8374498, 8040669, 7709294, 7384945, 7072243, 6775057, 6496123, 6237274, 5999932, 5785234, 5593696, 5425053, 5278599, 5153571, 5049047, 4963564, 4895056, 4841081, 4799036, 4766271, 4740160, 4718011, 4696987, 4674384, 4648204, 4617241, 4580490, 4536776, 4485269, 4426096, 4360193, 4288792, 4213392, 4135859, 4057985, 3981079, 3906401, 3835710, 3770653, 3711693, 3658312, 3610327, 3568347, 3532920, 3504049, 3481914, 3467322, 3461000, 3462972, 3473179, 3492277]
59297C492277K9061L9762N0961O2884P5484Q8090J00277J12582J25838J40043
59287D317259J54234J67209J78140J86662J92590J95438J94144J87542J75085
59278E948303J57015J33741J05358P1852L3808o916m7203q3717j14437j39089
59268F058715j58066j71486j79647j83774j85340j84909j82258j77421j70748
59259D465066j62194j51620j39806j28105j16798j04780r1313p7184o3581n0609
59249C379076l7598k4228j0509L977J9936L7486N6099P5479R6108J18816J44089
59238C858731J71875K01893K33910K67605L02034L35457L65809L91144M09267
59229F537725M17112M11331L89759L52129K99460K33352J56191P1443j6744j04174
$$ y = [3492277, 3521338, 3561100, 3612061, 3674945, 3750429, 3838519, 3938796, 4051378, 4177216, 4317259, 4471493, 4638702, 4816842, 5003504, 5196094, 5391532, 5585676, 5773218, 5948303, 6105318, 6239059, 6344417, 6416269, 6450077, 6443161, 6395958, 6312241, 6197804, 6058715, 5900649, 5729163, 5549516, 5365742, 5180402, 4995493, 4813235, 4635814, 4465066, 4302872, 4151252, 4011446, 3883341, 3766543, 3661763, 3570450, 3493266, 3429685, 3379076, 3341478, 3317250, 3306741, 3310718, 3330654, 3368140, 3424239, 3499718, 3595826, 3714642, 3858731, 4030606, 4232499, 4466409, 4734014, 5036048, 5371505, 5737314, 6128458, 6537725, 6954837, 7366168, 7755927, 8108056, 8407516, 8640868, 8797059, 8868502, 8851758, 8747584]
59219H747584j86737k60371l21416l67252l96829m10904m11696m01816l83424
59210E607139l58487l29545k99404k69872k41382k14066j88616j65708j45157
59201C394902j26261j08809r3339q0413o9909o1048n3001m5565l9209l4276l0264
59190B652808k6182k1558j6705j1957p098j709M267J0426J6245K1521K6634L2253
59178B678945L8419M4196M8642N1835N4358N6060N6126N4233N0775M5844L8982
59167C218415L0213K0517J0867J380q202j7814k7111l5683m2961m8401n1927n3784
59155B995509n3966n2450m9934m7358m4632m0797l5711l0465k5761k1058j5952
59144B577425j1160p248l412J342O626J1497J6241K2007K8942L5960M2359M8740
$$ y = [8747584, 8560847, 8300476, 7979060, 7611808, 7214979, 6804075, 6392379, 5990563, 5607139, 5248652, 4919107, 4619703, 4349831, 4108449, 3894383, 3705767, 3540059, 3394902, 3268641, 3159832, 3066493, 2986080, 2916171, 2855123, 2802122, 2756557, 2717348, 2683072, 2652808, 2626626, 2605068, 2588363, 2576406, 2569308, 2567599, 2571866, 2582292, 2598537, 2620058, 2646692, 2678945, 2717364, 2761560, 2810202, 2862037, 2916395, 2972455, 3028581, 3082814, 3133589, 3179433, 3218415, 3248628, 3269145, 3280012, 3281392, 3273190, 3255376, 3228265, 3192582, 3149621, 3101220, 3049293, 2995509, 2941543, 2889093, 2839159, 2791801, 2747169, 2706372, 2670661, 2640196, 2614435, 2593377, 2577425, 2566265, 2559017, 2555605, 2556947, 2563573, 2575070, 2591311, 2613318, 2642260, 2678220, 2720579, 2769319]
59132B769319N6060O4565P3812Q3224R2556J02046J12135J22760J33214J42847
59122C752538J51465J58744J63856J66258J66377J64883J61741J56626J49895
59113E192383J42402J34640J26715J18898J11487J04232R6387Q7063P5004N8412
59103F247623L5860P352k5869o2288j00319j37963j73047k03760k28620k46289
59093E112680k56197k59125k56546k49581k39037k26081k11979j97314j82160
59084C034660j66924j52417j39169j27233j16525j06857r7817q9234q1505p4906
59074A882073o8882o2677n6404n0773m5940m1375l6715l2103k7724k3598j9723
59063A416159j5912j1829p717m654l373l245l308l814n668q612j1231j2794j3868
$$ y = [2769319, 2825379, 2889944, 2963756, 3046980, 3139536, 3241582, 3353717, 3476477, 3609691, 3752538, 3904003, 4062747, 4226603, 4392861, 4559238, 4724121, 4885862, 5042488, 5192383, 5334785, 5469425, 5596140, 5715038, 5826525, 5930757, 6027144, 6114207, 6189211, 6247623, 6283483, 6290835, 6264966, 6202678, 6102359, 5964396, 5791349, 5587589, 5358969, 5112680, 4856483, 4597358, 4340812, 4091231, 3852194, 3626113, 3414134, 3216820, 3034660, 2867736, 2715319, 2576150, 2448917, 2332392, 2225535, 2127718, 2038484, 1956979, 1882073, 1813191, 1750514, 1694110, 1643337, 1597397, 1556022, 1519307, 1487204, 1459480, 1435882, 1416159, 1400247, 1388418, 1380701, 1376047, 1372674, 1369429, 1366121, 1362307, 1356639, 1348027, 1336796, 1324002, 1310134]
59050A310134j5034j6061j6620j6763j6352j4899j2381r433o418k958J306O114
59038A190635J1022J5777K0034K3355K5676K7209K7763K6838K4523K1607J8579
59027A433018J5279J1739Q513N895L618J733R63J630K871L604L867M522N955P604
59013A510811Q669Q804Q170P045N424L049j01l528o711r669j2512j4837j6183
59000A488431j6879j7607j8177j7710j6137j4455j3225j1854r797p554n768m208
58988A335060k334l31J217K269L220M225N195O201P296Q228Q882R779J1563J4148
58974A414618J6847J9322K1869K4860K8276L1800L5001L7428L8741L8843L7853
58963A745458L5964L3467L0740K8176K6084K4655K3818K3295K3080K3718K5767
$$ y = [1310134, 1295100, 1279039, 1262419, 1245656, 1229304, 1214405, 1202024, 1192591, 1186173, 1183215, 1184521, 1190635, 1201657, 1217434, 1237468, 1260823, 1286499, 1313708, 1341471, 1368309, 1392832, 1414439, 1433018, 1448297, 1460036, 1468549, 1474444, 1478062, 1479795, 1480758, 1482388, 1485259, 1488863, 1492730, 1497252, 1503207, 1510811, 1519480, 1528284, 1536454, 1543499, 1548923, 1551972, 1551871, 1548343, 1541632, 1531963, 1519451, 1504614, 1488431, 1471552, 1453945, 1435768, 1418058, 1401921, 1387466, 1374241, 1362387, 1352590, 1345036, 1339268, 1335060, 1332726, 1332395, 1333612, 1335881, 1339101, 1343326, 1348521, 1354722, 1362018, 1370246, 1379128, 1388907, 1400470, 1414618, 1431465, 1450787, 1472656, 1497516, 1525792, 1557592, 1592593, 1630021, 1668762, 1707605, 1745458, 1781422, 1814889, 1845629, 1873805, 1899889, 1924544, 1948362, 1971657, 1994737, 2018455, 2044222]
58952B044222K9017L2640L6138L9702M3604M7747N1878N5887N9728O3502O7661
58941B571726P2738P8746Q5317R2493J00813J10559J21398J33079J45872J60104
58931C672845J75690J92497K10728K30586K51902K74495K98660L25001L53929
58922E986333L85484M19420M55321M92733N31092N69275O05320O37000O62404
58913A0744382O79357O84503O73849O44534N95486N26384M37167L29288K06963
58904A5521913P6562n5011j81297k96682l96860m79091n41988n85411o10635o20010
58894A1831490o15967o00657n76617n47056n15032m82635m51188m21541l93824
58885G226973l67656l43039l20568l00324k81393k63016k45578k29634k14691
$$ y = [2044222, 2073239, 2105879, 2142017, 2181719, 2225323, 2273070, 2324948, 2380835, 2440563, 2504065, 2571726, 2644464, 2723210, 2808527, 2901020, 3001833, 3112392, 3233790, 3366869, 3512741, 3672845, 3848535, 4041032, 4251760, 4482346, 4734248, 5008743, 5307403, 5632404, 5986333, 6371817, 6791237, 7246558, 7739291, 8270383, 8839658, 9444978, 10081978, 10744382, 11423739, 12108242, 12782091, 13426625, 14022111, 14548495, 14985662, 15314950, 15521913, 15598475, 15543464, 15362167, 15065485, 14668625, 14189534, 13647546, 13062135, 12451500, 11831490, 11215523, 10614866, 10038249, 9491193, 8976161, 8493526, 8042338, 7620797, 7226973, 6859317, 6516278, 6195710, 5895386, 5613993, 5350977, 5105399, 4875765, 4661074]
58876D661074j99878j85372j71978j59558j47057j34194j22027j11457j02021
58867C327532r2707q3290p4323o6156n8686n1859m5859m0602l5512l0058k4281
58856B724199j8539j2913p239j641L462Q079J2772J7847K2863K7496L2389L8357
58844B847132M5060N1315N6689O1960O7931P4558Q1531Q8943R7036J05842J15397
58833C693394J25867J37249J49436J62763J77861J94819K13137K32841K54915
58824E342282K80201L08442L38907L71431M06257M43253M81745N20730N58780
58815I052028N93865O23574O45279O55934O52237O31395N91538N31496M51004
58806A4428350L51662K37275J12952j5672j42376k60645l65184m52947n22460
$$ y = [4661074, 4461196, 4275824, 4103846, 3944288, 3797231, 3663037, 3541010, 3429553, 3327532, 3234825, 3151535, 3077212, 3011056, 2952370, 2900511, 2854652, 2814050, 2778538, 2748480, 2724199, 2705660, 2692747, 2685508, 2683867, 2687329, 2695408, 2708180, 2726027, 2748890, 2776386, 2808775, 2847132, 2892192, 2943507, 3000196, 3062156, 3130087, 3204645, 3286176, 3375119, 3472155, 3577997, 3693394, 3819261, 3956510, 4105946, 4268709, 4446570, 4641389, 4854526, 5087367, 5342282, 5622483, 5930925, 6269832, 6641263, 7047520, 7490773, 7972518, 8493248, 9052028, 9645893, 10269467, 10914746, 11570680, 12222917, 12854312, 13445850, 13977346, 14428350, 14780012, 15017287, 15130239, 15114567, 14972191, 14711546, 14346362, 13893415, 13370955]
58797A3370955n72862o04436o19502o21671o14012n98340n76053n48922n18887
58788H096270m87457m55484m23360l91413l60038l29409k99321k69868k42220
58779D837700k18070j98339j83056j72471j67050j65809j65699j63588j58466
58770C245152j51133j42443j32685j22212j11604j01227r1216q1793p3100o4954
58760B172785n7210n0161m4112l8812l3751k8868k4488k0809j7858j5719j4416
58749A826581j3787j3736j4417j5912j8096k0982k4760k9143l3150l5859l7081
58738A569658l7122l6375l5359l4537l3756l2398l0410k8577k7460k6807k6314
58727A220543k6122k6110k5568k4174k2549k1221j9859j8177j6693j5790j4900
$$ y = [13370955, 12798093, 12193657, 11574155, 10952484, 10338472, 9740132, 9164079, 8615157, 8096270, 7608813, 7153329, 6729969, 6338556, 5978518, 5649109, 5349788, 5079920, 4837700, 4619630, 4421291, 4238235, 4065764, 3898714, 3732905, 3567206, 3403618, 3245152, 3094019, 2951576, 2818891, 2696679, 2585075, 2483848, 2392632, 2310839, 2237739, 2172785, 2115575, 2065414, 2021302, 1982490, 1948739, 1919871, 1895383, 1874574, 1856716, 1840997, 1826581, 1812794, 1799058, 1784641, 1768729, 1750633, 1729651, 1704891, 1675748, 1642598, 1606739, 1569658, 1532536, 1496161, 1460802, 1426265, 1392509, 1360111, 1329701, 1301124, 1273664, 1246857, 1220543, 1194421, 1168311, 1142743, 1118569, 1096020, 1074799, 1054940, 1036763, 1020070, 1004280, 989380]
58716I89380j3559j2455j2428j3093j3491j3406j3030j2051j0365r013r028r720
58704H47741r466p941o319n411m983m808n118n813o380o794p572q733r579r630
58690G49194r038p988o501m893l654k642j050J711N468R490J2800J4493J4387
58677G71777J3147J1387R137O732N429O240Q688J1785J5578K0481K5479K8404
58665I34264K7921K4029J6992P242l661j3406k0639k5219k7010k5803k2521j8978
58653H53211j5962j2796r114n728l232j040J530M243O732R295J2199J4941J6958
58640H71237J8469K0133K2366K5346K9123L3368L7572M1669M5959N0415N4969
58629A250626O0447O8057P7691Q7788R7445J07523J19146J32103J45467J58851
$$ y = [989380, 975821, 963366, 950938, 937845, 924354, 910948, 897918, 885867, 875502, 866489, 857461, 847741, 838275, 830334, 824015, 818604, 813621, 808813, 803695, 797882, 791502, 784708, 777136, 768403, 758824, 749194, 740156, 732168, 725667, 720774, 717120, 714478, 713428, 715139, 720607, 730097, 742897, 757390, 771777, 784924, 796311, 805448, 812180, 817609, 823849, 832537, 844322, 859900, 880381, 905860, 934264, 962185, 986214, 1003206, 1010448, 1006787, 993381, 972742, 947523, 920513, 894710, 872189, 853211, 837249, 824453, 815339, 809611, 806379, 805339, 806869, 811112, 817844, 827139, 839338, 854279, 871237, 889706, 909839, 932205, 957551, 986674, 1020042, 1057614, 1099283, 1145242, 1195657, 1250626, 1311073, 1379130, 1456821, 1544609, 1642054, 1749577, 1868723, 2000826, 2146293, 2305144]
58619B305144J72144J84630J95140K02542K05426K01918J90463J70571J42500
58610C970478J06938O5614K1585k1898o2488r8417j27846j49466j63418j70888
58600C370194j73044j70862j65585j58518j50413j41557j32254j22790j13101
58591B042070j03063r3010q3466p4476o5731n7365n0052m4163l9217l4557l0331
58580A366639k7322k5720k4475k2219j8708j4855j1407q194m887j794N64K107
58568A209729K742J768j395o050j0667j4395j7415j9864k1236k1099j9704j7716
58556A064698j5683j3898j2385j1052j0133j0327j2061j4814j7623j9945k1549
58545I05228k2060k1359k0122j9092j8107j6623j4897j3639j2761j1577j0111
$$ y = [2305144, 2477288, 2661918, 2857058, 3059600, 3265026, 3466944, 3657407, 3827978, 3970478, 4077416, 4143030, 4164615, 4142717, 4080229, 3981812, 3853966, 3704500, 3541082, 3370194, 3197150, 3026288, 2860703, 2702185, 2551772, 2410215, 2277961, 2155171, 2042070, 1939007, 1845997, 1762531, 1688055, 1622324, 1564959, 1514907, 1470744, 1431527, 1396970, 1366639, 1339317, 1313597, 1289122, 1266903, 1248195, 1233340, 1221933, 1213739, 1208852, 1207058, 1207622, 1209729, 1212471, 1214239, 1212844, 1206794, 1196127, 1181732, 1164317, 1144453, 1123217, 1102118, 1082414, 1064698, 1049015, 1035117, 1022732, 1011680, 1001547, 991220, 979159, 964345, 946722, 926777, 905228, 883168, 861809, 841687, 822595, 804488, 787865, 772968, 759329, 746568, 734991, 724880]
58534G24880r118q790q513q085q011q415q663q377p884p438o830o035n380m855
58520F18486m064l059k390k148j788j111n26j34N61J821L281M619N848O821P299
58505F33516P604Q302R193R582R567J0029J1131J1956J1847J1020R585P205M064
58492G54601J115j147l123n014o365p190q384j0357j2229j2933j2405j1185r688
58479F55696q334p552p180o625n831n368n409n502n563n965o461o286n509n037
58465E69074n005m592l695l234l244k487p62K61l85j159l05J497K383K200K358
58450E52905L493N026O645Q720J1163J3089J3805J3462J2631J1730J0703R024
58438F72396O196K475j271m456o945q509q969q877q963q848p520n211l351k447
$$ y = [724880, 715762, 706972, 698459, 690374, 682363, 673948, 665285, 656908, 649024, 641586, 634756, 628721, 623341, 618486, 614422, 611363, 608973, 606825, 605037, 603926, 603400, 603266, 603827, 605648, 608929, 613548, 619396, 626217, 633516, 641120, 649422, 658615, 668197, 677764, 687793, 698924, 710880, 722727, 733747, 743332, 750537, 754601, 755716, 754569, 751446, 746432, 740067, 732877, 724493, 714136, 701907, 688974, 676569, 665384, 655696, 647362, 639810, 632630, 626005, 620174, 614806, 609397, 603895, 598332, 592367, 585906, 579620, 574111, 569074, 564069, 559477, 555782, 552548, 549304, 546817, 546055, 546316, 545931, 544772, 544467, 545964, 548347, 550547, 552905, 556398, 561424, 568069, 576789, 587952, 601041, 614846, 628308, 640939, 652669, 663372, 672396, 678592, 681067, 679796, 675340, 668395, 659886, 650917, 642040, 633077, 624229, 616709, 611498, 608147, 605700]
58424F05700j525j70P34R28J635L405M879N016M991O248Q038Q626P841O706N308
58409F68360K897l02k996m429m884m780m286l660l144k700k319k206k173j616
58395F31762n32K58L80M46P99Q90N65O77J562K124J548P13Q22J694K535L380M576
58378F54199N771O503O958P210O749N640M964N144N160M450M097M939N922N875
58364G33581N476N873O680O988P155P811Q219P483O274N582M807K974P99l87q61
58349H08454j657k381j945p63j20J12J077K734L959M538N234O206P040P906R087
58334H49481R866R474Q672Q721R394R673R787J0691J2169J3209J3730J4199J4208
58321I93274J3230J2120J1942J1877J0314P509N187L972L255L080M046N606O397
$$ y = [605700, 604175, 604005, 604739, 605667, 607302, 610707, 615586, 620602, 625593, 631841, 639879, 648505, 656346, 663052, 668360, 671257, 670955, 667959, 663530, 658646, 653866, 649580, 645920, 642776, 640076, 637757, 635551, 633378, 631762, 631230, 631488, 631868, 632314, 633113, 634003, 634568, 635245, 636807, 638931, 640479, 641192, 642014, 643708, 646243, 649623, 654199, 659970, 666473, 673431, 680641, 687390, 693030, 697994, 703138, 708298, 712748, 716845, 721784, 727706, 733581, 739057, 744930, 751610, 758598, 765753, 773564, 781783, 789266, 795540, 801122, 805929, 808903, 809702, 809315, 808454, 806797, 804416, 802471, 801708, 801588, 801700, 802777, 805511, 809470, 814008, 819242, 825448, 832488, 840394, 849481, 859347, 868821, 877493, 886214, 895608, 905281, 915068, 925759, 937928, 951137, 964867, 979066, 993274, 1006504, 1018624, 1030566, 1042443, 1052757, 1060266, 1065453, 1069425, 1072680, 1075760, 1079806, 1085412, 1091809]
58308A091809O258O150O436O870P829R744J1803J2973J3735J5066J6356J6400
58296A221429J5762J6037J7332J8537J9557K1122K2889K3961K4839K6794K9729
58285A457988L2632L5550L8943M1790M2552M1501L9840L7275L2753K6900K1408
58274A849132J6669J2481J0165J1181J4304J6991J9045K2171K6497L0444L3572
58263B062652L6696L9608M1586M3649M7261N1288N3295N3488N4308N6530N8894
58252B599255O1151O4182O7441O9549P1235P4409P8712Q2251Q5327Q9919R5880
58241C439311J01248J06021J12013J19303J26445J33831J43070J53342J62264
58232D596848J70036J78961J89308J99581K10284K23312K38309K53692K70436
$$ y = [1091809, 1098067, 1104217, 1110653, 1117523, 1125352, 1135096, 1146899, 1159872, 1173607, 1188673, 1205029, 1221429, 1237191, 1253228, 1270560, 1289097, 1308654, 1329776, 1352665, 1376626, 1401465, 1428259, 1457988, 1490620, 1526170, 1565113, 1606903, 1649455, 1690956, 1730796, 1768071, 1800824, 1827724, 1849132, 1865801, 1878282, 1888447, 1899628, 1913932, 1930923, 1949968, 1972139, 1998636, 2029080, 2062652, 2099348, 2138956, 2180542, 2224191, 2271452, 2322740, 2376035, 2429523, 2483831, 2540361, 2599255, 2660406, 2724588, 2792029, 2861578, 2932813, 3007222, 3085934, 3168185, 3253512, 3343431, 3439311, 3540559, 3646580, 3758593, 3877896, 4004341, 4138172, 4281242, 4434584, 4596848, 4766884, 4945845, 5135153, 5334734, 5545018, 5768330, 6006639, 6260331, 6530767]
58223F530767K90519L12817L35209L59361L88394M21445M56239M95297N43196
58214A0133244N99198O59539P25719Q03351Q94007R95937J111912J248504J409047
58205A8580458J596177J820367K097426K439511K859064L380585M039022M870005
58197D1682615N915046P236863Q920660J1064445J3774713J7152451K1249867
58190A26996660K6011585L1180612L6086064L9376395L9094949L3488259K2258527
58183C54493051P247966q220248k0953065k9215705l2946588l3109046l0952489
58176B06343876k7604165k3913358k0394902j7265697j4567038j2274744j0335380
58169G9988592q674419p222598n933807m769943l686659k647524j637439o53803
$$ y = [6530767, 6821286, 7134103, 7469312, 7828673, 8217067, 8638512, 9094751, 9590048, 10133244, 10732442, 11391981, 12117700, 12921051, 13815058, 14810995, 15922907, 17171411, 18580458, 20176635, 21997002, 24094428, 26533939, 29393003, 32773588, 36812610, 41682615, 47597661, 54834524, 63755184, 74819629, 88594342, 105746793, 126996660, 153008245, 184188857, 220274921, 259651316, 298746265, 332234524, 354493051, 361741017, 353520769, 332567704, 303351999, 270405411, 237296365, 206343876, 178739711, 154826353, 134431451, 117165754, 102598716, 90323972, 79988592, 71314173, 64091575, 58157768, 53387825, 49701166, 47053642, 45416203, 44762400]
58161D4762400K84569J081517J526680J376525N36979q07679k257313l412685
58153D3090993m067162m236863m058065l678275l214087k750330k337075j987434
58145A6761702j693629j447913j245781j078540r35370q11629p07342o19397n42578
58136G679523m76512m24183l84266l51355l23101l00968k84258k69105k53483
58127D612292k38164k22792k05701j87556j70773j55473j39950j24654j11710
58118C055519j01202r1931q5100q2893q3916q4337q3130q1977q0543p6376o9492
58107B134622o2708n7114n1280m5144m0658l8157l5860l3567l3250l5388l8112
58096A663384m0486m3323m6238m7223m5755m3311m0426l6253l1420k8086k6586
$$ y = [44762400, 45046969, 46128486, 47655166, 49031691, 49568670, 48760991, 46503678, 43090993, 39023831, 34786968, 30728903, 27050628, 23836541, 21086211, 18749136, 16761702, 15068073, 13620160, 12374379, 11295839, 10360469, 9548840, 8841498, 8222101, 7679523, 7203011, 6778828, 6394562, 6043207, 5720106, 5419138, 5134880, 4865775, 4612292, 4374128, 4151336, 3945635, 3758079, 3587306, 3431833, 3291883, 3167229, 3055519, 2954317, 2862386, 2777286, 2694393, 2610477, 2526140, 2443010, 2361033, 2280490, 2204114, 2134622, 2071914, 2014800, 1963520, 1918376, 1877718, 1839561, 1803701, 1770134, 1736884, 1701496, 1663384, 1622898, 1579575, 1533337, 1486114, 1440359, 1397048, 1356622, 1320369, 1288949, 1260863, 1234277]
58085A234277k5047k2883k1645k1880k2079k1476k1037k0972k0077j8217j6769
58074A002195j6016j4754j3076j2689j3729j4169j3188j2345j2487j2210j0571
58063H56961q688p513o424n219n088o414p788q363q982r993j0204r260q651r075
58049G45299q973p220n057l882l054j587k19kl48k17J50K67Q80K724M836N653
58033G29250N041L907K664J267K4p60j284j678j693j653k572m553o119o163n420
58018G10258n068m938m266l287k811k823k665k116j400n33M67J120R57J24j038
58003F81981k509m301o057p392q227q522q274p883p812p789p125o020n446n498
57989E89126m970l080o48J070J819K071K139K230K582K981K743J675N10k0O4L86
$$ y = [1234277, 1209230, 1186347, 1164702, 1142822, 1120743, 1099267, 1078230, 1057258, 1037181, 1018964, 1002195, 986179, 971425, 958349, 945660, 931931, 917762, 904574, 892229, 879742, 867532, 856961, 848273, 840760, 834336, 829117, 824029, 817615, 809827, 801464, 792482, 782489, 772285, 763025, 754374, 745299, 736326, 729106, 724049, 720167, 717113, 715526, 715307, 715305, 714957, 714740, 714890, 715157, 716037, 718761, 723597, 729250, 734291, 738198, 740862, 742129, 742153, 741393, 740109, 738431, 736738, 735085, 732513, 727960, 721841, 715678, 710258, 705190, 700252, 695986, 692699, 689888, 687065, 684400, 682284, 680884, 680351, 680818, 681938, 682895, 683019, 681981, 679472, 675171, 669114, 661722, 653495, 644973, 636699, 628816, 621004, 613215, 606090, 600070, 594624, 589126, 584156, 581076, 580428, 581498, 583317, 585388, 587527, 589757, 592339, 595320, 598063, 599738, 600248, 600228, 600292, 600678]
57973F00678P30R25Q80R49J511K130J900P29o16j741k865l777l829l228k996l271
57957E88109k902j277O97K074L146M485N794O534O743O518N516L758K033P79o98
57942F31309l054n822q148r940j1461j2548j2945j2873j2570j1797j0475r198
57930E10478q513q207p841p454p202o831o014m741l039r24J079K138K226K304
57916D57459L045M109N098O280P775Q952R335R399R781J0281J0284R583Q279O425
57902E66085M301K413Q21r52l015m876o322p608q437p999o547n718o386p375p247
57887E01138o285n485m629k823l67J465K236K719L518M438N171N706O001O025
57873E18828O098O554P128P159O431N335M339L579K802J540l14j973k441j954
$$ y = [600678, 601408, 602333, 603213, 604162, 605673, 607803, 609703, 610432, 609816, 608075, 605210, 601433, 597604, 594376, 591380, 588109, 585207, 583930, 584627, 586701, 589847, 594332, 600126, 606660, 613403, 619921, 625437, 629195, 631228, 632007, 631309, 628255, 622433, 614285, 604345, 592884, 580336, 567391, 554518, 541948, 530151, 519676, 510478, 501965, 493758, 485917, 478463, 471261, 464430, 458416, 453675, 450636, 449712, 450791, 452929, 455155, 457459, 460504, 464613, 469711, 475991, 483766, 492718, 502053, 511452, 521233, 531514, 541798, 551381, 559660, 566085, 570386, 572799, 573620, 572668, 569653, 564777, 558455, 550847, 542410, 534411, 527864, 522146, 515760, 508385, 501138, 494853, 489368, 484739, 481916, 481549, 483014, 485250, 487969, 491487, 495925, 501096, 506802, 512803, 518828, 524926, 531480, 538608, 545767, 552198, 557533, 561872, 565451, 568253, 569793, 569479, 567506, 565065, 563111]
57859E63111j961l220m739n229m792m392m338m279m148m200m366m377m257m085
57845E04728l613k692j668q17M8P74M43j393l615m725m708m749n467o460p375
57830D58711q341r297r820r754r321q608p561o453n726n371m985m352l596k883
57816C62643k356k130j963j316j99O06O83P62J625K803L372L587M620O741Q934
57801C88412J0402J1488J2790J4063J4451J3436J1375R313Q173P917P638O677
57789E16135N249L734J865p49l859o950r876j2421j3781j3460j2282j1489j1126
57776D30990j0294q813p507o832o338n581m622l474j944k61R63J616K178K852
57762C82933L353L649M078M609M779M597M594M802M631M015L702L946L962L289
$$ y = [563111, 561150, 557930, 553191, 547962, 543170, 538778, 534440, 530161, 526013, 521813, 517447, 513070, 508813, 504728, 501115, 498423, 496755, 495938, 495986, 496760, 497203, 495810, 492195, 487470, 482762, 478013, 472546, 466086, 458711, 450370, 441073, 431253, 421499, 412178, 403570, 396009, 389556, 383830, 378459, 373474, 369122, 365526, 362643, 360287, 358157, 356194, 354878, 354679, 355285, 355968, 356730, 358355, 361158, 364530, 368117, 372737, 379478, 388412, 398814, 410302, 423092, 437155, 451606, 465042, 476417, 485730, 493903, 501820, 509458, 516135, 521384, 525118, 526983, 526234, 522375, 515425, 505549, 493128, 479347, 465887, 453605, 442116, 430990, 420696, 411883, 404376, 397544, 391206, 385625, 381003, 377529, 375585, 375324, 376287, 377903, 380081, 382933, 386286, 389935, 394013, 398622, 403401, 407998, 412592, 417394, 422025, 426040, 429742, 433688, 437650, 440939]
57748D40939K760L205M034M105L482L227L669M068L931L727L957M401M728N244
57734D95477O382P804Q660Q717Q667R166J0030J0697J1163J1940J3272J4893J6579
57721F33447J8413K0285K1688K2317K2612K3329K4902K7464L1052L5356L9588
57710I20453M3299M7089N2076N8666O6395P4875Q4310R5028J07056J20230J34380
57699A803857J49215J64293J79143J93069K04737K12169K13258K06214J89735
57690C515690J63336J27776Q5256L9113o773m8836q4579j12637j32148j42483
57680C403715j43816j37576j25712j09539q9397o5110l6442l485L2724O9751J03528
57669B898641J27756J33727J13136O4127m593p6805j37172j77415j96301j96564
$$ y = [440939, 443699, 446904, 450938, 455043, 458525, 461752, 465421, 469489, 473420, 477147, 481104, 485505, 490233, 495477, 501859, 509663, 518323, 527040, 535707, 544873, 554903, 565600, 576763, 588703, 601975, 616868, 633447, 651860, 672145, 693833, 716150, 738762, 762091, 786993, 814457, 845509, 880865, 920453, 963752, 1010841, 1062917, 1121583, 1187978, 1262853, 1347163, 1442191, 1549247, 1669477, 1803857, 1953072, 2117365, 2296508, 2489577, 2694314, 2906483, 3119741, 3325955, 3515690, 3679026, 3806802, 3892058, 3931171, 3924398, 3875562, 3790983, 3678346, 3546198, 3403715, 3259899, 3122323, 2996611, 2887072, 2797675, 2732565, 2696123, 2692638, 2725362, 2795113, 2898641, 3026397, 3160124, 3273260, 3337387, 3332794, 3255989, 3118817, 2941402, 2745101, 2548537]
57659B548537j82998j61628j38101j15802r5692p7645o1467m6912l3622k1321
57649A613349r897Q20J1169K1589L2510M4200N6521O9057Q1643R4708J08817J23912
57637B248398J39101J53169J65119J74117J78979J77862J68689J50143J22374
57628C677951Q6919M6205L239l8662p6515j08437j33728j52318j64355j70291
57618B970008j71028j67684j61269j52597j42441j31616j20876j10709j01315
57609A710473r2755q5065p8123p1546o5026n8716n2990m7825m2866l8202l4523
57598A042836l2138l0335k8188k5698k3591k2159k0859j9081j6813j4541j2734
57587G96699j1518j0623r609q361p287o839o918o941o397n161l454j660j64Q26
$$ y = [2548537, 2365539, 2203911, 2065810, 1950008, 1854316, 1776671, 1715204, 1668292, 1634670, 1613349, 1603452, 1604272, 1615441, 1637030, 1669540, 1713740, 1770261, 1839318, 1920961, 2015669, 2124486, 2248398, 2387499, 2540668, 2705787, 2879904, 3058883, 3236745, 3405434, 3555577, 3677951, 3764870, 3811075, 3814314, 3775652, 3699137, 3590700, 3456972, 3304654, 3140299, 2970008, 2798980, 2631296, 2470027, 2317430, 2174989, 2043373, 1922497, 1811788, 1710473, 1617718, 1532653, 1454530, 1382984, 1317958, 1259242, 1206252, 1158427, 1115561, 1077359, 1042836, 1010698, 980363, 952175, 926477, 902886, 880727, 859868, 840787, 823974, 809433, 796699, 785181, 774558, 764949, 756588, 749301, 742462, 735544, 728603, 722206, 717045, 713591, 711931, 711767, 712593]
57573G12593J296J394J578K601M779P247Q623Q698Q764R949J1962J3971J5938
57560H09393J8250K0683K2683K4436K6680K9619L2870L6406M0667M5798N1492
57549A158977N7715O4952P3565Q3419R4038J04758J14882J24235J33233J41700
57539B151474J47892J49422J44981J34363J17257R3198O2944K8877o157l9693
57529B984558o9494r3760j11927j24421j31469j32958j29685j23664j16609j08899
57519A841672j00401r1559q3079p5259o8130o1653n5429m8852m2061l6064l1438
57508A147747k7600k3775k0016j6628j3356r857o453l572r11K155N604Q974J2185
57495A054497J5531J9044K2560K6296L0767L6201M2498M9608N7579O6370P5941
$$ y = [712593, 713889, 715283, 716861, 719462, 724241, 731488, 740111, 748809, 757573, 767522, 779484, 793455, 809393, 827643, 848326, 871009, 895445, 922125, 951744, 984614, 1021020, 1061687, 1107485, 1158977, 1216692, 1281644, 1355209, 1438628, 1532666, 1637424, 1752306, 1876541, 2009774, 2151474, 2299366, 2448788, 2593769, 2728132, 2845389, 2938587, 3001531, 3030408, 3024251, 2984558, 2915064, 2821304, 2709377, 2584956, 2453487, 2320529, 2190844, 2067180, 1950571, 1841672, 1741271, 1649712, 1566633, 1491374, 1423244, 1361591, 1306162, 1257310, 1215249, 1179185, 1147747, 1120147, 1096372, 1076356, 1059728, 1046372, 1036515, 1030062, 1026490, 1025579, 1027734, 1033338, 1042312, 1054497, 1070028, 1089072, 1111632, 1137928, 1168695, 1204896, 1247394, 1297002, 1354581, 1420951, 1496892]
57484A496892Q6338R7336J08237J18369J27341J34512J38538J38020J32236J20786
57474B698605J03004P8505M8205J4301k0582n3759q2643j05539j22323j33619
57464B424155j39525j39921j35899j29677j22753j14972j05924r6369q7592p9908
57454A271615p2772o5981o0052n5186n0714m5854m0741l6203l2768l0165k7874
57443G53305k5769k3995k2413k0641j8623j6815j5544j4496j3144j1500j0058
57432E60307r082q362p706p227o962o590n878n168m953n166n221m830m314m015
57418D74833l797l435l050k762k183q66Q10J753J335J6j261j861j555m57P83J281
57402D59584Q98N18Q62J462J339M19m33o29l92j22J42N01Q86J162J244J086P68
$$ y = [1496892, 1583230, 1680566, 1788803, 1907172, 2034513, 2169025, 2307563, 2445583, 2577819, 2698605, 2801609, 2880114, 2928319, 2942620, 2922038, 2868279, 2785636, 2680097, 2557774, 2424155, 2284630, 2144709, 2008810, 1879133, 1756380, 1641408, 1535484, 1439115, 1351523, 1271615, 1198843, 1132862, 1072810, 1017624, 966910, 921056, 880315, 844112, 811344, 781179, 753305, 727536, 703541, 681128, 660487, 641864, 625049, 609505, 595009, 581865, 570365, 560307, 551225, 542863, 535157, 527930, 520968, 514378, 508500, 503332, 498379, 493213, 487992, 483162, 478848, 474833, 471036, 467601, 464551, 461789, 459606, 458740, 459550, 461303, 462638, 462654, 461393, 459532, 457977, 457520, 458303, 459584, 460482, 461000, 461862, 463324, 464663, 465082, 464649, 464020, 463628, 463506, 463648, 464149, 465035, 466197, 467441, 468527, 469295]
57385D69295N14M21L31K81O25J345J662J024Q1j01M81J007J259J717K279K171
57369D84392J426J255K380L895M525M167L565L086K619K186J928J806J845K317
57355E21392L180L764L585L067K926L184L348L249L075K849K478K214K427L026
57341E63764L544L763L824L765L423K834K423K654L616M881N748N779N216M728
57327F19962M717N101N705O458P148P532P755Q238Q929R289R183R194R762J0585
57313G29558J1304J2117J3225J4259J4895J5551J6761J8249J9336J9976K0737
57302I05968K1894K3223K4533K5817K6935K7662K7949K7771K6839K4880K2035
57291A185506J8496J4070Q498K161m098r714j4641j8930k2456k4962k6125k5770
$$ y = [469295, 469809, 470230, 470561, 470842, 471467, 472812, 474474, 475498, 475579, 475478, 475959, 476966, 478225, 479942, 482221, 484392, 485818, 487073, 489453, 493348, 497873, 502040, 505605, 508691, 511310, 513496, 515424, 517230, 519075, 521392, 524572, 528336, 531921, 534988, 537914, 541098, 544446, 547695, 550770, 553619, 556097, 558311, 560738, 563764, 567308, 571071, 574895, 578660, 582083, 584917, 587340, 589994, 593610, 598491, 604239, 610018, 615234, 619962, 624679, 629780, 635485, 641943, 649091, 656623, 664378, 672616, 681545, 690834, 700017, 709211, 718973, 729558, 740862, 752979, 766204, 780463, 795358, 810909, 827670, 845919, 865255, 885231, 905968, 927862, 951085, 975618, 1001435, 1028370, 1056032, 1083981, 1111752, 1138591, 1163471, 1185506, 1204002, 1218072, 1226570, 1228731, 1224633, 1214919, 1200278, 1181348, 1158892, 1133930, 1107805, 1082035]
57279A082035k4262k2374k0467j8247j5537j2817j0505q353o137m389l557k951
57267I32439j511N74K070K480K633L374M539N493N992O146O152O275O727P326
57253I90709P690P817Q049Q435Q683Q793R164R843J0259R978R340R010R286J0023
57239A117079J0878J1375J1141J0370R788R868J0309J0533J0411J0281J0431J0905
57227A243369J1722J2848J3987J4678J4780J4718J5043J5802J6530J6916J7195
57216A407588J7759J8525J9045J9170J9235J9538J9859J9679J8762J7537J6887
57205A613584J7407J8629J9302J8811J8016J8166J9254K0233K0618K0940K1593
57194A826553K2283K2918K3998K5640K7129K7986K8669K9608L0376L0505L0376
$$ y = [1082035, 1057773, 1035399, 1014932, 996685, 981148, 968331, 957826, 949473, 943336, 938947, 935390, 932439, 930928, 931502, 933572, 936052, 938685, 942059, 946598, 952091, 958083, 964229, 970381, 976656, 983383, 990709, 998399, 1006216, 1014265, 1022700, 1031383, 1040176, 1049340, 1059183, 1069442, 1079420, 1088760, 1097770, 1107056, 1117079, 1127957, 1139332, 1150473, 1160843, 1170631, 1180499, 1190808, 1201341, 1211752, 1222033, 1232464, 1243369, 1255091, 1267939, 1281926, 1296604, 1311384, 1326102, 1341145, 1356947, 1373477, 1390393, 1407588, 1425347, 1443872, 1462917, 1482087, 1501322, 1520860, 1540719, 1560398, 1579160, 1596697, 1613584, 1630991, 1649620, 1668922, 1687733, 1705749, 1723915, 1743169, 1763402, 1784020, 1804960, 1826553, 1848836, 1871754, 1895752, 1921392, 1948521, 1976507, 2005176, 2034784, 2065160, 2095665, 2126041]
57183B126041L0524L0707L0499L0209L0363L0722L0679L0262K9951K9835K9683
57172B459475K9596K9952L0892L2305L3934L5145L5261L4608L4509L5602L6990
57161B828269L7677L8000L8711L9561L9926M0062M0524M0999M1008M1138M2282
57150C268157M4039M5147M5277M5191M5509M6314M7564M8686M8258M5433M1356
57139C770931L7995L5973L4699L3963L3870L3741L2773L1531L1216L1721L1926
57128D140339L1626L1567L1900L2203L2813L4353L6301L7901M0187M5127N2832
57117D547149O1702P1231Q2525R5968J10538J25866J43001J62777J85213K10678
57107E796648K39956K73280L11211L56389M12476M81909N67061O73154Q07471
$$ y = [2126041, 2156565, 2187272, 2217771, 2247980, 2278343, 2309065, 2339744, 2370006, 2399957, 2429792, 2459475, 2489071, 2519023, 2549915, 2582220, 2616154, 2651299, 2686560, 2721168, 2755677, 2791279, 2828269, 2865946, 2903946, 2942657, 2982218, 3022144, 3062206, 3102730, 3143729, 3184737, 3225875, 3268157, 3312196, 3357343, 3402620, 3447811, 3493320, 3539634, 3587198, 3635884, 3684142, 3729575, 3770931, 3808926, 3844899, 3879598, 3913561, 3947431, 3981172, 4013945, 4045476, 4076692, 4108413, 4140339, 4171965, 4203532, 4235432, 4267635, 4300448, 4334801, 4371102, 4409003, 4449190, 4494317, 4547149, 4608851, 4680082, 4762607, 4858575, 4969113, 5094979, 5237980, 5400757, 5585970, 5796648, 6036604, 6309884, 6621095, 6977484, 7389960, 7871869, 8438930, 9112084, 9919555]
57098I919555R76338J185751J443996J759859K138124K579355L081689L637116
57090B6721783M226150M820842N391872N908358O336320O647765O823293O820690
57082G3697073O535697N828729M633070L045978J296222l86625j871714l120807
57074H9657623m128046m888065n403313n691871n781348n704559n500766n210289
57066D7349366m863728m480284m076098l668554l272159k895869k546233k229435
57058A9317006j948962j704411j493871j315262j164820j036960r26780q31357
57050H894583p48444o75719o11616n55280n05339m60075m18672l80925l45777
57041D192736l11749k78759k48043k20357j95588j73938j55772j40292j25977
$$ y = [9919555, 10895893, 12081644, 13525640, 15285499, 17423623, 20002978, 23084667, 26721783, 30947933, 35768775, 41160647, 47069005, 53405325, 60053090, 66876383, 73697073, 80232770, 86061499, 90694569, 93740547, 95036769, 94650144, 92778430, 89657623, 85529577, 80641512, 75238199, 69546328, 63764980, 58060421, 52559655, 47349366, 42485638, 38005354, 33929256, 30260702, 26988543, 24092674, 21546441, 19317006, 17368044, 15663633, 14169762, 12854500, 11689680, 10652720, 9725940, 8894583, 8146139, 7470420, 6858804, 6303524, 5798185, 5338110, 4919438, 4538513, 4192736, 3880987, 3602228, 3354185, 3133828, 2938240, 2764302, 2608530, 2468238, 2342261]
57032B342261j12523j00951r1529q3161p5100o7872o1965n6857n1908m7246m3206
57021A549943l9731l6754l4345l2107k9152k5120k0553j5919j0961n243J451R704
57009A311213K0757L5597N4328P6850J03135J30996J52995J57130J33307Q1244
56999B257552J2625n5022j07485j38731j49706j45110j31193j13934r6958q1083
56989A250955o6269n3179m2258l2538k2795j3513o567l219l428o624j1950j7864
56977I70751k2695k5771k7294k7304k5707k3078k0406j7954j5328j2637j0504
56966G42073q879o884m056p89K684O697J1202J5351J8470K0497K0865J7918J0459
56953H45608l86j1641k0561k5949k7869k7005k4339k0913j7510j4491j1907r672
$$ y = [2342261, 2229738, 2128787, 2037258, 1954097, 1878997, 1811125, 1749160, 1692303, 1640395, 1593149, 1549943, 1510212, 1473458, 1439113, 1407006, 1377854, 1352734, 1332181, 1316262, 1305301, 1300058, 1301509, 1311213, 1331970, 1367567, 1421895, 1498745, 1601880, 1732876, 1885871, 2043001, 2176308, 2257552, 2270177, 2215155, 2107670, 1968939, 1819233, 1674123, 1542930, 1428996, 1332038, 1250955, 1184686, 1131507, 1089249, 1056711, 1033916, 1020403, 1013836, 1010617, 1007189, 1000565, 988615, 970751, 948056, 922285, 894991, 867687, 841980, 818902, 798496, 780542, 765214, 752577, 742073, 733194, 726310, 722254, 721465, 724149, 730846, 742048, 757399, 775869, 796366, 817231, 835149, 845608, 845222, 833581, 813020, 787071, 759202, 732197, 707858, 686945, 669435, 654944, 643037, 633365]
56941F33365p670n803l821j248K329O905J2140J7708K3357K8561L2313L3186K9645
56928H00967K0804P506p478k0781l0253l5398l6657l4920l1550k7959k4802k1913
56916E57566j9104j6537j4273j2078r949q346p562p179o530n462m411l825l730
56903D38580l784l650l256k693j869n95R03J911K090K162L251N685Q780J1770
56889D59285J4465J7046J9587K1694K2298J9994J4226O041k579j0051j5431j7995
56877E48580j7622j5521j3486j2025j0042o726k936q0J784L990P642J2641J8256
56864E14455K4176L0770L8383M6370N2721N4732N0277L8776K1619J922j6445l0392
56852H27364l8624m1343l9462l4394k8024k1963j6738j2057p574k844L005J0527
$$ y = [633365, 625695, 619892, 616071, 614823, 617152, 624057, 636197, 653905, 677262, 705823, 738136, 771322, 800967, 821771, 829277, 821799, 801018, 770765, 735367, 698710, 663790, 632240, 604281, 579479, 557566, 538462, 521925, 507652, 495574, 485625, 477279, 469717, 462538, 456008, 450546, 446135, 442310, 438580, 434796, 431146, 427890, 425197, 423328, 422733, 423636, 425547, 427637, 429799, 433050, 438735, 447515, 459285, 473750, 490796, 510383, 532077, 554375, 574369, 588595, 594636, 592057, 582006, 566575, 548580, 530958, 515437, 501951, 489926, 479884, 473158, 470222, 470142, 471926, 475916, 483558, 496199, 514455, 538631, 569401, 607784, 654154, 706875, 761607, 811884, 850660, 872279, 874201, 857756, 827364, 788740, 747397, 707935, 673541, 645517, 623554, 606816, 594759, 587185, 584341, 587346, 597873]
56840E97873J9006K7371L6075M6905O0381P4253Q4848Q8922Q3864O7822M1344
56829A228664Q773k3206m8848o5323p2550p2301o7350o0294n2548m4428l6058
56818F94531k7869k0309j3441o914j15P496J6087K5519L5655M6125N5634O1730
56806H74129O1576N2972L5316J0659j5917l8240n2457n8635n9037n5679m9945
56795G04742m3305l6939l0899k4700j8572j3295q946m754j79M708R956J5878K2223
56782E75918K7865L1483L1931K7994J8831N307r721k3022l2656l8021l9127l6659
56770E40123l2219k7611k3690k0335j7386j5079j3476j2078j0375q518p150o657
56758C45549o862p258p356o835n727m565m052m376m955n048m456l527k678k116
$$ y = [597873, 616879, 644250, 680325, 727230, 787611, 861864, 946712, 1035634, 1119498, 1187320, 1228664, 1237437, 1214231, 1165383, 1100060, 1027510, 955209, 887859, 827565, 775017, 730589, 694531, 666662, 646353, 632912, 625998, 625883, 633379, 649466, 674985, 710640, 756765, 812399, 874129, 935705, 988677, 1023993, 1034652, 1018735, 980495, 928038, 869403, 810366, 754687, 704742, 661437, 624498, 593599, 568899, 550327, 537032, 528086, 523332, 523153, 527861, 537817, 553695, 575918, 603783, 635266, 667197, 695191, 714022, 719329, 709608, 686586, 653930, 615909, 576782, 540123, 507904, 480293, 456603, 436268, 418882, 403803, 390327, 378249, 367874, 359356, 352206, 345549, 338687, 331429, 324073, 317238, 311511, 306946, 302894, 298518, 293563, 288515, 284059, 280532, 277854, 275738]
56744B75738j877j792j581j247j170j512j803j596j256j430j905j872j306j118
56730B54273j686k254k220k108k492k794k128p84J50K90J54M1l10r55j492j700
56714B33985j692j365m78O34J115O38j93p10q17n96K5P64P96k56j530j768q09
56697B27743L26Q04Q25R72J209R66J16o29m71N02J338J179L8j329k090j846q28
56680B28825K11M67k61j413k235k414k137j788j656j809k063k200k147j852j034
56665B06494L91J746K001J012k00o69n01l21l08l29m74q34j032o87q8J55j8j49
56647B06189L0L77P14R27Q58N37K86J78k16j065j688j407o11k02l48n64p40j063
56629B02192j176m71O92J197P00Mk15j29M4M98J118J238O61P3l6j07o40j282j473
$$ y = [275738, 273861, 272069, 270488, 269241, 268071, 266559, 264756, 263160, 261904, 260474, 258569, 256697, 255391, 254273, 252587, 250333, 248113, 246005, 243513, 240719, 238591, 237807, 237957, 238247, 238401, 238442, 238132, 237177, 235685, 233985, 232293, 230928, 230450, 231084, 232199, 232837, 232644, 231934, 231117, 230521, 230546, 231310, 232106, 231850, 230320, 228552, 227743, 228069, 228873, 229698, 230670, 231879, 232845, 232961, 232332, 231861, 232363, 233701, 234880, 234918, 233589, 231499, 229653, 228825, 229036, 229503, 229242, 227829, 225594, 223180, 221043, 219255, 217599, 215790, 213727, 211527, 209380, 207528, 206494, 206885, 208631, 210632, 211644, 211444, 210775, 210274, 209953, 209645, 209316, 208842, 208008, 206976, 206289, 206201, 206356, 206338, 206189, 206219, 206596, 207310, 208237, 209095, 209632, 209918, 210096, 209880, 208815, 207127, 205720, 205109, 204907, 204559, 203995, 203255, 202192, 201016, 200545, 201237, 202434, 203134, 203138, 202923, 202794, 202838, 203336, 204454, 205692, 206353, 206426, 206390, 206283, 205643, 204361, 202888]
56610B02888j347j311j226p00J22O75O97L78j3k94l68l22k66m1N38J056Q09l1
56592B01244l35M71J514J664R89L58J25K3m6R9L98O39R61J557K119K166J823J642
56574B17411J688J514J089J069J937L323M433M791M392L531K700K431K842L463
56560B56614L732L715M043N018N921N604L881J865O80K23k80r28j162r99j198
56545B86729j987k584k507k486l343m591n040m462l833l987m736n265m944l743
56531B33221k294j486j632k114k214j979j935k170k293k162k037k057k079k045
56517B04724k039j954j601j231j395k088k483j891o59J78O2n80r35o59k9N54Q88
56500A88862Q67M38q4l9Q07J723J791J168R10J473K149K200J841J597J420J079
$$ y = [202888, 201541, 200230, 199004, 198304, 198426, 199101, 199798, 200176, 200163, 199869, 199501, 199179, 198913, 198872, 199410, 200466, 201275, 201244, 200909, 201380, 202894, 204558, 205547, 205905, 206030, 206053, 206007, 206106, 206504, 207143, 208104, 209661, 211780, 213946, 215769, 217411, 219099, 220613, 221702, 222771, 224708, 228031, 232464, 237255, 241647, 245178, 247878, 250309, 253151, 256614, 260346, 264061, 268104, 273122, 279043, 284647, 288528, 290393, 291073, 291296, 291016, 290088, 288926, 287927, 286729, 284742, 282158, 279651, 277165, 273822, 269231, 264191, 259729, 255896, 251909, 247173, 241908, 236964, 233221, 230927, 229441, 227809, 225695, 223481, 221502, 219567, 217397, 215104, 212942, 210905, 208848, 206769, 204724, 202685, 200731, 199130, 197899, 196504, 194416, 191933, 190042, 189383, 189561, 189623, 189043, 188108, 187449, 187420, 187974, 188862, 189729, 190167, 190083, 190044, 190851, 192574, 194365, 195533, 196443, 197916, 200065, 202265, 204106, 205703, 207123, 208202]
56484B08202R40J547K664L383L175K299J334P20O71R82J076O57K51N89J529K099
56468B32118J661N97k38l83j7L42K72j52m03j33L17L09k90r98j409j621j876k044
56450B26052j746q53K41R68J182J328J817K375K280J273m6q56r07n50k88l40m67
56433B31463j67N86R32l7j967l430l511k667j763j048m75k92o88j285j614j664
56417B12373j555j138m32O4L8m4L84J112J503J350Q84L36l3O5L81J45p57j274
56399B13402n95N60R91P05N75P97Q85Q34J104J539J537J219J305J770J739R20
56383B29287R3q9J57M69Q53J158R09Q0o43p14k90L20J102J981K591K740K543K013
56365B44560J065O3k96J46Q74J548K299L035L208K644J897J466J184Q63Q73J598
$$ y = [208202, 209142, 210689, 213353, 216736, 219911, 222210, 223544, 224264, 224935, 225917, 226993, 227650, 227901, 228490, 230019, 232118, 233779, 234376, 234138, 233755, 233738, 234080, 234352, 234200, 233797, 233664, 233981, 234290, 234000, 233002, 231593, 229972, 228096, 226052, 224306, 223453, 223694, 224662, 225844, 227172, 228989, 231364, 233644, 234917, 234871, 234015, 233108, 232558, 232270, 231930, 231463, 231296, 231882, 232814, 232777, 230810, 227380, 223869, 221202, 219439, 218391, 217916, 217624, 216936, 215651, 214037, 212373, 210818, 209680, 209248, 209312, 209350, 209306, 209690, 210802, 212305, 213655, 214539, 214875, 214842, 214907, 215288, 215433, 214676, 213402, 212807, 213367, 214358, 215063, 215638, 216435, 217320, 218154, 219258, 220797, 222334, 223553, 224858, 226628, 228367, 229287, 229380, 229291, 229448, 229917, 230770, 231928, 232837, 232917, 232274, 231560, 231270, 231590, 232692, 234673, 237264, 240004, 242547, 244560, 245625, 245688, 245392, 245538, 246412, 247960, 250259, 253294, 256502, 259146, 261043, 262509, 263693, 264556, 265429, 267027]
56349B67027K681L327L248K958L204M178N281N731N523N470O051O633O426N725
56335C33463N435N663N728N292M563L507K003P44P67J825K368J558K60m11m98
56320C72267o42j076j770k770l663l558k269q47k79k54N3O41R11Q30R40J525K397
56303C62436L312M071M417M348M290M586N060N486O067P011P962Q496Q818R364
56289D45724J0009J0368J0773J2101J4454J6682J7717J7995J9014K1501K4555
56278F20893K6855K8350L0247L3465L7742M2373M7217N2588N8737O5861P4102
56267A118430Q3052R1824J00135J08780J18343J28088J36870J44463J50849J54914
56257B335748J55163J51428J44493J34361J20411J03165Q4281O4671M4183K3404
$$ y = [267027, 269708, 273035, 276283, 279241, 282445, 286623, 291904, 297635, 303158, 308628, 314679, 321312, 327738, 333463, 338898, 344561, 350289, 355581, 360144, 363651, 365654, 366398, 367165, 368990, 371358, 372916, 373176, 372765, 372267, 371625, 370549, 368779, 366009, 362346, 358788, 356519, 355672, 355393, 355139, 355192, 355833, 356744, 357574, 358514, 360039, 362436, 365748, 369819, 374236, 378584, 382874, 387460, 392520, 398006, 404073, 411084, 419046, 427542, 436360, 445724, 455733, 466101, 476874, 488975, 503429, 520111, 537828, 555823, 574837, 596338, 620893, 647748, 676098, 706345, 739810, 777552, 819925, 867142, 919730, 978467, 1044328, 1118430, 1201482, 1293306, 1393441, 1502221, 1620564, 1748652, 1885522, 2029985, 2180834, 2335748, 2490911, 2642339, 2786832, 2921193, 3041604, 3144769, 3229050, 3293721, 3337904, 3361308]
56247C361308M111j2561k6877l8984m8245n4809o0197o5349o9454p1819p3555
56236B843569p6217p9827q3540q7287r1373r5194r7708r8817r9126r8771r7478
56225A838231r5452r3182r0594q7253q3089p8291p2827o6812o0953n5871n1341
56214A002566m6835m2438l8514l4962l1452k8077k5112k2525k0234j8414j6982
56203F77021j5414j3578j2153j1511j0835r176o850m890l601k496j325l27L74
56190E85239R12J388J895K634L529M137M256M187M042L468K462J691J438J053
56176F22331J28o09m00K36L02j83m29j03N81J555K826M041M983O040P477Q748
56160F57524R364R950J1449J3631J5398J6415J7548J9711K3058K7251L1996L7273
$$ y = [3361308, 3365419, 3352858, 3325981, 3286997, 3238752, 3183943, 3123746, 3058397, 2988943, 2917124, 2843569, 2767352, 2687525, 2603985, 2516698, 2425325, 2330131, 2232423, 2133606, 2034480, 1935709, 1838231, 1742779, 1649597, 1559003, 1471750, 1388661, 1310370, 1237543, 1170731, 1109778, 1053907, 1002566, 955731, 913293, 874779, 839817, 808365, 780288, 755176, 732651, 712417, 694003, 677021, 661607, 648029, 635876, 624365, 613530, 604354, 597504, 592614, 589013, 586517, 585192, 584865, 585239, 586151, 587539, 589434, 592068, 595597, 599734, 603990, 608177, 612219, 615687, 618149, 619840, 621278, 622331, 622459, 621850, 621450, 621686, 621988, 621805, 621376, 621273, 621854, 623409, 626235, 630276, 635259, 641299, 648776, 657524, 666888, 676838, 688287, 701918, 717316, 733731, 751279, 770990, 794048, 821299, 853295, 890568]
56148H90568M3490N1299O1152P3207Q7745J05033J24556J44872J64311J80968
56138A927201J91987J94105J85870J68815J46400J22677J01950Q7737Q0581P7390
56128C284713P3705O6135N2930L4304J3303n119j7601k4545k8642l2830m0387
56117C375966n4758p6999j04033j30866j53746j70358j78794j78455j71190j59781
56107A996986j45826j30247j14685j00635q7989p6088o5411n6700m9314m2247
56097A127844l5949l1396k8028k4453k0587j7385j4979j2729j0580q790o933m720
56085I11315l121k931l065j939J51J799K835L984M997N153N059N859P179P821
56071I45096P946Q517R185Q878Q030Q035Q754Q881Q377Q462R296R857R984J0524
$$ y = [890568, 934058, 985357, 1046509, 1119716, 1207461, 1312494, 1437050, 1581922, 1746233, 1927201, 2119188, 2313293, 2499163, 2667978, 2814378, 2937055, 3039005, 3126742, 3207323, 3284713, 3358418, 3424553, 3477483, 3511787, 3525090, 3519971, 3502370, 3477825, 3449183, 3416353, 3375966, 3321208, 3244209, 3140176, 3009310, 2855564, 2685206, 2506412, 2327957, 2156767, 1996986, 1851160, 1720913, 1606228, 1505593, 1417604, 1341516, 1276105, 1219405, 1170091, 1127844, 1091895, 1060499, 1032471, 1008018, 987431, 970046, 955067, 942338, 931758, 922968, 916035, 911315, 908194, 905263, 902198, 900259, 900410, 902209, 905044, 909028, 914025, 919178, 924237, 930096, 937275, 945096, 953042, 961559, 970744, 979622, 987652, 995687, 1004441, 1013322, 1021699, 1030161, 1039457, 1049314, 1059298, 1069822]
56057A069822J1533J2307J3030J4442J6074J6788J6826J7460J8840K0167K1483
56046A248772K3362K5184K5850K5847K6504K7679K8198K8023K7764K6734K3897
56035A537814K0250J7831J6996J7013J8555K2718K8183L2324L4767L7092L9484
56024A823027M0788M1483M3323M6163M8209M9408N1450N4436N6680N7853N9285
56013B372105O1275O3035O5132O8816P3118P5877P7462Q0156Q4221Q7971R1384
56002C200552R5934J01175J05321J08992J14397J21179J27107J32590J40019J48941
55992D396207J56552J63002J71444J82663J94484K06670K21440K38750K56079
55983F187291K73378K93320L16383L40702L66878L97735M33338M71766N14567
$$ y = [1069822, 1081355, 1093662, 1106692, 1121134, 1137208, 1153996, 1170822, 1188282, 1207122, 1227289, 1248772, 1272134, 1297318, 1323168, 1349015, 1375519, 1403198, 1431396, 1459419, 1487183, 1513917, 1537814, 1558064, 1575895, 1592891, 1609904, 1628459, 1651177, 1679360, 1711684, 1746451, 1783543, 1823027, 1863815, 1905298, 1948621, 1994784, 2042993, 2092401, 2143851, 2198287, 2254967, 2312820, 2372105, 2433380, 2496415, 2561547, 2630363, 2703481, 2779358, 2856820, 2936976, 3021197, 3109168, 3200552, 3296486, 3397661, 3502982, 3611974, 3726371, 3847550, 3974657, 4107247, 4247266, 4396207, 4552759, 4715761, 4887205, 5069868, 5264352, 5471022, 5692462, 5931212, 6187291, 6460669, 6753989, 7070372, 7411074, 7777952, 8175687, 8609025, 9080791, 9595358]
55974I595358N65544O24599O89051P60610Q44135R40131J046151J165303J305539
55965A7536421J471223J664390J894378K177545K528493K962180L504941M193897
55957C7933468N067517O170118P567699R350851J1624029J4497080J8069084K2385603
55949A32665449K7372056L2714750L7625912M0602597L9598910L2946743K0626950
55942C64153367M824246j0926156k3452002l1210273l4356859l4000139l1453691
55935B03578493k7857754k4043406k0489530j7378536j4731518j2514827j0669872
55928G5893050r123463p815746o711960n783422m996599m326659l762926l293073
55920C0079202k895690k553330k259485k007817j786792j589438j417201j269593
$$ y = [9595358, 10160902, 10785501, 11474552, 12235162, 13079297, 14019428, 15065579, 16230882, 17536421, 19007644, 20672034, 22566412, 24743957, 27272450, 30234630, 33739571, 37933468, 43000985, 49171103, 56738802, 66089653, 77713682, 92210762, 110279846, 132665449, 160037505, 192752255, 230378167, 270980764, 310579674, 343526417, 364153367, 368977613, 358051457, 334599455, 303389182, 269032323, 235032184, 203578493, 175720739, 151677333, 131187803, 113809267, 99077749, 86562922, 75893050, 66769587, 58953841, 52241881, 46458459, 41461860, 37135201, 33372275, 30079202, 27183512, 24630182, 22370697, 20362880, 18576088, 16986650, 15569449, 14299856]
55912A4299856j139604j022598r20172q31694p50988o74854o06669n48234m95659
55903G309384m46443m03263l67567l36098l06705k81429k60951k41910k22419
55894D442599k04821j90479j77017j63110j50930j41667j33291j24761j17855
55885C038668j12980j07643j00908r4934r0434q5092p8148p2172o8485o5125o1152
55874B101595n8668n8566n8265n5786n2446m9525m5896m0854l5901l1846k7374
55863A586468k2085j7690j4682j1347p756p293j2097k0010k7813l4569l9982m2672
55851A328472m2269m0656l9208l7165l4229l2016l1285l0353k8054k5757k4697
55840I62783k3772k1889k0086j9437j9009j7733j6336j5678j5025j3562j1822
$$ y = [14299856, 13160252, 12137654, 11217482, 10385788, 9634800, 8959946, 8353277, 7805043, 7309384, 6862941, 6459678, 6092111, 5756013, 5449308, 5167879, 4906928, 4665018, 4442599, 4237778, 4047299, 3870282, 3707172, 3556242, 3414575, 3281284, 3156523, 3038668, 2925688, 2818045, 2717137, 2622203, 2531769, 2446677, 2368529, 2296357, 2227872, 2162747, 2101595, 2042927, 1984361, 1926096, 1870310, 1817864, 1768339, 1722443, 1681589, 1645688, 1613842, 1586468, 1564383, 1546693, 1532011, 1520664, 1512908, 1505615, 1493518, 1473508, 1445695, 1411126, 1371144, 1328472, 1286203, 1245547, 1206339, 1169174, 1134945, 1102929, 1071644, 1041291, 1013237, 987480, 962783, 939011, 917122, 897036, 877599, 858590, 840857, 824521, 808843, 793818, 780256, 768434]
55829G68434j0252q200n632l836l256k550j067j26n83j327j546k247m080n781
55815G17951o376o854q098r251r676j0394j1815j2246j0549q397p780q038p440
55802F01037o095n137m458l442k784l524n116o232o686o988o879n886m478l233
55788E30099j696N65K574K815P40l459r359j5484j9390j9964j8719j7582j6560
55775D14580j4707j2106r410o653l961k507l138m996o748q318j0018j1070j0567
55762C10381r075p822o949n888m733l875k986j747r09j312k417l088l250l548
55748B52782l955l970l748l839m200m439m607m816m635l807k998k886l088k873
55734A98921k254j541n12Q89J748J161m16j769k379k497k376k217k381k756k679
$$ y = [768434, 758182, 749982, 744350, 740514, 737258, 734708, 733641, 733515, 732932, 731605, 730059, 727812, 723732, 717951, 711575, 704721, 696623, 687372, 677696, 667302, 655487, 643241, 632692, 624295, 616515, 608477, 601037, 594942, 589805, 585347, 581905, 579121, 575597, 570481, 564249, 557563, 550575, 543696, 537810, 533332, 530099, 528403, 528968, 531542, 534357, 535097, 531638, 522279, 506795, 487405, 467441, 448722, 431140, 414580, 399873, 387767, 378357, 371704, 367743, 365236, 362098, 357102, 350354, 342036, 332018, 320948, 310381, 301306, 293484, 286535, 280647, 275914, 272039, 269053, 267306, 266397, 265085, 262668, 259580, 256330, 252782, 248827, 244857, 241109, 237270, 233070, 228631, 224024, 219208, 214573, 210766, 207768, 204882, 201794, 198921, 196667, 195126, 194614, 195503, 197251, 198412, 197996, 196227, 193848, 191351, 188975, 186758, 184377, 181621, 178942]
55719A78942k045j706k031j997o78J318K838L737M343M397L784L401L974M704
55705B02981M424L440K801K416J337m36j929k744l317l735l584k981k638k795
55691A93240k891k377j274K0R65J250J353K232L976N418N669N263N154N368N527
55676B28893N759O050N589L930K182J709K140K035J067K41J47L13K35n8m92j069
55660B58671j492j499j427j785k431k876l129l481l819l891l934m339m961n473
55646B14134n998o693p135o887o246n764n435n055m801m743m410l645l221l680
55632A40421m240l900k992k511k477k208j719j574j727j666j479j647j990j944
55618A08347j555j304j169q71o55q24r71p19o39j268j786j132O7L22l50o10k13
$$ y = [178942, 176897, 175191, 173160, 171163, 170485, 171803, 174641, 178378, 182721, 187118, 190902, 194303, 198277, 202981, 207405, 210845, 213646, 216062, 217399, 216963, 215034, 212290, 208973, 205238, 201654, 198673, 196035, 193240, 190349, 187972, 186698, 186718, 187683, 188933, 190286, 192518, 196494, 201912, 207581, 212844, 217998, 223366, 228893, 234652, 240702, 246291, 250221, 252403, 254112, 256252, 258287, 259354, 259595, 259742, 260055, 260290, 260232, 259740, 258671, 257179, 255680, 254253, 252468, 250037, 247161, 244032, 240551, 236732, 232841, 228907, 224568, 219607, 214134, 208136, 201443, 194308, 187421, 181175, 175411, 169976, 164921, 160120, 155377, 150967, 147322, 144101, 140421, 136181, 132281, 129289, 126778, 124301, 122093, 120374, 118800, 117073, 115407, 113928, 112281, 110291, 108347, 106792, 105488, 104319, 103448, 102793, 101969, 100998, 100279, 99640, 98372, 96586, 95454, 95521, 95843, 95493, 94883, 94670]
55601I4670l05j181j578q02J04M2o34j115j439j891k081j506m76K50L75M6o17
55584H1862j461k078k064j352k27Q34J346J198P83M78K24k6J28R21J694J568O66
55567H4494m7p7J94K69L6m79j185j753j887j657j191l44P84J500J361R47J081
55550H2046J665K069K269K665L219L602L869M110L920L156K681L284M273M402
55536A27230L722L206K977K302J139J30p22j915l024l070k268j907k298k521k380
55521A20601k862m196n139m945m493m666m963m664m126l934l762l128k411k208
55507F5104k326k278k133k144k086j620r28m39l07n03r31j240j072o97o91r45
55491D4764q14l56l11o56l97P56J702J574R60O95M93k90j383k025k089j917j631
$$ y = [94670, 94365, 93184, 91606, 90804, 90908, 90950, 90316, 89201, 87762, 85871, 83790, 82284, 81808, 82058, 82433, 82479, 81862, 80401, 78323, 76259, 74907, 74680, 75514, 76860, 78058, 78841, 79319, 79543, 79517, 79645, 80566, 82260, 83828, 84494, 84447, 84370, 84564, 84833, 84869, 84390, 83205, 81452, 79565, 77908, 76717, 76373, 77157, 78657, 80018, 80965, 82046, 83711, 85780, 88049, 90714, 93933, 97535, 101404, 105514, 109434, 112590, 115271, 118555, 122828, 127230, 130952, 134158, 137135, 139437, 140576, 140706, 139984, 138069, 135045, 131975, 129707, 127800, 125502, 122981, 120601, 117739, 113543, 108404, 103459, 98966, 94300, 89337, 84673, 80547, 76613, 72851, 69723, 67312, 65104, 62778, 60500, 58367, 56223, 54137, 52517, 51589, 51150, 50843, 50340, 49409, 48169, 47097, 46400, 45709, 44764, 43950, 43594, 43283, 42627, 42230, 42986, 44688, 46262, 47222, 47917, 48410, 48120, 46737, 44712, 42623, 40706, 39075]
55474C9075j316j324j655j601p24L62Q36P65O53M91O1l47k89M6J80J20J45J67
55456C5645j01n68q84q85n10L30J288J519P04k88m16K12O84N87L08J95J87K42
55438C8249N31J033J349J015k2j236j819j420n46N0L14P53J371J541J108P90J106
55421D4167J536J305M55l46o19l10L89J084J424J593K048K585K295Q58q12j663
55405E5989j645j358j166j190j533j918j723r53o07j375k545k925k343j526q99
55390C2283l31K05M97N04L19j05o86r22m16M89J070J038N96mn61q77r71j067j066
55371B9995n60L63R02O45K77N57J161J282Q49L89K1n26j128j298r21l52P5J74
55353C1905j78p20q31l45l9n79j474j764j381r71p26l15K32M76L99L86M44K29
$$ y = [39075, 37759, 36435, 34780, 33179, 32455, 32817, 33653, 34418, 35071, 35562, 35623, 35276, 34987, 35033, 35213, 35333, 35478, 35645, 35544, 34976, 34092, 33207, 32697, 33027, 34315, 35834, 36538, 36250, 35834, 36046, 36730, 37317, 37625, 37820, 38007, 38249, 38780, 39813, 41162, 42177, 42155, 40919, 39100, 37680, 37134, 37184, 37498, 38251, 39622, 41163, 42271, 43061, 44167, 45703, 47008, 47463, 47117, 46498, 46188, 46577, 47661, 49085, 50678, 52726, 55311, 57606, 58464, 57652, 55989, 54344, 52986, 51820, 50630, 49097, 47179, 45456, 44503, 43896, 42521, 39976, 37051, 34708, 33182, 32283, 31952, 32157, 32654, 33158, 33477, 33372, 32686, 31764, 31348, 31837, 32907, 33945, 34541, 34537, 33976, 33099, 32128, 31061, 29995, 29435, 29798, 30700, 31345, 31622, 32179, 33340, 34622, 35471, 35860, 35881, 35355, 34227, 32929, 32008, 31656, 31731, 31905, 31727, 31007, 30176, 29831, 29792, 29213, 27739, 25975, 24594, 23623, 22897, 22582, 22814, 23290, 23689, 24075, 24519, 24748]
55335B4748j63k26J09M14N94R66J403J227K46q01j190j020p36l67L07J109J471
55318B8091J054J44o28r25r82j131j140m91O42J291R36K30k8k2k97n99k59N34
55300B6420R67Q96R11J033N86m19q68j50P81O85k63q69o45k02j12j60M1K81K2
55281B8935q03j615j797j281m88Q2J62j98n92n01J74Q64R45N05J03o6k29l02J23
55262B4021R48J411J124O10L64J34l50o42k80L11M14O6k23l42m50l76Q1N60P02
55243B8083Q74J465J919J474N69K71N10K04p77j216m80M45M89Mo3L25N09L10J27
55224C5042J46J29j05m84q44j027r28p18p82j244j699j595p62M16J202J023N8
55207B7828p09n13K84Q19J035J526K201K113R25m38j134j486k011k230j394L8
$$ y = [24748, 24585, 24359, 24468, 24882, 25476, 26442, 27845, 29072, 29318, 28517, 27327, 26307, 25571, 25204, 25511, 26620, 28091, 29145, 29289, 28661, 27736, 26754, 25623, 24483, 23992, 24634, 25925, 26861, 27091, 27063, 27041, 26744, 26145, 25886, 26420, 27387, 28283, 29194, 30227, 30813, 30394, 29526, 29376, 30157, 30842, 30579, 29710, 29065, 28863, 28751, 28591, 28632, 28913, 28935, 28132, 26517, 24720, 23439, 22951, 23033, 23195, 22997, 22405, 21904, 22078, 22942, 23887, 24392, 24495, 24429, 24200, 23898, 24021, 24969, 26380, 27504, 28114, 28478, 28612, 28262, 27620, 27340, 27651, 28065, 28131, 27908, 27566, 27116, 26740, 26821, 27381, 28083, 28957, 30422, 32341, 33815, 34384, 34655, 35165, 35369, 34592, 33376, 32896, 33341, 33830, 33834, 33771, 34096, 34605, 34915, 35042, 35188, 35317, 35212, 34728, 33884, 32857, 31929, 31211, 30429, 29185, 27486, 25891, 25129, 25545, 26747, 27770, 27828, 27119, 26606, 26890, 27709, 28744, 30270, 32471, 34584, 35509, 35071, 33937, 32451, 30440, 28210, 26816, 26854]
55191B6854P74M08k25m12l96o02q03n86j14J47K17N35J125J344P19l12q16m27
55173B7430K99N76J20p50j430j360m54O32J037P19N32R66J345Q25k51p92n00j14
55155B8830k10n35o72o35n36l42k29n42j065r97mJ162J621J454J329J419J352
55138C1400J085J149J862K790L186K850K279K006J951J546N21p08j534j806j744
55123D6833j484j088q28q92r64n94M5L59K74L46P83J030O08k11q70j105p71L15
55105D1786J813K679K144O65o00r90o33R6Q13J045N90l7n8O37J380J549J185P44
55087E4808O13Q99J354J474R05j34j050j497j593j529j273p71j74L06O21P82P15
55070E4456L81l4k70l28m46o45n94o4N65O54J25m12m61j86M1K27N45P49M46j54
$$ y = [26854, 27628, 28036, 27811, 27399, 27003, 26401, 25598, 25012, 24898, 25045, 25262, 25797, 26922, 28266, 28985, 28673, 27857, 27430, 27729, 28305, 28425, 27675, 26245, 24885, 24431, 25063, 26100, 26819, 27351, 28317, 29662, 30487, 30236, 29444, 28944, 28830, 28620, 28085, 27413, 26778, 26242, 25900, 25671, 25129, 24064, 23067, 23063, 24225, 25846, 27300, 28629, 30048, 31400, 32485, 33634, 35496, 38286, 41472, 44322, 46601, 48607, 50558, 52104, 52625, 51917, 50383, 48577, 46833, 45349, 44261, 43433, 42541, 41577, 40983, 41028, 41387, 41661, 42007, 42790, 43820, 44428, 44217, 43347, 42242, 41471, 41786, 43599, 46278, 48422, 49087, 48487, 47497, 46864, 46960, 47773, 48818, 49408, 49371, 49313, 49950, 51330, 52879, 54064, 54808, 55421, 56320, 57674, 59148, 60053, 59919, 58869, 57372, 55779, 54250, 52977, 52206, 52032, 52338, 52959, 53741, 54456, 54837, 54803, 54533, 54205, 53759, 53114, 52520, 52456, 53021, 53675, 53800, 53388, 52927, 52741, 52782, 53009, 53554, 54303, 54749, 54595]
55050E4595l10K43Q45P45P3l96k53J14J19k53m12J14J081J762J777J459J276J181
55032F3760P96O4o08q32n70l4M44N02j2q39j552j937j999j790j500j492j830j950
55014D8621j317k44M40M48J27l17r80j587j526p62l5J97L08N87O17J33j75M08
54996D4943J402J637R22K99N93J414J822J510J002R23J348J827J951J862K066
54981F5521K743L438L611L239K752K574K940L914N330O797Q081R411J1181J3446
54967A44978J5845J7906J9250J9723J9483J8789J7416J4585R838L877j919o731
54955B93040j0675j3994j6467j7853j8393j8417j7679j5670j2619r661p799o932
54943A26881o303n568m972m536l813k634j597j245j185o07N53J596K140K566L320
$$ y = [54595, 54285, 54528, 55373, 56118, 56191, 55795, 55542, 55656, 55775, 55522, 55110, 55224, 56305, 58067, 59844, 61303, 62579, 63760, 64556, 64620, 64012, 63180, 62610, 62576, 63020, 63522, 63510, 62671, 61119, 59182, 57183, 55393, 53893, 52401, 50571, 48621, 47304, 47060, 47500, 47948, 48075, 47758, 46778, 45191, 43665, 42903, 42868, 43065, 43373, 43960, 44577, 44710, 44535, 44943, 46345, 47982, 48904, 49203, 49796, 51210, 53032, 54542, 55544, 56467, 57815, 59642, 61593, 63455, 65521, 68264, 71702, 75313, 78552, 81304, 83878, 86818, 90732, 96062, 102859, 110940, 120351, 131532, 144978, 160823, 178729, 197979, 217702, 237185, 255974, 273390, 287975, 297813, 301690, 299771, 293040, 282365, 268371, 251904, 234051, 215658, 197241, 179562, 163892, 151273, 141612, 133813, 126881, 120578, 115010, 110038, 105502, 101689, 99055, 97458, 96213, 95028, 94421, 94974, 96570, 98710, 101276, 104596]
54928A04596M410N791P675J0062J2382J4023J5042J6000J7097J7702J6767J3756
54916B55303R227M376p2m343q760j2803j5527j6670j6742j6191j5141j3876j2739
54903A36042j1484r581p386o047n843n601m296k494j429j352j594j749j953k184
54889G3049k184j902j412o34L43Q41K58j028k005k203j990j775j539j129n69n
54873E6116K15l14j456k284j991q95k9J10k13o56j080j166o59O9L27O9j31j22
54855D5910l93j062j418q60K35J017J034L98m85j048r00l39j81o95j117o04P13
54838D0205J948K447K221J677J238J128J228J226J035Q77R11J084J423K043K755
54823F3446L047K810K649L147M183N335O550P972R410J0580J1703J3362J5695
$$ y = [104596, 109006, 114797, 122472, 132534, 144916, 158939, 173981, 189981, 207078, 224780, 241547, 255303, 264530, 268906, 268834, 264491, 255731, 242928, 227401, 210731, 193989, 177798, 162657, 148781, 136042, 124558, 114977, 107591, 101544, 95701, 90100, 85804, 83310, 81881, 80529, 78935, 77186, 75233, 73049, 70865, 68963, 67551, 66917, 67260, 68101, 68359, 67331, 65326, 63123, 61133, 59358, 57819, 56690, 56121, 56116, 56331, 56017, 54561, 52277, 50286, 49391, 49362, 49472, 49259, 48603, 47523, 46357, 45698, 45767, 46094, 46163, 46032, 45910, 45517, 44455, 43037, 42177, 42412, 43429, 44463, 44861, 44376, 43328, 42428, 42089, 41908, 41213, 40096, 39492, 40205, 42153, 44600, 46821, 48498, 49736, 50864, 52092, 53318, 54353, 55230, 56141, 57225, 58648, 60691, 63446, 66493, 69303, 71952, 75099, 79282, 84617, 91167, 99139, 108549, 119129, 130832, 144194, 159889]
54810A59889J8133J9836K0143J8750J5890J2194Q082L387j969p178j0999j3046
54798B43112j3965j4377j4251j3489j2361j1083r572q016p094p049p055o141m432
54785A14227k866j955j506j321j306j011J07J793L108L712M321N572P115Q282
54771A38272R043R819J0754J1771J2963J4383J5614J6057J5436J3660J0526O092
54759B84390J103l500p285j0152j1818j2162j1769j1379j0918r880q537p854q166
54746A72073q770r051r169r367r343q733p674o477n254m176l577l497l526l353
54732H0106l025k578j954j425j376j506j053r7K36o10j643j655q18j99l09q10
54716F1284j172r25J73J516J831P47m34m58J39J07l49jJ133J629R31K01M14R33
$$ y = [159889, 178022, 197858, 218001, 236751, 252641, 264835, 272917, 276304, 274335, 267157, 256158, 243112, 229147, 214770, 200519, 187030, 174669, 163586, 154014, 145998, 138904, 131855, 124800, 118659, 114227, 111361, 109406, 107900, 106579, 105273, 104262, 104369, 106162, 109270, 112982, 117303, 122875, 129990, 138272, 147315, 157134, 167888, 179659, 192622, 207005, 222619, 238676, 254112, 267772, 278298, 284390, 285493, 281993, 274708, 264556, 252738, 240576, 228807, 217428, 206510, 196630, 188093, 180239, 172073, 163303, 154252, 145083, 135716, 126373, 117640, 109966, 103489, 98235, 94059, 90482, 86985, 83459, 80106, 77081, 74503, 72549, 71124, 69748, 68242, 67189, 67092, 67328, 66718, 65075, 63420, 62602, 62403, 62094, 61284, 60112, 59187, 59360, 60876, 62707, 63454, 63020, 62562, 62701, 62808, 62459, 62458, 63591, 65220, 66151, 66352, 66766, 67699]
54698F7699P28m8n67o21n30l08K34Q10Q28K54l05l22J27O23Q42P39L96r4n27m97
54678F9461K56J314J819J523J169J424J988K318K732L772M896M921L769K615K069
54663A06046J430J29j099j264n04L18P72R84J093J297J930K921L557L440L214
54648A24264L677M635N376N875O602P350P305O270M923L636J901o63l484n688
54634A71979p123q123q654q335p284o341o208o626o648n652l962k462j715j555
54620I1291j447j090n75p9L28N61M66J0m95n62k9P33J154R61L09n13j263j764
54602H7996j944j965k091k298k216j627q57m85p58j494k345k952k964k257j204
54587F0539m58l87p96j178j157p48l14j73k06m8L26M78J39l90p38r74j267j341
$$ y = [67699, 68427, 68379, 67812, 67191, 66661, 66353, 66587, 67397, 68225, 68479, 68174, 67852, 67979, 68602, 69444, 70183, 70579, 70485, 69958, 69461, 69717, 71031, 72850, 74373, 75542, 76966, 78954, 81272, 84004, 87776, 92672, 97593, 101362, 103977, 106046, 107476, 107605, 106506, 105242, 104738, 105056, 105828, 106812, 107905, 109202, 111132, 114053, 117610, 121050, 124264, 127941, 132576, 137952, 143827, 150429, 157779, 165084, 171354, 176277, 179913, 181814, 181151, 177667, 171979, 164856, 156733, 148079, 139744, 132460, 126119, 119911, 113285, 106637, 100985, 97023, 94561, 92846, 91291, 89844, 88754, 88179, 88100, 88428, 88989, 89455, 89465, 88970, 88408, 88379, 89112, 90266, 91227, 91536, 91023, 89760, 87996, 86052, 84087, 81996, 79698, 77482, 75855, 74998, 74513, 73755, 72261, 69916, 66964, 64000, 61743, 60539, 60081, 59694, 58898, 57720, 56563, 55815, 55501, 55328, 55122, 55074, 55400, 55878, 56017, 55627, 54889, 53915, 52648, 51307]
54569E1307q61j13K63J49j5J5Q2J48M99J225J979K373K209J427K06p91r03l03
54551E8896J02j73o39n83M1P52J225J545K003K760L564L885L594L330L732M453
54535H8487M596M048L591L569L322K329J065J98m19j303k343l013l243l404l569
54520I3911l421k900k440k435k757k910k558j868j303j060q25l31J21Q3k36k00
54504F8871K56N52M40L51N32O43M93M79P73P97Q5r25j455j314p68n0M81L07m80
54485G0068r39n09J23Q4l10j68M65P73N14J43k80j125k124k345j499l81K99O37
54467F3426Q52O72Rn42l83K11N48M89M92P96J009O55j50p55p69o09r70j751j984
54448F1246j096K32R06P13K36j75n99r29q40m32j58n9K29O38O29J67kN47J179
$$ y = [51307, 50446, 50333, 50596, 50745, 50730, 50745, 50827, 50975, 51474, 52699, 54678, 57051, 59260, 60687, 60893, 60102, 59199, 58896, 58998, 58825, 58186, 57603, 57644, 58396, 59621, 61166, 63169, 65929, 69493, 73378, 76972, 80302, 84034, 88487, 93083, 97131, 100722, 104291, 107613, 109942, 111007, 111205, 110786, 109483, 107140, 104127, 100884, 97480, 93911, 90490, 87590, 85150, 82715, 79958, 77048, 74490, 72622, 71319, 70259, 69434, 69103, 69224, 69307, 69071, 68871, 69127, 69679, 70119, 70470, 71002, 71645, 72138, 72617, 73390, 74187, 74272, 73347, 71892, 70578, 69810, 69760, 70241, 70548, 70068, 69129, 68620, 68743, 68827, 68517, 68349, 68814, 69587, 70101, 70244, 69964, 68839, 66715, 64370, 62871, 62490, 62789, 63426, 64278, 64950, 64959, 64417, 64034, 64245, 64793, 65282, 65774, 66570, 67579, 68234, 68084, 67329, 66560, 65951, 64981, 63230, 61246, 60150, 60382, 61288, 62001, 62237, 62062, 61463, 60534, 59694, 59262, 59104, 59045, 59274, 59912, 60541, 60708, 60706, 61253, 62432]
54429F2432J043J89n98p34k15N99J203J264R89R87J400J604J023K2m86j67M36
54412G0991O96O00N65Q34J240J519J664J874K178K367K359K359K500K542K234
54397I6522J686J105M28k72l47O46J929J979L07j953l396l634l057k105j249j023
54381H7566j480j973j953j602j312r94m43L9L1k89m33m38p40j342j732j642j302
54364F9961r15l63M23J210J708J787J442Q76N66Q47J380J439Q69K97L22Q66J462
54347H4177J883K176K353K354K145J732J209Q30P84Q07L68n62j355j565j514j654
54331I4168j727j226m75m32j322k211k277j893j942k501k874k709k367k177j985
54316F6050j601j199r71q01o06o53j164j776j867j341p19m48m49l75j26J33K60
$$ y = [62432, 63475, 63664, 63066, 62332, 62117, 62716, 63919, 65183, 66172, 67159, 68559, 70163, 71186, 71208, 70722, 70555, 70991, 71687, 72287, 72852, 73686, 74926, 76445, 78109, 79983, 82161, 84528, 86887, 89246, 91746, 94288, 96522, 98208, 99313, 99741, 99469, 99122, 99768, 101697, 103676, 103983, 102030, 98634, 95000, 91943, 89838, 88589, 87566, 86086, 84113, 82160, 80558, 79246, 78252, 77809, 77848, 77879, 77590, 77157, 76719, 75979, 74637, 72905, 71263, 69961, 69046, 68683, 69106, 70316, 72024, 73811, 75253, 76129, 76695, 77542, 78922, 80361, 81230, 81527, 81849, 82715, 84177, 86060, 88236, 90589, 92943, 95088, 96820, 98029, 98859, 99643, 100450, 100818, 100256, 98901, 97336, 95822, 94168, 92441, 91215, 90740, 90308, 88986, 86775, 84498, 82605, 80663, 78162, 75288, 72579, 70212, 68035, 66050, 64449, 63250, 62279, 61478, 60872, 60219, 59055, 57279, 55412, 54071, 53352, 52904, 52455, 52080, 51954, 52087, 52347]
54299E2347K80K56J03l46j021j481j279n12K10M72M87O47R21R29N40j0n33j041
54281E0969j454j471r23r0M59L71j63n20k10N72J093R23M40K58L47J80l33o06
54263D9842j91N54R58Q34N24L43L23M33O48Q37Q05N52L28L41N10N77M50K67R4
54244E9029k61r76j757j997j490p14k44q2Q5K74K18o4j85O5M42O76P77P99O40
54225E5235K96K7K2J19J01N8J27J07k74p90q38k27M59N87K45P8M00Q11P89L55
54205E7687q1l00l75k82J47P45R23L40n95j178j129o18J34Q80J231R88N92O42
54187E9751R89Q51o8j044j218o30p5j28o54j070r05j80O48J092J074Q15M75J08
54169E9831j00P6M87O67M05j8k79l41k59jL57N73N71N16M29Q5m88q31o83m24m71
$$ y = [52347, 52627, 52883, 52986, 52640, 51619, 50138, 48859, 48347, 48557, 49029, 49516, 50163, 51084, 52013, 52553, 52543, 52010, 50969, 49515, 48044, 47121, 47031, 47490, 47861, 47698, 47178, 46968, 47540, 48633, 49556, 49996, 50254, 50601, 50781, 50448, 49842, 49651, 50205, 51163, 51997, 52521, 52864, 53187, 53620, 54268, 55105, 55910, 56462, 56790, 57131, 57641, 58218, 58668, 58935, 59029, 58768, 57792, 56035, 54038, 52548, 51834, 51590, 51508, 51593, 51867, 52085, 52021, 51836, 51901, 52343, 53019, 53796, 54595, 55235, 55531, 55558, 55580, 55699, 55800, 55858, 55985, 56092, 55818, 55028, 54190, 53963, 54422, 55009, 55254, 55332, 55732, 56543, 57332, 57687, 57606, 57306, 56931, 56649, 56796, 57541, 58464, 58804, 58209, 57031, 55902, 55284, 55418, 56298, 57529, 58517, 59109, 59751, 60740, 61591, 61523, 60479, 59261, 58631, 58556, 58428, 57774, 56704, 55799, 55619, 56267, 57359, 58433, 59248, 59723, 59831, 59731, 59807, 60294, 60961, 61366, 61348, 61069, 60728, 60469, 60468, 60825, 61398, 61969, 62485, 62914, 62999, 62511, 61680, 60997, 60573, 60102]
54148F0102o11l72J11K27j96n81l80K12M85N9p10j139j003p28o65m84K97J321
54130E5945J565P09l24o18l97m16p14p86n71m71n19l66j18l13q98j056l69N17
54112E0800P94M84J00j98n07o38l01K99O14M69J94L5r3k70l91m66o98j082j255
54093D7890r35l20J68L69L79K36l6k35j55P1J84K58N97J121J356J182J100J356
54075E4586J339M34q71j492j164n78j60M34J307J739J179J20n70p35o86l49N13
54058E5046J551K094K093K072K140J814R77K49J54M93Q32J059J197J130R52J101
54042G4954J764K459K659K508K520K823L178L590M293N189N743N623N080M627
54028A27010M516M618M604M198L445K759K558K795K947K549J632P26L81O51R90
$$ y = [60102, 59491, 59119, 59230, 59457, 59261, 58680, 58300, 58512, 58997, 59056, 58346, 57207, 56204, 55476, 54811, 54327, 54624, 55945, 57510, 58219, 57895, 57277, 56880, 56464, 55750, 54964, 54393, 53922, 53403, 53037, 52919, 52606, 51708, 50652, 50283, 50800, 51594, 52078, 52178, 51980, 51473, 50835, 50534, 50833, 51447, 51916, 52110, 52145, 52052, 51782, 51391, 50925, 50227, 49145, 47890, 46955, 46635, 46803, 47172, 47551, 47787, 47751, 47516, 47361, 47432, 47616, 47874, 48471, 49592, 50948, 52130, 53230, 54586, 55925, 56359, 55488, 53996, 52832, 52254, 52094, 52528, 53835, 55574, 56753, 56873, 56303, 55568, 54882, 54533, 55046, 56597, 58691, 60784, 62856, 64996, 66810, 67787, 68036, 68190, 68683, 69515, 70574, 71771, 72901, 73853, 74954, 76718, 79177, 81836, 84344, 86864, 89687, 92865, 96455, 100748, 105937, 111680, 117303, 122383, 127010, 131526, 136144, 140748, 144946, 148391, 151150, 153708, 156503, 159450, 161999, 163631, 164357, 164738, 165389, 166379]
54013A66379P24k46j410k297k893l315l413l074k575k254k042j820j984k932m087
53998A32761m281l307k337k326k783k709k112j770j850j720j136o79q25j186j100
53983A02640m01N65J386J725J435Q00L57K75K08j7k5M97J198J496J361J189J111
53966A15800R26O09L47J04l89j139j753j890j564r44j81M98Q36Q14O45M57K30
53949A13406J00L95J203K178K960L562M178M846N524O214O804O974O511N598M548
53934A75001L401K031N66o49j467k078k573k767k521k040j510o86P89K626L900
53919A72023M024L422K921K738K543K348K687L708M720N099N176N648O352O358
53905B29767N228L590K313J596J096N00l00j252k067k313j944j552j799k700l676
$$ y = [166379, 167103, 166857, 165447, 163150, 160257, 156942, 153529, 150455, 147880, 145626, 143584, 141764, 139780, 136848, 132761, 128480, 125173, 122836, 120510, 117727, 115018, 112906, 111136, 109286, 107566, 106430, 105751, 104926, 103740, 102640, 102239, 102804, 104190, 105915, 107350, 108150, 108507, 108782, 108990, 108973, 108948, 109445, 110643, 112139, 113500, 114689, 115800, 116726, 117335, 117682, 117786, 117397, 116258, 114505, 112615, 111051, 110107, 109926, 110424, 111260, 112074, 112719, 113176, 113406, 113506, 113901, 115104, 117282, 120242, 123804, 127982, 132828, 138352, 144566, 151370, 158344, 164855, 170453, 175001, 178402, 180433, 180999, 180350, 178883, 176805, 174232, 171465, 168944, 166904, 165394, 164708, 165497, 168123, 172023, 176047, 179469, 182390, 185128, 187671, 190019, 192706, 196414, 201134, 206233, 211409, 217057, 223409, 229767, 234995, 238585, 240898, 242494, 243590, 244090, 243790, 242538, 240471, 238158, 236214, 234662, 232863, 230163, 226487]
53890B26487m291m632m994n426n737n841n934o213o533o445n768m858m223l956
53876A51636l794l609l485l387l147k847k883l434m032l933k863j358l78n40j543
53861A10403k414k468j948j523j404j327j246j410j762j865j615j472j685j796
53847H6468j310m77Mj41n73p84m80K68R70J054N13j8n3J68K18J44J98K40J4k54
53827H6169r5M24P08M90J35Oj4j77l95l52Q7P75J479K029K344K346J931J136L21
53808I9347j0L13R76J625K206K804L355L782M110M255M012L518L427M165N227
53793A43112N619M978L839K872K232J646Q28j54p65m07P57J612J201j76j349j682
53777A64163j564j603j926k362k795l067k898k199j269n91n37j195k192k804k608
$$ y = [226487, 222196, 217564, 212570, 207144, 201407, 195566, 189632, 183419, 176886, 170441, 164673, 159815, 155592, 151636, 147842, 144233, 140748, 137361, 134214, 131367, 128484, 125050, 121018, 117085, 114222, 112864, 112486, 111946, 110403, 107989, 105521, 103573, 102050, 100646, 99319, 98073, 96663, 94901, 93036, 91421, 89949, 88264, 86468, 85158, 84681, 84685, 84544, 83971, 83187, 82707, 82975, 83945, 84999, 85512, 85494, 85441, 85609, 85827, 85971, 86169, 86409, 86423, 86169, 86074, 86498, 87206, 87696, 87831, 87837, 87823, 87646, 87251, 86899, 86986, 87761, 89240, 91269, 93613, 95959, 97890, 99026, 99347, 99337, 99650, 100626, 102251, 104457, 107261, 110616, 114398, 118508, 122763, 126775, 130293, 133720, 137885, 143112, 148731, 153709, 157548, 160420, 162652, 164298, 165126, 164972, 164207, 163800, 164557, 166169, 167370, 167194, 165845, 164163, 162599, 160996, 159070, 156708, 153913, 150846, 147948, 145749, 144480, 143889, 143352, 142157, 139965, 137161, 134553]
53762A34553k016j772j962k005j631j275j325j480j220n45J13M07K67j82o02n77
53746A18748j01K23j90j259k358l006l097k674j843r17l57l43o28q80j077j395
53730I8846j763j823j451j095j277j801j796p87O73J666J927J829J632J312J025
53715I7117J145J715K219K222J800J161K46r77k113k553k077r17O49K429M103
53700A06169N162N328M889M446M252L985L258K226J508J463J815K043J937J590
53686A50071J115O74N76R88J580J760J329O60K39K18M92R28J378J616J463J000
53670A66087O14O73J099J337J006M51L36P19R22N13j33m72n05m48j92L55P94P02
53652A73858L39K58M17L13j42n18o09o62q13q87p51l96K55J092J497R78J4m23
$$ y = [134553, 132537, 130765, 128803, 126798, 125167, 123892, 122567, 121087, 119867, 119322, 119435, 119842, 120109, 119927, 119325, 118748, 118647, 118870, 118680, 117421, 115063, 112057, 108960, 106286, 104443, 103526, 103169, 102826, 102198, 101318, 100241, 98846, 97083, 95260, 93809, 92714, 91437, 89636, 87840, 87053, 87726, 89392, 91319, 93148, 94780, 96092, 97117, 98262, 99977, 102196, 104418, 106218, 107379, 107625, 106648, 104535, 101982, 99905, 98988, 99637, 102066, 106169, 111331, 116659, 121548, 125994, 130246, 134231, 137489, 139715, 141223, 142686, 144501, 146544, 148481, 150071, 151186, 151860, 152436, 153424, 155004, 156764, 158093, 158753, 158992, 159210, 159702, 160630, 162008, 163624, 165087, 166087, 166701, 167374, 168473, 169810, 170816, 171267, 171603, 172322, 173244, 173757, 173624, 173152, 172647, 172199, 172007, 172362, 173156, 173858, 174197, 174455, 174872, 175185, 175043, 174525, 173916, 173254, 172441, 171554, 170803, 170407, 170662, 171754, 173251, 174229, 174243, 173820]
53634A73820j62O0j74n44q73j461k166k100q24Q70J890K075J962J835J565J055
53618A76828L52m01q42n96J49P62J077J594K446K947K613J994J817J975K068K303
53602A97086L010L758L971L981M463N046M707L525K829L241L737L255K359K405
53588B47373L575M721M987M748M708M769M338L358K478K183K240K200K028J933
53574B95639J926J935K163K785L446L545L020K397K031J882J990K496L044K886
53560C31185J907Q60K94j17p48j149p21L07J121J267Q12j4q76j339j364j456j866
53543C28103k130j940j885k586l499l499k443j260o30m08l35m64p44q58o69l17
53527C04436J66Q58J442J349N27k89k66P81K379L825M687N102N506N959O134O082
$$ y = [173820, 173658, 173718, 173544, 173000, 172127, 170666, 168500, 166400, 165576, 166446, 168336, 170411, 172373, 174208, 175773, 176828, 177180, 176779, 175937, 175341, 175490, 176252, 177329, 178923, 181369, 184316, 186929, 188923, 190740, 192715, 194783, 197086, 200096, 203854, 207825, 211806, 216269, 221315, 226022, 229547, 232376, 235617, 239354, 242609, 244968, 247373, 250948, 255669, 260656, 265404, 270112, 274881, 279219, 282577, 285055, 287238, 289478, 291678, 293706, 295639, 297565, 299500, 301663, 304448, 307894, 311439, 314459, 316856, 318887, 320769, 322759, 325255, 328299, 331185, 333092, 333952, 334246, 334129, 333381, 332232, 331511, 331818, 332939, 334206, 335018, 335004, 334128, 332789, 331425, 329969, 328103, 325973, 324033, 322148, 319562, 316063, 312564, 310121, 308861, 308231, 307823, 307488, 307024, 306280, 305422, 304753, 304436, 304602, 305460, 306902, 308251, 308778, 308489, 308223, 309004, 311383, 315208, 319895, 324997, 330503, 336462, 342596, 348678]
53511C48678O378P060P265O689O592Q168J0409J1140J0039R131J0010J1995J3563
53498D67117J4389J5147J6176J7299J8341J9169J9564J9600J9820K0610K1752
53487F68984K2853K3777K4355K4254K3496K2670K2270K2304K2734K3719K5070
53476I26486K6124K6591K6838K7027K6653K5500K4329K3828K3554K2767K1754
53465A201451K1349K1448K1056J9791J8358J7430J6804J5931J4648J3155J1715
53454A393136J0561R819R311Q617P401N526L005O8k808n255p246q843r942j0584
53440A402766j1290j2604j4382j5970j6991j7619j8195j8920j9829k0674k1052
53429A215240k0986k1185k2179k3387k3689k2810k1577k0691j9982j9062j8031
$$ y = [348678, 355056, 362116, 369381, 376070, 382662, 390830, 401239, 412379, 422418, 431549, 441559, 453554, 467117, 481506, 496653, 512829, 530128, 548469, 567638, 587202, 606802, 626622, 647232, 668984, 691837, 715614, 739969, 764223, 787719, 810389, 832659, 854963, 877697, 901416, 926486, 952610, 979201, 1006039, 1033066, 1059719, 1085219, 1109548, 1133376, 1156930, 1179697, 1201451, 1222800, 1244248, 1265304, 1285095, 1303453, 1320883, 1337687, 1353618, 1368266, 1381421, 1393136, 1403697, 1413516, 1422827, 1431444, 1438845, 1444371, 1447376, 1447444, 1444636, 1439381, 1432135, 1423292, 1413350, 1402766, 1391476, 1378872, 1364490, 1348520, 1331529, 1313910, 1295715, 1276795, 1256966, 1236292, 1215240, 1194254, 1173069, 1150890, 1127503, 1103814, 1081004, 1059427, 1038736, 1018754, 999692, 981661]
53418I81661j7162j6312j5113j3540j1954j0744j0080r817r424q265o240m060
53406H48950k583j909j258K43K685N282P141Q160R087J0633J2663J4501J5836
53393I29431J6984J8258J9558K0717K1916K3494K5444K7340K8722K9496L0043
53382A191403L0932L2443L4325L6115L7618L8990M0475M2251M4349M6398M7677
53371A622976M7861M7604M7902M8873M9744N0043N0100N0111M9482M7608M4725
53360B157029M1444L7881L3951L0129K7117K4884K2788K0574J8616J7064J5447
53349B446924J3262J0440P137L518j90l947q311j3899k0339k6422l1523l6072
53337B340578m0329m3521m4930m5114m5139m5182m4732m3851m3134m2610m1788
$$ y = [981661, 964499, 948187, 933074, 919534, 907580, 896836, 886756, 876939, 867515, 859250, 853010, 848950, 846367, 844458, 843200, 843443, 846128, 851410, 858551, 866711, 875798, 886431, 899094, 913595, 929431, 946415, 964673, 984231, 1004948, 1026864, 1050358, 1075802, 1103142, 1131864, 1161360, 1191403, 1222335, 1254778, 1289103, 1325218, 1362836, 1401826, 1442301, 1484552, 1528901, 1575299, 1622976, 1670837, 1718441, 1766343, 1815216, 1864960, 1915003, 1965103, 2015214, 2064696, 2112304, 2157029, 2198473, 2236354, 2270305, 2300434, 2327551, 2352435, 2375223, 2395797, 2414413, 2431477, 2446924, 2460186, 2470626, 2477763, 2481281, 2481091, 2477144, 2468833, 2454934, 2434595, 2408173, 2376650, 2340578, 2300249, 2256728, 2211798, 2166684, 2121545, 2076363, 2031631, 1987780, 1944646, 1902036, 1860248]
53326A860248m0846m0705m1609m2640m3008m2986m3025m2737m1521l9651l7940
53315A403580l6631l5269l3510l1403k9008k6312k3572k1241j9544j8390j7636
53304A111064j7107j6472j5483j4333j3364j2447j0992q735o187m192l188k912
53292I85652k741k293j741j472j434j101j42J174K495L889N503P094Q352R471
53278A012706J0845J2363J3568J4470J5595J7156J8686J9590J9799J9690J9688
53267A194156J9943K0214K0079J9438J8662J7988J7141J5948J4953J4653J4440
53256A387615J3195J1015R258Q656Q225O604L730O56j771l494m906o492q566j0932
53242A412793j3013j4604j6151j7999j9823k1201k2301k3506k4657k5241k5111
$$ y = [1860248, 1819402, 1778697, 1737088, 1694448, 1651440, 1608454, 1565429, 1522692, 1481171, 1441520, 1403580, 1366949, 1331680, 1298170, 1266767, 1237759, 1211447, 1187875, 1166634, 1147090, 1128700, 1111064, 1093957, 1077485, 1062002, 1047669, 1034305, 1021858, 1010866, 1002131, 995944, 991752, 988564, 985652, 982911, 980618, 978877, 977405, 975971, 974870, 974728, 975902, 978397, 982286, 987789, 994883, 1003235, 1012706, 1023551, 1035914, 1049482, 1063952, 1079547, 1096703, 1115389, 1134979, 1154778, 1174468, 1194156, 1214099, 1234313, 1254392, 1273830, 1292492, 1310480, 1327621, 1343569, 1358522, 1373175, 1387615, 1400810, 1411825, 1421083, 1429739, 1437964, 1444568, 1448298, 1448954, 1447183, 1443689, 1438783, 1432291, 1423725, 1412793, 1399780, 1385176, 1369025, 1351026, 1331203, 1310002, 1287701, 1264195, 1239538, 1214297, 1189186]
53231A189186k4547k3726k2647k1422k0279j9377j8900j9124j9971k0713k0615
53220I57865j9787j9029j8844j9075j9258j9003j8056j6475j4732j3291j2085
53209G68230j0779r411q354p715p201o690o448o656p134p676q349r227j0072j0539
53195F51979j0605j0557j0626j0709j0503r876r034q376q174q474r163r938j0310
53182E25634j0015r447r317r759j0182j0208j0183j0526j0982j1096j0929j0740
53170D02250j0325r375q252p652p600p471p015o631o537o453o323o585p350p909
53156B96772p588o639n813n356m865m071l254k936l285l839l876l184k440k494
53142B37132l232l661l209k430k127k199j951j121j60M48O23N47M85P31J325J818
$$ y = [1189186, 1164639, 1140913, 1118266, 1096844, 1076565, 1057188, 1038288, 1019164, 999193, 978480, 957865, 938078, 919049, 900205, 881130, 861872, 842869, 824813, 808338, 793606, 780315, 768230, 757451, 748040, 739686, 731971, 724770, 718080, 711632, 704976, 697842, 690166, 681817, 672590, 662518, 651979, 641374, 630817, 620191, 609482, 598979, 589103, 580069, 571693, 563519, 555045, 545882, 535944, 525634, 515619, 506172, 496855, 487096, 476914, 466706, 456523, 445997, 435015, 423919, 412990, 402250, 391925, 382550, 374298, 366646, 359046, 351575, 344560, 337929, 331392, 324939, 318616, 312031, 304681, 296772, 289184, 282545, 276732, 271376, 266511, 262440, 259186, 256250, 252965, 249126, 245250, 242066, 239626, 237132, 233900, 230239, 227030, 224600, 222473, 220274, 218323, 217202, 217042, 217490, 218113, 218660, 219145, 219876, 221201, 223019]
53126B23019J628P06m80j529k374k921k929k429j966k068k653l165l241k943k500
53111A94155k096j902k041k369k554k475k396k574k811k682k102j447j118j193
53097A64395j530j948k222k153j778j344j001o87m49n59j122j768k041j874j451
53082A42468q24o7L91R2p55j419j513j400j494j595j189k32P07R97N36k40q01
53065A33662r50q16m63K48J240J873J455J02j281j901j708j127n82m19p90j333
53049A27210j344o81j21m18j226j509r18k24k70r58j532j467q52j40K08m0o93
53032A15025j182j067n17j25k17n27o55o37p88j088j077n13J83M31K91L58Q52
53015A08747J253J056M70L9j54m04o71n11P9L54j96r99j082m24M4j84m84j30O05
$$ y = [223019, 224647, 225353, 224873, 223344, 220970, 218049, 215120, 212691, 210725, 208657, 206004, 202839, 199598, 196655, 194155, 192059, 190157, 188116, 185747, 183193, 180718, 178322, 175748, 172937, 170255, 168153, 166706, 165588, 164395, 162865, 160917, 158695, 156542, 154764, 153420, 152419, 151732, 151283, 150724, 149602, 147834, 145793, 143919, 142468, 141644, 141577, 141968, 142060, 141305, 139886, 138373, 136973, 135479, 133884, 132695, 132463, 133170, 134167, 134703, 134463, 133662, 132712, 131896, 131433, 131681, 132921, 134794, 136249, 136351, 135070, 133169, 131461, 130334, 129752, 129333, 128543, 127210, 125866, 125185, 125064, 124646, 123420, 121911, 120993, 120769, 120499, 119541, 118009, 116542, 115690, 115550, 115758, 115718, 115025, 113843, 112776, 112259, 112134, 111917, 111390, 110735, 110098, 109310, 108222, 107145, 106632, 106815, 107246, 107537, 107895, 108747, 110000, 111056, 111526, 111565, 111411, 111007, 110336, 109825, 109904, 110258, 110062, 109063, 107981, 107557, 107601, 107417, 106933, 106803, 107408]
52996A07408R58R25J221K052K644K300J371P90R97J674K331K706K770K639K543
52981A35329K607K666K493K104J672J217O40K3m02n49n98p53j037j343j502j356
52965A41211r40n67n70q57r89p11k73j27m31r35j272j314j207j173j259j332j220
52948A26034p74R0J205J990J869R74J53O2M92Q62J020J198J380J266Q26M18L32
52931A39397N55R85J471J697J416Q43L76o4q48j735j773n32J094J796J332N61
52915A46571K77M91Q81J279J576J499Q84J9m90l09L26Q85J054R34P87P27P27P90
52897A58908R78J239J340J047M20j28r1O15J445J789J701J761K103K053J126o1
52881A76245m61PM66L96K25M86J047J515J778J811J420O54J57N88J798K975L471
$$ y = [107408, 108366, 109291, 110512, 112564, 115208, 117508, 118879, 119669, 120666, 122340, 124671, 127377, 130147, 132786, 135329, 137936, 140602, 143095, 145199, 146871, 148088, 148728, 148751, 148349, 147800, 147202, 146449, 145412, 144069, 142567, 141211, 140271, 139704, 139134, 138277, 137288, 136577, 136304, 136177, 135746, 134811, 133539, 132225, 131018, 129845, 128586, 127254, 126034, 125260, 125350, 126555, 128545, 130414, 131388, 131541, 131603, 132095, 132957, 133977, 135175, 136555, 137821, 138647, 139065, 139397, 139952, 140937, 142408, 144105, 145521, 146364, 146740, 146676, 145828, 144093, 142320, 141788, 142882, 144678, 146010, 146571, 146848, 147339, 148220, 149499, 151075, 152574, 153458, 153477, 152987, 152678, 153004, 153889, 154943, 155877, 156664, 157391, 158118, 158908, 159886, 161125, 162465, 163512, 163932, 163804, 163713, 164328, 165773, 167562, 169263, 171024, 173127, 175180, 176306, 176245, 175784, 175791, 176257, 176653, 176878, 177364, 178411, 179926, 181704, 183515, 184935, 185589, 185746, 186334, 188132, 191107, 194578]
52864A94578L234K620K064J835J858J855J757J760J879J795J427J222J495J769
52850B21148J343L54l62l70j35k44p21j271j806k346k739k791k626k553k642k614
52834A99625k239j687j396j540j810j784j432j150j235j531j666j495j246j240
52820A78174j544j823j574p49r1m66j715k561k040o78J94Mo48j052j121j007o52
52803A60651j22J14k15o27m05L90Q93N06l93j019j096j013j163j486j676j622
52787A51717j536j643j869j903j625j339j443j851k009j578q99n40n86p25q26
52772A31345j043j357j479j352j294j408j303p55k50m62j350k273k778k864k593
52757A08784j961j199p28p34j060j479j840j980j776j308p14l0N26M47m20j302
$$ y = [194578, 197812, 200432, 202496, 204331, 206189, 208044, 209801, 211561, 213440, 215235, 216662, 217884, 219379, 221148, 222491, 222845, 222483, 222113, 221978, 221734, 221013, 219742, 217936, 215590, 212851, 210060, 207434, 204881, 202239, 199625, 197386, 195699, 194303, 192763, 190953, 189169, 187737, 186587, 185352, 183821, 182155, 180660, 179414, 178174, 176630, 174807, 173233, 172484, 172393, 171927, 170212, 167651, 165611, 164933, 165127, 165131, 164483, 163431, 162310, 161303, 160651, 160529, 160643, 160428, 159801, 159396, 159786, 160679, 161185, 160792, 159773, 158677, 157664, 156501, 155015, 153339, 151717, 150181, 148538, 146669, 144766, 143141, 141802, 140359, 138508, 136499, 134921, 134022, 133482, 132896, 132171, 131345, 130302, 128945, 127466, 126114, 124820, 123412, 122109, 121354, 121104, 120642, 119292, 117019, 114241, 111377, 108784, 106823, 105624, 104896, 104162, 103102, 101623, 99783, 97803, 96027, 94719, 94005, 93975, 94501, 94948, 94528, 93226]
52741I3226j278m96O6rj41P9K16j57o52o65l08j87n08r25j050p92l46n9j06j95
52721H5713P4N69Q06P73R27J261J169N59K75Q25J523J568J274J393J784J715J053
52704A03261K41n43j341j789j568j224j618k570l077k779k259j930j538j002p01
52689G9563o89m87L7L58K19J3l7k96q73j199j002r22j434j922j590q20p08j434
52671F6777j994j566m63M30O57M86M62Q50J362J492J133O97N25M93L60J90J21
52654G2012J0l36p45q86p42n26k75J46O80J031J052R20Q90J004J048P24J0o65
52636G5352p33j70L42J30p28j602j981j815j300o77j46K05M48O16O11L92J03o3
52618F8984o4R8M10O65N36L8l48k94o0O3L39J128J991J990R19k89o02L9R17J370
$$ y = [93226, 91948, 91452, 91518, 91509, 91368, 91447, 91663, 91506, 90854, 90189, 89881, 89694, 89186, 88261, 87211, 86419, 86073, 86014, 85908, 85713, 85787, 86356, 87162, 87935, 88862, 90123, 91292, 91851, 92126, 92951, 94474, 96042, 97316, 98709, 100493, 102208, 103261, 103502, 102959, 101618, 99829, 98261, 97037, 95419, 92849, 89772, 86993, 84734, 82804, 81266, 80264, 79563, 78874, 78387, 78424, 78782, 79001, 79014, 78977, 78681, 77808, 76609, 75607, 74685, 73251, 71329, 69739, 68919, 68211, 66777, 64783, 63217, 62754, 63184, 63841, 64327, 64789, 65639, 67001, 68493, 69626, 70323, 70848, 71341, 71701, 71891, 72012, 72022, 71686, 70941, 70055, 69313, 68787, 68512, 68658, 69338, 70369, 71421, 72341, 73231, 74235, 75283, 76007, 76017, 75352, 74619, 74449, 74791, 74921, 74193, 72591, 70610, 68795, 67495, 66818, 66672, 66877, 67325, 67941, 68552, 68944, 69047, 68984, 68920, 69018, 69428, 70093, 70629, 70667, 70319, 70025, 69965, 70028, 70367, 71495, 73486, 75476, 76395, 76106, 75504, 75543, 76460, 77830]
52598G7830J209N74k44r15j239j164o31M16J733K693K758K009J069N37N89R62
52582H8186J217J092P21N45Q59J512K115K413K402K142J735J426J437J675J765
52567A11242J549J332J462J842K073J971J659J219O23Q0L8O24J335J626J540J444
52551A31659J290P25j14m57J04R30J068M46j48j99K5J81M17Q26P91l19j910k441
52533A32874j216O81J718J562Q87R2q15j392j005n6K23m12o69K98J408J200P7
52516A35455l67J54L52m27j176r14j41J51p3k20j89k81m02k50Ll3k15n0M45P45
52496A32567O21L75J95j11n47p08l68J41M33N98R33J383J563J245N10m68j443
52479A36919j929j428p8J185J456P97L3k72k62j69J17O19R05P06M94P86J167P90
$$ y = [77830, 79039, 79613, 79369, 78454, 77215, 76051, 75420, 75836, 77569, 80262, 83020, 85029, 86098, 86635, 87224, 88186, 89403, 90495, 91216, 91761, 92620, 94132, 96247, 98660, 101062, 103204, 104939, 106365, 107802, 109477, 111242, 112791, 114123, 115585, 117427, 119500, 121471, 123130, 124349, 124972, 125052, 125090, 125714, 127049, 128675, 130215, 131659, 132949, 133674, 133560, 133103, 133207, 134137, 135205, 135651, 135503, 135304, 135329, 135510, 135927, 136753, 137544, 137225, 135315, 132874, 131658, 132339, 134057, 135619, 136506, 136598, 135783, 134391, 133386, 133330, 133553, 133141, 132472, 132770, 134178, 135378, 135455, 135088, 135242, 135594, 135167, 133991, 133077, 132936, 133087, 133014, 132794, 132605, 132324, 131922, 131672, 131675, 131642, 131427, 131377, 131822, 132567, 133188, 133563, 133758, 133647, 133100, 132392, 132024, 132165, 132598, 133196, 134129, 135512, 137075, 138320, 138830, 138362, 136919, 134990, 133562, 133484, 134669, 136125, 136922, 136955, 136683, 136421, 136252, 136369, 136988, 137893, 138599, 139093, 139879, 141046, 141836]
52461A41836j82n66J80J150J273O42Jm27q27r67m09N96J173Q96K37j52j27Q1K30
52442A44638J52k39q15j278j410j229r20p70r83j415j599j312q53n68l80j07O6
52425A30978n4j60R8L25j33r49r60J62J218R81j20o02J75J254J328K31r63j092
52407A31717n5J089J243L77n97r67p91k62Q21K433L654L410J899N54M34J138J623
52390A47720J516J234J084R33P31P71J204J692J815J568J209P92K82j1M32J562
52374A64534K593K831K432K084K140K393K545K535K412K220K054J965J751J181
52360A95670N00L76J096K038K318J834J325J422J958K421K659K862K999K698J822
52345B23998P87J51M7K65O80J297J914K137J873J485J362J505J729J966K167K100
$$ y = [141836, 141654, 141088, 141268, 142418, 143691, 144333, 144334, 143907, 143080, 142113, 141704, 142300, 143473, 144369, 144606, 144454, 144327, 144408, 144638, 144790, 144551, 143736, 142458, 141048, 139819, 138899, 138129, 137146, 135731, 134132, 132820, 131967, 131399, 131019, 130912, 130978, 130924, 130764, 130862, 131187, 131054, 130105, 129145, 129307, 130525, 131506, 131386, 130784, 130959, 132213, 133541, 133772, 132809, 131717, 131662, 132751, 133994, 134371, 133774, 132807, 132016, 131754, 132575, 135008, 138662, 142072, 143971, 144525, 144959, 146097, 147720, 149236, 150470, 151554, 152487, 153218, 153989, 155193, 156885, 158700, 160268, 161477, 162269, 162551, 162540, 162972, 164534, 167127, 169958, 172390, 174474, 176614, 179007, 181552, 184087, 186499, 188719, 190773, 192738, 194489, 195670, 196170, 196546, 197642, 199680, 201998, 203832, 205157, 206579, 208537, 210958, 213617, 216479, 219478, 222176, 223998, 224785, 224936, 224983, 225248, 225928, 227225, 229139, 231276, 233149, 234634, 235996, 237501, 239230, 241196, 243363, 245463]
52329B45463J562P91L19L91P14Q84R12J147J740K316K323J671R46Q26J429K313
52313B65747L070L684M302M976N613O056O077N675N404O015P508Q924R389R148
52299C51588R153R870J0905J1697J2079J2131J1955J1766J1881J2413J3124J3687
52287D92249J3917J3729J3107J2258J1558J1220J1068J0815J0433J0196J0381
52276F20931J0977J1689J2134J2042J1351J0240R126Q487Q372Q224P461O242N314
52263G42590M988M731M039L210K859K966K997K732K406K099J562P47M3q4M97J568
52247G79950K548K669J686M33Q5P56J441J495J525K406L943N123N421N302N537
52232H20320O452P856R317J0444J1101J1448J1676J1747J1505J0996J0460J0095
$$ y = [245463, 247025, 247816, 248135, 248526, 249240, 250124, 251036, 252183, 253923, 256239, 258562, 260233, 261179, 262005, 263434, 265747, 268817, 272501, 276803, 281779, 287392, 293448, 299525, 305200, 310604, 316619, 324127, 333051, 342440, 351588, 360741, 370611, 381516, 393213, 405292, 417423, 429378, 441144, 453025, 465438, 478562, 492249, 506166, 519895, 533002, 545260, 556818, 568038, 579106, 589921, 600354, 610550, 620931, 631908, 643597, 655731, 667773, 679124, 689364, 698490, 706977, 715349, 723573, 731034, 737276, 742590, 747578, 752309, 756348, 759558, 762417, 765383, 768380, 771112, 773518, 775617, 777179, 777926, 777969, 777885, 778382, 779950, 782498, 785167, 786853, 787286, 787371, 788127, 789568, 791063, 792588, 794994, 798937, 804060, 809481, 814783, 820320, 826772, 834628, 843945, 854389, 865490, 876938, 888614, 900361, 911866, 922862, 933322, 943417]
52220I43417R921R868R863R817R598R038Q085P024O354O295O387N902M633L095
52206A049297J900J248R65P32K12p04j584j760j142m23k56n83r98j439k059k657
52190A040749k781k400k000j939j988j681r09n9L43Q9n37j069j353j603j949k110
52174A018803j852j549j787k447k688k070j256j180j838k429k591k845l652m561
52160I86058m814m380l902l710l530l164k872k814k687k249j786j713j988k371
52146I44078k925l743m492m810m975n549o450p024p025o891o943o934o600o128
52132H63589n774n532n363n351n390n185m790m695n109n644n936o104o209n856
52118G86651m787l490k684k533k785l306l935m116l326j760j35J060J777K092
$$ y = [943417, 953338, 963206, 973069, 982886, 992484, 1001522, 1009607, 1016631, 1022985, 1029280, 1035667, 1041569, 1046202, 1049297, 1051197, 1052445, 1053410, 1054142, 1054354, 1053650, 1052066, 1050306, 1049164, 1048741, 1048485, 1047902, 1046904, 1045465, 1043406, 1040749, 1037968, 1035568, 1033568, 1031629, 1029641, 1027960, 1027051, 1026992, 1027335, 1027424, 1026887, 1025818, 1024465, 1022862, 1020913, 1018803, 1016951, 1015402, 1013615, 1011168, 1008480, 1006410, 1005154, 1003974, 1002136, 999707, 997116, 994271, 990619, 986058, 981244, 976864, 972962, 969252, 965722, 962558, 959686, 956872, 954185, 951936, 950150, 948437, 946449, 944078, 941153, 937410, 932918, 928108, 923133, 917584, 911134, 904110, 897085, 890194, 883251, 876317, 869717, 863589, 857815, 852283, 846920, 841569, 836179, 830994, 826204, 821509, 816400, 810756, 804820, 798716, 792507, 786651, 781864, 778374, 775690, 773157, 770372, 767066, 763131, 759015, 755689, 753929, 753794, 754854, 756631, 758723]
52104G58723K208K551L337M201M663M841N210N809O355O970Q168J0002J1847J3149
52090H48034J3959J4566J5054J5412J5764J6212J6731J7268J7777J8132J8143
52079A027052J7713J6820J5489J4000J2899J2497J2487J2342J1910J1258J0337
52068A174804R262Q574Q486Q189O740M516K817J973J000o40k085k472k332k738
52054A216094l724m456m525m198l681l014k560k750l343l553l117k680k972l952
52040A167569m922n167m497l334k324j692j102l79om49j217j267l35P43J192J135
52024A143948J020Q29L63l8K05J003J488J053P1o33p25n07l42l81q25j942l555
52007A141032m914n562o088p468r708j1734j2829j3489j4534j5891j6889j7381
$$ y = [758723, 760931, 763482, 766819, 771020, 775683, 780524, 785734, 791543, 797898, 804868, 813036, 823038, 834885, 848034, 861993, 876559, 891613, 907025, 922789, 939001, 955732, 973000, 990777, 1008909, 1027052, 1044765, 1061585, 1077074, 1091074, 1103973, 1116470, 1128957, 1141299, 1153209, 1164467, 1174804, 1184066, 1192640, 1201126, 1209315, 1216055, 1220571, 1223388, 1225361, 1226361, 1225721, 1223636, 1221164, 1218832, 1216094, 1212370, 1207914, 1203389, 1199191, 1195510, 1192496, 1189936, 1187186, 1183843, 1180290, 1177173, 1174493, 1171521, 1167569, 1162647, 1157480, 1152983, 1149649, 1147325, 1145633, 1144531, 1144152, 1144146, 1143697, 1142480, 1141213, 1140878, 1141621, 1142813, 1143948, 1144968, 1145797, 1146160, 1146122, 1146327, 1147330, 1148818, 1149871, 1149942, 1149309, 1148584, 1148077, 1147735, 1147354, 1146529, 1144587, 1141032, 1136118, 1130556, 1124468, 1117000, 1107292, 1095558, 1082729, 1069240, 1054706, 1038815, 1021926, 1004545]
51995A004545j7850j8559j9244j9772k0446k1436k2424k3060k3469k3942k4484
51984G69859k4920k5231k5468k5448k4918k3931k2826k1812k0866j9988j9249
51973E15202j8546j7544j6115j4669j3794j3607j3641j3353j2607j1625j0694
51962C59007j0006r608r228q383o917n359m490m513m943n275n395n232m571l437
51948B71650k309j575j118p87r04j765k879l402l229k962k842k475j817j622k351
51933B39613l260l265k394j669j727k202k474k468k508k784l153l248k716j650
51919B04095p54p87j686k534k571j962j377j113r56p52o59p61p52l14L40N93J18
51902A88168o85j124r59n30j65J68N08N01k46j484k392k368j562n50K19M98J65
$$ y = [1004545, 986695, 968136, 948892, 929120, 908674, 887238, 864814, 841754, 818285, 794343, 769859, 744939, 719708, 694240, 668792, 643874, 619943, 597117, 575305, 554439, 534451, 515202, 496656, 479112, 462997, 448328, 434534, 420927, 407286, 393933, 381326, 369701, 359007, 349001, 339393, 330165, 321782, 314865, 309506, 305016, 300503, 295560, 290285, 284890, 279658, 275087, 271650, 269341, 267766, 266648, 265861, 264957, 263192, 260313, 256911, 253682, 250720, 247878, 245403, 243586, 241964, 239613, 236353, 233088, 230694, 229025, 227298, 225096, 222622, 220154, 217646, 214862, 211709, 208461, 205745, 204095, 203341, 202554, 200868, 198334, 195763, 193801, 192424, 191311, 190355, 189603, 188944, 188183, 187431, 187117, 187457, 188050, 188168, 187483, 186359, 185400, 184870, 184705, 184873, 185381, 185882, 185636, 184152, 181760, 179392, 177830, 177280, 177499, 177997, 178162]
51885A78162o66j534j973j943j747j608j528j497j559j585j347q21l01j7J22K48
51869A60406K22j27o19q65p99o91n98j86O74J426J380O29k3j9M04P43Q81R73J089
51850A64900J287J753K454K805K274J245P46J103J478J028O7m46k92j43m46p99
51834A79014o98l29j82k71j80J77L83J94m6J41P32J282J426J058K42o76j012k97
51816A80958R30J462P90k15m27J26M65R0m85o28l65l0K67N03N09K47M9J98N13
51797A84957P00P75Q41P26K92j10k7L47L81j60q15j053o51L65J699K638K544J656
51779A95105R80J166J902K479K561K214J655J204J124J274J285J262J786K958
51765B18955M004M255M016L898L735K893J429J39n53r80j429j631j350r92j065
$$ y = [178162, 177496, 175962, 173989, 172046, 170299, 168691, 167163, 165666, 164107, 162522, 161175, 160354, 160053, 160036, 160158, 160406, 160628, 160501, 159882, 159017, 158218, 157527, 156929, 156743, 157417, 158843, 160223, 160852, 160829, 160810, 161214, 161957, 162838, 163811, 164900, 166187, 167940, 170394, 173199, 175473, 176718, 177464, 178567, 180045, 181073, 181140, 180694, 180402, 180259, 179813, 179014, 178316, 177987, 177805, 177534, 177354, 177531, 177914, 178108, 178062, 178203, 178935, 180217, 181643, 182701, 182943, 182267, 181255, 180958, 181888, 183350, 184140, 183925, 183498, 183624, 184089, 184179, 183694, 183066, 182701, 182671, 182938, 183441, 183950, 184197, 184246, 184444, 184957, 185657, 186432, 187273, 187999, 188291, 188181, 188154, 188501, 188882, 188722, 187907, 186854, 186203, 186568, 188267, 190905, 193449, 195105, 196085, 197251, 199153, 201632, 204193, 206407, 208062, 209266, 210390, 211664, 212949, 214211, 215997, 218955, 222959, 227214, 231230, 235128, 238863, 241756, 243185, 243324, 242771, 241791, 240362, 238731, 237381, 236389, 235324]
51750B35324j416j421q54j89J7k62o12p61q19r48r89o76j04K67J66j83m05l40
51732B25795KN49J029J035O49N30J074J693J532O51j32m40o78j131j480j500j538
51715B27640j881k155j925j477j471j983k423k364j999j750j749j795j624j235
51701B01809r93j256j818j971j365n48k61m90o37m94l91m32k26L81R22J046J149
51684A94425J731K498K699K174J475R28K39p87j709j928j375l83Q07K034K924
51669B05752L079K519J754J303J351J696J860J406L99n69j081j443k117k917l219
51654B09773l019l023l548l991l700k892k285k184k371k624k888l101l225l315
51640A67607l273k811j887j050q38j135j503j837k234k384j839q33j93k63m61
$$ y = [235324, 233908, 232487, 231633, 231444, 231461, 231199, 230587, 229826, 229007, 228059, 227070, 226394, 226290, 226557, 226723, 226540, 226135, 225795, 225797, 226346, 227375, 228410, 229059, 229589, 230663, 232356, 233888, 234539, 234407, 233967, 233289, 232158, 230678, 229178, 227640, 225759, 223604, 221679, 220202, 218731, 216748, 214325, 211961, 209962, 208212, 206463, 204668, 203044, 201809, 200816, 199560, 197742, 195771, 194406, 193858, 193597, 193107, 192470, 191976, 191585, 191153, 190927, 191308, 192230, 193276, 194425, 196156, 198654, 201353, 203527, 205002, 205930, 206169, 205382, 203673, 201745, 200370, 199987, 200794, 202828, 205752, 208831, 211350, 213104, 214407, 215758, 217454, 219314, 220720, 221119, 220550, 219469, 218026, 215909, 212992, 209773, 206754, 203731, 200183, 196192, 192492, 189600, 187315, 185131, 182760, 180136, 177248, 174147, 170922, 167607, 164334, 161523, 159636, 158586, 157748, 156613, 155110, 153273, 151039, 148655, 146816, 145983, 145790, 145527, 145066]
51625A45066j39O33J280J457J198P15K25j26l70o08p70o82l79j27r0k26m97q94
51607A45666j205j071l95M55R95J000O09K01J17K85K59p4k10K43Q44J021J120
51590A49860J908L108L522K879K449L312M841N697N558N014M408L715L233L436
51576B02940M150M599M320L416K062L75j198k064k170k126k467l102l496l116
51562B02123j826j45J023J300J280J714K515L131L543M154M811M841M191L688
51548B36343L878M307M300L864L421L164L054L045K941K404J473O75L46J78j89
51533B73204n10m06r1j26o20j214j746k360l082l715m237m763n099m759l685k518
51517B34273j908j871k050k361k924l551l742l277k519j932j594j333j123j038
$$ y = [145066, 144927, 145560, 146840, 148297, 149495, 150210, 150435, 150309, 149939, 149331, 148561, 147879, 147500, 147373, 147283, 147057, 146560, 145666, 144461, 143390, 142995, 143450, 144445, 145445, 146054, 146255, 146372, 146657, 146916, 146842, 146632, 146875, 147719, 148740, 149860, 151768, 154876, 158398, 161277, 163726, 167038, 171879, 177576, 183134, 188148, 192556, 196271, 199504, 202940, 207090, 211689, 216009, 219425, 221487, 221862, 220664, 218600, 216430, 214304, 211837, 208735, 205239, 202123, 200297, 200152, 201175, 202475, 203755, 205469, 207984, 211115, 214658, 218812, 223623, 228464, 232655, 236343, 240221, 244528, 248828, 252692, 256113, 259277, 262331, 265376, 268317, 270721, 272194, 272869, 273215, 273393, 273204, 272694, 272288, 272197, 272071, 271451, 270237, 268491, 266131, 263049, 259334, 255097, 250334, 245235, 240476, 236791, 234273, 232365, 230494, 228444, 226083, 223159, 219608, 215866, 212589, 210070, 208138, 206544, 205211, 204088, 203050]
51503B03050r49o78l92m65q22q52k42M79O03J54k26r7M45J117J672J802J355O56
51485B06610K61L81Q37J496K269K803K745K406K421K685K347J182J63J88Q92J424
51469B31110J799K634L862M705M824M660M591M422M030L817M141M703M891M471
51455B88660L708K995K546K369K335K359K456K491K025P73q65k121k766l222l774
51440B99969m196m406m920o089p306p565o749n778n438n522n358m805m334m265
51426B23238m268l789k817j915j490j298r10m49l90o29l34R78K623L477L323K980
51410B18330L067L208K656J308j86j213j772k294l072l996m801n448o095o699
51396A92993o832o155m944l957l713m059m479m590m319l802l257k835k482k073
$$ y = [203050, 202101, 201423, 201031, 200566, 199744, 198892, 198650, 199129, 199732, 199886, 199660, 199563, 200008, 201125, 202797, 204599, 205954, 206610, 206871, 207252, 208089, 209585, 211854, 214657, 217402, 219808, 222229, 224914, 227261, 228443, 228606, 228794, 229686, 231110, 232909, 235543, 239405, 244110, 248934, 253594, 258185, 262607, 266637, 270454, 274595, 279298, 284189, 288660, 292368, 295363, 297909, 300278, 302613, 304972, 307428, 309919, 311944, 312717, 311852, 309731, 306965, 303743, 299969, 295773, 291367, 286447, 280358, 273052, 265487, 258738, 252960, 247522, 242000, 236642, 231837, 227503, 223238, 218970, 215181, 212364, 210449, 208959, 207661, 206751, 206302, 205912, 205283, 204949, 205927, 208550, 212027, 215350, 218330, 221397, 224605, 227261, 228569, 228383, 227170, 225398, 223104, 220032, 216036, 211235, 205787, 199692, 192993, 186161, 180006, 175062, 171105, 167392, 163333, 158854, 154264, 149945, 146143, 142886, 140051, 137569, 135496]
51382A35496j671j505j571j570j306r77q56r37j101j417j907k196j844j029m21
51367A15188k81j56L43Q77Q70L16l62r71j583j978j660o42L18N43K36P6K75M20
51349A11829K23k7J19O44J040Q58J43n55o03J10R79J234Q49O53J372K695L653
51332A25216L815L680L840M171M213M045M203M840N344M984L682J961L92p27j334
51317A72325j508j483j596k184l412n013o180o098m821l397k835l023l064k555
51303A25156k016j982k219k191j920j820j911j759j259q71r11j047q30l73j6L64
51287A04395J131J960J874M85j211j785q90N54J486J625J284Q05L58M2j60l39
51271A11614n11n24k42K96R40J483J619J135K18o00r92j111j180j097p38l53l33
$$ y = [135496, 133825, 132320, 130749, 129179, 127873, 126896, 126040, 125103, 124002, 122585, 120678, 118482, 116638, 115609, 115188, 114907, 114751, 115094, 115971, 116841, 117157, 116795, 115824, 114241, 112263, 110603, 109961, 110279, 110822, 111058, 111134, 111409, 111829, 112052, 112025, 112144, 112788, 113828, 114686, 114829, 114274, 113671, 113781, 114760, 115994, 116843, 117496, 118868, 121563, 125216, 129031, 132711, 136551, 140722, 144935, 148980, 153183, 158023, 163367, 168351, 172033, 173994, 174386, 173659, 172325, 170817, 169334, 167738, 165554, 162142, 157129, 150949, 144851, 140030, 136633, 133798, 130775, 127711, 125156, 123140, 121158, 118939, 116748, 114828, 113008, 111097, 109338, 108079, 107208, 106297, 105250, 104420, 104047, 104031, 104395, 105526, 107486, 109360, 109845, 108634, 106849, 105959, 106513, 107999, 109624, 110908, 111713, 112071, 112113, 111953, 111614, 111103, 110579, 110337, 110633, 111573, 113056, 114675, 115810, 116028, 115428, 114436, 113325, 112145, 111048, 110310, 109957, 109624]
51254A09624o16p52m95j0M27O38M76m0m71k91M37J027J049P76N83L63r1n10m77
51235A11647j46r2m60p61n38J44R24J506J718J589J432J497J525J029J65k24L15
51218A21270J147J376R70N45L43P8l27n26l44QM00R37J385J141J32p34o02K45
51200A27444R17J161J414J719J536P12r1k85j16j38l96o70j035j621j991j506
51184A27054l20N80M82l03j013j335j416j288p53J22P46M82o48j815k150j630
51168A16795j072j129j470j320n97p7k63o16l39M17O84Nr18j125n44P5K09Q1J95
51149A08991O47J077J125Q16N15O02J160J820K047J635R23M00J42j68o28q40m18
51132A19846L37O70K21n73j120j368j633j892j680q30J08M41J66j45j75k12n31
$$ y = [109624, 109008, 108256, 107761, 107751, 108178, 108816, 109292, 109252, 108781, 108490, 108927, 109954, 111003, 111779, 112362, 112725, 112634, 112124, 111647, 111501, 111409, 110949, 110188, 109650, 109794, 110718, 112224, 113942, 115531, 116963, 118460, 119985, 121014, 121179, 120955, 121270, 122417, 123793, 124763, 125308, 125651, 125729, 125402, 124876, 124532, 124540, 124940, 125877, 127262, 128403, 128535, 127801, 127199, 127444, 128361, 129522, 130936, 132655, 134191, 134903, 134812, 134527, 134411, 134273, 133877, 133207, 132172, 130551, 128560, 127054, 126734, 127314, 127796, 127493, 126480, 125145, 123729, 122441, 121688, 121810, 122556, 123038, 122390, 120575, 118425, 116795, 115723, 114594, 113124, 111804, 111207, 111130, 110867, 110251, 109912, 110329, 111013, 111018, 110100, 108975, 108431, 108506, 108715, 108796, 108991, 109638, 110715, 111840, 112656, 113171, 113773, 114933, 116753, 118800, 120435, 121358, 121758, 121900, 121732, 121104, 120264, 119846, 120183, 120853, 121074, 120501, 119381, 118013, 116380, 114488, 112808, 111978, 112086, 112527, 112693, 112548, 112373, 112161, 111630]
51115A11630q33n97K09J067J524J572J419J156P30J41m73q10n39L72J493K264
51099A20325K472K227J580N68m24p82m03R4J59k0N1M05P14R09J115J191Q69M07
51081A31457N04J396K462K957K739K073J160K10l65l07O1J46k15o81r57j022q53
51064A40765l41L89Q76Q22M54J82R5O8J67O03J259J672J641J487J468J298O16
51047A53521k58n90k91p7m39r06p28M0O10M69j13n50n60k13L11R03J524K106K437
51028A57196K264J677J160J072J206J171R48P68O13L47K26O75J507J974J840J753
51012A76397K239K857K891K472K374K907L614M007M083M048M045M182M510M835
50998B25461M964N169N994P398Q516Q673Q274Q266Q959R888J0706J1599J2702
$$ y = [111630, 110797, 110200, 110409, 111476, 113000, 114572, 115991, 117147, 117877, 118018, 117545, 116735, 116196, 116568, 118061, 120325, 122797, 125024, 126604, 127172, 126748, 125966, 125563, 125657, 125816, 125796, 125847, 126252, 126966, 127875, 128990, 130181, 131050, 131457, 131961, 133357, 135819, 138776, 141515, 143588, 144748, 144958, 144593, 144286, 144347, 144493, 144278, 143597, 142640, 141618, 140765, 140424, 140813, 141689, 142511, 142965, 143147, 143242, 143310, 143477, 144080, 145339, 147011, 148652, 150139, 151607, 152905, 153521, 153263, 152673, 152382, 152305, 151866, 150960, 150232, 150272, 150882, 151351, 151238, 150688, 150128, 149915, 150226, 151129, 152653, 154759, 157196, 159460, 161137, 162297, 163369, 164575, 165746, 166694, 167462, 168075, 168422, 168648, 169323, 170830, 172804, 174644, 176397, 178636, 181493, 184384, 186856, 189230, 192137, 195751, 199758, 203841, 207889, 211934, 216116, 220626, 225461, 230425, 235594, 241588, 248986, 257502, 266175, 274449, 282715, 291674, 301562, 312268, 323867, 336569]
50985C36569J3790J4804J6282J8725K1858K4943K7670L0185L2429L4162L5719
50974F07136L7954M1103M4316M6773M8700N0628N2137N2212N0695M8439M5991
50963A126084M3030L9349L5583L2417K9683K6883K4138K1948K0282J8715J7398
50952A435510J7066J7949J9271K0216K0838K1540K2034K1448J9298J5763J1028
50941A641961N086j628q129j3993k0107k7518l5788m3269m9026n3594n7665o0928
50929A275402o2743o3121o2414o0574n7540n3913n0410m6918m2939l8752l5192
50918G00886l2347k9426k6015k2649j9865j7556j5483j3662j1940r973p987o756
50906D87227o370n836m467k937k256k350k438k319k338k459k242j666j162q87
$$ y = [336569, 350359, 365163, 381445, 400170, 422028, 446971, 474641, 504826, 537255, 571417, 607136, 645090, 686193, 730509, 777282, 825982, 876610, 928747, 980959, 1031654, 1080093, 1126084, 1169114, 1208463, 1244046, 1276463, 1306146, 1333029, 1357167, 1379115, 1399397, 1418112, 1435510, 1452576, 1470525, 1489796, 1510012, 1530850, 1552390, 1574424, 1595872, 1615170, 1630933, 1641961, 1647047, 1645419, 1637290, 1623297, 1603190, 1575672, 1539884, 1496615, 1447589, 1393995, 1336330, 1275402, 1212659, 1149538, 1087124, 1026550, 969010, 915097, 864687, 817769, 774830, 736078, 700886, 668539, 639113, 613098, 590449, 570584, 553028, 537545, 523883, 511943, 501970, 493983, 487227, 480857, 475021, 470554, 467617, 465361, 463011, 460573, 458254, 455916, 453457, 451215, 449549, 448387, 447500]
50892D47500n59q1L03N48R87J917L184M287M744M512M244M784O215P786Q994J0190
50876E09555J1692J3010J3707J4406J6042J8508K0972K3283K6032K9377L2932
50865G29516L6772M1472M6970N2496N7889O3934P1019P8417Q5471R2493R9745
50854A456194J06334J11041J13750J15255J15828J14779J11237J04802R5633Q4538
50844B529391P2921O2010N2015M2420L3235K5614K1054K0122K2119K5882L0772
50833B937555L6814M3982N1601N8490O3387O5017O2158N4225M1779K5951P513
50822C448472j3021l4638n5929p6093r5035j12346j27023j38454j46891j52490
50812B496552j54585j52562j46919j38850j29240j18630j07653r6807q6128p5747
$$ y = [447500, 446941, 446860, 447163, 447711, 448698, 450615, 453799, 458086, 462830, 467342, 471586, 476370, 482585, 490371, 499365, 509555, 521247, 534257, 547964, 562370, 578412, 596920, 617892, 641175, 667207, 696584, 729516, 766288, 807760, 854730, 907226, 965115, 1029049, 1100068, 1178485, 1263956, 1356449, 1456194, 1562528, 1673569, 1787319, 1902574, 2018402, 2133181, 2244418, 2349220, 2444853, 2529391, 2602312, 2664322, 2716337, 2758757, 2791992, 2817606, 2838660, 2858782, 2880901, 2906783, 2937555, 2974369, 3018351, 3069952, 3128442, 3191829, 3256846, 3319004, 3373229, 3415008, 3440959, 3448472, 3435451, 3400813, 3344884, 3268791, 3173756, 3061410, 2934387, 2795933, 2649042, 2496552, 2341967, 2189405, 2042486, 1903636, 1774396, 1655766, 1548113, 1451306, 1365178, 1289431]
50802A289431o6403n8715n2243m5923l9250l2453k5788j9485j4100j0084p037
50791I17950m194j605J1O65J306K261K416O95k336n044o635p737r151j0728j1745
50776H66129j2020j2269j3271j4865j6038j6028j5116j4066j3079j1766j0049
50765G17562q475p379o243m315j562J296L602N294O700Q141R767J1603J3620J5797
50751G65408J8081K0347K2524K4806K7688L1592L6507M1989M7542N3018N8690
50740A148192O4896P1521P7815Q2832Q6025Q7345Q6771Q3998P8693P0933O1266
50729B000287N0359L8685K6512J4117K009q981j7762k3264k4881k2897j8429j2699
50717B003056o307O92Q034J4879K0400K4328K6590K6594K3409J6693P083m459
$$ y = [1289431, 1223028, 1164313, 1112070, 1066147, 1026897, 994444, 968656, 949171, 935071, 924987, 917950, 913756, 912151, 912162, 912827, 914133, 916394, 918810, 919505, 917169, 912125, 905490, 897753, 888602, 877874, 866129, 854109, 841840, 828569, 813704, 797666, 781638, 766522, 752456, 739377, 727611, 717562, 709087, 701708, 695465, 691150, 689588, 690884, 694486, 699780, 706480, 714621, 724388, 735991, 749611, 765408, 783489, 803836, 826360, 851166, 878854, 910446, 946953, 988942, 1036484, 1089502, 1148192, 1213088, 1284609, 1362424, 1445256, 1531281, 1618626, 1705397, 1789395, 1868088, 1939021, 2000287, 2050646, 2089331, 2115843, 2129960, 2131969, 2122988, 2105226, 2081962, 2057081, 2034184, 2015755, 2003056, 1996749, 1997441, 2005475, 2020354, 2040754, 2065082, 2091672, 2118266, 2141675, 2158368, 2165451, 2160992]
50705B160992j7429l1707m6859o1672p4379q3508q8681r0673r0562q8842q5499
50694A401181q0690p4938o8620o1766n4601m7818m1948l6685l1254k5413j9714
50683H57734j4789j0673o841k714J893O571J0618J3732J6379J9147K1766K3269
50671I36092K3274K2592K2096K1460J9680J6684J3628J1420R708P708N451L586
50659A113379K333J297K03p71j427j792j882j595r50p4J089K708M610O389Q041
50644A131558J0071J2759J5742J8528K0975K2970K4059K3860K2533K0558J8267
50633A341880J5952J4091J2997J2393J1820J1413J1850J3653J6792K0864K5248
50622A508953K9181L2139L4174L5480L5583L3416K8334K0871J2416M334k693q751
$$ y = [2160992, 2143563, 2111856, 2064997, 2003325, 1928946, 1845438, 1756757, 1666084, 1575522, 1486680, 1401181, 1320491, 1245553, 1176933, 1115167, 1060566, 1012748, 970800, 934115, 902861, 877448, 857734, 842945, 832272, 825431, 822717, 824610, 831181, 841799, 855531, 871910, 891057, 912823, 936092, 959366, 981958, 1004054, 1025514, 1045194, 1061878, 1075506, 1086926, 1096634, 1104342, 1109793, 1113379, 1115712, 1117009, 1117212, 1116441, 1115014, 1113222, 1111340, 1109745, 1108795, 1108721, 1109810, 1112518, 1117128, 1123517, 1131558, 1141629, 1154388, 1170130, 1188658, 1209633, 1232603, 1256662, 1280522, 1303055, 1323613, 1341880, 1357832, 1371923, 1384920, 1397313, 1409133, 1420546, 1432396, 1446049, 1462841, 1483705, 1508953, 1538134, 1570273, 1604447, 1639927, 1675510, 1708926, 1737260, 1758131, 1770547, 1774881, 1772188, 1763437]
50610A763437j4286j9477k4025k7621l0440l2954l5449l7955m0467m2922m5083
50599A412758m6819m8359m9819n0730n0506m9338m7980m6701m5027m2630l9844
50588H95005l7080l4290l1336k8390k5598k2709j9513j6335j3710j1731j0072
50577F44241q471o864n153l179r39J348L379M950O171P564R664J2344J4764J6241
50563F96060J7057J8147K0156K2939K5816K8168K9811L1024L2117L3012L3409
50552I87716L3322L3136L2959L2375L1150K9805K9114K9202K9550K9793L0014
50541A328136L0310L0484L0352L0017K9677K9413K9316K9701L0909L2909L5279
50530A666503L7615L9830M1906M3466M3937M3230M1884M0286L8002L4274K9016
$$ y = [1763437, 1749151, 1729674, 1705649, 1678028, 1647588, 1614634, 1579185, 1541230, 1500763, 1457841, 1412758, 1365939, 1317580, 1267761, 1217031, 1166525, 1117187, 1069207, 1022506, 977479, 934849, 895005, 857925, 823635, 792299, 763909, 738311, 715602, 696089, 679754, 666044, 654313, 644241, 635770, 628906, 623753, 620574, 619635, 620983, 624362, 629312, 635483, 643047, 652711, 665055, 679819, 696060, 713117, 731264, 751420, 774359, 800175, 828343, 858154, 889178, 921295, 954307, 987716, 1021038, 1054174, 1087133, 1119508, 1150658, 1180463, 1209577, 1238779, 1268329, 1298122, 1328136, 1358446, 1388930, 1419282, 1449299, 1478976, 1508389, 1537705, 1567406, 1598315, 1631224, 1666503, 1704118, 1743948, 1785854, 1829320, 1873257, 1916487, 1958371, 1998657, 2036659, 2070933, 2099949]
50519B099949K2805J6088Q871J234o506j4234k2034k9524l5855m0600m4060m6289
50507A909845m6555m4385m0494l5941l0879k4913j8402j2431p678m092j642m39
50495A641994q3L10J187K332L579M876N481M078J71n353j1584j8710k7190l6407
50481A564681m4947n1832n6795n9777o0922o0859o0181n8730n6068n2488m8743
50470I53339m4886m0339l5238l0780k7764k5537k2955j9811j6673j3808j1015
50459F64533q355o228m706l328j634M68K921N594Q071R831J0883J1873J3280J4877
50445G18080J6249J7477J8895K0446K1752K2763K3868K5222K6504K7428K8154
50434I66838K8861K9282K9047K8416K8196K8787K9643K9883K9344K8738K8780
$$ y = [2099949, 2122754, 2138842, 2147713, 2148947, 2142441, 2128207, 2106173, 2076649, 2040794, 2000194, 1956134, 1909845, 1863290, 1818905, 1778411, 1742470, 1711591, 1686678, 1668276, 1655845, 1648167, 1644075, 1642433, 1641994, 1641911, 1642221, 1643408, 1645740, 1649319, 1654195, 1659676, 1663754, 1663925, 1658572, 1646988, 1628278, 1601088, 1564681, 1519734, 1467902, 1411107, 1351330, 1290408, 1229549, 1169368, 1110638, 1054570, 1002082, 953339, 908453, 868114, 832876, 802096, 774332, 748795, 725840, 706029, 689356, 675548, 664533, 656178, 649950, 645244, 641916, 640282, 640750, 643671, 649265, 657336, 667167, 678050, 689923, 703203, 718080, 734329, 751806, 770701, 791147, 812899, 835662, 859530, 884752, 911256, 938684, 966838, 995699, 1024981, 1054028, 1082444, 1110640, 1139427, 1169070, 1198953, 1228297, 1257035, 1285815]
50423A285815K9362K9827K9953L0354L1717L3797L5503L6047L5580L4604L2991
50412A645550L0125K5880K1024J6349J1764O622Q21m938j0129j5170k0870k7223
50400A679805l3353l8573m3088m7391n1423n4744n7171n8775n9376n8601n6465
50389A120845n3431m9679m4952l9325l3645k8710k4389k0002j5387j0970o937
50378G93418k955J178N175Q776J2107J5104J6934J6589J4034J0330O537K829j177
50365H98879n535r746j3319j6199j8556k0395k1622k2354k2868k3151k2778k1402
50353F80954j9263j7025j5211j3894j2898j2029j1132j0114r004p897o815n699
50341E39973m525l325k085p19P49K132L284M304N444O802Q226R468J0447J1325
$$ y = [1285815, 1315177, 1345004, 1374957, 1405311, 1437028, 1470825, 1506328, 1542375, 1577955, 1612559, 1645550, 1675675, 1701555, 1722579, 1738928, 1750692, 1757314, 1758135, 1753197, 1743068, 1727898, 1707028, 1679805, 1646452, 1607879, 1564791, 1517400, 1465977, 1411233, 1354062, 1295287, 1235911, 1177310, 1120845, 1067414, 1017735, 972783, 933458, 899813, 871103, 846714, 826712, 811325, 800355, 793418, 790463, 791641, 796816, 805592, 817699, 832803, 849737, 866326, 880360, 890690, 897227, 900056, 898879, 893344, 883598, 870279, 854080, 835524, 815129, 793507, 771153, 748285, 725134, 702356, 680954, 661691, 644666, 629455, 615561, 602663, 590634, 579502, 569388, 560384, 552487, 545672, 539973, 535448, 532123, 530038, 529319, 530068, 532200, 535484, 539788, 545232, 552034, 560260, 569728, 580175, 591500]
50327E91500J2357J3606J4829J5712J6234J6771J7681J8824J9616J9724J9626
50316G76480K0226K1734K3183K3358K2145K0606J9648J9082J8177J6832J5626
50305I97097J4907J4299J3186J1374R192P161N662M662L732K460Q14j129l667
50292A079750p214j1542j5737j9175k1974k4279k5667k5765k5039k4318k3739
50281H55301k2824k1487k0223j9271j8252j6945j5745j5003j4383j3336j1867
50270F65965j0484r529q973q625q230p552o599n616m667l504k173j250j007p36
50256E87020M18K179L523M177M848N873O614O642O636P442Q810R858J0348J0699
50242F75087J0952J0518R127P300N731M654L979L606L315K689J472j52j805l306
$$ y = [591500, 603857, 617463, 632292, 648004, 664238, 681009, 698690, 717514, 737130, 756854, 776480, 796706, 818440, 841623, 864981, 887126, 907732, 927380, 946462, 964639, 981471, 997097, 1012004, 1026303, 1039489, 1050863, 1060055, 1067216, 1072878, 1077540, 1081272, 1083732, 1084546, 1083417, 1079750, 1072536, 1060994, 1045257, 1026082, 1004108, 979829, 954162, 928397, 903358, 879040, 855301, 832477, 810990, 790767, 771496, 753244, 736299, 720554, 705551, 691168, 677832, 665965, 655481, 645952, 636979, 628354, 620124, 612572, 605973, 600357, 595690, 592186, 590013, 588763, 587756, 587020, 587438, 589617, 593140, 597317, 602165, 608038, 614652, 621294, 627930, 635372, 644182, 654040, 664388, 675087, 686039, 696557, 705684, 712984, 718715, 723369, 727348, 730954, 734269, 736958, 738430, 738278, 736473, 733167]
50228G33167m611n523n740n336m983n340o228o700o217n436n359n847n681m248
50214F55918k428j416j231r56K1J570L248M574N173N273N741P000Q277Q662Q446
50199G07872Q467Q527P687O022M717M175L443J912L11p77k114m520p358r385j0429
50184G18550j1057j1236j0594r648r422r908j0043r344q487p999p404o172m724
50171F02512l858l644l487l112k955l500m529n331n602n835o415o666n583l556
50157E38439k356k913l970l802k458j231o42k86l71j659l781n001m284k500j076
50142E02109m21k76n51j034r93nJ356K327K944L567L957L663L005K712K796K607
50126E27763K024J765K270K941K829J757M69j97r1K14R7n08j192j684k088k552
$$ y = [733167, 728556, 723033, 717293, 711957, 706974, 701634, 695406, 688706, 682489, 677053, 671694, 665847, 660166, 655918, 653490, 652074, 650843, 649887, 649908, 651478, 654726, 659300, 664473, 669746, 675487, 682487, 690764, 699426, 707872, 716339, 724866, 732553, 738575, 743292, 747467, 750910, 752822, 753133, 752356, 750242, 745722, 738364, 728979, 718550, 707493, 696257, 685663, 676015, 666593, 656685, 646642, 637298, 628811, 620812, 613408, 607236, 602512, 598654, 595010, 591523, 588411, 585456, 581956, 577427, 572096, 566494, 560659, 554244, 547578, 541995, 538439, 536083, 533170, 529200, 525398, 522940, 521709, 521067, 520781, 520410, 518751, 514970, 509969, 505685, 503185, 502109, 501688, 501412, 500861, 499827, 498834, 498829, 500185, 502512, 505456, 509023, 512980, 516643, 519648, 522360, 525156, 527763, 529787, 531552, 533822, 536763, 539592, 541349, 541818, 541621, 541530, 541744, 541841, 541333, 540141, 538457, 536369, 533817]
50110E33817k932l003k700k052j112j04O25R97J332J837K310K516K652L158M192
50095E41533N494O639P364P821Q466R502J0510J1046J1510J2736J4680J6318J7105
50082F80724J7744J9055K0793K2282K3474K4676K5718K6255K6577K7265K8307
50071I42870K9316L0458L2372L5267L8830M2946M7728N2992N8336O3542O8133
50060A442790P0732O9939O5978O0496N4605M8155M1270L5411L2148L1648L3060
50049A986232L5663L8814M1199M1144L7537K9930J8044K105j6326l4589n0424
50038B129329o2908p2027p7830q0321p9817p7021p2782o7891o3015n8518n4352
50027A362847n0271m6302m2845m0097l7589l4608l1155k8034k5799k4060k2118
$$ y = [533817, 530885, 527882, 525182, 523130, 522018, 521914, 522539, 523536, 524868, 526705, 529015, 531531, 534183, 537341, 541533, 547027, 553666, 561030, 568851, 577317, 586819, 597329, 608375, 619885, 632621, 647301, 663619, 680724, 698468, 717523, 738316, 760598, 784072, 808748, 834466, 860721, 887298, 914563, 942870, 972186, 1002644, 1035016, 1070283, 1109113, 1152059, 1199787, 1252779, 1311115, 1374657, 1442790, 1513522, 1583461, 1649439, 1709935, 1764540, 1812695, 1853965, 1889376, 1921524, 1953172, 1986232, 2021895, 2060709, 2101908, 2143052, 2180589, 2210519, 2228563, 2230668, 2214342, 2179753, 2129329, 2066421, 1994394, 1916564, 1836243, 1756426, 1679405, 1606623, 1538732, 1475717, 1417199, 1362847, 1312576, 1266274, 1223429, 1183332, 1145743, 1111135, 1079980, 1051946, 1026147, 1002087, 979969]
50016I79969j9893j7661j5297j2499r573p256n694m391l149k291j759q57O48J948
50002H82245K280K029K037K417K693K688K481J822M34j249k473l224m163n456
49988H84561o457o786o935p441q069q250p957p599p358p079o654o105n341m256
49974G88274l048k081j368m98P71K111L020L494M043N065O491Q082R811J1675
49960H35842J3397J4671J5736J7356K0047K3619K7639L2084L7258M3244M9823
49949A130716N6945O4872P3671Q2744R0902R6875R9741R9217R5786R0498Q4494
49938B066461P8650P3647P0227O9049P0216P3000P6092P8046P7357P2411O1868
49927B867024M5462K4330M50k4163m7678o8377q5037r7425j06159j12024j15672
$$ y = [979969, 960076, 942415, 927118, 914619, 905046, 897790, 892096, 887705, 884556, 882265, 880506, 879649, 880297, 882245, 884525, 886554, 888591, 891008, 893701, 896389, 898870, 900692, 901126, 899877, 897404, 894180, 890017, 884561, 878104, 871318, 864383, 856942, 848873, 840623, 832666, 825067, 817709, 810630, 803976, 797871, 792530, 788274, 785226, 783145, 781777, 781279, 782050, 784161, 787181, 790675, 794718, 799783, 806274, 814356, 824167, 835842, 849239, 863910, 879646, 897002, 917049, 940668, 968307, 1000391, 1037649, 1080893, 1130716, 1187661, 1252533, 1326204, 1408948, 1499850, 1596725, 1696466, 1795683, 1891469, 1981967, 2066461, 2145111, 2218758, 2288985, 2358034, 2428250, 2501250, 2577342, 2655388, 2732745, 2805156, 2867024, 2912486, 2936816, 2937266, 2913103, 2865425, 2797048, 2712011, 2614586, 2508427, 2396403, 2280731]
49916B280731j17766j18809j18610j16487j12246j06619j00414r3766q6575p9301
49906A230138p2608o6448o0167n3553m7250m2007l7916l4526l1324k7982k4513
49895G31844k1334j8887j7081j5393j3704j2618j2641j3369j3856j3691j3322
49884E65948j3274j3474j3425j2824j1787j0576r383q393p818p661p476o673n164
49871D38020l586k708k648k880k889k641k374k153j759r65J96J383K188K467K435
49856D22086K400K453K529K643K837K960K795K460K390K807L385L680L718L858
49842D63001M308M954N726O752Q073R475J0802J2254J4161J6508J9018K1671K5021
49829F21724K9714L5786M2579M9383N6027O2706O9214P4460P6987P6043P2110
$$ y = [2280731, 2162965, 2044156, 1925546, 1809059, 1696813, 1590194, 1489780, 1396014, 1309439, 1230138, 1157530, 1091082, 1030915, 977362, 930112, 888105, 850189, 815663, 784339, 756357, 731844, 710510, 691623, 674542, 659149, 645445, 632827, 620186, 606817, 592961, 579270, 565948, 552674, 539200, 525775, 512951, 501164, 490588, 481205, 472812, 464994, 457333, 449857, 443184, 438020, 434434, 431726, 429078, 426198, 423309, 420668, 418294, 416141, 414382, 413417, 413613, 414996, 417184, 419651, 422086, 424486, 426939, 429468, 432111, 434948, 437908, 440703, 443163, 445553, 448360, 451745, 455425, 459143, 463001, 467309, 472263, 477989, 484741, 492814, 502289, 513091, 525345, 539506, 556014, 575032, 596703, 621724, 651438, 687224, 729803, 779186, 835213, 897919, 967133, 1041593, 1118580, 1194623, 1266733]
49818A266733O6298N9397N1794M4181L7801L3726L2159L2739L5069L8453M1247
49807A739597M1196L6603K6886J2142p078k9200n1424p0778q5448r5032r9864
49796A417600j00486r7573r1995q4780p6965o9189o1419n3463m5860l9722l5453
49785F60695l2244k9166k6214k3655k1068j7986j5035j3287j2588j1646r890q157
49773D39759p180o480n356m125l538l516l325k638j739q86j49K24o9q98j646j787
49757C96651j224k60N27N98L6l46N1P89R22L34j04K46R47J175Q51O53J044J637
49739D04527J647Q43j42n08j59K67K18j60l14N8P68J389J578J299Q87P52Q89R10
49721D14749O30L21K76M42P10J139J544J324K27r70j179k31J113K148K602K249
$$ y = [1266733, 1333031, 1392428, 1444222, 1488403, 1526204, 1559930, 1592089, 1624828, 1659897, 1698350, 1739597, 1780793, 1817396, 1844282, 1856424, 1849346, 1820146, 1768722, 1697944, 1612496, 1517464, 1417600, 1317114, 1219541, 1127546, 1042766, 965801, 896612, 835193, 781730, 735870, 696148, 660695, 628451, 599285, 573071, 549416, 528348, 510362, 495327, 482040, 469452, 457806, 447916, 439759, 432579, 426099, 420743, 416618, 413080, 409564, 406239, 403601, 401862, 400976, 400827, 401051, 400982, 400084, 398438, 396651, 395427, 395167, 395694, 396292, 396328, 395982, 396033, 396822, 397744, 398078, 397974, 398220, 399167, 400342, 401193, 401846, 402890, 404527, 406174, 407017, 406875, 406367, 406208, 406475, 406693, 406533, 406219, 406277, 407045, 408434, 410012, 411311, 412198, 412950, 413839, 414749, 415379, 415700, 415976, 416418, 417128, 418267, 419811, 421135, 421362, 420392, 419213, 418982, 420095, 422243, 424845, 427094]
49705D27094J022l26n83M85J678J814J107O32Q39J230J259R07L66l01r80j376
49689D34867j297r41p23q55j146j239j016p52p86j135j453j449j169r36j016j419
49673D17535j793j659r07j9M03L41K94N25P92Q82R84J252J352R36L48K94Q48J247
49655D23655R28L23K74Q92J455J411J016P70O22J52o07j083r60m87P3Q26J672
49638D30932J936J210J82k9P10J533J911K227K836L311L060K198J361R82J082
49623D55442J460J705J401P21N07J282K407K719J961J120J338K804M718O086O453
49608D92124O090N535N072M744M776N513O762P694P809P640Q003Q867R506R652
49594E89787R787J0306J0965J1356J1551J1971J2872J4074J5070J5490J5585J6106
$$ y = [427094, 428116, 427790, 427207, 427692, 429370, 431184, 432291, 432923, 433762, 434992, 436251, 437158, 437524, 437223, 436243, 434867, 433570, 432629, 431906, 431051, 429905, 428666, 427650, 426898, 426112, 424977, 423524, 422075, 420906, 419970, 418954, 417535, 415742, 414083, 413176, 413157, 413560, 413901, 414195, 414720, 415512, 416394, 417378, 418630, 419982, 420918, 421266, 421560, 422408, 423655, 424583, 424906, 425180, 426072, 427527, 428938, 429954, 430724, 431346, 431498, 430891, 429808, 428848, 428361, 428434, 429260, 430932, 432868, 434078, 434260, 434231, 434941, 436474, 438385, 440612, 443448, 446759, 449819, 452017, 453378, 454360, 455442, 456902, 458607, 460008, 460729, 461236, 462518, 464925, 467644, 469605, 470725, 472063, 474867, 479585, 485671, 492124, 498214, 503749, 508821, 513565, 518341, 523854, 530616, 538310, 546119, 553759, 561762, 570629, 580135, 589787, 599574, 609880, 620845, 632201, 643752, 655723, 668595, 682669, 697739, 713229, 728814, 744920]
49582G44920J7402J8890J9841K0496K1757K3843K6007K7672K9149L0810L2335
49571A013122L3299L4057L5344L7238L9081M0393M1331M2283M3432M4769M6182
$$ y = [744920, 762322, 781212, 801053, 821549, 843306, 867149, 893156, 920828, 949977, 980787, 1013122, 1046421, 1080478, 1115822, 1153060, 1192141, 1232534, 1273865, 1316148, 1359580, 1404349, 1450531]
$$ [...]
##END NTUPLES=NMR SPECTRUM
##END=
