##TITLE=NES1099_Nhol10910_9887186_AK32tKpe6a
##JCAMPDX= 6.0         $$ Bruker NMR JCAMP-DX V2.0
##DATA TYPE= NMR SPECTRUM
##DATA CLASS= NTUPLES
##ORIGIN= BRUKER
##OWNER= Administrator
$$ 1.72 TOPSPIN		Version 2.1
$$ 2016-08-28 15:44:08.898 -0500  Administrator@X
$$ Compression mode = diff/dup
##.OBSERVE FREQUENCY= 400.02188249412
##.OBSERVE NUCLEUS= ^1H
##.ACQUISITION MODE= SIMULTANEOUS (DQD)
##.ACQUISITION SCHEME= undefined
##.AVERAGES= 64
##.DIGITISER RES= 22
##SPECTROMETER/DATA SYSTEM= spect
##.PULSE SEQUENCE= noesygpps1d.comp
##.SOLVENT NAME= COFFEE_meoh
##.SHIFT REFERENCE= INTERNAL, COFFEE_meoh, 1, 14.96174
##AUDIT TRAIL= $$ (NUMBER, WHEN, WHO, WHERE, PROCESS, VERSION, WHAT)
$$ ##TITLE= Audit trail, TOPSPIN		Version 2.1
$$ ##JCAMPDX= 5.01
$$ ##ORIGIN= Bruker BioSpin GmbH
$$ ##OWNER= Administrator
$$ $$ E:\/data/COFFEE/nmr/NES1099_Nhol10910_9887186_AK32tKpe6a/22/pdata/1/auditp.txt
$$ ##AUDIT TRAIL=  $$ (NUMBER, WHEN, WHO, WHERE, PROCESS, VERSION, WHAT)
(   1,<2016-08-28 15:44:03.398 -0500>,<Administrator>,<X>,<go>,<TOPSPIN 2.1>,
      <created by zg
	started at 2016-08-28 15:32:32.804 -0500,
	POWCHK enabled, PULCHK disabled,
       configuration hash MD5:
       21 0F 79 D6 B3 7B B4 F6 88 20 88 DB 03 48 BD 9F
       data hash MD5: 64K
       C4 EC 14 EB 1A 2F 90 32 1B 2D EC 72 A5 B0 A6 9F>)
(   2,<2016-08-28 15:44:06.554 -0500>,<Administrator>,<X>,<proc1d>,<TOPSPIN 2.1>,
      <Start of raw data processing
       efp LB = 0.3 FT_mod = 6 PKNL = 1 PHC0 = 0 PHC1 = 0 SI = 128K 
       data hash MD5: 128K
       3B 86 DD 96 82 D1 70 AC 0B 2F 1B A3 E5 11 09 E6>)
(   3,<2016-08-28 15:44:07.429 -0500>,<Administrator>,<X>,<proc1d>,<TOPSPIN 2.1>,
      <pk PHC0 = -84.98474 PHC1 = 0 
       data hash MD5: 128K
       CC 2C AB 40 DB 2A 40 D6 F9 6F 2D 41 42 4C CE 84>)
(   4,<2016-08-28 15:44:07.820 -0500>,<Administrator>,<X>,<proc1d>,<TOPSPIN 2.1>,
      <abs ABSG = 1 
       data hash MD5: 128K
       0B 4C C8 14 AD E9 7A C5 75 E5 D5 1B 5A F5 C6 57>)
(   5,<2016-08-28 15:44:08.101 -0500>,<Administrator>,<X>,<proc1d>,<TOPSPIN 2.1>,
      <abs ABSG = 2 
       data hash MD5: 128K
       A0 85 3D A8 62 AA 41 59 57 2A 33 18 4A 04 08 CD>)
(   6,<2016-08-28 15:44:08.304 -0500>,<Administrator>,<X>,<proc1d>,<TOPSPIN 2.1>,
      <abs ABSG = 3 
       data hash MD5: 128K
       78 4F 10 FD 45 EC B3 C0 92 D6 88 F7 A1 8E 8F 37>)
(   7,<2016-08-28 15:44:08.383 -0500>,<Administrator>,<X>,<proc1d>,<TOPSPIN 2.1>,
      <abs ABSG = 4 
       data hash MD5: 128K
       73 FA B0 0E 25 B9 2D 1C AF D2 14 9E 5D 5E 85 0F>)
(   8,<2016-08-28 15:44:08.523 -0500>,<Administrator>,<X>,<proc1d>,<TOPSPIN 2.1>,
      <abs ABSG = 5 
       data hash MD5: 128K
       77 33 8B 5B A9 FD 28 16 58 BC B4 87 55 7C A3 D9>)
$$ ##END=
$$ 
$$ $$ hash MD5
$$ $$ 30 AC 21 A7 99 9A 0A 5F F6 C8 59 0A 1E 3D 57 FD
##$RELAX= 
##$RELAX= 
##$RELAX= 
##$RELAX= 
##$RELAX= 
##$RELAX= 
##$RELAX= 
##$RELAX= 
$$ Bruker specific parameters
$$ --------------------------
##$DU= <E:\>
##$EXPNO= 22
$$ [...]
##$TP07= 0
##$TPNAME0= <>
##$TPNAME1= <>
##$TPNAME2= <>
##$TPNAME3= <>
##$TPNAME4= <>
##$TPNAME5= <>
##$TPNAME6= <>
##$TPNAME7= <>
##$TPOAL= (0..7)
0.5 0.5 0.5 0.5 0.5 0.5 0.5 0.5
##$TPOFFS= (0..7)
0 0 0 0 0 0 0 0
##$TUNHIN= 0
##$TUNHOUT= 0
##$TUNXOUT= 0
##$USERA1= <user>
##$USERA2= <user>
##$USERA3= <user>
##$USERA4= <user>
##$USERA5= <user>
##$V9= 5
##$VALIST= <valist>
##$VCLIST= <CCCCCCCCCCCCCCC>
##$VD= 0
##$VDLIST= <DDDDDDDDDDDDDDD>
##$VPLIST= <PPPPPPPPPPPPPPP>
##$VTLIST= <TTTTTTTTTTTTTTT>
##$WBST= 2048
##$WBSW= 25
##$XGAIN= (0..3)
0 0 0 0
##$XL= 0
##$YL= 0
##$YMAX_a= 7801545
##$YMIN_a= -14076903
##$ZGOPTNS= <>
##$ZL1= 120
##$ZL2= 120
##$ZL3= 120
##$ZL4= 120
##$ABSF1= 14.96174
##$ABSF2= -5.596442
##$ABSG= 5
##$ABSL= 3
##$ALPHA= 0
##$AQORDER= 0
##$ASSFAC= 0
##$ASSFACI= 0
##$ASSFACX= 0
##$ASSWID= 0
##$AUNMP= <proc_prof1d_extract.lims>
##$AXLEFT= 0
##$AXNAME= <>
##$AXNUC= <1H>
##$AXRIGHT= 0
##$AXTYPE= 0
##$AXUNIT= <>
##$AZFE= 0.1
##$AZFW= 0.1
##$BCFW= 0
##$BC_mod= 0
##$BYTORDP= 0
##$COROFFS= 0
##$CY= 15
##$DATMOD= 1
##$DC= 0
##$DFILT= <>
##$DTYPP= 0
##$F1P= 0
##$F2P= 0
##$FCOR= 0.5
##$FTSIZE= 131072
##$FT_mod= 6
##$GAMMA= 0
##$GB= 0
##$INTBC= 1
##$INTSCL= 1
##$ISEN= 128
##$LB= 0.3
##$LEV0= 0
##$LPBIN= 0
##$MAXI= 10000
##$MC2= 0
##$MEAN= 0
##$ME_mod= 0
##$MI= 0
##$NCOEF= 0
##$NC_proc= -2
##$NLEV= 6
##$NOISF1= 0
##$NOISF2= 0
##$NSP= 0
##$NTH_PI= 0
##$NZP= 0
##$OFFSET= 14.96174
##$PC= 1
##$PHC0= -84.98474
##$PHC1= 0
##$PH_mod= 1
##$PKNL= yes
##$PPARMOD= 0
##$PPDIAG= 0
##$PPIPTYP= 0
##$PPMPNUM= 2147483647
##$PPRESOL= 1
##$PSCAL= 4
##$PSIGN= 0
##$PYNMP= <proc.py>
##$REVERSE= no
##$SF= 400.020009341162
##$SI= 131072
##$SIGF1= 0
##$SIGF2= 0
##$SINO= 400
##$SIOLD= 131072
##$SPECTYP= <>
##$SREGLST= <1H.CDCl3>
##$SSB= 0
##$STSI= 131072
##$STSR= 0
##$SW_p= 8223.68421052631
##$SYMM= 0
##$S_DEV= 0
##$TDeff= 65536
##$TDoff= 0
##$TI= <>
##$TILT= no
##$TM1= 0
##$TM2= 0
##$TOPLEV= 0
##$USERP1= <user>
##$USERP2= <user>
##$USERP3= <user>
##$USERP4= <user>
##$USERP5= <user>
##$WDW= 1
##$XDIM= 131072
##$YMAX_p= 374960410
##$YMIN_p= -11385
##$CURPLOT= <Network HP LaserJet P1505>
##$CURPRIN= <$Network HP LaserJet P1505>
##$DFORMAT= <normdp>
##$LAYOUT= <+/1D_H.xwp>
##$LFORMAT= <normlp>
##$PFORMAT= <normpl>
##$SURQMSG= 1
$$ End of Bruker specific parameters
$$ ---------------------------------
##NTUPLES= NMR SPECTRUM
##VAR_NAME=  FREQUENCY,     SPECTRUM/REAL,   SPECTRUM/IMAG
##SYMBOL=    X,             R,               I
##VAR_TYPE=  INDEPENDENT,   DEPENDENT,       DEPENDENT
##VAR_FORM=  AFFN,          ASDF,            ASDF
##VAR_DIM=   131072,        131072,          131072
##UNITS=     HZ,            ARBITRARY UNITS, ARBITRARY UNITS
##FACTOR=    0.0627417313425164, 1,          1
##FIRST=     8223.62146879497, -667,         -63279
##LAST=      0,             2499,            -63080
##MIN=       0,             -11385,          0
##MAX=       8223.62146879497, 374960410,    0
$$ Real data points
##PAGE= N=1
##DATA TABLE= (X++(R..R)), XYDATA
$$ [...]
$$ plain form
61166 914501 899385 884888 872029 860866 851098 843048 837555 834937 834557 835512 837138 838514 838012 833934
61152 833934 825416 812327 794696 772812 747758 721231 694771 669443 646003 624760 605333 587146
61140 587146 570252 555167 541876 529578 517585 505976 495153 485283 476412 468672 462016 456165
61128 456165 451147 447559 445865 445653 445965 446201 446411 446894 447942 449959 453422 458528 465020 472421 480396
61113 480396 488886 497924 507347 516632 525001 531637 535782 536795 534383 528814 520831 511385 501539 492384
61099 492384 484723 478765 474303 471164 469275 468373 467973 467730 467624 467750 468038 468245 468075 467454 466766 466675 467397
61082 467397 468334 468657 468137 467100 465842 464542 463551 463194 463323 463570 463974 464837 466039 467173 468365 470250
61066 470250 472974 475863 478306 480382 482428 484603 487116 490289 494047 497895 501698 505926 510826 516019
$$ packed form
61166I14501j5116j4497j2859j1163r768q050n493k618l80R55J626J376n02m078
61152H33934q518j3089j7631k1884k5054k6527k6460k5328k3440k1243j9427j8187
61140E87146j6894j5085j3291j2298j1993j1609j0823r870q871p740o656n851
61128D56165n018l588j694k12L12K36K10M83J048K017L463N106O492P401P975
61113D80396Q490R038R423R285Q369O636M145J013k412n569p983r446r846r155
61099D92384p661n958m462l139j889r02m00k43j06J26K88K07j70o21o88r1P22
61082D67397R37L23n20j037j258j300r91l57J29K47M04Q63J202J134J192J885
61066D70250K724K889K443K076K046K175K513L173L758L848L803M228M900N193
$$ plain form
61052 516019 521274 527022 533501 540010 545748 551067 557272 565341 575296 586482 597951 608880 619189
61039 619189 629700 641285 654004 667407 681353 696086 711794 728592 746858 767161 789859
61028 789859 815021 842616 872583 904958 940149 978943 1022048 1069779 1122055 1178224 1236872
61017 1236872 1296582 1357240 1420207 1487225 1559927 1640466 1731412 1834295 1949013 2075124 2212865
61006 2212865 2362805 2526480 2708984 2920007 3171000 3472183 3833299 4265453 4780289
60997 4780289 5389492 6108955 6963539 7986422 9218481 10715218 12545439 14748501 17250313
60988 17250313 19803816 22035067 23597483 24334068 24333990 23864405 23254849 22808774 22742401 23117133
60978 23117133 23782017 24395292 24557577 23990553 22646883 20693311 18404892 16051161 13827877
$$ packed form
61052E16019N255N748O479O509N738N319O205Q069R955J1186J1469J0929J0309
61039F19189J0511J1585J2719J3403J3946J4733J5708J6798J8266K0303K2698
61028G89859K5162K7595K9967L2375L5191L8794M3105M7731N2276N6169N8648
61017A236872N9710O0658O2967O7018P2702Q0539R0946J02883J14718J26111J37741
61006B212865J49940J63675J82504K11023K50993L01183L61116M32154N14836
60997D780289O09203P19463Q54584J022883J232059J496737J830221K203062K501812
60988A7250313K553503K231251J562416P36585p8m69585o09556m46075o6373L74732
60978B3117133O64884O13275J62285n67024j343670j953572k288419k353731k223284
$$ plain form
60969 13827877 11841148 10125485 8673428 7459767 6453825 5623935 4940416 4377929
60961 4377929 3915265 3533690 3216497 2949532 2720986 2521096 2342949 2183017 2039521
60952 2039521 1910229 1792472 1684712 1586827 1498794 1420030 1349915 1287964 1233102 1183381 1136648
60941 1136648 1091230 1046142 1001284 957526 916169 878149 843881 813555 787115 764072 743802
60930 743802 725975 710341 696346 683504 672052 662689 655631 650287 645840 641724 637571 633174 628649
60917 628649 624311 620207 615909 610795 604445 596861 588523 580154 572236 564803 557681 550707 543590 535936
60903 535936 527678 519273 511213 503625 496493 489911 483811 477864 472067 466984 462939 459356 455594 452089
60889 452089 449851 448915 448041 446052 442827 438915 434890 431365 428903 427449 426191 424432 422411 420986 420653
$$ packed form
60969A3827877j986729j715663j452057j213661j005942q29890o83519n62487
60961D377929m62664l81575l17193k66965k28546j99890j78147j59932j43496
60952B039521j29292j17757j07760r7885q8033p8764p0115o1951n4862m9721m6733
60941A136648m5418m5088m4858m3758m1357l8020l4268l0326k6440k3043k0270
60930G43802j7827j5634j3995j2842j1452r363p058n344m447m116m153m397m525
60917F28649m338m104m298n114o350p584q338q369p918p433p122o974p117p654
60903E35936q258q405q060p588p132o582o100n947n797n083m045l583l762l505
60889D52089k238r36q74j989l225l912m025l525k462j454j258j759k021j425l33
$$ plain form
60874 420653 421136 421792 422126 421961 421288 420056 418149 415657 413053 410909 409445 408563 408286 408822 410150 411886
60858 411886 413812 416299 419873 424423 429110 433117 436225 438571 440186 441149 442104 444120 447764 452564 457587
60843 457587 462166 465696 467111 465370 460567 454053 447327 441234 436186 432410 429632 427165 424795 423121
60829 423121 422568 422532 422028 420823 419385 418090 417117 416889 417809 419533 421079 421717 421376 420286 418763 417325
60813 417325 416427 415985 415532 414900 414314 413824 413139 412115 410993 410040 409289 408664 407938 406580 404113 400783 397451
60796 397451 394707 392482 390574 388996 387579 385763 383206 380293 377707 375737 374265 373108 372084 370985
60782 370985 369821 368870 368198 367410 366260 365334 365566 367041 368667 369224 368546 367524 367073 367257 367389 366902 365993
60765 365993 365309 365108 365044 364793 364540 364556 364576 364092 363198 362733 363419 365203 367582 370199 372801 374947 376346 377452
$$ packed form
60874D20653M83O56L34j65o73j232j907k492k604k144j464q82k77N36J328J736
60858D11886J926K487L574M550M687M007L108K346J615R63R55K016L644M800N023
60843D57587M579L530J415j741m803o514o726o093n048l776k778k467k370j674
60829D23121n53l6n04j205j438j295r73k28R20J724J546O38l41j090j523j438
60813D17325q98m42m53o32n86m90o85j024j122r53p51o25p26j358k467l330l332
60796C97451k744k225j908j578j417j816k557k913k586j970j472j157j024j099
60782C70985j164r51o72p88j150r26K32J475J626N57o78j022m51J84J32m87r09
60765C65993o84k01o4k51k53J6K0m84q94m65O86J784K379K617K602K146J399J106
$$ plain form
60747 377452 379126 381494 383590 384501 384450 384197 383616 381651 377741 372647 367542 362841 358346 354046 350076
60732 350076 346150 341790 337251 333593 331545 330687 330023 329072 328048 327201 326441 325681 325179 325333 326256 327692
60716 327692 329270 330643 331435 331317 330341 329055 328103 327733 327744 327762 327368 326225 324433 322686 321597 320896 319744
60699 319744 317953 316319 315479 315018 314171 313000 312288 312475 313288 314396 315956 318399 321910 326144 330269 333447
60683 333447 335472 336803 337785 338206 337980 337875 338859 340870 342865 344099 344730 345124 345296 345315 345623 346469 347336
60666 347336 347362 346187 344175 341982 340097 338622 337320 336070 335333 335842 337620 339678 341059 341971 343502
60651 343502 346270 349728 352772 354708 355537 355591 355135 354273 353037 351492 349809 348260 347121 346478 346124 345729
60635 345729 345161 344559 344112 343906 344058 344798 346234 348170 350266 352252 353837 354632 354479 353812 353440 353966 355485
$$ packed form
60747C77452J674K368K096R11n1k53n81j965l910n094n105m701m495m300l970
60732C50076l926m360m539l658k048q58o64r51j024q47p60p60n02J54R23J436
60716C27692J578J373P92j18r76j286r52l70J1J8l94j143j792j747j089p01j152
60699C19744j791j634q40m61q47j171p12J87Q13J108J560K443L511M234M125L178
60683C33447K025J331R82M21k26j05R84K011J995J234O31L94J72J9L08Q46Q67
60666C47336K6j175k012k193j885j475j302j250p37N09J778K058J381R12J531
60651C43502K768L458L044J936Q29N4m56q62j236j545j683j549j139o43l54l95
60635C45729n68o02m47k06J52P40J436J936K096J986J585P95j53o67l72N26J519
$$ plain form
60618 355485 357610 359577 360615 360670 360670 361571 363151 364208 364048 363297 363108 364040 365901 368332 371101 374055 377121
60601 377121 380288 383344 385710 386764 386359 384925 383070 381124 379031 376598 373852 371059 368348 365535
60587 365535 362501 359615 357408 355862 354459 353022 352071 352092 352727 353020 352364 350958 349406 348099 346989 345759
60571 345759 344129 342027 339526 336756 333961 331580 330107 329822 330674 332335 334336 336316 338382 341116 344939
60556 344939 349492 353854 357429 360424 363461 366904 370557 373877 376501 378660 381013 384011 387672 392153
60542 392153 398064 405760 414680 424029 434038 445854 460242 477088 496191 517752 541817 568058
60530 568058 596626 628619 665047 705644 748996 793322 836465 875526 907370 929658 941111
60519 941111 941072 929544 907824 878571 844863 809213 773458 739172 707911 680969 658982 641785
$$ packed form
60618C55485K125J967J038N5%R01J580J057j60p51j89R32J861K431K769K954L066
60601C77121L167L056K366J054m05j434j855j946k093k433k746k793k711k813
60587C65535l034k886k207j546j403j437r51K1O35K93o56j406j552j307j110j230
60571C45759j630k102k501k770k795k381j473k85Q52J661K001J980K066K734L823
60556C44939M553M362L575K995L037L443L653L320K624K159K353K998L661M481
60542C92153N911P696Q920R349J0009J1816J4388J6846J9103K1561K4065K6241
60530E68058K8568L1993L6428M0597M3352M4326M3143L9061L1844K2288J1453
60519I41111l9j1528k1720k9253l3708l5650l5755l4286l1261k6942k1987j7197
$$ plain form
60507 641785 628768 619477 613850 611941 613599 618529 626558 637822 652833 672278 696466 724853 756313
60494 756313 789855 824686 859482 892004 919804 941149 955328 962597 964145 961698 956616 949429
60482 949429 940428 930299 919863 909653 900309 893095 889397 889882 894833 905221 922743 948661 983252
60469 983252 1026581 1079223 1141935 1215251 1299913 1397332 1508882 1634669 1773037 1920746 2072746
60458 2072746 2221642 2357998 2471782 2553758 2596291 2594363 2547230 2459267 2338654 2194846
60448 2194846 2037098 1874332 1714683 1564096 1425612 1300438 1189332 1092554 1009146 937306
60438 937306 875528 822790 777781 738780 704488 674298 647568 623310 600923 580607 562642
60427 562642 546743 532590 520509 511104 504465 500085 497186 494731 491512 486941 481599 476507 471936
$$ packed form
60507F41785j3017r291n627j909J658M930Q029J1264J5011J9445K4188K8387L1460
60494G56313L3542L4831L4796L2522K7800K1345J4179P269J548k447n082p187
60482I49429r001j0129j0436j0210r344p214l698M85M951J0388J7522K5918L4591
60469I83252M3329N2642O2712P3316Q4662R7419J11550J25787J38368J47709J52000
60458B072746J48896J36356J13784Q1976M2533j928m7133q7963j20613j43808
60448B194846j57748j62766j59649j50587j38484j25174j11106r6778q3408p1840
60438I37306o1778n2738m5009l9001l4292l0190k6730k4258k2387k0316j7965
60427E62642j5899j4153j2081r405o639m380k899k455l219m571n342n092m571
$$ plain form
60414 471936 467396 462694 458450 455429 453710 452711 451820 450974 450629 451156 452286 453392 454370 455865 458416 461719
60398 461719 465087 468326 471788 475780 480383 485699 491836 498625 505637 512379 518267 522736 525791 528271
60384 528271 531070 534176 536903 538915 540546 542180 543876 545652 547630 549742 551670 553177 554160 554337 553325
60369 553325 551237 548853 546974 545793 545064 544609 544485 544779 545436 546283 547251 548630 550991 554638 559145 563670
60353 563670 567740 571614 575932 581195 587500 594564 601995 609617 617432 625200 632381 638698 644313 648975
60339 648975 651422 650377 646119 640377 634612 629051 623565 618688 615225 613256 612077 610986 609732 608297
60325 608297 606515 604021 600509 596117 591485 587213 583221 578890 573880 568552 563518 559094 555317 552194
60311 552194 549637 547322 544884 542289 539939 538416 538109 538942 540515 542608 545420 549074 553026 556336 558461
$$ packed form
60414D71936m540m702m244l021j719r99q91q46l45N27J130J106R78J495K551L303
60398D61719L368L239L462L992M603N316O137O789P012O742N888M469L055K480
60384E28271K799L106K727K012J631J634J696J776J978K112J928J507R83J77j012
60369E53325k088k384j879j181p29m55j24K94O57Q47R68J379K361L647M507M525
60353E63670M070L874M318N263O305P064P431P622P815P768P181O317N615M662
60339F48975K447j045m258n742n765n561n486m877l463j969j179j091j254j435
60325F08297j782k494l512m392m632m272l992m331n010n328n034m424l777l123
60311E52194k557k315k438k595k350j523l07Q33J573K093K812L654L952L310K125
$$ plain form
60296 558461 559435 559314 557974 555605 552892 550394 548025 545377 542255 538631 534414 529642 524758 520355 516704
60281 516704 513667 511026 508767 507152 506596 507254 508699 510296 512012 514533 518340 522966 527505 531605 535574
60266 535574 539638 543548 546996 550131 553478 557387 561592 565334 568076 570129 572413 575494 579067 582526
60252 582526 585794 589350 593646 598795 604743 611477 619055 627687 637764 649694 663712 679944 698486
60239 698486 719190 741533 765015 789684 816082 844692 875696 909273 945853 985931 1029733
60228 1029733 1077157 1127943 1181817 1238477 1297373 1357479 1417415 1475891 1531910 1584440 1632150
60217 1632150 1673887 1709395 1739180 1763517 1781822 1793130 1797004 1793870 1784737 1770849 1753450 1733553
60205 1733553 1711906 1689341 1667176 1647071 1630390 1617802 1609512 1605794 1607211 1614398 1627767 1647482
$$ packed form
60296E58461R74j21j340k369k713k498k369k648l122l624m217m772m884m403l651
60281E16704l037k641k259j615n56O58J445J597J716K521L807M626M539M100L969
60266E35574M064L910L448L135L347L909M205L742K742K053K284L081L573L459
60252E82526L268L556M296N149N948O734P578Q632J0077J1930J4018J6232J8542
60239F98486K0704K2343K3482K4669K6398K8610L1004L3577L6580M0078M3802
60228A029733M7424N0786N3874N6660N8896O0106N9936N8476N6019N2530M7710
60217A632150M1737L5508K9785K4337J8305J1308L874l134r133j3888j7399j9897
60205A733553k1647k2565k2165k0105j6681j2588q290l718J417P187J3369J9715
$$ plain form
60193 1647482 1673680 1706607 1746446 1793008 1845718 1903942 1967107 2034297 2103763 2173094 2239906
60182 2239906 2302290 2358689 2407755 2448524 2480449 2503032 2515602 2517756 2509839 2492666 2466879 2432948
60170 2432948 2391810 2345183 2295197 2243998 2193664 2145950 2101836 2061587 2025534 1994614 1970032
60159 1970032 1952564 1942385 1939351 1943296 1954248 1972445 1997863 2029517 2065496 2103824 2142970 2181360
60147 2181360 2216893 2247460 2271738 2289085 2298945 2300835 2294793 2281505 2262177 2238602 2212977 2187105
60135 2187105 2161996 2138778 2119552 2106479 2100206 2100225 2106860 2121829 2146457 2180382 2222790 2274180
60123 2274180 2336000 2408993 2492871 2587530 2693768 2812611 2944413 3088695 3244338 3409666
60113 3409666 3582534 3760459 3940508 4119093 4292182 4455879 4606760 4741741 4857894
$$ packed form
60193A647482K6198L2927L9839M6562N2710N8224O3165O7190O9466O9331O6812
60182B239906O2384N6399M9066M0769L1925K2583J2570K154p917j7173k5787l3931
60170B432948m1138m6627m9986n1199n0334m7714m4114m0249l6053l0920k4582
60159A970032j7468j0179l034L945J0952J8197K5418L1654L5979L8328L9146L8390
60147B181360L5533L0567K4278J7347R860J890o042j3288j9328k3575k5625k5872
60135B187105k5109k3218j9226j3073o273J9O635J4969K4628L3925M2408N1390
60123B274180O1820P2993Q3878R4659J06238J18843J31802J44282J55643J65328
60113C409666J72868J77925J80049J78585J73089J63697J50881J34981J16153
$$ plain form
60104 4857894 4952482 5023101 5067868 5085727 5076636 5041319 4980782 4896275 4789774 4664242 4523252
60093 4523252 4370514 4210043 4046598 3885361 3730687 3585155 3450043 3326608 3216564
60084 3216564 3121378 3041610 2977233 2928247 2894488 2875055 2868497 2873718 2890353 2918008 2955401 3000317
60072 3000317 3050182 3102414 3154370 3203303 3246594 3282137 3308498 3324684 3329812 3323200 3304861 3275687
60060 3275687 3236922 3189531 3134157 3071418 3002026 2926851 2847238 2765056 2682011 2599103 2517158
60049 2517158 2437681 2362588 2293111 2229651 2172760 2123598 2083145 2051570 2028765 2015023 2010881
60038 2010881 2016652 2032455 2058279 2093659 2137618 2189344 2248593 2314982 2387171 2463095 2540618
60027 2540618 2617399 2690417 2756456 2813197 2859431 2894208 2916319 2924721 2918955 2898962 2864941 2817850
$$ packed form
60104D857894R4588P0619M4767J7859r091l5317o0537q4507j06501j25532j40990
60093D523252j52738j60471j63445j61237j54674j45532j35112j23435j10044
60084C216564r5186p9768o4377m8986l3759j9433o558N221J6635K7655L7393M4916
60072C000317M9865N2232N1956M8933M3291L5543K6361J6186N128o612j8339k9174
60060C275687l8765m7391n5374o2739o9392p5175p9613q2182q3045q2908q1945
60049B517158p9477p5093o9477o3460n6891m9162m0453l1575k2805j3742m142
60038B010881N771J5803K5824L5380M3959N1726N9249O6389P2189P5924P7523
60027B540618P6781P3018O6039N6741M6234L4777K2111Q402n766j9993l4021m7091
$$ plain form
60015 2817850 2759766 2693386 2621206 2545440 2468570 2393392 2322203 2256198 2196020 2142845 2098444
60004 2098444 2064010 2039248 2022991 2014576 2014342 2022947 2040586 2066933 2101613 2144710 2196996 2259491
59992 2259491 2332478 2415003 2505554 2602869 2705395 2810092 2912555 3008575 3095116 3169779 3230288
59981 3230288 3275075 3303813 3316815 3314273 3296400 3263759 3216930 3156455 3083913 3002754 2917328
59970 2917328 2831215 2746960 2666958 2593492 2527915 2470677 2422428 2384346 2357040 2339757 2331179
59959 2331179 2330684 2338437 2354578 2378819 2410725 2450019 2496472 2549604 2608442 2671477 2736820 2802459
59947 2802459 2866453 2927012 2982542 3031642 3073116 3106155 3130698 3147405 3157097 3160326 3157784 3151067
59935 3151067 3142723 3135457 3131397 3132140 3139281 3154743 3180651 3218930 3270983 3337751 3419995 3518424
$$ packed form
60015B817850n8084o6380p2180p5766p6870p5178p1189o6005o0178n3175m4401
60004B098444l4434k4762j6257q415k34Q605J7639K6347L4680M3097N2286O2495
59992B259491P2987Q2525R0551R7315J02526J04697J02463R6020Q6541P4663O0509
59981C230288M4787K8738J3002k542j7873l2641m6829o0475p2542q1159q5426
59970B917328q6113q4255q0002p3466o5577n7238m8249l8082k7306j7283q578
59959B331179m95P753J6141K4241L1906L9294M6453N3132N8838O3035O5343O5639
59947B802459O3994O0559N5530M9100M1474L3039K4543J6707R692L229k542o717
59935C151067q344p266m060P43P141J5462K5908L8279N2053O6768Q2244R8429
$$ plain form
59923 3518424 3633526 3765416 3913702 4077092 4252932 4437409 4626309 4815195 4998554
59914 4998554 5169225 5319298 5441626 5530463 5581341 5591409 5560247 5490071 5385044 5250680
59904 5250680 5093647 4921214 4740181 4556240 4374356 4199285 4035267 3885244 3750625
59895 3750625 3631872 3529221 3442876 3372737 3318210 3278460 3252834 3240913 3242274 3256520 3283580
59884 3283580 3323550 3375936 3439222 3511394 3590540 3674535 3760414 3844496 3923065 3992560 4049382
59873 4049382 4090187 4112613 4115425 4098069 4060623 4004310 3931439 3844474 3745367 3636043 3519190
59862 3519190 3398204 3276425 3156642 3041148 2931886 2830455 2738089 2655641 2583484 2521383
59852 2521383 2468520 2423672 2385402 2352214 2322698 2295720 2270593 2247065 2225155 2205165 2187965
$$ packed form
59923C518424J15102J31890J48286J63390J75840J84477J88900J88886J83359
59914D998554J70671J50073J22328Q8837N0878J0068l1162p0176j05027j34364
59904E250680j57033j72433j81033j83941j81884j75071j64018j50023j34619
59895C750625j18753j02651q6345p0139n4527l9750k5626j1921J361J4246K7060
59884C283580L9970N2386O3286P2172P9146Q3995Q5879Q4082P8569O9495N6822
59873D049382M0805K2426K812j7356l7446n6313p2871q6965r9107j09324j16853
59862C519190j20986j21779j19783j15494j09262j01431r2366q2448p2157o2101
59852B521383n2863m4848l8270l3188k9516k6978k5127k3528k1910j9990j7200
$$ plain form
59841 2187965 2175029 2167596 2165509 2166965 2169534 2171323 2171358 2169534 2166707 2164587 2165015 2169139 2177144 2188184
59827 2188184 2200191 2210068 2214809 2212673 2203370 2187465 2166014 2140468 2112334 2082863 2053280 2025019
59815 2025019 1999211 1976043 1955121 1936324 1919752 1905037 1891503 1879266 1869503 1863379 1861184 1862782
59803 1862782 1868335 1878046 1891418 1907264 1924419 1942188 1960097 1977414 1993010 2005813 2015472 2022428
59791 2022428 2027120 2029358 2028880 2026403 2023614 2022110 2022894 2027033 2036112 2051608 2074237 2104430 2143230
59778 2143230 2192182 2252401 2324193 2407708 2503701 2613512 2738430 2879213 3036175 3209319
59768 3209319 3397665 3597571 3801135 3995924 4166350 4296198 4371890 4385889 4338817 4238907
59758 4238907 4099178 3934228 3757967 3582131 3415291 3262641 3126682 3008116 2906503
$$ packed form
59841B187965j2936p433k087J456K569J789L5j824k827k120M28M124Q005J1040
59827B188184J2007R877M741k136r303j5905k1451k5546k8134k9471k9583k8261
59815B025019k5808k3168k0922j8797j6572j4715j3534j2237r763o124k195J598
59803A862782N553R711J3372J5846J7155J7769J7909J7317J5596J2803R659O956
59791B022428M692K238m78k477k789j504P84M139R079J5496K2629L0193L8800
59778B143230M8952O0219P1792Q3515R5993J09811J24918J40783J56962J73144
59768C209319J88346J99906K03564J94789J70426J29848P5692J3999m7072r9910
59758D238907j39729j64950j76261j75836j66840j52650j35959j18566j01613
$$ plain form
59749 2906503 2820752 2749585 2691681 2645597 2609938 2583796 2566906 2559260 2560596 2570209 2587109 2610477
59737 2610477 2640187 2676792 2720708 2771553 2828696 2892394 2963992 3044967 3136114 3237672 3349879
59726 3349879 3473461 3610018 3761900 3931172 4118590 4324055 4548062 4792029 5057039
59717 5057039 5342803 5647971 5970506 6307090 6652585 7000620 7344523 7677560 7993223
59708 7993223 8286522 8555261 8799891 9022449 9226098 9415279 9595195 9770439 9943881
59699 9943881 10116410 10287119 10453629 10612607 10760314 10892862 11006384 11097481 11163695 11203710
59689 11203710 11217452 11206312 11173100 11121550 11055957 10981427 10904010 10830054 10765325 10714872 10683385
59678 10683385 10675144 10693660 10741747 10821919 10936346 11086373 11272401 11494274 11751413 12042317
$$ packed form
59749B906503q5751p1167n7904m6084l5659k6142j6890p646J336R613J6900K3368
59737B610477K9710L6605M3916N0845N7143O3698P1598Q0975R1147J01558J12207
59726C349879J23582J36557J51882J69272J87418K05465K24007K43967K65010
59717E057039K85764L05168L22535L36584L45495L48035L43903L33037L15663
59708G993223K93299K68739K44630K22558K03649J89181J79916J75244J73442
59699I943881J72529J70709J66510J58978J47707J32548J13522R1097O6214M0015
59689A1203710J3742j1140l3212n1550o5593p4530p7417p3956o4729n0453l1487
59678A0683385q241J8516M8087Q0172J14427J50027J86028K21873K57139K90904
$$ plain form
59668 12042317 12363980 12711684 13078970 13457469 13836676 14203904 14544520 14842566 15081802
59659 15081802 15247059 15325724 15309197 15194076 14982656 14682643 14306422 13869970 13391335 12888922
59649 12888922 12380226 11881135 11405154 10962302 10558342 10194783 9869017 9573923 9297599
59640 9297599 9024465 8738105 8425075 8078350 7699041 7295425 6879783 6465008 6062510
59631 6062510 5681244 5327069 5002512 4707476 4440518 4199798 3983431 3789654 3616872
59622 3616872 3463423 3327348 3206595 3099456 3004685 2921194 2847757 2782944 2725296 2673633
59612 2673633 2627347 2586275 2550208 2518623 2490932 2466684 2445338 2426014 2407638 2389194 2369739
59601 2369739 2348417 2324723 2298611 2270218 2239744 2207811 2175597 2144246 2114259 2085720 2058813
$$ packed form
59668A2042317L21663L47704L67286L78499L79207L67228L40616K98046K39236
59659A5081802J65257P8665j6527j15121k11420l00013l76221m36452m78635n02413
59649A2888922n08696m99091m75981m42852m03960l63559l25766k95094k76324
59640I297599k73134k86360l13030l46725l79309m03616m15642m14775m02498
59631F062510l81266l54175l24557k95036k66958k40720k16367j93777j72782
59622C616872j53449j36075j20753j07139r4771q3491p3437o4813n7648n1663
59612B673633m6286m1072l6067l1585k7691k4248k1346j9324j8376j8444j9455
59601B369739k1322k3694k6112k8393l0474l1933l2214l1351k9987k8539k6907
$$ plain form
59590 2058813 2033724 2010312 1988424 1968493 1951292 1936954 1924622 1913213 1902254 1891940 1882617
59579 1882617 1874330 1866691 1859168 1851729 1845190 1840676 1838647 1838629 1839957 1842532 1846856 1853539 1862938 1875159
59565 1875159 1890292 1908610 1930453 1955853 1984447 2015966 2050641 2088863 2130579 2175494 2223919
59554 2223919 2276975 2335675 2400126 2469969 2545358 2627065 2715636 2810932 2912640 3020725 3134915
59543 3134915 3254001 3376407 3501432 3628999 3757343 3881209 3993184 4087215 4160952 4215389
59533 4215389 4253217 4277444 4290331 4292600 4283790 4263685 4233141 4193361 4144900 4087896 4022952 3951422
59521 3951422 3875287 3797232 3720423 3647414 3579405 3517161 3462558 3418563 3387705 3371249 3369971
59510 3369971 3385117 3418246 3470525 3542447 3633924 3744368 3872594 4016552 4172746 4335868
$$ packed form
59590B058813k5089k3412k1888j9931j7201j4338j2332j1409j0959j0314r323
59579A882617q287p639p523p439o539m514k029j8J328K575M324O683R399J2221
59565A875159J5133J8318K1843K5400K8594L1519L4675L8222M1716M4915M8425
59554B223919N3056N8700O4451O9843P5389Q1707Q8571R5296J01708J08085J14190
59543C134915J19086J22406J25025J27567J28344J23866J11975R4031P3737N4437
59533D215389L7828K4227J2887K269q810k0105l0544l9780m8461n7004o4944p1530
59521C951422p6135p8055p6809p3009o8009o2244n4603m3995l0858j6456j278
59510C369971J5146L3129N2279P1922R1477J10444J28226J43958J56194J63122
$$ plain form
59500 4335868 4499275 4655943 4798868 4920876 5014914 5075245 5098492 5083616 5031223 4943194
59490 4943194 4822931 4675721 4508503 4328822 4143565 3958527 3778929 3609684 3454551
59481 3454551 3315248 3191969 3084807 2994255 2920500 2863070 2821490 2795685 2785297 2789094 2805607
59470 2805607 2834129 2874577 2926475 2988561 3059343 3137555 3221739 3309586 3397856 3482902 3561192
59459 3561192 3629495 3684896 3724796 3746964 3749579 3731417 3692235 3633095 3556239 3464467 3360622
59448 3360622 3247538 3128156 3005401 2881881 2759748 2640771 2526338 2417458 2314886
59439 2314886 2219235 2130847 2049618 1975093 1906830 1844606 1788297 1737659 1692270 1651721 1615859
59428 1615859 1584760 1558356 1536219 1517950 1503691 1493884 1488452 1486620 1487670 1491585 1498771 1509607
$$ packed form
59500D335868J63407J56668J42925J22008R4038O0331K3247j4876n2393q8029
59490D943194j20263j47210j67218j79681j85257j85038j79598j69245j55133
59481C454551j39303j23279j07162r0552p3755n7430m1580k5805j0388L797J6513
59470B805607K8522M0448N1898O2086P0782P8212Q4184Q7847Q8270Q5046P8290
59459C561192O8303N5401L9900K2168K615j8162l9182n9140p6856r1772j03845
59448C360622j13084j19382j22755j23520j22133j18977j14433j08880j02572
59439B314886r5651q8388q1229p4525o8263o2224n6309n0638m5389m0549l5862
59428A615859l1099k6404k2137j8269j4259r807n432j832J050L915P186J0836
$$ plain form
59416 1509607 1524506 1543795 1566737 1590640 1611530 1626111 1633352 1634769 1633500 1632716 1634161 1638084 1644825
59403 1644825 1656047 1673579 1696879 1722273 1745132 1762765 1775381 1785018 1794080 1804602 1818151 1835865
59391 1835865 1858427 1886043 1918630 1956068 1998125 2044182 2093420 2145566 2201235 2261214 2325568
59380 2325568 2393799 2465633 2541282 2621042 2705064 2793502 2886555 2984415 3087476 3196493 3312267
59369 3312267 3435517 3567541 3710802 3868204 4041861 4233066 4443260 4674112 4926395
59360 4926395 5199325 5490945 5798172 6116018 6437564 6755526 7063789 7357433 7632167
59351 7632167 7884686 8113429 8318334 8499742 8657715 8792100 8902492 8987784 9045772 9073147
59341 9073147 9065791 9019395 8930309 8796138 8615872 8390027 8121251 7814955 7479282 7124261
$$ packed form
59416A509607J4899J9289K2942K3903K0890J4581P241J417j269p84J445L923O741
59403A644825J1222J7532K3300K5394K2859J7633J2616R637R062J0522J3549J7714
59391A835865K2562K7616L2587L7438M2057M6057M9238N2146N5669N9979O4354
59380B325568O8231P1834P5649P9760Q4022Q8438R3053R7860J03061J09017J15774
59369C312267J23250J32024J43261J57402J73657J91205K10194K30852K52283
59360D926395K72930K91620L07227L17846L21546L17962L08263K93644K74734
59351G632167K52519K28743K04905J81408J57973J34385J10392Q5292N7988K7375
59341I073147p356m6396q9086j34171j80266k25845k68776l06296l35673l55021
$$ plain form
59331 7124261 6760463 6397516 6043060 5702679 5380610 5080142 4803267 4550315 4320291
59322 4320291 4111449 3921517 3747901 3588362 3441614 3306992 3183563 3069829 2964384
59313 2964384 2866453 2775568 2690952 2611612 2537132 2467991 2404790 2347242 2294300 2245338 2200786
59302 2200786 2161311 2126666 2095781 2067913 2043373 2023093 2007790 1997581 1992166 1991329 1995297 2004313
59290 2004313 2017354 2031313 2042023 2046570 2044808 2038971 2032295 2027917 2028270 2034793 2047968 2067666 2093453
59277 2093453 2124824 2161505 2203480 2250442 2301233 2354142 2407661 2460507 2510894 2556337 2594387
59266 2594387 2623257 2641727 2649026 2645114 2630631 2606152 2571869 2528330 2477252 2421146 2362269 2302187
59254 2302187 2242150 2183464 2127424 2075081 2027136 1983935 1945594 1912143 1883528 1859548 1839955
$$ packed form
59331G124261l63798l62947l54456l40381l22069l00468k76875k52952k30024
59322D320291k08842j89932j73616j59539j46748j34622j23429j13734j05445
59313B964384r7931r0885q4616p9340p4480o9141o3201n7548n2942m8962m4552
59302B200786l9475l4645l0885k7868k4540k0280j5303j0209n415q37L968R016
59290B004313J3041J3959J0710M547j762n837o676m378L53O523J3175J9698K5787
59277B093453L1371L6681M1975M6962N0791N2909N3519N2846N0387M5443L8050
59266B594387K8870J8470P299l912j4483k4479l4283m3539n1078n6106n8877o0082
59254B302187o0037n8686n6040n2343m7945m3201l8341l3451k8615k3980j9593
$$ plain form
59243 1839955 1824610 1813358 1805810 1801509 1800272 1802054 1806529 1813215 1822093 1833684 1848335 1865787 1885559
59230 1885559 1907395 1931181 1956876 1984819 2015737 2050048 2087393 2127200 2169551 2215195 2264933
59219 2264933 2319282 2378599 2443206 2513482 2590095 2674165 2767065 2870115 2984566 3111661 3252446
59208 3252446 3407480 3576793 3759956 3955875 4162232 4374902 4587869 4793944 4985875
59199 4985875 5156830 5299959 5408215 5475425 5497732 5473847 5404407 5291958 5141544 4960300
59189 4960300 4755952 4536026 4308361 4081214 3861787 3654679 3461990 3284524 3122650
59180 3122650 2976535 2846212 2731391 2631076 2543761 2468242 2403852 2349628 2303820 2264617
59170 2264617 2230988 2202357 2177934 2156873 2138658 2122601 2107147 2090260 2070459 2047141 2020097
$$ packed form
59243A839955j5345j1252p548m301j237J782M475O686Q878J1591J4651J7452J9772
59230A885559K1836K3786K5695K7943L0918L4311L7345L9807M2351M5644M9738
59219B264933N4349N9317O4607P0276P6613Q4070R2900J03050J14451J27095J40785
59208C252446J55034J69313J83163J95919K06357K12670K12967K06075J91931
59199D985875J70955J43129J08256O7210K2307k3885o9440j12449j50414j81244
59189D960300k04348k19926k27665k27147k19427k07108j92689j77466j61874
59180C122650j46115j30323j14821j00315q7315p5519o4390n4224m5808l9203
59170B264617l3629k8631k4423k1061j8215j6057j5454j6887j9801k3318k7044
$$ plain form
59159 2020097 1989262 1954787 1916910 1875806 1831854 1785890 1738814 1691188 1643574 1596983 1552462
59148 1552462 1510456 1471081 1434845 1402436 1373777 1347798 1323303 1299825 1277743 1257910 1241078
59137 1241078 1227337 1216102 1206860 1199678 1194706 1191513 1189434 1188345 1188545 1190038 1192527 1196097 1201320 1208625
59123 1208625 1217990 1229271 1242410 1257327 1274010 1292640 1313196 1335046 1357484 1380619 1405159
59112 1405159 1431304 1458488 1486266 1514747 1543913 1573149 1601737 1629256 1655124 1678425 1698755
59101 1698755 1716962 1734485 1752249 1770688 1790567 1813063 1838968 1868333 1901044 1937262 1977006
59090 1977006 2019621 2064077 2109746 2156537 2204202 2251825 2298274 2343000 2386032 2427080 2464876
59079 2464876 2497514 2523247 2540761 2548916 2546639 2533274 2508947 2474426 2430517 2377665 2316336 2247942
$$ packed form
59159B020097l0835l4475l7877m1104m3952m5964m7076m7626m7614m6591m4521
59148A552462m2006l9375l6236l2409k8659k5979k4495k3478k2082j9833j6832
59137A241078j3741j1235r242p182m972l193k079j089K00J493K489L570N223P305
59123A208625R365J1281J3139J4917J6683J8630K0556K1850K2438K3135K4540
59112A405159K6145K7184K7778K8481K9166K9236K8588K7519K5868K3301K0330
59101A698755J8207J7523J7764J8439J9879K2496K5905K9365L2711L6218L9744
59090A977006M2615M4456M5669M6791M7665M7623M6449M4726M3032M1048L7796
59079B464876L2638K5733J7514Q155k277j3365k4327l4521m3909n2852o1329o8394
$$ plain form
59067 2247942 2175131 2100712 2026289 1952237 1878991 1807797 1740029 1676289 1616605 1561135 1510173
59056 1510173 1463706 1421455 1383243 1348990 1318473 1291464 1267933 1247607 1229468 1212163 1195015
59045 1195015 1178371 1163030 1149747 1139132 1131451 1126331 1123091 1121571 1122339 1125926 1132184 1140627 1151074
59032 1151074 1163559 1177713 1192535 1206814 1219611 1230336 1238672 1244723 1249231 1253209 1257049 1260057
59020 1260057 1261196 1260277 1258135 1255709 1253375 1251268 1249722 1249078 1249381 1250573 1252692 1255553 1258571 1261276 1263813
59005 1263813 1266554 1269430 1271997 1273940 1275061 1274955 1273168 1269705 1265070 1259929 1255000 1251104 1248827 1248156
58991 1248156 1248785 1250723 1254255 1259329 1265327 1271417 1276829 1280846 1282896 1282683 1279964 1274251 1265090 1252710
58977 1252710 1238178 1222873 1207898 1193870 1181025 1169564 1159939 1152591 1147307 1143257 1139968 1137856
$$ packed form
59067B247942p2811p4419p4423p4052p3246p1194o7768o3740n9684n5470n0962
59056A510173m6467m2251l8212l4253l0517k7009k3531k0326j8139j7305j7148
59045A195015j6644j5341j3283j0615p681n120l240j520P68L587O258Q443J0447
59032A151074J2485J4154J4822J4279J2797J0725Q336O051M508L978L840L008
59020A260057J139r19k142k426k334k107j546o44L03J192K119K861L018K705K537
59005A263813K741K876K567J943J121j06j787l463m635n141m929l896k277o71
58991A248156O29J938L532N074N998O090N412M017K050k13k719n713r161j2380
58977A252710j4532j5305j4975j4028j2845j1461r625p348n284m050l289k112
$$ plain form
58965 1137856 1137381 1138065 1138995 1139970 1141483 1143652 1145944 1148063 1150388 1153331 1156761 1160348 1164099 1168315 1173311
58950 1173311 1179381 1186804 1195704 1205988 1217446 1229759 1242496 1255389 1268606 1282514 1297199 1312419
58938 1312419 1327891 1343387 1358643 1373579 1388608 1404444 1421628 1440459 1461300 1484624 1510748
58927 1510748 1539725 1571410 1605573 1642211 1682003 1726104 1775109 1828477 1885291 1945125 2007586
58916 2007586 2071391 2134831 2197194 2259224 2322227 2387429 2456221 2530370 2611653 2701518 2800981
58905 2800981 2910372 3029215 3156962 3293929 3441138 3599186 3767737 3946098 4133816
58896 4133816 4330778 4537164 4753226 4978501 5211204 5448905 5689765 5932420 6174463
58887 6174463 6411481 6637626 6846636 7032412 7189524 7313814 7402499 7453787 7466833 7441971
$$ packed form
58965A137856m75O84R30R75J513K169K292K119K325K943L430L587L751M216M996
58950A173311O070P423Q900J0284J1458J2313J2737J2893J3217J3908J4685J5220
58938A312419J5472J5496J5256J4936J5029J5836J7184J8831K0841K3324K6124
58927A510748K8977L1685L4163L6638L9792M4101M9005N3368N6814N9834O2461
58916B007586O3805O3440O2363O2030O3003O5202O8792P4149Q1283Q9865R9463
58905B800981J09391J18843J27747J36967J47209J58048J68551J78361J87718
58896D133816J96962K06386K16062K25275K32703K37701K40860K42655K42043
58887F174463K37018K26145K09010J85776J57112J24290Q8685N1288J3046k4862
$$ plain form
58877 7441971 7380461 7283957 7154663 6995928 6812043 6607424 6386489 6154137 5915404 5674366
58867 5674366 5433878 5196496 4964963 4741622 4527964 4324894 4132892 3951828 3781246
58858 3781246 3620911 3470566 3329298 3196004 3070489 2953186 2843785 2741220 2645135 2556108
58848 2556108 2474054 2397695 2326300 2260742 2201913 2149115 2101053 2057539 2019103 1985624 1956636
58837 1956636 1932431 1913505 1899068 1887347 1877406 1869747 1865050 1863237 1863876 1866729 1871755 1879309 1890426
58824 1890426 1906133 1926194 1949202 1974169 2001511 2032319 2067285 2106698 2150787 2199452 2251951
58813 2251951 2307534 2366331 2429203 2496760 2568989 2645941 2728273 2816757 2911563 3012500 3120013
58802 3120013 3235488 3360416 3495598 3641375 3798342 3967403 4149250 4343978 4551031
$$ packed form
58877G441971o1510r6504j29294j58735j83885k04619k20935k32352k38733k41038
58867E674366k40488k37382k31533k23341k13658k03070j92002j81064j70582
58858C781246j60335j50345j41268j33294j25515j17303j09401j02565r6085q9027
58848B556108q2054p6359p1395o5558n8829n2798m8062m3514l8436l3479k8988
58837A956636k4205j8926j4437j1721r941p659m697j813O39K853N026P554J1117
58824A890426J5707K0061K3008K4967K7342L0808L4966L9413M4089M8665N2499
58813B251951N5583N8797O2872O7557P2229P6952Q2332Q8484R4806J00937J07513
58802C120013J15475J24928J35182J45777J56967J69061J81847J94728K07053
$$ plain form
58793 4551031 4769165 4996639 5231752 5472984 5718213 5963909 6205450 6437964 6656294
58784 6656294 6854359 7025478 7163756 7264986 7326421 7346367 7324215 7260476 7156703 7015702
58774 7015702 6841694 6639694 6414627 6171506 5916190 5655039 5393466 5135332 4883783
58765 4883783 4641819 4411690 4194344 3989856 3797982 3618216 3450006 3293222 3147834
58756 3147834 3012885 2886538 2767506 2655884 2552220 2456380 2367731 2285812 2210399 2141425
58746 2141425 2079244 2024344 1976364 1933920 1895842 1862111 1833174 1808921 1788783 1772179 1758284
58735 1758284 1745864 1733909 1722050 1709937 1696798 1682215 1666872 1652015 1638575 1627296 1619029
58724 1619029 1614054 1611418 1609560 1607270 1603532 1596879 1585698 1568952 1546027 1516295 1479609 1437077
$$ packed form
58793D551031K18134K27474K35113K41232K45229K45696K41541K32514K18330
58784F656294J98065J71119J38278J01230O1435J9946k2152o3739j03773j41001
58774G015702j74008k02000k25067k43121k55316k61151k61573k58134k51549
58765D883783k41964k30129k17346k04488j91874j79766j68210j56784j45388
58756C147834j34949j26347j19032j11622j03664r5840q8649q1919p5413o8974
58746B141425o2181n4900m7980m2444l8078l3731k8937k4253k0138j6604j3895
58735A758284j2420j1955j1859j2113j3139j4583j5343j4857j3440j1279q267
58724A619029m975k636j858k290l738o653j1181j6746k2925k9732l6686m2532
$$ plain form
58712 1437077 1390622 1341770 1291366 1240330 1190057 1142044 1097448 1056937 1020582 987991 958838
58701 958838 933104 910693 891163 874220 860121 849244 841553 836744 834538 834423 835518 837022 838437
58688 838437 839018 837502 832883 825119 814721 802149 788107 773948 761156 750614 742651 737311 734154
58675 734154 732363 731570 732220 734738 738910 744465 751541 759956 768800 777510 786709 797040 807656 816726
58661 816726 822880 825304 823075 815747 804455 791259 777366 762809 747677 732621 718158 704453
58649 704453 691894 680993 671571 662887 654768 647898 642800 639239 636868 635758 635958 637049 638547 640453
58635 640453 643117 646746 651220 656239 661546 667004 672461 677624 682353 687063 692424 698547 704964 711489
58621 711489 718487 726112 734055 742474 752345 764245 777507 791372 806281 823171 842034 862213
$$ packed form
58712A437077m6455m8852n0404n1036n0273m8013m4596m0511l6355l2591k9153
58701I58838k5734k2411j9530j6943j4099j0877p691m809k206j15J095J504J415
58688H38437N81j516m619p764j0398j2572j4042j4159j2792j0542p963n340l157
58675G34154j791p93O50K518M172N555P076Q415Q844Q710R199J0331J0616R070
58661H16726O154K424k229p328j1292j3196j3893j4557j5132j5056j4463j3705
58649G04453j2559j0901r422q684q119o870n098l561k371j110K00J091J498J906
58635F40453K664L629M474N019N307N458N457N163M729M710N361O123O417O525
58621G11489O998P625P943Q419R871J1900J3262J3865J4909J6890J8863K0179
$$ plain form
58609 862213 883738 907379 933600 962313 993528 1027390 1063814 1102923 1145740 1193636 1247077
58598 1247077 1305483 1368105 1434405 1503782 1575682 1649849 1725776 1801956 1876215 1946547 2011090
58587 2011090 2067599 2113686 2147502 2167812 2173934 2166309 2146696 2117135 2079044 2033909 1984164 1932412
58575 1932412 1880215 1828559 1778973 1733028 1691023 1652287 1616651 1584589 1556101 1530479 1507238
58564 1507238 1486364 1467786 1451406 1437547 1426450 1417352 1408719 1399144 1387347 1371813 1351403 1326125
58552 1326125 1296505 1262682 1225084 1185425 1145761 1106816 1068357 1030791 995133 961728 930369
58541 930369 901486 875822 853089 832296 813340 796857 782522 768974 755583 742940 731422
58530 731422 720538 709863 699463 689282 679244 669955 662080 655099 648003 641069 635467 631118 626679
$$ packed form
58609H62213K1525K3641K6221K8713L1215L3862L6424L9109M2817M7896N3441
58598A247077N8406O2622O6300O9377P1900P4167P5927P6180P4259P0332O4543
58587B011090N6509M6087L3816K0310O122p625j9613k9561l8091m5135m9745n1752
58575A932412n2197n1656m9586m5945m2005l8736l5636l2062k8488k5622k3241
58564A507238k0874j8578j6380j3859j1097r098q633r575j1797j5534k0410k5278
58552A326125k9620l3823l7598l9659l9664l8945l8459l7566l5658l3405l1359
58541I30369k8883k5664k2733k0793j8956j6483j4335j3548j3391j2643j1518
58530G31422j0884j0675j0400j0181j0038r289p875o981p096o934n602m349m439
$$ plain form
58517 626679 621769 617419 613960 610328 606120 602622 600968 600750 601282 602838 605641 608908 611932 615186 619465
58502 619465 624853 631215 638788 647465 656302 664467 672011 679219 686036 692611 699556 707114 714901 722928
58488 722928 732027 742811 754959 767816 780784 792851 802836 810488 816344 820207 820936 818135 812807
58475 812807 805796 796763 785215 771408 755701 738270 720051 702737 687101 672456 658419 645933
58463 645933 635775 627322 619675 612891 607204 602166 597538 593995 591949 590610 589121 587760 587067 586742
58449 586742 586352 586294 587071 588365 589762 591659 594558 598127 601876 606151 611703 618754 627078 636381 646132
58434 646132 655826 665868 677254 689819 701880 712269 721611 730801 739302 745868 750032 751993 752021
58421 752021 750962 750442 751576 754155 757744 762593 768474 773627 776017 775117 771718 766913 762155 759394 759885
$$ packed form
58517F26679m910m350l459l632m208l498j654k18N32J556K803L267L024L254M279
58502F19465N388O362P573Q677Q837Q165P544P208O817O575O945P558P787Q027
58488G22928R099J0784J2148J2857J2968J2067R985P652N856L863P29k801n328
58475H12807p011r033j1548j3807j5707j7431j8219j7314j5636j4645j4037j2486
58463F45933j0158q453p647o784n687n038m628l543k046j339j489j361o93l25
58449E86742l90n8P77J294J397J897K899L569L749M275N552P051Q324R303R751
58434F46132R694J0042J1386J2565J2061J0389R342R190Q501O566M164J961K8
58421G52021j059n20J134K579L589M849N881N153K390r00l399m805m758k761M91
$$ plain form
58406 759885 763246 768455 775128 783107 791558 799430 806318 812245 817112 820794 823046 823053 820078 814927 809517
58391 809517 804570 799178 793260 788715 786969 786920 786672 786083 786158 787010 787928 788654 789294 789665 789912 791113 794126
58374 794126 798395 802762 806728 810247 813283 816419 820832 826754 833023 838956 845372 852810 860240 866807
58360 866807 873454 881405 890254 899051 908078 918015 928392 938437 948482 959108 969873 980470 992113
58347 992113 1006135 1021967 1037986 1053546 1068706 1082824 1095013 1105335 1114140 1120984 1125556 1128885
58335 1128885 1132249 1135661 1138719 1142080 1146614 1151931 1157157 1162517 1168958 1176947 1186692 1198560 1212187
58322 1212187 1226282 1240364 1255496 1272284 1289779 1307557 1327127 1349649 1373980 1398733 1424485
58311 1424485 1451895 1479280 1504423 1527405 1549375 1569807 1587350 1602294 1615898 1628271 1639149
$$ packed form
58406G59885L361N209O673P979Q451P872O888N927M867L682K252Pk975n151n410
58391H09517m947n392n918m545j746m9k48n89P5Q52R18P26O40L71K47J201L013
58374G94126M269M367L966L519L036L136M413N922O269N933O416P438P430O567
58360H66807O647P951Q849Q797R027R937J0377J0045J0045J0626J0765J0597J1643
58347I92113J4022J5832J6019J5560J5160J4118J2189J0322Q805O844M572L329
58335A128885L364L412L058L361M534N317N226N360O441P989R745J1868J3627
58322A212187J4095J4082J5132J6788J7495J7778J9570K2522K4331K4753K5752
58311A424485K7410K7385K5143K2982K1970K0432J7543J4944J3604J2373J0878
$$ plain form
58300 1639149 1649768 1661674 1674623 1687769 1701894 1718284 1736459 1755257 1775138 1797157 1820760
58289 1820760 1844903 1870327 1898359 1928463 1959298 1991224 2025519 2062176 2100724 2142054 2187108
58278 2187108 2234968 2284573 2336974 2393513 2453265 2514845 2579096 2647205 2717740 2788526 2859844
58267 2859844 2932597 3004846 3073534 3138284 3200197 3258364 3311263 3360453 3409272 3458925 3509233
58256 3509233 3561915 3619420 3681684 3747756 3819346 3898938 3985611 4076776 4172879 4276356 4387179
58245 4387179 4503621 4626354 4757468 4896494 5041553 5193353 5353983 5523261 5700615
58236 5700615 5888793 6090937 6305770 6530769 6768202 7022652 7294512 7581887 7887106
58227 7887106 8215049 8566739 8941195 9342044 9775346 10242427 10742236 11279547 11863206
$$ packed form
58300A639149J0619J1906J2949J3146J4125J6390J8175J8798J9881K2019K3603
58289A820760K4143K5424K8032L0104L0835L1926L4295L6657L8548M1330M5054
58278B187108M7860M9605N2401N6539N9752O1580O4251O8109P0535P0786P1318
58267B859844P2753P2249O8688O4750O1913N8167N2899M9190M8819M9653N0308
58256C509233N2682N7505O2264O6072P1590P9592Q6673R1165R6103J03477J10823
58245D387179J16442J22733J31114J39026J45059J51800J60630J69278J77354
58236E700615J88178K02144K14833K24999K37433K54450K71860K87375L05219
58227G887106L27943L51690L74456M00849M33302M67081M99809N37311N83659
$$ plain form
58218 11863206 12497547 13183561 13927526 14740361 15629723 16601635 17669107 18850416 20160402
58209 20160402 21613634 23235573 25061215 27125119 29465170 32136385 35211176 38770288
58201 38770288 42909202 47753195 53451139 60154556 68017274 77214382 87949655 100459422
58193 100459422 115044019 132101431 152109117 175567640 202922271 234321982 269043722
58186 269043722 304786630 337498584 362261205 374960410 373783017 359698678 335820695
58179 335820695 306176755 274561120 243885240 216049740 192060543 172110664 155628361
58172 155628361 141503399 128557145 116011541 103661271 91720289 80549598 70450970
58165 70450970 61572028 53902996 47336865 41740851 36987446 32950399 29507568 26557601
$$ packed form
58218A1863206O34341O86014P43965Q12835Q89362R71912J067472J181309J309986
58209B0160402J453232J621939J825642K063904K340051K671215L074791L559112
58201C8770288M138914M843993N697944O703417P862718R197108J0735273J2509767
58193A00459422J4584597J7057412K0007686K3458523K7354631L1399711L4721740
58186B69043722L5742908L2711954K4762621J2699205j177393j4084339k3877983
58179C35820695k9643940l1615635l0675880k7835500k3989197j9949879j6482303
58172A55628361j4124962j2946254j2545604j2350270j1940982j1170691j0098628
58165G0450970q878942p669032o566131n596014m753405m037047l442831k949967
$$ plain form
58157 26557601 24022689 21835006 19933217 18272126 16821715 15552954 14433383 13436716
58149 13436716 12546103 11745772 11018119 10350466 9736476 9169321 8640663 8147266 7691217
58140 7691217 7272130 6885260 6527758 6200139 5900767 5625124 5371408 5140782 4931047
58131 4931047 4735561 4549219 4370358 4196599 4024762 3855885 3694876 3543894 3400769
58122 3400769 3264567 3137464 3019970 2909270 2803799 2705052 2613470 2526718 2443431 2364832
58112 2364832 2291374 2221400 2154233 2091109 2032062 1975215 1920064 1868113 1819546 1772654 1727327
58101 1727327 1685662 1648178 1612706 1577955 1545051 1514736 1486241 1459843 1437331 1418832 1402009
58090 1402009 1385350 1369452 1354194 1337550 1318199 1296653 1272865 1245453 1214288 1181302 1147783
$$ packed form
58157B6557601k534912k187683j901789j661091j450411j268761j119571r96667
58149A3436716q90613q00331p27653o67653o13990n67155n28658m93397m56049
58140G691217m19087l86870l57502l27619k99372k75643k53716k30626k09735
58131D931047j95486j86342j78861j73759j71837j68877j61009j50982j43125
58122C400769j36202j27103j17494j10700j05471r8747r1582q6752q3287p8599
58112B364832p3458o9974o7167o3124n9047n6847n5151n1951m8567m6892m5327
58101A727327m1665l7484l5472l4751l2904l0315k8495k6398k2512j8499j6823
58090A402009j6659j5898j5258j6644j9351k1546k3788k7412l1165l2986l3519
$$ plain form
58079 1147783 1113368 1078557 1045548 1015499 987342 960305 935263 912666 891500 871378 853468
58068 853468 838325 824820 812113 800588 790041 779080 767245 755710 745076 734524 723870
58057 723870 714267 705926 697237 687152 676520 666171 655657 644819 634614 625370 616078 606396 597499
58044 597499 589975 582686 574742 566900 560016 553834 548236 543977 541178 538714 536054 534008 532689 530451
58030 530451 526002 519973 513295 505588 496382 486554 477301 468862 461235 454941 450055 445619 440983 436672
58016 436672 433199 430191 427428 425447 424378 423495 422715 423172 425464 428636 431753 435223 439680 444905 450730
58001 450730 457737 466139 475281 485102 496712 510404 524452 537111 548644 560115 571269 580992
57989 580992 589101 596378 603385 610297 617427 625105 633443 642765 653506 665200 676466 686617 696296
$$ packed form
58079A147783l4415l4811l3009l0049k8157k7037k5042k2597k1166k0122j7910
58068H53468j5143j3505j2707j1525j0547j0961j1835j1535j0634j0552j0654
58057G23870r603q341q689j0085j0632j0349j0514j0838j0205r244r292r682q897
58044E97499p524p289p944p842o884o182n598m259k799k464k660k046j319k238
58030E30451m449o029o678p707r206r828r253q439p627o294m886m436m636m311
58016D36672l473l008k763j981j069q83p80M57K292L172L117L470M457N225N825
58001D50730P007Q402R142R821J1610J3692J4048J2659J1533J1471J1154R723
57989E80992Q109P277P007O912P130P678Q338R322J0741J1694J1266J0151R679
$$ plain form
57976 696296 705932 714600 721254 726101 729915 732822 734481 734563 732270 726263 715867 701637 684266 663938
57962 663938 641380 618390 596433 575623 555856 537890 522496 509527 498751 490603 485240 481815
57950 481815 479669 479376 481659 486210 492544 501098 512292 525274 538662 551859 564678 576413 586352
57937 586352 594607 601407 606199 608401 608451 607043 603925 598469 590953 582349 573341 564506 556829 550973 546478
57922 546478 542736 540302 540095 541515 542440 541122 537328 531645 524358 515102 503281 488958 473363 458026
57908 458026 443266 428357 413421 400040 389388 380871 373531 367706 364138 362281 360905 359913 360236
57895 360236 362222 365222 368611 372133 375352 377639 378648 378200 375976 372027 367190 362165 356625 350092
57881 350092 343282 337539 333200 329576 326401 324324 323956 325250 327841 331267 335009 339122 344776 353306
$$ packed form
57976F96296R636Q668O654M847L814K907J659Q2k293o007j0396j4230j7371k0328
57962F63938k2558k2990k1957k0810j9767j7966j5394j2969j0776q148n363l425
57950D81815k146k93K283M551O334Q554J1194J2982J3388J3197J2819J1735R939
57937E86352Q255O800M792K202N0j408l118n456p516q604r008q835p677n856m495
57922E46478l742k434k07J420R25j318l794n683p287r256j1821j4323j5595j5337
57908D58026j4760j4909j4936j3381j0652q517p340n825l568j857j376r92L23
57895C60236J986L000L389L522L219K287J009m48k224l949m837n025n540o533
57881C50092o810n743m339l624l175k077l68J294K591L426L742M113N654Q530
$$ plain form
57867 353306 364650 377375 390221 402902 415386 427219 437871 447206 455272 461901 466639 468904
57855 468904 468334 465224 460470 454772 448056 439954 430657 420986 411755 403295 395332 387181 378452 369822
57841 369822 362738 358107 355683 354846 355337 356888 358932 361248 364248 367988 371491 373820 375352 377188 379577
57826 379577 381581 382091 380662 377568 373536 369198 364518 359110 353264 347918 343394 339092 335057 332740
57812 332740 333235 335608 338108 340398 343282 346753 349684 351489 352954 355303 359210 364734 371478 378913
57798 378913 387145 397142 409564 423679 438177 452613 467159 481284 493719 503585 510681 514877
57786 514877 516230 515520 513681 510704 506014 499760 492729 485015 475836 464793 452339 438895 424456
57773 424456 409252 393925 378803 363767 348983 334960 321731 308844 296356 285014 275166 266326
$$ packed form
57867C53306J1344J2725J2846J2681J2484J1833J0652R335Q066O629M738K265
57855D68904n70l110m754n698o716q102r297r671r231q460p963q151q729q630
57841C69822p084m631k424q37M91J551K044K316L000L740L503K329J532J836K389
57826C79577K004N10j429l094m032m338m680n408n846n346m524m302m035k317
57812C32740M95K373K500K290K884L471K931J805J465K349L907N524O744P435
57798C78913Q232R997J2422J4115J4498J4436J4546J4125J2435R866P096M196
57786E14877J353p10j839k977m690o254p031p714r179j1043j2454j3444j4439
57773D24456j5204j5327j5122j5036j4784j4023j3229j2887j2488j1342r848q840
$$ plain form
57761 266326 258163 251148 245822 242004 239148 236893 234977 233094 231152 229288 227497 225779 224705 225137
57747 225137 227053 229253 230597 231017 231102 231321 232083 234016 237533 242251 247249 251836 255918 259759 263574
57732 263574 267207 270208 272328 273839 275125 276127 276553 276470 276221 275855 275230 274620 274625 275374 276412 277526 279060
57715 279060 281117 283039 284107 284469 285019 286534 289185 292681 296586 300510 304231 307788 311511 315884 321132
57700 321132 326845 332267 337109 341823 347007 352948 359933 368406 378359 389044 399860 411103 423260
57687 423260 436089 449224 463406 480135 500177 523190 548811 577327 609262 645145 685864
57676 685864 732608 786263 847310 916333 994179 1081820 1180750 1293287 1421189 1562945 1711980
57665 1711980 1857075 1984617 2082228 2143049 2168050 2164020 2138975 2099139 2048940 1991626 1929042
$$ packed form
57761B66326q163p015n326l818k856k255j916j883j942j864j791j718j074M32
57747B25137J916K200J344M20Q5K19P62J933L517M718M998M587M082L841L815
57732B63574L633L001K120J511J286J002M26q3k49l66o25o10NP49J038J114J534
57715B79060K057J922J068L62N50J515K651L496L905L924L721L557L723M373N248
57700C21132N713N422M842M714N184N941O985Q473R953J0685J0816J1243J2157
57687D23260J2829J3135J4182J6729K0042K3013K5621K8516L1935L5883M0719
57676F85864M6744N3655O1047O9023P7846Q7641R8930J12537J27902J41756J49035
57665A711980J45095J27542R7611O0821K5001m030k5045l9836n0199n7314o2584
$$ plain form
57654 1929042 1861803 1790340 1715359 1637401 1557115 1476354 1397905 1323513 1253031 1186027 1123254
57643 1123254 1065816 1013824 966811 924781 887840 855280 826101 800186 778117 759889 744645
57632 744645 731613 720631 711701 704665 699487 696361 695308 695963 697967 701461 707058 715345 726393 739839
57618 739839 755475 773582 794557 818486 845478 876093 910771 948985 989750 1033095 1080249
57607 1080249 1132064 1187894 1246257 1305772 1365037 1422342 1476173 1525437 1568531 1602669 1624913
57596 1624913 1633663 1628705 1610334 1579330 1537540 1487545 1431521 1370911 1307236 1242537 1178738 1116816
57584 1116816 1056913 999151 944235 893256 846895 804859 766270 730608 698048 668847 642743
57573 642743 619107 597384 577211 558403 541046 525324 511086 497924 485836 475392 466942 460010
$$ packed form
57654A929042o7239p1463p4981p7958q0286q0761p8449p4392p0482o7004o2773
57643A123254n7438n1992m7013m2030l6941l2560k9179k5915k2069j8228j5244
57632G44645j3032j0982q930p036n178l126j053O55K004L494N597Q287J1048J3446
57618G39839J5636J8107K0975K3929K6992L0615L4678L8214M0765M3345M7154
57607A080249N1815N5830N8363N9515N9265N7305N3831M9264M3094L4138K2244
57596A624913Q750m958j8371l1004m1790m9995n6024o0610o3675o4699o3799o1922
57584A116816n9903n7762n4916n0979m6361m2036l8589l5662l2560k9201k6104
57573F42743k3636k1723k0173j8808j7357j5722j4238j3162j2088j0444q450o932
$$ plain form
57561 460010 453778 447811 442005 436277 430803 426274 423364 422063 421859 422304 422948 423076 422258 421133 420974 422276
57545 422276 424309 426255 428331 431429 435892 441058 445962 450280 454510 459430 465480 472592 480454 488849
57531 488849 497833 507677 518659 530873 544313 559081 575358 593109 612095 632373 654508 678978
57519 678978 705684 734466 765831 800584 838780 879653 922568 967441 1014064 1061577 1108876
57508 1108876 1155022 1198987 1239369 1274721 1303883 1325840 1339514 1343895 1338150 1321676 1294634 1258645
57496 1258645 1216533 1171006 1123758 1075814 1028213 982091 938429 897913 860690 826255 794082
57485 794082 764518 738452 715944 695848 677185 660214 645793 634270 625485 619197 614915 611837
57473 611837 609658 609048 610606 613736 617344 621399 627044 635197 645729 658001 671599 686498 703022
$$ packed form
57561D60010o232n967n806n728n474m529k910j301k04M45O44J28q18j125j59J302
57545D22276K033J946K076L098M463N166M904M318M230M920O050P112P862Q395
57531D88849Q984R844J0982J2214J3440J4768J6277J7751J8986K0278K2135K4470
57519F78978K6706K8782L1365L4753L8196M0873M2915M4873M6623M7513M7299
57508A108876M6146M3965M0382L5352K9162K1957J3674M381n745j6474k7042l5989
57496A258645m2112m5527m7248m7944m7601m6122m3662m0516l7223l4435l2173
57485G94082k9564k6066k2508k0096j8663j6971j4421j1523q785o288m282l078
57473F11837k179o10J558L130L608M055N645Q153J0532J2272J3598J4899J6524
$$ plain form
57460 703022 721776 743168 766946 792539 819924 849817 883008 919702 959483 1001584 1045146
57449 1045146 1089441 1133887 1177755 1219938 1258985 1293140 1320325 1338577 1346871 1345303 1334282 1313967
57437 1313967 1284856 1248495 1207036 1162234 1115169 1066686 1017676 969158 922418 878819 839013
57426 839013 802655 769287 739148 712505 688592 666054 644483 624718 607554 592777 579673
57415 579673 567880 557402 548247 540446 534097 529059 524712 520394 516055 512245 509376 507153 504914 502491
57401 502491 500443 499330 499061 499304 500169 501897 504001 505527 506326 507356 509353 511866 514004 515551 516861
57386 516861 518215 519873 522247 525381 528628 531508 534499 538367 543066 547990 552957 558100 563050 567185
57372 567185 570730 574788 580062 586071 591743 596347 599901 603181 607345 612962 619362 625361 630576 635550
$$ packed form
57460G03022J8754K1392K3778K5593K7385K9893L3191L6694L9781M2101M3562
57449A045146M4295M4446M3868M2183L9047L4155K7185J8252Q294j568j1021k0315
57437A313967k9111l6361m1459m4802m7065m8483m9010m8518m6740m3599l9806
57426H39013l6358l3368l0139k6643k3913k2538k1571j9765j7164j4777j3104
57415E79673j1793j0478r155p801o349n038m347m318m339l810k869k223k239k423
57401E02491k048j113k69K43Q65J728K104J526P99J030J997K513K138J547J310
57386E16861J354J658K374L134L247K880K991L868M699M924M967N143M950M135
57372E67185L545M058N274O009N672M604L554L280M164N617O400N999N215M974
$$ plain form
57358 635550 640734 645960 650978 655838 660636 665391 670339 675908 682296 689377 696962 704749 712157 718751
57344 718751 724895 731406 738561 745933 753227 760705 768674 777090 785783 794617 803310 811561 819481 827491
57330 827491 835707 843925 852249 861226 871150 881599 891887 901645 910955 920254 930176 941106 952834
57317 952834 964956 977471 990577 1004021 1017253 1030188 1043216 1056449 1069609 1082718 1096263
57306 1096263 1110521 1125284 1140406 1156063 1172333 1189070 1206343 1224404 1243128 1262127 1281533
57295 1281533 1301926 1323304 1344874 1366206 1387817 1410243 1433239 1456478 1480299 1505141 1530690
57284 1530690 1556226 1581457 1606465 1631172 1655366 1678877 1701235 1721542 1739191 1754414 1767649
57273 1767649 1778715 1787214 1793434 1798200 1802027 1805035 1807582 1810373 1813924 1818421 1824092 1831200 1839602 1848775
$$ packed form
57358F35550N184N226N018M860M798M755M948N569O388P081P585P787P408O594
57344G18751O144O511P155P372P294P478P969Q416Q693Q834Q693Q251P920Q010
57330H27491Q216Q218Q324Q977R924J0449J0288R758R310R299R922J0930J1728
57317I52834J2122J2515J3106J3444J3232J2935J3028J3233J3160J3109J3545
57306A096263J4258J4763J5122J5657J6270J6737J7273J8061J8724J8999J9406
57295A281533K0393K1378K1570K1332K1611K2426K2996K3239K3821K4842K5549
57284A530690K5536K5231K5008K4707K4194K3511K2358K0307J7649J5223J3235
57273A767649J1066Q499O220M766L827L008K547K791L551M497N671P108Q402R173
$$ plain form
57259 1848775 1858454 1868928 1880526 1893068 1906028 1919149 1932722 1947211 1962739 1979081 1996205
57248 1996205 2014482 2034071 2054270 2073968 2092698 2110863 2128980 2147339 2166415 2186841 2208560
57237 2208560 2230567 2251921 2272595 2293031 2313489 2334342 2356371 2379967 2404310 2428056 2450668
57226 2450668 2472501 2493900 2514999 2536289 2558478 2581618 2604958 2627816 2650079 2671747 2692673
57215 2692673 2713041 2733559 2754749 2776393 2798036 2819818 2842414 2866271 2891130 2916295 2941113
57204 2941113 2965245 2988673 3011545 3033996 3056078 3077851 3099515 3121416 3143854 3166742 3189444
57193 3189444 3211177 3231755 3251766 3271772 3291444 3309839 3326562 3342286 3357961 3373845 3389643
57182 3389643 3405351 3421385 3437802 3453990 3469540 3485093 3501712 3519537 3537668 3555399 3572850
$$ packed form
57259A848775R679J0474J1598J2542J2960J3121J3573J4489J5528J6342J7124
57248A996205J8277J9589K0199J9698J8730J8165J8117J8359J9076K0426K1719
57237B208560K2007K1354K0674K0436K0458K0853K2029K3596K4343K3746K2612
57226B450668K1833K1399K1099K1290K2189K3140K3340K2858K2263K1668K0926
57215B692673K0368K0518K1190K1644K1643K1782K2596K3857K4859K5165K4818
57204B941113K4132K3428K2872K2451K2082K1773K1664K1901K2438K2888K2702
57193C189444K1733K0578K0011K0006J9672J8395J6723J5724J5675J5884J5798
57182C389643J5708J6034J6417J6188J5550J5553J6619J7825J8131J7731J7451
$$ plain form
57171 3572850 3590153 3606792 3622390 3637604 3653410 3669772 3685740 3700751 3714977 3728437 3740677
57160 3740677 3751619 3761914 3772005 3781398 3789298 3795526 3800405 3804132 3806707 3808199 3808677 3808025 3806137 3803145
57146 3803145 3799375 3795304 3791662 3789222 3788293 3788786 3790868 3795086 3801670 3810284 3820842 3834037 3850628 3870570
57132 3870570 3893236 3918027 3944270 3970966 3997385 4023777 4050958 4079378 4109096 4140596 4175041
57121 4175041 4213694 4257447 4306913 4362535 4424521 4492955 4568082 4650470 4741083 4841461 4953728
57110 4953728 5080271 5223614 5386869 5574172 5790558 6041677 6333999 6675363 7075485
57101 7075485 7546471 8103280 8763554 9546864 10474332 11568813 12854459 14354948 16091534
57092 16091534 18082015 20340067 22874011 25685196 28766195 32097902 35645071 39350815
$$ packed form
57171C572850J7303J6639J5598J5214J5806J6362J5968J5011J4226J3460J2240
57160C740677J0942J0295J0091R393P900O228M879L727K575J492M78o52j888k992
57146C803145l770m071l642k440r29M93K082M218O584Q614J0558J3195J6591J9942
57132C870570K2666K4791K6243K6696K6419K6392K7181K8420K9718L1500L4445
57121D175041L8653M3753M9466N5622O1986O8434P5127Q2388R0613J00378J12267
57110D953728J26543J43343J63255J87303K16386K51119K92322L41364M00122
57101G075485M70986N56809O60274P83310R27468J094481J285646J500489J736586
57092A6091534J990481K258052K533944K811185L080999L331707L547169L705744
$$ plain form
57084 39350815 43130241 46863380 50392056 53529818 56089385 57918816 58929220 59102521
57076 59102521 58480837 57146937 55204624 52764028 49933347 46815784 43508859 40104008
57068 40104008 36685698 33329710 30100525 27048872 24210866 21608679 19251791 17138646
57060 17138646 15259218 13598042 12136631 10855182 9734133 8755261 7901633 7157137
57052 7157137 6506845 5937821 5439103 5000981 4614839 4273527 3971087 3701978 3461119
57043 3461119 3244644 3049942 2874783 2716845 2574020 2444482 2326367 2217917 2118055 2026288
57033 2026288 1942044 1864720 1794341 1731409 1675965 1627508 1585969 1552088 1526672 1510259 1503742
57022 1503742 1508750 1527432 1562714 1618367 1696336 1791460 1888435 1965180 2000970 1984087 1915300
$$ packed form
57084C9350815L779426L733139L528676L137762K559567J829431J010404J73301
57076E9102521o21684j333900j942313k440596k830681l117563l306925l404851
57068D0104008l418310l355988l229185l051653k838006k602187k356888k113145
57060A7138646j879428j661176j461411j281449j121049r78872q53628p44496
57052G157137o50292n69024m98718m38122l86142l41312l02440k69109k40859
57043C461119k16475j94702j75159j57938j42825j29538j18115j08450r9862r1767
57033B026288q4244p7324p0379o2932n5444m8457m1539l3881k5416j6413o517
57022A503742N008J8682L5282N5653P7969R5124R6975P6745L5790j6883o8787
$$ plain form
57011 1915300 1806597 1675984 1540637 1412046 1295513 1192599 1103365 1027114 962447 907469
57001 907469 860187 819001 783062 752004 725249 701888 681353 663682 648833 636164 624961
56990 624961 615098 606787 600114 595251 592728 592935 595496 599414 603454 605975 604888 598609 587093 571609
56976 571609 553678 534663 515968 498842 483888 471225 461081 453764 449089 446419 445431 446454 449917
56963 449917 455791 463709 473369 484740 498047 513500 530762 548484 564436 576065 581056 577947
56951 577947 566927 550155 530881 511838 494306 478429 464115 451624 441542 434283 429621 426834
56939 426834 425448 425727 428339 433764 442231 454054 469658 489161 511909 536148 558873 576209 584551
56926 584551 581912 568652 547242 521224 493780 466705 440637 416147 394192 375342 359130 344655
$$ packed form
57011A915300j08703j30613j35347j28591j16533j02914q9234p6251o4667n4978
57001I07469m7282m1186l5939l1058k6755k3361k0535j7671j4849j2669j1203
56990F24961r863q311o673m863k523K07K561L918M040K521j087o279j1516j5484
56976E71609j7931j9015j8695j7126j4954j2663j0144p317m675k670r88J023L463
56963D49917N874P918R660J1371J3307J5453J7262J7722J5952J1629M991l109
56951E77947j1020j6772j9274j9043j7532j5877j4314j2491j0082p259m662k787
56939D26834j386K79K612N425Q467J1823J5604J9503K2748K4239K2725J7336Q342
56926E84551k639j3260k1410k6018k7444k7075k6068k4490k1955j8850j6212j4475
$$ plain form
56914 344655 331612 320268 310644 302266 294730 288056 282375 277597 273480 269833 266651 264199 262869 262741
56900 262741 263340 264022 264538 265095 266131 268241 272104 277998 285489 293930 303233 313846 326041 339627
56886 339627 354223 369228 383321 394415 400548 400891 395956 387075 375783 363497 351450 340757
56874 340757 332286 326369 322773 321174 321591 324229 329106 336146 345646 358366 375168 396726 423534
56861 423534 455716 492414 531201 568134 598639 618843 626616 621801 605914 581892 553692 525212
56849 525212 498990 476082 457158 443094 434227 429814 429044 432294 440718 454886 474679 500427 533267
56836 533267 574088 622737 678199 738432 799116 853035 891796 909037 902721 875262 832021 779343
56824 779343 722992 667459 616040 571052 533783 504406 482189 466098 455502 450562 451855 459525
$$ packed form
56914C44655j3043j1344r624q378p536o674n681m778m117l647l182k452j330j28
56900B62741N99O82N16N57J036K110L863N894P491Q441R303J0613J2195J3586
56886C39627J4596J5005J4093J1094O133L43m935q881j1292j2286j2047j0693
56874C40757q471n917l596j599M17K638M877P040R500J2720J6802K1558K6808
56861D23534L2182L6698L8787L6933L0505K0204P773m815j5887k4022k8200k8480
56849E25212k6222k2908j8924j4064q867m413p70L250Q424J4168J9793K5748L2840
56836E33267M0821M8649N5462O0233O0684N3919L8761J7241o316k7459m3241n2678
56824G79343n6351n5533n1419m4988l7269k9377k2217j6091j0596m940J293P670
$$ plain form
56812 459525 473026 491914 516682 548297 586807 630442 675649 717338 749277 765476 762494 740963
56800 740963 705052 660502 612718 565676 521660 481767 446743 417401 394309 377296 365475
56789 365475 357631 352716 350339 351029 355877 365667 380382 399466 422124 446871 470791 489739 499778
56776 499778 498836 487324 467504 442363 414770 387072 360876 337081 316190 298572 284215 272335
56764 272335 261697 251586 242203 233907 226492 219558 213258 208187 204628 202367 201065 200253 199061 196622
56750 196622 193057 189578 187284 186105 185101 183519 181343 179070 177263 176237 175946 176102 176406 176605 176417
56735 176417 175613 174314 173079 172596 173258 174879 176759 178163 178950 179610 180500 181248 181257 180644 180239 180595 181400 181913
56717 181913 181723 180983 180184 179771 179746 179652 179170 178595 178378 178316 177709 176387 174948 173840 172719 171102 169287 168149
$$ packed form
56812D59525J3501J8888K4768L1615L8510M3635M5207M1689L1939J6199k982k1531
56800G40963l5911m4550m7784m7042m4016l9893l5024k9342k3092j7013j1821
56789C65475p844m915k377O90M848R790J4715J9084K2658K4747K3920J8948J0039
56776D99778r42j1512j9820k5141k7593k7698k6196k3795k0891j7618j4357j1880
56764B72335j0638j0111r383q296p415o934o300n071l559k261j302q12j192k439
56750A96622l565l479k294j179j004j582k176k273j807j026k91J56L04J99j88
56735A76417q04j299j235m83O62J621J880J404P87O60Q90P48Ro13m05L56Q05N13
56717A81913j90p40p99m13k5r4m82n75k17o2o07j322j439j108j121j617j815j138
$$ plain form
56699 168149 168166 168977 169844 170306 170437 170565 170801 170859 170422 169604 168799 168195 167723 167457 167743 168831 170658 172925
56681 172925 175142 176702 177330 177464 177756 178190 178173 177542 176940 177057 177975 179394 180979 182357 183337 184365 186149
56664 186149 188549 190445 191162 191386 192174 193619 195071 196173 196897 196965 196113 194833 194088 194225 194712 194928 194671
56647 194671 193896 192552 190809 189004 187246 185452 183820 182828 182593 182571 182025 180566 178248 175459 172865 171149
56631 171149 170574 170826 171258 171232 170435 169156 168141 167880 168084 168186 168139 168286 168544 168353 167533 166580 165889 165258 164510
56612 164510 164069 164320 164776 164556 163578 162616 162112 161615 160642 159552 159023 158993 158716 157813 156737 156111 156016 156205 156688
56593 156688 157815 159871 162783 166065 168927 170685 171346 171654 172314 173312 174253 175055 175897 176682 177159 177599 178750
56576 178750 180941 183683 186340 188769 191070 193176 195038 196897 199041 201562 204612 208605 213830 220079
$$ packed form
56699A68149J7Q11Q67M62J31J28K36N8m37q18q05o04m72k66K86J088J827K267
56681A72925K217J560O28J34K92M34j7o31o02J17R18J419J585J378R80J028J784
56664A86149K400J896P17K24P88J445J452J102P24O8q52j280p45J37M87K16k57
56647A94671p75j344j743j805j758j794j632r92k35k2n46j459k318k789k594j716
56631A71149n75K52M32k6p97j279j015k61K04J02m7J47K58j91q20r53o91o31p48
56612A64510m41K51M56k20r78r62n04m97r73j090n29l0k77r03j076o26r5J89M83
56593A56688J127K056K912L282K862J758O61L08O60R98R41Q02Q42P85M77M40J151
56576A78750K191K742K657K429K301K106J862J859K144K521L050L993N225O249
$$ plain form
56562 220079 226960 234315 242055 249863 257507 265266 273554 282217 290591 298269 305423 312293 318690 324146
56548 324146 328333 331158 332490 332008 329488 325277 320286 315245 310020 303974 296937 289385 281565 273046
56534 273046 263506 253551 244273 236215 229209 222957 217298 211990 206808 201894 197651 194231 191420 189013
56520 189013 186959 185094 183141 181058 179149 177667 176492 175398 174450 173929 173893 174036 174059 174048 174234 174403 173904
56503 173904 172459 170687 169415 168751 168302 168103 168538 169343 169504 168522 167109 166226 165994 166019 166184 166512 166701 166440
56485 166440 165916 165446 164927 164242 163864 164375 165587 166840 167976 169329 170893 172278 173433 174659 175909 176812
56469 176812 177530 178803 180872 183059 184755 186208 187861 189442 190273 190268 190091 190406 191326 192596 193983 195338
56453 195338 196422 196907 196721 196282 196165 196459 196792 197049 197648 198818 200025 200585 200543 200442 200426 200141 199359 198141
$$ packed form
56562B20079O881P355P740P808P644P759Q288Q663Q374P678P154O870O397N456
56548C24146M187K825J332m82k520m211m991n041n225o046p037p552p820q519
56534B73046r540r955r278q058p006o252n659n308n182m914m243l420k811k407
56520A89013k054j865j953k083j909j482j175j094r48n21l6J43K3j1J86J69m99
56503A73904j445j772j272o64m49j99M35Q05J61r82j413q83k32K5J65L28J89k61
56485A66440n24m70n19o85l78N11J212J253J136J353J564J385J155J226J250R03
56469A76812P18J273K069K187J696J453J653J581Q31nj77L15R20J270J387J355
56453A95338J084M85j86m39j17K94L33K57N99J170J207N60m2j01j6k85p82j218
$$ plain form
56435 198141 196538 194733 193353 192931 193014 192480 190920 189100 187850 187110 186367 185481 184659 183960 183275 182663 182386
56418 182386 182636 183266 183791 183820 183660 184199 185818 187604 188254 187647 186858 186618 186502 185911 185151 185090 186133 187922
56400 187922 189758 191038 191573 191774 192311 193423 194765 196048 197435 199114 200813 202014 202488 202463 202492 203122
56384 203122 204337 205268 204929 203447 202141 202203 203608 205529 207274 208517 209037 208794 208170 207764 207893 208415 208931
56367 208931 209080 208810 208492 208576 209080 209601 209794 209599 208995 207982 206913 206418 206760 207530 208221 208859 209867 211579
56349 211579 214042 217098 220439 223707 226667 229219 231359 233333 235641 238474 241206 242943 243630 244113 245025
56334 245025 246147 247055 247796 248566 249182 249333 249175 249302 250208 251896 253907 255741 257410 259469 262174 264803
56318 264803 266413 267199 268362 270419 272410 273180 272841 272490 272934 274202 275930 277661 278953 279653 280012 280245
$$ packed form
56435A98141j603j805j380m22Q3n34j560j820j250p40p43q86q22o99o85o12k77
56418A82386K50O30N25K9j60N39J619J786O50o07p89k40j16n91p60o1J043J789
56400A87922J836J280N35K01N37J112J342J283J387J679J699J201M74k5K9O30
56384B03122J215R31l39j482j306O2J405J921J745J243N20k43o24m06J29N22N16
56367B08931J49k70l18Q4N04N21J93j95o04j013j069m95L42P70O91O38J008J712
56349B11579K463L056L341L268K960K552K140J974K308K833K732J737O87M83R12
56334B45025J122R08P41P70O16J51j58J27R06J688K011J834J669K059K705K629
56318B64803J610P86J163K057J991P70l39l51M44J268J728J731J292P00L59K33
$$ plain form
56302 280245 280167 279535 278555 277730 277329 277273 277466 278032 279225 281119 283291 284919 285497 285491 285943 287329 289061 290125
56284 290125 289986 288919 287863 287926 289568 292179 294729 296790 298550 300033 301015 301669 302546 303797 305003 306009
56268 306009 307265 309123 311363 313614 315744 317690 319483 321544 324320 327475 330093 331907 333660 336081
56254 336081 339148 342530 346011 349291 352100 354747 357797 361111 364085 366920 370574 375222 379955 384390
56240 384390 389216 394509 398948 401743 404190 408007 412970 417398 420331 422074 423138 423853 424651 425738 426684
56225 426684 427122 427434 428009 428432 428243 427926 428166 428694 428858 428845 429255 429939 430371 430825 432046 433994 435979 437845
56207 437845 440018 442549 445156 448018 451579 455621 459466 462930 466201 468973 470766 472003 473807 476648
56193 476648 480042 483492 486941 490389 493883 497779 502213 506492 509816 512414 515147 518304 521728 525758
$$ packed form
56302B80245p8o32r80q25m01n6J93N66J193J894K172J628N78oM52J386J732J064
56284B90125j39j067j056O3J642K611K550K061J760J483R82O54Q77J251J206J006
56268C06009J256J858K240K251K130J946J793K061K776L155K618J814J753K421
56254C36081L067L382L481L280K809K647L050L314K974K835L654M648M733M435
56240C84390M826N293M439K795K447L817M963M428K933J743J064P15P98J087R46
56225D26684M38L12N75M23j89l17K40N28J64j3M10O84M32M54J221J948J985J866
56207D37845K173K531K607K862L561M042L845L464L271K772J793J237J804K841
56193D76648L394L450L449L448L494L896M434M279L324K598K733L157L424M030
$$ plain form
56179 525758 530926 536878 542768 548739 555867 564575 574131 583851 593776 604035 614531 625444 637196
56166 637196 649776 662876 676715 691858 708228 725214 742872 762057 783299 806516 831974
56155 831974 860589 893077 929719 971230 1019057 1074600 1138895 1213238 1299442 1399425 1515434
56144 1515434 1650776 1809323 1993743 2204357 2438940 2691836 2952577 3206606 3439060
56135 3439060 3639130 3802613 3932486 4037686 4129541 4216773 4301865 4380590 4444267 4483581
56125 4483581 4492933 4473309 4431623 4377122 4317376 4255372 4187872 4105958 3998564 3857261 3679223
56114 3679223 3467689 3231289 2982480 2734491 2498147 2280784 2086907 1918492 1774892
56105 1774892 1653804 1552788 1469460 1400902 1344130 1297154 1258616 1226821 1200264 1178755 1162562
$$ packed form
56179E25758N168N952N890N971P128Q708R556R720R925J0259J0496J0913J1752
56166F37196J2580J3100J3839J5143J6370J6986J7658J9185K1242K3217K5458
56155H31974K8615L2488L6642M1511M7827N5543O4295P4343Q6204R9983J16009
56144A515434J35342J58547J84420K10614K34583K52896K60741K54029K32454
56135C439060K00070J63483J29873J05200R1855Q7232Q5092P8725O3677L9314
56125D483581R352j9624m1686n4501n9746o2004o7500q1914j07394j41303j78038
56114C679223k11534k36400k48809k47989k36344k17363j93877j68415j43600
56105A774892j21088j01016q3328o8558n6772m6976l8538l1795k6557k1509j6193
$$ plain form
56094 1162562 1150565 1140701 1132242 1126169 1123145 1122442 1123083 1124760 1127443 1131217 1136581 1143672 1151158 1157233
56080 1157233 1161793 1166387 1171973 1178176 1184760 1192129 1200032 1207314 1213554 1219724 1226881 1235312 1245128 1256351
56066 1256351 1268245 1279950 1291957 1305545 1320675 1335981 1351002 1366765 1383944 1402165 1421434
56055 1421434 1442377 1464569 1486384 1507144 1527886 1549513 1571806 1594716 1618855 1644143 1669711
56044 1669711 1695736 1723617 1753702 1784659 1815768 1848009 1882135 1917508 1953638 1991067 2029863
56033 2029863 2069033 2108362 2149121 2192119 2236787 2282981 2331814 2383743 2437653 2492801 2549966
56022 2549966 2609743 2671485 2734829 2800546 2869019 2939613 3012386 3088561 3168563 3251456 3336971
56011 3336971 3426169 3519475 3616255 3716997 3823563 3936572 4054866 4178156 4307716 4443907
$$ packed form
56094A162562j1997r864q459o073l024p03O41J677K683L774N364P091P486O075
56080A157233M560M594N586O203O584P369P903P282O240O170P157Q431R816J1223
56066A256351J1894J1705J2007J3588J5130J5306J5021J5763J7179J8221J9269
56055A421434K0943K2192K1815K0760K0742K1627K2293K2910K4139K5288K5568
56044A669711K6025K7881L0085L0957L1109L2241L4126L5373L6130L7429L8796
56033B029863L9170L9329M0759M2998M4668M6194M8833N1929N3910N5148N7165
56022B549966N9777O1742O3344O5717O8473P0594P2773P6175Q0002Q2893Q5515
56011C336971Q9198R3306R6780J00742J06566J13009J18294J23290J29560J36191
$$ plain form
56001 4443907 4585843 4734069 4890535 5055248 5226310 5404078 5591702 5790622 5999423
55992 5999423 6218423 6451331 6700760 6966155 7247876 7549106 7871886 8215870 8583175
55983 8583175 8979876 9410245 9874211 10373054 10912704 11498700 12133256 12820634 13570196
55974 13570196 14390912 15288624 16272510 17358575 18563183 19900002 21388114 23056957
55966 23056957 24939413 27068728 29489171 32263753 35468051 39188020 43532795 48640609
55958 48640609 54663385 61754462 70079711 79832045 91234226 104554423 120141575 138435280
55950 138435280 159929639 185123457 214398191 247617386 283401858 318543763 348290581
55943 348290581 367726739 373565031 365268757 344944572 316296656 283351602 249511477
$$ packed form
56001D443907J41936J48226J56466J64713J71062J77768J87624J98920K08801
55992E999423K19000K32908K49429K65395K81721L01230L22780L43984L67305
55983H583175L96701M30369M63966M98843N39650N85996O34556O87378P49562
55974A3570196Q20716Q97712R83886J086065J204608J336819J488112J668843
55966B3056957J882456K129315K420443K774582L204298L719969M344775N107814
55958D8640609O022776P091077Q325249R752334J1402181J3320197J5587152J8293705
55950A38435280K1494359K5193818K9274734L3219195L5784472L5141905K9746818
55943C48290581J9436158N838292q296274k0324185k8647916l2945054l3840125
$$ plain form
55936 249511477 217132570 187552578 161352353 138635496 119222728 102779431 88914981
55929 88914981 77248401 67430686 59148697 52134651 46171534 41082211 36716797 32952554
55921 32952554 29694663 26865964 24397491 22231439 20325324 18645318 17158488 15835525
55913 15835525 14655592 13602434 12658748 11808540 11041097 10347888 9718506 9143445 8617618
55904 8617618 8137178 7695731 7287086 6908733 6559057 6233992 5929777 5646116 5383100
55895 5383100 5137568 4905872 4687740 4484023 4292990 4112242 3942192 3784243 3637263
55886 3637263 3498931 3368897 3247656 3133992 3026517 2926302 2835105 2752268 2676063 2606878
55876 2606878 2546249 2493414 2444927 2396743 2344840 2285374 2216917 2142072 2065186 1989274 1916321
$$ packed form
55936B49511477l2378907k9579992k6200225k2716857j9412768j6443297j3864450
55929H8914981j1666580r817715q281989p014046n963117n089323m365414l764243
55921C2952554l257891k828699k468473k166052j906115j680006j486830j322963
55913A5835525j179933j053158r43686q50208p67443o93209o29382n75061n25827
55904H617618m80440m41447m08645l78353l49676l25065l04215k83661k63016
55895E383100k45532k31696k18132k03717j91033j80748j70050j57949j46980
55886C637263j38332j30034j21241j13664j07475j00215r1197q2837p6205o9185
55876B606878o0629n2835m8487m8184n1903n9466o8457p4845p6886p5912p2953
$$ plain form
55865 1916321 1848689 1787845 1732691 1681137 1632402 1586198 1541135 1496033 1451815 1410165 1371217
55854 1371217 1334288 1299770 1268454 1239927 1213330 1188645 1165558 1142190 1116920 1090606 1065179
55843 1065179 1040970 1017089 993546 971072 949557 928456 908185 889575 872620 857179 844065
55832 844065 833928 825881 818770 812949 809321 807567 806959 807964 811218 815716 819792 823207 826501 829004
55818 829004 829367 827477 823997 818517 809954 798402 784831 769339 751473 731898 712000 692028 671418
55805 671418 650749 631641 614739 599422 585456 573356 563092 553932 545744 539044 533583 528208
55793 528208 522368 516774 512522 510532 511736 516710 525060 535858 548230 560497 569345 571410 565759
55780 565759 553894 537791 519269 500716 484533 471475 460803 452201 446370 443630 443102 443360 442914
$$ packed form
55865A916321o7632o0844n5154n1554m8735m6204m5063m5102m4218m1650l8948
55854A371217l6929l4518l1316k8527k6597k4685k3087k3368k5270k6314k5427
55843A065179k4209k3881k3543k2474k1515k1101k0271j8610j6955j5441j3114
55832H44065j0137q047p111n821l628j754o08J005L254M498M076L415L294K503
55818H29004L63j890l480n480q563j1552j3571j5492j7866j9575j9898j9972k0610
55805F71418k0669j9108j6902j5317j3966j2100j0264r160q188o700n461n375
55793E28208n840n594m252j990J204M974Q350J0798J2372J2267Q848K065n651
55780E65759j1865j6103j8522j8553j6183j3058j0672q602n831k740n28K58m46
$$ plain form
55767 442914 440146 434055 425285 415459 405473 395329 385380 376429 368602 361314 354447 348383 342852 336929
55753 336929 330308 323443 316274 307991 298276 287784 277205 266917 257605 250048 244034 238555 233275
55740 233275 228726 224863 220742 216093 212040 209625 208569 208029 207695 207527 207241 206680 206101 205531 204366 202059
55724 202059 198716 194693 190129 185246 180579 176539 173210 170781 169627 169646 170046 170110 169824 169539 169461 169640 170047
55707 170047 170445 170585 170640 171074 171949 172768 173017 172492 171072 168717 165762 162806 160274 158392 157393 157259 157454
55690 157454 157538 157872 159051 160837 162446 163819 165702 168428 171462 174343 177270 180511 183960 187557 191507
55675 191507 195774 199984 204036 208262 212702 216761 219797 221578 222000 220887 218313 214673 210261 205189
55661 205189 199769 194479 189476 184634 180188 176777 174718 173689 173284 173422 174202 175759 178246 181431 184365
$$ packed form
55767D42914k768o091q770r826r986j0144r949q951p827p288o867o064n531n923
55753C36929o621o865p169q283r715j0492j0579j0288r312p557o014n479n280
55740B33275m549l863m121m649m053k415j056n40l34j68k86n61n79n70j165k307
55724B02059l343m023m564m883m667m040l329k429j154J9M00O4k86k85p8J79M07
55707A70047L98J40N5M34Q75Q19K49n25j420k355k955k956k532j882r99j34J95
55690A57454Q4L34J179J786J609J373J883K726L034K881K927L241L449L597L950
55675A91507M267M210M052M226M440M059L036J781M22j113k574l640m412n072
55661B05189n420n290n003m842m446l411k059j029m05J38P80J557K487L185K934
$$ plain form
55646 184365 186114 186846 187628 189129 191139 193353 195844 198593 201205 203327 204831 205486 205049 203756 202121
55631 202121 200148 197382 193822 190088 186597 183229 179938 177003 174464 171920 169047 165755 161926 157746
55617 157746 154230 152389 151661 150114 146530 141396 135599 129319 122747 116802 112182 108347 104289 99881
55603 99881 95822 92675 90588 89535 89181 88793 87840 86468 85057 83657 82171 80697 79309 77930 76717
55588 76717 76087 75924 75282 73319 70158 66470 62726 59323 56865 55669 55279 54986 54500 53743 52533 51095
55572 51095 50408 51263 53181 54899 55786 56140 56258 55953 55080 53983 53217 53126 53738 54711 55397 55241 54280 53153
55554 53153 52589 52895 53827 54859 55706 56655 58190 60253 62169 63356 63806 63739 63130 61911 60367 59050 58363
55537 58363 58314 58554 58576 58079 57151 55985 54574 53004 51816 51510 51792 51928 51814 52010 52710 53472 54169 55302
$$ packed form
55646A84365J749P32P82J501K010K214K491K749K612K122J504O55m37j293j635
55631B02121j973k766l560l734l491l368l291k935k539k544k873l292l829m180
55617A57746l516j841p28j547l584n134n797o280o572n945m620l835m058m408
55603I9881m059l147k087j053l54l88r53j372j411j400j486j474j388j379j213
55588G6717o30j63o42j963l161l688l744l403k458j196l90k93m86p57j210j438
55572E1095o87Q55J918J718Q87L54J18l05q73j097p66r1O12R73O86j56r61j127
55554E3153n64L06R32J032Q47R49J535K063J916J187M50o7o09j219j544j317o87
55537E8363m9K40K2m97r28j166j411j570j188l06K82J36j14J96P00P62O97J133
$$ plain form
55519 55302 57032 58723 59913 61046 62682 64665 66622 68639 70821 72770 74193 75561 77470 79839
55505 79839 82375 85316 88832 92175 94426 95850 97551 99820 101743 102531 102368 101757 100737 99109 96859
55490 96859 94064 90723 86880 82604 77774 72338 66906 62597 59984 58437 56773 54389 51561 48794
55476 48794 46164 43407 40492 37941 36446 36186 36620 36941 36580 35352 33411 31205 29270 27919 27203 27099
55460 27099 27460 27812 27609 26780 25731 24797 24070 23767 24181 25120 25939 26341 26604 26812 26548 25722 25046 25129 25693
55441 25693 26236 26884 27871 28715 28783 28399 28514 29382 30356 30964 31451 32187 33175 34285 35422 36330 36637 36214 35186
55422 35186 33695 32061 31075 31515 33246 35167 36254 36383 36057 35665 35108 34077 32641 31512 31482 32451 33402
55405 33402 33605 33427 33573 34004 34237 34357 34930 36013 36965 37313 37209 36943 36592 36248 36094 36102 36112 36255 36884 37942
$$ packed form
55519E5302J730J691J190J133J636J983J957K017K182J949J423J368J909K369
55505G9839K536K941L516L343K251J424J701K269J923P88j63o11j020j628k250
55490I6859k795l341l843m276m830n436n432m309k613j547j664k384k828k767
55476D8794k630k757k915k551j495k60M34L21l61j228j941k206j935j351p16j04
55460B7099L61L52k03q29j049r34p27l03M14R39Q19M02K63K08k64q26o76Q3N64
55441B5693N43O48R87Q44O8l84J15Q68R74O08M87P36R88J110J137R08L07m23j028
55422C5186j491j634r86M40J731J921J087J29l26l92n57j031j436j129l0R69R51
55405C3402K03j78J46M31K33J20N73J083R52L48j04k66l51l44j54QJ0J43O29J058
$$ plain form
55385 37942 38866 39237 39167 38942 38680 38434 38247 37957 37296 36304 35331 34553 33779 32782 31497 29833 27727 25500
55367 25500 23793 22939 22668 22494 22137 21530 20760 20113 19853 19820 19550 18887 18167 17688 17414 17361 17904 19304 21124
55348 21124 22448 22667 21894 20682 19488 18421 17391 16442 15851 15883 16558 17748 19315 21011 22396 23157
55332 23157 23479 23809 24262 24517 24298 23742 23219 22959 22909 22874 22728 22549 22489 22566 22762 23336 24690 26757 28858
55313 28858 30372 31214 31410 30667 28873 26708 25146 24451 24135 23775 23375 23048 22839 22836 22958 22780 22090 21515
55295 21515 21953 23395 24912 25902 26671 27625 28565 29142 29469 29858 30255 30377 30195 29990 29973 30000 29587 28281 26232
55276 26232 24310 23373 23431 23806 24023 24129 24262 24433 24759 25404 26211 26819 27199 27528 27521 26580 24798 23154 22300
55257 22300 21741 20666 19120 17837 17253 17152 17055 16549 15480 14215 13498 13707 14399 14945 15274 15658 15947 15645
$$ packed form
55385C7942R24L71p0k25k62k46j87k90o61r92r73p78p74r97j285j664k106k227
55367B5500j707q54k71j74l57o07p70o47k60l3k70o63p20m79k74n3N43J400J820
55348B1124J324K19p73j212j194j067j030r49n91L2O75J190J567J696J385P61
55332B3157L22L30M53K55k19n56n23k60n0l5j46j79o0P7J96N74J354K067K101
55313B8858J514Q42J96p43j794k165j562o95l16l60m00l27k09lJ22j78o90n75
55295B1515M38J442J517R90P69R54R40N77L27L89L97J22j82k05j7K7m13j306k049
55276B6232j922r37N8L75K17J06J33J71L26O45Q07O08L80L29pr41j782j644q54
55257B2300n59j075j546j283n84j01r7n06j069j265p17K09O92N46L29L84K89l02
$$ plain form
55239 15645 14672 13621 13138 13374 14104 15090 16218 17447 18765 20136 21439 22533 23303 23630 23328 22290
55223 22290 20705 19114 18183 18347 19516 21112 22444 23119 23116 22638 21961 21305 20743 20275 20094 20568 21801 23377
55205 23377 24724 25558 25804 25462 24924 25056 26342 28112 29177 29168 28641 28022 27193 26162 25352 24912 24486 23992
55187 23992 23981 24741 25586 25606 24802 23927 23461 23180 22634 21681 20610 19957 20087 20804 21572 22154 22744 23413 23812
55168 23812 23657 23129 22615 22382 22725 23969 26025 28290 30287 31985 33297 33774 33254 32368 31821 31475 30659
55151 30659 29158 27396 25816 24576 23757 23401 23382 23544 23915 24552 25297 25912 26225 25990 25026 23802 23446 24624
55133 24624 26715 28534 29555 29912 29715 29205 29298 30906 33579 35670 36157 35637 35253 35352 35589 35757 35863 35690
55115 35690 34924 33745 32882 32929 33763 34687 35044 34653 33718 32459 31009 29675 28956 29013 29250 28841 27677 26498
$$ packed form
55239A5645r73j051m83K36P30R86J128J229J318J371J303J094P70L27l02j038
55223B2290j585j591r31J64J169J596J332O75lm78o77o56n62m68j81M74J233J576
55205B3377J347Q34K46l42n38J32J286J770J065rn27o19q29j031q10m40m26m94
55187B3992j1P60Q45K0q04q75m66k81n46r53j071o53J30P17P68N82N90O69L99
55168B3812j55n28n14k33L43J244K056K265J997J698J312M77n20q86n47l46q16
55151C0659j501j762j580j240q19l56j9J62L71O37P45O15L13k35r64j224l56J178
55133B4624K091J819J021L57j97n10R3J608K673K091M87n20l84R9K37J68J06j73
55115C5690p66j179q63M7Q34R24L57l91r35j259j450j334p19N7K37m09j164j179
$$ plain form
55097 26498 26015 26166 26357 26232 26017 26142 26621 26914 26530 25744 25411 25907 26599 26684 26233 25888 25765 25317 24378
55078 24378 23641 23732 24273 24366 23742 22982 22619 22498 22144 21467 20917 20981 21680 22525 22912 22627 22025 21729 22065 22847
55058 22847 23746 24780 26182 27799 28991 29331 29078 28664 28019 26886 25550 24662 24404 24528 25191 26892 29301
55041 29301 31011 31092 30249 29775 29827 29568 28689 27897 27875 28574 29647 30951 32336 33414 33843 33602 32949 32319
55023 32319 32235 32883 33715 33867 33098 32032 31383 31278 31458 31836 32586 33782 35169 36262 36728 36685 36558 36538 36362
55004 36362 35739 34768 33746 32827 32126 31851 31944 31864 31235 30554 30683 31731 32976 33854 34504 35287 36295 37449
54986 37449 38634 39672 40547 41614 43164 44833 46022 46837 47921 49344 50460 51039 51684 52778 53833
54971 53833 54424 55029 56213 57524 57979 57346 56250 55275 54637 54538 55019 55528 55326 54434 53623 53374 53413 53425 53637
$$ packed form
55097B6498m83J51J91j25k15J25M79K93l84p86l33M96O92Q5m51l45j23m48r39
55078B4378p37R1N41R3o24p60l63j21l54o77n50O4O99Q45L87k85o02k96L36P82
55058B2847Q99J034J402J617J192L40k53m14o45j133j336q88k58J24O63J701K409
55041B9301J710Q1q43m74N2k59q79p92k2O99J073J304J385J078M29k41o53o30
55023C2319q4O48Q32J52p69j066o49j05J80L78P50J196J387J093M66m3j27k0j76
55004C6362o23r71j022r19p01k75R3q0o29o81J29J048J245Q78O50P83J008J154
54986C7449J185J038Q75J067J550J669J189Q15J084J423J116N79O45J094J055
54971E3833N91O05J184J311M55o33j096r75o38r9M81N09k02q92q11k49L9J2K12
$$ plain form
54952 53637 54367 55395 56217 56729 57386 58745 61022 64038 67458 71097 75056 79514 84427 89552 94805
54937 94805 100413 106542 112903 118855 123912 127936 130738 131657 129843 125095 118295 110844 103655 96808 90023
54922 90023 83253 76807 71150 66669 63473 61260 59494 57748 55902 54019 52244 50795 49921 49734 50179
54907 50179 51100 52228 53193 53833 54496 55716 57557 59576 61598 64177 68015 73135 78898 84721 90557
54892 90557 96727 103446 110395 116611 120903 122608 121960 119626 115955 110789 104003 96123 88333 81780 76723
54877 76723 72384 67751 62529 57256 52704 49356 47271 46005 44778 43182 41766 41433 42145 42779 42440
54862 42440 41386 40338 39488 38677 38129 38292 39087 39875 40181 40073 39854 39723 39679 39512 38919 37890 36853 36245
54844 36245 36091 36157 36174 35708 34243 31978 30209 30240 31937 33914 35091 35514 35678 35753 35694 35568 35440 35243 34947
$$ packed form
54952E3637P30J028Q22N12O57J359K277L016L420L639L959M458M913N125N253
54937I4805N608O129O361N952N057M024K802R19j814m748o800p451p189o847o785
54922I0023o770o446n657m481l196k213j766j746j846j883j775j449q74j87M45
54907E0179R21J128R65O40O63J220J841K019K022K579L838N120N763N823N836
54892I0557O170O719O949O216M292J705o48k334l671n166o786p880p790o553n057
54877G6723m339m633n222n273m552l348k085j266j227j596j416l33P12O34l39
54862D2440j054j048q50q11n48J63P95P88L06j08k19j31m4j67n93j029j037o08
54844C6245j54O6J7m66j465k265j769L1J697J977J177M23J64P5n9j26j28j97k96
$$ plain form
54825 34947 34633 34270 33729 33067 32540 32301 32330 32682 33404 34203 34583 34416 34083 34010 34412 35456 37189 39223 40947
54806 40947 42206 43287 44241 44772 45002 45655 47085 48646 49552 49895 50380 51373 52701 54138 55647 57378
54790 57378 59778 63413 68291 73706 79164 85031 91763 98955 105910 112805 120359 128414 135736 141312
54776 141312 145087 147250 147662 146336 143850 140773 137250 133533 130392 128426 127344 126509 125941 126239 127655
54761 127655 129805 132273 134999 137919 140571 142233 142387 140987 138345 134790 130448 125572 120988 117829
54747 117829 116479 116090 115515 114525 113758 113731 114503 116266 119559 124583 130648 136586 141444 144576 145471 143926
54731 143926 140280 135142 128903 121756 114139 106774 100186 94416 89318 84933 81406 78633 76210 73710
54717 73710 70957 68089 65519 63774 63132 63301 63560 63335 62617 61776 61156 60954 61273 61994 62651 62793 62538 62498
$$ packed form
54825C4947l14l63n41o62n27k39K9L52P22P99L80j67l33p3M02J044J733K034J724
54806D0947J259J081R54N31K30O53J430J561R06L43M85R93J328J437J509J731
54790E7378K400L635M878N415N458N867O732P192O955O895P554Q055P322N576
54776A41312L775K163M12j326k486l077l523l717l141j966j082q35n68K98J416
54761A27655K150K468K726K920K652J662J54j400k642l555m342m876m584l159
54747A17829j350l89n75r90p67k7P72J763L293N024O065N938M858L132Q95j545
54731A43926l646n138o239p147p617p365o588n770n098m385l527k773k423k500
54717G3710k753k868k570j745o42J69K59k25p18q41o20k02L19P21O57J42k55m0
$$ plain form
54699 62498 63063 64003 64917 65766 66709 67655 68338 68742 69113 69531 69789 69733 69533 69474 69658 69999 70461 71199 72442
54680 72442 74194 76087 77686 78953 80230 81699 83121 84223 85049 85704 86221 86971 88720 91610 94453
54665 94453 95968 96637 98355 102062 106664 110760 114542 119267 125492 132747 140612 149193 158590 168586 178968
54650 178968 189640 200315 210447 219474 226817 231809 234093 233961 231813 227407 220250 210723 200175
54637 200175 189770 179822 170350 161573 153562 146063 139094 133233 128743 124872 120646 116177 112597 110705
54623 110705 110152 109993 109566 108750 107670 106452 105194 103996 102972 102184 101583 101113 100866 100981 101309 101346 100673
54606 100673 99418 98215 97743 98229 99192 99755 99512 99140 99812 101842 104305 106125 107154 107925 108806 109843
54590 109843 111036 112243 113050 113339 113894 115748 118916 122285 124850 126586 128003 129399 130727 131788 132288
$$ packed form
54699F2498N65R40R14Q49R43R46O83M04L71M18K58n6k00n9J84L41M62P38J243
54680G2442J752J893J599J267J277J469J422J102Q26O55N17P50J749K890K843
54665I4453J515O69J718L707M602M096L782M725O225P255P865Q581R397R996J0382
54650A78968J0672J0675J0132R027P343M992K284j32k148m406p157r527j0548
54637B00175j0405r948r472q777q011p499o969n861m490l871m226m469l580j892
54623A10705n53j59m27q16j080j218j258j198j024p88o01m70k47J15L28L7o73
54606A00673j255j203m72M86R63N63k43l72O72K030K463J820J029P71Q81J037
54590A09843J193J207Q07K89N55J854L168L369K565J736J417J396J328J061N00
$$ plain form
54575 132288 132110 131716 131853 132595 133102 132672 131705 131186 131530 132398 133431 134573 135733 136687 137441 138233 139054 139543
54557 139543 139612 139831 140847 142556 144204 145330 146281 147717 149822 152266 154903 158109 162251 167064 171920
54542 171920 176653 181677 187184 192690 197740 202676 208121 213725 217998 219568 218295 215103 211071 206878
54528 206878 202715 198367 193522 188276 183297 179282 176366 174254 172716 171686 170956 170183 169339 168889 169309
54513 169309 170536 172034 173357 174525 175761 176965 177663 177628 177440 178128 180173 183097 186125 188938 191567
54498 191567 193881 195667 197065 198477 199993 201316 202290 203082 203781 204271 204674 205495 206974 208566 209419 209182
54482 209182 208149 206882 206013 206153 207462 209355 210968 211929 212500 213112 214071 215541 217270 218419 218194 216791
54466 216791 215274 214387 213911 213372 212869 212769 212977 213025 212711 212191 211455 210162 208073 205310 202150 198902 196127
$$ packed form
54575A32288j78l94J37P42N07m30r67n19L44Q68J033J142J160R54P54P92Q21M89
54557A39543O9K19J016J709J648J126R51J436K105K444K637L206M142M813M856
54542A71920M733N024N507N506N050M936N445N604M273J570j273l192m032m193
54528B06878m163m348m845n246m979m015k916k112j538j030p30p73q44m50M20
54513A69309J227J498J323J168J236J204O98l5j88O88K045K924L028K813K629
54498A91567K314J786J398J412J516J323R74P92O99M90M03Q21J479J592Q53k37
54482B09182j033j267q69J40J309J893J613R61N71O12R59J470J729J149k25j403
54466B16791j517q87m76n39n03j00K08M8l14n20p36j293k089k763l160l248k775
$$ plain form
54449 196127 194541 194323 194656 194318 192799 190621 188576 186970 185775 185150 185333 186089 186659 186478 185648 184536
54433 184536 183243 181739 180259 179054 177861 176145 173935 171953 170719 169977 169258 168585 168217 168025 167683 167347
54417 167347 167634 168848 170643 172521 174276 175830 177011 177754 178265 178733 179103 179321 179642 180359 181359 182221
54401 182221 182692 182821 182634 181985 180749 178916 176431 173254 169681 166363 163745 161693 159930 158625 158187
54386 158187 158547 159067 159267 159273 159341 159303 158840 158125 157728 157859 158027 157569 156279 154416 152394 150627 149451 148813
54368 148813 148139 146927 145471 144615 144600 144541 143421 141345 139331 137967 136895 135722 134768 134515 134787 135089 135514
54351 135514 136600 138319 139875 140699 141059 141382 141465 140807 139398 137672 135841 133752 131395 129145 127354 125954
54335 125954 124580 122986 121315 119970 119203 118749 117972 116491 114538 112641 111114 109972 109100 108216 106864
$$ packed form
54449A96127j586k18L33l38j519k178k045j606j195o25J83P56N70j81q30j112
54433A84536j293j504j480j205j193j716k210j982j234p42p19o73l68j92l42l36
54417A67347K87J214J795J878J755J554J181P43N11M68L70K18L21P17J000Q62
54401A82221M71J29j87o49j236j833k485l177l573l318k618k052j763j305m38
54386A58187L60N20K00OO8l8m63p15l97J31J68m58j290j863k022j767j176o38
54368A48813o74j212j456q56j5n9j120k076k014j364j072j173r54k53K72L02M25
54351A35514J086J719J556Q24L60L23Q3o58j409j726j831k089k357k250j791j400
54335A25954j374j594j671j345p67m54p77j481j953j897j527j142q72q84j352
$$ plain form
54320 106864 104812 102483 100722 100043 100191 100387 99951 98865 97844 97686 98374 98997 98753 97708 96288 94444
54304 94444 91888 88963 86586 85219 84428 83587 82568 81574 80708 79942 79206 78331 77162 75818 74613 73664
54288 73664 72895 72362 72200 72203 71942 71408 71052 71021 70848 70147 69139 68226 67532 67191 67564 68690 69944 70834 71766
54269 71766 73402 75472 76970 77509 77801 78624 79875 80917 81446 81685 81953 82383 82977 83703 84534 85464 86453
54252 86453 87336 87846 87881 87767 88077 89027 90058 90298 89585 88838 89137 90522 92001 92664 92376 91416 89928 87986
54234 87986 85892 84082 82890 82470 82769 83468 84217 84972 85832 86508 86382 85268 83680 82166 80780 79469
54218 79469 78530 78229 78317 78291 77952 77400 76812 76501 76896 78039 79361 80265 80634 80585 80179 79715 79686 79958 79522 77735
54198 77735 75336 73506 72375 71327 70347 69999 70147 69847 68656 67128 65821 64674 63557 62597 61672 60383
$$ packed form
54320A06864k052k329j761o79J48J96m36j086j021j58O88O23k44j045j420j844
54304I4444k556k925k377j367p91q41j019r94q66p66p36q75j169j344j205r49
54288G3664p69n33j62Lk61n34l56l1j73p01j008r13o94l41L73J126J254Q90R32
54269G1766J636K070J498N39K92Q23J251J042N29K39K68M30N94P26Q31R30R89
54252H6453Q83N10L5j14L10R50J031K40p13p47K99J385J479O63k88r60j488j942
54234H7986k094j810j192m20K99O99P49P55Q60O76j26j114j588j514j386j311
54218G9469r39l01Q8k6l39n52n88l11L95J143J322R04L69m9m06m64k9K72m36j787
54198G7735k399j830j131j048r80l48J48l00j191j528j307j147j117r60r25j289
$$ plain form
54182 60383 58897 57968 57707 57117 55493 53596 52706 52977 53482 53584 53553 53864 54477 54943 54895 54379 53770 53330 52831
54163 52831 51940 50916 50503 50929 51541 51696 51582 51829 52735 54208 56004 57537 57923 56821 55044 53830 53730
54146 53730 54583 56179 58276 60247 61479 62087 62647 63268 63583 63560 63513 63253 62107 60114 58400 57809 57786 57292
54128 57292 56334 55802 55980 56117 55515 54367 53238 52279 51337 50388 49431 48223 46609 45059 44394 44883 45948
54111 45948 46840 47332 47607 47832 48094 48532 49152 49651 49731 49596 49802 50562 51432 51772 51386 50623 50014 49895 50256
54092 50256 50840 51371 51704 51819 51791 51821 52132 52726 53387 54043 54936 56206 57542 58586 59492 60609 61710 62073
54074 62073 61469 60573 60118 60056 59862 59402 59080 59293 60033 61008 61896 62514 62945 63491 64395 65595 66845 68042
54056 68042 69326 70843 72472 73888 74903 75717 76674 77818 78959 80252 82311 85383 88696 91114 92371
$$ packed form
54182F0383j486r29k61n90j624j897q90K71N05J02l1L11O13M66m8n16o09m40m99
54163E2831q91j024m13M26O12J55j14K47R06J473J796J533L86j102j777j214j00
54146E3730Q53J596K097J971J232O08N60O21L15k3m7k60j146j993j714n91k3m94
54128E7292r58n32J78J37o02j148j129r59r42r49r57j208j614j550o65M89J065
54111D5948Q92M92K75K25K62M38O20M99Q0j35K06P60Q70L40l86p63o09j19L61
54092E0256N84N31L33J15k8L0L11N94O61O56Q93J270J336J044R06J117J101L63
54074F2073o04q96m55o2j94m60l22K13P40R75Q88O18M31N46R04J200J250J197
54056F8042J284J517J629J416J015Q14R57J144J141J293K059L072L313K418J257
$$ plain form
54041 92371 93201 94320 95800 97499 99552 102180 105376 109002 112916 116850 120509 123856 127016 129845 132062
54026 132062 133890 135968 138414 140556 141980 143276 145187 147433 149013 149424 148969 148015 146593 144798 143098
54011 143098 142000 141578 141367 140625 138794 135890 132404 128775 125195 121942 119442 117716 116176 114362 112558
53996 112558 111271 110475 109820 109270 108910 108337 106891 104435 101384 98067 94739 92112 91078 91647 92742 93306
53980 93306 93167 92639 91847 90835 89881 89264 88888 88440 87803 87097 86490 86143 86135 86323 86494 86814 87870 89984 92653
53961 92653 94894 96126 96559 96849 97508 98621 99965 101336 102694 103966 104950 105669 106672 108560 111243 114113
53945 114113 117015 120473 124703 129003 132645 135946 139807 144386 148941 152955 156645 160158 162966 164591
53931 164591 165434 166264 167095 167185 166168 164623 163393 162787 162690 163041 163843 164966 166336 168191 170802 174037 177550
$$ packed form
54041I2371Q30J119J480J699K053K628L196L626L914L934L659L347L160K829K217
54026A32062J828K078K446K142J424J296J911K246J580M11m55r54j422j795j700
54011A43098j098m22k11p42j831k904l486l629l580l253k500j726j540j814j804
53996A12558j287p96o55n50l60n73j446k456l051l317l328k627j034N69J095N64
53980I3306j39n28p92j012r54o17l76m48o37p06o07l47qJ88J71L20J056K114K669
53961I2653K241J232M33K90O59J113J344J371J358J272R84P19J003J888K683K870
53945A14113K902L458M230M300L642L301L861M579M555M014L690L513K808J625
53931A64591Q43Q30Q31R0j017j545j230o06r7L51Q02J123J370J855K611L235L513
$$ plain form
53914 177550 181315 185543 190124 194620 198943 203515 208443 212868 215569 216102 215056 213322 211412 209476
53900 209476 207607 205910 204337 202648 200666 198567 196771 195303 193390 189979 184765 178480 172162 166378
53886 166378 161189 156459 151974 147532 143171 139165 135624 132357 129250 126488 124193 122149 120139 118317
53872 118317 116923 115864 114824 113594 112053 110156 108235 106952 106514 106199 105135 103374 101733 100746 100327
53857 100327 100291 100585 100973 101040 100661 100092 99538 98954 98262 97384 96056 94052 91652 89478 87784 86276 84728
53840 84728 83374 82578 82475 83000 83906 84638 84642 84040 83694 84314 85643 86732 86889 86285 85719 85881 86783 87911
53822 87911 88936 90056 91491 92962 94080 95026 96338 98099 99830 101218 102453 103807 105340 107094 109220
53807 109220 111825 115009 118926 123398 127582 130723 133240 136368 140568 145001 148810 152207 155819 159581
$$ packed form
53914A77550L765M228M581M496M323M572M928M425K701N33j046j734j910j936
53900B09476j869j697j573j689j982k099j796j468j913l411n214o285o318n784
53886A66378n189m730m485m442m361m006l541l267l107k762k295k044k010j822
53872A18317j394j059j040j230j541j897j921j283m38l15j064j761j641r87m19
53857A00327l6K94L88O7l79n69n54n84o92q78j328k004k400k174j694j508j548
53840H4728j354p96j03N25R06P32Mo02l46O20J329J089J57o04n66J62R02J128
53822H7911J025J120J435J471J118R46J312J761J731J388J235J354J533J754K126
53807A09220K605L184L917M472M184L141K517L128M200M433L809L397L612L762
$$ plain form
53793 159581 162805 164999 166186 166691 167001 167547 168338 169061 169630 170216 170557 169895 167989 165617 163591 161760
53777 161760 159539 156924 154338 151864 149378 147143 145521 144237 142663 140820 139432 138914 138833 138484 137558
53762 137558 136225 134968 134354 134547 134987 134924 134247 133416 132669 131791 130655 129447 128223 126706 124708 122399
53746 122399 120020 117683 115560 113957 112965 112334 111820 111408 111091 110732 110310 110033 110029 110157 110280 110451 110659 110632
53728 110632 110133 109303 108459 107696 106980 106535 106838 108103 109941 111672 112954 114025 115359 117180 119365 121678
53712 121678 123842 125428 125944 125276 123858 122261 120757 119539 119167 120374 123402 127813 132962 138411 143867
53697 143867 149019 153595 157385 160121 161619 162179 162534 163148 163771 164015 164224 165355 167948 171513 175123 178299
53681 178299 181111 183652 185871 187932 190276 193054 195753 197746 199122 200658 202923 205655 208038 209410
$$ packed form
53793A59581L224K194J187N05L10N46P91P23N69N86L41o62j906k372k026j831
53777A61760k221k615k586k474k486k235j622j284j574j843j388n18q1l49r26
53762A37558j333j257o14J93M40o3o77q31p47q78j136j208j224j517j998k309
53746A22399k379k337k123j603r92o31n14m12l17l59m22k77mJ28J23J71K08k7
53728A10632m99q30q44p63p16m45L03J265J838J731J282J071J334J821K185K313
53712A21678K164J586N16o68j418j597j504j218l72J207L028M411N149N449N456
53697A43867N152M576L790K736J498N60L55O14O23K44K09J131K593L565L610L176
53681A78299K812K541K219K061K344K778K699J993J376J536K265K732K383J372
$$ plain form
53667 209410 209681 209360 209251 209824 210739 211164 210732 209981 209763 210439 211775 213317 214594 215183 214960 214233 213392 212446
53649 212446 211164 209546 207907 206525 205392 204317 203093 201606 199975 198478 197178 195742 193904 192024
53635 192024 190872 190826 191568 192556 193506 194303 194793 194939 195001 195269 195588 195403 194383 192942 191994 192163 193377 195258
53617 195258 197646 200474 203231 205115 205906 206422 207825 210622 214455 218521 221972 224286 225753 227421 230080
53602 230080 233321 236074 238033 240023 242847 246288 249540 252233 254656 257183 259940 262945 266166 269342
53588 269342 272024 273979 275400 276640 277880 279231 280929 283073 285156 286257 285933 284615 282931 280986
53574 280986 278736 276747 275852 276038 276320 275942 275157 274574 274330 274233 274176 273900 272828 270734 268278 266319 264943
53557 264943 263737 262767 262550 263195 264257 265488 267062 268992 270866 272375 273589 274571 275188 275423 275502 275595 275828
$$ packed form
53667B09410K71l21j09N73R15M25m32p51k18O76J336J542J277N89k23p27q41r46
53649B12446j282j618j639j382j133j075j224j487j631j497j300j436j838j880
53635A92024j152m6P42R88R50P97M90J46O2K68L19j85j020j441r48J69J214J881
53617A95258K388K828K757J884P91N16J403K797L833M066L451K314J467J668K659
53602B30080L241K753J959J990K824L441L252K693K423K527K757L005L221L176
53588B69342K682J955J421J240J240J351J698K144K083J101l24j318j684j945
53574B80986k250j989q95J86K82l78p85n83k44r7n7k76j072k094k456j959j376
53557B64943j206r70k17O45J062J231J574J930J874J509J214R82O17K35P9R3K33
$$ plain form
53540 275828 276669 278726 281932 285415 288482 291321 294473 298051 301817 305692 309817 314317 319350 325166
53526 325166 331807 338923 346174 353675 361791 370665 380239 390602 401959 414228 426960 439767 452766
53513 452766 466568 481787 498479 516033 533770 551673 570439 590832 613122 637108 662395
53502 662395 688591 715442 742917 771011 799497 828004 856300 884232 911539 938202 965016
53491 965016 993277 1023678 1055852 1089134 1123308 1158348 1193912 1229470 1264597 1298714 1330873
53480 1330873 1360278 1386882 1411169 1433565 1454382 1474080 1493075 1511435 1529247 1547166 1566174
53469 1566174 1586743 1608565 1630985 1653242 1674324 1693133 1709057 1722163 1732687 1740553 1745409 1746803
53457 1746803 1744238 1737319 1726178 1711649 1694904 1676884 1658040 1638351 1617475 1594967 1570517 1544037
$$ packed form
53540B75828Q41K057L206L483L067K839L152L578L766L875M125M500N033N816
53526C25166O641P116P251P501Q116Q874R574J0363J1357J2269J2732J2807J2999
53513D52766J3802J5219J6692J7554J7737J7903J8766K0393K2290K3986K5287
53502F62395K6196K6851K7475K8094K8486K8507K8296K7932K7307K6663K6814
53491I65016K8261L0401L2174L3282L4174L5040L5564L5558L5127L4117L2159
53480A330873K9405K6604K4287K2396K0817J9698J8995J8360J7812J7919J9008
53469A566174K0569K1822K2420K2257K1082J8809J5924J3106J0524P866M856J394
53457A746803k565o919j1141j4529j6745j8020j8844j9689k0876k2508k4450k6480
$$ plain form
53445 1544037 1515598 1485402 1453895 1421819 1390104 1359570 1330510 1302387 1274047 1244477 1213465
53434 1213465 1181566 1149639 1118572 1089357 1063034 1040335 1021351 1005618 992508 981631 972869
53423 972869 966052 960758 956780 954805 956200 961676 970394 980770 992098 1005056 1020689 1039349 1060640
53410 1060640 1083939 1108625 1134144 1160239 1187089 1215079 1244416 1275060 1306924 1340045 1374615
53399 1374615 1410910 1449176 1489583 1532363 1577911 1626563 1678288 1732849 1790281 1850921 1914758
53388 1914758 1981054 2048886 2117907 2188247 2259861 2332440 2405945 2480714 2556713 2632936 2707767
53377 2707767 2779826 2848292 2912737 2973070 3029618 3082992 3133854 3182908 3230837 3277815 3323169
53366 3323169 3366051 3406473 3445193 3482430 3517196 3548083 3573911 3592969 3602215 3598264 3579343 3545787
$$ packed form
53445A544037k8439l0196l1507l2076l1715l0534k9060k8123k8340k9570l1012
53434A213465l1899l1927l1067k9215k6323k2699j8984j5733j3110j0877q762
53423I72869o817n294l978j975J395N476Q718J0376J1328J2958J5633J8660K1291
53410A060640K3299K4686K5519K6095K6850K7990K9337L0644L1864L3121L4570
53399A374615L6295L8266M0407M2780M5548M8652N1725N4561N7432O0640O3837
53388A914758O6296O7832O9021P0340P1614P2579P3505P4769P5999P6223P4831
53377B707767P2059O8466O4445O0333N6548N3374N0862M9054M7929M6978M5354
53366C323169M2882M0422L8720L7237L4766L0887K5828J9058R246l951j8921l3556
$$ plain form
53354 3545787 3498887 3440119 3371608 3296282 3216835 3134821 3051042 2966305 2881355 2796470 2711861
53343 2711861 2628352 2547096 2468550 2392054 2316456 2240950 2165359 2090012 2015468 1942246 1870720
53332 1870720 1801258 1734332 1670382 1609720 1552710 1499872 1451598 1407898 1368599 1333685 1303265
53321 1303265 1277322 1255619 1237616 1222282 1208247 1194611 1181497 1169516 1158778 1148867 1139634 1131507
53309 1131507 1124886 1119707 1115746 1112941 1111177 1110165 1109889 1110925 1113855 1118460 1123872 1129557 1135839 1143410
53295 1143410 1152620 1163487 1176195 1191248 1209044 1229472 1251970 1275878 1300692 1326279 1353024
53284 1353024 1381644 1412508 1445141 1478587 1512243 1546035 1579775 1612778 1644424 1674836 1704713
53273 1704713 1734619 1764703 1794898 1824992 1854416 1882209 1907322 1928961 1946748 1960733 1971213
$$ packed form
53354C545787m6900n8768o8511p5326p9447q2014q3779q4737q4950q4885q4609
53343B711861q3509q1256p8546p6496p5598p5506p5591p5347p4544p3222p1526
53332A870720o9462o6926o3950o0662n7010n2838m8274m3700l9299l4914l0420
53321A303265k5943k1703j8003j5334j4035j3636j3114j1981j0738r911r233q127
53309A131507o621n179l961k805j764j012k76J036K930M605N412N685O282P571
53295A143410R210J0867J2708J5053J7796K0428K2498K3908K4814K5587K6745
53284A353024K8620L0864L2633L3446L3656L3792L3740L3003L1646L0412K9877
53273A704713K9906L0084L0195L0094K9424K7793K5113K1639J7787J3985J0480
$$ plain form
53262 1971213 1978293 1981563 1980257 1973674 1961421 1943384 1919628 1890315 1855687 1816245 1772973 1727089
53250 1727089 1679373 1629921 1578749 1526510 1474434 1423767 1375494 1330274 1288217 1248806 1211395
53239 1211395 1175716 1141600 1108372 1074973 1040664 1005249 968674 930894 892200 853244 814672
53228 814672 777089 741440 708905 680112 654775 632309 612558 595706 581722 570135 560149 550841
53216 550841 541468 531916 522736 514518 507193 499989 491970 482630 472161 461235 450437 439857 429329
53203 429329 418876 408701 398808 389031 379424 370210 361325 352436 343446 334518 325573 316325 307049 298590
53189 298590 291191 283909 275804 267254 259371 252421 245602 238375 231252 225130 220379 216736 213675 210689
53175 210689 207564 204535 201934 199650 197274 194826 192886 191840 191363 190838 189994 188905 187696 186531 185662
$$ packed form
53262A971213P080L270j306o583j2253j8037k3756k9313l4628l9442m3272m5884
53250A727089m7716m9452n1172n2239n2076n0667m8273m5220m2057l9411l7411
53239A211395l5679l4116l3228l3399l4309l5415l6575l7780l8694l8956l8572
53228H14672l7583l5649l2535k8793k5337k2466j9751j6852j3984j1587r986r308
53216E50841r373r552r180q218p325p204q019r340j0469j0926j0798j0580j0528
53203D29329j0453j0175r893r777r607r214q885q889q990q928q945r248r276q459
53189B98590p399p282q105q550p883o950o819p227p123o122m751l643l061k986
53175B10689l125l029k601k284k376k448j940j046m77n25q44j089j209j165q69
$$ plain form
53160 185662 185147 184640 183764 182566 181372 180315 179269 178237 177491 177263 177495 177919 178193 177916 176762 174863
53144 174863 172983 172007 172143 172754 173066 172927 172704 172550 172141 171271 170435 170435 171390 172459 172640 171789 170696 170256
53126 170256 170650 171277 171363 170552 168955 166811 164321 161784 159686 158418 158031 158339 159094 159847 159878 158690 156559
53109 156559 154267 152179 149996 147488 145050 143170 141684 140093 138498 137577 137479 137214 135651 132955 130560
53094 130560 129627 129908 130264 129991 129192 128106 126702 125159 124131 124075 124549 124720 124396 124025 123791 123422 123020 123361
53076 123361 124914 127012 128487 128765 127953 126311 124291 122804 122603 123401 124249 124780 125393 126164 126417 125734 124630
53059 124630 123758 123029 122118 121345 121292 121821 122242 122283 122169 121801 120694 118929 117465 117051 117331 117469 117332 117545
53041 117545 118517 119823 120607 120358 119324 118311 118068 118738 119881 121023 122022 122832 123125 122407 120521 117919
$$ packed form
53160A85662n15n07q76j198j194j057j046j032p46k28K32M24K74k77j154j899
53144A74863j880r76J36O11L12j39k23j54m09q70q36%R55J069J81q51j093m40
53126A70256L94O27Q6q11j597k144k490k537k098j268l87L08P55P53L1j188k131
53109A56559k292k088k183k508k438j880j486j591j595r21r8k65j563k696k395
53094A30560r33K81L56k73p99j086j404j543j028n6M74J71l24l71k34l69m02L41
53076A23361J553K098J475K78q12j642k020j487k01P98Q48N31O13P71K53o83j104
53059A24630q72p29r11p73n3N29M21M1j14l68j107j765j464m14K80J38j37K13
53041A17545R72J306P84k49j034j013k43O70J143J142R99Q10K93p18j886k602
$$ plain form
53025 117919 115419 113741 113168 113455 114005 114237 113961 113533 113658 114809 116633 117999 117945 116646 115241 114634 114702
53008 114702 114750 114458 114058 113775 113507 113113 112741 112682 113027 113676 114654 116214 118418 120711 122212 122595 122516 122974
52990 122974 124325 126106 127673 128674 128990 128677 128121 127863 128030 128119 127603 126591 125735 125627 126416 127832 129393
52973 129393 130708 131720 132570 133200 133317 132856 132188 131745 131680 132047 132998 134504 136144 137453 138354 139009 139512
52956 139512 140010 140867 142263 143769 144655 144672 144274 144188 144941 146584 148559 150019 150609 150762 150939 150907 150264 149397
52938 149397 149162 149718 150336 150466 150285 150057 149618 148943 148625 149284 150778 152398 153656 154512 155047 155295 155380 155554
52920 155554 156034 156867 157865 158653 158939 158786 158542 158477 158704 159327 160342 161370 161888 161855 161739 161787 161657 160995 160009
52901 160009 159224 158932 159108 159584 160040 160132 159948 160070 160864 161922 162528 162477 162131 161876 161880 162237 162936 163778 164649 165764
$$ packed form
53025A17919k500j678n73K87N50K32k76m28J25J151J824J366n4j299j405o07O8
53008A14702M8k92m00k83k68l94l72n9L45O49R78J560K204K293J501L83p9M58
52990A22974J351J781J567J001L16l13n56k58J67Q9n16j012q56j08P89J416J561
52973A29393J315J012Q50O30J17m61o68m43o5L67R51J506J640J309R01O55N03
52956A39512M98Q57J396J506Q86J7l98q6P53J643J975J460N90J53J77l2o43q67
52938A49397k35N56O18J30j81k28m39o75l18O59J494J620J258Q56N35K48Q5J74
52920A55554M80Q33R98P88K86j53k44o5K27O23J015J028N18l3j16M8j30o62r86
52901A60009p85k92J76M76M56R2j84J22P94J058O06n1l46k55ML57O99Q42Q71J115
$$ plain form
52881 165764 167286 168755 169347 168729 167366 165953 164847 164108 163761 163834 164300 165099 166197 167576 169234 171060
52865 171060 172661 173503 173478 173193 173372 174012 174371 173781 172181 169881 167170 164217 161066 157580 153628 149535
52849 149535 146114 144049 143233 142849 142002 140282 137904 135495 133710 132855 132780 133090 133462 133780 134038 134185 134060
52832 134060 133556 132813 132160 131758 131409 130821 130014 129256 128619 127867 126861 125897 125398 125326 125116 124286 122993 121874
52814 121874 121399 121477 121671 121636 121305 120845 120578 120842 121732 122960 124072 124753 124805 124024 122449 120657 119430 118960
52796 118960 118682 118068 117325 117102 117704 118824 119898 120435 120070 118643 116377 113930 112099 111264 110994 110317 108685
52779 108685 106660 105357 105192 105559 105845 106245 107217 108499 109230 108946 108008 107016 106181 105359 104474 103741 103542 104081
52761 104081 105138 106283 107356 108512 109607 109888 108637 106042 103130 100903 99728 99394 99394 99245 98858 98624
$$ packed form
52881A65764J522J469N92o18j363j413j106p39l47P3M66P99J098J379J658J826
52865A71060J601Q42k5k85J79O40L59n90j600k300k711k953l151l486l952m093
52849A49535l421k065q16l84q47j720k378k409j785q55p5L10L72L18K58J47j25
52832A34060n04p43o53m02l49n88q07p58o37p52j006r64m99p2k10q30j293j119
52814A21874m75P8J94l5l31m60k67K64Q90J228J112O81N2p81j575j792j227m70
52796A18960k78o14p43k23O02J120J074N37l65j427k266k447j831q35k70o77j632
52779A08685k025j303j65L67K86M00R72J282P31k84r38r92q35q22q85p33j99N39
52761A04081J057J145J073J156J095K81j251k595k912k227j175l34%j49l87k34
$$ plain form
52745 98624 98893 99471 99891 100071 100360 100997 101918 103035 104281 105403 106137 106676 107569 109045 110810 112623 114652
52728 114652 117011 119295 120891 121595 121649 121298 120510 119155 117356 115674 114805 114907 115282 114968 113682 111988
52712 111988 110603 109849 109736 110145 110732 111009 110779 110341 110144 110383 110969 111627 111969 111759 111247 111024 111385 112103
52694 112103 112863 113553 113992 113779 112783 111563 110970 111371 112446 113575 114308 114639 114992 115785 116881 117726 118101
52677 118101 118330 118574 118422 117601 116676 116474 117037 117720 118161 118512 118744 118427 117404 116210 115498 115359 115429 115385 115154
52658 115154 114899 114939 115433 115949 115664 114248 112306 110653 109396 108139 106942 106480 107149 108436 109489 110096
52642 110096 110725 111708 112732 113238 113068 112537 112052 111867 112103 112732 113510 114132 114557 115030 115738 116622 117570 118547
52624 118547 119365 119603 119084 118318 118048 118332 118492 118090 117536 117393 117396 116723 115238 113930 113836 114841 115974 116661
$$ packed form
52745I8624K69N78M20J80K89O37R21J117J246J122P34N39Q93J476J765J813K029
52728A14652K359K284J596P04N4l51p88j355j799j682q69J02L75l14j286j694
52712A11988j385p54j13M09N87K77k30m38j97K39N86O58L42k10n12k23L61P18
52694A12103P60O90M39k13r96j220n93M01J075J129P33L31L53P93J096Q45L75
52677A18101K29K44j52q21r25k02N63O83M41L51K32l17j023j194p12j39P0m4k31
52658A15154k55M0M94N16k85j416j942j653j257j257j197m62O69J287J053O07
52642A10096O29R83J024N06j70n31m85j85K36O29P78O22M25M73P08Q84R48R77
52624A18547Q18K38n19p66k70K84J60m02n54j43Lo73j485j308r4J005J133O87
$$ plain form
52606 116661 117234 118168 119289 120034 120188 120042 119928 119881 119710 119125 117895 116200 114832 114678 115826 117403 118483
52589 118483 118906 119052 119082 118739 117830 116565 115380 114677 114745 115661 117112 118463 119219 119384 119268 119066 118823 118766
52571 118766 119309 120521 121765 122184 121570 120526 119780 119604 119938 120686 121622 122282 122357 122024 121615 121104 120296 119449
52553 119449 119140 119465 119785 119419 118334 117028 116094 115919 116401 116791 116285 115021 114064 114106 114643 114860 114879 115504
52535 115504 116972 118660 119943 120716 120996 120599 119457 117893 116391 115447 115608 117188 119682 121873 122827 122582
52519 122582 121705 120579 119511 119145 120153 122374 124666 125793 125351 123840 122059 120552 119498 118894 118723
52504 118723 118977 119590 120442 121393 122267 122846 123035 122995 122971 123034 123133 123398 124096 125202 126247 126793 126838 126631 126299 125921
52484 125921 125763 126079 126701 127132 127091 126705 126210 125754 125554 125896 126701 127356 127303 126756 126546 127130 127966 128061 127100 125832
$$ packed form
52606A16661N73R34J121P45J54j46j14m7j71n85j230j695j368j54J148J577J080
52589A18483M23J46L0l43r09j265j185p03O8R16J451J351P56J65j16k02k43n7
52571A18766N43J212J244M19o14j044p46j76L34P48R36O60P5l33m09n11q08q47
52553A19449l09L25L20l66j085j306r34j75M82L90n06j264r57M2N37K17J9O25
52535A15504J468J688J283P73K80l97j142j564j502r44J61J580K494K191R54k45
52519A22582q77j126j068l66J008K221K292J127m42j511j781j507j054o04j71
52504A18723K54O13Q52R51Q74N79J89m0k4O3R9K65O98J106J045N46M5k07l32l78
52484A25921j58L16O22M31m1l86m95m56k00L42Q05O55n3n47k10N84Q36R5r61j268
$$ plain form
52464 125832 125208 125352 125618 125626 125771 126496 127411 127639 126931 125891 125137 124758 124765 125436 126755 127935 128122 127422 126754
52445 126754 126785 127460 128464 129594 130553 130976 130858 130613 130508 130409 130203 130058 129969 129487 128290 126786 125737 125462
52427 125462 125735 126318 127188 128251 129196 129717 129702 129249 128637 128203 128047 127932 127619 127182 126809 126519 126304 126367 126903
52408 126903 127736 128469 128898 128992 128591 127498 125825 123949 122230 120980 120470 120567 120558 119856 118750 117936 117504 117033
52390 117033 116621 116995 118404 120158 121548 122603 123624 124633 125673 126986 128438 129316 129204 128517 127672 126415
52374 126415 124703 123615 124328 126452 128378 129284 129840 130850 132157 133231 134086 135067 136221 137359 138433
52359 138433 139490 140429 141130 141686 142297 143079 144051 145190 146403 147620 148954 150571 152399 154225 156019 157826
52343 157826 159300 159920 159861 160186 161721 164083 166216 167716 169101 170854 172739 174313 175763 177843 180998
$$ packed form
52464A25832o24J44K66QJ45P25R15K28p08j040p54l79PO71J319J180J87p00o68
52445A26754L1O75J004J130R59M23j18k45j05r9k06j45q9m82j197j504j049k75
52427A25462K73N83Q70J063R45N21j5m53o12m34j56j15l13m37l73k90k15O3N36
52408A26903Q33P33M29R4m01j093j673j876j719j250n10R7rp02j106q14m32m71
52390A17033m12L74J409J754J390J055J021J009J040J313J452Q78j12o87q45j257
52374A26415j712j088P13K124J926R06N56J010J307J074Q55R81J154J138J074
52359A38433J057R39P01N56O11P82R72J139J213J217J334J617J828J826J794J807
52343A57826J474O20n9L25J535K362K133J500J385J753J885J574J450K080L155
$$ plain form
52328 180998 184745 188065 190415 192280 194730 198466 203348 208773 214319 219999 226034 232560 239555 246981
52314 246981 254944 263618 273025 283010 293526 304812 317119 330322 344046 358144 372800 388095
52302 388095 403693 419175 434499 449947 465651 481440 497162 512920 528721 543993 557814
52291 557814 569790 580511 590869 601026 610408 618587 625709 631937 636936 640275 641980 642317 641341 639120
52277 639120 636227 633376 630522 626769 621383 614642 607600 601214 595798 591091 586725 582715 579504 577484
52263 577484 576614 576634 577479 579260 582060 586078 591711 598990 607129 615210 623320 632449 643199 655209 667928
52248 667928 681288 695216 709117 722336 734820 746796 758012 767752 775526 781465 786102 789951
52236 789951 793149 795347 796087 795333 793401 790311 785676 779369 771851 763466 753916 742943 731121 719335
$$ packed form
52328A80998L747L320K350J865K450L736M882N425N546N680O035O526O995P426
52314B46981P963Q674R407R985J0516J1286J2307J3203J3724J4098J4656J5295
52302C88095J5598J5482J5324J5448J5704J5789J5722J5758J5801J5272J3821
52291E57814J1976J0721J0358J0157R382Q179P122O228M999L339J705L37r76k221
52277F39120k893k851k854l753n386o741p042o386n416m707m366m010l211k020
52263E77484q70K0Q45J781K800M018N633P279Q139Q081Q110R129J0750J2010J2719
52248F67928J3360J3928J3901J3219J2484J1976J1216R740P774N939M637L849
52236G89951L198K198P40p54j932l090m635o307p518q385r550j0973j1822j1786
$$ plain form
52222 719335 707658 695365 682030 668143 654599 642002 630473 619717 609195 598580 588125
52211 588125 578327 569318 560859 552890 545637 539144 533132 527472 522398 518048 514106 510200 506528 503833
52197 503833 502740 503167 504318 505268 505647 505737 505877 505961 505732 505394 505531 506421 507784 509264 510748 512044 512602
52180 512602 511909 510119 508054 506571 505917 505639 505060 503923 502508 501091 499452 497191 494460 492004 490348
52165 490348 489177 487668 485300 482294 479331 476846 474521 471552 467598 463245 459286 455791 452353 449052
52151 449052 446414 444379 442142 439354 436734 434923 433433 431433 429087 427187 425769 424145 422322 421335
52137 421335 421789 422905 423605 423965 424845 426396 427708 428035 427827 428263 430013 432663 435275 437350 439243 441759
52121 441759 445446 450288 455972 462288 469347 477525 487178 498211 509958 521743 533648 546466 560793
$$ packed form
52222G19335j1677j2293j3335j3887j3544j2597j1529j0756j0522j0615j0455
52211E88125r798r009q459p969p253o493o012n660n074m350l942l906l672k695
52197E03833j093M27J151R50L79R0J40Q4k29l38J37Q90J363J480J484J296N58
52180E12602o93j790k065j483o54k78n79j137j415j417j639k261k731k456j656
52165D90348j171j509k368l006k963k485k325k969l954m353l959l495l438l301
52151D49052k638k035k237k788k620j811j490k000k346j900j418j624j823r87
52137D21335M54J116P00L60Q80J551J312L27k08M36J750K650K612K075J893K516
52121D41759L687M842N684O316P059Q178R653J1033J1747J1785J1905J2818J4327
$$ plain form
52108 560793 576358 592436 608715 625521 643251 661809 680641 699221 717451 735540 753467
52097 753467 770631 786268 800149 812592 823798 833574 841892 849250 856053 861874 865743 867067 865925
52084 865925 862629 857477 850931 843583 835771 827491 818708 809482 799834 789785 779570 769473 759454
52071 759454 749338 739422 730455 722900 716576 711174 706706 703282 700877 699663 700135 702563 706510 711288
52057 711288 716711 723116 730839 739871 749886 760433 771282 782678 794909 807582 819799 831280
52045 831280 842627 854082 864704 873467 880617 887109 893116 897999 901473 903780 904799 904079 901865 898983
52031 898983 895348 889555 880500 868725 855632 842001 827808 812961 797528 781522 764987 748103
52019 748103 730877 713046 694564 675891 657489 639418 621641 604315 587501 571028 554966
$$ packed form
52108E60793J5565J6078J6279J6806J7730J8558J8832J8580J8230J8089J7927
52097G53467J7164J5637J3881J2443J1206R776Q318P358O803N821L869J324j142
52084H65925l296n152o546p348p812q280q783r226r648j0049j0215j0097j0019
52071G59454j0116r916q967p555o324n402m468l424k405j214M72K428L947M778
52057G11288N423O405P723R032J0015J0547J0849J1396J2231J2673J2217J1481
52045H31280J1347J1455J0622Q763P150O492O007M883L474K307J019p20k214k882
52031H98983l635n793r055j1775j3093j3631j4193j4847j5433j6006j6535j6884
52019G48103j7226j7831j8482j8673j8402j8071j7777j7326j6814j6473j6062
$$ plain form
52008 554966 539676 525125 510753 496527 483442 472275 462370 452378 441747 430781 419758 408940
51996 408940 399051 390614 382945 374832 366217 358208 351398 345190 338998 333128 328001 323386 318913 314706
51982 314706 310962 307478 304034 300808 297924 294973 291399 287049 282091 276731 271251 265932 260697 255330
51968 255330 250207 246202 243467 240917 237388 232823 227822 222668 217521 212968 209475 206461 202775 198040
51954 198040 192886 188025 183803 180531 178360 176695 174494 171430 168202 165490 163218 161100 159303 158089
51940 158089 157246 156349 155332 154414 153666 153020 152566 152460 152582 152560 152106 151199 150025 148902 148134 147706 147166 146007
51922 146007 144199 142253 140802 140177 140243 140498 140362 139525 138048 136212 134402 133143 132927 133712 134702 134940 134209
51905 134209 133194 132731 132998 133510 133789 133921 134435 135612 137031 137934 138064 137952 138205 138705 138794 138198 137423 137119
$$ packed form
52008E54966j5290j4551j4372j4226j3085j1167r905r992j0631j0966j1023j0818
51996D08940r889q437p669q113q615q009o810o208o192n870n127m615m473m207
51982C14706l744l484l444l226k884k951l574m350m958n360n480n319n235n367
51968B55330n123m005k735k550l529m565n001n154n147m553l493l014l686m735
51954A98040n154m861m222l272k171j665k201l064l228k712k272k118j797j214
51940A58089q43q97j017r18p48o46m54j06J22k2m54r07j174j123p68m28n40j159
51922A46007j808j946j451o25O6K55j36q37j477j836j810j259k16P85R90K38p31
51905A34209j015m63K67N12K79J32N14J177J419R03J30j12K53N00Q9n96p75l04
$$ plain form
51887 137119 137344 137719 138122 138829 139910 140882 141210 140967 140705 140685 140581 140019 139173 138630 138860 140018 142083 144841
51869 144841 147799 150512 153131 156339 160511 165219 169789 174183 178951 184350 189813 194369 197334 198504
51855 198504 197976 196039 193215 190133 187225 184548 181927 179223 176408 173416 170045 166179 162129 158561
51841 158561 155892 153838 151715 149205 146637 144540 143121 142229 141598 140997 140291 139545 138956 138518 137915 136942
51825 136942 135984 135757 136559 137954 139230 140025 140432 140716 141083 141582 142101 142433 142444 142172 141721 141082 140118 138773
51807 138773 137361 136589 137092 138730 140478 141297 141117 140667 140356 139755 138372 136556 135238 134944 135500 136519
51791 136519 137692 138540 138432 137241 135766 135139 135793 137143 138235 138531 138133 137472 136895 136449 135912 135068 133976
51774 133976 133021 132607 132775 133133 133259 133131 133090 133387 133941 134571 135251 135956 136417 136298 135634 134894 134550 134686 135002
$$ packed form
51887A37119K25L75M03P07J081R72L28k43k62k0j04n62q46n43K30J158K065K758
51869A44841K958K713K619L208M172M708M570M394M768N399N463M556K965J170
51855A98504n28j937k824l082k908k677k621k704k815k992l371l866m050l568
51841A58561k669k054k123k510k568k097j419q92o31o01p06p46n89m38o03r73
51825A36942r58k27Q02J395J276P95M07K84L67M99N19L32J1k72m51o39r64j345
51807A38773j412p72N03J638J748Q19j80m50l11o01j383j816j318k94N56J019
51791A36519J173Q48j08j191j475o27O54J350J092K96l98o61n77m46n37q44j092
51774A33976r55m14J68L58J26j28m1K97N54O30O80P05M61j19o64p40l44J36L16
$$ plain form
51755 135002 135089 134666 133774 132835 132376 132556 133044 133405 133591 133911 134581 135373 135785 135493 134641 133637 132759 132018 131447
51736 131447 131305 131827 132813 133621 133616 132529 130514 128037 125723 124034 123005 122351 121859 121538 121401 121348 121392 121786
51718 121786 122689 123812 124558 124524 123826 122952 122351 122089 121836 121274 120467 119699 118997 118113 117105 116564 116932 117843
51700 117843 118547 118868 119282 120051 120835 121361 121996 123230 124938 126688 128579 131092 134011 136151 136616 135908
51684 135908 135233 134924 134194 132404 129891 127316 124879 122696 121412 121684 123165 124707 125697 126615 128111 130042
51668 130042 131743 132829 133377 133627 133870 134462 135541 136858 138187 139726 141684 143593 144472 143834 142206 140556
51652 140556 139481 139053 139128 139496 139883 140092 140186 140391 140760 141033 140838 139986 138567 136815 134938 133067 131276
51635 131276 129635 128322 127710 128163 129497 130816 131189 130516 129440 128426 127361 126230 125608 126023 127145 128154
$$ packed form
51755A35002Q7m23q92r39m59J80M88L61J86L20O70P92M12k92q52j004q78p41n71
51736A31447j42N22R86Q08nj087k015k477k314j689j029o54m92l21j37n3M4L94
51718A21786R03J123P46l4o98q74o01k62k53n62q07p68p02q84j008n41L68R11
51700A17843P04L21M14P69P84N26O35J234J708J750J891K513K919K140M65p08
51684A35908o75l09p30j790k513k575k437k183j284K72J481J542R90R18J496J931
51668A30042J701J086N48K50K43N92J079J317J329J539J958J909Q79o38j628j650
51652A40556j075m28P5L68L87K09R4K05L69K73j95q52j419j752j877j871j791
51635A31276j641j313o12M53J334J319L73o73j076j014j065j131o22M15J122J009
$$ plain form
51619 128154 128728 129114 129341 129005 128028 127090 126993 127904 129442 131160 132716 133859 134600 135237 135977 136678 137143 137570
51601 137570 138445 140045 142232 144655 146981 148964 150418 151096 150617 148678 145482 141792 138456 135945 134326
51586 134326 133428 132882 132297 131666 131410 131788 132449 132800 132669 132304 131938 131658 131589 131784 131997 131903 131585 131482 131848
51567 131848 132496 133098 133489 133692 133961 134759 136346 138415 140485 142597 145088 147634 149176 149151 148300 147836 148160
51550 148160 148821 149426 149959 150348 150256 149470 148149 146652 145410 144931 145550 147055 148791 150309 151744 153426
51534 153426 155243 156570 156788 155885 154542 153585 153333 153476 153530 153241 152500 151206 149424 147480 145661 143974
51518 143974 142422 141280 140711 140273 139290 137711 136179 135179 134526 133800 132904 131989 131089 130069 128806 127325
51502 127325 125948 125262 125671 126874 128058 128710 128970 129156 129310 129369 129425 129563 129720 129915 130378 131211 132119 132700
$$ packed form
51619A28154N74L86K27l36r77r38r7R11J538J718J556J143P41O37P40P01M65M27
51601A37570Q75J600K187K423K326J983J454O78m79j939l196l690l336k511j619
51586A34326q98n46n85o31k56L78O61L51j31l65l66k80o9J95K13r4l18j03L66
51567A31848O48O02L91K03K69P98J587K069K070K112K491K546J542k5q51m64L24
51550A48160O61O05N33L89r2p86j321j497j242m79O19J505J736J518J435J682
51534A53426J817J327K18r03j343r57k52J43N4k89p41j294j782j944j819j687
51518A43974j552j142n69m38r83j579j532j000o53p26q96r15r00j020j263j481
51502A27325j377o86M09J203J184O52K60J86J54N9N6J38J57J95M63Q33R08N81
$$ plain form
51484 132700 132802 132474 131858 131319 131329 131954 132730 133342 134076 135252 136546 137313 137373 137036 136568 136073 135789 135960 136459
51465 136459 136951 137378 137879 138315 138367 138044 137687 137429 137139 136879 136890 137004 136601 135377 133774 132413 131452 130706
51447 130706 130073 129590 129262 128994 128534 127503 125788 123972 122977 123103 123693 123858 123242 122008 120478 118963 117606
51430 117606 116177 114365 112423 111122 110898 111450 112396 113786 115634 117426 118656 119491 120288 120726 120120 118585
51414 118585 117230 116987 117650 118288 118324 117953 117672 117695 117904 118174 118478 118570 117899 116229 114171 112607 111551 110227
51396 110227 108380 106786 106091 105844 105279 104467 103961 103696 103105 102140 101368 101112 101241 101775 102871 104061 104376
51379 104376 103507 102234 101370 100855 100259 99636 99428 99829 100672 101659 102426 102648 102421 102284 102648 103424 104342 105259
51361 105259 105909 105907 105418 105382 106459 108022 108822 108540 108008 107955 108229 108417 108579 108903 109126 108868 108352 108265 108826 109431
$$ packed form
51484A32700J02l28o16n39J0O25P76O12P34J176J294P67O0l37m68m95k84J71M99
51465A36459M92M27N01M36N2l23l57k58k90k60J1J14m03j224j603j361r61p46
51447A30706o33m83l28k68m60j031j715j816r95J26N90J65o16j234j530j515j357
51430A17606j429j812j942j301k24N52R46J390J848J792J230Q35P97M38o06j535
51414A18585j355k43O63O38L6l71k81K3K09K70L04R2o71j670k058j564j056j324
51396A10227j847j594o95k47n65q12n06k65n91r65p72k56J29N34J096J190L15
51379A04376q69j273q64n15n96o23k08M01Q43R87P67K22k27j37L64P76R18R17
51361A05259O50km89l6J077J563Q00k82n32n3K74J88J62L24K23k58n16q7N61O05
$$ plain form
51341 109431 109386 108654 107642 106480 104934 103008 101231 100179 99973 100403 101309 102536 103726 104539 105040 105551
51325 105551 106194 106924 107934 109511 111371 112658 112897 112662 112901 113810 114673 114707 113730 112077 110176 108342 106910
51308 106910 106420 107398 109708 112222 113607 113610 113152 113033 113006 112482 111593 110907 110361 109307 107624 106107 105503 105691
51290 105691 106082 106424 106854 107464 108148 108749 109125 109238 109384 110102 111604 113402 114772 115434 115574 115391 114974 114513
51272 114513 114211 114003 113723 113595 114113 115235 116123 116051 115354 115012 115484 116378 117267 118281 119665 121225 122615
51255 122615 123924 125555 127546 129430 130845 131929 132993 134076 135052 135975 137044 138258 139312 139893 139981
51240 139981 139854 139894 140400 141486 143048 144785 146285 147219 147607 147894 148600 149807 151102 152126 153038 154218
51224 154218 155620 156737 157243 157401 157607 157792 157641 157342 157643 158950 160712 162035 162717 163317 164326 165735
$$ packed form
51341A09431m5p32j012j162j546j926j777j052k06M30R06J227J190Q13N01N11
51325A05551O43P30J010J577J860J287K39k35K39R09Q63L4r77j653j901j834j432
51308A06910m90R78K310K514J385Lm58j19k7n24q89o86n46j054j683j517o04J88
51290A05691L91L42M30O10O84O01L76J13J46P18J502J798J370O62J40j83m17m61
51272A14513l02k08k80j28N18J122Q88p2o97l42M72Q94Q89J014J384J560J390
51255A22615J309J631J991J884J415J084J064J083R76R23J069J214J054N81Q8
51240A39981j27M0N06J086J562J737J500R34L88K87P06J207J295J024R12J180
51224A54218J402J117N06J58K06J85j51k99L01J307J762J323O82O00J009J409
$$ plain form
51208 165735 167434 169450 171534 172967 173268 172900 172804 173322 173982 174305 174292 174018 173195 171539 169356 167457 166472
51191 166472 166349 166493 166239 165274 163755 162110 160717 159708 158994 158420 157908 157480 157078 156437 155351 154066 153123
51174 153123 152643 152152 151351 150694 150698 151003 150740 149706 148485 147441 146306 144955 143836 143270 142918 142416 142010
51157 142010 142058 142328 142326 142085 142023 142242 142423 142364 142168 141968 141825 141805 141908 142044 142276 142814 143517 143860 143759 143992 145192
51136 145192 146845 148028 148787 149900 151414 152494 152767 152841 153182 153486 153597 154205 155906 158205 160145 161494
51120 161494 162619 163523 163765 163234 162351 161583 161227 161622 162986 164967 166769 167810 168023 167600 166827 166220 166393
51103 166393 167601 169535 171625 173318 174167 173991 173189 172642 173128 174752 176982 179146 180948 182601 184469
51088 184469 186591 188655 190456 192104 193667 194865 195431 195605 195951 196783 198042 199622 201466 203355 205035
$$ packed form
51208A65735J699K016K084J433L01l68r6N18O60L23j3k74q23j656k183j899r85
51191A66472j23J44k54r65j519j645j393j009p14n74n12m28m02o41j086j285r43
51174A53123m80m91q01o57ML05k63j034j221j044j135j351j119n66l52n02m06
51157A42010M8K70kk41o2K19J81n9j96k00j43k0J03J36K32N38P03L43j01K33J200
51136A45192J653J183P59J113J514J080K73P4L41L04J11O08J701K299J940J349
51120A61494J125R04K42n31q83p68l56L95J364J981J802J041K13m23p73o07J73
51103A66393J208J934K090J693Q49j76q02n47M86J624K230K164J802J653J868
51088A84469K122K064J801J648J563J198N66J74L46Q32J259J580J844J889J680
$$ plain form
51073 205035 206597 208428 210691 213092 215188 216674 217371 217314 216860 216338 215533 213936 211640 209536 208339 207850
51057 207850 207446 206890 206269 205505 204491 203474 202749 202068 200960 199605 198824 199074 199951 200792 201323 201484 201209
51040 201209 200765 200896 202068 203730 204842 205100 205189 205845 207105 208608 210216 212056 214135 216226 218100 219707
51024 219707 221090 222234 223028 223414 223617 224122 225321 227156 229266 231460 233879 236683 239792 243041 246385
51009 246385 249779 253038 256000 258757 261589 264773 268516 272880 277536 281849 285563 289336 294180 300369
50995 300369 307275 314356 321823 330088 338995 348020 356985 366084 375326 384573 394253 405557 419518 436000
50981 436000 453892 472276 491314 512038 535428 561757 590798 622555 657559 696373 738948
50970 738948 784745 833325 884485 937860 992924 1049592 1108271 1168807 1229606 1288292 1343109
$$ packed form
51073B05035J562J831K263K401K096J486O97n7m54n22q05j597k296k104j197m89
51057B07850m04n56o21p64j014j017p25o81j108j355p81K50Q77Q41N31J61k75
51040B01209m44J31J172J662J112K58Q9O56J260J503J608J840K079K091J874J607
51024B19707J383J144P94L86K03N05J199J835K110K194K419K804L109L249L344
51009B46385L394L259K962K757K832L184L743M364M656M313L714L773M844O189
50995C00369O906P081P467Q265Q907R025Q965R099R242R247R680J1304J3961J6482
50981D36000J7892J8384J9038K0724K3390K6329K9041L1757L5004L8814M2575
50970G38948M5797M8580N1160N3375N5064N6668N8679O0536O0799N8686N4817
$$ plain form
50959 1343109 1393219 1437782 1475515 1505410 1527343 1541643 1548470 1547979 1540683 1527091 1507212 1481098
50947 1481098 1449884 1415716 1380491 1345131 1310230 1276825 1246010 1218074 1192542 1168950 1147131
50936 1147131 1126747 1107022 1087155 1066682 1045263 1022376 997573 970962 943206 915031 886802
50925 886802 858553 830229 801938 774108 747405 722368 699058 677184 656609 637641 620747
50914 620747 606070 593282 581863 571518 562367 554764 548834 544174 540116 536249 532550 529041 525701
50901 525701 522860 521319 521639 523488 526101 529269 533360 538348 543419 547799 551532 555190 559223 563942
50887 563942 569712 576549 583739 590452 596688 603143 610143 617322 624504 632332 641676 652764 665249 678820
50873 678820 693348 708601 724289 740566 758205 778103 800609 825404 852045 880549 911455
$$ packed form
50959A343109N0110M4563L7733K9895K1933J4300O827m91p296j3592j9879k6114
50947A481098l1214l4168l5225l5360l4901l3405l0815k7936k5532k3592k1819
50936A147131k0384j9725j9867k0473k1419k2887k4803k6611k7756k8175k8229
50925H86802k8249k8324k8291k7830k6703k5037k3310k1874k0575j8968j6894
50914F20747j4677j2788j1419j0345r151p603n930m660m058l867l699l509l340
50901E25701k841j541L20J849K613L168M091M988N071M380L733L658M033M719
50887E63942N770O837P190O713O236O455P000P179P182P828R344J1088J2485J3571
50873F78820J4528J5253J5688J6277J7639J9898K2506K4795K6641K8504L0906
$$ plain form
50862 911455 945382 982796 1024357 1071235 1124726 1185564 1253854 1329622 1413117 1504584 1604122
50851 1604122 1711775 1827360 1950052 2078526 2211609 2348244 2486423 2622529 2752111
50842 2752111 2871075 2975900 3063320 3130616 3176266 3199814 3201260 3181135 3141172 3084327 3013988
50831 3013988 2933568 2846793 2757692 2669808 2585690 2507278 2436314 2373981 2320358 2274527 2234979
50820 2234979 2199658 2165964 2131426 2094602 2055184 2013249 1968520 1920389 1868414 1812830 1754697
50809 1754697 1695593 1637025 1580060 1525495 1474222 1427231 1385302 1348928 1318577 1294853 1278194
50798 1278194 1268507 1265304 1268335 1277996 1295011 1319710 1351648 1389930 1433665 1481907 1533180 1585238
50786 1585238 1635496 1681868 1723317 1759680 1790911 1816529 1835957 1849393 1858000 1862956 1864427 1861688
$$ packed form
50862I11455L3927L7414M1561M6878N3491O0838O8290P5768Q3495R1467R9538
50851A604122J07653J15585J22692J28474J33083J36635J38179J36106J29582
50842B752111J18964J04825Q7420O7296M5650K3548J446k0125l9963n6845p0339
50831C013988q0420q6775q9101q7884q4118p8412p0964o2333n3623m5831l9548
50820B234979l5321l3694l4538l6824l9418m1935m4729m8131n1975n5584n8133
50809A754697n9104n8568n6965n4565n1273m6991m1929l6374l0351k3724j6659
50798A278194r687l203L031R661J7015K4699L1938L8282M3735M8242N1273N2058
50786A585238N0258M6372M1449L6363L1231K5618J9428J3436Q607M956J471k739
$$ plain form
50774 1861688 1854031 1841158 1822715 1797970 1766260 1727640 1682998 1633787 1581711 1528368 1474893
50763 1474893 1422016 1370559 1321660 1276278 1234597 1196170 1160654 1128324 1099911 1076021 1056625
50752 1056625 1041018 1028395 1018542 1011887 1008855 1009440 1013578 1021666 1034312 1051698 1073557 1099840 1131076
50739 1131076 1167989 1211037 1260454 1316448 1378997 1447462 1520683 1597573 1677443 1759566 1842514
50728 1842514 1924200 2002738 2077043 2146215 2208332 2260207 2298557 2321255 2327376 2316581 2289161
50717 2289161 2246784 2192688 2130829 2064959 1998439 1934241 1874527 1820329 1772048 1730249 1695543
50706 1695543 1667670 1645141 1626089 1609224 1593768 1578773 1562927 1545030 1524308 1500316 1472965
50695 1472965 1442930 1411751 1381239 1352762 1327088 1304704 1286028 1271524 1261894 1258135 1261088 1270932
$$ packed form
50774A861688p657j2873j8443k4745l1710l8620m4642m9211n2076n3343n3475
50763A474893n2877n1457m8899m5382m1681l8427l5516l2330k8413k3890j9396
50752A056625j5607j2623r853o655l032N85M138Q088J2646J7386K1859K6283L1236
50739A131076L6913M3048M9417N5994O2549O8465P3221P6890P9870Q2123Q2948
50728A842514Q1686P8538P4305O9172O2117N1875L8350K2698O121j0795k7420
50717B289161m2377n4096o1859o5870o6520o4198n9714n4198m8281m1799l4706
50706A695543k7873k2529j9052j6865j5456j4995j5846j7897k0722k3992k7351
50695A472965l0035l1179l0512k8477k5674k2384j8676j4504r630l759K953R844
$$ plain form
50683 1270932 1287394 1310609 1341497 1381180 1430253 1488848 1557185 1635707 1724589 1823371 1931078
50672 1931078 2046354 2167156 2290372 2412141 2528765 2637455 2736416 2824683 2902127 2969360
50662 2969360 3027151 3075837 3115486 3146467 3169271 3183498 3187389 3178854 3156909 3121966 3075038 3017219
50650 3017219 2949970 2875504 2796633 2716395 2637756 2563336 2495163 2434673 2382864 2340172 2306262
50639 2306262 2280183 2260796 2246848 2236652 2228133 2219483 2209683 2198304 2184979 2169148 2150130 2127333
50627 2127333 2100616 2070562 2038263 2004816 1971212 1938710 1908810 1882567 1860198 1841663 1827421
50616 1827421 1818244 1814413 1815409 1820374 1828565 1839307 1851804 1865254 1879159 1893377 1907589 1920559
50604 1920559 1930018 1933530 1929401 1916541 1893747 1859955 1815505 1762616 1704132 1642129 1578081 1513877
$$ packed form
50683A270932J6462K3215L0888L9683M9073N8595O8337P8522Q8882R8782J07707
50672A931078J15276J20802J23216J21769J16624J08690R8961Q8267P7444O7233
50662B969360N7791M8686L9649L0981K2804J4227L891q535k1945l4943m6928n7819
50650C017219o7249p4466p8871q0238p8639p4420o8173o0490n1809m2692l3910
50639B306262k6079j9387j3948j0196q519q650r800j1379j3325j5831j9018k2797
50627B127333k6717l0054l2299l3447l3604l2502k9900k6243k2369j8535j4242
50616A827421r177l831R96M965Q191J0742J2497J3450J3905J4218J4212J2970
50604A920559R459L512m129j2860k2794l3792m4450n2889n8484o2003o4048o4204
$$ plain form
50592 1513877 1451834 1393681 1339975 1290435 1244397 1201041 1159891 1121414 1086734 1056490 1030165
50581 1030165 1006717 985701 967548 952891 941743 933414 927221 923173 921761 923068 926482 931457 938177
50568 938177 947123 958368 971899 988371 1008907 1034171 1064192 1099051 1139142 1184743 1236032 1293650
50556 1293650 1358421 1430164 1507405 1588616 1673070 1759969 1847365 1932688 2013996 2090150 2160256
50545 2160256 2223966 2282271 2337180 2390361 2442581 2494276 2545778 2596587 2645041 2689228 2728089
50534 2728089 2761519 2790050 2815001 2838726 2864073 2893402 2928155 2969107 3016547 3070133 3128794
50523 3128794 3190910 3254428 3316879 3375572 3428004 3472019 3505620 3526822 3533917 3525787 3501846 3461836
50511 3461836 3406031 3335664 3252796 3159570 3057857 2949966 2839516 2731044 2628531 2534503
$$ packed form
50592A513877o2043n8153n3706m9540m6038m3356m1150l8477l4680l0244k6325
50581A030165k3448k1016j8153j4657j1148q329o193m048j412J307L414M975O720
50568I38177Q946J1245J3531J6472K0536K5264L0021L4859M0091M5601N1289N7618
50556A293650O4771P1743P7241Q1211Q4454Q6899Q7396Q5323Q1308P6154P0106
50545B160256O3710N8305N4909N3181N2220N1695N1502N0809M8454M4187L8861
50534B728089L3430K8531K4951K3725K5347K9329L4753M0952M7440N3586N8661
50523C128794O2116O3518O2451N8693N2432M4015L3601K1202P095q130k3941m0010
50511C461836n5805p0367q2868r3226j01713j07891j10450j08472j02513r4028
$$ plain form
50501 2534503 2450538 2378133 2318694 2273006 2241166 2222975 2217953 2224976 2242373 2268509 2301931 2340622
50489 2340622 2381340 2419959 2452399 2475055 2484617 2478098 2453491 2410493 2350606 2276568 2191593 2098874
50477 2098874 2001400 1901957 1803089 1706920 1614943 1527900 1445928 1368915 1296894 1230160 1169017
50466 1169017 1113459 1063243 1018265 978684 944530 915259 889862 867401 847351 829469 813644
50455 813644 799933 788537 779480 772297 766172 760421 754830 749602 745136 741832 739972 739625 740664 742907
50441 742907 746217 750555 755987 762700 770960 781084 793481 808684 827178 849172 874538 903004
50429 903004 934319 968277 1004717 1043528 1084518 1127246 1171155 1215978 1261844 1308922 1357090
50418 1357090 1406146 1456182 1507542 1560456 1614906 1670716 1727424 1784072 1839400 1892458 1942912
$$ packed form
50501B534503q3965p2405n9439m5688l1840j8191n022P023J7397K6136L3422L8691
50489B340622M0718L8619L2440K2656R562o519k4607m2998n9887p4038q4975r2719
50477B098874r7474r9443r8868r6169r1977q7043q1972p7013p2021o6734o1143
50466A169017n5558n0216m4978l9581l4154k9271k5397k2461k0050j7882j5825
50455H13644j3711j1396r057p183o125n751n591n228m466l304j860l47J039K243
50441G42907L310M338N432O713Q260J0124J2397J5203J8494K1994K5366K8466
50429I03004L1315L3958L6440L8811M0990M2728M3909M4823M5866M7078M8168
50418A357090M9056N0036N1360N2914N4450N5810N6708N6648N5328N3058N0454
$$ plain form
50407 1942912 1990678 2035336 2075948 2111264 2140038 2161385 2175022 2181121 2179717 2170171 2151241 2121715
50395 2121715 2081126 2030124 1970390 1904140 1833482 1760101 1685448 1611142 1539188 1471776 1410856
50384 1410856 1357702 1312784 1276036 1247251 1226228 1212688 1206294 1206781 1213783 1226401 1243104 1262212
50372 1262212 1282211 1301407 1317577 1328570 1333285 1331641 1323474 1308053 1285066 1255694 1222118 1185990
50360 1185990 1147849 1108033 1067511 1027563 989001 952073 916868 883416 851578 821324 793039
50349 793039 767149 743426 721126 699924 680289 662718 646999 632528 619050 606692 595561
50338 595561 585724 577429 570784 565225 559757 553937 548298 543653 540200 537432 534733 531895 529220 527190
50324 527190 525963 525237 524763 524919 526412 529462 533649 538640 544570 551551 559355 567957 577965 589920
$$ packed form
50407A942912M7766M4658M0612L5316K8774K1347J3637O099j404r546j8930k9526
50395B121715m0589n1002n9734o6250p0658p3381p4653p4306p1954o7412o0920
50384A410856n3154m4918l6748k8785k1023j3540o394M87P002J2618J6703J9108
50372A262212J9999J9196J6170J0993M715j644q167j5421k2987k9372l3576l6128
50360A185990l8141l9816m0522l9948l8562l6928l5205l3452l1838l0254k8285
50349G93039k5890k3723k2300k1202j9635j7571j5719j4471j3478j2358j1131
50338E95561r837q295o645n559n468n820n639m645l453k768k699k838k675k030
50324E27190j227p26m74J56J493L050M187M991N930O981P804Q602J0008J1955
$$ plain form
50310 589920 603478 617849 632892 649101 666471 684033 700693 716025 729980 742296 752665
50299 752665 761267 768678 775260 780802 784604 785728 783358 777265 767942 756089 742038 725815 707673
50286 707673 688272 668407 648853 630434 613875 599408 586825 576103 567724 562034 558433 555620
50274 555620 552768 550219 548870 549130 550693 553204 556708 561282 566499 571608 576224 580613 585186 590005
50260 590005 594904 599852 604897 609803 614087 617493 620254 622832 625591 628745 632280 635753 638489 640325
50246 640325 641997 644399 647527 650552 652996 655366 658423 662216 666237 670285 674668 679577 684745 690034
50232 690034 696006 703435 712256 721357 729691 737429 745745 755567 766877 779265 792745 807701 824304
50219 824304 842470 862393 884673 909765 937645 968207 1001810 1039249 1081367 1128929 1182713
$$ packed form
50310E89920J3558J4371J5043J6209J7370J7562J6660J5332J3955J2316J0369
50299G52665Q602P411O582N542L802J124k370o093r323j1853j4051j6223j8142
50286G07673j9401j9865j9554j8419j6559j4467j2583j0722q379n690l601k813
50274E55620k852k549j349K60J563K511L504M574N217N109M616M389M573M819
50260E90005M899M948N045M906M284L406K761K578K759L154L535L473K736J836
50246F40325J672K402L128L025K444K370L057L793M021M048M383M909N168N289
50232F90034N972P429Q821R101Q334P738Q316R822J1310J2388J3480J4956J6603
50219H24304J8166J9923K2280K5092K7880L0562L3603L7439M2118M7562N3784
$$ plain form
50208 1182713 1243539 1312268 1389891 1477408 1575383 1683726 1802051 1929984 2066599 2209410
50198 2209410 2354181 2496002 2630690 2755471 2868869 2970418 3060685 3141404 3215081 3283747
50188 3283747 3347508 3403982 3448911 3477078 3482944 3461314 3408495 3323364 3207676 3065770 2904073
50177 2904073 2730131 2551052 2372445 2198742 2034041 1881837 1743934 1620275 1510072
50168 1510072 1412624 1327022 1251795 1185520 1127487 1077393 1034583 997979 966476 938998 914384
50157 914384 891803 871299 853441 838175 824387 810901 797687 785713 775576 766624 757713 748661
50145 748661 740563 734513 730376 727060 723757 720472 717471 714849 712813 711914 712630 714866 718184 722411 727792
50130 727792 734598 742731 751655 760754 769935 779850 791231 803955 817204 830648 845009 861050 878435
$$ packed form
50208A182713O0826O8729P7623Q7517R7975J08343J18325J27933J36615J42811
50198B209410J44771J41821J34688J24781J13398J01549R0267Q0719P3677O8666
50188C283747O3761N6474M4929K8167N866k1630n2819q5131j15688j41906j61697
50177B904073j73942j79079j78607j73703j64701j52204j37903j23659j10203
50168A510072r7448q5602p5227o6275n8033n0094m2810l6604l1503k7478k4614
50157I14384k2581k0504j7858j5266j3788j3486j3214j1974j0137q952q911r052
50145G48661q098o050m137l316l303l285l001k622k036q99P16K236L318M227N381
50130G27792O806Q133Q924R099R181R915J1381J2724J3249J3444J4361J6041J7385
$$ plain form
50117 878435 896143 913777 931813 950595 969754 988882 1008362 1029113 1051679 1075823 1101013
50106 1101013 1127140 1154760 1184702 1217471 1253031 1291214 1332288 1377125 1426834 1482251 1543718
50095 1543718 1611366 1685744 1768220 1860656 1964742 2081894 2213731 2362140 2528536 2713350
50085 2713350 2916485 3137677 3375545 3626207 3883363 4139934 4389577 4627343 4850397
50076 4850397 5058903 5255688 5444120 5625986 5801061 5967507 6121222 6254612 6357050
50067 6357050 6417646 6428293 6384971 6287544 6139286 5946371 5716815 5459070 5181150 4890514
50057 4890514 4594147 4298469 4009173 3731066 3467756 3221497 2993605 2785088 2596549
50048 2596549 2427466 2276081 2140490 2019614 1912790 1818758 1735630 1661760 1596100 1537706
$$ packed form
50117H78435J7708J7634J8036J8782J9159J9128J9480K0751K2566K4144K5190
50106A101013K6127K7620K9942L2769L5560L8183M1074M4837M9709N5417O1467
50095A543718O7648P4378Q2476R2436J04086J17152J31837J48409J66396J84814
50085B713350K03135K21192K37868K50662K57156K56571K49643K37766K23054
50076D850397K08506J96785J88432J81866J75075J66446J53715J33390J02438
50067F357050O0596J0647m3322r7427j48258j92915k29556k57745k77920k90636
50057D890514k96367k95678k89296k78107k63310k46259k27892k08517j88539
50048B596549j69083j51385j35591j20876j06824r4032q3128p3870o5660n8394
$$ plain form
50038 1537706 1485481 1438588 1396638 1359222 1325601 1295057 1267111 1241184 1216421 1192211 1168586
50027 1168586 1145766 1123630 1102070 1081514 1062492 1044739 1027259 1009437 991686 974802 958994
50016 958994 943867 929294 915934 904638 895386 887089 878703 870324 862802 856490 850919 845729 841214
50003 841214 837627 834642 832007 830225 829886 830624 831432 831771 831681 831013 829488 827633 826818 827966 830750 834453
49987 834453 839054 845028 852474 861104 871018 882966 897660 915189 935305 958131 984244 1014116
49975 1014116 1047893 1086067 1130061 1181489 1240858 1307742 1382532 1467284 1564238 1674081 1796339
49964 1796339 1930795 2077266 2233951 2396932 2561382 2722399 2874836 3013948 3137354
49955 3137354 3246011 3342744 3430304 3510908 3586288 3656524 3718590 3766588 3793359 3791720 3755189
$$ packed form
50038A537706n2225m6893m1950l7416l3621l0544k7946k5927k4763k4210k3625
50027A168586k2820k2136k1560k0556j9022j7753j7480j7822j7751j6884j5808
50016I58994j5127j4573j3360j1296r252q297q386q379p522o312n571n190m515
50003H41214l587k985k635j782l39P38Q08L39r0o68j525j855q15J148K784L703
49987H34453M601N974P446Q630R914J1948J4694J7529K0116K2826K6113K9872
49975A014116L3777L8174M3994N1428N9369O6884P4790Q4752R6954J09843J22258
49964A796339J34456J46471J56685J62981J64450J61017J52437J39112J23406
49955C137354J08657R6733Q7560Q0604P5380P0236O2066M7998K6771j639l6531
$$ plain form
49944 3755189 3679387 3563769 3412069 3231176 3029771 2817388 2603249 2394810 2197160 2013616
49934 2013616 1846303 1695990 1561967 1442833 1337506 1245317 1165287 1095784 1035049 981878
49924 981878 935641 895737 861176 830705 803269 778378 756086 736570 719580 704236 689531
49913 689531 675096 661362 648864 637578 627029 616825 606752 596584 586218 576015 566594 558147
49901 558147 550268 542473 534629 526824 519193 512050 505799 500525 495876 491523 487442 483594 479698 475517
49887 475517 471111 466555 461807 457159 453403 451044 449476 447421 444112 439780 435147 430921 427640 425426
49873 425426 423739 421811 419482 417341 415941 415213 414813 414683 414944 415445 415818 415976 416242 416910 417933 419194
49857 419194 420849 423050 425419 427195 428104 428692 429527 430435 430991 431457 432475 433798 434101 432473 429567 426850
$$ packed form
49944C755189p5802j15618j51700j80893k01405k12383k14139k08439j97650j83544
49934B013616j67313j50313j34023j19134j05327r2189q0030o9503o0735n3171
49924I81878m6237l9904l4561l0471k7436k4891k2292j9516j6990j5344j4705
49913F89531j4435j3734j2498j1286j0549j0204j0073j0168j0366j0203r421q447
49901E58147p879p795p844p805p631p143o251n274m649m353m081l848l896m181
49887D75517m406m556m748m648l756k359j568k055l309m332m633m226l281k214
49873D25426j687j928k329k141j400p28m00j30K61N01L73J58K66O68J023J261
49857D19194J655K201K369J776R09N88Q35R08N56M66J018J323L03j628k906k717
$$ plain form
49841 426850 425149 424380 424256 424537 424749 424370 423446 422532 421953 421518 421020 420541 420102 419473 418633 418081 418315 419181
49823 419181 420081 420730 421327 421984 422418 422516 422864 424281 426821 429604 431788 433341 434586 435397 435332 434436 433320
49806 433320 432349 431201 429495 427501 425944 425271 425267 425237 424501 422959 421295 420324 420059 419740 418869 417793 417047
49789 417047 416579 416014 415280 414571 413935 413351 412936 412699 412314 411506 410493 409586 408607 407152 405317 403666 402602
49772 402602 402170 402319 402902 403477 403681 403699 403929 404313 404541 404849 405858 407521 408896 409303 409233 409728 411265 413486
49754 413486 415679 417218 417823 417803 417926 418766 420194 421606 422537 422992 423309 423759 424255 424555 424843 425877 428142
49737 428142 431059 433543 435326 437144 439507 441906 443526 444236 444460 444486 444412 444548 445363 446955 448878 450490
49721 450490 451389 451633 451721 452263 453447 454935 456401 458053 460454 463857 467839 471623 474697 477232 479913
$$ packed form
49841D26850j701p69j24K81K12l79r24r14n79m35m98m79m39o29q40n52K34Q66
49823D19181R00O49N97O57M34R8L48J417K540K783K184J553J245Q11o5q96j116
49806D33320r71j148j706j994j557o73ml0p36j542j664r71k65l19q71j076p46
49789D17047m68n65p34p09o36n84m15k37l85q08j013r07r79j455j835j651j064
49772D02602m32J49N83N75K04J8K30L84K28L08J009J663J375M07p0M95J537K221
49754D13486K193J539O05k0J23Q40J428J412R31M55L17M50M96L00K88J034K265
49737D28142K917K484J783J818K363K399J620P10K24K6p4J36Q15J592J923J612
49721D50490Q99K44Q8N42J184J488J466J652K401L403L982L784L074K535K681
$$ plain form
49706 479913 483285 487244 491214 494691 497522 499793 501773 503918 506591 509727 512987 516211 519467 522710
49692 522710 525793 528743 531563 533795 534880 535141 535817 537792 540779 544087 547664 551821 556313 560416 563825
49677 563825 566880 569864 572585 574821 576845 579260 582359 585745 588621 590540 591889 593472 595553 597599
49663 597599 599102 600301 601752 603452 604816 605511 605925 606792 608567 611205 614298 617412 620402 623443 626673
49648 626673 629957 633171 636580 640648 645464 650591 655555 660310 665119 670055 674769 678878 682521 686375
49634 686375 690886 695643 699760 702889 705523 708314 711480 714948 718628 722299 725574 728393 731282 734843
49620 734843 739210 744257 749982 756241 762350 767493 771586 775376 779715 784925 790764 796672 802122 807039
$$ packed form
49706D79913L372L959L970L477K831K271J980K145K673L136L260L224L256L243
49692E22710L083K950K820K232J085K61O76J975K987L308L577M157M492M103L409
49677E63825L055K984K721K236K024K415L099L386K876J919J349J583K081K046
49663E97599J503J199J451J700J364O95M14Q67J775K638L093L114K990L041L230
49648F26673L284L214L409M068M816N127M964M755M809M936M714M109L643L854
49634F86375M511M757M117L129K634K791L166L468L680L671L275K819K889L561
49620G34843M367N047N725O259O109N143M093L790M339N210N839N908N450M917
$$ [...]
##END NTUPLES=NMR SPECTRUM
##END=
