##TITLE=NES1100_IP_9887010_eJgVA0lbO1
##JCAMPDX= 6.0         $$ Bruker NMR JCAMP-DX V2.0
##DATA TYPE= NMR SPECTRUM
##DATA CLASS= NTUPLES
##ORIGIN= BRUKER
##OWNER= Administrator
$$ 1.72 TOPSPIN		Version 2.1
$$ 2016-08-28 14:58:35.648 -0500  Administrator@X
$$ Compression mode = diff/dup
##.OBSERVE FREQUENCY= 400.02188249412
##.OBSERVE NUCLEUS= ^1H
##.ACQUISITION MODE= SIMULTANEOUS (DQD)
##.ACQUISITION SCHEME= undefined
##.AVERAGES= 8
##.DIGITISER RES= 22
##SPECTROMETER/DATA SYSTEM= spect
##.PULSE SEQUENCE= zg30
##.SOLVENT NAME= COFFEE_meoh
##.SHIFT REFERENCE= INTERNAL, COFFEE_meoh, 1, 14.98509
##AUDIT TRAIL= $$ (NUMBER, WHEN, WHO, WHERE, PROCESS, VERSION, WHAT)
$$ ##TITLE= Audit trail, TOPSPIN		Version 2.1
$$ ##JCAMPDX= 5.01
$$ ##ORIGIN= Bruker BioSpin GmbH
$$ ##OWNER= Administrator
$$ $$ E:\/data/COFFEE/nmr/NES1100_IP_9887010_eJgVA0lbO1/10/pdata/1/auditp.txt
$$ ##AUDIT TRAIL=  $$ (NUMBER, WHEN, WHO, WHERE, PROCESS, VERSION, WHAT)
(   1,<2016-08-28 14:58:28.445 -0500>,<Administrator>,<X>,<go>,<TOPSPIN 2.1>,
      <created by zg
	started at 2016-08-28 14:57:22.211 -0500,
	POWCHK enabled, PULCHK disabled,
       configuration hash MD5:
       21 0F 79 D6 B3 7B B4 F6 88 20 88 DB 03 48 BD 9F
       data hash MD5: 64K
       2D E5 70 EC 94 BB B1 06 44 1D A6 B1 3A DA 6A 13>)
(   2,<2016-08-28 14:58:31.554 -0500>,<Administrator>,<X>,<proc1d>,<TOPSPIN 2.1>,
      <Start of raw data processing
       efp LB = 0 FT_mod = 6 PKNL = 1 PHC0 = 0 PHC1 = 0 SI = 32K 
       data hash MD5: 32K
       02 34 C1 83 29 7A 02 8A CC 4B D4 15 FC 8F 59 9D>)
(   3,<2016-08-28 14:58:31.851 -0500>,<Administrator>,<X>,<proc1d>,<TOPSPIN 2.1>,
      <pk PHC0 = 90.50537 PHC1 = 0 
       data hash MD5: 32K
       02 EA 12 36 0E 3F 77 54 FE 5F 19 2A FB 11 4F AC>)
(   4,<2016-08-28 14:58:31.961 -0500>,<Administrator>,<X>,<proc1d>,<TOPSPIN 2.1>,
      <abs ABSG = 1 
       data hash MD5: 32K
       0F 3F 4A 08 25 B8 98 A2 3B 3C 81 74 2F 4D B9 A9>)
(   5,<2016-08-28 14:58:32.023 -0500>,<Administrator>,<X>,<proc1d>,<TOPSPIN 2.1>,
      <abs ABSG = 2 
       data hash MD5: 32K
       A5 D0 C4 FC 4B B5 4D 38 C0 DD A2 97 88 02 A6 A5>)
(   6,<2016-08-28 14:58:32.086 -0500>,<Administrator>,<X>,<proc1d>,<TOPSPIN 2.1>,
      <abs ABSG = 3 
       data hash MD5: 32K
       03 73 6E 56 A2 B0 D5 77 4E 6B 03 F4 BB 38 FB 24>)
(   7,<2016-08-28 14:58:32.148 -0500>,<Administrator>,<X>,<proc1d>,<TOPSPIN 2.1>,
      <abs ABSG = 4 
       data hash MD5: 32K
       1A 18 58 36 72 8F A4 3E 77 BC 15 19 38 B7 30 B9>)
(   8,<2016-08-28 14:58:32.211 -0500>,<Administrator>,<X>,<proc1d>,<TOPSPIN 2.1>,
      <abs ABSG = 5 
       data hash MD5: 32K
       D0 B4 59 8A 87 25 6A F0 98 72 B1 9F 74 30 45 40>)
$$ ##END=
$$ 
$$ $$ hash MD5
$$ $$ 0C 4A 72 89 37 39 8B A2 55 C1 32 92 D0 1F 8F 2C
##$RELAX= 
##$RELAX= 
##$RELAX= 
##$RELAX= 
##$RELAX= 
##$RELAX= 
##$RELAX= 
$$ Bruker specific parameters
$$ --------------------------
##$DU= <E:\>
##$EXPNO= 10
##$NAME= <NES1100_IP_9887010_eJgVA0lbO1>
##$PROCNO= 1
$$ [...]
##$TP= (0..7)
150 150 150 150 150 150 150 150
##$TP07= 0
##$TPNAME0= <>
##$TPNAME1= <>
##$TPNAME2= <>
##$TPNAME3= <>
##$TPNAME4= <>
##$TPNAME5= <>
##$TPNAME6= <>
##$TPNAME7= <>
##$TPOAL= (0..7)
0.5 0.5 0.5 0.5 0.5 0.5 0.5 0.5
##$TPOFFS= (0..7)
0 0 0 0 0 0 0 0
##$TUNHIN= 0
##$TUNHOUT= 0
##$TUNXOUT= 0
##$USERA1= <user>
##$USERA2= <user>
##$USERA3= <user>
##$USERA4= <user>
##$USERA5= <user>
##$V9= 5
##$VALIST= <valist>
##$VCLIST= <CCCCCCCCCCCCCCC>
##$VD= 0
##$VDLIST= <DDDDDDDDDDDDDDD>
##$VPLIST= <PPPPPPPPPPPPPPP>
##$VTLIST= <TTTTTTTTTTTTTTT>
##$WBST= 2048
##$WBSW= 25
##$XGAIN= (0..3)
0 0 0 0
##$XL= 0
##$YL= 0
##$YMAX_a= 553752
##$YMIN_a= -468962
##$ZGOPTNS= <>
##$ZL1= 120
##$ZL2= 120
##$ZL3= 120
##$ZL4= 120
##$ABSF1= 14.98509
##$ABSF2= -5.573092
##$ABSG= 5
##$ABSL= 3
##$ALPHA= 0
##$AQORDER= 0
##$ASSFAC= 0
##$ASSFACI= 0
##$ASSFACX= 0
##$ASSWID= 0
##$AUNMP= <proc_prof1d_extract_pilot.lims>
##$AXLEFT= 0
##$AXNAME= <>
##$AXNUC= <1H>
##$AXRIGHT= 0
##$AXTYPE= 0
##$AXUNIT= <>
##$AZFE= 0.1
##$AZFW= 0.1
##$BCFW= 0
##$BC_mod= 0
##$BYTORDP= 0
##$COROFFS= 0
##$CY= 15
##$DATMOD= 1
##$DC= 0
##$DFILT= <>
##$DTYPP= 0
##$F1P= 0
##$F2P= 0
##$FCOR= 0.5
##$FTSIZE= 32768
##$FT_mod= 6
##$GAMMA= 0
##$GB= 0
##$INTBC= 1
##$INTSCL= 1
##$ISEN= 128
##$LB= 0
##$LEV0= 0
##$LPBIN= 0
##$MAXI= 10000
##$MC2= 0
##$MEAN= 0
##$ME_mod= 0
##$MI= 0
##$NCOEF= 0
##$NC_proc= -8
##$NLEV= 6
##$NOISF1= 0
##$NOISF2= 0
##$NSP= 0
##$NTH_PI= 0
##$NZP= 0
##$OFFSET= 14.98509
##$PC= 1
##$PHC0= 90.50537
##$PHC1= 0
##$PH_mod= 1
##$PKNL= yes
##$PPARMOD= 0
##$PPDIAG= 0
##$PPIPTYP= 0
##$PPMPNUM= 2147483647
##$PPRESOL= 1
##$PSCAL= 4
##$PSIGN= 0
##$PYNMP= <proc.py>
##$REVERSE= no
##$SF= 400.02
##$SI= 32768
##$SIGF1= 0
##$SIGF2= 0
##$SINO= 400
##$SIOLD= 32768
##$SPECTYP= <>
##$SREGLST= <1H.CDCl3>
##$SSB= 0
##$STSI= 32768
##$STSR= 0
##$SW_p= 8223.68421052631
##$SYMM= 0
##$S_DEV= 0
##$TDeff= 65536
##$TDoff= 0
##$TI= <>
##$TILT= no
##$TM1= 0
##$TM2= 0
##$TOPLEV= 0
##$USERP1= <user>
##$USERP2= <user>
##$USERP3= <user>
##$USERP4= <user>
##$USERP5= <user>
##$WDW= 1
##$XDIM= 32768
##$YMAX_p= 450029862
##$YMIN_p= -687387
##$CURPLOT= <Network HP LaserJet P1505>
##$CURPRIN= <$Network HP LaserJet P1505>
##$DFORMAT= <normdp>
##$LAYOUT= <+/1D_H.xwp>
##$LFORMAT= <normlp>
##$PFORMAT= <normpl>
##$SURQMSG= 1
$$ End of Bruker specific parameters
$$ ---------------------------------
##NTUPLES= NMR SPECTRUM
##VAR_NAME=  FREQUENCY,     SPECTRUM/REAL,   SPECTRUM/IMAG
##SYMBOL=    X,             R,               I
##VAR_TYPE=  INDEPENDENT,   DEPENDENT,       DEPENDENT
##VAR_FORM=  AFFN,          ASDF,            ASDF
##VAR_DIM=   32768,         32768,           32768
##UNITS=     HZ,            ARBITRARY UNITS, ARBITRARY UNITS
##FACTOR=    0.250966925370066, 1,           1
##FIRST=     8223.43324360094, 43610,        2796
##LAST=      0,             -108396,         -55304
##MIN=       0,             -687387,         0
##MAX=       8223.43324360094, 450029862,    0
$$ Real data points
##PAGE= N=1
##DATA TABLE= (X++(R..R)), XYDATA
$$ [...]
19517A44838O6842a35058b2185C8152b14288a8174j21384L2464j79381Q3633F2454
19505d2333k9312C03141f8269L0942A98317r2685c47829J34929H410O8817b32019
19493G1488N0029b62388A06592c49519a45998j496K7266A16397D0714J73639E6487
19481E7656g7547b8152A8722K39941a52415p7351J12422I5789l056i8955k13542
19470c12497O1547B49739c64917B41383G2538N5293a96668j58736a20983q7200
19460b08183B90142c15559B68752a30349E3428a84356f9184B41699b32210A80554
19449b61107A26187c20833Q0460G1311J4010B4655c0737j62322e6536n7461K6542
19438h7455j51791q6651L7737A86248o3401b41774I6477B2810a8017k53138j5210
$$ y = [144838, 211680, -135058, -22185, 38152, -214288, -18174, -139558, -107094, -286475, -202842, 62454, -42333, -71645, 303141, -68269, -37327, 198317, 105632, -347829, -212900, 8410, 77227, -232019, 71488, 121517, -262388, 106592, -349519, -145998, -147494, -120228, 116397, 40714, 214353, 56487, 57656, -77547, -28152, 18722, 258663, -152415, -229766, -117344, 95789, 92733, -98955, -312497, -250950, 249739, -364917, 241383, 72538, 127831, -196668, -355404, -120983, -208183, 290142, -315559, 268752, -130349, 53428, -184356, -69184, 241699, -232210, 180554, -261107, 126187, -320833, -240373, 71311, 85321, 24655, -30737, -193059, -56536, -113997, -87455, -239246, -325897, -288160, 186248, 122847, -241774, 96477, 22810, -18017, -271155, -286365]
19427b86365A96939p8581a91517C3743b71029A68658O7311c0855C8364a61486
19416g0938j01270j30341B74535a82541D3163a42234f7740L3475J5226k06571
19406b25610E2689J49755D4608b89459c7778J2484P757A45504G1120R4322h9760
19394a78505b8290b594A37689J53861r1434b08001O0034k9753J293k52139A61110
19382D1267N883d6019k05306A68284B6773I707b85313f7087E2660J22659b03751
19370b71859A68119b5542k6876k4940q2799A57840g3899j6911j27161A28690A2552
19358B53730c79105A59109C9250d8659i281k91148a8239A38046B1033K5563a40595
19346b03458G8225a8678j38670A91237H9176h6288p7137b475E9457i1191m0144
$$ y = [-286365, 196939, 118358, -191517, 33743, -271029, 168658, 235969, -30855, 38364, -161486, -70938, -172208, -302549, 274535, -182541, 43163, -142234, -67740, -34265, -19039, -225610, 52689, 202444, 44608, -289459, -37778, -25294, -17537, 145504, 71120, 165442, -89760, -178505, -28290, -2594, 137689, 291550, 200116, -208001, -147967, -177720, -176427, -428566, 161110, 41267, 47150, -46019, -251325, 168284, 26773, 9707, -285313, -67087, 52660, 175319, -203751, -271859, 168119, -25542, -52418, -77358, -160157, 157840, -73899, -90810, -217971, 128690, 12552, 253730, -379105, 159109, 39250, -48659, -9281, -300429, -18239, 138046, 21033, 46596, -140595, -203458, 78225, -18678, -157348, 191237, 89176, -86288, -163425, -2475, 59457, -91191, -131335]
19335a31335a8061r6352L115m5110e6788B3174a40944C1020J89100a62698l96832
19324e59530b02098o7418g3294n2959A0264J16176a50539B862c87254b1396F8278
19312c13558C9262b6232q8225k41136I7215Q9269a16683o7789r1271d3987B65633
19300b01236K4238A81023b6693D9396e6532F6409a56127G4807c7916k17156j44346
19289c99418A19333B5172J42833F8448B1965J11041a51282A41371c26915Q7222
19279b39693I8376a35310n0142J7188L0716m9167b8260p9673d5794A32277a54173
19267E8194a63467O1185b6377B8256G571a56533a578A10825a08531a6632G1959
19255b80225Q1787R5986j82141a16721A56706d68234J11182J76799q3292A09304
$$ y = [-131335, -18061, -114413, -111298, -156408, -56788, 23174, -140944, 31020, 220120, -162698, -559530, -202098, -269516, -73294, -126253, 10264, 126440, -150539, 2862, -387254, -21396, 68278, -313558, 39262, -26232, -114457, -355593, 97215, 186484, -116683, -184472, -275743, -43987, 265633, -201236, -176998, 181023, -26693, 49396, -56532, 66409, -156127, 74807, -37916, -255072, -399418, 119333, 25172, 168005, 68448, 21965, 133006, -151282, 141371, -326915, -239693, 98376, -135310, -185452, -168264, -137548, -186715, -28260, -107933, -45794, 132277, -154173, 58194, -163467, -102282, -26377, 28256, 7571, -156533, -1578, 110825, -108531, -16632, 71959, -280225, -198438, -102452, -284593, -116721, 156706, -468234, -357052, -180253, -263545, 109304]
19244a94367c9343j5969j02461B45744a65797D4844c26876I4908J1992k4732a93148
19232c6383k87265A1370J82717a4036j31165J1332k65023D0347h9775k66980f4073
19220h879l52213F2214d67113H0350g0237C1038a19131A65129d2863j51688p9928
19209b74479J18632J7259p8891g6853J4454D971a23512r5076d1934j87715a04738
19197A25377a34848J4414B42260q2116e0773e364k76817B67917a3595A68476F7161
19185b59858C36123a37936C19966d9972k94132a09182j29428R9312J8363F0561
19174d28694a6237B29988c6965Q334k43416B7408l614d74189B8229J49634g9795
19162c40422e6367A26584a05736j96856F0706a69407c6831H7110M4453a19200
$$ y = [-194367, -39343, -55312, -157773, 245744, -165797, 44844, -326876, 94908, 106900, 82168, -193148, -36383, -323648, 11370, 194087, -14036, -145201, -133869, -398892, 40347, -89775, -356755, -64073, -8879, -361092, 62214, -467113, 80350, -70237, 31038, -119131, 165129, -42863, -194551, -274479, -155847, -138588, -217479, -76853, -62399, 4971, -123512, -218588, -41934, -229649, -104738, 125377, -134848, -120434, 242260, 160144, -50773, -5364, -282181, 267917, -13595, 168476, 67161, -259858, 336123, -137936, 319966, -49972, -344104, -109182, -238610, -139298, -120935, 60561, -428694, -16237, 229988, -36965, -28631, -272047, 27408, 23794, -474189, 28229, 177863, -79795, -340422, -56367, 126584, -105736, -302592, 60706, -169407, -36831, 87110, 131563, -119200]
19151A9604P0641k1087i738k54339B29288c1123B56324F2556O5436j7261c9583
19139a62919j32775C19448C1802b91260K2461B38027A16961a85162b1326r9627
19129a20953j30166H796J76359H8382B5613c00688J3622J6856a0977j50575A85525
19117a14425c490j66730j49569P0421M5813h3117E3498a07555k25049A20223j1388
19106A08835C6951a99478B00545H3338b18616H7858K0322k7821p330e1121F5518
19094b02218O8412k24401R3923A14672a17283p9041n3926N1989j2534M4464A36069
19082e4163k44635a10064A10798K48187d970C31680f4792l4791d841A835a90126
19070a10562e0625j86748F7079h2024G9228j878c14592C54565a45892G7717O8464
$$ y = [19604, 90245, 69158, -9738, -264077, 229288, -31123, 256324, 62556, 127992, 110731, -39583, -162919, -295694, 319448, 31802, -291260, -268799, 238027, 116961, -185162, -21326, -120953, -251119, 8796, 185155, 88382, 25613, -300688, -287066, -270210, -10977, -161552, 185525, -114425, -3490, -170220, -319789, -249368, -203555, -83117, 53498, -107555, -332604, 120223, 108835, 36951, -199478, 200545, 83338, -218616, 87858, 108180, 80359, 73029, -51121, 65518, -202218, -133806, -358207, -264284, 114672, -117283, -196324, -250250, -198261, -210795, -166331, 136069, -54163, -298798, -110064, 110798, 358985, -4970, 331680, -64792, -99583, -4841, 1835, -190126, -110562, -50625, -237373, 67079, -82024, 79228, 77350, -314592, 354565, -145892, 77717, 146181]
19059A46181a01678j39962p7905h8267j24789e5569A64932i8833A21372a75905
19048e8346H470a22530l4769f858A34117o1918L2446b64313H7175f6604A38206
19036c594j16803D5046b82287O9960A68154a14470N0018j85987D3045J55027b41132
19024I0949c5976j13228A03368L0033a6000q1273B69022b6796A24882a46609A28844
19012b14600f9574K3997B37310a76388b5596B06955b16485A51536B3504a94458
19001b8766F6306b28225b7837A79319m2161a7901A12306j0184A8857J02732i6597
18989i0412A1480K58603c86483i5930A09118b56874p999A52710a84180A62620
18978i1022A3008a22127A25730J19484J64037M0239M5015B8525e7786n4921k16590
$$ y = [146181, -101678, -241640, -319545, -88267, -213056, -55569, 164932, -98833, 121372, -175905, -58346, 8470, -122530, -157299, -6858, 134117, 72199, 104645, -264313, 87175, -66604, 138206, -3594, -120397, 45046, -282287, -212327, 168154, -114470, -64452, -250439, 43045, 198072, -241132, 90949, -35976, -149204, 103368, 133401, -16000, -97273, 269022, -26796, 124882, -146609, 128844, -214600, -69574, -45577, 237310, -176388, -25596, 206955, -216485, 151536, 23504, -194458, -28766, 66306, -228225, -27837, 179319, 137158, -17901, 112306, 102122, 18857, 121589, -96597, -90412, 11480, 270083, -386483, -95930, 109118, -256874, -264873, 152710, -184180, 162620, -91022, 13008, -122127, 125730, 245214, 409251, 449490, 494505, 28525, -57786, -112707, -329297]
18967c29297H7054J82230c01303a22997N8511c0291A5377K534B605K254J21086
18956A25945a0404k75618a18411l70465b003B8491p960b74534C4449b86159i3113
18944A13378a3762B52633A10101L22898I0528H830J70584b50840e0839B6950c04196
18932i2422k74593c4642A4292Q1540a78812C80372c878l15238d4385f179H2764
18920A53899A8426f5890A92393o7803c2453j23600f546k11579G7863J2546L95451
18909D85860N6725j03946b24816C4175a08561R212F6291J2107P4491a22649e252
18897B17841I2913A9452a31601j70328A12062a8606k00246A82367c34532A52859
18886C17377a87300d5221j7293p0374k507j555J6642e6482l21105A93229o4588
$$ y = [-329297, 87054, 269284, -301303, -122997, -64486, -30291, 15377, 17911, 2605, 4859, 125945, -10404, -286022, -118411, -488876, -2003, 28491, 20531, -274534, 34449, -286159, -93113, 113378, -13762, 252633, 110101, 432999, 90528, 8830, 179414, -250840, -50839, 26950, -304196, -92422, -367015, -34642, 14292, 95832, -178812, 380372, -3878, -319116, -44385, -6179, 82764, 153899, 18426, -65890, 192393, 124590, -32453, -156053, -6546, -218125, 77863, 90409, 485860, 542585, 438639, -224816, 34175, -108561, -99349, 66291, 78398, 152889, -122649, -5252, 217841, 92913, 19452, -131601, -301929, 112062, -18606, -218852, 182367, -334532, 152859, 317377, -187300, -45221, -62514, -132888, -135395, -136950, -120308, -56482, -377587, 193229, 128641]
18875A28641b46826A2880O0196R150c5559j10285I817b30759P2446H866a67312
18863A97340A4422K05304b14966A38580e7824E01838b08921B8992a60116f5529
18852i7695A4779N62131G0663k1085J29703A7915J97285J22829A39562K473b39417
18840a88534d0369J7094p5146B05810E6085b31218J8291P8645l3846j45949k9837
18829c43914J4590l7956J47932f937F0580C041J43566E2143a33038k2074d2283
18817A94364q6336a62740F4768O9520f9136m9566L0341B30003A07196F654L42464
18806C49118A4723b82400G410O573N9305B722c35893J27196F006J19910c96739
18794b40252j4466E5162h2466j78690J9283F3P4702B3832L0595a79228b9793E1075
$$ y = [128641, -246826, 12880, 73076, 82226, -35559, -145844, 9817, -230759, -158313, 8866, -167312, 197340, 14422, 219726, -214966, 138580, -57824, 501838, -208921, 28992, -160116, -65529, -97695, 14779, 576910, 70663, 49578, 179281, 17915, 215200, 338029, 139562, 142035, -239417, -188534, -40369, -23275, -98421, 205810, 56085, -231218, -212927, -134282, -168128, -314077, -343914, -329324, -367280, -219348, -6937, 60580, 3041, 146607, 52143, -133038, -155112, -42283, 194364, 108028, -162740, 64768, 134288, -69136, -118702, -88361, 230003, 107196, 6654, 349118, 14723, -282400, 7410, 13983, 73288, 2722, -335893, -208697, 6006, 125916, -396739, -240252, -254718, 55162, -82466, -261156, -241873, 63, 74765, 23832, 54427, -179228, -29793, 51075]
18781d16370e1691j10242A56255b38234d1734N960C22167a02797j80922c8965
18770b29999a02629k57589J10401d7304A97997p3075b34494f9510G0323d1277
18759D1105b99024C03083a04306k07973a1468A99525d7243A31160d7588l8810
18749h6398B5879c60925i3102r484a1911A50023b39543D2861a95638H1998a936
18737B90202g1369A44739o5191a12915n9146d1692M477j67264g8336A1097a823
18725g6062b0340A93686i761A94765P7247b69388A8196J53317a30473q7527F0748
18713I301g9514I5002b0089r2224P631A09656i5304m9828p250g009A23573j0641
18701A12932K26890A04859a02728B82155d09813a28108E68b29255M9600j13260
$$ y = [-416370, -51691, -161933, 156255, -238234, -41734, -35774, 322167, -102797, -283719, -38965, -229999, -102629, -360218, -249817, -47304, 197997, 124922, -234494, -69510, 70323, -41277, 41105, -299024, 303083, -104306, -312279, -11468, 199525, -47243, 131160, -47588, -86398, 25879, -360925, -93102, -102586, -11911, 150023, -239543, 42861, -195638, 81998, -1936, 290202, -71369, 144739, 79548, -112915, -172061, -41692, -37215, -204479, -78336, 11097, -1823, -76062, -20340, 193686, -9761, 194765, 272012, -269388, 18196, 171513, -130473, -218000, 60748, 9301, -79514, 95002, -20089, -112313, -104682, 109656, -95304, -145132, -152382, -7009, 123573, 112932, 339822, 104859, -102728, 282155, -409813, -128108, 568, -229255, -179655, -292915]
18691b92915e5659J272j11406B44858D316J49338G4582c31277N3844a06035l25803
18680d31838B73263h9684d0399l2126j05314f9317j06201A43324G522a67839K0513
18669a47326M195B04203a80041j24246J2529g7417I6659b04618k9415Q2744A00614
18657b18456A19573c83639a39506K4259j18351a4719C4765R9535k421D7746c9266
18645A78756d8292j25918F7a20231A12775a03570j68462A50690a07895j75134
18635b83029j23482d1697E87g8882n2513j09536f6016G1165B1414a21784C8896
18623B38584f4319j37992l4398K4719A6991M4006K67218b3564k85712f3636A66107
18611a94827A22655B4010n165K34072c49826a16110J5520F459J60667g7622B65669
$$ y = [-292915, -55659, -54387, -165793, 244858, 4316, 153654, 74582, -331277, -277433, -106035, -431838, 273263, -89684, -40399, -72525, -177839, -69317, -175518, 143324, 7522, -167839, -147326, -143131, 204203, -180041, -304287, -291758, -77417, 96659, -204618, -234033, -151289, 100614, -218456, 119573, -383639, -139506, -115247, -233598, -14719, 34765, 134300, 131879, 47746, -39266, 178756, -48292, -174210, 67, -120231, 112775, -103570, -272032, 150690, -107895, -283029, -406511, -41697, 587, -78882, -131395, -240931, -66016, 71165, 21414, -121784, 38896, 238584, -64319, -202311, -236709, -211990, 16991, 60997, 328215, -23564, -309276, -63636, 166107, -194827, 122655, 24010, 18845, 252917, -349826, -116110, -100590, 6459, 167126, -77622, 265669]
18599A71373l7819c3955A36812a84184D7451a70819j44741A0259b67040B6557
18588D8131J9e8885B18451C4319Q4062l6139b90557A3480K9274L0035A8826a40182
18575a07201j0797j02593g4174k18441Q9246F218J6342h9445C40423e3921l0391
18564h4312A80007e4163j11671H9830b20618e9575B29778B7897a07755C9331a0424
18552c55758A33706B4101b65205b7933A39008a71491L2927l9140a9019B3122b83510
18540F9204A3819b57084j20246a17454C12726a3454k0239F673a28272A46020Q2458
18529B28478d0995A82382g2407j32385R2962k65617N2053B61188a73303B260M2436
18518D4696c0929B29985b75609Q0571A92832a75568O9154M3897l8086A8648a4963
$$ y = [171373, 133554, -33955, 136812, -184184, 47451, -170819, -315560, 10259, -267040, 26557, 48131, 48150, -58885, 218451, 34319, 118381, 82242, -290557, 13480, 42754, 72789, 18826, -140182, -107201, -117998, -220591, -74174, -292615, -203369, 6218, 22560, -89445, 340423, -53921, -84312, 180007, -54163, -165834, 89830, -220618, -59575, 229778, 27897, -107755, 39331, -10424, -355758, 133706, 24101, -265205, -27933, 139008, -171491, -138564, -177704, -19019, 23122, -283510, 69204, 13819, -257084, -377330, -117454, 312726, -13454, -33693, 6673, -128272, 146020, 228478, -40995, 182382, -72407, -204792, -111830, -377447, -325394, 261188, -173303, 2260, 44696, -30929, 229985, -275609, -195038, 192832, -175568, -106414, -62517, -100603, 18648, -14963]
18506a36091f6509o7076A47395R9044G7484g8112l6093j10658E652c93636C5851
18494D3284Q3434g2194J0072A14691R0710a11542F8502b087k66384A81114d6810
18482G8479K6033a28209d9974j04210A64371b11098k033C89707a8244A75470h7046
18470A56276g2849q9747F2180a09934l27626a86746j07321e5355j10112n9703
18460b25170B06588d1933J4455j11332r4707E143O4278M916b75963I9488d6008
18448A44632J27579o7637b07656N7188a186k32339A47346i8090A23171b06259
18437a73496E3526e61940e8293p1832E3894b99158D4475c37131A32041f5736D9795
18425f8187k27426a1006p6329j43675A46782d8207j78921F5825J20736a9399p1431
$$ y = [-136091, -66509, -133585, 147395, 246439, 77484, -78112, -114205, -224863, 5652, -393636, 35851, 43284, 126718, -72194, -62122, 114691, 205401, -111542, 68502, -2087, -268471, 181114, -46810, 78479, 104512, -128209, -49974, -154184, 164371, -211098, -213131, 389707, -18244, 175470, -87046, 156276, -72849, -162596, 62180, -109934, -437560, -186746, -294067, -55355, -165467, -225170, 206588, -41933, -27478, -138810, -233517, 5143, 69421, 74337, -275963, 99488, -46008, 144632, 272211, 204574, -207656, -150468, -1186, -233525, 147346, -98090, 123171, -206259, -173496, 53526, -561940, -58293, -130125, 53894, -299158, 44475, -337131, 132041, -65736, 49795, -68187, -295613, -11006, -87335, -231010, 146782, -48207, -227128, 65825, 186561, -19399, -90830]
18414i0830l5717F9682J56778m0307a61318D08321H3872b40029f8887A30717e1390
18402i5880F3558L7323g4142j2643F5088a05918C45641E7304c19594D8847h5069
18390b4023j8359m6949A84691q4637a66446O4515F0900a41914E5235a98426N5942
18379a42484l4937C2074a42367A88789d8320J9124k88652B14270g5295A18208
18368b27363R8906F8230B3179b42909D5742a06133A94739k496n9557a6423B78687
18356c7846B49695g7722k401C2726O776b04842a1214A11993B4774c4504A5004
18344A77032C5955d09278i5722b2518B03560i3077K7564a7736G5272b10734C44139
18332A81783g6603f896j24753A18940a80201c4441B00761b25679A08338f7642
$$ y = [-90830, -126547, 69682, 226460, 186153, -161318, 408321, 83872, -240029, -68887, 130717, -51390, -95880, 63558, 100881, -74142, -86785, 65088, -105918, 345641, 57304, -319594, 48847, -85069, -24023, -42382, -89331, 184691, 100054, -166446, -101931, 60900, -141914, 55235, -198426, -142484, -177421, 32074, -142367, 188789, -48320, -29196, -317848, 214270, -75295, 118208, -227363, -128457, 68230, 23179, -242909, 45742, -106133, 194739, 192243, 132686, -16423, 278687, -37846, 249695, -77722, -80123, 32726, 39502, -204842, -11214, 111993, 24774, -34504, 15004, 177032, 35955, -409278, -95722, -22518, 203560, -93077, -65513, -17736, 75272, -210734, 344139, 181783, -76603, -6896, -131649, 118940, -180201, -34441, 200761, -225679, 108338, -67642]
18321b58053H3263b55022i4200j3242F1374O5165C9525d12473A49200a53441I0493
18309c62907h1765B37149o8873a1592G6100A5361i724p4851B5708K68610H7423
18297d19182J57971a1110A85741c2074k35057A40407o3083A2006K31251b8181
18286a90619g2564R382A3675J90100h5954I24a87992A83342C9973a86346D00503
18274a20185q9744E0959i4657C03015e3603A24803b34012e3653A00274a33228
18263I9601e2333j56949e6067A60238O0836q0458h4442k15104J06983l6323C12432
18251a54289n5644i5404C9205c42158B7927g9198A39929B0737M203J63218b24109
18239H081L75895b565j85451o9794a06915A7061R5833L4865b7205F9866m510M19590
$$ y = [-258053, 83263, -255022, -94200, -107442, 61374, 126539, 39525, -412473, 149200, -153441, 90493, -362907, -81765, 237149, 168276, -11592, 76100, 15361, -9724, -84575, 25708, 294318, 87423, -419182, -261211, -11110, 185741, -32074, -267131, 140407, 77324, 12006, 243257, -28181, -190619, -72564, -63182, 13675, 203775, -85954, 924, -187992, 183342, 39973, -186346, 400503, -120185, -209929, 50959, -94657, 303015, -53603, 124803, -234012, -53653, 100274, -133228, 99601, -52333, -209282, -56067, 160238, 221074, 140616, -84442, -299546, -192563, -228886, 312432, -154289, -209933, -95404, 39205, -342158, 27927, -79198, 139929, 20737, 24940, 188158, -224109, 8081, 383976, -2565, -188016, -257810, -106915, 17061, 112894, 147759, -27205, 69866, 65356, 484946]
18227D84946A96121E2548g8454b9509I8032c33474E6517b71185D1910d290k47335
18216b51625A29151f2073j589E5215R0776e908l16650h2061B17374a20180A25471
18204H5249b6912q5151k89334A55513E5767a96359g5046K5086j02438A47647Q6806
18193B34453A13833i9429k0598d8684B77686A03114a27247B961b5943A10423a01412
18181i7970j19336j78897A05974h3558l73261c1228I0510a83860G5589j5327h4159
18169d02778D0302a26816a5166l8543A56129d77034b06585r2617C37066a9646
18158B99910g887D8432a83425a3065A04046R836d2582n2849B6805O4882i0059
18146a42820d7458j07266A90006o8791N9066J05696a36304c766A67924B846Q1996
$$ y = [484946, 196121, 52548, -78454, -29509, 98032, -333474, 56517, -271185, 41910, -4290, -251625, 129151, -62073, -63662, 55215, 145991, -5908, -322558, -82061, 217374, -120180, 125471, 85249, -26912, -112063, -401397, 155513, 55767, -196359, -75046, -49960, -152398, 147647, 234453, 113833, -99429, -120027, -48684, 277686, 103114, -127247, 2961, -25943, 110423, -101412, -97970, -217306, -396203, 105974, -83558, -456819, -31228, 90510, -183860, 75589, 60262, -84159, -402778, 40302, -126816, -15166, -53709, 156129, -477034, -206585, -299202, 337066, -19646, 299910, -7887, 48432, -183425, -13065, 104046, 113882, -42582, -95431, 26805, 91687, -90059, -142820, -47458, -154724, 190006, 121215, 180281, 285977, -136304, -3766, 167924, 2846, 84842]
18135H4842c24781A62919g4007E309i034A25792c2608A3530b97964c0465O837
18124b3628B77857A6024J08235g3200j28557A35441h2982G1320K312i9791n9073
18113a58864A6347K50123a62962l8882B48354j14502a52230I6373a17819c6760
18102a96228d6987B20827a80093G9422b53672B76807b15779n228a01945r4507
18092a96452Q9158C2078K18243r2889A2739b14568K7438P4912k54377c8502A05970
18080C32186E4328g8510A04329o583a97249A11150h4659B97561o4605a51527b7252
18068A53527E129b33569i8062J4693A1467a22688j3691k57576g6937A92584d0096
18056E7891h1368j0791c2840G902J2856c6773A07500L89065A66698h6092j18599
$$ y = [84842, -324781, 162919, -74007, 5309, -9034, 125792, -32608, 13530, -297964, -30465, -23628, 277857, 16024, 124259, -73200, -201757, 135441, -82982, 71320, 73632, -99791, -158864, 16347, 266470, -162962, -201844, 248354, 133852, -152230, 96373, -117819, -36760, -196228, -46987, 220827, -180093, 79422, -253672, 276807, -215779, -221007, -101945, -196452, -107294, 32078, 250321, 157432, 12739, -214568, -187130, -112218, -366595, -38502, 105970, 332186, 54328, -78510, 104329, 97746, -197249, 111150, -84659, 297561, 232956, -151527, -27252, 153527, 5129, -233569, -98062, -83369, 11467, -122688, -136379, -393955, -76937, 192584, -40096, 57891, -81368, -92159, -32840, 7902, 20758, -36773, 107500, 496565, 166698, -86092, -204691]
18045b04691h739B8001Q1819Q1351c71651a11808J0109C5527d85396K19489a11213
18033A35765a83419G5041d2318B39469b5972A45609a15817A60273b60869A64266
18022h8698G2658b49290e3727h594A42670a6381A55803b9427m3141j16943H5101
18010A84897G2508K65747a02700C2714J65631a59464G4186J34761I6381b74251
17999c05671i0303j34008A38408b30107A81765h8445C1416i4442j93539b4041
17988F8247k2034j6046J43804P9998A9004J31917a78604g1160C70025A28515a41018
17976A98473J1242h5310A21394Q7454c6225B57409p029c02315f5127b2294k17345
17965b39639A65430a04606a9247A07752P3497a19252A64584E8142n676b14090
$$ y = [-204691, -8739, 28001, 109820, 191171, -371651, -111808, -101699, 35527, -485396, -265907, -111213, 135765, -183419, 75041, -42318, 239469, -25972, 145609, -115817, 160273, -260869, 164266, -88698, 72658, -249290, -53727, -8594, 142670, -16381, 155803, -29427, -72568, -189511, 85101, 184897, 72508, 338255, -102700, 32714, 198345, -159464, 74186, 208947, 96381, -274251, -305671, -90303, -224311, 138408, -230107, 181765, -88445, 31416, -94442, -287981, -24041, 68247, 46213, 30167, 173971, 253969, 19004, 150921, -178604, -71160, 370025, 128515, -141018, 198473, 209715, -85310, 121394, 208848, -36225, 257409, 250380, -302315, -65127, -22294, -239639, 165430, -104606, -19247, 107752, 181249, -119252, 164584, 58142, 52466, -214090]
17954E256a71419C3286j0149K637j2207b08400o588H9099C9299J56048a58307
17942h468j8256l7053A09935J66768m9503j11565g2060B90071b45552i4446A96001
17930c51451a3836B22296r5626a38382A36792a8708A47712b16511B9465L53977
17920C83442i9922j65164a1417m9593A35761J44993j478b09865I3590K4754b12835
17908a0095A33129a65084C8439Q8329e5464G9174B4384a16020o9504F5905a10338
17896a98410D10083c2269A40560F563A102L47270a98450A9999a37805C69579N2824
17885D22403a03199c7337A16a29801N1494B4621M8437j1199L1655j5247J65005
17874B43272d9926f330j09933L5802A22578a81444c7245k8961I4074J2865h2030
$$ y = [5256, -171419, 33286, 23137, 25774, 13567, -208400, -214988, 89099, 39299, 195347, -158307, -8468, -26724, -63777, 109935, 276703, 227200, 115635, -72060, 290071, -245552, -94446, 196001, -351451, -13836, 222296, 126670, -138382, 136792, -18708, 147712, -216511, 29465, 383442, -99922, -265086, -11417, -61010, 135761, 280754, 279276, -209865, 93590, 118344, -212835, -10095, 133129, -165084, 38439, 126768, -55464, 79174, 24384, -116020, -185524, 65905, -110338, -198410, 410083, -32269, 140560, 6563, 1102, 348372, -198450, 19999, -137805, 369579, 422403, -103199, -37337, 116, -129801, -78307, 24621, 73058, 61859, 93514, 78267, 243272, -49926, -6330, -116263, -80461, 122578, -181444, -37245, -66206, 94074, 106939, -82030]
17862a64226H1389h5753A74482J12164D069d08277B30959C8815J0890O3023K883
17851A15611b07353f1040j12794A57365c420E9521A8852a16160A46016b3789l2291
17840e6080j05386M5531L461k1154A6848e2601C66693h7421k33472g2627A87036
17828b29148H7797h8318a1562p052j45002A1978J13550K0362C3301a73890G1720
17816A97162e5794j00174d5066C21142b6773B34129i9458A45702g7808j17791
17806a95599f0997F2819e4688b2520j44812H6588a04131F6286d0811j31875A87115
17794b79516A32154a61623B2035J78318P264a1397A46794i5594E6824g5901R412
17783f6489K8335J1572l13402B10548h2177J7732k85758B4047g9563e762B02096
$$ y = [-164226, 81389, -85753, 174482, 286646, 4069, -408277, 230959, 38815, 49705, 112728, 115611, -207353, -61040, -173834, 157365, -3420, 59521, 18852, -116160, 146016, -23789, -56080, -161466, -115935, -112474, -133628, 16848, -52601, 366693, -87421, -320893, -72627, 187036, -229148, 87797, -88318, -11562, -18614, -163616, 11978, 125528, 145890, 33301, -173890, 71720, 197162, -55794, -155968, -45066, 321142, -26773, 234129, -99458, 145702, -77808, -195599, -60997, 62819, -54688, -22520, -167332, 86588, -104131, 66286, -40811, -172686, 187115, -279516, 132154, -161623, 22035, 200353, 207617, -11397, 146794, -95594, 56824, -75901, -66489, -38154, -26582, -339984, 210548, -82177, -64445, -350203, 24047, -79563, -5762, 202096]
17771H5703o956K9017J29205a69405q793k9160m6749a1407q2842E3337a71055
17759a37636I832L1276J94505b45854E5209c8222j42548C4514h3374F827L0009
17748C6836E660M3483a11590D7226d8170q128F7984O3064a30782A04272n1917
17737E2355A7631J91836c44897a03851d1914A53890J25654h9195A09131d5196
17726A83024A7217a1206D30675d36807i1399i258c866k47733B9284J11149e17832
17714A87777l4010N2627q1999E3116J75064a04382F6501L46082C1312J2421L8813
17703H2546I633J33616f8368b2890j43344B61331A803b68169O5645D6193a74368
17691B75611f4381e461A51164L34268j37075r6695I9023J04483a4492C24165b1725
$$ y = [85703, 78747, 107764, 236969, -169405, -178198, -207358, -254107, -11407, -94249, 53337, -171055, -137636, 9832, 41108, 235613, -245854, 55209, -38222, -180770, 34514, -83374, 6827, 36836, 5660, 49143, -111590, 47226, -48170, -56298, 67984, 131048, -130782, 104272, 52355, 17631, 209467, -344897, -103851, -41914, 153890, 279544, -89195, 109131, -45196, 183024, 17217, -11206, 430675, -436807, -91399, -9258, -3866, -251599, 29284, 140433, -517832, 187777, 153767, 206394, 124395, 53116, 228180, -104382, 66501, 412583, 31312, 43733, 82546, 9633, 143249, -68368, -22890, -166234, 261331, 1803, -268169, -202524, 46193, -174368, 275611, -64381, -5461, 151164, 485432, 348357, 251662, 99023, 203506, -14492, 324165, -21725]
17679G3636L5005b36228A52686M9085n021a2293F4319k0912J77588a07319B21312
17667A60714a8645A63310L9387q0037J2578L391a36414B46451d08110d0083B39789
17655B8196e737F1263a17644B21561I0029i6581a9093F4689a03341B19877a14486
17643B09559J64125A13398c17307H5843D0030R6609b03931K9165F2818K68082
17633C30900b34544a08420A12497L05985j54636i6175j6329B7628b60201D8777
17622b8656A25675g3296j54654a01100B61172P8716b7533j22298F4761L3628K90216
17611C88605e07078A52184m7450L0272E3849O6313M39260B49448H9589g0355A50690
17599B39049a02380A18205J5929k0948e324k9393A58875G2087m485K22169m8284
$$ y = [73636, 108641, -236228, 152686, 201771, 196750, -12293, 64319, 43407, 220995, -107319, 221312, 160714, -18645, 163310, 202697, 122660, 135238, 138629, -136414, 246451, -408110, -40083, 239789, 28196, -5737, 61263, -117644, 221561, 90029, -96581, -19093, 64689, -103341, 219877, -114486, 209559, 373684, 113398, -317307, 85843, 40030, 136639, -203931, -174766, 62818, 330900, -234544, -108420, 112497, 418482, 263846, -96175, -112504, 27628, -260201, 48777, -28656, 125675, -73296, -227950, -101100, 261172, 339888, -27533, -149831, 64761, 98389, 388605, -507078, 152184, 104734, 135006, 53849, 120162, 559422, 249448, 89589, -70355, 150690, 239049, -102380, 118205, 134134, 113186, -5324, -34717, 158875, 72087, 67602, 289771, 241487]
17588B41487a03086a4773k68159A72825F0951J67502E4259M2025C5532J50877
17578A86409J19780C5801L79972j98530J64873q7018c3817B93972b25186h4355
17567A57567J684a61151A20445J77558A48879o480L1963h3300b6657D547J98817
17556B03364E7519J34677n059b9679B15966a6240C81916o6578C3899N4459l6795
17545E1563k3771J62909O1001d9347r641A10774d0874B61243J25342F5498N824
17534G1322O1690J63764J0639j38239P4542R4463f0561B81099A1390M29498L19404
17523G60292M0706J17140j94715Q2826l20927r3939E0102J67280n3485K10930
17513C74827H9533P02374B28843K83353K58260j13423K06191q5540l36588j91869
$$ y = [241487, -103086, -14773, -282932, 172825, 60951, 228453, 54259, 96284, 35532, 186409, 306189, 35801, 415773, 217243, 382116, 295098, -33817, 293972, -225186, -84355, 157567, 159251, -161151, 120445, 298003, 148879, 142399, 174362, -83300, -26657, 4547, 203364, 57519, 192196, 187137, -29679, 215966, -16240, 381916, 315338, 33899, 88358, 51563, 27792, 190701, 251702, -49347, -58988, 110774, -40874, 261243, 386585, 65498, 71322, 133012, 296776, 307415, 169176, 243718, 338181, -60561, 281099, 11390, 440888, 760292, 800998, 918138, 723423, 806249, 485322, 391383, 50102, 217382, 163897, 374827, 89533, 791907, 228843, 512196, 770456, 657033, 863224, 777684, 441096, 249227]
17503B49227A15033J05434r2293J7857l3017Q8840a80778A86511E5853L37424
17493C93277E200L38117A31294L23485d057A48216L33934B09765j4998a13188
17482A35615L7512a63083B36294c7680C75894A86411n3502R3068A8731M02047
17472D20778A44545c8801N674B66280K5383L28952A20745C2073a98012R3772H2944
17460A56976J29345j33411N1174K61413A93272o3738c028B03367c1748m5503a4010
17448D46124J36337B74993N4932K878r2975k7439J35588C7785K27832K2282j12894
17437A75005o1723J58504R0484J55653A89682P8393K63843B03075K03990F993
17426C92555m7221l8553o5943J14623O418A9113a1264B35567n9560a5205A69108
$$ y = [249227, 115033, 220467, 128174, 146031, 113014, 201854, -180778, 186511, 55853, 393277, 5200, 343317, 131294, 454779, -4057, 148216, 482150, 209765, 194767, -113188, 135615, 173127, -163083, 236294, -37680, 375894, 186411, 132909, 225977, 18731, 420778, 144545, -38801, -33127, 266280, 291663, 620615, 120745, 32073, -198012, -104240, 82944, 156976, 286321, 152910, 204084, 465497, 193272, 129534, -3028, 203367, -31748, -77251, -14010, 446124, 582461, 274993, 329925, 332803, 239828, 212389, 347977, 37785, 265617, 287899, 175005, 113282, 271786, 362270, 517923, 189682, 268075, 531918, 203075, 407065, 6993, 392555, 345334, 306781, 240838, 355461, 361879, 19113, -11264, 235567, 176007, -15205, 169108]
17414E470K91696H4942d4249D05674j84418J56409p2843m5365E2877f1472A19828
17402A43025j8514F0515J46666N5593r4269F1019B307d0519C92046A65413j9813
17391A45600M5831a88614C76727f9984I3639J41600E4117A4790K27470j08708
17381A33552F6589K03417H2611B4200J84642A2942b1431J041D6737J23434Q221
17370A78392a30964A13543K37658e7479D8362O402M32210j61308C2645K57996
17360B90641j11181J23235K36473a43317D55920j89767A22045D0770J76235q8162
17350A28843O5462M7449A03296k2484K48100j1713l9423g735A30240D1739N17183
17339E58922B03452A6598a4574A48123a50737B35449N3385R3341f6800C94666
$$ y = [5470, 297166, 84942, -44249, 405674, 221256, 377665, 304822, 259457, 52877, -61472, 119828, 143025, 124511, 60515, 207181, 262774, 168505, 61019, 2307, -40519, 392046, 165413, 145600, 191431, -188614, 376727, -69984, 93639, 235239, 54117, 14790, 242260, 133552, 66589, 270006, 82611, 24200, 208842, 12942, -21431, -20390, 46737, 170171, 178392, -130964, 113543, 351201, -57479, 48362, 54764, 486974, 325666, 32645, 290641, 179460, 302695, 539168, -143317, 455920, 266153, 122045, 40770, 217005, 128843, 194305, 241754, 103296, 80812, 328912, 317199, 277776, -7735, 130240, 41739, 558922, 203452, 16598, -14574, 148123, -150737, 235449, 288834, 382175, -66800, 394666]
17328D97607A05771J10632H085K91869j3534A33206l1293m2024J57022o4015L0905
17317A83801K3531j6961M4372J3866J01364j32678J73475a81537A43487L40h8381
17305A83939O123K5994J13163A50722O0099a20984C06356A29922J85060q1839
17295B33143R1109A09528J03004c7162A81320J67183H3418N7261M1196a30375
17284G81079C69333Q298P1249j55009d2603j34178D12459p5912l4649p2732L03094
17273E32260d5999E0682J89300O4575F4208N3331J90482r5003H9938L68296E4696
17261G0541L91270A93281O2984a5115A6929J36040N8144N25264A40043K15035
17251C55078j25677o5516J73905L72451C25767A01100P8324J9056L1054b4401
$$ y = [497607, 105771, 216403, 8085, 299954, 286420, 133206, 101913, 59889, 216911, 152896, 183801, 207332, 190371, 234743, 248609, 349973, 217295, 390770, -181537, 143487, 143827, -88381, 183939, 190062, 216056, 329219, 150722, 210821, -120984, 306356, 129922, 314982, 233143, 324252, 109528, 212532, -37162, 181320, 348503, 83418, 140679, 181875, -130375, 781079, 369333, 377631, 448880, 293871, -42603, -176781, 412459, 336547, 301898, 229166, 532260, -45999, 50682, 239982, 304557, 64208, 117539, 308021, 213018, 89938, 458234, 54696, 70541, 461811, 193281, 256265, -15115, 16929, 152969, 211113, 736377, 140043, 355078, 229401, 163885, 337790, 710241, 325767, 101100, 179424, 198480, 229534, -24401]
17240F2185K58301O615A36305K59056j37678r5582M3754K74600A73040N9578a0508
17228B46885G2849K16952f9662C1847L83670q9426P1245m9280N7967J8316A16134
17216C69287A44946Q9224p5580G8564L83231j71915N8779o1302k8164J61001O3752
17205D83946r3047A56535J57653p8379p9342J70412p5598O8735b6966B22499J43845
17194C66344P3012P3809j38805I2800J27544K27544A98045q163L03132j33060
17184C59954R8252m8745j96393L69020D3743L57303p7102J56690K83526E5411
17173C02317J81828p4726H5653K71539A31817K68960r0625J49127j76362K09625
17163D92542N2760q7997p8858J3689p0857L36839B61911L97301o7306k79667J27085
$$ y = [62185, 320486, 327101, 136305, 395361, 257683, 162101, 205855, 480455, 173040, 232618, -10508, 246885, 72849, 289801, -69662, 31847, 415517, 326091, 397336, 348056, 406023, 424339, 116134, 369287, 144946, 234170, 158590, 78564, 461795, 289880, 348659, 287357, 259193, 420194, 483946, 390899, 156535, 314188, 235809, 156467, 326879, 251281, 320016, -26966, 222499, 366344, 439356, 513165, 374360, 92800, 220344, 447888, 198045, 189882, 493014, 359954, 458206, 409461, 213068, 582088, 43743, 401046, 323944, 480634, 764160, 55411, 302317, 484145, 409419, 85653, 357192, 131817, 400777, 310152, 459279, 282917, 492542, 545302, 457305, 378447, 392136, 321279, 658118, 261911, 659212, 591906, 312239, 439324]
17152D39324I1191M82370q2149j85663J73787k3049k8227j86067m9818K94906
17142D87281J6361j16787m1278H1437J36075K36020H6131J83821L07647j95666
17132C81933M31451C04085K7369J7865P6744N1865k417M82783D35803j02465K10030
17121E43368Q0804j52394j79709L55436C08227j37780N92591B96447L41468k16958
17111D20957j0703J62988j21194L946J30740B31596L66742K7423r3545m6487K19469
17100G05198j85750p678k36689K85776B61925K33691Q0483l3248j02016K11367
17090F52202j99697Q3777J8353j64261L27473k80400L37473j3712C22772D4121
17079E55202j05410J63761J34548j11035A56568L46710j25618K61117K48322l13402
$$ y = [439324, 91191, 573561, 491412, 305749, 479536, 456487, 428260, 242193, 192375, 487281, 503642, 386855, 345577, 81437, 217512, 453532, 86131, 269952, 577599, 381933, 813384, 304085, 331454, 349319, 426063, 477928, 475511, 958294, 435803, 333338, 543368, 624172, 471778, 292069, 647505, 308227, 170447, 763038, 296447, 637915, 420957, 410254, 573242, 452048, 455994, 586734, 231596, 598338, 625761, 532216, 485729, 705198, 519448, 511770, 275081, 560857, 261925, 495616, 576099, 542851, 440835, 652202, 452505, 536282, 554635, 390374, 717847, 437447, 774920, 761208, 322772, 44121, 555202, 449792, 613553, 748101, 637066, 156568, 503278, 377660, 638777, 887099, 573697]
17069E73697K6440o8792K70491l55261J92426k01690K55904J44372j45564P2421
17059G64444m8184l3909P2979j6667j48875m9766L8500L75968m76996L08620j51247
17048F34867m7431J92699L0387k8569o7951j9839C25598N30099q3443j10594L25084
17037I86744m2826j95309k48461K6234J52715K01728j58342q1063J31244K1115
17027G93779K712K08225k97051Q6937M5735k57591L10623k61306K09560L72867
17017A214490n64956M69486l85146J10275o536j48968K59213Q023k0367k68009
17007F67505M04558j1455m01801K26836J11443p1307M2597L09837l26675K62495
16997A214033k9888j2208k50285O54748n17628l15479M35666l93598O6149P733
$$ y = [573697, 600137, 531345, 801836, 446575, 639001, 437311, 693215, 837587, 692023, 764444, 716260, 682351, 755330, 738663, 589788, 540022, 578522, 954490, 477494, 786114, 634867, 587436, 780135, 810522, 781953, 714002, 694163, 325598, 855697, 772254, 661660, 986744, 943918, 748609, 500148, 526382, 679097, 880825, 722483, 641420, 772664, 793779, 796491, 1004716, 707665, 794602, 840337, 582746, 893369, 632063, 841623, 1214490, 649534, 1119020, 733874, 844149, 837613, 688645, 947858, 955881, 935514, 667505, 1072063, 1060608, 658807, 885643, 997086, 925779, 968376, 1278213, 951538, 1214033, 1184145, 1171937, 921652, 1576400, 1058772, 743293, 1178959, 785361, 851510, 859243]
16987H59243L09024j33322L46083j29736j72483J31644R1279J21578n81768M18576
16977A260118N4300K18469n28860r271J69770J23633j543j96493K48390j70785
16967A167728J60453k67009M45406m01312p071L96761l8304p8638O5713Q3494
16957A527221k14745L6741p171k63057M52654J30393k61495p447K34882L1866
16947A659842N3906r3561j23164m0326L23211j11941J90465l23277O4070M18754
16937B017979k38886j29019J31599p1352J3993J78611o6569j32475J33470K31605
16927B068956P4678l80191L16826l78956M77254R306l77489q2172M95494Q0018
16917B303724o6143j82712k7044J00829j03322J5383J16396j09625k0274N21401
$$ y = [859243, 1168267, 1034945, 1381028, 1251292, 1078809, 1210453, 1301732, 1423310, 841542, 1260118, 1314418, 1532887, 1004027, 994756, 1164526, 1288159, 1286616, 1090123, 1338513, 1167728, 1328181, 1061172, 1506578, 1105266, 1098195, 1494956, 1456652, 1378014, 1443727, 1527221, 1312476, 1349217, 1342046, 1078989, 1531643, 1662036, 1400541, 1393094, 1627976, 1659842, 1713748, 1620187, 1497023, 1456697, 1779908, 1667967, 1858432, 1535155, 1599225, 2017979, 1779093, 1650074, 1781673, 1710321, 1724314, 1902925, 1836356, 1703881, 1837351, 2068956, 2143634, 1763443, 2080269, 1701313, 2178567, 2187873, 1810384, 1728212, 2223706, 2303724, 2237581, 2054869, 2027825, 2128654, 2025332, 2040715, 2157111, 2047486, 2027212, 2548613]
16907B548613l23510M05680j61547K8276J12964k26272j06699J32093J63440L10592
16897B883630l31097K21125j62089K35714M8019O8269l3031j69816J10477K51639
16887C122840l02706o3352K24104K07873j65221K39910k35490J45376j57507K29219
16877C245046J2797J38571J8748j53972J80923M05017k39609j53247K42481J8288
16867C715043j10652J59133J86428j15000K81584j03207O2824M0093J48555J69368
16857D434169j68926J17264P6540N38456P3903l44618j56636O40099m68446J07867
16847D849672L02569j19843o0637L38606J93366q3845o1847R9610J60717J66207
16837E784575k19444N64587n5785K91835L7438J22750J52276K9399K16662J67073
$$ y = [2548613, 2225103, 2630783, 2469236, 2497512, 2610476, 2384204, 2277505, 2409598, 2573038, 2883630, 2552533, 2773658, 2611569, 2847283, 2895302, 2963571, 2930540, 2760724, 2871201, 3122840, 2820134, 2756782, 2980886, 3188759, 3023538, 3263448, 3027958, 3173334, 3015827, 3245046, 3257843, 3396414, 3415162, 3261190, 3442113, 3847130, 3607521, 3454274, 3696755, 3715043, 3604391, 3763524, 3949952, 3834952, 4116536, 4013329, 4076153, 4116246, 4264801, 4434169, 4265243, 4382507, 4459047, 4997503, 5071406, 4726788, 4570152, 5210251, 4741805, 4849672, 5152241, 5032398, 4971761, 5310367, 5503733, 5419888, 5358041, 5457651, 5618368, 5784575, 5565131, 6129718, 6073933, 6365768, 6403206, 6525956, 6678232, 6707631, 6924293, 7091366]
16827G091366m2125J98415K99255j68123J91831J51388K98115M12785n4516n9446
16817H318945J94245J84330k387L03704N32619m13966N34963J11421K76131K72409
16807A0312414k61415L95419N14555K54680J0572K16771L58530K20998P62326
16798A2784850J5831j6125O14411J98786M75959K66515K75496N05250L70391k3444
16788A5467920O42766N72408O96371J33814R54358m6946O85703M37651P52871
16779B0296916L47686M72345O48778J030613L97180N50604R30137Q72241K37360
16770B5783860J111032P85262R00117Q90170P29846J457613O43618J106603R19314
16761C4327435J641855O41990J650668J054732J589009J047017J577927J436405
$$ y = [7091366, 7049241, 7247656, 7546911, 7378788, 7570619, 7722007, 8020122, 8432907, 8378391, 8318945, 8513190, 8697520, 8695133, 8998837, 9531456, 9117490, 9652453, 9763874, 10040005, 10312414, 10050999, 10446418, 10960973, 11215653, 11226225, 11442996, 11801526, 12022524, 12784850, 12800681, 12784556, 13398967, 13597753, 14073712, 14340227, 14615723, 15120973, 15491364, 15467920, 16110686, 16683094, 17379465, 17513279, 18467637, 18420691, 19106394, 19544045, 20296916, 20644602, 21116947, 21765725, 22796338, 23193518, 23744122, 24674259, 25546500, 25783860, 26894892, 27680154, 28580271, 29470441, 30200287, 31657900, 32301518, 33408121, 34327435, 35969290, 36611280, 38261948, 39316680, 40905689, 41952706, 43530633, 44967038]
16753D4967038J657851J747527J655970J777909J775704J720418J806913J808144
16745E8917474K062217K061594J807883K256419J772400K441087K373314K024799
16737G5717187K032151K039083J978423J879170J922875J933023J614016J779117
16729I0895045J246796J252529J530690P80900M93941O03172K65139P54851j41300
16720I7681763n12113m65924q29906m81017j161429j392230j192544j550541j658219
16711H8437840k077527j514197k041775j970018j924610k224144j931147k370296
16703G2384126j690206k270158j734926k388109j861204j860554k057460j733114
16695E6788395j809814j726539j535931j643059j797935j598397j426577j127412
$$ y = [44967038, 46624889, 48372416, 50028386, 51806295, 53581999, 55302417, 57109330, 58917474, 60979691, 63041285, 64849168, 67105587, 68877987, 71319074, 73692388, 75717187, 77749338, 79788421, 81766844, 83646014, 85568889, 87501912, 89115928, 90895045, 92141841, 93394370, 94925060, 95705960, 96199901, 96803073, 97068212, 97823063, 97681763, 97169650, 96703726, 95873820, 95392803, 94231374, 92839144, 91646600, 90096059, 88437840, 86360313, 84846116, 82804341, 80834323, 78909713, 76685569, 74754422, 72384126, 70693920, 68423762, 66688836, 64300727, 62439523, 60578969, 58521509, 56788395, 54978581, 53252042, 51716111, 50073052, 48275117, 46676720, 45250143, 44122731]
16687D4122731j709376j477557r39614j544896j394341q85969j153764j067763
16679C3949451j005383j067409q19452j253945l65186r20659o36152r99952p00451
16670B6180862j029271n71036n55380r50659k84192p74246m48713q64841l55467
16661B0347057o44363n65682n29083l42076m62298l11028l81781m95221m47981
16652A6167544j57827n03361j50315o59147k73906l59285m24173l73069k4432
16643A3242029j14284l09776m01526n66958j01081j63599l90516j55143L3373
16634A1072519n88770K39665m34746l6562k35825k33410l64498J36976j12373
16625I442976k58988l41161k24748J9412j58832K2159o02333j19196k0368R0025
$$ y = [44122731, 42413355, 40935798, 39996184, 38451288, 37056947, 36170978, 35017214, 33949451, 32944068, 31876659, 31057207, 29803262, 29438076, 28517417, 27881265, 26881313, 26180862, 25151591, 24580555, 24025175, 23074516, 22790324, 22016078, 21567365, 20702524, 20347057, 19702694, 19137012, 18607929, 18265853, 17803555, 17492527, 17110746, 16615525, 16167544, 16009717, 15506356, 15356041, 14696894, 14422988, 14063703, 13639530, 13266461, 13242029, 13127745, 12817969, 12416443, 11849485, 11748404, 11584805, 11194289, 11039146, 11072519, 10483749, 10723414, 10288668, 10252106, 10016281, 9782871, 9418373, 9555349, 9442976, 9183988, 8842827, 8618079, 8637491, 8478659, 8500818, 7898485, 7779289, 7758921, 7848946]
16615G848946l35345k28264j23395m8739l08687L28475j78554j78153j89467J22254
16605F709071k32898k30454J61022l57810q1802J31209k86198k25798M5592j05097
16595E526837N03J36374l68097j11946p8570j93006M60254k64587j52488L2253
16585D987527n6506J37316l57525l40788K85871j01090J14940k58980L5399k87274
16575D158890J97712k01957L21101l80013n2477j13070Q5846k37671J16062k1818
16565C872605J0222o898k70368n1045j28087J05098k21549K49168J81817k09315
16555C531648m12984M18856j87505l6238R2931r2383j93456J64317N7522k46787
16545C095921J4895N1520j96054k25188N57769j81502m00202K91986m40291P1623
$$ y = [7848946, 7513601, 7285337, 7161942, 7113203, 6804516, 7132991, 6954437, 6776284, 6586817, 6709071, 6476173, 6245719, 6406741, 6048931, 5967129, 6098338, 5812140, 5586342, 5631934, 5526837, 5527340, 5663714, 5295617, 5183671, 5105101, 4912095, 5372349, 5107762, 4955274, 4987527, 4931021, 5068337, 4710812, 4370024, 4655895, 4554805, 4669745, 4410765, 4446164, 4158890, 4356602, 4154645, 4475746, 4095733, 4043256, 3930186, 4016032, 3778361, 3894423, 3872605, 3882827, 3875929, 3605561, 3554516, 3426429, 3531527, 3309978, 3559146, 3740963, 3531648, 3118664, 3537520, 3350015, 3313777, 3406708, 3314325, 3120869, 3285186, 3342708, 3095921, 3110816, 3162336, 2966282, 2741094, 3298863, 3117361, 2717159, 3009145, 2568854, 2640477]
16535B640477K2795N1370j33735r8162K27678k57842J94816Q8747K01880k21699
16525B716325j79129j75235P2824K27628l31311P1015J41722m35250L17818M6888
16515B473295l75902K186j19414K73153j50362p0547K36842q8957J13145p9339
16505B214100n41880K80709j66219L04121m23579K34287K32394M2801l05698J61083
16495B032119p6600j51502J36086j7570Q9685j62568r8606q6972P8095R4034j76051
16484A660150J16273k09345J94940j22288J20384m8041j38697K15643j12066O6710
16474A743663j15749J23383m02901L67453O4536r8003j34185l24664M07510K39720
16464A870763K03962n67725J13477j74412J73092n0259N6052k60177K16878k0263
$$ y = [2640477, 2663272, 2714642, 2580907, 2482745, 2710423, 2452581, 2647397, 2736144, 2938024, 2716325, 2537196, 2361961, 2434785, 2662413, 2331102, 2402117, 2543839, 2108589, 2426407, 2473295, 2097393, 2099579, 1980165, 2253318, 2102956, 2032409, 2269251, 2180294, 2293439, 2214100, 1672220, 1952929, 1786710, 2090831, 1667252, 1901539, 2133933, 2176734, 1871036, 2032119, 1955519, 1804017, 1940103, 1922533, 2012218, 1849650, 1751044, 1664072, 1742167, 1836201, 1660150, 1776423, 1567078, 1762018, 1639730, 1760114, 1712073, 1573376, 1789019, 1676953, 1743663, 1627914, 1751297, 1348396, 1715849, 1780385, 1682382, 1548197, 1223533, 1631043, 1870763, 2074725, 1507000, 1620477, 1446065, 1619157, 1568898, 1624950, 1364773, 1581651, 1561388]
16454A561388j08376Q731J81265q1898m32062K74327m1450j12095L68431j22279
16444A495982r0632j20273p0463P3314k65737K32094J68947p3804K34126n42428
16434A041126M73066k19463K21128k90590J30242j7058k75497J34538J82631l02679
16424A077444J83179l26837J88157Q0346j25280j10599N4341j77512K15485J88566
16414A247290k14377J44716r8752O5103L29012o06918L84184j56452o3000k78807
16404G51999M29113p6027r8316K49302j56108j0225M4259j38619J23881j05692
16394A013567q3614o0320L45229j98562J08693l7596p9234j56861K99822m3110
16384A108014o3770J66417m82719L59698l12012J33786K36284j61770k15457K00308
$$ y = [1561388, 1453012, 1461743, 1643008, 1561110, 1129048, 1403375, 1361925, 1249830, 1618261, 1495982, 1405350, 1285077, 1214614, 1287928, 1022191, 1254285, 1423232, 1349428, 1583554, 1041126, 1514192, 1294729, 1515857, 1225267, 1355509, 1338451, 1062954, 1197492, 1380123, 1077444, 1260623, 933786, 1121943, 1202289, 1077009, 966410, 1020751, 843239, 1058724, 1247290, 1032913, 1177629, 1078877, 1143980, 1472992, 866074, 1250258, 1093806, 1030806, 751999, 1181112, 1105085, 1006769, 1256071, 1099963, 1089738, 1133997, 995378, 1119259, 1013567, 929953, 869633, 1214862, 1016300, 1124993, 1087397, 1008163, 851302, 1151124, 1108014, 1044244, 1210661, 727942, 1087640, 775628, 909414, 1145698, 983928, 768471, 968779]
16374I68779l57198L28729J6044j27466j35605L73527q2891D73921P59182k54502
16364I78601K96361n64312J34466M0886j42784j6497M88712m83204k68262K11628
16354F75595J30563J76671p5330j6046M3754j47568j18112j31890J85843o8627
16344F54853J62698j79598l0962j1316r7944L83311m8312k7200j70040L7824l0485
16333F42829j16061L88359N8664j34016r810K16217E20349L83970k34145m1235
16323F28939K65198j53190q5815A46547N49446m8556J39557j95390J02120r1934
16313F01790R026M403K99538l31782l4563J8491L86746k92368L39311k11799l75630
16302D13163K39730R1231j49776B95787M47455j9758j96532N29643k07221j88488
$$ y = [968779, 611581, 940310, 956354, 828888, 693283, 1066810, 983919, 473921, 1233103, 978601, 1274962, 710650, 845116, 886002, 743218, 726721, 1215433, 732229, 463967, 675595, 806158, 982829, 907499, 891453, 935207, 787639, 669527, 537637, 723480, 654853, 817551, 637953, 606991, 595675, 497731, 881042, 832730, 805530, 635490, 673314, 642829, 526768, 915127, 973791, 839775, 829965, 1046182, 520349, 904319, 670174, 628939, 894137, 740947, 655132, 146547, 695993, 647437, 786994, 591604, 693724, 601790, 610816, 615219, 914757, 582975, 548412, 566903, 953649, 661281, 1000592, 788793, 413163, 652893, 744124, 594348, 295787, 743242, 723484, 526952, 1056595, 849374, 660886]
16292F60886j36596J84224p6257q8069j51807K33692k54263J40697J02493K90394
16282I05394C91683M33532A18152M11312K67611I7951K19469J4568J38899R9633
16272E70520L5507j52603L3554j1038K49607r3024j83841K11414k44508J24242
16262E39830j71147L97508j7686l03501o8078p4414J68899P4642k3535m9622k5214
16251D47682n2588j64900l2918L96479O8156k50528o4795j42255M13289q1781
16241E35841k9189j38238R3015j09741J49950c9395C56731J47625a54049E73867
16230E77565j89613J60445B11692J69153A52365K05133K35934j00023j36851J59388
16220E15946R3152k29126K2800J79352J392p5803k25105L25247j84024j68673
$$ y = [660886, 524290, 708514, 632257, 544188, 392381, 626073, 371810, 512507, 615000, 905394, 391683, 825215, 118152, 529464, 797075, 97951, 317420, 331988, 470887, 570520, 606027, 453424, 486978, 475940, 725547, 632523, 448682, 660096, 415588, 539830, 368683, 766191, 748505, 445004, 376926, 302512, 471411, 546053, 522518, 472896, 447682, 395094, 230194, 197276, 593755, 661911, 411383, 346588, 204333, 617622, 535841, 506652, 368414, 461429, 351688, 501638, -39395, 356731, 504356, -154049, 573867, 577565, 387952, 548397, 211692, 380845, 152365, 357498, 593432, 493409, 356558, 515946, 609098, 379972, 402772, 582124, 583516, 507713, 282608, 607855, 423831, 255158]
16210B55158K56109B41346K21312j27048K36485n8094j83199j53872m0799D2817
16199B75066r2446M17129B16876K94228B52428F5123L48586j62430O4657D5765
16188B55905J67831O5408A37403L46177H3245J34007j05007J27444K55383o5477
16178D29595k12280J29389j22691K73307r6358A64032K97806J01542B72319j20380
16168A51939J11942q7641n2303m3897R3922O4274P6319A01500Q6264J81181j34425
16157B34520L314g9459B34283K40684J8604k02048J47829k12694b0991A59775
16146B11361P11o7644J43758R3146m1785J57811I8233P0845K60181A37730c0937
16134a47318A01777J27200G1974L40796j73861C2185b348E3690P4388K34938j49437
$$ y = [255158, 511267, 241346, 462658, 335610, 572095, 514001, 330802, 176930, 136131, 42817, 275066, 182620, 599749, 216876, 511104, 252428, 65123, 413709, 251279, 315936, 45765, 255905, 423736, 489144, 137403, 483580, 83245, 217252, 112245, 239689, 495072, 429595, 217315, 346704, 224013, 497320, 400962, 164032, 461838, 563380, 272319, 151939, 263881, 176240, 123937, 80040, 173962, 238236, 314555, 101500, 187764, 368945, 234520, 237834, -79459, 234283, 474967, 493571, 291523, 439352, 226658, -20991, 159775, 211361, 212072, 144428, 288186, 381332, 339547, 497358, 98233, 169078, 429259, 137730, -30937, -147318, 101777, 228977, 71974, 412770, 238909, 32185, -2348, 53690, 128078, 363016, 213579]
16123B13579J3636N0675O694A35676J08403G4730K39121k0565A15606L57272C0833
16111A81981J76697G8946N2083l4329K05639q4252F8091L30986J4075j71048b07737
16099B57996d2616A38227B9115R3167A073J02133J66516d9503l5986A86685E5414
16087B01104Q9765b20865B52182j23675L8859R0075J20398j87634K7461H2481
16076A82672k6929g5458B47746A11287Q4618p0333c5524l2479m0092n4846F8933
16064A45668Q72Q8450e6112A59627A5634J85720o1176j8623m9784c8792C25311
16052A07523a81741D02472A95838a6058B57443b41292D11799A62985m9035P6483
16042A90433J13267J7288j37360l8117J8790D039L1907L678B884K36562q4176
$$ y = [213579, 227215, 277890, 284584, 135676, 244079, 74730, 313851, 293286, 115606, 472878, 30833, 181981, 358678, 78946, 131029, 96700, 302339, 218087, 68091, 399077, 413152, 242104, -207737, 257996, -42616, 138227, 29115, 122282, 1073, 103206, 269722, -49503, -85489, 186685, 55414, 201104, 290869, -220865, 252182, 128507, 167366, 257441, 377839, 190205, 217666, 82481, 182672, 155743, -75458, 247746, 111287, 195905, 125572, -35524, -68003, -108095, -162941, 68933, 145668, 146540, 234990, -56112, 159627, 15634, 201354, 140178, 121555, 71771, -38792, 325311, 107523, -181741, 402472, 195838, -16058, 257443, -241292, 411799, 162985, 113950, 190433, 303700, 320988, 183628, 145511, 164301, 4039, 35946, 39624, 2884, 239446, 155270]
16031A55270a00850C37950H6740N5999L30896q1849p4176p9198n1097L2471J3547
16020B33333F2918K65813a09039D18504A31091P0662M7155A02877a58685A59564
16009B9734b5181E6378K6074N1908i286C8485N3412a30090B91164P2381r3240
15998B70305A15096b75037A57452l3632a34662M3602I8478C5836K03068J46078
15988C84982L86820K8097K62139K66232J33231G12979K99647C52205M7373j8748
15978C80830g9078B89999b6911C49954e3797A62051E5868h7497D03143A18672
15967h9956B4274J2762c46276i181A35895L0692a78479A33351a16643H6593J60900
15956B47493F6581K3677m3603A8915a40065M0610A24937k7059e6265j7766G1835
$$ y = [155270, -100850, 337950, 86740, 142739, 473635, 391786, 317610, 238412, 187315, 219786, 233333, 62918, 328731, -109039, 418504, 131091, 201753, 248908, 102877, -158685, 159564, 29734, -25181, 56378, 82452, 134360, -9286, 38485, 91897, -130090, 291164, 363545, 270305, 115096, -275037, 157452, 123820, -134662, -91060, 98478, 35836, 238904, 384982, 771802, 799899, 1062038, 1328270, 1461501, 712979, 1012626, 352205, 399578, 380830, -79078, 289999, -26911, 349954, -53797, 162051, 55868, -87497, 403143, 118672, -89956, 24274, 37036, -346276, -9181, 135895, 166587, -178479, 133351, -116643, 86593, 247493, 66581, 90258, 46655, 18915, -140065, -99455, 124937, 97878, -56265, -74031, 71835]
15944A34301h0487A17772h8975a6780k50528D20026D4501K92668b8374j0653l1433
15933g0460B24873F738J91150F2678a47412B0890a01532A6924J36795B7212b47178
15921i5088c3809F1103a18548e2562A83689J49242f0876p8776f6521q8035A96773
15909a68455A01890I703J04632a31961B29136h5538j03665Q933F6290a00260A72533
15897B34892b25599b3707B42364b90155A48547b15757A3627d3468p6046B6288
15886c64021c5035A80569b43428A36210n2898i8677m3387H0744g7115m2520A60421
15874B22477p2295n4773l2357a095A43186a40369D2995c7738B2710M8440J77020
15863B48170p9683a30347A22226e1458H9625A7042h1697L5624j30178h0229j5525
$$ y = [134301, -80487, 117772, -88975, -16780, -267308, 420026, 44501, 337169, -28374, -39027, -70460, 224873, 6738, 197888, 62678, -147412, 20890, -101532, 16924, 153719, 27212, -247178, -95088, -33809, 61103, -118548, -52562, 183689, 332931, -60876, -139652, -66521, -154556, 196773, -168455, 101890, 9703, 114335, -131961, 229136, -85538, -189203, -180270, 66290, -100260, 172533, 234892, -225599, -23707, 242364, -290155, 148547, -215757, 13627, -43468, -119514, 26288, -364021, -35035, 180569, -243428, 136210, 83312, -98677, -142064, 80744, -77115, -119635, 160421, 222477, 150182, 95409, 63052, -1095, 143186, -140369, 42995, -37738, 22710, 71150, 248170, 168487, -130347, 122226, -51458, 89625, 17042, -81697, -46073, -176251, -80229, -95754]
15852i5754k14381O9575M497c4726q8226j0035F1460K38339d2968j7147j45789
15841b05904f8723B51000h889G8931d155A61705C1678c0717H5617b8858k43689
15830b72547E9622b41832B45962j16709g6022a3178B8371b9044j79234C7953M8830
15819H6783A9860N6620a11572C01071b10288h8571j82869B2615K75698b17508
15808A25972g9838B4369a1482A42687n5794K21392I9833a71423D9108M4819i074
15796b74713d324B71266B3690J83609m2545k3305a68303A5800a68541l86420d4968
15784a91797A80385b06171O2138A56403b11415d8847G1995B0808c773o3172e823
15772b46359c4916c252j587j11571c4558G5382K8124j5100b62706A86594a12440
$$ y = [-95754, -310135, -240560, -236063, -34726, -122952, -132987, 61460, 299799, -42968, -60115, -205904, -68723, 251000, -8889, 78931, -4155, 161705, 31678, -30717, 85617, -28858, -272547, 59622, -241832, 245962, 129253, -76022, -13178, 28371, -29044, -208278, 37953, 86783, 19860, 76480, -111572, 301071, -210288, -88571, -271440, 22615, 298313, -217508, 125972, -79838, 24369, -11482, 142687, 86893, 308285, 99833, -171423, 49108, 93927, -9074, -274713, -4324, 271266, 23690, 207299, 164754, 141449, -168303, 15800, -168541, -554961, -44968, -191797, 180385, -206171, -144033, 156403, -211415, -48847, 71995, 20808, -3773, -66945, -5823, -246359, -34916, -3252, -4839, -116410, -34558, 75382, 103506, 88406, -262706, 186594, -112440]
15760f6431I6352a82087h006j11561n1510A11860c477k45146A68384b17526L786
15749b13740Q0168E66010C9211c3820j9316A01797a98900A71529b5255A23434
15738F4550h3890A81849J1324E7926J92754r9977a15809K1680A30350N7126P5119
15727B62595E9637a81234A2904a27071G8219b63275B71752a39423A32807J03996
15717B36803B144O0703c36457A6044J33463K50408b05413A96552a75084A64885
15706f4055D83M0993R3172e3220D68890j99496E9919f1405I7318b64j95231L24
15694a95171c7528k28834A58264J01022A27281k1367g9986j73320f3450J6314
15684d7136q4938C7485b29889l3899I340N8115g8983r2301F3143a45687c214A11686
$$ y = [-66431, 96352, -182087, -8006, -119567, -171077, 111860, -3477, -248623, 168384, -217526, -213740, -133572, 566010, 39211, -33820, -53136, 101797, -198900, 171529, -25255, 123434, 64550, -83890, 181849, 193173, 57926, 250680, 150703, -115809, -94129, 130350, 187476, 262595, 59637, -181234, 12904, -127071, 78219, -263275, 271752, -139423, 132807, 236803, 2144, 62847, -336457, 16044, 149507, 399915, -205413, 196552, -175084, 164885, -64055, 483, 41476, 134648, -53220, 468890, 269394, 59919, -61405, 97318, -264, -195495, -195171, -37528, -266362, 158264, 259286, 127281, 105914, -79986, -253306, -63450, -47136, -132074, 37485, -229889, -263788, 9340, 67455, -78983, -171284, 63143, -145687, -3214, 111686]
15671D3697a54326A0837J51021p6480a73505C79510F5181g9086r5135I610a97437
15659a64631A7226J93929b03304C8680j363p84J16623a99759G7611N6514Q1625
15648B15750a73262B60476i6910a1225C03927b66336D4018J42899q0686k8398
15638G7833h7716J5559c1035B35233J01339a66247B5292a34777l2529F6120J01950
15627A68070J13396m6573I3112c6848o1989A70020a3657H2370a51861C1751c2600
15615g3249F5006M460a8596A28886b30225O1936E9987L31110A68446n5635d3368
15603a7541k80340b748j43667n8714o734b6225o7234k6237j58029e8208B34529
15591B72238d9328m8187k5667J697m2966q4158A52804a42282A41571a65071B0346
$$ y = [43697, -154326, 10837, 161858, 85378, -173505, 379510, 65181, -79086, -174221, 9610, -197437, -164631, 17226, 211155, -203304, 38680, 37317, 36533, 153156, -199759, 77611, 134125, 215750, -173262, 260476, -96910, -11225, 303927, -266336, 44018, 186917, 106231, 77833, -87716, -72157, -31035, 235233, 336572, -166247, 25292, -134777, -167306, 66120, 168070, 281466, 234893, 93112, -36848, -98837, 170020, -13657, 82370, -151861, 31751, -32600, -73249, 65006, 69466, -18596, 128886, -230225, -168289, 59987, 391097, 168446, 112811, -43368, -17541, -297881, -2748, -146415, -205129, -211863, -26225, -93459, -119696, -277725, -58208, 234529, 272238, -49328, -97515, -123182, -121485, -164451, -248609, 152804, -142282, 141571, -165071, 20346]
15579A26592B1537c43036d6041a3037G3643L1056a08838A74833H1666a18845B3862
15567b3608F7467e5215B67032C8523b92576F4281b28882B6849L5881h7456l00511
15556c87967O7743B65736A13395J36847K9617b1008F3408b44679a4211k51872
15546b66083A60422a076j82315j16330n2739I4416K1122L9259g3304B60704h083
15534A69555L9136r5243b59658A53953b0488L840H7952a55521g7255B5793Q2214
15523A08007e7702H6877a11256C7692b97209f0447q844E6098a26922C17356r106
15512C08250r5428G6767k3376b1962m0535k03790B04213H7031K07044E3424J71206
15501B24630H0535f0824j87276A96550o4012K7601J15887A32398J44432b0512
$$ y = [126592, 21537, -343036, -46041, -13037, 73643, 104699, -108838, 174833, 81666, -118845, 23862, -23608, 67467, -55215, 267032, 38523, -292576, 64281, -228882, 26849, 62730, -87456, -387967, -320224, 265736, 113395, 250242, 279859, -21008, 63408, -244679, -14211, -266083, 160422, -1076, -183391, -299721, -352460, 94416, 115538, 154797, -73304, 260704, -8083, 169555, 208691, 113448, -259658, 153953, -20488, -16648, 87952, -155521, -77255, 25793, 108007, -57702, 86877, -111256, 37692, -297209, -60447, -69291, 56098, -126922, 317356, 308250, 212822, 76767, 53391, -21962, -62497, -266287, 204213, 87031, 294075, 53424, 224630, 80535, -60824, -248100, 196550, 132538, 160139, 276026, 132398, 276830, -20512]
15490a84214A5364c33126a54928M7430H0172J8177C4697a23984k37232c1136B666
15478A75553G352g0725B48564K80665M3845k17382j12647p8738q1579L5637N3823
15467A72188E2832j0209K6184C3460a18618l9843A05819L454k2923M9472L5627
15456A71449E2275D84f4442r349A23566b21796N7361A55286C2146R1797d6550
15444B83189l8615L74200L0708L87654l39891C33269R9039A65761L48436B41929
15433C75948a6793j18325B8239f390G2023c91439c7839m1141B58957d72138D4806
15421d8485C30145r5167A00415M6657g4444B23134k2592D5922K05898j05045a74324
15409c63618B62553a40297A64107h9651o6092a3028j35824c2673A96993a21780
$$ y = [-184214, 15364, -333126, -154928, -107498, 80172, 98349, 34697, -123984, -361216, -31136, 2666, 175553, 7352, -70725, 248564, 529229, 573074, 355692, 243045, 164307, 82728, 118365, 172188, 52832, 42623, 68807, 33460, -118618, -158461, 105819, 109273, 86350, 135822, 171449, 52275, 484, -64442, -73791, 123566, -221796, -164435, 155286, 32146, 123943, -46550, 283189, 244574, 618774, 649482, 1037136, 697245, 333269, 432308, 165761, 514197, 241929, 375948, -16793, -135118, 28239, -6390, 72023, -391439, -37839, -78980, 258957, -472138, 44806, -48485, 330145, 234978, 100415, 147072, -74444, 223134, 200542, 45922, 251820, 146775, -174324, -363618, 262553, -140297, 164107, -89651, -155743, -13028, -148852, -32673, 196993, -121780]
15398D91J47012J11357h9735G4320B7873a64627j60669A48325R5719J55161j96207
15387B02998e0249j8672o3349A27200A9321L3553P5447a59018H2623L15918F7951
15375E2081d1251A5752K05372G158J81124q3790J99731a13477C05919b69200E2344
15363A8152q482a65128A55503d8109J9993k39513C07949O2944A24769k3360K23649
15352C25058D3689b84254B00161C1662L571L35925G2392c2951G3358G012K09541
15341B16553p2804D5867K25120E9545g6120l7358C08760G1672a15185I3410L1431
15330A24841d7574j1437B32396i5454K1576K5942A60437o5739L551P1440d3315
15318c34373D0466b65301A44783J20010a18430k68582B39571j00428J75611J01588
$$ y = [491, 147503, 258860, -89735, 74320, 27873, -164627, -325296, 148325, 244044, 399205, 202998, -50249, -68921, -132270, 127200, 19321, 52874, 128321, -159018, 82623, 398541, 67951, 52081, -41251, 15752, 221124, 7158, 188282, 104492, 304223, -113477, 305919, -269200, 52344, 18152, 9670, -165128, 155503, -48109, -28116, -267629, 307949, 370893, 124769, 101409, 325058, 43689, -284254, 200161, 31662, 35233, 371158, 72392, -32951, 73358, 7012, 216553, 143749, 45867, 270987, 59545, -76120, -113478, 308760, 71672, -115185, 93410, 124841, -47574, -59011, 232396, -95454, -73878, -47936, 160437, 94698, 98249, 169689, -43315, -334373, 40466, -265301, 144783, 264793, -118430, -387012, 239571, 139143, 314754, 416342]
15308D16342c056A00662b93181B40123H639J11272d44962J39837J13902D5879
15297I540b2257h959B0440L18720a21450B2435b5843j92524C2803J53581a31365
15285h2308I0226J9151d2795q3599e3542k3964k40732I337K66553h7585A19377
15273E20560A20896a25505j36650l2548J07335P6176e2351j58443A35687d7871
15262A59499M6936b64027k4173E5170e9724I3914h8264k16802a26177G6426J93546
15251B69972a5231A82465A3215K22727J8483J59382Q03060L82724n78564N19490
15241A540517j55001E19044B23882p7402F872i8050L8684j80929B07519E1613
15230b22185g988B9133J18921i1301A80268n7692l2100l0517g9576C0462O5145
$$ y = [416342, -3056, 100662, -293181, 240123, 8639, 119911, -444962, -305125, -191223, 45879, 9540, -22257, -8959, 20440, 339160, -121450, 22435, -25843, -218367, 32803, 186384, -131365, -82308, 90226, 109377, -42795, -126394, -53542, -77506, -318238, 9337, 275890, -87585, 119377, 520560, 120896, -125505, -262155, -294703, -187368, -111192, -52351, -210794, 135687, -47871, 159499, 206435, -264027, -288200, 55170, -59724, 93914, -88264, -305066, -126177, 76426, 269972, -15231, 182465, 13215, 235942, 254425, 413807, 1216867, 1599591, 1021027, 1540517, 1385516, 519044, 223882, 146480, 6872, -98050, -59366, -240295, 207519, 51613, -222185, -7988, 29133, 148054, -91301, 180268, 122576, 90476, 59959, -79576, 30462, 95607]
15219I5607a01518j25557D33344a28854A27053B985a21487C33925I7082i0879
15208B77427J60265a7471B20525A0642e18294a19186A82443k8884f6218B31047
15197b19452B61642B2231b5451j53495D4460e3228H1262N5609a19253D8040a2521
15185C3176K26265j27815a80663B1687i1484A6996a21731J5842C48526G0142a17274
15173G069a8206B23868A00204r416a88414A8044J13136B6536L2759J8493A6012
15161a80681B98831C3078P8937R0760b7735A42027j9698J43122G2402M558k0456
15150E6504j0767a40058A59834o0528D1540J53213F5250a15449A75843J45917
15140C21760q6361b04154B68084b5235H0234d82971A4912J50210K58376e5142
$$ y = [95607, -101518, -227075, 433344, -128854, 127053, 2985, -121487, 333925, 97082, -90879, 277427, 437692, -17471, 220525, 10642, -518294, -119186, 182443, 153559, -66218, 231047, -219452, 261642, 22231, -25451, -178946, 44460, -53228, 81262, 136871, -119253, 48040, -12521, 33176, 259441, 131626, -180663, 21687, -91484, 16996, -121731, -105889, 348526, 70142, -117274, 7069, -18206, 223868, 100204, 90788, -188414, 18044, 131180, 26536, 59295, 77788, 16012, -180681, 298831, 33078, 112015, 202775, -27735, 142027, 122329, 265451, 72402, 76960, 56504, 45737, -140058, 159834, 99306, 41540, 194753, 65250, -115449, 175843, 321760, 235399, -204154, 268084, -25235, 80234, -482971, 14912, 165122, 423498, -55142]
15129B04147j00511L19395F0818J11570E3378a5456r6711A25573a07572C81486
15118D3845I779M05793E439J54633b5245E4546Q0774K7665f361B68936A18700
15106I6742j7265K8468l5382O8358O1711a90616B4592a18782A34177B1889a55942
15094C53779i1972a2605I8134N0051p0322c4686D33064F1756a074E1565e6690
15082c6100A75883a33205B07448q5570k9995K2068c6473A57493E8159a03163D39311
15070b84677f1957a5466F5432B7204J46915J82959A940d6247E9603J45653A5121
15058A78436G0472K10602o4073B759L96475a32111J6899D21862A19142N4930j0912
15047A63160J35286J27186j43608J12172A05489J77316j17824F153J61429J155
$$ y = [204147, 103636, 423031, 60818, 172388, 53378, -15456, -112167, 125573, -107572, 381486, 43845, 9779, 415572, 5439, 160072, -25245, 54546, 135320, 162985, -6361, 268936, 118700, 96742, 79477, 107945, 72563, 140921, 202632, -190616, 24592, -118782, 134177, 21889, -155942, 353779, -91972, -12605, 98134, 148185, 77863, -34686, 433064, 61756, -1074, 51565, -56690, -36100, 175883, -133205, 207448, 121878, 91883, 113951, -36473, 157493, 58159, -103163, 439311, -284677, -61957, -15466, 65432, 27204, 174119, 357078, 1940, -46247, 59603, 205256, 15121, 178436, 70472, 281074, 217001, 2759, 399234, -132111, -115212, 421862, 119142, 174072, 163160, 298446, 425632, 282024, 394196, 105489, 282805, 164981, 6153, 167582, 168737]
15037A68737O5849n4158O2319A06276L22312j78433K54070o0723J27688j59307
15027D11883L00319B53891K23332j8423J42245A43911L29591o8856r6706A34432
15016A95018H4162M67238k70678j09923M1176J90675m5364p1333j6177J57425
15006D27201m8789g0287C87371m7253B550M76917r8079J926M4777j70692k1089
14995B36310l7560R0861E3810K17175F5137K3489L96503K11359k05009j65450
14985C26029K72091k87296n8458K37028k24114J03877P9279q2164N76211l63930
14975E78553N1899k98463A21245L50304J8784J00527k84599J88742k39074N7397
14965C13326J41514A84096L00039j76826J2079Q5466H6980L84397F3566J61581
$$ y = [168737, 234586, 180428, 242747, 106276, 428588, 250155, 504225, 443502, 571190, 411883, 712202, 253891, 477223, 458800, 601045, 143911, 473502, 404646, 307940, 134432, 195018, 84162, 551400, 280722, 170799, 211975, 402650, 357286, 285953, 269776, 427201, 378412, -70287, 387371, 340118, 2550, 479467, 381388, 383314, 428091, 257399, 236310, 198750, 289611, 53810, 270985, 65137, 88626, 485129, 696488, 491479, 326029, 598120, 310824, 252366, 489394, 265280, 369157, 448436, 366272, 942483, 578553, 630452, 331989, 121245, 471549, 490333, 590860, 306261, 495003, 255929, 313326, 454840, 184096, 484135, 307309, 319388, 404854, 86980, 471377, 63566, 225147]
14955B25147K39950c0516A55633M60085k45333A35533K19981I9427J57615A3976
14944E98322o7594R4567C06295l6648j9627l2133J38487J7923a4059D64276j32842
14933C31434Q4721k5074L07370j06462J4785n317N82309l48999N57658m10046
14923I82379R1698j31834k77839M8331M11536J07088O71893k1385n71674l04816
14913A005377Q9290m41153L31050l45805k34781j12453A16650a1953D40465r2125
14903C48340A13596K09229L921K19552j28461J02604k00881o2783G8247J17298
14893A95545J94612n4776A6930L78782f0232C92092K74873j8399k16854M63592
14883H95304C78765L44176G5108P12790C87614L07243o8443k14499K47410B42572
$$ y = [225147, 465097, -30516, 155633, 615718, 370385, 135533, 355514, 99427, 257042, 13976, 598322, 530728, 625295, 306295, 269647, 250020, 217887, 356374, 374297, -14059, 464276, 331434, 416155, 391081, 698451, 591989, 606774, 601457, 1183766, 834767, 1392425, 982379, 1074077, 942243, 664404, 712735, 1124271, 1231359, 1903252, 1881867, 1310193, 1005377, 1094667, 653514, 984564, 638759, 403978, 291525, 116650, -11953, 440465, 348340, 113596, 322825, 326746, 546298, 417837, 520441, 319560, 256777, 78247, 195545, 390157, 335381, 16930, 395712, -60232, 392092, 666965, 648566, 431712, 895304, 378765, 722941, 75108, 787898, 387614, 694857, 626414, 411915, 659325, 242572]
14872B76373J53259o131J04532A47573J71868F2837M32300M3365k2084k02840
14862C13578N6225l0246q0515L24991B81970K0359r6492L11070A27400M52360
14852E79760A80007J65533o1955J00273j17H4508K68944j55469K11315J71521
14842E80819K36157J17513L9207l52720L3340M1315m7230l01256Q7127A36437
14831E51559o3153A60756N29700B83510M5419j0560N43906k82607J28171j35540
14821E72299j0619n4243q9358j1922M46903C57014K48454K25197l51499J56591
14811F35757j71007j3007A6027M99062J49293k3222k41942L87577L0041k43008
14801E73828j53389L492m9029N2432K52220n6866j07572j16812j80091M08334
$$ y = [276373, 429632, 423501, 528033, 147573, 319441, 62837, 495137, 538502, 516418, 313578, 369803, 339557, 259042, 584033, 281970, 302329, 205837, 516907, 127400, 579760, 180007, 345540, 283585, 383858, 383741, 84508, 353452, 197983, 409298, 580819, 816976, 934489, 973696, 620976, 654316, 695631, 648401, 347145, 434272, 136437, 551559, 488406, 160756, 690456, 283510, 328929, 318369, 862275, 579668, 707839, 572299, 561680, 507437, 418079, 406157, 853060, 357014, 605468, 830665, 479166, 635757, 464750, 451743, 16027, 515089, 664382, 641160, 399218, 786795, 816836, 573828, 420439, 423931, 374902, 427334, 679554, 622688, 515116, 398304, 218213, 626547]
14791F26547r2421J96955C27648J38402M9036m9217n4899J72675N8359k31652
14781D10352q9769L83709M4611j06432q0686K86716p4419l57757K18807L7815
14771F72947k18556r8081j29631K17536N9293k05262M09264l36310p8843m5743
14761B46614K10502L29909k28348k79152M40340k23190P6801N0448J20190k73845
14751D70269j59002J57561m5985N5978A52029N23567A79859J85795P9591K38798
14741F84043R554n4445P254k38676K65378l32131K73769j41940r2887J20119K59233
14730G59271K6061m7019L35740p167K26196k26615L03303m68257k6744Q6810k27812
14719G33767J0149B71729M42744k82728K26431j30868q1112J98368M7536k18874
$$ y = [626547, 534126, 731081, 327648, 466050, 515086, 465869, 410970, 583645, 642004, 410352, 320583, 704292, 748903, 642471, 561785, 848501, 774082, 416325, 635132, 672947, 454391, 356310, 226679, 444215, 503508, 298246, 707510, 371200, 292357, 246614, 457116, 787025, 558677, 279525, 719865, 496675, 573476, 623924, 744114, 470269, 311267, 468828, 422843, 478821, 152029, 675596, 179859, 365654, 445245, 684043, 693597, 639152, 646406, 407730, 673108, 340977, 614746, 472806, 379919, 500038, 759271, 785332, 738313, 1074053, 1066886, 1293082, 1066467, 1369770, 901513, 874769, 961579, 733767, 743916, 271729, 714473, 431745, 658176, 527308, 446196, 644564, 692100, 473226]
14709D73226P630K68735m4152M4426j24031j8599K33638j72626P33286l1958K72847
14698A642422l73854l98413K43288j69470k18571J92861k15189J22647k63903
14689E61818J68082K13048N0728m90476L532K8192N8663m6111K63782j46983K63388
14678I27663l09443k50454L85891J65589k00591j05896L13901D50815M12138q1589
14668G81364O549K5931l0928l4130K1943j21452j01349P6831J98024k04170M14387
14657A033000n2444j66518J5953j17577Q8905R7773K1366O2669l11597K30646
14647I02176L3587k8207m0562j15447K71841j20803j01795L22561j57697k18534
14637G47120K20711j28520j7587m1405L0872J28022j30604P6473n1679P5914P4767
$$ y = [473226, 480856, 749591, 705439, 749865, 625834, 607235, 840873, 668247, 1401533, 1369575, 1642422, 1268568, 870155, 1113443, 943973, 725402, 918263, 703074, 825721, 561818, 729900, 942948, 993676, 503200, 506732, 534924, 593587, 547476, 811258, 664275, 927663, 618220, 367766, 753657, 919246, 718655, 612759, 926660, 450815, 862953, 781364, 787913, 813844, 782916, 748786, 770729, 649277, 547928, 624759, 822783, 618613, 1033000, 980556, 814038, 829991, 712414, 801319, 899092, 920458, 983127, 671530, 902176, 935763, 907556, 866994, 751547, 1023388, 902585, 800790, 1123351, 965654, 747120, 967831, 839311, 821724, 780319, 811191, 939213, 808609, 885082, 833403, 909317, 984084]
14626I84084j28266J09987J78557l76931J92289j82475K02399N192k00829K26002
14616A010009L0926J8163p9848j390K29509l78720L60434k28036J19384j93105
14606H87326k68261M26018P7815k59691M57168M5587L3423k18332L2451J44533
14596A358037p7349r7776k4866J89731J08190j01994O7309p9047J5461m5470j00276
14585A211950J92443L5458k49634K93074J7142M0431j1438j30397j01979J04172
14575A401222J64K04218r40J51339k93963K50434j71989j21396J42398J96141
14565A757628o1079J92068l73069O25180k55185K5259J7216j15973L44339L20657
14555B477041J6593p9837L12321J86162J76562J044428J206803L096993Q013280
$$ y = [984084, 855818, 965805, 1144362, 767431, 959720, 777245, 979644, 984836, 784007, 1010009, 1040935, 1059098, 979250, 977860, 1207369, 828649, 1189083, 961047, 1080431, 887326, 619065, 1045083, 1122898, 863207, 1320375, 1365962, 1399385, 1181053, 1213504, 1358037, 1280688, 1182912, 1158046, 1347777, 1455967, 1353973, 1421282, 1342235, 1357696, 1312226, 1211950, 1404393, 1439851, 1190217, 1483291, 1500433, 1540864, 1529426, 1399029, 1297050, 1401222, 1401386, 1605604, 1604664, 1756003, 1462040, 1712474, 1540485, 1419089, 1561487, 1757628, 1696549, 1888617, 1515548, 2140728, 1885543, 1910802, 1928018, 1812045, 2156384, 2477041, 2493634, 2413797, 2726118, 2912280, 3088842, 4133270, 5340073, 8437066, 16450346]
14546A6450346J5106509J0912028B0054080G197853l236028k47166Q73644B221880
14537A905320m40861j63747R3984J77492O3206j89588L4241O2013J04825J07657
14527A754542k53887L07583j12596Q2240J29227j68845K18528Q3944J9849m2041
14517B018544J9755k17461K93793K689j74537j46641J70777J89516j9466k50039
14507A886930L29397l74291N75046J37124l24893J74718L1997k52880J84620j82355
14497B185413K84105l18002Q5262J00922M27339l33156J98617j32561J29827j4258
14487B613508J12414J3997k52347J68029k0723K84251k0404J2599k8864R8573
14477B981033l22435L39325n6710J26122k52261M01591K26216k42361R8186k21125
$$ y = [16450346, 31556855, 42468883, 20054080, 7197853, 3961825, 3714659, 4588303, 2221880, 1905320, 1464459, 1300712, 1394696, 1572188, 1635394, 1445806, 1480047, 1542060, 1646885, 1754542, 1500655, 1808238, 1695642, 1777882, 1907109, 1738264, 1956792, 2040736, 2060585, 2018544, 2038299, 1820838, 2114631, 2117320, 1942783, 1796142, 1966919, 2156435, 2136969, 1886930, 2216327, 1842036, 2417082, 2554206, 2229313, 2404031, 2436028, 2183148, 2367768, 2185413, 2469518, 2151516, 2236778, 2337700, 2765039, 2431883, 2630500, 2497939, 2627766, 2613508, 2725922, 2739919, 2487572, 2655601, 2634878, 2919129, 2898725, 2911324, 2882460, 2981033, 2658598, 2997923, 2941213, 3067335, 2815074, 3216665, 3442881, 3200520, 3298706, 3077581]
14467C077581k4890K97529J97030j8715L8162k15583L16775K7212k68263J61185
14457C588023K6390P0185J55618L6894n6428L7983K11078q399R476q2912N7112
14446D045020L27886k56662M94887J23290k61260L93555m35522J31165o4828m1857
14436D455674L56148J57712J11205j84006J56435M43485l73711K79198L92026
14427E794166r1698l66995M81214J61479J913r2214J50436M31829j00937L56603
14417F725796k26709J69760o1922J4464N4894M50222j5547j37013k47967O94135
14407G420113j41800N39129j76641K31695N2623L50666l80051L79056j42477P3877
14397H206190J06572p777L71428K7652M24488K07748J06321r5683L08855J82042
$$ y = [3077581, 3052691, 3350220, 3547250, 3528535, 3566697, 3351114, 3667889, 3695101, 3426838, 3588023, 3614413, 3684598, 3840216, 3877110, 3820682, 3858665, 4069743, 4061344, 4070820, 3987908, 4045020, 4372906, 4116244, 4611131, 4734421, 4473161, 4866716, 4431194, 4562359, 4497531, 4455674, 4811822, 4969534, 5080739, 4896733, 5053168, 5496653, 5122942, 5402140, 5794166, 5702468, 5335473, 5816687, 5978166, 5980079, 5887865, 6038301, 6470130, 6369193, 6725796, 6499087, 6668847, 6606925, 6621389, 6676283, 7126505, 7110958, 6973945, 6725978, 7420113, 7278313, 7817442, 7640801, 7872496, 7925119, 8275785, 7895734, 8274790, 8132313, 8206190, 8312762, 8304985, 8676413, 8704065, 9128553, 9336301, 9442622, 9346939, 9655794, 9837836]
14387I837836j8696J12134M18541M74742l12320P39277K4791J81605K36749k10540
14377A1484119O32524j0623M81560N4751M61592j72686L48925m2999N97786N02556
14367A4337505K40230N71574N14375k7965K46260N80629K58128J52422L94675
14358A7267833K54726J73227Q15905N73024N4776O48686L64120N28590R1528J191605
14348B1964020K91835J148984L08497P43264K58013M46385R98660N48360R87619
14339B7695637P23233O24300J053304Q17599Q15917P76537J179711J183368Q00376
14330C5669982J304146J199339J152617J174748J833790J473910J364490J529827
14322D6702849J729142J978408J201194K406647K252477J741161K320169K301972
$$ y = [9837836, 9819140, 9931274, 10349815, 10824557, 10512237, 11251514, 11276305, 11457910, 11694659, 11484119, 12116643, 12106020, 12587580, 12642331, 13103923, 12931237, 13280162, 13237163, 13834949, 14337505, 14577735, 15149309, 15663684, 15635719, 15881979, 16462608, 16720736, 16873158, 17267833, 17522559, 17695786, 18511691, 19084715, 19139491, 19788177, 20152297, 20680887, 20772415, 21964020, 22255855, 23404839, 23713336, 24456600, 24714613, 25160998, 26159658, 26708018, 27695637, 28418870, 29043170, 30096474, 30914073, 31729990, 32506527, 33686238, 34869606, 35669982, 36974128, 38173467, 39326084, 40500832, 42334622, 43808532, 45173022, 46702849, 48431991, 50410399, 51611593, 54018240, 56270717, 58011878, 60332047, 62634019]
14314F2634019K856485K229064L167431K989323L710268K913178L587520L900949
14306H7988237M306657M440571M805841N001711N006688N728593N937099O879442
14298A30094839O629730P526503Q094971Q271681R285167R479663J0564780J0693077
14290B00640411J2081652J2069251J3353303J3553714J4709309J5444147J5247208
14283B97098995J6529459J6373754J6894009J6373748J6016117J5447753J4166054
14276D08899889J2649609J1358121Q615883O602304J904056l306244m201730k982491
14268D39539397l629772p009751q925741j1108374j4050384j5414242j6693011
14261C62708122j6865841j6872792j6859042j6091625j6001196j5089696j4473836
$$ y = [62634019, 65490504, 67719568, 70886999, 73876322, 77586590, 80499768, 84087288, 87988237, 92294894, 96735465, 101541306, 106543017, 111549705, 117278298, 123215397, 130094839, 136724569, 144251072, 152346043, 160617724, 169902891, 179382554, 189947334, 200640411, 212722063, 224791314, 238144617, 251698331, 266407640, 281851787, 297098995, 313628454, 330002208, 346896217, 363269965, 379286082, 394733835, 408899889, 421549498, 432907619, 441523502, 448125806, 450029862, 446723618, 442521888, 439539397, 435909625, 428899874, 419974133, 408865759, 394815375, 379401133, 362708122, 345842281, 328969489, 312110447, 296018822, 280017626, 264927930, 250454094]
14254B50454094j3918611j2870205j2837687j0631602j0214869j0826924r427634
14247A69726562r152890q568111p427616p188357o716472o568004o136800n518903
14239A12449409n435271n036421m257796m511505m019030l672433m040231l290370
14231G8186352k813532l082284k879905k786508l143163k185068k434723j838689
14223E7022480k243155k003598j906163j523171j954786j374902j698039j309616
14215D3009050j536096j437787n45370j296092j473766j185477r93314j019494
14207C3521654n87519r16777j240282j140943n54214o03864p15530k43545j184550
14198B6334430j227744k44786n25599q52616m12599n90961p72155p8506p76408
$$ y = [250454094, 236535483, 223665278, 210827591, 200195989, 189981120, 179154196, 169726562, 160573672, 152005561, 144577945, 137389588, 130673116, 124105112, 117968312, 112449409, 107014138, 101977717, 97719921, 93208416, 89189386, 85516953, 81476722, 78186352, 75372820, 72290536, 69410631, 66624123, 63480960, 61295892, 58861169, 57022480, 54779325, 52775727, 50869564, 49346393, 47391607, 46016705, 44318666, 43009050, 41472954, 40035167, 39489797, 38193705, 36719939, 35534462, 34541148, 33521654, 32934135, 32017358, 30777076, 29636133, 29081919, 28478055, 27762525, 27518980, 26334430, 25106686, 24861900, 24336301, 23483685, 23071086, 22480125, 21707970, 21629464, 20853056]
14189B0853056l83919q12811j26925n58325l48475o74561m648o90529j70274m05282
14179A6677307l21863m51400k15047o21525r2086k58914k60386k09801l65898
14170A3880387l35103k77270l31853j58824l44879J59691l46614l23432j88243
14161A1733860o85752K5901l04202j27937Q5068j18800k22355q4800l19452l3890
14151I947641l52057K1301j48335l38311n2988m17625n7539j28621J86006l31382
14141H328090j32701j35356K2363j5892l15960l09661k5002j21643k26537q440
14131G059261k9658J43464n24070P745j53735K00715r5955j29716j3599q7899
14121F376553k71480J50027m12790J57806m0223q0243N9354l09805r3334J44046
$$ y = [20853056, 20469137, 19656326, 19529401, 18971076, 18622601, 17948040, 17943392, 17252863, 17082589, 16677307, 16355444, 15904044, 15688997, 15067472, 14975386, 14716472, 14456086, 14246285, 13880387, 13545284, 13268014, 12936161, 12777337, 12432458, 12592149, 12245535, 11922103, 11733860, 11048108, 11074009, 10769807, 10641870, 10726938, 10608138, 10385783, 10300983, 9981531, 9947641, 9595584, 9616885, 9468550, 9130239, 9077251, 8659626, 8602087, 8473466, 8659472, 8328090, 8195389, 8060033, 8082396, 8066504, 7750544, 7440883, 7415881, 7294238, 7067701, 7059261, 7029603, 7173067, 6648997, 6656742, 6503007, 6703722, 6607767, 6478051, 6464452, 6376553, 6105073, 6255100, 5842310, 6000116, 5959893, 5879650, 5939004, 5629199, 5535865, 5679911]
14111E679911m36557K47297l62995K15368l09225P7840O6832l04965p885j61615
14101D704006P2031K46630l97307J56993j94678J3787o7675k57229K50856m25439
14091D101975L84917k81466J23054k62537m6017k75201M68616l49517J24200j84184
14081C803840q078K08990k82417m3852R9573n20094M84874j85704N5385J28705
14071C741222l28029o2051L11807k53944J20910l22187j76563P2158K05541J71527
14061C480391j33459Q297l9473R0362r7437l79614L36662k16665k30439J96418
14051C015043j69927K1465K16168l66369J29138k94100J66807o4448J12188J9644
14041B785609k26633J83517l96334L75689n6469k67650N5097N9218j79827l00296
$$ y = [5679911, 5243354, 5490651, 5127656, 5343024, 5033799, 5111639, 5178471, 4873506, 4865621, 4704006, 4776037, 5022667, 4625360, 4782353, 4587675, 4601462, 4533787, 4276558, 4527414, 4101975, 4486892, 4205426, 4328480, 4065943, 4019926, 3744725, 4213341, 3863824, 3988024, 3803840, 3795762, 4004752, 3722335, 3678483, 3778056, 3257962, 3742836, 3557132, 3612517, 3741222, 3413193, 3351142, 3662949, 3409005, 3529915, 3207728, 3031165, 3103323, 3308864, 3480391, 3346932, 3355229, 3315756, 3406118, 3308681, 2929067, 3265729, 3049064, 2818625, 3015043, 2845116, 2866581, 3082749, 2716380, 2845518, 2551418, 2718225, 2653777, 2765965, 2785609, 2558976, 2742493, 2346159, 2721848, 2665379, 2397729, 2452826, 2512044, 2332217, 2031921]
14031B031921P83477l28245L04647k51539l26320K03912M3052q3567l7748r1743
14021B247847k65301L22604q0912k11770K26030M6793k29526k21253M64440j98817
14011B100135j71662k1914n5397j9012J85376j18628p4846K57184n18985J55468
14001A717719O768l77592P5560L47313N5287j51952K8644l2931k62320M01969
13991A808465r7198J87134P51397J750664N278042J3963794J8169018j3623299
13983B8188017A2855610n499585k450797j302378n50338m328n27395j63779J13696
13974B470706l08451J33276j05728j01140O3628j72506j42004r4250L30727j56843
13964A917415q4965j58222k90433M09114p7701Q1382o4770K32291m22203K02046
$$ y = [2031921, 2815398, 2487153, 2791800, 2540261, 2213941, 2417853, 2460905, 2377338, 2339590, 2247847, 1982546, 2305150, 2224238, 2012468, 2238498, 2285291, 2055765, 1834512, 2298952, 2100135, 1928473, 1906559, 1851162, 1832150, 2017526, 1898898, 1824052, 2081236, 1562251, 1717719, 1724487, 1346895, 1422455, 1769768, 1825055, 1673103, 1701747, 1668816, 1406496, 1808465, 1711267, 1898401, 2649798, 4400462, 9678504, 23642298, 41811316, 28188017, 12855610, 7356025, 4905228, 3602850, 3052512, 3048184, 2520789, 2357010, 2470706, 2162255, 2295531, 2189803, 2088663, 2152291, 1979785, 1837781, 1743531, 2074258, 1917415, 1832450, 1674228, 1383795, 1792909, 1715208, 1796590, 1731820, 1964111, 1541908, 1743954]
13954A743954k05854J52218p8685n4098j52409L00352k32306k7655R7550P7171
13944A620238k90951K13958L4409l30390p2385K31216k5695l2170k59301L16506
13934A405435j09575K14319j53837Q1603l4729l00953K89943K2864k57598m6626
13924A110846M19K23366L1050k23869j3849Q9358K51509l49383J64304k56567
13914A027184J64467J0292K50677l02183P5302j86536J87160K5296j51402j87616
13904I12641M21138l17670J2215O3635j98516P5495L62599l22582J74871l35618
13894H48208K70445K0600n2067j77110J72232m7437L04460j9045l78866j54888
13884G86532L86013k05485K0110j9254q2591m0024P2039L71538l72377K28348
$$ y = [1743954, 1538100, 1690318, 1611633, 1557535, 1405126, 1705478, 1473172, 1445517, 1543067, 1620238, 1329287, 1543245, 1577654, 1247264, 1174879, 1406095, 1380400, 1348230, 1088929, 1405435, 1295860, 1510179, 1356342, 1437945, 1403216, 1102263, 1392206, 1415070, 1157472, 1110846, 1111265, 1334631, 1365681, 1141812, 1127963, 1217321, 1468830, 1119447, 1283751, 1027184, 1191651, 1201943, 1452620, 1150437, 1225739, 1039203, 1226363, 1251659, 1100257, 912641, 1333779, 1016109, 1028324, 1091959, 893443, 968938, 1331537, 1008955, 1183826, 848208, 1118653, 1139253, 1087186, 910076, 1082308, 1034871, 1339331, 1320286, 941420, 786532, 1172545, 967060, 987170, 967916, 885325, 845301, 917340, 1288878, 916501, 1144849]
13874A144849l97355R5714M21268m38059J85646L31607l15826J49466k91068J3270
13864H99512k23826J00904l09982M07551J14997p2510m669l35210L33479j44904
13854G65342k14056K53805L57942q6647k7413k53280J03547L5510r7448M59320
13844A296622m32444k65633L3636K9015J74521l07085K22894j06166J91025k8291
13834H08094J49713k44142L7295p6469J96983J2745j55283J68545j14924K66225
13824A048782q1017N3156l80757J49813j28416p1615O3894K92649l52845K14539
13814H08183k29951K29609j34240j40274K32492q2803O4717C22028J99265K19122
13804G40415F2404P90683l48545j9794N0549m6592N57711m60760j46837Q8573
$$ y = [1144849, 747494, 843208, 1264476, 826417, 1012063, 1343670, 1027844, 1177310, 886242, 899512, 675686, 776590, 466608, 874159, 989156, 916646, 911977, 576767, 910246, 765342, 551286, 805091, 1163033, 1076386, 1048973, 795693, 899240, 934750, 837302, 1296622, 864178, 598545, 632181, 661196, 835717, 528632, 751526, 645360, 836385, 808094, 957807, 713665, 750960, 674491, 871474, 884219, 728936, 897481, 782557, 1048782, 967765, 1020921, 640164, 789977, 661561, 589946, 653840, 946489, 593644, 808183, 578232, 807841, 673601, 533327, 765819, 683016, 747733, 322028, 521293, 740415, 62404, 853087, 504542, 484748, 535297, 488705, 1046416, 585656, 438819, 527392]
13794E27392j05333R3964L06029r7289C17398K66415J42076p6892p4498k79586
13784B94913M65810j09494r7243p9526L88698p5726k75493j1351j41886L76905
13774G35607j90554M22923D22392A55669J60722J66447L3334P6480M9990m5564
13764E97078R8778k31749J37818k51323L63773l44373j42973M15882N739p5661
13754E72989p4170L41889B40271L73684B74284J97183K32307J35996l35737o0300
13744D43733N7481R2956Q8368j59375j84945K17920k2636o8072A36708K68299
13734D05007j92058L76618B17084L38658j25268L31333l10514P495n4570K46179
13724F50397k59628K33157q203O7270j75712j25616K37049j3239j2044j67854
$$ y = [527392, 422059, 516023, 822052, 724763, 317398, 583813, 725889, 648997, 574499, 294913, 760723, 651229, 553986, 474460, 863158, 787432, 511939, 500588, 358702, 735607, 545053, 967976, 422392, 155669, 316391, 482838, 516172, 592652, 642642, 597078, 695856, 464107, 601925, 350602, 714375, 370002, 227029, 642911, 648650, 572989, 498819, 840708, 240271, 613955, 274284, 471467, 703774, 839770, 504033, 443733, 501214, 594170, 682538, 523163, 338218, 556138, 533502, 465430, 136708, 405007, 212949, 589567, 217084, 555742, 430474, 761807, 451293, 458788, 404218, 650397, 390769, 623926, 615723, 682993, 507281, 381665, 618714, 605475, 593431, 425577]
13714D25577J13389Q5659j81635o5876R6545q4804o8912R9490O1038B15008N95994
13703H11002k13992k4114B56137K74519j79700J28160p8569J14362J45233B00242
13692E93603k58491Q5550J91530k30969m7170J36516q0922J45024j57764j1481
13682C65426K93221l24567J78717j16182Q0979B07364L71858B16593r584k5031
13672A81978L78067B77754K35770M7703j03274j92441H1323L18603H6087M46699
13662E32786j64710K83032q8088k44025G8466K25648K5276q9784L35435j38246
13652D36795j69469K60610A87987J49711j59558J50845K44660j07068I3769L85805
13642D79574A27403a8594D2427m683J56113J64231J12214B05012k5441k9294J11503
$$ y = [425577, 538966, 624625, 442990, 377114, 473659, 388855, 319943, 419433, 480471, 215008, 811002, 597010, 572896, 256137, 530656, 350956, 479116, 400547, 514909, 660142, 200242, 593603, 335112, 420662, 612192, 381223, 334053, 470569, 389647, 534671, 376907, 365426, 658647, 334080, 512797, 396615, 477594, 207364, 579222, 216593, 207009, 181978, 560045, 277754, 513524, 561227, 457953, 265512, 81323, 399926, 86087, 532786, 368076, 651108, 563020, 318995, 78466, 304114, 329390, 239606, 575041, 436795, 267326, 527936, 187987, 337698, 178140, 328985, 573645, 466577, 93769, 479574, 127403, -18594, 42427, 37744, 193857, 358088, 470302, 205012, 179571, 150277, 261780]
13631B61780j4833j9145n4101J89933R6620K0670k28106k6013j0489G0281J82080
13620B52361j14675J37105K05248M8668A739N49836r9423j80296Q6835q1850o2327
13609B14514P4618A06401J57639j14754L38749j79330B8372p95M77616j87409
13599C17784B1357J77087L04788j80769J13863J63155F2099J00244P1602N5796
13589B89741m4875R6536l9626J15632j36947R2505J68697j78761J19516A95272
13578B90656e8067D03126J63463o5656J03436k87001J03523L1937A47774f3581
13567D64023k22267J70709j86305L0240R5269j37408J40323H1037g9003I5785
13556A57727O1243K34l5082O6275l6521L1834J29829B5792M64271A82701G3380
$$ y = [261780, 246947, 227802, 173701, 363634, 460254, 480924, 252818, 226805, 216316, 70281, 252361, 137686, 274791, 480039, 528707, 1739, 551575, 452152, 271856, 358691, 276841, 214514, 289132, 106401, 264040, 149286, 488035, 308705, 28372, 27577, 505193, 317784, 21357, 198444, 503232, 322463, 436326, 599481, 62099, 162343, 233945, 289741, 244866, 341402, 301776, 417408, 280461, 372966, 541663, 362902, 482418, 195272, 290656, -58067, 403126, 566589, 500933, 604369, 317368, 420891, 452828, 147774, -63581, 464023, 241756, 412465, 226160, 256400, 351669, 214261, 354584, 81037, -79003, 95785, 157727, 218970, 219204, 184122, 250397, 213876, 245710, 375539, 25792, 490063, 182701, 73380]
13544E84047B55378F1637N1803O5782R2590K21l6920K11773A56623K75087j28805
13533C02905K33987k40522K03766A31243J34984C8812J28634K18334b05175H7677
13522I2978L02046D118K20291A03993P1496L87872m2696B32703B8406b2955B58517
13510C06752l4405m141n1947q509o4502E4781J64695a58254A57126K2278J31762
13499C11166m0349J15050A42495O2453m1005J65644A23729K26749A18640L47113
13489D65753j89993k283A771Q6819K49035A45337L07300q389A17762L18003A4085
13477B13379K3825l8414C7925M04267I7986Q9695k5585b7878h539B73652B5376
13465b28545C19505A47566J38711c0529A83018a00226C4187K15019b27241A67912
$$ y = [584047, 255378, 61637, 113440, 179222, 271812, 272033, 235113, 446886, 156623, 431710, 302905, 536892, 296370, 500136, 131243, 266227, 38812, 167446, 385780, -205175, 87677, 92978, 395024, 4118, 224409, 103993, 175489, 563361, 520665, 232703, 28406, -22955, 258517, 306752, 272347, 268206, 216259, 207750, 143248, 54781, 219476, -158254, 157126, 179404, 311166, 270817, 385867, 142495, 204948, 163943, 329587, 123729, 350478, 118640, 465753, 275760, 273477, 1771, 88590, 337625, 145337, 452637, 444248, 117762, 435765, 14085, 213379, 237204, 198790, 37925, 442192, 97986, 187681, 162096, -27878, -8539, 273652, 25376, -228545, 319505, 147566, 286277, -30529, 183018, -100226, 34187, 249206, -227241, 167912]
13454C74263q6577J00588j62793A11939e705A75259L47657B34084D7702f7288
13443A49351k578L8866q3571J77274M4649r2409J33090K8141B3720N7449J10277
13432A91446K9076A0954L32907j25209C2379N89565A01716K69217A49315Q1530
13422B30845A10394O9182P6657M8996n8196A15640M7192G7510b22141B58395J4423
13411B72818C7906a83951N9322e9245C83930D7136a4897A6843c272n4621C82028
13399A9274N16247B17970A05649J82975J08340I4218L8178K65080H801P8640Q7295
13388A74736h8835A46093J93807J39680a148B43574b30853C64748L2912e4305
13377I4021c8580n2082B0348N5832d7816B33949D0306b67359G1928J7471e7219
$$ y = [374263, 287686, 388274, 225481, 111939, -5705, 175259, 522916, 234084, 47702, -67288, 149351, 146773, 185639, 102068, 279342, 323991, 231582, 364672, 392813, 23720, 81169, 191446, 220522, 10954, 343861, 218652, 32379, 621944, 101716, 370933, 149315, 230845, 110394, 179576, 256233, 305229, 247033, 115640, 162832, 77510, -222141, 258395, 272818, 37906, -183951, -124629, -59245, 383930, 47136, -14897, 16843, -3272, -57893, 382028, 19274, 535521, 217970, 105649, 288624, 396964, 94218, 132396, 397476, 8801, 87441, 174736, -88835, 146093, 339900, 479580, -1148, 243574, -230853, 364748, 397660, -54305, 94021, -38580, -90662, 20348, 76180, -47816, 233949, 40306, -267359, 71928, 89399, -57219]
13365C33563j26738K1194K5275a48898B39519e1831q5801C16751o9170M0429I6872
13353A04578Q4908J9599K09538r3641K9313e8592D49924l8922j5880I3838J17151
13342B10989C9254K70330I3521N14323B80544K78317A90869J23205J67662C9241
13331A58012Q6480A8466J15785A7921J13968Q0125H9338L1363J14438c6596B42932
13319h0102B06247q798P5606j30554M0401B1424J11885Q7540j10400l3570a02293
13307A25011L6517b6514G4252A6590M52330A9621d9625A41969O2598b4569B16656
13295E3468J75017A06121I494J11297J62594M5841A089K11894a26259C25775A1821
13283A32229E9822J56804h2077B6339K38278b4818q288B51055A01494J18741A08167
$$ y = [333563, 206825, 228019, 253294, -148898, 239519, -51831, -137632, 316751, 247581, 288010, 96872, 104578, 189486, 209085, 418623, 324982, 354295, -58592, 449924, 411002, 395122, 93838, 210989, 39254, 309584, 93521, 607844, 280544, 558861, 190869, 314074, 481736, 39241, 158012, 244492, 18466, 134251, 17921, 131889, 212014, 89338, 120701, 235139, -36596, 242932, -80102, 206247, 197449, 273055, 142501, 182902, 21424, 133309, 220849, 110449, 76879, -102293, 125011, 161528, -26514, 74252, 16590, 468920, 19621, -49625, 141969, 204567, -24569, 216656, 53468, 228485, 106121, 9494, 120791, 283385, 329226, 1089, 212983, -126259, 325775, 11821, 132229, 59822, 216626, -82077, 26339, 264617, -24818, -33106, 251055, 101494, 220235, 108167]
13271D14244B01041e4833E193O0876k9736a27812A12951g4844F8507R0117A4411
13259G4016a05466m5491A20734A7730J12191J84006A5820O56Q883i8960l14614
13248d13574a79289B4915a21053a5077H0010i8278d4755B37371q0520D5880L73767
13237D19647h9174A42755K0481J30654i5421L5117A12739h0379A30439C3774N4723
13226H8497b19144h0275A64678P0014F190L17566A4157M0079a49418j9180F0365
13214B24640B2516a54703B78444a46714E1434a12816A56577K6796N3167c5511
13203A25658J01654b1557C02729A49348l4079i6595D27080F9643a39221F9635
13192B12064a2711G0346J17325h1199A53406M0914H2328a37699B11787H5764Q2796
$$ y = [414244, 201041, -54833, 5193, 66069, 36333, -127812, 112951, -74844, 68507, 158624, 14411, 74016, -105466, -150957, 120734, 17730, 129921, 313927, 15820, 16476, 25359, -98960, -413574, -179289, 24915, -121053, -15077, 80010, -98278, -44755, 237371, 156851, 45880, 419647, -89174, 142755, 163236, 293890, -95421, -60304, 112739, -80379, 130439, 33774, 88497, -219144, -80275, 164678, 234692, 6190, 323756, 14157, 54236, -149418, -168598, 60365, 224640, 22516, -154703, 278444, -146714, 51434, -112816, 156577, 183373, 236540, -35511, 125658, 227312, -21557, 302729, 149348, 115269, -96595, 427080, 69643, -139221, 69635, 212064, -12711, 70346, 187671, -81199, 153406, 194320, 82328, -137699, 211787, 85764, 168560]
13181A68560K31058q2340j56501d4927B46965b7504D1443c9728F7367c8606F5880
13169C16260b7329I9899Q3398b37513C44644e5467A84363H8727J06389g2233G1431
13157C5745L24359e562j99158C14913b39799l9293b567G5026e1287j75080E1331
13145B44014R0250j58446J45406j50880J11622A07690J03033j0931b76586Q5797
13135a90789q2781i1883j88828d4103F5082k989b04440F8122a05012k3125D21287
13123A97301o5855R7160a97949A0898M6334K920a35548q6432j3246a03638q570
13112a12208l3133B21976A03547C9684P7535j2512K08362a0947n1850B22364b14181
13100d3055H8308d8321E7764a29008B67664c8201B46972l4250A9145c6921B09326
$$ y = [168560, 399618, 317278, 160777, -44927, 246965, -27504, 41443, -39728, 67367, -38606, 65880, 316260, -27329, 99899, 183297, -237513, 344644, -55467, 184363, 88727, 195116, -72233, 71431, 35745, 360104, -5562, -204720, 314913, -239799, -279092, -2567, 75026, -51287, -226367, 51331, 244014, 334264, 175818, 321224, 170344, 281966, 107690, 210723, 199792, -276586, -190789, -273570, -91883, -280711, -44103, 65082, 62093, -204440, 68122, -105012, -128137, 421287, 197301, 131446, 228606, -197949, 10898, 57232, 60152, -135548, -221980, -235226, -103638, -112208, -145341, 221976, 103547, 39684, 117219, 104707, 313069, -10947, -62797, 222364, -214181, -43055, 88308, -48321, 57764, -129008, 267664, -38201, 246972, 212722, 19145, -36921, 209326]
13088B45431J4002i4046A26546J92530H4355J47961A8L44500j58143K09855p9136
13077C17094E9440O2368b36264B76256c1337C36600A44835i9013f75C9787K46997
13066B86784A03999l0150b57614A78838A8278q90K48789e4472H5631a31318A5084
13054H2852L4402m7380N2149b27591c5048n0019L6381k4762K2016B49447A00002
13042H3574c9889a8640A33831a16110l00495A25137Q4349p7572J3202L45065A43830
13030A72013b3078D40179a01685D20677A47756m3695J28101a45075B3598n114
13020A8484e0175j79134C8817b16740g0341A42620e6089j36933F2095a06243F5537
13008D0469d2051A62266n7402a24025A1890b40262B06944k5999m347p1097c67985
$$ y = [245431, 259433, -94046, 126546, 319076, 84355, 232316, 18, 344518, 186375, 396230, 317094, 59440, 121808, -236264, 276256, -31337, 336600, 144835, -99013, -675, 39787, 286784, 103999, 73849, -257614, 178838, 18278, 17388, 266177, -54472, 85631, -131318, 15084, 82852, 117254, 69874, 122023, -227591, -35048, -85067, -48686, -73448, -51432, 249447, 100002, 83574, -39889, -18640, 133831, -116110, -416605, 125137, 209486, 131914, 145116, 490181, 143830, 172013, -23078, 440179, -101685, 420677, 147756, 104061, 232162, -145075, 23598, 18484, -50175, -229309, 38817, -216740, -70341, 142620, -56089, -193022, 62095, -106243, 65537, 40469, -42051, 162266, 104864, -124025, 11890, -240262, 206944, 180945, 176598, 105501, -367985]
12996c49633F8242b14179o996M4546E04825C6142J34007a22872A37986e8080B6803
12984f6862B77182e8890C10749r5384M9422m7427q3518I581a52313N7913B09448
12972f7366B9392K7938a36627j13085A11810a0891E2743a30323o6737D5155O0975
12961A06130J49213e082B9950J69090M2629G1578N7906n5374c79019i9070A94595
12949B09429h6568b7491A04019f870p7427j07964A69567a99475A03587a5226j44926
12938a60152A09128k4308C4366K13751a04897l3282e1899A71557g6351A78542
12927f8510F1722h4874l20720i2403D6374h1624k10023A99521b34412B30815j08604
12916A22211a14964C58755a12988k7852r2735A58699c97929a36917f0074H4991
$$ y = [-349633, 68242, -214179, -221175, -176629, 504825, 36142, 170149, -122872, 137986, -58080, 26803, -66862, 277182, -58890, 310749, 215365, 264787, 217360, 133842, 9581, -152313, -94400, 209448, -67366, 29392, 57330, -136627, -249712, 111810, -10891, 52743, -130323, -197060, 45155, 106130, 255343, -5082, 29950, 199040, 241669, 71578, 129484, 74110, -379019, -99070, 194595, 209429, -86568, -27491, 104019, -6870, -84297, -192261, 169567, -199475, 103587, -15226, -160152, 109128, 84820, 34366, 248117, -104897, -138179, -51899, 171557, -76351, 178542, -68510, 61722, -84874, -405594, -92403, 46374, -81624, -291647, 199521, -234412, 230815, 122211, -114964, 358755, -112988, -140840, -233575, 158699, -397929, -136917, -60074, 84991]
12905a64501j66451A2255L6446B1547b0046A04935A0238h0455B06667a82208e393
12893F2692K56292K711a56233A74980L00853B13993J64102p5174D4071e0419n9070
12882a09489K6664C30915f9483l2423A65936j153a2214E8329d089o7692l0531
12871a02312l73819J87666p3123h736p9511C867J45605e7391A66423K80637A86087
12859b62733r434B48852j10147h9811a9688B03535J15872c0526H0527k6220J31101
12848A85408D0671J54221b63589a0398l43728a19289e9498N897j60275P0964f2973
12836a12475C84107a69194f3352A32601A1888h1349Q084h854F2752f8252B01947
12824i2624p9766D5756a31155A74791H279a54462O1952A27621A4531h9576L0471
$$ y = [-164501, -330952, 12255, 48701, 21547, -20046, 104935, 10238, -80455, 206667, -182208, -5393, 62692, 318984, 321695, -156233, 174980, 475833, 213993, 378095, 302921, 44071, -50419, -109489, -82825, 330915, -69483, -101906, 165936, 164783, -12214, 58329, -4089, -71781, -102312, -476131, -288465, -361588, -8736, -88247, 3867, 149472, -57391, 166423, 447060, 186087, -262733, -272167, 248852, 138705, -89811, -19688, 203535, 319407, -30526, 80527, 54307, 185408, 40671, 194892, -263589, -10398, -354126, -119289, -59498, -53601, -213876, -142912, -62973, -112475, 384107, -169194, -63352, 132601, 11888, -81349, -73265, -8854, 62752, -68252, 201947, -92624, -172390, 45756, -131155, 174791, 8279, -154462, -92510, 127621, 14531, -89576, -59105]
12813e9105n3450C39903E3331J41731H2908e4090B6285A357b08796E9757b49518
12801B15042j00756l1151J8548a4031j41793H0422a18731G5735A5496P5627J5193
12790A06316j4628J38997a74771O9694m7518N6214E0623G592K59073O8687K7785
12779C63137f7394C8305a18234G2893k302j2643J23207a98333A18854C683g8787
12767B65427l6890q7786c6662B20023B9790p2K5664b09095H8035B7113J06300
12756A33413J1630g0105r5295A96099q233p0324L9840d4461D763O2553c4730q7293
12744a22023C6345J05047F3894b57217A97451N9187p4056i5384H1628K70241A51864
12732d0382G0017K12875b65256J17062k51569g5126j72112I9842r404h373j73080
$$ y = [-59105, -112555, 339903, 53331, 195062, 82908, -54090, 26285, 1357, -208796, 59757, -249518, 215042, 114286, 83135, 101683, -14031, -155824, 80422, -118731, 75735, 15496, 91123, 106316, 91688, 230685, -174771, -105077, -152595, -96381, 50623, 7592, 266665, 335352, 363137, -67394, 38305, -118234, 72893, 70591, 57948, 181155, -198333, 118854, 3683, -78787, 265427, 228537, 140751, -36662, 220023, 29790, 29718, 55382, -209095, 88035, 27113, 133413, 145043, -70105, -165400, 196099, 187866, 117542, 157382, -44461, 4763, 67316, -34730, -122023, 36345, 141392, 63894, -257217, 197451, 256638, 182582, -95384, 81628, 351869, 151864, -40382, 70017, 282892, -265256, -148194, -399763, -75126, -247238, 99842, 90438, -8373, -181453]
12721a81453c4435l6422C65438a26820j06612g3619j18563A88167p6488N6391
12711A68070c449A60998D8766a13946A40739C2311L64672j66285k9257M0671N8749
12700C00861d532B6725L162F4K27648Q7295b07970R3613A61847a9008G3305g0841
12687a22375M6174A8102a31520l3036B9461N5881C6115d5109D09068a60482A12083
12675B5096a89133A85406i5188E1857J51954d1562A49514b6211A93a59356B98765
12663c75967H5779J12255a05625B38231c20478A03651a37717A6406h4127q137
12653i2264a8724E22399B49205f9645k94828R8473B7480r684J66480r0394c5940
12641b56326A288b6430B51126b23442A53990a26395p782A0914K03318b60114H8632
$$ y = [-181453, -34435, -70857, 365438, -126820, -233432, -73619, -192182, 188167, 111679, 168070, -3449, 160998, 48766, -113946, 140739, 32311, 396983, 230698, 201441, 242112, 300861, -4532, 26725, 29887, 64, 227712, 315007, -207970, -114357, 161847, -19008, 73305, -70841, -122375, -76201, 18102, -131520, -164556, 29461, 85342, 36115, -45109, 409068, -160482, 112083, 25096, -189133, 185406, -95188, 51857, 203811, -41562, 149514, -26211, 193, -159356, 298765, -375967, 85779, 198034, -105625, 238231, -320478, 103651, -137717, 16406, -84127, -92264, -18724, 522399, 249205, -69645, -364473, -266000, 27480, 17796, 184276, 93882, -35940, -256326, 1288, -26430, 251126, -223442, 153990, -126395, -134177, 10914, 214232, -260114, 88632]
12629e5738n6763D03442G0074M2582i7168A58942p3320J88632a68119n5632M3838
12618a79913C12731a79241A63164L6392a62404C71707H2977b63383R0032A98883
12607b69930c0247A93420a38613e7879k00614F7309J85477m3816H8387a41954
12596A08192a81592g0398D5584K7831b00681J7490A22475L1164J42842m245o1642
12585B30594F2080a86912E5012k2671b90108a31078C5319c1020G6399c5297E6829
12573C73397h4490o3017O7340M492A17865m2367Q7533i5691B34627b54275B3906
12561A33014a95032c4365B95479B2210e6997k14322C21674F9666a7153j80219
12551a97372C46609G5445b06345M5266C0634C086c0254m566m1611C71069m0315
$$ y = [-55738, -112501, 403442, 70074, 112656, -97168, 158942, 85622, 274254, -168119, -223751, -179913, 312731, -179241, 163164, 199556, -162404, 371707, 82977, -263383, -173351, 198883, -269930, -30247, 193420, -138613, -57879, -258493, 67309, 252786, 208970, 88387, -141954, 108192, -181592, -70398, 45584, 73415, -200681, -183191, 122475, 153639, 296481, 292236, 230594, 62080, -186912, 55012, 32341, -290108, -131078, 35319, -31020, 76399, -35297, 56829, 373397, -84490, -147507, -80167, -75675, 117865, 75498, 163031, -95691, 234627, -254275, 23906, 133014, -195032, -34365, 295479, 22210, -56997, -271319, 321674, 69666, -17153, -197372, 346609, 75445, -206345, -161079, 30634, 3086, -30254, -34820, -76431, 371069, 330754]
12540C30754a21360A83099c92512A57371a77877L9660M6593b89l8768j07687A0031
12528A2757M8959a66786g9371p1071l6757E563g6546B30738a52186j23916F5888
12516a8361B0004Q0270O304n2711J38925o7040L2530b25805A6900M5002J01397
12505A63299D9680e2638l18567A49270b37797g0552A33850c34066c3687p1000
12495a04687B55804f4732B58191c73540A51770J85424b52768i7699B92035b1260
12484A55260o7295c49567a11570k6408H2696J53566B2424Q2353k7547b579I0957
12472I777a8840A20034i6618L3093j23954F7515a96811B06754J21472A5104O4165
12461G9269a15900A56327a67500g7078m4160d4351l8125L3507J5572C92883C4684
$$ y = [330754, -121360, 183099, -392512, 157371, -177877, -138217, -91624, -289, -39057, -146744, 10031, 12757, 61716, -166786, -79371, -150442, -187199, 5563, -76546, 230738, -152186, -276102, 65888, -18361, 20004, 100274, 106578, 53867, 192792, 125752, 158282, -225805, 16900, 61902, 163299, 49680, -52638, -371205, 149270, -237797, -70552, 133850, -334066, -33687, -104687, 255804, -64732, 258191, -373540, 151770, 337194, -252768, -97699, 292035, -21260, 155260, 87965, -349567, -111570, -137978, 82696, 236262, 22424, 104777, 77230, -2579, 90957, 9777, -18840, 120034, -96618, -63525, -187479, 67515, -196811, 206754, 328226, 15104, 79269, -115900, 156327, -167500, -77078, -121238, -44351, -82476, -48969, -33397, 392883, 34684]
12449a77222C729a3160e499l7323L883j68131l0025c5976A20278g2562r0554c6830
12436C00698b85517C24384c05194a40194A69392G9059a74230j0081j00885P8740
12426b06456C55629a52775o8086l9753c9194E5991B1593d7007k58418B19055d19743
12414A59520o4793i7126A13297c3974k5433j4217A30911F0137e9569d893F387
12402F3617i9226m6341m8909J972A4228J21898b5026k8445G8570b98970J24408
12391a74562c4718B38536i3229l7352f2032G1107K94532F8465M1444b48705A42925
12379B7090K38941b624C7294I411b2972C33197f169l04624c4041j82613C3756
12367b1530A37918l5747N9125f8247D6776f3769I7671g5856a2573A99385k4809
$$ y = [-177222, 3729, -13160, -5499, -42822, -38939, -207070, -237095, -35976, 120278, -72562, -163116, -36830, 300698, -285517, 324384, -305194, -140194, 169392, 79059, -174230, -184311, -285196, -206456, 355629, -152775, -220861, -260614, -39194, 55991, 21593, -47007, -305425, 219055, -419743, 159520, 94727, -97126, 113297, -33974, -59407, -73624, 130911, 60137, -59569, -4893, 6387, 63617, -99226, -145567, -194476, -192504, 14228, 136126, -25026, -53471, 78570, -298970, -174562, -34718, 238536, -93229, -130581, -62032, 71107, 365639, 68465, 109909, -248705, 142925, 27090, 266031, -2624, 37294, 9411, -22972, 333197, -6169, -310793, -34041, -216654, 33756, -21530, 137918, 102171, 161296, -68247, 46776, -63769, 97671, -75856, -12573, 199385, 174576]
12356A74576A088R3866L23675A06011H261R9645F927J02609d7586H7838a3951
12344H0587K26519G2545a19567H0157f077H2432M38469j73396a39007K6551C06916
12332H7120K21285G5964J95622B9433L3667a20470F4234a25882A5800K54799a82622
12320G7671j9129K58234L6721a18393M6444l7567A18989K44286j78992n1827L0340
12309A62796a79103A05523a7301A29483h5469r9445A9704J49870a48381E3676
12298B88884a18873A907K89810a41628A91298d5430H4527B7555J28817c7801B14257
12286e0367H7982h4276a3712C3360K62639A40157E3806a61262A75402D6481A0015
12274B82296B1092b43722G2275O242p874i6701I9627J44607J7042j13481e6313
$$ y = [174576, 1088, 94954, 418629, 106011, 8261, 107906, 6927, 109536, -47586, 87838, -13951, 80587, 307106, 72545, -119567, 80157, -6077, 82432, 520901, 347505, -139007, -112456, 306916, 87120, 308405, 75964, 271586, 29433, 63100, -120470, 64234, -125882, 15800, 270599, -182622, 77671, 58542, 316776, 353497, -118393, -71949, -109516, 118989, 363275, 184283, 132456, 162796, -179103, 105523, -17301, 129483, -85469, -184914, 19704, 169574, -148381, 53676, 288884, -118873, 1907, 291717, -141628, 191298, -45430, 84527, 27555, 156372, -37801, 214257, -50367, 87982, -84276, -13712, 33360, 295999, 140157, 53806, -161262, 175402, 46481, 10015, 282296, 21092, -243722, 72275, 78517, 70643, -96701, 99627, 244234, 261276, 147795, -56313]
12262D13367D9992m243J24256g6832E3508i677I4445L4367a9366B1926J67803
12251A89729J90394D3788b39294C47397C4191K7364K8276b1024B8564J15957J45576
12240B90097I4858J98244a60656A52746p2796J71691O0109g2571A9324c5825A70284
12228a13984A31479b1982A54813L1211e4095a1430D51142J2215j69460j44969
12218A48928J10163H0644g6313B45985E8846i1416j6885r7667R7085B8111K4812
12207E2923K83142j61068a12088I7789h5177C79344a6707j34121a0743k0606C59697
12195B39032c8325A66404E4903K34075b02264R0168D33307j19293A40933j2474
12185A28459d7943B25056a38303A20744m3309L86M66436A31631d8843A13967A2706
$$ y = [413367, 49992, 45749, 170005, -76832, 53508, -9677, 94445, 128812, -19366, 21926, 189729, 380123, 43788, -239294, 347397, 34191, 61555, 89831, -21024, 28564, 144521, 290097, 94858, 293102, -160656, 152746, 79950, 251641, 311750, -72571, 19324, -35825, 170284, -113984, 131479, -21982, 154813, 186024, -54095, -11430, 451142, 463357, 293897, 148928, 259091, 80644, -76313, 245985, 58846, -91416, -108301, -205968, -108883, 28111, 52923, 336065, 174997, -112088, 97789, -85177, 379344, -16707, -150828, -10743, -31349, 359697, 239032, -38325, 166404, 54903, 288978, -202264, -112096, 433307, 314014, 140933, 128459, -47943, 225056, -138303, 120744, 77435, 77821, 544257, 131631, -48843, 113967, 12706]
12173B691J32935q308j9625K06245M2403o024c1858a3829A65500K64449A44105
12161A30587O9034c3292E3336J14917E4406K21422H5648j8290r848J42461i0789
12149G2936J63207B4354d5398A6247e5670j04304H8591M6973a80581c4885C727
12137d9550D43828H8867M1159P2294e2967B20279f9856a9495B42817f3616B49666
12125b64621g522B4881b941C71564i3371A20345J77820b1658A26399n994a85173
12113A04138L55702a78727f050q671A10815N0397e8298J5532B75799r3830J78491
12102C60460a63538E7905k3307f910A05553L67282b7030R993A24186Q1607f2248
12090A44645l5892a03173A5474b34525J13860B42562a29914c1656A30911l691
$$ y = [2691, 135626, 127318, 107693, 313938, 356341, 350317, -31858, -13829, 165500, 429949, 144105, 130587, 199621, -33292, 53336, 168253, 54406, 275828, 85648, 67358, 57510, 199971, -90789, 72936, 236143, 24354, -45398, 16247, -55670, -159974, 88591, 135564, -180581, -34885, 3727, -49550, 443828, 88867, 130026, 202320, -52967, 220279, -69856, -19495, 242817, -63616, 249666, -264621, -7522, 24881, -2941, 371564, -93371, 120345, 298165, -21658, 126399, 120405, -185173, 104138, 459840, -178727, -6050, -14721, 110815, 161212, -58298, -42766, 275799, 181969, 360460, -163538, 57905, 34598, -6910, 105553, 472835, -27030, -17037, 124186, 205793, -62248, 144645, 108753, -103173, 15474, -234525, -120665, 242562, -129914, -31656, 130911, 127220]
12080A27220l8904L4685c93311B01409M3172M9296b14406e6825A95410a42078
12069i7418B53429F9460c1191j05280c2551A05140A5710a82762g946G7039O2826
12058A39865N7180p4329J0572m4949P5801l36A6342N3454b5563B15185a9856B75231
12045A31959b08025e0739l23414F9036j2529K0776F213J59478D0368M2366b34557
12033A95597O722k9485J19016I4854b403l7549j4456B8543N5097j7368b76554
12021D8170a7878D69g2472A01753a00370G1287c213B01041E8084M5926l8527a50820
12008A15816b39549G8738a32460I5233a64850j8933J7605k13964b9740B14149
11997d445r0886C5839K01940a07876e3513G1637G927e147F8154R3347j6099c50803
$$ y = [127220, 88316, 123001, -393311, 201409, 244581, 293877, -214406, -56825, 195410, -142078, -97418, 253429, 69460, -31191, -136471, -32551, 105140, 15710, -182762, -7946, 77039, 139865, 197045, 122716, 133288, 88339, 164140, 163804, 16342, 69796, -25563, 215185, -19856, 275231, 131959, -208025, -50739, -374153, 69036, 56507, 77283, 6213, 165691, 40368, 82734, -234557, 195597, 202319, 172834, 291850, 94854, -2403, -39952, -54408, 28543, 83640, 66272, -276554, 48170, -17878, 469, -72472, 101753, -100370, 71287, -3213, 201041, 58084, 104010, 65483, -150820, 115816, -239549, 78738, -132460, 95233, -164850, -183783, -166178, -380142, -29740, 214149, -4445, -95331, 35839, 237779, -107876, -53513, 71637, 7927, -5147, 68154, 161501, 145402, -350803]
11984b05495A67719h3006C45065q5244a13774F1608i385n8558C0928K06982b17685
11972A08538J11111B5353L72007A25309k1228J33165b0394j30528a8644l51257
11962c69901B87639F4896a83650N9072j36670d5764a3036B06026a67575a6316
11951d78278A21326c0322I6870d894A8802a85702B3004K21239G2725L9620N5123
11940A67468l6316g6651A1512K23079C82j24K24926E5358a49138k02683J35044
11929b16777A6285b41876J6595B46353e9706q1623A10790g4452C37364A26171
11918A08182a78100C13682j1726a17611j87295D691e5996j60260D702c78908J80009
11907a98899C5327b4419G6835K9485A3659d6996k60987R9198H6348a3541j92088
$$ y = [-205495, 167719, -83006, 345065, 259821, -113774, 61608, -9385, -67943, 30928, 237910, -217685, 108538, 219649, 25353, 397360, 125309, 104081, 237246, -20394, -150922, -18644, -369901, 287639, 64896, -183650, -124578, -261248, -45764, -13036, 206026, -167575, -16316, -478278, 121326, -30322, 96870, -4894, 18802, -185702, 23004, 244243, 72725, 112345, 167468, 131152, -76651, 11512, 234591, 382, 258, 225184, 55358, -149138, -351821, -216777, 16285, -241876, -225281, 246353, -59706, -141329, 110790, -74452, 337364, 126171, 108182, -178100, 313682, 301956, -117611, -304906, 4691, -55996, -216256, 4702, -378908, -198899, 35327, -24419, 76835, 106320, 13659, -46996, -307983, -208785, 86348, -13541, -205629]
11896b05629A2111b07919G540a32715N0162B89695a81276N1514k0679E7650d8428
11884a7043j14163j32106C01241m0412a55132M6989G2553a23863j42790K5151
11874b41502E5422b7147A68417c37095H2435M855a32919c5487j7356n2689h211
11862A2500a5224B95557B7132a01827j38660d7187j06108b69j72325O2204m6419
11851a56809F0813b36182A13053b02956F4248J09765b19823c7546A06122a48998
11840I2704M5781i4155A3507M8749a80519j75468A32161O0829g0817k00127j4920
11829b85864k24867b2710C3684a0935C45476A46895K61916j72295c88584g6285
11818a4862j89H2553J5530c07940e2473H7841A0161j360f9037J3800A15236a15857
$$ y = [-205629, 12111, -207919, 7540, -132715, -82553, 289695, -181276, -129762, -150441, 57650, -48428, -17043, -131206, -263312, 301241, 260829, -155132, -108143, 72553, -123863, -266653, -241502, 55422, -27147, 168417, -337095, 82435, 87290, -132919, -35487, -52843, -105532, -8211, 12500, -15224, 295557, 27132, -101827, -240487, -47187, -153295, -269, -172594, -110390, -156809, 60813, -236182, 113053, -202956, 64248, 174013, -219823, -37546, 106122, -148998, 92704, 138485, -94155, 13507, 62256, -180519, -355987, 132161, 192990, -70817, -270944, -285864, -510731, -22710, 33684, -10935, 345476, 146895, 408811, 236516, -388584, -76285, -14862, -15051, 82553, 98083, -307940, -52473, 87841, 10161, 8801, -69037, -55237, 115236, -115857]
11805e1365A80441a90441D21417A69881H2111b12527A17865a54196A55895J53444
11795C09339F758J5036K8076K2489g0459O318n6962A84692b55575A64974K796
11784A67770b01760a7614B8800L05706j40818L2272a93784E9990J43855b09592
11773a83365M0996C0542b30437A52782b24006C2950R4947g1936d178j97293h596
11761c9760H7172b19043j058A26511n6874L8339a48381C0411b27189D3605J96687
11750B40292f9066F2825a35161A11377h980k28636m954a5316H9692a08668M7507
11739f1161k55744A98553c2269N831o9715I4104J06303b99212g7801A0998d885
11727A03130c86583J61321F6116b94308A34452a75992b6806q7516l1150I5492
$$ y = [-51365, 180441, -190441, 421417, 169881, 82111, -212527, 117865, -154196, 155895, 309339, 6758, 21794, 49870, 72359, -70459, -64141, -121103, 184692, -255575, 164974, 167770, -201760, -17614, 28800, 334506, 193688, 225960, -193784, 59990, 203845, -209592, -183365, -142369, 30542, -230437, 152782, -224006, 32950, 127897, -71936, -4178, -201471, -8596, -39760, 87172, -219043, -220101, 126511, 69637, 107976, -148381, 30411, -227189, 43605, 240292, -69066, 62825, -135161, 111377, -8980, -237616, -242570, -15316, 89692, -108668, -61161, -316905, 198553, -32269, -26438, -96153, 94104, 200407, -299212, -77801, 10998, -4885, 103130, -386583, -225262, 66116, -294308, 134452, -175992, -26806, -114322, -145472, 95492]
11716h386A17414B025P1923J18981c21989c473B77131d4720j5896K0586j29750
11705a69780C0472a24104B15447d0117J7382A05707m3183a1218A18568i1169L1216
11694e9953M68A22752a95695B47998h7030C14004j36319d0313J2629k06841A5474
11682B55876F9971P7755b7247A19045d1992d076A46171a40837B08390e1776C4557
11670A19645a07129A92621a04876C16276a19143m5424j7945f677l58391B9662
11659C1619h4749j17321D82828f317A04950c13949d6379A20518a96951R2087b3869
11647C789a9914l24520R3711B73192c07958B18025q9847O7726a15117k39775C21223
11635B75895H4010b85607f2721A36375q877K05359o1889g5335n5216o3011B12114
$$ y = [-8386, 117414, 2025, 73948, 192929, -321989, -3473, 277131, -44720, -60616, -40030, -169780, 30472, -124104, 215447, -40117, -22735, 105707, 62524, -11218, 118568, -91169, -59953, -59485, 122752, -195695, 247998, -87030, 314004, 177685, -40313, -27684, -234525, 15474, 255876, 69971, 147726, -27247, 119045, -41992, -4076, 146171, -140837, 208390, -51776, 34557, 119645, -107129, 192621, -104876, 316276, -119143, -164567, -182512, -6677, -365068, 29662, 31619, -84749, -202070, 482828, -6317, 104950, -313949, -46379, 120518, -196951, -104864, -23869, 3789, -19914, -344434, -250723, 273192, -307958, 218025, 128178, 195904, -115117, -354892, 321223, 275895, 84010, -285607, -62721, 136375, 127498, 332857, 270968, -75335, -130551, -193562, 212114]
11623C58265D0311O7697B5057Q2527b6461c972q917B0554a05783B16108C718d10463
11610A42876h6423K2081A26507a12032j36434f9460q0198A44520C9005a14618
11599a69738E1844J43903p0173J08102q8620b0160R621A45808b744C053e7819
11587G2520J08539g2386l2770B51885A180J89698a11418G9457J29072D178e9867
11575e53A35723J37325i1927J2854I2173f0371K2520I6059K5659c9291A17209
11563C92857k8570A00007A7144Q0164K44452I5145R8887c00135A96135F8331B5493
11551A64226J8892j3278o9669O9628D5408J85889l2484H1978k2772M12149C2621
11539D14051D7197j1893J64887J41519h0829k03189D2640H044J66708A9805J32335
$$ y = [358265, 40311, 108008, 25057, 107584, -26461, -3972, -12889, 20554, -105783, 216108, 3718, -410463, 142876, -86423, -64342, 126507, -112032, -248466, -69460, -149658, 144520, 39005, -114618, -169738, 51844, 195747, 125574, 233676, 145056, -20160, -10539, 145808, -2744, 3053, -57819, 72520, 181059, -72386, -105156, 251885, 1180, 190878, -111418, 79457, 208529, 4178, -59867, -553, 135723, 273048, -91927, -79073, 92173, -60371, -37851, 96059, 121718, -39291, 117209, 392857, 364287, 100007, 17144, 97308, 341760, 95145, 194032, -300135, 196135, 68331, 25493, 164226, 183118, 169840, 100171, 169799, 45408, 231297, 198813, 81978, 59206, 471355, 32621, 414051, 47197, 35304, 200191, 341710, -80829, -284018, 42640, 8044, 174752, 19805, 152140]
11528A52140a31152F9415J9371a95900R0932M7589C27762G1640b19969B97293
11517G1279b6388B1415J09192h8309q2770P0431B4633D55Q8848a46070B71752
11505e2667B22211L9689r0019P362A7458P877J91787h7063D03120A24439j3300
11494A11139a5290l49822A73371b32235a07153k6081f0589H7334L361a8937n205
11483b4142o12620B0931i5290j3027A3874J3000K61446n1117b41876G6167e0882
11471D54845A19959a7419B70431D7149J48055f327A63913a94897A5691P998a41687
11459C5814Q0457D3299b35381L1636a00698C5029L6462a27528B87073j03938A0911
11447A52360b6718j8871E8421A0266a1248A28154D6960L6735k9267k5963J56477
$$ y = [152140, -131152, 69415, 88786, -195900, -104968, -57379, 327762, 71640, -219969, 297293, 71279, -26388, 21415, 130607, -88309, -171079, -100648, 24633, 455, 89303, -146070, 271752, -52667, 222211, 261900, 171881, 179243, 17458, 25335, 217122, -87063, 403120, 124439, 111139, -15290, -365112, 173371, -232235, -107153, -133234, -60589, 87334, 90695, -18937, -24142, -636762, 20931, -95290, -108317, 13874, 26874, 288320, 237203, -241876, 76167, -50882, 454845, 119959, -17419, 270431, 47149, 195204, -6327, 163913, -194897, 15691, 23689, -141687, 35814, 116271, 43299, -235381, -203745, -100698, 35029, 71491, -127528, 287073, 183135, 10911, 152360, -26718, -45589, 58421, 10266, -11248, 128154, 46960, 83695, 54428, 28465, 184942]
11436A84942A0246P1142O961g0034A09954d929H6495e7184A42883b61598P5993
11425a85605R852o6805j28025E7174j7532N9851b9199A05866g6859o1736j83174
11414c21769c4506E64e143A14671N6148m4390K30093b39480a5514j6356A05269
11402A30016b5589a0484B66511I7467a51237O3886P595A01597M2870A0546b5935
11390B20431c23259J52349l2928o7659i7034A91460b81022C0878j3277b28259
11379a16985B99841l1436a72441A1260P8452N9304b3822D12706A45073i9155i292
11367C1266J55594r1987O0657K7843a27190B3854n769b08370B15632a01347k4360
11356a25707G811e1906j51784k2276I3487a73053A8267L973K64793a66765F8138
$$ y = [184942, 10246, 81388, 88349, -70034, 109954, -4929, 86495, -57184, 142883, -261598, -185605, -175753, -242558, -370583, 57174, 39642, 99493, -29199, 105866, -76859, -138595, -321769, -34506, 564, -5143, 114671, 170819, 126429, 356522, -239480, -15514, -31870, 105269, 130016, -25589, -10484, 266511, 97467, -151237, -87351, -79756, 101597, 144467, 10546, -25935, 220431, -323259, -170910, -203838, -271497, -97034, 191460, -281022, 30878, 17601, -228259, -116985, 299841, 268405, -172441, 11260, 89712, 149016, -23822, 412706, 145073, -99155, -9292, 31266, 186860, 94873, 155530, 183373, -127190, 23854, 18085, -208370, 215632, -101347, -125707, 7811, -51906, -203690, -225966, 93487, -173053, 18267, 22240, 287033, -166765, 68138]
11344e8381D41312m2111i9513j1901c8865k11654h9926d1713C8187A4764b80982
11332a22277i118j5341k8700k95088i263I5166e5774A31953m8120i1295A2316
11320c505A16860C162a44668j15866B39194j12079k1314b50316C07813c84172
11309A10793R9972b1076p7414D9371a39828f361j06724A73457M4455d7894r6593
11298a44487D15236C4925b02395e7613I992a63178K1427A67357h5167J8856A5312
11286B84833f6817I422c9420m16057G2163c26760a2248L663k4561j27983g6604
11274a53247j04220C2352J08175m8440b42037i7746j42373d403o093A45861b6934
11262b65033J17735B17737o8555a66103K8582c6618A50303b59780a21084L1460
$$ y = [-58381, 441312, 399201, -99513, -111414, -38865, -250519, -89926, -41713, 38187, 14764, -280982, -122277, -9118, -24459, -53159, -348247, -9263, 95166, -55774, 131953, 83833, -91295, 12316, -3505, 116860, 3162, -144668, -260534, 239194, 127115, 105801, -250316, 307813, -384172, 110793, 210765, -21076, -98490, 49371, -139828, -6361, -113085, 173457, 217912, -47894, -144487, 415236, 34925, -202395, -57613, 9992, -163178, -141751, 167357, -85167, -66311, 15312, 284833, -66817, 9422, -39420, -455477, 72163, -326760, -12248, -8585, -33146, -161129, -76604, -153247, -257467, 32352, 140527, 92087, -242037, -97746, -240119, -4403, -10496, 145861, -26934, -265033, -147298, 217737, 149182, -166103, -137521, -36618, 150303, -259780, -121084, -89624]
11252h9624A21504B8654b22152F2351b83629D9012L1738a16741L3727r0450C18383
11240a26111M6208k5141k63165D45951a60155e7770i009n9061b4329r5752G6950
11228d9795A28216a62499B28960B66K8220c8154A38870g5233A60432a51040A10156
11216b96256A68159b4311r9344D465i8177p0978g0714l8058B7718a13917M2660
11205g1257E2197c14766j67864I2484a04284c3923j76223P0860A21686a466G1918
11193b5711A55705c02618J26938N0387B3882a83301K6098l3159M5077E8593a02791
11181a37051A35334k2891R3882b57758L6641h6046D2639a12958k7538N3596M0603
11170d6297B0015c03588a13384J3350l0819B22216K4813a17716k97346J21566
$$ y = [-89624, 121504, 28654, -222152, 62351, -283629, 49012, 80750, -116741, -83014, -173464, 318383, -126111, -79903, -105044, -368209, 445951, -160155, -57770, -9009, -68070, -24329, -120081, 76950, -49795, 128216, -162499, 228960, 266, 28486, -38154, 138870, -75233, 160432, -151040, 110156, -296256, 168159, -24311, -123655, 4465, -98177, -169155, -70714, -108772, 27718, -113917, -71257, 52197, -314766, -482630, 92484, -104284, -33923, -210146, -139286, 121686, -1466, 71918, -25711, 155705, -302618, -175680, -125293, 23882, -183301, -157203, -190362, -145285, 58593, -102791, -137051, 135334, 112443, 206325, -257758, -221117, -86046, 42639, -112958, -140496, -86900, -46297, 20015, -303588, -113384, -100034, -130853, 222216, 247029, -117716, -415062, -293496]
11160b93496I1681b3543j1499d306B7011O6348K05383A9984J64441L9532C3281
11148b16477C52632g1034b182k51154A29906b16494B57399a77799D55322B6214
11137b73849J10456B9566b2117B00267a03693N496j23251L1627B56539r3909k9036
11126A33594L8689b97453B54428b92614A9228a55956A49508F0560k0938L9759
11116G9381a07593D7757A2604b4222B09288c6427A36725d06281A78301b03141
11105i9299E2879a45321A89406H9196D135K62711A20829b4163C795R8558b6069
11093a24796A81348m9938J71895c02996B7295h706C5399K70346E6868Q3363K01681
11082C41912i0526c3652H2357g8835A84092a15568b5009H6424j8358R0698O7180
$$ y = [-293496, 91681, -23543, -35042, -4306, 27011, 93359, 298742, 19984, 184425, 223957, 33281, -216477, 352632, -71034, -2182, -253336, 129906, -216494, 257399, -177799, 455322, 26214, -273849, -163393, 29566, -22117, 200267, -103693, -98197, -221448, -189821, 256539, 162630, 133594, 172283, -297453, 254428, -292614, 19228, -155956, 149508, 60560, 39622, 79381, -107593, 47757, 12604, -24222, 209288, -36427, 136725, -406281, 178301, -203141, -99299, 52879, -145321, 189406, 89196, 4135, 266846, 120829, -24163, 3795, 102353, -26069, -124796, 181348, 131410, 303305, -302996, 27295, -8706, 35399, 305745, 56868, 140231, 341912, -90526, -33652, 82357, -78835, 184092, -115568, -25009, 86424, 68066, 158764, 225944]
11071B25944N7692j36216m2785f6697B68031r3959l1770o2013J50581M5261n5209
11060B20922J25854A68881N60366k62364B16569K04337k01536L4487K87178B57107
11049D78241k34362O15600l55334A66319N4229J31676K68551O1836C32530K43335
11039E75865k71018J03369N4099q575J74431n8501m6229q7979K66529j46846j21355
11028D33790j45839J93209k06118K00970K6979M31076C27017K05173J0001j58887
11018C83304O6852J04357N1474j17263K64724k90272r1001j47393K19412n4819
11008C89375R0150J08866j31803m4384r2321J13221j7813j92934L61952A58298
10997E19696k00899K27476j17426J28288j14902J27609k6525j73168J7672J57492
$$ y = [225944, 283636, 147420, 104635, -66697, 268031, 174072, 142302, 80289, 230870, 276131, 220922, 346776, 168881, 729247, 466883, 216569, 420906, 219370, 253857, 541035, 257107, 478241, 243879, 859479, 504145, 166319, 220548, 352224, 620775, 682611, 332530, 575865, 304847, 408216, 462315, 453740, 628171, 569670, 523441, 435462, 701991, 555145, 433790, 287951, 481160, 275042, 476012, 502991, 934067, 327017, 532190, 542191, 383304, 450156, 554513, 605987, 488724, 753448, 463176, 372175, 224782, 444194, 389375, 479525, 588391, 456588, 412204, 319883, 433104, 415291, 222357, 584309, 158298, 519696, 318797, 546273, 428847, 557135, 442233, 569842, 543317, 370149, 387821, 545313]
10987E45313B38002L64299L76574l07179J2709j30347o9653L2057P7435K84014
10977H77911J21032j97494K15443J76943O4611m5390J03744L07634j34478N01153
10967A991109j69887L00692n76780L0416K70951l44600j34188J56617l8842l09490
10957A175998L12707J84385k24090l1255k52609L41264J25158k95174j6971j92537
10947A126876o2623l91151k1095J91123B15017L26641C1597b9602A15845M8409
10937A64254f7640C7522Q7720N3562c4058A10930j2944e4833A60992a90839g9194
10925A23994a64240B59192b28988c2901k49309A92590C9438i1466A84045e6211
10914B84a65876B8686a61304B5766K21306h4381A65548m4334a35k48093B46042
$$ y = [545313, 238002, 602301, 978875, 671696, 684405, 554058, 484405, 516462, 593897, 877911, 998943, 801449, 1016892, 1193835, 1258446, 1213056, 1316800, 1624434, 1489956, 1991109, 1821222, 2121914, 1545134, 1575550, 1846501, 1501901, 1367713, 1524330, 1485488, 1175998, 1488705, 1673090, 1449000, 1417745, 1165136, 1506400, 1631558, 1336384, 1319413, 1126876, 1064253, 673102, 652007, 843130, 215017, 541658, 31597, -29602, 115845, 164254, -67640, 37522, 125242, 178804, -34058, 110930, 97986, -54833, 160992, -190839, -79194, 123994, -164240, 259192, -228988, -32901, -282210, 192590, 39438, -91466, 184045, -56211, 284, -165876, 28686, -161304, 25766, 247072, -84381, 165548, 121214, -135, -248228, 246042]
10902a88343B34664D568R1610j3979N752R5168G4564c4943o6702n9619A59631
10890A9698b37362A06849J78827c5985o849J095b0157B941e5882j47600g8861
10878a23025A8208J49778B7699K0563a27224A78205F5177a57747K2295A66197
10867I0751b66764A1236d2035J9702F3764a28470C10178a85323J7561F2311J67006
10856B29317a35296B31686a30958l9187B50511r3869L0669d8541A63580J4526
10846A78106C0093A1793J67790c03387d0068B7089c8618q7408D6715e1628m5120
10835i6748l28081J94981j3152I0262b23447j32942C29505a20136A0702h88m07338
10824d08226g235H6648J06505l1748M1837a1846j12221A71740b69642a29511m6318
$$ y = [-188343, 234664, 4568, 96178, 82199, 87951, 183119, 74564, -34943, -101645, -161264, 159631, 19698, -237362, 106849, 285676, -35985, -42834, -41739, -20157, 2941, -55882, -203482, -78861, -123025, 18208, 167986, 27699, 48262, -127224, 178205, 65177, -157747, -135452, 166197, 90751, -266764, 11236, -42035, -22333, 63764, -128470, 310178, -185323, -167762, 62311, 229317, -135296, 231686, -130958, -170145, 250511, 156642, 187311, -48541, 163580, 178106, 30093, 11793, 179583, -303387, -40068, 27089, -38618, -126026, 46715, -51628, -96748, -424829, -229848, -243000, 90262, -223447, -356389, 329505, -120136, 10702, -888, -408226, -7235, 86648, 193153, 161405, 203242, -11846, -124067, 171740, -269642, -129511, -175829]
10813a75829B4602f1336D1843a80524A54778b07806i626G8877c97591F8082b01524
10801b9228h962j93254g2231A08653C755a23591b3609p4031A2496d32214c2422
10789C84987D3231P771J27867E8962J13817q4879a53392c8291j25332F0439J13338
10778A73777d26798a05085b467j86307B08503N7186a19337m4193E9113c4739j12323
10767a47062C4555K690J89413a49407C1408f2311F1769b01006B2624c33415d9125
10755e701j28164q418C23311j57635b01120B24034c16639f2378j6886B6085c2604
10743b2559j10370k12074j03195B52555b87664j36985A70620H079L2118a88582
10732a49596B516b42696J08993N3806j36727F8049a36991k29656b3993j28563
$$ y = [-175829, 24602, -61336, 41843, -180524, 154778, -207806, -9626, 78877, -397591, 68082, -201524, -29228, -8962, -202216, -72231, 108653, 3755, -123591, -23609, -97640, 12496, -432214, -32422, 384987, 43231, 51002, 178869, 58962, 172779, 87900, -153392, -38291, -163623, 60439, 173777, -426798, -105085, -2467, -188774, 208503, 265689, -119337, -163530, 59113, -34739, -147062, 34555, 37245, 226658, -149407, 31408, -62311, 61769, -201006, 22624, -333415, -49125, -5701, -133865, -142283, 323311, 165676, -201120, 224034, -316639, -62378, -79264, 26085, -32604, -22559, -132929, -345003, -448198, 252555, -287664, -424649, 170620, 8079, 40197, -188582, -149596, 2516, -242696, -133703, -79897, -216624, 68049, -136991, -366647, -23993, -152556]
10722a52556A22191a20626k6754j13191E0927b7969j58710A7397c2105l4179A9498
10710A02339O6677g2216L1116F6924f963j3439j2713j02760F0497d3303C30a13408
10697i3948L2148j93099c2514A12165k2317C8151H088K48098b96214P6153a1258
10685C9824a37053A08948N4603l3978Q6301b26954k0726N7100h8182L3288F590
10673B62713A17509e0474a7179B39305C3400M6858a21389E7079K81057a38109
10662f879j0579n2158A46328k0316D1644b96971d8694B70329B2678g1619L3864
10651c7755k70603M0551c3355j56467K8660k348j44143B19582R2516b02376C8353
10639C9433a1799c960j4331A65352c9059A36401M7928d682l05776D9344c7055
$$ y = [-152556, 122191, -120626, -147380, -260571, 50927, -27969, -186679, 17397, -32105, -66284, 19498, 102339, 169016, -72216, -41100, 66924, -6963, -20402, -33115, -135875, 60497, -43303, 330, -113408, -93948, -61800, -254899, -32514, 112165, 89848, 38151, 8088, 256186, -296214, -220061, -11258, 39824, -137053, 108948, 163551, 129573, 215874, -226954, -247680, -190580, -88182, -54894, 6590, 262713, 117509, -50474, -17179, 239305, 33400, 80258, -121389, 57079, 338136, -138109, -6879, -17458, -69616, 146328, 126012, 41644, -296971, -48694, 270329, 22678, -71619, -37755, -308358, -267807, -33355, -189822, -161162, -163510, -307653, 219582, 312098, -202376, 38353, 39433, -11799, -3960, -18291, 165352, -39059, 136401, 184329, -4682, -310458, 49344, -37055]
10627E3389b20024c8122A23969a08266D7110a68606A15872j2147D7762N1201a09309
10615D8441N278J50510i4659R98O041p188q6302N0164G601a66138A6586c3770
10602a6452C8250h2282J7169A08210n0397a80615O2156a0121B4085J17595h0375
10590c00576A03760b0041j4967k07244A34827a71086j92049J49850a1490j32534
10580a44024B51014A14859C4085K8603K36654c91013p9740A9030b69134f9714
10569c1158A65214C2010J70995b709k44703A77489a23295A56369E4768a30922
10558d7445k76387A11364O0070Q5697c83935a12204D4681d03791e2440B94434
10547b64679g1207o0737A80213n4438b86226B87416a48769C7679a12684M7957
$$ y = [53389, -220024, -38122, 123969, -108266, 47110, -168606, 115872, 103725, 47762, 98963, -109309, 48441, 53719, 204229, -94659, -93661, -87620, -94808, -181110, -130946, 7601, -166138, 16586, -33770, -16452, 38250, -82282, -65113, 108210, 57813, -180615, -118459, -10121, 24085, 141680, -80375, -300576, 103760, -20041, -35008, -242252, 134827, -171086, -363135, -213285, -11490, -144024, 251014, 114859, 34085, 62688, 299342, -391013, -470753, 19030, -269134, -69714, -31158, 165214, 32010, 203005, -2709, -247412, 177489, -123295, 156369, 54768, -130922, -47445, -323832, 111364, 171434, 257131, -383935, -112204, 44681, -403791, -52440, 294434, -264679, -71207, -131944, 180213, 125775, -286226, 287416, -148769, 37679, -112684, -64727]
10537f4727B11405a18033j84491A45173A7520c21440a4554n4744F9393a60942
10526b35071D14203A10360N8591A2933g6254l03989g0274A21005M2549a89760
10515a53721k3011e8151c072m5263o0535B21422d4455j1073j18930B65125C0106
10503A66083b94750A35707b16112b1373p954B36169a48245A02313J82186j04137
10493A80362l128d8784j13286p1150A54321e7671j75726a6027C96646j72823c55382
10481a41769A45093a59349a274A70207F788M9489L17371j09360a53699A84497
10470C31348c4759C9862j5649F404K27421a49020M7983c7454j97738a02504K7158
10459g5346E9746a74659q5075K8053R2434a5445k47466j26886a30491j95584M9148
$$ y = [-64727, 211405, -118033, -302524, 145173, 17520, -321440, -14554, -69298, 69393, -160942, -235071, 414203, 110360, 168951, 12933, -76254, -380243, -70274, 121005, 163554, -189760, -153721, -176732, -58151, -3072, -48335, -108870, 221422, -44455, -55528, -174458, 265125, 30106, 166083, -294750, 135707, -216112, -21373, -29327, 236169, -148245, 102313, 284499, 180362, 177234, -48784, -162070, -233220, 154321, -57671, -233397, -16027, 396646, 223823, -355382, -141769, 145093, -159349, -1274, 170207, 6788, 56277, 373648, 264288, -153699, 184497, 331348, -34759, 39862, 24213, 6404, 233825, -149020, -101037, -37454, -235192, -102504, -75346, 59746, -174659, -259734, -231681, -139247, -15445, -262911, -389797, -130491, -326075, -276927]
10448b76927B01469a03475b7A65989C0664O0086k6389a56531A42160c3846G9308
10436a87394A15152I006J59432G0831a74863B35861o8826a57755j4072C52722
10425i4288A63736j857b02321k79543h52l58749a13088k14646H9043a0439B8114
10413a36196a2368A6825a74431c4389k06133A964b96265a10514j12404F9389j8212
10402E1177L29130c62020f6370k4443j51362l8380a33328f0855B7628J96962d9724
10390A22417J5149P938m0547c20916A60251b34454B0127b59439G5297a5386A22907
10378C8210K50995o7192d17798D24525I3559B551Q7426d8996A67505b3991A35654
10366B40154a32397A38976E1229P6163L09041k15492h7806A9543N2258N6293m9472
$$ y = [-276927, 201469, -103475, -27, 165989, 30664, 90750, 64361, -156531, 142160, -33846, 79308, -187394, 115152, 9006, 168438, 70831, -174863, 235861, 167035, -157755, -171827, 352722, -94288, 163736, 161879, -202321, -481864, -852, -359601, -113088, -327734, 89043, -10439, 28114, -136196, -12368, 16825, -174431, -34389, -240522, 1964, -296265, -110514, -222918, 69389, 51177, 380307, -362020, -66370, -90813, -242175, -280555, -133328, -60855, 27628, 224590, -49724, 122417, 137566, 145504, 104957, -320916, 160251, -234454, 20127, -259439, 75297, -15386, 122907, 38210, 289205, 222013, -417798, 424525, 93559, 2551, 89977, -48996, 167505, -23991, 135654, 240154, -132397, 138976, 51229, 127392, 436433, 220941, -87806, 19543, 71801, 128094, 78622]
10355G8622a04324B16017H1594M45654a635j13176B27641P8442j39560M82335
10345F48858A77195J58349p5121G4122L05311j16476f4349C97753A55713G2537
10334C3941J05469a09487A53328n4179M2183A8891a58479B61351H7072g1414l64822
10323d36236D5879P9201Q9450k3591N0607j18174D7351j6047J1959J835K3632
10312F8730J68316b19767D4887g2608Q770B64578a60797A79389n1782a93723j2149
10301b05872A60641d3500I9739J62115e8201A5884a4511j18714B55327g9069c5077
10289D780L95136d4106r5211B03136h4371D0795a04385B71249E6505K83180G7217
10277i0093j87004d8187j85764P4265F1572Q6058b11951A06996a26534C4312e4553
$$ y = [78622, -104324, 216017, 81594, 527248, -1635, -114811, 227641, 306083, 166523, 648858, 177195, 335544, 260423, 74122, 379433, 262957, -64349, 397753, 155713, 72537, 33941, 139410, -109487, 153328, 99149, 141332, 18891, -158479, 261351, 87072, -71414, -436236, 45879, 125080, 214530, 190939, 241546, 123372, 47351, 31304, 43263, 45098, 68730, 237046, -219767, 44887, -72608, -63838, 264578, -160797, 179389, 127607, -193723, -205872, 160641, -43500, 99739, 261854, -58201, 15884, -14511, -133225, 255327, -79069, -35077, 4780, 399916, -44106, -139317, 203136, -84371, 40795, -104385, 271249, 56505, 339685, 77217, -90093, -277097, -48187, -233951, -159686, 61572, 147630, -211951, 106996, -126534, 34312, -54553]
10265h2942D4054b56224i371A30970b92363h4834A72822l8942J295L5381b10990
10253A13265J53365j5543a18434F7530O3465L24767b13036c039j58065I8211J13623
10242B11834b90073i0777k550r6287G6202e1727A23399e0497C12503G1553G327
10230b03285R5324A38177b22915Q7151p3643H8673b15280G8593b26018p497f4574
10218g1445B87757D7760g5857C837a87431R545a5236j17140A45995B7184J04425
10207A31609j0481a68298G1182c3795k52475A46181E1178P237Q6077K10433C0528
10195a49919N7051o938F9474a51668C47907I832a92964A38360b23799I0408C9552
10183b3873i150l9493q0973j56726D01857F0913a4142n6448l5659m89548a39403
$$ y = [-82942, 44054, -256224, -9371, 130970, -292363, -84834, 172822, 133880, 135175, 170556, -210990, 113265, 266630, 251087, -118434, 67530, 130995, 455762, -213036, -3039, -161104, 98211, 211834, -290073, -90777, -93327, -189614, 76202, -51727, 123399, -50497, 312503, 71553, 7327, -203285, -107961, 138177, -222915, -135764, -209407, 88673, -215280, 78593, -226018, -233515, -64574, -71445, 287757, 47760, -75857, 3837, -187431, -177886, -15236, -132376, 145995, 27184, 131609, 121128, -168298, 71182, -33795, -286270, 146181, 51178, 58415, 144492, 354925, 30528, -149919, -92868, -99806, 69474, -151668, 347907, 9832, -192964, 138360, -223799, 90408, 39552, -23873, -9150, -48643, -129616, -286342, 401857, 60913, -14142, -70590, -106249, -595797, -139403]
10171e9532n2677e1946A70312d7525q9573j76161e8695j5140j85964A77562J53147
10160C30709a1385l81485a86033A80633b57296A71528i6841A50798b65784q540
10150b74324J06630k36993i4694n7273B8704d8221m5303j02432H9593b3086D31285
10138b08537m2663J09964q4510R992q0557B71610b97257I9372a98892p3346C070
10126a51933B66470d6797D09K0697K408J27227m9184m1424a91913D1872A9571
10114a31741n2007A00997M4317a00527A8275J74353F8823R591a21406k1332O0950
10103h1788B16004a47266A93266C4314p303J69463b2585A40757a9816j80934Q2063
10092a18687k66892I5044a32918d0650j01036b1463A7060g8916l94056a36023
$$ y = [-59532, -112209, -51946, 170312, -47525, -137098, -313259, -58695, -73835, -259799, 177562, 330709, -11385, -392870, -186033, 180633, -257296, 171528, -96841, 150798, -265784, -274324, -167694, -404687, -94694, -151967, 28704, -48221, -93524, -195956, 89593, -23086, 431285, -208537, -251200, -141236, -225746, -215754, -296311, 271610, -297257, 99372, -198892, -272238, 3070, -151933, 266470, -46797, 409, 21106, 23514, 150741, 101557, 60133, -191913, 41872, 19571, -131741, -183748, 100997, 145314, -100527, 18275, 192628, 68823, 78414, -121406, -142738, -81788, 216004, -147266, 193266, 34314, 27011, 196474, -22585, 140757, -19816, -200750, -118687, -385579, 95044, -132918, -40650, -141686, -21463, 17060, -78916, -472972, -136023]
10081b1574A48623e8921p4757F4383a72738q6902h118C2475K4208M0352o736f4679
10068a30209e8484B63499b34387e3148B3928J36635b9916F9344J60458A5915K73266
10057B89181b6618j72379d0689j00813l35835a24114l8208a7938H6433c93918
10046h3317P30A72601g2887c2163p3991C5833a11616j52173J26513f5839k9704
10035i5543C8692f7576j46574j32394e5554j27029A938i7531A19755a81140M7311
10024a33829D2300i1382k04305B5064g0794J2608A00571a26014I7557a32971B6028
10012A44079a87282A31308e7764l921G3425a06981H1741k8605L15622G5194f4584
10000a27418m3461l53213A60202l1653F1464J04764b98614K8061p0546g0859A86814
$$ y = [-21574, 148623, -58921, -133678, 64383, -172738, -259640, -8118, 32475, 56683, 97035, 90299, -64679, -130209, -58484, 263499, -234387, -53148, 23928, 160563, -29916, 69344, 229802, 15915, 289181, -26618, -198997, -40689, -141502, -477337, -124114, -162322, -17938, 86433, -393918, -83317, -82587, 172601, -72887, -32163, -106154, 35833, -111616, -263789, -137276, -65839, -95543, 38692, -67576, -214150, -346544, -55554, -182583, 1938, -97531, 119755, -181140, -133829, 42300, -91382, -295687, 25064, -70794, -58186, 100571, -126014, 97557, -132971, 26028, 144079, -187282, 131308, -57764, -61685, 73425, -106981, 81741, 53136, 368758, 75194, -64584, -127418, -170879, -524092, 160202, 128549, 61464, 166228, -298614, -270553, -341099, -70859, 186814]
9988A11665b83155J40289R037K6412E5092c30294a35492k42573p0389A5065c1379
9976c46626A3671f5178a0835j5000k92128B7493a13141L0716m5267r4179F8082
9964H7498a42410N5494K9868J6222B7252g597r4363n147A40829a25632K907B8497
9951b87522a06173A666a46176o2903J9058B0846c0906n1563j73861R8415L1922
9940a25993N7792j2637A48054a6970B452b98371a4364p7293j29628A33284a88217
9928A0848a1341p8570j61827o6118J20333B9828L6442J08423A6603J94647d34855
9916A26698b87266b8614A48317d0037n9738p6845a2006G0546J2917a68447j93282
9905c61729J46576Q5432m4140e6758j4682L827r3724C55021a0731C5358e302B4358
$$ y = [111665, -283155, -142866, -133829, -107417, 55092, -330294, -135492, -378065, -448454, 15065, -31379, -346626, 13671, -65178, -10835, -25835, -317963, 27493, -113141, -82425, -127692, -221871, 68082, 87498, -142410, -86916, -57048, -40826, 27252, -7597, -101960, -107107, 140829, -125632, -122725, 28497, -287522, -106173, 1666, -146176, -209079, -190021, 20846, -30906, -82469, -256330, -157915, -125993, -68201, -80838, 148054, -16970, 2452, -298371, -14364, -91657, -221285, 133284, -188217, 10848, -11341, -89911, -251738, -317856, -197523, 29828, 66270, 174693, 16603, 211250, -434855, 126698, -287266, -28614, 148317, -40037, -99775, -176620, -12006, 70546, 83463, -168447, -361729, -215153, -129721, -173861, -56758, -71440, -67613, -161337, 355021, -10731, 35358, -5302, 24358]
9892a04735L4870I5568j5196k5748a17074k6495m8791L1846f3755q5j36238B28747
9879D2571c1231B0954J4899P0460a33613F2234d1103k59279d276B85476J50246
9868D35722f4473l22856A82908Q8783a00647o7320l559O1864B0653K6397b37684
9856A4645P7809a17027j66962O8571A56052c30937B36088H0485a22122J5600d2363
9844F9599f4216B24418b05065k11317B9823b1651n885j75331K1782B54065a36345
9832a72478A03754i751j22523b6873j70231A02528a71416c2603D0802a21132I0141
9820c8667R765l67398A26187L8949b48309N4633M6612j88311I2024i1318J9662
9809g1656F8583a75766M7104j28789I7611Q4386a961j47820B04902K7677f0315
$$ y = [-104735, -69865, 95568, 80372, 54624, -117074, -143569, -192360, -160514, -63755, -63840, -200078, 228747, 42571, -31231, 20954, 35853, 106313, -133613, 62234, -41103, -300382, -4276, 285476, 435722, -64473, -387329, 182908, 271691, -100647, -167967, -171526, -109662, 20653, 47050, -237684, 14645, 92454, -117027, -283989, -215418, 156052, -330937, 236088, 80485, -122122, -106522, -42363, 69599, -64216, 224418, -205065, -416382, 29823, -21651, -27536, -202867, -181085, 254065, -136345, -172478, 103754, -9751, -132274, -26873, -197104, 102528, -171416, -32603, 40802, -121132, 90141, -38667, -28902, -396300, 126187, 165136, -248309, -193676, -147064, -335375, 92024, -91318, -71656, 68583, -175766, -128662, -257451, 97611, 181997, -1961, -149781, 204902, 232579, -60315]
9797f7303A8331b35353B35169a40342J5448l0202J9672K1943J3641G8016e8681
9785a07747n3856a1316D4653e5533m08942a45621o5034k5101B4584Q2881J05900
9774B13365c17383B45205m4429a16283m5224M9210j5041C6944R5825b31535B132
9762a88285R2264k07954a23830p0818O9610D24026b36515A32060Hh2836j96954
9751b79790r367a15329j5827F602f7146j03933F5143k1846a60859d6589j79027
9740b25616d0297R609B8355g3553A19920k3070l5555a47764g638r9070j26592
9729b33300a4930A82229K1959a20380p3000C6274b04698n6936H9530c77658a33513
9717B60728g5722j45335e3199j06339n772g7089j86544l6437a37510k252k45181
$$ y = [-67303, 18331, -235353, 235169, -140342, -124894, -155096, -135424, -113481, -99840, 78016, -58681, -107747, -161603, -11316, 44653, -55533, -464475, -145621, -210655, -235756, 24584, 107465, 213365, -317383, 245205, 200776, -116283, -161507, -112297, -127338, 36944, 132769, -231535, 2132, -188285, -96021, -303975, -123830, -194648, -125038, 424026, -236515, 132060, 8, -82836, -279790, -289157, -115329, -131156, 6602, -67146, -171079, 65143, 43297, -160859, -46589, -225616, -40297, -30688, 28355, -73553, 119920, 96850, 61295, -147764, -7638, -106708, -233300, -14930, 182229, 204188, -120380, -193380, 36274, -204698, -261634, 89530, -377658, -133513, 260728, -75722, -221057, -53199, -159538, -165310, -77089, -263633, -300070, -137510, -139762, -384943]
9706c84943i6003A02430b70258A40486h5254H7268C6375a8468j73992O5838A52182
9694b12401R5832m154C8270D690O9179h1294K5840j26669E2540a54860B3648g0656
9681D7092a07341F608b86124a362l6143A5661L9650J43728a52706G3497f6934
9669d415A13230a59581M7610k73442q91g7204j00096r9423d6981B31753g5153
9657A20717a9512j39360A43238a96300A31864A9041f2472A15640L2106B4959a27031
9645a26503I6881a85271D537a95929A33595o5012h8124B75675h7183D0629f443
9633c68474J5952i1029A4976J80105a22820j7992n6527B74403n1659O2537H559
9621c24565A37800b08314A67498b08484H7129a99348B32898b045A83907J75456
$$ y = [-384943, -96003, 102430, -270258, 140486, -85254, 87268, 36375, -18468, -192460, -126622, 152182, -212401, -116569, -120723, 38270, 4690, 73869, -81294, -55454, -182123, 52540, -154860, 23648, -70656, 47092, -107341, 6608, -286124, -1362, -37505, 15661, 55311, 199039, -152706, 73497, -66934, -4415, 113230, -159581, -111971, -385413, -386304, -77204, -177300, -276723, -46981, 231753, -75153, 120717, -19512, -158872, 143238, -196300, 131864, 19041, -62472, 115640, 147746, 24959, -127031, -126503, 96881, -185271, 4537, -195929, 133595, 68583, -88124, 275675, -87183, 40629, -6443, -368474, -352522, -91029, 14976, 195081, -122820, -140812, -197339, 274403, 222744, 285281, 8559, -324565, 137800, -208314, 167498, -208484, 87129, -199348, 232898, -2045, 183907, 359363]
9611C59363a53597A22535M0441e5041j40948a59G7429d75635D3982J28948e1642
9599F8892b35498J1418P3630L1075j06793q027A38335F7753Q2138a17765j31382
9588b49147O3959B38308I1479a88066k05901I9505c86260c3520j58096o428g8576
9576E9943g2005A18046a74971m3434d4150j46113M4357B1324a48458J7890D9138
9564b55218A57859D800b79979A37071b60469a6915a633j7563A302b98317a20994
9552a15881D658J89235H8575M9237o5338C5679J00391b10640b7114j89568O7264
9541a49418o3535j48665M9664B40845d7971j08267A31771E2218a6153B4959e197
9529a36512B85897G8735f2443k0060C37332H9341A2375K00331C3997e1271C7920
$$ y = [359363, -153597, 122535, 162976, -55041, -195989, -159, 77429, -475635, 43982, 172930, -51642, 68892, -235498, -224080, -150450, -119375, -226168, -234195, 138335, 67753, 149891, -117765, -249147, -185188, 238308, 91479, -188066, -393967, 99505, -386260, -33520, -191616, -198044, -78576, 59943, -72005, 118046, -174971, -218405, -44150, -190263, -145906, 21324, -148458, -130568, 49138, -255218, 157859, 4800, -279979, 137071, -260469, -16915, -1633, -19196, 1302, -298317, -120994, -115881, 4658, 193893, 88575, 137812, 72474, 35679, 136070, -210640, -27114, -216682, -149418, -212953, -361618, -311954, 240845, -47971, -156238, 131771, 52218, -16153, 24959, -5197, -136512, 285897, 78735, -62443, -82503, 337332, 89341, 12375, 212706, 33997, -51271, 37920]
9517G706J2420d082j11399J8659r1457j64086a15626R794L1544j54912A08018
9505E1517a88041j1822n1725d7583o845A98099a3066A70586K3652a30455F6026
9493I268a02597B72418j33820c11903i2884E1244K18848A32563J699b3269o5280
9482h8549j6175L2693R166B25132a04553M1677F8347c56994J10317J17821j61910
9471b90766E6725J08265h7417j90300E2698J66665a21558G5417h2655I9016a52819
9459a83184p5269i2567q4440D6395N2944f7744A79865q1338b10208A43059c10888
9447d0683j28243D2361f8294b7102j59259h6605m94r1168f184H98a39492O3148
9435g6344c8030p6958D8908b42137A2010b84329A67625e3256A44611m5071O1049
$$ y = [7706, 20126, -4082, -115481, -96822, -188279, -352365, -115626, -105832, -74288, -229200, 108018, 51517, -188041, -199863, -251588, -47583, -54428, 198099, -13066, 170586, 194238, -130455, 66026, 9268, -102597, 272418, 138598, -311903, -92884, 51244, 270092, 132563, 134262, -23269, -88549, -104724, -72031, -62865, 225132, -104553, -62876, 68347, -356994, -246677, -128856, -290766, 56725, 164990, -87417, -277717, 52698, 219363, -121558, 75417, -82655, 99016, -152819, -183184, -258453, -92567, -177007, 46395, 99339, -67744, 179865, 98527, -210208, 143059, -310888, -40683, -168926, 42361, -68294, -27102, -186361, -86605, -87099, -178267, -6184, 898, -139492, -76344, -38030, -114988, 48908, -242137, 12010, -284329, 167625, -53256, 144611, 99540, 160589]
9424A60589b65863J24918F8204a92083h3020E7770k5780Q909f4311A72890q4825
9413H8065a9084k54380A47096f5658H1265i2405j83479i4762D8849K4984a4022
9401C5403i2023q7715j42001B15805a73016A28256a11351L7251l69222b14635
9390C17154b15533A01487c25881a58112A02399f9661A54168b46868I7564i6002
9379H2393J57823a14300B28379n4669k6232b44498h857A5428f4838l9618l32722
9368d37178a38766B25769a82021F8170a5814j54178L7253O1952o8713A72607f2461
9356b60055l1953k10m1163a33989C08635I1454j1707l9283b71681J02216j525
9345a70990L1991A665a07307I3404k3418J05706n2782h6335k17376R9649c3025
$$ y = [160589, -265863, -140945, 68204, -192083, -83020, 57770, 31990, 40899, -64311, 172890, 88065, -19084, -273464, 147096, -65658, 81265, -92405, -275884, -94762, 48849, 73833, -14022, 35403, -92023, -179738, -321739, 215805, -173016, 128256, -111351, -74100, -443322, -214635, 317154, -215533, 101487, -325881, -158112, 102399, -69661, 154168, -246868, 97564, -96002, 82393, 240216, -114300, 228379, 173710, 147478, -244498, -8857, 15428, -64838, -104456, -437178, -138766, 225769, -182021, 68170, -15814, -169992, -132739, -70787, -139500, 172607, -62461, -260055, -292008, -292218, -333381, -133989, 308635, 91454, 79747, 40464, -271681, -169465, -170990, -138999, 1665, -107307, 93404, 69986, 175692, 122910, -86335, -303711, -204062, -33025]
9333a19897j84416J18917A37722g8741b4000A03633M6388f0771C79706a91638
9322c36745D1798A7170O2767b91275d4854A28346C6977G916c76765f1020j5676
9311g6696K5894A97362a81079k21336a88072A3464J2503a71462D3402b01017A3071
9299a33013P873E197b56270n5656b6202j54874G8307b11172C86478A71607F6770
9287A02951O3396d31815D06544i4395k0831A39488a09415D4325K48565r9128b75512
9275A69757p5334B6379a72906e9895A43387d16519a76251A62697b8439H9270a18574
9263a57346j67996J41600J2699A32085a17863F8737B8427e2496k0081o0081d1627
9251C43937a71718D5192a7212H7270J7875e0113k65493a12319J9663a6655k78544
$$ y = [-119897, -304313, -185396, 137722, -78741, -24000, 103633, 150021, -60771, 379706, -191638, -336745, 41798, 17170, 79937, -291275, -44854, 128346, 36977, 7916, -376765, -61020, -76696, -50802, 197362, -181079, -402415, -188072, 13464, 25967, -171462, 43402, -201017, 13071, -133013, -125140, 5197, -256270, -311926, -26202, -181076, 78307, -211172, 386478, 171607, 66770, 102951, 166347, -431815, 406544, -94395, -115226, 139488, -109415, 44325, 292890, 193762, -275512, 169757, 94423, 26379, -172906, -59895, 143387, -416519, -176251, 162697, -28439, 89270, -118574, -157346, -325342, -183742, -171043, 132085, -117863, 68737, 28427, -52496, -72577, -132658, -41627, 343937, -171718, 45192, -17212, 87270, 105145, -50113, -315606, -112319, -92656, -16655, -295199]
9240b95199A44d18723a79433M2100q6253E8764b04401N5953j01965k46445b40672
9228a00399l006A12504a1604p9693d2672A40443c2363r3060G1813a69669A0992
9216a57423M4104A89603D3211a02254r879c3637l04207a4158r155j62558N1624
9205a34247r161k7071C67205b13592E8716a68518C01162d0410r0877C14658m3658
9194B71000b29935A66678a32375D6594c1445j05696C4945K7028L1098a43090g1450
9182B1709i1914A64365K50566b95055J05765D348b70041R6308j03194J10455A22810
9170d9530A93977C3110e157G0536c1326m60440B6647c13643b3513H9905g8027
9158i8580L3718p3434B2002a77555A42537h529D19298B3493a63578k5130A9590
$$ y = [-295199, 144, -418723, -179433, -137333, -223586, 58764, -204401, -148448, -250413, -496858, -240672, -100399, -103405, 112504, -11604, -91297, -42672, 140443, -32363, -125423, 71813, -169669, 10992, -157423, -113319, 189603, 43211, -102254, -112133, -33637, -337844, -14158, -23313, -185871, -134247, -143408, -170479, 367205, -213592, 58716, -168518, 301162, -40410, -131287, 314658, 271000, -229935, 166678, -132375, 46594, -31445, -137141, 34945, 61973, 93071, -143090, -71450, 21709, -91914, 164365, 414931, -295055, -189290, 4348, -270041, -173733, -276927, -166472, 122810, -49530, 193977, 33110, -5157, 70536, -31326, -491766, 26647, -313643, -23513, 89905, -78027, -98580, -64862, -138296, 22002, -177555, 142537, -8529, 419298, 23493, -163578, -188708, 19590]
9146i1428O399n7460A91610b56000D6916K15623b5300j4289j34979c3160B82346
9134a44483m3542B6734c15584Q0835J08461A28594d3255B2553D937J26802N874
9123A37613j2934a08549K8515g171A62154H0317j4403L3488c1170l08482J08643
9112b31009h1638C5340b22745a04414j00508J812c1838k14507g0085l5623C72762
9100A29668C0142D371L6003a83364A92791a79412j77704a8808q0375p5599g6426
9088g0815F9129a78757P6611m6288D1128a35332k1520k56515J86679Q7111r3707
9077b33284A58205a04900Q411a553j11007A76180b29063A46600E7844c33396J39099
9066a94297O6926L7146o8195A92350b44817j84431e8752C1391a60728C6045a41744
$$ y = [-91428, -85029, -142489, 191610, -256000, 46916, 262539, -25300, -39589, -174568, -33160, 282346, -144483, -188025, 26734, -315584, -234749, -126288, 128594, -43255, 22553, 4937, 131739, 137613, 124679, -108549, -80034, -7171, 162154, 80317, 65914, 99402, -31170, -339652, -231009, -81638, 35340, -222745, -104414, -204922, -203110, -31838, -246345, -70085, -105708, 372762, 129668, 30142, 4371, 40374, -183364, 192791, -179412, -357116, -18808, -99183, -174782, -76426, -70815, 69129, -178757, -102146, -148434, 41128, -135332, -156852, -413367, -226688, -139577, -233284, 158205, -104900, -96489, -1553, -112560, 176180, -229063, 146600, 57844, -333396, -194297, -127371, -90225, -158420, 192350, -244817, -429248, -58752, 31391, -160728, 36045, -141744]
9054c16246a53431b275G0188P9809j1210L7400G473c25694P0882B42751a8904
9042a29137f4314r1285E3351D081b88535A53472l7420M356a72027d8795g18m2515
9030d3233j16889j73518b7397k369q4945N6858R04C07599k6075a80712E4171J64218
9018B18389g2036F2482M2856b38090A919J96913a44603k7515Q5627o8117o5251
9007b19859N7358q4604Q0484j22669D1768a86615j65719a49421B94730a38362
8996b9628j43611B4174b93114a13975m9422C7192b2273A22397a24419E6516P348
8985F3864b07446m2182c0009j1338j26223F967a12233I4079J59887E6903K3717
8974H0620b46592N5853k63122b0541k55510C8933a13241H7124d2052d088k44508
$$ y = [-316246, -153431, -2275, 70188, 149997, 138787, 176187, 7473, -325694, -254812, 242751, -18904, -129137, -64314, -155599, 53351, 4081, -288535, 153472, 116052, 120408, -172027, -48795, -718, -43233, -160122, -333640, -27397, -29766, -114711, -57853, -56949, 307599, 281524, -180712, 54171, 218389, -72036, 62482, 105338, -238090, 1919, 198832, -144603, -172118, -86491, -154608, -219859, -162501, -247105, -166621, -289290, 41768, -186615, -352334, -149421, 294730, -138362, -29628, -173239, 24174, -293114, -113975, -163397, 37192, -22273, 122397, -124419, 56516, 63864, -207446, -249628, -30009, -41347, -167570, 6967, -112233, 94079, 253966, 56903, 80620, -246592, -190739, -453861, -20541, -276051, 38933, -113241, 87124, -42052, -4088, -248596]
8963b48596E4563b16349a7152A01622f0963A71377c80107d4707A35025d5p0295
8952g0340c4274H4878b06194C8063e2212n0945A29091h2764k24118b7583l4011
8941f1594j4722F7394b5221C4831d0683B731M0418A9215a59239H7053A1394J7954
8929B9348J4806a96656c5365j53316Q1608C4050c09434a17530A98416N3785P33235
8918I85436k53059B74437c32280A73270o3637a1058k31263a3933o3296k2276L4103
8907f5402J1145N347A48420N6830D5759h984o2339q4235f5622k03159b3321o3067
8895h6388E0396g7721j98147b4135B94241a13861A0351K3547b8443l80867J61909
8884b47401Q3852D3442Q1846c5153j60785A3510b45230q177E8469d0873j46201
$$ y = [-248596, 54563, -216349, -17152, 101622, -60963, 171377, -380107, -44707, 135025, -45, -70340, -34274, 84878, -206194, 38063, -52212, -103157, 129091, -82764, -306882, -27583, -61594, -76316, 67394, -25221, 34831, -40683, 2731, 43149, 19215, -159239, 87053, 11394, 29348, 44154, -196656, -35365, -188681, -107073, 34050, -309434, -117530, 198416, 252201, 985436, 732377, 274437, -332280, 173270, 109633, -11058, -242321, -13933, -77229, -99505, -65402, -54257, -48910, 148420, 205250, 45759, -8984, -71323, -155558, -65622, -268781, -23321, -86388, 50396, -77721, -275868, -24135, 294241, -113861, 10351, 33898, -28443, -409310, -247401, -163549, 43442, 125288, -35153, -195938, 13510, -245230, -253407, 58469, -40873, -187074]
8873a87074j41488a23244J1480H9522b71337J33243G2766K58020h2947B2974b47786
8861a5387B2559a30890c5572p1393A65214J44539a53675e8101l3399b5086l42932
8850c68018F170a66657N3414M661j71225c2635B80200a09392k63608A57185E1660
8838b594r8946k4257H0750b31904k59598G1325b39326H8929a6781j87988H7798
8826C12987r4769a69448a9332m5176k58464n1688I9069a53349D08813b6903h876
8814a4187q3365j30251A48967K14853f67F9828g4297m0146j10675B2084P8621
$$ y = [-187074, -328562, -123244, -111764, 89522, -271337, -138094, 72766, 330786, -82947, 22974, -247786, -15387, 22559, -130890, -35572, -106965, 165214, 309753, -153675, -58101, -91500, -25086, -368018, 6170, -166657, -113243, -108582, -279807, -32635, 280200, -109392, -373000, 157185, 51660, -2594, -101540, -125797, 80750, -231904, -491502, 71325, -239326, 88929, -16781, -204769, 87798, 312987, 218218, -169448, -19332, -64508, -322972, -374660, 99069, -153349, 408813, -26903, -8876, -14187, -97552, -227803, 148967, 363820, -667, 69828, -74297, -114443, -225118, 22084, 100705]
$$ [...]
##END NTUPLES=NMR SPECTRUM
##END=
