##TITLE=NES1100_IP_9887010_eJgVA0lbO1
##JCAMPDX= 6.0         $$ Bruker NMR JCAMP-DX V2.0
##DATA TYPE= NMR SPECTRUM
##DATA CLASS= NTUPLES
##ORIGIN= BRUKER
##OWNER= Administrator
$$ 1.72 TOPSPIN		Version 2.1
$$ 2016-08-28 15:11:39.633 -0500  Administrator@X
$$ Compression mode = diff/dup
##.OBSERVE FREQUENCY= 400.02188249412
##.OBSERVE NUCLEUS= ^1H
##.ACQUISITION MODE= SIMULTANEOUS (DQD)
##.ACQUISITION SCHEME= undefined
##.AVERAGES= 64
##.DIGITISER RES= 22
##SPECTROMETER/DATA SYSTEM= spect
##.PULSE SEQUENCE= noesygpps1d.comp
##.SOLVENT NAME= COFFEE_meoh
##.SHIFT REFERENCE= INTERNAL, COFFEE_meoh, 1, 14.96278
##AUDIT TRAIL= $$ (NUMBER, WHEN, WHO, WHERE, PROCESS, VERSION, WHAT)
$$ ##TITLE= Audit trail, TOPSPIN		Version 2.1
$$ ##JCAMPDX= 5.01
$$ ##ORIGIN= Bruker BioSpin GmbH
$$ ##OWNER= Administrator
$$ $$ E:\/data/COFFEE/nmr/NES1100_IP_9887010_eJgVA0lbO1/12/pdata/1/auditp.txt
$$ ##AUDIT TRAIL=  $$ (NUMBER, WHEN, WHO, WHERE, PROCESS, VERSION, WHAT)
(   1,<2016-08-28 15:11:33.976 -0500>,<Administrator>,<X>,<go>,<TOPSPIN 2.1>,
      <created by zg
	started at 2016-08-28 15:00:03.508 -0500,
	POWCHK enabled, PULCHK disabled,
       configuration hash MD5:
       21 0F 79 D6 B3 7B B4 F6 88 20 88 DB 03 48 BD 9F
       data hash MD5: 64K
       72 FC AC 92 8B 10 FB 09 0C 9D 9C 1A E3 16 57 6F>)
(   2,<2016-08-28 15:11:37.289 -0500>,<Administrator>,<X>,<proc1d>,<TOPSPIN 2.1>,
      <Start of raw data processing
       efp LB = 0.3 FT_mod = 6 PKNL = 1 PHC0 = 0 PHC1 = 0 SI = 128K 
       data hash MD5: 128K
       C9 72 56 90 5C BF 2D 51 98 70 74 B4 9C 70 7D 41>)
(   3,<2016-08-28 15:11:38.148 -0500>,<Administrator>,<X>,<proc1d>,<TOPSPIN 2.1>,
      <pk PHC0 = -87.18201 PHC1 = 0 
       data hash MD5: 128K
       82 0D AA 45 5C 56 02 90 6C 6A 65 1B 7A AC 1C 47>)
(   4,<2016-08-28 15:11:38.523 -0500>,<Administrator>,<X>,<proc1d>,<TOPSPIN 2.1>,
      <abs ABSG = 1 
       data hash MD5: 128K
       5D 75 FD 79 57 8C 2E 35 AD 88 EA 89 CB AD DC 78>)
(   5,<2016-08-28 15:11:38.617 -0500>,<Administrator>,<X>,<proc1d>,<TOPSPIN 2.1>,
      <abs ABSG = 2 
       data hash MD5: 128K
       93 5F 9B D4 9D 65 EB 87 4C A4 EB 92 76 F0 1E 19>)
(   6,<2016-08-28 15:11:38.914 -0500>,<Administrator>,<X>,<proc1d>,<TOPSPIN 2.1>,
      <abs ABSG = 3 
       data hash MD5: 128K
       57 4B DD B8 4E F6 3E 4A D3 CF ED 39 B6 D9 2A 26>)
(   7,<2016-08-28 15:11:39.117 -0500>,<Administrator>,<X>,<proc1d>,<TOPSPIN 2.1>,
      <abs ABSG = 4 
       data hash MD5: 128K
       EB 1B 26 99 78 C7 92 1A EC 50 DD EF D1 C8 07 97>)
(   8,<2016-08-28 15:11:39.211 -0500>,<Administrator>,<X>,<proc1d>,<TOPSPIN 2.1>,
      <abs ABSG = 5 
       data hash MD5: 128K
       2B 94 8B D1 ED C3 78 25 DA 18 CA C9 D3 CA 0F 7F>)
$$ ##END=
$$ 
$$ $$ hash MD5
$$ $$ A6 0C E1 5A F6 E0 C9 34 93 8D 0D E4 C0 71 33 15
##$RELAX= 
##$RELAX= 
##$RELAX= 
##$RELAX= 
##$RELAX= 
##$RELAX= 
##$RELAX= 
##$RELAX= 
$$ Bruker specific parameters
$$ --------------------------
##$DU= <E:\>
##$EXPNO= 12
$$ [...]
##$TP07= 0
##$TPNAME0= <>
##$TPNAME1= <>
##$TPNAME2= <>
##$TPNAME3= <>
##$TPNAME4= <>
##$TPNAME5= <>
##$TPNAME6= <>
##$TPNAME7= <>
##$TPOAL= (0..7)
0.5 0.5 0.5 0.5 0.5 0.5 0.5 0.5
##$TPOFFS= (0..7)
0 0 0 0 0 0 0 0
##$TUNHIN= 0
##$TUNHOUT= 0
##$TUNXOUT= 0
##$USERA1= <user>
##$USERA2= <user>
##$USERA3= <user>
##$USERA4= <user>
##$USERA5= <user>
##$V9= 5
##$VALIST= <valist>
##$VCLIST= <CCCCCCCCCCCCCCC>
##$VD= 0
##$VDLIST= <DDDDDDDDDDDDDDD>
##$VPLIST= <PPPPPPPPPPPPPPP>
##$VTLIST= <TTTTTTTTTTTTTTT>
##$WBST= 2048
##$WBSW= 25
##$XGAIN= (0..3)
0 0 0 0
##$XL= 0
##$YL= 0
##$YMAX_a= 6472006
##$YMIN_a= -13413440
##$ZGOPTNS= <>
##$ZL1= 120
##$ZL2= 120
##$ZL3= 120
##$ZL4= 120
##$ABSF1= 14.96278
##$ABSF2= -5.595402
##$ABSG= 5
##$ABSL= 3
##$ALPHA= 0
##$AQORDER= 0
##$ASSFAC= 0
##$ASSFACI= 0
##$ASSFACX= 0
##$ASSWID= 0
##$AUNMP= <proc_prof1d_extract.lims>
##$AXLEFT= 0
##$AXNAME= <>
##$AXNUC= <1H>
##$AXRIGHT= 0
##$AXTYPE= 0
##$AXUNIT= <>
##$AZFE= 0.1
##$AZFW= 0.1
##$BCFW= 0
##$BC_mod= 0
##$BYTORDP= 0
##$COROFFS= 0
##$CY= 15
##$DATMOD= 1
##$DC= 0
##$DFILT= <>
##$DTYPP= 0
##$F1P= 0
##$F2P= 0
##$FCOR= 0.5
##$FTSIZE= 131072
##$FT_mod= 6
##$GAMMA= 0
##$GB= 0
##$INTBC= 1
##$INTSCL= 1
##$ISEN= 128
##$LB= 0.3
##$LEV0= 0
##$LPBIN= 0
##$MAXI= 10000
##$MC2= 0
##$MEAN= 0
##$ME_mod= 0
##$MI= 0
##$NCOEF= 0
##$NC_proc= -2
##$NLEV= 6
##$NOISF1= 0
##$NOISF2= 0
##$NSP= 0
##$NTH_PI= 0
##$NZP= 0
##$OFFSET= 14.96278
##$PC= 1
##$PHC0= -87.18201
##$PHC1= 0
##$PH_mod= 1
##$PKNL= yes
##$PPARMOD= 0
##$PPDIAG= 0
##$PPIPTYP= 0
##$PPMPNUM= 2147483647
##$PPRESOL= 1
##$PSCAL= 4
##$PSIGN= 0
##$PYNMP= <proc.py>
##$REVERSE= no
##$SF= 400.020008924517
##$SI= 131072
##$SIGF1= 0
##$SIGF2= 0
##$SINO= 400
##$SIOLD= 131072
##$SPECTYP= <>
##$SREGLST= <1H.CDCl3>
##$SSB= 0
##$STSI= 131072
##$STSR= 0
##$SW_p= 8223.68421052631
##$SYMM= 0
##$S_DEV= 0
##$TDeff= 65536
##$TDoff= 0
##$TI= <>
##$TILT= no
##$TM1= 0
##$TM2= 0
##$TOPLEV= 0
##$USERP1= <user>
##$USERP2= <user>
##$USERP3= <user>
##$USERP4= <user>
##$USERP5= <user>
##$WDW= 1
##$XDIM= 131072
##$YMAX_p= 388061179
##$YMIN_p= -11529
##$CURPLOT= <Network HP LaserJet P1505>
##$CURPRIN= <$Network HP LaserJet P1505>
##$DFORMAT= <normdp>
##$LAYOUT= <+/1D_H.xwp>
##$LFORMAT= <normlp>
##$PFORMAT= <normpl>
##$SURQMSG= 1
$$ End of Bruker specific parameters
$$ ---------------------------------
##NTUPLES= NMR SPECTRUM
##VAR_NAME=  FREQUENCY,     SPECTRUM/REAL,   SPECTRUM/IMAG
##SYMBOL=    X,             R,               I
##VAR_TYPE=  INDEPENDENT,   DEPENDENT,       DEPENDENT
##VAR_FORM=  AFFN,          ASDF,            ASDF
##VAR_DIM=   131072,        131072,          131072
##UNITS=     HZ,            ARBITRARY UNITS, ARBITRARY UNITS
##FACTOR=    0.0627417313425164, 1,          1
##FIRST=     8223.62146879497, 2402,         -43410
##LAST=      0,             3579,            -42864
##MIN=       0,             -11529,          0
##MAX=       8223.62146879497, 388061179,    0
$$ Real data points
##PAGE= N=1
##DATA TABLE= (X++(R..R)), XYDATA
$$ [...]
61058D82627J590J692J457J388J716K310K980L665M302M692M671M416M450N047
$$ 482627 484217 485909 487366 488754 490470 492780 495760 499425 503727 508419 513090 517506 521956 527003
61044E27003N790O033N822N858O463P084P117O723O478O627P184Q348J0070J1556
$$ 527003 532793 538826 544648 550506 556969 564053 571170 577893 584371 590998 598182 606530 616600 628156
61030F28156J2010J1841J2265J3626J4949J5453J5623J6300J7389J8174J8521
$$ 628156 640166 652007 664272 677898 692847 708300 723923 740223 757612 775786 794307
61019G94307J8980J9929K1300K3126K5696K9054L2718L6026L8478L9787M0070
$$ 794307 813287 833216 854516 877642 903338 932392 965110 1001136 1039614 1079401 1119471
61008A119471M0088M0919M3259M7276N3079O0833P0205Q0170Q9762R8812J07868
$$ 1119471 1159559 1200478 1243737 1291013 1344092 1404925 1475130 1555300 1645062 1743874 1851742
60997A851742J17813J30121J47193J71867K06551K53169L13855L91302M88459
$$ 1851742 1969555 2099676 2246869 2418736 2625287 2878456 3192311 3583613 4072072
60988D072072O08373P54217R28787J134083J371904J641841J929434K185781K318936
$$ 4072072 4680445 5434662 6363449 7497532 8869436 10511277 12440711 14626492 16945428
60979A6945428K222994J843180J232783N48811k0466l43334l86703k02472J03373
$$ 16945428 19168422 21011602 22244385 22793196 22772730 22429396 22042693 21840221 21943594
60970B1943594L89853N03378L29257j44215q03670j462459j954037k200163k216040
$$ 21943594 22333447 22836825 23166082 23021867 22218197 20755738 18801701 16601538 14385498
60961A4385498k069352j835068j571440j315621j087086q92335p30029n95887
$$ 14385498 12316146 10481078 8909638 7594017 6506931 5614596 4884567 4288680
60953D288680m85658l95805l23288k65561k20552j86192j60035j39659j23395
$$ 4288680 3803022 3407217 3083929 2818368 2597816 2411624 2251589 2111930 1988535
60944A988535j10383r9935r1174q3357p6134o9323o2721n6431n1104m7452m5565
$$ 1988535 1878152 1778217 1687043 1603686 1527552 1458229 1395508 1339077 1287973 1240521 1194956
60933A194956m4916m4932m5275m5586m5307m3946m1425l8072l4361l0731k7571
$$ 1194956 1150040 1105108 1059833 1014247 968940 924994 883569 845497 811136 780405 752834
60922G52834k5203k3696k2629k1263j9173j6732j4743j3540j2695j1637j0328
$$ 752834 727631 703935 681306 660043 640870 624138 609395 595855 583160 571523 561195
60911E61195r165q447q105p854p409o655n696m751l961l427l257l394l463l193
$$ 561195 552030 543583 535478 527624 520215 513560 507864 503113 499152 495725 492468 489074 485611 482418
60897D82418k952l276l869l674k266n58L51M67M97P25J008J560K795M440N599
$$ 482418 479466 476190 472321 468647 466381 465823 466174 466641 467138 467863 468871 470431 473226 477666 483265
60882D83265N857N724N823O147O335O145N529M565L516K651J966J324P83M16o2
$$ 483265 489122 494846 500669 506816 513151 519296 524825 529390 532906 535557 537523 538847 539630 540046 539984
60867E39984r87k136k978l467l989m516m535m037l689l739l474k304p56K67P15
$$ 539984 538997 536861 533883 530416 526427 521911 517376 513339 509650 505911 502437 500133 499377 499644 500359
60852E00359J221K106L208M412N665O606O873O704O709O960O875O140N296N154
$$ 500359 501580 503686 506894 511306 516971 523577 530450 537154 543863 550823 557698 563838 569134 574288
60838E74288N911O985P646P691P560P760Q218Q374P952P267O624N883M939M224
$$ 574288 580199 587184 594830 602521 610081 617841 626059 634433 642385 649652 656276 662159 667098 671322
60824F71322M148M384M340M131M363N055N509N338M893M484L878K919J937J109
$$ 671322 675470 679854 684194 688325 692688 697743 703252 708590 713483 717967 721845 724764 726701 727810
60810G27810L2j554l083l892m231m923o237p742r050r972j0176r502q627q507
$$ 727810 727842 726288 723205 719313 715082 710159 703922 696180 687130 677158 666982 657480 648853 640346
60796F40346q919q547o842m912l908l427k409r41LL52J063K404L315K989K097
$$ 640346 631427 622880 616038 611126 607218 603791 601382 600441 600444 600796 601859 604263 607578 610567 612664
60781F12664J828K422L317M059M362L855K612J605J760K657L012K357J529J465
$$ 612664 614492 616914 620231 624290 628652 632507 635119 636724 638484 641141 644153 646510 648039 649504
60767F49504K182L132L863M165M070L944M153M545M658M470M463M839N293N650
$$ 649504 651686 654818 658681 662846 666916 670860 675013 679558 684216 688686 693149 697988 703281 708931
60753G08931O147O810P193P045O686O376N904N175M594M334L801K474Q65m6n0
$$ 708931 715078 721888 729081 736126 742812 749188 755092 760267 764861 769195 772996 775470 776335 776289 776239
60738G76239K50L46J57l02q70j017m70N4n20k169l731m491n044o176p650q629
$$ 776239 776489 776835 776992 776690 775820 774803 774333 774387 773867 771698 767967 763476 758432 752256 744606 735977
60722G35977q855q777q703q528q294q452r270j0243j0466r715q887r116j0469
$$ 735977 727122 718345 709642 701114 692820 684368 675098 664855 654389 644674 635787 626671 616202
60709F16202j1763j1849j0768r374q087o572m562k466q33M01J674L070M167M651
$$ 616202 604439 592590 581822 572448 564361 557789 553227 550761 549928 550329 552003 555073 559240 563891
60695E63891M758M944N292N435N018M143L270K713K356J784O90q89k635m217n590
$$ 563891 568649 573593 578885 584320 589338 593481 596751 599464 601820 603604 604294 603405 600770 596553 590963
60680E90963o934q291r382r926j0021r879r396q391p266o791p002o872n542l438
$$ 590963 584029 575738 566356 556430 546409 536530 527134 518743 511477 504686 497684 490812 485270 481832
60666D81832j730r89q90r09p00nJ139K145K456K379K670L296L296K165P49L06
$$ 481832 480102 479113 478223 477314 476614 476609 477748 479893 482349 484728 487398 490694 493990 496155 496904 497210
60650D97210J118K349L024K799K036J431J414J707J682J284J207J958L134L994
$$ 497210 498328 500677 503701 506500 508536 509967 511381 513088 514770 516054 517261 519219 522353 526347
60636E26347M449N000N953P083Q076Q826R289R440R408R425R533R621R745J0129
$$ 526347 530796 535796 541749 548832 556908 565734 575023 584463 593871 603296 612829 622450 632195 642324
60622F42324J0777J1326J1451J1199J0744J0037Q968P704O638N946N467N003M469
$$ 642324 653101 664427 675878 687077 697821 707858 716826 724530 731168 737114 742581 747584 752053
60609G52053L730K637J386N33K19l20j944m389o499p685q557r811j1183j2008
$$ 752053 755783 758420 759806 760339 760558 760238 758294 753905 747406 739721 731164 721353 710170 698162
60595F98162j2233j2194j1764j0520q657o905n557m217k634j140m4P24J212J254
$$ 698162 685929 673735 661971 651451 642794 635889 630332 626115 623481 622341 622297 623021 624233 625487
60581F25487J030J152J784K185J680O94K63P29J450J666J209M39j71l89m02n77
$$ 625487 626517 627669 629453 631638 633318 634012 634275 635004 636454 638120 639329 639768 639597 639208 638806 638229
60565F38229r39j127j049j217k068l308m326m911n118m760l651k231j211o15K05
$$ 638229 637290 636163 635114 633897 631829 628521 624195 619284 614166 609406 605755 603524 602313 601698 601903
60550F01903J597L296N149P424J0170J2870J5208J7705K1170K5763L1040L6489
$$ 601903 603500 606796 611945 619369 629539 642409 657617 675322 696492 722255 753295 789784
60538G89784M1566M5370M6852M5387M0928L3668K3909J2267k64j2455k2983l0667
$$ 789784 831350 876720 923572 968959 1009887 1043555 1067464 1079731 1079467 1067012 1044029 1013362
60526A013362l4972l6276l5351l2581k7958k1779j5008q747l587M60L686O362
$$ 1013362 978390 942114 906763 874182 846224 824445 809437 800690 797103 797563 801249 807611
60514H07611Q473R657R607Q663P693P322P548Q279R786J2340J5845K0294K6209
$$ 807611 816084 825741 835348 844011 851704 859026 866574 874853 884639 896979 912824 933118 959327
60501I59327L3950M2803N1615O0411P0587Q3065R7053J11149J25160J40063J56586
$$ 959327 993277 1036080 1087695 1148106 1218693 1301758 1398811 1509960 1635120 1775183 1931769
60490A931769J74695J94457K16513K41295K68024K94324L16141L27618L21878
$$ 1931769 2106464 2300921 2517434 2758729 3026753 3321077 3637218 3964836 4286714
60481D286714K93147K39125J62089O8315l3372j33215k21943k91964l38411l60030
$$ 4286714 4579861 4818986 4981075 5049390 5016018 4882803 4660860 4368896 4030485 3670455
60471C670455l59383l41850l13774k80831k47185k15364j86477j60802j38350
$$ 3670455 3311072 2969222 2655448 2374617 2127432 1912068 1725591 1564789 1426439
60462A426439j19004j02424q8145p5852o5321n6266m8599m2668l8674l5817l2709
$$ 1426439 1307435 1205011 1116866 1041014 975693 919427 870828 828160 789486 753669 720960
60451G20960k8865k5130k2339k0156j7817j5447j3769j2841j1904j0525r139q261
$$ 720960 692095 666965 644626 624470 606653 591206 577437 564596 552692 542167 533028 524767
60439E24767p749p136o271n372m629m085l752l679l942m629n703o890p753p840
$$ 524767 517018 509882 503611 498239 493610 489525 485773 482094 478152 473523 467820 460930 453177 445337
60425D45337o785m521j568J137L000M204N033N120L956K013N58K43N10P07J028
$$ 445337 438552 434031 432463 433600 436600 440804 445837 450957 454913 456926 457484 457727 458237 458944 459972
60410D59972J876K868L258L002K716K680K597K397K579L500M759N660N929N708
$$ 459972 461848 464716 467974 470976 473692 476372 478969 481366 483945 487445 492204 497864 503793 509501
60396E09501N173M559M297M683N447N992O008N598M837L711K504J840K035K675
$$ 509501 514674 519233 523530 528213 533660 539652 545660 551258 556095 559806 562310 564150 566185 568860
60382E68860L045K780J912N75j002k386l247l727m184m661m869m707m394m104
$$ 568860 571905 574685 576597 577172 576170 573784 570537 566810 562626 557965 553096 548389 543995 539891
60368E39891l775l291k632j792q78k16jJ36P19J670K440K888L362L829L749L102
$$ 539891 536116 532825 530193 528401 527523 527307 527306 527442 528161 529831 532271 535159 538521 542350 546099 549201
60352E49201K723L063L429L122K648K859L459L443K629J639N84r90k791l713l474
$$ 549201 551924 554987 558416 561538 564186 567045 570504 573947 576576 578215 578799 577809 575018 571305 567831
60337E67831l173l662m300m038k939j834j028j95P79J627K214K601K744K664K759
$$ 567831 564658 560996 556696 552658 549719 547885 546857 546662 547441 549068 551282 553883 556627 559291 562050
60322E62050L372M178M418L780K672J696J155R42O31j65j230j756j323o41q03
$$ 562050 565422 569600 574018 577798 580470 582166 583321 584263 584894 584729 583499 581743 580420 579779 578976
60307E78976j890k891k960k240j415r41r07j241j774k278k627k800k774k622k555
$$ 578976 577086 574195 571235 568995 567580 566639 565732 564491 562717 560439 557812 555012 552238 549616 547061
60292E47061k709k779k300j277k62K69L86M78Q15J464K402L514M570N243N256
$$ 547061 544352 541573 539273 537996 537734 538003 538389 538867 539682 541146 543548 547062 551632 556875 562131
60277E62131M608L767L381L625M005M099M164M683N513O069O173O160O193O158
$$ 562131 566739 570506 573887 577512 581517 585616 589780 594463 599976 606045 612218 618378 624571 630729
60263F30729O290P154Q758J0320J1259J1898J2768J3774J4546J5164J6063J7388
$$ 630729 637019 644173 652931 663251 674510 686408 699176 712950 727496 742660 758723 776111
60251G76111J9008K0897K3053K5264K7398K9747L2654L6050L9808M4296M9920
$$ 776111 795119 816016 839069 864333 891731 921478 954132 990182 1029990 1074286 1124206
60240A124206N6268O2382O7935P3485P9400Q5169R0010R3610R5952R6915R6370
$$ 1124206 1180474 1242856 1310791 1384276 1463676 1548845 1638855 1732465 1828417 1925332 2021702
60229B021702R4304R0524Q4531P6136O5980N5081M4032L2858K1476R973j381j2056
$$ 2021702 2116006 2206530 2291061 2367197 2433177 2488258 2532290 2565148 2586624 2596597 2595216 2583160
60217B583160k1361k8953l5110m0105m3382m3865m1223l6396l0671k4493j7419
$$ 2583160 2561799 2532846 2497736 2457631 2414249 2370384 2329161 2292765 2262094 2237601 2220182
60206B220182r038L92J0228K0065K9982M0222N0765O1262P1367Q0935Q9818R7468
$$ 2220182 2211144 2211536 2221764 2241829 2271811 2312033 2362798 2424060 2495427 2576362 2666180 2763648
60194B763648J02949J05369J04297R9763R2095Q1793O9476N5742M1041K5595R471
$$ 2763648 2866597 2971966 3076263 3176026 3268121 3349914 3419390 3475132 3516173 3541768 3551239
60183C551239p285k4325m0796n5511o7571p6831q3608q7935q9276q7094q1551
$$ 3551239 3543954 3519629 3478833 3423322 3355751 3278920 3195312 3107377 3018101 2931007 2849456
60172B849456p3443o3554n2302l9969k6931j3554j32J2908K5063L6272M6894N6747
$$ 2849456 2776013 2712459 2660157 2620188 2593257 2579703 2579571 2592479 2617542 2653814 2700708 2757455
60160B757455O4473O8561O8852O6364O1655N4320M4372L3073K1693J0188j934
$$ 2757455 2821928 2890489 2959341 3025705 3087360 3141680 3186052 3219125 3240818 3251006 3249072
60149C249072j3941k4272l2328l8785m3884m6586m5851m1907l5678k7567j7494
$$ 3249072 3235131 3210859 3178531 3139746 3095862 3049276 3003425 2961518 2925840 2898273 2880779
60138B880779n656P397K1267L5740N0645O6129Q2820J01076J20194J39012J57226
$$ 2880779 2875123 2882520 2903787 2939527 2990172 3056301 3139121 3240197 3360391 3499403 3656629
60127C656629J75561J94527K13570K31625K48107K62942K75852K85899K91827
$$ 3656629 3832190 4026717 4240287 4471912 4720019 4982961 5258813 5544712 5836539
60118E836539K92732K88439K79222K65210K46202K22085J93175J60076J23467
$$ 5836539 6129271 6417710 6696932 6962142 7208344 7430429 7623604 7783680 7907147
60109G907147Q4231M3486K160l9245q0098j19266j55637j88738k18101k42251
$$ 7907147 7991378 8034864 8037024 7997779 7917681 7798415 7642778 7454040 7235939 6993688
60099F993688k59153k67871k69095k63863k52483k35175k13065j87913j61162
$$ 6993688 6734535 6466664 6197569 5933706 5681223 5446048 5232983 5045070 4883908
60090D883908j33693j06210p9283n3081k7552k856K0655M2694O2911Q0581R4763
$$ 4883908 4750215 4644005 4564722 4511641 4484089 4481233 4501888 4544582 4607493 4688074 4782837
60079D782837J04736J10068J10357J05289R5014Q0215O1794M0732J8193m607k6792
$$ 4782837 4887573 4997641 5107998 5213287 5308301 5388516 5450310 5491042 5509235 5504628 5477836
60068E477836m8007o8105q6783j03556j17996j29937j39425j46499j50990j52592
$$ 5477836 5429829 5361724 5274941 5171385 5053389 4923452 4784027 4637528 4486538 4333946
60058D333946j51077j46352j38518j28129j16272j03945r1232p7469o2318m6264
$$ 4333946 4182869 4036517 3897999 3769870 3653598 3549653 3458421 3380952 3318634 3272370
60048C272370k9846j3070L992K0644L6249N1106O5829Q0044R2458J02118J08878
$$ 3272370 3242524 3229454 3233446 3254090 3290339 3341445 3407274 3487318 3579776 3681894 3790772
60037C790772J12569J12571J08429J00231Q8188P2492N3872L3673J2878q373k9938
$$ 3790772 3903341 4015912 4124341 4224572 4312760 4385252 4439124 4472797 4485675 4477302 4447364
60026D447364n0899p0185q7455j02636j14960j23218j26914j26535j22775j16141
$$ 4447364 4396465 4326280 4238825 4136189 4021229 3898011 3771097 3644562 3521787 3405646
60016C405646j07299r7105q6036p4018o1097m7869l4932k2244r328M086J7904
$$ 3405646 3298347 3201242 3115206 3041188 2980091 2932222 2897290 2875046 2865718 2869804 2887708
60005B887708L2012M6477O1422P6839R2595J08423J23725J37475J48389J55425
$$ 2887708 2919720 2966197 3027619 3104458 3197053 3305476 3429201 3566676 3715065 3870490
59995C870490J58091J56264J49781J38404J22204J01755P7901N1602K4075l244
$$ 3870490 4028581 4184845 4334626 4473030 4595234 4696989 4774890 4826492 4850567 4847323
59985D847323k9291n3845p7138r8919j18040j32852j41994j45057j42805j36605
$$ 4847323 4818032 4764187 4687049 4588130 4470090 4337238 4195244 4050187 3907382 3770777
59975C770777j27356j15101r9886q2723o5179m8157l1593j5316M47J5490K9926
$$ 3770777 3643421 3528320 3428434 3345711 3280532 3232375 3200782 3185466 3185913 3201403 3231329
59964C231329M3713N6355O7444P7118Q5548R2263R6439R7735R6393R2602Q6198
$$ 3231329 3275042 3331397 3398841 3475959 3561507 3653770 3750209 3847944 3944337 4036939 4123137
59953D123137P7143O6001N3779M1348K9044J6844M883o244j5846k3594k9280l2147
$$ 4123137 4200280 4266281 4320060 4361408 4390452 4407296 4412179 4405935 4390089 4366495 4337215 4305068
59941D305068l0974k5161j5271k186J3940L3435N6161Q1436J08767J37943J68447
$$ 4305068 4274094 4248933 4233662 4231476 4245416 4278851 4335012 4416448 4525215 4663158 4831605
59930D831605J99419K30354K61262K91668L19903L43662L61006L70462L70361
$$ 4831605 5031024 5261378 5522640 5814308 6134211 6477873 6838879 7209341 7579702
59921G579702L58556L32928K92256K36941J69244R2963J2627o7184j42181k08711
$$ 7579702 7938258 8271186 8563442 8800383 8969627 9062590 9075217 9008033 8865852 8657141
59911H657141k64039l06297l34335l48050l49002l40093l24110l02668k76739
$$ 8657141 8393102 8086805 7752470 7404420 7055418 6715325 6391215 6088547 5811808
59902E811808k47735k17479j87232j57281j27507r7927o8664l9875j1868J5016
$$ 5811808 5564073 5346594 5159362 5002081 4874574 4776647 4707983 4668108 4656240 4671256
59892D671256M0796O5828R0191J13284J34205J52223J66538J75762J78037J71928
$$ 4671256 4712052 4777880 4868071 4981355 5115560 5267783 5434321 5610083 5788120 5960048
59882E960048J57134J34208J03800O6471K3359k3189p0076j14527j54432j87724
$$ 5960048 6117182 6251390 6355190 6421661 6445020 6421831 6351755 6237228 6082796 5895072
59872E895072k12245k26989k33142k33101k28280k18584k04151j86836j69305
$$ 5895072 5682827 5455838 5222696 4989595 4761315 4542731 4338580 4151744 3982439
59863C982439j53086j38191j24481j12629j03478r6992r2203q7977q3525p8322
$$ 3982439 3829353 3691162 3566681 3454052 3350574 3253582 3161379 3073402 2989877 2911555
59853B911555p2058o4747n6675m7951l8316k7748j7120p879p55M725R057J1449
$$ 2911555 2839497 2774750 2718075 2670124 2631808 2604060 2586940 2579061 2578306 2583031 2592088 2603537
59841B603537J0325N139k913j2041k1095k9400l6109m0410m2146m1718l9615l6491
$$ 2603537 2613862 2619001 2616088 2604047 2582952 2553552 2517443 2477033 2434887 2393169 2353554 2317063
59829B317063l3458l1606l1051l0850k9869k7468k3443j7903j1392m716J549P257
$$ 2317063 2283605 2251999 2220948 2190098 2160229 2132761 2109318 2091415 2080023 2075307 2076856 2084113
59817B084113J2426J7141K1683K6375L1127L5507L9219M2090M3601M3005M0180
$$ 2084113 2096539 2113680 2135363 2161738 2192865 2228372 2267591 2309681 2353282 2396287 2436467
59806B436467L5761L0206K3280J4981O400q93o079r234j0539j0011p747l842J866
$$ 2436467 2472228 2502434 2525714 2540695 2547095 2546202 2540123 2530889 2520350 2510339 2502592 2498750 2500616
59793B500616R439J8338K7881L8185N0093O4263Q0837J00003J22089J46982J74166
$$ 2500616 2510055 2528393 2556274 2594459 2644552 2708815 2789652 2889655 3011744 3158726 3332892
59782C332892K03538K35355K68800L01009L27794L44748L47142L29655K87742
$$ 3332892 3536430 3771785 4040585 4341594 4669388 5014136 5361278 5690933 5978675
59773E978675K20296J31515L0673o9979j58521k26683k71299k93299k95789k83157
$$ 5978675 6198971 6330486 6361159 6291180 6132659 5905976 5634677 5341378 5045589 4762432
59763D762432k60667k33311k04443j75743j48270j22910j00024p9554o1533m5885
$$ 4762432 4501765 4268454 4064011 3888268 3739998 3617088 3517064 3437510 3375977 3330092
59753C330092l1834j8424n762N320J5080K5256L6957M9195O0433P0832Q1830R4072
$$ 3330092 3298258 3279834 3274072 3279392 3294472 3319728 3356685 3405880 3466313 3537145 3618975 3713047
59741C713047J07093J20781J35778J52229J69399J87038K06158K27849K52037
$$ 3713047 3820140 3940921 4076699 4228928 4398327 4585365 4791523 5019372 5271409
59732E271409K78075L05883L35694L67026L98611M29204M57778M82910N02428
$$ 5271409 5549484 5855367 6191061 6558087 6956698 7385902 7843680 8326590 8829018
59723H829018N13864N15100N04943M83632M52998M15999L76141L37321L03815
$$ 8829018 9342882 9857982 10362925 10846557 11299555 11715554 12091695 12429016 12732831
59714A2732831K79639K67556K68545K81909L05527L36229L70432M04564M34823
$$ 12732831 13012470 13280026 13548571 13830480 14136007 14472236 14842668 15247232 15682055
59705A5682055M56900M66634M61235M39706M02223L49680K84032K08704J28204
$$ 15682055 16138955 16605589 17066824 17506530 17908753 18258433 18542465 18751169 18879373
59696A8879373M7289k9605r8522j55994j99053k25465k34327k26563k04413j70136
$$ 18879373 18926662 18897057 18798535 18642541 18443488 18218023 17983696 17757133 17552720 17382584
59686A7382584j25130p0248o572O4396J41096K22116L06174L92176M79274N66392
$$ 17382584 17257454 17187206 17180634 17245030 17386126 17608242 17914416 18306592 18785866 19352258
59676A9352258O51257P29743P96236Q44726Q69503Q64810Q24464P43047O18541
$$ 19352258 20003515 20733258 21529494 22374220 23243723 24108533 24932997 25676044 26294585
59667B6294585M54121K57511L9362j87297m06998o03706p64534q82271r54944
$$ 26294585 26748706 27006217 27045579 26858282 26451284 25847578 25083044 24200773 23245829
59658B3245829r84251r74983r34809q73031p99252p23373o55936o06789n82505
$$ 23245829 22261578 21286595 20351786 19478755 18679503 17956130 17300194 16693405 16110900
59649A6110900n84774o10313o51252o96208p33273p53976p55191p38004p05750
$$ 16110900 15526126 14915813 14264561 13568353 12835080 12081104 11325913 10587909 9882159
59640I882159o63016o14778n64939n15508m67490m22017l80101l41862l06901
$$ 9882159 9219143 8604365 8039426 7523918 7056428 6634411 6254310 5912448 5605547
59631E605547k75232k47105k22014j98753j76667j56274j38279j22440j07782
$$ 5605547 5330315 5083210 4861196 4662443 4485776 4329502 4191223 4068783 3961001
59622C961001r3662q0296o8206n7408m7416l8076l0187k4925k2608k2404k3471
$$ 3961001 3867339 3787043 3718837 3661429 3614013 3575937 3545750 3520825 3498217 3475813 3452342
59611C452342k5915l0282l6463m3664n1205n8721o5624p1108p4813p6964p7669
$$ 3452342 3426427 3396145 3359682 3316018 3264813 3206092 3140468 3069360 2994547 2917583 2839914
59600B839914p6547p3437o8950o3968n8864n3544m7978m2300l6531l0579k4490
$$ 2839914 2763367 2689930 2620980 2557012 2498148 2444604 2396626 2354326 2317795 2287216 2262726
59589B262726j8448j2587p032k024K262N971R350J2355J4689J6296J7462J8400
$$ 2262726 2244278 2231691 2224659 2222635 2224897 2230868 2240218 2252573 2267262 2283558 2301020 2319420
59577B319420J8947J8884J8445J8259J8839K0211K2017K3926K5944K8482L2148
$$ 2319420 2338367 2357251 2375696 2393955 2412794 2433005 2455022 2478948 2504892 2533374 2565522
59566B565522L7266M3533N0222N6897O3912P1996Q1355R1465J01787J12396J23736
$$ 2565522 2602788 2646321 2696543 2753440 2817352 2889348 2970703 3062168 3163955 3276351 3400087
59555C400087J36028J49203J63111J77422J91482K04543K16073K25506K32035
$$ 3400087 3536115 3685318 3848429 4025851 4217333 4421876 4637949 4863455 5095490
59546E095490K35120K34990K31988K25631K15233K01270J84894J65741J41718
$$ 5095490 5330610 5565600 5797588 6023219 6238452 6439722 6624616 6790357 6932075
59537F932075J12069P9781M9492K3578J556j7094l1491m1054m6840m9949m9490
$$ 6932075 7044144 7123925 7173417 7196995 7198551 7181457 7149966 7108912 7062072 7012123 6962633
59526F962633m3300l0241j0950J3193M0849P0572J00687J29333J54053J71587
$$ 6962633 6919333 6889092 6878142 6891335 6932184 7002756 7103443 7232776 7386829 7558416
59516G558416J78941J74750J59142J32412R4828M7809n674o2463j20325j77282
$$ 7558416 7737357 7912107 8071249 8203661 8298489 8346298 8340624 8278161 8157836 7980554
59506G980554k30530k76809l13616l39515l53772l56565l49562l35449l16548
$$ 7980554 7750024 7473215 7159599 6820084 6466312 6109747 5760185 5424736 5108188
59497E108188k94155k69161k42743k16168j90332j65779j42887j21842j02541
$$ 5108188 4814033 4544872 4302129 4085961 3895629 3729850 3586963 3465121 3362580
59488C362580q4673o7858n1733l6182k1434p533O187K0652L5974N1416O6555Q1882
$$ 3362580 3277907 3210049 3158316 3122134 3100700 3093167 3099354 3120006 3155980 3207396 3273951 3355833
59476C355833R7952J14515J31036J47417J63500J78329J90759K00515K07679K11142
$$ 3355833 3453785 3568300 3699336 3846753 4010253 4188582 4379341 4579856 4787535 4998677
59466D998677K08668J98677J81192J56736J25383Q7560M5083M42m4489q8371j29290
$$ 4998677 5207345 5406022 5587214 5743950 5869333 5956893 6001976 6002418 5957929 5869558 5740268
59455E740268j64769j93096k14119k28580k37096k39952k37553k30728k20678
$$ 5740268 5575499 5382403 5168284 4939704 4702608 4462656 4225103 3994375 3773697
59446C773697k08648j95531j81779j67704j53700j40090j26965j14418j02717
$$ 3773697 3565049 3369518 3187739 3020035 2866335 2726245 2599280 2484862 2382145
59437B382145r1992q2000p2527o3841n6288m9545m2841l6003k9682k4347j9557
$$ 2382145 2290153 2208153 2135626 2071785 2015497 1965952 1923111 1887108 1857426 1833079 1813522
59426A813522j4613r557n041j382J735M659P350R801J2416J5575J8777K0625J9859
$$ 1813522 1798909 1789352 1784311 1782929 1784664 1789323 1796673 1806474 1818890 1834465 1853242 1873867 1893726
59413A893726J6325J0962N148L42k053j179K705Q530J5450K3235L1444L8749M3546
$$ 1893726 1910051 1921013 1926161 1926503 1924450 1923271 1925976 1934506 1949956 1973191 2004635 2043384 2086930
59400B086930M5124M3995M1471L9360L9592M3362N0373N9413O9640Q0979R3458
$$ 2086930 2132054 2176049 2217520 2256880 2296472 2339834 2390207 2449620 2519260 2600239 2693697
59389B693697J06897J21382J37418J55281J74721J95649K18711K44779K74018
$$ 2693697 2800594 2921976 3059394 3214675 3389396 3585045 3803756 4048535 4322553
59380D322553L05716L38797L72145M04481M34226M59507M78265M88528M88821
$$ 4322553 4628269 4967066 5339211 5743692 6177918 6637425 7115690 7604218 8093039
59371H093039M78470M57790M28233L92262L52751L12288K73090K37097K05505
$$ 8093039 8571509 9029299 9457532 9849794 10202545 10514833 10787923 11025020 11230525
59362A1230525J78153J53825J31191J09001Q5446N8303K6179j0847n2149r7396
$$ 11230525 11408678 11562503 11693694 11802695 11888141 11946444 11972623 11961776 11909627 11812231
59352A1812231j45840j95314k42795k85904l23371l54443l78664l96327m08484
$$ 11812231 11666391 11471077 11228282 10942378 10619007 10264564 9885900 9489573 9081089
59343I081089m16150m19722m19126m14225m05037l91840l75174l55633l33806
$$ 9081089 8664939 8245217 7826091 7411866 7006829 6614989 6239815 5884182 5550376
59334E550376l10504k86692k62904k39046k15163j92161j71143j52262j34808
$$ 5550376 5239872 4953180 4690276 4451230 4236067 4043906 3872763 3720501 3585693
59325C585693j18349j03122q9264p6411o4285n3141m3262l4364k5863j7391q932
$$ 3585693 3467344 3364222 3274958 3198547 3134262 3081121 3037859 3003495 2977632 2960241 2951309
59314B951309o55P165J4317K0930K7286L3264L8298M2095M5039M7638M9814N0967
$$ 2951309 2950654 2957819 2972136 2993066 3020352 3053616 3091914 3134009 3179048 3226686 3276500 3327467
59302C327467N0598M8578M5057M0293L4481K7667K0017J2321N807J217j713l479
$$ 3327467 3378065 3426643 3471700 3511993 3546474 3574141 3594158 3606479 3612286 3613503 3611790 3608311
59290C608311l849j999K441Q989J7017K6418L7446N0004O3303P6004Q6601R3873
$$ 3608311 3604462 3602463 3604904 3613893 3630910 3657328 3694774 3744778 3808081 3884085 3970686 4064559
59278D064559R7368R7666R6060R3648R0527Q5789P8335O7734N4285L8556K1051
$$ 4064559 4161927 4259593 4355653 4449301 4539828 4625617 4703952 4771686 4825971 4864527 4885578
59267D885578K335j6737l4987n1137o4135p3460p9102q1324q0553p7560p3282
$$ 4885578 4887913 4871176 4836189 4785052 4720917 4647457 4568355 4487031 4406478 4328918 4255636
59256D255636o8159o1980n4758m7515m1521l6961l3062k9607k7455k7215k8243
$$ 4255636 4187477 4125497 4070739 4023224 3981703 3944742 3911680 3882073 3854618 3827403 3799160
59245C799160k9460l0616l1955l3137l3346l2310l0411k7674k3361j6756p828
$$ 3799160 3769700 3739084 3707129 3673992 3640646 3608336 3577925 3550251 3526890 3510134 3502306
59234C502306L126J6049L1056M8133O7198Q8279J11443J36668J63964J93262K23945
$$ 3502306 3505432 3521481 3552537 3600670 3667868 3756147 3867590 4004258 4168222 4361484 4585429
59223D585429K54664K83797L09791L30751L43875L46093L35485L11851K75698
$$ 4585429 4840093 5123890 5433681 5764432 6108307 6454400 6789885 7101736 7377434
59214G377434K27173J66634R6151J9730n8266j34440k05864k68959l19942l56607
$$ 7377434 7604607 7771241 7867392 7887122 7828856 7694416 7488552 7219593 6899651 6543044
59204F543044l79023l88444l86199l73962l54290l29988l03003k74430k45448
$$ 6543044 6164021 5775577 5389378 5015416 4661126 4331138 4028135 3753705 3508257
59195C508257k17603j92139j69475j49453j31772j16206j02785r1750q2995p5643
$$ 3508257 3290654 3098515 2929040 2779587 2647815 2531609 2428824 2337074 2254079 2178436
59185B178436o8632o1771n5671n0536m5644m0307l4747k9562k4845k0409j6424
$$ 2178436 2109804 2048033 1992362 1941826 1896182 1855875 1821128 1791566 1766721 1746312 1729888
59174A729888j3088r944o297k319J014L312N389Q171J1563J4858J7786K0557K3191
$$ 1729888 1716800 1706856 1700559 1698240 1699254 1702566 1707955 1716126 1727689 1742547 1760333 1780890 1804081
59161A804081K5505K7744L0512L3949L7442M0489M3389M6741N0419N3592N5629
$$ 1804081 1829586 1857330 1887842 1921791 1959233 1999722 2043111 2089852 2140271 2193863 2249492
59150B249492N6652N7130N7297N7077N6293N4649N1643M6878M0521L3205K5405
$$ 2249492 2306144 2363274 2420571 2477648 2533941 2588590 2640233 2687111 2727632 2760837 2786242
59139B786242J7088Q179q16q940j5538k0654k4615k7538k9331k9926k9202k6963
$$ 2786242 2803330 2811509 2810693 2801753 2786215 2765561 2740946 2713408 2684077 2654151 2624949 2597986
59127B597986k3165j8127j2236n604J716R411J7249K5545L4726M4456N3781O2327
$$ 2597986 2574821 2556694 2544458 2538854 2540570 2549981 2567230 2592775 2627501 2671957 2725738 2788065
59115B788065P0676P9272Q7602R4943J01413J07613J13697J19541J25553J32486
$$ 2788065 2858741 2938013 3025615 3120558 3221971 3329584 3443281 3562822 3688375 3820861
59105C820861J40407J48608J56559J64183J71038J75860J77246J74217J65848
$$ 3820861 3961268 4109876 4266435 4430618 4601656 4777516 4954762 5128979 5294827
59096E294827J51008J28978J00038O5115K5294j7841o1747j03422j40460j71437
$$ 5294827 5445835 5574813 5674851 5739966 5765260 5747419 5685672 5582250 5441790 5270353
59086E270353j95624k12825k23465k28400k28524k24642k17660k08534j98058
$$ 5270353 5074729 4861904 4638439 4410039 4181515 3956873 3739213 3530679 3332621
59077C332621j86764j75040j63252j51780j40948j30742j20690j10432j00455
$$ 3332621 3145857 2970817 2807565 2655785 2514837 2384095 2263405 2152973 2052518
59068B052518r1802q4788p8498p1919o5207n9300n4610n0594m6501m2013l7308
$$ 2052518 1960716 1875928 1797430 1725511 1660304 1601004 1546394 1495800 1449299 1407286 1369978
59057A369978l2970k9711k7684k6108k4008k1249j8355j5564j2727j0225r067
$$ 1369978 1337008 1307297 1279613 1253505 1229497 1208248 1189893 1174329 1161602 1151377 1142310
59046A142310r644j0918j1356j0442q898p661p044o803o621o425o319o260n942
$$ 1142310 1132666 1121748 1110392 1099950 1091052 1083391 1076347 1069544 1062923 1056498 1050179 1043919 1037977
59033A037977n059l682k088l41J697L889N777P104Q103R063R945J0543J0850J1034
$$ 1037977 1032918 1029236 1027148 1026807 1028504 1032393 1038170 1045274 1053377 1062440 1072385 1082928 1093778 1104812
59019A104812J1279J1730J2421J3048J3034J1971R904P162M170J485l75j390k090
$$ 1104812 1116091 1127821 1140242 1153290 1166324 1178295 1188199 1195361 1199531 1201016 1200641 1199251 1197161
59006A197161k924l771m234m174l748l236k990l289l946m361m190l704l170k296
$$ 1197161 1194237 1190466 1186232 1182058 1178310 1175074 1172084 1168795 1164849 1160488 1156298 1152594 1149424 1147128
58992A147128p83R37K183L003L968N066N643N620N876O989Q260Q606Q017P461
$$ 1147128 1146345 1147282 1149465 1152468 1156436 1161502 1167145 1172765 1178641 1185630 1193890 1202496 1210513 1217974
58978A217974P552Q108Q812R682J0666J1442J1923J2505J3456J4430J5000J5408
$$ 1217974 1225526 1233634 1242446 1252128 1262794 1274236 1286159 1298664 1312120 1326550 1341550 1356958
58966A356958J6254J7622J9097K0591K2473K4691K6455K7243K7639K8424K9205
$$ 1356958 1373212 1390834 1409931 1430522 1452995 1477686 1504141 1531384 1559023 1587447 1616652
58955A616652K8821K7102K5337K4631K4609K4357K4017K4532K6034K7610K8815
$$ 1616652 1645473 1672575 1697912 1722543 1747152 1771509 1795526 1820058 1846092 1873702 1902517
58944A902517L0501L3517L7254M0328M2468M4938M8926N4179N9538O4319O8727
$$ 1902517 1933018 1966535 2003789 2044117 2086585 2131523 2180449 2234628 2294166 2358485 2427212
58933B427212P3233P8089Q3485Q9677R6865J05055J14266J24647J36341J49333
$$ 2427212 2500445 2578534 2662019 2751696 2848561 2953616 3067882 3192529 3328870 3478203
58923C478203J63474J78587J94535K11449K29941K50847K74533L00597L28417
$$ 3478203 3641677 3820264 4014799 4226248 4456189 4707036 4981569 5282166 5610583
58914E610583L57828L89083M22253M56849M91891N26076N57796N85079O05482
$$ 5610583 5968411 6357494 6779747 7236596 7728487 8254563 8812359 9397438 10002920
58905A0002920O16128O14119N97141N63514N11778M40857L51352K46559J31765
$$ 10002920 10619048 11233167 11830308 12393822 12905600 13346457 13697809 13944368 14076133
58896A4076133J2523j06128k19122l21139m07643m76179n26591n60176n78582
$$ 14076133 14088656 13982528 13763406 13442267 13034624 12558445 12031854 11471678 10893096
58887A0893096n83276n75848n58774n35448n08810m80017m48967m16140l83221
$$ 10893096 10309820 9733972 9175198 8639750 8130940 7650923 7201956 6785816 6402595
58878F402595l51783l22294k94737k69428k46548k25678k06542j89759j75892
$$ 6402595 6050812 5728518 5433781 5164353 4917805 4692127 4485585 4295826 4119934
58869D119934j64204j53294j42783j33249j24581j15657j05952r6365q7864q0192
$$ 4119934 3955730 3802436 3659653 3526404 3401823 3286166 3180214 3083849 2995985 2915793
58859B915793p2708o5688n9844n4956n0032m4750l9770l5529l1429k6687k1352
$$ 2915793 2843085 2777397 2717553 2662597 2612565 2567815 2528045 2492516 2461087 2434400 2413048
58848B413048j6053j1031n973o30M792R971J4830J9461K3848K7872L1553L5154
$$ 2413048 2396995 2385964 2379991 2379361 2384153 2394124 2408954 2428415 2452263 2480135 2511688 2546842
58836B546842L9069M3608M8859N4590O0393O6066P1913P8518Q6127R4450J03132
$$ 2546842 2585911 2629519 2678378 2732968 2793361 2859427 2931340 3009858 3095985 3190435 3293567
58825C293567J12252J22191J33179J45269J58621J73484J89901K07761K27218
$$ 3293567 3405819 3528010 3661189 3806458 3965079 4138563 4328464 4536225 4763443
58816D763443K48776K72795K99208L27848L58748L91840M26480M61497M95518
$$ 4763443 5012219 5285014 5584222 5912070 6270818 6662658 7089138 7550635 8046153
58807H046153N26968N53744N73274N83024N80758N64274N31176M79525M08940
$$ 8046153 8573121 9126865 9700139 10283163 10863921 11428195 11959371 12438896 12847836
58798A2847836L21156K19448J07738r515j26806k37853l37140m21326m88949n39140
$$ 12847836 13168992 13388440 13496178 13486663 13359857 13122004 12784864 12363538 11874589 11335449
58788A1335449n71326n86304n86673n75677n55844n29176m97915m64332m29847
$$ 11335449 10764123 10177819 9591146 9015469 8459625 7930449 7432534 6968202 6538355
58779F538355l95102l60920l28499k98635k71548k47834k28789k15129k05716
$$ 6538355 6143253 5782333 5453834 5155199 4883651 4635817 4407028 4191899 3986183
58770C986183j98164j90540j82052j72492j61860j50586j39385j28574j17932
$$ 3986183 3788019 3597479 3415427 3242935 3081075 2930489 2791104 2662530 2544598
58761B544598j07447r7737q9383q2156p5256o8078o0490n2654m5043l8424l3278
$$ 2544598 2437151 2339414 2250031 2167875 2092619 2024541 1964051 1911397 1866354 1827930 1794652
58750A794652k9196k5320k1410j8003j5359j2911j0160p697o633p145q279r352
$$ 1794652 1765456 1740136 1718726 1700723 1685364 1672453 1662293 1654596 1647963 1640818 1632539 1623187
58738A623187j0906j3841j8004k2200k5539k8187l0695l2954l4256l4139l2862
$$ 1623187 1612281 1598440 1580436 1558236 1532697 1504510 1473815 1440861 1406605 1372466 1339604
58727A339604l1049k9129k7204k5315k3650k2539k2266k2827k3821k4614k4678
$$ 1339604 1308555 1279426 1252222 1226907 1203257 1180718 1158452 1135625 1111804 1087190 1062512
58716A062512k3847k2300k0382j8452j6751j5311j3933j2413j0815r539r009r266
$$ 1062512 1038665 1016365 995983 977531 960780 945469 931536 919123 908308 898769 889760 880494
58704H80494r936j0614j1228j1944j2733j3240j3167j2631j2066j1846j2048j2486
$$ 880494 870558 859944 848716 836772 824039 810799 797632 785001 772935 761089 749041 736555
58692G36555j2744j2418j1432j0175r059q077o982n748m515l152j362P05K393
$$ 736555 723811 711393 699961 689786 680727 672650 665668 659920 655405 652253 650891 651596 653989
58679F53989L367M033M823N487N591N415N790P068Q804J0346J1385J1942J2411
$$ 653989 657356 661389 666212 671699 677290 682705 688495 695563 704367 714713 726098 738040 750451
58666G50451J3614J6209J9699K2435K2802K0163J4631O608k960j2315j9597k3940
$$ 750451 764065 780274 799973 822408 845210 865373 880004 886612 883652 871337 851740 827800
58654H27800k5626k5304k3437k0464j7027j3706j0670p715m708j931J25J385K479
$$ 827800 802174 776870 753433 732969 715942 702236 691566 683851 679143 677212 677337 678722 681201
58641F81201M164O455Q629J0144J1254J2573J4332J6314J8234J9919K1334K2735
$$ 681201 685365 691820 700449 710593 721847 734420 748752 765066 783300 803219 824553 847288
58629H47288K4535K6831K9279L1736L4652L8489M3069M7999N3459N9880O7108
$$ 847288 871823 898654 927933 959669 994321 1032810 1075879 1123878 1177337 1237217 1304325
58618A304325P4695Q2943R2839J04636J17278J29552J41201J52420J62870J71742
$$ 1304325 1379020 1461963 1554802 1659438 1776716 1906268 2047469 2199889 2362759 2534501
58608B534501J78227J81306J79359J70781J54970J32254J03091O8146K9205j0669
$$ 2534501 2712728 2894034 3073393 3244174 3399144 3531398 3634489 3702635 3731840 3721171
58598C721171m8324q1613j09343j30756j45522j53965j56884j55211j49976j42449
$$ 3721171 3672847 3591234 3481891 3351135 3205613 3051648 2894764 2739553 2589577 2447128
58588B447128j33887j25106j16364j07610r8809r0104q1768p4004o6769n9922
$$ 2447128 2313241 2188135 2071771 1964161 1865352 1775248 1693480 1619476 1552707 1492785
58578A492785n3510m7753m2639l7774l2868k8148k4061k0636j7417j4029j0550
$$ 1492785 1439275 1391522 1348883 1311109 1278241 1250093 1226032 1205396 1187979 1173950 1163400
58567A163400p314m512k145k92O70J99j973n478r502j3438j7114k0297k2246k2291
$$ 1163400 1156086 1151574 1149429 1149137 1149807 1150006 1148033 1142555 1133053 1119615 1102501 1082204 1059958 1037667
58553A037667k0767j8913j7660j6936j6327j5965j6289j7217j8035j8101j7323
$$ 1037667 1016900 997987 980327 963391 947064 931099 914810 897593 879558 861457 844134
58542H44134j6047j4714j3654j2782j1567r602p271n449m469l804k928k072j767
$$ 844134 828087 813373 799719 786937 775370 765768 758497 753048 748579 744775 741847 739775 738008
58529G38008k010k326k525k918l760m861n912o875p879q899r746j0352j0813j1168
$$ 738008 735998 733672 731147 728229 724469 719608 713696 706821 698942 690043 680297 669945 659132 647964
58515F47964j1197j0548r081p099n240m019l428k961k195j295q64j227k019k610
$$ 647964 636767 626219 617138 610039 604799 600780 597352 594391 592196 590901 590037 588810 586791 584181
58501E84181k747k546j990q80P20K336L651M858O156P268P818P955Q067Q089P592
$$ 584181 581434 578888 576898 576018 576738 579074 582725 587583 593739 601007 608825 616780 624847 632936 640528
58486F40528O480N067L487J651j36j255j668k142l168m181m341l642k731j988
$$ 640528 647008 652075 655562 657213 657077 655822 654154 652012 648844 644663 640322 636680 633949 631961
58472F31961j277m35N08J444K146K244J701J080R14R63M98p98k665m702o511p593
$$ 631961 630684 630249 630757 632201 634347 636591 638292 639372 640286 641249 641747 640949 638284 633582 627071 619478
58456F19478p783p687q060q795r095q658p986p472o956o347n947n773n248m063
$$ 619478 611695 604008 595948 587153 578058 569400 561414 553942 546986 540639 534692 528919 523671 519608
58442E19608k786k151k073j900j260k04J089K273K717K039O72n37j152j313j223
$$ 519608 516822 514671 512598 510698 509438 509234 510323 512596 515313 517352 518024 517487 516335 515022 513799
58427E13799r53n62J1J022K503L891M542M511M368M343M247M214M831O306P999
$$ 513799 512846 512284 512295 513317 515820 519711 524253 528764 533132 537475 541722 545936 550767 557073 565072
58412E65072R127R570R714R826R864R736R424Q962Q418P786O833N336L548K110
$$ 565072 574199 583769 593483 603309 613173 622909 632333 641295 649713 657499 664332 669668 673216 675326
58398F75326J227K99j295l232m482m437l463k384j776j780k167k404j985r10K50
$$ 675326 676553 676852 675557 672325 667843 663406 659943 657559 655783 654003 651836 649432 647447 646537 646787
58383F46787J022J524K172L002L634L825L768L706L511K885J832P38k6l81m05
$$ 646787 647809 649333 651505 654507 658141 661966 665734 669440 672951 675836 677668 678406 678380 677999 677594
58368F77594j35L65R06J337J727K221K737K951K675K086J543J317J510K076K802
$$ 677594 677459 677824 678730 680067 681794 684015 686752 689703 692378 694464 696007 697324 698834 700910 703712
58353G03712L336L415L036K446J970J853K053K192J935J559J788K881M150M779
$$ 703712 707048 710463 713499 715945 717915 719768 721821 724013 725948 727507 729295 732176 736326 741105
58339G41105M892N265O112O742O651O384O836Q085R328R873R783R580R632R884
$$ 741105 745997 751262 757374 764116 770767 777151 783987 792072 801400 811273 821056 830636 840268 850152
58325H50152J0007R835R583R614R940J0163J0035R795R770R945J0099J0125R954
$$ 850152 860159 869994 879577 889191 899131 909294 919329 929124 938894 948839 958938 969063 979017
58312I79017R490Q931Q835R424J0163J0436J0449J0880J1861J2858J3470J3728
$$ 979017 988507 997438 1006273 1015697 1025860 1036296 1046745 1057625 1069486 1082344 1095814 1109542
58300A109542J3732J3608J3747J4462J5396J5889J6005J6380J7092J7465J7239
$$ 1109542 1123274 1136882 1150629 1165091 1180487 1196376 1212381 1228761 1245853 1263318 1280557
58289A280557J7096J7703J8964K0566K2490K4566K6278K7586K9283L1927L5029
$$ 1280557 1297653 1315356 1334320 1354886 1377376 1401942 1428220 1455806 1485089 1517016 1552045
58278A552045L7857M0379M2812M4844M6142M7001M7561M6874M3808L8715L3231
$$ 1552045 1589902 1630281 1673093 1717937 1764079 1811080 1858641 1905515 1949323 1988038 2021269
58267B021269K8554K4847K2200K1110K1727K3380K5328K7482L0178L3559L7418
$$ 2021269 2049823 2074670 2096870 2117980 2139707 2163087 2188415 2215897 2246075 2279634 2317052
58256B317052M1377M5187M8895N2674N6350N9496O2163O5001O8293P1463P4082
$$ 2317052 2358429 2403616 2452511 2505185 2561535 2621031 2683194 2748195 2816488 2887951 2962033
58245B962033P6783Q0413Q4828Q9318R3884R9070J04781J10271J15276J20338
$$ 2962033 3038816 3119229 3204057 3293375 3387259 3486329 3591110 3701381 3816657 3936995
58235C936995J26041J32662J40472J49635J59816J70608J82185J94977K08918
$$ 3936995 4063036 4195698 4336170 4485805 4645621 4816229 4998414 5193391 5402309
58226E402309K23749K39778K57471K76709K97207L19276L43298L68949L96123
$$ 5402309 5626058 5865836 6123307 6400016 6697223 7016499 7359797 7728746 8124869
58217H124869M26101M60547M99809N43645N93157O50307P15853P89758Q73699
$$ 8124869 8550970 9011517 9511326 10054971 10648128 11298435 12014288 12804046 13677745
58208A3677745R71202J085092J216983J369925J549742J763245K017615K323296
$$ 13677745 14648947 15734039 16951022 18320947 19870689 21633934 23651549 25974845
58200B5974845K696787L160709L744591M488868N447379O683308Q262081J0247944
$$ 25974845 28671632 31832341 35576932 40065800 45513179 52196487 60458568 70706512
58192G0706512J2701782J5670259J9167513K3165168K7584640L2227671L6577904
$$ 70706512 83408294 99078553 118246066 141411234 168995874 201223545 237801449
58185B37801449L9554665L9516454L4807053K4733963J0347575n672398k0101986
$$ 237801449 277356114 316872568 351679621 376413584 386761159 381088761 360986775
58178C60986775l0531608l6118052l7413404l5658278l2129140k7821502k3397099
$$ 360986775 330455167 294337115 256923711 221265433 189136293 161314791 137917692
58171A37917692j9234219j5503826j2248480r440799p018371m926626l183586
$$ 137917692 118683473 103179647 90931167 81490368 74471997 69545371 66361785
58164F6361785j917896j313761j468725k265676l372751m387135n018841n184173
$$ 66361785 64443889 63130128 61661403 59395727 56022976 51635841 46617000 41432827
58156D1432827m967356m516693l964477l401258k880034k424790k039762j720181
$$ 41432827 36465471 31948778 27984301 24583043 21703009 19278219 17238457 15518276
58148A5518276j458679j245531j069329r20948p95617o90541o02703n29771m70700
$$ 15518276 14059597 12814066 11744737 10823789 10028172 9337631 8734928 8205157 7734457
58139G734457m23991l86788l56636l32611l13911k98542k84186k69324k53054
$$ 7734457 7310466 6923678 6567042 6234431 5920520 5621978 5337792 5068468 4815414
58130D815414k35041k16250j98487j82553j67583j52609j37894j24482j13442
$$ 4815414 4580373 4364123 4165636 3983083 3815500 3662891 3524997 3400515 3287073
58121C287073j05811j02125j01533j02106j02331j01561r9164r4523q8132q1520
$$ 3287073 3181262 3079137 2977604 2875498 2773167 2671606 2572442 2477919 2389787 2308267
58111B308267p5680p0468o5800o2128n9356n6490n3023m9647m6973m4559m1880
$$ 2308267 2232587 2162119 2096319 2034191 1974835 1918345 1865322 1815675 1768702 1724143 1682263
58100A682263l9248l6983l4576l1600k8697k6728k5493k4274k3167k2951k3863
$$ 1682263 1643015 1606032 1571456 1539856 1511159 1484431 1458938 1434664 1411497 1388546 1364683
58089A364683k5386k7028k8589k9708k9897k9136k7923k6713k5633k4773k4287
$$ 1364683 1339297 1312269 1283680 1253972 1224075 1194939 1167016 1140303 1114670 1089897 1065610
58078A065610k4100k3793k2950k1567k0017j8656j7473j6269j5125j4426j4153
$$ 1065610 1041510 1017717 994767 973200 953183 934527 917054 900785 885660 871234 857081
58067H57081j3512j1821r542p848p119o550n435m140l452l478l732l960m395n244
$$ 857081 843569 831748 822206 814358 807239 800689 795254 791114 787662 784184 780452 776492 772097 766853
58053G66853o307p098p288p002o688o545o280n645m992m761m604l647j800j21
$$ 766853 760546 753448 746160 739158 732470 725925 719645 714000 709008 704247 699643 695996 694196 694075
58039F94075M20N3k05L02J442K645L415L659L771M080M181L222J053j420l301
$$ 694075 694495 694548 694343 694645 696087 698732 702147 705806 709577 713657 717838 721060 722113 720693 717392
58024G17392m666o033p284p771p325o665o622p221p634p015n370l623k697k602
$$ 717392 712726 706693 699409 691638 684313 677648 671026 663805 656171 649156 643786 640163 637466 634864
58010F34864k643k350j864j389p69J94J321K261K832L031K937K754K736K862K767
$$ 634864 632221 629871 628007 626618 625849 626043 627364 629625 632457 635488 638425 641179 643915 646777 649544
57995F49544K078P21j054k797m038m713n193n682n711m866l750l418l871l997
$$ 649544 651622 652343 651289 648492 644454 639741 634548 628866 623155 618289 614539 611121 607250 603253
57981F03253l257k472k447k695k307j422r76j305j910k316k442k173j343j72P84
$$ 603253 599996 597524 595077 592382 590075 588653 587677 586372 584462 582146 579704 577531 576188 576016 576800
57966E76800J308J664K087K503K872L295L701L631K646P51j544l605n064o001
$$ 576800 578108 579772 581859 584362 587234 590529 594230 597861 600507 601258 599714 596109 591045 585044
57952E85044o628o817o180m701k988j684q69k80J93N15P54R22P88K31l47m07K0
$$ 585044 578416 571599 565419 560718 557730 556046 555177 554897 555090 555605 556359 557281 558069 558300 557953 557546 557566
57935E57566L54J77n27j702l370n329p103q420r493j0632j1681j2032j1309r912
$$ 557566 557920 558097 557570 555868 552498 547169 540066 531646 522153 511521 499840 487808 476499 466587
57921D66587q742q239p795o410l920j243O18J512J956K482L389M734O251P475
$$ 466587 457845 449606 441811 435401 431481 430238 430856 432368 434324 436806 440195 444929 451180 458655
57907D58655Q193Q586Q779Q654Q253P866P312N759K801o78l403n148o550p812
$$ 458655 466848 475434 484213 492867 501120 508986 516298 522057 524858 524180 520777 515629 509079 501267
57893E01267q482q559q798r642j0522j0636r916q865p823o758n544m095k417p03
$$ 501267 492785 484226 475428 465786 455264 444628 434712 425847 418024 411266 405722 401627 399210 398507
57879C98507P42J772K479L006L448L950M602N223N510N459N398N545N772N840
$$ 398507 399249 401021 403500 406506 409954 413904 418506 423729 429239 434698 440096 445641 451413 457253
57865D57253N640N155M484L876L447K872J678j12j938l324m208m673m738m530
$$ 457253 462893 468048 472532 476408 479855 482727 484405 484293 482355 479031 474823 470150 465412 460882
57851D60882m295m112l939l935m308m733m451l237j823j030q93r29r66j195j659
$$ 460882 456587 452475 448536 444601 440293 435560 431109 427872 426049 425019 424126 423197 422231 421036 419377
57836D19377k202k754l343l918m442n081n959o880p612q281r114r843r854r005
$$ 419377 417175 414421 411078 407160 402718 397637 391678 384798 377186 368905 359791 349948 340094 331089
57822C31089p896p183o876o526n885n130m549m143l641k753j465p8J078J925K638
$$ 331089 323193 316010 309134 302608 296723 291593 287044 282901 279260 276507 275042 274964 276042 277967 280605
57807B80605L459M599O203Q195J0146J1497J1997J1842J1330J0532R427Q198P171
$$ 280605 284064 288663 294866 303061 313207 324704 336701 348543 359873 370405 379832 388030 395201
57794C95201O486N991N530N165N022N036N009M833M537M069L191J598q61m034
$$ 395201 401687 407678 413208 418373 423395 428431 433440 438273 442810 446879 450070 451668 450807 446773
57780D46773p425j0393j2580j4122j5276j5814j5202j3391j1132r258p897o653
$$ 446773 439348 428955 416375 402253 386977 371163 355961 342570 331438 322180 314283 307630
57768C07630n337m153l312k794k459k110j488n24M99J296K016K958L947M449M370
$$ 307630 302293 298140 294828 292034 289575 287465 285977 285453 285952 287248 289264 292222 296169 300618 304988
57753C04988M263M578N114N471N672N983O313O273N692M816L986L364L015L070
$$ 304988 309251 313829 318943 324414 330086 336069 342382 348655 354347 359163 363149 366513 369528 372598
57739C72598L585M280M515L807K449J411J284J519J086n8p70j01J581L148L994
$$ 372598 376183 380463 384978 388785 391234 392645 393929 395448 396534 396476 395706 395605 397186 400334 404328
57724D04328M393M927N976P502Q899R282Q460P460P564Q783R904J0126J0022J0576
$$ 404328 408721 413648 419624 427126 436025 445307 453767 461227 468791 477574 487478 497604 507626 518202
57710E18202J1915J3400J4689J6033J7597J9113K0346K1557K3259K5722K8859
$$ 518202 530117 543517 558206 574239 591836 610949 631295 652852 676111 701833 730692
57699G30692L2408L6059L9587M3169M7511N3394O1031O9936P9527Q9575J00131
$$ 730692 763100 799159 838746 881915 929426 982820 1043851 1113787 1193314 1282889 1383020
57688A383020J11254J23050J35708J49148J62642J74914J84559J90229J90642
$$ 1383020 1494274 1617324 1753032 1902180 2064822 2239736 2424295 2614524 2805166
57679B805166J84827J72530J54180J30687J03557P5236M8939K7822J4342J0009
$$ 2805166 2989993 3162523 3316703 3447390 3550947 3626183 3675122 3702944 3717286 3727295
57669C727295J4837K6195L8023M1531K7710q833o6120j33765j96809k42598k65735
$$ 3727295 3742132 3768327 3806350 3847881 3875591 3866758 3800638 3666873 3470064 3227466 2961731
57658B961731k67815k53891k29718k00820j71803j45303j21895j01285q3341o8090
$$ 2961731 2693916 2440025 2210307 2009487 1837684 1692381 1570486 1469201 1385860 1317770
57648A317770n5350m4794l6028k8492k1589j5067q989l258K388P865J2763J7144
$$ 1317770 1262420 1217626 1181598 1153106 1131517 1116450 1107461 1104203 1106591 1114456 1127219 1144363
57636A144363K1813K7481L4096M1298M9096N7584O6451P5369Q4651R4863J05871
$$ 1144363 1166176 1193657 1227753 1269051 1318147 1375731 1442182 1517551 1602202 1697065 1802936
57625A802936J16848J27072J36268J44010J49331J50950J47514J37608J20213
$$ 1802936 1919784 2046856 2183124 2327134 2476465 2627415 2774929 2912537 3032750
57616C032750R5508O4990L0688n429m1251p4434j03027j26017j42946j53399j57353
$$ 3032750 3128258 3193248 3223936 3218507 3177256 3102822 2999795 2873778 2730832 2577433 2420080
57605B420080j55867j50712j43282j34182j23951j13597j04043r5341q6923p8582
$$ 2420080 2264213 2113501 1970219 1836037 1712086 1598489 1494446 1399105 1312182 1233600
57595A233600p0760o3818n7485n1384m5827m1526l8526l5954l3040k9910k7019
$$ 1233600 1162840 1099022 1041537 990153 944326 902800 864274 828320 795280 765370 738351
57584G38351k4285k1390j8691j6981j6324j5815j4745j3401j2333j1507j0633
$$ 738351 714066 692676 673985 657004 640680 624865 610120 596719 584386 572879 562246
57573E62246r878r526r297q606p391o048m681l090j454l04K98R30J862K648K946
$$ 562246 552368 542842 533545 524939 517548 511500 506819 503729 502275 501971 502269 503199 505061 507709 510655
57558E10655L240M168N553O646P149P496Q174R272J0650J2267J4187J6451J9029
$$ 510655 513895 518063 523616 530262 537411 544907 553081 562353 573003 585270 599457 615908 634937
57545F34937K1684K4072K6141K8381L1395L5277L9658M4338M9525N5359O1643
$$ 634937 656621 680693 706834 735215 766610 801887 841545 885883 935408 990767 1052410
57534A052410O8231P5454Q3735R2800J01629J09321J15726J20893J23988J23237
$$ 1052410 1120641 1196095 1279830 1372630 1474259 1583580 1699306 1820199 1944187 2067424
57524B067424J17130J05457Q8892O7912M2696J4190j5375m3357o7945q8306j03879
$$ 2067424 2184554 2290011 2378903 2446815 2489511 2503701 2488326 2444969 2377024 2288718 2184839
57513B184839j14078j18773j18752j15486j10401j04310r7386q9618q1225p2654
$$ 2184839 2070761 1951988 1833236 1717750 1607349 1503039 1405653 1316035 1234810 1162156
57503A162156o4247n6259m9067m3066l8209l3948k9789k5664k1653j7788j4325
$$ 1162156 1097909 1041650 992583 949517 911308 877360 847571 821907 800254 782466 768141
57492G68141j1730r923p920m860j125K178M769P451J0794J4317J7340K0016K3116
$$ 768141 756411 746488 738568 733708 732583 734761 739530 746981 757775 772092 789432 809448 832564
57479H32564K7077L1737L6744M1881M7117N2722N9252O7079P5965Q5250R4326
$$ 832564 859641 891378 928122 970003 1017120 1069842 1129094 1196173 1272138 1357388 1451714
57468A451714J02697J09695J14465J16307J14730J09087R8362Q1617N8844L1400
$$ 1451714 1554411 1664106 1778571 1894878 2009608 2118695 2217057 2298674 2357518 2388918
57458B388918J564k8315n6366q1043j00934j15045j23327j26646j26090j22427
$$ 2388918 2390482 2362167 2305801 2224758 2123824 2008779 1885452 1758806 1632716 1510289
57448A510289j16245j08355r9791r1391q3502p6095o9039o2243n5664m9358m3585
$$ 1510289 1394044 1285689 1185898 1094507 1011005 934910 865871 803628 747964 698606 655021
57437F55021l8709l4831l1608k8554k5512k2649k0096j7850j6014j4701j3604
$$ 655021 616312 581481 549873 521319 495807 473158 453062 435212 419198 404497 390893
57426C90893j2144j0367r125q935r073q460p165o300o482p170p555p389o751n655
$$ 390893 378749 368382 359257 350322 341249 332789 325624 319324 312842 305672 298117 290728 283977 278322
57412B78322m344l423l240l385l251k769k360k316k521k660k509k157k014k358
$$ 278322 273978 270555 267315 263930 260679 257910 255550 253234 250713 248053 245544 243387 241373 239015
57398B39015k834k757k033j337j213j370j250q16m57l08j88K3K61M38N34N53N65
$$ 239015 236181 233424 231391 230054 228841 227471 226221 225405 224948 224640 224452 224475 224736 225174 225708 226261 226826
57381B26826N68K73o11j730k174j545n35q3l28p40q93o92j67L93L87m80j643k205
$$ 226826 227394 227667 227056 225326 223152 221607 221072 220989 220661 219921 219028 218336 218169 218562 218949 218469 216826 214621
57363B14621j915j193m51K27P68J097J256J227P82n5o23k29R54K054K462K179
$$ 214621 212706 211513 211062 211289 212057 213154 214410 215637 216419 216364 215741 215512 216466 218520 220982 223161
57347B23161J464P19N03J030J698J712J126O55N90N74M00K95L68N09Q92J803K876
$$ 223161 224625 225344 225847 226877 228575 230287 231413 232068 232658 233232 233632 233927 234295 234804 235696 237499 240375
57330B40375L233K657J861J456J384J585K300L298L695L113K313K124K402K681
$$ 240375 243608 246265 248126 249582 250966 252551 254851 258149 261844 264957 267270 269394 271796 274477
57316B74477L108L912M593M604M402M861N909O694O955P289Q015Q678Q932R139
$$ 274477 277585 281497 286090 290694 295096 299957 305866 312560 319515 326804 334819 343497 352429 361568
57302C61568R772J0749J1663J2248J2443J2377J2507J3408J5159J7093J8415J8924
$$ 361568 371340 382089 393752 406000 418443 430820 443327 456735 471894 488987 507402 526326
57290E26326J9056J9370J9986K0429K0069J8849J7403J6174J4633J1767P238J684
$$ 526326 545382 564752 584738 605167 625236 644085 661488 677662 692295 704062 711300 712984
57278G12984m025r333j3842j7238j9612k1459k3028k3973k3929k3110k2044k0916
$$ 712984 708959 699626 685784 668546 648934 627475 604447 580474 556545 533435 511391 490475
57266D90475j9423j7334j4907j2753j1362j0648j0003q846p164n423m011l007
$$ 490475 471052 453718 438811 426058 414696 404048 394045 385199 378035 372612 368601 365594
57254C65594k414k273k359k107j213j54K73p9m39lJ173K318K842K844K696K477
$$ 365594 363180 360907 358548 356441 355228 355074 355347 355268 354829 354826 355999 358317 361159 364003 366699 369176
57238C69176K038J470J141J253J585J884K219K850L775M665N135N068M692M391
$$ 369176 371214 372684 373825 375078 376663 378547 380766 383616 387391 392056 397191 402259 406951 411342
57224D11342M298M126L606L048L092L765M311M175L850M186N263O383P092P588
$$ 411342 415640 419766 423372 426420 429512 433277 437588 441763 445613 449799 455062 461445 468537 476125
57210D76125Q128Q597Q757Q594Q271Q009Q064Q525R046R159Q930Q945R488J0118
$$ 476125 484253 492850 501607 510201 518472 526481 534545 543070 552116 561275 570205 579150 588638 598756
57196E98756J0232R831R394R213R129Q881Q537Q467Q942R739J0268J0165R682
$$ 598756 608988 618819 628213 637426 646555 655436 663973 672440 681382 691121 701389 711554 721236
57183G21236R375R504R969J0678J1710J3068J4582J5969J6873J6934J6247J5653
$$ 721236 730611 740115 750084 760762 772472 785540 800122 816091 832964 849898 866145 881798
57171H81798J6111J7659J9348K0324K0618K0796K1176K1698K2268K2981K3975
$$ 881798 897909 915568 934916 955240 975858 996654 1017830 1039528 1061796 1084777 1108752
57160A108752K5213K6346K6977K7142K7432K8347K9692L0933L1994L3207L4578
$$ 1108752 1133965 1160311 1187288 1214430 1241862 1270209 1299901 1330834 1362828 1396035 1430613
57149A430613L5663L6247L6652L7173L7735L8213L8688L9244L9934M1040M2770
$$ 1430613 1466276 1502523 1539175 1576348 1614083 1652296 1690984 1730228 1770162 1811202 1853972
57138A853972M4585M5528M5509M5595M6674M8494N0515N2966N6363O0403O4182
$$ 1853972 1898557 1944085 1989594 2035189 2081863 2130357 2180872 2233838 2290201 2350604 2414786
57127B414786O7276P0042P3087P6931Q1815Q7140R1325R2973R2284R1017R1274
$$ 2414786 2482062 2552104 2625191 2702122 2783937 2871077 2962402 3055375 3147659 3238676 3329950
57116C329950R4578J01702J12421J25506J39520J53825J68582J84105K00770K19384
$$ 3329950 3424528 3526230 3638651 3764157 3903677 4057502 4226084 4410189 4610959 4830343
57106D830343K41018K66547K96823L33223L77531M31529M97336N78182O78597
$$ 4830343 5071361 5337908 5634731 5967954 6345485 6777014 7274350 7852532 8531129
57097H531129Q04057R60931J156335J397170J688912K034838K434787K882808
$$ 8531129 9335186 10296117 11452452 12849622 14538534 16573372 19008159 21890967
57089B1890967L365533L863212M352535M809383N211743N542979N792902N955160
$$ 21890967 25256500 29119712 33472247 38281630 43493373 49036352 54829254 60784414
57081F0784414O023766N989525N830502N496033M902953L967246K663767J069182
$$ 60784414 66808180 72797705 78628207 84124240 89027193 92994439 95658206 96727388
57073I6727388o52002k310481l756650m908315n741674o268976o520716o535847
$$ 96727388 96075386 93764905 90008255 85099940 79358266 73089290 66568574 60032727
57065F0032727o357450o030917n601825n112270m597298m083710l590808l131424
$$ 60032727 53675277 47644360 42042535 36930265 32332967 28249257 24658449 21527025
57057B1527025k712844k338133k007557j719510j471085j258771j078820r27127
$$ 21527025 18814181 16476048 14468491 12748981 11277896 10019125 8940305 8013178
57049H013178p99281o91267o00114n23588m59437m05181l58628l18296k83322
$$ 8013178 7213897 6522630 5922516 5398928 4939491 4534310 4175682 3857386 3574064
57040C574064k53001k26517k03106j82361j64149j48191j33952j21110j09775
$$ 3574064 3321063 3094546 2891440 2709079 2544930 2396739 2262787 2141677 2031902
57031B031902j00033r1526q3901p7272p1777o6883o1774n6321n1018m6005m0801
$$ 2031902 1931869 1840343 1756442 1679170 1607393 1540510 1478736 1422415 1371397 1325392 1284591
57020A284591l5141k9367k3633j7320r575k0J1440K5033M0949N9027P8904R9666
$$ 1284591 1249450 1220083 1196450 1179130 1169555 1169535 1180975 1206008 1246957 1305984 1384888 1484554
57008A484554J18198J27707J19336Q7317L4186k8615q6083j27106j48488j53299
$$ 1484554 1602752 1730459 1849795 1937112 1971298 1942683 1856600 1729494 1581006 1427707
56998A427707j46652j33062j16250r9254q3846p0406n8831m9190m1338l4527k8025
$$ 1427707 1281055 1147993 1031743 932489 848643 778237 719406 670216 628878 594351 566326
56987E66326k1863j6488j1877p412k647K009N327N872K904k971j0052j6500k1115
$$ 566326 544463 527975 516098 508686 506039 508048 513375 519247 522151 519180 509128 492628 471513
56974D71513k3349k3138k0986j7829j4369j0691o730k952j97J160J716K708N155
$$ 471513 448164 425026 404040 386211 371842 361151 354421 351469 351272 352432 354148 356856 362011
56961C62011R076J3486J7330K0488K3595K6760K8783K7909K3159J4919M626n845
$$ 362011 371087 384573 401903 422391 445986 472746 501529 529438 552597 567516 572142 566297
56949E66297j4867k1603k5918k7773k7043k4062j9909j5736j2011q674n635k794
$$ 566297 551430 529827 503909 476136 449093 425031 405122 389386 377375 368701 363066 360272
56937C60272J68L550P331J1409J5893K0834K5892L0543L4265L5951L3612K5528
$$ 360272 360440 363990 371321 382730 398623 419457 445349 475892 510157 546108 579720 605248
56925F05248J2052m075j9216l0605l7103l9147l8151l5541l2079k8141k4247k0848
$$ 605248 617300 613225 594009 563404 526301 487154 449003 413462 381383 353242 328995 308147
56913C08147j7755j4533j1475r456q671q213p240n947m944m207l356k529k215
$$ 308147 290392 275859 264384 254928 246257 238044 230804 224857 219913 215706 212350 209821 207606
56900B07606k245j781n55M85K68r27j653q46J213L604N860Q049J0123J1930J3766
$$ 207606 205361 203580 203025 203510 203778 202851 201198 200352 201565 205169 211029 219078 229201 241131 254897
56885B54897J6189J8958K0617J9645J5775R920L193l487r069j2489j3361j2262
$$ 254897 271086 290044 310661 330306 346081 356001 359194 355707 346638 334149 320788 308526
56873C08526j0188p859n577l355j040J549M530Q002J2075J6667K1484K6440L1848
$$ 308526 298338 290479 284902 281547 280507 282056 286586 294588 306663 323330 344814 371254 403102
56860D03102L7880M3898M8496N0094M7139L8342K3649N261j2952k7520l6836m1031
$$ 403102 440982 484880 533376 583470 630609 668951 692600 697861 684909 657389 620553 579522
56848E79522m1110l8387l3958k8256k1330j3703o441r5N932J2568K0136K8599
$$ 579522 538412 500025 466067 437811 416481 402778 396337 396242 402174 414742 434878 463477
56836D63477L8254M9357O1243P2341Q0873Q4771Q1190O7366M3001J1738k0250
$$ 463477 501731 551088 612331 684672 765545 850316 931506 998872 1041873 1053611 1033361
56825A033361m7325o6331p6495p8579p4500o6883n7939m8514l8579k8509j9342
$$ 1033361 986036 919705 843210 764631 690131 623248 565309 516795 478216 449707 430365
56814D30365j1586m413L391J2077K1041K9984L9221M8652N6969O1970O1298N3075
$$ 430365 418779 414366 417757 429834 450875 480859 520080 568732 625701 687671 748969 802044
56802H02044L6776J4152j0821l3405m9896n8705o0547n7766n2822m6914m0090
$$ 802044 838820 852972 842151 808746 758850 700145 639598 581832 529010 482096 442006
56791D42006l2600k5462j9478j4311r079l481K146P545J2806J8047K3224K8040
$$ 442006 409406 383944 364466 350155 341076 337595 339741 347286 360092 378139 401363 429403
56779D29403L1583L2256K8541K0046P777o217j9318k9085l4486l6384l6337l4913
$$ 429403 460986 493242 521783 541829 549606 543389 524071 494986 460500 424116 387779 352866
56767C52866l1752k7109k2429j8981j6572j4152j1346q826p243o415n709m891
$$ 352866 321114 294005 271576 252595 236023 221871 210525 201699 194456 188041 182332 177441
56755A77441m237l914l550k656j285m3N78O11L53o0n99j117j453j651j803j797
$$ 177441 173204 169290 165740 163084 161799 161756 162334 162945 163298 163238 162639 161522 160069 158418 156615 154818
56739A54818j423p64k38k43q43j806k715l149k946k366j864j696j732j630j155
$$ 154818 153395 152631 152393 152150 151307 149501 146786 143637 140691 138325 136461 134765 133033 131403 130248
56724A30248m08J50M8o82j432j582j097m46r0j19l24m09k41M9K42L11L77L90K26
$$ 130248 129840 129990 130038 129356 127924 126342 125245 124799 124709 124590 124266 123857 123616 123665 123907 124218 124595 124985 125211
56705A25211J27N64J397J737J129L84M95J065P63o56j822j625p12m57j038j388
$$ 125211 125338 125902 127299 129036 130165 130549 131044 132109 132872 132216 130394 128769 128057 127600 126562 125174
56689A25174q37N1M44L33K70M24M50J66q8P1M87O60M01M9L5M56J109J784K298
$$ 125174 124337 124388 124832 125165 125435 125859 126309 126475 126387 126458 126945 127605 128006 128055 128090 128546 129655 131439 133737
56670A33737K422K009J132Q2q07j294j349j201j112j049p97m18m00j022j885k337
$$ 133737 136159 138168 139300 139382 138575 137281 135932 134731 133619 132570 131773 131355 130955 129933 128048 125711
56654A25711k187j711j095l34M10Q05P86O50O26O04M33J95N2J6k1j30k86m36n09
$$ 125711 123524 121813 120718 120384 120794 121599 122385 123035 123661 124265 124698 124893 124945 124961 124940 124810 124524 124088 123579
56635A23579n10m90m02j22K09J00o87j593j785j187n31k76l1O85J531J674Q22
$$ 123579 123069 122579 122177 122055 122264 122364 121677 120084 118299 117112 116581 116305 116274 116959 118490 120164 120986
56618A20986m73j448j813j780j668j533j077j1J389K248J905P57j4L21J314J987
$$ 120986 120513 119065 117252 115472 113804 112271 111194 111183 112572 114820 116725 117482 117468 117789 119103 121090
56602A21090J999J862J989K039J481N06j29q2K05K68J83K10K80K85M94J093J614
$$ 121090 123089 124951 126940 128979 130460 130966 130837 130755 130960 131228 131411 131621 131901 132186 132680 133773 135387
56585A35387J397O02P5J64K62j44o00k88P60J666J788J418J278J606K039K259
$$ 135387 136784 137386 137461 137625 137887 137743 137143 136855 137615 139281 141069 142487 143765 145371 147410 149669
56569A49669K507L208M276N143N553N876O430O916O977O948P433Q237Q475P809
$$ 149669 152176 155384 159660 164803 170356 176232 182662 189578 196555 203503 210936 219173 227648 235457
56555B35457O914O455O212N591M509L320K194J058L1o21r66j531k753m426n755
$$ 235457 242371 248826 255038 260629 265138 268458 270652 271710 271741 271120 270154 268623 265870 261444 255689
56540B55689o061n509n076n608o921q035q252p720o964o321n863n514n009m108
$$ 255689 249628 244119 239043 233435 226514 218479 210227 202507 195543 189222 183359 177845 172836 168728
56526A68728k972k097j737j720j900k274k558k181j143l02l42q56j009p21n55
$$ 168728 165756 163659 161922 160202 158302 156028 153470 151289 150146 149844 149502 148646 147637 146916 146361
56511A46361p03q47q89j068j280r84j17N29K68n24q76m30K65N58L69ql64n81m16
$$ 146361 145658 144811 143922 142854 141574 140590 140473 141002 141270 140746 139870 139440 139705 140263 140632 140624 140260 139679 139263
56492A39263K67J035J042mj269j573o50O58J423J505J314J246J466J958K472K669
$$ 139263 139530 140565 141607 141603 140334 138761 138111 138769 140192 141697 143011 144257 145723 147681 150153 152822
56476A52822K481K122J693J142P70J142K227L131L182K815K820L145L103K629
$$ 152822 155303 157425 159118 160260 161030 162172 164399 167530 170712 173527 176347 179492 182595 185224
56462A85224K441K960L722M033L662K775J676Q13N61Q02R93Q55N83K98k16j036
$$ 185224 187665 190625 194347 198380 202042 204817 206493 207306 207867 208669 209662 210517 211100 211398 211182 210146
56446B10146j722j831j512j244j199j217j262j505j942k259k223k049k179k694
$$ 210146 208424 206593 205081 203837 202638 201421 200159 198654 196712 194453 192230 190181 188002 185308
56432A85308l149l040k371j571r79o27n63r27j529j752j267n58l53p17j129j288
$$ 185308 182159 179119 176748 175177 174198 173571 173008 172081 170552 168800 167533 166975 166622 165905 164776 163488
56416A63488j267j019l79L89O69L09j49k72k84n38r02j014p84l19L02Q79J088
$$ 163488 162221 161202 160823 161212 161881 162190 162041 161769 161485 160947 160045 159031 158247 157928 158230 159109 160197
56399A60197R60J007J480J871J608R42N39M86K82j91m42j78K41M29M97O77Q09
$$ 160197 161157 162164 163644 165515 167123 168065 168604 169090 169372 169181 168739 168561 168802 169231 169728 170405 171214
56382A71214O35L70M88J068J647J766J460J121J094J365J540J204N02K50J121
$$ 171214 171849 172219 172707 173775 175422 177188 178648 179769 180863 182228 183768 184972 185474 185724 186845
56367A86845K628L343K445P59j52K23J023J356J347J518J789J753J550J714K188
$$ 186845 189473 192816 195261 196020 195868 196091 197114 198470 199817 201335 203124 204877 206427 208141 210329
56352B10329K290J771J261J304J546J362Q48O17Q57J186J329J419J582J689J630
$$ 210329 212619 214390 215651 216955 218501 219863 220711 221328 222185 223371 224700 226119 227701 229390 231020
56337B31020J474J336J404J978L110M190M422L875L502L890M540M770M821N332
$$ 231020 232494 233830 235234 237212 240322 244512 248934 252809 256311 260201 264741 269511 274332 279664
56323B79664O130O346N752N207N431O010O000N196M334M141M601N066M887L899
$$ 279664 285794 292140 297892 303099 308530 314540 320540 325736 330070 334211 338812 343878 348765 352664
56309C52664K494J258M41j18n72p36l70L94J082J324J166J007J287K052K874L356
$$ 352664 355158 356416 356857 356739 356167 355431 355061 355455 356537 357861 359027 360034 361321 363373 366247 369603
56293C69603L751M698O229P517P914P805Q016Q765R784J1053J2693J4320J5331
$$ 369603 373354 378052 384281 391798 399712 407517 415533 424298 434082 445135 457828 472148 487479
56280D87479J5831J6526J7708J9145K0992K3831K7471L0733L3073L5522L9332
$$ 487479 503310 519836 537544 556689 577681 601512 628983 659716 692789 728311 767643
56269G67643M4357M9637N4996O1129O8355P6408Q5311R5501J06905J18675J30087
$$ 767643 812000 861637 916633 977762 1046117 1122525 1207836 1303337 1410242 1528917 1659004
56258A659004J41087J51798J61948J71010J78423J83501J85491J83833J78109
$$ 1659004 1800091 1951889 2113837 2284847 2463270 2646771 2832262 3016095 3194204
56249C194204J67790J52549J32945J10312Q5835O0150L3908Q265j5491l6493n4301
$$ 3194204 3361994 3514543 3647488 3757800 3843635 3903785 3937693 3945958 3930467 3893974 3839673
56238C839673o8786q0197q9041r5724j00472j03733j06253j08595j10908j13282
$$ 3839673 3770887 3690690 3601649 3505925 3405453 3301720 3195467 3086872 2975964 2862682
56228B862682j15901j18598j20657j21419j20918j19651j17878j15431j12105
$$ 2862682 2746781 2628183 2507526 2386107 2265189 2145538 2027660 1912229 1800124
56219A800124j07979j03359r8434r3034q6849q0031p3309o7256o1574n5640m9570
$$ 1800124 1692145 1588786 1490352 1397318 1310469 1230438 1157129 1089873 1028299 972659 923089
56208I23089m4126l9547l5285l1142k7812k5768k4229k2062j9318j7049j5770
$$ 923089 878963 839416 804131 772989 745177 719409 695180 673118 653800 636751 620981
56197F20981j4888j3723j2395j1386j0722j0038r224q573q225p736o476m413k320
$$ 620981 606093 592370 579975 568589 557867 547829 538605 530032 521807 514071 507595 503182 500862
56184E00862r89m02J21J044K158L007L429L604L869M540N617O653P207P459P947
$$ 500862 499873 499471 499592 500636 502794 505801 509230 512834 516703 521243 526860 533513 540720 548179 556126
56169E56126Q640Q841Q227P416P176P438P585P352O892O362N864N666N951O527
$$ 556126 564766 573607 581834 589250 596426 603864 611449 618801 625693 632055 637919 643585 649536 656063
56155F56063P168Q116R799J2146J4702J7364K0631K4999L0579L7233M4905N3660
$$ 656063 663231 671347 681146 693292 707994 725358 745989 770988 801567 838800 883705 937365
56143I37365O3691P5202Q8110J01839J15448J27664J36647J40180J36817J26980
$$ 937365 1001056 1076258 1164368 1266207 1381655 1509319 1645966 1786146 1922963 2049943
56133B049943J12718R6524Q0647O7112N7386N1468M7536M2806L4995K3370R047
$$ 2049943 2162661 2259185 2339832 2406944 2464330 2515798 2563334 2606140 2641135 2664505 2673552
56122B673552n529j7792k6347l1569l5381m0484m9235o2494p9199r6978j13057
$$ 2673552 2668023 2650231 2623884 2592315 2556934 2516450 2467215 2404721 2325522 2228544 2115487
56111B115487j24767j30056j28324j20742j09318r5706q1133o6885n4134m3286
$$ 2115487 1990720 1860664 1732340 1611598 1502280 1406574 1325441 1258556 1204422 1161136
56101A161136l4139k6672k1186j7723j5898j5348j5781j6635j7254j7463j7455
$$ 1161136 1126997 1100325 1079139 1061416 1045518 1030170 1014389 997754 980500 963037 945582
56090I45582j7111j6028j4236j2265j0427q699p294o531o010m838l005j540r03
$$ 945582 928471 912443 898207 885942 875515 866816 859522 852991 846981 842143 839138 837598 836695
56077H36695j54J568L647M967N588O372P422Q074Q218Q475R069R527R688J0129
$$ 836695 836541 838109 841756 846723 852311 858683 866105 874179 882397 890872 899941 909468 919156 929285
56063I29285J1207J2464J3268J3487J3281J2815J2524J3027J4258J5240J5133
$$ 929285 940492 952956 966224 979711 992992 1005807 1018331 1031358 1045616 1060856 1075989
56052A075989J4280J3688J3804J4278J4709J5137J5810J6839J8096J9252J9965
$$ 1075989 1090269 1103957 1117761 1132039 1146748 1161885 1177695 1194534 1212630 1231882 1251847
56041A251847K0300K0796K1878K3334K4669K5774K6863K7913K8674K9227L0001
$$ 1251847 1272147 1292943 1314821 1338155 1362824 1388598 1415461 1443374 1472048 1501275 1531276
56030A531276L1070L1983L2510L3118L4325L5981L7623L9290M1381M3829M5908
$$ 1531276 1562346 1594329 1626839 1659957 1694282 1730263 1767886 1807176 1848557 1892386 1938294
56019A938294M7064M7637M8585N0604N3578N6681N9077O0631O1950O3604O5499
$$ 1938294 1985358 2032995 2081580 2132184 2185762 2242443 2301520 2362151 2424101 2487705 2553204
56008B553204O7219O8803P0805P3676P7418Q1858Q6816R1947R6827J01411J06133
$$ 2553204 2620423 2689226 2760031 2833707 2911125 2992983 3079799 3171746 3268573 3369984 3476117
55997C476117J11407J17257J23435J29736J36231J43405J51916J61856J72477
$$ 3476117 3587524 3704781 3828216 3957952 4094183 4237588 4389504 4551360 4723837
55988D723837J83204J94691K08163K23783K40537K57812K76132K96136L17848
$$ 4723837 4907041 5101732 5309895 5533678 5774215 6032027 6308159 6604295 6922143
55979F922143L41314L67027L95260M25981M59956M98952N44223N95807O54052
$$ 6922143 7263457 7630484 8025744 8451725 8911681 9410633 9954856 10550663 11204715
55970A1204715P20713P97788Q86586R89012J108533J248707J412293J603496J830072
$$ 11204715 11925428 12723216 13609802 14598814 15707347 16956054 18368347 19971843 21801915
55961B1801915K102038K430705K832019L330854L961752M768970N808622P147117
$$ 21801915 23903953 26334658 29166677 32497531 36459283 41228253 47036875 54183992
55953E4183992Q852238J0985715J3602683J6745340K0423864K4602099K9179979
$$ 54183992 63036230 74021945 87624628 104369968 124793832 149395931 178575910
55946A78575910L3890003L8050262M0338765L8963931L2439231K0613699N189378
$$ 178575910 212465913 250516175 290854940 329818871 362258102 382871801 388061179
55939C88061179j0795607k4255718l3266624l7488930l7771783l5428377l1678374
$$ 388061179 377265572 353009854 319743230 282254300 244482517 209054140 177375766
55932A77375766k7419815k3223678j9403679j6091956j3306741j1006205r123670
$$ 177375766 149955951 126732273 107328594 91236638 77929897 66923692 57800022
55925E7800022p587494o332436n304981m463088l772919l206127k738973k352296
$$ 57800022 50212528 43880092 38575111 34112023 30339104 27132977 24394004 22041708
55917B2041708k031203j764108j541462j354968j197678j064288r50775q53626
$$ 22041708 20010505 18246397 16704935 15349967 14152289 13088001 12137226 11283600
55909A1283600p69581o95965o30796n72573n20281m73530m32163l95571l62735
$$ 11283600 10514019 9818054 9187258 8614685 8094404 7620874 7188711 6793140 6430405
55900F430405l33108l06951k84464k64981k47412k31151k16194k02576j90206
$$ 6430405 6097297 5790346 5505882 5240901 4993489 4762338 4546144 4343568 4153362
55891D153362j79026j68877j59293j49905j40927j32773j25267j17763j10109
$$ 4153362 3974336 3805459 3646166 3496261 3355334 3222561 3097294 2979531 2869422
55882B869422j02875r6444r0440q4391p8509p3349o8898o4530n9804n4964n0635
$$ 2869422 2766547 2670103 2579663 2495272 2416763 2343414 2274516 2209986 2150182 2095218 2044583
55871B044583m7231m4755m2920m1295l9372l6724l3390l0256k8806l0191l4348
$$ 2044583 1997352 1952597 1909677 1868382 1829010 1792286 1758896 1728640 1699834 1669643 1635295
55860A635295m0074m5752n0004n1907n1204m8397m4396l9938l5415l1181k7601
$$ 1635295 1595221 1549469 1499465 1447558 1396354 1347957 1303561 1263623 1228208 1197027 1169426
55849A169426k4786k2597k1017k0180j9924j9618j8710j7206j5550j4230j3609
$$ 1169426 1144640 1122043 1101026 1080846 1060922 1041304 1022594 1005388 989838 975608 961999
55838I61999j3778j4384j4859j5018j5219j5764j6456j6947j7132j6913j5945
$$ 961999 948221 933837 918978 903960 888741 872977 856521 839574 822442 805529 789584
55827G89584j4120j2081j0752j0331j0178r790r467r815j0842j1777j1805j0870
$$ 789584 775464 763383 752631 742300 732122 722332 712865 703050 692208 680431 668626 657756
55815F57756r647q704p835o420m390k395r28L01J749L144L741L367K696K358K170
$$ 657756 648109 639405 631570 625150 620760 618365 617437 617738 619487 622631 626372 629739 632435 634793 636963
55800F36963J467n1k034l951n567o891p856q255q175q136q493q745p910n663k638
$$ 636963 638430 638379 636345 632394 626827 619936 612080 603825 595650 587514 579021 570276 562366 556703 554065
55785E54065N06L718O782Q416P029K297m444j1335j6995k0595k1784k0926j9016
$$ 554065 554571 558289 565071 573487 580516 582813 578369 567034 550039 529444 507660 486734 467718
55772D67718j6920j4860j2703j0508q655p614p637q497r509j0016r935r553q965
$$ 467718 450798 435938 423235 412727 404072 396458 388821 380324 370815 360799 350864 341311 332346
55759C32346q052o999o256n877n360m352l143k287k047k436l333m310m793m745
$$ 332346 324294 317295 311039 305162 299802 295450 292307 290020 287973 285537 282204 277894 273101 268356
55745B68356m841n563o451o727o326n804n415m894m105l270k547j791r63l08j6
$$ 268356 263515 257952 251501 244774 238448 232644 227229 222335 218230 214960 212413 210622 209659 209351 209335
55730B09335Q2K32M44N11K05o16j881l198m043m148l697l136k865k996l220l075
$$ 209335 209417 209649 210093 210604 210809 210193 208312 205114 201071 196923 193226 190090 187225 184229 181009 177934
55714A77934k446j738j329j107q05n55n70n14K04J453K377K542K441K624K876
$$ 177934 175488 173750 172421 171314 170509 169954 169384 168870 169074 170527 172904 175446 177887 180511 183387
55699A83387K697K107J467Q76K77j66k95l81p32j020o61K02O32lj290k286k395
$$ 183387 186084 188191 189658 190534 190811 190645 190350 189969 189237 188217 187556 187758 188390 188387 187097 184811 182416
55682A82416j693p25j16lK08J186K690L636L373K394J602J290J242J437K041K857
$$ 182416 180723 179998 179882 179879 180087 181273 183963 187599 190972 193366 194968 196258 197500 198937 200978 203835
55666B03835L366L372L215L261L512L836M225M682N093N340N373N088M383L424
$$ 203835 207201 210573 213788 217049 220561 224397 228622 233304 238397 243737 249110 254198 258581 262005
55652B62005K608K007J125m89k462l862m247m072l993m127m231m313m612n116
$$ 262005 264613 266620 267745 267256 264794 260932 256685 252613 248620 244493 240262 235949 231337 226221
55638B26221n499n611n720o064o473o579o243n629n003m676m903n575o118n996
$$ 226221 220722 215111 209391 203327 196854 190275 184032 178403 173400 168724 163821 158246 152128 146132
55624A46132n257m389l737l315l055k939k816k499k080j887j994k054j817j452
$$ 146132 140875 136486 132749 129434 126379 123440 120624 118125 116045 114158 112164 110110 108293 106841
55610A06841j231j147j067j034j126j183r24l07L85P67O00qn85o90m55m57r32
$$ 106841 105610 104463 103396 102362 101236 100053 99129 98822 99207 99974 100574 100566 99981 99291 98836 98379 97447
55593I7447j449j582j508j574j712j718j825k323k838k705j981j372j120p00Q0
$$ 97447 95998 94416 92908 91334 89622 87904 86079 83756 80918 78213 76232 74860 73740 73040 73120
55578G3120N27J1j023j587j355q55o22o96p96o53k10L04N20L26k3l13n32n72j89
$$ 73120 73647 73658 72635 71048 69693 68838 68216 67520 66724 66071 65861 66165 66685 67011 66988 66675 66143 65571 65382
55559F5382M24N59Jl34M54J809K269J478O61Q19J298Q19o43j781j629o20J05M4
$$ 65382 65806 66365 66366 66032 66486 68295 70564 72042 72703 73522 74820 75639 74996 73215 71586 70966 71071 71115
55541G1115l11k04N11J293J639J676J920K513L062L213L136L187L368L355L009
$$ 71115 70804 70600 71111 72404 74043 75719 77639 80152 83214 86427 89563 92750 96118 99473 102482
55526A02482K558K354K560L056L505L480K739J462K09m27k46L36N81J03q12j691
$$ 102482 105040 107394 109954 113010 116515 119995 122734 124196 124405 123978 123732 124068 124649 124752 123940 122249
55510A22249k521l552m543m821m300l882m351n302n665n093m155l352k715k338
$$ 122249 119728 116176 111633 106812 102512 98630 94279 88977 83312 78219 74064 70712 67997 65659
55496F5659k544l188l513l131k675k834l154k545q48P80J236O41r9m15m19l92
$$ 65659 63115 59927 56414 53283 50608 47774 44620 42075 41227 42007 43243 43884 43785 43370 42951 42559
55480D2559m53o71j113j634j843j435n27L86P99N09k45r08j023p10n70r50j367
$$ 42559 42106 41435 40322 38688 36845 35410 34883 35269 36068 36577 36332 35424 34401 33691 33121 32171 30804
55463C0804j004J73J235J366P93K63Qk94o26m74L06J073J197Q49N32K85j62o91
$$ 30804 29800 29973 31208 32574 33367 33630 33638 33344 32718 32244 32550 33623 34820 35669 36201 36486 36324 35633
55445C5633q93q18r68j475j807j508q29l22j33j4K22N39Q30R79Q52M75R7m3M1
$$ 35633 34740 33922 32954 31479 29672 28164 27335 27013 26880 26866 27088 27627 28457 29436 30288 30763 30860 30817 30858
55426C0858K17M28O13O30N02N07P95J061R24M84J66M6j98o55r16o02J24Q15J262
$$ 30858 31075 31503 32116 32746 33248 33755 34550 35611 36535 37019 37185 37231 37033 36378 35462 34860 34984 35799 37061
55407C7061J450J261N93k98q80r86j051j516k129k151j286j19O22Q94J060J023
$$ 37061 38511 39772 40365 40067 39187 38201 37150 35634 33505 31354 30068 29949 30571 31465 32525 33548
55391C3548L13r04j542r06L16Q99O57L75M30L24k76r07j092j052j150j183q37
$$ 33548 33861 32957 31415 30509 30825 31724 32381 32756 33186 33510 33234 32327 31235 30183 29033 27850 27013
55374B7013m13n71j410k334k663k053o23R26J602J091K31K6M19O83P36J165J970
$$ 27013 26600 26029 24619 22285 19622 17569 16946 17872 19474 20565 20796 20822 21241 21924 22660 23825 25795
55357B5795K231J427K97j36J89N79O23M37J52j91m48n23o24j010j518j721j501
$$ 25795 28026 29453 29750 29614 29803 30382 31005 31442 31594 31403 30955 30432 29808 28798 27280 25559 24058
55340B4058j113p53l67P7M20M66J55l65p26n61J01P87J111J197J319J417J264
$$ 24058 22945 22192 21825 21902 22322 22788 22943 22578 21852 21291 21392 22179 23290 24487 25806 27223 28487
55323B8487R44P33O28M04J06L1K09L22J27l21r07j549j988j933j496j108r87r64
$$ 28487 29431 30164 30792 31196 31302 31333 31542 31864 31991 31670 30763 29214 27226 25293 23797 22689 21702 20738
55305B0738r15q90p36k20L83L52m25j035o25M45J101R11M32L10N69Q03O92L05
$$ 20738 19823 18933 18197 17977 18360 18712 18287 17252 16627 17072 18173 19084 19516 19826 20395 21198 21890 22195
55287B2195N5K98Q29J044Q03P17J190J603J111J9n13j23K47k12j025j182n19K33
$$ 22195 22250 22548 23377 24421 25224 25941 27131 28734 29845 29864 29351 29228 29475 29263 28238 27056 26537 26770
55269B6770N21M65L94L82L42K67J96N8k35n86o88l57J04Q7n49j116q65JN05J88
$$ 26770 27291 27756 28150 28532 28874 29141 29337 29395 29160 28574 27886 27529 27633 27720 27171 26055 25190 25191 25696 25884
55249B5884l20j91N31J147J224Q69K79m60j109j286r43n27m27m26oQ93J622J547
$$ 25884 25564 25373 25904 27051 28275 29144 29423 28963 27854 26568 25625 25098 24671 24245 24239 25132 26754 28301
55231B8301Q00R9j48j92l53m64k20K25M61M80O21Q22O21nm04j97M8l49j102j321
$$ 28301 29101 29200 29052 28860 28507 28043 27823 28048 28509 28989 29610 30432 31053 31048 30644 30447 30495 30146 29044 27723
55211B7723p50o8J18k2J0L09N42M43Q7k38l23j59J10L29L81J89k25o00o18k31
$$ 27723 26973 26905 27023 27001 27011 27320 27862 28305 28392 28154 27831 27672 27782 28111 28492 28681 28456 27856 27238 27007
55191B7007L05P64J071J118P45J01l63m75n40p29o72q9N79O92K97r3l39o49q69
$$ 27007 27312 28076 29147 30265 31010 31111 30748 30273 29733 29004 28332 28243 28822 29514 29811 29718 29379 28730 27861
55172B7861n62J24M13k2n90o51l13MK57N65P13L41m82j303j742j691j183m23K47
$$ 27861 27299 27423 27836 27814 27224 26573 26260 26264 26521 27086 27799 28140 27658 26355 24613 22922 21739 21316 21563
55153B1563O39Q67J066J134R49O26L29J7l88p49r31j054j222j138m15P50J620
$$ 21563 22202 23069 24135 25269 26218 26844 27173 27190 26802 26053 25122 24068 22846 21708 21293 22043 23663
55136B3663J741J421J177R94M33n84j433j414n76L31P67R70J430K057K260J790
$$ 23663 25404 26825 28002 28996 29429 28845 27412 25998 25422 25753 26520 27490 28920 30977 33237 35027
55120C5027J042M56N0k89m54l80l75p73j360j482p92L30J151J284R93P89Q24P81
$$ 35027 36069 36525 36575 36286 35832 35452 35077 34304 32944 31462 30670 31000 32151 33435 34428 35217 36041 36822
55102C6822M83L46Q08J511J537O50l37n99k66M1J38K68M50M26J32j76k58l1N02
$$ 36822 37305 37651 38459 39970 41507 42157 41820 41221 40955 40996 41134 41402 41852 42278 42410 42234 41976 41945 42447
55083D2447J151J484J216O06J58J5k8p0J2K46M35L35j31p55j062o86J4K25k48
$$ 42447 43598 45082 46298 46904 47062 47077 47049 46979 46991 47237 47672 48007 47876 47121 46059 45373 45387 45612 45364
55064D5364n40N1R25R48R0o05n37j98j83l55l53j85j9J61K88R7m71j078j442j598
$$ 45364 44824 44875 45800 46748 46838 46233 45696 45498 45315 44960 44607 44422 44403 44564 44852 44949 44478 43400 41958 40360
55044D0360j549j105l23L48O56Q55J187J435J354J101Q96O16J05m26p05q40j076
$$ 40360 38811 37706 37383 37731 38387 39242 40429 41864 43218 44319 45215 45831 45936 45510 44805 43965 42889
55027D2889j321j242o67L23J490K344K364J592P58M46N08N53N76O93O72L49J16
$$ 42889 41568 40326 39659 39982 41472 43816 46180 47772 48530 48976 49484 50037 50613 51306 51978 52327 52443
55010E2443L50O29K15q20j628j703j289p15q0L41P3q46j669j754j230o39l13k91
$$ 52443 52793 53422 53637 52817 51189 49486 48197 47482 47402 47743 47816 46970 45301 43547 42317 41678 41365 41074
54992D1074m83o65n91l00n8J66P68J809K660K645J854J027O88P26O94L90P9K19
$$ 41074 40591 39926 39335 39035 38977 39143 39911 41720 44380 47025 48879 49906 50594 51320 52014 52404 52483 52702
54974E2702Q97J624J897J835J966K441K832K861K829L123L614L929M149M810O168
$$ 52702 53599 55223 57120 58955 60921 63362 66194 69055 71884 75007 78621 82550 86699 91509 97677
54959I7677P783Q964R629J0522J2428J5145J7485J8508J8458J8023J6958J4131
$$ 97677 105460 114424 124053 134575 147003 162148 179633 198141 216599 234622 251580 265711
54947B65711R076K771l328q471j2517j5317j6789j7251j7067j6217j4660j2904
$$ 265711 274787 277558 274230 265759 253242 237925 221136 203885 186818 170601 155941 143037
54935A43037j1576j0565r185p233n348m215l780l511l037k362j638r08k1J186
$$ 143037 131461 120896 111711 104478 99130 94915 91135 87624 84587 82225 80587 79679 79658 80844
54921H0844K586L724M258M401M668N322O272P503R170J1288J3571J5651J7222
$$ 80844 83430 87154 91412 95813 100481 105803 112075 119578 128748 140036 153607 169258 186480
54908A86480J7988J7668J6130J3341R305M280j059n975j0202j3838j6807j8757
$$ 186480 204468 222136 238266 251607 260912 265192 264133 258158 247956 234118 217311 198554
54896A98554j9447j8860j7003j4117j1059q875p797p121o259n370m753m142l152
$$ 198554 179107 160247 143244 129127 118068 109193 101396 94275 88016 82646 77893 73751 70599
54883G0599j942r94m33l5L09M98L93j51j155k117k120q94N62R87K79o64j275j688
$$ 70599 68657 67663 67230 67195 67504 68002 68395 68244 67089 64972 62852 61958 62520 63507 63786 63122 61847 60159
54865F0159j969j856j452j375j842k265k131j664j201n99J86N07j40j083j174
$$ 60159 58190 56334 54882 53507 51665 49400 47269 45605 44404 43805 43991 44498 44358 43275 42101
54850D2101m42j03q22j754j751q42M0M00N92R79J264R67J69m20k51M86J074J067
$$ 42101 41659 41556 40734 38980 37229 36387 36427 36827 37419 38398 39662 40629 40798 40378 40127 40613 41687 42754
54832D2754P45O60R24J136R65N37J49r3j82n1K52L89R0l83m33J76J067J764K177
$$ 42754 43499 44159 45083 46219 47184 47721 47870 47777 47595 47544 47796 48185 48275 47892 47459 47635 48702 50466 52643
54813E2643K453K688K965L424M003M336M293M486N714P869R894J1082J1914J3252
$$ 52643 55096 57784 60749 64173 68176 72512 76805 81291 87005 94874 104768 115850 127764 141016
54799A41016J5032J6386J6895J7012J7027J6219J3518Q803L104k398p157j1118
$$ 141016 156048 172434 189329 206341 223368 239587 253105 261908 265012 262614 255457 244339
54787B44339j4194j6163j6890j6427j4974j2879j0648q790p563o829o107m891
$$ 244339 230145 213982 197092 180665 165691 152812 142164 133374 125811 118982 112875 107984
54775A07984l171j619j002j300j636j277m56R0J64K40O53J263K054L446N645Q030
$$ 107984 104813 103194 102192 100892 99256 97979 97523 97613 97777 98017 98670 99933 101987 105433 111078 119108
54759A19108R731J0618J1311J2348J3726J5147J6135J5983J4136J0871P087L255
$$ 119108 128839 139457 150768 163116 176842 191989 208124 224107 238243 249114 256201 259456
54747B59456j006n969j0884j4474j6133j6295j5700j4759j3571j2252j1042j0103
$$ 259456 258450 252481 241597 227123 210990 194695 178995 164236 150665 138413 127371 117268
54735A17268r282q166o598n090m366m413m428l836k902k124j522j024r47j457
$$ 117268 107986 99820 93222 88132 83766 79353 74925 71089 68187 66063 64541 63517 62570 61113
54721F1113j937j732j178j064j219p39L99J009L93o41j016q43r07j308j449r95
$$ 61113 59176 57444 56266 55202 53983 53244 53643 54652 55045 54404 53388 52545 51638 50330 48881 47886
54705D7886j55P77J529J698J104K37j80o4L3k46o63q23n74j2O27J037J114J095
$$ 47886 47731 48508 50037 51735 52839 53076 52896 52832 52865 52619 51956 51133 50559 50547 51174 52211 53325 54420
54687E4420J182J248J178J264J719K055J544L22n99m94L58J241J729J731J263
$$ 54420 55602 56850 58028 59292 61011 63066 64610 64932 64333 63839 64197 65438 67167 68898 70161
54672G0161N92J79K48N66R02J339J945K461K595K454K316K183J818J167M21k21
$$ 70161 70753 70932 71180 71746 72648 73987 75932 78393 80988 83442 85758 87941 89759 90926 91347 91126
54656I1126o62p96n42l8L48K75k48q54j086q15l23RQ9O2lj45k67j26L11P47Q74
$$ 91126 90464 89668 89126 89088 89436 89711 89463 88609 87523 86708 86385 86394 86483 86545 86542 86397 86130 86004 86315 87062 87936
54635H7936O82L40N1J02P09J606J917R74q52k399k932k796k733k842k602j758
$$ 87936 88618 88958 89009 89111 89820 91426 93343 94317 93465 91066 88134 85338 82605 79763 77161 75403
54619G5403q25m29n37n99l12J67N90R15J145J308J611K194K688K446J467N26J44
$$ 75403 74578 74149 73612 73013 72701 72868 73458 74373 75518 76826 78437 80631 83319 85765 87232 87758 87902
54602H7902o4n78j114j139q45q68j277j626j838k247k783k912k453j776j087k59
$$ 87902 87838 87260 86146 85007 84162 83294 82017 80391 78553 76306 73523 70611 68158 66382 65295 65036
54586F5036M91N27l05j360k058k420k521k124j312q09j069j591j629j184p60n43
$$ 65036 65527 66054 65749 64389 62331 59911 57390 55266 53954 53145 52076 50485 48856 47672 46912 46369
54570D6369l27J5M33P83P39L2r06j114l60L71K34k77k41K53M67M56Q87J582J474
$$ 46369 46042 46057 46490 47273 48012 48044 47138 46024 45664 46035 46269 45992 45751 46004 46471 46927 47814 49396 50870
54551E0870K64r21j042m72k35n19o21j01N98P21N9q53j220p22K35R38R48K96o20
$$ 50870 51134 50213 49171 48699 48464 47945 47324 47223 47821 48542 48601 47748 46528 45806 46041 46979 47927 48223 47603
54532D7603j250j203o18l1K92N95J049J308J027M51P6m2o0J31O12R63P47L00K46
$$ 47603 46353 45150 44532 44501 44793 45388 46437 47745 48772 49223 49299 49257 49197 49328 49940 50903 51650 51950 52196
54513E2196M06J8r60j620j354o14j74k48n68p86n71J50R01J105R41J137J760J959
$$ 52196 52602 52620 51660 50040 48686 48072 47898 47650 47082 46296 45725 45875 46776 47881 48822 49959 51719 53678
54495E3678J192N5n39m26l9L28O13P21N82K99l2l63n06k79N7O4j41l6L57M37J50
$$ 53678 54870 54925 54386 53960 53921 54249 54862 55583 56165 56464 56432 56069 55563 55284 55341 55405 55264 55228 55585 56022 56172
54474E6172J87O44N86m24j290q83K49P33L60J0K2p8l73k91L04P87P39L93om52
$$ 56172 56359 57003 57589 57165 55875 54992 55241 55974 56334 56344 56366 56288 55915 55624 55928 56715 57454 57847 57841 57389
54454E7389o65k07O32R10L91J4N11J289J262L42n59p50m10j45k32m02j93M14P87
$$ 57389 56724 56517 57149 58059 58450 58464 58975 60264 61526 61868 61309 60559 60149 60004 59772 59370 59177 59591 60378
54435F0378L62m70p28j11O08O73J82l95r54j458j443n63N90R59L54k52K8Q67J162
$$ 60378 60740 60270 59542 59431 60039 60712 60894 60499 59545 58087 56644 56081 56671 57630 57984 57732 57760 58627 59789
54416E9789L40r77j586q63P10K109K699K570K110J592J222J217J643K311L014
$$ 59789 60129 59152 57566 56703 57413 59522 62221 64791 66901 68493 69715 70932 72575 74886 77900
54401G7900L654M064M016L539L032K779K649K463K335K335K101J263J02p16r83
$$ 77900 81554 85618 89634 93173 96205 98984 101633 104096 106431 108766 110867 112130 112232 111516 110533
54386A10533j094j378j780k198k638k916k708k155j884k165k431j988r90k76m13
$$ 110533 109439 108061 106281 104083 101445 98529 95821 93666 91782 89617 87186 85198 84208 83932 83519
54371H3519j182j914k083j674j217j268j692j705r13M8L40O6k1K93N26M84N67
$$ 83519 82337 80423 78340 76666 75449 74181 72489 70784 69871 69919 70259 70325 70304 70597 71123 71607 72174
54354G2174Q64P76J7o92m94M98J549K340K972L270K932K240J845J866J836J616
$$ 72174 73038 73814 73831 73139 72645 73143 74692 77032 80004 83274 86206 88446 90291 92157 93993 95609
54338I5609J662K172K619K440J687O39o60k145l351l765l358k494j567r57j001
$$ 95609 97271 99443 102062 104502 106189 106828 106168 104023 100672 96907 93549 91055 89488 88531 87530
54323H7530j645k327k539k393k356k613k905k862k303j399p11p54j359j728j458
$$ 87530 85885 83558 81019 78626 76270 73657 70752 67890 65587 64188 63477 62723 61364 59636 58178
54308E8178j041j090j395j273n39L20P72N61k84j318j716j067JN17L77K58M94
$$ 58178 57137 56047 54652 53379 52840 53160 53932 54493 54209 52891 51175 50108 50109 50626 51003 51261 51755
54291E1755O76M36p9o17j091j323j044m34l3OR5M80Q89J155J457J661J121l29
$$ 51755 52431 52867 52788 52171 51080 49757 48713 48279 48246 48252 48347 48827 49716 50871 52328 53989 55110 54781
54273E4781j699j896j076l16k14m19m12j13L18P48J076J229J231J074O68P1m11
$$ 54781 53082 51186 50110 49794 49580 49161 48749 48636 48954 49702 50778 52007 53238 54312 54980 55051 54640
54256E4640o31p76q69n36L23J013Q76L54L85R82J231P20J25N0K36K20J18K18M26
$$ 54640 54009 53233 52364 51828 52151 53164 54040 54394 54779 55761 56992 57712 57837 57887 58123 58343 58461 58679 59105
54237E9105N53O97Q30N62j37m88N9Q19O98k46r29q70o97r68j266r43l4R01J481
$$ 59105 59658 60355 61185 61747 61610 61122 61181 62000 62698 62452 61523 60653 59956 58988 57722 56779 56745 57646 59127
54218E9127J642J473J246J247J344J060L31k15r8K42m3j111k256k649j981n95
$$ 59127 60769 62242 63488 64735 66079 67139 67470 67255 67157 67399 67356 66245 63989 61340 59359 58764
54202E8764P02J116O04p4k65j37j71l45k92J7L46O76J030J019L31n33p82n52p06
$$ 58764 59466 60582 61186 61112 60847 60710 60539 60194 59902 59919 60265 60941 61971 62990 63321 62788 62006 61454 60748
54183F0748j312j390m30P49J202J084R78Q16K56m32o98o33p26r13o35K26J120
$$ 60748 59436 58046 57616 58365 59567 60651 61629 62445 62701 62269 61571 60938 60212 59299 58664 58890 60010
54166F0010J539J363O26n50j707k310k223j687r04j03K89L9m20n06k81j99k22
$$ 60010 61549 62912 63538 62988 61281 58971 56748 55061 54157 54054 54343 54382 53962 53456 53175 52976 52754
54149E2754L2L85K12m79q87o20k95n07r11p95p1P40J133R34L32n3L38J192J450
$$ 52754 52786 53171 53383 52904 52017 51397 51102 50595 49684 48889 48818 49558 50691 51625 51957 51904 52242 53434 54884
54130E4884O99j89k63J64J00o14j195j148q01n09j48L66O22K70l75o62m57k60
$$ 54884 55583 55394 55131 55295 55395 54781 53586 52438 51637 51128 50980 51346 51968 52238 51863 51201 50744 50484
54112E0484m80q86r22m31J29K79J34K46Q43J452J400O18k27l85K03Q91J082Q98
$$ 50484 50004 49118 48196 47765 47894 48173 48307 48553 49396 50848 52248 52866 52639 52254 52457 53348 54430 55328
54094E5328Q95J210J356J011N29L28K06k37q12j023q82q01p51l64J96L01m0n9
$$ 55328 56223 57433 58789 59800 60329 60657 60863 60626 59814 58791 57909 57108 56357 55993 56189 56490 56450 56391
54076E6391N38J040R16O91J063J827K300K179J438J0j688k533j878m92M56Q97
$$ 56391 56929 57969 58885 59576 60639 62466 64766 66945 68383 68393 66705 64172 62294 61802 62258 63155
54060F3155J485K139K137J485J054J308J774J908J721J368R47P88J236J933K106
$$ 63155 64640 66779 68916 70401 71455 72763 74537 76445 78166 79534 80481 81269 82505 84438 86544
54045H6544J680J413J686K026K114K424L352M409M893M900N083N701O446O965
$$ 86544 88224 89637 91323 93349 95463 97887 101239 105648 110541 115441 120524 126225 132671 139636
54031A39636P198P387P888Q770R434R150Q049P115O921O964O558N773N014M300
$$ 139636 146834 154221 162109 170879 180313 189463 197512 204627 211548 218512 225070 230843 235857 240157
54017B40157L523K921K607K006N35j398k806l416l861m618n427n876n957n897
$$ 240157 243680 246601 249208 251214 251749 250351 247545 244129 240268 235650 230223 224347 218390 212493
54003B12493n826n812n855n732n199m436l951l939m049l873l417k891k353j756
$$ 212493 206667 200855 195000 189268 184069 179633 175682 171743 167694 163821 160404 157513 155160 153404
53989A53404j250j148j569k256k737k728k347j945j749j680j533j173n77J28O38
$$ 153404 152154 151006 149437 147181 144444 141716 139369 137424 135675 133995 132462 131289 130712 130840 131478
53974A31478O53J86m11p91p83l35L78P99M60l11o53l59j75n58q82m66K21K76j98
$$ 131478 132131 132317 131906 131115 130332 129997 130375 131174 131634 131323 130670 130311 130136 129578 128696 128230 128451 128727 128529
53955A28529m00l11o71j451j559m77Q51J375J347J634K323K834L045L387L983
$$ 128529 128129 127818 127147 125696 124137 123660 124511 125886 127233 128867 131190 134024 137069 140456 144439
53940A44439M414M510M678N309O185O768O865O817P033P393P269O224M584L065
$$ 144439 148853 153363 158041 163350 169535 176303 183168 189985 197018 204411 211680 217904 222488 225553
53926B25553J917Q97j7m28k50PM0L22J306K582L477M064M850N684N976N913O487
$$ 225553 227470 228367 228350 227922 227672 227679 227719 228041 229347 231929 235406 239470 244320 250004 255980 261893 268380
53909B68380Q011R453R734R077Q468Q269P968P074N647L927K039J78j261k041
$$ 268380 276391 285844 295578 304655 313123 321392 329360 336434 342081 346008 348047 348225 346964 344923
53895C44923k375k671l025l183l085l237m228n895p325p891q028q593r695j0595
$$ 344923 342548 339877 336852 333669 330584 327347 323119 317224 309899 302008 293980 285387 275692 265097
53881B65097j0685j0108r276q334p276o204n216m253l350k821k968l732m737n542
$$ 265097 254412 244304 235028 226694 219418 213214 207998 203745 200395 197574 194606 190874 186137 180595
53867A80595n796n392m601l864l379l075k998l288l723l784l405l147l314l399
$$ 180595 174799 169407 164806 160942 157563 154488 151490 148202 144479 140695 137290 134143 130829 127430
53853A27430k884k101j740j837j931j991k421l185l633l336k566j757r42O1J195
$$ 127430 124546 122445 120705 118868 116937 114946 112525 109340 105707 102371 99805 98048 97106 97167 98362
53838I8362K072K158J155n32j820j841q58J14M63L73J85J1OM02R66J027L27n48
$$ 98362 100434 102592 103747 103215 101395 99554 98696 98810 99273 99646 99831 99842 99848 100250 101216 102243 102570 102022
53820A02022q69n86j81l9j61k02L25J495K571K626J786J240J728K653L126L247
$$ 102022 101153 100567 100386 100347 100186 99984 100309 101804 104375 107001 108787 110027 111755 114408 117534 120781
53804A20781L609M089M010L406L217M023N315O200O440O461O617O769O559N906
$$ 120781 124390 128479 132489 135895 139112 143135 148450 154650 161090 167551 174168 180937 187496 193402
53790A93402N192M831M742M474L795K954K199J480Q04N17Q49J394J450O86p34
$$ 193402 198594 203425 208167 212641 216436 219390 221589 223069 223873 224390 225239 226633 228083 228769 228035
53775B28035k430l922m734m816m674m767n010n109n106n102m884m309l827l953
$$ 228035 225605 221683 216949 212133 207459 202692 197682 192573 187467 182365 177481 173172 169345 165392
53761A65392m383m369l739k964k263j441o17l65q73j577j866j715j443j237j153
$$ 165392 161009 156640 152901 149937 147674 146233 145616 145251 144378 142801 140935 139220 137777 136540 135387
53746A35387j119r10m34q8l60j033j415j358j488k168k923l148k812k155j279
$$ 135387 134268 133358 132924 132836 132476 131443 130028 128670 127182 125014 122091 118943 116131 113976 112697
53731A12697m49k02o89j321j538j534j792k211k278j803j095n43l44m40m45M4
$$ 112697 112248 112046 111357 110036 108498 106964 105172 102961 100683 98880 97785 97242 96898 96458 96013 96057
53715I6057Q00J083P08M79J026J741J597O59p1j38o0k03j62M76J457K386L389
$$ 96057 96857 97940 98648 99127 100153 101894 103491 104150 104079 103941 103881 103678 103516 103992 105449 107835 111224
53698A11224M707N920O174N125L316J558K61n84j008r03k80O01J450K200K836
$$ 111224 115931 121851 128025 133150 136466 138024 138285 137701 136693 135790 135510 136111 137561 139761 142597
53683A42597L081K596J547O15K84L31K68K3r9L6J59o9o63j204j137m14J86k55
$$ 142597 145678 148274 149821 150436 150720 151051 151319 151342 151243 151279 151438 151369 150706 149502 148365 147951 148137 147882
53665A47882j649k830k896k171j504j085n26J57M76K84N0J78N25P39O36J64n60
$$ 147882 146233 143403 140507 138336 136832 135747 135221 135378 135854 136138 136188 136366 136891 137630 138266 138430 137870
53648A37870j076q28J88J311J907J912J607J156O08N4l72n36l65N9L98L89K37
$$ 137870 136794 135966 136154 137465 139372 141284 142891 144047 144655 144709 144337 143801 143436 143495 143893 144282 144519
53631A44519L71P84J040J013J117J502J586Q54j81m64K44J075J222Q97Q35J246
$$ 144519 144890 145674 146714 147727 148844 150346 151932 152786 152605 152141 152385 153460 154682 155579 156414 157660
53615A57660J651J620J283J088J327J955K670L112L140K999L068L374L499L123
$$ 157660 159311 160931 162214 163302 164629 166584 169254 172366 175506 178505 181573 184947 188446 191569
53601A91569K437J887J619J481J441J669K225K845L182L093K758K613L008L645
$$ 191569 194006 195893 197512 198993 200434 202103 204328 207173 210355 213448 216206 218819 221827 225472
53587B25472L682K738J646J549K422L147L057K567K100J385L17l43L0P78P92J00
$$ 225472 229154 231892 233538 235087 237509 240656 243713 246280 248380 249765 250082 249739 249769 250547 251339 251439
53571B51439k14M01J384J965J944J466P48J19k14m65q45r50k13J013J631J197
$$ 251439 251225 251626 253010 254975 256919 258385 259133 259252 259038 258573 257728 256778 256565 257578 259209 260406
53555B60406M13Nj18k21QQ82J907K240J751J045N54J36m00q15o80O9J003J576
$$ 260406 260819 260824 260706 260485 260493 261375 263282 265522 267273 268318 268872 269008 268608 267793 267113 267182 268185 269761
53537B69761J664J624J772J922J638Q61K4m11k67M03J352K106K387K517L013L733
$$ 269761 271425 273049 274821 276743 278381 279242 279266 278855 278588 278991 280343 282449 284836 287353 290366 294099
53521B94099L978L539L108L323L968M468M783N246N864O358O742P288P918Q129
$$ 294099 298077 301616 304724 308047 312015 316483 321266 326512 332376 338734 345476 352764 360682 368811
53507C68811P747P349P649Q619R542R934J0117J0656J1520J2208J2665J3463J4824
$$ 368811 376558 383907 391556 400175 409717 419651 429768 440424 451944 464152 476817 490280 505104
53494E05104J6071J6517J6475J6656J6954J6686J5905J5465J5738J6110J6068
$$ 505104 521175 537692 554167 570823 587777 604463 620368 635833 651571 667681 683749
53483F83749J5928J6123J6466J6623J6656J6627J6252J5482J4905J5058J5738
$$ 683749 699677 715800 732266 748889 765545 782172 798424 813906 828811 843869 859607
53472H59607J6367J6635J6335J5318J4007J3368J3658J3879J3233J2398J2410
$$ 859607 875974 892609 908944 924262 938269 951637 965295 979174 992407 1004805 1017215
53461A017215J2835J2366J0933R796R478Q974P411N345L672K224K72k097m051
$$ 1017215 1030050 1042416 1053349 1063145 1072623 1081597 1089008 1094353 1098025 1100249 1100521 1098424 1094373
53448A094373n249o275p705r321j0365j0525j0332j0570j1332j1882j1654j1110
$$ 1094373 1089124 1082849 1075144 1065823 1055458 1044933 1034601 1024031 1012699 1000817 989163 978053
53436I78053j1170j2014j2897j3252j3345j3684j4194j4447j4343j4160j4010
$$ 978053 966883 954869 941972 928720 915375 901691 887497 873050 858707 844547 830537
53425H30537j3629j2791j1668j0620r716q648p229n743m616l828l040k256j901
$$ 830537 816908 804117 792449 781829 772113 763465 756236 750493 745877 742049 739009 736753 734852
53412G34852k040k001j241j28O33J047J762L083M666O123P353Q262Q752R049R605
$$ 734852 732812 730811 729570 729442 730075 731122 732884 735967 740633 746756 754109 762371 771123 780172 789777
53397G89777J0530J1533J2497J3647J5029J6288J7186J8042J9369K1226K3099
$$ 789777 800307 811840 824337 837984 853013 869301 886487 904529 923898 945124 968223
53386I68223K4345K4793K5047K5996K7796K9569L0473L0789L1371L2350L3105
$$ 968223 992568 1017361 1042408 1068404 1096200 1125769 1156242 1187031 1218402 1250752 1283857
53375A283857L3432L3861L4604L5058L4679L3724L2724L1786L0863L0155K9746
$$ 1283857 1317289 1351150 1385754 1420812 1455491 1489215 1521939 1553725 1584588 1614743 1644489
53364A644489K9219K8050K6124K3545K0327J6692J3278J0594Q410O056L153j18
$$ 1644489 1673708 1701758 1727882 1751427 1771754 1788446 1801724 1812318 1820728 1826784 1829937 1829819
53352A829819l245n753p586r344j1737j4679j7366j9416k1390k3803k6239k7923
$$ 1829819 1826574 1820821 1813235 1803891 1792154 1777475 1760109 1740693 1719303 1695500 1669261 1641338
53340A641338k8699k8896k8674k8066k7384k6887k6366k5517k4534k3758k3080
$$ 1641338 1612639 1583743 1555069 1527003 1499619 1472732 1446366 1420849 1396315 1372557 1349477
53329A349477k2296k1816k2267k3511k4670k5074k4596k3269k1325j9505j8543
$$ 1349477 1327181 1305365 1283098 1259587 1234917 1209843 1185247 1161978 1140653 1121148 1102605
53318A102605j8192j7454j5944j4299j3148j2299j1319j0275r395q635p980p883
$$ 1102605 1084413 1066959 1051015 1036716 1023568 1011269 999950 989675 980280 971645 963665 955782
53306I55782q795j0452j2009j2778j2586j1579j0065q422o965n709m477l171j965
$$ 955782 946987 936535 924526 911748 899162 887583 877518 869096 862131 856422 851945 848774 846809
53293H46809j232j212j594j570n69J082K516L328L914M791N990P323Q805J0447
$$ 846809 845577 844365 842771 841201 840632 841714 844230 847558 851472 856263 862253 869576 878381 888828
53279H88828J1908J2768J3032J3180J3658J4492J5327J5762J5645J5150J4586
$$ 888828 900736 913504 926536 939716 953374 967866 983193 998955 1014600 1029750 1044336
53268A044336J4056J3377J2305J0785R001P335O147N422M685L498J961N27o48
$$ 1044336 1058392 1071769 1084074 1094859 1103860 1111195 1117342 1122764 1127449 1130947 1132908 1133435 1132787
53255A132787j816l104m287n183o031p201q784j0546j2078j2903j2839j2384j2459
$$ 1132787 1130971 1127867 1123580 1118397 1112366 1105165 1096381 1085835 1073757 1060854 1048015 1035631 1023172
53242A023172j3443j4740j5473j5431j5017j4581j4154j3720j3336j3025j2772
$$ 1023172 1009729 994989 979516 964085 949068 934487 920333 906613 893277 880252 867480
53231H67480j2660j2786j3084j3376j3494j3290j2647j1725j1033j0949j1217
$$ 867480 854820 842034 828950 815574 802080 788790 776143 764418 753385 742436 731219
53220G31219j1176j0454r294q232p644p627p954q110p558o197m536l330l029l498
$$ 731219 720043 709589 700295 692063 684419 676792 668838 660728 653170 646973 642437 639107 636078 632580
53206F32580m261m951n561o248p002p646q150q624r024r098q829q596q654q708
$$ 632580 628319 623368 617807 611559 604557 596911 588761 580137 571113 562015 553186 544590 535936 527228
53192E27228q325p632p178p151p171o946o781p152p959q495q232p470p132p767
$$ 527228 518903 511271 504093 496942 489771 482825 476044 468892 460933 452438 444206 436736 429604 421837
53178D21837q873r387q906q130p937q219q014o729m878l582l548m591n902o647
$$ 421837 412964 403577 394671 386541 378604 370385 362371 355642 350764 347182 343634 339043 333141 326494
53164C26494o476n661m777m258m228m552m877m822m367l936l924m198m355m258
$$ 326494 320018 314357 309580 305322 301094 296542 291665 286843 282476 278540 274616 270418 266063 261805
53150B61805m002l531k814k295k546l359l798l435k837k597k496k194k065k555
$$ 261805 257803 254272 251458 249163 246617 243258 239460 236025 233188 230591 228095 225901 223836 221281
53136B21281l059k561j196k53m20r90j173j316k093l152l421k591j456q15o86
$$ 221281 218222 215661 214465 214212 213792 212802 211629 210313 208220 205068 201647 199056 197600 196785 196099
53121A96099p64r43j120r41k04P09J202J166R23O43J87l77n49j3P47Q75J87n39
$$ 196099 195335 194392 193272 192331 192127 192836 194038 195204 196127 196770 196957 196580 196031 196018 196765 197640 197827 197288
53103A97288m84K98J155J718K085K190J608K84j048j635j611j677k033k249k215
$$ 197288 196804 197102 198257 199975 202060 204250 205858 206142 205094 203459 201848 200171 198138 195889 193674
53088A93674k430l146l809l791l260k818k590k302k035k171k614k681k043j231
$$ 193674 191244 188098 184289 180498 177238 174420 171830 169528 167493 165322 162708 160027 157984 156753
53074A56753r26j135j341j250r82p67p77j071j445j470r80m13l77q91j349j236
$$ 156753 155827 154692 153351 152101 151119 150352 149575 148504 147059 145589 144609 144196 143819 142928 141579 140343
53058A40343o70k10k78q17j393j603j440j207j067q90o36n69q16r58n42J16K02
$$ 140343 139673 139463 139185 138368 136975 135372 133932 132725 131658 130768 130132 129563 128747 127789 127247 127363 127565
53041A27565n32j392j636j325j027r74q55l75K94O22K66m51o88k9Q77R63J06o91
$$ 127565 127033 125641 124005 122680 121653 120679 119824 119449 119743 120365 120631 120180 119492 119463 120340 121303 121409 120718
53023A20718p02l93n08q35o61m6K15j18m58m82o32j112j241m09Q79J596J441Q54
$$ 120718 120016 119623 119115 118280 117619 117573 117788 117670 117212 116730 116098 114986 113745 113336 114215 115811 117252 118106
53005A18106J50n80r75o66l0J32j85j19O08J064M19p50j214p05l5J76P3l5j05
$$ 118106 118256 117676 116701 116035 116005 116137 115952 115833 116441 117505 117924 117174 115960 115255 115220 115396 115469 115434 115329
52986A15329o0L31J056J701J918J705J181N18J25M50J344K041K066J752J569J358
$$ 115329 115269 115600 116656 118357 120275 121980 123161 123679 123804 124254 125598 127639 129705 131457 133026 134384
52970A34384P00k70q93p87j85N15J176J860K513K896K762K225J894K335L322L953
$$ 134384 135084 134814 133921 133134 132949 133464 134640 136500 139013 141909 144671 146896 148790 151125 154447 158400
52954A58400L702K956K288J694J032O91J086J718J567N03m83n75o2K29j23r93
$$ 158400 162102 165058 167346 169040 170072 170763 171849 173567 175134 175637 175154 174579 174517 174746 174623 173630
52938A73630j995k586k428j883j709k000j936r96Q2J43r15k041k308j781j102
$$ 173630 171635 169049 166621 164738 163029 161029 159093 158097 158179 158322 157407 155366 153058 151277 150175
52923A50175p25n50k32L01O14K61m52o77j58L08j2o81p38j03L34K2n17m10O01
$$ 150175 149450 148900 148668 148969 149583 149844 149392 148715 148557 148865 148853 148172 147434 147331 147665 147687 147170 146760 147361
52904A47361J972K835K618J568O40M83O62K99o00j153r13m68m50n93k66N09J102
$$ 147361 149333 152168 154786 156354 156994 157477 158139 158438 157838 156685 155772 155304 154854 154261 153995 154504 155606
52887A55606J059N02j18l20J12Q28J111O71Ll05l51n59q07n57K40R43J105J001
$$ 155606 156665 157167 157049 156729 156841 157669 158780 159451 159454 159149 158798 158239 157432 156875 157115 158058 159163 160164
52869A60164J049J122Q63L50K5N3J72J91K65N53Q75R42P16L94J51J47N36J258
$$ 160164 161213 162335 163198 163548 163573 163626 163798 163989 164254 164807 165682 166624 167340 167734 167885 168032 168568 169826
52851A69826J896K063J840J540J185O72L72Q97K013K549J831O83L25P28Q57L43
$$ 169826 171722 173785 175625 177165 178350 179022 179394 180291 182304 184853 186684 187367 187692 188420 189277 189620
52835A89620o3K28P68Q64N50K93K04J9l45o73p53n69l24l86r69j717j993j738
$$ 189620 189557 189785 190553 191417 191967 192260 192464 192483 192138 191465 190712 190143 189819 189433 188464 186747 184754 183016
52817A83016j673k321l167l257k408j389r65j138j356j233r28q92j262j625j595
$$ 183016 181343 179022 175855 172598 170190 168801 167836 166698 165342 164109 163181 162289 161027 159402 157807
52802A57807j464j804k442k471j571o33o06j259j693j677j666j774j584j010n82
$$ 157807 156343 154539 152097 149626 148055 147422 146816 145557 143864 142187 140521 138747 137163 136153 135571
52787A35571o64j016j296j496j677j714j549j331j099o98k07Jj66k66j7J53l59
$$ 135571 134907 133891 132595 131099 129422 127708 126159 124828 123729 123031 122824 122825 122659 122393 122376 122529 122170
52770A22170j417k254k355j918j436j175j157j312j465j347r07n59q08j545j944
$$ 122170 120753 118499 116144 114226 112790 111615 110458 109146 107681 106334 105427 104868 104060 102515 100571
52755A00571j378l35M5o51j617j873j456j130j297j688j940j943j649j043l72
$$ 100571 99193 98858 98903 98252 96635 94762 93306 92176 90879 89191 87251 85308 83659 82616 82244
52740H2244M2K77O42J049J006M06j79k45l3j40p63j533j883j437l15P31Q21j30
$$ 82244 82286 82563 83205 84254 85260 85666 85487 85242 85209 85069 84306 82773 80890 79453 79138 79869 80690 80560
52722H0560j194j420q11j01J92J02j85o26j194j683j824j483p80m0M41O65Q44
$$ 80560 79366 77946 77135 77034 77226 77328 77143 76517 75323 73640 71816 70333 69553 69513 69954 70619 71463
52705G1463J065J187J104Q73N27P4k93k75K3J26p1k8O45J450J615J229J133J773
$$ 71463 72528 73715 74819 75692 76219 76293 76000 75725 75748 75874 75803 75775 76420 77870 79485 80714 81847 83620
52687H3620K611K917K655K371K441K733K897K796K541K145J337p5j683k658k700
$$ 83620 86231 89148 91803 94174 96615 99348 102245 105041 107582 109727 111064 110989 109306 106648 103948
52672A03948k440k580k894k599j579o82o29j189j662j802j845j881j698j236q76
$$ 103948 101508 98928 96034 93435 91856 91174 90545 89356 87694 85892 84047 82166 80468 79232 78356
52657G8356r99j482j816j703j322j003p91m54J25P52J059P75o1r98j372r06o7
$$ 78356 77357 75875 74059 72356 71034 70031 69240 68786 68911 69663 70722 71497 71436 70438 69066 68160 68093
52640F8093M02L40K46M53O89O29M57M20K57m47j426j822j151J59J267J638J249
$$ 68093 68495 68835 69081 69534 70223 70852 71309 71729 71986 71539 70113 68291 67140 67299 68566 70204 71453
52623G1453M71j78l75k38q9l8j2j00m86r71j038n59k6J12K9J20K53j6o53j037
$$ 71453 71924 71746 71371 71133 71044 71006 70994 70894 70408 69437 68399 67840 67814 67926 67955 68075 68328 68312 67659 66622
52603F6622p63r6N35J113J778K260K014R55l35j186j322p73L02J453K068J988
$$ 66622 65859 65763 66298 67411 69189 71449 73463 74418 74083 72897 71575 70802 71104 72557 74625 76613
52587G6613J735J758J746J205M51K93Q32J310J235R18P03L87j33m09j33K58K85
$$ 76613 78348 80106 81852 83057 83508 83801 84633 85943 87178 88096 88799 89186 89053 88644 88511 88769 89054
52570H9054J99M11O73O01N50J097J868J843Q22k95p33n44j0Q01J628J928J610
$$ 89054 89253 89664 90337 90938 91488 92585 94453 96296 97118 96823 96090 95546 95536 96337 97965 99893 101503
52553A01503J238J207J275J163J057J122J118R10Q53J167J392J009K50k18j63
$$ 101503 102741 103948 105223 106386 107443 108565 109683 110593 111446 112613 114005 115014 115264 115046 114883
52538A14883J66O29J266J921K244K071J477O25j60l84J09P14O67M0l03J30P49
$$ 114883 115049 115678 116944 118865 121109 123180 124657 125282 125122 124738 124847 125561 126228 126268 125965 126095 126844
52521A26844N44p00k042k249j029O05J300P04k51m79J32Q49J075Q38M98L24L46
$$ 126844 127388 126688 124646 122397 121368 121973 123273 123977 123726 123247 123379 124228 125303 126141 126639 126963 127309
52504A27309L88J91k31m73j54N34R31O40l9n13n84o38j029j473j306m40K99J03
$$ 127309 127697 127888 127657 127184 127030 127564 128495 129135 129096 128583 127999 127361 126332 124859 123553 123113 123412 123515
52486A23515p04r94k46Q86J467J255N85j03l88LQ19J394J512J632J968K022J449
$$ 123515 122811 121817 121571 122457 123924 125179 125764 125661 125273 125276 126095 127489 129001 130633 132601 134623 136072
52469A36072Q54Q86J127P47p7m35j35J22L0L9K94L04J0J19Q32J175L53r37j406
$$ 136072 136926 137812 138939 139686 139609 139174 139039 139161 139191 139230 139524 139828 139838 139957 140789 141964 142317 141380 139974
52450A39974q73k26j3M3K43M47M91N02N86O54O70P09O71K86m13r37p97m3P79J114
$$ 139974 139101 138875 138862 138905 139148 139595 140086 140588 141174 141828 142498 143207 143878 144164 143751 142814 142017 141974 142753 143867
52430A43867Q25K57r9p9Q4P8j90o13r68r04k89L47J19j091k192k071r01K85J047
$$ 143867 144692 144949 144850 144771 144855 144933 144743 144130 143162 142258 141969 142316 142435 141344 139152 137081 136180 136465 137512
52411A37512J826K809L370L007K141J536J341J226J146J362J827K048J737J178
$$ 137512 139338 142147 145517 148524 150665 152201 153542 154768 155914 157276 159103 161151 162888 164066
52397A64066Q33P46N12j91j151j726j515q35l87m21m83j56K97L38J3m6M89J125
$$ 164066 164899 165645 166157 165966 164815 163089 161574 160739 160352 159931 159448 159292 159589 159927 159940 159894 160383 161508
52379A61508J065J02j137j764j436o12j3J79L26N67M92p1m12K69J578K263J868
$$ 161508 162573 162675 161538 159774 158338 157726 157713 157892 158218 158785 159277 159206 158794 159063 160641 162904 164772
52362A64772J272J325J715J759J630K007K891L582L641L222K543J739J236J514
$$ 164772 166044 167369 169084 170843 172473 174480 177371 180953 184594 187816 190359 192098 193334 194848
52348A94848K344K882K694K189J894J891K110K576L038K962K268J558J256J086
$$ 194848 197192 200074 202768 204957 206851 208742 210852 213428 216466 219428 221696 223254 224510 225596
52334B25596P83P32J262J855J835J432J358J640J764J821K447L571M182L765L059
$$ 225596 226379 227111 228373 230228 232063 233495 234853 236493 238257 240078 242525 246096 250278 254043 257102
52319B57102K950L324L625L890M496N214N396N007M840N479O577P337P433P287
$$ 257102 260052 263376 267001 270891 275387 280601 285997 291004 295844 301323 307900 315237 322670 329957
52305C29957P529Q322R175R503R332R304R866J0796J1620J2222J2684J2810J2398
$$ 329957 337486 345808 354983 364486 373818 383122 392988 403784 415404 427626 440310 453120 465518
52292D65518J1851J1967J2920J3970J4418J4434J4627J5082J5305J4991J4389
$$ 465518 477369 489336 502256 516226 530644 545078 559705 574787 590092 605083 619472
52281F19472J3902J3612J3352J3004J2561J2019J1361J0610R766Q788P624O367
$$ 619472 633374 646986 660338 673342 685903 697922 709283 719893 729659 738447 746071 752438
52269G52438N293M707M651M638L967K473R08J89L04M38K27K95J154K103K006R00
$$ 752438 757731 762438 767089 771727 775694 778167 779075 779264 779568 780006 780233 780528 781682 783785 785791 786691
52253G86691j4rL70M34M57J061K141L033L546M117N118O529Q164R719J0754J1046
$$ 786691 786677 786668 787038 787472 787929 788990 791131 794164 797710 801827 806945 813474 821638 831357 842111 853157
52237H53157J1015J1209J1530J1427J0829J0271J0042R886R614R391R185Q638
$$ 853157 864172 875381 886911 898338 909167 919438 929480 939366 948980 958371 967556 976194
52225I76194P791P219P042O414M718K677J512J291R36k68j955l469m542n046m874
$$ 976194 983985 991204 998246 1004660 1009378 1012055 1013567 1014858 1015794 1015526 1013571 1010102 1005560 1000514 995640
52210I95640m460m700n895p176p592p345p343p806q052p672p136o908o680n934
$$ 995640 991180 986480 980585 973409 965817 958472 951129 943323 935271 927599 920463 913555 906875 900941
52196I00941m929m372m335m166l592l221l546l975l474k007p32o64j596k472k569
$$ 900941 896012 891640 887305 883139 879547 876326 872780 868805 865331 863324 862592 861928 860332 857860 855291
52181H55291k041j571j637k159k676k883k838k633k121j292p29j093k147k861
$$ 855291 853250 851679 850042 847883 845207 842324 839486 836853 834732 833440 832711 831618 829471 826610
52167H26610k712k358k674l585m272m240l727l236l149l580m190m256l437k401
$$ 826610 823898 821540 818866 815281 811009 806769 803042 799806 796657 793077 788887 784631 781194 778793
52153G78793k180k871l495l225k280j474j284j621k173k623k769k663k556k594
$$ 778793 776613 773742 770247 767022 764742 763268 761984 760363 758190 755567 752798 750135 747579 744985
52139G44985k639k512k229j970j927k240k829l224k946k168j694k053k868l401
$$ 744985 742346 739834 737605 735635 733708 731468 728639 725415 722469 720301 718607 716554 713686 710285
52125G10285l437l253l073k917k933l266l651l579l001k411k046j508m88N59R22
$$ 710285 706848 703595 700522 697605 694672 691406 687755 684176 681175 678764 676718 675210 674722 675281 676203
52110F76203O35M35Q44J742K836M070N393O566P484Q385R469J0580J1582J2796
$$ 676203 676838 677273 678117 679859 682695 686765 692158 698724 706208 714593 724062 734642 746224 759020
52096G59020J4576J6595J8040J8554J8621J8842J9298J9694J9900K0001K0022
$$ 759020 773596 790191 808231 826785 845406 864248 883546 903240 923140 943141 963163
52085I63163J9804J9150J7996J6556J5208J4119J2972J1418R702Q430P680O855
$$ 963163 982967 1002117 1020113 1036669 1051877 1065996 1078968 1090386 1100088 1108518 1116198 1123053
52073A123053N597M231K978J433o01k387l104l155l711n097o547p451p940q095
$$ 1123053 1128650 1132881 1135859 1137292 1136691 1134304 1131200 1128045 1124334 1119237 1112690 1105239 1097299 1089204
52059A089204p629o674o057o146o230n684n032n052n311m623k761q21K01L74K65
$$ 1089204 1081575 1074901 1068844 1062698 1056468 1050784 1045752 1040700 1035389 1030766 1028005 1027184 1027385 1027759 1028024
52044A028024J69K04N99J431K420L226L789M142M188L961L777L878M012L707K906
$$ 1028024 1028193 1028397 1028996 1030427 1032847 1036073 1039862 1044004 1048192 1052153 1055930 1059808 1063820 1067527 1070433
52029A070433K108J825K017K117J598M85p14j607k316l136m015m566m605m336
$$ 1070433 1072541 1074366 1076383 1078500 1080098 1080583 1079869 1078262 1075946 1072810 1068795 1064229 1059624 1055288
52015A055288m126m350n464p652j0313j2287j2972j2896j2957j3413j3995j4648
$$ 1055288 1051162 1046812 1041348 1033696 1023383 1011096 998124 985228 972271 958858 944863 930215
52003I30215j5599j6753j7609j7916j8035j8461j9204j9794j9798j9277j8774
$$ 930215 914616 897863 880254 862338 844303 825842 806638 786844 767046 747769 728995
51992G28995j8837j9399j9779j9463j8778j8388j8330j8022j7284j6733j6900
$$ 728995 710158 690759 670980 651517 632739 614351 596021 577999 560715 543982 527082
51981E27082j7424j7537j7010j6195j5381j4618j4000j3612j3205j2369j1141
$$ 527082 509658 492121 475111 458916 443535 428917 414917 401305 388100 375731 364590
51970C64590j0000r222q605p960p397o918o129m797l443k953l600m796n733n998
$$ 364590 354590 345368 336763 328803 321406 314488 308359 303562 300119 297166 293566 288770 283037 277039
51956B77039n597m762l900l411l325l234k779k142j857k174k768l114k999k612
$$ 277039 271442 266680 262780 259369 256044 252810 250031 247889 246032 243858 241090 237976 234977 232365
51942B32365k234k026j984k023k006j836j531j150o88k00k5n74j717k601k479
$$ 232365 230131 228105 226121 224098 222092 220256 218725 217575 216887 216687 216662 216088 214371 211770 209291
51927B09291j605r97j228j866k188k117k086k217k113j510p58m72q45j474j785
$$ 209291 207686 206689 205461 203595 201407 199290 197204 194987 192874 191364 190606 190134 189289 187815 186030
51912A86030j535r51n19o10j203j909k296k170j632r11k95j03n09j253j699j384
$$ 186030 184495 183544 183025 182415 181212 179303 177007 174837 173205 172294 171999 171896 171387 170134 168435 167051
51896A67051n40J16J31k46m68l22l3R0n8l62n93n37k18M5n8m99r43j084q56m04
$$ 167051 166511 166627 166758 166512 166044 165722 165689 165779 165721 165359 164766 164229 164011 164056 163998 163499 162556 161472 160616 160212
51876A60212K8K63L38L93L02k44j110j500q92Q0L47j28l51J81P84P50M44O28J257
$$ 160212 160240 160503 160841 161234 161536 161292 160182 158682 157790 157870 158217 158089 157738 157919 158703 159453 159897 160525 161782
51857A61782J644J459R13K54l17m26J28Q88J231J228J426J862K014J700J326J102
$$ 161782 163426 164885 165798 166052 165735 165309 165437 166325 167556 168784 170210 172072 174086 175786 177112 178214
51841A78214P88M08M85J116J507R38k22j051j209j074j001j001j053j138j084
$$ 178214 179002 179410 179895 181011 182518 183456 183234 182183 180974 179900 178899 177898 176845 175707 174623
51826A74623p03j08L91O30N68J40n25q69m15N23J111R75N33L14L69N12O85Q42
$$ 174623 173920 173812 174203 174833 175401 175541 175016 174147 173732 174255 175366 176341 176874 177188 177557 178069 178754 179596
51808A79596Q60P88Q49R85O98k36j204j349p18j88l10o93p30m50k78k78j82l1
$$ 179596 180456 181244 182093 183078 183776 183540 182336 180987 180269 180081 179771 179078 178348 177898 177620 177342 177160 177129
51790A77129k07p22r40l50O71J201Q56J65r7K26O22N86K13M9L99Q95R11L00m61
$$ 177129 176922 176200 175260 174910 175581 176782 177638 177803 177706 177932 178554 179140 179353 179402 179801 180696 181607 181907 181446
51771A81446q96r55p28j60P10J414J469R96N72M81M91L91L35N52J028J644K344
$$ 181446 180550 179595 178867 178707 179417 180831 182300 183296 183868 184349 184840 185231 185566 186118 187146 188790 191134
51754A91134K981L254L039K622K433K574K817K929K879K734K487J987J130J70
$$ 191134 194115 197369 200408 203030 205463 208037 210854 213783 216662 219396 221883 223870 225000 225170
51740B25170l76k73N9M6k99n00m29n58j178j840j790p50Q62K217K501J518N1p11
$$ 225170 224794 224521 224580 224626 224327 223827 223398 222840 221662 219822 218032 217282 218144 220361 222862 224380 224431 223720
51722B23720m54lj68p40j062r93q30n92j61J75Nm33n22k77l61j030j714j915j830
$$ 223720 223266 223263 223095 222355 221293 220300 219470 218878 218717 218892 218897 218464 217942 217665 217304 216274 214560 212645 210815
51703B10815j769j572j035m69l13m84o30p54j058j274q27K78J202J217N99K81
$$ 210815 209046 207474 206439 205970 205657 205173 204543 203789 202731 201457 200630 200908 202110 203327 203926 204207
51687B04207P63J642K269K557K965L734M449M443L475J900K36j161k124k597k608
$$ 204207 204970 206612 208881 211438 214403 218137 222586 227029 230504 232404 232640 231479 229355 226758 224150
51672B24150k167j228J12J431K309K733K922K791K074J051O23J289K417K985K722
$$ 224150 221983 220755 220867 222298 224607 227340 230262 233053 235127 236178 236801 238090 240507 243492 246214
51657B46214K100J386L50j055k273k715k420j969j964k647l733m464m204l230
$$ 246214 248314 249700 250050 248995 246722 244007 241587 239618 237654 235007 231274 226810 222606 219376
51643B19376k591k821l233k948k298k380l294l800l133k256k545l753m275l332
$$ 219376 216785 213964 210731 207783 205485 203105 199811 196011 192878 190622 188077 184324 180049 176717
51629A76717j861j077r84q45m52k38m62r44j471j932k089j707r77l36J29P16J378
$$ 176717 174856 173779 172795 171950 171498 171260 170798 169854 168383 166451 164362 162655 161678 161342 161471 162187 163565
51612A63565J495O92m73j051p95l08j96m10n40m02j00K95Q12J364J680J612J326
$$ 163565 165060 165752 165279 164228 163433 163125 162929 162519 161979 161577 161477 161772 162584 163948 165628 167240 168566
51595A68566J057Q64P72J014J787K772L237K777J745R16Q77J737L116M261M519
$$ 168566 169623 170487 171259 172273 174060 176832 180069 182846 184591 185507 186384 188121 191237 195498 200017
51580B00017M004L486L492L792M009M272M743M881L923K046L92k35j58j83o61
$$ 200017 204021 207507 210999 214791 218800 223072 227815 232696 236619 238665 239057 238822 238664 238481 237820
51565B37820j442k286k948l092k539j527n86j98n19j265j767j430l05J021K106
$$ 237820 236378 234092 231144 228052 225513 223986 223400 223202 222683 221418 219651 218221 217916 218937 221043
51550B21043K957L626L929L826L746M146M891N407N346M869M296L761L198K523
$$ 221043 224000 227626 231555 235381 239127 243273 248164 253571 258917 263786 268082 271843 275041 277564
51536B77564J814J266R89P80L27l69r13r75o17j48J55J71j4j06J02L59K32k62
$$ 277564 279378 280644 281633 282413 282740 282371 281458 280483 279866 279718 279873 280044 280030 279924 280026 280385 280617 280355
51518B80355o29o58p08j071j520j835k290l103l798l720k976k310k142k264k442
$$ 280355 279726 279068 278360 277289 275769 273934 271644 268541 264743 261023 258047 255737 253595 251331 248889
51503B48889k706l042l280l445l697l827l342k236j277j177j757k247k148j535
$$ 248889 246183 243141 239861 236416 232719 228892 225550 223314 222037 220860 219103 216856 214708 213173
51489B13173o56L59J376K074K068J303L06r0N08J615K289K045J196M30K90R70
$$ 213173 212517 212876 214252 216326 218394 219697 220003 219913 220421 222036 224325 226370 227566 227996 228286 229256
51473B29256K231L420L854L491K977K923L197L264L054L144L890M714M631L496
$$ 229256 231487 234907 238761 242252 245229 248152 251349 254613 257667 260811 264701 269415 274046 277542
51459B77542K352K243L009L646L688L588L690L594K902K010J531J366J002M11
$$ 277542 279894 282137 285146 288792 292480 296068 299758 303352 306254 308264 309795 311161 312163 312574
51445C12574p6n38j281j975j914j187p14q60r02k53N31O06k6q46j742k851l868
$$ 312574 312498 311960 310679 308704 306790 305603 304889 304029 303127 302874 303405 304011 303985 303139 301397 298546 294678
51428B94678m333m404m611m980n057m755m503m534m600m415l948l193k272j731
$$ 294678 290345 285941 281330 276350 271293 266538 262035 257501 252901 248486 244538 241345 239073 237342
51414B37342k084k951l286k716k030j985k236j977j179m98j79K48J120K147K906
$$ 237342 235258 232307 229021 226305 224275 222290 220054 218077 216898 216400 216221 216469 217589 219736 222642
51399B22642L385L804M177M365M344M138L619K665J460L34p38k121l828n202n640
$$ 222642 226027 229831 234008 238373 242717 246855 250474 253139 254599 254933 254195 252074 248246 243044 237404
51384B37404n416n337n641n819n587n379n559n746n483n104n188n451n007l714
$$ 237404 231988 226651 221010 215191 209604 204225 198666 192920 187437 182333 177145 171694 166687 162973
51370A62973k416j693j257q64r60j861k939l403l374l425l406k679j364l86j19
$$ 162973 160557 158864 157607 156743 155783 153922 150983 147580 144206 140781 137375 134696 133332 132946 132827
51355A32827J02P84J314Q17n25j674k025j872j705j571j267q38n47n40o60o06
$$ 132827 132929 133713 135027 135844 135319 133645 131620 129748 128043 126472 125205 124367 123820 123280 122620 122014
51339A22014k57K51O70R13J063J144J027N99l3n53n78J26J385K566L053K878K619
$$ 122014 121757 122008 122678 123591 124654 125798 126825 127424 127391 126838 126260 126386 127771 130337 133390 136268 138887
51322A38887K660K815K841K977L554M342M741M562M217M095M100L934L501K874
$$ 138887 141547 144362 147203 150180 153734 158076 162817 167379 171596 175691 179791 183725 187226 190100
51308A90100K096J214L64l82j167k161l222l917l916l368k830k769l124l513l802
$$ 190100 192196 193410 193774 193392 192225 190064 186842 182925 179009 175641 172811 170042 166918 163405 159603
51293A59603m167m525m309l226j933j439j880k423k424k061j711j329q04l97l41
$$ 159603 155436 150911 146602 143376 141443 140004 138124 135701 133277 131216 129505 128176 127372 126975 126634
51278A26634l31N1O35Q21L26n74j436j888j660q74k03k65q72j220q79k26J36K8
$$ 126634 126303 126354 126989 127810 128136 127562 126126 124238 122578 121704 121501 121236 120364 119144 118265 118039 118175 118203
51260A18203k89m25j61L40O00L86J17L37Q66J033P25O12J063J510J232L38m77
$$ 118203 117914 117489 117328 117668 118268 118654 118771 119108 119974 121007 121732 122344 123407 124917 126149 126487 126010
51243A26010q16p22k67M61J070J079N23n4k66k45l06m92n98m46o3L96Q34J247
$$ 126010 125194 124472 124205 124666 125736 126815 127338 127284 127018 126773 126467 125975 125377 124931 124868 125264 126098 127345
51225A27345J476J113l8j388j851j038K51R73R70P71O50M37J13m6J1L0n4OJ92
$$ 127345 128821 129934 129896 128508 126657 125619 125870 126843 127813 128584 129234 129671 129784 129738 129749 129779 129725 129731 129923
51206A29923P9m78r12o13K30Q54Q53N33L81N10O51N46K36m3j77l65q48j476j743
$$ 129923 130002 129524 128612 127999 128229 129083 129936 130469 130850 131360 132011 132557 132793 132750 132573 132208 131360 129884 128141
51187A28141j335n22J18K65K6k97m79m78m50o46j165j759j972j539p44k42m14
$$ 128141 126806 126284 126402 126667 126693 126396 125917 125439 124989 124343 123178 121419 119447 117908 117164 116922 116508
51170A16508q61p69J21J109J358R16N29N93P47N95L18K21Q9n49j593k286j997
$$ 116508 115647 114878 114999 116108 117466 118382 118911 119504 120251 120846 121164 121385 121474 120925 119332 117046 115049
51153A15049r26J44O09N44L86K51k09j162k062k085j154o1M17K51j37l95k63M05
$$ 115049 114123 114267 114876 115420 115806 116057 115848 114686 112624 110539 109385 109324 109741 109992 109855 109460 109197 109602
51135A09602J327J789J446Q71Q86J487J923J713J125O88O30Q56J051Q11M4p95
$$ 109602 110929 112718 114164 115035 115921 117408 119331 121044 122169 122857 123487 124343 125394 126205 126249 125454
51119A25454j137j069j135j449j469q83j77Jk95m70j72L78P27N59q4p45q06j08
$$ 125454 124317 123248 122113 120664 119195 118312 118135 118136 117841 117371 117199 117577 118304 118863 118779 118034 117228 117120
51101A17120P65J049O45J81K63Q22J246J087N56L49Q92J820K322K000J173L87
$$ 117120 117885 118934 119579 119760 120023 120845 122091 123178 123734 124083 124975 126795 129117 131117 132290 132677
51085A32677r1j88J11N74O92K35l38l62J65N98N16K26K56O24Q56O19J36o1K50
$$ 132677 132586 132398 132509 133083 133775 134010 133672 133310 133475 134073 134589 134815 135071 135695 136551 137170 137306 137245 137495
51066A37495O89O81J22n56j002j352j868k326k150j128K64J285J524J142P34R33
$$ 137495 138184 138865 138987 138431 137429 136077 134209 131883 129733 128605 128869 130154 131678 132820 133554 134487
51050A34487J850K826K958K004O68r3O1P02J205J315J258J397J797K114J934J224
$$ 134487 136337 139163 142121 144125 144793 144700 144761 145463 146668 147983 149241 150638 152435 154549 156483 157707
51034A57707M28N7K14N10M40j23q25j199j141r14p61o83n82m04n3O24J555K307
$$ 157707 158135 158192 158406 158916 159356 159233 158408 157209 156068 155154 154393 153710 153128 152724 152671 153295 154850 157157
51016A57157K455J967J198N86M67R45J721K295K525K828L484M090M005L261K511
$$ 157157 159612 161579 162777 163363 163830 164775 166496 168791 171316 174144 177628 181718 185723 188984 191495
51001A91495K253K526L210M147M962N285N285N430N787O004O092O547P538Q565
$$ 191495 193748 196274 199484 203631 208593 213878 219163 224593 230380 236384 242476 249023 256561 265126
50987B65126R241R838J0718J1758J2758J3930J5478J7148J8774K0796K3614K6786
$$ 265126 274367 284205 294923 306681 319439 333369 348847 365995 384769 405565 429179 455965
50975D55965K9627L2311L5581L9455M3161M6324M9355N2353N4625N5766N6422
$$ 455965 485592 517903 553484 592939 636100 682424 731779 784132 838757 894523 950945
50964I50945N7296N7900N7108N4722N1622M8355M4304L8679L1796K5000J9352
$$ 950945 1008241 1066141 1123249 1177971 1229593 1277948 1322252 1360931 1392727 1417727 1437079
50953A437079J4797J0576O311K432l93k058k991l398k881j108J326L168L678L193
$$ 1437079 1451876 1462452 1468763 1471195 1470802 1468744 1465753 1462355 1459474 1458366 1459692 1462860 1466538 1469731
50939A469731K285P55k130o597j2009j7607k3142k8627l3939l9044m4206m9497
$$ 1469731 1472016 1472771 1470641 1464044 1452035 1434428 1411286 1382659 1348720 1309676 1265470 1215973
50927A215973n4238n7407n8635n8408n7321n5538n3037m9868m6082m1797l7507
$$ 1215973 1161735 1104328 1045693 987285 929964 874426 821389 771521 725439 683642 646135
50916F46135l3811l0631k7192k3185j9478j7112j5984j5006j3472j1615r950q591
$$ 646135 612324 581693 554501 531316 511838 494726 478742 463736 450264 438649 428699 420108
50904D20108p382o213n094m141l543l288l007k369j534r17n54j11N24J098J509
$$ 420108 412726 406513 401419 397278 393735 390447 387440 385071 383537 382620 382066 381955 382479 383577 385086
50889C85086K014K804L701M499N222N891O335O410O280O232O431O946P836Q991
$$ 385086 387100 389904 393605 398104 403326 409217 415552 421962 428242 434474 440905 447851 455687 464678
50875D64678J0086J0846J1340J1879J2699J3844J5336J7315J9914K2955K5917
$$ 464678 474764 485610 496950 508829 521528 535372 550708 568023 587937 610892 636809
50864F36809K8531L1320L5188M0279M5840N1407N7587O5026P3199Q1023Q8395
$$ 636809 665340 696660 731848 772127 817967 869374 926961 991987 1065186 1146209 1234604
50853A234604R6075J04233J12060J19025J25324J30761J34192J34756J32777J28698
$$ 1234604 1330679 1434912 1546972 1665997 1791321 1922082 2056274 2191030 2323807 2452505
50843B452505J21808J11039R6572P9886O2473M5285K9144J4785K428p988j6023
$$ 2452505 2574313 2685352 2781924 2861810 2924283 2969568 2998712 3013497 3015925 3007937 2991914
50832B991914k0783k1826j9588j4858q277m54P851J5820K2457K6297K5705J9806
$$ 2991914 2971131 2949305 2929717 2914859 2906582 2906128 2913979 2929799 2952256 2978553 3004258 3024064
50820C024064R124m747k0119l6025n2321o9090q5814j01328j14560j25090j32854
$$ 3024064 3033188 3028441 3008322 2972297 2919976 2850886 2765072 2663744 2549184 2424094 2291240
50809B291240j37676j39454j38422j34832j28591j19777j09318r8620q8566p9298
$$ 2291240 2153564 2014110 1875688 1740856 1612265 1492488 1383170 1284550 1195984 1116686
50799A116686p0753o2890n5467m8268m1552l5777l0853k6232k1795j8028j5179
$$ 1116686 1045933 983043 927576 879308 837756 801979 771126 744894 723099 705071 689892
50788F89892j2885j0851r276q255p331o151n123m849n183n419n292n256n710o346
$$ 689892 677007 666156 656880 648625 641294 635143 630020 625171 619988 614569 609277 604021 598311 591965
50774E91965o516o050n467n295n419n301m774m326m365m564m241l178j686j04
$$ 591965 585449 579399 573932 568637 563218 557917 553143 548817 544452 539888 535647 532469 530783 530679
50760E30679J281K044K050K017K976N046P367R355J1314J3529J5587J7153J8768
$$ 530679 531960 534004 536054 538071 541047 546093 553460 562815 574129 587658 603245 620398 639166
50747F39166K1161K4195K7167K9913L2891L6349M0135M4318M9305N5165O1296
$$ 639166 660327 684522 711689 741602 774493 810842 850977 895295 944600 999765 1061061
50736A061061O7038P2217P6876Q0823Q3663Q5164Q5244Q3687Q0131P4433O6889
$$ 1061061 1128099 1200316 1277192 1358015 1441678 1526842 1612086 1695773 1775904 1850337 1917226
50725A917226N7866M7285L4810K0697O164p387j9191k8838l5541l8563l8210l5560
$$ 1917226 1975092 2022377 2057187 2077884 2084048 2076661 2057470 2028632 1993091 1954528 1916318 1880758
50713A880758l1048k4319j5798p346n83M649R166J2491J3104J0260M426l875j4426
$$ 1880758 1849710 1825391 1809593 1802247 1801664 1806313 1815479 1827970 1841074 1851334 1855760 1851885 1837459
50700A837459k6455l8660n0347o1546p1632p8977q2584q3230q2256p9947p5924
$$ 1837459 1811004 1772344 1721997 1660451 1588819 1509842 1427258 1344028 1261772 1181825 1105901
50689A105901p0482o4533n8492n2116m5464l9211l3984k9897k6704k3905k0761
$$ 1105901 1035419 970886 912394 860278 814814 775603 741619 711722 685018 661113 640352
50678F40352j6815j2542q954o449m421k155M11K889M937O357P029P095O933O757
$$ 640352 623537 610995 602041 595592 591171 589016 589427 592316 597253 603610 610639 617734 624667 631424
50664F31424O448N951N513N336N287N232N414O096P083P949Q683R654J0991J2417
$$ 631424 637872 643823 649336 654672 659959 665191 670605 676701 683784 691733 700416 710070 721061 733478
50650G33478J3748J5184J6933J8930K1084K3564K6511K9620L2300L4206L5414
$$ 733478 747226 762410 779343 798273 819357 842921 869432 899052 931352 965558 1000972
50639A000972L6148L6589L6897L7084L6768L5274L2215K7946K3346J9100J5242
$$ 1000972 1037120 1073709 1110606 1147690 1184458 1219732 1251947 1279893 1303239 1322339 1337581
50628A337581J1400P375L474K46j962l110l277k548j177M41K115L998O165Q109
$$ 1337581 1348981 1356356 1359830 1360076 1358114 1355004 1351727 1349179 1348002 1348443 1350558 1354556 1360721 1368830
50614A368830Q982Q348O587M538K926K049J709J322L53j254l227n620r002j3814
$$ 1368830 1377812 1386160 1392747 1397285 1400211 1402260 1403969 1405291 1405644 1404390 1401163 1395543 1386541 1372727
50600A372727j9702k5785l1381l6211m0058m2699m4293m5422m6426m6911m6167
$$ 1372727 1353025 1327240 1295859 1259648 1219590 1176891 1132598 1087176 1040750 993839 947672
50589I47672m4066m1287l8635l6356l4156l1694k8839k5631k2262j9086j6374
$$ 947672 903606 862319 823684 787328 753172 721478 692639 667008 644746 625660 609286
50578F09286j4014j1634r114o714m598k513j96K180M233N875P225Q198Q657Q937
$$ 609286 595272 583638 574524 567810 563212 560699 560503 562683 566916 572791 580016 588214 596871 605808
50564F05808R702J1134J2666J3729J4369J4952J5659J6506J7546J8693J9564J9878
$$ 605808 615510 626644 639310 653039 667408 682360 698019 714525 732071 750764 770328 790206
50552G90206J9803J9606J9181J8344J7354J6738J6545J6293J5679J5005J4790
$$ 790206 810009 829615 848796 867140 884494 901232 917777 934070 949749 964754 979544
50541I79544J5228J6201J7525J9100K0958K3310K6362K9976L3678L7195M0812
$$ 979544 994772 1010973 1028498 1047598 1068556 1091866 1118228 1148204 1181882 1219077 1259889
50530A259889M5110N0340N6128O1728O6443O9913P2104P3108P2929P1404O8351
$$ 1259889 1304999 1355339 1411467 1473195 1539638 1609551 1681655 1754763 1827692 1899096 1967447
50519A967447O3750N7720N0278M1233L0433J8297N835o060j7269k8128l8501m7582
$$ 1967447 2031197 2088917 2139195 2180428 2210861 2229158 2234993 2228933 2211664 2183536 2145035 2097453
50507B097453n4690n9936o3751o6060o6195o3505n7941n0226m1618l3202k5180
$$ 2097453 2042763 1982827 1919076 1853016 1786821 1723316 1665375 1615149 1573531 1540329 1515149
50496A515149j7017q535m21O632J2840J8758K4075K7743K9250K8971K7049K2670
$$ 1515149 1498132 1489597 1489176 1495808 1508648 1527406 1551481 1579224 1608474 1637445 1664494 1687164
50484A687164J4978M271q121k0930l3461m5152n5157o2615o7200o9374o9872o9011
$$ 1687164 1702142 1706413 1698292 1677362 1643901 1598749 1543592 1480977 1413777 1344403 1274531 1205520
50472A205520o6668o3065n9121n5597n2057m7396m1511l5751l1410k8259k5073
$$ 1205520 1138852 1075787 1016666 961069 909012 861616 820105 784354 752944 724685 699612
50461F99612k1159j6889j2946r645o980m778k667k49K482N051O990Q401R906J2026
$$ 699612 678453 661564 648618 638973 631993 627215 624548 624299 626781 631832 638822 647223 657129 669155
50447F69155J4574J6725J7859J8287J8943K0285K1758K2560K2646K2674K3063
$$ 669155 683729 700454 718313 736600 755543 775828 797586 820146 842792 865466 888529
50436H88529K3507K3442K2686K1408J9768J7824J5761J3890J2333J0886R264P450
$$ 888529 912036 935478 958164 979572 999340 1017164 1032925 1046815 1059148 1070034 1079298 1086748
50424A086748N683M207L176K654K593K864L567N213Q138J1776J5043J7515J9740
$$ 1086748 1092431 1096638 1099814 1102468 1105061 1107925 1111492 1116705 1124843 1136619 1151662 1169177 1188917
50411A188917K2043K3824K4545K4758K5286K5773K5110K3145K0806J8406J4941
$$ 1188917 1210960 1234784 1259329 1284087 1309373 1335146 1360256 1383401 1404207 1422613 1437554
50400A437554R546K781m141j0684j7024k3378k9850l6491m2902m8190n1793n3921
$$ 1437554 1447100 1449881 1445740 1435056 1418032 1394654 1364804 1328313 1285411 1237221 1185428 1131507
50388A131507n4789n3997n1247m7090m2265l6895l1032k5384k0463j5495r462
$$ 1131507 1076718 1022721 971474 924384 882119 845224 814192 788808 768345 752850 743388
50377G43388k980K211N728R120J3501J7811K0202K0250J8861J6636J3341Q775
$$ 743388 740408 742619 748347 757467 770968 788779 808981 829231 848092 864728 878069 886844
50365H86844L277k645q529j3758j7692k0285k2169k3904k5282k5596k4582k2867
$$ 886844 890121 887476 878947 865189 847497 827212 805043 781139 755857 730261 705679 682812
50353F82812k1341k0257j9172j7810j6493j5443j4151j2013r467p703p182p078
$$ 682812 661471 641214 622042 604232 587739 572296 558145 546132 536665 528962 521780 514702
50341E14702o420n161l782k430r71M45J504K256L110M334N911P665R254J0249
$$ 514702 508282 503121 499339 496909 495938 496383 497887 500143 503253 507587 513498 521163 530417 540666
50327E40666J0643J1152J2432J4080J4897J4394J3494J3480J4466J5432J5572
$$ 540666 551309 562461 574893 588973 603870 618264 631758 645238 659704 675136 690708
50316F90708J5143J4792J4470J3521J1784J0037R014Q393P253N405L683K800K503
$$ 690708 705851 720643 735113 748634 760418 770455 779469 787862 795115 800520 804203 807003 809506
50303H09506K101J411P57L37pm75j177k180l398m456m999n096n120n320n809o798
$$ 809506 811607 813018 813775 814112 814105 813630 812453 810273 806875 802419 797420 792324 787204 781884 776075 769277
50287G69277q470j0502j2197j3166j3579j3668j3399j2855j2493j2609j2812j2504
$$ 769277 760807 750305 738108 724942 711363 697695 684296 671441 658948 646339 633527 621023
50275F21023j1775j1252j1119j0860j0052q913p779o531m924l205j886j065m43
$$ 621023 609248 597996 586877 576017 565965 557052 549273 542742 537818 534613 532727 531662 531219
50262E31219Q2M12P70J646L071M446N276N632N667N327M865N024O104P176P029
$$ 531219 531301 531713 532483 534129 537200 541646 546922 552554 558221 563548 568413 573437 579541 586717 593746
50247E93746N646M135L219K614J884J202R24R13O98K4j003k120l065l727m243
$$ 593746 599392 603527 606746 609360 611244 612446 613370 614283 614981 615005 614002 611882 608817 605090 600847
50232F00847m819n401n797o055o372o631o379n396m031k818k029j594j213m92
$$ 600847 596028 590627 584830 578775 572403 565772 559393 553997 549966 547148 545119 543525 542312 541820
50218E41820O82J939K892L669M552N258N229M669M469M896N160M683L970L665
$$ 541820 542502 544441 547333 551002 555554 560812 566041 570710 575179 580075 585235 589918 593888 597553
50204E97553L369K226K85j496k437k732k913l255l711m132m500n057n964o851
$$ 597553 600922 603148 603433 601937 599500 596768 593855 590600 586889 582757 578257 573200 567236 560385
50190E60385p169p097p456q421r158r162r131r676j0044r173p446o166n577m746
$$ 560385 553216 546119 538663 530242 521084 511922 502791 493115 483071 473898 466452 460286 454709 449963
50176D49963l281j905j101m33M31R98P73j8r14j770k490k905l220l960n149o224
$$ 449963 446682 444777 443676 443243 443674 444672 445445 445427 444513 442743 440253 437348 434128 430168 425019 418795
50160D18795o890p370p554o878n469m441m389m500l917l161l218l815l786k829
$$ 418795 411905 404535 396981 390103 384634 380193 375804 371304 367387 364226 361008 357193 353407 350578
50146C50578j848j618j999k500k837k781k162j252o72p15j040j062m39P24J844
$$ 350578 348730 347112 345113 342613 339776 336995 334833 333581 332909 332194 331154 330092 329653 330377 332221
50131C32221K219J722J040R02J342K025K868L841M499M451M081M091M426M447
$$ 332221 334440 336162 337202 338104 339446 341471 344339 348180 352679 357130 361211 365302 369728 374175
50117C74175M093M066M664N260N217M723M337M242M270M258M020L392K608K249
$$ 374175 378268 382334 386998 392258 397475 402198 406535 410777 415047 419305 423325 426717 429325 431574
50103D31574K544K972K988K697K550K564K356J798J255J226J918L136M386N196
$$ 431574 434118 437090 440078 442775 445325 447889 450245 452043 453298 454524 456442 459578 463964 469160
50089D69160N466N487N493N427N259N312N908O839P507P657P664P910Q170P942
$$ 469160 474626 480113 485606 491033 496292 501604 507512 514351 521858 529515 537179 545089 553259 561201
50075E61201P336P183P968Q962R001Q057P366P781Q689R044Q889R001R469R624
$$ 561201 568537 575720 583688 592650 601651 609708 617074 624855 633544 642588 651477 660478 669947 679571
50061F79571R340R320R896J0430J0378J0144J0342J0860J1211J1295J1164J0562
$$ 679571 688911 698231 708127 718557 728935 739079 749421 760281 771492 782787 793951 804513
50049H04513R363Q118P413O869N539L217P56q78j364r78m30o76k151m037m875
$$ 804513 813876 821994 829407 836276 841815 845032 845788 844910 843546 842568 842138 841462 839311 835274 830399
50034H30399m138k659j389k78J194K946M332N105N770O926Q474R679R936R386
$$ 830399 826261 823602 822213 821935 823129 826075 830407 835512 841282 848208 856682 866361 876297 885683
50020H85683Q725Q400Q238P915P601P792Q659R924J1286J2555J3362J3235J1985
$$ 885683 894408 902808 911046 918961 926562 934354 943013 952937 964223 976778 990140 1003375 1015360
50007A015360R724O407J880l535r050j4233j9283k4125k7831k9528k9565k9073
$$ 1015360 1025084 1031491 1033371 1029836 1020786 1006553 987270 963145 935314 905786 876221 847148
49995H47148k8591k7830k6710k5802k5439k5023k3762k1765j9897j8684j7781
$$ 847148 818557 790727 764017 738215 712776 687753 663991 642226 622329 603645 585864
49984E85864j6622j5188j3926j3091j2400j1396r947q344o967n996n400n043m747
$$ 585864 569242 554054 540128 527037 514637 503241 493294 484950 477983 471987 466587 461544 456797
49971D56797m362l846l254k642k106j897k286l185m084m521m518m385m178l739
$$ 456797 452435 448589 445335 442693 440587 438690 436404 433219 429135 424614 420096 415711 411533 407794
49957D07794l120k726k873l395l836l897l603l121k611k274k329k777l195k971
$$ 407794 404674 401948 399075 395680 391844 387947 384344 381223 378612 376338 374009 371232 368037 365066
49943C65066j948p31j74n06j095j071j02J462K885L458K981K041J627K160L097
$$ 365066 363118 362387 362213 361707 360612 359541 359439 360901 363786 367244 370225 372266 373893 376053 379150
49928C79150L697L914M187M626M923M982N098N470N985O587P400Q361R244J0244
$$ 379150 382847 386761 390948 395574 400497 405479 410577 416047 422032 428619 436019 444380 453624 463868
49914D63868J1999J4700J7624J9981K1801K3511K4991K5673K5427K4687K3717
$$ 463868 475867 490567 508191 528172 549973 573484 598475 624148 649575 674262 697979
49903F97979K2379K0711J9164J8105J7490J7268J7633J8570J9481J9739J9248
$$ 697979 720358 741069 760233 778338 795828 813096 830729 849299 868780 888519 907767
49892I07767J8133J6068J2469P338J466m319r784j5057k0085k4566k8243l1010
$$ 907767 925900 941968 954437 961775 963241 958922 949138 934081 913996 889430 861187 830177
49880H30177l2732l3248l2620l1238k9624k8176k7099k6429k5933k5102k3577
$$ 830177 797445 764197 731577 700339 670715 642539 615440 589011 563078 537976 514399
49869E14399k1581j9710j8172j6502j4273j1797r794q468p367o176n149m540m100
$$ 514399 492818 473108 454936 438434 424161 412364 402570 394102 386735 380559 375410 370870 366770
49856C66770l491k912k789l017l012k626k463l056m043m566m359l963l873l822
$$ 366770 363279 360367 357578 354561 351549 348923 346460 343404 339361 334795 330436 326473 322600 318778
49842C18778l248k230j542j713k414k963l108l011k678j965j113o94q23r15n23
$$ 318778 315530 313300 311758 310045 307631 304668 301560 298549 295871 293906 292793 292099 291276 290361 289838
49827B89838QJ44M5K62P95J096R35O47N28N75Q63J505K102J994J350J187J834
$$ 289838 289846 289990 290035 290297 291092 292188 293123 293770 294298 294873 295736 297241 299343 301337 302687 303874 305708
49810C05708K218J452M25O85K155L228L087K655K942L644M021M117M274M232L691
$$ 305708 307926 309378 309803 310488 312643 315871 318958 321613 324555 328199 332220 336337 340611 344843 348534
49795C48534L340M235O328Q539J0227J1737J3442J5129J6618J8159J9805K0889
$$ 348534 351874 356109 362437 370976 381203 392940 406382 421511 438129 456288 476093 496982
49783D96982K0673J9152J6883J4368J1929R874Q409P538P293P775Q748R528R628
$$ 496982 517655 536807 553690 568058 579987 589861 598270 605808 613101 620876 629624 639152 648780
49770F48780R243Q701P692N450J590l517r147j4574j9251k2919k5546k6997k7020
$$ 648780 658023 666724 674416 679866 681456 677939 668792 654218 634967 612048 586502 559505 532485
49757E32485k5791k4098k2541k0823j8364j5359j2644j0654r167p928o840n681
$$ 532485 506694 482596 460055 439232 420868 405509 392865 382211 373044 365116 358276 352595
49745C52595m352l434l593m289m012k185J1J130J060O44M39O28J412K602L266
$$ 352595 348243 344809 341216 336927 332915 330730 330741 331871 332931 333575 334014 334642 336054 338656 341922
49730C41922K701J462O25K86k43r97j180n41J47K53P7J23K82K85K80M72N53J24
$$ 341922 344623 346085 346710 346996 346753 345756 344576 344035 344182 344435 344512 344635 344917 345202 345482 345954 346507 346631
49712C46631n87r44o75j27K58M24O59J196J820J947J229J13n49l94K33Q80J386
$$ 346631 346044 345100 344425 344298 344556 344980 345639 346835 348655 350602 351831 351944 351395 351001 351234 352114 353500
49695C53500J619J440J082J025J273J219O49K66P06J516J703J025J68k25r5K80
$$ 353500 355119 356559 357641 358666 359939 361158 361807 362073 362779 364295 365998 367023 367191 366966 366871 367151
49679C67151N85N06m5p18j030r39p20m42O8P74J348J546J368R51N33M57P57R49
$$ 367151 367736 368242 368197 367479 366449 365510 364790 364348 364416 365190 366538 368084 369452 370403 370936 371393 372150 373099
49661C73099O34K67O77J839K696K458J544R13R08J183J379J464J468J284Q05J04
$$ 373099 373733 374000 374677 376516 379212 381670 383214 384127 385035 386218 387597 389061 390529 391813 392618 392722
49645C92722n83j017j134j008o58j0P50J054N58k32l89L31J233J583J381J090
$$ 392722 392139 391122 389988 388980 388322 388312 389062 390116 390674 390442 390053 390384 391617 393200 394581 395671
49629C95671R81J038J145J179J089R94J023J000P19M81Q88J922K784K942K781
$$ 395671 396652 397690 398835 400014 401103 402097 403120 404120 404839 405320 406208 408130 410914 413856 416637
49614D16637K868L109L205L373L988M782N183N216N394N832O180O438P012P915
$$ 416637 419505 422614 425819 429192 433180 437962 443145 448361 453755 459587 465767 472205 479217 487132
49600D87132Q551Q549Q260Q149Q259Q499Q996R759J0476J0975J1557J2477J3379
$$ 487132 495683 504232 512492 520641 528900 537399 546395 556154 566630 577605 589162 601639 615018
49587F15018J3740J3638J3698J4320J5311J6237J6887J7394J8120J9330K0856
$$ 615018 628758 642396 656094 670414 685725 701962 718849 736243 754363 773693 794549
49576G94549K2204K3126K3901K4803K5631K6050K6263K6837K7880K8858K9324
$$ 794549 816753 839879 863780 888583 914214 940264 966527 993364 1021244 1050102 1079426
49565A079426K9495K9879L0559L1103L1090L0542K9834K9165K8286K6851K5047
$$ 1079426 1108921 1138800 1169359 1200462 1231552 1262094 1291928 1321093 1349379 1376230 1401277
49554A401277K3515K2504K1402J9457J6775J4037J1435Q527N162J896q32l222
$$ 1401277 1424792 1447296 1468698 1488155 1504930 1518967 1530402 1538929 1544091 1545987 1545155 1541933
49542A541933n419o927p370p399q050r313j0187j0102r527q972q202o790m884
$$ 1541933 1536514 1529587 1522217 1514818 1506768 1497455 1487268 1477166 1467639 1458667 1450465 1443675 1438791
49529A438791k902q92J306L570N627P533R539J1653J3680J5604J7531J9348K0791
$$ 1438791 1435889 1434997 1436303 1439873 1445500 1453033 1462572 1474225 1487905 1503509 1521040 1540388 1561179
49516A561179K1783K2355K2393K1834K1039K0480K0061J9097J7087J4164J0739
$$ 1561179 1582962 1605317 1627710 1649544 1670583 1691063 1711124 1730221 1747308 1761472 1772211
49505A772211P117L511K7l504p319j1296j5059j8502k1801k4818k7062k8504k9882
$$ 1772211 1779328 1782839 1782866 1779362 1772043 1760747 1745688 1727186 1705385 1680567 1653505 1625001 1595119
$$ [...]
##END NTUPLES=NMR SPECTRUM
##END=
