##TITLE=coffee_type TORI02-ROVE100A-50-50
COFFEE_meoh_noesyp64 COFFEE_meoh {C:\Bruker\TOPSPIN} Administrator 7
##JCAMPDX= 6.0         $$ Bruker NMR JCAMP-DX V2.0
##DATA TYPE= NMR SPECTRUM
##DATA CLASS= NTUPLES
##ORIGIN= Bruker BioSpin GmbH
##OWNER= Administrator
$$ 1.72 TOPSPIN		Version 2.1
$$ 2012-05-29 13:27:02.392 -0700  Administrator@X
$$ Compression mode = diff/dup
##.OBSERVE FREQUENCY= 400.13188235
##.OBSERVE NUCLEUS= ^1H
##.ACQUISITION MODE= SIMULTANEOUS (DQD)
##.ACQUISITION SCHEME= undefined
##.AVERAGES= 64
##.DIGITISER RES= 22
##SPECTROMETER/DATA SYSTEM= spect
##.PULSE SEQUENCE= noesygpps1d.comp
##.SOLVENT NAME= COFFEE_meoh
##.SHIFT REFERENCE= INTERNAL, COFFEE_meoh, 1, 14.98061
##AUDIT TRAIL= $$ (NUMBER, WHEN, WHO, WHERE, PROCESS, VERSION, WHAT)
$$ ##TITLE= Audit trail, TOPSPIN		Version 2.1
$$ ##JCAMPDX= 5.01
$$ ##ORIGIN= Bruker BioSpin GmbH
$$ ##OWNER= Administrator
$$ $$ Z:/data/jwist/nmr/12-COFFEE-0203/92/pdata/1/auditp.txt
$$ ##AUDIT TRAIL=  $$ (NUMBER, WHEN, WHO, WHERE, PROCESS, VERSION, WHAT)
(   1,<2012-03-02 22:34:51.990 -0500>,<Administrator>,<TOPSPIN>,<go>,<TOPSPIN 2.1>,
      <created by zg
	started at 2012-03-02 22:23:21.678 -0500,
	POWCHK enabled, PULCHK disabled,
       configuration hash MD5:
       1A 1E CE 29 27 FD 77 03 67 4E F0 E3 C4 B2 CB 90
       data hash MD5: 64K
       1C A9 AA 41 50 9D C5 EA 8A 30 C4 4D 05 DC A4 DC>)
(   2,<2012-03-02 22:34:56.740 -0500>,<Administrator>,<TOPSPIN>,<audit>,<TOPSPIN 2.1>,
      <user comment:
       ICON-NMR User ID: Administrator
       data hash MD5: 64K
       1C A9 AA 41 50 9D C5 EA 8A 30 C4 4D 05 DC A4 DC>)
(   3,<2012-05-29 09:24:23.534 -0700>,<Administrator>,<X>,<proc1d>,<TOPSPIN 2.1>,
      <Start of raw data processing
       efp LB = 0.3 FT_mod = 6 PKNL = 1 PHC0 = 0 PHC1 = 0 SI = 128K 
       data hash MD5: 128K
       6C B3 30 EC 08 5A 45 B7 07 BC 47 04 D7 21 A1 DF>)
(   4,<2012-05-29 09:24:24.081 -0700>,<Administrator>,<X>,<proc1d>,<TOPSPIN 2.1>,
      <pk PHC0 = 36.76025 PHC1 = 0 
       data hash MD5: 128K
       09 13 5F 42 74 FA CF BF 32 3D 8D 9F 13 FD A6 8A>)
(   5,<2012-05-29 09:24:25.472 -0700>,<Administrator>,<X>,<proc1d>,<TOPSPIN 2.1>,
      <abs ABSG = 1 
       data hash MD5: 128K
       EC F1 EF 0B 9A 10 38 04 A8 97 EF 87 B3 23 C2 AC>)
(   6,<2012-05-29 09:24:25.565 -0700>,<Administrator>,<X>,<proc1d>,<TOPSPIN 2.1>,
      <abs ABSG = 2 
       data hash MD5: 128K
       C0 9B DB E4 7A 93 4D 2C 00 DE 78 CC 57 0B EA 01>)
(   7,<2012-05-29 09:24:25.644 -0700>,<Administrator>,<X>,<proc1d>,<TOPSPIN 2.1>,
      <abs ABSG = 3 
       data hash MD5: 128K
       49 DC 25 43 8E 19 6A B3 2C D7 78 F3 8E C6 D7 3D>)
(   8,<2012-05-29 09:24:25.722 -0700>,<Administrator>,<X>,<proc1d>,<TOPSPIN 2.1>,
      <abs ABSG = 4 
       data hash MD5: 128K
       A4 6E 98 B9 BA 77 0E AE DD 14 06 5A 8E 88 42 1C>)
(   9,<2012-05-29 09:24:25.800 -0700>,<Administrator>,<X>,<proc1d>,<TOPSPIN 2.1>,
      <abs ABSG = 5 
       data hash MD5: 128K
$$ [...]
150 150 150 150 150 150 150 150
##$TP07= 0
##$TPNAME0= <>
##$TPNAME1= <>
##$TPNAME2= <>
##$TPNAME3= <>
##$TPNAME4= <>
##$TPNAME5= <>
##$TPNAME6= <>
##$TPNAME7= <>
##$TPOAL= (0..7)
0.5 0.5 0.5 0.5 0.5 0.5 0.5 0.5
##$TPOFFS= (0..7)
0 0 0 0 0 0 0 0
##$TUNHIN= 0
##$TUNHOUT= 0
##$TUNXOUT= 0
##$USERA1= <user>
##$USERA2= <user>
##$USERA3= <user>
##$USERA4= <user>
##$USERA5= <user>
##$V9= 5
##$VALIST= <valist>
##$VCLIST= <CCCCCCCCCCCCCCC>
##$VD= 0
##$VDLIST= <DDDDDDDDDDDDDDD>
##$VPLIST= <PPPPPPPPPPPPPPP>
##$VTLIST= <TTTTTTTTTTTTTTT>
##$WBST= 1024
##$WBSW= 4
##$XGAIN= (0..3)
0 0 0 0
##$XL= 0
##$YL= 0
##$YMAX_a= 13930385
##$YMIN_a= -6529637
##$ZGOPTNS= <>
##$ZL1= 120
##$ZL2= 120
##$ZL3= 120
##$ZL4= 120
##$ABSF1= 14.98061
##$ABSF2= -5.57192
##$ABSG= 5
##$ABSL= 3
##$ALPHA= 0
##$AQORDER= 0
##$ASSFAC= 0
##$ASSFACI= 0
##$ASSFACX= 0
##$ASSWID= 0
##$AUNMP= <proc_prof1d_extract>
##$AXLEFT= 0
##$AXNAME= <>
##$AXNUC= <1H>
##$AXRIGHT= 0
##$AXTYPE= 0
##$AXUNIT= <>
##$AZFE= 0.1
##$AZFW= 0.1
##$BCFW= 0
##$BC_mod= 0
##$BYTORDP= 0
##$COROFFS= 0
##$CY= 15
##$DATMOD= 1
##$DC= 0
##$DFILT= <>
##$DTYPP= 0
##$F1P= 0
##$F2P= 0
##$FCOR= 0.5
##$FTSIZE= 131072
##$FT_mod= 6
##$GAMMA= 0
##$GB= 0
##$INTBC= 1
##$INTSCL= 1
##$ISEN= 128
##$LB= 0.3
##$LEV0= 0
##$LPBIN= 0
##$MAXI= 10000
##$MC2= 0
##$MEAN= 0
##$ME_mod= 0
##$MI= 0
##$NCOEF= 0
##$NC_proc= -3
##$NLEV= 6
##$NOISF1= 0
##$NOISF2= 0
##$NSP= 0
##$NTH_PI= 0
##$NZP= 0
##$OFFSET= 14.98061
##$PC= 1
##$PHC0= 36.76025
##$PHC1= 0
##$PH_mod= 1
##$PKNL= yes
##$PPARMOD= 0
##$PPDIAG= 0
##$PPIPTYP= 0
##$PPMPNUM= 2147483647
##$PPRESOL= 1
##$PSCAL= 4
##$PSIGN= 0
##$PYNMP= <proc.py>
##$REVERSE= no
##$SF= 400.13
##$SI= 131072
##$SIGF1= 0
##$SIGF2= 0
##$SINO= 400
##$SIOLD= 131072
##$SPECTYP= <>
##$SREGLST= <1H.CDCl3>
##$SSB= 0
##$STSI= 131072
##$STSR= 0
##$SW_p= 8223.68421052632
##$SYMM= 0
##$S_DEV= 0
##$TDeff= 65536
##$TDoff= 0
##$TI= <>
##$TILT= no
##$TM1= 0
##$TM2= 0
##$TOPLEV= 0
##$USERP1= <user>
##$USERP2= <user>
##$USERP3= <user>
##$USERP4= <user>
##$USERP5= <user>
##$WDW= 1
##$XDIM= 131072
##$YMAX_p= 547576892
##$YMIN_p= -228291975
##$CURPLOT= <Network HP LaserJet P1505>
##$CURPRIN= <$Network HP LaserJet P1505>
##$DFORMAT= <normdp>
##$LAYOUT= <+/1D_H.xwp>
##$LFORMAT= <normlp>
##$PFORMAT= <normpl>
##$SURQMSG= 1
$$ End of Bruker specific parameters
$$ ---------------------------------
##NTUPLES= NMR SPECTRUM
##VAR_NAME=  FREQUENCY,     SPECTRUM/REAL,   SPECTRUM/IMAG
##SYMBOL=    X,             R,               I
##VAR_TYPE=  INDEPENDENT,   DEPENDENT,       DEPENDENT
##VAR_FORM=  AFFN,          ASDF,            ASDF
##VAR_DIM=   131072,        131072,          131072
##UNITS=     HZ,            ARBITRARY UNITS, ARBITRARY UNITS
##FACTOR=    0.0627417313425165, 1,          1
##FIRST=     8223.62146879498, -30,          -93427
##LAST=      0,             2423,            -94315
##MIN=       0,             -228291975,      0
##MAX=       8223.62146879498, 547576892,    0
$$ Real data points
##PAGE= N=1
##DATA TABLE= (X++(R..R)), XYDATA
$$ [...]
60739A091939Q01K149M092O777R143J0362J1491J3831J6441J7485J7235J7323
60727A219069J7593J6370J3624J1299J0469J0438J0554J0513R119N519J665P17
60715A336949K592L942L082K077K820L899K982L81j564j357N92K783L634K619
60701A365431Q98L0J26L25N79J210J149r97m105n147l201n54P53J115J322P93
60685A359727q13k227k340j929k307l443m512n196n502n338n043n299n967o137
60671A303674n698n545n780n372m264m159o233r316j1355j1572j0505r119q513
60658A206243r213j0025q866n483k174r76j505k324k985l614l837l517l642n138
60644A142944p353q847r168q955q760q843r631j1392j3472j4639j4335j3229j2413
$$ y = [1091939, 1092740, 1094889, 1098981, 1105758, 1114901, 1125263, 1136754, 1150585, 1167026, 1184511, 1201746, 1219069, 1236662, 1253032, 1266656, 1277955, 1288424, 1298862, 1309416, 1319929, 1329048, 1334567, 1336232, 1336949, 1339541, 1343483, 1346565, 1348642, 1351462, 1355361, 1358343, 1358724, 1357160, 1355803, 1356395, 1359178, 1362812, 1365431, 1366329, 1366359, 1366485, 1366810, 1367389, 1368599, 1369748, 1368751, 1364646, 1359499, 1356298, 1355744, 1356497, 1357612, 1358934, 1359727, 1358914, 1356687, 1354347, 1352418, 1350111, 1346668, 1342156, 1336960, 1331458, 1326120, 1321077, 1315778, 1309811, 1303674, 1297976, 1292431, 1286651, 1281279, 1277015, 1272856, 1266623, 1257307, 1245952, 1234380, 1223875, 1214756, 1206243, 1197030, 1187005, 1178139, 1172656, 1170482, 1169506, 1168001, 1165677, 1162692, 1159078, 1155241, 1151724, 1148082, 1142944, 1135591, 1126744, 1117576, 1108621, 1099861, 1091018, 1081387, 1069995, 1056523, 1041884, 1027549, 1014320, 1001907]
60631A001907j2180j1825j0806r892j0385j1977j2522j0696p883o253n904n431
60619H86153m543m229m594m576l838l132k581j250J190L889O194Q179R563R674
60605H96099Q806Q220Q368Q513Q480R241J1179J3057J3554J2875J2286J2717J4132
60592A037527J5563J5839J4910J4206J4873J6232J7073J7560J8314J8573J7383
60581A218053J5950J6243J7653J7634J5747J4163J3853J3147J1099R387R454R990
60569A382373Q956O369L529R75j370l299m913p175j0768j5059j8767k0858k0706
60556A299287j8621j6322j5426j5306j4029j1456r323q119o270l058lJ717K948
60543A186019M687O566Q289J0547J3271J4976J4976J4377J3658J1443P175K999
$$ y = [1001907, 989727, 977902, 967096, 957204, 946819, 934842, 922320, 911624, 903741, 897488, 891584, 886153, 881610, 877381, 872787, 868211, 864373, 861241, 858660, 857410, 858600, 862489, 868683, 876862, 886425, 896099, 904905, 913125, 921493, 930006, 938486, 947727, 958906, 971963, 985517, 998392, 1010678, 1023395, 1037527, 1053090, 1068929, 1083839, 1098045, 1112918, 1129150, 1146223, 1163783, 1182097, 1200670, 1218053, 1234003, 1250246, 1267899, 1285533, 1301280, 1315443, 1329296, 1342443, 1353542, 1362929, 1372383, 1382373, 1391329, 1397698, 1401227, 1402202, 1400832, 1397533, 1392620, 1385445, 1374677, 1359618, 1340851, 1319993, 1299287, 1280666, 1264344, 1248918, 1233612, 1219583, 1208127, 1198804, 1190685, 1184415, 1181357, 1181354, 1183071, 1186019, 1190706, 1197272, 1205561, 1216108, 1229379, 1244355, 1259331, 1273708, 1287366, 1298809, 1305984, 1308983]
60531A308983J173J228J414J413J992L268M877O728Q311Q544P440O492O361N868
60517A374092M421L336L366L002J031j161j991k524m604p636r732j0936j2762
60504A337902j5210j6572j5944j4087j2087j0522r580q767p164m820k977k024
60492A218148p50J331K817L106M245P884J2219J4505J5159J6684J9682K2832K6049
60479A363911L0550L6074M0945M5064N0211N6955O3638O9073P4284Q0846Q8779
60468B000330R6501J01611J01587R5126Q3125O7511M9409K9624J0358n308j5714
60457B614160k1221k2810k1340j7855j2952o125K713J1296J6463J7605J6958J6214
60445B593106J4746J1709Q307O838Q387J2316J7503K3490L0618L9318M9287N9779
$$ y = [1308983, 1310156, 1311384, 1312798, 1314211, 1316203, 1319471, 1324348, 1331076, 1339387, 1347931, 1355371, 1361863, 1368224, 1374092, 1378513, 1381849, 1385215, 1388217, 1389248, 1388087, 1386096, 1383572, 1378968, 1371332, 1361600, 1350664, 1337902, 1322692, 1306120, 1290176, 1276089, 1264002, 1253480, 1243900, 1235133, 1227969, 1223149, 1220172, 1218148, 1217398, 1218729, 1221546, 1224652, 1228897, 1236781, 1249000, 1263505, 1278664, 1295348, 1315030, 1337862, 1363911, 1394461, 1430535, 1471480, 1516544, 1566755, 1623710, 1687348, 1756421, 1830705, 1911551, 2000330, 2096831, 2198442, 2300029, 2395155, 2478280, 2545791, 2595200, 2624824, 2635182, 2629874, 2614160, 2592939, 2570129, 2548789, 2530934, 2517982, 2511857, 2514570, 2525866, 2542329, 2559934, 2576892, 2593106, 2607852, 2619561, 2627868, 2634706, 2643093, 2655409, 2672912, 2696402, 2727020, 2766338, 2815625, 2875404]
60433B875404P0833Q3446R7903J12858J26945J40491J54385J68026J79928J90009
60423D200228J99774K10378K22077K35697K53259K76575L06131L41632L82859
60414F628610M29434M79945N31263N78267O14129O30821O19509N71746M82885
60405A1566609L55707K00070K8305j47904l16150m62076n73185o44469o79280
60396I327627o85242o70275o41048o02414n57491n09068m60660m15064l72601
60387D413764l32311k94589k61181k32743k07906j84933j63346j43942j28012
60378B464801j16171j07180r8380q8278p8053o9747o3736n9145n5499n2508m9144
60367A626960m4803m0594l7732l5340l1971k8528k7321k8259k8502k6140k2161
$$ y = [2875404, 2946237, 3029683, 3127586, 3240444, 3367389, 3507880, 3662265, 3830291, 4010219, 4200228, 4400002, 4610380, 4832457, 5068154, 5321413, 5597988, 5904119, 6245751, 6628610, 7058044, 7537989, 8069252, 8647519, 9261648, 9892469, 10511978, 11083724, 11566609, 11922316, 12122386, 12150691, 12002787, 11686637, 11224561, 10651376, 10006907, 9327627, 8642385, 7972110, 7331062, 6728648, 6171157, 5662089, 5201429, 4786365, 4413764, 4081453, 3786864, 3525683, 3292940, 3085034, 2900101, 2736755, 2592813, 2464801, 2348630, 2241450, 2143070, 2054792, 1976739, 1906992, 1843256, 1784111, 1728612, 1676104, 1626960, 1582157, 1541563, 1503831, 1468491, 1436520, 1407992, 1380671, 1352412, 1323910, 1297770, 1275609]
60356A275609j8393j5606j4185j4535j5735j5538j3004j0013q965r825j0480r455
60344A119875p336n649n057m848l989k449j114m72j25J93J36k01K8Q50Q27o59
60328A090010j668o9L273N471N295L902K345N38j270k153k162k655m321o271p479
60313A082786p926p894p320o302n228m078k553j115q12j762k695k373p92J099
60299A033035K178J800M27n12q5J060J799K116K608L039K807K447L132M750N911
60284A066512N967N751O124O845P044O135M406L250M198O852Q682Q031O266N527
60270A151590N484M469K843K606M023N308N878P239J0033J2589J3303J2475J0815
60257A248655Q107M478J296n26j927m114o719q565r450j0029j0530j0531r695
$$ y = [1275609, 1257216, 1241610, 1227425, 1212890, 1197155, 1181617, 1168613, 1158600, 1149635, 1139810, 1129330, 1119875, 1112539, 1106890, 1101833, 1096985, 1092996, 1090547, 1089433, 1088961, 1088836, 1089029, 1089165, 1088964, 1088992, 1089842, 1090669, 1090010, 1088342, 1088273, 1091546, 1097017, 1102312, 1106214, 1108559, 1109097, 1107827, 1105674, 1103512, 1100857, 1096536, 1090265, 1082786, 1074860, 1066966, 1059646, 1053344, 1048116, 1044038, 1041485, 1040370, 1039558, 1037796, 1035101, 1032728, 1031936, 1033035, 1035213, 1037013, 1037440, 1036928, 1036843, 1037903, 1039702, 1041818, 1044426, 1047465, 1050272, 1052719, 1055851, 1060601, 1066512, 1072479, 1078230, 1084354, 1091199, 1098243, 1104378, 1108784, 1112034, 1116232, 1123084, 1131766, 1139797, 1146063, 1151590, 1157074, 1161543, 1164386, 1166992, 1171015, 1176323, 1182201, 1189440, 1199473, 1212062, 1225365, 1237840, 1248655, 1256762, 1261240, 1262536, 1262010, 1260083, 1255969, 1249250, 1240685, 1231235, 1221206, 1210676, 1200145, 1190450]
60244A190450q083o009l890k034m90O31J023Q37R53J794K498K229J692K079L044
60229A186724L228K350J281L90m13m49J012K974L763L780N018P672R608R861J0112
60214A246911J1688J3321J3399J2625J2637J3330J3419J2805J2666J3533J4639
60203A390973J5307J5968J7564K0312K3354K5699K7475K9835L3321L7038M0129
60192A676975M3243M7378N1995N5798N8978O3087O8686P4725Q0345Q5921R2155
60181B399286R9264J07034J14646J20849J25462J30104J35747J40365J41082J38136
60171C651975J34195J30036J23648J13956J02499R0641P7796O3595M9457L6466
60161D574264K3786J0617j963j2612k1509k9045l4214l5867l4465l1175k6194
$$ y = [1190450, 1182367, 1176358, 1172468, 1170434, 1169944, 1170575, 1171598, 1172435, 1173388, 1175182, 1177680, 1179909, 1181601, 1183680, 1186724, 1189952, 1192302, 1193583, 1193973, 1193560, 1193111, 1194123, 1197097, 1200860, 1204640, 1209658, 1217330, 1226938, 1236799, 1246911, 1258599, 1271920, 1285319, 1297944, 1310581, 1323911, 1337330, 1350135, 1362801, 1376334, 1390973, 1406280, 1422248, 1439812, 1460124, 1483478, 1509177, 1536652, 1566487, 1599808, 1636846, 1676975, 1720218, 1767596, 1819591, 1875389, 1934367, 1997454, 2066140, 2140865, 2221210, 2307131, 2399286, 2498550, 2605584, 2720230, 2841079, 2966541, 3096645, 3232392, 3372757, 3513839, 3651975, 3786170, 3916206, 4039854, 4153810, 4256309, 4346950, 4424746, 4488341, 4537798, 4574264, 4598050, 4608667, 4606704, 4594092, 4572583, 4543538, 4509324, 4473457, 4438992, 4407817, 4381623]
60150D381623j9212j0721j578Q084J8648L0365M3400N7617P1863Q4479R5165J05316
60138D865049J15973J26359J34743J39553J39555J34458J25846J15931J04830
60129F002297R0598P2516N2678L3589J5777j406j8328l5231n2150o7581p8777
60118F013982q4448q5974q5028q1521p4723o4794n2048l6370j8467k08J7543L5843
60106E483787N5199P3712Q9148J01362J11120J17789J19873J16831J08953R6427
60096F474201Q0060O1907M3702K5537P321r438k2865l2840m0351m5332m6678m3922
60084F451302l7593k8217j5957r58J6748L7201N9659Q2510J04754J26917J49896
60073F946262J73797J98530K24545K52061K80444L09017L37534L65112L89810
$$ y = [4381623, 4362411, 4351690, 4350112, 4358196, 4376844, 4407209, 4450609, 4508226, 4580089, 4664568, 4759733, 4865049, 4981022, 5107381, 5242124, 5381677, 5521232, 5655690, 5781536, 5897467, 6002297, 6092895, 6165411, 6218089, 6251678, 6267455, 6266049, 6247721, 6212490, 6160340, 6092759, 6013982, 5929534, 5843560, 5758532, 5677011, 5602288, 5537494, 5485446, 5449076, 5430609, 5430401, 5447944, 5483787, 5538986, 5612698, 5701846, 5803208, 5914328, 6032117, 6151990, 6268821, 6377774, 6474201, 6554261, 6616168, 6659870, 6685407, 6692728, 6683290, 6660425, 6627585, 6587234, 6541902, 6495224, 6451302, 6413709, 6385492, 6369535, 6368577, 6385325, 6422526, 6482185, 6564695, 6669449, 6796366, 6946262, 7120059, 7318589, 7543134, 7795195, 8075639, 8384656, 8722190, 9087302, 9477112]
60064I477112M10083M25801M37029M42672M41028M30900M11847L84431L50372
60055A3211275L11123K66261K14985J59135J02310M5582j3023p3757j32911j87087
60045A3903893k36692k82678l22305l51222l68232l75133l73122l62277l43705
60036A0888527l19375k90146k56247k19201j81038j42088j01770o1261k3249J0865
60026I305017M1639O9645R4459J15300J30991J39688J40207J33273J19978R9775
60016A0389972P2028L8936M808k7624n8325q7557j14260j37128j55799j70667
60006I754384j82571j92498k00554k05549k06694k05113k02329j98025j90934
59997G970117j81272j70328j58051j43123j25411j06374q6844o6351m4959k3921
$$ y = [9477112, 9887195, 10312996, 10750025, 11192697, 11633725, 12064625, 12476472, 12860903, 13211275, 13522398, 13788659, 14003644, 14162779, 14265089, 14310671, 14297648, 14223891, 14090980, 13903893, 13667201, 13384523, 13062218, 12710996, 12342764, 11967631, 11594509, 11232232, 10888527, 10569152, 10279006, 10022759, 9803558, 9622520, 9480432, 9378662, 9317401, 9294152, 9305017, 9346656, 9416301, 9510760, 9626060, 9757051, 9896739, 10036946, 10170219, 10290197, 10389972, 10462000, 10500936, 10505744, 10478120, 10419795, 10332238, 10217978, 10080850, 9925051, 9754384, 9571813, 9379315, 9178761, 8973212, 8766518, 8561405, 8359076, 8161051, 7970117, 7788845, 7618517, 7460466, 7317343, 7191932, 7085558, 6998714, 6932363, 6887404, 6863483]
59987F863483l847J6234L7015N7338P5235Q9868J01759J11588J19105J22869J21002
59976G711649J12719R9097Q2077O2892M1844J8984n616l1650n7878q2200j03293
59965G848625j21614j37882j51301j60397j64861j65262j61381j52457j39089
59956F494381j23440j07135q9979p1224n1276l1596j3146M561K2739M1747O0704
59945F136336P8841R6590J14663J32737J50115J66745J81941J92936J97111J95378
59935G643393J90508J82041J66327J42555J15138Q8120O0646L0585m84k9315n5800
59924H533714q1824j06632j27085j41779j51552j56340j54989j48299j39139j28966
59914G197109j16631j01054q2785o2625m0804j8139L820K4320M3753O2252P9333
$$ y = [6863483, 6859636, 6875870, 6912885, 6970223, 7045458, 7135326, 7237085, 7348673, 7467778, 7590647, 7711649, 7824368, 7923465, 8005542, 8068434, 8110278, 8129262, 8123646, 8091996, 8034118, 7951918, 7848625, 7727011, 7589129, 7437828, 7277431, 7112570, 6947308, 6785927, 6633470, 6494381, 6370941, 6263806, 6173827, 6102603, 6051327, 6019731, 6006585, 6011146, 6033885, 6075632, 6136336, 6215177, 6311767, 6426430, 6559167, 6709282, 6876027, 7057968, 7250904, 7448015, 7643393, 7833901, 8015942, 8182269, 8324824, 8439962, 8528082, 8588728, 8619313, 8618829, 8589514, 8533714, 8451890, 8345258, 8218173, 8076394, 7924842, 7768502, 7613513, 7465214, 7326075, 7197109, 7080478, 6979424, 6896639, 6834014, 6793210, 6775071, 6778891, 6803211, 6846964, 6909216, 6988549]
59903F988549R4797J08648J20209J28681J34276J37470J37565J33626J26393J17569
59893H227783J07658R6157Q3483P1048N9755N0062M2883L8739L6634L5890L8451
59882H888543M7130O1938Q0474J01703J26827J56280J88254K20898K54080K88379
59872A0414506L23732L59226L92855M21546M42801M55914M60084M52013M27559
59863A4150236L85510L27690K55943J71676P8387j7959j11760j99029k75981l39019
59853A4425694l86844m20458m40528m46814m40603m25337m03696l76026l42678
59844A0742710l06087k69147k32694j95732j57388j17950p8787m1559o914K5995
59834I362447N7871Q7594J13316J34582J51772J63859J68631J64973J53115J32713
$$ y = [6988549, 7083346, 7191994, 7312203, 7440884, 7575160, 7712630, 7850195, 7983821, 8110214, 8227783, 8335441, 8431598, 8515081, 8586129, 8645884, 8695946, 8738829, 8777568, 8814202, 8850092, 8888543, 8935673, 8997611, 9078085, 9179788, 9306615, 9462895, 9651149, 9872047, 10126127, 10414506, 10738238, 11097464, 11490319, 11911865, 12354666, 12810580, 13270664, 13722677, 14150236, 14535746, 14863436, 15119379, 15291055, 15369442, 15351483, 15239723, 15040694, 14764713, 14425694, 14038850, 13618392, 13177864, 12731050, 12290447, 11865110, 11461414, 11085388, 10742710, 10436623, 10167476, 9934782, 9739050, 9581662, 9463712, 9384925, 9343366, 9336452, 9362447, 9420318, 9507912, 9621228, 9755810, 9907582, 10071441, 10240072, 10405045, 10558160, 10690873]
59824A0690873J02714O3349J6582l5445r0602j45509j96104k40014k76908l06495
59814I582441l27817l40557l45428l43328l35554l24393l11516k96109k76708
59805F681031k54479k32461k11746j90973j69587j48981j30175j12908r7385q4621
59795E047715p4653o6602o0648n7501n5919n3476m9971m7308m5613m2531l6973
59784D456520l0504k4303j7844j1565p678p050q286j1113j7413k7170l6670m2976
59772D213948m7423n2378n7073n9218n8527n6061n1982m6554m1598l8269l4625
59761C670240k7956j8673r550j963N117J3020K2207L2664M3836N4466O3520P0716
59749C917644P5562P7235P6379P5393P5657P5952P4971P3463P1943O8043N8828
$$ y = [10690873, 10793587, 10856936, 10873518, 10838073, 10747471, 10601962, 10405858, 10165844, 9888936, 9582441, 9254624, 8914067, 8568639, 8225311, 7889757, 7565364, 7253848, 6957739, 6681031, 6426552, 6194091, 5982345, 5791372, 5621785, 5472804, 5342629, 5229721, 5132336, 5047715, 4973062, 4906460, 4845812, 4788311, 4732392, 4678916, 4628945, 4581637, 4536024, 4493493, 4456520, 4426016, 4401713, 4383869, 4372304, 4364626, 4357576, 4349290, 4338177, 4320764, 4293594, 4256924, 4213948, 4166525, 4114147, 4057074, 3997856, 3939329, 3883268, 3831286, 3784732, 3743134, 3704865, 3670240, 3642284, 3623611, 3614061, 3612098, 3617215, 3630235, 3652442, 3685106, 3728942, 3783408, 3846928, 3917644, 3993206, 4070441, 4146820, 4222213, 4297870, 4373822, 4448793, 4522256, 4594199, 4662242, 4721070]
59738D721070M5019L0694J9151J0961N670L270L723O579J1538J8661K7960L9393
59726D943689N2947O8282Q4717J02120J21096J41959J64182J87454K12307K39074
59716F317827K66989K94997L22681L49697L74847L95791M08496M06518L82302
59707I520145L30812K52596J54124M6373n7676j46933k15574k62721k89487k97825
59697I033834k91686k76548k56418k32531k05323j76016j45741j14925q4425n5703
59687G194518k9362m844J8149L9732O1336Q4853J09848J33903J56272J78740K02322
59676H145467K26009K49765K75717L04732L34555L63296L92391M24147M58661
59667A1174740M95128N33989N75337O17094O57137O95784P34002P70529Q02580
$$ y = [4721070, 4766089, 4796783, 4815934, 4826895, 4832565, 4835835, 4839558, 4846137, 4857675, 4876336, 4904296, 4943689, 4996636, 5064918, 5149635, 5251755, 5372851, 5514810, 5678992, 5866446, 6078753, 6317827, 6584816, 6879813, 7202494, 7552191, 7927038, 8322829, 8731325, 9137843, 9520145, 9850957, 10103553, 10257677, 10304050, 10246374, 10099441, 9883867, 9621146, 9331659, 9033834, 8742148, 8465600, 8209182, 7976651, 7771328, 7595312, 7449571, 7334646, 7250221, 7194518, 7165156, 7160312, 7178461, 7218193, 7279529, 7364382, 7474230, 7608133, 7764405, 7943145, 8145467, 8371476, 8621241, 8896958, 9201690, 9536245, 9899541, 10291932, 10716079, 11174740, 11669868, 12203857, 12779194, 13396288, 14053425, 14749209, 15483211, 16253740, 17056320]
59658A7056320Q28001Q44891Q50837Q44608Q27533Q01633P68128P29621O91948
59649B4243520O61343O40729O30198O29364O37012O49966O64609O78434O88247
59640C0123422O88497O73794O42241N94422N30544M50842L57923K56752J53239
59631C4471676N4085l3892j06475j62951k02763k23288k23069k04872j72642j27154
59621C3068655o7816K945Q0728J63668K52399L46206M42516N39772O37215P31671
59611C6197959Q17564Q90359R47043R82724R89463R59344Q86987P69150O04929
59602D4045522L97939J57290j04023l70868o27090q57674j051344j201056j303336
59593C9085360j359060j374212j357367j315765j254882j181161j103112j029732
$$ y = [17056320, 17884321, 18729212, 19580049, 20424657, 21252190, 22053823, 22821951, 23551572, 24243520, 24904863, 25545592, 26175790, 26805154, 27442166, 28092132, 28756741, 29435175, 30123422, 30811919, 31485713, 32127954, 32722376, 33252920, 33703762, 34061685, 34318437, 34471676, 34525761, 34491869, 34385394, 34222443, 34019680, 33796392, 33573323, 33368451, 33195809, 33068655, 33000839, 33003784, 33084512, 33248180, 33500579, 33846785, 34289301, 34829073, 35466288, 36197959, 37015523, 37905882, 38852925, 39835649, 40825112, 41784456, 42671443, 43440593, 44045522, 44443461, 44600751, 44496728, 44125860, 43498770, 42641096, 41589752, 40388696, 39085360, 37726300, 36352088, 34994721, 33678956, 32424074, 31242913, 30139801, 29110069]
59585B9110069r69356r29563r15576r27455r59275j000838j040116j066129j072525
59576B0229236j059121j029264r86329r33572q75386q15967p57040o98784o42387
59567A2431386n89612n40467m93621m49041m08133l71383l37683l06012k76247
59558H659187k48610k23786k02846j85441j68869j51075j33848j20826j12869
59549G111017j07781j04066j02315j02827j04559j06926j10562j15637j21090
59540F135254j25796j29137j30477j29589j27309j24141j18770j09902r9134q9706
59530D951293q2464p5258o6344n6258m6256l6922k8461k0554j1917j956P349J3349
59518D545601J6548K0092K5363L0512L3833L6109L8677M1354M3412M5059M6818
$$ y = [29110069, 28140713, 27211150, 26295574, 25368119, 24408844, 23408006, 22367890, 21301761, 20229236, 19170115, 18140851, 17154522, 16220950, 15345564, 14529597, 13772557, 13073773, 12431386, 11841774, 11301307, 10807686, 10358645, 9950512, 9579129, 9241446, 8935434, 8659187, 8410577, 8186791, 7983945, 7798504, 7629635, 7478560, 7344712, 7223886, 7111017, 7003236, 6899170, 6796855, 6694028, 6589469, 6482543, 6371981, 6256344, 6135254, 6009458, 5880321, 5749844, 5620255, 5492946, 5368805, 5250035, 5140133, 5040999, 4951293, 4868829, 4793571, 4727227, 4670969, 4624713, 4587791, 4559330, 4538776, 4526859, 4524903, 4532252, 4545601, 4562149, 4582241, 4607604, 4638116, 4671949, 4708058, 4746735, 4788089, 4831501, 4876560, 4923378]
59507D923378M8714N0878N4021N8810O5578P4584Q5376R6092J04995J12819J22227
59496E797472J34765J49682J65694J82321J99377K16538K33740K50960K67708
59487G598257K83702K99485L15028L28397L37513L42549L44815L43798L37410
59478A0530954L24932L07721K87292K64453K39871K13423J83584J49806J15009
59469A2617045Q3345N5922L1348R847o406j6958k3395k5418k0038n993J3990L6743
59457A2750032O1766Q9250J17470J43828J66298J82103J86909J77476J54015J18481
59447A4147628P1859J4631n1321j22694j95857k66895l31613l86792m30961m63264
59437A1984721m82557m88382m82132m66390m43600m15725l84473l51404l18179
$$ y = [4923378, 4972092, 5022970, 5076991, 5135801, 5201379, 5275963, 5361339, 5457431, 5562426, 5675245, 5797472, 5932237, 6081919, 6247613, 6429934, 6629311, 6845849, 7079589, 7330549, 7598257, 7881959, 8181444, 8496472, 8824869, 9162382, 9504931, 9849746, 10193544, 10530954, 10855886, 11163607, 11450899, 11715352, 11955223, 12168646, 12352230, 12502036, 12617045, 12700390, 12756312, 12787660, 12797507, 12791101, 12774143, 12750748, 12725330, 12705292, 12699299, 12713289, 12750032, 12811798, 12901048, 13018518, 13162346, 13328644, 13510747, 13697656, 13875132, 14029147, 14147628, 14219487, 14234118, 14182797, 14060103, 13864246, 13597351, 13265738, 12878946, 12447985, 11984721, 11502164, 11013782, 10531650, 10065260, 9621660, 9205935, 8821462, 8470058, 8151879]
59428H151879k86472k56791k27691j97503j66863j38202j12701q9106o5688m1990
59418F568872j8453M433K6326M7424O8758R1088J13743J35542J56323J76304J94624
59407G564984K10280K23938K36738K47636K53949K54221K48286K34831K11595
59398I686458J78447J37891R1934M0737j4959p2161j27291j77916k22306k59049
59388I261785k87853l09314l23439l29814l29361l24307l16100l04858k90833
59379F445906k74744k56870k37730k19457k04165j90906j76624j60305j43877
59370D581228j28831j14693j01305q9831q0414p1227o0988n0548m1036l2327k4151
59359C785877j6904j0527m172K447Q857J5144K1819K8499L4639M0998M7773N1791
$$ y = [8151879, 7865407, 7608616, 7380925, 7183422, 7016559, 6878357, 6765656, 6676550, 6610862, 6568872, 6550419, 6554852, 6581178, 6628602, 6697360, 6788448, 6902191, 7037733, 7194056, 7370360, 7564984, 7775264, 7999202, 8235940, 8483576, 8737525, 8991746, 9240032, 9474863, 9686458, 9864905, 10002796, 10094730, 10135467, 10120508, 10048347, 9921056, 9743140, 9520834, 9261785, 8973932, 8664618, 8341179, 8011365, 7682004, 7357697, 7041597, 6736739, 6445906, 6171162, 5914292, 5676562, 5457105, 5252940, 5062034, 4885410, 4725105, 4581228, 4452397, 4337704, 4236399, 4146568, 4066154, 3994927, 3933939, 3883391, 3842355, 3810028, 3785877, 3768973, 3758446, 3754274, 3756721, 3765578, 3780722, 3802541, 3831040, 3865679, 3906677, 3954450, 4006241]
59347D006241M9036M0370L1503K6812K6415K9794L7945N0294O3446P5306Q7326
59336D524488J00155J10213J13702J11956J10027J11634J17861J29059J45026
59327E574121J64063J84080K04523K26048K49238K74607L02647L32849L63974
59318G876150L96090M30827M68773N08312N47841N87118O25307O59719O87747
59309A2787884P08157P19332P18309P03236O75245O36879N90436N38935M86496
59300A8564909M36053L88124L42693L00376K60777K21859J82165J41450R8254
59291B0936660M9569n523o4398j24684j86762k50635l13078l70285m21186m65778
59281A8783900n02513n30069n49865n64081n72467n73482n67250n55251n38235
$$ y = [4006241, 4055277, 4095647, 4127150, 4153962, 4180377, 4210171, 4248116, 4298410, 4361856, 4437162, 4524488, 4624643, 4734856, 4848558, 4960514, 5070541, 5182175, 5300036, 5429095, 5574121, 5738184, 5922264, 6126787, 6352835, 6602073, 6876680, 7179327, 7512176, 7876150, 8272240, 8703067, 9171840, 9680152, 10227993, 10815111, 11440418, 12100137, 12787884, 13496041, 14215373, 14933682, 15636918, 16312163, 16949042, 17539478, 18078413, 18564909, 19000962, 19389086, 19731779, 20032155, 20292932, 20514791, 20696956, 20838406, 20936660, 20986229, 20980706, 20916308, 20791624, 20604862, 20354227, 20041149, 19670864, 19249678, 18783900, 18281387, 17751318, 17201453, 16637372, 16064905, 15491423, 14924173, 14368922, 13830687]
59272A3830687n16507m91161m63209m32665l99844l66131l32210k97548k63087
59263A0268325k31933k05372j80646j55177j30743j10729r5280q2274p1464o4396
59253H940311o1249o0761o2621o7339p4227q1680q8895r5520j00583j03660j05966
59242H037810j08341j09404j07596j03647r9004r3327q5858p7730p0278o2335
59232G120290n1870l9320k6702j4314q80J3791K8836M4295O0659P7019R2095J06533
59220G410432J22011J38540J54632J69574J83509J96036K06688K16020K24166
59211I021608K29085K28313K21791K10918J95627J74410J46700J13339P5454L4738
59201A0651983n937m4152p9548j12512j42635j70197j97359k25233k50783k69151
$$ y = [13830687, 13314180, 12823019, 12359810, 11927145, 11527301, 11161170, 10828960, 10531412, 10268325, 10036392, 9831020, 9650374, 9495197, 9364454, 9253725, 9158445, 9076171, 9004707, 8940311, 8879062, 8818301, 8755680, 8688341, 8614114, 8532434, 8443539, 8348019, 8247436, 8143776, 8037810, 7929469, 7820065, 7712469, 7608822, 7509818, 7416491, 7330633, 7252903, 7182625, 7120290, 7068420, 7029100, 7002398, 6988084, 6987204, 7000995, 7029831, 7074126, 7134785, 7211804, 7303899, 7410432, 7532443, 7670983, 7825615, 7995189, 8178698, 8374734, 8581422, 8797442, 9021608, 9250693, 9479006, 9700797, 9911715, 10107342, 10281752, 10428452, 10541791, 10617245, 10651983, 10646046, 10601894, 10522346, 10409834, 10267199, 10097002, 9899643, 9674410, 9423627, 9154476]
59191I154476k78275k79275k73729k63116k49815k35767k20709k03850j86272
59182F963668j69350j52205j33537j14700r7819q1856o3898m3774k3990n396J3605
59171F090748L3591N3270P2652R3922J18292J44511J71351J99314K29131K60437
59161G467219K92608L25173L57061L86808M13668M36908M54089M61597M56854
59152A1051985M38527M05194L55911K92023K16677J32581M1858n2256j45334k33204
59142A2503962l12007l77569m26719m59147m76451m79894m70705m51729m26742
59133H622999l98312l67743l36287l04852k73597k43518k17144j95523j75923
59124F110100j55027j33304j13615r6725q1087o6220n3100m1593l0387j9256q927
$$ y = [9154476, 8876201, 8596926, 8323197, 8060081, 7810266, 7574499, 7353790, 7149940, 6963668, 6794318, 6642113, 6508576, 6393876, 6296057, 6214201, 6150303, 6106529, 6082539, 6077143, 6090748, 6124339, 6177609, 6250261, 6344183, 6462475, 6606986, 6778337, 6977651, 7206782, 7467219, 7759827, 8085000, 8442061, 8828869, 9242537, 9679445, 10133534, 10595131, 11051985, 11490512, 11895706, 12251617, 12543640, 12760317, 12892898, 12934756, 12882500, 12737166, 12503962, 12191955, 11814386, 11387667, 10928520, 10452069, 9972175, 9501470, 9049741, 8622999, 8224687, 7856944, 7520657, 7215805, 6942208, 6698690, 6481546, 6286023, 6110100, 5955073, 5821769, 5708154, 5611429, 5530342, 5464122, 5411022, 5369429, 5339042, 5319786, 5310859]
59113E310859P85J0285J8491K4624L0676L8900M7808N4218N8496O3791P0165P3818
59101E802916P2742O9242O5805O1974N6565M9676M1195L0188J7234M764o161j7087
59089F249053k9060m0725n0501n8273o3853o6189o5411o3494o1525n8264n2578
59078E639180m5487l8601l2175k5717j8952j1252j764R043J9430K8656L7778M7645
59066E607784N7823O8024P8873R0433J01641J12041J22675J34489J47024J59199
59056F680006J70278J79714J87372J94191K01268K08102K12886K14631K13737
59047H462185K10652K05450J98553J90293J79914J66608J51399J36329J21853
59038A0023236J06505Q8644O6810L9099M542l5174p7369j21332j67419k13743
$$ y = [5310859, 5311644, 5321929, 5340420, 5365044, 5395720, 5434620, 5482428, 5536646, 5595142, 5658933, 5729098, 5802916, 5875658, 5944900, 6010705, 6072679, 6129244, 6178920, 6220115, 6250303, 6267537, 6272301, 6266140, 6249053, 6219993, 6179268, 6128767, 6070494, 6006641, 5940452, 5875041, 5811547, 5750022, 5691758, 5639180, 5593693, 5555092, 5522917, 5497200, 5478248, 5466996, 5465232, 5474275, 5493705, 5522361, 5560139, 5607784, 5665607, 5733631, 5812504, 5902937, 6004578, 6116619, 6239294, 6373783, 6520807, 6680006, 6850284, 7029998, 7217370, 7411561, 7612829, 7820931, 8033817, 8248448, 8462185, 8672837, 8878287, 9076840, 9267133, 9447047, 9613655, 9765054, 9901383, 10023236, 10129741, 10218385, 10285195, 10324294, 10328836, 10293662, 10216293, 10094961, 9927542, 9713799]
59028I713799k56529k93655l25143l50072l66046l72370l71163l64515l52824
59019F661482l36788l18752l00829k83167k65000k46183k27259k09022j92225
59010D282257j76888j62267j48506j37173j28827j21279j12287j02607r4044q6030
59000C012349p7097o8412o2319n8161n3225m7352m2894m0330l7725l4659l2859
58989B457316l2518l1567k9143k6449k3883k0815j8309j8114j8543j5566q915
58978B213494k756Q02M427J0050J5030J6429J5422J4650J4169J2823J1155J0289
58966B335984R895R481R839J1284J2204J1102Q472N431K330k05r25P3J089J343
58952B417397J668J946O70j894l003j358Q79J569J466J947K244Q49k335o624j1502
$$ y = [9713799, 9457270, 9163615, 8838472, 8488400, 8122354, 7749984, 7378821, 7014306, 6661482, 6324694, 6005942, 5705113, 5421946, 5156946, 4910763, 4683504, 4474482, 4282257, 4105369, 3943102, 3794596, 3657423, 3528596, 3407317, 3295030, 3192423, 3098379, 3012349, 2935252, 2866840, 2804521, 2746360, 2693135, 2645783, 2602889, 2562559, 2524834, 2490175, 2457316, 2424798, 2393231, 2364088, 2337639, 2313756, 2292941, 2274632, 2256518, 2237975, 2222409, 2213494, 2210738, 2211540, 2215967, 2226017, 2241047, 2257476, 2272898, 2287548, 2301717, 2314540, 2325695, 2335984, 2345879, 2355360, 2365199, 2376483, 2388687, 2399789, 2408261, 2413692, 2416022, 2415817, 2414892, 2414965, 2416054, 2417397, 2419065, 2421011, 2421681, 2419787, 2416784, 2415426, 2416305, 2417874, 2419340, 2421287, 2423531, 2424380, 2422045, 2415421, 2403919]
58937B403919j5795j7967j8373j9059k0576k1352k0792k0182j9759j8089j5284
58926B196691j3456j2657j0032m612O71L716O274R884J2528J2444J2017J4419
58914B227887J8926K2834K5845K9209L2477L4404L5658L7666L9936M1088M1302
58903B587232M1463M1150L9817L8687L9251M0938M2298M3252M4421M5487M6105
58892C050101M7183M9659N3143N7092O1781O6851P0804P3336P6346Q1124Q6498
58881C773918R1271R6281J02480J09181J16013J24250J34293J44160J52662J61740
58871E006249J73296J85905J97256K07840K19586K32650K46363K61837K80772
58862G011754L02656L25695L49608L75450M03557M33543M65366M98802N33002
$$ y = [2403919, 2388124, 2370157, 2351784, 2332725, 2312149, 2290797, 2270005, 2249823, 2230064, 2211975, 2196691, 2183235, 2170578, 2160546, 2155934, 2156605, 2160321, 2166595, 2176479, 2189007, 2201451, 2213468, 2227887, 2246813, 2269647, 2295492, 2324701, 2357178, 2391582, 2427240, 2464906, 2504842, 2545930, 2587232, 2628695, 2669845, 2709662, 2748349, 2787600, 2828538, 2870836, 2914088, 2958509, 3003996, 3050101, 3097284, 3146943, 3200086, 3257178, 3318959, 3385810, 3456614, 3529950, 3606296, 3687420, 3773918, 3865189, 3961470, 4063950, 4173131, 4289144, 4413394, 4547687, 4691847, 4844509, 5006249, 5179545, 5365450, 5562706, 5770546, 5990132, 6222782, 6469145, 6730982, 7011754, 7314410, 7640105, 7989713, 8365163, 8768720, 9202263, 9667629, 10166431, 10699433]
58853A0699433N67975O04978O43897O81891P16292P47200P75419P99290Q15303
58844A7051678Q20264Q11333P85567P41006O76914N92072M85265L58753K18869
58835B2541721P1735p8852k27767l66380m87081n87668o68737p29494p69245p90699
58825A7907533p98097p93377p76975p51042p19041o83363o45682o08064n71469
58816A1560423n34827m98030m63784m33984m06446l78366l50981l27431l07485
58807G859089k88146k68410k49937k33477k17888k02571j88113j74618j61659
58798E874270j49608j39020j29037j18365j07302r7017q7449p7536o6952n6172
58788D845812m5529l5383k6255j7851r118p8Q183J6152K6225L9008N1711O1888
$$ y = [10699433, 11267408, 11872386, 12516283, 13198174, 13914466, 14661666, 15437085, 16236375, 17051678, 17871942, 18683275, 19468842, 20209848, 20886762, 21478834, 21964099, 22322852, 22541721, 22613456, 22534604, 22306837, 21940457, 21453376, 20865708, 20196971, 19467477, 18698232, 17907533, 17109436, 16316059, 15539084, 14788042, 14069001, 13385638, 12739956, 12131892, 11560423, 11025596, 10527566, 10063782, 9629798, 9223352, 8844986, 8494005, 8166574, 7859089, 7570943, 7302533, 7052596, 6819119, 6601231, 6398660, 6210547, 6035929, 5874270, 5724662, 5585642, 5456605, 5338240, 5230938, 5133921, 5046472, 4968936, 4901984, 4845812, 4800283, 4764900, 4738645, 4720794, 4711676, 4711598, 4719781, 4735933, 4762158, 4801166, 4852877, 4914765]
58776D914765P0505P9568Q9139R8756J09429J21848J34567J46171J57486J69871
58766F092105J83286J97679K13884K31515K48523K64685K82614L03537L25300
58757H343128L46722L70350L98108M27874M57580M89274N25322N63653O00679
58748A2522690O36191O71466P05031P34057P57524P74086P79189P68262P40491
58739A9088987O95851O31175N43584M35354L11248J73689K5430j25340k68092
58730B1511886l97174n11631o09738o88555p47589p88130q10068q13815q03991
58721A5341195p86435p62558p31134o94277o56605o19448n80947n41537n04397
58712I463857m70739m39237m09923l84236l61337l38664l16006k95142k75889
$$ y = [4914765, 4985270, 5064838, 5153977, 5252733, 5362162, 5484010, 5618577, 5764748, 5922234, 6092105, 6275391, 6473070, 6686954, 6918469, 7166992, 7431677, 7714291, 8017828, 8343128, 8689850, 9060200, 9458308, 9886182, 10343762, 10833036, 11358358, 11922011, 12522690, 13158881, 13830347, 14535378, 15269435, 16026959, 16801045, 17580234, 18348496, 19088987, 19784838, 20416013, 20959597, 21394951, 21706199, 21879888, 21905318, 21779978, 21511886, 21114712, 20603081, 19993343, 19304788, 18557199, 17769069, 16959001, 16145186, 15341195, 14554760, 13792202, 13061068, 12366791, 11710186, 11090738, 10509791, 9968254, 9463857, 8993118, 8553881, 8143958, 7759722, 7398385, 7059721, 6743715, 6448573, 6172684]
58703F172684k56605k38050k22463k09245j95668j81527j68842j57415j44995
58694D397874j31607j19426j08618r7421q6141p6772o8918o0328n1285m4128l8578
58683C514652l1978k4255j8319j5216j2972j0665r869j1735j6061k2965l2109
58672C308508m0704m6047m9297n3062n6508n7183n6391n7436n9530n9001n6245
58661B717104n5624n8144o0134n9952o0391o2920o4857o4039o1679n8999n5323
58650B055042n1009m8126m6729m4401m0700l8121l7498l6397l3398l0128k7814
58639A620721k5683k3851k3949k5496k5468k2856k0281j9742k0090j9860j9420
58628A374025j9070j7951j5765j3069r672n484k411k034j951J416O853R753R339
$$ y = [6172684, 5916079, 5678029, 5455566, 5246321, 5050653, 4869126, 4700284, 4542869, 4397874, 4266267, 4146841, 4038223, 3940802, 3854661, 3777889, 3708971, 3648643, 3597358, 3553230, 3514652, 3482674, 3458419, 3440100, 3424884, 3411912, 3401247, 3391378, 3379643, 3363582, 3340617, 3308508, 3267804, 3221757, 3172460, 3119398, 3062890, 3005707, 2949316, 2891880, 2832350, 2773349, 2717104, 2661480, 2603336, 2543202, 2483250, 2422859, 2359939, 2295082, 2231043, 2169364, 2110365, 2055042, 2004033, 1955907, 1909178, 1864777, 1824077, 1785956, 1748458, 1712061, 1678663, 1648535, 1620721, 1595038, 1571187, 1547238, 1521742, 1496274, 1473418, 1453137, 1433395, 1413305, 1393445, 1374025, 1354955, 1337004, 1321239, 1308170, 1298498, 1293014, 1290603, 1288569, 1286618, 1288034, 1294887, 1304640, 1313979]
58615A313979R472J1834J3497J2412J0471R593R038Q236Q333R482J0041R532R032
58602A444952Q197N654K478J049L19l062q487j1497j0951j0722j2911j4612j3349
58589A377058j0748q548n602j282K382M258O183R324J2155J3906J6321K0109K3253
58576A458769K4773K6653L0264L4202L7325M0674M4912M8983N2597N6874O1621
58565A917647O5358O8672P4010Q1439Q8527R4942J03037J13215J23173J32477
58555B862497J43363J56039J67837J78096J89199K01503K11968K19141K24748
58546D554391K28885K28514K22206K11546J96159J72194J37780R5677M8971j099
58536F095224n1505r6641j33392j62837j85529j99867k06584k09704k11011k08157
$$ y = [1313979, 1323451, 1335285, 1348782, 1361194, 1371665, 1381258, 1390296, 1398532, 1406865, 1416347, 1426388, 1435920, 1444952, 1453149, 1458803, 1461281, 1462330, 1462649, 1459587, 1451100, 1439603, 1428652, 1417930, 1405019, 1390407, 1377058, 1366310, 1357762, 1352160, 1350878, 1353260, 1357518, 1363701, 1373025, 1385180, 1399086, 1415407, 1435516, 1458769, 1483542, 1510195, 1540459, 1574661, 1611986, 1652660, 1697572, 1746555, 1799152, 1856026, 1917647, 1983005, 2051677, 2125687, 2207126, 2295653, 2390595, 2493632, 2606847, 2730020, 2862497, 3005860, 3161899, 3329736, 3507832, 3697031, 3898534, 4110502, 4329643, 4554391, 4783276, 5011790, 5233996, 5445542, 5641701, 5813895, 5951675, 6047352, 6096323, 6095224, 6043719, 5947078, 5813686, 5650849, 5465320, 5265453, 5058869, 4849165, 4638154, 4429997]
58526D429997j99941j88674j75796j60363j43452j28685j16449j03116q7895p4786
58516C050840o5549n6682m6149l7164l2099k8100k2211j5894j1110o643j376L311
58504B731174P129J2088J7546J8957J4148N922l830j6998l3596m9082o0594p0309
58492B572555p9482q4876q4642q2167q0353p7446p2119o7230o4616o1465n5785
58481A762374n0366m7417m4551l9884l5983l4739l3500l0181k7064k5738k3699
58470A369252j9873j7788j9112j9692j6438j2476j1008r975p634p306j1061j4257
58458A202632j2363q281p098q237q407p857q016p117l600l6J277K531N749Q472
58444A149649Q587Q622J0591J1802J0652J1062J5793K0912K2531K3465K7188L0805
$$ y = [4429997, 4230056, 4041382, 3865586, 3705223, 3561771, 3433086, 3316637, 3213521, 3125626, 3050840, 2985291, 2928609, 2882460, 2845296, 2813197, 2785097, 2762886, 2746992, 2735882, 2729239, 2727863, 2731174, 2738303, 2750391, 2767937, 2786894, 2801042, 2806964, 2803134, 2786136, 2752540, 2703458, 2642864, 2572555, 2493073, 2408197, 2323555, 2241388, 2161035, 2083589, 2011470, 1944240, 1879624, 1818159, 1762374, 1712008, 1664591, 1620040, 1580156, 1544173, 1509434, 1475934, 1445753, 1418689, 1392951, 1369252, 1349379, 1331591, 1312479, 1292787, 1276349, 1263873, 1252865, 1242890, 1235256, 1227950, 1216889, 1202632, 1190269, 1181988, 1174890, 1166653, 1158246, 1150389, 1142373, 1135256, 1131656, 1131620, 1132897, 1135428, 1141177, 1149649, 1158236, 1166858, 1177449, 1189251, 1199903, 1210965, 1226758, 1247670, 1270201, 1293666, 1320854, 1351659]
58432A351659L0706K9924L2796L6844L7023L3744L0098K5160J7012Q464L176l82
58420A636224n142r755j2770j7676k6999l5827l8417l7159l7697l9218l7312l2884
58408A305368l0336k9672k7861k5621k5589k5950k2736j6723j1932r312p389o577
58396A065670p453p559n097k612k241j296K425N626N324M705P136R674R048Q645
58382A091995J2270J6319J6001J4349J6772K1348K2997K2999K5461K8357K6992
58371A315860K2897K0425J7854J0779J331m843p996j2156j6397j6891j5051j5119
58359A300693j6167j4594j1892j1712j2149r181m715k902j723L064Q998J1056
58347A238776J1376J5402K1250K2607J9643J7394J5758J0962M693J894J222k602
$$ y = [1351659, 1382365, 1412289, 1445085, 1481929, 1518952, 1552696, 1582794, 1607954, 1624966, 1633430, 1636606, 1636224, 1631082, 1621327, 1608557, 1590881, 1563882, 1528055, 1489638, 1452479, 1414782, 1375564, 1338252, 1305368, 1275032, 1245360, 1217499, 1191878, 1166289, 1140339, 1117603, 1100880, 1088948, 1079636, 1072247, 1065670, 1058217, 1050658, 1045561, 1042949, 1040708, 1039412, 1041837, 1047463, 1052787, 1057492, 1064628, 1074302, 1083350, 1091995, 1104265, 1120584, 1136585, 1150934, 1167706, 1189054, 1212051, 1235050, 1260511, 1288868, 1315860, 1338757, 1359182, 1377036, 1387815, 1389146, 1384303, 1376307, 1364151, 1347754, 1330863, 1315812, 1300693, 1284526, 1269932, 1258040, 1246328, 1234179, 1224998, 1220283, 1217381, 1215658, 1218722, 1227720, 1238776, 1250152, 1265554, 1286804, 1309411, 1329054, 1346448, 1362206, 1373168, 1377861, 1379755, 1380977, 1378375]
58335A378375q649j1530j1526j3261j5885j4302r082n835n727n439m996o754q221
58322A257168m950Q95L660L843N820Q367O838K585Q26J325L71n28K396O398O276
58307A301290M332O075R282Q152N213P383J2875J4117J1610J2545J7336J9733
58295A429943J9164K0719K3919K3607K1073K2281K5885K5137K0833K0047K2586
58284A675194K1215J4975J0060P691L447j683j908J727K340m43r04Q91p2k101
58270A730429J078P523R551Q171J1412J8982K2604K1445K2871K7712K9108K6580
58258A937466K6980L0694L1025K8082K9124L4236L5857L3301L3455L6330L4385
58247B290935K7117K2001K0331J6538J1692J2663J7671J8141J5024J7341K4528
$$ y = [1378375, 1369726, 1358196, 1346670, 1333409, 1317524, 1303222, 1294140, 1288305, 1282578, 1277139, 1272143, 1265389, 1257168, 1252218, 1253113, 1256773, 1260616, 1266436, 1274803, 1281641, 1284226, 1285052, 1286377, 1286748, 1286220, 1288616, 1295014, 1301290, 1305622, 1311697, 1320979, 1329131, 1334344, 1341727, 1354602, 1368719, 1380329, 1392874, 1410210, 1429943, 1449107, 1469826, 1493745, 1517352, 1538425, 1560706, 1586591, 1611728, 1632561, 1652608, 1675194, 1696409, 1711384, 1721444, 1729135, 1732582, 1730899, 1728991, 1730718, 1733058, 1732615, 1731711, 1732602, 1732530, 1730429, 1731507, 1739030, 1748581, 1756752, 1768164, 1787146, 1809750, 1831195, 1854066, 1881778, 1910886, 1937466, 1964446, 1995140, 2026165, 2054247, 2083371, 2117607, 2153464, 2186765, 2220220, 2256550, 2290935, 2318052, 2340053, 2360384, 2376922, 2388614, 2401277, 2418948, 2437089, 2452113, 2469454, 2493982]
58236B493982K6958K4333K6249L3657L7364L6272L9154M6656M9593M7091M8442
58225B909751N4882N7677N6226N9532O7758P1321P0336P5395Q6785R2987R2390
58214C695040R6074J06199J12523J13306J18165J26677J26279J15615J07864J06681
58204D824423J01359R0263Q5758R0768R3799R2746R9812J17111J31359J38797
58194E866195J50954J69683J81607J83996J90846K06612K19556K27725K44755
58185G641929K72789K96623L11718L30570L54823L70476L77708L94878M25153
58176A0776667M50744M68151M96123N39848N81592O16538O62616P24398P83541
58167A6100218Q35968R00863R81474J055907J118496J189471J271946J342935
$$ y = [2493982, 2520940, 2545273, 2571522, 2605179, 2642543, 2678815, 2717969, 2764625, 2814218, 2861309, 2909751, 2964633, 3022310, 3078536, 3138068, 3205826, 3277147, 3347483, 3422878, 3509663, 3602650, 3695040, 3791114, 3897313, 4009836, 4123142, 4241307, 4367984, 4494263, 4609878, 4717742, 4824423, 4925782, 5016045, 5101803, 5192571, 5286370, 5379116, 5478928, 5596039, 5727398, 5866195, 6017149, 6186832, 6368439, 6552435, 6743281, 6949893, 7169449, 7397174, 7641929, 7914718, 8211341, 8523059, 8853629, 9208452, 9578928, 9956636, 10351514, 10776667, 11227411, 11695562, 12191685, 12731533, 13313125, 13929663, 14592279, 15316677, 16100218, 16936186, 17837049, 18818523, 19874430, 20992926, 22182397, 23454343, 24797278]
58159B4797278J400391J473544J572065J672229J768013J885511K031182K179909
58151C8780122K331487K521395K756524L001426L248917L540124L894471M291599
58143F4366065M745027N314001O015039O807161P693620Q743520R982858J1374115
58135A25041406J2937087J4755621J6814083J8980860K1231681K3748519K6759025
58128B60268282L0472249L5091686M0243547M3916141M2524959L3208647J6646625
58121E02372136k695564j9472092l0655179l6231912l7717600l6674108l4286686
58114C04638995l1405527k8490317k5649114k2896153k0308613j7939434j5755241
58107A42194596j3734495j1920904j0337782q945350p715977o666133n787105
$$ y = [24797278, 26197669, 27671213, 29243278, 30915507, 32683520, 34569031, 36600213, 38780122, 41111609, 43633004, 46389528, 49390954, 52639871, 56179995, 60074466, 64366065, 69111092, 74425093, 80440132, 87247293, 94940913, 103684433, 113667291, 125041406, 137978493, 152734114, 169548197, 188529057, 209760738, 233509257, 260268282, 290740531, 325832217, 366075764, 409991905, 452516864, 485725511, 502372136, 499676572, 480204480, 449549301, 413317389, 375599789, 338925681, 304638995, 273233468, 244743151, 219094037, 196197884, 175889271, 157949837, 142194596, 128460101, 116539197, 106201415, 97256065, 89540088, 82873955, 77086850]
58100G7086850n022073m335655l738326l224993k753234k297418j868240j469112
58092E2377799j083265p05281l34679O1362N32887J097362J734415K401193L016487
58083E9098280L482183L776145L947802L919916L372422K006187n0010k227174
58075G7325751l954694n024431n529359n617224n405788n023632m585469m133529
58067C8051625l669362l220228k823129k475646k156578j872287j638866j443079
58059A8752450j263020j105901r87859q97307q13436p40993o93690o61801o26968
58050A0961475n91547n64955n38372m99982m58627m27125l98469l61912l25576
58041F794910l00464k79273k53368k33219k29352k29801k19055k03383j95492
$$ y = [77086850, 72064777, 67729122, 63990796, 60765803, 58012569, 55715151, 53846911, 52377799, 51294534, 50589253, 50254574, 50315936, 50848823, 51946185, 53680600, 56081793, 59098280, 62580463, 66356608, 70304410, 74224326, 77596748, 79602935, 79552925, 77325751, 73371057, 68346626, 62817267, 57200043, 51794255, 46770623, 42185154, 38051625, 34382263, 31162035, 28338906, 25863260, 23706682, 21834395, 20195529, 18752450, 17489430, 16383529, 15395670, 14498363, 13684927, 12943934, 12250244, 11588443, 10961475, 10369928, 9804973, 9266601, 8766619, 8307992, 7880867, 7482398, 7120486, 6794910, 6494446, 6215173, 5961805, 5728586, 5499234, 5269433, 5050378, 4846995, 4651503]
58032D651503j90038j76614j62140j57949j57959j51012j42070j40633j40587
58023C232501j31786j20008j15767j14457j06496r6307r2722r1046q2778p3158
58013B207976p1443p3201o9086o1943n9143n7372n0744m4496m5109m6352m0359
58002A588728l3060l3296l6304l3412k8676l0339l4649l3774l1156l3607l6564
57991A223891l2495k6124k6043k8814k6302k1325k1076k2294j7996j2115j2579
57980I76728j6085j4535j0484j1592j5361j3956r191q499j0623r056n315n479
57968H46552p715o143k942l970o582m344K03Ml188k295J873L069J891L802P859
57953H28074Q944Q287J0739J4432J3935J0735J0198J1269R515O976Q443J1318
$$ y = [4651503, 4461465, 4284851, 4122711, 3964762, 3806803, 3655791, 3513721, 3373088, 3232501, 3100715, 2980707, 2864940, 2750483, 2643987, 2547680, 2454958, 2363912, 2281134, 2207976, 2136533, 2063332, 1994246, 1932303, 1873160, 1815788, 1765044, 1720548, 1675439, 1629087, 1588728, 1555668, 1522372, 1486068, 1452656, 1423980, 1393641, 1358992, 1325218, 1294062, 1260455, 1223891, 1191396, 1165272, 1139229, 1110415, 1084113, 1062788, 1041712, 1019418, 1001422, 989307, 976728, 960643, 946108, 935624, 924032, 908671, 894715, 885524, 877025, 866402, 857346, 852031, 846552, 838837, 832694, 829752, 825782, 819200, 814856, 815059, 815063, 811875, 809580, 811453, 814522, 816413, 820215, 828074, 837018, 845305, 856044, 870476, 884411, 895146, 905344, 916613, 926128, 933104, 941547, 952865]
57941I52865R828O112O503R727R426N708L716L167l19n775q728j0279j4563j9480
57927I47908j9619j6237j4861j5210j2957r213q723j0646j0435q892j0079j2239
57915G98797j0076m530j274j132n10N88l64j297J638N918N932K679J817L783M421
57900H06390L567M399N818L953j11k224l071o127r720r560p398q560j2426j3803
57886G51127j2210j1297j0538o351l62K195J571K716O174P953P654Q603J0521
57873G57756J0082Q134Q398R694P353J712k552m932r022j4683j8095j9199k1226
57860G13420k3412k2022j8127j6492j7120j5851j2963j2903j5388j5116j0934
57849E33092p400o407m809j411R10J229K111M076M605L369K662K658J874J743
$$ y = [952865, 962693, 968805, 975308, 985035, 994461, 1000169, 1003885, 1007052, 1006733, 1000958, 992230, 981951, 967388, 947908, 928289, 912052, 897191, 881981, 869024, 859811, 851088, 840442, 830007, 821115, 811036, 798797, 788721, 784191, 782917, 781785, 781275, 781863, 781499, 780202, 781840, 787758, 793690, 796369, 798186, 801969, 806390, 809957, 814356, 820174, 824127, 824016, 821792, 818721, 812594, 802874, 793314, 785916, 777356, 764930, 751127, 738917, 727620, 717082, 710731, 710369, 712564, 714135, 716851, 723025, 730978, 738632, 747235, 757756, 767838, 775972, 784370, 794064, 801417, 803129, 800577, 795645, 786623, 771940, 753845, 734646, 713420, 690008, 667986, 649859, 633367, 616247, 600396, 587433, 574530, 559142, 544026, 533092, 525692, 519285, 514476, 513065, 513975, 515204, 517315, 521391, 525996, 529365, 532027, 534685, 536559, 538302]
57835E38302M608Q121Q129O044O456Q598P773M340L266N113N502L497K536K877
57821F15162J241j705j755L57p60n429p896o405n892q625j0414q783p183p976
57807E43937q240n786l041j940o77J817L549L855M823O556O362M355M302P319
57793E67191J0088J0702J0794J0745Q670N467M734O141N043K58l867m849n235
57780F25882o557o491m412l639n492o769n720n056o478p518o308m519l320j451
57766E52152O99K70k752m581l939l919n688o144m265l929p391j1228j1987j0944
57752D76354j0345r670q653r412j2373j4186j2584r587p489n599l137j342n92
57739C71385O12J988J087j804k906q86J170J540K633N887Q951J0376J2267J5654
$$ y = [538302, 542910, 551031, 559160, 565204, 571660, 580258, 588031, 592371, 595637, 600750, 606252, 609749, 612285, 615162, 616403, 614698, 612943, 613300, 612540, 607111, 599215, 592810, 586918, 578293, 567879, 559096, 551913, 543937, 535697, 529911, 526870, 524930, 524253, 526070, 529619, 533474, 538297, 544853, 551215, 555570, 559872, 567191, 577279, 587981, 598775, 609520, 618190, 623657, 628391, 634532, 639575, 639833, 635966, 631117, 625882, 619325, 612834, 608422, 604783, 599291, 592522, 586802, 581746, 575268, 567750, 561442, 556923, 553603, 552152, 552851, 553121, 550369, 545788, 541849, 537930, 532242, 526098, 521833, 517904, 510513, 499285, 487298, 476354, 466009, 456339, 447686, 438274, 425901, 411715, 399131, 389544, 382055, 376456, 373319, 371977, 371385, 371997, 373985, 375072, 373268, 370362, 369476, 370646, 372186, 374819, 380706, 389657, 400033, 412300, 427954]
57725D27954J7944J7539J6476J6065J4544J1453R553R733Q858N380K375K101K301
57712E62276Q08r34j902m190q391j1032j0141q832r830j0947r776q350r013r856
57698D59890q519o802p035p323m879j173M61j6l96j08K49J039K264K459J450J536
57682D33097L583M989M009K857L808N688O942Q556J0875J1324Q721O336P022Q686
57668E26493Q339P272Q108R766R779R101J0252J2633J3732J3493J3791J5037J6374
57655F74170J7838J9474J9990J8927J8270J9402K0628K0370K0435K3122K7178
57644H99804K9731L0520L1440L3505L6717M1157M6041M9543N1488N4051N7964
57633A361961O0632O0032N7699N5884N4723N4540N7517O4306P2131P9152Q7555
$$ y = [427954, 445898, 463437, 479913, 495978, 510522, 521975, 531528, 541261, 550119, 555499, 557874, 559975, 562276, 563084, 562150, 560248, 556058, 547667, 536635, 526494, 517662, 507832, 496885, 487109, 478759, 469746, 459890, 451371, 444569, 437534, 430211, 425332, 424159, 424620, 424604, 424208, 424100, 424349, 425388, 427652, 430111, 431561, 433097, 436680, 441669, 445678, 448535, 452343, 458031, 464973, 473529, 484404, 495728, 504449, 510785, 517807, 526493, 534832, 542104, 550212, 559978, 569757, 578858, 589110, 601743, 615475, 628968, 642759, 657796, 674170, 692008, 711482, 731472, 750399, 768669, 788071, 808699, 829069, 849504, 872626, 899804, 929535, 960055, 991495, 1025000, 1061717, 1102874, 1148915, 1198458, 1249946, 1303997, 1361961, 1422593, 1482625, 1540324, 1596208, 1650931, 1705471, 1762988, 1827294, 1899425, 1978577, 2066132]
57622B066132R9371J12588J24737J37168J51983J67737J82043J95767K10399K23509
57612C671434K30946K31922K28075K19130K03291J80677J53027J20952Q3904M1502
57602E364860p211o3141j22864j77352k18167k43282k54775k54216k43784k28622
57592C551446k13242j97291j78621j58644j40747j25339j10575r6445q4357p3950
57582B172235o3992n5010m7683m0260l1184k2486j6844j2890p352k64N991J1379
57570A891640J7677K4441K9846L4728M1580N0071N7651O4178P1965Q1458R0670
57559B455905R8956J07726J17295J26271J34215J41787J48107J50794J48708J42108
57549C771872J30140J10951Q4401N2507J7359j9315n4954q6775j13525j35110
$$ y = [2066132, 2165503, 2278091, 2402828, 2539996, 2691979, 2859716, 3041759, 3237526, 3447925, 3671434, 3902380, 4134302, 4362377, 4581507, 4784798, 4965475, 5118502, 5239454, 5323358, 5364860, 5357649, 5294508, 5171644, 4994292, 4776125, 4532843, 4278068, 4023852, 3780068, 3551446, 3338204, 3140913, 2962292, 2803648, 2662901, 2537562, 2426987, 2330542, 2246185, 2172235, 2108243, 2053233, 2005550, 1965290, 1934106, 1911620, 1894776, 1881886, 1874534, 1874270, 1880261, 1891640, 1909317, 1933758, 1963604, 1998332, 2039912, 2089983, 2147634, 2211812, 2283777, 2365235, 2455905, 2554861, 2662587, 2779882, 2906153, 3040368, 3182155, 3330262, 3481056, 3629764, 3771872, 3902012, 4012963, 4097364, 4149871, 4167230, 4147915, 4092961, 4006186, 3892661, 3757551]
57539C757551j51277j62167j68851j71609j69284j62261j54031j47294j40587
57530B330190j31587j21586j13319j06311r8253q9512q2363p6648p0254o3220
57520A377137n7632n3743m9786m5510m2441m0588l7981l3668k8660k4000k0300
57509I42828j8680j9606k1108k0595j7923j4655j1310p806n387n245o185o177
57497G88151n141l726j032L398P084P684P114Q816J2203J3941J3783J4642J7248
57484H84165J9097J9013J8840K0150K2560K5591K9126L2063L3599L5593M0368
57473A180165M6456N0131N1054N2695N7013O2420O7489P3036P9748Q6811R3712
57462A900730J00756J07359J12376J16197J19807J21801J19236J11374R9612Q3903
$$ y = [3757551, 3606274, 3444107, 3275256, 3103647, 2934363, 2772102, 2618071, 2470777, 2330190, 2198603, 2077017, 1963698, 1857387, 1759134, 1669622, 1587259, 1510611, 1440357, 1377137, 1319505, 1265762, 1215976, 1170466, 1128025, 1087437, 1049456, 1015788, 987128, 963128, 942828, 924148, 904542, 883434, 862839, 844916, 830261, 818951, 811145, 805758, 800513, 794328, 788151, 783010, 779284, 778252, 781650, 788734, 796418, 803532, 812348, 824551, 838492, 852275, 866917, 884165, 903262, 922275, 941115, 961265, 983825, 1009416, 1038542, 1070605, 1104204, 1139797, 1180165, 1226621, 1276752, 1327806, 1380501, 1437514, 1499934, 1567423, 1640459, 1720207, 1807018, 1900730, 2001486, 2108845, 2221221, 2337418, 2457225, 2579026, 2698262, 2809636, 2909248, 2993151]
57452B993151O2708L6613Q729j8899m6006p0995r0566j03414j11449j16626j19136
57441B424110j19083j17196j13276j06627r8318r0561q3730p6566o9284o3470
57431A485999n8822n3056m5467l7752l1171k5538k1031j8070j5487j1698p485
57420A160422m515j658L568J0172J4498J5949J7802K1765K5961K9195L3035L8416
57408A364610M4039M9510N6372O4652P2046P7939Q4544R2466R8877J02040J03961
57397B211056J06309J06962J03060R4593Q2548O6158M4471J8749q861l7126o4473
57386B723446q8059j05958j18709j27275j31384j31121j28189j24097j18910j12678
57376A537066j06130r9043r0233q0300p2018o6785o2868n8256n3073m8175m3666
$$ y = [2993151, 3055859, 3092472, 3101201, 3082302, 3036296, 2965301, 2874735, 2771321, 2659872, 2543246, 2424110, 2305027, 2187831, 2074555, 1967928, 1869610, 1779049, 1695319, 1618753, 1549469, 1485999, 1427177, 1374121, 1328654, 1290902, 1259731, 1234193, 1213162, 1195092, 1179605, 1167907, 1160422, 1155907, 1154249, 1157817, 1167989, 1182487, 1198436, 1216238, 1238003, 1263964, 1293159, 1326194, 1364610, 1408649, 1458159, 1514531, 1579183, 1651229, 1729168, 1813712, 1906178, 2005055, 2107095, 2211056, 2317365, 2424327, 2527387, 2621980, 2704528, 2770686, 2815157, 2833906, 2825045, 2787919, 2723446, 2635387, 2529429, 2410720, 2283445, 2152061, 2020940, 1892751, 1768654, 1649744, 1537066, 1430936, 1331893, 1241660, 1161360, 1089342, 1022557, 959689, 901433, 848360, 800185, 756519]
57365G56519l9847l7404l5702l3173l0106k8441k8150k6798k3659k1062k0383
57354D31794j9919j8312j6865j6719j6655j5696j4966j5008j4084j1237q432p556
57342B56345p772p733p736p842o736m621m153o081o976m204k08J308P85Q00J105
57327A96281l25k826l619k198q19j049k561m729o856p481n917l838l202l479l240
57312A44142l162m805p225p836o337n028n188n632n196m351l828l315k420j717
57298G8102k115l664n238n407m035k873l606n322n392l139p85r0j19N34J471J889
57282D0211K269K934K780J454R72K959N700O434N365M929N867O608O206N437N024
57267A05149M775M673N099N729N531M183K613J981K667M074N107N223N140N726
$$ y = [756519, 716672, 679268, 643566, 610393, 580287, 551846, 523696, 496898, 473239, 452177, 431794, 411875, 393563, 376698, 359979, 343324, 327628, 312662, 297654, 283570, 272333, 263901, 256345, 248573, 240840, 233104, 225262, 218526, 213905, 209752, 203671, 196695, 192491, 192283, 193591, 194376, 195176, 196281, 195956, 193130, 189511, 187313, 186494, 185445, 182884, 178155, 171299, 163818, 157901, 154063, 150861, 147382, 144142, 140980, 136175, 128950, 121114, 114777, 109749, 104561, 98929, 93733, 89382, 85554, 82239, 79819, 78102, 75987, 72323, 67085, 61678, 57643, 54770, 51164, 45842, 40450, 37311, 36526, 36436, 36317, 36851, 38322, 40211, 42480, 45414, 48194, 49648, 50620, 53579, 59279, 65713, 71078, 76007, 81874, 88482, 94688, 100125, 105149, 109924, 114597, 119696, 125425, 130956, 135139, 137752, 139733, 142400, 146474, 151581, 156804, 161944, 167670]
57253A67670O270N325L392K809M192N097L664J621J794M162O415P373P786Q308
57239B35878Q526P889O425M782M175N569Q283J0377J1108J1673J2948J4119J4720
57226C56472J6150J9457K3064K4553K3794K2600K2111K2113K2313K2784K3451
57215E98862K4075K4277K3166K0043J5967J3031J1298Q271K479m127q850j1590
57203G16902j4037j7040k0526k4504k8368l0395k9774k8064k7020k6191k4332
57192D46651k1900k0188j9005j7153j4520j1943r638p278m964k818l75K391M423
57179C23683N240O140Q318J0996J2831J4004J5378J6641J7009J6745J6422J5453
57167D78860J2947R341N896L383K233K939N189P740J0196J3652J8578K3637K7687
$$ y = [167670, 173940, 179265, 182657, 185466, 189658, 194755, 198419, 200040, 201834, 205996, 212411, 219784, 227570, 235878, 244404, 252293, 258718, 263500, 267675, 273244, 281527, 291904, 303012, 314685, 327633, 341752, 356472, 372622, 392079, 415143, 439696, 463490, 486090, 508201, 530314, 552627, 575411, 598862, 622937, 647214, 670380, 690423, 706390, 719421, 730719, 738990, 741469, 737342, 728492, 716902, 702865, 685825, 665299, 640795, 612427, 582032, 552258, 524194, 497174, 470983, 446651, 424751, 404563, 385558, 368405, 353885, 341942, 332304, 325026, 320062, 317244, 316869, 319260, 323683, 328923, 335063, 343381, 354377, 367208, 381212, 396590, 413231, 430240, 446985, 463407, 478860, 491807, 501148, 507044, 510427, 512660, 515599, 520788, 528528, 538724, 552376, 570954, 594591, 622278]
57154F22278L1251L4663L6714L6746L6350L7230L9033M0749M2422M3887M4054
57143A045377M3408M4862M9639N4518N5978N5202N5964N9311O3443O7219P0464
57132A665385P2006P1043O9706P0904P4070P6150P6244P6133P6703P7182P7917
57121B483443Q0438Q4353Q6999Q6883Q5038Q2597P9432P5564P1698O7876O3618
57110C347939N9775N8306N9887O3397O7785P2500P6122P6640P3593O8307O2080
57099D086331N5789N1064M9579N0784N2358N3284N4675N7043N8560N6836N0991
57088D677294M1136K7157R187j1242l1315m8489o2062p3451q4573r5818j06199
57077D241625j15627j25945j39116j55441j74264j95129k17336k39563k61199
$$ y = [622278, 653529, 688192, 724906, 761652, 798002, 835232, 874265, 915014, 957436, 1001323, 1045377, 1088785, 1133647, 1183286, 1237804, 1293782, 1348984, 1404948, 1464259, 1527702, 1594921, 1665385, 1737391, 1808434, 1878140, 1949044, 2023114, 2099264, 2175508, 2251641, 2328344, 2405526, 2483443, 2563881, 2648234, 2735233, 2822116, 2907154, 2989751, 3069183, 3144747, 3216445, 3284321, 3347939, 3407714, 3466020, 3525907, 3589304, 3657089, 3729589, 3805711, 3882351, 3955944, 4024251, 4086331, 4142120, 4193184, 4242763, 4293547, 4345905, 4399189, 4453864, 4510907, 4569467, 4626303, 4677294, 4718430, 4745587, 4754774, 4743532, 4712217, 4663728, 4601666, 4528215, 4443642, 4347824, 4241625, 4125998, 4000053, 3860937, 3705496, 3531232, 3336103, 3118767, 2879204, 2618005]
57068B618005k83220l06729l31499l56816l82811m10016A08284c60860n02907
57059h63767n41373n85957o38721p01795p75423q58033r48713j048034j156005
57050h117821j271022j391536j517288j648695j786682j933149k089552k255107
57042b2010852k428476k611491k810652l037286l308820l647433m073515m599950
57034d8528475n229863n951263o733599p544485q373308r209970r982037j0562413
57026a12115413j0922913j1285793j2012803j3223094j4502580j5056819j4215866
57019b03335281j1843602q341872m347923m23297L087644O035898Q365982J0029423
57011b00773028J0989673J1304671J1173881J0866837J0592241J0432274J0375818
$$ y = [2618005, 2334785, 2028056, 1696557, 1339741, 956930, 546914, 108284, -360860, -863767, -1405140, -1991097, -2629818, -3331613, -4107036, -4965069, -5913782, -6961816, -8117821, -9388843, -10780379, -12297667, -13946362, -15733044, -17666193, -19755745, -22010852, -24439328, -27050819, -29861471, -32898757, -36207577, -39855010, -43928525, -48528475, -53758338, -59709601, -66443200, -73987685, -82360993, -91570963, -101553000, -112115413, -123038326, -134324119, -146336922, -159560016, -174062596, -189119415, -203335281, -215178883, -223520755, -227868678, -228291975, -225204331, -219168433, -210802451, -200773028, -189783355, -178478684, -167304803, -156437966, -145845725, -135413451, -125037633]
57004a25037633J0378036J0385550J0339315J0184898R887127R435148Q840469
56997e5587090Q134223P360050O562473N779115N039272M362719L758168L226617
56989a1364453K766854K375355K043162J758828i05006D05078J139880R97740
56981B542698Q76909P72692O80896N98004N23239M57587M00801L51906L11775
56972G516507K81942K61060K45213K31211K17160K00953J81544J61090J42782
56963I439462J26904J11596R6432Q2141O7694N1139L3214J6962L776p599j8555
56952A0003166k9939m3373o0040p8008r3743j06573j19132j33050j46963j59310
56942I033035j70558j81702j92720k03343k13400k21206k23204k16597k01350
$$ y = [-125037633, -114659597, -104274047, -93934732, -83749834, -73862707, -64427559, -55587090, -47452867, -40092817, -33530344, -27751229, -22711957, -18349238, -14591070, -11364453, -8597599, -6222244, -4179082, -2420254, -905006, 405078, 1544958, 2542698, 3419607, 4192299, 4873195, 5471199, 5994438, 6452025, 6852826, 7204732, 7516507, 7798449, 8059509, 8304722, 8535933, 8753093, 8954046, 9135590, 9296680, 9439462, 9566366, 9677962, 9774394, 9856535, 9924229, 9975368, 10008582, 10025544, 10029320, 10021721, 10003166, 9973227, 9929854, 9869814, 9791806, 9698063, 9591490, 9472358, 9339308, 9192345, 9033035, 8862477, 8680775, 8488055, 8284712, 8071312, 7850106, 7626902, 7410305, 7208955]
56933G208955j78737j49180j13105p2532k8541K3126Q8208J58834K03191J80517
56923G320736P5817q0754k34452l46074m09863m38433m42672m29210m06089l80621
56913D228385l54064l24549k93510k64664k38618k13159j87750j63782j41487
56904B046802j20217j00833q4641p1047n9038m9542m3413l8763l3597k9685l0421
56893A385605l5890m3171n0255n6476o0382o0670n8576n6239n3391m8525m2147
56882H19883l5923k9690k2602j6119j2305r872n508J232P677J2477J6979K2265
56870G48494K7449L0879L0502K3658R473q644k5323l7720m5719m9113m7903m4585
56858F11448m2648m2557m1937l9507l6242l2965k9621k6671k4642k2460j8797
$$ y = [7208955, 7030218, 6881038, 6767933, 6695401, 6666860, 6689986, 6778194, 6937028, 7140219, 7320736, 7396553, 7315799, 7081347, 6735273, 6325410, 5886977, 5444305, 5015095, 4609006, 4228385, 3874321, 3549772, 3256262, 2991598, 2752980, 2539821, 2352071, 2188289, 2046802, 1926585, 1825752, 1741111, 1670064, 1611026, 1561484, 1518071, 1479308, 1445711, 1416026, 1385605, 1349715, 1306544, 1256289, 1199813, 1139431, 1078761, 1020185, 963946, 910555, 862030, 819883, 783960, 754270, 731668, 715549, 703244, 693372, 687864, 689096, 696773, 709250, 726229, 748494, 775943, 806822, 837324, 860982, 870455, 861811, 836488, 798768, 753049, 703936, 656033, 611448, 568800, 526243, 484306, 444799, 408557, 375592, 345971, 319300, 294658, 272198, 253401]
56847B53401j4570j1672r872p652n333m269l618j141K985O278P786Q882J0370
56834B31575J1726J3127J5291J7438J8246J8672K0841K4297K6554K7194K8029
56823D52990K8905K6912K0758J2937O518K073j277l982o053p275o964m901k279
56810E18362j95K103N608R290J1783J4180J8415K3952K9076L4356M1188M7731
56798G55849N0142M7502M1607L2306J7699n39j6419k5623k8903k8730k6087k1682
56786G97122j6862j1897o004K03N157R675J6534K6016L5275M2821N0092N7560
56774A005692O3172O5987O7503O7343O1247M5926K3405j449k5045m4898n8321
56763A270562o4177o4343o1364n6122m9086m1813l5436k9265k2366j5010p445
$$ y = [253401, 238831, 227159, 217287, 209635, 204302, 200033, 196415, 195274, 198259, 204537, 212323, 221205, 231575, 243301, 256428, 271719, 289157, 307403, 326075, 346916, 371213, 397767, 424961, 452990, 481895, 508807, 529565, 542502, 549020, 551093, 549816, 545834, 539781, 532506, 525542, 520641, 518362, 518167, 520270, 525878, 535168, 546951, 561131, 579546, 603498, 632574, 666930, 708118, 755849, 805991, 853493, 895100, 927406, 945105, 944566, 928147, 902524, 873621, 844891, 818804, 797122, 780260, 768363, 762359, 762562, 767719, 777394, 793928, 819944, 855219, 898040, 948132, 1005692, 1068864, 1134851, 1202354, 1269697, 1330944, 1376870, 1400275, 1398826, 1373781, 1328883, 1270562, 1206385, 1142042, 1080678, 1024556, 975470, 933657, 898221, 868956, 846590, 831580, 824135]
56752H24135R90J0311J9183K6901L4439M2394M9334N2803N0475M0236K1722j375
56740A171548k2769l8385m8190n3267n3826n0676m5887m0688l4957k9305k5090
56729G28508k1672j6606r516k897J965O717J2301J6900J9318K1286K4136K5649
56717H06089K2412J3462R4j5486k9564l7726l8795l6305l4345l3609l2836l1613
56705E51778k9789k6457k1769j7944j6457j5954j4682j3056j2052j1025r170p319
56693C56104o305n236l322j696j478j733j307j079k245l823m051l119k470k450
56679C15790k403k212k072j559l97O22O58r5j155k609m397n770o147n523l909
56664B78822j766p61k007l715l111p63R1j260k116j468j826m202n251k326J920
$$ y = [824135, 825125, 835436, 854619, 881520, 915959, 958353, 1007687, 1060490, 1110965, 1151201, 1172923, 1171548, 1148779, 1110394, 1062204, 1008937, 955111, 904435, 858548, 817860, 782903, 753598, 728508, 706836, 690230, 680714, 677817, 679782, 686499, 698800, 715700, 735018, 756304, 780440, 806089, 828501, 841963, 842057, 826571, 797007, 759281, 720486, 684181, 649836, 616227, 583391, 551778, 521989, 495532, 473763, 455819, 439362, 423408, 408726, 395670, 383618, 372593, 363423, 356104, 349799, 344563, 341241, 339545, 338067, 336334, 335027, 333948, 331703, 327880, 323829, 320710, 318240, 315790, 313387, 311175, 309103, 307544, 307147, 307769, 308427, 308332, 307177, 304568, 300171, 294401, 288254, 282731, 278822, 277056, 276295, 274288, 270573, 267462, 266699, 266790, 265530, 263414, 261946, 260120, 255918, 250667, 248341, 250261]
56649B50261L171J305m37l82M09N24n71k641m312l932k047j247k416l436k927
56634B31322k433l173l541k060k28R4l18o8K26j60J08K020L844L759K836K826
56618B35054L174K783K581L526M290L698L356M880O640O359M980M655M830L585
56604B94391J335q2n09o87L4K053L318K048J67N41K367K751J650J507K948M315
56588C18147M816M894M237K418P41M15k1k318m847m726k723k242m020n400m680
56573C04691k830j059J76m9k244m538m512k750j852k324k473j932k008k655k288
56558B71353q78k55j014j747j611j290j106n34L03O35N01M09L9p82o37J615M259
56541B69260M645L000J827J998K114J437Q90J168K075L459M982N543M843M440
$$ y = [250261, 253432, 254737, 254300, 253918, 254327, 254851, 254280, 251639, 247327, 243395, 241348, 240101, 237685, 234249, 231322, 228889, 225716, 222175, 220115, 219887, 219981, 219663, 219595, 219821, 219661, 219769, 221789, 225633, 229392, 232228, 235054, 238228, 241011, 243592, 247118, 251408, 255106, 258462, 263342, 269982, 276341, 281321, 285976, 290806, 294391, 295726, 295644, 295135, 294448, 294482, 296535, 299853, 301901, 302068, 302609, 304976, 307727, 309377, 310884, 313832, 318147, 322963, 327857, 332094, 334512, 335253, 335668, 335647, 333329, 328482, 323756, 321033, 318791, 314771, 309371, 304691, 301861, 300802, 300978, 300929, 298685, 294147, 289635, 286885, 285033, 282709, 280236, 278304, 276296, 273641, 271353, 270475, 270220, 269206, 267459, 265848, 264558, 263452, 262918, 263221, 263856, 264357, 264766, 264805, 264023, 263386, 265001, 269260, 273905, 276905, 278732, 280730, 282844, 284281, 285171, 286339, 288414, 291873, 296855, 302398, 307241, 311681]
56527C11681N352O020M955L724M411N682M757K065N08Q63J397J327J313J167L77
56512C55599K55K316N109O008N351N383O005N445M398N315P874R174Q390P353
56498D33975O663N309M184N620Q877J0181Q089N151L693L486M157O012P728O956
56484E20081M184K543K971L141J830N40r3j616m121n117l717k469l325m866n371
56469E04595n554o425p059o425n326m850m736m454m187l961l559l636m799n683
56455D33941m455k210j914l851n349n239n161n776n376l305j454j114j324j433
56441C85980k274l774m422m083m441n693n946m714l726l414k062L40J072q52k676
56426C39315k166p39m04o50l43J2n7N00K176L544L629L499M136M830M872M682
$$ y = [311681, 317033, 323053, 328008, 331732, 336143, 341825, 346582, 348647, 349155, 350018, 351415, 352742, 354055, 355222, 355599, 355854, 358170, 363279, 369287, 374638, 380021, 386026, 391471, 395869, 401184, 409058, 418232, 426622, 433975, 440638, 445947, 450131, 455751, 464628, 474809, 482898, 488049, 491742, 495228, 499385, 505397, 513125, 520081, 524265, 526808, 529779, 532920, 534750, 535290, 535197, 533581, 529460, 524343, 520626, 518157, 514832, 509966, 504595, 499041, 492616, 485557, 479132, 473806, 468956, 464220, 459766, 455579, 451618, 448059, 444423, 439624, 433941, 429486, 427276, 425362, 421511, 416162, 410923, 405762, 399986, 394610, 391305, 389851, 388737, 387413, 385980, 383706, 379932, 375510, 371427, 366986, 361293, 355347, 350633, 346907, 343493, 341431, 341771, 342843, 341991, 339315, 337149, 336410, 336006, 335356, 335013, 335025, 334968, 335468, 337644, 341188, 344817, 348316, 352452, 357282, 362154, 366836]
56410C66836M314L238K293L084M752M481K174J247L466O330P208O716O275N487
56396D27901M092L577M617N417M577L327L162L591L837M359N115M739K998J641
56382D82950J497J251L93N31K333L977M245M296M824M301J892o17j679k186l092
56367E04916l444k529j601j799k542l208m073m677l998k927l406m490l128K53
56353D63347J375j084l007j530L57r43l963n290m928m841m997m397l716l756l459
56338D19168k182j579k577k967q93J869K786K337K077J520o6j127k06J167R20
56323D20247j04K9Q26M11j346l089l962l560j589P53J109p63k104j047R91K066
56307D08868K157J624K99n10J437N100O267L661J037J094J692O96J11J882L703
$$ y = [366836, 371150, 374388, 376681, 379765, 384517, 388998, 391172, 392419, 395885, 402215, 409423, 416139, 422414, 427901, 431993, 435570, 440187, 445604, 450181, 453508, 456670, 460261, 464098, 468457, 473572, 478311, 481309, 482950, 484447, 485698, 486091, 486622, 488955, 492932, 497177, 501473, 506297, 510598, 512490, 511873, 510194, 508008, 504916, 501472, 498943, 497342, 495543, 493001, 489793, 485720, 481043, 477045, 474118, 470712, 466222, 463094, 463347, 464722, 463638, 460631, 459101, 459458, 458515, 454552, 449262, 444334, 439493, 434496, 430099, 426383, 422627, 419168, 416986, 415407, 412830, 409863, 408970, 410839, 413625, 415962, 418039, 419559, 419493, 418366, 418160, 419327, 420247, 420143, 420172, 420998, 421409, 420063, 416974, 413012, 409452, 407863, 408616, 409725, 408962, 406858, 405811, 406802, 408868, 411025, 412649, 412948, 412438, 413875, 418975, 425242, 428903, 429940, 431034, 432726, 433422, 433533, 435415, 439118]
56292D39118K904J090J044K220K961M103O529Q085O711M138K976K865K612L163
56278D90519N002N803M209K832L905N225M238K783L577N263N369N105O618Q316
56264E58764P711O384P267R380R930R557J0698J2650J2893J1728J1292J1544J1170
56251F90968J0813J1530J2012J0969J0036J0665J0757Q374N853N912O599M984
56239G99472K882L642N719N194K655J891L230L609K261J133O58j3L24L341P183
56224H43181Q615Q102Q620J0641J2582J4655J7863K0656K1030K0559K2054K4896
56212A033454K6795K8316L1168L4139L5436L7106M2090M8804N3617N6826O1102
56201A488853O5998O9353P2451P8285Q6097R2943R9112J06857J15354J22213J28050
$$ y = [439118, 442022, 443112, 444156, 446376, 449337, 453440, 459969, 468054, 474765, 478903, 481879, 484744, 487356, 490519, 495521, 501324, 505533, 508365, 512270, 517495, 521733, 524516, 528093, 533356, 538725, 543830, 550448, 558764, 566475, 572859, 580126, 589506, 599436, 608993, 619691, 632341, 645234, 656962, 668254, 679798, 690968, 701781, 713311, 725323, 736292, 746328, 756993, 767750, 776124, 781977, 787889, 794488, 799472, 802354, 805996, 811715, 816909, 819564, 821455, 824685, 828294, 830555, 831688, 832346, 832333, 832657, 835998, 843181, 851796, 859898, 868518, 879159, 891741, 906396, 924259, 944915, 965945, 986504, 1008558, 1033454, 1060249, 1088565, 1119733, 1153872, 1189308, 1226414, 1268504, 1317308, 1370925, 1427751, 1488853, 1554851, 1624204, 1696655, 1774940, 1861037, 1953980, 2053092, 2159949, 2275303, 2397516, 2525566]
56190B525566J34300J38449J37444J33856J32391J31873J27034J16839J04602
56181C682354R1049P4026N4400L5634J7993o49j8774l2306m1348m9653n7782o2900
56169C692044o4993o6992o9025o8739o7179o8092p1390p3398p3532p4779p7586
56158B916339p9401q0169q2217q4700q4303q1509q0123q0524p9356p6078p3705
56147B034254p2846p0899o7307o4008o0725n5586m9998m7027m5471m1661l6390
56136A422336l3507l2346k8661k2757j9411j9488j8922j6416j5077j5675j5176
56125A184900j2780j0962r977p609m681m212n185l766m85P41L16K130N439N613
56111A139482L197L805Q471J2288J3518J5681J9511K1208K0224K0584K2847K2805
$$ y = [2525566, 2659866, 2798315, 2935759, 3069615, 3202006, 3333879, 3460913, 3577752, 3682354, 3773403, 3847429, 3901829, 3937463, 3955456, 3954807, 3936033, 3903727, 3862379, 3812726, 3754944, 3692044, 3627051, 3560059, 3491034, 3422295, 3355116, 3287024, 3215634, 3142236, 3068704, 2993925, 2916339, 2836938, 2756769, 2674552, 2589852, 2505549, 2424040, 2343917, 2263393, 2184037, 2107959, 2034254, 1961408, 1890509, 1823202, 1759194, 1698469, 1642883, 1592885, 1545858, 1500387, 1458726, 1422336, 1388829, 1356483, 1327822, 1305065, 1285654, 1266166, 1247244, 1230828, 1215751, 1200076, 1184900, 1172120, 1161158, 1151181, 1143572, 1138891, 1134679, 1129494, 1125728, 1125243, 1125984, 1126300, 1128430, 1133869, 1139482, 1142679, 1146484, 1154955, 1167243, 1180761, 1196442, 1215953, 1237161, 1257385, 1277969, 1300816, 1323621]
56099A323621J9812J8470K0218K1155J9924J9868K1637K1731K0208K1731K6816
56088A555191L0136K9699K9938L3496L7676M1095M6157N2925N8211O2396O9414
56077B046334P8701Q5503R0411R9599J14103J28307J40943J57677J80084K01870
56067C323532K19314K35930K53011K64676K66263K59419K45756K24187J97581
56058E489669J73194J52956J31641J07142Q3239N9864L1018l869l6300o0347p8492
56047F049715r2824j00942j04882j13686j31884j54254j75850j97483k17423k28222
56037D532265k27006k19520k09677j94754j74857j56574j42737j28702j13022
56028B965416j01134r4222q5672p3207o3133n7860n1100m0530l3008l1519k9390
$$ y = [1323621, 1343433, 1361903, 1382121, 1403276, 1423200, 1443068, 1464705, 1486436, 1506644, 1528375, 1555191, 1585327, 1615026, 1644964, 1678460, 1716136, 1757231, 1803388, 1856313, 1914524, 1976920, 2046334, 2125035, 2210538, 2300949, 2400548, 2514651, 2642958, 2783901, 2941578, 3121662, 3323532, 3542846, 3778776, 4031787, 4296463, 4562726, 4822145, 5067901, 5292088, 5489669, 5662863, 5815819, 5947460, 6054602, 6137841, 6197705, 6228723, 6224854, 6188554, 6128207, 6049715, 5956891, 5855949, 5751067, 5637381, 5505497, 5351243, 5175393, 4977910, 4760487, 4532265, 4305259, 4085739, 3876062, 3681308, 3506451, 3349877, 3207140, 3078438, 2965416, 2864282, 2770060, 2684388, 2611181, 2548048, 2490188, 2439088, 2398558, 2365550, 2334031, 2304641]
56017B304641k3371j9899k1835k1909j6262j1786j2622j2130o101j088j351k18
56005B156069O920J3375J3824J3943J8614K2579K1841K2103K6956K9858K6930
55994B373012K5379L0119L4494L3439L2982L7411M0300L7769L7175M2762M6625
55983B771467M3895M2508M7563N0931M7461M5985N2494N8099N6192N5728O3948
55972C336271P1982P1740P1451P9494Q8332Q9830R1243J00343J09846J12431J16002
55961D338965J27963J39774J43405J47495J60564J74208J79934J85969K00004
55952E798281K12398K14733K17513K30610K44340K49555K57664K79696L04464
55943H009254L19228L32907L56129L78169L87823L97433M21189M49298M69173
$$ y = [2304641, 2281270, 2261371, 2239536, 2217627, 2201365, 2189579, 2176957, 2164827, 2158726, 2157638, 2156287, 2156069, 2162989, 2176364, 2190188, 2204131, 2222745, 2245324, 2267165, 2289268, 2316224, 2346082, 2373012, 2398391, 2428510, 2463004, 2496443, 2529425, 2566836, 2607136, 2644905, 2682080, 2724842, 2771467, 2815362, 2857870, 2905433, 2956364, 3003825, 3049810, 3102304, 3160403, 3216595, 3272323, 3336271, 3408253, 3479993, 3551444, 3630938, 3719270, 3809100, 3900343, 4000686, 4110532, 4222963, 4338965, 4466928, 4606702, 4750107, 4897602, 5058166, 5232374, 5412308, 5598277, 5798281, 6010679, 6225412, 6442925, 6673535, 6917875, 7167430, 7425094, 7704790, 8009254, 8328482, 8661389, 9017518, 9395687, 9783510, 10180943, 10602132, 11051430, 11520603]
55934A1520603M91872N30912N75612O13083O55216P15162P79265Q32287Q87629
55925A7601641R61355J040079J107132J175316J259202J341807J406147J472692
55917B7365371J566027J672354J771254J879548K019444K175036K328330K505307
55909D3282671K734740K995717L260983L556109L918012M336249M800081N359125
55901G4243687O065411O902442P847662Q947664J0242516J1683956J3241124J5022045
55893A54196507J7168058J9705667K2640014K6075876L0039004L4294760L8577963
55886C42697849M2723250M5918164M5805598L9285518K5157905N988608j3146023
55879E34430869k7939660l6934086m0978957m1591158m0057470l7371049l4224189
$$ y = [11520603, 12012475, 12543387, 13118999, 13732082, 14387298, 15102460, 15881725, 16714012, 17601641, 18562996, 19603075, 20710207, 21885523, 23144725, 24486532, 25892679, 27365371, 28931398, 30603752, 32375006, 34254554, 36273998, 38449034, 40777364, 43282671, 46017411, 49013128, 52274111, 55830220, 59748232, 64084481, 68884562, 74243687, 80309098, 87211540, 95059202, 104006866, 114249382, 125933338, 139174462, 154196507, 171364565, 191070232, 213710246, 239786122, 269825126, 304119886, 342697849, 385421099, 431339263, 477144861, 516430379, 541588284, 547576892, 534430869, 506491209, 469557123, 428578166, 386987008, 346929538, 309558489, 275334300]
55872B75334300l0930794k7582843k4306229k1268761j8535058j6079466j3909121
55865A22722028j2056183j0486451r124941p947767o963733o137321n413066m789182
55857E9803384m290884l894119l544684l230324k968836k745299k523779k305034
55849C4300425k115235j951213j789007j632896j506130j404681j305707j210339
55841B1385217j135141j072635j001652r26273q65782q16614p61465p05118o64435
55832A3436102o32776n90265n40456n02419m74968m42253m06799l83888l69902
55823I092376l48137l20255l01707k91475k75778k56607k47748k46667k38071
55814F565931k21724k10472k04332j92167j75613j66483j63433j55054j43164
$$ y = [275334300, 244403506, 216820663, 192514434, 171245673, 152710615, 136631149, 122722028, 110665845, 100179394, 91054453, 83106686, 76142953, 70005632, 64592566, 59803384, 55512500, 51618381, 48073697, 44843373, 41874537, 39129238, 36605459, 34300425, 32185190, 30233977, 28444970, 26812074, 25305944, 23901263, 22595556, 21385217, 20250076, 19177441, 18175789, 17249516, 16383734, 15567120, 14805655, 14100537, 13436102, 12803326, 12213061, 11672605, 11170186, 10695218, 10252965, 9846166, 9462278, 9092376, 8744239, 8423984, 8122277, 7830802, 7555024, 7298417, 7050669, 6804002, 6565931, 6344207, 6133735, 5929403, 5737236, 5561623, 5395140, 5231707, 5076653, 4933489]
55805D933489j39900j44656j46333j45253j50564j58966j58227j49534j45006
55796C595050j45256j40111j29330j22033j17646j07526r3578q5563q1840p2123
55786B500044n7379m7743m2802l3560k2438k1486l1207m0059m4576n1226n8745
55775B048823n7659m8459m2181m1590l8723l2044k9047l0462k8475k2545k1095
55764A656543k5645k8516k7965l0657l7252m0295l8453l8697m2306m2462l7759
55753A266536l4725l5015l2998k7854k5338k5891k3403j7293j3608j3052j0089
55742A007270m802l170m615k019M572O961L082j35J79q45m687o784o815r664j4378
55727I64150j4172r442q478j2947j4863j0872p421q188q081l826J73P27P03J175
$$ y = [4933489, 4793589, 4648933, 4502600, 4357347, 4206783, 4047817, 3889590, 3740056, 3595050, 3449794, 3309683, 3180353, 3058320, 2940674, 2833148, 2739570, 2654007, 2572167, 2500044, 2442665, 2394922, 2352120, 2318560, 2296122, 2274636, 2243429, 2203370, 2158794, 2107568, 2048823, 1991164, 1942705, 1900524, 1858934, 1820211, 1788167, 1759120, 1728658, 1700183, 1677638, 1656543, 1630898, 1602382, 1574417, 1543760, 1506508, 1466213, 1427760, 1389063, 1346757, 1304295, 1266536, 1231811, 1196796, 1163798, 1135944, 1110606, 1084715, 1061312, 1044019, 1030411, 1017359, 1007270, 1002468, 999298, 994683, 992664, 997236, 1004197, 1007279, 1007144, 1007323, 1006478, 1001791, 995007, 988192, 978528, 964150, 949978, 940536, 932058, 919111, 904248, 893376, 885955, 877767, 869686, 865860, 866033, 866760, 867463, 868638]
55713H68638j778q768j4511j6638j8563k1145k0506j6559j4632j6031j5782j2096
55701F91629r400r863j0637j1306j4977k0207k1149j7668j6013j7617j6951j2465
55689E13376r512r906q714m421k298m288n304l145k483n152o138l364k167n416
55675D41068q106o591m632n371n402j957J447J504L59q9k051n929p517n482m739
55660C86512q105j1294j0514q305p570o375l244j280k469l565j892K72Q01J555
55646C24527L569M210K686K503M954O041L417M82N2j37k023l302k637k806m851
55631C36685m897q64L249L778K881L677N050N190N332O324O133M172L382N022
55617C85114O140M946L494K544n88o150r797r469q666r738r823o840l612k466
$$ y = [868638, 866860, 858092, 843581, 826943, 808380, 787235, 766729, 750170, 735538, 719507, 703725, 691629, 682229, 672366, 661729, 650423, 635446, 615239, 594090, 576422, 560409, 542792, 525841, 513376, 503864, 493958, 485244, 480823, 478525, 474237, 468933, 465788, 463305, 458153, 452015, 448651, 446484, 441068, 432962, 426371, 421739, 416368, 410966, 409009, 410456, 411960, 412319, 412230, 410179, 404250, 396733, 391251, 386512, 378407, 367113, 356599, 348294, 340724, 334349, 331105, 329825, 327356, 323791, 321899, 322171, 322972, 324527, 328096, 332306, 334992, 337495, 342449, 348490, 351907, 352389, 352441, 352304, 350281, 346979, 344342, 341536, 336685, 331788, 330924, 334173, 337951, 340832, 344509, 349559, 354749, 360081, 366405, 372538, 376710, 380092, 385114, 391254, 396200, 399694, 402238, 401650, 395500, 385703, 376234, 367568, 357830, 348007, 341167, 337555, 335089]
55603C35089j446N62Q65j355k359n65J94j988k888M16M151M622M215N565N826
55588C50904K437j007n84J022o26m272o107o307o997p401o281n704p337q570p036
55573B86134n268o126p505o564n373p008r540r353p358o756p290o828o061o712
55559A88392p416n999l693k841k644j222L96K89o24n04J30L08R98K405J978j400
55543A68553m514m525l229k971k135J168M586N190M482N199O203N137L316L301
55529A89761M193L770K909L507M564M417M423O185P866P470P069R333J2483J3330
55515B81280J2765J3653J5644J6894J8635K3034K8278L0765L0817L1703L4219
55504E37687L6510L7837L8366L6489L0414K1421J1981K096r089j9847k7679l2893
$$ y = [335089, 333643, 334205, 335070, 333715, 331356, 330791, 330985, 328997, 326109, 326525, 330676, 335298, 339513, 345078, 350904, 353341, 352334, 351750, 352772, 352146, 347874, 341767, 335460, 328463, 321062, 314781, 309077, 301740, 293170, 286134, 280866, 274740, 267235, 260671, 255298, 248290, 238750, 229397, 222039, 215283, 207993, 201165, 195104, 188392, 180976, 174977, 171284, 168443, 165799, 164577, 164973, 165262, 164638, 164134, 164264, 164572, 165570, 167975, 169953, 168553, 164039, 159514, 156285, 153314, 151179, 152347, 156933, 162123, 166605, 171804, 178007, 183144, 186460, 189761, 193954, 197724, 200633, 204140, 208704, 213121, 217544, 223729, 231595, 239065, 246134, 255467, 267950, 281280, 294045, 307698, 323342, 340236, 358871, 381905, 410183, 440948, 471765, 503468, 537687, 574197, 612034, 650400, 686889, 717303, 738724, 750705, 752801, 743712, 723865, 696186, 663293]
55492F63293l6929l9092l8573l7482l7944l8225l5673l1418k8029k4755j9628
55481B95545j4356j2268j2756j2453j0838j0122j0404r516p142n140m133l302
55469A83115k867l359l390j583L74l6j942k558j608p88j31J393K866K594J353
55454A73433R69Q40n69k167j946j106k471n647p621p541p202p239o507m912l712
55439A16602l253l063l450m475m526k596o03o58j661j526q51j123j359k83J38
55424H7313k386n649n538k294K52Q05J499L091L596J942o64l015m525m103j521
55409F8803Q15M82j350j983j538j950k952k815j908j756j593J97K356K351Q56
55394E8015N48J324Q46q73j635j289j611k445j950m11K20N9P16J573P29q94p38
$$ y = [663293, 626364, 587272, 548699, 511217, 473273, 435048, 399375, 367957, 339928, 315173, 295545, 281189, 268921, 256165, 243712, 232874, 222752, 212348, 202832, 195690, 190550, 186417, 183115, 180248, 176889, 173499, 171916, 172290, 172254, 170312, 167754, 166146, 165358, 165227, 166620, 169486, 172080, 173433, 174402, 175242, 174673, 172506, 170560, 169454, 166983, 161336, 153715, 146174, 138972, 131733, 125226, 120314, 116602, 113349, 110286, 106836, 102361, 97835, 95239, 94636, 93978, 92317, 90791, 89940, 88817, 87458, 87175, 87313, 84927, 79278, 73740, 71446, 71698, 72503, 74002, 77093, 80689, 82631, 81967, 78952, 74427, 70324, 68803, 69618, 70100, 68750, 66767, 65229, 63279, 60327, 57512, 55604, 53848, 52255, 52452, 54808, 57159, 58015, 58563, 59887, 60733, 59860, 58225, 56936, 55325, 52880, 50930, 50519, 50739, 50798, 51514, 53087, 53816, 52922, 52184]
55377E2184N97K42j536j472J010K859K540J685J178j10j895k019l61O31J80K72
55361E5985J730K783K362J490P53m06j447j140l64r97k016n67K889M623L394J963
55345G1035K191K804K960L685M515K927j085l792l012j089p03j093n55M07O86
55330G9881P68J166Q76p71k546l185k999k519j364M86K050K811L142K891J459
55315H2146m17j115o25m52j019j409j515j961k098j005k15k102n521o647m578
55300E1467k425k164k126p32Q58J357J403J571J094j17q62j106k170l571k819
55285C9658L97L042L252K768L262L335J476p93j219l35k76j528k808l038k067
55270D5126l86R31R92K50j74k81p05q50K41J482R53o59q26N31Q27o19j336k1J363
$$ y = [52184, 52781, 53023, 51487, 50015, 51025, 53884, 56424, 58109, 59287, 59177, 57282, 55263, 54902, 55533, 55713, 55985, 57715, 60498, 62860, 64350, 65103, 64697, 63250, 62110, 61746, 60749, 58733, 58166, 61055, 65678, 69072, 71035, 73226, 76030, 78990, 82675, 87190, 90117, 89032, 85240, 82228, 81139, 80436, 79343, 78788, 79195, 79881, 80649, 81815, 82691, 81920, 79374, 76189, 73190, 70671, 69307, 69793, 71843, 74654, 77796, 80687, 82146, 81729, 80614, 79989, 79537, 78518, 77109, 75594, 73633, 71535, 70530, 70315, 68213, 62692, 56045, 51467, 49042, 46878, 44752, 44020, 44878, 46235, 47638, 49209, 50303, 50186, 49324, 48218, 46048, 42477, 39658, 40055, 43097, 46349, 49117, 52379, 55714, 57190, 56397, 55178, 54843, 54567, 53039, 50231, 47193, 45126, 44740, 45671, 46663, 46913, 46739, 46458, 45753, 44903, 45144, 46626, 47579, 46920, 46094, 46625, 47452, 46833, 45497, 45476, 46839]
55251D6839J078R7l42o93j128n03J130J729O29R9J668L502L133P16k024l937m111
55234D7882j802J766L629K639P39l57j314k619k707o40J619J768K55r94j269q65
55218D7730J83J419J510Pj648j992j210j19R17J408P26n95j135o56j45K50J232
55201D7882K141J363o82j766j458j514k087j123J472K651R86q50m01R33Q34j46
55185D8235l15J7l54j135j416j353j232m94P91J343Q30O24J259J477R16J161K596
55168E2950L176J864N34N19K84j270k183p44J196J006q51k400l435m388m068j591
55152D0599J066J304m04j581j224p7J308K628L218L161L598M353L320K1k576k071
55136E6643k50l0r63p70M46P86Jp23j404k703l530k210N65K421K486J641L88j197
$$ y = [46839, 47917, 48014, 47672, 46979, 45851, 45348, 46478, 48207, 48836, 48935, 50603, 54105, 57238, 57954, 55930, 51993, 47882, 46080, 47846, 51475, 54114, 54853, 54496, 53182, 50563, 47856, 47216, 48835, 50603, 50858, 49864, 48595, 47730, 47913, 49332, 50842, 50849, 49201, 47209, 45999, 45880, 46797, 48205, 48931, 48336, 47201, 46545, 46400, 46650, 47882, 50023, 51386, 50704, 48938, 47480, 45966, 43879, 42756, 44228, 46879, 47865, 47015, 46614, 47547, 48381, 48235, 47920, 47937, 47583, 46448, 45032, 43679, 42447, 41953, 42744, 44087, 44917, 45541, 46800, 48277, 49193, 50354, 52950, 56126, 57990, 58524, 59043, 59327, 58057, 55874, 55130, 56326, 57332, 56481, 54081, 50646, 46258, 42190, 40599, 41665, 42969, 42565, 40984, 39760, 39683, 40991, 43619, 46837, 49998, 53596, 57949, 61269, 61290, 58714, 56643, 56393, 56363, 55400, 54630, 55076, 55862, 55863, 55140, 53736, 51033, 47503, 45293, 45858, 48279, 50765, 52406, 52794, 51597]
55118E1597k097j224O15J650J451O47p23k578l484k214n4O56j64n16N32J806K035
55101D7935J286L47j88k48m19j183j754p27J591L007K282N41p00j163p20R28K465
55084E3280J465j846l885k515R7J323J789K766K813M27k316k369m03O02J05p0
55068E1263M55M38n8K73J257J468P81K35r5o45n38J092K729K227M82M59K785N021
55050F9629N360M492L582K676J546L14j137k961m485m679l304r04J653K851J384
55035G6017j587k841j212P28Q22P05K481M536M076J990J310K020J412r36k434
55020H7087j818p73p01r19n48K20J123J961J753L3j424n46J577J850l47k529k942
55003H3057k389j873j113J10J290K402L760M481L195M79j406j446p33l02m9Q8
$$ y = [51597, 49500, 48276, 48891, 50541, 51992, 52639, 51916, 49338, 45854, 43640, 43586, 44242, 44078, 43562, 44094, 45900, 47935, 49221, 49568, 49380, 49132, 48713, 47530, 45776, 45049, 46640, 49647, 51929, 52470, 51770, 50607, 49887, 50815, 53280, 54745, 52899, 49014, 46499, 46596, 47919, 49708, 52474, 55287, 55714, 53398, 51029, 50626, 51228, 51333, 51263, 51718, 52156, 52098, 52371, 53628, 55096, 55877, 56112, 56017, 55372, 54834, 55926, 58655, 60882, 61364, 61823, 64608, 69629, 74989, 79481, 83063, 85739, 87285, 87599, 86462, 83501, 79016, 74337, 71033, 70129, 71782, 74633, 76017, 74430, 71589, 70377, 71105, 71927, 72632, 75113, 79649, 83725, 85715, 87025, 89045, 90457, 89521, 87087, 85269, 84496, 83795, 82876, 82328, 82548, 83671, 85632, 87385, 87418, 85994, 85448, 87025, 88875, 88528, 85999, 83057, 80668, 78795, 77682, 77792, 79082, 81484, 85244, 89725, 92920, 93399, 91993, 90547, 89814, 89512, 89463, 89551]
54987H9551k29o59m26K49N07L49L43K52l33n81L86J511J134k16m83Q93K724M271
54969I9243N408N300L424J445J342K092R92j958l966l714k821k623k473j711q23
54954I9157L5J312K490K418J525J334J627O99j278j969n84P96N52k84k76K03J99
54937A07956k69r29j857k583k206j035n24j080j524j062k21M80J081J312R05P75
54921I9219J865K949J858j029k974k763j834j188LJ972L335L633M277N687N870
54906A20880L558P25J39J851L717M336M120M150M863N443M515K183Q63K508N521
54891A69372O580N391M972P037R760J1016J1204J1666J2491J3210J3931J4620
54879B91250J4749J4340J3836J2438Q658L100j586m352p018j0781j4006j5073
$$ y = [89551, 89322, 88663, 88237, 88486, 88993, 89342, 89685, 89937, 89604, 89023, 89409, 90920, 92054, 91838, 91355, 92248, 94972, 99243, 104651, 109951, 113375, 114820, 116162, 118254, 119246, 117288, 113322, 109608, 106787, 104164, 101691, 99980, 99157, 99192, 100504, 102994, 105412, 106937, 108271, 109898, 110597, 109319, 107350, 106766, 107562, 108114, 107830, 107554, 107757, 107956, 107687, 106758, 104901, 102318, 100112, 99077, 98553, 97473, 95949, 94887, 94666, 95146, 96227, 97539, 98444, 99219, 101084, 104033, 105891, 104862, 101888, 99125, 97291, 96103, 96106, 98078, 101413, 105046, 109323, 115010, 120880, 124438, 125163, 125302, 127153, 130870, 135206, 139326, 143476, 148339, 153782, 158297, 160480, 161343, 163851, 169372, 175952, 181343, 186315, 193352, 203112, 214128, 225332, 236998, 249489, 262699, 276630, 291250, 305999, 320339, 334175, 346613, 355271, 358371, 356785, 352433, 345415, 334634, 320628, 305555]
54867C05555j5075j5647j6061j4777j2555j1532j1843j1421q995n733l564l040
54855A75312l096k446r18N40J166J297J624K138K528K941L427L493L296M288P128
54840B02718J0009J0970J0922J2078J4263J5381J4935J4140J2886R652M549n87
54828C31916n257j0378j5092j6950j5899j4729j4568j3372j0130p214o825q010
54816A93492q934r382r252p399l982j486j366j949j513r33j366j850j405j199
54802A41476k192k826j549L36Q98Q00J535K202J023j056j360M58K076K013J144
54787A44978P41P75M01r81l128m887n323n204o091p518p051m024j059l66o68K06
54771A00801J605J355n87k242k525j917q48N73J670J668P56l83j499k209j602
$$ y = [305555, 290480, 274833, 258772, 243995, 231440, 219908, 208065, 196644, 187649, 181916, 178352, 175312, 172216, 169770, 168852, 169392, 170558, 171855, 173479, 175617, 178145, 181086, 184513, 188006, 191302, 195590, 202718, 212727, 223697, 234619, 246697, 260960, 276341, 291276, 305416, 318302, 327954, 332503, 331916, 326659, 316281, 301189, 284239, 268340, 253611, 239043, 225671, 215541, 208327, 201502, 193492, 184558, 175176, 165924, 158525, 154543, 153057, 151691, 149742, 148229, 147296, 145930, 144080, 142675, 141476, 139284, 136458, 134909, 135245, 136143, 136943, 138478, 140680, 141703, 140647, 139287, 139745, 141821, 143834, 144978, 145719, 146494, 146895, 145914, 142786, 137899, 132576, 127372, 121281, 113763, 106712, 102688, 101629, 101263, 100595, 100801, 102406, 103761, 103174, 100932, 98407, 96490, 95642, 96215, 97885, 99553, 100309, 99926, 98427, 96218, 94616]
54756I4616M73K766M231N035N155L704R55q66m26P12O37p4L0O58J004J942M462
54739A25014P153P862O897O221O332O398O627P972J0057J1676J2945J4610J5938
54726B45702J5685J4728J5119J6654J6929J4926J2060R303N699N57m789q450r999
54713C44124j0325j0473j1019j1794j2003j1217r998q940p643n622l536k272j495
54700B37787m77K58j57p39P00M601Q874J1351J1809J1349J0901J0749J0747J0760
54686C28513J1186J2727J5232J7392J8174J7737J6199J2738P128J214k910n661
54674D49669r278j4546j9708k2656k2965k1754k0492k0010j9878j8923j6815j4583
54662B28061j3002j1371q894o407n341n589n719n006m001l222k592k010j653j583
$$ y = [94616, 95089, 97855, 102086, 107121, 112276, 115980, 116935, 116069, 115643, 116355, 116992, 116918, 116948, 117606, 118610, 120552, 125014, 132167, 140029, 146926, 153147, 159479, 165877, 172504, 180476, 190533, 202209, 215154, 229764, 245702, 261387, 276115, 291234, 307888, 324817, 339743, 351803, 361106, 366805, 367362, 362573, 354123, 344124, 333799, 323326, 312307, 300513, 288510, 277293, 267295, 258355, 250712, 245090, 241554, 239282, 237787, 237310, 237568, 237411, 236672, 237372, 241973, 250847, 262198, 274007, 285356, 296257, 307006, 317753, 328513, 339699, 352426, 367658, 385050, 403224, 420961, 437160, 449898, 457026, 458240, 455330, 449669, 440391, 425845, 406137, 383481, 360516, 338762, 318270, 298260, 278382, 259459, 242644, 228061, 215059, 203688, 194794, 188387, 183046, 177457, 171738, 166732, 162731, 159509, 156917, 154907, 153254, 151671]
54648A51671j701j927k066j903j710j920k116j263N75J902J749P76j38j042j866
54633A39021j780o68J67p4l61M60J900K909L333L220K206P84N11J648K338J590
54617A57204J099K392M136M462M011M289M741M076L077L340M369M561M038L958
54603B09753M130L850L901N026N646M087J905J771L051L021J709J681L335M355
54589B57221M091M637O918R153J0081J0534J0938J0448R590J0665J4082J7098
54577C75456J7552J6401J5086J3078R662N807K434j315o220j1016j3999j5300
54565D07626j6122j6771j6814j6162j4971j3317j1696j0886j0690r966q361o739
54553B55131n463l739j307O66J262J075J124J552J925J796O42j575l618m213m019
$$ y = [151671, 149970, 148043, 145977, 144074, 142364, 140444, 138328, 137065, 137640, 139542, 141291, 142067, 141929, 140887, 139021, 137241, 136573, 136740, 136666, 136305, 136765, 138665, 141574, 144907, 148127, 150333, 151117, 151628, 153276, 155614, 157204, 158303, 160695, 164831, 169293, 173304, 177593, 182334, 186410, 189487, 192827, 197196, 201757, 205795, 209753, 213883, 217733, 221634, 226660, 232306, 236393, 238298, 240069, 243120, 246141, 247850, 249531, 252866, 257221, 261312, 265949, 272867, 282020, 292101, 302635, 313573, 324021, 333611, 344276, 358358, 375456, 393008, 409409, 424495, 437573, 447235, 453042, 455476, 454161, 447941, 436925, 422926, 407626, 391504, 374733, 357919, 341757, 326786, 313469, 301773, 290887, 280197, 270231, 261870, 255131, 249668, 245929, 244622, 245288, 246550, 247625, 248749, 250301, 252226, 254022, 254664, 253089, 249471, 245258, 241239]
54538B41239m733o173o392n061m305n377o738o602n285l750j813M84J582M17j558
54523A85935k257j926k439m288n927n889m239k150r20j132k027k119q83O37J397
54508A51773J585J704J381N7j715k667k267j093J6P39J302K004K619K483J492
54493A59413N61M34N34K1o00k29Q67J379J109J066J541J804J870K621L840M024
54477A80255K846J935K501L885N235O804Q531R195Q300P312P575Q313Q032O736
54463B67455N260L438P26k061l369l134l073m515o868q450q287o961n817n451
54449B18893n262m743m510n148n706m756k728j526j691j653k94J448K230K072
54435A86626J681J216O73M74R03J710K660L527L419J516j244k695k132r33o0J200
$$ y = [241239, 236506, 230333, 223941, 218880, 214575, 209198, 202460, 195858, 190573, 186823, 185010, 185494, 187076, 187493, 185935, 183678, 181752, 179313, 175025, 169098, 163209, 158970, 156820, 155900, 154768, 152741, 150622, 149739, 150376, 151773, 153358, 155062, 156443, 156500, 154785, 152118, 149851, 148758, 148774, 149513, 150815, 152819, 155438, 157921, 159413, 159974, 160408, 160942, 160963, 160363, 160134, 161001, 162380, 163489, 164555, 166096, 167900, 169770, 172391, 176231, 180255, 183101, 185036, 187537, 191422, 196657, 203461, 211992, 221187, 229487, 236799, 244374, 252687, 260719, 267455, 272715, 276153, 276879, 274818, 271449, 268315, 265242, 260727, 253859, 245409, 237122, 230161, 224344, 218893, 213631, 208888, 204378, 199230, 193524, 188768, 186040, 184514, 182823, 181170, 180876, 182324, 184554, 186626, 188307, 189523, 190196, 190670, 191573, 193283, 195943, 199470, 202889, 204405, 203161, 200466, 198334, 197401, 197341, 198541]
54419A98541L290N000N133L983K126m69k944l070j0L777N104L554J082o96j204
54404B23197k90J214J217j229l854l510l10K476K612J113kn08j462l046m016l318
54388B10284j591o31j360k716l111k487k010k009j538k34Q35O96k41j036j327
54373A91524j055k43L92k06j755k510j514J14Q37M69m01j397j926j172M88J400
54357A83045R74P26J850L231L355K783L018M039M682M645M455M106L356K711K730
54342B29706L043L339M340O244P320N950L328K000K364K753K552K761L300K336
54328B81336q63m278n440m102j817k4N71l92k799n768q031q644p467n313l517
54313B23452k869k997l167l296l638l870l329j992n85K28K70j76l94L54J738K330
$$ y = [198541, 201831, 206831, 211964, 215947, 218073, 217604, 214660, 211590, 211580, 215357, 220461, 224015, 225097, 224401, 223197, 222907, 224121, 225338, 224109, 220255, 216745, 216435, 218911, 221523, 222636, 222634, 222126, 220664, 217618, 213602, 210284, 208693, 208062, 206702, 203986, 200875, 198388, 196378, 194369, 192831, 192597, 193432, 194128, 193887, 192851, 191524, 190469, 190226, 190618, 190412, 188657, 186147, 184633, 184747, 185584, 186053, 185652, 184255, 182329, 181157, 181645, 183045, 184019, 184745, 186595, 189826, 193181, 195964, 198982, 203021, 207703, 212348, 216803, 220909, 224265, 226976, 229706, 232749, 236088, 240428, 246672, 253992, 259942, 263270, 265270, 267634, 270387, 272939, 275700, 279000, 281336, 280473, 276195, 270755, 266653, 264836, 264812, 265383, 264991, 262192, 256424, 248393, 239749, 232282, 226969, 223452, 220583, 217586, 214419, 211123, 207485, 203615, 200286, 198294, 197709, 197937, 198207, 198031, 197637, 197991, 199729, 202059]
54297B02059J365K2k9J189K212K237J827J726K027K515K900K830K442K650L940
54282B31912N088M341J994N04J557L865M607K561p36k826k817k003k085l177l980
54267B38805l757l316l739m902n837n995n474m482l321k686l266m999o985p952
54253A72094o948m172j342l87j389k507k384j703j790k622l159k898k179j485
54239A37129j217j691k565k852k199j536j724k267k151j304l79K63M27k73j677
54224A15984k653k410j616j229r76j93O32N80R4M80J841K837K537J295r2j129
54208A15982j493j127m62K08J103K132K306J111k35j89R22J536J237R33J000R38
54192A25902Q58J479K395K091K78j377j543q92o34p07m33n1l21j173j830j943
$$ y = [202059, 203424, 203446, 203417, 204606, 206818, 209055, 210882, 212608, 214635, 217150, 220050, 222880, 225322, 227972, 231912, 237000, 241341, 243335, 243839, 245396, 249261, 253868, 256429, 255693, 252867, 250050, 248047, 245962, 242785, 238805, 235048, 231732, 227993, 223091, 217254, 211259, 205785, 201303, 197982, 195296, 192030, 187031, 180046, 172094, 165146, 160974, 159632, 159245, 157856, 155349, 152965, 151262, 149472, 146850, 143691, 140793, 138614, 137129, 135912, 134221, 131656, 128804, 126605, 125069, 123345, 121078, 118927, 117623, 117244, 117507, 117934, 117661, 115984, 113331, 110921, 109305, 108076, 107100, 106907, 107539, 108119, 108213, 108693, 110534, 113371, 115908, 117203, 117111, 115982, 114489, 113362, 112900, 113108, 114211, 116343, 118649, 119760, 119525, 119336, 120258, 121794, 123031, 123964, 124964, 125902, 126760, 128239, 130634, 132725, 133003, 131626, 130083, 129191, 128557, 127850, 127417, 127366, 127045, 125872, 124042, 122099]
54176A22099j718j127J09J635K365J645J02j034j291j169j038n10O85J699J356
54161A23808j78j402j394p61l97k36P0J13p01k011k749k393j362l78J19K04L88
54144A10740J003J534J168Q6o63p91j187k219k929k651k179k273k176r58O76J285
54128I8466Q01K74J28K3k4K23L29k29q67o24K82Q32Q06P55O75J41m17j06P53Q04
54108A03025l35j545j935j847j804j646j163p01n48m48p3N38J281K081K551K108
54092I9539P83n19q37j96L00m12j936k407n67K313L643K708J324J001J040K98
54076A06075p94j304j443j671j354j5J212J181Q85J843L153K502j00j939j266
54061A06965O08J341K02j849l398l590k763k179k343k135o39R66R63m6N8J577
$$ y = [122099, 120381, 119254, 119363, 120998, 123363, 125008, 125110, 124076, 122785, 121616, 120578, 120068, 120753, 122452, 123808, 123630, 122228, 120834, 120073, 119676, 119440, 119510, 119623, 118922, 116911, 114162, 111769, 110407, 110029, 110148, 110352, 110740, 111743, 113277, 114445, 114531, 113868, 113077, 111890, 109671, 106742, 104091, 101912, 99639, 97463, 96505, 97181, 98466, 99267, 99541, 99669, 99692, 99668, 99891, 100220, 99991, 99124, 98500, 98782, 99614, 100420, 101175, 101850, 101991, 101574, 101468, 102221, 103025, 102690, 101145, 99210, 97363, 95559, 93913, 92750, 92049, 91501, 91053, 90980, 91518, 92799, 94880, 97431, 99539, 100322, 99803, 98966, 98770, 99070, 98658, 96722, 94315, 93748, 96061, 99704, 102412, 103736, 104737, 105777, 106075, 105281, 103977, 102534, 100863, 99509, 99494, 100706, 101887, 102772, 104615, 107768, 110270, 110170, 108231, 106965, 107573, 108914, 109116, 107267, 103869, 100279, 97516, 95337, 92994, 90859, 90220, 91186, 92149, 92103, 92161, 93738]
54045I3738K588K083J263J247J376P32l01q56q04m65r0j10q70j674j155Q60K769
54028A00331K953J407n34j426o85R13J780J316P73J389K320J850J89p32j02R61
54012A12703J429J514J481J054L35j65n94j476k121j074J547L822M500M252L956
53997A31163L462K593J850J377O51j68L7J520K826K503P35j225k218j616K50J937
53981A45677K393K632M338O796P303N112K786K710M190N231N495N884O474O479
53967B13500N665M631M081M403N462O449O587O078N568M906L720K890L556M754
53953B82250M172J761J90J025K729L486L606L686K711J1k638l174k201j750k174
53938B93690k281j833j801k576l631m796o305p738q178p410o083m879m238m486
$$ y = [93738, 96326, 98409, 99672, 100919, 102295, 103027, 102726, 101870, 101066, 100601, 100511, 100401, 99531, 97857, 96702, 97562, 100331, 103284, 104691, 104157, 102731, 102046, 102959, 104739, 106055, 106828, 108217, 110537, 112387, 112576, 111844, 111742, 112703, 114132, 115646, 117127, 118181, 118516, 118351, 117757, 116281, 114160, 113086, 114633, 118455, 122955, 127207, 131163, 134625, 137218, 139068, 140445, 141096, 140928, 140965, 142485, 145311, 147814, 148549, 147324, 145106, 143490, 143740, 145677, 148070, 150702, 155040, 161836, 169139, 174251, 177037, 179747, 183937, 189168, 194663, 200547, 207021, 213500, 219165, 223796, 227877, 232280, 237742, 244191, 250778, 256856, 262424, 267330, 271050, 273940, 277496, 282250, 286422, 288183, 288373, 289398, 292127, 295613, 299219, 302905, 305616, 305627, 302989, 299815, 297614, 295864, 293690, 291409, 289576, 287775, 285199, 281568, 276772, 270467, 262729, 254551, 247141, 241058, 236179, 231941, 227455]
53924B27455n415o152o004n085l648j733R6O52l33j533j662j014n81o14q53j241
53908A92335j425n35J448K943K525P66n99p07J40J443K703L288L061K714K745
53893B12845K666J891P45n0k36J62J111K199K794K981L376L753L185J913J435
53878B40770K150K695K526L140N391P454P304N700M749M742M500L872L649L613
53864C02255K691R02n49j010q16k28P30J555J659J341J486K447L975N752P248
53849C29438P770P397P106P281P040N857M688M532N133O044P503R065R050O957
53835D24861M821M306M064K148m22j266o46j004l034n026n901o280o472n973n106
53820C99070m937n332n245m994o002q045r158q775q544r292r545q177o491o223
$$ y = [227455, 222040, 215888, 209884, 204799, 201151, 199418, 199514, 200166, 199833, 198300, 196638, 195624, 195043, 194429, 193576, 192335, 190910, 190375, 191823, 194766, 197291, 198057, 197458, 196751, 196891, 198334, 201037, 204325, 207386, 210100, 212845, 215511, 217402, 218147, 218097, 217861, 218023, 219134, 221333, 224127, 227108, 230484, 234237, 237422, 239335, 240770, 242920, 245615, 248141, 251281, 256672, 264126, 271430, 277130, 281879, 286621, 291121, 294993, 298642, 302255, 304946, 305848, 305299, 304289, 303473, 303245, 303975, 305530, 307189, 308530, 310016, 312463, 316438, 322190, 329438, 337208, 344605, 351711, 358992, 366032, 371889, 376577, 381109, 386242, 392286, 399789, 408854, 417904, 424861, 429682, 433988, 438052, 440200, 439778, 438512, 437866, 436862, 433828, 428802, 422901, 416621, 410149, 404176, 399070, 394133, 388801, 383556, 378562, 372560, 364515, 355357, 346582, 338038, 328746, 319201, 311024, 304533, 298310]
53806B98310p034p438p009o429o167o164o310o383o054n482n212n241m846l662
53792B14879k226j184p48j013j977l055l369k825k099j557j018n70o87j349j926
53777A89276k010j651r78m16q96k690m277l773j409O82J268J134J416K254L286
53762A81216M060L695J654q26j598l71Q47O36r2M8Q63J468J890K566L176L221
53746B02453L043L176L284K735J821J430J852K731L882N386O939P840P717P028
53732B61317O791P796R769J1347J1336J0060Q866Q375P969P134O286N887N544
53719C68477M711L632K816K036N82j608l742n050n443n295m947m589m375m353
53705C42852m371m255m241m907o290p301o720m797l128k727l022l128l143l517
$$ y = [298310, 291276, 283838, 276829, 270400, 264233, 258069, 251759, 245376, 239322, 233840, 228628, 223387, 218541, 214879, 212653, 211469, 210721, 209708, 207731, 204676, 201307, 198482, 196383, 194826, 193808, 193238, 192551, 191202, 189276, 187266, 185615, 184637, 184221, 183325, 180635, 176358, 172585, 171176, 171858, 173126, 174260, 175676, 177930, 181216, 185276, 188971, 190625, 189799, 188201, 187830, 188677, 189313, 189221, 189269, 190132, 191600, 193490, 196056, 199232, 202453, 205496, 208672, 211956, 214691, 216512, 217942, 219794, 222525, 226407, 231793, 238732, 246572, 254289, 261317, 268108, 275904, 285673, 297020, 308356, 318416, 327282, 335657, 343626, 350760, 357046, 362933, 368477, 373188, 376820, 379636, 381672, 382254, 380646, 376904, 371854, 366411, 361116, 356169, 351580, 347205, 342852, 338481, 334226, 329985, 325078, 318788, 311487, 304767, 299970, 296842, 294115, 291093, 287965, 284822, 281305]
53691B81305m024m234m326m473m086k719j193p31j281j797j801j603j298p59m23
53676B46557q83j710j799r30N3O09R82J251R92J65m63j88Q56J846J951R70l11
53659B49948q45o94q67j428j052N53J383o7j875r69K297M407L510J636J484L097
53643B60518M544M453K933J018j13r4L36O55J644L949O221O529N279M575M904
53628C07351M853M274M913P027Q081O358L601K376K564K475J953K266L602M600
53614C66294M123K421P31M50K041M133M568K958J229R15J218P20k79m82L37J439
53598C92816K463L247K937Q25k140m014l968k808j595o79pL92L77k34j357k234
53582C84021j885l66J085J485J022K40p30j602j652p48J97N65R17J623J823Q18
$$ y = [281305, 277281, 273047, 268721, 264248, 260162, 257443, 256250, 255519, 254238, 252441, 250640, 249037, 247739, 246980, 246557, 245674, 243964, 242165, 241235, 241288, 241897, 242879, 244130, 245122, 245287, 244824, 244636, 245492, 247338, 249289, 250259, 249948, 249103, 248409, 247542, 246114, 245062, 245615, 246998, 246931, 245056, 244087, 246384, 250791, 254301, 255937, 257421, 260518, 265062, 269515, 272448, 273466, 273353, 273259, 273595, 274250, 275894, 279843, 286064, 292593, 297872, 302447, 307351, 312204, 316478, 321391, 328418, 336499, 342857, 346458, 348834, 351398, 353873, 355826, 358092, 361694, 366294, 370417, 372838, 373569, 374019, 376060, 380193, 384761, 387719, 388948, 389863, 391081, 391801, 391522, 391040, 391377, 392816, 395279, 398526, 401463, 402288, 400148, 396134, 392166, 389358, 387763, 387084, 387077, 387469, 387846, 387612, 386255, 384021, 382136, 381770, 382855, 384340, 385362, 385602, 384872, 383270, 381618, 380870, 381067, 381632, 382549, 384172, 385995, 386813]
53566C86813m18m99L58J009J498K798M711N680N022L845L367L413L302L310M337
53551D28546O309P863P860O817O307O922P510O919N895O199Q058R711R631Q136
53537E32683O476N499N691P341R871J1875J2602J2563J2107J0601P971N866N846
53524F46992P175P870P430P079P512P968P632O701N742M868L981L126K373J761
53510G28210J485J739K238K350J713M96q29j706j734r97j29J78l68j706l453m787
53494G22700m811l461j655l44J64j46j223k462k705j508K00J169J173Q39P51J208
53478G09889K325L761M801N216N533O007O035N214M366M624O009P672R101J0341
53464G90894J1438J2544J4230J6758J9206K0227J9777J9319K0122K1914K3445
$$ y = [386813, 386395, 385896, 386254, 387263, 388761, 391559, 396270, 401950, 406972, 410817, 414184, 417597, 420899, 424209, 428546, 434855, 442718, 450578, 457395, 463702, 470624, 478134, 485053, 490948, 497147, 505205, 514916, 524547, 532683, 539159, 544658, 550349, 557690, 567561, 579436, 592038, 604601, 616708, 627309, 635280, 641146, 646992, 654167, 662037, 669467, 676546, 684058, 692026, 699658, 706359, 712101, 716969, 720950, 724076, 726449, 728210, 729695, 731434, 733672, 736022, 737735, 738231, 737402, 735696, 733962, 732965, 732836, 733014, 732646, 730940, 727487, 722700, 717889, 714428, 712773, 712429, 712593, 712447, 711224, 708762, 706057, 704549, 704749, 705918, 707091, 707930, 708681, 709889, 712214, 715975, 720776, 725992, 731525, 737532, 743567, 748781, 753147, 757771, 763780, 771452, 780553, 790894, 802332, 814876, 829106, 845864, 865070, 885297, 905074, 924393, 944515, 966429, 989874]
53453I89874K4145K4798K6528K9217L1425L2269L2828L4839L8138M0791M1909
53442A346761M2943M5390M8449N0179N0222N0102N1106N2963N4632N5633N6428
53431A904808N7884O0225O2352O2608O0623N8024N6905N7905N9970O1626O2165
53420B565095O2024O2235O3130O3707O2977O1593O0980O0925N9566N6181N2292
53409C230705M9296M6605M3313M0055L7744L5664L2526K8603K5229K2780K0722
53398C613242J9148J8678J8989J8738J6811J2764O546j088q298j3606j7366k0873
53386C663685k4531k7990l1442l5378l9439m2819m5613m8429n1050n2802n3892
53375C210300n5081n6309n6980n7351n8093n8737n8079n6121n4130n2774n1650
$$ y = [989874, 1014019, 1038817, 1065345, 1094562, 1125987, 1158256, 1191084, 1225923, 1264061, 1304852, 1346761, 1389704, 1435094, 1483543, 1533722, 1583944, 1634046, 1685152, 1738115, 1792747, 1848380, 1904808, 1962692, 2022917, 2085269, 2147877, 2208500, 2266524, 2323429, 2381334, 2441304, 2502930, 2565095, 2627119, 2689354, 2752484, 2816191, 2879168, 2940761, 3001741, 3062666, 3122232, 3178413, 3230705, 3280001, 3326606, 3369919, 3409974, 3447718, 3483382, 3515908, 3544511, 3569740, 3592520, 3613242, 3632390, 3651068, 3670057, 3688795, 3705606, 3718370, 3724916, 3723828, 3715530, 3701924, 3684558, 3663685, 3639154, 3611164, 3579722, 3544344, 3504905, 3462086, 3416473, 3368044, 3316994, 3264192, 3210300, 3155219, 3098910, 3041930, 2984579, 2926486, 2867749, 2809670, 2753549, 2699419, 2646645, 2594995]
53364B594995n0499m9285m7057m2627l6617l1147k7047k3157j8833j5136j2618
53353B240972r743m888J336P192J2188J6920K1451K5326K8780L2610L6962M1322
53341B450428M5573N0168N5158N9878O3709O6703O9320P1976P4882P8111Q1678
53330C167584Q5660R0153R4999R9813J04310J08547J12779J17238J21899J26196
53320D229178J29192J30543J31197J32543J34866J37159J38445J38639J37965
53311E439727J36373J33954J31186J28244J24396J18715J11205J02853R4775Q7589
53301F609017Q1354P5599O9504O2549N5028M7637M0517L3051K4721J5747O563
53290G121287k973j3470k5271l8489n3494p0487q8193j04136j16868j27221j36426
$$ y = [2594995, 2544496, 2495211, 2448154, 2405527, 2368910, 2337763, 2310716, 2287559, 2268726, 2253590, 2240972, 2231229, 2226341, 2227677, 2234869, 2247057, 2263977, 2285428, 2310754, 2339534, 2372144, 2409106, 2450428, 2496001, 2546169, 2601327, 2661205, 2724914, 2791617, 2860937, 2932913, 3007795, 3085906, 3167584, 3253244, 3343397, 3438396, 3538209, 3642519, 3751066, 3863845, 3981083, 4102982, 4229178, 4358370, 4488913, 4620110, 4752653, 4887519, 5024678, 5163123, 5301762, 5439727, 5576100, 5710054, 5841240, 5969484, 6093880, 6212595, 6323800, 6426653, 6521428, 6609017, 6690371, 6765970, 6835474, 6898023, 6953051, 7000688, 7041205, 7074256, 7098977, 7114724, 7121287, 7118314, 7104844, 7079573, 7041084, 6987590, 6917103, 6828910, 6724774, 6607906, 6480685, 6344259]
53279F344259j43888j48143j49435j49608j49674j49288j48629j48619j48781
53270E008194j47112j43256j39817j38888j38904j37019j33160j29491j26669
53261C773878j23140j17994j12242j06813j01120r4228q6177p7682o9641o3108
53251B821733n8489n4513m9234m2525l6348l2064k8547k3780j7478j1314o956
53240B460485m574l015r92J923N199Q166J0659J2841J4790J6607J8549K0639K2649
53227B583926K4877K8159L2403L5982L7768L9145M2642M8735N5256N9903O2105
53216C050901O2493O1825O0747N9607N8210N6448N5041N4769N5027N4324N2239
53205C681631M9749M7512M5036M1850L8481L5648L3279L0662K7119K2414J6972
$$ y = [6344259, 6200371, 6052228, 5902793, 5753185, 5603511, 5454223, 5305594, 5156975, 5008194, 4861082, 4717826, 4578009, 4439121, 4300217, 4163198, 4030038, 3900547, 3773878, 3650738, 3532744, 3420502, 3313689, 3212569, 3118341, 3032164, 2954482, 2884841, 2821733, 2763244, 2708731, 2659497, 2616972, 2580624, 2548560, 2520013, 2496233, 2478755, 2467441, 2460485, 2455911, 2452896, 2451904, 2453827, 2459026, 2467192, 2477851, 2490692, 2505482, 2522089, 2540638, 2561277, 2583926, 2608803, 2636962, 2669365, 2705347, 2743115, 2782260, 2824902, 2873637, 2928893, 2988796, 3050901, 3113394, 3175219, 3235966, 3295573, 3353783, 3410231, 3465272, 3520041, 3575068, 3629392, 3681631, 3731380, 3778892, 3823928, 3865778, 3904259, 3939907, 3973186, 4003848, 4030967, 4053381, 4070353]
53194D070353J1559O153m05q751j7503k4723l0548l6844m4399n2093n8930o5137
53182C748732p0788p5133p8101q0931q4335q7314q8707q8720q7926q5966q2491
53171B838320p8498p5492p3777p2656p1760p1176p0733p0118o9512o9288o9265
53160B046045o8913o7888o5973o2960n9324n6371n4737n3150m9754m4581l9669
53149A422725l6574l4752l2827l0597k8875k7803k6440k4411k3028k3780k5957
53138A107681k7011k5541k2884k0983j9837j8215j6199j5388j6507j8287j9173
53127H87656j9062j8849j9053j9408j9356j8514j7053j5793j5490j6004j6651
53116F92423j7193j7760j7944j6991j5095j3515j3093j3408j3731j3853j3605
$$ y = [4070353, 4081912, 4088065, 4087660, 4078909, 4061406, 4036683, 4006135, 3969291, 3924892, 3872799, 3813869, 3748732, 3677944, 3602811, 3524710, 3443779, 3359444, 3272130, 3183423, 3094703, 3006777, 2920811, 2838320, 2759822, 2684330, 2610553, 2537897, 2466137, 2394961, 2324228, 2254110, 2184598, 2115310, 2046045, 1977132, 1909244, 1843271, 1780311, 1720987, 1664616, 1609879, 1556729, 1506975, 1462394, 1422725, 1386151, 1351399, 1318572, 1287975, 1259100, 1231297, 1204857, 1180446, 1157418, 1133638, 1107681, 1080670, 1055129, 1032245, 1011262, 991425, 973210, 957011, 941623, 925116, 906829, 887656, 868594, 849745, 830692, 811284, 791928, 773414, 756361, 740568, 725078, 709074, 692423, 675230, 657470, 639526, 622535, 607440, 593925, 580832, 567424, 553693, 539840, 526235]
53105E26235j2462j0360q298p361p414p326o341m813l723l776m888o296p099o777
53091D29301n484m153m094n661p291o871m417k388k601m100n033n276n555n268
53077C61109l325o73M69k32r82r69j434l051m384m032k632j577j049m18L62Q08
53061C37990O42j3o19k79J284K847K947J951J381J286L23j459k296j749j586k515
53045C40135k580n56J345N60j770k391o03J245J479R00Q64J521K322K861K894
53030C48226K534K475L162L819L223J282r56k626l633m168m474m840n213n165
53016C33646m751m785n551o023n248l763k682k093j512j218j791k807l354l568
53002B84500m273n298n576m902m246m072l699k658j611j278j368j253j052j277
$$ y = [526235, 513773, 503413, 495115, 487754, 480340, 473014, 466673, 461860, 458137, 454361, 449473, 443177, 436078, 429301, 423817, 419664, 415570, 409909, 402618, 395747, 391330, 388942, 386341, 382241, 377208, 371932, 366377, 361109, 357784, 357111, 357580, 357348, 356366, 355397, 353963, 350912, 346528, 342496, 339864, 338287, 337238, 336820, 337182, 337990, 338632, 338619, 338000, 337721, 339005, 341852, 344799, 346750, 348131, 349417, 349740, 348281, 345985, 344236, 342650, 340135, 337555, 336999, 338344, 338904, 337134, 334743, 334140, 335385, 336864, 337764, 338628, 340149, 342471, 345332, 348226, 350760, 353235, 356397, 360216, 363439, 364721, 363765, 361139, 357506, 353338, 348864, 344024, 338811, 333646, 328895, 324110, 318559, 312536, 307288, 303525, 300843, 298750, 297238, 296020, 294229, 291422, 288068, 284500, 280227, 274929, 269353, 264451, 260205, 256133, 252434, 249776, 248165, 246887, 245519, 244266, 243214, 241937]
52988B41937j741j673r79q10k210m392n070k992K36J637P9k721m344l997k628
52973B10332j627j682k334k425j571j025k074l826m031k245n44n84j602k132k077
52958A80553j906j308jJ164J305P87K07p54k289l317k917j905j408r15N12J988
52942A69796J820J68j244j735k021k142j323mJ14j275k179r38J583L299L323K250
52926A69492R71l5o85j280k117k840k563r03J424L180L514K412P40k97j29O89
52910A71573J188R42J16r10j424n78J617L854M895M885M638M141K787P75p36q64
52894A96899K82J897L040L283L361M560O738P870O524M025K827L406M239M445
52880B53396M681N475O138N684L797P94k364m121l679k313k198l758n299n383
$$ y = [241937, 240196, 238523, 237544, 236734, 234524, 230132, 225062, 222070, 222306, 223943, 224022, 221301, 216957, 212960, 210332, 208705, 207023, 204689, 202264, 200693, 199668, 197594, 193768, 189737, 187492, 186948, 186364, 184762, 182630, 180553, 178647, 177339, 177338, 178502, 179807, 180594, 180801, 180047, 177758, 174441, 171524, 169619, 168211, 167296, 167808, 169796, 171616, 171784, 170540, 168805, 166784, 164642, 163319, 163315, 163429, 162154, 159975, 159037, 160620, 163919, 167242, 169492, 170463, 170428, 169743, 168463, 166346, 163506, 160943, 160040, 161464, 164644, 168158, 170570, 171310, 171013, 170884, 171573, 172761, 173703, 173819, 172909, 171485, 170907, 172524, 176378, 181273, 186158, 190796, 194937, 197724, 198499, 197763, 196899, 197181, 199078, 202118, 205401, 208762, 213322, 220060, 227930, 234454, 238479, 241306, 244712, 248951, 253396, 258077, 263552, 269690, 275374, 279171, 279965, 277601, 273480, 269801, 267488, 265290, 261532, 256233, 250850]
52866B50850m353l288k634k291k080j672q68k26p32k358l685l441j923n79m57
52851B20263j247j741j184k13n7p72j053j37J068J391R06J40j093k759l548k380
52835B07584l56N82L63L30N73j58j843k673j611K61J552K036J923J226M20K92
52819B10501N05j55j592k020o05J122J445O52o2n14r17n52J198L136L206J183
52803B16531r31j378m77K81K44J63R05K061K216P65j027j358j01J165J280O99
52787B21038L26J35l59r13o31Q76K901M262M445M144M530N839O938O603M876K680
52771B67690O51r78j736j194K22J635K807M003M919M780L515J938P15J8l2M22
52755B89375M26q33k530k978k029j294j686k279k311k758m756p449q688p474m819
$$ y = [250850, 246497, 243209, 240575, 238284, 236204, 234532, 233664, 233438, 232706, 230348, 226663, 223222, 221299, 220720, 220263, 219016, 217275, 216091, 215878, 215821, 215049, 213996, 213859, 214927, 216318, 217224, 217364, 216271, 213512, 209964, 207584, 207228, 207810, 208173, 208503, 209076, 208918, 207075, 204402, 202791, 203052, 204604, 206640, 208563, 209789, 210209, 210501, 211006, 210851, 209259, 207239, 206634, 207756, 209201, 209853, 209791, 209277, 208360, 207808, 209006, 212142, 215348, 216531, 215600, 214222, 213745, 214026, 214270, 214433, 215338, 217399, 219615, 220380, 219353, 217995, 217894, 219059, 220339, 221038, 221364, 221499, 221140, 220227, 219596, 220472, 223373, 227635, 232080, 236224, 240754, 246593, 253531, 260134, 265010, 267690, 268341, 267363, 265627, 264433, 264655, 266290, 269097, 273100, 278019, 282799, 286314, 288252, 288967, 288985, 288953, 289375, 289801, 288968, 286438, 283460, 281431, 280137, 278451, 276172, 273861, 271103, 266347, 258898, 250210, 242736, 237917]
52740B37917k457j511k128l636m972n327m635l455k540k313k465k243j476r93
52726A97766j530k602l123k799k193j691j369j481k127k590k090j106q75j656
52712A70534k454k426j556j44J316J930J194n6o17o14j034j962k674l116l649
52697A54672l618k172l32r6j344j910j068m72j024j354n81o3p51j196j13R73K8
52680A39579k040k685j576p16j216k076k120j221L17K001K692J417j069k736k523
52665A26028j229j1Q94J638J849R54q54k389k454j089L08N04j44l73N5J61m81
52648A23367r77o28j5J36J70O89J410J695J516J095K79q48j408p84K75M60m55
52631A25977j506j633l74K006M422N549N141M255L723L103J734M1r86r55L2J847
$$ y = [237917, 235460, 233949, 231821, 228185, 223213, 217886, 213251, 209796, 207256, 204943, 202478, 200235, 198759, 197766, 196236, 193634, 190511, 187712, 185519, 183828, 182459, 180978, 178851, 176261, 174171, 173065, 172190, 170534, 168080, 165654, 164098, 163954, 165270, 167200, 168394, 168338, 167721, 167107, 166073, 164111, 161437, 158321, 154672, 151054, 148882, 148550, 148454, 147110, 145200, 144132, 143660, 142636, 141282, 140701, 140638, 139887, 138691, 138578, 139551, 139579, 137539, 134854, 133278, 132562, 131346, 129270, 127150, 125929, 126246, 128247, 130939, 132356, 131287, 128551, 126028, 124799, 124788, 125682, 127320, 129169, 130123, 129269, 126880, 124426, 123337, 123645, 124149, 124005, 123632, 123687, 123848, 123367, 122390, 121762, 121747, 121883, 122053, 122742, 124152, 125847, 127363, 128458, 128737, 127889, 126481, 125697, 125972, 126432, 125977, 124471, 122838, 122464, 124470, 128892, 134441, 139582, 143837, 147560, 150663, 152397, 152438, 151452, 150497, 150529, 152376]
52615A52376L933N119M883M224M307M787M405K865J105j06q92j678k595l442l840
52600A75451l590l080k959l160k896j899q67k88J96O38P2k019m283m840l636k324
52584A40516k057k326k124j330o91p35j019n65P71J773J301r2q35m44K06O39J267
52567A34255J944J617J06j294j819k348l565m363l396j079J129K496L045K814
52553A29542K189K087K560K284N28j357j675p20l6q9o7O19J834L171L986L643
52537A48499K514J809J650O63j495k881k101q12j346l051l321j473O82J734J998
52522A43069K137K368K882L380K586k8k516k376L2J973K061J355R18M91oK66J572
52505A60164K889L323K909J845L04q30n00R20J899J835J421Q97l27j900k197n93
$$ y = [152376, 156309, 161428, 166311, 170535, 174842, 179629, 184034, 186899, 188004, 187898, 187006, 185328, 182733, 179291, 175451, 171861, 168781, 165822, 162662, 159766, 157867, 157000, 156712, 156908, 157546, 157618, 155599, 151316, 146476, 142840, 140516, 138459, 136133, 134009, 132679, 131988, 131253, 130234, 129669, 130440, 132213, 133514, 133422, 132587, 132143, 132349, 132988, 134255, 136199, 137816, 137922, 136628, 134809, 132461, 128896, 124533, 121137, 120058, 121187, 123683, 126728, 129542, 131731, 133818, 136378, 138662, 139190, 137833, 136158, 135438, 135402, 135313, 135246, 135865, 137699, 140870, 144856, 148499, 151013, 152822, 154472, 155135, 153640, 150759, 148658, 147846, 146500, 143449, 140128, 138655, 139337, 141071, 143069, 145206, 147574, 150456, 153836, 156422, 156394, 153878, 151502, 151534, 153507, 155568, 156923, 157841, 158332, 158326, 158592, 160164, 163053, 166376, 169285, 171130, 171434, 170604, 170104, 171024, 172923, 174758, 176179, 177076, 176749, 174849, 172652, 172059]
52489A72059J331J780Q74J1m4L40M85J93o0L70J207J197j25j246n46J222J942
52472A80990J332J148K125K787K009Q55P68J391J504J035Q57J111Q88m08k102
52457A96290k811j837J2J223J306J155J385J233j8j385j371j44Q77J178J239R27
52441A99259l84k109k759k145j536j365n74J182K518K233R28j31m90k51M11Q70
52425A95657L40o87n45J309L163L096J299l96o26M80J826K213J231l95j530j683
52409B04752r87L54J778K169J163K27R19K466K799J733J155J922K668K155R84
52394B26257K64L08J152K747M066L726K068Q96O91R6j322k010j176k37l24n23
52378B36679p5o6j146j612j03J652J259n81j356p40m59q07l00J180J651J73j510
$$ y = [172059, 173390, 175170, 176044, 176055, 176011, 176351, 176836, 177029, 176969, 177339, 178546, 179743, 179618, 178372, 177826, 179048, 180990, 182322, 183470, 185595, 188382, 190391, 191246, 192014, 193405, 194909, 195944, 196801, 197912, 198800, 198392, 196290, 193479, 191642, 191654, 192877, 194183, 195338, 196723, 197956, 197938, 196553, 195182, 195038, 195915, 197093, 198332, 199259, 198875, 196766, 194007, 191862, 190326, 188961, 188387, 189569, 192087, 194320, 195248, 195117, 194627, 194376, 194787, 195657, 195997, 195310, 194765, 196074, 199237, 202333, 203632, 203236, 202610, 203090, 204916, 207129, 208360, 207965, 206435, 204752, 203765, 204119, 205897, 208066, 209229, 209456, 210375, 212841, 215640, 217373, 218528, 220450, 223118, 225273, 226257, 226521, 226829, 227981, 230728, 234794, 238520, 240588, 241484, 242175, 242271, 240949, 238939, 237763, 237526, 237202, 236679, 236604, 236538, 235392, 233780, 233677, 235329, 236588, 236007, 234651, 233911, 233452, 232645, 232345, 233525, 235176, 235349, 233839]
52361B33839j450k1J085J121N72o2o64r93n99N61J753K026J307O58R70J669J468
52344B43240L07m88j15P85J450K011K549K451J602J124J823K745K424Q78p30j682
52328B60374j827q20J487M141N636N305L585J338m88j134p06j5P35K211M220N018
52312B89060L515J094j00J13M31M53Q50J669K267K709L541M188L344J219j74M09
52296C14588J939K718K315J278m2j294j492J56K838M388L433R60o34K6K173M167
52280C37517N222N329M322K209K28P1J726L198K958J519J89n53p54k24R80K250
52264C66187L399M816O012N397K702J83j35P96Q13K4L72K356M455N700O638P459
52248D17174P192N577M228M898P352R701J0395R478Q268P953Q388Q455P829P616
$$ y = [233839, 232389, 232368, 233453, 234574, 235146, 235084, 234420, 233427, 232828, 233389, 235142, 237168, 238475, 239133, 240103, 241772, 243240, 243547, 243059, 242944, 243729, 245179, 247190, 249739, 252190, 253792, 254916, 256739, 259484, 261908, 262786, 262056, 260374, 258547, 257727, 259214, 263355, 268991, 274296, 277881, 279219, 278731, 277597, 276891, 276876, 277611, 279822, 284042, 289060, 292575, 293669, 293569, 293682, 294113, 294566, 295416, 297085, 299352, 302061, 305602, 309790, 313134, 314353, 314179, 314588, 316527, 319245, 321560, 322838, 322796, 321502, 320010, 320166, 323004, 327392, 330825, 331785, 331151, 331177, 333350, 337517, 342739, 348068, 352390, 354599, 354827, 354898, 356624, 359822, 362780, 364299, 364488, 363935, 363181, 362957, 363937, 366187, 369586, 374402, 380414, 385811, 388513, 388696, 388561, 389357, 390170, 390194, 390566, 392922, 397377, 403077, 409715, 417174, 424366, 429943, 434171, 439069, 446421, 456122, 466517, 475995, 484263, 492216, 500604, 509059, 516888, 524504]
52234E24504Q614R792R542P877O211N487N733O906Q675R675Q588O070M330M682
52220F26686O544Q722J0357J0752R655P973P068P299Q179R531J1142J1722J0130
52207G45760P565O487P222P657O819O326P360Q366P374M943L143K827L511M828
52193H30188O343O792N385L399K827L647L992K897J394O67O16O14N63N63L81j6
52177H70252M7J232L153M575M735M224M402N926Q079R601J0069R989R706R014
52163I55004Q066P720Q256Q524P474O096O425Q527R959Q914O687N904P045Q197
52149A062798P988P209P075P141O021L509R27m39m65P1J98o56k105k853k052n54
52133A093813n4j053k507l471m071m686n259n754o240o119m507j969n76j228k202
$$ y = [524504, 533118, 542910, 552452, 560329, 566540, 572027, 577760, 584666, 593341, 603016, 611604, 617674, 622004, 626686, 633230, 641952, 652309, 663061, 672716, 680689, 687757, 695056, 703235, 712766, 723908, 735630, 745760, 753325, 759812, 767034, 774691, 781510, 787836, 795196, 803562, 810936, 815879, 819022, 821849, 825360, 830188, 836531, 843323, 848708, 852107, 854934, 858581, 862573, 865470, 866864, 867531, 868147, 868761, 869324, 869887, 870268, 870252, 870299, 871531, 874684, 879259, 883994, 888218, 892620, 898546, 906625, 916226, 926295, 936284, 945990, 955004, 963070, 970790, 979046, 987570, 995044, 1001140, 1007565, 1016092, 1026051, 1034965, 1041652, 1047556, 1054601, 1062798, 1070786, 1077995, 1085070, 1092211, 1098232, 1101741, 1102668, 1102229, 1101764, 1101835, 1102033, 1101377, 1099272, 1096419, 1094367, 1093813, 1093759, 1092706, 1090199, 1086728, 1082657, 1077971, 1072712, 1066958, 1060718, 1054599, 1050092, 1048123, 1047547, 1046319, 1044117]
52118A044117j580q2J77j130k406k812l160m110n218o024o656o840n833l916k727
52103I91800l339m938o022o087n425m306l111k562k930l437l228k533k223k721
52089I38938l934n681p356p602n438j793J004J363l73k886n141o543o686n743
52075H82129m663m319m525m417l759l252l454l960m074l838l827m212m575m571
52061H24683m206l495k533j929k450l837m609l560j196P72J075o8j287j177N21
52046G96704K550L204K071M60OJ177L259N201O225O193N790N910O596P097P125
52031H59568P309Q008Q654Q803R040R965J1009J1251J0888J0874J1562J2656J4106
52018I93693J6001J7730J8311J7565J6253J5040J4087J3454J3115J2686J1955
$$ y = [1044117, 1042537, 1042455, 1042632, 1041502, 1039096, 1036284, 1033124, 1029014, 1023796, 1017772, 1011116, 1004276, 998443, 994527, 991800, 988461, 983523, 977501, 971414, 965989, 961683, 958572, 956010, 953080, 949643, 946415, 943882, 941659, 938938, 935004, 929323, 921967, 914365, 908927, 907134, 908138, 909501, 909128, 906242, 901101, 894558, 887872, 882129, 877466, 873147, 868622, 864205, 860446, 857194, 853740, 849780, 845706, 841868, 838041, 833829, 829254, 824683, 820477, 816982, 814449, 812520, 810070, 806233, 801624, 798064, 796868, 797640, 798715, 798647, 797360, 796183, 796704, 799254, 802458, 804529, 804989, 804995, 806172, 809431, 814632, 820857, 827050, 832840, 838750, 845346, 852443, 859568, 866877, 874885, 883539, 892342, 901382, 911347, 922356, 933607, 944495, 955369, 966931, 979587, 993693, 1009694, 1027424, 1045735, 1063300, 1079553, 1094593, 1108680, 1122134, 1135249, 1147935, 1159890]
52007A159890J1501J1977J2877J2836J1188Q439N441K915J613J867K687K432P40
51994A246403r58j356j013j636l893o568p868p299n934m971m471l983l856m861
51980A187736o440o776n243l553l446m231l994k495j249j077j202q61l64j69o
51965A146630N03J109J296J042R26J611L044M028L143M62k167l174k871k440k150
51950A150992j598r30o97r75j726l393o047q519r691j0030j0594j1238j1323j1500
51936A062731j2920j5142j6696j7443j8386j9346j9075j7769j7302j8491k0030
51925H70131k0638k0422j9699j8419j7305j7612j8993j9477j8398j7513j8243
51914F63412j9564j9830j9021j8004j6944j5809j5082j4783j3963j2319j1073
$$ y = [1159890, 1171391, 1183368, 1196245, 1209081, 1220269, 1228708, 1234149, 1237064, 1238677, 1240544, 1243231, 1245663, 1246403, 1245445, 1244089, 1243076, 1241440, 1237547, 1230979, 1223111, 1215812, 1209878, 1204907, 1200436, 1196453, 1192597, 1187736, 1181296, 1174520, 1169277, 1165724, 1162278, 1158047, 1154053, 1151558, 1150309, 1149232, 1148030, 1147169, 1146805, 1146636, 1146630, 1147133, 1148242, 1149538, 1150580, 1151506, 1153117, 1156161, 1160189, 1163332, 1163794, 1161627, 1158453, 1155582, 1153142, 1150992, 1149394, 1148464, 1147767, 1146792, 1145066, 1141673, 1135626, 1127107, 1117416, 1107386, 1096792, 1085554, 1074231, 1062731, 1049811, 1034669, 1017973, 1000530, 982144, 962798, 943723, 925954, 908652, 890161, 870131, 849493, 829071, 809372, 790953, 773648, 756036, 737043, 717566, 699168, 681655, 663412, 643848, 624018, 604997, 586993, 570049, 554240, 539158, 524375, 510412, 498093, 487020]
51903D87020j1062j1234j0418r265q943q998q239o929o311o431o168n245m661
51890C83116m999n488n083l742k388j996k775m044m971n308n014l686j350M60
51876C32732l7k341l959l674k869l018l593l487k848k174j163Q4J49j712l760
51861B98330l768k023n60k52m08o81j396k154j916p20O2n84k201l497l481k185
51845B72566r11j082k288k393n26J279Q44r20j469n10j53j349k499j969j53J580
51829B60047K503K461J431j00j164j310r65o66n75p14r15o03M24J249R01qm1O57
51811B62612L93j266k315r19K025M045M091L180K538K317K150J991J983J966J680
51796B86471J244J029R72N70k14n24J80R56M09j178j894o26J783L973N263M961
$$ y = [487020, 475958, 464724, 454306, 445041, 436098, 427100, 418861, 411932, 405621, 399190, 393022, 387777, 383116, 378117, 372629, 367546, 363804, 361416, 359420, 356645, 352601, 347630, 342322, 337308, 333622, 332272, 332732, 332695, 330354, 326395, 322721, 319852, 316834, 313241, 309754, 306906, 304732, 303569, 303653, 303802, 302090, 298330, 294562, 292539, 291979, 291727, 291319, 290638, 289242, 287088, 285172, 284452, 284514, 283930, 281729, 278232, 274751, 272566, 271655, 270573, 268285, 265892, 265366, 266645, 267489, 266569, 265100, 264590, 264437, 263088, 260589, 258620, 258467, 260047, 262550, 265011, 266442, 266342, 265178, 263868, 262903, 262237, 261662, 260948, 260033, 259430, 259854, 261103, 262004, 261996, 261955, 262612, 263005, 261739, 259424, 258505, 260530, 264575, 268666, 271846, 274384, 276701, 278851, 280842, 282825, 284791, 286471, 287715, 288744, 289716, 290286, 290072, 289548, 289728, 290684, 291093, 289915, 288021, 287395, 289178, 293151, 298414, 303375]
51780C03375K325j510l292j168K510L883K341N70M09R61Q83L80K23M66Q22J132
51764C14310R54j49j488j670n82L32K79L33J626L415M005K857R22o35j155m19
51748C22935J282L048L913L588K622J883J820J951J319j70j230o98Q05J713J793
51733C46574K293L618M330L181J149M24J858M228N783N917N329M983N089N138
51719C99894M943N204O471Q038Q639Q058P067N888L865R01j925l610m222m299
51705D44912m139m090m537n054m547k923j701k058l158l430k756k177k025j671
51691D00646r90o81r38r90m13P8l04j237j677j055L60J749K007L73k455m244l255
51674C86974l54J712J363l47j519j835k338l509m579m686l863k693j709j361j940
$$ y = [303375, 305700, 304190, 300898, 299730, 302240, 306123, 308464, 309034, 309443, 310404, 311287, 311667, 311890, 312356, 313178, 314310, 315264, 315115, 313627, 311957, 311375, 311707, 311986, 312319, 313945, 317360, 321365, 324222, 325144, 324509, 323354, 322935, 324217, 327265, 331178, 334766, 337388, 339271, 341091, 343042, 344361, 344191, 342961, 342263, 343068, 344781, 346574, 348867, 352485, 356815, 359996, 361145, 361569, 363427, 367655, 373438, 379355, 384684, 389667, 394756, 399894, 404837, 410041, 416512, 424550, 433189, 441247, 448314, 454202, 458067, 458968, 457043, 453433, 449211, 444912, 440773, 436683, 432146, 427092, 422545, 419622, 417921, 415863, 412705, 409275, 406519, 404342, 402317, 400646, 399656, 398975, 398037, 397047, 396634, 396712, 396408, 395171, 393494, 392439, 392799, 394548, 396555, 396928, 394473, 390229, 386974, 386620, 388332, 389695, 389348, 387829, 385994, 383656, 380147, 375568, 370882, 367019, 364326, 362617, 361256, 359316]
51659C59316l108l902l482j840J99J453J187m0o09L20J499J189j95n21P85J678
51643C53929N25j355j608o1J548K309K826L514L870L637L345L382L522L633L977
51628C86993M518M601L620J610q03k593k752j186Q05J620R28l09j183j592j973
51613C92304k910m810p323r166r252p863o249n274m982n049m909l861j980n67
51599C18109q06k151k971k582j658r06m66m36r37j539j635j465j744k297k110
51584B94406q86M13Q80O00J28j74k6P28J606J749R89J97K82J206K024J681m4k070
51566C03689k910k245j077n3J229K671L001J855J117K339M081M009K651K380L314
51551C26051L229J771J496L845O811P974P520O812O068N219N226O625P956P519
$$ y = [359316, 356208, 352306, 348824, 346984, 347183, 348636, 349823, 349783, 349174, 349494, 350993, 352182, 351987, 351466, 352251, 353929, 354454, 353099, 351491, 351430, 352978, 355287, 358113, 361627, 365497, 369134, 372479, 375861, 379383, 383016, 386993, 391511, 396112, 399732, 401342, 400539, 397946, 395194, 394008, 394813, 396433, 397361, 397052, 395869, 394277, 392304, 389394, 384584, 377261, 368095, 358843, 350980, 344731, 339457, 334475, 329426, 324517, 320656, 318676, 318109, 317303, 315152, 312181, 309599, 307941, 307035, 306569, 306133, 305196, 303657, 302022, 300557, 298813, 296516, 294406, 293520, 293933, 294813, 295413, 295541, 295367, 295341, 296069, 297675, 299424, 300413, 300610, 300892, 302098, 304122, 305803, 305759, 303689, 300779, 298534, 297457, 297404, 298633, 301304, 304305, 306160, 307277, 309616, 313697, 317706, 320357, 322737, 326051, 329280, 331051, 332547, 336392, 343203, 351177, 358697, 365509, 371577, 376796, 382022, 388647, 396603, 404122]
51537D04122N741M332L890L737L368K757J882J060J030J658J421n60k811l178
51523D28449j580J70Q47Q22R67J704K949L997L888K757K265L668N851O570N396
51508D68720M199M578N902O273M657J699j072k413j971k81J547K257J286m91j425
51493D93465j140j286l174n386n348l016j042j198k552l710m773o020o642o170
51479D42008n600n625n111k918j63R36l49k976n467o358m618j182J166R69N7O39
51463D05408J909J654P3o24K39J341K108L283M577M447K735J323J318J608J023
51448D32422J92K30J047J839K061J355k60j570r81J170K618K246J582K261L454
51433D49666L301J743L76L05J538L886O841Q908Q653O570M669M151M444M741N156
$$ y = [404122, 409863, 414195, 418085, 421822, 425190, 427947, 429829, 430889, 431919, 433577, 434998, 434438, 431627, 428449, 426869, 427039, 427886, 428708, 429675, 431379, 434328, 438325, 442213, 444970, 447235, 450903, 456754, 463324, 468720, 472919, 477497, 483399, 489672, 494329, 496028, 494956, 492543, 490572, 490291, 491838, 494095, 495381, 494890, 493465, 492325, 491039, 487865, 482479, 477131, 474115, 473073, 471875, 469323, 465613, 460840, 454820, 448178, 442008, 436408, 430783, 425672, 422754, 422591, 423527, 423178, 420202, 414735, 408377, 403759, 402577, 403743, 404712, 404769, 405408, 407317, 408971, 409044, 408420, 408659, 410000, 412108, 415391, 419968, 424415, 427150, 428473, 429791, 431399, 432422, 432614, 432844, 433891, 435730, 437791, 439146, 438886, 437316, 436335, 437505, 440123, 442369, 443951, 446212, 449666, 452967, 454710, 455086, 455391, 456929, 460815, 467656, 476564, 485217, 491787, 496456, 500607, 505051, 509792, 514948]
51418E14948N847O023M847K930J947K644L842L758J932m53j927k053j532j406
51404E41347k217l611m608m505l659l220l919n336o408o484n844n442o074p476
51390D72544q364p798o316n157m528l636k353j613j840k180j876j241n81N35K013
51375D27609K513J334q4j12N07r2j766k538j808j295k447m684o667p828p953o808
51359C87881n025m214n177o739p130n959m256l152l084l722m177l699k562j776
51345C27209j725j845j854k407l941n624o255n698m661l483j997m10M77J13j192
51330B86707k627l532l670l178k418j823j665j850j855j209j37M63M4q32j169
51315B61249q08n46j008j830k124j407qJ225J560R12k17j308k125k476k169j361
$$ y = [514948, 520795, 526818, 531665, 534595, 536542, 539186, 543028, 546786, 548718, 548265, 546338, 544285, 542753, 541347, 539130, 535519, 530911, 526406, 522747, 519527, 515608, 510272, 503864, 497380, 491536, 486094, 480020, 472544, 464180, 456382, 450066, 444909, 440381, 436745, 434392, 432779, 430939, 428759, 426883, 425642, 425061, 425596, 427609, 430122, 431456, 431372, 431260, 431767, 431675, 429909, 427371, 425563, 424268, 421821, 417137, 410470, 402642, 394689, 387881, 382856, 378642, 373465, 366726, 359596, 353637, 349381, 346229, 343145, 339423, 335246, 331547, 328985, 327209, 325484, 323639, 321785, 319378, 315437, 309813, 303558, 297860, 293199, 289716, 287719, 287309, 287786, 287899, 286707, 284080, 280548, 276878, 273700, 271282, 269459, 267794, 265944, 264089, 262880, 262743, 263206, 263250, 262418, 261249, 260441, 259895, 258887, 257057, 254933, 253526, 253518, 254743, 256303, 257215, 256998, 255690, 253565, 251089, 248920, 247559]
51299B47559n36K17J366L013M382M788M497M067L454K661K543L834N756O736O435
51284C00772N826N375M297J970r45l182m026l707l187l550m943o229o302n547
51270B76622n144n336n434n278n325n329m406k688j595j961k992l548l418k892
51256B21276k050j108n34l76k47l35j343l002l810k943j440p51r44j202j236j340
51240A98615j533j478q76M01K072L081K460Q83K42J109J777P72r22j387m81M12
51224B05147O66Q30J071Q37N2o50j115j945l241m006l356j704l05J06j07r1M38
51207A92627Q15K92p91j286q55n87j423k742l241k796k336k212j765o10N98J012
51191A74700O36J66J25L20J07p74j613j360q0Q21L09q82j306p73k88k79K0J244
$$ y = [247559, 247023, 247240, 248606, 251619, 256001, 260789, 265286, 269353, 272807, 275468, 278011, 281845, 287601, 294337, 300772, 306598, 311973, 316270, 318240, 317295, 314113, 310087, 306380, 303193, 299643, 294700, 288471, 282169, 276622, 271478, 266142, 260708, 255430, 250105, 244776, 240370, 237682, 236087, 234126, 231134, 227586, 224168, 221276, 219226, 218118, 217584, 217208, 216961, 216626, 215283, 212281, 208471, 205528, 204088, 203337, 202393, 201191, 199955, 198615, 197082, 195604, 194728, 195129, 197201, 200282, 202742, 203625, 203867, 204976, 206753, 207525, 206603, 205216, 204735, 205147, 205813, 206643, 207714, 208551, 208603, 207953, 206838, 204893, 201652, 197646, 194290, 192586, 192281, 192387, 192280, 192189, 192627, 193442, 193734, 192943, 191657, 190802, 190215, 188792, 186050, 182809, 180013, 177677, 175465, 173700, 173090, 173688, 174700, 175336, 175502, 175627, 175947, 176054, 175280, 173667, 172307, 172227, 173048, 173357, 172475, 171169, 170396, 170108, 169829, 169849, 171093]
51173A71093K839L726L412K223P97k61o08l09L48J121J734J731R65O7j30L43P65
51156A89856R25J400K342K827K082Q67P60K092L408L203J724N53O49J460J966
51141B16114J956J845J721J402J216J795K801K800J036j295k270j425K8R00J072
51126B29696R08M78k37r92j522j861k095k034j425l48P93J617J984J926J434L57
51110B28679j348l141l986l228j431M9M19R4j39j59l98q39p64L16J742K159R10
51093B18935j233k818l039k290j644j910l002m014m114l397k693k374j830m59
51079A84118J266K344K557K424K016Q16r91k087j567k76J50o86j547j092O68K576
51063A90689L525L288K341J119k17j288j470p39j55o69j617j503k27N96M6n92
$$ y = [171093, 173932, 177658, 181070, 183293, 184090, 183829, 183221, 182912, 183260, 184381, 186115, 187846, 188811, 188878, 188748, 189091, 189856, 190781, 192181, 194523, 197350, 199432, 200299, 201059, 203151, 206559, 209762, 211486, 212039, 212688, 214148, 216114, 218070, 219915, 221636, 223038, 224254, 226049, 228850, 231650, 232686, 231391, 229121, 227696, 227724, 228624, 229696, 230604, 231082, 230845, 229853, 228331, 226470, 224375, 222341, 220916, 220568, 221361, 222978, 224962, 226888, 228322, 228679, 227331, 224190, 220204, 216976, 215545, 215594, 216013, 216107, 215968, 215809, 215411, 214572, 213808, 214124, 215866, 218025, 218935, 217702, 214884, 211845, 209555, 207911, 206001, 202999, 198985, 194871, 191474, 188781, 186407, 184577, 184118, 185384, 187728, 190285, 192709, 194725, 195541, 194550, 192463, 190896, 190620, 190770, 190084, 188537, 187445, 188113, 190689, 194214, 197502, 199843, 200962, 200745, 199457, 197987, 197248, 197093, 196424, 194807, 193304, 193077, 193673, 193719, 193127]
51047A93127K86K239L381K882J630N81k49j035j433j139m11M01J346K459L262
51032B07327L195K414J701J606J950K313K703L395M175M250L229J846J175J363
51018B42642J747K012K443K977K959K134J020o4j402k811l159j909l39l7p93j165
51002B46255p33l95o37r01q75j096j796k228j796r88o03p49j109j564j984k033
50986B26768j657j311j210r41l23J5l70p56j59J090J691J135K48n7L72J375K824
50969B28734M099M098K471L82n98j71O54J017J115J616K617L442L343K308J099
50954B56226M25J76k18p42o15O08K373L910N060N777N471L854K082J777L001M285
50938B93450M770M997N328N153M445M541O095P473O827N044M727O569Q591R163
$$ y = [193127, 193413, 195652, 199033, 201915, 203545, 204126, 203877, 202842, 201409, 200270, 199859, 200260, 201606, 204065, 207327, 210522, 212936, 214637, 216243, 218193, 220506, 223209, 226604, 230779, 235029, 238258, 240104, 241279, 242642, 244389, 246401, 248844, 251821, 254780, 256914, 257934, 257870, 256468, 253657, 250498, 248589, 248250, 248213, 247420, 246255, 245522, 245127, 244490, 243589, 242714, 241618, 239822, 237594, 235798, 234810, 234207, 233458, 232349, 230785, 228801, 226768, 225111, 223800, 222590, 221649, 221326, 221341, 220971, 220215, 220056, 221146, 222837, 223972, 224220, 224163, 224535, 225910, 228734, 232833, 236931, 239402, 239784, 239186, 239015, 239669, 240686, 241801, 243417, 246034, 249476, 252819, 255127, 256226, 256651, 256827, 256609, 255867, 255252, 255860, 258233, 262143, 267203, 272980, 278451, 282305, 284387, 286164, 289165, 293450, 298220, 303217, 308545, 313698, 318143, 322684, 328779, 336252, 343079, 348123, 352850, 359419, 368010, 377173]
50924C77173Q916R086R541R526R307R936J1818J4331J6556J7925J8454J8763J9585
50911E50917K1044K2720K4459K6418K8370K9765L0820L2565L5340L8104L9895
50900H80417M1151M2820M4765M6078M6450M6306M5752M4333M1822L8601L5194
50889A353689L1850K8545K5070K1264J7415J4057J1066P553L240n63k219j735
50877A509232o12L6K87L06m25k315m805o966q637j0394j2640j5174j7707k0349
50863A409837k3331k6448k9150l1241l3154l5349l7588l9125l9365l8102l5446
50852A041538l2061k9253k7931k7345k5630k1899j7219j3194j0295q031o113m765
50840H17802m086l709l047j689K96K348L948N155O250O972O793N951N362N342
$$ y = [377173, 386089, 395175, 404716, 414242, 423549, 433485, 445303, 459634, 476190, 494115, 512569, 531332, 550917, 571961, 594681, 619140, 645558, 673928, 703693, 734513, 767078, 802418, 840522, 880417, 921568, 964388, 1009153, 1055231, 1101681, 1147987, 1193739, 1238072, 1279894, 1318495, 1353689, 1385539, 1414084, 1439154, 1460418, 1477833, 1491890, 1502956, 1510509, 1513749, 1513186, 1510967, 1509232, 1508620, 1508656, 1508943, 1509249, 1508824, 1506509, 1501704, 1494738, 1486101, 1475707, 1463067, 1447893, 1430186, 1409837, 1386506, 1360058, 1330908, 1299667, 1266513, 1231164, 1193576, 1154451, 1115086, 1076984, 1041538, 1009477, 980224, 952293, 924948, 899318, 877419, 860200, 847006, 836711, 828680, 822567, 817802, 813716, 810007, 806960, 805271, 805567, 807915, 811863, 817018, 823268, 830240, 837033, 842984, 848346, 853688]
50826H53688N275M875M694M892M643L583K798L272M202M253L796M290N715O281
50812I16257N001L136K422K987L815M581N901Q003J0126J1561J2710J4550J7304
50799A018354K0220K2729K5167K7942L0782L3499L6843M1501M6653N0968N4870
50788A409528O0187O7199P3784P8259Q1558Q5446Q9866R3467R5688R6969R7458
50777B329409R6832R4912R1384Q5468P7049O7529N8388M9470L9908L0199K1919
50766C042467J5669J0666O231K530j14j521j411K68K860N667Q588J1177J1852
50753C114929R350M366j685q900j8188k8810l8610m6601n3364n8940o2312o3496
50741B747739o4093o4966o4966o2700n8185n1996m4285l5520k6898j8948j0674
$$ y = [853688, 858963, 863838, 868532, 873424, 878067, 881650, 884448, 887720, 891922, 896175, 899971, 904261, 909976, 916257, 921258, 924394, 926816, 929803, 933618, 938199, 944100, 952103, 962229, 973790, 986500, 1001050, 1018354, 1038574, 1061303, 1086470, 1114412, 1145194, 1178693, 1215536, 1257037, 1303690, 1354658, 1409528, 1469715, 1536914, 1610698, 1688957, 1770515, 1855961, 1945827, 2039294, 2134982, 2231951, 2329409, 2426241, 2521153, 2612537, 2698005, 2775054, 2842583, 2900971, 2950441, 2990349, 3020548, 3042467, 3058136, 3068802, 3075033, 3077563, 3077449, 3075928, 3074517, 3074785, 3077645, 3083312, 3091900, 3103077, 3114929, 3124279, 3128645, 3126960, 3118060, 3099872, 3071062, 3032452, 2985851, 2932487, 2873547, 2811235, 2747739, 2683646, 2618680, 2553714, 2491014, 2432829, 2380833, 2336548, 2301028, 2274130, 2255182, 2244508]
50730B244508r94R762K0473L0445L9505M7720N5653O3863P1706P7525Q0550Q1481
50718B822197Q0736P7458P1182O3120N4601M5294L4330K2369J1111J180q206j7754
50706C257618k7424l7018m6242n4279o0343o4882o9293p4163p8447q0811q1288
50695B583428q1084q0903p9956p6863p1405o4909n8802n3246m7604m1781l6339
50684A890536l1441k6475k0902j4841q648k318M429J1694J9024K5440L0221L3925
50672A910644L8089M3461M9220N4525N9786O5355O9900P1689P0916O9128O6716
50661B569429O2789N7167N0670M3493L5292K6863J9582J3002N215l930j2311j8771
50649B848490k4335k9151l0910k8180k3230j9372j7018j4344j0589o596k853R07
$$ y = [2244508, 2243514, 2253276, 2273749, 2304194, 2343699, 2391419, 2447072, 2510935, 2582641, 2660166, 2740716, 2822197, 2902933, 2980391, 3051573, 3114693, 3169294, 3214588, 3248918, 3271287, 3282398, 3283578, 3275372, 3257618, 3230194, 3193176, 3146934, 3092655, 3032312, 2967430, 2898137, 2823974, 2745527, 2664716, 2583428, 2502344, 2421441, 2341485, 2264622, 2193217, 2128308, 2069506, 2016260, 1968656, 1926875, 1890536, 1859095, 1832620, 1811718, 1796877, 1788229, 1785911, 1790340, 1802034, 1821058, 1846498, 1876719, 1910644, 1948733, 1992194, 2041414, 2095939, 2155725, 2221080, 2290980, 2362669, 2433585, 2502713, 2569429, 2632218, 2689385, 2740055, 2783548, 2818840, 2845703, 2865285, 2878287, 2883502, 2879572, 2867261, 2848490, 2824155, 2795004, 2764094, 2735914, 2712684, 2693312, 2676294, 2661950, 2651361, 2644765, 2641912, 2642819]
50637B642819M549P298Q357O951K755k856p317r801j2298j6449k0598k1772j9302
50624B562336j4794r514l712K475R343J7902K7979L7150M3711M9651N8101O8689
50612B849317P8330Q6251R5105J06768J19802J31883J42297J51094J57852J62367
50602D081066J64840J64423J59185J48499J34190J18604J02772Q7123P2403N8830
50592E291935M5558L1831J7892M124r503k2660l4456m4773n4575o4164p2273p7635
50580E011301q0342q0841p8688p3468o6099n8143n0272m2337l4437k7179k1094
50569D398401j6481j3387j1466j0326j0270j2064j5644j9862k3798k7343l0162
50558D207598l1228l0199k8190k6204k3616j9135j2717n549J286P148J1419J3807
$$ y = [2642819, 2647368, 2654666, 2663023, 2669974, 2672729, 2669873, 2662556, 2652755, 2640457, 2624008, 2603410, 2581638, 2562336, 2547542, 2538028, 2534316, 2536791, 2546134, 2564036, 2592015, 2629165, 2672876, 2722527, 2780628, 2849317, 2927647, 3013898, 3109003, 3215771, 3335573, 3467456, 3609753, 3760847, 3918699, 4081066, 4245906, 4410329, 4569514, 4718013, 4852203, 4970807, 5073579, 5160702, 5233105, 5291935, 5337493, 5369324, 5387216, 5391340, 5381837, 5359177, 5324721, 5279948, 5225373, 5161209, 5088936, 5011301, 4930959, 4850118, 4771430, 4697962, 4631863, 4573720, 4523448, 4481111, 4446674, 4419495, 4398401, 4381920, 4368533, 4357067, 4346741, 4336471, 4324407, 4308763, 4288901, 4265103, 4237760, 4207598, 4176370, 4146171, 4117981, 4091777, 4068161, 4049026, 4036309, 4030760, 4032046, 4039194, 4050613, 4064420]
50546D064420J4899J5354J4661J1483N302k933j1858k0908l0490m1324n3620o6620
50534C898366p8968q9555r7865j03643j06932j08455j09173j09067j07126j02963
50524B884619r7665r2469q7326q1505p4991o8333o1685n4915m8284m2072l5849
50513B139525k9031k1997j5645j0060m615Q37N940J0979J6643K2429K6705K9060
50501B170770L1357L5390M0502M4768M7955N1646N6594O1704O6109P0841P7247
50490B754883Q4864R2268R9474J07788J17159J25230J29785J31049J30630J28987
50480C902117J25244J19053J11395J03445R5763Q8831Q3439P9930P7698P5968
50470D862883P4631P3754P2755P0760O7782O5062O4117O5742O9836P5645Q1922
$$ y = [4064420, 4079319, 4094673, 4109334, 4120817, 4126119, 4123186, 4111328, 4090420, 4059930, 4018606, 3964986, 3898366, 3819398, 3729843, 3631978, 3528335, 3421403, 3312948, 3203775, 3094708, 2987582, 2884619, 2786954, 2694485, 2607159, 2525654, 2450663, 2382330, 2320645, 2265730, 2217446, 2175374, 2139525, 2110494, 2088497, 2072852, 2062792, 2058177, 2059014, 2064954, 2075933, 2092576, 2115005, 2141710, 2170770, 2202127, 2237517, 2278019, 2322787, 2370742, 2422388, 2478982, 2540686, 2606795, 2677636, 2754883, 2839747, 2932015, 3031489, 3139277, 3256436, 3381666, 3511451, 3642500, 3773130, 3902117, 4027361, 4146414, 4257809, 4361254, 4457017, 4545848, 4629287, 4709217, 4786915, 4862883, 4937514, 5011268, 5084023, 5154783, 5222565, 5287627, 5351744, 5417486, 5487322, 5562967, 5644889]
50459E644889Q7256R0882R3251R5261R6551R5043Q8860P8440O5932N2409L6675
50448F525449J7379m648k7012m8198o8381q8002j06484j22460j34641j42295j45274
50437E655433j43663j37360j26427j12076r6435q0687o4042m5625k6710r935L336
50426D815809J3341J9800K1268J6979P848n121k2137m3359o7216r0869j11849
50415D554494j28821j41619j51188j58746j64208j66101j63674j58381j52424
50406C169332j46454j39623j31420j22441j13477j04716r5858q6583p7083o8346
50396B083331o1447n6158n0938m4857l8758l3685k8999k3376j7137j2143r204
50385A706629o963l717P08N300R164J1905J3579J4913J7036K0372K4118K7350
$$ y = [5644889, 5732145, 5823027, 5916278, 6011539, 6108090, 6203133, 6291993, 6370433, 6436365, 6488774, 6525449, 6542828, 6538180, 6511168, 6462970, 6394589, 6306587, 6200103, 6077643, 5943002, 5800707, 5655433, 5511770, 5374410, 5247983, 5135907, 5039472, 4958785, 4894743, 4849118, 4822408, 4812473, 4815809, 4829150, 4848950, 4870218, 4887197, 4895045, 4889924, 4867787, 4824428, 4757212, 4666343, 4554494, 4425673, 4284054, 4132866, 3974120, 3809912, 3643811, 3480137, 3321756, 3169332, 3022878, 2883255, 2751835, 2629394, 2515917, 2411201, 2315343, 2228760, 2151677, 2083331, 2021884, 1965726, 1914788, 1869931, 1831173, 1797488, 1768489, 1745113, 1727976, 1715833, 1706629, 1699666, 1695949, 1696657, 1701957, 1711121, 1723026, 1736605, 1751518, 1768554, 1788926, 1813044, 1840394]
50373A840394L0166L3211L6519L9624M2578M5932M9631N2763N4835N6482N8447
50362B340582O0451O1873O3050O4788O6827O7956O7924O8023O9191P0607P1052
50351C072324P0790P0911P1444P1574P1408P1976P3266P3726P2297O9790O7497
50340C857003O5226O1479N5110M6261L6063K5726J5639N122o530j8993l1572m4685
50328D065849n9342p4820q8365r7924j04040j08168j10293j09480j05819j00297
50318C107301r3264q4400p4096o3485n3183m2905l2315k1403j0344m6P405J0198
50306B649463Q782N299P78n757j5053k5725l5575m3971n1870n9765o6572p0758
50294B289276p2117p1982p1610p0683o7914o3178n8287n4969n2680m9488m4920
$$ y = [1840394, 1870560, 1903771, 1940290, 1979914, 2022492, 2068424, 2118055, 2170818, 2225653, 2282135, 2340582, 2401033, 2462906, 2525956, 2590744, 2657571, 2725527, 2793451, 2861474, 2930665, 3001272, 3072324, 3143114, 3214025, 3285469, 3357043, 3428451, 3500427, 3573693, 3647419, 3719716, 3789506, 3857003, 3922229, 3983708, 4038818, 4085079, 4121142, 4146868, 4162507, 4167629, 4161099, 4142106, 4110534, 4065849, 4006507, 3931687, 3843322, 3745398, 3641358, 3533190, 3422897, 3313417, 3207598, 3107301, 3014037, 2929637, 2855541, 2792056, 2738873, 2695968, 2663653, 2642250, 2631906, 2631860, 2639265, 2649463, 2658245, 2663544, 2664322, 2658565, 2643512, 2617787, 2582212, 2538241, 2486371, 2426606, 2360034, 2289276, 2217159, 2145177, 2073567, 2002884, 1934970, 1871792, 1813505, 1758536, 1705856, 1656368, 1611448]
50283A611448m0662l8103l6373l3606k9413k5200k2202k0047j7392j3630r666
50272A325154o992n969n279l360j45L098N451P106Q430R184R350R918J1954J5019
50258A382919J7343J7753J6887J6378J7233J9207K1391K3054K3952K4192K3951
50247A604260K3373K2679K2307K2720K3901K5076K5150K3614K0902J7827J4806
50236A846615J1767Q560N105J337k618o134q426r387r877j1065j3618j7430k1746
50223A773083k5507k8210l0504l3360l6430l8034l7220l5077l3299l2062l0298
50212A413082k7607k4787k2554k0944k0119k0570k1937k2582k1235j8623j6619
50201A175505j5954j5519j4077j1947j0553j0484j0618r461p019m875m353n084
$$ y = [1611448, 1570786, 1532683, 1496310, 1462704, 1433291, 1408091, 1385889, 1365842, 1348450, 1334820, 1325154, 1318162, 1312193, 1306914, 1303554, 1303409, 1306507, 1311958, 1319064, 1327494, 1336678, 1346028, 1355946, 1367900, 1382919, 1400262, 1418015, 1434902, 1451280, 1468513, 1487720, 1509111, 1532165, 1556117, 1580309, 1604260, 1627633, 1650312, 1672619, 1695339, 1719240, 1744316, 1769466, 1793080, 1813982, 1831809, 1846615, 1858382, 1866942, 1872047, 1873384, 1870766, 1864632, 1856206, 1846819, 1836942, 1825877, 1812259, 1794829, 1773083, 1747576, 1719366, 1688862, 1655502, 1619072, 1581038, 1543818, 1508741, 1475442, 1443380, 1413082, 1385475, 1360688, 1338134, 1317190, 1297071, 1276501, 1254564, 1231982, 1210747, 1192124, 1175505, 1159551, 1144032, 1129955, 1118008, 1107455, 1096971, 1086353, 1076892, 1069873, 1064998, 1060645, 1055561]
50189A055561n607m965l400j807r43r43j140n22J081K488K385R75j45J76J550
50174A044744K746K872J758j90k017k746k337j856k284l461m566n257n894o802
50160A014710p905q989r774r705q304o037m329m163m870m894l710k390k054k315
50146I35271j878k29J864L357L783L176J867N73R7N82J535K569L570M077L435
50131I63649K000J198J735K570K517J964J966K211J444l74j872k410l105n004
50117I68489p261p952o284l467j508j498k808l933m068l634k954j301J835N048
50103I28704O132M975L867M478N837O117N269M666M900N214M939M379M159M389
50089I98025M754N063N504O403P641Q528Q554Q158Q209Q790R271R500R973J0582
$$ y = [1055561, 1049954, 1044989, 1041589, 1039782, 1038839, 1037896, 1036756, 1036234, 1037315, 1039803, 1042188, 1043163, 1043018, 1043194, 1044744, 1047490, 1050362, 1052120, 1051930, 1049913, 1047167, 1044830, 1042974, 1040690, 1037229, 1032663, 1027406, 1021512, 1014710, 1006805, 997816, 988042, 978337, 970033, 963996, 959667, 955504, 950634, 945740, 942030, 939640, 937586, 935271, 933393, 933164, 935028, 938385, 942168, 945344, 947211, 947784, 947881, 948463, 949998, 952567, 956137, 960214, 963649, 965649, 966847, 968582, 971152, 973669, 975633, 977599, 979810, 981254, 980880, 979008, 976598, 973493, 968489, 961228, 953276, 946992, 943525, 942017, 940519, 937711, 933778, 929710, 926076, 923122, 921821, 923656, 928704, 934836, 939811, 943678, 948156, 953993, 960110, 965379, 970045, 974945, 980159, 985098, 989477, 993636, 998025, 1002779, 1007842, 1013346, 1019749, 1027390, 1035918, 1044472, 1052630, 1060839, 1069629, 1078900, 1088400, 1098373, 1108955]
50075A108955J0453R601R484J0925J2614J2963J2553J3075J4462J4958J4076J3651
50063A257770J5215J7689J8634J7013J4007J1711J1601J3766J6838J8941J9265
50052A432450J8629J8287J8680J9668K1391K4223K7982L1869L5299L8483M2145
50041A729106M6883N2793N9521O6616P3948Q1741R0146R9053J08485J18972J31185
50030B658449J45183J60208J75141J88882K00294K08056K10827K07637J98257
50021D352934J83420J64729J44019J22723J02054Q3750O9911O1264N5720M9619
50011E390143M0650K8960J4997k588k5886n5010q7494j20108j49985j74314j90834
50000D668531j99654k03256k03625k00335j92374j80730j67672j54179j39906
$$ y = [1108955, 1119408, 1129009, 1138493, 1149418, 1162032, 1174995, 1187548, 1200623, 1215085, 1230043, 1244119, 1257770, 1272985, 1290674, 1309308, 1326321, 1340328, 1352039, 1363640, 1377406, 1394244, 1413185, 1432450, 1451079, 1469366, 1488046, 1507714, 1529105, 1553328, 1581310, 1613179, 1648478, 1686961, 1729106, 1775989, 1828782, 1888303, 1954919, 2028867, 2110608, 2200754, 2299807, 2408292, 2527264, 2658449, 2803632, 2963840, 3138981, 3327863, 3528157, 3736213, 3947040, 4154677, 4352934, 4536354, 4701083, 4845102, 4967825, 5069879, 5153629, 5223540, 5284804, 5340524, 5390143, 5430793, 5459753, 5474750, 5472162, 5446276, 5391266, 5303772, 5183664, 5033679, 4859365, 4668531, 4468877, 4265621, 4061996, 3861661, 3669287, 3488557, 3320885, 3166706, 3026800]
49991C026800j25414j12555j02266r3539q5064p6660o8498o0374n2566m6290m2221
49980B161353l9293l6039l2416k9313k6785k4024k0855j8224j7022j7117j7510
49969A882755j6948j4659j1190q261p071o932o297m871l691l314l065k252j093
49956A793111L7J392L256N240O680P433P900Q668J0315J3006J6160J8978K1607
49943A913783K4954K9127L2808L4739L5185L5286L5679L6479L8083M0905M4519
49932B301547M7906N0630N3139N5949N9089O2437O6124P0597P6484Q4202R3381
49921C021485J03018J12653J23063J35324J49539J65163J82146K00904K21475
49912D414770K43441K66345K88876L07782L19088L21020L14946L03044K86171
$$ y = [3026800, 2901386, 2788831, 2686565, 2593026, 2507962, 2431302, 2362804, 2302430, 2249864, 2203574, 2161353, 2122060, 2086021, 2053605, 2024292, 1997507, 1973483, 1952628, 1934404, 1917382, 1900265, 1882755, 1865807, 1851148, 1839958, 1831697, 1824626, 1817694, 1811397, 1806526, 1802835, 1799521, 1796456, 1794204, 1793111, 1793148, 1794540, 1797796, 1803036, 1809716, 1817149, 1825049, 1833717, 1844032, 1857038, 1873198, 1892176, 1913783, 1938737, 1967864, 2000672, 2035411, 2070596, 2105882, 2141561, 2178040, 2216123, 2257028, 2301547, 2349453, 2400083, 2453222, 2509171, 2568260, 2630697, 2696821, 2767418, 2843902, 2928104, 3021485, 3124503, 3237156, 3360219, 3495543, 3645082, 3810245, 3992391, 4193295, 4414770, 4658211, 4924556, 5213432, 5521214, 5840302, 6161322, 6476268, 6779312, 7065483]
49903G065483K64662K40284K16200J95083J77795J63430J50076J35708J19089
49894H727810R9755P6805M8032J1048l4392q5155j35952j81992k21034k53358
49884H051567k80006l01226l16642l26301l30803l30578l25812l17164l05755
49875E217280k92335k77130k60630k43667k26443k08527j90242j73082j58136
49866C187088j44893j32334j20428j09818j00613r2338q4579p7047o9639o2978
49856B192421n8227n5497n3359n0696m8150m6595m5272m2947m0122l8280l7448
49845A675828l6376l4880l3935l3316l1316k7416k3380k0778j9091j7247j5435
$$ y = [7065483, 7330145, 7570429, 7786629, 7981712, 8159507, 8322937, 8473013, 8608721, 8727810, 8827565, 8904370, 8952402, 8963450, 8929058, 8843903, 8707951, 8525959, 8304925, 8051567, 7771561, 7470335, 7153693, 6827392, 6496589, 6166011, 5840199, 5523035, 5217280, 4924945, 4647815, 4387185, 4143518, 3917075, 3708548, 3518306, 3345224, 3187088, 3042195, 2909861, 2789433, 2679615, 2579002, 2486664, 2402085, 2325038, 2255399, 2192421, 2134194, 2078697, 2025338, 1974642, 1926492, 1879897, 1834625, 1791678, 1751556, 1713276, 1675828, 1639452, 1604572, 1570637, 1537321, 1506005, 1478589, 1455209, 1434431, 1415340, 1398093, 1382658]
$$ [...]
##END NTUPLES=NMR SPECTRUM
##END=
