##TITLE=coffee_type TORI02-ROVE100A-60-40
COFFEE_meoh_noesyp64 COFFEE_meoh {C:\Bruker\TOPSPIN} Administrator 8
##JCAMPDX= 6.0         $$ Bruker NMR JCAMP-DX V2.0
##DATA TYPE= NMR SPECTRUM
##DATA CLASS= NTUPLES
##ORIGIN= Bruker BioSpin GmbH
##OWNER= Administrator
$$ 1.72 TOPSPIN		Version 2.1
$$ 2012-05-29 13:27:18.048 -0700  Administrator@X
$$ Compression mode = diff/dup
##.OBSERVE FREQUENCY= 400.13188235
##.OBSERVE NUCLEUS= ^1H
##.ACQUISITION MODE= SIMULTANEOUS (DQD)
##.ACQUISITION SCHEME= undefined
##.AVERAGES= 64
##.DIGITISER RES= 22
##SPECTROMETER/DATA SYSTEM= spect
##.PULSE SEQUENCE= noesygpps1d.comp
##.SOLVENT NAME= COFFEE_meoh
##.SHIFT REFERENCE= INTERNAL, COFFEE_meoh, 1, 14.98061
##AUDIT TRAIL= $$ (NUMBER, WHEN, WHO, WHERE, PROCESS, VERSION, WHAT)
$$ ##TITLE= Audit trail, TOPSPIN		Version 2.1
$$ ##JCAMPDX= 5.01
$$ ##ORIGIN= Bruker BioSpin GmbH
$$ ##OWNER= Administrator
$$ $$ Z:/data/jwist/nmr/12-COFFEE-0203/102/pdata/1/auditp.txt
$$ ##AUDIT TRAIL=  $$ (NUMBER, WHEN, WHO, WHERE, PROCESS, VERSION, WHAT)
(   1,<2012-03-02 22:57:58.068 -0500>,<Administrator>,<TOPSPIN>,<go>,<TOPSPIN 2.1>,
      <created by zg
	started at 2012-03-02 22:46:27.850 -0500,
	POWCHK enabled, PULCHK disabled,
       configuration hash MD5:
       1A 1E CE 29 27 FD 77 03 67 4E F0 E3 C4 B2 CB 90
       data hash MD5: 64K
       40 B4 D9 0E 8D C0 86 3D 87 19 35 79 C1 3D DE AA>)
(   2,<2012-03-02 22:58:03.162 -0500>,<Administrator>,<TOPSPIN>,<audit>,<TOPSPIN 2.1>,
      <user comment:
       ICON-NMR User ID: Administrator
       data hash MD5: 64K
       40 B4 D9 0E 8D C0 86 3D 87 19 35 79 C1 3D DE AA>)
(   3,<2012-05-29 09:24:30.519 -0700>,<Administrator>,<X>,<proc1d>,<TOPSPIN 2.1>,
      <Start of raw data processing
       efp LB = 0.3 FT_mod = 6 PKNL = 1 PHC0 = 0 PHC1 = 0 SI = 128K 
       data hash MD5: 128K
       79 E7 49 F8 48 0E 0B 11 F8 4A 5D 87 32 43 27 CF>)
(   4,<2012-05-29 09:24:31.097 -0700>,<Administrator>,<X>,<proc1d>,<TOPSPIN 2.1>,
      <pk PHC0 = 36.13953 PHC1 = 0 
       data hash MD5: 128K
       2C F1 9C 38 90 CC 92 14 38 B0 0E 69 4D 6F 5E 03>)
(   5,<2012-05-29 09:24:32.237 -0700>,<Administrator>,<X>,<proc1d>,<TOPSPIN 2.1>,
      <abs ABSG = 1 
       data hash MD5: 128K
       D7 45 A3 91 AB E5 93 AC 6E 87 A2 FC BE B1 FF 96>)
(   6,<2012-05-29 09:24:32.362 -0700>,<Administrator>,<X>,<proc1d>,<TOPSPIN 2.1>,
      <abs ABSG = 2 
       data hash MD5: 128K
       F7 B7 C7 23 33 E6 B3 63 F2 25 FC D5 53 42 DB E8>)
(   7,<2012-05-29 09:24:32.456 -0700>,<Administrator>,<X>,<proc1d>,<TOPSPIN 2.1>,
      <abs ABSG = 3 
       data hash MD5: 128K
       AE 88 87 D6 ED DE 2C 6E 20 0D 2F 50 DD 9B B2 B0>)
(   8,<2012-05-29 09:24:32.534 -0700>,<Administrator>,<X>,<proc1d>,<TOPSPIN 2.1>,
      <abs ABSG = 4 
       data hash MD5: 128K
       37 FE 52 E8 D2 24 C4 E5 04 27 D4 E9 95 73 0F 59>)
(   9,<2012-05-29 09:24:32.628 -0700>,<Administrator>,<X>,<proc1d>,<TOPSPIN 2.1>,
      <abs ABSG = 5 
       data hash MD5: 128K
$$ [...]
150 150 150 150 150 150 150 150
##$TP07= 0
##$TPNAME0= <>
##$TPNAME1= <>
##$TPNAME2= <>
##$TPNAME3= <>
##$TPNAME4= <>
##$TPNAME5= <>
##$TPNAME6= <>
##$TPNAME7= <>
##$TPOAL= (0..7)
0.5 0.5 0.5 0.5 0.5 0.5 0.5 0.5
##$TPOFFS= (0..7)
0 0 0 0 0 0 0 0
##$TUNHIN= 0
##$TUNHOUT= 0
##$TUNXOUT= 0
##$USERA1= <user>
##$USERA2= <user>
##$USERA3= <user>
##$USERA4= <user>
##$USERA5= <user>
##$V9= 5
##$VALIST= <valist>
##$VCLIST= <CCCCCCCCCCCCCCC>
##$VD= 0
##$VDLIST= <DDDDDDDDDDDDDDD>
##$VPLIST= <PPPPPPPPPPPPPPP>
##$VTLIST= <TTTTTTTTTTTTTTT>
##$WBST= 1024
##$WBSW= 4
##$XGAIN= (0..3)
0 0 0 0
##$XL= 0
##$YL= 0
##$YMAX_a= 14148836
##$YMIN_a= -6826848
##$ZGOPTNS= <>
##$ZL1= 120
##$ZL2= 120
##$ZL3= 120
##$ZL4= 120
##$ABSF1= 14.98061
##$ABSF2= -5.57192
##$ABSG= 5
##$ABSL= 3
##$ALPHA= 0
##$AQORDER= 0
##$ASSFAC= 0
##$ASSFACI= 0
##$ASSFACX= 0
##$ASSWID= 0
##$AUNMP= <proc_prof1d_extract>
##$AXLEFT= 0
##$AXNAME= <>
##$AXNUC= <1H>
##$AXRIGHT= 0
##$AXTYPE= 0
##$AXUNIT= <>
##$AZFE= 0.1
##$AZFW= 0.1
##$BCFW= 0
##$BC_mod= 0
##$BYTORDP= 0
##$COROFFS= 0
##$CY= 15
##$DATMOD= 1
##$DC= 0
##$DFILT= <>
##$DTYPP= 0
##$F1P= 0
##$F2P= 0
##$FCOR= 0.5
##$FTSIZE= 131072
##$FT_mod= 6
##$GAMMA= 0
##$GB= 0
##$INTBC= 1
##$INTSCL= 1
##$ISEN= 128
##$LB= 0.3
##$LEV0= 0
##$LPBIN= 0
##$MAXI= 10000
##$MC2= 0
##$MEAN= 0
##$ME_mod= 0
##$MI= 0
##$NCOEF= 0
##$NC_proc= -3
##$NLEV= 6
##$NOISF1= 0
##$NOISF2= 0
##$NSP= 0
##$NTH_PI= 0
##$NZP= 0
##$OFFSET= 14.98061
##$PC= 1
##$PHC0= 36.13953
##$PHC1= 0
##$PH_mod= 1
##$PKNL= yes
##$PPARMOD= 0
##$PPDIAG= 0
##$PPIPTYP= 0
##$PPMPNUM= 2147483647
##$PPRESOL= 1
##$PSCAL= 4
##$PSIGN= 0
##$PYNMP= <proc.py>
##$REVERSE= no
##$SF= 400.13
##$SI= 131072
##$SIGF1= 0
##$SIGF2= 0
##$SINO= 400
##$SIOLD= 131072
##$SPECTYP= <>
##$SREGLST= <1H.CDCl3>
##$SSB= 0
##$STSI= 131072
##$STSR= 0
##$SW_p= 8223.68421052632
##$SYMM= 0
##$S_DEV= 0
##$TDeff= 65536
##$TDoff= 0
##$TI= <>
##$TILT= no
##$TM1= 0
##$TM2= 0
##$TOPLEV= 0
##$USERP1= <user>
##$USERP2= <user>
##$USERP3= <user>
##$USERP4= <user>
##$USERP5= <user>
##$WDW= 1
##$XDIM= 131072
##$YMAX_p= 496464589
##$YMIN_p= -264201698
##$CURPLOT= <Network HP LaserJet P1505>
##$CURPRIN= <$Network HP LaserJet P1505>
##$DFORMAT= <normdp>
##$LAYOUT= <+/1D_H.xwp>
##$LFORMAT= <normlp>
##$PFORMAT= <normpl>
##$SURQMSG= 1
$$ End of Bruker specific parameters
$$ ---------------------------------
##NTUPLES= NMR SPECTRUM
##VAR_NAME=  FREQUENCY,     SPECTRUM/REAL,   SPECTRUM/IMAG
##SYMBOL=    X,             R,               I
##VAR_TYPE=  INDEPENDENT,   DEPENDENT,       DEPENDENT
##VAR_FORM=  AFFN,          ASDF,            ASDF
##VAR_DIM=   131072,        131072,          131072
##UNITS=     HZ,            ARBITRARY UNITS, ARBITRARY UNITS
##FACTOR=    0.0627417313425165, 1,          1
##FIRST=     8223.62146879498, 2287,         -96704
##LAST=      0,             5357,            -96652
##MIN=       0,             -264201698,      0
##MAX=       8223.62146879498, 496464589,    0
$$ Real data points
##PAGE= N=1
##DATA TABLE= (X++(R..R)), XYDATA
$$ [...]
60721A371674R171Q143O165M064L539M927O770P684P651P242O524N371M320M274
$$ 1371674 1380845 1388988 1395153 1399217 1402756 1407683 1414453 1422137 1429788 1437030 1443554 1448925 1453245 1457519
60707A457519N372O647P043O600O348O934P638P138N166K884J448Q44M88L14N05
$$ 1457519 1462891 1469538 1476581 1483181 1489529 1496463 1504101 1511239 1516405 1519289 1520737 1521581 1522069 1522383 1522888
60692A522888N72k37j583k008o38J652L131K881J238j002l295n384p122q488r505
$$ 1522888 1523460 1523223 1521640 1519632 1518994 1520646 1523777 1526658 1527896 1526894 1523599 1518215 1511093 1502605 1493100
60677A493100j0013r689q472o909n752n205m947n005o078q502j1264j2745j2313
$$ 1493100 1483087 1473398 1464926 1458017 1452265 1447060 1442113 1437108 1431030 1422528 1411264 1398519 1386206
60664A386206j0600q578p127p252r354j2083j3061j1462q950p432o808n791m156
$$ 1386206 1375606 1367028 1359901 1352649 1343295 1331212 1318151 1306689 1297739 1290307 1283499 1277708 1273552
60651A273552l014l065l568l191j515L21N38j361l637m175l299l458n865q911
$$ 1273552 1270538 1267473 1263905 1260714 1259199 1259520 1260058 1258697 1255060 1250885 1247586 1244128 1238263 1229352
60637A229352j0660j1262j1706j1805j1128j0693j1653j3126j3497j3261j4280
$$ 1229352 1218692 1207430 1195724 1183919 1172791 1162098 1150445 1137319 1123822 1110561 1096281
60626A096281j6457j7565j6545j4763j3552j2526j1046r436p969o230m307l121
$$ 1096281 1079824 1062259 1045714 1030951 1017399 1004873 993827 984391 976422 970192 965885 962764
60614I62764k873k592j874j412j070O12L939O869P743P541P873Q416Q234Q247
$$ 962764 959891 957299 955425 954013 952943 953555 957494 964363 972106 979647 987520 995936 1004170 1012417
60600A012417R882J2212J2966J2056J1699J2894J4132J4031J3228J2878J3063
$$ 1012417 1022299 1034511 1047477 1059533 1071232 1084126 1098258 1112289 1125517 1138395 1151458
60589A151458J3588J4801J6448J6991J5445J3111J2164J3047J4435J5364J6088
$$ 1151458 1165046 1179847 1196295 1213286 1228731 1241842 1254006 1267053 1281488 1296852 1312940
60578A312940J6833J7017J6282J5415J5487J6426J7123J6705J5238J3134J0553
$$ 1312940 1329773 1346790 1363072 1378487 1393974 1410400 1427523 1444228 1459466 1472600 1483153
60567A483153P709N272L829K872R62k737p263j0617j1762j1643j2070j3794j5914
$$ 1483153 1490862 1496134 1499963 1502835 1503797 1501060 1493797 1483180 1471418 1459775 1447705 1433911 1417997
60554A417997j7094j6940j5984j4615j2666j0060p364n347m212l438k275l59J888
$$ 1417997 1400903 1383963 1367979 1353364 1340698 1330638 1323274 1317927 1313715 1310277 1308002 1307643 1309531
60541A309531L569M426N444P598J0012J0496Q251M934K510J279Q74J704L860N765
$$ 1309531 1313100 1317526 1322970 1330568 1340580 1351076 1359327 1364261 1366771 1368050 1368924 1370628 1374488 1380253
60527A380253N850M982N260O857Q136Q572R248J0235R969P945N769M514L133O72
$$ 1380253 1386103 1391085 1396345 1403202 1411338 1419910 1429158 1439393 1449362 1457307 1463076 1467590 1470723 1471395
60513A471395j839l201l920m687m734l607l034m777p724r428r828j0935j3254
$$ 1471395 1469556 1466355 1462435 1457748 1453014 1449407 1446373 1441596 1433872 1424444 1414616 1403681 1390427
60500A390427j4929j4496j2397r491o123l147j893k326k671j614L20K138L859
$$ 1390427 1375498 1361002 1348605 1339114 1332991 1329844 1327951 1325625 1322954 1321340 1321660 1323798 1327657
60487A327657N977Q610J1851J5908K0233K3572K5615K7613L0682L4523L8735M4281
$$ 1327657 1333634 1342244 1354095 1370003 1390236 1413808 1439423 1467036 1497718 1532241 1570976 1615257
60475A615257N2210O1589P0103P6620Q1906Q6642Q9770Q9244Q3844P3840O0348
$$ 1615257 1667467 1729056 1799159 1875779 1957685 2044327 2134097 2223341 2307185 2381025 2441373
60464B441373M4635K8104J2574O8q102j1948j2345j0020n431M99O322J1098J5000
$$ 2441373 2486008 2514112 2526686 2526754 2518652 2506704 2494359 2484339 2478908 2479407 2485729 2496827 2511827
60451B511827J8423K0930K1706K0785J9141J7604J6296J5314J5338J7210K1141
$$ 2511827 2530250 2551180 2572886 2593671 2612812 2630416 2646712 2662026 2677364 2694574 2715715
60440B715715K6672L3215M0394M8073N6550O6598P8824R2760J07072J20956J34957
$$ 2715715 2742387 2775602 2815996 2864069 2920619 2987217 3066041 3158801 3265873 3386829 3521786
60429C521786J49871J65238J79502J91686K02438K13647K27688K46849K72451
$$ 3521786 3671657 3836895 4016397 4208083 4410521 4624168 4851856 5098705 5371156
60420E371156L04165L41013L83181M31709M85353N38195N80756O03001N96321
$$ 5371156 5675321 6016334 6399515 6831224 7316577 7854772 8435528 9038529 9634850
60411I634850N54788M77122L67796K35252Q9058o0453k01120l20740m11777m73739
$$ 9634850 10189638 10666760 11034556 11269808 11358866 11298413 11097293 10776553 10364776 9891037
60401I891037n10411n26044n24968n12923m95907m77078m56125m32194m06416
$$ 9891037 9380626 8854582 8329614 7816691 7320784 6843706 6387581 5955387 5548971
60392E548971l80937l56486l32119l07118k82046k57784k34404k11617j89711
$$ 5548971 5168034 4811548 4479429 4172311 3890265 3632481 3398077 3186460 2996749
60383B996749j69374j50848j34001j19091j06636r6411q7432p9234p2446o7567
$$ 2996749 2827375 2676527 2542526 2423435 2316799 2220388 2132956 2053722 1981276 1913709
60373A913709o3791n9683n4647m9209m4206m0230l7456l5384l3056l0115k7393
$$ 1913709 1849918 1790235 1735588 1686379 1642173 1601943 1564487 1529103 1496047 1465932 1438539
60362A438539k5811k5041k3984k2309k0578j9064j7325j5109j2780j0769r271
$$ 1438539 1412728 1387687 1363703 1341394 1320816 1301752 1284427 1269318 1256538 1245769 1236498
60351A236498q561q771r187q623o843m874l547k548j307j37K62r5n27n55j56O62
$$ 1236498 1227937 1219166 1209979 1201356 1194513 1189639 1186092 1183544 1182237 1182100 1182362 1182267 1181740 1181185 1181029 1181691
60335A181691J910L338M516N201N399N127M368L284K265J706J669J725J275K81
$$ 1181691 1183601 1186939 1191455 1196656 1202055 1207182 1211550 1214834 1217099 1218805 1220474 1222199 1223474 1223755
60321A223755n71p48o90j246k396l324l734m316n600p183q366q828q200n911k305
$$ 1223755 1223184 1222436 1221746 1220500 1218104 1214780 1211046 1206730 1201130 1193947 1185581 1176753 1168553 1162642 1160337
60306A160337P91J678N79r55k054k884l376k964j732o47j79K23Q38R58L03J66
$$ 1160337 1161128 1162806 1163385 1162430 1160376 1157492 1154116 1151152 1149420 1148773 1148594 1148817 1149655 1150613 1150916 1151082
60290A151082J953N069P420P754O567M827L093J968K183L636N268O359P237Q156
$$ 1151082 1153035 1158104 1165524 1173278 1179845 1184672 1187765 1189733 1191916 1195552 1200820 1207179 1214416 1222572
60276A222572Q437P481N888M686M024L484L086L061L197L604N412R238J3281J4740
$$ 1222572 1231009 1238490 1244378 1249064 1253088 1256572 1259658 1262719 1265916 1269520 1274932 1284170 1297451 1312191
60262A312191J3206J0893R293P540M820K340J396J002q03m167p476r510j0109
$$ 1312191 1325397 1336290 1345583 1353123 1357943 1360283 1361679 1362681 1361878 1357711 1350235 1340725 1330616
60249A330616r397p957p327q475r867q798m952j194k50j819l434l221j311Q34
$$ 1330616 1321219 1313262 1305935 1297460 1287593 1278795 1273843 1272649 1272399 1270580 1267146 1263925 1262614 1263448
60235A263448J890J831J749K357L019K891K414K660L593M299M614N064N399M928
$$ 1263448 1265338 1267169 1268918 1271275 1274294 1277185 1279599 1282259 1285852 1290151 1294765 1299829 1305228 1310156
60221A310156M435N710Q597J0522R969Q627Q687R757J0208J0255J1413J3640J5309
$$ 1310156 1314591 1320301 1328898 1339420 1349389 1358016 1366703 1376460 1386668 1396923 1408336 1421976 1437285
60208A437285J5869J6461J7682J8681J9086K0051K2369K4880K6081K6480K8058
$$ 1437285 1453154 1469615 1487297 1505978 1525064 1545115 1567484 1592364 1618445 1644925 1672983
60197A672983L1652L5991L9414M1741M4120M7574N2077N6902O1547O6261P1640
$$ 1672983 1704635 1740626 1780040 1821781 1865901 1913475 1965552 2022454 2084001 2150262 2221902
60186B221902P7835Q4322R0579R6808J03733J11628J19818J27322J33730J39130
$$ 2221902 2299737 2384059 2474638 2571446 2675179 2786807 2906625 3033947 3167677 3306807
60176C306807J43396J46163J47574J48355J48606J47013J41956J33207J21905
$$ 3306807 3450203 3596366 3743940 3892295 4040901 4187914 4329870 4463077 4584982
60167D584982J09118R5373Q1479O8601N6907M5006L1587J7233L920o835j4713
$$ 4584982 4694100 4789473 4870952 4939553 4996460 5041466 5073053 5090286 5094206 5087371 5072658
60156E072658j9761k1931k1606j9903j7827j5350j1541n551K715J2880K4593L7552
$$ 5072658 5052897 5030966 5009360 4989457 4971630 4956280 4944739 4939188 4941903 4954783 4979376 5016928
60144E016928N1153O4622P7790R1236J05156J18339J29024J36586J41549J43793
$$ 5016928 5068081 5132703 5210493 5301729 5406885 5525224 5654248 5790834 5932383 6076176
60134F076176J41984J35417J25541J14564J02860Q8826P1266N1111L0547J1119
$$ 6076176 6218160 6353577 6479118 6593682 6696542 6785368 6856634 6907745 6938292 6949411
60124F949411p001k4345m1068n6289o8369p6085p9625q0227p8799p5184o8772
$$ 6949411 6942410 6918065 6876997 6820708 6752339 6676254 6596629 6516402 6437603 6362419 6293647
60113F293647n9373m7268l2871j6766K07J7445L4999N2946P0312Q5213R6403J03995
$$ 6293647 6234274 6187006 6154135 6137369 6137576 6155021 6190020 6242966 6313278 6398491 6494894 6598889
60101F598889J08312J08513J03382R3237Q0085O5672N0408L4627J9831P519k528
$$ 6598889 6707201 6815714 6919096 7012333 7092418 7158090 7208498 7243125 7262956 7270475 7267947
60090G267947j1573j9633k5089k6820k5484k2117j6444p536M384J7992L2759M9720
$$ 7267947 7256374 7236741 7211652 7184832 7159348 7137231 7120787 7113251 7117635 7135627 7168386 7218106
60078G218106O9888R2426J15283J37503J60238J85206K12838K42420K73445L05634
$$ 7218106 7287994 7380420 7495703 7633206 7793444 7978650 8191488 8433908 8707353 9012987
60068I012987L37756L67728L94415M18305M39613M56579M66639M68607M62694
$$ 9012987 9350743 9718471 10112886 10531191 10970804 11427383 11894022 12362629 12825323
60059A2825323M49042M27616L99253L65172L25395K78938K25949J68472J08696
$$ 12825323 13274365 13701981 14101234 14466406 14791801 15070739 15296688 15465160 15573856
60050A5573856M7671j3848p4444j32690j87711k38326k82407l17917l43936l60105
$$ 15573856 15621527 15607679 15533235 15400545 15212834 14974508 14692101 14374184 14030248 13670143
60040A3670143l65962l61847l49777l32318l10732k85022k55484k23228j89240
$$ 13670143 13304181 12942334 12592557 12260239 11949507 11664485 11409001 11185773 10996533
60031A0996533j53605j15932p6390l6516R25L3394O0200Q2067R8850J08596J09522
$$ 10996533 10842928 10726996 10650606 10614090 10615015 10648409 10708609 10790676 10889526 10998122 11107644
60020A1107644J02015Q7707O7506M2051J3761j3471l7138n7710p6923r5543j13331
$$ 11107644 11209659 11297366 11364872 11406923 11420684 11407213 11370075 11312365 11235442 11139899 11026568
60009A1026568j30328j46979j63155j77709j89328j97549k02884k06078k07315
$$ 11026568 10896240 10749261 10586106 10408397 10219069 10021520 9818636 9612558 9405243
60000I405243k06154k02032j94639j83962j70442j55167j39354j23289j06179
$$ 9405243 9199089 8997057 8802418 8618456 8448014 8292847 8153493 8030204 7924025
59991G924025q7431o7640m7856k8237q086J2982L4435N5278P4522R1252J04749
$$ 7924025 7836594 7768954 7721098 7692861 7684775 7697757 7732192 7787470 7861992 7953244 8057993
59980H057993J14637J20520J21633J17295J07757R4102P7252N7535L5358J1697
$$ 8057993 8172630 8293150 8414783 8532078 8639835 8733937 8811189 8868724 8904082 8915779
59970H915779j2373l6403o0404q3972j05788j24187j38202j47992j54143j56733
$$ 8915779 8903406 8867003 8806599 8722627 8616839 8492652 8354450 8206458 8052315 7895582
59960G895582j55359j50006j41414j30463j17665j03401q8208p2474n6181l9311
$$ 7895582 7740223 7590217 7448803 7318340 7200675 7097274 7009066 6936592 6880411 6841100
59950F841100k2055m288J4719L5444N7237P8902R9963J20678J40969J60041J77049
$$ 6841100 6819045 6814757 6829476 6864920 6922157 7001059 7101022 7221700 7362669 7522710 7699759
59939G699759J91345K01724K06166K03161J93180J78376J60655J40302J16517
$$ 7699759 7891104 8092828 8298994 8502155 8695335 8873711 9034366 9174668 9291185
59930I291185Q9008N8865K8108j393k8751n4293p8922j02594j23261j37923j45270
$$ 9291185 9380193 9439058 9467166 9465773 9437022 9382729 9303807 9201213 9077952 8940029 8794759
59919H794759j46821j45140j41394j35132j25610j12423r5520p5903n5929l7496
$$ 8794759 8647938 8502798 8361404 8226272 8100662 7988239 7892719 7816816 7760887 7723391
59909G723391j9923j070J9548M0344O0321Q0028R9134J15168J26051J32398J35940
$$ 7723391 7703468 7702398 7721946 7762290 7822611 7902639 8001773 8116941 8242992 8375390 8511330
59898H511330J37041J35347J31566J26566J19592J09601R7958Q7638P9638P2109
$$ 8511330 8648371 8783718 8915284 9041850 9161442 9271043 9369001 9456639 9536277 9608386
59888I608386O3412N4516M7885M5453M8136N6033O8373Q4141J03283J26469J53473
$$ 9608386 9671798 9726314 9774199 9819652 9867788 9923821 9992194 10076335 10179618 10306087 10459560
59877A0459560J82864K13865K47447K84739L24874L65184M03036M36800M65152
$$ 10459560 10642424 10856289 11103736 11388475 11713349 12078533 12481569 12918369 13383521
59868A3383521M85839M95350M89969M67574M28368L73672L04519K22385J31103
$$ 13383521 13869360 14364710 14854679 15322253 15750621 16124293 16428812 16651197 16782300
59859A6782300L6707n5093j40511k16769k81062l31598l68902l94879m10665m16307
$$ 16782300 16819007 16763914 16623403 16406634 16125572 15793974 15425072 15030193 14619528 14203221
59849A4203221m12374m00891l84204l63548l39174l11403k80967k48453k14052
$$ 14203221 13790847 13389956 13005752 12642204 12303030 11991627 11710660 11462207 11248155
59840A1248155j78123j41371j04119o5953k6888J1458M6808P8298J06510J31232
$$ 11248155 11070032 10928661 10824542 10758589 10731701 10743159 10789967 10868265 10974775 11106007
59830A1106007J50348J61571J64150J58056J42473J16429Q0434L6363j3754o7565
$$ 11106007 11256355 11417926 11582076 11740132 11882605 11999034 12079468 12115831 12102077 12034512
59820A2034512j21322j70597k12625k47313k75784k98748l16369l28815l36363
$$ 12034512 11913190 11742593 11529968 11282655 11006871 10708123 10391754 10062939 9726576
59811I726576l39258l37564l31038l19503l03742k85675k66998k48065k28697
$$ 9726576 9387318 9049754 8718716 8399213 8095471 7809796 7542798 7294733 7066036
59802G066036k09521j91492j74529j57790j41257j25959j12678j01422r2224q5351
$$ 7066036 6856515 6665023 6490494 6332704 6191447 6065488 5952810 5851388 5759164 5673813
59792E673813q0524p6603p2176o6056n7666m7907l9049l2462k6807j9953j2437
$$ 5673813 5593289 5516686 5444510 5378454 5320788 5272881 5233832 5201370 5174563 5154610 5142173
59781E142173p277o263q376j2371j8851k8606m0256n0928n8541o2645o3912o3650
$$ 5142173 5134896 5128633 5120257 5107886 5089035 5060429 5020173 4969245 4910704 4848059 4784147 4720497
59769D720497o3034o1944n9161n4363m9120m5152m2347l9103l3960k6398j6835
$$ 4720497 4657463 4595519 4536358 4481995 4432875 4387723 4345376 4306273 4272313 4245915 4229080
59758D229080o524L368J3185K4346L6801M8226N6702O3042O9082P4680P8322Q0058
$$ 4229080 4222556 4225924 4239109 4263455 4300256 4348482 4405184 4468226 4537308 4611988 4690310 4770368
59746D770368Q1756Q4084Q5049Q2191P5069O4983N3344M1303L0302K1786J6274
$$ 4770368 4852124 4936208 5021257 5103448 5178517 5243500 5296844 5338147 5368449 5390235 5406509
59735E406509J3312J2442J3764J7397K2827K9362L7102M6852N8921P2587Q7271
$$ 5406509 5419821 5432263 5446027 5463424 5486251 5515613 5552715 5599567 5658488 5731075 5818346
59724E818346J03671J22929J45030J69006J94702K23191K55181K89961L26317
$$ 5818346 5922017 6044946 6189976 6358982 6553684 6776875 7032056 7322017 7648334
59715G648334L63354L99360M30153M49398M50579M28741L81408L09554K18569
$$ 7648334 8011688 8411048 8841201 9290599 9741178 10169919 10551327 10860881 11079450
59706A1079450J18057J9579o6916j35981j86834k21024k40215k46157k41654k30258
$$ 11079450 11197507 11217086 11150170 11014189 10827355 10606331 10366116 10119959 9878305 9648047
59696I648047k14955j97721j79808j61453j41664j19644r6457p3985n2265k9395
$$ 9648047 9433092 9235371 9055563 8894110 8752446 8632802 8536345 8462360 8410095 8380700
59686H380700m438K1219M6064P0625R6367J23474J50736J77025K02138K26869
$$ 8380700 8376262 8397481 8443545 8514170 8610537 8734011 8884747 9061772 9263910 9490779
59676I490779K52778K81117L11486L42382L73622M07173M44810M85917N28374
$$ 9490779 9743557 10024674 10336160 10678542 11052164 11459337 11904147 12390064 12918438
59667A2918438N70870O13588O57298P02402P48131P92108Q31355Q63877Q88184
$$ 12918438 13489308 14102896 14760194 15462596 16210727 17002835 17834190 18698067 19586251
59658A9586251R01504R00769Q86352Q62937Q35357Q05437P74460P46630P27440
$$ 19586251 20487755 21388524 22274876 23137813 23973170 24778607 25553067 26299697 27027137
59649B7027137P19573P22435P34550P53781P75845P95448Q09037Q14498Q08427
$$ 27027137 27746710 28469145 29203695 29957476 30733321 31528769 32337806 33152304 33960731
59640C3960731P86241P45335O86224O10490N20003M18786L13318K09759J12233
$$ 33960731 34746972 35492307 36178531 36789021 37309024 37727810 38041128 38250887 38363120
59631C8363120K4365m9564j06365j45530j67835j73445j62597j37085r9550n1615
$$ 38363120 38387485 38337921 38231556 38086026 37918191 37744746 37582149 37445064 37345514 37293899
59621C7293899O356P3998J50488K35224L28045M28379N34354O42610P48926Q48814
$$ 37293899 37300255 37374253 37524741 37759965 38088010 38516389 39050743 39693353 40442279 41291093
59611D1291093R37211J007391J050826J058914J024734R43086Q10511O27756M02819
$$ 41291093 42228304 43235695 44286521 45345435 46370169 47313255 48123766 48751522 49154341
59602D9154341J50181j13746l74121o17606q31780j006991j138875j228376j279521
$$ 49154341 49304522 49190776 48816655 48199049 47367269 46360278 45221403 43993027 42713506
59593D2713506j297607j288786j260103j219085j172997j128556j092533j072171
$$ 42713506 41415899 40127113 38867010 37647925 36474928 35346372 34253839 33181668
59585C3181668j073210j095935j133351j174349j208815j229741j232706j216405
$$ 33181668 32108458 31012523 29879172 28704823 27496008 26266267 25033561 23817156
59577B3817156j183890j140738j090899j035578r76275r16514q59402q05295p53286
$$ 23817156 22633266 21492528 20401629 19366051 18389776 17473262 16613860 15808565 15055279
59568A5055279p03409o55886o09647n63680n18931m77118m38234m00907l64771
$$ 15055279 14351870 13695984 13086337 12522657 12003726 11526608 11088374 10687467 10322696
59559A0322696l30783k99440k70326k43380k19177j97913j79439j64295j53291
$$ 10322696 9991913 9692473 9422147 9178767 8959590 8761677 8582238 8417943 8264652
59550H264652j45846j40186j35577j33134j33818j36629j39518j41350j42349
$$ 8264652 8118806 7978620 7843043 7709909 7576091 7439462 7299944 7158594 7016245
59541G016245j43178j44037j44279j42686j38532j32550j26222j20119j13487
$$ 7016245 6873067 6729030 6584751 6442065 6303533 6170983 6044761 5924642 5811155
59532E811155j05571r6469q6651p6598o7053n8536n0243m0712l0081k0371j2620
$$ 5811155 5705584 5609115 5522464 5445866 5378813 5320277 5270034 5229322 5199241 5178870 5166250
59521E166250n327K989J1111J6914K0759K4836K9672L3760L6602L9475M2675M4800
$$ 5166250 5160923 5163912 5175023 5191937 5212696 5237532 5267204 5300964 5337566 5377041 5419716 5464516
59509E464516M5926M8903N5528O3499O9638P4549Q1362R0882J01037J10893J22026
$$ 5464516 5510442 5559345 5614873 5678372 5748010 5822559 5903921 5994803 6095840 6206733 6328759
59498F328759J35389J49594J63509J78196J94840K12653K30470K48872K68870
$$ 6328759 6464148 6613742 6777251 6955447 7150287 7362940 7593410 7842282 8111152
59489H111152K89562L08945L26269L41822L54967L64238L69347L71381L70761
$$ 8111152 8400714 8709659 9035928 9377750 9732717 10096955 10466302 10837683 11208444
59480A1208444L66403L57337L44046L27612L08216K85068K57350K25230J90373
$$ 11208444 11574847 11932184 12276230 12603842 12912058 13197126 13454476 13679706 13870079
59471A3870079J55632J23641R5412P0579M8974L1430J9157J2948J3279K0558L4797
$$ 13870079 14025711 14149352 14244764 14315343 14364317 14395747 14414904 14427852 14441131 14461689 14496486
59460A4496486N4987P9142J04991J30544J53805J71984J81544J79597J65154J38525
$$ 14496486 14551473 14630615 14735606 14866150 15019955 15191939 15373483 15553080 15718234 15856759
59450A5856759R9898M9504j0758p7125j45885k14558k80705l40738l91041m29790
$$ 15856759 15956657 16006161 15995403 15918278 15772393 15557835 15277130 14936392 14545351 14115561
59440A4115561m56966m73310m80070m78992m71408m57695m38445m15591l91335
$$ 14115561 13658595 13185285 12705215 12226223 11754815 11297120 10858675 10443084 10051749
59431A0051749l66446l40545l13580k85976k57830k29132k00519j72833j46165
$$ 10051749 9685303 9344758 9031178 8745202 8487372 8258240 8057721 7884888 7738723
59422G738723j20192r4949p0256m5053j8684P600L1930N4423P7081J01224J26368
$$ 7738723 7618531 7523582 7453326 7408273 7389589 7397189 7429119 7483542 7560623 7661847 7788215
59411G788215J51565J76267J99750K21115K40088K56638K69645K77181K78091
$$ 7788215 7939780 8116047 8315797 8536912 8777000 9033638 9303283 9580464 9858555
59402I858555K71947K57512K33052J98562J56074J07515N3906k834n9267j12662
$$ 9858555 10130502 10388014 10621066 10819628 10975702 11083217 11137123 11134289 11075022 10962360
59392A0962360j62264k07333k45503k74675k95435l10185l20442l26225l27447
$$ 10962360 10800096 10592763 10347260 10072585 9777150 9466965 9146523 8820298 8492851
59383H492851l24661l18652l10134k99697k87469k73259k57479k41284k25339
$$ 8492851 8168190 7849538 7539404 7239707 6952238 6678979 6421500 6180216 5954877
59374E954877k09110j91955j74239j56867j40543j26006j13969j03955r4055q2945
$$ 5954877 5745767 5553812 5379573 5222706 5082163 4956157 4842188 4738233 4644178 4561233
59364D561233p1510o1336n2224m2435l1187j9839j0366l391K280Q536J6448K5541
$$ 4561233 4489723 4428387 4376163 4333728 4302541 4282702 4272336 4268945 4271225 4279761 4296209 4321750
59352D321750L4461M2111M7611M9649M7393M2523L8907L9223M2804M7773N4138
$$ 4321750 4356211 4398322 4445933 4495582 4542975 4585498 4624405 4663628 4706432 4754205 4808343
59341D808343O3331P5517Q9044J02236J13995J22775J26995J27378J27634J31690
$$ 4808343 4871674 4947191 5036235 5138471 5252466 5375241 5502236 5629614 5757248 5888938
59331E888938J40792J53893J70062J89309K11316K34690K58225K82379L08843
$$ 5888938 6029730 6183623 6353685 6542994 6754310 6989000 7247225 7529604 7838447
59322G838447L38845L72547M09810M50450M93364N36507N78633O20137O61041
$$ 7838447 8177292 8549839 8959649 9410099 9903463 10439970 11018603 11638740 12299781
59313A2299781O98606P28325P47049P53850P48310P29997P00178O62299O19893
$$ 12299781 12998387 13726712 14473761 15227611 15975921 16705918 17406096 18068395 18688288
59304A8688288N74960N28839M83111M38786L95817L54214L14243K74534K31604
$$ 18688288 19263248 19792087 20275198 20713984 21109801 21464015 21778258 22052792 22284396
59295B2284396J82865J29088P2314J2450n1983j20119j87885k51229l08653l60236
$$ 22284396 22467261 22596349 22668663 22681113 22629130 22509011 22321126 22069897 21761244 21401008
59285B1401008m05746m44714m77591n05757n30337n51275n67594n78454n83759
$$ 21401008 20995262 20550548 20072957 19567200 19036863 18485588 17917994 17339540 16755781
59276A6755781n83669n77856n65978n48804n28003n04643m78794m50816m21806
$$ 16755781 16172112 15594256 15028278 14479474 13951471 13446828 12968034 12517218 12095412
59267A2095412l92292l61704l30007k98643k68833k40022k11225j82940j56300
$$ 12095412 11703120 11341416 11011409 10712766 10443933 10203911 9992686 9809746 9653446
59258I653446j31251j07214q4944o5960n0443l7309k6292j8310j3774j2173j3602
$$ 9653446 9522195 9414981 9330037 9264077 9213634 9176325 9150033 9131723 9117949 9105776 9092174
59247I092174j8964k7927l7953m6334n2598n8315o5051p2935q0659q6418q9126
$$ 9092174 9073210 9045283 9007330 8960996 8908398 8850083 8785032 8712097 8631438 8545020 8455894
59236H455894q8964q6699q2709p6982o9691o1045n0810l8794k5538j1891K093
$$ 8455894 8366930 8280231 8197522 8120540 8050849 7989804 7938994 7900200 7874662 7862771 7864864
59225G864864J7044L3256N0487O8710Q8006J07693J26395J43349J59048J74363
$$ 7864864 7881908 7915164 7965651 8034361 8122367 8230060 8356455 8499804 8658852 8833215
59215H833215J89375K03043K13650K19757K21177K18726K12610K01678J85070
$$ 8833215 9022590 9225633 9439283 9659040 9880217 10098943 10311553 10513231 10698301
59206A0698301J64049J41027J17059R1520O4099L5687O984k2573n3782q6187j18027
$$ 10698301 10862350 11003377 11120436 11211956 11276055 11311742 11318726 11296153 11242371 11156184 11038157
59195A1038157j47013j71119j89338k02209k11224k17483k21120k21783k19166
$$ 11038157 10891144 10720025 10530687 10328478 10117254 9899771 9678651 9456868 9237702
59186I237702k13259k04789j95258j85705j75427j62787j47376j30669j14330
$$ 9237702 9024443 8819654 8624396 8438691 8263264 8100477 7953101 7822432 7708102
59177G708102r8509q1960o3250m1857j8541N318K9176N3899Q0506J08901J38663
$$ 7708102 7609593 7527633 7464383 7422526 7403985 7409303 7438479 7492378 7572884 7681785 7820448
59166G820448J70464K05324K42718K80698L18028L54875L91158M25181M54033
$$ 7820448 7990912 8196236 8438954 8719652 9037680 9392555 9783713 10208894 10662927
59157A0662927M74289M82324M75358M52846M15929L65295L00770K23366J36533
$$ 10662927 11137216 11619540 12094898 12547744 12963673 13328968 13629738 13853104 13989637
59148A3989637M4701m8331j39018k23306k97309l58334m04839m36408m54430m61841
$$ 13989637 14034338 13986007 13846989 13623683 13326374 12968040 12563201 12126793 11672363 11210522
59138A1210522m61221m53657m39987m22188m02465l81725l59982l37715l15687
$$ 11210522 10749301 10295644 9855657 9433469 9031004 8649279 8289297 7951582 7635895
59129G635895k93760k71107k47661k24435k02307j81327j61419j42878j25830
$$ 7635895 7342135 7071028 6823367 6598932 6396625 6215298 6053879 5911001 5785171
59120E785171j09710r3827p8199o3439m9983l7871k7216j8322j0873l371N772
$$ 5785171 5675461 5581634 5503435 5439996 5390013 5352142 5324926 5306604 5295731 5292360 5298132
59109E298132J6451K6764L5178M2157M9218N6895O4510P1460P7730Q3191Q7424
$$ 5298132 5314583 5341347 5376525 5418682 5467900 5524795 5589305 5660765 5738495 5821686 5909110
59098E909110R0454R2799R4469R4453R1512Q5116P5596O3966N1628L9645K8012
$$ 5909110 5999564 6092363 6186832 6281285 6372797 6457913 6533509 6597475 6649103 6688748 6716760
59087F716760J5986L299r237k0339k9252l6232m2220m7652n1483n2074m9479m5744
$$ 6716760 6732746 6736045 6726808 6706469 6677217 6640985 6598765 6551113 6499630 6447556 6398077 6352333
59075F352333m2164l7567l0645k2823j6530j1214l668P475J9967L1378M1996N3246
$$ 6352333 6310169 6272602 6241957 6219134 6202604 6191390 6187722 6195197 6215164 6246542 6288538 6341784
59063F341784O5181P7130Q9428J02881J17282J31756J45942J59896J73564J87254
$$ 6341784 6406965 6484095 6573523 6676404 6793686 6925442 7071384 7231280 7404844 7592098
59053G592098K01596K16176K29101K39074K47084K54946K62865K69471K73538
$$ 7592098 7793694 8009870 8238971 8478045 8725129 8980075 9242940 9512411 9785949
59044I785949K74494K71910K65606K55738K41747K21671J93598J57276J13518
$$ 9785949 10060443 10332353 10597959 10853697 11095444 11317115 11510713 11667989 11781507
59035A1781507O2835O006n4559j15429j73849k27783k74870l13025l42086l63488
$$ 11781507 11844342 11850348 11795789 11680360 11506511 11278728 11003858 10690833 10348747 9985259
59025I985259l78183l86029l87366l83899l77432l68464l56464l41222l23751
$$ 9985259 9607076 9221047 8833681 8449782 8072350 7703886 7347422 7006200 6682449
59016F682449l06002k89387k73491k56917k39771k24100k11055j99008j86025
$$ 6682449 6376447 6087060 5813569 5556652 5316881 5092781 4881726 4682718 4496693
59007D496693j72879j61389j50671j38037j23687j11312j03048r6553q8870q0744
$$ 4496693 4323814 4162425 4011754 3873717 3750030 3638718 3535670 3439117 3350247 3269503
58997C269503p4674p0414o5437n9225n4083n1429m9786m7275m4055m1057l7998
$$ 3269503 3194829 3124415 3058978 2999753 2945670 2894241 2844455 2797180 2753125 2712068 2674070
58986B674070l4198l0285k7395k5196k2217j7977j3378r087m922j116J343K299
$$ 2674070 2639872 2609587 2582192 2556996 2534779 2516802 2503424 2494337 2489415 2488299 2489642 2491941
58974B491941L055M369N004L694J785K206N817J0337J3215J4274J4918J5876J6675
$$ 2491941 2494996 2499365 2504369 2508063 2509848 2512054 2517871 2528208 2541423 2555697 2570615 2586491 2603166
58961B603166J6624J5388J2861R288N582K922J863J915J952J113n72k375l661
$$ 2603166 2619790 2635178 2648039 2657327 2662909 2665831 2667694 2669609 2671561 2672674 2672102 2669727 2666066
58948B666066m201l722j853R06K940L114K054O49j851o533j1972j5059j5074j4784
$$ 2666066 2661865 2658143 2656290 2657196 2660136 2663250 2665304 2665953 2664102 2657569 2645597 2630538 2615464 2600680
58934B600680j6494j9104k0360k0048j9049j6903j2621p159k807m22R26J967K831
$$ 2600680 2584186 2565082 2544722 2524674 2505625 2488722 2476101 2468942 2466135 2465713 2466639 2468606 2471437
58921B471437M322P415J1289J3774J4311J4781J6860K0076K3140K5766K8313L0849
$$ 2471437 2475759 2483174 2494463 2508237 2522548 2537329 2554189 2574265 2597405 2623171 2651484 2682333
58909B682333L3497L6634L9873M1809M1820M1378M2463M5129M7575M8465M8294
$$ 2682333 2715830 2752464 2792337 2834146 2875966 2917344 2959807 3004936 3052511 3100976 3149270
58898C149270M8596N0401N3518N6796N9160O0636O2326O5174O8974P2901P6675
$$ 3149270 3197866 3248267 3301785 3358581 3417741 3478377 3540703 3605877 3674851 3747752 3824427
58887C824427Q0774Q5517R0451R4924R9154J04385J11702J20829J30414J39530
$$ 3824427 3905201 3990718 4081169 4176093 4275247 4379632 4491334 4612163 4742577 4882107
58877D882107J48332J57262J66425J76202J87535K00578K13837K25815K37192
$$ 4882107 5030439 5187701 5354126 5530328 5717863 5918441 6132278 6358093 6595285
58868F595285K50079K65385K82362L00571L20638L42725L66086L90885M18785
$$ 6595285 6845364 7110749 7393111 7693682 8014320 8357045 8723131 9114016 9532801
58859I532801M50534M84405N18545N53823N92584O35088O78952P22013P64003
$$ 9532801 9983335 10467740 10986285 11540108 12132692 12767780 13446732 14168745 14932748
58850A4932748Q05020Q43486Q76153Q99351R09809R04872Q82317Q39770P74676
$$ 14932748 15737768 16581254 17457407 18356758 19266567 20171439 21053756 21893526 22668202
58841B2668202O85714N74400M44707L01344J49332m935j53898k91099m12774n17048
$$ 22668202 23353916 23928316 24373023 24674367 24823699 24818764 24664866 24373767 23960993 23443945
58831B3443945o02757o69896p20243p56241p79382p90304p90036p80336p63258
$$ 23443945 22841188 22171292 21451049 20694808 19915426 19125122 18335086 17554750 16791492
58822A6791492p41069p15989o88963o59206o26248n92108n59955n30555n01794
$$ 16791492 16050423 15334434 14645471 13986265 13360017 12767909 12207954 11677399 11175605
58813A1175605m72046m42292m14037l86908l59957l34079l11188k91333k72575
$$ 11175605 10703559 10261267 9847230 9460322 9100365 8766286 8455098 8163765 7891190
58804G891190k53790k35941k20076k05534j90980j76318j62475j49821j37663
$$ 7891190 7637400 7401459 7181383 6975849 6784869 6608551 6446076 6296255 6158592
58795F158592j25271j12758j00738q9442p8434o7214n5822m4644l3692k2623j1510
$$ 6158592 6033321 5920563 5819825 5730383 5651949 5584735 5528913 5484269 5450577 5427954 5416444
58784E416444q86R335K0165L2148M4352N5658O6377P7542Q9201J00776J12618
$$ 5416444 5415558 5424893 5445058 5477206 5521558 5577216 5643593 5721135 5810336 5911112 6023730
58773F023730J25500J38727J50674J61587J73860J88819K04925K20303K35412
$$ 6023730 6149230 6287957 6438631 6600218 6774078 6962897 7167822 7388125 7623537
58764G623537K51757K69401K87479L06387L27598L51593L77661M05659M36447
$$ 7623537 7875294 8144695 8432174 8738561 9066159 9417752 9795413 10201072 10637519
58755A0637519M70381N06524N43874N82506O23093O65691P09126P51236P89595
$$ 10637519 11107900 11614424 12158298 12740804 13363897 14029588 14738714 15489950 16279545
58746A6279545Q22126Q46738Q60319Q58803Q38775P98440P36636O52019N44518
$$ 16279545 17101671 17948409 18808728 19667531 20506306 21304746 22041382 22693401 23237919
58737B3237919M17248K75964J26980k3563j69274l04329m25026n29625o16716
$$ 23237919 23655167 23931131 24058111 24034548 23865274 23560945 23135919 22606294 21989578
58728B1989578o85071p35303p70162p92521q03763q04572p96298p80905p60113
$$ 21989578 21304507 20569204 19799042 19006521 18202758 17398186 16601888 15820983 15060870
58719A5060870p35144p06899o76062o43400o10064n77144n44976n13545m83552
$$ 15060870 14325726 13618827 12942765 12299365 11689301 11112157 10567181 10053636 9570084
58710I570084m56038m30707m05710l79834l54159l30800l10427k91830k73518
$$ 9570084 9114046 8683339 8277629 7897795 7543636 7212836 6902409 6610579 6337061
58701F337061k55030k36822k19632k03958j89715j76207j62706j49126j36028
$$ 6337061 6082031 5845209 5625577 5421619 5231904 5055697 4892991 4743865 4607837
58692D607837j23958j12906j02365r1905q1704p2423o4397n7117m9852m2589l5878
$$ 4607837 4483879 4370973 4268608 4176703 4094999 4022576 3958179 3901062 3851210 3808621 3772743
58681C772743k9823k4102j9268j7184j9310k4683l0488l4723l7823m1375m5720
$$ 3772743 3742920 3718818 3699550 3682366 3663056 3638373 3607885 3573162 3535339 3493964 3448244
58670C448244m9447n1148n1133n1019n1930n3598n5247n6734n8343n9835o0409
$$ 3448244 3398797 3347649 3296516 3245497 3193567 3139969 3084722 3027988 2969645 2909810 2849401
58659B849401n9850n9231n9930o1953o3578o3061o0481n7542n5498n3825n1321
$$ 2849401 2789551 2730320 2670390 2608437 2544859 2481798 2421317 2363775 2308277 2254452 2203131
58648B203131m7967m4991m3187m2038m0591l8507l6017l3531l1559l0512l0186
$$ 2203131 2155164 2110173 2066986 2024948 1984357 1945850 1909833 1876302 1844743 1814231 1784045
58637A784045k9904k9395k8895k8231k6662k4211k2266k1882k2130k1022j7907
$$ 1784045 1754141 1724746 1695851 1667620 1640958 1616747 1594481 1572599 1550469 1529447 1511540
58626A511540j3993j0735q520o902n229k953p3K446L305K203K40j165j470j015
$$ 1511540 1497547 1486812 1478292 1471390 1466161 1463208 1463135 1465581 1468886 1471089 1471329 1470164 1468694 1467679
58612A467679j91J083L121N829Q432R992J0179R379Q167O975O148N721N097L542
$$ 1467679 1467488 1468571 1471692 1477521 1485953 1495945 1506124 1515503 1523670 1530645 1536793 1542514 1547611 1551153
58598A551153J155j144k701l615m140m344m437m535l967j952Q52K836L886N786
$$ 1551153 1552308 1551164 1548463 1544848 1540708 1536364 1531927 1527392 1523425 1521473 1522325 1525161 1529047 1534833
58584A534833R298J2591J3977J4780J7533K2291K6780K9672L1723L3939L6594
$$ 1534833 1544131 1556722 1570699 1585479 1603012 1625303 1652083 1681755 1713478 1747417 1784011
58573A784011M0064M4676M9437N2628N4329N6773O1554O7730P3482P8565Q4276
$$ 1784011 1824075 1868751 1918188 1970816 2025145 2081918 2143472 2211202 2284684 2363249 2447525
58562B447525R1741J01006J11352J21976J32663J44004J56642J70392J84549J98925
$$ 2447525 2539266 2640272 2751624 2873600 3006263 3150267 3306909 3477301 3661850 3860775
58552C860775K13734K28438K41549K51765K58629K61733K59710K50231K30982
$$ 3860775 4074509 4302947 4544496 4796261 5054890 5316623 5576333 5826564 6057546
58543F057546K01186J62731J19261P3523K6151k2148o8194j07800j39192j63376
$$ 6057546 6258732 6421463 6540724 6614247 6640398 6618250 6550056 6442256 6303064 6139688
58533F139688j81385j93105j99050k01264k01444j99498j94815j87960j80160
$$ 6139688 5958303 5765198 5566148 5364884 5163440 4963942 4769127 4581167 4401007
58524D401007j71894j62743j52150j39972j26864j14307j03366r3284q2292p0181
$$ 4401007 4229113 4066370 3914220 3774248 3647384 3533077 3429711 3336427 3254135 3183954
58514C183954n8946n0302m3645l7262l0574k4118j8008j1678n125N49M137N455
$$ 3183954 3125008 3074706 3031061 2993799 2963225 2939107 2921099 2909421 2904296 2904845 2908982 2914437
58502B914437N117L162j721j0983k3975l7608m8808n6890o2786o6765o8180o7210
$$ 2914437 2919554 2922716 2920995 2910012 2886037 2848429 2799621 2742731 2679945 2613180 2545000 2477790
58490B477790o5278o3445o1588n9632n8340n8178n8109n6447n2812m8744m6263
$$ 2477790 2412512 2349067 2287479 2227847 2169507 2111329 2053220 1996773 1943961 1895217 1848954
58479A848954m5777m5530m3528l9898l6501l4098l1363k7532k4357k3642k4065
$$ 1848954 1803177 1757647 1714119 1674221 1637720 1603622 1572259 1544727 1520370 1496728 1472663
58468A472663k2688j9143j5961j4870j5004j5034j4871j4523j3312j1207r551
$$ 1472663 1449975 1430832 1414871 1400001 1384997 1369963 1355092 1340569 1327257 1316050 1306499
58457A306499r327r756r395p865n980m767m562m479l070l21J691J471O63K026
$$ 1306499 1297172 1287416 1278021 1270156 1264176 1259409 1254847 1250368 1247298 1246977 1248668 1250139 1250802 1252828
58443A252828N541Q825J0999J3403J6303J7990J7967J8327K0633K3821K6450K8808
$$ 1252828 1258369 1267194 1278193 1291596 1307899 1325889 1343856 1362183 1382816 1406637 1433087 1461895
58431A461895L1325L3035L3102L2051K9991K5674J8997J2454Q043M418q08p356
$$ 1461895 1493220 1526255 1559357 1591408 1621399 1647073 1666070 1678524 1686567 1690985 1690177 1682821
58419A682821j3072j7327k1309k5543k9087l1044l1428l0862l0314l0544l0997
$$ 1682821 1669749 1652422 1631113 1605570 1576483 1545439 1514011 1483149 1452835 1422291 1391294
58408A391294l0124k7614k5108k3846k3021k1566j9970j8908j7580j5160j2562
$$ 1391294 1361170 1333556 1308448 1284602 1261581 1240015 1220045 1201137 1183557 1168397 1155835
58397A155835j0953r592o996l357j26J980L037L036K615L511O436R385J0010Q868
$$ 1155835 1144882 1135290 1128294 1124937 1124811 1126791 1129828 1132864 1135479 1138990 1145426 1154811 1164821 1173689
58383A173689Q452R800J2077J4721J7801K0622K2284K3387K5214K7228K7326K4700
$$ 1173689 1182141 1191941 1204018 1218739 1236540 1257162 1279446 1302833 1328047 1355275 1382601 1407301
58371A407301K0617J6274J1489N938K85m376p356q609q981r854j1610j2869j2324
$$ 1407301 1427918 1444192 1455681 1461619 1461904 1457528 1450172 1441563 1432582 1422728 1411118 1398249 1385925
58358A385925j0744r801r509q375n913l358j711m16J760N296R493J2868J4212
$$ 1385925 1375181 1365380 1355871 1347496 1341583 1338225 1336514 1336098 1337858 1343154 1352647 1365515 1379727
58345A379727J3882J3527J3909J3788J1832Q640N640K895m27m015o528p506p751
$$ 1379727 1393609 1407136 1421045 1434833 1446665 1455305 1460945 1463840 1463413 1459398 1452870 1445364 1437613
58332A437613p905p838p371o538n291l789k705k408k224j369l9J157K178L028
$$ 1437613 1429708 1421870 1414499 1407961 1402670 1398881 1396176 1393768 1391544 1390175 1390136 1391293 1393471 1396499
58318A396499L030J784K03m52j35L44P19J392K655M452O367P527P467P417R252
$$ 1396499 1399529 1401313 1401516 1401064 1400929 1401273 1401992 1403384 1406039 1410491 1416858 1424385 1431852 1439269 1448521
58303A448521J2592J4644J3849J1997J1516J2569J4177J6332J9153K1443K2095
$$ 1448521 1461113 1475757 1489606 1501603 1513119 1525688 1539865 1556197 1575350 1596793 1618888
58292A618888K1750K1561K1555K1556K2029K2397K0475J5473R743N548K072k074
$$ 1618888 1640638 1662199 1683754 1705310 1727339 1749736 1770211 1785684 1795427 1800975 1803047 1800973
58280A800973n422n593l062k44J933L880N249N716O492Q398R936J0001J0689J4206
$$ 1800973 1795551 1789958 1786896 1786652 1788585 1792465 1797714 1803430 1809922 1818320 1828256 1838257 1848946 1863152
58266A863152J8742K1036K1521K2963K5329K6383K6463K8047L0945L2473L2518
$$ 1863152 1881894 1902930 1924451 1947414 1972743 1999126 2025589 2053636 2084581 2117054 2149572
58255B149572L3802L6629L7868L6254L4357L3726L2082K7467K1840J8165J6426
$$ 2149572 2183374 2220003 2257871 2294125 2328482 2362208 2394290 2421757 2443597 2461762 2478188
58244B478188J4867J3276J2839J3967J5927J8021J9999K1759K3222K4292K5084
$$ 2478188 2493055 2506331 2519170 2533137 2549064 2567085 2587084 2608843 2632065 2656357 2681441
58233B681441K6364K8944L2180L4465L5973L8920M3835M8011M9640N0971N4738
$$ 2681441 2707805 2736749 2768929 2803394 2839367 2878287 2922122 2970133 3019773 3070744 3125482
58222C125482N9877O4007O7807P3327P9967Q5964R2112R9910J07613J12335J14613
$$ 3125482 3185359 3249366 3317173 3390500 3470467 3556431 3648543 3748453 3856066 3968401 4083014
58211D083014J16574J17112J13501J06633R9914R4116Q8052Q3224Q2624Q5788
$$ 4083014 4199588 4316700 4430201 4536834 4636748 4730864 4818916 4902140 4984764 5070552
58201E070552Q9952R5383J04306J15492J25424J34235J45038J57798J69586J80377
$$ 5070552 5160504 5255887 5360193 5475685 5601109 5735344 5880382 6038180 6207766 6388143
58191F388143J92984K07531K21733K36130K53202K71955K89541L07520L29831
$$ 6388143 6581127 6788658 7010391 7246521 7499723 7771678 8061219 8368739 8698570
58182H698570L55291L79230M01981M28190M58075M87570N17249N52517N94141
$$ 8698570 9053861 9433091 9835072 10263262 10721337 11208907 11726156 12278673 12872814
58173A2872814O36961O79056P23791P71676Q18844Q65073R15098R70870J030930
$$ 12872814 13509775 14188831 14912622 15684298 16503142 17368215 18283313 19254183 20285113
58164B0285113J097767J175934J262057J346936J428924J514893J607261J702273
$$ 20285113 21382880 22558814 23820871 25167807 26596731 28111624 29718885 31421158
58156C1421158J802749J919458K056346K206504K365756K537687K722421K914399
$$ 31421158 33223907 35143365 37199711 39406215 41771971 44309658 47032079 49946478
58148D9946478L115364L336794L587018L870392M201233M602096N085918N657392
$$ 49946478 53061842 56398636 59985654 63856046 68057279 72659375 77745293 83402685
58140H3402685O333391P142496Q105122R240215J0595462J2247427J4272205J6736564
$$ 83402685 89736076 96878572 104983694 114223909 124819371 137066798 151339003 168075567
58132A68075567J9693472K3137518K6995717L1229934L5830482M0370286M3372022
$$ 168075567 187769039 210906557 237902274 269132208 304962690 345332976 388704998
58125C88704998M2420301L5528074K2832245O978971q305723k0196773k7704171
$$ 388704998 431125299 466653373 489485618 496464589 488158866 467962093 440257922
58118D40257922l1259085l1849530l0500163k8119837k5427541k2887160k0724922
$$ 440257922 408998837 377149307 346649144 318529307 293101766 270214606 249489684
58111B49489684j9002581j7671834j6618808j5723969j4897154j4062237j3146190
$$ 249489684 230487103 212815269 196196461 180472492 165575338 151513101 138366911
58104A38366911j2111242j0980328r808748q641945p512309o454278n496257m644287
$$ 138366911 126255669 115275341 105466593 96824648 89312339 82858061 77361804 72717517
58096G2717517l889353l222307k628044k076178j535592r93139m43082J39312
$$ 72717517 68828164 65605857 62977813 60901635 59366043 58372904 57929822 58069134
58088E8069134Q01244J585980K491722L419318M130338M287697L625390K156868
$$ 58069134 58870378 60456358 62948080 66367398 70497736 74785433 78410823 80567691
58080H0567691K35689j619556l008547l815954m161527m232365m161323m014377
$$ 80567691 80803380 79183824 76175277 72359323 68197796 63965431 59804108 55789731
58072E5789731l829450l635959l448522l264969l077287k880851k676327k470521
$$ 55789731 51960281 48324322 44875800 41610831 38533544 35652693 32976366 30505845
58064C0505845k274602k094882j925934j758578j593039j437698j296612j166742
$$ 30505845 28231243 26136361 24210427 22451849 20858810 19421112 18124500 16957758
58056A6957758j047659r45084q62244p94604p35856o83123o33917n84371n33994
$$ 16957758 15910099 14965015 14102771 13308167 12572311 11889188 11255271 10670900 10136906
58047A0136906m87361m47712m13055l80939l52610l29546l10151k92942k79389
$$ 10136906 9649545 9201833 8788778 8407839 8055229 7725683 7415532 7122590 6843201
58038F843201k70571k63905k55623k44111k29497k13173j98906j90640j87414
$$ 6843201 6572630 6308725 6053102 5808991 5579494 5366321 5167415 4976775 4789361
58029D789361j83876j77158j69526j63170j56864j49743j43674j39206j33327
$$ 4789361 4605485 4428327 4258801 4095631 3938767 3789024 3645350 3506144 3372817
58020C372817j24318j15216j09347j05710j01641r6932r2398q7403q1831p7749
$$ 3372817 3248499 3133283 3023936 2918226 2816585 2719653 2627255 2539852 2458021 2380272
58010B380272p6094p4254o9783o4075n9623n6080n1928m7671m4406m1290l7376
$$ 2380272 2304178 2229924 2160141 2096066 2036443 1980363 1928435 1880764 1836358 1795068 1757692
57999A757692l4194l3739l5397l7152l8084l7603l4466k9073k4744k3953k4981
$$ 1757692 1723498 1689759 1654362 1617210 1579126 1541523 1507057 1477984 1453240 1429287 1404306
57988A404306k4712k2929k1329k0200j8813j7623j7295j6868j5365j3829j3393
$$ 1404306 1379594 1356665 1335336 1315136 1296323 1278700 1261405 1244537 1229172 1215343 1201950
57977A201950j2801j0460p535o192n989m901l118k927n156q161j0119j0487r582
$$ 1201950 1189149 1178689 1171154 1164962 1158973 1154072 1150954 1148027 1142871 1134710 1124591 1114104 1104522
57964A104522q311p788p792o681m018j804j418j214P29L247M061L530L523L892
$$ 1104522 1096211 1088423 1080631 1073950 1069932 1068128 1066710 1065496 1066225 1069472 1073533 1077063 1080586 1084478
57950A084478L117J615J215J824J768J212K087M502O140N767M764M545M810M921
$$ 1084478 1087595 1089210 1090425 1092249 1094017 1095229 1097316 1101818 1107958 1113725 1118489 1123034 1127844 1132765
57936A132765M784L720O00m045p944r959j1346j3290j4999j5289j4556j3887j3352
$$ 1132765 1137549 1141269 1141869 1137824 1129880 1119921 1108575 1095285 1080286 1064997 1050441 1036554 1023202
57923A023202j2475j1536j1179j1072j0063p665m739k664k082k402k415j394L94
$$ 1023202 1010727 999191 988012 976940 966877 959212 954473 951809 949727 947325 944910 943516 943910
57910I43910K245L664M351M107L273K895L725N345O739P410P478P042O133N023
$$ 943910 946155 949819 954170 958277 961550 964445 968170 973515 980254 987664 995142 1002184 1008317 1013340
57896A013340L845K048j044n142q970j1423j2507j3009j3435j3374j2075r678
$$ 1013340 1017185 1019233 1018189 1013047 1004077 992654 980147 967138 953703 940329 928254 918576
57884I18576p384n836m002o97L198N481N657N599O770Q367Q986Q578P741O253
$$ 918576 911192 905356 901354 900657 903855 909336 914993 920592 927362 935729 944715 953293 961034 967287
57870I67287L527l36m892r955j4954j8583k0110k0256j9987j9294j8052j7005
$$ 967287 970814 970478 965586 955631 940677 922094 901984 881728 861741 842447 824395 807390
57858H07390j6737j6517j5403j3790j2723j2238j1584j0514r320p989o399m876
$$ 807390 790653 774136 758733 744943 732220 719982 708398 697884 688564 680575 674176 669300
57846F69300l691k394n51J339K432K567K089J299P79J460L523N891P499Q255Q220
$$ 669300 665609 663215 662664 664003 666435 669002 671091 672390 673169 674629 678152 684043 691542 699797 708017
57831G08017P023N073M039M798N954N719M269K771J244q42k661k840j912k049
$$ 708017 715040 720113 724152 728950 734904 740623 744892 747663 748907 748065 745404 742564 740652 738603
57817G38603m225p101q886r040q115o980o459o719o996o450n099l398j438O73
$$ 738603 734378 727277 718391 709351 701236 694256 687797 681078 674082 667632 662533 659135 657697 658370
57803F58370K303L034L371L947M677N396O396P476P585O570O022O935P774O603
$$ 658370 660673 663707 667078 671025 675702 681098 687494 694970 702555 709125 715147 722082 729856 736459
57789G36459M094K345J572L18j571k540j998j261j514k542l762m930n608n442
$$ 736459 740553 742898 744470 744788 743217 740677 738679 737418 735904 733362 729600 724670 719062 713620
57775G13620n116n694o907p476p075o408n574m066k453k157l180l937l875m464
$$ 713620 708504 702810 695903 688427 681352 674944 669370 665304 662851 660694 657514 653577 649702 645238
57761F45238o786r646j1067j0516q840p122o388p357r532j1220j1307j0527j0285
$$ 645238 638452 628806 617739 607223 598383 591261 584873 577516 567984 556764 545457 534930 524645
57748E24645j0683j0386q263m747j523J05L74K83m5j272k879k830k38K942M317
$$ 524645 513962 503576 495313 490566 489043 489148 489522 489805 489760 488488 485609 482779 482541 485483 489800
57733D89800M186M588O162P880R342J1054J2636J2955J2269J2210J3175J3703
$$ 489800 493986 498574 504736 512616 521958 533012 545648 558603 570872 583082 596257 609960
57721F09960J2992J2241J2569J3067J1947Q738M682J528J54l20j903n331q775
$$ 609960 622952 635193 647762 660829 672776 681514 686196 687724 687878 687558 685655 680324 671549
57708F71549j0097r724r682j0372j0515r939r872j0189q975n759k773j930k461
$$ 671549 661452 651728 642046 631674 621159 611220 601348 591159 582184 576425 573652 571722 569261
57695E69261k733k520k298j937j441j418j634o39J837L620K817O07k73J101L378
$$ 569261 566528 564008 561710 559773 558332 556914 555280 554641 556478 560098 562915 563522 563249 564350 567728
57680E67728N010N417M757L928M294O303Q690R908R810R215Q541P803P413P921
$$ 567728 572738 578155 582912 586840 591134 597437 606127 616035 625845 635060 643601 651404 658817 666738
57666F66738R210J0619J1683J2315J2749J3582J5347J7806K0073K1638K2629K3257
$$ 666738 675948 686567 698250 710565 723314 736896 752243 770049 790122 811760 834389 857646
57654H57646K3766K4683K6039K6720K5959K5068K5912K8060K9655L0988L4409
$$ 857646 881412 906095 932134 958854 984813 1009881 1035793 1063853 1093508 1124496 1158905
57643A158905M0099M4995M7184M8648N1848N6060N9204O1199O3116O4659O5060
$$ 1158905 1199004 1243999 1291183 1339831 1391679 1447739 1506943 1568142 1631258 1695917 1760977
57632A760977O5266O6861O9791P3332P8273Q5829R5179J04517J14077J25864J40476
$$ 1760977 1826243 1893104 1962895 2036227 2114500 2200329 2295508 2400025 2514102 2639966 2780442
57621B780442J56288J71856J87175K02394K16718K28864K37483K41224K39246
$$ 2780442 2936730 3108586 3295761 3498155 3714873 3943737 4181220 4422444 4661690
57612D661690K31419K17348J96304J69356J40364J12769Q5707N4853J6726k8918
$$ 4661690 4893109 5110457 5306761 5476117 5616481 5729250 5814957 5869810 5886536 5857618
57602E857618p9576j30388j74467k05658k22172k26743k23621k16488k08292k00457
$$ 5857618 5778042 5647654 5473187 5267529 5045357 4818614 4594993 4378505 4170213 3969756
57592C969756j91854j80486j66640j52938j41056j29961j17905j04781r2020q1044
$$ 3969756 3777902 3597416 3430776 3277838 3136782 3006821 2888916 2784135 2692115 2611071
57582B611071p2097o3787n4021m2352l1051k2580j6454j0146k665M756J1513J8888
$$ 2611071 2538974 2475187 2421166 2378814 2347763 2325183 2308729 2298583 2295918 2300674 2312187 2331075
57570B331075K7760L6950M4981N2163N9943O9023P9076Q9709J00898J12662J24802
$$ 2331075 2358835 2395785 2440766 2492929 2552872 2621895 2700971 2790680 2891578 3004240 3129042
57559C129042J36894J48609J59923J70352J77706J78696J71727J58164J39774
$$ 3129042 3265936 3414545 3574468 3744820 3922526 4101222 4272949 4431113 4570887
57550D570887J16092Q5937N0541J3165k3867n9607r2304j19279j39319j53333
$$ 4570887 4686979 4772916 4823457 4836622 4812755 4753148 4660844 4541565 4402246 4248913
57540D248913j62354j66761j67703j67241j66343j64210j60171j54717j48447
$$ 4248913 4086559 3919798 3752095 3584854 3418511 3254301 3094130 2939413 2790966
57531B790966j41502j34335j27546j20692j12983j05137r8516r2371q4467p5031
$$ 2790966 2649464 2515129 2387583 2266891 2153908 2048771 1950255 1857884 1773417 1698386
57521A698386o7280o2873n9494n4594m9068m5014m1959l7898l2896k8968k6970
$$ 1698386 1631106 1568233 1508739 1454145 1405077 1360063 1318104 1280206 1247310 1218342 1191372
57510A191372k5853k4660k3359k1813j9589j6876j4270j1754q971o312m486l216
$$ 1191372 1165519 1140859 1117500 1095687 1076098 1059222 1044952 1033198 1024227 1017915 1013429 1010213
57498A010213j573M79K014K716L508N359Q201J1203J3612J5173J6241J7498J9340
$$ 1010213 1008640 1009119 1011133 1013849 1017357 1022716 1030917 1042120 1055732 1070905 1087146 1104644 1123984
57485A123984K1430K3170K4452K5814K7861L0604L3320L5298L7132M0735M7208
$$ 1123984 1145414 1168584 1193036 1218850 1246711 1277315 1310635 1345933 1383065 1423800 1471008
57474A471008N4918O0830O4001O6662P1473P8754Q6918R4647J01929J09501J17907
$$ 1471008 1525926 1586756 1650757 1717419 1788892 1867646 1954564 2049211 2151140 2260641 2378548
57463B378548J26657J34155J38932J40831J40124J35651J25236J08203Q6172O1036
$$ 2378548 2505205 2639360 2778292 2919123 3059247 3194898 3320134 3428337 3514509 3575545
57453C575545L3664N156k2198m6398o7039q4284r7574j06438j11611j14353j15271
$$ 3575545 3609209 3614365 3592167 3545769 3478730 3394446 3296872 3190434 3078823 2964470 2849199
57442B849199j14516j12295j08556j03079r6531r0463q5544q0907p5719p0153
$$ 2849199 2734683 2622388 2513832 2410753 2314222 2223759 2138215 2057308 1981589 1911436
57432A911436o4238n7392m9960m3495l8321l2653k5537j8819j4200j0164m317
$$ 1911436 1847198 1789806 1739846 1696351 1658030 1625377 1599840 1581021 1566821 1556657 1552340
57421A552340K526P413R776J2058J5919K0385K4123K7400L1236L6306M3069N1376
$$ 1552340 1554866 1562279 1572055 1584113 1600032 1620417 1644540 1671940 1703176 1739482 1782551 1833927
57409A833927N9735O6512P2213P9022Q7852R7393J06250J14202J20816J24632
$$ 1833927 1893662 1960174 2032387 2111409 2199261 2296654 2402904 2517106 2637922 2762554
57399B762554J24760J21848J16253J06310Q9707O6133L7798P761k1579m8886p3538
$$ 2762554 2887314 3009162 3125415 3231725 3321432 3387565 3425363 3433124 3411545 3362659 3289121
57388C289121r4902j11943j23921j31336j35518j37145j36055j32558j27917j23036
$$ 3289121 3194219 3082276 2958355 2827019 2691501 2554356 2418301 2285743 2157826 2034790
57378B034790j17627j11432j05413j00728r6843r1782q4484p6178o9125o4365
$$ 2034790 1917163 1805731 1700318 1599590 1502747 1410965 1326481 1250303 1181178 1116813
57368A116813o1056n7713n3566m8737m3753l9315l6105l4188l2756l0989k8921
$$ 1116813 1055757 998044 944478 895741 851988 812673 776568 742380 709624 678635 649714
57357F49714k6918k4741k2095j9859j9373k0286k0486j8640j5646j3043j1237
$$ 649714 622796 598055 575960 556101 536728 516442 495956 477316 461670 448627 437390
57346D37390r962r205q766q030p112p101q211q909p999o394n444m799l454j902
$$ 437390 427428 418223 409457 401427 394315 387214 379003 370094 362095 355701 350257 345458 342004 340102
57332C40102j418j994k713l523m805n798n420m282m014m818n517n775o379p275
$$ 340102 338684 336690 333977 330454 325649 319851 314431 310149 306135 301317 295800 290025 283646 276371
57318B76371p358o430n646n615n712n476n289n276n016m644m797n176m556k657
$$ 276371 269013 262583 256937 251322 245610 240134 234845 229569 224553 219909 215112 209936 205380 202723
57304B02723o90K94L43k64j403k298j829j49J282J697J788K193K596K756L043
$$ 202723 202033 202327 202670 202406 201003 198705 196876 196727 198009 199706 201494 203687 206283 209039 212082
57289B12082L391L073K083J469J686J868J382R62J532K999M769O420P399P224
$$ 212082 215473 218546 220629 222098 223784 225652 227034 227996 229528 232527 237296 243716 251115 258339
57275B58339O499O601P750Q669Q819R583J2233J5891J8687K0096K0893K1476K1438
$$ 258339 264838 271439 279189 287858 296677 306260 318493 334384 353071 373167 394060 415536 436974
57262D36974K0585J9301J7850J5917J3106R721O954N981O661P587P913Q505J0345
$$ 436974 457559 476860 494710 510627 523733 533454 540408 546389 553050 560637 568550 577055 587400
57249E87400J2523J3284J2714J2674J3966J5235J5127J4071J3327J3491J4419
$$ 587400 599923 613207 625921 638595 652561 667796 682923 696994 710321 723812 738231
57238G38231J5633J6391J6259J5875J6131J6721J6689J6310J6925J8862K1205
$$ 738231 753864 770255 786514 802389 818520 835241 851930 868240 885165 904027 925232
57227I25232K3598K6532K9592L1506L2329L3521L5337L6292L5951L5899L6903
$$ 925232 948830 975362 1004954 1036460 1068789 1102310 1137647 1173939 1209890 1245789 1282692
57216A282692L7507L6820L6249L6582L5579L0808K3237J5580Q494R92o376j1604
$$ 1282692 1320199 1357019 1393268 1429850 1465429 1496237 1519474 1535054 1543548 1544540 1538164 1526560
57204A526560j4248j5940j7848j9621k1006k2516k4095k4739k4000k2636k1145
$$ 1526560 1512312 1496372 1478524 1458903 1437897 1415381 1391286 1366547 1342547 1319911 1298766
57193A298766j8837j5020j0385o489m181l039k275j744j855k583l053k383o87
$$ 1298766 1279929 1264909 1254524 1248035 1243854 1240815 1238540 1236796 1234941 1232358 1229305 1226922 1226235
57180A226235J316L352N660Q167J0382J1990J2906J3056J2859J3308J4572J5164
$$ 1226235 1227551 1230903 1236563 1244730 1255112 1267102 1280008 1293064 1305923 1319231 1333803 1348967
57168A348967J3867J1747J0632J0312R476Q739R922J2291J2861J1078J0106J2033
$$ 1348967 1362834 1374581 1385213 1395525 1405001 1413740 1423662 1435953 1448814 1459892 1469998 1482031
57156A482031J4796J5822J6116J8205K1967K5077K6419K6670K6338K5399K4456
$$ 1482031 1496827 1512649 1528765 1546970 1568937 1594014 1620433 1647103 1673441 1698840 1723296
57145A723296K4478K5535K6913K8207K9415L0548L1822L3652L6027L8617M1723
$$ 1723296 1747774 1773309 1800222 1828429 1857844 1888392 1920214 1953866 1989893 2028510 2070233
57134B070233M5884N0506N4457N8128O2895O8225P1696P2514P2425P2239P0285
$$ 2070233 2116117 2166623 2221080 2279208 2342103 2410328 2482024 2554538 2626963 2699202 2769487
57123B769487O5847O1410N9375N8726N6944N3337M8574M3002L7340L3249L1141
$$ 2769487 2835334 2896744 2956119 3014845 3071789 3125126 3173700 3216702 3254042 3287291 3318432
57112C318432K9172K6174K3731K3583K4979K6492K8331L0669L1823L0500K8029
$$ 3318432 3347604 3373778 3397509 3421092 3446071 3472563 3500894 3531563 3563386 3593886 3621915
57101C621915K6207K4709K2801K1573K2076K3146K3387K3539K4668K6046K7002
$$ 3621915 3648122 3672831 3695632 3717205 3739281 3762427 3785814 3809353 3834021 3860067 3887069
57090C887069K8876L2683L7018M0527M4180M8658N1869N1511M7709M0905L0153
$$ 3887069 3915945 3948628 3985646 4026173 4070353 4119011 4170880 4222391 4270100 4311005 4341158
57079D341158J6166K632q757k1223l7321n3835o6311p5469q4563r3407r9876j04987
$$ 4341158 4357324 4359956 4351199 4329976 4292655 4238820 4172509 4097040 4012477 3919070 3819194 3714207
57067C714207j11662j20480j31010j45154j64912j89224k16989k50279k90449
$$ 3714207 3602545 3482065 3351055 3205901 3040989 2851765 2634776 2384497 2094048
57058B094048l34649l81000m33474D48338a21046o50185p42701q51121r73639
$$ 2094048 1759399 1378399 944925 448338 -121046 -771231 -1513932 -2365053 -3338692
57049c338692j107888j258033j429048j619097j825978k055452k313741k597760
$$ -3338692 -4446580 -5704613 -7133661 -8752758 -10578736 -12634188 -14947929 -17545689
57041a7545689k903987l241557l624960m060108m550836n110544n748342o449009
$$ -17545689 -20449676 -23691233 -27316193 -31376301 -35927137 -41037681 -46786023 -53235032
57033e3235032p186918p953778q745913r525998j0230011j0819116j1293443j1648356
$$ -53235032 -60421950 -68375728 -77121641 -86647639 -96877650 -107696766 -118990209 -130638565
57025a30638565j1868845j2013452j2277755j2900112j3940992j5112182j5793214
$$ -130638565 -142507410 -154520862 -166798617 -179698729 -193639721 -208751903 -224545117
57018b24545117j5239681j2891500q637280k888120L578750R880857J5230596
$$ -224545117 -239784798 -252676298 -261313578 -264201698 -260622948 -250742091 -235511495
57011b35511495J9040673K1005406K1166474J9881116J7667798J5030638J2368614
$$ -235511495 -216470822 -195465416 -174298942 -154417826 -136750028 -121719390 -109350776
57004a09350776R966790Q007946O580209N689825N275102N215387N352123N532128
$$ -109350776 -99383986 -91376040 -84795831 -79106006 -73830904 -68615517 -63263394 -57731266
56996e7731266N647007N640915N497063N227486M865495M450272M012744L575947
$$ -57731266 -52084259 -46443344 -40946281 -35718795 -30853300 -26403028 -22390284 -18814337
56988a8814337L160772K782578K445512K147098J885997J660516J464106J289290
$$ -18814337 -15653565 -12870987 -10425475 -8278377 -6392380 -4731864 -3267758 -1978468
56980a978468h44698A52886Q77539P69810O74999N94695N25621M62835M06603
$$ -1978468 -844698 152886 1030425 1800235 2475234 3069929 3595550 4058385 4464988
56971D464988L60561L24643K94924K69177K47734K29836K13537J98753J86594
$$ 4464988 4825549 5150192 5445116 5714293 5962027 6191863 6405400 6604153 6790747
56962F790747J76262J65739J54802J44503J34611J24221J13791J04040R3870Q1538
$$ 6790747 6967009 7132748 7287550 7432053 7566664 7690885 7804676 7908716 8002586 8084124
56952H084124O6623M9311K9811J0222n537j5981k3907l1841l8292m1100m1761
$$ 8084124 8150747 8200058 8229869 8240091 8234554 8218573 8194666 8162825 8124533 8083433 8041672
56941H041672m3427m6917n1355n6176n9590n7815m9015l5775k0764k723K0212
$$ 8041672 7998245 7951328 7899973 7843797 7784207 7726392 7677377 7641602 7620838 7618115 7638327
56930G638327M6014P0412Q8663R1243O2937m883j00863j98554k75770l26045l53290
$$ 7638327 7684341 7754753 7843416 7934659 7997596 7992713 7891850 7693296 7417526 7091481 6738191
56919F738191l62651l58291l44399l24390l00868k77349k57669k42862k30919
$$ 6738191 6375540 6017249 5672850 5348460 5047592 4770243 4512574 4269712 4038793
56910D038793k19851k08740j95969j79770j61217j43848j29401j16268j02956
$$ 4038793 3818942 3610202 3414233 3234463 3073246 2929398 2799997 2683729 2580773
56901B580773r0576q0813p3528o7520o2216n7898n5393n5875n9485o3897o5769
$$ 2580773 2490197 2409384 2335856 2268336 2206120 2148222 2092829 2036954 1977469 1913572 1847803
56890A847803o3921n9987n5907n2252m9004m6391m4520m3167m2143m1285m0291
$$ 1847803 1783882 1723895 1667988 1615736 1566732 1520341 1475821 1432654 1390511 1349226 1308935
56879A308935l9235l8472l7328l4087k8488k2944j9586j7293j3663r042o484q208
$$ 1308935 1269700 1231228 1193900 1159813 1131325 1108381 1088795 1071502 1057839 1048797 1042313 1034105
56867A034105j4005k2406l1486l9088m4194m7715n0331n0570m6976m1137l6031
$$ 1034105 1020100 997694 966208 927120 882926 835211 784880 734310 687334 646197 610166
56856F10166l2186k8012k3441k0344j9465j9493j9328j9020j8399j7001j5396
$$ 610166 577980 549968 526527 506183 486718 467225 447897 428877 410478 393477 378081
56845C78081j4505j3681j1692r228q121q272p935o882o450o371m629q95K721N098
$$ 378081 363576 349895 338203 328975 320854 312582 304647 297765 291315 284944 280315 279420 282141 287239
56831B87239P390J0100J1832J2221J3343J6436J9400J9402J6167J1183N449l12
$$ 287239 294629 304729 316561 328782 342125 358561 377961 397363 413530 424713 430162 429850
56819D29850m743p007p898q517q761q171p153o225n004k980l76K574O261J0791
$$ 429850 425107 418100 410202 401685 392924 384753 377600 371375 366371 363391 363015 365589 371850 382641
56805C82641J5496J9977K4722L0013L5267L9844M3184M3664L9060K9148J6566
$$ 382641 398137 418114 442836 472849 508116 547960 591144 634808 673868 703016 719582
56794G19582M312o300j4540j9142j9762j8108j6091j3820j0731p425m872k655
$$ 719582 723894 717594 703054 683912 664150 646042 629951 616131 605400 597975 593103 590448
56782E90448M00M630R775J6016K3255L0355L6667M3598N2495O1062O3739N6271
$$ 590448 590848 595478 605253 621269 644524 674879 711546 755144 807639 868701 932440 988711
56770I88711L9132J6631n965k4433l6626m2765m4485m3208l9608l4489k9307k5292
$$ 988711 1027843 1044474 1038509 1014076 977450 934685 890200 846992 807384 772895 743588 718296
56758G18296k2387j9462j5573j0846o063j408M084J1440K0254K8857L5792M0304
$$ 718296 695909 676447 660874 650028 643965 642557 646641 658081 678335 707192 742984 783288
56746G83288M1278L6945K6507J1559m746j9449l0328l6011l6773l4804l2445l0230
$$ 783288 824566 861511 888018 899577 894831 875382 845054 809043 772270 737466 705021 674791
56734F74791k7596k4946k3505k3143k1945j8613j4041r721n717j314L313P464
$$ 674791 647195 622249 598744 575601 553656 535043 521002 511281 505564 504250 507563 515027
56722E15027J1321J5355J8428J8184J3714O569j321r277j6699k1897k3612k2817
$$ 515027 526348 541703 560131 578315 592029 598598 597277 588000 571301 549404 525792 502975
56710E02975k1559k0614j9594j8495j7545j6229j4240j2901j3573j5075j4928
$$ 502975 481416 460802 441208 422713 405168 388939 374699 361798 348225 333150 318222
56699C18222j3115j1936j2024j1419r364p906q304q799p818o628o412n473k366
$$ 318222 305107 293171 281147 269728 260364 252458 244154 235355 227537 220909 214497 209024 206658
56686B06658M91m6k686l546k103j282j971j630R46L225K759M57j404k174k360
$$ 206658 207149 207103 204417 200871 198768 197486 195515 193885 194831 198056 200815 201272 199868 197694 195334
56671A95334k248k328l459n351o230n099l009j304j1J177J744J195m7j358k534
$$ 195334 193086 190758 187299 181948 175718 170619 167610 166306 166295 167472 169216 170411 170364 169006 166472
56656A66472l182k719j587j175j919k694k549j894j380j012q34j267k127k435
$$ 166472 163290 160571 158984 157809 155890 153196 150647 148753 147373 146361 145527 144260 142133 139698
56642A39698j796q21MO72Q15J12m34N31K245K486J030J37R33J875J816K008L376
$$ 139698 137902 137081 137085 137757 138572 138684 138250 138781 141026 143512 144542 144679 145612 147487 149303 151311 154687
56625A54687M292L174J308Q63J622J865J329J108J584K313L106L672L177J722
$$ 154687 158979 162153 163461 164324 165946 167811 169140 170248 171832 174145 177251 180923 184100 185822
56611A85822J065K304M076M682M533M557L855J432j041j117O09J424P33M05J027
$$ 185822 186887 189191 193267 197949 202482 207039 210894 212326 211285 210168 210777 212201 212934 213339 214366
56596B14366R50n25j855j989j892k291k099n01J172J155l24j683k142k049j778
$$ 214366 215316 214791 212936 210947 209055 206764 204665 204164 205336 206491 206167 204484 202342 200293 198515
56581A98515j346q63m65K0Q36J748K061J313O6k20J328L467L792J712m99n69Q59
$$ 198515 197169 196306 195841 195861 196697 198445 200506 201819 201885 201665 202993 206460 210252 211964 211465 210896 211755
56564B11755J457L98j228k485l258l101j462Q67K176K088J784J858J476K11q67
$$ 211755 213212 213610 212382 209897 206639 203538 202076 202943 205119 207207 208991 210849 212325 212536 211669
56549B11669o79M49J441J634Q50o66j970k032r38K83J077J630J807J293Q05J488
$$ 211669 210990 211439 212880 214514 215364 214698 212728 210696 209758 210041 211118 212748 214555 215848 216653 218141
56533B18141K848K930J212m74n98J95Q02J447K446K877K150J506K137K969K351
$$ 218141 220989 223919 225131 224657 224059 224254 225056 226503 228949 231826 233976 235482 237619 240588 242939
56518B42939J014J087K624L424K477J326J567K875M283N759P381Q264P586N965
$$ 242939 243953 245040 247664 251088 253565 254891 256458 259333 263616 269375 276756 285020 292606 298571
56504B98571M718M209L787L077K447K480L537N565P776Q882Q454P737Q172R183
$$ 298571 303289 307498 311285 314362 316809 319289 322826 328391 336167 345049 353503 361240 369412 378595
56490C78595Q586N546K115R42K154L526L434K520K179K435K055L62j816l031k651
$$ 378595 387181 392727 394842 395784 397938 401464 404898 407418 409597 412032 414087 414449 412633 409602 406951
56475D06951j391n71q59j705k091j844j801k631l938m833m973m623m096l608l464
$$ 406951 405560 404989 404130 402425 400334 398490 396689 394058 390120 385287 380314 375691 371595 367987 364523
56460C64523l838m537n364o476p808q493p662n787m359m109m262l856l088k800
$$ 364523 360685 356148 350784 344308 336500 328007 320345 314558 310199 306090 301828 297972 294884 292084
56446B92084l163l379k697j333l96q42k368l551l333k231j587j890k529k970l177
$$ 292084 288921 285542 282845 281512 281116 280274 277906 274355 271022 268791 267204 265314 262785 259815 256638
56431B56638k803j263Q90J939J167J06M36J601J847J141J235K827M272L777J729
$$ 256638 253835 252572 253462 255401 256568 256674 257110 258711 260558 261699 262934 265761 270033 273810 275539
56416B75539L2l9J269K800L360K409N76p30o09O94K499M449O156O894O345N182
$$ 275539 275571 275532 276801 279601 282961 285370 285946 285216 284607 285301 287800 292249 298405 305299 311644 316826
56400C16826M358M156M398N024N795N999N352M690M800N087M489L405L212L974
$$ 316826 321184 325340 329738 334762 340557 346556 351908 356598 361398 366485 370974 374379 377591 381565
56386C81565M186L082J718J156J013O97Q35K235M245N331M858L380J703N33M09
$$ 381565 385751 388833 390551 391707 392720 393417 394252 396487 400732 406063 410921 414301 416004 416537 416946
56371D16946R45O91j120l048k999j106K71m39k340l693m148m557n345n858n236
$$ 416946 417891 418582 417462 414414 411415 410309 410580 410141 407801 404108 399960 395403 390058 384200 378964
56356C78964l454j465l47l37r12j766l138m814n656m867l223k146j994k186k534
$$ 378964 375510 374045 373698 373361 372449 370683 367545 362731 357075 352208 348985 346839 344845 342659 340125
56341C40125l215l657k881j042N47J113J112R21K07j049j922j711r45o59j277
$$ 340125 336910 333253 330372 329330 329877 330990 332102 333023 333230 332181 330259 328548 327603 326944 325667
56326C25667k467l558l805k887j371q5Q80J814K253J480J38j58Q28J416M52j091
$$ 325667 323200 319642 315837 312950 311579 311494 312374 314188 316441 317921 318059 317901 318729 320145 320597 319506
56310C19506j665j033K59J972L699M493M147L858M445M914M106K670J937J672
$$ 319506 317841 316808 317067 319039 322738 327231 331378 335236 339681 344595 348701 351371 353308 354980
56296C54980Q60M4Q84L421N652O163N494M573L333J624K17j16L48Q95J373J863
$$ 354980 355840 355884 356768 360189 365841 372004 377498 382071 385404 387028 387245 387129 387477 388372 389745 391608
56280C91608K003J535J147J810L300M228L841L181L864N953P720P745O658O260
$$ 391608 393611 395146 396293 398103 401403 405631 409472 412653 416517 422470 430190 437935 444593 450853
56266D50853P343Q988R888R595Q483P296O999Q204J0297J1848J2337J2789J4208
$$ 450853 458196 467184 477072 486667 495150 502446 509445 517649 527946 539794 552131 564920 579128
56253E79128J6077J7109J6850J5694J3919J1658R535Q267P695P121O569O701P375
$$ 579128 595205 612314 629164 644858 658777 670435 679970 688237 695932 703053 709622 716323 723698
56240G23698P244N303K257j74r95n46K95J066J904L183N077P221Q699Q675P418
$$ 723698 730942 736245 738502 738328 737333 736787 737082 738148 740052 743235 748312 755533 764232 772907 780325
56225G80325O530P602J0528J3560J5326J6139J7089J8471J9837K1019K2284K3785
$$ 780325 786855 794457 804985 818545 833871 850010 867099 885570 905407 926426 948710 972495
56213I72495K5671K8338L1763L4989L7315L9578M3075M7687N2425N7396O3360
$$ 972495 998166 1026504 1058267 1093256 1130571 1170149 1213224 1260911 1313336 1370732 1434092
56202A434092O9563P4256P7735Q2591R0057R8286J05503J12662J21220J30079
$$ 1434092 1503655 1577911 1655646 1738237 1828294 1926580 2032083 2144745 2265965 2396044
56192B396044J37102J42376J47488J52034J53428J50410J44725J38585J31841
$$ 2396044 2533146 2675522 2823010 2975044 3128472 3278882 3423607 3562192 3694033
56183C694033J22430J08798R1276P1661N1973L3419J6258M35j3991k6925l8138
$$ 3694033 3816463 3925261 4016537 4088198 4140171 4173590 4189848 4190283 4176292 4149367 4111229
56172D111229m7002n3075n7151o0831o4762o8330p1402p4952p9296q3175q5672
$$ 4111229 4064227 4011152 3954001 3893170 3828408 3760078 3688676 3613724 3534428 3451253 3365581
56161C365581q7675r0059r1877r2096r2027r3717r6492r7409r5305r2244r0414
$$ 3365581 3277906 3187847 3095970 3003874 2911847 2818130 2721638 2624229 2528924 2436680 2346266
56150B346266q9384q7470q4366q1112p8156p4649o9773o4059n9019n5546n2888
$$ 2346266 2256882 2169412 2085046 2003934 1925778 1851129 1781356 1717297 1658278 1602732 1549844
56139A549844m9417m4472l9062l4722l2025l0467k9311k8239k7300k6448k5136
$$ 1549844 1500427 1455955 1416893 1382171 1350146 1319679 1290368 1262129 1234829 1208381 1183245
56128A183245k2701j9487j6914j5672j4494j1998r110p798p738o462l128J84J702
$$ 1183245 1160544 1141057 1124143 1108471 1093977 1081979 1072869 1065071 1057333 1050871 1047743 1047927 1049629
56115A049629K277L332M656N700P292J0307J3831J6162J6544J5029J2183R972
$$ 1049629 1051906 1055238 1059894 1065594 1072886 1083193 1097024 1113186 1129730 1144759 1156942 1166914
56103A166914J0907J4739J7903J8036J7094J7929J9772J9882J8179J7296J8665
$$ 1166914 1177821 1192560 1210463 1228499 1245593 1263522 1283294 1303176 1321355 1338651 1357316
56092A357316K1161K3209K4130K3915K3628K5258K9307L3523L6080L8718M4221
$$ 1357316 1378477 1401686 1425816 1449731 1473359 1498617 1527924 1561447 1597527 1636245 1680466
56081A680466N1853N8173O1800O4587O8496P4060Q1807R2506J05831J20861J37751
$$ 1680466 1732319 1790492 1852292 1916879 1985375 2059435 2141242 2233748 2339579 2460440 2598191
56070B598191J56818J76442J94120K08850K20057K24982K20581K08086J92738
$$ 2598191 2755009 2931451 3125571 3334421 3554478 3779460 4000041 4208127 4400865
56061D400865J78615J66182J54530J42732J28504J08843Q3313N4664K5816j439
$$ 4400865 4579480 4745662 4900192 5042924 5171428 5280271 5363584 5418248 5444064 5442625
56051E442625k4630m0805m9954n6092o3962p6203r3737j16037j39917j60455j74664
$$ 5442625 5417995 5377190 5327236 5271144 5207182 5130979 5037242 4921205 4781288 4620833 4446169
56040D446169j82939j86600j85920j81040j72718j61561j48306j35098j24376
$$ 4446169 4263230 4076630 3890710 3709670 3536952 3375391 3227085 3091987 2967611
56031B967611j16042j07886r9034r0732q3414p5796o7577o0476n5482n1309m6514
$$ 2967611 2851569 2743683 2644649 2553917 2470503 2394707 2327130 2266654 2211172 2159863 2113349
56020B113349m1225l5929l0629k5782k2084j8809j4576j0117p700p278n905j993
$$ 2113349 2072124 2036195 2005566 1979784 1957700 1938891 1924315 1914198 1906498 1899220 1893315 1891322
56008A891322K436M853N215M858M703N641Q374J1883J4089J4886J6310J9059K1405
$$ 1891322 1893758 1898611 1903826 1908684 1913387 1919028 1927402 1939285 1953374 1968260 1984570 2003629 2025034
55995B025034K2323K2965K4084K4790K5008K6313K8994L1089L1850L3300L6686
$$ 2025034 2047357 2070322 2094406 2119196 2144204 2170517 2199511 2230600 2262450 2295750 2332436
55984B332436M0183M2003M3136M4978M6764M7780M9751N4404O0202O4066O5171
$$ 2332436 2372619 2414622 2457758 2502736 2549500 2597280 2647031 2701435 2761637 2825703 2890874
55973B890874O5153O5636O7304P0426P4596P8701Q2092Q5172Q8447R2244R7413
$$ 2890874 2956027 3021663 3088967 3159393 3233989 3312690 3394782 3479954 3568401 3660645 3758058
55962C758058J04627J12804J20166J26965J34843J43423J50437J55716J62004
$$ 3758058 3862685 3975489 4095655 4222620 4357463 4500886 4651323 4807039 4969043
55953D969043J70875J80836J90634K01480K14389K27923K40366K52211K65074
$$ 4969043 5139918 5320754 5511388 5712868 5927257 6155180 6395546 6647757 6912831
55944F912831K79821K96691L15603L35805L56738L79172M03820M29603M55872
$$ 6912831 7192652 7489343 7804946 8140751 8497489 8876661 9280481 9710084 10165956
55935A0165956M85026N19584N57561N94696O30546O68184P08560P49896P92264
$$ 10165956 10650982 11170566 11728127 12322823 12953369 13621553 14330113 15080009 15872273
55926A5872273Q37936Q87556R40878J000523J069267J144010J218643J292681
$$ 15872273 16710209 17597765 18538643 19539166 20608433 21752443 22971086 24263767
55918B4263767J370944J455313J544170J639799J748425J872129K008266K156909
$$ 24263767 25634711 27090024 28634194 30273993 32022418 33894547 35902813 38059722
55910C8059722K320466K495999K677791K868894L081147L323696L602299L930400
$$ 38059722 40380188 42876187 45553978 48422872 51504019 54827715 58430014 62360414
55902F2360414M328547M810858N383895O060278O860952P804921Q914496J0235891
$$ 62360414 66688961 71499819 76883714 82943992 89804944 97609865 106524361 116760252
55894A16760252J1843118J3824562J6283666J9346284K3130200K7666093L2770825
$$ 116760252 128603370 142427932 158711598 178057882 201188082 228854175 261625000
55887B61625000L7827277M1523621M1905188L7135287K6742366J2369982k806370
$$ 261625000 299452277 340975898 382881086 420016373 446758739 459128721 456322351
55880D56322351j5672715k4527233k9292384l0831517l0204803k8324411k5889594
$$ 456322351 440649636 416122403 386830019 355998502 325793699 297469288 271579694
55873B71579694k3375758k1044194j9001879j7269702j5819954j4602669j3570369
$$ 271579694 248203936 227159742 208157863 190888161 175068207 160465538 146895169
55866A46895169j2676220j1854637j1031108j0162073r251691q327766p418577
$$ 146895169 134218949 122364312 111333204 101171131 91919440 83591674 76173097
55859G6173097o554373n767501n076839m481222l973194l547934l195012k895040
$$ 76173097 69618724 63851223 58774384 54293162 50319968 46772034 43577022 40681982
55851D0681982k632217k401664k200351k020641j857436j712272j585032j469543
$$ 40681982 38049765 35648101 33447750 31427109 29569673 27857401 26272369 24802826
55843B4802826j361729j264449j179877j104094j033324r68790r11185q56398
$$ 24802826 23441097 22176648 20996771 19892677 18859353 17890563 16979378 16122980
55835A6122980q00750p45441o92707o42608n96088n55808n21232m87898m54092
$$ 16122980 15322230 14576789 13884082 13241474 12645386 12089578 11568346 11080448 10626356
55826A0626356m23361l98355l77129l57471l39700l23286l06132k89318k77150
$$ 10626356 10202995 9804640 9427511 9070040 8730340 8407054 8100922 7811604 7534454
55817G534454k69890k61874k49461k35575k23324k10531j94462j77397j63263
$$ 7534454 7264564 7002690 6753229 6517654 6294330 6083799 5889337 5711940 5548677
55808E548677j52303j42929j35886j32907j33522j36104j39905j43689j44943
$$ 5548677 5396374 5253445 5117559 4984652 4851130 4715026 4575121 4431432 4286489
55799D286489j42788j39438j36681j33267j27681j21000j14945j09424j03885
$$ 4286489 4143701 4004263 3867582 3734315 3606634 3485634 3370689 3261265 3157380
55790C157380r8839r4210q8313q0229p1360o3513n7540n4701n6500o1710o6250
$$ 3157380 3058541 2964331 2876018 2795789 2724429 2660916 2603376 2548675 2492175 2430465 2364215
55779B364215o7530o6650o5150o2444n8106n3832n1035m8729m5637m2428m0263
$$ 2364215 2296685 2230035 2164885 2102441 2044335 1990503 1939468 1890739 1845102 1802674 1762411
55768A762411l9077l8689l9567m1086m1272l9766l8898m0238m2111m2110m0144
$$ 1762411 1723334 1684645 1645078 1603992 1562720 1522954 1484056 1443818 1401707 1359597 1319453
55757A319453l7524l4874l2500l1042l0220k8470k5137k1499j8640j6045j3310
$$ 1319453 1281929 1247055 1214555 1183513 1153293 1124823 1099686 1078187 1059547 1043502 1030192
55746A030192j1337j0696j0487r797q603o550k969J081L188K978K704L321K679
$$ 1030192 1018855 1008159 997672 987875 979272 972722 969753 970834 974022 977000 979704 983025 985704
55733I85704p89n198q134j0033j2450j4866j5755j5369j5086j4988j4151j2538
$$ 985704 984915 979717 971583 961550 949100 934234 918479 903110 888024 873036 858885 846347
55721H46347j0795q804o150l491k058k128l034m225n666p614j0364j3502j5472
$$ 846347 835552 826748 820598 817107 815049 812921 809887 805662 799996 792382 782018 768516 753044
55708G53044j5097j3474j2817j3363j3306j1922j0581j0225j0262j0662j2648
$$ 753044 737947 724473 711656 698293 684987 673065 662484 652259 641997 631335 618687
55697F18687j6084j8589j8778j8192j8592j9251j8630j6777j4431j1498q210o085
$$ 618687 602603 584014 565236 547044 528452 509201 490571 473794 459363 447865 439655 433570
55685D33570n748n358l201n78q5j994m231n155m663l189j307Q2M98M74N64M15
$$ 433570 427822 422464 419263 418685 418600 416606 412375 407220 402557 399368 398061 398143 398641 399115 399679 400094
55669D00094l93j498k462l500m734n794o733q105r496r476p833o274n925n749
$$ 400094 399701 398203 395741 392241 387507 381713 374980 366875 357379 347903 340070 333796 327871 322122
55655C22122m581l090k383k121j504q15n21n5J126K413L237M187N613O368N428
$$ 322122 317541 314451 312068 309947 308443 307628 307107 307052 308178 310591 313828 318015 323628 329996 335424
55640C35424L619K260J239j32j434j963k167k698k841j494Q88K892M074N016N901
$$ 335424 339043 341303 342542 342410 340976 339013 336846 334148 331307 329813 330701 333593 337667 342683 348584
55625C48584O339O245N825N071M001L017K290J414J59j135k278l417m251m294
$$ 348584 354923 361168 366993 372064 376065 379082 381372 382786 382945 381810 379532 376115 371864 367570
55611C67570m162n056o538o646m749k461j037M4J077J211O33J155L045L891K531
$$ 367570 363408 358352 351814 345168 340419 337958 336921 336965 338042 339253 339886 341041 344086 347977 350508
55596C50508J432K713M395L659J740J975M434O039N293L451J436j150l888n380
$$ 350508 351940 354653 359048 362707 364447 366422 370856 376895 382188 385639 387075 385925 382037 376657
55582C76657n581n862o650p155p335p776p789o152l850l359m862n788m865m018
$$ 376657 371076 365214 358564 351409 344074 336298 328509 322357 318507 315148 310286 304498 299633 295615
55568B95615n125p156q026p553p012o953o959o805o597o306o043o344p397q312
$$ 295615 290490 283334 275308 267755 260743 253790 246831 240026 233429 227123 221080 214736 207339 199027
55554A99027p837n772l247j574r77n91K08P88K15r09p98R58K419J792j69j423
$$ 199027 191190 185418 182171 180597 179620 179029 179237 180025 180240 179331 178533 179491 181910 183702 183533 182110
55538A82110j290m94N28J716K225J016j371l109l249k476j582l94J462L603N192
$$ 182110 180820 180326 180854 182570 184795 185811 184440 181331 178082 175606 174024 173630 175092 178695 183887
55523A83887N746N470N065N201O001P298R146J1537J3627J4404J4259J4744J6414
$$ 183887 189633 195103 200168 205369 211370 218668 227814 239351 252978 267382 281641 296385 312799
55510C12799J8287J9879K1991K4775K6901K7857K9092L1242L2006K8886K2602
$$ 312799 331086 350965 372956 397731 424632 452489 481581 512823 544829 573715 596317
55499E96317J5638Q667Q20p388j4034j8435k1697k4717k7321k9097k9606k8238
$$ 596317 611955 620622 621442 614054 600020 581585 559888 535171 507850 478753 449147 420909
55487D20909k5343k2683k1260j9737j6852j4025j3258j3664j2920j1249j0725
$$ 420909 395566 372883 351623 331886 315034 301009 287751 274087 261167 249918 239193
55476B39193j1148j0162p520n772o013o173m662k793k102j833p38P26J590K136
$$ 239193 228045 217883 210363 204591 198578 192405 187743 184950 182848 181015 180277 181003 182593 184729
55462A84729K873L140K101J12j838l056k920j141J019J371m50k328k676k526l477
$$ 184729 187602 190742 192843 192955 191117 188061 185141 184000 185019 186390 185940 183612 180936 178410 174933
55447A74933m991n409m620m104m703n632n703m776l849l981m986n441m462l079
$$ 174933 169942 164533 159913 155809 151106 145474 139771 134995 131146 127165 122179 116738 112276 109197
55433A09197k972m206n352n527n034m245l382l232m284n146l861j081K42j067
$$ 109197 106225 102019 96667 91140 86106 81861 78479 75247 70963 65817 61956 60875 61117 60050
55419F0050k733k401o83M64N90M00o6j110k081j968q66K24O37K46r32k433l139
$$ 60050 57317 54916 54233 54697 55287 55687 55621 54511 52430 50462 49596 49820 50457 50703 49771 47338 44199
55402D4199k185P9K365L310K165m88k628k543r12n6q80j954j929j253q04l51O02
$$ 44199 42014 42093 44458 47768 49933 49445 46817 44274 43362 43306 42426 40472 38543 37290 36486 36135 36737
55385C6737J704K443K929L119K356N80j076j748j861j921j545n35L48P64J579
$$ 36737 38441 40884 43813 46932 49288 49868 48792 47044 45183 43262 41717 41182 41530 42294 43873
55370D3873L041L496J606j161k107q95K13l42j443j030J172L266L279J373k49
$$ 43873 46914 50410 52016 50855 48748 47853 48066 47724 46281 45251 46423 49689 52968 54341 54092
55355E4092k4R37M21j509k377o88K142L889L948K790Q25r99j066P96K339J648
$$ 54092 54068 55005 55426 53917 51540 50852 52994 56883 60831 63621 64446 63447 62381 63177 65516 67164
55339F7164j98r00l26k25j243k229k220j427l45O30R19L68n7N13J340J146K36
$$ 67164 66966 66066 65740 65515 64272 62043 59823 58396 58051 58681 59600 59968 59911 60424 61764 62910 63146
55322F3146j6N50Q30N66O41J185J229O25N25J153Q95j230l528l534j307O11L83
$$ 63146 63130 63680 64510 65076 65717 66902 68131 68756 69281 70434 71329 70099 66571 63037 61730 62341 62724
55305F2724j202k216k079j854k479l473l723k915j618k38J152J997J510J02n75
$$ 62724 61522 59306 57227 55373 52894 49421 45698 42783 41165 40927 42079 44076 45586 45688 45113
55290D5113J13N47r27l329m064k279K04J316P66n05j666k238j908q54J44M46K37
$$ 45113 45226 45773 44846 41517 37453 35174 35378 36694 37460 36955 35289 33051 31143 30289 30433 30879 31116
55273C1116K99J183K646L776L799K767J368k5j494k739k879j668j63N48O46Q37
$$ 31116 31415 32598 35244 39020 42819 45586 46954 46929 45435 42696 39817 38149 37986 38534 39180 40017
55257D0017Q90L7j610l120l950m088l293j474L69R15M06M98J803K807J882m95
$$ 40017 40907 40944 39334 36214 32264 28176 24883 23409 23778 24693 25099 25597 27400 30207 32089 31594
55241C1594k345k391r99O55J672J825J385P54J38l75o08m79k45k05k46n2L85Q25
$$ 31594 29249 26858 25859 26514 28186 30011 31396 32150 32288 31913 31305 30826 30581 30376 30130 30078 30463 31288
55223C1288J207J551J699J713K155L090L173R49k759n077m203j323J148K096J787
$$ 31288 32495 34046 35745 37458 39613 42703 45876 46825 44066 38989 34786 33463 34611 36707 38494
55208C8494O00r47j677q09O46R71K57K62J459J918J88k182k576r83J85l22j126
$$ 38494 39094 38147 36470 35661 36307 37278 37535 37797 39256 41174 41362 39180 36604 35621 35806 35484 34358
55191C4358p66Q8J3q73j391j166p41k99L53P91L16p22j085k69J007J965K407K196
$$ 34358 33592 33680 33693 32820 31429 30263 29522 29223 29576 30367 30683 29961 28876 28607 29614 31579 33986 36182
55173C6182J249K12RM93O45L35N07J219J070o38k474k743j663n30L29J365K323
$$ 36182 37431 37643 37652 38145 38790 39125 39632 40851 41921 41283 38809 36066 34403 33873 34202 35567 37890
55156C7890K434J836J414J375J067L06k30m1N39J012J363J817K218J964N65j569
$$ 37890 40324 42160 43574 44949 46016 46322 46092 46051 46590 47602 48965 50782 53000 54964 55529 53960
55140E3960l081l030k224k240l006k673m94J617J641L57M6J114J787R78l39p61
$$ 53960 50879 47849 45625 43385 40379 37706 37212 38829 40470 40827 40873 41987 43774 44752 44413 43652
55124D3652j28P68J074K90j250k217j488M16J888K097J418K50j270k477k459j399
$$ 43652 43524 44292 45366 45656 44406 42189 40701 41117 43005 45102 46520 46770 45500 43023 40564 39165
55108C9165m76j77P8M18M3j247k301k228j523q52J82J972L485L259J310r97k610
$$ 39165 38689 38512 38590 39008 39051 37804 35503 33275 31752 30900 31082 33054 36539 39798 41108 40111 37501
55091C7501l312l043j900o99l02k26R42L253M654L384N33j059l12Q63L25j439
$$ 37501 34189 31146 29246 28547 28245 28019 28961 32214 36868 40252 40785 39726 39414 40277 40602 39163
55075C9163k242j435n39o21n84Q71K839L274J971Q32J105J905J985J617J728K168
$$ 39163 36921 35486 34947 34326 33742 34613 37452 40726 42697 43529 44634 46539 48524 50141 51869 54037
55059E4037K056J509J642K742L521K824J378R24J794K347J100j275k860k840k116
$$ 54037 56093 57602 59244 61986 65507 68331 69709 70633 72427 74774 75874 74599 71739 68899 66783
55044F6783j709j560j106j80J044K189K462J161j048k329j786n14K41Q19J939
$$ 66783 65074 63514 62408 62228 63272 65461 67923 69084 68036 65707 63921 63407 63648 64467 66406
55029F6406K829K210N62m48n10q05j508j200O85K640L154K584J951J259K20m13
$$ 66406 69235 71445 72007 71559 71049 70244 68736 67536 68221 70861 74015 76599 78550 79809 80029 79616
55013G9616K60J705K473K108J483J461K132L106L657K831M37k102k879j692k81
$$ 79616 79876 81581 84054 86162 87645 89106 91238 94344 98001 100832 101269 99167 96288 94596 94315
54998I4315j74j092j852k062k178k310j875o05Q51J655J761J645J310K60j338
$$ 94315 94141 93049 91197 89135 86957 84647 82772 82167 83018 84673 86434 88079 89389 89649 88311
54983H8311k281j676l57j00j384k635j999N46L174M035K856R06l14k84M19J009
$$ 88311 86030 84354 83997 83897 82513 79878 77879 78425 81599 85634 88490 89396 89082 88798 89217 90226
54967I0226J214J127P54J05m98o43l14J82O85J313K170L194M112M384L510J790
$$ 90226 91440 92567 93321 93426 92928 92285 91971 92153 92838 94151 96321 99515 103627 108011 111521 113311
54951A13311L55o8J3j10m5R24K124J938J06j747k289k004j943k044j651q93n71
$$ 113311 113666 113598 113611 113501 113456 114380 116504 118442 118548 116801 114512 112508 110565 108521 106870 105977 105406
54934A05406r98j721k107j649k06J493K069Q98j018k248k524k424k055j099N9
$$ 105406 104408 102687 100580 98931 98725 100218 102287 103185 102167 99919 97395 94971 92916 91817 91876
54919I1876N19K42K05R33J771J953J532R17L14L2O02J888K834K821K617L061L395
$$ 91876 92395 92637 92842 93775 95546 97499 99031 99948 100262 100294 100896 102784 105618 108439 111056 114117 117512
54902A17512K222n1j126L70L185N163N791O038O435O569O350O640Q163J0542J2767
$$ 117512 119734 119683 118557 118927 122112 127275 133066 139104 145539 152108 158458 165098 173261 183803 196570
54887A96570J4174J4704J4633J4443J4662J5326J5693J4735J1977P877L489j83
$$ 196570 210744 225448 240081 254524 269186 284512 300205 314940 326917 334794 338283 338100
54875C38100k736m476o034p885j0099j2228j3331j2689j0934r894j0571j1797
$$ 338100 335364 330888 324854 316969 306870 294642 281311 268622 257688 247794 237223 225426
54863B25426j1756j0513r648r595q894o656m186l122l125k677j381j38N78J271
$$ 225426 213670 203157 193509 183914 175020 168364 164178 161056 157931 155254 153873 153735 154313 155584
54849A55584K407L856N310O421O598N664M771N772R218J3480J6124J5960J3786
$$ 155584 157991 161847 167157 173578 180176 185840 190611 196383 205601 219081 235205 251165 264951
54836B64951J1432J0026Q995O874L133j260n240q691j1547j2908j2184j0565r959
$$ 264951 276383 286409 295404 302278 305411 304151 298911 290220 278673 265765 253581 243016 233057
54823B33057j0659j1252j0728r499q148o541m702l545l786m748n025m204l286
$$ 233057 222398 211146 200418 190919 182771 176230 171528 167983 164197 159449 154424 150220 146934
54810A46934l310l891l549j654L91N20j422l349l459k155r18j82N87J491K144
$$ 146934 143624 139733 136184 134530 134921 135441 134019 130670 127211 125056 124138 123956 124543 126034 128178
54795A28178K665L484M243L984K519O11j118k566l521l617l037k478k400k870
$$ 128178 130843 134327 138570 142554 145073 145684 144566 142000 138479 134862 131825 129347 126947 124077
54781A24077l852m886m888l295j211k15m00o28m94o12j084j280j130j205j262
$$ 124077 120225 115339 110451 107156 105945 105730 105330 104702 104208 103596 102512 101232 100102 98897 97635
54766I7635l35J375K246J466P8q07j475k340k593j327P83K067J750N30l54j28
$$ 97635 97300 98675 100921 102387 102465 101658 100183 97843 95250 93923 94706 96773 98523 99053 98699 98571
54750I8571J042K184K531K449K789L439L473K790K443L025L915M609N611P386
$$ 98571 99613 101797 104328 106777 109566 113005 116478 119268 121711 124736 128651 133260 138871 146257
54736A46257R346J0560J0747J0161R307R053J0144J2295J4565J6675J8740J9718
$$ 146257 155603 166163 176910 187071 196378 205431 215575 227870 242435 259110 277850 297568
54724B97568J7906J3492Q925N770K831j489o397r711j0561r758q280o692n490
$$ 297568 315474 328966 337891 343661 346492 345003 338606 328895 318334 308576 300296 293604 288114
54711B88114m868m507m297m626n424n910n800n717n714m792k788j215r26m24J915
$$ 288114 283246 278739 274442 269816 264392 258482 252682 246965 241251 236459 233671 232456 231530 231106 233021
54696B33021N202P391Q215Q810R365R319R466J1497J5312J8658J9795J8958J6977
$$ 233021 238223 245614 253829 262639 272004 281323 290789 302286 317598 336256 356051 375009 391986
54683C91986J4088J0611P407M867K251j233n259q730j0990j2340j3529j4865j5891
$$ 391986 406074 416685 424092 428959 431210 429977 424718 415988 404998 392658 379129 364264 348373
54670C48373j6062j5602j5123j4622j3676j2589j2080j1750j0444q529q025r496
$$ 348373 332311 316709 301586 286964 273288 260699 248619 236869 226425 217896 209871 200375
54658B00375j0686r625p338n810m921l453j864j514k020j917j371j897l484m330
$$ 200375 189689 180064 172726 166916 161995 158542 156678 155164 153144 151227 149856 147959 144475 140145
54644A40145l472j641M04K410L564L026J663J275J821J473k91j814j956j651j939
$$ 140145 136673 135032 135436 137846 141410 144436 146099 147374 149195 150668 150377 148563 146607 144956 143017
54629A43017k263j642j64J512K848L166K001K76l02N53J450J581J615J966J994
$$ 143017 140754 139112 138948 140460 143308 146474 148475 148751 148449 149002 150452 152033 153648 155614 157608
54614A57608J604J812K907L786M026M803O525P451O153L922L021L665M419M526
$$ 157608 159212 161024 163931 167717 171743 176546 183071 190522 196675 200597 203618 207283 211702 216228
54600B16228M181L273J643J88J32J396K898M175N444O324N950M503L513M243O336
$$ 216228 220409 223682 225325 225513 225645 227041 229939 234114 239558 245882 251832 256335 259848 264091 270427
54585B70427Q393R467R892J0775J2660J4780J5935J5822J4913J3241J0416O886
$$ 270427 278820 288287 298179 308954 321614 336394 352329 368151 383064 396305 406721 413607
54573D13607L873J694o13l501o144q157j0537j3748j6242j6461j5207j4349j3990
$$ 413607 417480 419174 418561 415060 408916 400759 390222 376474 360232 343771 328564 314215 300225
54560C00225j2716j0269q058p026o562n858m955m097l220k463k266k514k398j548
$$ 300225 287509 277240 269182 262156 255594 249736 244781 240684 237464 235001 232735 230221 227823 226275
54546B26275o80p76k036l836n202n275l902k019r52j080j566j545j072p85j019
$$ 226275 225595 224819 222783 218947 213745 208470 204568 202549 201597 200517 198951 197406 196334 195549 194530
54531A94530j592k147k497k738l125l664l899l338k192j332j344j828j992j731
$$ 194530 192938 190791 188294 185556 182431 178767 174868 171530 169338 168006 166662 164834 162842 161111
54517A61111j764k570l621m013l669l260l111k841k275j768j226Q7J954K529P00
$$ 161111 159347 156777 153156 149143 145474 142214 139103 136262 133987 132219 130993 131080 133034 135563 136263
54502A36263j647j627O38K147J423N69J868M295M983K950k55k790l883l446j846
$$ 136263 134616 132989 133627 135774 137197 137766 139634 143929 148912 151862 151607 148817 144934 141488 139642
54487A39642K2J488K745M064M930M805M076L189J709l40j060J411N724Q144P060
$$ 139642 139664 141152 143897 147961 152891 157696 161772 164961 166670 166330 165270 166681 172405 180549 187609
54472A87609M900M770O813Q942R821R539Q204N582K226m57j738k461l850n858
$$ 187609 192509 197279 204092 213034 222855 232394 240598 246180 248406 247949 246211 243750 239900 234042
54458B34042p228o990n487l841k857k678l169m075m900n122m779m356m043l531
$$ 234042 226814 219824 214337 210496 207639 204961 201792 197717 192817 187695 182916 178560 174517 170986
54444A70986k735k077j693j015K97J524J752J078L16j77n50p35n86m20m82j35
$$ 170986 168251 166174 164481 163466 163763 165287 167039 168117 168433 168256 167706 166971 166385 165965 165483 165348
54428A65348J269K845K933J554N86R73J313K29j277j365j86N69M19M59J114J448
$$ 165348 166617 169462 172395 173949 174535 175508 176821 177050 175773 174408 174222 174791 175210 175669 176783 178231
54412A78231J148J385K738L896L625K750K646K811J835J72k00J038J828Q95l37
$$ 178231 179379 180764 183502 187398 191023 193773 196419 199230 201065 201237 201037 202075 203903 204798 204461
54397B04461j99M54m00k755m526m417l252k365k038j906j840j902k002k084k234
$$ 204461 204262 204716 204316 201561 197035 192618 189366 187001 184963 183057 181217 179315 177313 175229 172995
54382A72995k467k703k903k911k312r71M55J132J040Q27Q01P92P32O63L61k85
$$ 172995 170528 167825 164922 162011 159699 158728 159183 160315 161355 162182 162983 163775 164507 165170 165531 165246
54366A65246o78k17N52O29L04Q96K513L433K377K99r13p15jM30O06Q82J478K456
$$ 165246 164568 164351 164903 165532 165836 166732 169245 172678 175055 175354 174441 173726 173725 174155 174761 175643 177121 179577
54348A79577L624M516M706M241L707L882N035O361O580N491M387M244M306L503
$$ 179577 183201 187717 192423 196664 200371 204253 209288 215649 222229 227720 232107 236351 240657 244160
54334B44160K534K850M045M126K450M55q28j991l310l609k260o81n04j501k469
$$ 244160 246694 249544 253589 257715 260165 260620 259792 257801 254491 250882 248622 247941 247437 245936 243467
54319B43467l035l357l229k664k410k718k679j917j749l280n421o360n996n321
$$ 243467 240432 237075 233846 231182 228772 226054 223375 221458 219709 216429 211008 204648 198652 193331
54305A93331m341k497n11J16p51j743j867j143K16J846K714K101Q78N69J255J737
$$ 193331 188990 186493 185982 186098 185347 183604 181737 180594 180810 182656 185370 187471 188349 188918 190173 191910
54289A91910J422P71K28L8Q06K709M426M396L100K535L468M682M963M335L250
$$ 191910 193332 194103 194331 194369 195175 197884 202310 206706 209806 212341 215809 220491 225454 229789 233039
54274B33039J980J031Q31Q38J23j150k041k556l565n026n799n461m808m352l756
$$ 233039 235019 236050 236881 237719 237842 236692 234651 232095 228530 223504 217705 212244 207436 203084 199328
54259A99328k993k666k849l003l268m419o140o938o214n022m262l523k273r45
$$ 199328 196335 193669 190820 187817 184549 180130 173990 167052 160838 155816 151554 148031 145758 144813
54245A44813k64n69k009m174n472m399j824k98q09j959k669l457m333l911j999
$$ 144813 144549 143980 141971 137797 132325 127926 126102 125804 124995 123036 120367 116910 112577 108666 106667
54230A06667p88j686k846j938K28J200Q76J299K999L984K678j6k094k574j857
$$ 106667 105879 104193 101347 99409 99637 100837 101713 103012 106011 109995 112673 112657 110563 107989 106132
54215A06132r14m35l69k60k04p60j521q88J659M100M105K119P00J131K257K610
$$ 106132 105218 104783 104414 104154 103950 103190 101669 100781 102440 106540 110645 112764 113464 114595 116852 119462
54199A19462K208J878J928K051J802R47j98p63k56O46P99J43k69J33M80m84k552
$$ 119462 121670 123548 125476 127527 129329 130276 130078 129315 129059 129705 130504 130647 130378 130511 130991 130507 127955
54182A27955l827k610L91K439J902K95J25J237J215o59k076j274K76L27q38j509
$$ 127955 124128 121518 121909 124348 126250 126545 126670 127907 129122 128463 126387 125113 125389 125716 124878 123369
54166A23369j591k178k944k442p71K20l68j401j579r54k34J23lk02M45K006K756
$$ 123369 121778 119600 116656 114214 113443 113663 113295 111894 110315 109361 109127 109250 109247 109045 109490 111496 114252
54149A14252J170j571k817k064j363j915k468j709l99k3q19k060l040k985j376
$$ 114252 115422 113851 111034 108970 107607 105692 103224 101515 101116 101093 100274 98214 95174 92189 90813
54134I0813Q17J571M24o73j60Q67N52q40j575j182q01j080j407j244r81j147j483
$$ 90813 91630 93201 93625 92952 92792 93659 94211 93371 91796 90614 89813 88733 87326 86082 85101 83954 82471
54117H2471j154M06K753M370L940J977M51L71O02j62j313j402m17M26P14J031
$$ 82471 81317 81723 84476 88846 92786 94763 95214 95585 96187 96025 94712 93310 92893 93319 94033 95064
54101I5064J348Q72l28j007n76k7l63j140j310p74k71j99l27l82l75l62k85l7
$$ 95064 96412 97284 96956 95949 95373 95346 94983 93843 92533 91759 91488 91289 90962 90580 90205 89843 89558 89521
54083H9521M52J084J540J590J409J236P97l51j805k302j133Q69K243K439K036
$$ 89521 89973 91057 92597 94187 95596 96832 97629 97278 95473 93171 92038 92907 95150 97589 99625
54068I9625J692J433R52K04n29j034j562k617m134n020m134j798K42P76M64P05
$$ 99625 101317 102750 103702 103906 103377 102343 100781 98164 94030 89010 84876 83078 83320 84096 84560 85265
54052H5265J709K434K178J294L83l79r16r79o43m58p34j138j344j545j801j479
$$ 85265 86974 89408 91586 92880 93263 92884 91968 90989 90346 89888 89154 88016 86672 85127 83326 81847
54036H1847o0J727K457J652K85m30q8R87K180K736K219J202Q78J563K138J569
$$ 81847 81787 83514 85971 87623 87908 87478 87390 88377 90557 93293 95512 96714 97592 99155 101293 102862
54020A02862M71K34R48J171n2j853k615j852n05K47K5o37q10J17J839L307L717
$$ 102862 103333 103567 104515 105686 105634 103781 101166 99314 98809 99056 99081 98444 97634 97751 99590 102897 106614
54003A06614L232K523J920J374R98J015J304J548J835K419K865K375J245J009
$$ 106614 109846 112369 114289 115663 116661 117676 118980 120528 122363 124782 127647 130022 131267 132276
53989A32276K341L670L008O59j097r03L99J440K017K611L377M167M747M477K798
$$ 132276 134617 138287 141295 141954 140857 139954 140353 141793 143810 146421 149798 153965 158712 163189 165987
53974A65987O60K84K492N218N974N042M629N493O238N944N577O149O976O751N471
$$ 165987 166647 166931 169423 174641 180615 185657 190286 195779 202017 207961 213538 219687 226663 233414 238885
53959B38885M324M204M876N421N101M131L619M232N147N058M068L370L071J878
$$ 238885 243209 247413 252289 257710 262811 266942 270561 274793 279940 284998 289066 292436 295507 297385
53945B97385o10k789l141k226j598j780k433l493m856n713n532n068n115m912
$$ 297385 296775 293986 290845 288619 287021 285241 282808 279315 274459 268746 263214 258146 253031 248119
53931B48119l322j095k91j440k818k756j461k72k06j444l276m359l945k869k547
$$ 248119 244797 243702 243411 241971 239153 236397 234936 234664 234458 233014 229738 225379 221434 218565 216018
53916B16018l048l226k616j923j571j256j064j610k612k754j628l90J28N48J412
$$ 216018 212970 209744 207128 205205 203634 202378 201314 199704 197092 194338 192710 192320 192448 192996 194408
53901A94408J912J392P29R07J308J001O81J574L070L361K110O80k42j317k562
$$ 194408 196320 197712 198441 199348 200656 201657 202338 203912 206982 210343 212453 213133 212891 211574 209012
53886B09012k578o11K065L821M641N391O060N854M697L477K988L320M208N285
$$ 209012 206434 205823 207888 211709 216350 221741 227801 233655 238352 241829 244817 248137 252345 257630
53872B57630N975N747M684L495K827K731K796K619K117J523J153J143J419J788
$$ 257630 263605 269352 274036 277531 280358 283089 285885 288504 290621 292144 293297 294440 295859 297647
53858B97647J969J749J404J747L303N369O573O426N804N601N601N246M889N476
$$ 297647 299616 301365 302769 304516 307819 313188 319761 326187 331991 337592 343193 348439 353328 358804
53844C58804P067Q523Q778P907O733N879N397M951M140K799J322M09L75P39O72
$$ 358804 365871 374394 383172 391079 397812 403691 409088 414039 418179 420978 422300 422709 423084 423823 424495
53829D24495j59j382k437l255m289n757p042p269o599o363p513r310j0269j0002
$$ 424495 424336 422954 420517 417262 412973 407216 400174 392905 386306 379943 372430 363120 352851 342849
53815C42849r218q176o494m635m125n433o808o445m940m264m836n284m955m901
$$ 342849 333631 325455 318961 314326 310201 304768 297960 291515 286575 282311 277475 272191 267236 262335
53801B62335n937p155p237o232n197m853n308o332p148o641m683k718k116k443
$$ 262335 256398 249243 242006 235774 230577 225724 220416 214084 206936 200295 195612 192894 190778 188335
53787A88335k328j514q83p40m82J5R1l46m21J38K72p43j909j915j110p83j003
$$ 188335 186007 184493 183610 182870 182388 182403 182494 182148 181727 181865 182137 181394 179485 177570 176460 175677 174674
53770A74674p24m7o44l089n092l821M37M272M889K863Q40M35J196J989K285K038
$$ 174674 173950 173903 173259 170170 165078 161257 161694 165966 170855 173718 174558 174993 176189 178178 180463 182501
53754A82501J227J9j034j468j405j255j035k81J323L480N306N863M899L270K364
$$ 182501 183728 183747 182713 181245 179840 178585 177550 177269 178592 182072 187378 193241 198140 201410 203774
53739B03774K835M001M817N181N805O931P850P895P378P084P232P416P382P270
$$ 203774 206609 210610 215427 220608 226413 233344 241194 249089 256467 263551 270783 278199 285581 292851
53725B92851P083O530N712N437O290P673Q385Q063P253O092L936Q92j381j514
$$ 292851 299934 306464 312176 317613 323903 331576 339961 348024 355277 361369 365305 366197 364816 363302
53711C63302m84m46j831l118l549m262n952p137o153l711j895j359j176j028j620
$$ 363302 362818 362372 360541 357423 353874 349612 343660 336523 330370 326659 324764 323405 322229 321201 319581
53696C19581k907l782l973m608o122p034o006l977k999l564m345m246l521k960
$$ 319581 316674 312892 308919 304311 298189 291155 285149 281172 278173 274609 270264 266018 262497 259537
53682B59537k966l556m412m728l721j567N39J432Q44p02k383l448l595l101k329
$$ 259537 256571 253015 248603 243875 240154 238587 239126 240558 241402 240700 238317 234869 231274 228173 225844
53667B25844j182N01K071K450J569P49J157K418L358L572L514L384K900K168J798
$$ 225844 224662 225163 227234 229684 231253 232002 233159 235577 238935 242507 246021 249405 252305 254473 256271
53652B56271J935J962J633J591K131K273J074o57j243n51j15o82j032P4J964L225
$$ 256271 258206 260168 261801 263392 265523 267796 268870 268213 266970 266419 266304 265622 264590 264664 266628 269853
53636B69853L872M954O386O706N246L258K294K391K539K366K491L394M614N300
$$ 269853 273725 278679 285065 291771 297017 300275 302569 304960 307499 309865 312356 315750 320364 325664
53622C25664N054M134L101K597L153M758O403O593M808K254N97J62M8j08M19J889
$$ 325664 330718 334852 337953 340550 343703 348461 354864 361457 366265 368519 369116 369278 369326 369218 369637 371526
53606C71526L090K768J220l66j491k076j448Q62L515M192K427K29n71l02k32o12
$$ 371526 374616 377384 378604 378238 376747 374671 373223 374085 377600 381792 384219 384448 383877 383575 383343 382731
53590C82731r15j102j476j739j175K45J626J962R81o43j660j358m23k53j181k079
$$ 382731 381816 380714 379238 377499 376324 376569 378195 380157 381138 380495 378835 377477 377054 376801 375620 373541
53574C73541k038j497j211r15k9J102J696J869K385L322M014M157M002L440K039
$$ 373541 371503 370006 368795 367880 367851 368953 370649 372518 374903 378225 382239 386396 390398 393838 395877
53559C95877J40r43k62J753L877N208N544N234M923N069N569O077O635P520Q618
$$ 395877 396017 395074 394812 396565 400442 405650 411194 416428 421351 426420 431989 438066 444701 452221 460839
53544D60839R397R563R189Q397P519P350Q355R620R680Q642Q321R680J1257J1174
$$ 460839 470236 479799 488988 497385 504904 512254 520609 530229 539909 548551 556872 566552 577809 588983
53530E88983R710Q674Q739Q934Q698Q853J0024J1319J1400J0114Q219O252M584
$$ 588983 598693 607367 616106 625040 633738 642591 652615 663934 675334 685448 693667 699919 704503
53517G04503M097N432P576Q376P020M941L753L200K091M66m38j87J78k80j184
$$ 704503 708600 714032 721608 729984 737004 741945 745698 748898 750989 751455 751017 750830 751008 750728 749544
53502G49544j608j236l56N68R13K76p68j049l82Q9k21l04N82J167o1k101k460
$$ 749544 747936 746700 746344 746912 747825 748101 747333 746284 745902 745991 745770 745466 746048 747215 747154 745053 742593
53485G42593p98N57O0j112j389j145j362j419j02K129L615L865L857M176M520
$$ 742593 741795 742352 742412 741300 739911 738766 737404 735985 735883 738012 741627 745492 749349 753525 758045
53470G58045M971O232Q194R656R967R823R949J0277J0966J2954J6414J9659K0907
$$ 758045 763016 769248 777442 787098 797065 806888 816837 827114 838080 851034 867448 887107 908014
53457I08014K0569K0513K1508K2690K3436K4357K6083K8159K9711L0474L0765
$$ 908014 928583 949096 970604 993294 1016730 1041087 1067170 1095329 1125040 1155514 1186279
53446A186279L0983L1622L3237L5885L8887M1407M3136M4311M5382M6806M8651
$$ 1186279 1217262 1248884 1282121 1318006 1356893 1398300 1441436 1485747 1531129 1577935 1626586
53435A626586N0322N1203N1748N3176N5758N8081N8653N7700N6748N6794N7615
$$ 1626586 1676908 1728111 1779859 1833035 1888793 1946874 2005527 2063227 2119975 2176769 2234384
53424B234384N8527N9082N9084N8694N8445N8755N9454O0146O0775O1348O1388
$$ 2234384 2292911 2351993 2411077 2469771 2528216 2586971 2646425 2706571 2767346 2828694 2890082
53413B890082O0305N8098N5047N1098M6301M1705L8741L7602L6988L5659L3598
$$ 2890082 2950387 3008485 3063532 3114630 3160931 3202636 3241377 3278979 3315967 3351626 3385224
53402C385224L1526K9980K8957K7849K5683K2179J8511J6128J4815J2938R587
$$ 3385224 3416750 3446730 3475687 3503536 3529219 3551398 3569909 3586037 3600852 3613790 3623377
53391C623377N206Po495j3650j9137k1617k2768k5159k9066l2906l5995l8917
$$ 3623377 3628583 3628590 3622095 3608445 3589308 3567691 3544923 3519764 3490698 3457792 3421797 3382880
53379C382880m1574m2963m3186m3948m6400m9748n2636n4621n5645n5250n3391
$$ 3382880 3341306 3298343 3255157 3211209 3164809 3115061 3062425 3007804 2952159 2896909 2843518
53368B843518n1222n0030m9712m9124m7727m6037m4623m3302m1350l8193l3851
$$ 2843518 2792296 2742266 2692554 2643430 2595703 2549666 2505043 2461741 2420391 2382198 2348347
53357B348347k9050k4704k1003j7243j2848q253m260p78L162Q089J3436J8407
$$ 2348347 2319297 2294593 2273590 2256347 2243499 2235246 2230986 2230208 2233370 2241459 2254895 2273302
53345B273302K2875K7075L0897L4179L7412M1404M6045N0133N2789N4598N6805
$$ 2273302 2296177 2323252 2354149 2388328 2425740 2467144 2513189 2563322 2616111 2670709 2727514
53334B727514N9806O3132O6639P0806P5680Q0399Q4311Q7948R2250R7175J01692
$$ 2727514 2787320 2850452 2917091 2987897 3063577 3143976 3228287 3316235 3408485 3505660 3607352
53323C607352J05055J07590J10232J13629J17651J21519J24475J26385J27602
$$ 3607352 3712407 3819997 3930229 4043858 4161509 4283028 4407503 4533888 4661490
53314D661490J28233J28029J27170J26397J25900J24679J21803J17840J14100
$$ 4661490 4789723 4917752 5044922 5171319 5297219 5421898 5543701 5661541 5775641
53305E775641J10652J06138R9715R2304Q5625Q0553P6645P2630O7169N9768N1316
$$ 5775641 5886293 5992431 6092146 6184450 6270075 6350628 6427273 6499903 6567072 6626840 6678156
53294F678156M3289L6198K9147K1048J1646J127j0509k3201l6483m9890o3330
$$ 6678156 6721445 6757643 6786790 6807838 6819484 6820611 6810102 6786901 6750418 6700528 6637198
53283F637198p6532q8596r8752j07328j15200j22378j27857j30973j32248j32687
$$ 6637198 6560666 6472070 6373318 6265990 6150790 6028412 5900555 5769582 5637334 5504647
53273E504647j32797j32743j32907j33605j34319j33832j31548j28341j25781
$$ 5504647 5371850 5239107 5106200 4972595 4838276 4704444 4572896 4444555 4318774
53264D318774j24527j23739j22056j18853j14455j09413j03909r7864r1400q5042
$$ 4318774 4194247 4070508 3948452 3829599 3715144 3605731 3501822 3403958 3312558 3227516
53254C227516p9448p4795p0505o5702o0098n4268m9004m4469m0130l5315k9832
$$ 3227516 3148068 3073273 3002768 2937066 2876968 2822700 2773696 2729227 2689097 2653782 2623950
53243B623950k4231j9532j6370j4229j1848q684n645l860k989j367K101O666J0568
$$ 2623950 2599719 2580187 2563817 2549588 2537740 2529056 2523411 2519551 2516562 2515195 2517296 2523962 2534530
53230B534530J2814J3975J5381J7846K1116K4475K7614L0718L3925L7123M0280
$$ 2534530 2547344 2561319 2576700 2594546 2615662 2640137 2667751 2698469 2732394 2769517 2809797
53219B809797M3541M6781M9580N1825N3775N5176N5078N3227N1107N0594N1760
$$ 2809797 2853338 2900119 2949699 3001524 3055299 3110475 3165553 3218780 3269887 3320481 3372241
53208C372241N2877N2491N0696M8343M6001M3932M2218M0521L8198L5195L2292
$$ 3372241 3425118 3477609 3528305 3576648 3622649 3666581 3708799 3749320 3787518 3822713 3855005
53197C855005L0118K8119K4940J9726J2936N890l97o043j1845j8048k4074k9674
$$ 3855005 3885123 3913242 3938182 3957908 3970844 3976734 3976337 3970294 3958449 3940401 3916327 3886653
53185C886653l5677m2772n0098n6092o0486o4387o8375p1706p3710p4741p5368
$$ 3886653 3850976 3808204 3758106 3702014 3641528 3577141 3508766 3437060 3363350 3288609 3213241
53174C213241p5473p4831p3691p2251p0293o7974o6308o6023o6467o6407o5580
$$ 3213241 3137768 3062937 2989246 2916995 2846702 2778728 2712420 2646397 2579930 2513523 2447943
53163B447943o4730o4463o4722o5155o5426o5202o4291o2657o0080n6260n1656
$$ 2447943 2383213 2318750 2254028 2188873 2123447 2058245 1993954 1931297 1871217 1814957 1763301
53152A763301m7621m5078m3383m1275l8709l6880l6430l6510l5890l4372l2635
$$ 1763301 1715680 1670602 1627219 1585944 1547235 1510355 1473925 1437415 1401525 1367153 1334518
53141A334518l1110k9618k8036k6720k5903k5131k3936k3016k3715k5880k7252
$$ 1334518 1303408 1273790 1245754 1219034 1193131 1168000 1144064 1121048 1097333 1071453 1044201
53130A044201k6002k3274k1818k2344k2818k1651j9874j9291j9916k0445k0244
$$ 1044201 1018199 994925 973107 950763 927945 906294 886420 867129 847213 826768 806524
53119H06524j9602j8574j7062j5689j5402j6185j6984j6967j6137j4923j3837
$$ 806524 786922 768348 751286 735597 720195 704010 687026 670059 653922 638999 625162
53108F25162j3321j3241j2706j1229r737r560j0560j1200j0468q901p571o946
$$ 625162 611841 598600 585894 574665 564928 555368 544808 533608 523140 514239 506668 499722
53096D99722o923p234p439p099o293n707n970p069q326q786p907o263n224n487
$$ 499722 492799 485565 478126 471027 464734 459027 453057 445988 437662 428876 420969 414706 409482 403995
53082D03995o197o055m903l619k869k742l267m235m827m356l276k509k036j250
$$ 403995 397798 391743 386840 383221 380352 377610 374343 370108 365281 360925 357649 355140 353104 351854
53068C51854m33n48j487k093k013k100k514k056j88J715K232J786J543J454P23
$$ 351854 351421 350873 349386 347293 345280 343180 340666 338610 338422 340137 342369 344155 345698 347152 347875
53053C47875n12j341j420r93lJ563K920L268L060L281L731L339K194J707K504
$$ 347875 347363 346022 344602 343609 343606 345169 348089 351357 354417 357698 361429 364768 366962 368669 371173
53038C71173L491L469K510J166m84k215l052k432j375j388k584l777m244m406
$$ 371173 374664 378133 380643 381809 381325 379110 376058 373626 372251 370863 368279 364502 360258 355852
53024C55852m814n391n774n757n187m092l093l029l883m644m638m284m176m062
$$ 355852 351038 345647 339873 334116 328929 324837 321744 318715 314832 310188 305550 301266 297090 293028
53010B93028l475k819k792l004k361r58m14j712l671m419l750l015k991l007k291
$$ 293028 289553 286734 283942 280938 278577 277619 277205 275493 271822 267403 263653 260638 257647 254640 252349
52995B52349j231q92j722l120l981l505j889l49p8j003j880j756q59jL32k9j106
$$ 252349 251118 250226 248504 245384 241403 237898 236009 235660 235582 234579 232699 230943 230084 230083 230415 230386 229280
52978B29280k336k577j440l05r61l203m853m424k848j916j926j910j615j914l082
$$ 229280 226944 224367 222927 222622 221661 218458 213605 209181 206333 204417 202491 200581 198966 197052 193970
52963A93970l968l532k345j709j832j828j245n89k14K83J168J786J324n3j384
$$ 193970 190002 186470 184125 182416 180584 178756 177511 176922 176708 176991 178159 179945 181269 181216 179832
52948A79832k047k162k049j684q77L21J409J714J016m1n46l32n5r3k2N39J076
$$ 179832 177785 175623 173574 171890 171013 171334 172743 174457 175473 175432 174886 174554 174499 174406 174384 174923 175999
52931A75999R33L80L00R01J518J605J250P01K3n86q00o12m31n46q16r75q77m19
$$ 175999 176932 177312 177612 178513 180031 181636 182886 183587 183610 183024 182224 181612 181181 180635 179819 178844 177967 177548
52913A77548L74J162J556J593J536J402J166J311K349L738M107L023J798J993
$$ 177548 177922 179084 180640 182233 183769 185171 186337 187648 189997 193735 197842 200865 202663 204656
52899B04656L506M694M276K737J754K400M029N116N264N638O951P829O453L450
$$ 204656 208162 212856 217132 219869 221623 224023 228052 233168 238432 244070 251021 258850 265303 268753
52885B68753J538K064L417L464K131O21o40j868k678k511j939k154l218l960l644
$$ 268753 270291 272355 275772 279236 281367 281988 281348 279480 276802 274291 272352 270198 266980 263020 259376
52870B59376k666j727j225j509k700m107m713m406l913l446k429q68Q0m11j436
$$ 259376 256710 254983 253758 252249 249549 245442 240729 236323 232410 228964 226535 225667 225747 225336 223900
52855B23900j292L84K109K095L5k647m121l671j987j97J057J504R16n33k014k860
$$ 223900 222608 222992 225101 227196 227231 224584 220463 216792 214805 214608 215665 217169 218085 217552 215538 212678
52839B12678l316l709l448j849L10J465J511J837K826L032J611n1m34k09p70j472
$$ 212678 209362 205653 202205 200356 200666 202131 203642 205479 208305 211337 212948 212897 212463 212254 211484 210012
52823B10012n07J839L066K007N65R62K703L479K223O3j292j048N18K407L399K951
$$ 210012 209505 211344 214410 216417 216982 217944 220647 224126 226349 226412 225120 224072 224590 226997 230396 233347
52807B33347J752R06O37K69n05j067q21j38J89J09L27J137J695R59q62k217j866
$$ 233347 235099 236005 236642 236911 236406 235339 234518 234380 234569 234678 235005 236142 237837 238796 237934 235717 233851
52790B33851k20J199J613J725K638M378N840N942M669L078K520L482N053N730
$$ 233851 233631 234830 236443 238168 240806 245184 251024 256966 261635 264713 267233 270715 275768 281498
52776B81498M989L763L065K700J992J290J647K961L639K633R72M17J218K072J952
$$ 281498 286487 290250 293315 296015 298007 299297 300944 303905 307544 310177 311149 311566 312784 314856 316808
52761C16808J049M6p41j357k035l114m505n247m325k145m96p04k395m295n633
$$ 316808 317857 317903 317162 315805 313770 310656 306151 300904 296579 294434 293938 293234 290839 286544 280911
52746B80911o281o176n328m128l100k537k517l041l800m377m912n941p153p179
$$ 280911 274630 268454 263126 258998 255898 253361 250844 247803 244003 239626 234714 228773 221620 214441
52732B14441n406l231k318k275j507n4K70j128k326j569K34Q61j92j474j821j451
$$ 214441 209035 205804 203486 201211 199704 199650 199920 198792 196466 194897 195131 195992 195800 194326 192505 191054
52716A91054j033p94p21p41n88j58r9j173k922l713k611o53J80r19k789l588k623
$$ 191054 190021 189227 188506 187765 187177 187019 186920 185747 182825 179112 176501 175848 176028 175109 172320 168732 166109
52699A66109j003l58j018j786j619r57p99j101j114r65j596k928l478k500j315
$$ 166109 165106 164748 163730 161944 160325 159368 158569 157468 156354 155389 153793 150865 147387 144887 143572
52684A43572j542k805l422k844k070j753j319k95O41O32n1m63l27j84m40r81j653
$$ 143572 142030 139225 135803 132959 130889 129136 127817 127522 128163 128795 128744 128281 127954 127770 127330 126349 124696
52667A24696k441l031k756j387L35J356J345P99L18K49R09K438M070M152J762
$$ 124696 122255 119224 116468 115081 115416 116772 118117 118916 119234 119483 120392 122830 126900 131052 132814
52652A32814j855m091l598j547j38k13q61r70n45l64q01j355j197N1J993L787
$$ 132814 130959 126868 123270 121723 121585 121372 120511 119541 118996 118632 117831 116476 115279 115330 117323 121110
52636A21110M684M395L270K131J659J706J438N09j63O47K776M611M917M164L653
$$ 121110 125794 130189 133459 135590 137249 138955 140393 140902 140739 141386 144162 148773 153690 157854 161507
52621A61507L766L667K578R32J63J359L975N922N348K474o92k535l109l194l102
$$ 161507 165273 168940 171518 172450 172613 173972 177947 183869 189217 191691 190999 188464 185355 182161 179059
52606A79059k920l119l892m452l983k965k589l031l319k864k099j562j201q80
$$ 179059 176139 173020 169128 164676 160693 157728 155139 152108 148789 145925 143826 142264 141063 140183
52592A40183p43q28q96q88r99j251j566k097k812k943j776LQ36K36q36j629k313
$$ 140183 139440 138612 137716 136828 135829 134578 133012 130915 128103 125160 123384 123387 124223 124459 123623 121994 119681
52575A19681k762k134l89J022J020M06M68J047J178Q04O02N91K33l67n41j72K02
$$ 119681 116919 114785 114396 115418 116438 116844 117312 118359 119537 120341 120943 121534 121767 121400 120859 120687 120889
52558A20889K39m5p35j697k032q59J379L152L400K341Q87j01k37Q1Q0j46N45K449
$$ 120889 121128 121083 120348 118651 116619 115760 117139 120291 123691 126032 126919 126818 126581 126662 126742 126596 127141 129590
52540A29590L702K201j431m156l813j094J698K865K265J141R74J846K242J229
$$ 129590 133292 135493 134062 129906 126093 124999 126697 129562 131827 132968 133942 135788 138030 139259
52526A39259J05M61J526J372L65R08L456N404M787K860J651J046O4p47k88Q10
$$ 139259 139364 139825 141351 142723 143088 143996 147452 152856 157643 160503 162154 163200 163264 162517 162229 163039
52510A63039J019M78P91K429L988M108K839J049m68j213j138o98k01N62J487J612
$$ 163039 164058 164536 165327 167756 171744 175852 178691 179740 179272 178059 176921 176223 176022 176584 178071 179683
52494A79683L83j125j405n62K8j45k84K0J59j61k23M66J163Q63l12j345j508r06
$$ 179683 180066 178941 177536 176974 177002 176857 176573 176593 176752 176591 176368 176834 177997 178860 178548 177203 175695 174789
52476A74789j39K45J30q3J71J084K310L235L325K527J486J067J391J778J767J591
$$ 174789 174650 174895 175025 174942 175113 176197 178507 181742 185067 187594 189080 190147 191538 193316 195083 196674
52460A96674J336N65n81r34P6J209J102L52L98J026P64m45j163j001j125j737
$$ 196674 198010 198575 197994 197060 197136 198345 199447 199799 200197 201223 201987 201542 200379 199378 198253 196516
52444A96516j275Q60K753K600J255N19K97o72k199k837k283j633j344o97M89J241
$$ 196516 195241 196101 198854 201454 202709 203228 203525 202853 200654 197817 195534 193901 192557 191860 192349 193590
52428A93590R68L92M35J144K139L153L630K825R42o08p82j70L8k15q4N53O98k65
$$ 193590 194558 194950 195385 196529 198668 201821 205451 208276 209218 208610 207828 207658 207696 207481 207397 207950 208648 208383
52410B08383j370j045Q63K584K375O88l15M78J729J677O43K57P59P68j17l97Q85
$$ 208383 207013 205968 206831 209415 211790 212478 212163 212641 214370 216047 216690 216947 217706 218474 218357 217960 218845
52393B18845K416K690K353K824L602L051J297J12j58j081k994l697j703J103J948
$$ 218845 221261 223951 226304 229128 232730 235781 237078 237190 237032 235951 232957 229260 227557 228660 230608
52378B30608R28K06L42j92j956l329k894j344j85N9m07j446k533k503q71J185
$$ 230608 231536 231742 232084 231892 229936 226607 223713 222369 222184 222243 221836 220390 217857 215354 214483 215668
52362B15668K171K054J750J376K83j262j831p40P28P35q30k161j616M95K328K485
$$ 215668 217839 219893 221643 223019 223302 222040 220209 219469 220197 220932 220102 217941 216325 216820 219148 221633
52346B21633J233j68q44p08P3J326K545L044K658J895J248Q05O90J189K125K768
$$ 221633 222866 222698 221854 221146 221219 222545 225090 228134 230792 232687 233935 234740 235430 236619 238744 241512
52330B41512K807K848L481M361M767M481L587K039L10k67J101L189L905K886J783
$$ 241512 244319 247167 250648 255009 259776 264257 267844 269883 270193 269926 271027 274216 278121 281007 282790
52315B82790J893K673K971K706K565K789L014K924K484J769J069R35J670K842
$$ 282790 284683 287356 290327 293033 295598 298387 301401 304325 306809 308578 309647 310582 312252 315094
52301C15094L632L648L189K862K991L316L196K262R51K21O75K047L451L959L175
$$ 315094 318726 322374 325563 328425 331416 334732 337928 340190 341141 341362 342037 344084 347535 351494 354669
52286C54669J648N75P08J588K247K477K711K878K288R02k11k15M31Q82J228K098
$$ 354669 356317 356892 357600 359188 361435 363912 366623 369501 371789 372691 372480 372265 372696 373578 374806 376904
52270C76904L275L692K873J617J092J663K836L989M774N091M976M633M383M472
$$ 376904 380179 383871 386744 388361 389453 391116 393952 397941 402715 407806 412782 417415 421798 426270
52256D26270M757M661L724K317J617K509M534O255O619N852M975M774N438O771
$$ 426270 431027 435688 439412 441729 443346 445855 450389 456644 463263 469115 474090 478864 484302 491073
52242D91073Q291R262R250Q911R582J1597J3401J3179J1187R545R589J0445J0636
$$ 491073 499364 508626 517876 526787 536369 547966 561367 574546 585733 595278 604867 615312 625948
52229F25948J0135R948J0442J1107J1671J2226J2480J1909J0777J0007R912J0041
$$ 625948 636083 646031 656473 667580 679251 691477 703957 715866 726643 736650 746562 756603
52217G56603J0375J1501J3066J3383J1494Q896Q011R318J1004J1265J0068Q645
$$ 756603 766978 778479 791545 804928 816422 825318 833329 842647 853651 864916 874984 883629
52205H83629Q119Q733R711R656P763M969L335L871N407O056N408M630M549M464
$$ 883629 891748 900481 910192 919848 927611 932580 935915 939786 945193 951249 956657 961287 965836 970300
52191I70300L233J005p78j051j30R79J752K202K216J578O65N03J696L611M936
$$ 970300 973533 974538 973760 972709 972579 973558 975310 977512 979728 981306 981971 982474 984170 987781 992717
52176I92717M996M282L768M016N011O473P950Q676P987O268N049N506P057Q124
$$ 992717 997713 1001995 1005763 1009779 1014790 1021263 1029213 1037889 1045876 1052144 1057193 1062699 1069756 1077880
52162A077880Q314Q871J0703J2860J3743J3095J1944J1006J0207R456Q888Q248
$$ 1077880 1086194 1095065 1105768 1118628 1132371 1145466 1157410 1168416 1178623 1188079 1196967 1205215
52150A205215P061N593M720M669M641M011L146K582K176J547Q06K52k54j057k145
$$ 1205215 1212276 1217869 1222589 1227258 1231899 1235910 1239056 1241638 1243814 1245361 1246167 1246419 1246165 1245108 1242963
52135A242963l281m431n506o014n536m488l894m186m651m312l190k373k733l838
$$ 1242963 1239682 1235251 1229745 1223731 1218195 1213707 1209813 1205627 1200976 1196664 1193474 1191101 1188368 1184530
52121A184530m445l991l160k872l244l857m495n049n175m641l859l498l762m504
$$ 1184530 1180085 1176094 1172934 1170062 1166818 1162961 1158466 1153417 1148242 1143601 1139742 1136244 1132482 1127978
52107A127978n667o951p425o400m471l006k701l394m769o220o486m827k525j823
$$ 1127978 1122311 1115360 1107935 1101535 1097064 1094058 1091357 1087963 1083194 1076974 1070488 1065661 1063136 1061313
52093A061313l247n257o526p029o787n344l117j663j748k533l290m417n927o673
$$ 1061313 1058066 1052809 1046283 1039254 1032467 1027123 1024006 1022343 1020595 1018062 1014772 1010355 1004428 997755
52079I97755o172n645n915n837m328k521k158l031l902m738o012o817n986m480
$$ 997755 991583 985938 980023 974186 969858 967337 965179 962148 958246 953508 947496 940679 934693 930213
52065I30213m196m861m528l042k459l700n212n654n563n505m680k644p19k69q05
$$ 930213 926017 921156 916628 913586 911127 907427 902215 896561 890998 885493 880813 878169 877450 877181 876376
52050H76376j075q62n54J8J089K047K228K007K086K331K378K824M580P269R283
$$ 876376 875301 874439 873885 873903 874992 877039 879267 881274 883360 885691 888069 890893 895473 902742 912025
52035I12025R598Q789Q150Q287Q774R052R411J0723J2875J4251J3699J2545J3192
$$ 912025 921623 930412 938562 946849 955623 964675 974086 984809 997684 1011935 1025634 1038179 1051371
52022A051371J5696J7524J7125J5872J5555J5784J5429J5054J5826J7030J6951
$$ 1051371 1067067 1084591 1101716 1117588 1133143 1148927 1164356 1179410 1195236 1212266 1229217
52011A229217J5776J5339J6038J6219J5048J3785J3310J2351R625O320M627M639
$$ 1229217 1244993 1260332 1276370 1292589 1307637 1321422 1334732 1347083 1356708 1363028 1367655 1372294
51999A372294M508L377K347K277K224J000q39j722j321r53j698l156m381n213
$$ 1372294 1376802 1380179 1382526 1384803 1387027 1388027 1387188 1385466 1384145 1383192 1381494 1378338 1373957 1368744
51985A368744o005o604o525o008n911o361o363n202l610k848l081l295k759j834
$$ 1368744 1362739 1356135 1349610 1343602 1337691 1331330 1324967 1319765 1316155 1313307 1310226 1306931 1304172 1302338
51971A302338j282j180r03k3R93J196M98J69J441L620M548L308J572J408K607
$$ 1302338 1301056 1299876 1298973 1298950 1299943 1301139 1301637 1301806 1303247 1306867 1311415 1314723 1316295 1317703 1320310
51956A320310L317K782J907J256J44j704l105l051k369k618m020n631o998q422
$$ 1320310 1323627 1326409 1328316 1329572 1329716 1328012 1324907 1321856 1319487 1316869 1312849 1307218 1300220 1291798
51942A291798r784j0487j0689j1417j3121j5039j6499j7939j9915k1798k2253
$$ 1291798 1282014 1271527 1260838 1249421 1236300 1221261 1204762 1186823 1166908 1145110 1122857
51931A122857k0860j8710j7515j8327k0778k3193k3972k3207k2535k2971k3545
$$ 1122857 1101997 1083287 1065772 1047445 1026667 1003474 979502 956295 933760 910789 887244
51920H87244k2821k1117k0103k0457k1173k1250k0908k0632k0210j9432j8924
$$ 887244 864423 843306 823203 802746 781573 760323 739415 718783 698573 679141 660217
51909F60217j9237j9553j8380j5582j2827j1661j1756j1548j0432r498r764j0375
$$ 660217 640980 621427 603047 587465 574638 562977 551221 539673 529241 519743 509979 499604
51897D99604r571p358n944o752q125p431m762k780k957l984m356m566n429n953
$$ 499604 490033 482675 476731 469979 461854 454423 449661 446881 443924 439940 435584 431018 425589 419636
51883D19636m712k470j476k414l682l849l282l081l606m534n457n903n476m408
$$ 419636 414924 412454 410978 408564 404882 401033 397751 394670 391064 386530 381073 375170 369694 365286
51869C65286l467l012k653k088j657j749k160k385k207j775j429j602k488l501
$$ 365286 361819 358807 356154 354066 352409 350660 348500 346115 343908 342133 340704 339102 336614 333113
51855C33113l537k147l02M67k89j382j355k33M65k57j422j374j75M35m77j838
$$ 333113 329576 327429 327127 327594 327305 325923 324568 324335 324800 324543 323121 321747 321572 322007 321530 319692
51839C19692k433k573k920k984k166j384j817k730k426j142q31j961k640j603
$$ 319692 317259 314686 311766 308782 306616 305232 303415 300685 298259 297117 296286 294325 291685 290082
51825B90082r9K41k28k44K51N58P80J478K206J966Q84K43P28J666K162K184K286
$$ 290082 289983 290224 289996 289752 290003 290561 291341 292819 295025 296991 297875 298118 298846 300512 302674 304858 307144
51808C07144K744L275L362K785J920J372J315J372J269J192J323J417J097K24
$$ 307144 309888 313163 316525 319310 321230 322602 323917 325289 326558 327750 329073 330490 331587 331811
51794C31811j013k089k198j079K17L08n01l27J593L460L243J544O70J341K011
$$ 331811 330798 328709 326511 325432 325649 325957 325456 325129 326722 330182 333425 334969 335639 336980 338991
51779C38991J462M74K12L39r6o54R8K215L778L314J835J437K343K743J659M67
$$ 338991 340453 340927 341139 341478 341382 340728 340826 343041 346819 350133 351968 353405 355748 358491 360150 360617
51763C60617P90J966J988K61j894l129l139k040j93J284J371P60J245L055M306
$$ 360617 361407 363373 365361 365622 363728 360599 357460 355420 355227 356511 357882 358642 359887 362942 367248
51748C67248L737K418J759J371K47j079j205r4R54J184R37O00K59K87J068K117
$$ 367248 370985 373403 375162 376533 376780 375701 374496 374402 375356 376540 377477 378077 378336 378623 379691 381808
51732C81808K475J955J290J096J499K513L820M407L474J827J235K208L323L163
$$ 381808 384283 386238 387528 388624 390123 392636 396456 400863 404337 406164 407399 409607 412930 416093
51718D16093K141J965L649O447Q560Q703P160N226L790K795K087J905J982J151
$$ 416093 418234 420199 423848 430295 438855 447558 454718 459944 463734 466529 468616 470521 472503 473654
51704D73654j196l816m997m826m763n245n146l772k005r65o91p31j117j961k794
$$ 473654 472458 468642 463645 458819 454056 448811 443665 439893 437888 436923 436232 435501 434384 432423 429629
51689D29629k980k457j634q98n34o47r25q71n41n75j217j952k415l030m140n067
$$ 429629 426649 424192 422558 421660 421126 420479 419554 418683 418142 417567 416350 414398 411983 408953 404813 399746
51673C99746m776l286j682q31p37j083j653j995j437j20N02r38l690n250m115
$$ 399746 394970 391684 390002 389171 388434 387351 385698 383703 382266 382146 382648 381710 378020 372770 368655
51658C68655j605k30p43j691j643q10k49m15j004j609k046k392k842l182k510
$$ 368655 367050 366820 366077 364386 362743 361933 361684 361269 360265 358656 356610 354218 351376 348194 345684
51643C45684k37K636M291M331M098M445M609L995L514L913M206L265K004K075
$$ 345684 345447 348083 352374 356705 360803 365248 369857 373852 377366 381279 385485 388750 390754 392829
51629C92829L197L732L461L737M852N350M324K706J717J512J884K717L110J552
$$ 392829 396026 399758 403219 406956 411808 417158 421482 424188 425905 427417 429301 432018 435128 436680
51615D36680k018n433o667o112n592n975o783p454p779p357n794l599k131k282
$$ 436680 434662 429229 422562 416450 410858 404883 398100 390646 382867 375510 369716 366117 363986 361704
51601C61704l557m645m813m493m368m194l158j529q96k095l772m132l399l066
$$ 361704 358147 353502 348689 344196 339828 335634 332476 330947 330051 327956 324184 320052 316653 313587
51587C13587l202k412m45J094J225J004J509J929R16j247k984l230j972J72J898
$$ 313587 310385 307973 307528 308622 309847 310851 312360 314289 315205 313958 310974 307744 305772 305944 307842
51572C07842J619q96l665m388k824n80R93J627J429O34l6J54Q82J040L32p2J136
$$ 307842 309461 308565 304900 300512 297688 297108 298101 299728 301157 301791 301755 301909 302791 303831 304163 304091 305227
51555C05227L766O126O648N403L942L498L672L304K329J922K740M077N119O056
$$ 305227 308993 315119 321767 327170 331112 334610 338282 341586 343915 345837 348577 352654 357773 363829
51541C63829P330Q602R271R303Q871P830O285N137N084N660N966N886N695N072
$$ 363829 371159 379761 389032 398335 407206 415036 421321 426458 431542 437202 443168 449054 454749 459821
51527D59821L622K019J374J612J552O20n14j074r36j74J182K648L463L594L837
$$ 459821 463443 465462 466836 468448 470000 470620 470106 469032 468096 467922 469104 471752 475215 478809 482646
51512D82646M529N018M840M689N460O873P832P908P670P554P168N938L935J764
$$ 482646 487175 492193 497033 501722 507182 514055 521887 529795 537465 545019 552187 558125 562060 563824
51498E63824J2q70n86N04J168M19j140j933j600j542k718m034m103l607m232n612
$$ 563824 563836 562966 562380 562884 564052 564471 563331 561398 559798 558256 555538 551504 547401 543794 539562 533950
51482E33950n549l459j663k259m450o223p173p989q284p028m765l426l718m343
$$ 533950 528401 524942 523279 521020 516570 510347 503174 495185 486901 479873 475108 471682 467964 463621
51468D63621m136l526l217k733j365K58P79J65r1Q96J938J241r88k502j827j80
$$ 463621 459485 455959 452742 450009 448644 448902 449681 449846 449755 450651 452589 453830 452842 450340 448513 448333
51452D48333L43k85k84Q87J436j48k701l731k419j43J451J838J313M59L8O38K052
$$ 448333 448676 448391 448107 448994 450430 450282 447581 443850 441431 441288 442739 444577 445890 446349 446387 447025 449077
51435D49077L300L465K438J070N39J280K484L080L117L413M000M092L837M535
$$ 449077 452377 455842 458280 459350 459889 461169 463653 466733 469850 473263 477263 481355 485192 489727
51421D89727O441P770P117N665N579P099Q591Q801P725N969M606M832O261O439
$$ 489727 496168 503938 511055 516720 522299 529398 537989 546790 554515 560484 565090 569922 576183 582622
51407E82622L824M65n29N57O75j086k302j476n80j890m711o956q229r385j0379
$$ 582622 586446 586911 586382 586939 587614 586528 584226 582750 582170 580280 575569 568613 560384 550999 540620
51392E40620j0448r605q412o998n678n681p594r737r799p740n532m292l409k431
$$ 540620 530172 520567 512155 505157 499479 493798 486204 476467 466668 458928 453396 449104 445695 443264
51378D43264j966k171j935n63Q94J009P6j64J259L395M494L771J984M62k15n86
$$ 443264 441298 439127 437192 436629 437523 438532 438608 438444 439703 443098 447592 451363 453347 453809 453594 453008
51362D53008j470k904m118m491m330m577n803p654r271j0090j0132r545q283o482
$$ 453008 451538 448634 444516 440025 435695 431118 425315 417661 408390 398300 388168 378623 370340 363858
51348C63858m821l980l807l585l167l326m601o258o830n625l403j662j346k147
$$ 363858 359037 355057 351250 347665 344498 341172 336571 330313 323483 317858 314455 312793 311447 309300
51334C09300k884k673j797j337j986l339m361m277l027j285j03j84j259k337k707
$$ 309300 306416 303743 301946 300609 298623 295284 290923 286646 283619 282334 282231 282047 280788 278451 275744
51319B75744k484k153j959j892j955k053j902j346p36o27j131j739j909j646j388
$$ 275744 273260 271107 269148 267256 265301 263248 261346 260000 259264 258637 257506 255767 253858 252212 250824
51304B50824j381j321q02J37J130K055L016L780L828L149K424K071J844J742K498
$$ 250824 249443 248122 247320 247457 248587 250642 253658 257438 261266 264415 266839 268910 270754 272496 274994
51289B74994M297N770N438L802K816L367M492N099N253N418N427M765L223R76
$$ 274994 279291 285061 290499 294301 297117 300484 304976 310075 315328 320746 326173 330938 334161 335137
51275C35137j440l176l761l720l780l742l176k977m573p383q882p873o084n528
$$ 335137 333697 330521 326760 323040 319260 315518 312342 309365 304792 297409 288527 280654 274570 269042
51261B69042n866n699n080m965n109m387k878j939k270l219l907l982l341k311
$$ 269042 263176 257477 252397 247432 242323 237936 235058 233119 230849 227630 223723 219741 216400 214089
51247B14089j826k304k592j357O24J110n19k368k626j643p73m11j66M3K2J5L83
$$ 214089 212263 209959 207367 206010 206634 207744 207225 204857 202231 200588 199815 199404 199238 199281 199303 199318 199701
51230A99701J028J651K227K629K325J105k46p75n15k54l26l58j69j57o75j444
$$ 199701 200729 202380 204607 207236 209561 210666 210420 209645 209130 208876 208550 208192 208023 207866 207191 205747
51214B05747j863j666j174j013j556k441k810k171r86j32N0o1j6K32M03K00m67
$$ 205747 203884 202218 201044 200031 198475 196034 193224 191053 190067 189935 189985 189924 189908 190140 190543 190743 190276
51197A90276j274j653j408j154j644k672l111k235o34N13O43L4q07j426j441q25
$$ 190276 189002 187349 185941 184787 183143 180471 177360 175125 174491 175004 175647 175681 174874 173448 172007 171182
51181A71182j65j0o8L69J253J833J982K513L695M314L112O31j341j822j272l97
$$ 171182 171017 171007 170939 171308 172561 174394 176376 178889 182584 186898 190010 190641 189300 187478 186206 185809
51165A85809N31J202J207Q46J069K100K919K624J645R48O58K42l18m62l0M09L73
$$ 185809 186340 187542 188749 189595 190664 192764 195683 198307 199952 200900 201558 201800 201482 201020 200990 201399 201772
51148B01772J52M93J753L349L964K660N6j891j692K44K264L181K947K012P54m43
$$ 201772 201924 202417 204170 207519 211483 214143 214199 212308 210616 210860 213124 216305 219252 221264 222018 221575
51132B21575j209j473j391q64L49J971L087L019K104J303J185J446J367N87n59
$$ 221575 220366 218893 217502 216638 216987 218958 222045 225064 227168 228471 229656 231102 232469 233056 232497
51117B32497j497k064k596l228l506k910j631l88L95Q40J054Q89M44K80P26J204
$$ 232497 231000 228936 226340 223112 219606 216696 215065 214677 215072 215912 216966 217855 218299 218579 219305 220509
51101B20509Q76j69q78n25L99Q93O31J00k23k84j65j5l16j520l149l931l333k360
$$ 220509 221385 221216 220338 219813 220212 221105 221736 221836 221613 221329 221164 221149 220833 219313 216164 212233 208900 206540
51083B06540k182k541k312j293l94k04m41q02j317j576q25P06J546Q32m77r57
$$ 206540 204358 201817 199505 198212 197818 197614 197173 196371 195054 193478 192653 193359 194905 195737 195260 194303
51067A94303n59k33l66o79j137j835k173j314M23J592J268q2j464k296k297j319
$$ 194303 193744 193511 193145 192466 191329 189494 187321 186007 186430 188022 189290 189208 187744 185448 183151 181832
51051A81832J78J154J026M27L93J080J659J356L25m53k3J629L320L598K241O12
$$ 181832 182010 183164 184190 184617 185010 186090 187749 189105 189430 188977 188954 190583 193903 197501 199742 200354
51035B00354K65J313K551L048L001L001L054K882K696K900L121K406P03o63n32
$$ 200354 200619 201932 204483 207531 210532 213533 216587 219469 222165 225065 228186 230592 231295 230632 230100
51020B30100O79J827K664L633M342L691J745K71O63K214L192K996K359J877J377
$$ 230100 230779 232606 235270 238903 243245 246936 248681 248952 249615 251829 255021 258017 260376 262253 263630
51005B63630O35j00n50p96r00o40Q6P20L80j090k658l122k526k014k186k325j826
$$ 263630 264265 264165 263615 262819 261919 261279 261365 262085 262465 261375 258717 255595 253069 251055 248869 246544 244718
50988B44718j513k449l950m198k685p41M90J143J438J034J90L9P89J028j54j555
$$ 244718 243205 240756 236806 232608 229923 229182 229672 230815 232253 233287 233477 233516 234305 235333 235179 233624
50972B33624j669q84m65l60L93J762K846L427L913M123L677L172L509M273M281
$$ 233624 231955 231071 230606 230246 230639 232401 235247 238674 242587 246710 250387 253559 257068 261341 265622
50957B65622L494K796K175Q72p29j227m45K53K33M61J532K470K347J604J034P03
$$ 265622 269116 271912 274087 274959 274230 273003 272558 272811 273044 273505 275037 277507 279854 281458 282492 283195
50941B83195O66J508L231M782N521O103P009P449O797O006O293P254P701P728
$$ 283195 283861 285369 288600 293382 298903 305006 312015 319464 326261 332267 338560 345814 353515 361243
50927C61243Q438R980J1225J1557J1655J2158J2519J1936J0913J1157J3628J7094
$$ 361243 369681 379661 390886 402443 414098 426256 438775 450711 461624 472781 486409 503503
50915E03503J9219J9314J9211K0811K3463K5130K5630K7064L0740L5408L9201
$$ 503503 522722 542036 561247 582058 605521 630651 656281 683345 714085 749493 788694
50904G88694M1836M3881M5299M6009M6917M8858N1113N2242N1975N1247N0671
$$ 788694 830530 874411 919710 965719 1012636 1061494 1112607 1164849 1216824 1268071 1318742
50893A318742M9980M8519M5545M0613L4572K9510K6540K4248K0586J5714J1574
$$ 1318742 1368722 1417241 1462786 1503399 1537971 1567481 1594021 1618269 1638855 1654569 1666143
50882A666143R037P178N235L601K503J350k8p89n32l16j430l907p017j0523j4588
$$ 1666143 1675180 1682358 1687593 1691194 1693697 1695047 1695019 1694230 1693698 1693382 1691952 1688045 1681028 1670505 1655917
50867A655917j8816k2334k4789k6750k8988l1707l4477l6751l8298l9225l9719
$$ 1655917 1637101 1614767 1589978 1563228 1534240 1502533 1468056 1431305 1393007 1353782 1314063
50856A314063l9901l9844l9402l8146l5906l3427l1724l0552k8469k4966k1547
$$ 1314063 1274162 1234318 1194916 1156770 1120864 1087437 1055713 1025161 996692 971726 950179
50845I50179j9679j8525j6200j2742j0130r350r147q132o553n187l737j456J371
$$ 950179 930500 911975 895775 883033 872903 863553 854406 846274 839721 834534 830797 829341 830712
50832H30712L639M762N074N202N555O060O107N184L885L648M955O519O936O394
$$ 830712 834351 839113 844187 849389 854944 861004 867111 872295 876180 879828 884783 891302 898238 904632
50818I04632N906N576M835L987M062N101N887N825N966P441R776J1523J2117J2270
$$ 904632 910538 916114 920949 924936 928998 934099 939986 945811 951777 959218 968994 980517 992634 1004904
50804A004904J2826J4063J6010J8728K1982K5158K7809L0129L2732L6133M0346
$$ 1004904 1017730 1031793 1047803 1066531 1088513 1113671 1141480 1171609 1204341 1240474 1280820
50793A280820M4848M8994N2759N7072O2916P0028P6957Q2676Q7619R2676R7746
$$ 1280820 1325668 1374662 1427421 1484493 1547409 1617437 1694394 1777070 1864689 1957365 2055111
50782B055111J01976J05114J07715J09908J10785J09300J05214R8816R0396Q0554
$$ 2055111 2157087 2262201 2369916 2479824 2590609 2699909 2805123 2903939 2994335 3074889
50772C074889P0505O1331N2978M4614L5876K7373J9953J4045R686O860N486N383
$$ 3074889 3145394 3206725 3259703 3304317 3340193 3367566 3387519 3401564 3411250 3418110 3423596 3428979
50760C428979O291P749R030R491R045P803N199N8p995j7524k6450l4130m1549
$$ 3428979 3435270 3443019 3452049 3461540 3470585 3478388 3483587 3483645 3475650 3458126 3431676 3397546 3355997
50747C355997m9351n6563o2021o6306p0969p5887p8736p7746p3900o9471o5214
$$ 3355997 3306646 3250083 3188062 3121756 3050787 2974900 2896164 2818418 2744518 2675047 2609833
50736B609833o0206n4048m7573m1175l3898k4945j5111n739L053J2101K1489L0149
$$ 2609833 2549627 2495579 2448006 2406831 2372933 2347988 2332877 2327138 2330191 2342292 2363781 2393930
50724B393930L7320M3560M9870N6202O1272O3775O3491O1112N7262N2106M5904
$$ 2393930 2431250 2474810 2524680 2580882 2642154 2705929 2769420 2830532 2887794 2939900 2985804
50713B985804L9358L2944K6179J8117Q500j921j2060k1054k8438l4472m0164m6343
$$ 2985804 3025162 3058106 3084285 3102402 3110902 3108981 3096921 3075867 3047429 3012957 2972793 2926450
50701B926450n2723n8513o3624o8348p2088p3609p2699p0452o7640o4050n9655
$$ 2926450 2873727 2815214 2751590 2683242 2611154 2537545 2464846 2394394 2326754 2262704 2203049
50690B203049n5193n0971m6413m1404l6856l3105k9061k3930j8494j3437p790
$$ 2203049 2147856 2096885 2050472 2009068 1972212 1939107 1910046 1886116 1867622 1854185 1846395
50679A846395n10P331J3765J8646K3495K9121L5035M0920M6933N2654N7378O1422
$$ 1846395 1845885 1853216 1866981 1885627 1909122 1938243 1973278 2014198 2061131 2113785 2171163 2232585
50667B232585O5787P0376P3947P5770P5940P4143O9778O3502N7031N0888M3772
$$ 2232585 2298372 2368748 2442695 2518465 2594405 2668548 2738326 2801828 2858859 2909747 2953519
50656B953519L4631K4146J3695M074m276j0981j6268k0677k3754k4171k1714j8010
$$ 2953519 2988150 3012296 3025991 3030065 3025789 3014808 2998540 2977863 2954109 2929938 2908224 2890214
50644B890214j4692j1902r297p241o108n358m371l471l395m418o682j0570j5885
$$ 2890214 2875522 2863620 2854323 2847082 2840974 2835616 2831245 2827774 2824379 2819961 2813279 2802709 2786824
50631B786824k1324k5542k8247k9641k9587k8138k6049k3796k0633j5600r076
$$ 2786824 2765500 2739958 2711711 2682070 2652483 2624345 2598296 2574500 2553867 2538267 2529191
50620B529191k411L829J0389J8200K7237L6574M5287N3476O2377P3021Q4881R6562
$$ 2529191 2526780 2530609 2540998 2559198 2586435 2623009 2668296 2721772 2784149 2857170 2942051 3038613
50608C038613J07705J19082J30435J39682J45096J47185J47405J45777J40865
$$ 3038613 3146318 3265400 3395835 3535517 3680613 3827798 3975203 4120980 4261845
50599D261845J31695J18931J04640R1308Q0276P0448N9310M5832L1501J7995N262
$$ 4261845 4393540 4512471 4617111 4708419 4788695 4859143 4918453 4964285 4995786 5013781 5019043
50588E019043p261j9029k9455l9294m9083n7221o1648o2869o3293o3742o2595
$$ 5019043 5011782 4992753 4963298 4924004 4874921 4817700 4756052 4693183 4629890 4566148 4503553
50577D503553n8468n2018m4902l8463l3456k9633k5578k0491j5929j4022j4147
$$ 4503553 4445085 4393067 4348165 4309702 4276246 4246613 4221035 4200544 4184615 4170593 4156446
50566D156446j3533j1511j0741j3257j7539k0861k2725k4138k4930k3876k0788
$$ 4156446 4142913 4131402 4120661 4107404 4089865 4069004 4046279 4022141 3997211 3973335 3952547
50555C952547j6797j2748q699m602m16M140Q880J2493J3727J2915J1321R285O168
$$ 3952547 3935750 3923002 3914303 3909701 3909285 3913425 3922305 3934798 3948525 3961440 3972761 3982046 3988214
50542C988214J877k986q599j6177k6130l7062m7400n7203o7360p7443q5451r0014
$$ 3988214 3990091 3987105 3978506 3962329 3936199 3899137 3851737 3794534 3727174 3649731 3564280 3474266
50530C474266r2071r3790r6048r7614r6981r4366r1340q8720q5686q1127p5108
$$ 3474266 3382195 3288405 3192357 3094743 2997762 2903396 2812056 2723336 2637650 2556523 2481415
50519B481415o8566o2174n6201n1050m7002m3354l8620l2005k4338j7156j1114
$$ 2481415 2412849 2350675 2294474 2243424 2196422 2153068 2114448 2082443 2058105 2040949 2029835
50508B029835n625J2N622J0498J4498J8370K2899K8023L2986L7238M0890M4437
$$ 2029835 2024210 2024222 2029844 2040342 2054840 2073210 2096109 2124132 2157118 2194356 2235246 2279683
50496B279683M8339N2935N8426O4740P1538P8390Q4999R1363R7828J04690J11495
$$ 2279683 2328022 2380957 2439383 2504123 2575661 2654051 2739050 2830413 2928241 3032931 3144426
50485C144426J16962J19932J20299J18622J15163J09873J03211R6248Q9842Q4315
$$ 3144426 3261388 3381320 3501619 3620241 3735404 3845277 3948488 4044736 4134578 4218893
50475D218893P9976P7246P5940P4975P3239P0411O6781O2808N9179N6783N6166
$$ 4218893 4298869 4376115 4452055 4527030 4600269 4670680 4737461 4800269 4859448 4916231 4972397
50464D972397N7270N9917O4001O8964P3759P7851Q1646Q5244Q7338Q6187Q1456
$$ 4972397 5029667 5089584 5153585 5222549 5296308 5374159 5455805 5541049 5628387 5714574 5796030
50453E796030P4299O5768N5893M4235L0610J5131j838j9570l7255n4340p0242
$$ 5796030 5870329 5936097 5991990 6036225 6066835 6081966 6080128 6060558 6023303 5968963 5898721
50442E898721q4011r4944j03429j10220j14899j15958j12580j05450r5485q2967
$$ 5898721 5814710 5719766 5616337 5506117 5391218 5275260 5162680 5057230 4961745 4878778
50432D878778o8570n4079m0878k8475j5933m294L871P354P158M215k154j2711
$$ 4878778 4810208 4756129 4715251 4686776 4670843 4666549 4670420 4677774 4684932 4689147 4686993 4674282
50420D674282k6616m2506o0087p9081r7347j11947j22043j29125j34219j36703
$$ 4674282 4647666 4605160 4545073 4465992 4368645 4256698 4134655 4005530 3871311 3734608
50410C734608j36459j35325j35038j34827j32634j27926j21862j15325j08405
$$ 3734608 3598149 3462824 3327786 3192959 3060325 2932399 2810537 2695212 2586807
50401B586807j01556r5432q9451q2281p4085o6601o0366n3647m5340l7284l1955
$$ 2586807 2485251 2389819 2300368 2218087 2144002 2077401 2017035 1963388 1918048 1880764 1848809
50390A848809k8926k5605k0996j6510j3045r389m457P13M470O992R856J3715J7731
$$ 1848809 1819883 1794278 1773282 1756772 1743727 1734338 1729881 1730594 1735064 1742056 1751912 1765627 1783358
50377A783358K0960K3261K4875K6183K8003L1125L5234L9007M1564M3311M5109
$$ 1783358 1804318 1827579 1852454 1878637 1906640 1937765 1972999 2012006 2053570 2096881 2141990
50366B141990M7378N0202N3548N6698N8348N8095N7417N8025N9673O0561N9897
$$ 2141990 2189368 2239570 2293118 2349816 2408164 2466259 2523676 2581701 2641374 2701935 2761832
50355B761832N8859N8782N9533O0245O0696O1238O2015O3056O4518O5953O5961
$$ 2761832 2820691 2879473 2939006 2999251 3059947 3121185 3183200 3246256 3310774 3376727 3442688
50344C442688O3672O0306N7970N6878N4974N0619M4520L8285L2050K4540J5104
$$ 3442688 3506360 3566666 3624636 3681514 3736488 3787107 3831627 3869912 3901962 3926502 3941606
50333C941606M540o114j6755k7877l9673n1800o3669p4488q3305q9528r3453r5890
$$ 3941606 3946146 3940032 3923277 3895400 3855727 3803927 3740258 3665770 3582465 3492937 3399484 3303594
50321C303594r7020r6013r2046q5463p7537o9291o1042n2839m4557l5586k5368
$$ 3303594 3206574 3110561 3018515 2933052 2855515 2786224 2725182 2672343 2627786 2592200 2566832
50310B566832j4802o260j472J99N88J88k277p864j5753k3821l0475l5715m0734
$$ 2566832 2552030 2545770 2544298 2544497 2545085 2545273 2542996 2535132 2519379 2495558 2465083 2429368 2388634
50297B388634m6461n2342n6764n8811n9131n8808n8096n6901n5605n4346n2133
$$ 2388634 2342173 2289831 2233067 2174256 2115125 2056317 1998221 1941320 1885715 1831369 1779236
50286A779236m8153m3689m1089m0659m0111l7537l3501k9579k6290k3460k1374
$$ 1779236 1731083 1687394 1646305 1605646 1565535 1527998 1494497 1464918 1438628 1415168 1393794
50275A393794k0186j8895j6225j2195p926m189j045J374K678K903K844L598N913
$$ 1393794 1373608 1354713 1338488 1326293 1318367 1314178 1313133 1314507 1317185 1320088 1322932 1326530 1332443
50262A332443R632J3519J6169J7392J8242J9416K0431K0770K0920K1495K2215
$$ 1332443 1342075 1355594 1371763 1389155 1407397 1426813 1447244 1468014 1488934 1510429 1532644
50251A532644K2632K3131K4203K5392K6110K6789K7923K8632K7733K5851K4663
$$ 1532644 1555276 1578407 1602610 1628002 1654112 1680901 1708824 1737456 1765189 1791040 1815703
50240A815703K4114K2273J8401J4310J1769R958O793J823l442p581j0386j2254
$$ 1815703 1839817 1862090 1880491 1894801 1906570 1916528 1923321 1925144 1921702 1914121 1903735 1891481
50228A891481j3580j4873j6688j9128k1777k4275k6609k8769l0427l1311l1700
$$ 1891481 1877901 1863028 1846340 1827212 1805435 1781160 1754551 1725782 1695355 1664044 1632344
50217A632344l2164l2669l2389l0840k8930k8195k8821k9281k8223k6103k4333
$$ 1632344 1600180 1567511 1535122 1504282 1475352 1447157 1418336 1389055 1360832 1334729 1310396
50206A310396k3497k3144k2741k1942k0303j7702j4886j2773j1382j0307r862
$$ 1310396 1286899 1263755 1241014 1219072 1198769 1181067 1166181 1153408 1142026 1131719 1121857
50195A121857j0574j1637j1315r168o722n409m862l856k118m77J80l62j546k171
$$ 1121857 1111283 1099646 1088331 1079163 1072441 1067032 1062170 1058314 1056196 1055719 1055899 1055537 1053991 1051820
50181A051820j128J394L810M628L783K283R45j34j215k313l011k861k108j592
$$ 1051820 1050692 1052086 1055896 1060524 1064307 1066590 1067535 1067401 1066186 1063873 1060862 1058001 1055893 1054301
50167A054301j697j897j923k606m462o158n988m577m283n703o778n993m516m081
$$ 1054301 1052604 1050707 1048784 1046178 1041716 1035558 1029570 1024993 1020710 1015007 1008229 1002236 997720 993639
50153I93639m452m474m233m474m837m472l734l664m008l385j334J023K405K488
$$ 993639 989187 984713 980480 976006 971169 966697 962963 959299 955291 951906 950572 951595 954000 956488
50139I56488J669O75L47J005K125L184M423N940O729N726L495J657P93R9j094
$$ 956488 958157 958832 959179 960184 962309 965493 969916 975856 982585 988311 991806 993463 994256 994355 993261
50124I93261k550l820m590m461l463k698l220m363m488l505l184m595o552p197
$$ 993261 990711 986891 982301 977840 974377 971679 968459 964096 959608 956103 952919 948324 941772 934575
50110I34575o023l774j405J27J23j000j634n62J721L737M552M200L171K048J374
$$ 934575 928552 924778 923373 923500 923623 922623 920989 920427 922148 925885 930437 934637 937808 939856 941230
50095I41230J440K305L813N292N618M372K796K444L104L212K496K488L936N374
$$ 941230 942670 944975 948788 954080 959698 964070 966866 969310 972414 975626 978122 980610 984546 989920
50081I89920N368M768N213O452O844O052N505O232P643Q781R608J0563J1587J2171
$$ 989920 995288 1000056 1005269 1011721 1018565 1024617 1030122 1036354 1043997 1052778 1062386 1072949 1084536 1096707
50067A096707J2051J1521J1209J1560J2418J3136J3238J2773J2005J1220J0955
$$ 1096707 1108758 1120279 1131488 1143048 1155466 1168602 1181840 1194613 1206618 1217838 1228793
50056A228793J1818J3568J4881J4707J3500J2634J2840J3727J4557J4911J4868
$$ 1228793 1240611 1254179 1269060 1283767 1297267 1309901 1322741 1336468 1351025 1365936 1380804
50045A380804J4980J5941J7878K0275K2793K5641K8761L1467L3617L6399M0844
$$ 1380804 1395784 1411725 1429603 1449878 1472671 1498312 1527073 1558540 1592157 1628556 1669400
50034A669400M6100N0451N3798N7903O4125P2164Q1288R1528J03081J15458J28097
$$ 1669400 1715500 1765951 1819749 1877652 1941777 2013941 2095229 2186757 2289838 2405296 2533393
50023B533393J41147J54884J68489J79961J87234J89170J85797J77860J66169
$$ 2533393 2674540 2829424 2997913 3177874 3365108 3554278 3740075 3917935 4084104
50014D084104J51500J35122J19000J04823R2999Q3142P5346O9977O6027O0721
$$ 4084104 4235604 4370726 4489726 4594549 4687548 4770690 4846036 4916013 4982040 5042761
50004E042761N1334L6962J8059m925l1547o0274q8376j13338j34061j50494j62408
$$ 5042761 5094095 5131057 5149116 5144191 5112644 5052370 4963994 4850656 4716595 4566101 4403693
49993D403693j69012j69916j66200j60053j53228j46220j39043j32047j25364
$$ 4403693 4234681 4064765 3898565 3738512 3585284 3439064 3300021 3167974 3042610
49984C042610j18124j09304r9340q9933q2140p5483o9123o3049n7534n2394m7483
$$ 3042610 2924486 2815182 2715842 2625909 2543769 2468286 2399163 2336114 2278580 2226186 2178703
49973B178703m3336m0427l8080l5090l1302k7891k5876k4909k3815k1972j9909
$$ 2178703 2135367 2094940 2056860 2021770 1990468 1962577 1936701 1911792 1887977 1866005 1846096
49962A846096j8506j7839j6923j4724j1421q432p065p217p522o696m693k587j350
$$ 1846096 1827590 1809751 1792828 1778104 1766683 1758251 1751186 1743969 1736447 1729751 1725058 1722471 1721121
49949A721121p58K95K378M784O482P546Q960J1246J3874J6093J7717J9035K0506
$$ 1721121 1720363 1720658 1723036 1727820 1734302 1741848 1750808 1762054 1775928 1792021 1809738 1828773 1849279
49936A849279K2593K5267K7534K8204K7411K6725K7502K9715L2650L5885L9058
$$ 1849279 1871872 1897139 1924673 1952877 1980288 2007013 2034515 2064230 2096880 2132765 2171823
49925B171823M1520M3136M4785M7292N0314N3180N6393O1194O7823P5191Q2454
$$ 2171823 2213343 2256479 2301264 2348556 2398870 2452050 2508443 2569637 2637460 2712651 2795105
49914B795105R0005R8677J08811J20531J34305J50574J69008J88531K08024K26762
$$ 2795105 2885110 2983787 3092598 3213129 3347434 3498008 3667016 3855547 4063571 4290333
49904D290333K44115K59035K69953K75334K74307K66857K53826K37171K19823
$$ 4290333 4534448 4793483 5063436 5338770 5613077 5879934 6133760 6370931 6590754
49895F590754K04334J91354J79953J69457J59962J50722J39316J23367J02230
$$ 6590754 6795088 6986442 7166395 7335852 7495814 7646536 7785852 7909219 8011449
49886H011449P5928M3594M675l8592q1680j20969j55264j84335k07896k26625
$$ 8011449 8087377 8130971 8135646 8097054 8015374 7894405 7739141 7554806 7346910 7120285
49876G120285k42462k56465k67287k72898k73312k70591k66492k61041k53307
$$ 7120285 6877823 6621358 6354071 6081173 5807861 5537270 5270778 5009737 4756430
49867D756430k42763k29875k15850k01951j88879j76749j65623j55567j46143
$$ 4756430 4513667 4283792 4067942 3865991 3677112 3500363 3334740 3179173 3033030
49858C033030j36406j25772j14492j03177r2359q2824p5519p0529o6667o2819
$$ 3033030 2896624 2770852 2656360 2553183 2460824 2378000 2302481 2231952 2165285 2102466
$$ [...]
##END NTUPLES=NMR SPECTRUM
##END=
