##TITLE=coffee_type TORI02-ROVE100A-70-30
COFFEE_meoh_noesyp64 COFFEE_meoh {C:\Bruker\TOPSPIN} Administrator 9
##JCAMPDX= 6.0         $$ Bruker NMR JCAMP-DX V2.0
##DATA TYPE= NMR SPECTRUM
##DATA CLASS= NTUPLES
##ORIGIN= Bruker BioSpin GmbH
##OWNER= Administrator
$$ 1.72 TOPSPIN		Version 2.1
$$ 2012-05-29 13:27:30.798 -0700  Administrator@X
$$ Compression mode = diff/dup
##.OBSERVE FREQUENCY= 400.13188235
##.OBSERVE NUCLEUS= ^1H
##.ACQUISITION MODE= SIMULTANEOUS (DQD)
##.ACQUISITION SCHEME= undefined
##.AVERAGES= 64
##.DIGITISER RES= 22
##SPECTROMETER/DATA SYSTEM= spect
##.PULSE SEQUENCE= noesygpps1d.comp
##.SOLVENT NAME= COFFEE_meoh
##.SHIFT REFERENCE= INTERNAL, COFFEE_meoh, 1, 14.98061
##AUDIT TRAIL= $$ (NUMBER, WHEN, WHO, WHERE, PROCESS, VERSION, WHAT)
$$ ##TITLE= Audit trail, TOPSPIN		Version 2.1
$$ ##JCAMPDX= 5.01
$$ ##ORIGIN= Bruker BioSpin GmbH
$$ ##OWNER= Administrator
$$ $$ Z:/data/jwist/nmr/12-COFFEE-0203/112/pdata/1/auditp.txt
$$ ##AUDIT TRAIL=  $$ (NUMBER, WHEN, WHO, WHERE, PROCESS, VERSION, WHAT)
(   1,<2012-03-02 23:21:23.865 -0500>,<Administrator>,<TOPSPIN>,<go>,<TOPSPIN 2.1>,
      <created by zg
	started at 2012-03-02 23:09:53.631 -0500,
	POWCHK enabled, PULCHK disabled,
       configuration hash MD5:
       1A 1E CE 29 27 FD 77 03 67 4E F0 E3 C4 B2 CB 90
       data hash MD5: 64K
       53 15 75 B8 D6 22 81 27 E0 C7 AB FE 0A 74 A5 F5>)
(   2,<2012-03-02 23:21:28.646 -0500>,<Administrator>,<TOPSPIN>,<audit>,<TOPSPIN 2.1>,
      <user comment:
       ICON-NMR User ID: Administrator
       data hash MD5: 64K
       53 15 75 B8 D6 22 81 27 E0 C7 AB FE 0A 74 A5 F5>)
(   3,<2012-05-29 09:24:35.581 -0700>,<Administrator>,<X>,<proc1d>,<TOPSPIN 2.1>,
      <Start of raw data processing
       efp LB = 0.3 FT_mod = 6 PKNL = 1 PHC0 = 0 PHC1 = 0 SI = 128K 
       data hash MD5: 128K
       99 C3 9A 7B 50 28 8C D8 20 AB 8E D3 67 E0 A6 5D>)
(   4,<2012-05-29 09:24:36.159 -0700>,<Administrator>,<X>,<proc1d>,<TOPSPIN 2.1>,
      <pk PHC0 = 33.55774 PHC1 = 0 
       data hash MD5: 128K
       97 E4 C1 33 02 BF EA 8A 32 21 9B 0C F7 3B 16 C5>)
(   5,<2012-05-29 09:24:37.253 -0700>,<Administrator>,<X>,<proc1d>,<TOPSPIN 2.1>,
      <abs ABSG = 1 
       data hash MD5: 128K
       57 DE 0F 58 15 7C BA CB A6 CD CA AB 16 CF 3A 41>)
(   6,<2012-05-29 09:24:37.409 -0700>,<Administrator>,<X>,<proc1d>,<TOPSPIN 2.1>,
      <abs ABSG = 2 
       data hash MD5: 128K
       77 7C B6 64 F7 89 F4 F3 FF AD 82 68 14 0F 02 82>)
(   7,<2012-05-29 09:24:37.534 -0700>,<Administrator>,<X>,<proc1d>,<TOPSPIN 2.1>,
      <abs ABSG = 3 
       data hash MD5: 128K
       7A B1 98 7E 3A DB 89 22 25 FC 5D C3 C5 83 70 E2>)
(   8,<2012-05-29 09:24:37.612 -0700>,<Administrator>,<X>,<proc1d>,<TOPSPIN 2.1>,
      <abs ABSG = 4 
       data hash MD5: 128K
       37 F9 F1 BC 64 E9 5D 7B F7 05 21 9C 5B AD F0 0C>)
(   9,<2012-05-29 09:24:37.722 -0700>,<Administrator>,<X>,<proc1d>,<TOPSPIN 2.1>,
      <abs ABSG = 5 
       data hash MD5: 128K
$$ [...]
150 150 150 150 150 150 150 150
##$TP07= 0
##$TPNAME0= <>
##$TPNAME1= <>
##$TPNAME2= <>
##$TPNAME3= <>
##$TPNAME4= <>
##$TPNAME5= <>
##$TPNAME6= <>
##$TPNAME7= <>
##$TPOAL= (0..7)
0.5 0.5 0.5 0.5 0.5 0.5 0.5 0.5
##$TPOFFS= (0..7)
0 0 0 0 0 0 0 0
##$TUNHIN= 0
##$TUNHOUT= 0
##$TUNXOUT= 0
##$USERA1= <user>
##$USERA2= <user>
##$USERA3= <user>
##$USERA4= <user>
##$USERA5= <user>
##$V9= 5
##$VALIST= <valist>
##$VCLIST= <CCCCCCCCCCCCCCC>
##$VD= 0
##$VDLIST= <DDDDDDDDDDDDDDD>
##$VPLIST= <PPPPPPPPPPPPPPP>
##$VTLIST= <TTTTTTTTTTTTTTT>
##$WBST= 1024
##$WBSW= 4
##$XGAIN= (0..3)
0 0 0 0
##$XL= 0
##$YL= 0
##$YMAX_a= 14609704
##$YMIN_a= -6894104
##$ZGOPTNS= <>
##$ZL1= 120
##$ZL2= 120
##$ZL3= 120
##$ZL4= 120
##$ABSF1= 14.98061
##$ABSF2= -5.57192
##$ABSG= 5
##$ABSL= 3
##$ALPHA= 0
##$AQORDER= 0
##$ASSFAC= 0
##$ASSFACI= 0
##$ASSFACX= 0
##$ASSWID= 0
##$AUNMP= <proc_prof1d_extract>
##$AXLEFT= 0
##$AXNAME= <>
##$AXNUC= <1H>
##$AXRIGHT= 0
##$AXTYPE= 0
##$AXUNIT= <>
##$AZFE= 0.1
##$AZFW= 0.1
##$BCFW= 0
##$BC_mod= 0
##$BYTORDP= 0
##$COROFFS= 0
##$CY= 15
##$DATMOD= 1
##$DC= 0
##$DFILT= <>
##$DTYPP= 0
##$F1P= 0
##$F2P= 0
##$FCOR= 0.5
##$FTSIZE= 131072
##$FT_mod= 6
##$GAMMA= 0
##$GB= 0
##$INTBC= 1
##$INTSCL= 1
##$ISEN= 128
##$LB= 0.3
##$LEV0= 0
##$LPBIN= 0
##$MAXI= 10000
##$MC2= 0
##$MEAN= 0
##$ME_mod= 0
##$MI= 0
##$NCOEF= 0
##$NC_proc= -3
##$NLEV= 6
##$NOISF1= 0
##$NOISF2= 0
##$NSP= 0
##$NTH_PI= 0
##$NZP= 0
##$OFFSET= 14.98061
##$PC= 1
##$PHC0= 33.55774
##$PHC1= 0
##$PH_mod= 1
##$PKNL= yes
##$PPARMOD= 0
##$PPDIAG= 0
##$PPIPTYP= 0
##$PPMPNUM= 2147483647
##$PPRESOL= 1
##$PSCAL= 4
##$PSIGN= 0
##$PYNMP= <proc.py>
##$REVERSE= no
##$SF= 400.13
##$SI= 131072
##$SIGF1= 0
##$SIGF2= 0
##$SINO= 400
##$SIOLD= 131072
##$SPECTYP= <>
##$SREGLST= <1H.CDCl3>
##$SSB= 0
##$STSI= 131072
##$STSR= 0
##$SW_p= 8223.68421052632
##$SYMM= 0
##$S_DEV= 0
##$TDeff= 65536
##$TDoff= 0
##$TI= <>
##$TILT= no
##$TM1= 0
##$TM2= 0
##$TOPLEV= 0
##$USERP1= <user>
##$USERP2= <user>
##$USERP3= <user>
##$USERP4= <user>
##$USERP5= <user>
##$WDW= 1
##$XDIM= 131072
##$YMAX_p= 505360118
##$YMIN_p= -209220725
##$CURPLOT= <Network HP LaserJet P1505>
##$CURPRIN= <$Network HP LaserJet P1505>
##$DFORMAT= <normdp>
##$LAYOUT= <+/1D_H.xwp>
##$LFORMAT= <normlp>
##$PFORMAT= <normpl>
##$SURQMSG= 1
$$ End of Bruker specific parameters
$$ ---------------------------------
##NTUPLES= NMR SPECTRUM
##VAR_NAME=  FREQUENCY,     SPECTRUM/REAL,   SPECTRUM/IMAG
##SYMBOL=    X,             R,               I
##VAR_TYPE=  INDEPENDENT,   DEPENDENT,       DEPENDENT
##VAR_FORM=  AFFN,          ASDF,            ASDF
##VAR_DIM=   131072,        131072,          131072
##UNITS=     HZ,            ARBITRARY UNITS, ARBITRARY UNITS
##FACTOR=    0.0627417313425165, 1,          1
##FIRST=     8223.62146879498, 598,          -94862
##LAST=      0,             3010,            -94907
##MIN=       0,             -209220725,      0
##MAX=       8223.62146879498, 505360118,    0
$$ Real data points
##PAGE= N=1
##DATA TABLE= (X++(R..R)), XYDATA
$$ [...]
62969B662111L5500L3913L2823L1106K7135K0900J3862O648j573j0948j9754k6540
$$ 2662111 2697611 2731524 2764347 2795453 2822588 2843488 2857350 2863998 2862425 2851477 2831723 2805183
62957B805183l2136l8021m3591m6831m7202m5943m3810m0542l6643l3567l1330
$$ 2805183 2773047 2735026 2691435 2644604 2597402 2551459 2507649 2467107 2430464 2396897 2365567
62946B365567k7960k2350j6057j1062p174l044J480N620R314J2926J6107J8550
$$ 2365567 2337607 2315257 2299200 2288138 2280964 2277920 2279400 2285020 2294334 2307260 2323367 2341917
62934B341917K1262K5087K8363K8206K4558K0931K0278K1731K2486K1508J9802
$$ 2341917 2363179 2388266 2416629 2444835 2469393 2490324 2510602 2532333 2554819 2576327 2596129
62923B596129J8000J5570J2225Q377L803k583j0746j8590k4365k9243l5916m4737
$$ 2596129 2614129 2629699 2641924 2650301 2654104 2651521 2640775 2622185 2597820 2568577 2532661 2487924
62911B487924n2903n7821n9790o0634o1212o1466o1751o2358o2355o0552n7351
$$ 2487924 2435021 2377200 2317410 2256776 2195564 2134098 2072347 2009989 1947634 1887082 1829731
62900A829731n4082n0846m6778m2309l9168l7691l6089l3133k9777k7258k5296
$$ 1829731 1775649 1724803 1678025 1635716 1596548 1558857 1522768 1489635 1459858 1432600 1407304
62889A407304k3455k2523k2830k2614j9989j5804j2603j1245j0451r422q938r638
$$ 1407304 1383849 1361326 1338496 1315882 1295893 1280089 1267486 1256241 1245790 1236368 1227430 1217792
62877A217792j0834j1652j2102j2461j2605j2449j2336j2518j2818j3048j3195
$$ 1217792 1206958 1195306 1183204 1170743 1158138 1145689 1133353 1120835 1108017 1094969 1081774
62866A081774j3014j2090j0513q913p673o698o050o104o816p485p634p564p621
$$ 1081774 1068760 1056670 1046157 1037244 1029571 1022873 1016823 1010719 1003903 996418 988784 981220 973599
62853I73599p439o484n051m105m200m907n300m783l463k008j202j334j907k047
$$ 973599 966160 959676 954625 950520 946320 941413 936113 931330 927867 925859 924657 923323 921416 919369
62839I19369j379m03Q7j87q88j558j825j347k04O63J97j258k088j573r94j631
$$ 919369 917990 917587 917674 917487 916599 915041 913216 911869 911665 912328 912525 911267 909179 907606 906612 904981
62823I04981k615k193n01O08L79N7P35J920K813L500M133M239L672L185L174K929
$$ 904981 902366 900173 899672 900280 900659 900716 901451 903371 906184 909684 913817 918056 921728 924913 928087 931016
62807I31016J947R95R99J775K660L378L483K163l00j978j507M6P68M70K76N26
$$ 931016 932963 933958 934957 936732 939392 942770 946253 948416 948116 946138 944631 944677 945445 945915 946191 946717
62791I46717P23R89J894L064L437K733J578M33l32Q7J900L576L379J846J174K134
$$ 946717 947440 948429 950323 953387 956824 959557 961135 961568 961236 961323 963223 966799 970178 972024 973198 975332
62775I75332L258L138K001P16l12q71q09m68k42K55J428K229J133j357l021l031
$$ 975332 978590 981728 983729 984445 984133 983262 982453 981985 981743 981998 983426 985655 986788 985431 982410 979379
62759I79379k919l829m727m463l790l982m743m978m524l690k177n7J048k98k856
$$ 979379 976460 972631 967904 963441 959651 955669 950926 945948 941424 937734 935557 935500 936548 936250 933394
62744I33394l860k611j092o98k48J857M907O684O345N274N301P086J0156J3606
$$ 933394 929534 926923 925831 925133 924885 926742 931649 938333 944678 949952 955253 962339 972495 986101
62730I86101J6466J8120J8851J9562K0679K1697K2157K2588K3954K6605L0320
$$ 986101 1002567 1020687 1039538 1059100 1079779 1101476 1123633 1146221 1170175 1196780 1227100
62719A227100L4929M0073M4716M8110N1073N5065N9868O3578O5363O6695O8925
$$ 1227100 1262029 1302102 1346818 1394928 1446001 1501066 1560934 1624512 1689875 1756570 1825495
62708A825495P1068P1337O9805O7772O5129O0177N2033M1704L0546J8992P125
$$ 1825495 1896563 1967900 2037705 2105477 2170606 2230783 2282816 2324520 2355066 2374058 2381183
62697B381183m594j5725k6210l6030m5004n3109o0372o6394p0545p2731p3401
$$ 2381183 2376589 2360864 2334654 2298624 2253620 2200511 2140139 2073745 2003200 1930469 1857068
62686A857068p2892p1401o9489o7784o6052o3319n9165n4362n0043m6662m3878
$$ 1857068 1784176 1712775 1643286 1575502 1509450 1446131 1386966 1332604 1282561 1235899 1192021
62675A192021m1045l7747l4104l0572k7301k4113k1183j9174j8314j7982j7675
$$ 1192021 1150976 1113229 1079125 1048553 1021252 997139 975956 956782 938468 920486 902811
62664I02811j7489j7023j4988j1112p479o287o840o375l641o1K532L730M090M365
$$ 902811 885322 868299 853311 842199 834720 828433 821593 815218 811577 811516 814048 817778 821868 826233
62650H26233N534Q180J1590J4374J6136J7417J8303J8574J9122K1511K5743L0019
$$ 826233 831767 839947 851537 865911 882047 899464 917767 936341 955463 976974 1002717 1032736
62638A032736L3187L5974L9281M2762M5823M8724N1827N4747N6993N8656N9916
$$ 1032736 1065923 1101897 1141178 1183940 1229763 1278487 1330314 1385061 1442054 1500710 1560626
62627A560626O0706O1100O1098N9792N5940M9732M2682L5306K6330J4909K403
$$ 1560626 1621332 1682432 1743530 1803322 1859262 1908994 1951676 1986982 2013312 2028221 2030624
62616B030624r072j8864k7687l6104m3970n0815n6117n9701o2101o4006o5127
$$ 2030624 2021552 2002688 1975001 1938897 1894927 1844112 1787995 1728294 1666193 1602187 1537060
62605A537060o4556o2324n9649n7383n5241n2699m9580m5715m1288l7485l5305
$$ 1537060 1472504 1410180 1350531 1293148 1237907 1185208 1135628 1089913 1048625 1011140 975835
62594I75835l3726l0884k7160k4864k4342k2933j8988j4618j2716j3160j3817
$$ 975835 942109 911225 884065 859201 834859 811926 792938 778320 765604 752444 738627
62583G38627j3787j3604j3377j2701j1706j0664r264p572o734p380q291q023o912
$$ 738627 724840 711236 697859 685158 673452 662788 653524 645952 639218 631838 623547 615524 608612
62570F08612n925m747k727q46o77k009l130l044j860K97L022M856M657L468L372
$$ 608612 602687 597940 595213 594367 593690 591681 588551 585507 583647 583944 586966 591822 596479 599947 603319
62555F03319M753O298P274Q089Q772Q729Q146Q068Q919J0176J1480J2864J3951
$$ 603319 608072 614370 621644 629733 638505 647234 655380 663448 672367 682543 694023 706887 720838
62542G20838J4242J4059J4095J4236J4138J4570J6684K0001K2742K4146K5181
$$ 720838 735080 749139 763234 777470 791608 806178 822862 842863 865605 889751 914932
62531I14932K6800K8856L0864L2612L3835L4378L4760L5639L6731L7060L6004
$$ 914932 941732 970588 1001452 1034064 1067899 1102277 1137037 1172676 1209407 1246467 1282471
62520A282471L3270K8491K2066J5662J0482N665j65o504j1996j6951k2555k8022
$$ 1282471 1315741 1344232 1366298 1381960 1392442 1398107 1397942 1391438 1379442 1362491 1339936 1311914
62508A311914l1251l2235l3177l4882l5728l4801l3404l2463l0983k8380k6068
$$ 1311914 1280663 1248428 1215251 1180369 1144641 1109840 1076436 1043973 1012990 984610 958542
62497I58542k5155k4653k3430k2098k1273j9914j7312j5120j5206j6679j7181
$$ 958542 933387 908734 885304 863206 841933 822019 804707 789587 774381 757702 740521
62486G40521j6262j5351j5082j4679j3620j2148j0369q359o869o407o035m618
$$ 740521 724259 708908 693826 679147 665527 653379 643010 634651 627782 621375 615340 610722
62474F10722k816k196k646k510j215J68J084K312M147N609O228P035Q783J0550
$$ 610722 607906 605710 603064 600554 599339 599507 600591 602903 607050 612659 618887 625922 634705 645255
62460F45255J1263J1440J2263J3717J4937J5805J6944J8455J9932K1526K3807
$$ 645255 656518 667958 680221 693938 708875 724680 741624 760079 780011 801537 825344
62449H25344K6448K8229K8736K9135L0708L3252L5426L6146L5102L2504K8980
$$ 825344 851792 880021 908757 937892 968600 1001852 1037278 1073424 1108526 1141030 1170010
62438A170010K5384K2003J8101J2916O900J246l670q558j3862j8980k3091k6043
$$ 1170010 1195394 1217397 1235498 1248414 1255314 1256560 1252890 1244332 1230470 1211490 1188399 1162356
62426A162356k8022k9039k9162k8695k7715k6052k4116k2936k2711k2089j9854
$$ 1162356 1134334 1105295 1076133 1047438 1019723 993671 969555 946619 923908 901819 881965
62415H81965j6818j4908j4597j4321j2605r852p743p292p805p451n043j454J031
$$ 881965 865147 850239 835642 821321 808716 798864 791121 783829 776024 768573 763530 762076 763107
62402G63107J161Q9k09P45J955K769L491M380N204N946P019Q518R959J0776J0610
$$ 763107 764268 764357 764148 764893 766848 769617 773108 777488 782692 788638 795657 804175 814134 824910 835520
62387H35520R324P513O596P287Q258P584N368L412K318O66k432n764p953r457
$$ 835520 844844 852357 858953 866240 874498 882082 887450 890862 893180 893846 891414 885650 877697 868240
62373H68240j1412j3586j4876j5018j4559j3686j2323j0977j0302j0009r161p381
$$ 868240 856828 843242 828366 813348 798789 785103 772780 761803 751501 741492 732331 724950
62361G24950n118k954j408r01j116p72R21L072M345M976O224Q132R414R771J0545
$$ 724950 719832 716878 715470 714569 713453 712681 713602 716674 721019 725995 732219 740351 749765 759536 770081
62346G70081J2423J4018J3888J2807J2531J3148J3301J2710J2661J3589J3879
$$ 770081 782504 796522 810410 823217 835748 848896 862197 874907 887568 901157 915036
62335I15036J1994Q669N777L876K147K58j237k183l044l559k690n50R90O39m57
$$ 915036 927030 935699 941476 945352 947499 947757 946520 944337 941293 937734 935044 934494 935484 936123 935666
62320I35666l67J083K838M933Q406J3015J6925J9187K1002K3764K7063K9730L1959
$$ 935666 935299 936382 939220 944153 952559 965574 982499 1001686 1022688 1046452 1073515 1103245 1135204
62307A135204L5106L9702M4755M9244N3476N8480O4346O9694P3041P4397P4954
$$ 1135204 1170310 1210012 1254767 1304011 1357487 1415967 1480313 1550007 1623048 1697445 1772399
62296A772399P5173P3975P0307O4606N7841M9750L9489K7654J6082N469n167j6115
$$ 1772399 1847572 1921547 1991854 2056460 2114301 2164051 2203540 2231194 2247276 2252745 2247578 2231463
62284B231463k5701l2519l7714m3600n0675n7325o1972o4215o4065o1510n7214
$$ 2231463 2205762 2173243 2135529 2091929 2041254 1983929 1921957 1857742 1793677 1732167 1674953
62273A674953n2690m9224m7051m5665m4384m2441l9292l5256l1458k8720k6721
$$ 1674953 1622263 1573039 1525988 1480323 1435939 1393498 1354206 1318950 1287492 1258772 1232051
62262A232051k4572k1964j9294j6875j4515j2068r869q258o992n708m668m355
$$ 1232051 1207479 1185515 1166221 1149346 1134831 1122763 1112894 1104636 1097644 1091936 1087268 1082913
62250A082913m257l129q48R04O51q02j471r01n22j320k534l100l227l755m688
$$ 1082913 1078656 1075527 1074679 1075583 1076234 1075432 1073961 1073060 1072538 1071218 1068684 1065584 1062357 1058602 1053914
62235A053914n250n091m646m385m169l497k132m35J042K240L661N510P127P810
$$ 1053914 1048664 1043573 1038927 1034542 1030373 1026876 1024744 1024309 1025351 1027591 1031252 1036762 1043889 1051699
62221A051699P845Q144R071J0307J1719J3481J5373J6807J7646J8336J9229K0567
$$ 1051699 1059544 1067688 1076759 1087066 1098785 1112266 1127639 1144446 1162092 1180428 1199657 1220224
62209A220224K2988K6950L1605L5339L7758M0071M3369M7635N2636N8432O4338
$$ 1220224 1243212 1270162 1301767 1337106 1374864 1414935 1458304 1505939 1558575 1617007 1681345
62198A681345O8827P1292P2818P4267P4730P2848O8616O2618N4506M3676L0975
$$ 1681345 1750172 1821464 1894282 1968549 2043279 2116127 2184743 2247361 2301867 2345543 2376518
62187B376518J8290O627m315j4878k4835l3918m2025m8955n4470n8408o0327n9735
$$ 2376518 2394808 2401435 2397120 2382242 2357407 2323489 2281464 2232509 2178039 2119631 2059304 1999569
62175A999569n7374n5249n4336n3077m9466m3952l8666l4383l0158k5718k2101
$$ 1999569 1942195 1886946 1832610 1779533 1730067 1686115 1647449 1613066 1582908 1557190 1535089
62164A535089j9539j6799j3360j0448q781o971l618J26J952J608R36Q73L53j214
$$ 1535089 1515550 1498751 1485391 1474943 1466162 1459191 1455573 1455699 1457651 1459259 1460195 1461068 1461421 1460207
62150A460207k173n71K949N794O730P014P971Q987R098R354J1720J5869J9193
$$ 1460207 1458034 1457463 1460412 1466206 1472936 1479950 1487921 1496908 1506006 1515360 1527080 1542949 1562142
62137A562142K0478K1625K4589K8329L0587L1573L3615L7484M1294M3408M4500
$$ 1562142 1582620 1604245 1628834 1657163 1687750 1719323 1752938 1790422 1831716 1875124 1919624
62126A919624M5882M7225M7097M4811M0780L5730L0490K6072K3054K1038J9288
$$ 1919624 1965506 2012731 2059828 2104639 2145419 2181149 2211639 2237711 2260765 2281803 2301091
62115B301091J7700J6722J6722J7879K0373K4027K8082L1743L4933L8018M1017
$$ 2301091 2318791 2335513 2352235 2370114 2390487 2414514 2442596 2474339 2509272 2547290 2588307
62104B588307M3393M4404M3295L9614L3896K7745K2560J8158J3288P464J647l011
$$ 2588307 2631700 2676104 2719399 2759013 2792909 2820654 2843214 2861372 2874660 2882124 2883771 2880760
62092B880760o446r349j2172j4851j7192j8919j9455j8266j5587j2501j0012q168
$$ 2880760 2874314 2864965 2852793 2837942 2820750 2801831 2782376 2764110 2748523 2736022 2726010 2717842
62080B717842o242l734r16J655L938O368R006J1140J2132J2479J3483J5788J8687
$$ 2717842 2711600 2707866 2706950 2708605 2712543 2718911 2727917 2739057 2751189 2763668 2777151 2792939 2811626
62067B811626K1176K3158K5224K7552K9715L1439L2952L4590L6566L9128M2361
$$ 2811626 2832802 2855960 2881184 2908736 2938451 2969890 3002842 3037432 3073998 3113126 3155487
62056C155487M5722M8322M9797N0478N0725N0791N1259N2585N4033N4147N2876
$$ 3155487 3201209 3249531 3299328 3349806 3400531 3451322 3502581 3555166 3609199 3663346 3716222
62045C716222N2127N3434N6096N8473O0048O1117O1595O1720O2941O6152O9633
$$ 3716222 3768349 3821783 3877879 3936352 3996400 4057517 4119112 4180832 4243773 4309925 4379558
62034D379558P1014P1054P3123P8529Q4677Q8674R0687R2527R4885R7381R9853
$$ 4379558 4450572 4521626 4594749 4673278 4757955 4846629 4937316 5029843 5124728 5222109 5321962
62023E321962J01853J02018R9695R6503R4743R4839R5630R6529R7763R8805R8156
$$ 5321962 5423815 5525833 5625528 5722031 5816774 5911613 6007243 6103772 6201535 6300340 6398496
62012F398496R4965Q9968Q4735Q0618P8089P6340P3897P0311O6734O4047O1225
$$ 6398496 6493461 6583429 6668164 6748782 6826871 6903211 6977108 7047419 7114153 7178200 7239425
62001G239425N6719N0697M4544L8633L2230K5392J9245J4153R114L313k846q672
$$ 7239425 7296144 7346841 7391385 7430018 7462248 7487640 7506885 7521038 7530152 7533465 7530619 7521947
61989G521947j4047j9012k3429k7392l1189l4603l7033l8297l8609l7893l6149
$$ 7521947 7507900 7488888 7465459 7438067 7406878 7372275 7335242 7296945 7258336 7220443 7184294
61978G184294l4410l3988l4621l4626l3106l0782k8431k5949k3466k1852k1309
$$ 7184294 7149884 7115896 7081275 7046649 7013543 6982761 6954330 6928381 6904915 6883063 6861754
61967F861754k0779j9541j8221j7331j6156j4246j2622j2186j2033j0938r473
$$ 6861754 6840975 6821434 6803213 6785882 6769726 6755480 6742858 6730672 6718639 6707701 6698228
61956F698228q848q511o935m342k412j329N61L761O534P713Q504J0217J2026J2653
$$ 6698228 6689380 6680869 6673934 6669592 6667180 6665851 6666412 6670173 6676707 6684420 6692924 6703141 6715167 6727820
61942F727820J2713J3284J3243J0369M708j607p958j6208k7214l8598m7483n4005
$$ 6727820 6740533 6753817 6767060 6777429 6782137 6780530 6772572 6756364 6729150 6690552 6643069 6589064
61930F589064o0524o8248p6204q2783q6829q7651q5684q3119q2208q2707q2219
$$ 6589064 6528540 6460292 6384088 6301305 6214476 6126825 6041141 5958022 5875814 5793107 5710888
61919E710888p9364p5428p2318p0197o7938o4934o1559n8314n5423n2928n0641
$$ 5710888 5631524 5556096 5483778 5413581 5345643 5280709 5219150 5160836 5105413 5052485 5001844
61908E001844m8221m5667m3427m1666l9827l7190l3565k9311k5213k2352k1262
$$ 5001844 4953623 4907956 4864529 4822863 4783036 4745846 4712281 4682970 4657757 4635405 4614143
61897D614143k0971j9738j7166j4520j2482r804n275M0L993O288Q751J2888J8394
$$ 4614143 4593172 4573434 4556268 4541748 4529266 4519462 4514187 4514227 4518220 4524508 4533259 4546147 4564541
61884D564541K4202K9759L4891L9300M2724M5213M7017M8451M9852N1391N2868
$$ 4564541 4588743 4618502 4653393 4692693 4735417 4780630 4827647 4876098 4925950 4977341 5030209
61873E030209N3949N4489N4646N4952N6165N8323N9976N9538N7838N7987O1934
$$ 5030209 5084158 5138647 5193293 5248245 5304410 5362733 5422709 5482247 5540085 5598072 5660006
61862E660006O8418P5545Q3836R4974J08654J23168J38737J57706J81002K06576
$$ 5660006 5728424 5803969 5887805 5982779 6091433 6214601 6353338 6511044 6692046 6898622
61852F898622K32131K57714K84758L14126L46056L80750M17895M56615M96752
$$ 6898622 7130753 7388467 7673225 7987351 8333407 8714157 9132052 9588667 10085419
61843A0085419N39227N84135O29342O71887P09762P40951P61081P63327P40525
$$ 10085419 10624646 11208781 11838123 12510010 13219772 13960723 14721804 15485131 16225656
61834A6225656O86766N97686M71429L10984J25915o8767k56590m24215n63829
$$ 16225656 16912422 17510108 17981537 18292521 18418436 18349669 18093079 17668864 17105035
61825A7105035o72393p49597p97066q18659q19651q04651p76740p38683o93872
$$ 17105035 16432642 15683045 14885979 14067320 13247669 12443018 11666278 10927595 10233723
61816A0233723o45429n95267n44886m96393m51623m10621l72058l35174l00508
$$ 10233723 9588294 8993027 8448141 7951748 7500125 7089504 6717446 6382272 6081764
61807F081764k68848k40338k14800j92042j71371j51394j31143j11248r3288p7742
$$ 6081764 5812916 5572578 5357778 5165736 4994365 4842971 4711828 4600580 4507292 4429550
61797D429550o3102m7594l1555j7333o606J571R496J8055K5795L0506L1184K8521
$$ 4429550 4366448 4318854 4287299 4269966 4263360 4264931 4274427 4292482 4318277 4348783 4379967 4408488
61785D408488K4095J9110J3526O532j830r898j5785j9216k1151k1872k0553j6826
$$ 4408488 4432583 4451693 4465219 4471751 4469921 4460023 4444238 4425022 4403871 4381999 4361446 4344620
61773D344620j1669o266p76N077J0702J4612J5587J3640R837N219j29o821j4878
$$ 4344620 4332951 4326685 4325909 4330986 4341688 4356300 4371887 4385527 4395364 4400583 4400454 4393633 4378755
61760D378755k3175l0544l6983m2964m7956n0465m9515m5379l9060l1781k4597
$$ 4378755 4355580 4325036 4288053 4245089 4197133 4146668 4097153 4051774 4012714 3980933 3956336
61749C956336j7588r586L09J1171K1323L0719M0883N2500O4558P6066Q7223R8460
$$ 3956336 3938748 3929162 3929471 3940642 3961965 3992684 4033567 4086067 4150625 4226691 4313914 4412374
61737D412374J09759J21343J33818J47069J60331J73875J89180K06769K25319
$$ 4412374 4522133 4643476 4777294 4924363 5084694 5258569 5447749 5654518 5879837
61728E879837K43810K63216K85081L09680L36686L66474L99584M36066M76626
$$ 5879837 6123647 6386863 6671944 6981624 7318310 7684784 8084368 8520434 8997060
61719H997060N23329N77701O38907P05228P76569Q54042R37515J024965J113631
$$ 8997060 9520389 10098090 10736997 11442225 12218794 13072836 14010351 15035316 16148947
61710A6148947J200552J282231J354725J413155J449656J452460J408661J308005
$$ 16148947 17349499 18631730 19986455 21399610 22849266 24301726 25710387 27018392
61702B7018392J143943R14024O23519K89563o0931l99627p04020r59357j158096
$$ 27018392 28162335 29076359 29699878 29989441 29928510 29528883 28824863 27865506 26707410
61693B6707410j299601j388493j431247j434420j405753j354435j288403j212265
$$ 26707410 25407809 24019316 22588069 21153649 19747896 18393461 17105058 15892793
61685A5892793j129039j042701r57555q76047p98915p27081o61617o01937n45943
$$ 15892793 14763754 13721053 12763498 11887451 11088536 10361455 9699838 9097901 8551958
61676H551958m92777m44239m02612l67800l37434l09218k82231k56344k31780
$$ 8551958 8059181 7614942 7212330 6844530 6507096 6197878 5915647 5659303 5427523
61667E427523k09569j91197j76822j64556j52594j41551j33330j27962j23334
$$ 5427523 5217954 5026757 4849935 4685379 4532785 4391234 4257904 4129942 4006608
61658D006608j18381j14603j13181j12233j08809j02777r6711r2217q8332q3667
$$ 4006608 3888227 3773624 3660443 3548210 3439401 3336624 3239913 3147696 3059364 2975697
61648B975697p8276p2836o7545o2562n8331n4656n0537m5769m1684l9440l8369
$$ 2975697 2897421 2824585 2757040 2694478 2636147 2581491 2530954 2485185 2443501 2404061 2365692
61637B365692l7055l5347l4246l4117l4079l3087l1045k8808k7451k7221k6984
$$ 2365692 2328637 2293290 2259044 2224927 2190848 2157761 2126716 2097908 2070457 2043236 2016252
61626B016252k5344k2665k1047k1506k2213k0729j7346j4581j3760j3908j3988
$$ 2016252 1990908 1968243 1947196 1925690 1903477 1882748 1865402 1850821 1837061 1823153 1809165
61615A809165j4229j4561j3652j0952q217p371p730p114n323m602o508r953j2774
$$ 1809165 1794936 1780375 1766723 1755771 1747554 1740183 1732453 1725339 1720016 1715414 1708906 1698953 1686179
61602A686179j3990j3889j3071j2169j1647j1080r456o835m845m631n090m178
$$ 1686179 1672189 1658300 1645229 1633060 1621413 1610333 1600877 1594042 1589197 1584566 1579476 1575298
61590A575298j434J907M789P031Q425Q579P828P193P091O944O276N331M476L864
$$ 1575298 1573864 1575771 1580560 1587591 1596016 1604595 1612423 1619616 1626707 1633651 1639927 1645258 1649734 1653598
61576A653598L820M606N631N974N988P185R965J2638J3504J2928J2300J1807J0409
$$ 1653598 1657418 1662024 1667655 1673629 1679617 1686802 1696767 1709405 1722909 1735837 1748137 1759944 1770353
61563A770353P557L743m42m795r038j2821j6253j9769k3255k5787k6497k5435
$$ 1770353 1777910 1781653 1781211 1776416 1767378 1754557 1738304 1718535 1695280 1669493 1642996 1617561
61551A617561k3484k1619k0206j9008j7833j7062j7123j7666j7727j6809j5237
$$ 1617561 1594077 1572458 1552252 1533244 1515411 1498349 1481226 1463560 1445833 1429024 1413787
61540A413787j3577j2308j1843j1884j0945p829l746j349j192r41J051L297L863
$$ 1413787 1400210 1387902 1376059 1364175 1353230 1345401 1341655 1340306 1339114 1338173 1339224 1342521 1346384
61527A346384L667M878P257Q713R018J0256J3364J6656J8466J9275K0297K1632
$$ 1346384 1350051 1354929 1362186 1370899 1379917 1390173 1403537 1420193 1438659 1457934 1478231 1499863
61515A499863K2895K4394K6555K9098L1771L5134L9604M4294M7614M8808M8424
$$ 1499863 1522758 1547152 1573707 1602805 1634576 1669710 1709314 1753608 1801222 1850030 1898454
61504A898454M7715M7797M8782M9273M7387M2784L7292L3173L1141L0271K9171
$$ 1898454 1946169 1993966 2042748 2092021 2139408 2182192 2219484 2252657 2283798 2314069 2343240
61493B343240K7010K4121K1920K1559K2400K2601K1402J9806J8519J6561J2852
$$ 2343240 2370250 2394371 2416291 2437850 2460250 2482851 2504253 2524059 2542578 2559139 2571991
61482B571991Q141M054Q72k372o031r452j2327j5088j7649j8814j7598j4522j1209
$$ 2571991 2580132 2584186 2585058 2582686 2576655 2567203 2554876 2539788 2522139 2503325 2485727 2471205 2459996
61469B459996q953p798o597l818J237P758J4149J9513K4217K9179L4999M1683
$$ 2459996 2451043 2443245 2436648 2432830 2434067 2441825 2455974 2475487 2499704 2528883 2563882 2605565
61457B605565M8698N5301O1371O8063P6990Q8403J00684J12161J23179J35639
$$ 2605565 2654263 2709564 2770935 2838998 2915988 3004391 3105075 3217236 3340415 3476054
61447C476054J50620J67093J83342J98954K14850K31616K48714K65404K81494
$$ 3476054 3626674 3793767 3977109 4176063 4390913 4622529 4871243 5136647 5418141
61438E418141K96320L07476L11592L06611K92567K69975K38439J97625J49222
$$ 5418141 5714461 6021937 6333529 6640140 6932707 7202682 7441121 7638746 7787968
61429G787968R6976M4580n958n3787r7598j35005j63634j82814j94102k00013
$$ 7787968 7884944 7929524 7923566 7869779 7772181 7637176 7473542 7290728 7096626 6896613
61419F896613k02043k00022j93343j82483j68954j54051j38241j21761j05244
$$ 6896613 6694570 6494548 6301205 6118722 5949768 5795717 5657476 5535715 5430471
61410E430471q9372p4252n9542m5074l1143j8183o378M438J4588K4287L3511M2145
$$ 5430471 5341099 5266847 5207305 5162231 5131088 5112905 5106527 5110965 5125553 5149840 5183351 5225496
61398E225496N0163N7408O3267O7076O9154P0914P3287P5341P5340P3257P1326
$$ 5225496 5275659 5333067 5396334 5463410 5532564 5603478 5676765 5752106 5827446 5900703 5972029
61387E972029P1616P3775P5770P6281P5556P4225P2304O9479O5694O1265N6784
$$ 5972029 6043645 6117420 6193190 6269471 6345027 6419252 6491556 6561035 6626729 6687994 6744778
61376F744778N2857M9432M5442L9878L3127K6489K0324J3668N916k183r892j7766
$$ 6744778 6797635 6847067 6892509 6932387 6965514 6992003 7012327 7025995 7031911 7029728 7019836 7002070
61364G002070k6380l4513l9972m2318m3563m5801m8897n0983n0695m8400m5429
$$ 7002070 6975690 6941177 6901205 6858887 6815324 6769523 6720626 6669643 6618948 6570548 6525119
61353F525119m2564l9351l4811k8695k1890j5637j0658p189n434n524p096r362
$$ 6525119 6482555 6443204 6408393 6379698 6357808 6342171 6331513 6324324 6318890 6313366 6306270 6296908
61341F296908j1602j3422j4675j5425j5806j5582j3918r974l648M574J4419K6096
$$ 6296908 6285306 6271884 6257209 6241784 6225978 6210396 6196478 6186504 6182856 6187430 6201849 6227945
61329F227945L9798N5331P2393R0900J10872J32120J54218J76796J99769K23141
$$ 6227945 6267743 6323074 6395467 6486367 6597239 6729359 6883577 7060373 7260142 7483283
61319G483283K46450K68539K88110L04403L16934L24526L25179L17090K99399
$$ 7483283 7729733 7998272 8286382 8590785 8907719 9232245 9557424 9874514 10173913
61310A0173913K71903K34809J89334J37914Q3237K7416k7382p8339j23180j61826
$$ 10173913 10445816 10680625 10869959 11007873 11091110 11118526 11091144 11012805 10889625 10727799
61300A0727799j95883k26240k52020k71930k85914k95050l00341l01969k99443
$$ 10727799 10531916 10305676 10053656 9781726 9495812 9200762 8900421 8598452 8299009
61291H299009k92332k81169k67700k53940k40790k27866k14680k01509j88846
$$ 8299009 8006677 7725508 7457808 7203868 6963078 6735212 6520532 6319023 6130177
61282F130177j76453j63359j48895j33549j18590j04671r0890p5758n9307m3602
$$ 6130177 5953724 5790365 5641470 5507921 5389331 5284660 5193770 5118012 5058705 5015103
61272E015103l0586j9733q779L304J5008K4307L1131L7078M3051M8033N0510N0522
$$ 5015103 4984517 4964784 4956005 4959309 4974317 4998624 5029755 5066833 5109884 5157917 5208427 5258949
61260E258949M9742M9617M9900M9247M6811M2806L7929L2935K8663K5614K3326
$$ 5258949 5308691 5358308 5408208 5457455 5504266 5547072 5585001 5617936 5646599 5672213 5695539
61249E695539K0893J8227J5908J3692J0361N577N30m252j0339j9176k9396l8164
$$ 5695539 5716432 5734659 5750567 5764259 5774620 5780197 5780727 5776475 5766136 5746960 5717564 5679400
61237E679400m4657n0242n5540n9545o1981o4281o7181o9174o8672o6408o4205
$$ 5679400 5634743 5584501 5528961 5469416 5407435 5343154 5275973 5206799 5138127 5071719 5007514
61226E007514o2214n8979n3764m7483m1423l6084l1364k6909k2220j7095j2066
$$ 5007514 4945300 4886321 4832557 4785074 4743651 4707567 4676203 4649294 4627074 4609979 4597913
61215D597913p986n274l897l700m066l694j770O82J685Q90K28J488M058N989O762
$$ 4597913 4589927 4584653 4580756 4577056 4572990 4569296 4567526 4568208 4569893 4570783 4571011 4572499 4576557 4582546 4589308
61200D589308P839J0502J4254J7790K0814K4262K9107L5672M3907N3706O4726
$$ 4589308 4597147 4607649 4621903 4639693 4660507 4684769 4713876 4749548 4793455 4847161 4911887
61189D911887P6410Q8233R9666J09842J17630J22196J23117J19880J11733R8138
$$ 4911887 4988297 5076530 5176196 5286038 5403668 5525864 5648981 5768861 5880594 5978732
61179E978732P8929N3871K2809j3179n1147q7408j19225j45203j64653j77301
$$ 5978732 6057661 6111532 6134341 6121162 6070015 5982607 5863382 5718179 5553526 5376225
61169E376225j83650j84873j82279j77037j70265j62814j54927j46439j37359
$$ 5376225 5192575 5007702 4825423 4648386 4478121 4315307 4160380 4013941 3876582
61160C876582j27931j18277j08355r8382q8922q0452p2958o6054n9435n3244m7906
$$ 3876582 3748651 3630374 3522019 3423637 3334715 3254263 3181305 3115251 3055816 3002572 2954666
61149B954666m3394l8749l2808k5611j8540j2739p891k963K312P268J1317J4510
$$ 2954666 2911272 2872523 2839715 2814104 2795564 2782825 2774934 2771971 2774283 2781551 2792868 2807378
61137B807378J7273J9967K2588K4562K5088K3941K1550J8067J3139P111J629k013
$$ 2807378 2824651 2844618 2867206 2891768 2916856 2940797 2962347 2980414 2993553 3000664 3002293 3000280
61125C000280m586p861j2232j6637k0714k5420l1134l6430l9688m1216m2836m5720
$$ 3000280 2995694 2987833 2975601 2958964 2938250 2912830 2881696 2845266 2805578 2764362 2721526 2675806
61113B675806m9328n2289n3708n3648n2763n1804n1172n0746n0073m8809m7081
$$ 2675806 2626478 2574189 2520481 2466833 2414070 2362266 2311094 2260348 2210275 2161466 2114385
61102B114385m5348m3861m2413m0802l9278l8064l6610l4023l0361k6740k3928
$$ 2114385 2069037 2025176 1982763 1941961 1902683 1864619 1828009 1793986 1763625 1736885 1712957
61091A712957k1457j8598j5585j3395j2781j4044j7118k1178k4527k5717k4859
$$ 1712957 1691500 1672902 1657317 1643922 1631141 1617097 1599979 1578801 1554274 1528557 1503698
61080A503698k3346k2360k1842k0718j8061j4220j0819r124q497p110m225p71
$$ 1503698 1480352 1457992 1436150 1415432 1397371 1383151 1372332 1363208 1354711 1347601 1343376 1342605
61068A342605K358N296Q047R794J0310J0932J2899J5485J6863J6341J4894J3965
$$ 1342605 1344963 1350259 1358306 1368100 1378410 1389342 1402241 1417726 1434589 1450930 1465824 1479789
61056A479789J4356J5638J6132J4366J1117Q901Q794R147Q331P143P106P948Q426
$$ 1479789 1494145 1509783 1525915 1540281 1551398 1560299 1569093 1578240 1586571 1593714 1600820 1608768 1617194
61043A617194Q295P526M875m77o706j0996j2843j3695j4176j3953j3729j4695
$$ 1617194 1625489 1633015 1637890 1637413 1630707 1619711 1606868 1593173 1578997 1565044 1551315 1536620
61031A536620j6133j6132j4793j4291j5490j6849j7099j6779j6516j5977j5289
$$ 1536620 1520487 1504355 1489562 1475271 1459781 1442932 1425833 1409054 1392538 1376561 1361272
61020A361272j5469j6513j6790j5314j3175j1902j1642j1616j1056r302o180k816
$$ 1361272 1345803 1329290 1312500 1297186 1284011 1272109 1260467 1248851 1237795 1228493 1222313 1219497
61008A219497p84j37N02J745K857L456M062M603M248L307L415N098O767P086O777
$$ 1219497 1218713 1218576 1219078 1220823 1223680 1227136 1231198 1235801 1240049 1243356 1246771 1251869 1258636 1265722 1272499
60993A272499P122Q013Q587Q727Q916R385J0169J1467J3294J5233J6690J7058
$$ 1272499 1279621 1287634 1296221 1304948 1313864 1323249 1333418 1344885 1358179 1373412 1390102 1407160
60981A407160J6050J4645J4908J7732K1296K3303K4025K5359K7676K9857L1946
$$ 1407160 1423210 1437855 1452763 1470495 1491791 1515094 1539119 1564478 1592154 1622011 1653957
60970A653957L5177L9234M2141M3166M3637M4526M5547M6904M9412N2387N3847
$$ 1653957 1689134 1728368 1770509 1813675 1857312 1901838 1947385 1994289 2043701 2096088 2149935
60959B149935N3469N3035N3466N3917N4453N6853O1770O7461P2460P7320Q2767
$$ 2149935 2203404 2256439 2309905 2363822 2418275 2475128 2536898 2604359 2676819 2754139 2836906
60948B836906Q8418R4272J01213J09115J16658J23972J33168J45310J59064J73164
$$ 2836906 2925324 3019596 3120809 3229924 3346582 3470554 3603722 3749032 3908096 4081260
60938D081260J87836K02989K17378K30570K43629K57343K71999K88991L09822
$$ 4081260 4269096 4472085 4689463 4920033 5163662 5421005 5693004 5981995 6291817
60929F291817L33529L58247L85286M17941M56234M97049N39673N86838O40509
$$ 6291817 6625346 6983593 7368879 7786820 8243054 8740103 9279776 9866614 10507123
60920A0507123P02336P78774Q79106J006820J158885J333838J532449J750042
$$ 10507123 11209459 11988233 12867339 13874159 15033044 16366882 17899331 19649373
60912A9649373J979768K226743K506081K822777L170865L557264L988144M387703
$$ 19649373 21629141 23855884 26361965 29184742 32355607 35912871 39901015 44288718
60904D4288718M547542M232073L390801K255963J193652M52076O3455m5979O5754
$$ 44288718 48836260 53068333 56459134 58715097 59908749 60360825 60424280 60378301 60444055
60895F0444055L21897N22960L82730k66676j312873k433007l325245l869765m104284
$$ 60444055 60765952 61288912 61671642 61404966 60092093 57659086 54333841 50464076 46359792
60886D6359792m111811l960011l707203l408144l097912k788332k486621k205104
$$ 46359792 42247981 38287970 34580767 31172623 28074711 25286379 22799758 20594654
60878B0594654j950444j717810j502638j309396j143706j003778q84637p84296
$$ 20594654 18644210 16926400 15423762 14114366 12970660 11966882 11082245 10297949
60870A0297949p01076o30563n69553n18598m77114m40552m05423l72635l43038
$$ 10297949 9596873 8966310 8396757 7878159 7401045 6960493 6555070 6182435 5839397
60861E839397l14555k86820k63720k47451k34285k20066k05914j94565j84761
$$ 5839397 5524842 5238022 4974302 4726851 4492566 4272500 4066586 3872021 3687260
60852C687260j73624j61480j50083j38645j25898j13983j06049j01249r5795q8129
$$ 3687260 3513636 3352156 3202073 3063428 2937530 2823547 2717498 2616249 2520454 2432325
60842B432325p9990p3216o8042o3875n9593n3934m7222m1624l8315l5837l2626
$$ 2432325 2352335 2279119 2211077 2147202 2087609 2033675 1986453 1944829 1906514 1870677 1838051
60831A838051k9282k6918k5150k3351k1997k1162j9665j7274j5731j5973j6482
$$ 1838051 1808769 1781851 1756701 1733350 1711353 1690191 1670526 1653252 1637521 1621548 1605066
60820A605066j6119j6289j8393k1292k3393k5165k7477k9427k9916k9587k9158
$$ 1605066 1588947 1572658 1554265 1532973 1509580 1484415 1456938 1427511 1397595 1368008 1338850
60809A338850k7685k4549k1301j9492j8365j6611j4655j3297j1945j0050q377
$$ 1338850 1311165 1286616 1265315 1245823 1227458 1210847 1196192 1182895 1170950 1160900 1152523
60798A152523p095m716r87J655J811J830M167P357Q705Q899J0598J3918J6779
$$ 1152523 1145428 1140712 1139725 1141380 1143191 1145021 1149188 1156545 1165250 1174149 1184747 1198665 1215444
60785A215444J8497J9933K0916K0641J9948K0424K1688K2073K1340K0405J9175
$$ 1215444 1233941 1253874 1274790 1295431 1315379 1335803 1357491 1379564 1400904 1421309 1440484
60774A440484J7052J4737J3104J1173P681L882K053J876J014j129k894l373l454
$$ 1440484 1457536 1472273 1485377 1496550 1504231 1508113 1510166 1512042 1513056 1511927 1509033 1505660 1502206
60761A502206l897m560n581p304r089j0057j0776j2486j4911j6634j7301j7712
$$ 1502206 1498309 1493749 1488168 1480864 1471775 1461718 1450942 1438456 1423545 1406911 1389610 1371898
60749A371898j8079j7886j7223j6589j5761j4286j2609j1291r899q017o437n728
$$ 1371898 1353819 1335933 1318710 1302121 1286360 1272074 1259465 1248174 1238275 1230258 1223821 1218093
60737A218093m750k383L78K066L275N410P949R351R875J1014J2764J3932J4604
$$ 1218093 1213343 1210960 1211338 1213404 1216679 1222089 1230038 1239389 1249264 1260278 1273042 1286974 1301578
60724A301578J5820J7153J7091J5593J4015J2720J1002R165Q341Q345P955P129
$$ 1301578 1317398 1334551 1351642 1367235 1381250 1393970 1404972 1414137 1422478 1430823 1438778 1445907
60712A445907O916P276P133O506O504P370Q495R979J2070J3453J2473R842P770
$$ 1445907 1452823 1460099 1467232 1473738 1480242 1487612 1496107 1506086 1518156 1531609 1544082 1553924 1561694
60699A561694O755N648M552M751N776N569L930K898L164K886J062p04r03k28K31
$$ 1561694 1568449 1574097 1578649 1583400 1589176 1594745 1598675 1601573 1604737 1607623 1608685 1607981 1607078 1606850 1607081
60684A607081O88J235P41j437m254o586q536j0105j0352r095p968q448j0000j1238
$$ 1607081 1607769 1609004 1609745 1608308 1604054 1597468 1588932 1578827 1568475 1559380 1551412 1542964 1532964 1521726
60670A521726j1744j1674j0788r139p769p563q033q210q118q571r895j1496j2391
$$ 1521726 1509982 1498308 1487520 1478381 1470612 1463049 1455016 1446806 1438688 1430117 1420222 1408726 1396335
60657A396335j1921j0383q966q570q778q661q191p834p137n173k319j39O45O98
$$ 1396335 1384414 1374031 1365065 1356495 1347717 1339056 1330865 1323031 1315894 1310721 1308402 1308263 1308908 1309606
60643A309606M81l58j664k347j946j511k299m395o916q833r417q823q258q844
$$ 1309606 1310087 1309729 1308065 1305718 1303772 1302261 1299962 1295567 1288651 1279818 1270401 1261578 1253320 1244476
60629A244476j0340j1903j3469j5202j6125j5252j3848j4429j7067j8762j7250
$$ 1244476 1234136 1222233 1208764 1193562 1177437 1162185 1148337 1133908 1116841 1098079 1080829
60618A080829j3679j0656r186q586q091p240n590l185q89N09J199J893L008M485
$$ 1080829 1067150 1056494 1047308 1038722 1030631 1023391 1017801 1014616 1013727 1014236 1015435 1017328 1020336 1024821
60604A024821N955O922P269P566Q301R102R420R573J0109J0576J0207R539R866
$$ 1024821 1030776 1037698 1044967 1052533 1060834 1069936 1079356 1088929 1099038 1109614 1119821 1129360 1139226
60591A139226J1128J1893J1579J1184J1595J2504J3362J4028J4142J3136J1319
$$ 1139226 1150354 1162247 1173826 1185010 1196605 1209109 1222471 1236499 1250641 1263777 1275096
60580A275096R960R910J1035J3003J5451J7356J7655J6753J6206J6604J7060J6921
$$ 1275096 1285056 1294966 1306001 1319004 1334455 1351811 1369466 1386219 1402425 1419029 1436089 1453010
60568A453010J6605J6454J6013J4911J3241J0843P456L894J636P81l87l189o943
$$ 1453010 1469615 1486069 1502082 1516993 1530234 1541077 1548533 1552427 1554063 1554844 1554457 1551268 1544325
60555A544325r996j1477j1721j1827j2906j4838j5866j4509j1675r512q362o535
$$ 1544325 1534329 1522852 1511131 1499304 1486398 1471560 1455694 1441185 1429510 1419998 1411636 1405101
60543A405101l227J01J766J790J262J010J356J969J787J55j874k725k504k471
$$ 1405101 1401874 1401975 1403741 1405531 1406793 1407803 1409159 1411128 1412915 1413070 1411196 1408471 1405967 1403496
60529A403496k574j561M50J873K508M001O708Q527Q126P081P198P703O979N531
$$ 1403496 1400922 1399361 1399811 1401684 1404192 1408193 1414901 1423428 1431554 1438635 1445833 1453536 1460515 1466046
60515A466046N143N868O028M786L165K296J787K51k835o074p355o423n472o262
$$ 1466046 1471189 1477057 1483085 1487871 1491036 1493332 1495119 1495370 1492535 1486461 1479106 1472683 1467211 1460949
60501A460949p646p470o132n862o933p344o528o355p436p313l993J029N050P555
$$ 1460949 1453303 1445833 1439701 1433839 1426906 1419562 1413034 1406679 1399243 1391930 1387937 1388966 1394016 1401571
60487A401571R495J1093J2507J5036J9500K4430K7988L0753L4610L9791M5102
$$ 1401571 1411066 1422159 1434666 1449702 1469202 1493632 1521620 1552373 1586983 1626774 1671876
60476A671876N0401N6627O3540O9464P3482P6140P7538P6195P0506O0649M8415
$$ 1671876 1722277 1778904 1842444 1911908 1985390 2061530 2139068 2215263 2285769 2346418 2394833
60465B394833L5547K2523R090m069j4659k0464k1549j9852j6648j1686m924K437
$$ 2394833 2430380 2452903 2461993 2457924 2443265 2422801 2401252 2381400 2364752 2353066 2348142 2350579
60453B350579R278J5506K0917K4521K5970K6419K6923K7113K6626K6639K8561
$$ 2350579 2359857 2375363 2396280 2420801 2446771 2473190 2500113 2527226 2553852 2580491 2609052
60442B609052L2016L5573L9133M4285N2453O3441P5680Q7500R8700J11118J26853
$$ 2609052 2641068 2676641 2715774 2760059 2812512 2875953 2951633 3039133 3137833 3248951 3375804
60431C375804J45675J65193J83908K02653K22479K42883K63277K84767L08973
$$ 3375804 3521479 3686672 3870580 4073233 4295712 4538595 4801872 5086639 5395612
60422E395612L36140L65814L98201M33090M68085M99158N22085N31484N19225
$$ 5395612 5731752 6097566 6495767 6928857 7396942 7896100 8418185 8949669 9468894
60413I468894M76556L99265K90523J59015J5262j30284k67187l85064m75367n34470
$$ 9468894 9945450 10344715 10635238 10794253 10809515 10679231 10412044 10026980 9551613 9017143
60403I017143n65173n74070n66987n47289n18030m83481m47283m10581l73329
$$ 9017143 8451970 7877900 7310913 6763624 6245594 5762113 5314830 4904249 4530920
60394D530920l36537l01952k70337k41485k15360j92117j71415j52821j36432
$$ 4530920 4194383 3892431 3622094 3380609 3165249 2973132 2801717 2648896 2512464
60385B512464j22302j09743r8125q7825p9403p2387o5853n9757n4691n0703m7199
$$ 2512464 2390162 2280419 2182294 2094469 2015066 1942679 1876826 1817069 1762378 1711675 1664476
60374A664476m3864m0862l8375l6426l4899l3281l0875k7688k4620k2414k1024
$$ 1664476 1620612 1579750 1541375 1504949 1470050 1436769 1405894 1378206 1353586 1331172 1310148
60363A310148k0199j9808j9249j7583j4877j2451j1143j0219q696o783n287m383
$$ 1310148 1289949 1270141 1250892 1233309 1218432 1205981 1194838 1184619 1175923 1169140 1163853 1159470
60351A159470l709k973j898l26J128J425N32m59q97j119j120j70J701L342M245
$$ 1159470 1155761 1152788 1150890 1150564 1151692 1153117 1153649 1153190 1152293 1151174 1150054 1149884 1151585 1154927 1159172
60336A159172N167O327O743O194O024O896P573P207O934P589P766N984L291J606
$$ 1159172 1164339 1170666 1177409 1183603 1189627 1196523 1204096 1211303 1218237 1225826 1233592 1239576 1242867 1244473
60322A244473Q48k37j637k618l619n404p129p431o737o428o342n338l789l269
$$ 1244473 1245321 1245084 1243447 1240829 1237210 1231806 1224677 1217246 1210509 1204081 1197739 1192401 1188612 1185343
60308A185343l844l890k605r00L61J317K167K774L288L956M249L513K219J406
$$ 1185343 1181499 1177609 1175004 1174104 1174465 1175782 1177949 1180723 1184011 1187967 1192216 1195729 1197948 1199354
60294A199354J138Q32Q09J941L866N072M903M224L991M251M645M971N103N120
$$ 1199354 1200492 1201324 1202133 1204074 1207940 1213012 1217915 1222139 1226130 1230381 1235026 1239997 1245100 1250220
60280A250220N372N930O378O644P221P868P196M697K116J422K241K856K944L624
$$ 1250220 1255592 1261522 1267900 1274544 1281765 1289633 1296829 1301526 1303642 1305064 1307305 1310161 1313105 1316729
60266A316729N272P054Q353R166R269Q350O860N519M191K297p8k470m808o903
$$ 1316729 1322001 1329055 1337408 1346574 1355843 1364193 1371053 1376572 1380763 1383060 1382982 1380512 1375704 1368801
60252A368801p926p696p468q099q366o841m488l418l754l846l155k738k853k221
$$ 1368801 1360875 1353179 1345711 1337612 1329246 1322405 1317917 1314499 1310745 1306899 1303744 1301006 1298153 1295932
60238A295932l2K840M964N482M278K231J131K038L876M811M602M399M826N647
$$ 1295932 1295900 1298740 1303704 1309186 1313464 1315695 1316826 1318864 1322740 1327551 1332153 1336552 1341378 1347025
60224A347025O728P800P893O657N624O434Q416R709J0188J1227J3020J4308J4599
$$ 1347025 1353753 1361553 1369446 1376103 1381727 1388161 1396577 1406286 1416474 1427701 1440721 1455029 1469628
60211A469628J4670J4997J5412J6197J7644J8909J9157J9385K1146K3942K6107
$$ 1469628 1484298 1499295 1514707 1530904 1548548 1567457 1586614 1605999 1627145 1651087 1677194
60200A677194K7776L0441L3961L6765L8968M2331M6828N0302N2294N5309O1128
$$ 1677194 1704970 1735411 1769372 1806137 1845105 1887436 1934264 1984566 2036860 2092169 2153297
60189B153297O8321P4777Q0540Q6766R3660J00750J07827J14724J21461J29045
$$ 2153297 2221618 2296395 2376935 2463701 2557361 2658111 2765938 2880662 3002123 3131168
60179C131168J38262J47298J52822J54362J55286J58147J61269J61513J58297
$$ 3131168 3269430 3416728 3569550 3723912 3879198 4037345 4198614 4360127 4518424
60170D518424J52773J44667J32556J16793R9982Q4349O9868N5138L9223K2548
$$ 4518424 4671197 4815864 4948420 5065213 5165195 5249544 5319412 5374550 5413773 5436321
60160E436321O540p467j8923k7617l3073l5126l4678l2817k9360k3429j5176n594
$$ 5436321 5442861 5435394 5416471 5388854 5355781 5320655 5285977 5253160 5223800 5200371 5185195 5179601
60148E179601N146J7670L1811M6535O1474P6858R1948J05352J17137J28669J39986
$$ 5179601 5184747 5202417 5234228 5280763 5342237 5419095 5511043 5616395 5733532 5862201 6002187
60137F002187J49116J54555J56640J55755J50907J41090J26779J09378R0339P1067
$$ 6002187 6151303 6305858 6462498 6618253 6769160 6910250 7037029 7146407 7236746 7307813
60127G307813N2220L2746J1192j1751l3592n3123p0989q6742r7803j02511j02150
$$ 7307813 7360033 7392779 7403971 7392220 7358628 7305505 7234516 7147774 7049971 6947460 6845310
60116F845310r8719r2478q3058p1123n7290m0832k1196J46K0846L9851N7355P3472
$$ 6845310 6746591 6654113 6571055 6499932 6442642 6401810 6380614 6380760 6401606 6441457 6498812 6572284
60104F572284Q7999J00557J10011J14689J14019J09147J01235R0290P6339O0461
$$ 6572284 6660283 6760840 6870851 6985540 7099559 7208706 7309941 7400231 7476570 7537031
60094G537031M3783K6644R791m901j5972k3759k9246l2436l2619k9307k2105j0698
$$ 7537031 7580814 7607458 7617249 7612348 7596376 7572617 7543371 7510935 7478316 7449009 7426904 7416206
60082G416206M257K1311L9829O0420Q3277J07517J32730J59694J88717K18826
$$ 7416206 7420463 7441774 7481603 7542023 7625300 7732817 7865547 8025241 8213958 8432784
60072H432784K49337K80684L12667L43730L73104M01893M30544M56793M77829
$$ 8432784 8682121 8962805 9275472 9619202 9992306 10394199 10824743 11281536 11759365
60063A1759365M93016N02638N05261M98502M81855M56882M25014L86632L41984
$$ 11759365 12252381 12755019 13260280 13758782 14240637 14697519 15122533 15509165 15851149
60054A5851149K91549K35666J74753J09699M1459k8960r9481j66927k28859k84485
$$ 15851149 16142698 16378364 16553117 16662816 16704275 16675315 16575834 16408907 16180048 15895563
60044A5895563l32901l71836l99328m15548m21609m17615m03323l79919l49664
$$ 15895563 15562662 15190826 14791498 14375950 13954341 13536726 13133403 12753484 12403820
60035A2403820l14481k75959k35799j94895j52706j08902o4938k2930J5992N0978
$$ 12403820 12089339 11813380 11577581 11382686 11229980 11121078 11056140 11033210 11049202 11100180
60025A1100180Q0286J02444J17531J25753J25794J16573R9647P7738N1734K1595
$$ 11100180 11180466 11282910 11400441 11526194 11651988 11768561 11868208 11945946 11997680 12019275
60015A2019275j0254l9437o4067q6333j08874j31607j52952j72189j89172k03183
$$ 12019275 12009021 11969584 11905517 11819184 11710310 11578703 11425751 11253562 11064390 10861207
60005A0861207k13738k21772k28443k33152k33980k30099k22587k12633k00000
$$ 10861207 10647469 10425697 10197254 9964102 9730122 9500023 9277436 9064803 8864803
59996H864803j84001j65299j45484j25016j02848p8725n4587l2440j1678R857
$$ 8864803 8680802 8515503 8370019 8245003 8142155 8063430 8008843 7976403 7964725 7974582
59986G974582L2471N4162P3545R1357J08354J23508J35154J42357J44077J38695
$$ 7974582 8007053 8061215 8134760 8226117 8334471 8457979 8593133 8735490 8879567 9018262
59976I018262J25942J08177Q8047O5623L9556J0431j8995m6831p3643j00398j25966
$$ 9018262 9144204 9252381 9340428 9406051 9445607 9456038 9437043 9390212 9316569 9216171 9090205
59965I090205j47483j62796j72137j77341j79591j78135j71602j60205j45932
$$ 9090205 8942722 8779926 8607789 8430448 8250857 8072722 7901120 7740915 7594983
59956G594983j30416j13660r5133p5067n4066l2355j0191J1660L2704N3505P4998
$$ 7594983 7464567 7350907 7255774 7180707 7126641 7094286 7084095 7095755 7128459 7181964 7256962
59945G256962R7291J19659J41372J62124J81850K00113K15369K25187K27998K24444
$$ 7256962 7354253 7473912 7615284 7777408 7959258 8159371 8374740 8599927 8827925 9052369
59935I052369K15980K02421J82366J55966J25578R3412O0153K6318o909l8972
$$ 9052369 9268349 9470770 9653136 9809102 9934680 10028092 10088245 10114563 10107654 10068682
59925A0068682p0251j00122j26326j47374j63962j76690j83946j83704j76279
$$ 10068682 9998431 9898309 9771983 9624609 9460647 9283957 9100011 8916307 8740028
59916H740028j63778j47779j28908j07833q5145o0914l5495j0113J4386L8379
$$ 8740028 8576250 8428471 8299563 8191730 8106585 8045671 8010176 8000063 8014449 8052828
59906H052828O2004Q3771J02055J17151J30510J42463J51874J57539J58822J55621
$$ 8052828 8114832 8198603 8300658 8417809 8548319 8690782 8842656 9000195 9159017 9314638
59896I314638J48641J39238J28269J15761J02281Q9442P8203O7898N8024M9827
$$ 9314638 9463279 9602517 9730786 9846547 9948828 10038270 10116473 10184371 10242395 10292222
59886A0292222M4939M3670M5949N2712O4847Q1811J02883J28763J60264J96315
$$ 10292222 10337161 10380831 10426780 10479492 10544339 10626150 10729033 10857796 11018060 11214375
59876A1214375K34898K75206L17104L59238L99611M37508M72760N03265N25053
$$ 11214375 11449273 11724479 12041583 12400821 12800432 13237940 13710700 14213965 14739018
59867A4739018N34942N31552N13642M79157M26584L56315K70361J71686O4429
$$ 14739018 15273960 15805512 16319154 16798311 17224895 17581210 17851571 18023257 18087686
59858A8087686m5717j51864k47477l28532l94476m46315m83606n04540n09155
$$ 18087686 18041969 17890105 17642628 17314096 16919620 16473305 15989699 15485159 14976004
59849A4976004n00790m83275m58146m25786l87955l47381l05578k62505k17926
$$ 14976004 14475214 13991939 13533793 13108007 12720052 12372671 12067093 11804588 11586662
59840A1586662j72070j25667q0322l8039O52L7266P2990J06648J35971J59721
$$ 11586662 11414592 11288925 11208603 11170564 11171216 11208482 11281472 11388120 11524091 11683812
59830A1683812J77410J87990J90255J83684J67701J41118J03568N6685K809n6266
$$ 11683812 11861222 12049212 12239467 12423151 12590852 12731970 12835538 12892223 12895032 12838766
59820A2838766j17999j78025k32275k79430l19848l52953l77216l91817l97052
$$ 12838766 12720767 12542742 12310467 12031037 11711189 11358236 10981020 10589203 10192151
59811A0192151l93904l84385l71114l55216l35796l12705k88178k64209k40144
$$ 10192151 9798247 9413862 9042748 8687532 8351736 8039031 7750853 7486644 7246500
59802G246500k15010j90512j69147j50614j32878j16020j02290r2644q5693p9994
$$ 7246500 7031490 6840978 6671831 6521217 6388339 6272319 6170029 6077385 5991692 5911698
59792E911698p5251p1231o7254o2789n7424n0772m3488l7234l2236k6366j8562
$$ 5911698 5836447 5765216 5697962 5635173 5577749 5526977 5483489 5446255 5414019 5387653 5369091
59781E369091j1602r151j1325j5681k1280k8850l7825m6407n4151o1601o7737
$$ 5369091 5357489 5348338 5337013 5321332 5300052 5271202 5233377 5186970 5132819 5071218 5003481
59770E003481p0562p0184o8556o6315o2384n6643n0268m3431l5161k5589j5821
$$ 5003481 4932919 4862735 4794179 4727864 4665480 4608837 4558569 4515138 4479977 4454388 4438567
59759D438567n627O238J9392L1872M2788N2367N9729O3650O5718O9546P6111Q2641
$$ 4438567 4432940 4439178 4458570 4490442 4533230 4585597 4645326 4708976 4774694 4844240 4920351 5002992
59747E002992Q6794Q9086R0239Q8944Q3699P4814O3405N0347L7268K6604J9477
$$ 5002992 5089786 5178872 5269111 5358055 5441754 5516568 5579973 5630320 5667588 5694192 5713669
59736E713669J4953J2237J1947J4516J9017K4684L2166M2412N5324P0149Q6326
$$ 5713669 5728622 5740859 5752806 5767322 5786339 5811023 5843189 5885601 5940925 6011074 6097400
59725F097400J03758J23180J45973J72554K01360K30743K61190K93904L28118
$$ 6097400 6201158 6324338 6470311 6642865 6844225 7074968 7336158 7630062 7958180
59716G958180L61912L94658M25885M52239M68488M71154M57809M23177L60600
$$ 7958180 8320092 8714750 9140635 9592874 10061362 10532516 10990325 11413502 11774102
59707A1774102K69528J59101M3066o6675j61366k34718k84321l12324l22778l19027
$$ 11774102 12043630 12202731 12245797 12179122 12017756 11783038 11498717 11186393 10863615 10544588
59697A0544588l04141k81749k54816k24846j93082j61025j29130r6720o3989l2489
$$ 10544588 10240447 9958698 9703882 9479036 9285954 9124929 8995799 8899079 8835090 8802601
59687H802601k965K5421N3206P9817J05409J31478J58693J85857K11875K37253
$$ 8802601 8799636 8825057 8878263 8958080 9063489 9194967 9353660 9539517 9751392 9988645
59677I988645K62958K89567L18053L49602L84016M20013M57427M97236N39207
$$ 9988645 10251603 10541170 10859223 11208825 11592841 12012854 12470281 12967517 13506724
59668A3506724N81887O25332O71225P19532P67517Q13020Q56012Q95839R29538
$$ 13506724 14088611 14713943 15385168 16104700 16872217 17685237 18541249 19437088 20366626
59659B0366626R54313R69306R73512R64721R42623R11055Q75262Q38581Q03494
$$ 20366626 21320939 22290245 23263757 24228478 25171101 26082156 26957418 27795999 28599493
59650B8599493P73949P54257P46444P49901P62457P80571P99791Q16304Q27156
$$ 28599493 29373442 30127699 30874143 31624044 32386501 33167072 33966863 34783167 35610323
59641C5610323Q28488Q15257P83565P31877O59782N68042M60876L45779K29585
$$ 35610323 36438811 37254068 38037633 38769510 39429292 39997334 40458210 40803989 41033574
59632D1033574J16476J0695q1668j55448k08941k41897k53059k41741k10099j61624
$$ 41033574 41150050 41160745 41079077 40923629 40714688 40472791 40219732 39977991 39767892 39606268
59622C9606268r8507k1928O6401J64688K71622L85065N01430O17692P32522Q43880
$$ 39606268 39507761 39485833 39552234 39716922 39988544 40373609 40875039 41492731 42225253 43069133
59612D3069133R46794J034783J102030J142807J150184J116871J036552R04254
$$ 43069133 44015927 45050710 46152740 47295547 48445731 49562602 50599154 51503408
59604E1503408P18100M82731K09887q5369l87603o80142r45269j168658j343112
$$ 51503408 52221508 52704239 52914126 52828757 52441154 51761012 50815743 49647085 48303973
59595D8303973j467045j541585j570934j563047j526787j469060j396344j317526
$$ 48303973 46836928 45295343 43724409 42161362 40634575 39165515 37769171 36451645
59587C6451645j243162j182711j143588j130583j143274j174288j211847j244273
$$ 36451645 35208483 34025772 32882184 31751601 30608327 29434039 28222192 26977919
59579B6977919j262639j262082j242885j208918j163587j108348j045543r79750
$$ 26977919 25715280 24453198 23210313 22001395 20837808 19729460 18683917 17704167
59571A7704167r14467q49707p84905p21927o62999o07890n55568n06707m62051
$$ 17704167 16789700 15939993 15155088 14433161 13770162 13162272 12606704 12099997 11637946
59562A1637946m20235l79969l42643l10024k81018k53574k28268k06977j89265
$$ 11637946 11217711 10837742 10495099 10185075 9904057 9650483 9422215 9215238 9025973
59553I025973j73151j58483j46692j38113j32183j29256j29466j30966j32249
$$ 9025973 8852822 8694339 8547647 8409534 8277351 8148095 8018629 7887663 7755414
59544G755414j34969j41153j48507j52298j51483j49370j48069j46003j41519
$$ 7755414 7620445 7479292 7330785 7178487 7027004 6877634 6729565 6583562 6442043
59535F442043j35543j29309j22164j13078j02406r0970p9011o6946n5714m5616
$$ 6442043 6306500 6177191 6055027 5941949 5839543 5748573 5669562 5602616 5546902 5501286
59525E501286l5922k6068j6228o592K727J1016J7373K2014K6130L0536L5289M0258
$$ 5501286 5465364 5439296 5423068 5416476 5419203 5430219 5447592 5469606 5495736 5526272 5561561 5601819
59513E601819M4894M7971M8857M8840N0022N3261N8264O5006P3508Q2627R0780
$$ 5601819 5646713 5694684 5743541 5792381 5842403 5895664 5953928 6018934 6092442 6175069 6265849
59502F265849R7968J06020J16765J30641J46736J63455J79714J96121K14207K33996
$$ 6265849 6363817 6469837 6586602 6717243 6863979 7027434 7207148 7403269 7617476 7851472
59492G851472K53687K72501K92100L13790L35900L55675L72403L86895L99001
$$ 7851472 8105159 8377660 8669760 8983550 9319450 9675125 10047528 10434423 10833424
59483A0833424M07606M12061M11771M05355L92066L73347L51386L27067L00507
$$ 10833424 11241030 11653091 12064862 12470217 12862283 13235630 13587016 13914083 14214590
59474A4214590K72045K41004K05557J66241J28041R6183P1087N0106L2758K1036
$$ 14214590 14486635 14727639 14933196 15099437 15227478 15323661 15394748 15444854 15477612 15498648
59464A5498648J5582J5430K1297L5404N7399Q3365J09621J34865J57844J75319
$$ 15498648 15514230 15529660 15550957 15586361 15643760 15727125 15836746 15971611 16129455 16304774
59454A6304774J83367J79118J60683J27310Q0335K2647m3282j15699j92069k68747
$$ 16304774 16488141 16667259 16827942 16955252 17035587 17058234 17014952 16899253 16707184 16438437
59444A6438437l42184m09214m66385n10758n41481n59336n64967n58896n42928
$$ 16438437 16096253 15687039 15220654 14709896 14168415 13609079 13044112 12485216 11942288
59435A1942288n19715m90926m57217m19900l81364l43761l08215k74873k42806
$$ 11942288 11422573 10931647 10474430 10054530 9673166 9329405 9021190 8746317 8503511
59426H503511k10567j78003j46839j18418r1888o5748m0014j5369Q493L2185N5597
$$ 8503511 8292944 8114941 7968102 7849684 7757796 7692048 7652034 7636665 7645158 7677343 7732940
59415G732940P9132J04402J31734J58654J82942K05595K28419K50355K68974K83925
$$ 7732940 7812072 7916474 8048208 8206862 8389804 8595399 8823818 9074173 9343147 9627072
59405I627072K95753L02598L01493K92026K75472K51084K16679J72421J20695
$$ 9627072 9922825 10225423 10526916 10818942 11094414 11345498 11562177 11734598 11855293
59396A1855293O2864l93o5837j28514j86028k38737k85685l23804l51551l70043
$$ 11855293 11918157 11917764 11851927 11723413 11537385 11298648 11012963 10689159 10337608 9967565
59386I967565l80264l82281l77640l69259l58169l43237l24664l04867k85359
$$ 9967565 9587301 9205020 8827380 8458121 8099952 7756715 7432051 7127184 6841825
59377F841825k65731k46148k27843k10462j92125j72874j55105j39762j25237
$$ 6841825 6576094 6329946 6102103 5891641 5699516 5526642 5371537 5231775 5106538
59368E106538j10895r8328q7847p6911o3894n0711l9916l1420k3686j6012q039
$$ 5106538 4995643 4897315 4809468 4732557 4668663 4617952 4578036 4546616 4522930 4506918 4498879
59357D498879R51J0661J9336K5983L1724L7996M4888N1619N6852N8320N4635M8236
$$ 4498879 4499830 4510491 4529827 4555810 4587534 4625530 4670418 4722037 4778889 4837209 4891844 4940080
59345D940080M4138M4979M9392N5766O4725P6769R0257J03449J16301J28596J38402
$$ 4940080 4984218 5029197 5078589 5134355 5199080 5275849 5366106 5469555 5585856 5714452 5852854
59334E852854J44284J47703J51937J59746J72690J90928K12824K36413K61878
$$ 5852854 5997138 6144841 6296778 6456524 6629214 6820142 7032966 7269379 7531257
59325G531257K90845L22980L55941L89326M25819M67023N10848N54610N98357
$$ 7531257 7822102 8145082 8501023 8890349 9316168 9783191 10294039 10848649 11447006
59316A1447006O43076O87588P29098P65266P93800Q11439Q15326Q04677P80229
$$ 11447006 12090082 12777670 13506768 14272034 15065834 15877273 16692599 17497276 18277505
59307A8277505P43256O96200O42713N85765N26770M67302M10068L56892L06933
$$ 18277505 19020761 19716961 20359674 20945439 21472209 21939511 22349579 22706471 23013404
59298B3013404K57968K08457J57658J05031N0310o876o7821j33665k02948k71716
$$ 23013404 23271372 23479829 23637487 23742518 23792828 23785952 23718131 23584466 23381518 23109802
59288B3109802l36507l95822m48599m93348n29676n58934n82680o01769o17131
$$ 23109802 22773295 22377473 21928874 21435526 20905850 20346916 19764236 19162467 18545336
59279A8545336o29502o37991o40741o37291o28546o14501n94374n69067n40916
$$ 18545336 17915834 17277843 16637102 15999811 15371265 14756764 14162390 13593323 13052407
59270A3052407n10706m77651m42574m08165l75405l42771l09772k78113k48399
$$ 13052407 12541701 12064050 11621476 11213311 10837906 10495135 10185363 9907250 9658851
59261I658851k18974j89396j61832j37343j13912q9939o6728m5535k5322n720
$$ 9658851 9439877 9250481 9088649 8951306 8837394 8747455 8680727 8635192 8609870 8604150
59251H604150J0651K1659K9086L5925M2165M5756M5966M3303L7627K8767J7718
$$ 8604150 8614801 8636460 8665546 8701471 8743636 8789392 8835358 8878661 8916288 8945055 8962773
59240H962773N379q478k3321l6687m6695n4002n9652o2951o3389o2495o1385n8203
$$ 8962773 8968152 8959674 8936353 8899666 8852971 8798969 8739317 8676366 8612977 8550482 8489097 8430894
59228H430894n0424l8354k4136q639Q504K6989M6128O6078Q6912J07538J26990
$$ 8430894 8380470 8342116 8317980 8309341 8317845 8344834 8390962 8457040 8543952 8651490 8778480
59217H778480J45628J63672J79999J93722K05226K14163K18284K16046K08635
$$ 8778480 8924108 9087780 9267779 9461501 9666727 9880890 10099174 10315220 10523855
59208A0523855J97728J83082J64194J42389J19112R3792O5429L4649K370l1489
$$ 10523855 10721583 10904665 11068859 11211248 11330360 11424152 11489581 11524230 11526600 11495111
59198A1495111o5592r5438j16791j29859j38067j44062j48879j53270j57269j59725
$$ 11495111 11429519 11334081 11217290 11087431 10949364 10805302 10656423 10503153 10345884 10186159
59188A0186159j60420j61350j63853j66003j65038j60780j54414j45807j34692
$$ 10186159 10025739 9864389 9700536 9534533 9369495 9208715 9054301 8908494 8773802
59179H773802j22777j11603r9501q3618o3918m2391j9439N904L3074O0507Q8715
$$ 8773802 8651025 8539422 8439921 8356303 8292385 8249994 8230555 8236459 8269533 8330040 8418755
59168H418755J19826J54221J90245K27080K65428L05336L45555L84964M22515
$$ 8418755 8538581 8692802 8883047 9110127 9375555 9680891 10026446 10411410 10833925
59159A0833925M55741M81199M96310M99221M87462M58695M12684L51004K75274
$$ 10833925 11289666 11770865 12267175 12766396 13253858 13712553 14125237 14476241 14751515
59150A4751515J87188Q9675j3495j18662k21476l16305l98231m65051n15999n49932
$$ 14751515 14938703 15028378 15014883 14896221 14674745 14358440 13960209 13495158 12979159 12429227
59140A2429227n66620n68604n59577n41809n16930m87761m57013m25082l91600
$$ 12429227 11862607 11294003 10734426 10192617 9675687 9187926 8730913 8305831 7914231
59131G914231l58194l27193k98412k70024k42256k17567j97097j79240j61939
$$ 7914231 7556037 7228844 6930432 6660408 6418152 6200585 6003488 5824248 5662309
59122E662309j44428j26675j08873r1856p6802o4310n4269m5844l7078k6096j3745
$$ 5662309 5517881 5391206 5282333 5190477 5113675 5049365 4995096 4949252 4912174 4886078 4872333
59111D872333l399L387R072J6294K4048L0290L6178M4337N4208O2632O8587P4080
$$ 4872333 4868934 4872321 4881393 4897687 4921735 4952025 4988203 5032540 5086748 5149380 5217967 5292047
59099E292047Q0548Q7342R3826J00244J06142J10285J12521J13906J14804J14415
$$ 5292047 5372595 5459937 5553763 5654007 5760149 5870434 5982955 6096861 6211665 6326080
59089F326080J11961J06893R8512Q7011P4249O1686M8446L3195J6910J688j2104
$$ 6326080 6438041 6544934 6643446 6730457 6804706 6866392 6914838 6948033 6964943 6966631 6954527
59078F954527k5066l6100m3279m6890m8990n0210m9418m6214m1345l4765k5696
$$ 6954527 6929461 6893361 6850082 6803192 6754202 6703992 6654574 6608360 6567015 6532250 6506554
59067F506554j4632l054Q788K1837L6049N0305O4429P9437R5777J12972J30679
$$ 6506554 6491922 6488868 6497656 6519493 6555542 6605847 6670276 6749713 6845490 6958462 7089141
59056G089141J48527J65325J80188J94030K08466K23792K39294K54637K69443
$$ 7089141 7237668 7402993 7583181 7777211 7985677 8209469 8448763 8703400 8972843
59047H972843K82667K94010L04508L13985L19692L19494L14472L05699K90507
$$ 8972843 9255510 9549520 9854028 10168013 10487705 10807199 11121671 11427370 11717877
59038A1717877K65133K29392J85312J32786P0766J845o8453j36673k02029k62503
$$ 11717877 11983010 12212402 12397714 12530500 12601266 12603111 12534658 12397985 12195956 11933453
59028A1933453l14470l56447l89621m14328m29529m35979m36288m31328m20012
$$ 11933453 11618983 11262536 10872915 10458587 10029058 9593079 9156791 8725463 8305451
59019H305451m03212l84423l65561l45418l23321l01295k81262k62801k44920
$$ 8305451 7902239 7517816 7152255 6806837 6483516 6182221 5900959 5638158 5393238
59010E393238k27736k11380j95404j80186j66930j55620j44894j34275j24522
$$ 5393238 5165502 4954122 4758718 4578532 4411602 4255982 4111088 3976813 3852291
59001C852291j15548j06427r7616r0604q4993p8502p0521o3241n8544n5939n4056
$$ 3852291 3736743 3630316 3532700 3442096 3357103 3278601 3208080 3144839 3086295 3030356 2976300
58990B976300n2067m9221m5109m0716l7311l4406l0884k7736k6762k6820k4591
$$ 2976300 2924233 2875012 2829903 2789187 2751876 2717470 2686586 2658850 2632088 2605268 2580677
58979B580677j9327j3768r853o694l471j170l61J41J291K803M743P590J0329J1240
$$ 2580677 2561350 2547582 2537729 2531035 2527564 2526394 2526033 2526174 2527465 2530268 2535011 2542601 2552930 2564170
58965B564170J1082J2555J5881J8036J7259J5253J3725J1879Q827N685L511J558
$$ 2564170 2575252 2587807 2603688 2621724 2638983 2654236 2667961 2679840 2688667 2694352 2697863 2699421
58953B699421q54k944m135n033n591m659k403q18n80K6J804K924K009L86n44j766
$$ 2699421 2698567 2695623 2691488 2686455 2680864 2676205 2673802 2672984 2672404 2672430 2674234 2677158 2679167 2679553 2679009 2677243
58937B677243m556p973j0393j1924j3345j4212j3750j2337j0594q203m910j447
$$ 2677243 2672687 2664714 2654321 2642397 2629052 2614840 2601090 2588753 2578159 2569956 2565046 2563599
58925B563599J615M664P766R963J0872J1525J2740J4092J5297J7095J9835K2636
$$ 2563599 2565214 2569878 2577644 2587607 2598479 2610004 2622744 2636836 2652133 2669228 2689063 2711699
58913B711699K4854K7017K9621L2318L4935L7903M1136M3901M6082M8118M9692
$$ 2711699 2736553 2763570 2793191 2825509 2860444 2898347 2939483 2983384 3029466 3077584 3127276
58902C127276N0325N1184N3995N7875N9880N9299N8884O0884O4304O7243O9695
$$ 3127276 3177601 3228785 3282780 3340655 3400535 3459834 3518718 3579602 3643906 3711149 3780844
58891C780844P2591P6023P9803Q4319Q9661R5129J00403J05939J11893J18153
$$ 3780844 3853435 3929458 4009261 4093580 4183241 4278370 4378773 4484712 4596605 4714758
58881D714758J25487J34779J44995J54007J61779J70607J81910J94847K08346
$$ 4714758 4840245 4975024 5120019 5274026 5435805 5606412 5788322 5983169 6191515
58872F191515K22135K35668K48496K62089K78666K97966L17850L38255L61542
$$ 6191515 6413650 6649318 6897814 7159903 7438569 7736535 8054385 8392640 8754182
58863H754182L88464M17187M46959M79381N14975N52025N90169O31755O77775
$$ 8754182 9142646 9559833 10006792 10486173 11001148 11553173 12143342 12775097 13452872
58854A3452872P25483P71890Q16717Q60086R00062R34338R61584R78951R80856
$$ 13452872 14178355 14950245 15766962 16627048 17527110 18461448 19423032 20401983 21382839
58845B1382839R62677R23650Q64182P82517O76429N46587L96493K30937N6399
$$ 21382839 22345516 23269166 24133348 24915865 25592294 26138881 26535374 26766311 26822710
58836B6822710j18769k86647m41508n78752o94176p85768q54459r01956r29463
$$ 26822710 26703941 26417294 25975786 25397034 24702858 23917090 23062631 22160675 21231212
58827B1231212r39092r34171r17095q88952q52077q10463p66747p21323o75302
$$ 21231212 20292120 19357949 18440854 17551902 16699825 15889362 15122615 14401292 13725990
58818A3725990o31252n89894n49342n09300m72767m41721m14221l87861l63056
$$ 13725990 13094738 12504844 11955502 11446202 10973435 10531714 10117493 9729632 9366576
58809I366576l40500l18431k95267k72538k52337k33991k16079j99545j85931
$$ 9366576 9026076 8707645 8412378 8139840 7887503 7653512 7437433 7237888 7051957
58800G051957j74076j61559j48248j35836j24756j13827j02312r0513p8903o7889
$$ 7051957 6877881 6716322 6568074 6432238 6307482 6193655 6091343 6000830 5921927 5854038
58790E854038n7571m7020l5012k2085j0207J56J0624K2073L3596M4951N7284P0397
$$ 5854038 5796467 5749447 5714435 5692350 5682143 5682299 5692923 5714996 5748592 5793543 5850827 5921224
58778E921224Q2198R2182J02734J15539J29370J42799J56239J69878J82638J94885
$$ 5921224 6003422 6095604 6198338 6313877 6443247 6586046 6742285 6912163 7094801 7289686
58768G289686K09172K26485K44587K61849K79735K99686L20811L42722L67400
$$ 7289686 7498858 7725343 7969930 8231779 8511514 8811200 9132011 9474733 9842133
58759I842133L95950M26578M58118M92412N30768N71305O12435O55632P01844
$$ 9842133 10238083 10664661 11122779 11615191 12145959 12717264 13329699 13985331 14687175
58750A4687175P48169P91216Q30798Q67025Q96582R15206R21192R13114Q86650
$$ 14687175 15435344 16226560 17057358 17924383 18820965 19736171 20657363 21570477 22457127
58741B2457127Q37293P64107O67632N46796M01929K39163O8154j03237k69418
$$ 22457127 23294420 24058527 24726159 25272955 25674884 25914047 25982201 25878964 25609546
58732B5609546m24524n63214o82822p81869q57958r09917r40363r53392r51242
$$ 25609546 25185022 24621808 23938986 23157117 22299159 21389242 20448879 19495487 18544245
58723A8544245r35495r09374q76025q36475p91881p45715p01019o57699o15133
$$ 18544245 17608750 16699376 15823351 14986876 14194995 13449280 12748261 12090562 11475429
58714A1475429n75024n38878n05286m72751m42691m16444l91928l66671l41786
$$ 11475429 10900405 10361527 9856241 9383490 8940799 8524355 8132427 7765756 7423970
58705G423970l19504k99268k79691k61824k46700k32118k15825j99561j86025
$$ 7423970 7104466 6805198 6525507 6263683 6016983 5784865 5569040 5369479 5183454
58696E183454j74066j60988j47370j35272j23748j10735r7692q7847q1099p4685
$$ 5183454 5009388 4848400 4701030 4565758 4442010 4331275 4233583 4145736 4064637 3989952
58686C989952o7490n9924n1355m1824l4347l1149k9372k5156k0151j9092k2424
$$ 3989952 3922462 3862538 3811183 3769359 3735012 3703863 3674491 3649335 3629184 3610092 3587668
58675C587668k6645l0775l6843m4414n0048n2591n4235n6028n6724n6367n6805
$$ 3587668 3561023 3530248 3493405 3448991 3398943 3346352 3292117 3236089 3179365 3122998 3066193
58664C066193n8127n8447n7684n7897n9517o0671o0584o0428o0526n9752n7972
$$ 3066193 3008066 2949619 2891935 2834038 2774521 2713850 2653266 2592838 2532312 2472560 2414588
58653B414588n6280n4754n2454m9425m6440m3477m0660l9482m0346m0500l7383
$$ 2414588 2358308 2303554 2251100 2201675 2155235 2111758 2071098 2031616 1991270 1950770 1913387
58642A913387l2644k9673k8678k7671k6716k7296k8654k8629k7252k6001k4646
$$ 1913387 1880743 1851070 1822392 1794721 1768005 1740709 1712055 1683426 1656174 1630173 1605527
58631A605527k2397k0743k1313k2214k0484j6894j4207j2050p945k453J331K763
$$ 1605527 1583130 1562387 1541074 1518860 1498376 1481482 1467275 1455225 1447280 1444827 1446158 1448921
58619A448921L810M861M591L503L376L639K297R2j31K208N142P556R339R477P626
$$ 1448921 1452731 1457592 1462183 1465686 1469062 1472701 1474998 1475090 1474959 1477167 1482309 1489865 1499204 1508681 1516307
58604A516307O327P771R850R348P121N727M137m2m864o268m741m097m792m147
$$ 1516307 1522634 1530405 1540255 1549603 1556724 1562451 1566588 1566546 1561682 1555414 1550673 1546576 1541784 1537637
58590A537637k227j378o38L188R026J2336J2517J3568J7155K0927K4056K8282
$$ 1537637 1535410 1534032 1533394 1536582 1545608 1557944 1570461 1584029 1601184 1622111 1646167 1674449
58578A674449L2862L4584L3809L4786L8790M2530M4510M7372N2592N8215O3246
$$ 1674449 1707311 1741895 1775704 1810490 1849280 1891810 1936320 1983692 2036284 2094499 2157745
58567B157745O9277P6457Q2828Q8802R7205J07821J17213J25132J35670J50539
$$ 2157745 2227022 2303479 2386307 2475109 2572314 2680135 2797348 2922480 3058150 3208689
58557C208689J66472J81084J96048K12544K28493K42445K55733K68681K78837
$$ 3208689 3375161 3556245 3752293 3964837 4193330 4435775 4691508 4960189 5239026
58548E239026K84577K86280K82549K69555K45665K12621J71301J20907O3586N139
$$ 5239026 5523603 5809883 6092432 6361987 6607652 6820273 6991574 7112481 7176067 7181206
58538G181206n0329j02206j49010j87165k15468k36045k49622k54688k52416k47268
$$ 7181206 7130877 7028671 6879661 6692496 6477028 6240983 5991361 5736673 5484257 5236989
58528E236989k41059k31374k17386k02240j87897j72747j56156j40531j26913
$$ 5236989 4995930 4764556 4547170 4344930 4157033 3984286 3828130 3687599 3560686
58519C560686j13297r9169q7033p7646o8506n8812n1031m5652l9386l0750k2679
$$ 3560686 3447389 3348220 3261187 3183541 3115035 3056223 3005192 2959540 2920154 2889404 2866725
58508B866725j7488j3737r971p011m772j558J670J138l899j0175j6816k7098m1594
$$ 2866725 2849237 2835500 2825529 2818518 2813746 2812188 2813858 2814996 2811097 2800922 2784106 2757008 2715414
58495B715414n5021o2840o6214o7871o7834o5906o3701o1515n7414n1654m7655
$$ 2715414 2660393 2597553 2531339 2463468 2395634 2329728 2266027 2204512 2147098 2095444 2047789
58484B047789m6562m5438m2758m0798m0572l9487l6279l3363l2095l0534k7982
$$ 2047789 2001227 1955789 1913031 1872233 1831661 1792174 1755895 1722532 1690437 1659903 1631921
58473A631921k6712k7171k6685k4738k4042k4596k2788j8556j6860j9257k0654
$$ 1631921 1605209 1578038 1551353 1526615 1502573 1477977 1455189 1436633 1419773 1400516 1379862
58462A379862j7826j4613j4790j5961j4916j3287j3266j2891j0214p469o784o198
$$ 1379862 1362036 1347423 1332633 1316672 1301756 1288469 1275203 1262312 1252098 1244629 1237845 1231647
58450A231647l869j819j762j675k7J083M78Q29L640O139O566P584J1011J4208
$$ 1231647 1227778 1225959 1224197 1222522 1222495 1223578 1224056 1224885 1228525 1234664 1241230 1248814 1259825 1274033
58436A274033J5274J6726K0439K3996K5668K7678L0975L2321L0438K9283L1040
$$ 1274033 1289307 1306033 1326472 1350468 1376136 1403814 1434789 1467110 1497548 1526831 1557871
58425A557871L1557K7199K0713J5659J0525L221l978q942j4089k1366k7771l0662
$$ 1557871 1589428 1616627 1637340 1652999 1663524 1666745 1662767 1653825 1639736 1618370 1590599 1559937
58413A559937l2491l5524l7034l4848l2535l3693l5714l4413l0442k6328k1731
$$ 1559937 1527446 1491922 1454888 1420040 1387505 1353812 1318098 1283685 1253243 1226915 1205184
58402A205184j6430j3343j3733j4053j1854r845r880q636m100m05q32j901O9K331
$$ 1205184 1188754 1175411 1161678 1147625 1135771 1125926 1116046 1107410 1103310 1102905 1102073 1100172 1100241 1102572
58388A102572J604P50L197O161O028N371Q043J2050J3862J5062J8281K1176K1003
$$ 1102572 1104176 1104926 1108123 1114284 1120312 1125683 1133726 1145776 1159638 1174700 1192981 1214157 1235160
58375A235160K0510K2863K5235K3854K0811J9448J7707J2631O807L721J404k777
$$ 1235160 1255670 1278533 1303768 1327622 1348433 1367881 1385588 1398219 1405026 1408747 1410151 1407374
58363A407374n905m934l348n281p841o575l885m342o111m816j845r92p41K432
$$ 1407374 1401469 1396535 1393187 1387906 1380065 1373490 1369605 1365263 1359152 1354336 1352491 1351499 1350758 1353190
58349A353190O650Q060Q178J0591J3785J4234J3030J2688J1259O448J512J67j93
$$ 1353190 1359840 1367900 1376078 1386669 1400454 1414688 1427718 1440406 1451665 1458113 1459625 1459792 1459599
58336A459599l347o882p075o524r330j3067j3061j0419q643o781l197j120k784
$$ 1459599 1456252 1449370 1442295 1435771 1426441 1413374 1400313 1389894 1381251 1374470 1371273 1370153 1367369
58323A367369l295J856Q237R565P856Q156Q795O007K854M058O809O115M482O757
$$ 1367369 1364074 1365930 1374167 1383732 1391588 1399744 1408539 1414546 1417400 1421458 1428267 1434382 1438864 1445621
58309A445621J0209R430O502O573Q105P096O049Q934J2344J1703J0844J4872J9322
$$ 1445621 1455830 1465260 1471762 1478335 1486440 1493536 1499585 1508519 1520863 1532566 1543410 1558282 1577604
58296A577604J7650J3998J6388K2345K3810K1683K2655K5612K4327K0151J9108
$$ 1577604 1595254 1609252 1625640 1647985 1671795 1693478 1716133 1741745 1766072 1786223 1805331
58285A805331J9470J4967P474L869L239k49m785m021K35J273M64L996R631J0124
$$ 1805331 1824801 1839768 1847242 1851111 1854350 1854101 1849316 1845295 1845530 1846803 1847267 1851263 1860894 1871018
58271A871018P184Q564J3613J5287J4022J6052K0256K0416J8344K0829K5857K5925
$$ 1871018 1878202 1886766 1900379 1915666 1929688 1945740 1965996 1986412 2004756 2025585 2051442 2077367
58259B077367K2713K4073K8702K8678K5094K6042L0799L1404K8304K8880L1839
$$ 2077367 2100080 2124153 2152855 2181533 2206627 2232669 2263468 2294872 2323176 2352056 2383895
58248B383895K8998K1591J8788K0726J8956J3193J1522J4440J4763J2993J6474
$$ 2383895 2412893 2434484 2453272 2473998 2492954 2506147 2517669 2532109 2546872 2559865 2576339
58237B576339K3725K6097K4605K8367L6714M0061L8417M1382M9489N3328N1821
$$ 2576339 2600064 2626161 2650766 2679133 2715847 2755908 2794325 2835707 2885196 2938524 2990345
58226B990345N3636N9684O1961O0507O3661P0853P3268P2055P7154Q7524R1818
$$ 2990345 3043981 3103665 3165626 3226133 3289794 3360647 3433915 3505970 3583124 3670648 3762466
58215C762466Q9580R2160J01339J06774J06137J07891J12781J12571J08325J09561
$$ 3762466 3852046 3944206 4045545 4152319 4258456 4366347 4479128 4591699 4700024 4809585
58205D809585J14407J11638J03117J02265J09654J12993J12052J19449J35302
$$ 4809585 4923992 5035630 5138747 5241012 5350666 5463659 5575711 5695160 5830462
58196E830462J45957J50130J61071J80399J95518K05428K22490K45859K60727
$$ 5830462 5976419 6126549 6287620 6468019 6663537 6868965 7091455 7337314 7598041
58187G598041K67158K81414L05229L23052L33257L51294L77662L95109M02958
$$ 7598041 7865199 8146613 8451842 8774894 9108151 9459445 9837107 10232216 10635174
58178A0635174M21128M53840M83306N06195N40771N89909O33683O68003P13170
$$ 10635174 11056302 11510142 11993448 12499643 13040414 13630323 14264006 14932009 15645179
58169A5645179P73831Q28645Q70653R18734R77395J026151J061549J107880J172789
$$ 15645179 16419010 17247655 18118308 19037042 20014437 21040588 22102137 23210017 24382806
58160B4382806J235679J293843J374103J483413J595953J705288J838533K000881
$$ 24382806 25618485 26912328 28286431 29769844 31365797 33071085 34909618 36910499
58152C6910499K159860K304544K465008K653017K843793L038688L280579L582376
$$ 36910499 39070359 41374903 43839911 46492928 49336721 52375409 55655988 59238364
58144E9238364L910992M270627M725620N309169N993852O791060P789176R048734
$$ 59238364 63149356 67419983 72145603 77454772 83448624 90239684 98028860 107077594
58136A07077594J0553189J2299951J4317316J6536476J8789978K1021561K3371936
$$ 107077594 117630783 129930734 144248050 160784526 179574504 200596065 223968001
58129B23968001K6025022K9185218L3183810L7993122M2081953M2158520L5139190
$$ 223968001 249993023 279178241 312362051 350355173 392437126 434595646 469734836
58122D69734836K0991848L399230j2714020k4284263l0993636l3977646l4439554
$$ 469734836 490726684 494125914 481411894 457127631 426133995 392156349 357716795
58115C57716795l3306789l1341924k9054306k6624150k4103069k1606086j9243417
$$ 357716795 324410006 293068082 264013776 237389626 213286557 191680471 172437054
58108A72437054j7017766j4908420j2969299j1258820r751048q394467p195941
$$ 172437054 155419288 140510868 127541569 116282749 106531701 98137234 90941293
58101I0941293o177901n305853m522878l814015l179762k584004j987359j405744
$$ 90941293 84763392 79457539 74934661 71120646 67940884 65356880 63369521 61963777
58093F1963777q77492l83446J49968P70079J464006K203027K951892L574201L758459
$$ 61963777 61086285 60702839 60852807 61622886 63086892 65289919 68241811 71816012 75574471
58084G5574471L152023J671564l17388k203039l553299m333818m739348m916353
$$ 75574471 78726494 80398058 80080670 77877631 74324332 69990514 65251166 60334813
58076F0334813m900850m727582m468489m165656l815525l433384l068648k743987
$$ 60334813 55433963 50706381 46237892 42072236 38256711 34823327 31754679 29010692
58068B9010692k436978k136498j866684j640798j439759j253681j101354r90444
$$ 29010692 26573714 24437216 22570532 20929734 19489975 18236294 17134940 16144496
58060A6144496q97922q08468p36431o91763o57617o19683n86695n64562n39333
$$ 16144496 15246574 14438106 13701675 13009912 12352295 11732612 11145917 10581355 10042022
58051A0042022n02941m68566m44340m17834l81853l49851l30387l11323k84896
$$ 10042022 9539081 9070515 8626175 8208341 7826488 7476637 7146250 6834927 6550031
58042F550031k64139k58264k54682k41601k27040k19562k11017j94302j78900
$$ 6550031 6285892 6027628 5772946 5531345 5304305 5084743 4873726 4679424 4500524
58033D500524j72966j68035j56208j45068j41483j37770j27709j19431j18953
$$ 4500524 4327558 4159523 4003315 3858247 3716764 3578994 3451285 3331854 3212901
58024C212901j17414j07915r8863r7446r5954q7646q0302q0678q0838p3471o5941
$$ 3212901 3095487 2987572 2888709 2791263 2695309 2607663 2527361 2446683 2365845 2292374 2226433
58013B226433o5587o5449n8257n0878n1194n3487n0253m6062m6822m7236m1745
$$ 2226433 2160846 2095397 2037140 1986262 1935068 1881581 1831328 1785266 1738444 1691208 1649463
58002A649463l6231l6545l6919l1750k7372l0002l3546l1321k8420l0459l1525
$$ 1649463 1613232 1576687 1539768 1508018 1480646 1450644 1417098 1385777 1357357 1326898 1295373
57991A295373k5838k0148k1695k4680k1632j7663k0050k3609k0239j4058j3262
$$ 1295373 1269535 1249387 1227692 1203012 1181380 1163717 1143667 1120058 1099819 1085761 1072499
57980A072499j5181j2756q500q746j0877q782m824m469n285k643j2k367n458k915
$$ 1072499 1057318 1044562 1036062 1027316 1016439 1007657 1002833 998364 993079 990436 990424 988057 982599 979684
57966I79684K045K725Q06J473K782N39k045j71K783J653j43K932P442P032M140
$$ 979684 981729 984454 985260 986733 989515 990054 988009 987838 990621 992274 992131 995063 1002505 1009537 1013677
57951A013677M989P831O946L654K969L523J044k261j775J74j186l231m50M918
$$ 1013677 1018666 1026497 1033443 1037097 1040066 1043589 1044633 1042372 1040597 1040771 1039585 1036354 1035904 1040822
57937A040822O436M185K677J559k348p140r110j0633j5809k1391k1043j5802j1717
$$ 1040822 1047258 1051443 1054120 1055679 1053331 1046191 1037081 1026448 1010639 989248 968205 952403 940686
57924I40686r976p659n297n284n593l083k10p92k385o38K299J785m75K01K652
$$ 940686 930710 923051 917754 912470 906877 903794 903584 902792 900407 899769 902068 903853 903378 903579 906231
57909I06231K643J171J764K813Q90j589m10K124J448r3K590P186P416L970K435
$$ 906231 908874 910045 911809 914622 915512 913923 913513 915637 917085 916992 919582 926768 934184 938154 940589
57894I40589K596m06n869q230p207p791j0558j0850p756n429n135l860j086M18
$$ 940589 943185 942779 936910 928680 921473 913682 903124 892274 884518 879089 873954 870094 869008 869426
57880H69426P70K955O489P817O991P400R123Q849O240M039K177k091q414j3582
$$ 869426 870196 873151 879640 887457 894448 901848 910971 919820 926060 930099 932276 930185 921771 908189
57866I08189j7105k1023k4750k5671k4134k2588k0912j7792j5192j5854j7801
$$ 908189 891084 870061 845311 819640 795506 772918 752006 734214 719022 703168 685367
57855F85367j6882j3242j0021p556m475k198k424k506O66M655N501M899O564Q607
$$ 685367 668485 655243 645222 637666 633191 630993 628569 626063 626729 631384 636885 641784 648348 656955
57841F56955P102M457N829R374Q812M391K427M544O002M696L527L483K248K55
$$ 656955 664057 668514 674343 683717 692529 696920 699347 703891 709893 714589 718116 721599 723847 724102
57827G24102O15K498J755j438k690j396j477l850n340n541p429j0480j0586p602
$$ 724102 724717 727215 728970 727532 724842 723446 721969 718119 712779 707238 699809 689329 678743 671141
57813F71141n924o647o233l823k598k769o54L746N598L530K051L691N475N510
$$ 671141 665217 658570 652337 648514 645916 643147 642493 646239 651837 655367 657418 661109 666584 672094
57799F72094O298Q907J0140Q424O735O967O648L973J001n38j908l715m293l587
$$ 672094 678392 687299 697439 705863 712598 719565 726213 730186 731187 730649 728741 725026 720733 717146
57785G17146m069o024o631n238m717n971o074l659j446j546k712l762n343o956
$$ 717146 713077 707053 700422 695184 690467 684496 678422 674763 673317 671771 669059 665297 659954 652998
57771F52998o727n391n973q494r584q323p455q005p896p011q048j0838j1395q489
$$ 652998 646271 640880 634907 626413 616829 608506 601051 593046 585150 578139 570091 559253 547858 539369
57757E39369n973o558q288r033r574j0241r434p433o952q128p653m636k338k331
$$ 539369 533396 526838 518550 509517 499943 489702 480268 472835 465883 457755 450102 445466 443128 440797
57743D40797k039m7J298P89Q07K486L405K561K707N118O831N970N305P504J0890
$$ 440797 438758 438711 440009 440798 441605 444091 447496 450057 452764 457882 464713 470683 475988 483492 494382
57728D94382J2771J3138J2619J0652Q097P767R998J1452J0372R009Q910Q163N530
$$ 494382 507153 520291 532910 543562 551659 559426 569424 580876 591248 600257 609167 617330 622860
57715F22860L022J877K44k714m648m451m740p293j0053j1170j1932j3106j2569
$$ 622860 625882 627759 628003 625289 620641 616190 611450 604157 594104 582934 571002 557896 545327
57702E45327r438o596o231o610n929n487o293o315m043j302K46J836M276N629
$$ 545327 535889 529293 523062 516452 510523 505036 498743 492428 488385 487083 487329 489165 493441 499070
57688D99070M865M239N386O547O278O165P325P921O858O139O894O929N073L978
$$ 499070 503935 508174 513560 520107 526385 532550 539875 547796 554654 560793 567687 574616 579689 583667
57674E83667N556P486P401O817P647Q403P379O278P242R305J0864J2664J5405
$$ 583667 589223 596709 604110 610927 618574 626977 634356 640634 647876 657181 668045 680709 696114
57661F96114J7445J7822J8391K0262K1479K0937K1004K3277K5424K5373K5077
$$ 696114 713559 731381 749772 770034 791513 812450 833454 856731 882155 907528 932605
57650I32605K6758K8919K9521K9719L1147L2769L3839L6460M1777M6980M9659
$$ 932605 959363 988282 1017803 1047522 1078669 1111438 1145277 1181737 1223514 1270494 1320153
57639A320153N1811N5898O0370O2995O5254O9456P4400P8019Q1436Q6568R2453
$$ 1320153 1371964 1427862 1488232 1551227 1616481 1685937 1760337 1838356 1919792 2006360 2098813
57628B098813R7813J04520J14659J26795J38785J51600J66784J83091J99099K16015
$$ 2098813 2196626 2301146 2415805 2542600 2681385 2832985 2999769 3182860 3381959 3597974
57618C597974K33972K48867K57087K60317K61256K57554K44745K22557J93870
$$ 3597974 3831946 4080813 4337900 4598217 4859473 5117027 5361772 5584329 5778199
57609E778199J60097J22224Q3820M7853J2343k6447o8437j11371j54964j98199
$$ 5778199 5938296 6060520 6144340 6192193 6204536 6178089 6109652 5998281 5843317 5645118
57599E645118k34944k58164k67521k68113k62999k51758k35114k15885j95726
$$ 5645118 5410174 5152010 4884489 4616376 4353377 4101619 3866505 3650620 3454894
57590C454894j75030j55285j37832j21457j04804q9628p7894o7665n6046m4298
$$ 3454894 3279864 3124579 2986747 2865290 2760486 2670858 2592964 2525299 2469253 2424955
57580B424955l5432k8534k0387j1233l932J633Q281J6399K3826L0333L7726M5976
$$ 2424955 2389523 2360989 2340602 2329369 2325437 2327070 2335351 2351750 2375576 2405909 2443635 2489611
57568B489611N3683O1865P2984Q6384R8920J09879J21390J34152J46467J57251
$$ 2489611 2543294 2605159 2678143 2764527 2863447 2973326 3094716 3228868 3375335 3532586
57558C532586J66684J74273J79330J82406J83104J77865J63350J40507J11891
$$ 3532586 3699270 3873543 4052873 4235279 4418383 4596248 4759598 4900105 5011996
57549E011996P7208L5853q288m9666q7205j22498j53420j75323j88041j96015
$$ 5011996 5089204 5125057 5116769 5067103 4979898 4857400 4703980 4528657 4340616 4144601
57539D144601k01443k02589j99024j93273j86582j77750j66864j55985j45598
$$ 4144601 3943158 3740569 3541545 3348272 3161690 2983940 2817076 2661091 2515493
57530B515493j34381j22744j12640j03942r4972q6453q0534p6248p0560o3728
$$ 2515493 2381112 2258368 2145728 2041786 1946814 1860361 1779827 1703579 1633019 1569291
57520A569291n8763n5506n0513m3284l7444l4625l2260k8741k5958k5029k3793
$$ 1569291 1510528 1455022 1404509 1361225 1323781 1289156 1256896 1228155 1202197 1177168 1153375
57509A153375k0699j7398j5651j4778j3703j2580j1236q837n945m193l373j757
$$ 1153375 1132676 1115278 1099627 1084849 1071146 1058566 1047330 1038493 1032548 1028355 1024982 1023225
57497A023225O91K486L964O815J0397J2323J2783J4293J6951J8282J8171J9586
$$ 1023225 1023916 1026402 1030366 1037181 1047578 1059901 1072684 1086977 1103928 1122210 1140381 1159967
57485A159967K3506K7409K9856L2410L5865L8630M0237M2654M6801N1162N5039
$$ 1159967 1183473 1210882 1240738 1273148 1309013 1347643 1387880 1430534 1477335 1528497 1583536
57474A583536N9707O5436P0913P6412Q3820R2692J00175J05844J12673J22024
$$ 1583536 1643243 1708679 1779592 1856004 1939824 2032516 2132691 2238535 2351208 2473232
57464B473232J31540J39088J44925J48691J48269J43093J34679J22654J04127
$$ 2473232 2604772 2743860 2888785 3037476 3185745 3328838 3463517 3586171 3690298
57455C690298P8584M9529J9689j1441m3579p3244r7536j16920j32232j42281j46425
$$ 3690298 3768882 3818411 3838100 3826659 3783080 3709836 3612300 3495380 3363148 3220867 3074442
57444C074442j46491j44229j39565j32756j25270j17409j08150r8217q9771q2353
$$ 3074442 2927951 2783722 2644157 2511401 2386131 2268722 2160572 2062355 1972584 1890231
57434A890231p3241o2759n4680m9884m4492l6433k8951k4757k1239j5014p464
$$ 1890231 1816990 1754231 1699551 1649667 1605175 1568742 1539791 1515034 1493795 1478781 1471317
57423A471317k014R93L411N962Q972J3808K0652K7066L1475L5965M3026N1687
$$ 1471317 1469303 1470296 1473707 1479669 1488641 1502449 1523101 1550167 1581642 1617607 1660633 1712320
57411A712320N9345O5575P1862P9266Q8094R8093J07671J14832J19974J25391
$$ 1712320 1771665 1837240 1909102 1988368 2076462 2174555 2282226 2397058 2517032 2642423
57401B642423J31200J34516J33514J28889J20261J05001Q2514N6087K8413j301
$$ 2642423 2773623 2908139 3041653 3170542 3290803 3395804 3478318 3534405 3562818 3561517
57391C561517l3671o5853r4306j18003j36872j49976j57232j60161j59267j53692
$$ 3561517 3527846 3461993 3367687 3249684 3112812 2962836 2805604 2645443 2486176 2332484
57381B332484j44861j36856j31378j25907j18521j10671j03423r5206q5739p7903
$$ 2332484 2187623 2050767 1919389 1793482 1674961 1564290 1460867 1365661 1279922 1202019
57371A202019p3010o8280o1782n5800n2291m9175m4536m0423l8804l7499l3992
$$ 1202019 1129009 1060729 998947 943147 890856 841681 797145 756722 717918 680419 646427
57360F46427k9821k7353k5566k2792k0396j9782j9018j6396j4206j4849j6244
$$ 646427 616606 589253 563687 540895 520499 500717 481699 465303 451097 436248 420004
57349D20004j5305j3064j2016j1185q484n521n321p160q016p433o989o830o495
$$ 420004 404699 391635 379619 368434 359950 354429 349108 341948 333932 326499 319510 312680 306185
57336C06185p136r101r533o290k040m61q31n13k97k329m893m512j855n49j229
$$ 306185 299049 289948 280415 274125 272085 271624 270793 270280 269983 267654 262761 258249 256394 255845 254616
57321B54616j542j221k269m442n129l747k427k213k048j417r49o16r7l24k092
$$ 254616 253074 251853 249584 245142 240013 236266 233839 231626 229578 228161 227212 226596 226499 226175 224083
57306B24083l962l982k392n18J362K776J929j312l671k794r37j054j920r91O65
$$ 224083 220121 216139 213747 213229 214591 217367 219296 217984 214313 211519 210582 209528 207608 206617 207282
57291B07282O88K67J916M347M523L164L330M899N357N047O525R310J0201Q666
$$ 207282 207970 208237 210153 214500 219023 222187 225517 230416 235773 240820 247345 256655 266856 275522
57277B75522P465Q103R609J1507J4044J5930J5733J4933J5918J7714J7638J6251
$$ 275522 282987 291090 300699 312206 326250 342180 357913 372846 388764 406478 424116 440367
57265D40367J6481J8491J9664J9187J8446J7331J4279R844O358M256K320R62J508
$$ 440367 456848 475339 495003 514190 532636 549967 564246 574090 580448 584704 587024 587986 589494
57252E89494K876K926K447L965P117R287J0169J1720J3985J5122J5203J6107J7908
$$ 589494 592370 595296 597743 601708 608825 618112 628281 640001 653986 669108 684311 700418 718326
57239G18326J9027J9567K0761K1820K1011J9218J8694J9278J9580K0674K4355
$$ 718326 737353 756920 777681 799501 820512 839730 858424 877702 897282 917956 942311
57228I42311K8853L0852L0838L1965L4509L6202L7287M0143M4267M6499M6255
$$ 942311 971164 1002016 1032854 1064819 1099328 1135530 1172817 1212960 1257227 1303726 1349981
57217A349981M5951M6390M6064M4850M3945M2448L8140L1451K4432J6706O829
$$ 1349981 1395932 1442322 1488386 1533236 1577181 1619629 1657769 1689220 1713652 1730358 1737187
57206A737187l330j0382j4732j9322k3901k5731k5146k4956k4971k2680j8896
$$ 1737187 1733857 1723475 1708743 1689421 1665520 1639789 1614643 1589687 1564716 1542036 1523140
57195A523140j7029j6881j4888j0658p596o753n515k717J13K734O257R429J0136
$$ 1523140 1506111 1489230 1474342 1463684 1456088 1449335 1443820 1441103 1441216 1443950 1450207 1459636 1469772
57182A469772J0190J3050J7227J8085J5792J5100J7247J8783J8712J9922K2674
$$ 1469772 1479962 1493012 1510239 1528324 1544116 1559216 1576463 1595246 1613958 1633880 1656554
57171A656554K3450K1570K0525K1471K1587K0236K0588K3611K6292K7214K8294
$$ 1656554 1680004 1701574 1722099 1743570 1765157 1785393 1805981 1829592 1855884 1883098 1911392
57160A911392L0021L0704L1242L4703M0338M4081M5490M7915N1464N2533N0986
$$ 1911392 1941413 1972117 2003359 2038062 2078400 2122481 2167971 2215886 2267350 2319883 2370869
57149B370869N0691N2195N2093N0510N1613N5623N8155N8882O2680P0408P6766
$$ 2370869 2421560 2473755 2525848 2576358 2627971 2683594 2741749 2800631 2863311 2933719 3010485
57138C010485P9547Q2757Q8002R1041Q9946Q8829R0122R0735Q9030Q8145Q9200
$$ 3010485 3090032 3172789 3260791 3351832 3441778 3530607 3620729 3711464 3800494 3888639 3977839
57127C977839Q8590Q5116Q2338Q0879P6132O6796N7871N1848M4821L4911K6529
$$ 3977839 4066429 4151545 4233883 4314762 4390894 4457690 4515561 4567409 4612230 4647141 4673670
57116D673670K2440J9323J4962J2171J1952J0711P904Q440J3754J8751K1325K6295
$$ 4673670 4696110 4715433 4730395 4742566 4754518 4765229 4773133 4781573 4795327 4814078 4835403 4861698
57104D861698L5762M4318M8261N0988N4863N6527N4866N4915N9112O3339O5945
$$ 4861698 4897460 4941778 4990039 5041027 5095890 5152417 5207283 5262198 5321310 5384649 5450594
57093E450594P1442Q0771Q7591Q9038R0356R4030R4586Q9319Q3466P9253P0864
$$ 5450594 5522036 5602807 5690398 5779436 5869792 5963822 6058408 6147727 6231193 6310446 6381310
57082F381310N6409M3789L8112L4119K7508K2337K0535J5892N644l680q905j6338
$$ 6381310 6437719 6481508 6519620 6553739 6581247 6603584 6624119 6640011 6645655 6641975 6633070 6616732
57070F616732k8336l7146l9917m6007o1129p8499r4607j18791j57201k02279k48316
$$ 6616732 6588396 6551250 6511333 6465326 6404197 6325698 6231091 6112300 5955099 5752820 5504504
57059E504504l02025l67028m34115m98271n68722o50507p34147q16178B22576
$$ 5504504 5202479 4835451 4401336 3903065 3334343 2683836 1949689 1133511 222576
57049h05504j158038j294056j447968j628546j826713k039108k282475k566402
$$ -805504 -1963542 -3257598 -4705566 -6334112 -8160825 -10199933 -12482408 -15048810
57041a5048810k877014l206908l573169l984433m420185m864739n326574n799386
$$ -15048810 -17925824 -21132732 -24705901 -28690334 -33110519 -37975258 -43301832 -49101218
57033d9101218o245573o648834p038978p435175p820115q195419q572358q873220
$$ -49101218 -55346791 -61995625 -69034603 -76469778 -84289893 -92485312 -101057670 -109930890
57025a09930890r013541r228724j0118621j1987585j4085630j4860776j3250956
$$ -109930890 -118944431 -128173155 -138291776 -150279361 -164364991 -179225767 -192476723
57018a92476723r644952n423025j676025J448936M304965P025572R351063J0939151
$$ -192476723 -202121675 -207544700 -209220725 -207771789 -203466824 -196441252 -187090189 -176151038
57010a76151038J1663917J1681878J1332866J0956398J0714588J0564048J0394118
$$ -176151038 -164487121 -152805243 -141472377 -130515979 -119801391 -109237343 -98843225
57003i8843225J0153962R840530R436146Q917314Q296537P610741O885134O139187
$$ -98843225 -88689263 -78848733 -69412587 -60495273 -52198736 -44587995 -37702861 -31563674
56995c1563674N408123M726325M101745L530282L021348K587150K220596J905421
$$ -31563674 -26155551 -21429226 -17327481 -13797199 -10775851 -8188701 -5968105 -4062684
56987d062684J637066a010081B19590J066824R28004Q17369P26229O42318N65095
$$ -4062684 -2425618 -1010081 219590 1286414 2214418 3031787 3758016 4400334 4965429
56978D965429M98048M35684L72169L13718K68716K33452J99744J68448J43406
$$ 4965429 5463477 5899161 6271330 6585048 6853764 7087216 7286960 7455408 7598814
56969G598814J20317R3996O9684N5462M9476M5051M2015M2894M4147M1146L6175
$$ 7598814 7719131 7813127 7882811 7938273 7987749 8032800 8074815 8117709 8161856 8203002 8239177
56958H239177L2458K6241J3556r91j0751j6544k1738k4218k1660j8897k1698k8709
$$ 8239177 8271635 8297876 8311432 8310441 8299690 8283146 8261408 8237190 8215530 8196633 8174935 8146226
56946H146226l6969m9157o7444q6488j00627j12177j24944j35967j41610j45013
$$ 8146226 8109257 8060100 7992656 7906168 7805541 7693364 7568420 7432453 7290843 7145830
56936G145830j49041j48830j39484j22822r7130n1725J1877O0361N0394k7129
$$ 7145830 6996789 6847959 6708475 6585653 6488523 6436798 6448675 6509036 6559430 6532301
56926F532301j37104k35125l00563l35592l48296l45618l34139l18396k99806
$$ 6532301 6395197 6160072 5859509 5523917 5175621 4830003 4495864 4177468 3877662
56917C877662k79615k59932k41010k21372k01377j83078j66588j50488j35384
$$ 3877662 3598047 3338115 3097105 2875733 2674356 2491278 2324690 2174202 2038818
56908B038818j22957j12058j00077q7583p7343o9372o1305n2858m5449l8303k9610
$$ 2038818 1915861 1803803 1703726 1616143 1538800 1469428 1408123 1355265 1309816 1271513 1241903
56897A241903k1045j6458j6470j8705k2499k8690l5317l8864l9755m1611m4674
$$ 1241903 1220858 1204400 1187930 1169225 1146726 1118036 1082719 1043855 1004100 962489 917815
56886I17815m4896m0445l4544l0535k7928k4633j9800j3432o139j1L049M378P212
$$ 917815 872919 832474 797930 767395 739467 714834 695034 681602 675463 675452 678501 682879 690091
56873F90091J2190J7170K1391K6168L0844L1523K5364J3666k23j3737k5015l2467
$$ 690091 702281 719451 740842 767010 797854 829377 854741 868407 868184 854447 829432 796965
56861G96965l5782l6074l4399l1344k7907k5066k2473j9272j5998j3899j2719
$$ 796965 761183 725109 690710 659366 631459 606393 583920 564648 548650 534751 522032
56850E22032j1116r068p727p087n887l879k221j440q18K30J754M103P344J0077
$$ 522032 510916 501848 494121 487034 481147 477268 475047 473607 472789 473019 474773 478876 486220 496297
56836D96297J0767J0213J0911J3831J7566K0621K2792K4235K4867K5057K5495
$$ 496297 507064 517277 528188 542019 559585 580206 602998 627233 652100 677157 702652
56825G02652K5975K5326K2499J6942Q360k575j3543k1969k6972k9126k8977k6893
$$ 702652 728627 753953 776452 793394 801754 799179 785636 763667 736695 707569 678592 651699
56813F51699k3779k0441j6616j1778o510j997J382M054O624J0184J6074K4104
$$ 651699 627920 607479 590863 579085 572575 570578 571960 576014 582638 592822 608896 633000
56801F33000L1913L7397M0680M2429M1561L6438K7248J5532K529j0158j9624k3927
$$ 633000 664913 702310 742990 785419 826980 863418 890666 906198 908727 898569 878945 855018
56789H55018k4434k3731k2007j7914j2153p190l565P41O884J3589J9569K5353
$$ 855018 830584 806853 784846 766932 754779 747589 744024 744765 751649 765238 784807 810160
56777H10160L1898L9004M5796N1576N5759N7934N7952N4850M6309L0835J0569
$$ 810160 842058 881062 926858 978434 1034193 1092127 1150079 1204929 1251238 1282073 1292642
56766A292642r678k6109l7547m4041m6028m4864m2234l8589l3550k7771k2680
$$ 1292642 1282964 1256855 1219308 1175267 1129239 1084375 1042141 1003552 970002 942231 919551
56755I19551j8314j3258o861J89P582J5637K3464K9058L2024L4267L6787L7366
$$ 919551 901237 887979 881118 881307 888889 904526 927990 957048 989072 1023339 1060126 1097492
56743A097492L2687K1783O508j0115k5039l5965m2421m5666m6812m5770m2542
$$ 1097492 1130179 1151962 1158470 1148355 1123316 1087351 1044930 999264 952452 906682 864140
56732H64140l8354l4359l0096k4555j8191j2571q263m303K18N131R921J4475J8563
$$ 864140 825786 791427 761331 736776 718585 706014 697751 693448 693666 698797 708718 723193 741756
56719G41756K1165K0993J7453J0780J578r142j9450k6893l0085k9942k8828k8417
$$ 741756 762921 783914 801367 812147 813725 804583 785133 758240 728155 698213 669385 640968
56707F40968k8582k8257k6815k4317k1061j7477j4374j2641j2349j2368j1265
$$ 640968 612386 584129 557314 532997 511936 494459 480085 467444 455095 442727 431462
56696D31462q796o249n009m855m396l163k480l519n342n931m824l514l300l936
$$ 431462 422666 416417 411408 406553 402157 398994 396514 392995 387653 381722 376898 373384 370084 366148
56682C66148m566m882m904m553m000l799m220m926n479n554m688k658k66J124
$$ 366148 361582 356700 351796 347243 343243 339444 335224 330298 324819 319265 314577 311919 311653 312777
56668C12777J075L49m04j217j862j676q37o22j632k826l154l151l833m777m615
$$ 312777 313852 314201 313797 312580 310718 309042 308205 307583 305951 303125 299971 296820 292987 288210 283595
56653B83595l138j637j087r30q0J418K227J308o65j911j633q89r35j392r04P98
$$ 283595 280457 278820 277733 276803 276723 278141 280368 281676 281011 279100 277467 276578 275643 274251 273347 274145
56637B74145K583L460L415K813K029J576J626J477N68k81J90J731K978L460L584
$$ 274145 276728 280188 283603 286416 288445 290021 291647 293124 293692 293411 293601 295332 298310 301770 305354
56622C05354K956R00j360j403P85K278J327k11j5J218J345K76k90L08J155J515
$$ 305354 308310 309210 307850 306447 307232 309510 310837 310626 310611 311829 313174 313450 313160 313468 314623 316138
56606C16138J415P50n97j799j550K40K076K335P36j543k822k414j317j034j604
$$ 316138 317553 318303 317706 315907 314357 314597 316673 319008 319744 318201 315379 312965 311648 310614 309010
56591C09010j649n15P41J019P26Q76J515J840J274k05k160l540l177j051J452
$$ 309010 307361 306846 307587 308606 309332 310208 311723 313563 314837 314632 312472 308932 305755 304704 306156
56576C06156K925L033K110P21j50L74J836K825K936L221M123M430L169J318N02
$$ 306156 309081 312114 314224 314945 314795 315169 317005 319830 322766 325987 330110 334540 337709 339027 339529
56561C39529Q07R51M0j635k990k841r41J211J507l57k489l250l042l017l193k772
$$ 339529 340336 341287 341327 339692 336702 333861 332920 334131 335638 335281 332792 329542 326500 323483 320290 317518
56545C17518j475K37J657K109J363K03k11K35P10R43J456K179K381K171K471L125
$$ 317518 316043 316280 317937 320046 321409 321612 321401 321636 322346 323289 324745 326924 329305 331476 333947 337072
56529C37072K829J508P91J251J161o75k604k260J69K415K927K030R54P88J692
$$ 337072 339901 341409 342200 343451 344612 343937 341333 339073 339242 341657 344584 346614 347568 348356 350048
56514C50048K463J735R6k07J769M305N394N061M520M453M996O124P115O940N880
$$ 350048 352511 354246 354342 354135 355904 360209 365603 370664 375184 379637 384633 390757 397872 404812 410692
56499D10692N469O113O411N565M655M559M542M040L990M975N847N595M883M411
$$ 410692 416161 422274 428685 434250 438905 443464 448006 452046 456036 461011 466858 472453 477336 481747
56485D81747L520J928Q98J020P24j145l109l457l011l308l696k843j666k064l674
$$ 481747 485267 487195 488093 489113 489837 488692 485583 482126 479115 475807 472111 469268 467602 465538 461864
56470D61864m600m534m669n057m706l942m228n556o248n543m527m195m234l916
$$ 461864 457264 452730 448061 443004 438298 434356 430128 424572 418324 412781 408254 404059 399825 395909
56456C95909l046j889j137j666l392m880n041m544m465m472l661k401j784j929
$$ 395909 392863 390974 389837 388171 384779 379899 374858 370314 365849 361377 357716 355315 353531 351602
56442C51602k298k971m055m440k951l81J220J188O89P57J242J723K229K907L682
$$ 351602 349304 346333 342278 337838 334887 334506 335726 336914 337603 338360 339602 341325 343554 346461 350143
56427C50143M312M336L396K032J479K011K336J345l44j335j135j75J007J933K285
$$ 350143 354455 358791 362187 364219 365698 367709 370045 371390 371046 369711 368576 368401 369408 371341 373626
56412C73626K424K940L429K989K178K751M984P004P507P196O717N389L177J745
$$ 373626 376050 378990 382419 385408 387586 390337 395321 402325 409832 417028 423745 429134 432311 434056
56398D34056K008K618K409K298L120L618K634J319J175J596J489J498K367K810
$$ 434056 436064 438682 441091 443389 446509 450127 452761 454080 455255 456851 458340 459838 462205 465015
56384D65015J568Q3N23K315L244K909K564K383J466k5j039j559k266k761k067
$$ 465015 466583 466666 467189 469504 472748 475657 478221 480604 482070 482045 481006 479447 477181 474420 472353
56369D72353m62Q84J689K392K790K288R61p82k756m325m422l307k759l429l826
$$ 472353 471891 472775 474464 476856 479646 481934 482895 482113 479357 475032 470610 467303 464544 461115 457289
56354D57289l173l114m784o462o305n320n212n249l988k300j981k728l196l584
$$ 457289 454116 451002 446218 439756 433451 428131 422919 417670 413682 411382 409401 406673 403477 399893
56340C99893m524m772k937k71R36P62Q28J300J254R23J050J118N80N09J513J796
$$ 399893 395369 390597 387660 387389 388325 389087 389915 391215 392469 393392 394442 395560 396140 396649 398162 399958
56324C99958j6j826j044J008J211j98l12J392K549K024J105O44K19P7J076K664
$$ 399958 399942 398116 397072 398080 399291 399093 398781 400173 402722 404746 405851 406495 406714 406791 407867 410531
56308D10531L440L522M033M751M616L917L571L105J809Q57J580K727K319J254
$$ 410531 413971 417493 421526 426277 430893 434810 438381 441486 443295 444152 445732 448459 450778 452032
56294D52032J904L934M760L664K377J931J794J713J873J698R05R51K984N372N890
$$ 452032 453936 457870 462630 466294 468671 470602 472396 474109 475982 477680 478585 479536 482520 487892 493782
56279D93782N059M615M188K570Q95J044K142K198K068M031P361R135Q791Q285
$$ 493782 498841 503456 507644 510214 511109 512153 514295 516493 518561 522592 529953 539088 547879 556164
56265E56164Q376Q262Q237R103R729Q768P894R622J2847J4427J4333J5023J6491
$$ 556164 564540 572802 581039 590142 599871 608639 616533 626155 639002 653429 667762 682785 699276
56252F99276J6409J4764J3943J4237J3476J1228R381Q536P588O679O826P019N619
$$ 699276 715685 730449 744392 758629 772105 783333 792714 801250 808838 815517 822343 829362 834981
56239H34981M048M870O784O157L198J681K663L436L051L756O107P612P471Q147
$$ 834981 839029 843899 850683 856840 860038 861719 864382 867818 870869 874625 880732 888344 895815 903962
56225I03962J0838J3503J4726J5790J7709J9642K1252K3367K5625K6753K7460
$$ 903962 914800 928303 943029 958819 976528 996170 1017422 1040789 1066414 1093167 1120627
56214A120627K9676L2944L5246L7130M0807M5366M7761M8782N2948O1449P0136
$$ 1120627 1150303 1183247 1218493 1255623 1296430 1341796 1389557 1438339 1491287 1552736 1622872
56203A622872P5819Q0054Q5108R0631R6265J03667J13772J25020J35744J45714
$$ 1622872 1698691 1778745 1863853 1954484 2050749 2154416 2268188 2393208 2528952 2674666
56193B674666J54551J61480J67078J72299J75810J75594J72705J69470J64424
$$ 2674666 2829217 2990697 3157775 3330074 3505884 3681478 3854183 4023653 4188077
56184D188077J53573J36658J17529R8033P6524N2893L0026R198j1240l1311m8130
$$ 4188077 4341650 4478308 4595837 4693870 4770394 4823287 4853313 4862511 4851271 4819960 4771830
56173D771830o0495p0507p9347q5553q8706r0919r3482r5560r6961r8622j00145
$$ 4771830 4711335 4640828 4561481 4475928 4387222 4296303 4202821 4107261 4010300 3911678 3811533
56162C811533j00563j01393j04803j09048j10374j09124j08982j10448j10589
$$ 3811533 3710970 3609577 3504774 3395726 3285352 3176228 3067246 2956798 2846209
56153B846209j09064j08481j08459j05488r9524r4547r1511q6800p9134p1986
$$ 2846209 2737145 2628664 2520205 2414717 2315193 2220646 2129135 2042335 1963201 1891215
56143A891215o7418o3171n7809n3268n0435m7191m2605l8423l5187l1583k8235
$$ 1891215 1823797 1760626 1702817 1649549 1599114 1551923 1509318 1470895 1435708 1404125 1375890
56132A375890k7032k6430k3134j8627j7636j9707j9314j5107j1804j1499j0623
$$ 1375890 1348858 1322428 1299294 1280667 1263031 1243324 1224010 1208903 1197099 1185600 1174977
56121A174977p404m925m411k620J466M373N027O929J0879J2665J0917J0161J2902
$$ 1174977 1167573 1162648 1158237 1155617 1157083 1161456 1166483 1173412 1184291 1196956 1207873 1218034 1230936
56108A230936J5622J5908J6617J9402K0946J9318J7759J8500J8999J7659J7065
$$ 1230936 1246558 1262466 1279083 1298485 1319431 1338749 1356508 1375008 1394007 1411666 1428731
56097A428731J8244J8105J5744J4941J7206J8864J8114J8412K1726K5149K7212
$$ 1428731 1446975 1465080 1480824 1495765 1512971 1531835 1549949 1568361 1590087 1615236 1642448
56086A642448L0530L5331L7846L8230M2230N1591O0716O6465P2906Q2518R1405
$$ 1642448 1672978 1708309 1746155 1784385 1826615 1878206 1938922 2005387 2078293 2160811 2252216
56075B252216R7943J07396J22633J38487J50913J63670J79920J94995K03526K06560
$$ 2252216 2350159 2457555 2580188 2718675 2869588 3033258 3213178 3408173 3611699 3818259
56065C818259K05939J99108J85567J71358J61080J51926J40607J28700J16020
$$ 3818259 4024198 4223306 4408873 4580231 4741311 4893237 5033844 5162544 5278564
56056E278564R6630O7640L4714L618k6040n3638p3278q3190r1079j03481j17747
$$ 5278564 5375194 5442834 5477548 5481166 5455126 5401488 5328210 5245020 5153941 5050460 4932713
56045D932713j30531j45064j62921j77423j83038j83203j81748j75179j61175
$$ 4932713 4802182 4657118 4494197 4316774 4133736 3950533 3768785 3593606 3432431
56036C432431j45846j34341j22686j07086r2564q3831p6373o5661n6552n4016
$$ 3432431 3286585 3152244 3029558 2922472 2829908 2746077 2669704 2604043 2547491 2493475
56026B493475n3026m7556m1424m0075l9477l3802k6719k4411k4067j9832j3871
$$ 2493475 2440449 2392893 2351469 2311394 2271917 2238115 2211396 2186985 2162918 2143086 2129215
56015B129215j1335j0480p448m695n300n313q97L607L619L162O947J1249J1754
$$ 2129215 2117880 2107400 2099952 2095257 2089957 2084644 2083747 2087354 2090973 2094135 2101082 2112331 2124085
56002B124085J2524J7601K2007K0854J9127K2484K6838K7164K7745L3067L7751
$$ 2124085 2136609 2154210 2176217 2197071 2216198 2238682 2265520 2292684 2320429 2353496 2391247
55991B391247L6480L4923L9457M5192M5643M4952M8738N2387N0626M9026N3565
$$ 2391247 2427727 2462650 2502107 2547299 2592942 2637894 2686632 2739019 2789645 2838671 2892236
55980B892236N8485N7172N5063N8874O3336O2014O0607O5749P1528P1368P1902
$$ 2892236 2950721 3007893 3062956 3121830 3185166 3247180 3307787 3373536 3445064 3516432 3588334
55969C588334Q0262Q9322R1141R2978J03450J15029J17792J18545J27912J40197
$$ 3588334 3668596 3757918 3849059 3942037 4045487 4160516 4278308 4396853 4524765 4664962
55959D664962J44988J47303J56821J68392J73029J77016J90038K05605K13572
$$ 4664962 4809950 4957253 5114074 5282466 5455495 5632511 5822549 6028154 6241726
55950F241726K20320K35788K52791K60889K68252K87004L09523L22608L32332
$$ 6241726 6462046 6697834 6950625 7211514 7479766 7766770 8076293 8398901 8731233
55941H731233L50957L72406L85658L98894M24649M54917M77399N01578N41012
$$ 8731233 9082190 9454596 9840254 10239148 10663797 11118714 11596113 12097691 12638703
55932A2638703N85522O20256O55883P08544P66577Q10366Q48290Q98143R50517
$$ 12638703 13224225 13844481 14500364 15208908 15975485 16785851 17634141 18532284 19482801
55923A9482801R87976J023026J077725J143073J199643J260219J348446J453936
$$ 19482801 20470777 21493803 22571528 23714601 24914244 26174463 27522909 28976845
55915B8976845J554631J664041J806705J966550K112385K255320K426287K618617
$$ 28976845 30531476 32195517 34002222 35968772 38081157 40336477 42762764 45381381
55907D5381381K812164L030937L312046L642189L995320M407278M936508N580338
$$ 45381381 48193545 51224482 54536528 58178717 62174037 66581315 71517823 77098161
55899G7098161O317126P201651Q322086R691567J1283364J3131113J5274701J7663512
$$ 77098161 83415287 90616938 98939024 108630591 119913955 133045068 148319769 165983281
55891A65983281K0267664K3223046K6670611L0517144L4576310L8739059M2391113
$$ 165983281 186250945 209473991 236144602 266661746 301238056 339977115 382368228
55884C82368228M3534769L9291209K8180061J1985851n072384j9153496k8722326
$$ 382368228 425902997 465194206 493374267 505360118 500287734 481134238 452411912
55877D52411912l4179027l6491136l6513241l5030925l2734596l0032576k7106434
$$ 452411912 418232885 381741749 345228508 310197583 277462987 247430411 220323977
55870B20323977k4138549k1331256j8762010j6398009j4244955j2358679j0736090
$$ 220323977 196185428 174854172 156092162 139694153 125449198 113090519 102354429
55863A02354429r316389q080887p053523o214964n505126m900838m412577m015534
$$ 102354429 93038040 84957153 77903630 71688666 66183540 61282702 56870125 52854591
55855E2854591l657755l327874l048216k809977k577674k349002k150673j981881
$$ 52854591 49196836 45868962 42820746 40010769 37433095 35084093 32933420 30951539
55847C0951539j817389j659612j534116j438119j343183j244683j161985j094043
$$ 30951539 29134150 27474538 25940422 24502303 23159120 21914437 20752452 19658409
55839A9658409j020105r41348q79100q33911p86216p34627o95170o65321o26391
$$ 19658409 18638304 17696956 16817856 15983945 15197729 14463102 13767932 13102611 12476220
55830A2476220n79495n43293n17774m84967m44102m12433l91889l67193l36720
$$ 12476220 11896725 11353432 10835658 10350691 9906589 9494156 9102267 8735074 8398354
55821H398354l14265l00315k81228k56935k41031k33519k21072k04002j95911
$$ 8398354 8084089 7783774 7502546 7245611 7004580 6771061 6549989 6345987 6150076
55812F150076j96626j91960j80503j74809j75778j71150j60183j55158j57295
$$ 6150076 5953450 5761490 5580987 5406178 5230400 5059250 4899067 4743909 4586614
55803D586614j54983j47024j44465j48103j46641j38516j33724j32863j25930
$$ 4586614 4431631 4284607 4140142 3992039 3845398 3706882 3573158 3440295 3314365
55794C314365j13177j05833j04490r7680q3603p2956o8313o0991n0579m7602n3769
$$ 3314365 3201188 3095355 2990865 2893185 2809582 2736626 2668313 2607322 2556743 2509141 2455372
55783B455372n8463n7781n8894o2879o1398n3549m8654m9103m6948m0219l6460
$$ 2455372 2396909 2339128 2280234 2217355 2155957 2102408 2053754 2004651 1957703 1917484 1881024
55772A881024l7401l6138l1877l1727l5665l5460l0743l0428l5886l8359l5551
$$ 1881024 1843623 1807485 1775608 1743881 1708216 1672756 1642013 1611585 1575699 1537340 1501789
55761A501789l5150l9066l9700l5116l2943l5679l6512l3087l1427l2857l0953
$$ 1501789 1466639 1427573 1387873 1352757 1319814 1284135 1247623 1214536 1183109 1150252 1119299
55750A119299k4779k1523k2616k0681j3728r270j0498j1142p682m504l576r29
$$ 1119299 1094520 1072997 1050381 1029700 1015972 1006702 996204 985062 977380 972876 969300 968371
55738I68371L366L554o27k728j884m441j0949j3915j1205r472j1432j1918r566
$$ 968371 971737 975291 974664 971936 970052 965611 954662 940747 929542 920070 908638 896720 887154
55725H87154j0058j4255j5232j0808p482q309q258n141l722n429n268k598l631
$$ 887154 877096 862841 847609 836801 829319 821010 812752 807611 803889 798460 793192 790594 786963
55712G86963r654j3912j3841j4947j8908j9533j4931j2024j4077j4977j1153q338
$$ 786963 777309 763397 749556 734609 715701 696168 681237 669213 655136 640159 629006 620668
55700F20668j0858j4428j5154j6011j8847j9496j6325j4618j7122j8889j6569
$$ 620668 609810 595382 580228 564217 545370 525874 509549 494931 477809 458920 442351
55689D42351j4052j3909j1965n708J87J894K193L528L215K65r13J763M101L516
$$ 442351 428299 414390 402425 396717 396904 398798 400991 404519 407734 407999 407086 408849 412950 416466
55675D16466L142M346L374n76k285J55J367j622m169l219l052o688r789q762p251
$$ 416466 419608 423954 427328 426752 424467 424622 425989 424367 420198 416979 413927 407239 397450 388688 381437
55660C81437q823j0383q509n719n027m622k855k167l526l269J10K619K134K227
$$ 381437 372614 362231 353722 348003 342976 338354 335499 333332 329806 326537 326647 329266 331400 333627
55646C33627M699N720L720L443P187R701P178L982M520N471K344k400m140l500
$$ 333627 338326 344046 347766 351209 358396 368097 375275 379257 383777 389248 391592 389192 385052 381552
55632C81552l186k424n1J686J244J005K320K474M04k81K099L716K227J108K734
$$ 381552 378366 375942 375891 377577 378821 379826 382146 384620 385024 384743 386842 390558 392785 393893 396627
55617C96627L713J562l94L82P06j738l425j777m60k393l911j567J340R41m56L18
$$ 396627 400340 401902 401508 401890 402596 400858 397433 395656 395196 392803 388892 387325 388665 389606 389150 389468
55601C89468J071o10j671P42L389K844J818L441M753K486lJ473M171L462J000
$$ 389468 390539 389929 388258 389000 392389 395233 397051 400492 405245 407731 407728 409201 413372 416834 417834
55586D17834P06R72j775n497o003m733n879q621r088p583p185p500o240m797n977
$$ 417834 418540 419512 417737 412240 406237 401504 395625 387004 377916 370333 363148 355648 349408 344611 338634
55571C38634q108p490n077m963p605r814j0251j0094r539q079o787o564n905l835
$$ 338634 330526 323036 317959 312996 305391 295577 285326 275232 265693 257614 250827 244263 238358 234523
55557B34523k615l981n624n171m372n303n829l424l09lj590k048j482j516j389
$$ 234523 231908 227927 222303 217132 212760 207457 201628 198204 197895 197892 196302 194254 192772 191256 189867
55542A89867j42J82j925l634k053P00J244O24J412K322Q96j183p22J409K330K337
$$ 189867 189725 189907 187982 184348 182295 182995 184239 184863 186275 188597 189493 188310 187588 188997 191327 193664
55526A93664L202L807K433J057K377M827N260M257M098M046K667K244N544J0373
$$ 193664 196866 200673 203106 204163 206540 211367 216627 220884 224982 229028 231695 233939 239483 249856
55512B49856J2653J2849J4136J6297J6891J6731J8670K2122K3891K3331K2122
$$ 249856 262509 275358 289494 305791 322682 339413 358083 380205 404096 427427 449549
55501D49549K0251J6771J2909R981N908j601j0081j5316j7571k0131k3278k4680
$$ 449549 469800 486571 499480 509461 515369 513768 503687 488371 470800 450669 427391 402711
55489D02711k4338k4177k3939k2098j9641j8407j7155j3757r789q272q380p208
$$ 402711 378373 354196 330257 308159 288518 270111 252956 239199 229410 221138 212758 205550
55477B05550n184m861n642m861k954k530l186k214L26J983K508L439M063K580
$$ 205550 200366 195505 189863 185002 182048 179518 176332 174118 174444 176427 178935 182374 186437 189017
55463A89017L97M51K056K168Q45N81R88n81l465m034j785j95j080k509k819k630
$$ 189017 189414 189865 191921 194089 194934 195515 196503 195922 192457 188423 186638 186443 185363 182854 180035 177405
55447A77405k464j998j897l040m107l241j524j457k870l786m242n409o174m893
$$ 177405 174941 172943 171046 168006 163899 160658 159134 157677 154807 151021 146779 141370 135196 130303
55433A30303l333m418o923p185n339m868o421p032n641m406m178l274j381m06
$$ 130303 126970 122552 115629 108444 103105 98237 91816 84784 79143 74737 70559 67285 65904 65498
55419F5498o67k26J380K333J971J507J056m93k424k612j167l51p29p94l75q83
$$ 65498 64831 64605 65985 68318 70289 71796 72852 72359 69935 67323 66156 65805 65076 64282 63907 63024
55403F3024k127k324j332o93n12M27J722J871J305J536J800J68k488l336k105
$$ 63024 60897 58573 57241 56548 56036 56463 58185 60056 61361 62897 64697 64865 62377 59041 56936
55388E6936r64m73N12J344K40j784j738M72J951J549P94K53q76j593R6K929L215
$$ 56936 55972 55499 56011 57355 57595 55811 54073 54545 56496 58045 58839 59092 58216 56623 56719 59648 62863
55371F2863N47j417n09J403K192J925R77p85k201j637K6M84J56J428L725L649
$$ 62863 63410 61993 61484 62887 65079 67004 67981 67196 64995 63358 63384 63868 64024 65452 69177 72826
55355G2826N74j959j539K19J131J301J390J148P02P45R85Q66J439L596N154L462
$$ 72826 73400 71441 69902 70121 71252 72553 73943 75091 75793 76538 77523 78389 79828 83424 88578 92040
55339I2040K07n46J270J898J61j192r22j034k174k210o40J37o06o25O93Q92q02
$$ 92040 92247 91701 92971 94869 95030 93838 92916 91882 89708 87498 86858 86995 86389 85764 86457 87349 86547
55322H6547j769p79q5p85o12J383K319M20j577j072M5j010l082l432k476k681
$$ 86547 84778 83999 83914 83129 82517 83900 86219 86639 85062 83990 84035 83025 79943 76511 74035 71354
55306G1354m358n603n354m133k600j143j46M06P58M83q06j860r83J114K041J419
$$ 71354 66996 61393 56039 51906 49306 48163 48017 48423 49181 49664 48858 46998 46015 47129 49170 50589
55290E0589J086J490J019n59j318o46k64p63n07R03J440L53k49Q56J802J003k36
$$ 50589 51675 53165 54184 53625 52307 51661 51397 50634 50127 51030 52470 52823 52574 53430 55232 56235 55999
55273E5999l93k64r08j511j147m63m3O52J399P49j104j623K41K002J239j052k529
$$ 55999 55606 55342 54434 52923 51776 51313 51270 51922 53321 54070 52966 51343 51584 53586 54825 53773 51244
55256E1244k782k615k059q82L40J144J862K418J998N78q64k039l331l965k730
$$ 51244 48462 45847 43788 42906 43246 44390 46252 48670 50668 51246 50382 48343 45012 41047 38317
55241C8317p13m91k054k573q69J093J913K624L651L422J629N98J501K198Q08j291
$$ 38317 37604 37113 35059 32486 31617 32710 34623 37247 40898 44320 45949 46547 48048 50246 51054 49763
55225D9763j968j303k19J298K731K303k65k519k574j542j152j248j163j223j283
$$ 49763 47795 46492 46273 47571 50302 52605 52340 49821 47247 45705 44553 43305 42142 40919 39636
55210C9636j44J966K773J363k20l16k9n89j058n18k9l99l84Q50J841J308K75r4
$$ 39636 39492 41458 44231 45594 45374 45058 45029 44440 43382 42864 42835 42436 42052 42902 44743 46051 46326 46232
55192D6232m23j078p99O69J150m71j855p31J476K125J331Q43P15j20j352j769
$$ 46232 45809 44731 43932 44601 45751 45280 43425 42694 44170 46295 47626 48469 49184 49064 47712 45943
55176D5943j220k55R98K053J783M00l0J379K742K375J289R05N86n36j334n72P67
$$ 45943 44723 44468 45466 47519 49302 49702 49672 51051 53793 56168 57457 58362 58948 58412 57078 56506 57273
55159E7273J128Q47R43J179J153J520K234J503j412m152m187k131j41J253K579
$$ 57273 58401 59248 60191 61370 62523 64043 66277 67780 66368 62216 58029 55898 55757 57010 59589
55144E9589L416L200K575J998N26k116l982l578k346k272k638j580N00J612J236
$$ 59589 63005 66205 68780 70778 71304 69188 65206 61628 59282 57010 54372 52792 53292 54904 56140
55129E6140N03J29J27P09J689J853N84q27q78M5O25N12J15l62n97j62K89n66k360
$$ 56140 56643 56772 56899 57608 59297 61150 61734 60907 60029 60074 60699 61211 61326 60964 60367 60205 60494 59928 57568
55110E7568l036j999j031j064o30J059K210J405mm13m64j074j282k14R78J233
$$ 57568 54532 52533 51502 50438 49808 50867 53077 54482 54478 54065 53601 52527 51245 51031 52009 53242
55094E3242J423K155K069M85o78M3J067O33j88R7M55l92j064J3J358Q06p16r53
$$ 53242 54665 56820 58889 59374 58696 58739 59806 60439 60251 60348 60803 60411 59347 59360 60718 61524 60808 59855
55076E9855j76j27n90k71L12j37q84l82Q25J153Q75J324K236K432K041J804J390
$$ 59855 59679 59552 58962 58691 59003 58866 57982 57600 58425 59578 60453 61777 64013 66445 68486 70290 71680
55059G1680O67R97K897M216L232J679J853K567J294j382k828k571k126j796q92
$$ 71680 72347 73344 76241 80457 83689 85368 87221 89788 91082 89700 86872 84301 82175 80379 79487
55044G9487r1m74j199j008p82j628j977K9K759L232J822J135J396R38K89J520
$$ 79487 79396 78922 77723 76715 75933 74305 72328 72357 75116 78348 80170 81305 82701 83639 83928 85448
55028H5448L824L931J070k115l648l872l052r07J288J461K2o23J33P25P79J583
$$ 85448 89272 93203 94273 92158 88510 84638 81586 80679 81967 83428 83450 82827 82960 83685 84464 86047
55012H6047L057L460K597K321L295M041L645K863K217J385O29N60M75o48j865
$$ 86047 89104 92564 95161 97482 100777 104818 108463 111326 113543 114928 115557 116117 116592 115944 114079
54997A14079j522k68j4m12L71J799J472n38j625j264j857m154n551m369k487j963
$$ 114079 112557 112289 112275 111863 112234 114033 115505 114967 113342 112078 110221 106067 100516 96147 93660 91697
54981I1697j913o15J547L110L764L965L739L077K400J736N58j078k176j971n09
$$ 91697 89784 89169 90716 93826 97590 101555 105294 108371 110771 112507 113065 111987 109811 107840 107331
54966A07331J646L346L125J005p54m06Q55J046P76J789L368L276J675P49Q02R8
$$ 107331 108977 112323 115448 116453 115699 115293 116148 117194 117970 119759 123127 126403 128078 128827 129629 129727
54950A29727j484k045j222q44j513j778j273j511k741l152k109j255j400j181
$$ 129727 128243 126198 124976 124132 122619 120841 119568 118057 115316 112164 110055 108800 107400 106219
54936A06219J18J242J499J868K389J273j859m350l921j637K7L29O0j37rL99K65
$$ 106219 106337 107579 109078 110946 113335 114608 112749 108399 104478 102841 102868 103197 103257 103120 103111 103510 103775
54919A03775j104k561k031M52K592L082K811K571J982J331J845L201L280J522
$$ 103775 102671 100110 98079 98531 101123 104205 107016 109587 111569 112900 114745 117946 121226 122748
54905A22748J40Q42K535L582M107M735M988M431L774L702M084N116P309R646R990
$$ 122748 122888 123730 126265 129847 133954 138689 143677 148108 151882 155584 159668 164784 172093 181739 191729
54890A91729Q339P479R134J1612J2691J2763J3393J4474J4738J3911J2698J1454
$$ 191729 200068 207547 216681 228293 240984 253747 267140 281614 296352 310263 322961 334415
54878C34415R913P536L584k085p886j1604j2889j3243j3387j2671j1283j0655
$$ 334415 344328 351864 355448 353363 345477 333873 320984 307741 294354 281683 270400 259745
54866B59745j0992j0734r402q625r243r660q420o373m888l835k683j672p40R20
$$ 259745 248753 238019 228617 219992 210749 201089 192669 186296 181408 177573 174890 173218 172478 173398
54852A73398L057M100L880M317N956O376M073J671K689O690J0338J2029J2903
$$ 173398 176455 180555 184435 188752 194708 201084 205157 206828 209517 216207 226545 238574 251477
54839B51477J3966J4725J4591J3595J1593Q239L892n14m513q271j1750j4425j5693
$$ 251477 265443 280168 294759 308354 319947 328186 332078 331564 327051 318780 307030 292605 276912
54826B76912j5371j4061j2897j2467j2078j0926r530q882q692p954o820o042n024
$$ 276912 261541 247480 234583 222116 210038 199112 189582 180700 172008 164054 157234 151192 146168
54813A46168k775n44o90k674l174r53J337J345R0o70j236k305k977k668k751m008
$$ 146168 143393 142849 142159 139485 136311 135358 136695 138040 138130 137460 136224 133919 130942 128274 125523 121515
54797A21515m470k294R26K271J504M61k73j385k306j497Q61K718K901K198J513
$$ 121515 117045 114751 115677 117948 119452 119913 119640 118255 115949 114452 115313 118031 120932 123130 124643
54782A24643N71j096k965l828l097j633j214k512l861l201j097j03r14j322N9
$$ 124643 125214 124118 121153 117325 114228 112595 111381 108869 105008 101807 100710 100607 99693 98371 98430
54767I8430J364M75j477j760k3J627J906J713K314L632M554M142K511Q57L01O27
$$ 98430 99794 100269 98792 97032 97009 98636 100542 102255 104569 108201 112755 116897 119408 120265 120566 121193
54751A21193R28J248K275L432L134J396L21J200K975M397N732P208P887P461P293
$$ 121193 122121 123369 125644 129076 132210 133606 133927 135127 138102 142499 148231 155439 163326 170787 178080
54736A78080Q111Q598P981Q108J0739J4354J6039J5502J4776J4790J4598J3593
$$ 178080 186191 194789 202770 210878 221617 235971 252010 267512 282288 297078 311676 325269
54724C25269J2216J0456P605L689j45k906m529n520o504p837r007r153q591q861
$$ 325269 337485 347941 355546 359235 359090 356184 351655 346135 339631 331794 322787 313634 305043 296182
54710B96182j0415j1468j0327p785n925n372n034l899j910M59K408L169K916K774
$$ 296182 285767 274299 263972 256187 250262 244890 239856 235957 234047 234506 236914 240083 242999 245773
54696B45773L313L905M177M940O904R544J2087J4432J6441J7607J8225J9341K0634
$$ 245773 249086 252991 257168 262108 269012 278556 290643 305075 321516 339123 357348 376689 397323
54683C97323K0032J6645J2374R109O014J310m697j0204j4356j7319j8933j9165
$$ 397323 417355 434000 446374 455483 461497 462807 458110 447906 433550 416231 397298 378133
54671C78133j8981j9113j8829j7468j6091j5895j5938j4447j1464q427n916l721
$$ 378133 359152 340039 321210 303742 287651 271756 255818 241371 229907 221480 215564 211843
54659B11843k476l125n067o603p023o728n747l885k101j901l229m290l732k026
$$ 211843 209367 206242 201175 194572 187549 180821 175074 171189 169088 167187 163958 159668 155936 153910
54645A53910n69k01n23l46Q80J994J302q15j899n36J891L329L392K670J510O55
$$ 153910 153341 153140 152617 152271 153151 155145 156447 155632 153733 153197 155088 158417 161809 164479 165989 166644
54629A66644J249K666K229j062m210l895r23J286J440R68Q37N48K8R8R35J906
$$ 166644 167893 170559 172788 171726 167516 163621 162698 163984 165424 166392 167229 167777 167805 167903 168838 170744
54613A70744K830L832M352L928L449M022N083N359N064N301N843N486M300L591
$$ 170744 173574 177406 181758 185686 189135 193157 198240 203599 208663 213964 219807 225293 229593 233184
54599B33184L752L914L582L054K426J658J401K292L768M926N970P366Q222P311
$$ 233184 236936 240850 244432 247486 249912 251570 252971 255263 259031 263957 269927 277293 285515 292826
54585B92826N250L996M512O296Q646J0826J1677J0897J0016J0436J1158J0304
$$ 292826 298076 302072 306584 312880 321526 332352 344029 354926 364942 375378 386536 396840
54573C96840Q129O344N070K852o74m392p742j0979j3494j4264j3949j4334j5489
$$ 396840 404969 411313 416383 419235 418561 414169 406427 395448 381954 367690 353741 339407 323918
54560C23918j5621j3925j1566r533p652o061n595o033n790m051j773r2Q68J206
$$ 323918 308297 294372 282806 273273 265621 259560 253965 247932 242142 238091 236318 236226 237094 238300
54546B38300Q21K02J93N56P2j511k896l079k569k352k653l104l387l450l562l928
$$ 238300 239121 239323 239516 240072 240144 238633 235737 232658 230089 227737 225084 221980 218593 215143 211581 207653
54530B07653l927k565m56q8k654n854o662n293m198m086l529k170j438j898k361
$$ 207653 203726 201161 200705 200617 197963 192109 185447 180154 175956 171870 168341 166171 164733 162835 160474
54515A60474k184k132k363j741l9J086L04j607k992l100k097o04L73J32p18r72
$$ 160474 158290 156158 153795 152054 152015 153101 153405 151798 148806 145706 143609 143005 143378 143510 142792 141820
54499A41820n38k18J0R33K407L349L516L663L795L003J267k34q72j129j181n86
$$ 141820 141282 141064 141074 142007 144414 147763 151279 154942 158737 161740 163007 162773 161901 160772 159591 159005
54483A59005M46J135J681L058M992N795M743L005J973K044L209N110O438O042
$$ 159005 159451 160586 162267 165325 170317 176112 180855 183860 185833 187877 191086 196196 202634 208676
54469B08676M919N182O839P614O336M420L287K470J100n78k194m001n692o129
$$ 208676 213595 218777 225616 233230 239566 243986 247273 249743 250843 250265 248071 244070 238378 232249
54455B32249n263m684n314n950n206l497k185j932k725m225n402n124l844l308
$$ 232249 226986 222302 216988 211038 205832 202335 200150 198218 195493 191268 185866 180742 176898 173590
54441A73590l892l795j718J193L008L203K284P47n88o94J06J49r30j121R87L699
$$ 173590 169698 165903 164185 165378 168386 171589 173873 174620 174032 173338 173444 173593 172663 171542 172529 176228
54425A76228M371K884J178K86j88l03M94J897K593K019J120J029J772K491K458
$$ 176228 180599 183483 184661 184947 184759 184456 184950 186847 189440 191459 192579 193608 195380 197871 200329
54410B00329J600M75k07k08R0K90M48Q69J601K246K287J621Q30N78O37J11j084
$$ 200329 201929 202404 202197 201989 202079 202369 202817 203686 205287 207533 209820 211441 212271 212849 213486 213597 212513
54393B12513j767j217m51q31k116l030l118k800k221j355p36p53q96r67k112m762
$$ 212513 210746 209529 209078 208247 206131 203101 199983 197183 194962 193607 192871 192118 191222 190255 188143 183381
54377A83381o578m892p42K134K243J639K125K901K671J644M04r97k014j683n32
$$ 183381 176803 171911 171169 173303 175546 177185 179310 182211 184882 186526 186930 185933 183919 182236 181704
54362A81704l32j117p73J310K648J302r91j283O08K528L217L170L060K882K308
$$ 181704 181372 180255 179482 180792 183440 184742 183751 182468 183076 185604 188821 191991 195051 197933 200241
54347B00241J048n99j248L24K997M136L308L161N451Q237Q760P306O026N370M194
$$ 200241 201289 200690 199442 199766 202763 206899 210207 213368 218819 227056 235816 243122 249148 254518 258712
54332B58712K619K152K991L386K108K3j375j762j868k309l143m204n349o358o710
$$ 258712 261331 263483 266474 269860 271968 271991 270616 268854 266986 264677 261534 257330 251981 245623 238913
54317B38913n896m231k947k841l211l038k688l131l867l411j935j471k846m223
$$ 238913 233017 228786 225839 222998 219787 216749 214061 210930 207063 203652 201717 200246 197400 193177
54303A93177l686j781l34J4j26k37k04J10O38J009J105J204J286J121J160K085
$$ 193177 189491 187710 187376 187390 187264 187027 186823 186933 187571 188580 189685 190889 192175 193296 194456 196541
54287A96541L292L276K131J891L552N318N130L654L243M651O187N840L354K77
$$ 196541 199833 203109 205240 207131 210683 216001 221131 224785 228028 232679 238866 244706 248060 248337
54273B48337j587j950k128l082l807k807o68M06m85k214l752n117o064n887n023
$$ 248337 246750 244800 242672 239590 235783 232976 232308 232714 232229 230015 226263 221146 215082 209195 204172
54258B04172m831n218m597k869k169l614n489n917n276m644l879k803k505l608
$$ 204172 199341 194123 189526 186657 184488 180874 175385 169468 164192 159548 155669 152866 150361 146753
54244A46753m746m463l327k675k486k006j327r68r03j182k271l716l917k435j016
$$ 146753 142007 137544 134217 131542 129056 127050 125723 124755 123852 122670 120399 116683 112766 110331 109315
54229A09315j102j745j337Q4J537K640L116K334O45m09m58r66k353k609o50J293
$$ 109315 108213 106468 105131 105215 106752 109392 112508 114842 115487 115078 114620 113654 111301 108692 108042 109335
54213A09335R35m52k55J325K164J856J593J421M95n02L5J868L046K680J683J064
$$ 109335 110270 109818 109563 110888 113052 114908 116501 117922 118417 117915 117950 119818 122864 125544 127227 128291
54197A28291J092J682K025O67k442m905m640k566q52P0O88L17j442k477o94K173
$$ 128291 129383 131065 133090 133757 131315 126410 121770 119204 118352 118422 119110 119427 117985 115508 114814 116987
54181A16987K504K07j165K42K364K836J878P75o0o20q49j279k313k749j090J539
$$ 116987 119491 119698 118533 118775 121139 123975 125853 126628 126568 125948 125099 123820 121507 118758 117668 119207
54165A19207K178K60j365m67J776L039K777J649j13k188l379k848j392l13K34
$$ 119207 121385 121645 120280 119813 121589 124628 127405 129054 128941 126753 123374 120526 119134 118821 119055
54150A19055Q15J303J002n0p90k34J316K370J668l26j857j932j379j386j853j909
$$ 119055 119870 121173 122175 122125 121335 121101 122417 124787 126455 126129 124272 122340 120961 119575 117722 115813
54134A15813j285l32O67J297R67q4o24k81m05j826l034k302n65j13j169j808q74
$$ 115813 114528 114196 114863 116160 117127 117043 116419 116138 115733 113907 110873 108571 108006 107893 106724 104916 104042
54117A04042R18K486L143K220k31k528k959j964j198r52l57M21M33K9L81J062
$$ 104042 104960 107446 110589 112809 112578 110050 107091 105127 103929 102977 102620 103041 103474 103503 103884 104946
54101A04946N48q80j202J0Q01L2r60q20j78m0M0P96J660J625P53q3k63L30J339
$$ 104946 105494 104614 103412 103422 104223 104255 103295 102475 102297 102257 102297 103093 104753 106378 107131 107048 106785 107115 108454
54082A08454J795Q50r42j946j457n53o54j938l337l550k127r7Q77N70O65K231
$$ 108454 110249 111099 110157 108211 106754 106201 105547 103609 100272 96722 94595 94498 95375 95945 96610 98841
54066I8841L766L231J066p27j649k597l217k022O91K579K414J398P37O6r60j514
$$ 98841 102607 105838 106904 106177 104528 101931 98714 96692 97383 99962 102376 103774 104511 104577 103617 102103
54050A02103j234j223k207l029k288m84O38L80k30J82J802L423L735K844K011
$$ 102103 100869 99646 97439 94410 92122 91638 92276 92656 92426 92608 94410 97833 101568 104412 106423
54035A06423J700J018l24r68n6J030Q27J65K87J37j681l540k785l56L38j026j318
$$ 106423 108123 109141 108817 107849 107793 108823 109650 109815 110102 110239 108558 105018 102233 101877 102215 101189 99871
54018I9871M04J148p16k368j060J564K370J423R51J475J827J728J831J867J009
$$ 99871 100275 101423 100707 98339 97279 98843 101213 102636 103587 105062 106889 108617 110448 112315 113324
54003A13324m38j356j422j047k52J100K413K867K512K027J918K397L454M533M920
$$ 113324 112886 111530 110108 109061 108809 109909 112322 115189 117701 119728 121646 124043 127497 132030 136950
53988A36950M789M875N026M354L139K877L842M409L687L034L681M529L880K153
$$ 136950 141739 146614 151640 155994 159133 162010 165852 170261 173948 176982 180663 185192 189072 191225
53974A91225J208J784L103M323N134N357N130N095N644O361O661O390N513M109
$$ 191225 192433 194217 197320 201643 206777 212134 217264 222359 228003 234364 241025 247415 252928 257037
53960B57037L053L518N276O595O371N192L881K442J168J070K181K852J954M89
$$ 257037 260090 263608 268884 275479 281850 287042 290923 293365 294533 295603 297784 300636 302590 303079
53946C03079j45k78r24j913k596l400m943o267n721l440j472j335k475l329l169
$$ 303079 302934 302656 301732 299819 297223 293823 288880 282613 276892 273452 271980 270645 268170 264841 261672
53931B61672k593k551l059l076j904l32L77J98Nj31q16j680j580o87n21j432j898
$$ 261672 259079 256528 253469 250393 248489 248157 248534 248732 248737 248606 247790 246110 244530 243843 243322 241890 239992
53914B39992j154o15j601l197l660k685j187L9L78o66k492l400k520q12N64J557
$$ 239992 238838 238223 236622 233425 229765 227080 225893 225932 226310 225644 223152 219752 217232 216420 216984 218541
53898B18541K231J959O71m72p38q60j444j735j060p3O18J594L109L914L139J957
$$ 218541 220772 222731 223402 222930 222192 221332 219888 218153 217093 217020 217638 219232 222341 226255 229394 231351
53882B31351J886K533K613K084J887K457L856O138Q311Q363N898L394L124M182
$$ 231351 233237 235770 238383 240467 242354 244811 248667 254805 263116 271479 277377 280771 283895 288077
53868B88077M341L491K924K540J293k78n36N39J426J714K445L811M609M322L895
$$ 288077 292418 295909 298833 301373 302666 302388 301852 302391 303817 305531 307976 311787 316396 320718 324613
53853C24613M103M617N026N423N724N589N218N242N765O430P286Q475R307Q794
$$ 324613 328716 333333 338359 343782 349506 355095 360313 365555 371320 377750 385036 393511 402818 411612
53839D11612P054N210M007L418L247L050J888n77l005l721l009k814m070n587
$$ 411612 418666 423876 427883 431301 434548 437598 439486 438909 435904 432183 429174 426360 422290 416703
53825D16703n840m871m009m320n681p075p798q303r370j0466j0030p823n726n342
$$ 416703 410863 405992 401983 397663 391982 384907 377109 368806 359436 348970 338940 331117 325391 320049
53811C20049n981o210o135o606p161o664n556n528o935q062p377n272l300k621
$$ 320049 314068 307858 301723 295117 287956 281292 275736 270208 263273 255211 247834 242562 239262 236641
53797B36641l297m446m868l995k316p60r6q92k997m816m418k205r73k176l642
$$ 236641 233344 228898 224030 220035 217719 216959 216863 215971 212974 208158 203740 201535 200562 198386 194744
53782A94744k608J92J596M01j435j820q02L37P50L51m79j191j660k263k915k697
$$ 194744 192136 192328 193924 194325 192890 191070 190268 190605 191355 191706 191227 190036 188376 186113 183198 180501
53766A80501j251K88P53N63P24J078R32O46J116K127K680K453J706M13j092j427
$$ 180501 179250 179538 180291 180854 181578 182656 183588 184234 185350 187477 190157 192610 194316 194729 193637 192210
53750A92210J71K058K002M13k01J158K860L321L014L257M260N071M795L689L324
$$ 192210 192381 194439 196441 196854 196653 197811 200671 203992 207006 210263 214523 219594 224389 228078 231402
53735B31402N118Q211R766Q320N705M467M660M885N106O113P128O662N362N392
$$ 231402 236520 244731 254497 262817 268522 272989 277649 282534 287640 293753 300881 307543 312905 318297
53721C18297O855P478O166M553M203M407L738K206Q61L94P70J298P69j378l820
$$ 318297 325152 332630 338796 343349 347552 351959 355697 357903 358764 359158 359928 361226 361995 360617 356797
53706C56797m447k836o06O64P68J85o64j443k263l734n618o122m096j341q26k981
$$ 356797 352350 349514 348908 349572 350340 350525 349861 348418 346155 342421 336803 330681 326585 325244 324418 321437
53690C21437n699p581q896r501q426n954l831k897k439k175k704l504k961j070
$$ 321437 315738 308157 299261 289760 281334 275380 271549 268652 266213 264038 261334 257830 254869 253799
53676B53799R6n23j681k414l450m834m648j944J067J775P41M51J693L006L040
$$ 253799 253895 253372 251691 249277 245827 240993 236345 234401 235468 237243 237984 238435 240128 243134 246174
53661B46174J832K80m41N43K790M642N067M667M206L351J782M75O07J923L239
$$ 246174 248006 248286 247845 248388 251178 255820 260887 265554 269760 273111 274893 275368 275975 277898 281137
53646B81137M002M476M987N695O460O446M709J825j69j38Q53J419J722K477L281
$$ 281137 285139 289615 294602 300297 306757 313203 317912 319737 319568 319430 320283 321702 323424 325901 329182
53631C29182L333K908K762K643J785M92oQ61K530M172N219N228M128K619J806
$$ 329182 332515 335423 338185 340828 342613 343105 343099 343960 346490 350662 355881 361109 365237 367856 369662
53616C69662K391M266O390O990M807P29k499k915j210M64R56P85R87J977L188
$$ 369662 372053 376319 382709 389699 394506 395235 392736 389821 388611 389075 390031 390816 391803 393780 396968
53601C96968L460K140O1j236j328j128j086m46J077K194J726M20j78J5j71j044
$$ 396968 400428 402568 402629 401393 400065 398937 397851 397405 398482 400676 402402 402822 402644 402659 402488 401444
53585D01444j555j083n11r64k146k613j615j32K39o79j425r26j00n59k117k736
$$ 401444 399889 398806 398295 397331 395185 392572 390957 390825 391064 390385 388960 388034 387934 387375 385258 382522
53569C82522j008K272N165O360N710L966K386J923K455L177L707M206M643M891
$$ 382522 381514 383786 388951 395311 401021 404987 407373 409296 411751 414928 418635 422841 427484 432375
53555D32375N379O638Q114Q514P403N566L882K862L055M496N843N694M823N426
$$ 432375 437754 444392 452506 461020 468423 473989 477871 480733 483788 488284 494127 499821 504644 510070
53541E10070P922J0309J1123J1104J1302J1385J0910J0468J0367R773Q402P651
$$ 510070 517992 528301 539424 550528 561830 573215 584125 594593 604960 614733 623135 630786
53529F30786Q597J0068J0118Q500O436M847M032M230N315O537P448Q286Q823Q143
$$ 630786 639383 649451 659569 668069 674505 679352 683384 687614 692929 699466 706914 715200 724023 732166
53515G32166O365N138N375N882N486M908N004M852L524K388L131M706M633K795
$$ 732166 738531 743669 749044 754926 760412 765320 770324 775176 778700 781088 784219 788925 793558 796353
53501G96353J335J107R21L37N05J624J998P28o55n06M22K96j143k620l287l375
$$ 796353 797688 798795 799716 800053 800558 802182 804180 804908 804253 803747 804169 804465 803322 800702 797415 794040
53485G94040l164k497j391l03M10Q26J057R78O61P45J810L304L872L184K769M167
$$ 794040 790876 788379 786988 786685 787095 787921 788978 789956 790617 791362 793172 796476 800348 803532 806301 810468
53469H10468O665Q154Q110Q243R800J1821J2899J3390J4579J6566J8229J8850
$$ 810468 817133 825287 833397 841640 851440 863261 876160 889550 904129 920695 938924 957774
53457I57774J8809J9026K0409K3247K6455K8140K7872K7497K8774L1097L2761
$$ 957774 976583 995609 1016018 1039265 1065720 1093860 1121732 1149229 1178003 1209100 1241861
53446A241861L3598L4767L6512L7911L8757L9927M1833M3926M6015M8624N1657
$$ 1241861 1275459 1310226 1346738 1384649 1423406 1463333 1505166 1549092 1595107 1643731 1695388
53435A695388N4015N5142N5905N7246N8761N9312N8516N7125N6224N6468N7750
$$ 1695388 1749403 1804545 1860450 1917696 1976457 2035769 2094285 2151410 2207634 2264102 2321852
53424B321852N9287O0188O0206N9865N9882O0522O1351O1522O0634N9317N8425
$$ 2321852 2381139 2441327 2501533 2561398 2621280 2681802 2743153 2804675 2865309 2924626 2983051
53413B983051N7571N5317N1333M7352M5041M3831M2107L9746L7793L6025L2979
$$ 2983051 3040622 3095939 3147272 3194624 3239665 3283496 3325603 3365349 3403142 3439167 3472146
53402C472146K8665K5279K4185K3807K1906J8724J6237J4850J2712Q536L427p87
$$ 3472146 3500811 3526090 3550275 3574082 3595988 3614712 3630949 3645799 3658511 3667047 3670474 3669687
53390C669687l937p290j1571j6296k0840k5147k9314l3178l6625l9691m2117m3548
$$ 3669687 3665750 3658460 3646889 3630593 3609753 3584606 3555292 3522114 3485489 3445798 3403681 3360133
53378C360133m4380m5741m8059n0394n1720n2271n2839n3486n3780n3743n3548
$$ 3360133 3315753 3270012 3221953 3171559 3119839 3067568 3014729 2961243 2907463 2853720 2800172
53367B800172n2719n0810m8438m6506m4771m2475l9901l7835l5785l2496k8144
$$ 2800172 2747453 2696643 2648205 2601699 2556928 2514453 2474552 2436717 2400932 2368436 2340292
53356B340292k4094k0447j5841j0156n173j733J672O353J1370J5391J8893K2921
$$ 2340292 2316198 2295751 2279910 2269754 2264581 2262848 2264520 2270873 2282243 2297634 2316527 2339448
53344B339448K7083L0582L4039L8399M2912M6079M8202N1208N6059O1678O6456
$$ 2339448 2366531 2397113 2431152 2469551 2512463 2558542 2606744 2657952 2714011 2775689 2842145
53333B842145O9634P1397P2562P4274P7266Q1430Q6291R1435R6190R9868J02787
$$ 2842145 2911779 2983176 3055738 3130012 3207278 3288708 3374999 3466434 3562624 3662492 3765279
53322C765279J06143J10266J14055J16828J19372J22323J24807J25879J26091
$$ 3765279 3871422 3981688 4095743 4212571 4331943 4454266 4579073 4704952 4831043
53313D831043J26436J26868J27093J27408J27311J24652J18290J10426J04280
$$ 4831043 4957479 5084347 5211440 5338848 5466159 5590811 5709101 5819527 5923807
53304E923807J00096R5510Q9131Q1663P3976O6393N9691N4652N0374M4937L7868
$$ 5923807 6023903 6119413 6208544 6290207 6364183 6430576 6490267 6544919 6595293 6640230 6678098
53293F678098L0276K2493J3507L024p611j7227k6284l6152m8024o2395p8396r3419
$$ 6678098 6708374 6730867 6744374 6747398 6739787 6722560 6696276 6660124 6612100 6549705 6471309 6377890
53281F377890j04817j12230j17345j21617j25341j28606j31470j33311j33469
$$ 6377890 6273073 6160843 6043498 5921881 5796540 5667934 5536464 5403153 5269684
53272E269684j32614j31964j31331j29580j26948j25028j24194j22971j20343
$$ 5269684 5137070 5005106 4873775 4744195 4617247 4492219 4368025 4245054 4124711
53263D124711j16964j13551j09772j05427j01148r7155r2712q7520q2345p7564
$$ 4124711 4007747 3894196 3784424 3678997 3577849 3480694 3387982 3300462 3218117 3140553
53253C140553p2348o6077n9360n2982m6893m1007l5930l2106k9172k6665k4530
$$ 3140553 3068205 3002128 2942768 2889786 2842893 2801886 2765956 2733850 2704678 2678013 2653483
53242B653483k2418j9527j5574j1164o760k321J737M531N975O943P862Q491R399
$$ 2653483 2631065 2611538 2595964 2584800 2578040 2575719 2577456 2581987 2587962 2594905 2602767 2611258 2620657
53229B620657J1955J6114K0003K2620K5228K8808L1980L3257L3981L6760M1674
$$ 2620657 2632612 2648726 2668729 2691349 2716577 2745385 2777365 2810622 2844603 2881363 2923037
53218B923037M6193M8657M9934N1426N3160N4373N4770N4507N3763N2792N1923
$$ 2923037 2969230 3017887 3067821 3119247 3172407 3226780 3281550 3336057 3389820 3442612 3494535
53207C494535N1059M9652M7443M4834M2224L9390L5953L2257K9179K6829K4023
$$ 3494535 3545594 3595246 3642689 3687523 3729747 3769137 3805090 3837347 3866526 3893355 3917378
53196C917378J9677J4525J0400P510L616l158j1488j8285k2500k5973l0599l6366
$$ 3917378 3937055 3951580 3961980 3969490 3973106 3969948 3958460 3940175 3917675 3891702 3861103 3824737
53184C824737m2475m8696n4655n9259o2016o4174o7330p1394p4875p6664p6724
$$ 3824737 3782262 3733566 3678911 3619652 3557636 3493462 3426132 3354738 3279863 3203199 3126475
53173C126475p5384p3017p0304o8019o6429o5303o4430o3740o3083o2348o1752
$$ 3126475 3051091 2978074 2907770 2839751 2773322 2708019 2643589 2579849 2516766 2454418 2392666
53162B392666o1533o1464o0903n9452n7403n5500n4205n3131n1260m8037m4137
$$ 2392666 2331133 2269669 2208766 2149314 2091911 2036411 1982206 1929075 1877815 1829778 1785641
53151A785641m0852l8818l7551l6172l4175l1626k9049k7236k6683k7166k8082
$$ 1785641 1744789 1705971 1668420 1632248 1598073 1566447 1537398 1510162 1483479 1456313 1428231
53140A428231k8999k9647k9613k8674k7269k6169k5703k5704k5921k5967k5360
$$ 1428231 1399232 1369585 1339972 1311298 1284029 1257860 1232157 1206453 1180532 1154565 1129205
53129A129205k4249k3701k4390k5395k5250k3918k2625k2043k1824k1783k2179
$$ 1129205 1104956 1081255 1056865 1031470 1006220 982302 959677 937634 915810 894027 871848
53118H71848k2706k2584k1942k1780k2150k1666j9530j6921j5465j5162j4750
$$ 871848 849142 826558 804616 782836 760686 739020 719490 702569 687104 671942 657192
53107F57192j3622j2500j2256j2588j2150j0136p742p338r580j2107j2242j0295
$$ 657192 643570 631070 618814 606226 594076 583940 576198 568860 559280 547173 534931 524636
53095E24636q723q482q249p355p126q365r497q664o341m484l994m472n507o753
$$ 524636 515913 507431 499182 491827 484701 476336 466839 458175 451834 447350 443356 438884 433377 426624
53081D26624p263o261m442l333l326l362k649j722j522k011k225j546n65m77j625
$$ 426624 419361 413100 408658 405325 401999 398637 395988 394266 392744 390733 388508 386962 386397 385920 384295
53066C84295k983l361k794k283k443l029l541l516k511p02O73N38m14m96O16J553
$$ 384295 381312 377951 375157 372874 370431 367402 363861 360345 357834 357132 357805 358343 357929 357433 358049 359602
53050C59602J478J093J043Q73L98O85K526M909O199O074N251L989K139L14l16
$$ 359602 361080 362173 363216 364089 364487 365172 367698 372607 378806 384880 390131 394120 396259 396573 396257
53035C96257M72J445J230l80k422l832m393m654m979n148n100n490o702p700p049
$$ 396257 396729 398174 399404 399024 396602 392770 388377 383723 378744 373596 368496 363006 356304 348604 341555
53020C41555m992l354l277m090m579m340l577k641k035j967j862j203p28j542
$$ 341555 336563 333209 329932 325842 321263 316923 313346 310705 308670 306703 304841 303638 302910 301368
53006C01368l122l880l691l974m927m835k986j152r40j461j165l85l59j006j514
$$ 301368 298246 294366 290675 286701 281774 276939 273953 272801 271861 270400 269235 268850 268491 267485 265971
52991B65971k082l298m475m381l219k419k662l356l751l554k751j705j069r43
$$ 265971 263889 260591 256116 251735 248516 246097 243435 240079 236328 232774 230023 228318 227249 226306
52977B26306p51m77r13j881j641N60K637K175j81j792j799j675k256k402j036
$$ 226306 225555 225078 224165 222284 220643 221203 223840 226015 225834 224042 222243 220568 218312 215910 214874
52962B14874J152K654K675J300q54k835l928m252m210l635k263q30n59j508k370
$$ 214874 216026 218680 221355 222655 221801 218966 215038 210786 206576 202941 200678 199848 199289 197781 195411
52947A95411k143j179m19k96n77p90n96m1M70N84K81k67p35n96L24J192R20k18
$$ 195411 193268 192089 191670 191374 190797 190007 189411 189370 189840 190424 190705 190438 189703 189107 189431 190623 191543 191325
52929A91325p26P8J285K005K362K372J439r5o27K90Q47j61j081NJ931K186R68
$$ 191325 190599 190677 191962 193967 196329 198701 200140 200045 199418 199708 200555 200394 199313 199318 201249 203435 204403
52912B04403P79K458M267M856M650M120L111K231K722M267M933L943K686K319
$$ 204403 205182 207640 211907 216763 221413 225533 228644 230875 233597 237864 242797 246740 249426 251745
52898B51745K326K280L048M950O386N880M361L873M731N389M707L256K424K919
$$ 251745 254071 256351 259399 264349 270735 276615 280976 284849 289580 294969 299676 302932 305356 308275
52884C08275M120M532L193P07j444k610l237l504k881j459o32j552l672n524o386
$$ 308275 312395 316927 320120 320827 319383 316773 313536 310032 307151 305692 305060 303508 299836 294312 287926
52869B87926o454n861m427k239K4J336P14k072n706p807o945m175j868j148r85
$$ 287926 281472 275611 271184 268945 268969 270305 271019 268947 263241 255434 248489 244314 242446 241298 240313
52854B40313l6J413J963J156P3l71p13j761k803k348m31J202J443R80O83L40j49
$$ 240313 240277 241690 243653 244809 244882 244511 243798 242037 239234 236886 236455 237657 239100 240080 240763 241103 240954
52837B40954J49J549K451J356o64j391p47o95j947k778j604Q95K930L648L304
$$ 240954 241103 242652 245103 246459 245795 244404 243657 242962 241015 238237 236633 237528 240458 244106 247410
52822B47410K324R92l84j518k111j843p95L41J059J800L016L857K957N90j166
$$ 247410 249734 250726 250342 248824 246713 244870 244075 244416 245475 247275 250291 254148 257105 257695 256529
52807B56529p90R69K166J784M94l52j43M00K49l49L0J849L481L184J424Q7p3J76
$$ 256529 255739 256708 258874 260658 261152 260800 260657 261057 261306 260957 260987 262836 266317 269501 270925 271012 270939 271115
52789B71115K40L63P42J337K331L616M115L071J714J977L746N090N216N277O001
$$ 271115 271355 271718 272460 273797 276128 279744 283859 286930 288644 290621 294367 299457 304673 309950 315951
52774C15951O477N907M876M087L340K471J915J639Q91l03p40MO08j42j713k897
$$ 315951 322428 328335 333211 337298 340638 343109 345024 346663 347554 347251 346511 346515 347123 346981 345268 342371
52758C42371l354l280k732k239k879m727o224o063m771l552k698k144k367l526
$$ 342371 339017 335737 333005 330766 327887 323160 316936 310873 306102 302550 299852 297708 295341 291815
52744B91815m592m703m548n159o058n985m853l616k695j857j319j591k364k704
$$ 291815 287223 282520 277972 272813 266755 260770 255917 252301 249606 247749 246430 244839 242475 239771
52730B39771k393k081k224k703l359m022m132l228j798r11j027j685k238k331
$$ 239771 237378 235297 233073 230370 227011 222989 218857 215629 213831 212920 211893 210208 207970 205639
52716B05639j952j540j741k443k494j106Q95K079K168J852J244k19k249l406k730
$$ 205639 203687 202147 200406 197963 195469 194363 195258 197337 199505 201357 202601 202382 200133 196727 193997
52701A93997r62K56n9j637l286l667k352l92M73n17k480l775l436j745J27J026
$$ 193997 193035 193291 193232 191595 188309 184642 182290 181898 182371 181854 179374 175599 172163 170418 170545 171571
52685A71571O19o47k305m193n860o296m919k512m12R06J760K083J363k13j619
$$ 171571 172190 171543 169238 165045 159185 152889 147970 145458 145046 145952 147712 149795 151158 150945 149326
52670A49326k341k878l533l609k520r60m2K68Q39J746K066J430O56L96J26p11
$$ 149326 146985 144107 140574 136965 134445 133485 133443 133711 134550 136296 138362 139792 140448 140844 140970 140259
52654A40259j283k92J803K781J219j695l442k763n46J377J853J056R3j17L54Q85
$$ 140259 138976 138684 140487 143268 144487 142792 139350 136587 136041 137418 139271 140327 140420 140303 140657 141542
52638A41542J473K704M351N002L906K344K089K872K767J028q05r78M08K059L267
$$ 141542 143015 145719 150070 155072 158978 161322 163411 166283 169050 170078 169273 168295 168703 170762 174029
52623A74029M178M799M820M323L950M092M352M094L195J902K10k007m141m889
$$ 174029 178207 183006 187826 192149 196099 200191 204543 208637 211832 213734 213944 211937 207796 202907
52609B02907l787k176j770k556l211l391m146n699o484n392l694l311m121m468
$$ 202907 199120 196944 195174 192618 189407 186016 181870 176171 169687 164295 160601 157290 153169 148701
52595A48701l749k887k507k196j639j252j421j986k533k558j579N8J025N93j30
$$ 148701 144952 142065 139558 137362 135723 134471 133050 131064 128531 125973 124394 124452 125477 126070 125940
52580A25940K23J046O56q76j623o11J003J899K128K266K336K200J914J246o4j396
$$ 125940 126163 127209 127865 126989 125366 124755 125758 127657 129785 132051 134387 136587 138501 139747 139683 138287
52564A38287j786j428j358j553j023N4K59n42n91Q25J808O47j472k224j336l54
$$ 138287 136501 135073 133715 132162 131139 131193 131452 130910 130319 131144 132952 133599 132127 129903 128567 128213
52548A28213j5M80J849L632M595L674R89j625k066n25N83j06j035l42J223J705
$$ 128213 128198 128678 130527 134159 138754 142428 143417 141792 139726 139201 139784 139678 138643 138301 139524 141229
52532A41229J226J627L228L992K320p72k763k128N71L383M589M034K947K334K043
$$ 141229 142455 144082 147310 151302 153622 152850 150087 147959 148530 151913 156502 160536 163483 165817 167860
52517A67860J716J670K042J828%k669m041k901r6K518L643L233K339K124K629
$$ 167860 169576 171246 173288 175116 175116 172447 168406 165505 165409 167927 171570 174803 177142 179266 181895
52502A81895K693J516j21p50J14J657K764K812J946J032R45J483J581Q67J38j67
$$ 181895 184588 186104 185983 185233 185347 187004 189768 192580 194526 195558 196503 197986 199567 200434 200572 200405
52486B00405p71j932k233m81K083L194K657K260K664K371L03k210l041j921m48
$$ 200405 199634 197702 195469 194988 197071 200265 202922 205182 207846 210217 210520 208310 205269 203348 202900
52471B02900P8q3J53J322K815L320J968o57k649k318J52K686L326K176R52O22
$$ 202900 202978 202895 203048 204370 207185 210505 212473 211816 209167 206849 207001 209687 213013 215189 216141 216763
52455B16763L28q53k045j685J7J167P79o9r2N18P95M12l03j037j501j380p97l39
$$ 216763 217091 216238 214193 212508 212525 213692 214471 214402 214310 214828 215623 216035 215732 214695 213194 211814 211017 210678
52437B10678l11m40m66l45Q7Q75J436J270J030J652K586K444J447J231J974J864
$$ 210678 210367 209927 209461 209116 209203 210078 211514 212784 213814 215466 218052 220496 221943 223174 225148 227012
52421B27012K75q36J28J983K775K394J681O45o35r38K62J253M14j065r30P28K055
$$ 227012 227287 226451 226579 228562 231337 233731 235412 236057 235422 234484 234746 235999 236413 235348 234418 235146 237201
52404B37201K535L096L678L161J608M54L21M08J22k77o24r64q98j17P27J029J435
$$ 237201 239736 242832 246510 249671 251279 251733 252054 252462 252584 252307 251683 250719 249821 249704 250431 251460 252895
52387B52895K483K916J431o17o31J344K779K587K246K590K315O02j228j989k453
$$ 252895 255378 258294 259725 259108 258477 259821 262600 265187 267433 270023 272338 272940 271712 269723 267270
52372B67270l414l813k545q36q58k723m495m763l804k356o27J158K152J589j12
$$ 267270 263856 260043 257498 256662 255804 253081 248586 243823 240019 237663 237036 238194 240346 241935 241823
$$ [...]
##END NTUPLES=NMR SPECTRUM
##END=
