##TITLE=coffee_type TORI02-ROVE100A-80-20
COFFEE_meoh_noesyp64 COFFEE_meoh {C:\Bruker\TOPSPIN} Administrator 10
##JCAMPDX= 6.0         $$ Bruker NMR JCAMP-DX V2.0
##DATA TYPE= NMR SPECTRUM
##DATA CLASS= NTUPLES
##ORIGIN= Bruker BioSpin GmbH
##OWNER= Administrator
$$ 1.72 TOPSPIN		Version 2.1
$$ 2012-05-29 13:28:14.845 -0700  Administrator@X
$$ Compression mode = diff/dup
##.OBSERVE FREQUENCY= 400.13188235
##.OBSERVE NUCLEUS= ^1H
##.ACQUISITION MODE= SIMULTANEOUS (DQD)
##.ACQUISITION SCHEME= undefined
##.AVERAGES= 64
##.DIGITISER RES= 22
##SPECTROMETER/DATA SYSTEM= spect
##.PULSE SEQUENCE= noesygpps1d.comp
##.SOLVENT NAME= COFFEE_meoh
##.SHIFT REFERENCE= INTERNAL, COFFEE_meoh, 1, 14.98061
##AUDIT TRAIL= $$ (NUMBER, WHEN, WHO, WHERE, PROCESS, VERSION, WHAT)
$$ ##TITLE= Audit trail, TOPSPIN		Version 2.1
$$ ##JCAMPDX= 5.01
$$ ##ORIGIN= Bruker BioSpin GmbH
$$ ##OWNER= Administrator
$$ $$ Z:/data/jwist/nmr/12-COFFEE-0203/122/pdata/1/auditp.txt
$$ ##AUDIT TRAIL=  $$ (NUMBER, WHEN, WHO, WHERE, PROCESS, VERSION, WHAT)
(   1,<2012-03-02 23:44:55.850 -0500>,<Administrator>,<TOPSPIN>,<go>,<TOPSPIN 2.1>,
      <created by zg
	started at 2012-03-02 23:33:25.553 -0500,
	POWCHK enabled, PULCHK disabled,
       configuration hash MD5:
       1A 1E CE 29 27 FD 77 03 67 4E F0 E3 C4 B2 CB 90
       data hash MD5: 64K
       C3 48 3B BE AE 80 53 D0 EB B4 A8 AC 67 ED 77 95>)
(   2,<2012-03-02 23:45:00.490 -0500>,<Administrator>,<TOPSPIN>,<audit>,<TOPSPIN 2.1>,
      <user comment:
       ICON-NMR User ID: Administrator
       data hash MD5: 64K
       C3 48 3B BE AE 80 53 D0 EB B4 A8 AC 67 ED 77 95>)
(   3,<2012-05-29 09:24:40.800 -0700>,<Administrator>,<X>,<proc1d>,<TOPSPIN 2.1>,
      <Start of raw data processing
       efp LB = 0.3 FT_mod = 6 PKNL = 1 PHC0 = 0 PHC1 = 0 SI = 128K 
       data hash MD5: 128K
       CF 62 19 CD 76 86 4E ED FA CD 73 0F 51 F2 57 A2>)
(   4,<2012-05-29 09:24:41.362 -0700>,<Administrator>,<X>,<proc1d>,<TOPSPIN 2.1>,
      <pk PHC0 = 37.97974 PHC1 = 0 
       data hash MD5: 128K
       3E DB B9 35 39 8B 93 A4 BC 88 8A 32 12 F7 77 1A>)
(   5,<2012-05-29 09:24:42.394 -0700>,<Administrator>,<X>,<proc1d>,<TOPSPIN 2.1>,
      <abs ABSG = 1 
       data hash MD5: 128K
       E1 C4 84 50 F6 EB AC 79 05 D2 50 5D 33 B4 46 69>)
(   6,<2012-05-29 09:24:42.472 -0700>,<Administrator>,<X>,<proc1d>,<TOPSPIN 2.1>,
      <abs ABSG = 2 
       data hash MD5: 128K
       6A A2 9F CF CA 7B 96 1F 56 CF 1C E0 F4 A9 16 29>)
(   7,<2012-05-29 09:24:42.550 -0700>,<Administrator>,<X>,<proc1d>,<TOPSPIN 2.1>,
      <abs ABSG = 3 
       data hash MD5: 128K
       69 9B F6 D9 B3 2F F7 2D F5 2E AC 7F 1E 0B 0D 75>)
(   8,<2012-05-29 09:24:42.644 -0700>,<Administrator>,<X>,<proc1d>,<TOPSPIN 2.1>,
      <abs ABSG = 4 
       data hash MD5: 128K
       51 CD 2E 0B 09 CD 6D DB EA 18 B5 6D 6F 51 5B 79>)
(   9,<2012-05-29 09:24:42.722 -0700>,<Administrator>,<X>,<proc1d>,<TOPSPIN 2.1>,
      <abs ABSG = 5 
       data hash MD5: 128K
$$ [...]
150 150 150 150 150 150 150 150
##$TP07= 0
##$TPNAME0= <>
##$TPNAME1= <>
##$TPNAME2= <>
##$TPNAME3= <>
##$TPNAME4= <>
##$TPNAME5= <>
##$TPNAME6= <>
##$TPNAME7= <>
##$TPOAL= (0..7)
0.5 0.5 0.5 0.5 0.5 0.5 0.5 0.5
##$TPOFFS= (0..7)
0 0 0 0 0 0 0 0
##$TUNHIN= 0
##$TUNHOUT= 0
##$TUNXOUT= 0
##$USERA1= <user>
##$USERA2= <user>
##$USERA3= <user>
##$USERA4= <user>
##$USERA5= <user>
##$V9= 5
##$VALIST= <valist>
##$VCLIST= <CCCCCCCCCCCCCCC>
##$VD= 0
##$VDLIST= <DDDDDDDDDDDDDDD>
##$VPLIST= <PPPPPPPPPPPPPPP>
##$VTLIST= <TTTTTTTTTTTTTTT>
##$WBST= 1024
##$WBSW= 4
##$XGAIN= (0..3)
0 0 0 0
##$XL= 0
##$YL= 0
##$YMAX_a= 14397737
##$YMIN_a= -6894195
##$ZGOPTNS= <>
##$ZL1= 120
##$ZL2= 120
##$ZL3= 120
##$ZL4= 120
##$ABSF1= 14.98061
##$ABSF2= -5.57192
##$ABSG= 5
##$ABSL= 3
##$ALPHA= 0
##$AQORDER= 0
##$ASSFAC= 0
##$ASSFACI= 0
##$ASSFACX= 0
##$ASSWID= 0
##$AUNMP= <proc_prof1d_extract>
##$AXLEFT= 0
##$AXNAME= <>
##$AXNUC= <1H>
##$AXRIGHT= 0
##$AXTYPE= 0
##$AXUNIT= <>
##$AZFE= 0.1
##$AZFW= 0.1
##$BCFW= 0
##$BC_mod= 0
##$BYTORDP= 0
##$COROFFS= 0
##$CY= 15
##$DATMOD= 1
##$DC= 0
##$DFILT= <>
##$DTYPP= 0
##$F1P= 0
##$F2P= 0
##$FCOR= 0.5
##$FTSIZE= 131072
##$FT_mod= 6
##$GAMMA= 0
##$GB= 0
##$INTBC= 1
##$INTSCL= 1
##$ISEN= 128
##$LB= 0.3
##$LEV0= 0
##$LPBIN= 0
##$MAXI= 10000
##$MC2= 0
##$MEAN= 0
##$ME_mod= 0
##$MI= 0
##$NCOEF= 0
##$NC_proc= -3
##$NLEV= 6
##$NOISF1= 0
##$NOISF2= 0
##$NSP= 0
##$NTH_PI= 0
##$NZP= 0
##$OFFSET= 14.98061
##$PC= 1
##$PHC0= 37.97974
##$PHC1= 0
##$PH_mod= 1
##$PKNL= yes
##$PPARMOD= 0
##$PPDIAG= 0
##$PPIPTYP= 0
##$PPMPNUM= 2147483647
##$PPRESOL= 1
##$PSCAL= 4
##$PSIGN= 0
##$PYNMP= <proc.py>
##$REVERSE= no
##$SF= 400.13
##$SI= 131072
##$SIGF1= 0
##$SIGF2= 0
##$SINO= 400
##$SIOLD= 131072
##$SPECTYP= <>
##$SREGLST= <1H.CDCl3>
##$SSB= 0
##$STSI= 131072
##$STSR= 0
##$SW_p= 8223.68421052632
##$SYMM= 0
##$S_DEV= 0
##$TDeff= 65536
##$TDoff= 0
##$TI= <>
##$TILT= no
##$TM1= 0
##$TM2= 0
##$TOPLEV= 0
##$USERP1= <user>
##$USERP2= <user>
##$USERP3= <user>
##$USERP4= <user>
##$USERP5= <user>
##$WDW= 1
##$XDIM= 131072
##$YMAX_p= 499226113
##$YMIN_p= -139261830
##$CURPLOT= <Network HP LaserJet P1505>
##$CURPRIN= <$Network HP LaserJet P1505>
##$DFORMAT= <normdp>
##$LAYOUT= <+/1D_H.xwp>
##$LFORMAT= <normlp>
##$PFORMAT= <normpl>
##$SURQMSG= 1
$$ End of Bruker specific parameters
$$ ---------------------------------
##NTUPLES= NMR SPECTRUM
##VAR_NAME=  FREQUENCY,     SPECTRUM/REAL,   SPECTRUM/IMAG
##SYMBOL=    X,             R,               I
##VAR_TYPE=  INDEPENDENT,   DEPENDENT,       DEPENDENT
##VAR_FORM=  AFFN,          ASDF,            ASDF
##VAR_DIM=   131072,        131072,          131072
##UNITS=     HZ,            ARBITRARY UNITS, ARBITRARY UNITS
##FACTOR=    0.0627417313425165, 1,          1
##FIRST=     8223.62146879498, 5787,         -92065
##LAST=      0,             8152,            -92948
##MIN=       0,             -139261830,      0
##MAX=       8223.62146879498, 499226113,    0
$$ Real data points
##PAGE= N=1
##DATA TABLE= (X++(R..R)), XYDATA
$$ [...]
$$ plain form
60710 1393289 1406528 1418592 1430147 1441566 1452385 1462554 1472842 1483860 1495599 1507950 1520727
60699 1520727 1533191 1544491 1554663 1564439 1574216 1583965 1593799 1603592 1612376 1619263 1624722 1629758 1634174
60686 1634174 1637108 1638929 1640765 1642173 1641293 1637688 1633114 1628834 1624072 1617952 1611106 1604150 1596265 1586777
60672 1586777 1576833 1567910 1559559 1550204 1539536 1528753 1518813 1509635 1500773 1491903 1482839 1473683 1464652
60659 1464652 1455366 1445093 1434216 1424467 1416840 1410139 1402528 1393680 1384372 1374906 1365313 1356440 1349288
60646 1349288 1343467 1337652 1331468 1325774 1321113 1317071 1313348 1310448 1308962 1308794 1309361 1310087 1310560 1310480 1309508 1307103
60630 1307103 1302932 1297647 1292573 1288003 1282280 1273251 1260308 1244508 1227231 1209343 1191214 1172741
60618 1172741 1153681 1134595 1117043 1102106 1089169 1076919 1065103 1054429 1045245 1037434 1031351 1027657
$$ packed form
60710A393289J3239J2064J1555J1419J0819J0169J0288J1018J1739J2351J2777
60699A520727J2464J1300J0172R776R777R749R834R793Q784O887N459N036M416
60686A634174K934J821J836J408q80l605m574m280m762o120o846o956p885r488
60672A586777r944q923q351r355j0668j0783r940r178q862q870r064r156r031
60659A464652r286j0273j0877r749p627o701p611q848r308r466r593q873p152
60646A349288n821n815o184n694m661m042l723k900j486j68N67P26M73q0r72k405
60630A307103m171n285n074m570n723r029j2943j5800j7277j7888j8129j8473
60618A172741j9060j9086j7552j4937j2937j2250j1816j0674r184p811o083l694
$$ plain form
60606 1027657 1026192 1025999 1026603 1028394 1031691 1036253 1041858 1048440 1055417 1061794 1067421 1073502 1081224 1090268
60592 1090268 1099143 1106880 1113906 1121277 1129442 1138033 1146736 1155914 1166028 1176651 1186547 1194750 1201159
60579 1201159 1206183 1210474 1215109 1221316 1229620 1239716 1251388 1264961 1280637 1298112 1317176 1337980
60567 1337980 1360211 1382745 1404643 1425907 1446841 1467358 1487313 1506611 1524358 1538838 1549273
60556 1549273 1556839 1563121 1568267 1571665 1573579 1574870 1575511 1574588 1571543 1566462 1559493 1550900 1541446 1531794
60542 1531794 1521840 1511359 1500769 1490361 1479490 1467646 1455628 1444202 1432260 1418087 1402321
60531 1402321 1387821 1376391 1367196 1358822 1351444 1346348 1344507 1346087 1350361 1355642 1360391 1364839 1370564
60518 1370564 1378119 1386186 1393548 1400637 1408303 1416076 1422715 1427849 1432064 1435733 1438688 1440883 1442693 1444530
$$ packed form
60606A027657j465j93O04J791L297M562N605O582O977O377N627O081P722R044
60592A090268Q875P737P026P371Q165Q591Q703R178J0114J0623R896Q203O409
60579A201159N024M291M635O207Q304J0096J1672J3573J5676J7475J9064K0804
60567A337980K2231K2534K1898K1264K0934K0517J9955J9298J7747J4480J0435
60556A549273P566O282N146L398J914J291O41r23l045n081o969q593r454r652
60542A531794r954j0481j0590j0408j0871j1844j2018j1426j1942j4173j5766
60531A402321j4500j1430r195q374p378n096j841J580M274N281M749M448N725
60518A370564P555Q067P362P089P666P773O639N134M215L669K955K195J810J837
$$ plain form
60504 1444530 1446601 1448960 1451412 1453434 1454496 1454479 1453644 1452200 1449986 1446552 1441655 1435783 1430100 1425840 1423870
60489 1423870 1424685 1428287 1433961 1441056 1450393 1464058 1483133 1506483 1532812 1562938 1598664 1640038
60477 1640038 1685654 1735616 1792281 1857181 1928255 2000631 2069277 2130659 2183032 2225874 2258411
60466 2258411 2278516 2284080 2275941 2258517 2236951 2214343 2192020 2171217 2153407 2139703 2131082 2129024
60454 2129024 2135016 2149119 2169300 2192381 2215980 2239840 2265158 2292374 2320296 2348140 2377766
60443 2377766 2412512 2453983 2501477 2554652 2615263 2686004 2769151 2866771 2980491 3110205 3254706
60432 3254706 3414766 3594169 3796361 4021364 4267642 4535874 4828987 5149144 5496738
60423 5496738 5872258 6277186 6712293 7175432 7659878 8152406 8631976 9071503 9442200
$$ packed form
60504A444530K071K359K452K022J062j7q35j444k214l434m897n872n683m260j970
60489A423870Q15L602N674P095R337J3665J9075K3350K6329L0126L5726M1374
60477A640038M5616M9962N6665O4900P1074P2376O8646O1382N2373M2842L2537
60466B258411K0105N564q139j7424k1566k2608k2323k0803j7810j3704q621k058
60454B129024N992J4103K0181K3081K3599K3860K5318K7216K7922K7844K9626
60443B377766L4746M1471M7494N3175O0611P0741Q3147R7620J13720J29714J44501
60432C254706J60060J79403K02192K25003K46278K68232K93113L20157L47594
60423E496738L75520M04928M35107M63139M84446M92528M79570M39527L70697
$$ plain form
60414 9442200 9717366 9874711 9899258 9786987 9546295 9195741 8760087 8266748 7742397 7209696
60404 7209696 6685801 6183154 5710599 5273316 4872772 4508060 4177666 3879987 3612828
60395 3612828 3373179 3157636 2963043 2787091 2628594 2486849 2360478 2247237 2145222
60386 2145222 2053739 1972457 1900075 1834459 1774006 1718313 1667535 1621559 1579717 1540751 1503130
60375 1503130 1466062 1430359 1397603 1368130 1340476 1313312 1287221 1263715 1242924 1223349 1203875
60364 1203875 1185003 1167858 1152867 1139904 1128889 1119522 1110950 1102420 1094044 1086507 1080389 1076170 1074330
60351 1074330 1074607 1075497 1075300 1073595 1071183 1068900 1067169 1066380 1066752 1067879 1069262 1071184 1074153 1077600 1080324
60336 1080324 1082399 1085342 1089917 1094952 1099226 1103562 1109845 1118364 1127257 1134527 1139764 1143798 1147404 1150708
$$ packed form
60414I442200K75166J57345K4547j12271k40692l50554m35654m93339n24351n32701
60404G209696n23895n02647m72555m37283m00544l64712l30394k97679k67159
60395C612828k39649k15543j94593j75952j58497j41745j26371j13241j02015
60386B145222r1483q1282p2382o5616o0453n5693n0778m5976m1842l8966l7621
60375A503130l7068l5703l2756k9473k7654k7164k6091k3506k0791j9575j9474
60364A203875j8872j7145j4991j2963j1015r367q572q530q376p537o118m219j840
60351A074330K77Q90j97j705k412k283j731p89L72J127J383J922K969L447K724
60336A080324K075K943M575N035M274M336O283Q519Q893P270N237M034L606L304
$$ plain form
60322 1150708 1153449 1155403 1156466 1156527 1155524 1153802 1152146 1150963 1149434 1146027 1140120 1132815 1125981 1120694
60308 1120694 1116700 1113063 1109293 1106128 1105112 1106878 1109922 1111855 1112109 1112660 1115680 1121175 1127447 1133243
60294 1133243 1138745 1144898 1152518 1161796 1171999 1181765 1190243 1197890 1205688 1213868 1221923 1229686 1237530 1245390
60280 1245390 1252360 1257720 1261956 1266204 1270747 1274401 1275532 1273630 1269959 1266748 1265692 1266981 1269537 1272236
60266 1272236 1275099 1279366 1286260 1295606 1305847 1315389 1323611 1330476 1335696 1338748 1339420 1337873 1334356 1329329
60252 1329329 1323584 1317706 1311539 1304779 1297928 1292017 1287449 1283748 1280414 1277355 1274432 1271418 1268673 1267238
60238 1267238 1267870 1270300 1273581 1276746 1279154 1280703 1281845 1282939 1283677 1283683 1283563 1284616 1287483 1291828 1297324
60223 1297324 1304042 1311773 1319963 1328590 1338215 1348905 1360071 1371706 1384652 1399082 1413778 1427684
$$ packed form
60322A150708K741J954J063O1j003j722j656j183j529l407n907p305o834n287
60308A120694l994l637l770l165j016J766L044J933K54N51L020N495O272N796
60294A133243N502O153P620R278J0203R766Q478P647P798Q180Q055P763P844P860
60280A245390O970N360M236M248M543L654J131j902l671l211j056J289K556K699
60266A272236K863M267O894R346J0241R542Q222O865N220L052O72j547l517n027
60252A329329n745n878o167o760o851n911m568l701l334l059k923l014k745j435
60238A267238O32K430L281L165K408J549J142J094P38Oj20J053K867M345N496
60223A297324O718P731Q190Q627R625J0690J1166J1635J2946J4430J4696J3906
$$ plain form
60211 1427684 1441297 1455670 1470741 1485548 1499584 1513284 1527705 1544264 1564009 1586354 1609277
60200 1609277 1631703 1655194 1682472 1714819 1751686 1792092 1835284 1880642 1928366 1980187 2038219
60189 2038219 2103009 2173526 2248989 2329801 2416741 2510389 2611601 2721620 2841066 2969217
60179 2969217 3104652 3246462 3394723 3549921 3711786 3878512 4047252 4215519 4381692
60170 4381692 4543986 4699565 4845246 4978668 5098176 5202091 5288937 5358205 5410206 5445351
60160 5445351 5464152 5467682 5457399 5434807 5402052 5362699 5321057 5280589 5243363 5210863 5184761
60149 5184761 5166968 5159447 5163902 5181366 5212391 5257881 5319159 5396721 5489658 5597021 5718934
60138 5718934 5855325 6004121 6161857 6325432 6491821 6656441 6813636 6959064 7090390
$$ packed form
60211A427684J3613J4373J5071J4807J4036J3700J4421J6559J9745K2345K2923
60200A609277K2426K3491K7278L2347L6867M0406M3192M5358M7724N1821N8032
60189B038219O4790P0517P5463Q0812Q6940R3648J01212J10019J19446J28151
60179B969217J35435J41810J48261J55198J61865J66726J68740J68267J66173
60170D381692J62294J55579J45681J33422J19508J03915Q6846O9268N2001L5145
60160E445351J8801L530j0283k2592l2755l9353m1642m0468l7226l2500k6102
60149E184761j7793p521M455J7464L1025M5490O1278P7562R2937J07363J21913
60138E718934J36391J48796J57736J63575J66389J64620J57195J45428J31326
$$ plain form
60129 7090390 7205478 7301413 7375749 7427518 7456420 7462134 7444982 7406285 7347532 7270222 7177224
60118 7177224 7073457 6964488 6855042 6749190 6650874 6563388 6489156 6430730 6391102 6371980
60108 6371980 6372467 6390691 6426358 6480454 6552578 6639777 6738145 6844428 6955603 7067807 7176639
60097 7176639 7278457 7370861 7451814 7518641 7568491 7600179 7615434 7617757 7609830 7592592 7567204
60086 7567204 7537248 7508147 7484648 7469707 7465737 7475799 7502961 7549216 7615910 7705098 7819759
60075 7819759 7962630 8135298 8338493 8572647 8838004 9134826 9463981 9826812 10223578
60066 10223578 10652133 11108684 11589633 12091726 12610271 13138174 13667140 14188949 14694999
60057 14694999 15175653 15621402 16024619 16379420 16680128 16920907 17096887 17204731 17241939
$$ packed form
60129G090390J15088R5935P4336N1769K8902N714j7152l8697n8753p7310r2998
60118G177224j03767j08969j09446j05852r8316q7486p4232n8426l9628j9122
60108F371980M87J8224L5667N4096P2124Q7199R8368J06283J11175J12204J08832
60097G176639J01818R2404Q0953O6827M9850L1688J5255K323p927j7238k5388
60086G567204k9956k9101k3499j4941l970J0062K7162M6255O6694Q9188J14661
60075G819759J42871J72668K03195K34154K65357K96822L29155L62831L96766
60066A0223578M28555M56551M80949N02093N18545N27903N28966N21809N06050
60057A4694999M80654M45749M03217L54801L00708K40779J75980J07844L7208
$$ plain form
60048 17241939 17206566 17098220 16919150 16674438 16371651 16020273 15630534 15212406 14776096
60039 14776096 14333345 13896903 13477913 13084209 12721513 12395339 12110654 11870253 11674702
60030 11674702 11523963 11418019 11355589 11333154 11345972 11389630 11459864 11551082 11655798 11765841
60020 11765841 11873884 11973739 12059698 12126211 12168500 12183555 12170595 12130576 12065101 11975610 11863471
60009 11863471 11730408 11578139 11407464 11218463 11012287 10792355 10563027 10327327 10086934
60000 10086934 9844483 9604797 9373284 9153775 8948465 8759342 8588871 8439436 8312712
59991 8312712 8209637 8130733 8076474 8047307 8043085 8062617 8104299 8167155 8250583 8353101 8472206
59980 8472206 8605475 8750285 8901774 9052438 9194996 9324823 9438627 9532093 9600662 9642003
$$ packed form
60048A7241939l5373j08346j79070k44712l02787l51378l89739m18128m36310
60039A4776096m42751m36442m18990l93704l62696l26174k84685k40401j95551
60030A1674702j50739j05944o2430k2435J2818M3658P0234R1218J04716J10043
60020A1765841J08043R9855Q5959O6513M2289J5055j2960m0019o5475q9491j12139
60009A1863471j33063j52269j70675j89001k06176k19932k29328k35700k40393
60000A0086934k42451k39686k31513k19509k05310j89123j70471j49435j26724
59991H312712j03075p8904n4259k9167m222J9532M1682O2856Q3428J02518J19105
59980H472206J33269J44810J51489J50664J42558J29827J13804R3466O8569M1341
$$ plain form
59970 9642003 9655625 9640235 9593586 9515504 9409337 9279605 9129502 8961588 8779844 8590013
59960 8590013 8398416 8210951 8032343 7865348 7711118 7571112 7448322 7346103 7266272 7209076
59950 7209076 7174636 7163551 7176155 7212013 7270577 7351960 7456843 7585717 7738314 7913539
59940 7913539 8109455 8322983 8549721 8784649 9023203 9261069 9492394 9708864 9901764
59931 9901764 10065218 10196974 10296206 10361548 10391386 10384957 10342459 10264801 10154191 10014862 9852558
59920 9852558 9673303 9482882 9287349 9093409 8907914 8736793 8584209 8452526 8343061
59911 8343061 8256977 8195543 8159805 8150163 8166303 8207422 8272552 8360456 8468872 8593971 8731328
59900 8731328 8877805 9031892 9191742 9353523 9512385 9664463 9807181 9938319 10056209
$$ packed form
59970I642003J3622j5390m6649p8082j06167j29732j50103j67914j81744j89831
59960H590013j91597j87465j78608j66995j54230j40006j22790j02219p9831n7196
59950G209076l4440j1085J2604L5858N8564Q1383J04883J28874J52597J75225
59940G913539J95916K13528K26738K34928K38554K37866K31325K16470J92900
59931I901764J63454J31756R9232O5342K9838o429m2498p7658j10610j39329j62304
59920I852558j79255j90421j95533j93940j85495j71121j52584j31683j09465
59911H343061q6084o1434l5738r642J6140M1119O5130Q7904J08416J25099J37357
59900H731328J46477J54087J59850J61781J58862J52078J42718J31138J17890
$$ plain form
59891 10056209 10160722 10252843 10333112 10401596 10459570 10510131 10556767 10602411 10650510 10706217 10775693
59880 10775693 10864566 10977427 11118276 11290859 11498854 11746024 12035864 12370714 12751191
59871 12751191 13176141 13642363 14144218 14673994 15222635 15779318 16330217 16858618 17346704
59862 17346704 17776798 18131301 18393592 18551057 18597638 18533466 18363021 18094482 17740022 17315128
59852 17315128 16837085 16324109 15794566 15264724 14746131 14245888 13770249 13327512 12926531
59843 12926531 12572542 12265508 12003142 11785048 11613339 11489795 11413688 11382492 11393418 11443476
59833 11443476 11529075 11646714 11793492 11965589 12156181 12355638 12553679 12740536 12906424
59824 12906424 13041227 13135114 13179092 13165565 13089819 12951297 12752669 12497838 12192002 11843355
$$ packed form
59891A0056209J04513R2121Q0269O8484N7974N0561M6636M5644M8099N5707O9476
59880A0775693Q8873J12861J40849J72583K07995K47170K89840L34850L80477
59871A2751191M24950M66222N01855N29776N48641N56683N50899N28401M88086
59862A7346704M30094L54503K62291J57465M6581o4172j70445k68539l54460m24894
59852A7315128m78043n12976n29543n29842n18593n00243m75639m42737m00981
59843A2926531l53989l07034k62366k18094j71709j23544p6107l1196J0926N0058
59833A1443476Q5599J17639J46778J72097J90592J99457J98041J86857J65888
59824A2906424J34803R3887M3978j3527p5746j38522j98628k54831l05836l48647
$$ plain form
59814 11843355 11462911 11061838 10649716 10235172 9826216 9428995 9047399 8684539 8343473
59805 8343473 8026028 7732634 7464469 7224156 7012664 6826576 6660289 6510393 6376388
59796 6376388 6257637 6151547 6054899 5965460 5881799 5802635 5726964 5654324 5584719 5518725 5457586
59785 5457586 5402517 5353720 5310496 5272129 5237938 5206351 5174698 5140473 5102626 5061412 5017046
59774 5017046 4968809 4915702 4857903 4797006 4734468 4670480 4605434 4542188 4485361 4437843 4399091
59763 4399091 4367552 4343593 4329169 4325422 4331757 4346678 4368472 4395411 4426423 4461765 4502667 4550580
59751 4550580 4606946 4672754 4747385 4828348 4912909 4999414 5086271 5170521 5248840 5319771 5383774
59740 5383774 5441154 5491099 5532822 5566595 5593393 5614416 5631384 5646819 5663705 5685042 5713618
$$ packed form
59814A1843355l80444m01073m12122m14544m08956l97221l81596l62860l41066
59805H343473l17445k93394k68165k40313k11492j86088j66287j49896j34005
59796F376388j18751j06090r6648q9439q3661p9164p5671p2640o9605o5994o1139
59785E457586n5069m8797m3224l8367l4191l1587l1653l4225l7847m1214m4366
59774E017046m8237n3107n7799o0897o2538o3988o5046o3246n6827m7518l8752
59763D399091l1539k3959j4424l747O335J4921K1794K6939L1012L5342M0902M7913
59751D550580N6366O5808P4631Q0963Q4561Q6505Q6857Q4250P8319P0931O4003
59740E383774N7380M9945M1723L3773K6798K1023J6968J5435J6886K1337K8576
$$ plain form
59729 5713618 5751819 5801644 5864931 5943189 6037196 6147724 6277336 6430610 6611686 6822229
59719 6822229 7062722 7334892 7641379 7983298 8359567 8768384 9207732 9673751 10158937
59710 10158937 10651008 11131506 11575280 11953707 12241039 12419616 12481753 12430146 12277808 12045606
59700 12045606 11757060 11433864 11094842 10756454 10432174 10131347 9859552 9620071 9414821
59691 9414821 9244638 9109756 9010179 8945236 8913005 8910693 8935758 8986825 9063954 9168189 9300391
59680 9300391 9460305 9647179 9861307 10104195 10376888 10679055 11010518 11373036 11769696
59671 11769696 12202981 12674513 13186497 13742077 14343871 14993082 15690624 16438265 17237586
59662 17237586 18087868 18985586 19925492 20901041 21903374 22920884 23940869 24951766 25943753
$$ packed form
59729E713618L8201M9825O3287P8258R4007J10528J29612J53274J81076K10543
59719F822229K40493K72170L06487L41919L76269M08817M39348M66019M85186
59710A0158937M92071M80498M43774L78427K87332J78577O2137n1607j52338k32202
59700A2045606k88546l23196l39022l38388l24280l00827k71795k39481k05250
59691I414821j70183j34882r9577o4943l2231k312K5065N1067P7129J04235J32202
59680I300391J59914J86874K14128K42888K72693L02167L31463L62518L96660
59671A1769696M33285M71532N11984N55580O01794O49211O97542P47641P99321
59662A7237586Q50282Q97718R39906R75549J002333J017510J019985J010897R91987
$$ plain form
59653 25943753 26908130 27837674 28728526 29581853 30403833 31204279 31994767 32786530 33588407
59644 33588407 34405504 35238709 36084668 36936024 37781914 38608163 39396979 40127508 40778617
59635 40778617 41332500 41776380 42102263 42307204 42394633 42374492 42261504 42073982 41834112 41567101
59625 41567101 41297724 41047372 40834549 40676870 40590911 40590334 40685254 40883434 41191476 41615410
59615 41615410 42160836 42831560 43626424 44537220 45550156 46648383 47811332 49011447 50212646
59606 50212646 51371644 52439550 53363120 54088326 54566732 54761366 54649876 54226294 53502286
59597 53502286 52506147 51278712 49868559 48328414 46711720 45068123 43439350 41857271
59589 41857271 40343712 38910629 37560673 36288163 35079618 33913913 32764360 31604240
$$ packed form
59653B5943753R64377R29544Q90852Q53327Q21980Q00446P90488P91763Q01877
59644C3588407Q17097Q33205Q45959Q51356Q45890Q26249P88816P30529O51109
59635D0778617N53883M43880L25883K04941Q7429k0141j12988j87522k39870k67011
59625D1567101k69377k50352k12823j57679q5959n77R4920J98180L08042M23934
59615D1615410N45426O70724P94864R10796J012936J098227J162949J200115J201199
59606E0212646J158998J067906R23570P25206M78406J94634j11490m23582p24008
59597E3502286r96139j227435j410153j540145j616694j643597j628773j582079
59589D1857271j513559j433083j349956j272510j208545j165705j149553j160120
$$ plain form
59581 31604240 30413750 29184525 27919973 26632547 25339827 24060822 22813204 21611623
59573 21611623 20466859 19385744 18371942 17427073 16551426 15744017 15002504 14323104 13700671
59564 13700671 13129539 12605116 12124766 11686745 11288461 10926328 10597105 10298494 10028230
59555 10028230 9783359 9560816 9358215 9173584 9004494 8847617 8699080 8555284 8413738
59546 8413738 8273177 8132664 7990578 7844726 7693321 7535728 7372655 7206206 7039558
59537 7039558 6875852 6717211 6565001 6420645 6285554 6160463 6045597 5941501 5848989 5768269
59527 5768269 5698870 5640536 5593495 5557575 5531780 5515194 5507846 5510068 5521117 5538919 5561451 5588233
59515 5588233 5620079 5657205 5698135 5741208 5786722 5836256 5889792 5945195 6001331 6060200 6124887
$$ packed form
59581C1604240j190490j229225j264552j287426j292720j279005j247618j201581
59573B1611623j144764j081115j013802r44869q75647q07409p41513o79400o22433
59564A3700671n71132n24423m80350m38021l98284l62133l29223k98611k70264
59555A0028230k44871k22543k02601j84631j69090j56877j48537j43796j41546
59546H413738j40561j40513j42086j45852j51405j57593j63073j66449j66648
59537G039558j63706j58641j52210j44356j35091j25091j14866j04096r2512q0720
59527E768269o9399n8334m7041l5920k5795j6586p348K222J1049J7802K2532K6782
59515E588233L1846L7126M0930M3073M5514M9534N3536N5403N6136N8869O4687
$$ plain form
59504 6124887 6196954 6277401 6368578 6472687 6589280 6716922 6856998 7013112 7186594 7375542
59494 7375542 7579168 7800410 8042860 8307420 8593614 8902066 9233394 9585937 9956642
59485 9956642 10343427 10744785 11157671 11577446 11999446 12419019 12830503 13227948 13606845
59476 13606845 13963762 14294338 14593088 14855553 15079791 15265917 15415435 15531252 15617243
59467 15617243 15677337 15715650 15737597 15750057 15760041 15773674 15796611 15834766 15894109 15979687 16094478
59456 16094478 16238456 16408340 16598088 16799163 17000101 17186594 17343260 17455892 17512183
59447 17512183 17501319 17414497 17246499 16996503 16667473 16265496 15799897 15283138 14729645 14154148
59437 14154148 13570420 12990573 12424741 11881266 11367088 10887747 10446867 10045764 9683779
$$ packed form
59504F124887P2067Q0447R1177J04109J16593J27642J40076J56114J73482J88948
59494G375542K03626K21242K42450K64560K86194L08452L31328L52543L70705
59485I956642L86785M01358M12886M19775M22000M19573M11484L97445L78897
59476A3606845L56917L30576K98750K62465K24238J86126J49518J15817Q5991
59467A5617243O0094L8313K1947J2460R984J3633K2937L8155N9343Q5578J14791
59456A6094478J43978J69884J89748K01075K00938J86493J56666J12632N6291
59447A7512183j0864q6822j67998k49996l29030m01977m65599n16759n53493n75497
59437A4154148n83728n79847n65832n43475n14178m79341m40880m01103l61985
$$ plain form
59428 9683779 9359344 9071123 8818303 8599864 8413946 8258575 8132969 8037369 7971297 7932719
59418 7932719 7919457 7930888 7967727 8030705 8120166 8236483 8379858 8549756 8745173 8965281
59408 8965281 9209096 9474504 9758210 10056501 10365229 10678869 10990090 11290339 11570307
59399 11570307 11820015 12029505 12190030 12294398 12336456 12311485 12218097 12059491 11842376 11574716
59389 11574716 11264527 10919927 10549230 10160683 9762304 9361772 8966022 8580744 8210364
59380 8210364 7858237 7526535 7216081 6926728 6658043 6409545 6180579 5970483 5778932
59371 5778932 5605712 5450039 5310437 5185414 5073967 4975479 4889586 4816218 4755058 4704672
59361 4704672 4662956 4629078 4604390 4590539 4587099 4591866 4603066 4620275 4643590 4673370 4710577 4755370
$$ packed form
59428I683779l24435k88221k52820k18439j85918j55371j25606r5600o6072l8578
59418G932719j3262J1431L6839O2978Q9461J16317J43375J69898J95417K20108
59408H965281K43815K65408K83706K98291L08728L13640L11221L00249K79968
59399A1570307K49708K09490J60525J04368M2058k4971r3388j58606k17115k67660
59389A1574716l10189l44600l70697l88547l98379m00532l95750l85278l70380
59380H210364l52127l31702l10454k89353k68685k48498k28966k10096j91551
59371E778932j73220j55673j39602j25023j11447r8488q5893p3368o1160n0386
59361D704672m1716l3878k4688j3851l440M767J1200J7209K3315K9780L7207M4793
$$ plain form
59349 4755370 4804611 4852493 4894999 4932957 4969895 5008305 5049415 5095352 5149324 5213823 5290276
59338 5290276 5380092 5483940 5599527 5721875 5846975 5974602 6107368 6248296 6400050 6565625
59328 6565625 6748803 6953998 7185636 7446936 7739025 8062033 8417373 8808383 9238699
59319 9238699 9710981 10227401 10790045 11400045 12057053 12760106 13507780 14296193 15117046
59310 15117046 15958290 16806379 17647480 18467692 19253876 19995096 20683276 21313001 21881407
59301 21881407 22388129 22834709 23223783 23558607 23842389 24076925 24261522 24393368 24468702
59292 24468702 24483341 24432653 24312112 24118560 23851196 23511836 23104742 22636272 22114272 21547259
59282 21547259 20943509 20310267 19653438 18978092 18289245 17592143 16892265 16195720 15509571
$$ packed form
59349D755370M9241M7882M2506L7958L6938L8410M1110M5937N3972O4499P6453
59338E290276Q9816J03848J15587J22348J25100J27627J32766J40928J51754J65575
59328F565625J83178K05195K31638K61300K92089L23008L55340L91010M30316
59319I238699M72282N16420N62644O10000O57008P03053P47674P88413Q20853
59310A5117046Q41244Q48089Q41101Q20212P86184P41220O88180O29725N68406
59301B1881407N06722M46580L89074L34824K83782K34536J84597J31846P5334
59292B4468702J4639n0688j20541j93552k67364l39360m07094m68470n22000n67013
59282B1547259o03750o33242o56829o75346o88847o97102o99878o96545o86149
$$ plain form
59273 15509571 14841022 14195881 13578061 12990428 12435509 11915263 11430907 10983300 10572930
59264 10572930 10199252 9860645 9555429 9282485 9040452 8826830 8638486 8473027 8329509
59255 8329509 8208092 8109245 8032852 7977599 7941226 7921542 7917252 7927801 7952615 7990461 8039504
59244 8039504 8098097 8165456 8240890 8322063 8404821 8485561 8563141 8637350 8706015 8765102 8811708
59233 8811708 8845591 8867616 8878080 8877278 8866695 8849018 8827709 8806832 8790386 8781153 8780744 8790895
59221 8790895 8813955 8852007 8906558 8979338 9072267 9186043 9319630 9471279 9638843 9818654
59211 9818654 10005567 10195073 10384328 10570144 10746771 10906326 11040580 11141898 11204235 11225288
59201 11225288 11207682 11157211 11080063 10981955 10868719 10746270 10620120 10495382 10376521 10266253
$$ packed form
59273A5509571o68549o45141o17820n87633n54919n20246m84356m47607m10370
59264A0572930l73678l38607l05216k72944k42033k13622j88344j65459j43518
59255H329509j21417r8847p6393n5253l6373j9684m290J0549K4814L7846M9043
59244H039504N8593O7359P5434Q1173Q2758Q0740P7580P4209O8665N9087M6606
59233H811708L3883K2025J0464q02j0583j7677k1309k0877j6446r233m09J0151
59221H790895K3060L8052N4551P2780R2929J13776J33587J51649J67564J79811
59211I818654J86913J89506J89255J85816J76627J59555J34254J01318O2337K1053
59201A1225288j7606n0471p7148r8108j13236j22449j26150j24738j18861j10268
$$ plain form
59191 10266253 10165120 10072870 9989632 9915193 9847896 9785170 9724704 9664543 9602835 9538434 9471450
59180 9471450 9402704 9333208 9264472 9198341 9135906 9077645 9025484 8983759 8957243 8949181 8962179
59169 8962179 8999848 9066110 9163535 9293654 9458468 9660655 9902782 10187070 10514924 10885306
59159 10885306 11294051 11735607 12204410 12693079 13189846 13679067 14143648 14565965 14927877
59150 14927877 15212588 15407213 15502920 15493574 15376315 15153511 14832610 14424063 13940779 13399177
59140 13399177 12818350 12216619 11608993 11007379 10421589 9859523 9327264 8829418 8368780
59131 8368780 7945699 7558647 7205632 6884580 6592891 6327839 6087549 5870825 5676019
59122 5676019 5500885 5343419 5202075 5075385 4962185 4862045 4774556 4698431 4632154 4575227
$$ packed form
59191A0266253j01133r2250q3238p4439o7297o2726o0466o0161o1708o4401o6984
59180I471450o8746o9496o8736o6131o2435n8261n2161m1725k6516q062J2998
59169H962179L7669O6262R7425J30119J64814K02187K42127K84288L27854L70382
59159A0885306M08745M41556M68803M88669M96767M89221M64581M22317L61912
59150A4927877K84711J94625R5707r346j17259k22804l20901m08547m83284n41602
59140A3399177n80827o01731o07626o01614n85790n62066n32259m97846m60638
59131H368780m23081l87052l53015l21052k91689k65052k40290k16724j94806
59122E676019j75134j57466j41344j26690j13200j00140q7489p6125o6277n6927
$$ plain form
59112 4575227 4527801 4489386 4459003 4436398 4421906 4415123 4414836 4420352 4432030 4450449 4475863 4508432
59100 4508432 4548227 4595087 4649120 4711010 4781086 4858546 4942498 5033286 5131799 5238001 5351227
59089 5351227 5471211 5597203 5726561 5856086 5984850 6114036 6243545 6370115 6489140
59080 6489140 6597140 6692114 6772897 6838979 6890261 6926418 6946952 6952105 6943335 6922984 6894019
59069 6894019 6859798 6823287 6786665 6752244 6723335 6703279 6693960 6696191 6711119 6740246 6784544 6844601
59057 6844601 6921208 7014735 7124547 7250426 7393966 7556985 7738936 7937516 8151487 8381166
59047 8381166 8626274 8885233 9156786 9440655 9736230 10041737 10354424 10669874 10981162
59038 10981162 11280438 11561333 11818073 12042250 12222863 12350414 12419532 12427468 12372437 12254824
$$ packed form
59112D575227m7426l8415l0383k2605j4492o783k87N516J1678J8419K5414L2569
59100D508432L9795M6860N4033O1890P0076P7460Q3952R0788R8513J06202J13226
59089E351227J19984J25992J29358J29525J28764J29186J29509J26570J19025
59080F489140J08000R4974Q0783O6082N1282L6157K0534N153q770k0351k8965
59069F894019l4221l6511l6622l4421k8909k0056r319K231J4928K9127M4298O0057
59057F844601P6607R3527J09812J25879J43540J63019J81951J98580K13971K29679
59047H381166K45108K58959K71553K83869K95575L05507L12687L15450L11288
59038A0981162K99276K80895K56740K24177J80613J27551O9118P936n5031j17613
$$ plain form
59028 12254824 12078623 11850429 11577627 11267764 10928183 10565462 10185984 9797052 9405850
59019 9405850 9016952 8632376 8254468 7887096 7533590 7195348 6873204 6568361 6280926
59010 6280926 6009296 5752275 5510516 5284733 5073771 4875687 4689627 4515443 4352483
59001 4352483 4200043 4058224 3927195 3806122 3693674 3588950 3491242 3399643 3313697 3233700
58991 3233700 3159641 3090512 3025314 2964050 2907115 2854438 2805839 2761496 2721373 2684631 2650032
58980 2650032 2616588 2584007 2553325 2526942 2506805 2492405 2481547 2472872 2466104 2460255 2453950 2448026
58968 2448026 2445438 2447524 2452403 2458180 2465480 2475055 2484886 2492069 2496472 2500215 2504178 2507195 2508547 2509161
58954 2509161 2509934 2510313 2509292 2507151 2505669 2506753 2510822 2516571 2522601 2529208 2537895 2549137 2561393 2572389
$$ packed form
59028A2254824j76201k28194k72802l09863l39581l62721l79478l88932l91202
59019I405850l88898l84576l77908l67372l53506l38242l22144l04843k87435
59010F280926k71630k57021k41759k25783k10962j98084j86060j74184j62960
59001D352483j52440j41819j31029j21073j12448j04724r7708r1599q5946p9997
58991C233700p4059o9129o5198o1264n6935n2677m8599m4343m0123l6742l4599
58980B650032l3444l2581l0682k6383k0137j4400j0858q675o768n849o305n924
58968B448026k588K086M879N777P300R575R831P183M403L743L963L017J352O14
58954B509161P73L79j021k141j482J084M069N749O030O607Q687J1242J2256J0996
$$ plain form
58940 2572389 2580401 2584271 2583451 2578649 2571405 2562605 2552176 2540262 2527478 2514001 2499953 2486985 2477629
58927 2477629 2472486 2469821 2468580 2469894 2474577 2481254 2488508 2497179 2508791 2523097 2538967 2556589 2577033
58914 2577033 2600540 2626912 2656673 2690080 2725704 2761764 2798448 2837366 2879089 2922789 2968085
58903 2968085 3015704 3066292 3119586 3174759 3230896 3287459 3344995 3404932 3467951 3533228 3599969
58892 3599969 3668851 3741030 3816617 3895259 3977420 4063827 4154318 4248596 4347654 4453145 4565579
58881 4565579 4684335 4809388 4942035 5083938 5236136 5398911 5572082 5755575 5950038
58872 5950038 6156675 6376534 6610658 6860832 7129074 7416200 7722269 8048822 8399370
58863 8399370 8777244 9184532 9623625 10097825 10609307 11158283 11745518 12374080 13047167
$$ packed form
58940B572389Q012L870q20m802p244q800j0429j1914j2784j3477j4048j2968r356
58927B477629n143k665j241J314M683O677P254Q671J1612J4306J5870J7622K0444
58914B577033K3507K6372K9761L3407L5624L6060L6684L8918M1723M3700M5296
58903B968085M7619N0588N3294N5173N6137N6563N7536N9937O3019O5277O6741
58892C599969O8882P2179P5587P8642Q2161Q6407R0491R4278R9058J05491J12434
58881D565579J18756J25053J32647J41903J52198J62775J73171J83493J94463
58872E950038K06637K19859K34124K50174K68242K87126L06069L26553L50548
58863H399370L77874M07288M39093M74200N11482N48976N87235O28562O73087
$$ plain form
58854 13047167 13765752 14529822 15340229 16197278 17098600 18039823 19015651 20017967 21033790
58845 21033790 22046915 23040178 23993795 24882796 25679326 26357962 26897608 27280027 27490509
58836 27490509 27521317 27373111 27053295 26574990 25957360 25223981 24399065 23505472 22565445
58827 22565445 21600676 20630382 19670034 18731952 17825751 16958006 16132857 15353480 14622200
58818 14622200 13939204 13302400 12708993 12156660 11643357 11166927 10724850 10313625 9928747
58809 9928747 9566417 9225288 8905752 8607691 8329750 8070402 7828618 7603506 7394103
58800 7394103 7199583 7019256 6852641 6699791 6560805 6434693 6319874 6216379 6126089 6049674
58790 6049674 5984684 5928196 5880178 5842610 5816405 5801141 5797051 5805180 5825756 5858079 5901815 5957029
$$ packed form
58854A3047167P18585P64070Q10407Q57049R01322R41223R75828J002316J015823
58845B1033790J013125R93263R53617Q89001P96530O78636N39646L82419K10482
58836B7490509L0808j48206l19816m78305o17630p33379q24916q93593r40027
58827B2565445r64769r70294r60348r38082r06201q67745q25149p79377p31280
58818A4622200o82996o36804n93407n52333n13303m76430m42077m11225l84878
58809I928747l62330l41129l19536k98061k77941k59348k41784k25112k09403
58800G394103j94520j80327j66615j52850j38986j26112j14819j03495r0290p6415
58790F049674o4990n6488m8018l7568k6205j5264m090Q129K0576L2323M3736N5214
$$ plain form
58778 5957029 6023376 6100605 6189436 6290698 6404232 6529880 6668596 6821114 6986591 7164451
58768 7164451 7356647 7566058 7793441 8038175 8301309 8585437 8891954 9220956 9573855
58759 9573855 9953769 10363315 10804329 11279891 11794246 12350127 12948243 13589885 14277908
58750 14277908 15014214 15797961 16626998 17499223 18410856 19353743 20314936 21278376 22226649
58741 22226649 23141429 24002194 24784617 25461721 26008351 26404819 26636681 26693854 26572978
58732 26572978 26280080 25828648 25235247 24518533 23701108 22808635 21865764 20893805 19911402
58723 19911402 18934620 17975800 17044187 16147922 15293812 14485279 13722620 13005383 12332879
58714 12332879 11702856 11112308 10559915 10045573 9567250 9120520 8701508 8308205 7938637
$$ packed form
58778E957029O6347P7229Q8831J01262J13534J25648J38716J52518J65477J77860
58768G164451J92196K09411K27383K44734K63134K84128L06517L29002L52899
58759I573855L79914M09546M41014M75562N14355N55881N98116O41642O88023
58750A4277908P36306P83747Q29037Q72225R11633R42887R61193R63440R48273
58741B2226649R14780Q60765P82423O77104N46630L96468K31862N7173j20876
58732B6572978k92898m51432n93401p16714q17425q92473r42871r71959r82403
58723A9911402r76782r58820r31613q96265q54110q08533p62659p17237o72504
58714A2332879o30023n90548n52393n14342m78323m46730m19012l93303l69568
$$ plain form
58705 7938637 7590144 7261223 6952109 6662763 6391827 6137838 5899740 5676098 5465826
58696 5465826 5269876 5089943 4925063 4771675 4627607 4493855 4371830 4260979 4159891
58687 4159891 4067707 3983575 3906523 3836563 3774224 3718557 3667459 3620239 3577582 3538511 3499870
58676 3499870 3459674 3418636 3377428 3334786 3289488 3241967 3192660 3140895 3086831 3032535 2979607
58665 2979607 2927367 2874674 2821878 2769644 2717476 2664747 2611753 2558625 2504705 2450070 2396044
58654 2396044 2343160 2290364 2237376 2185944 2137414 2090875 2045288 2001732 1961671 1924367 1887918
58643 1887918 1851869 1817157 1784258 1752896 1722986 1694634 1667639 1641744 1616829 1592480 1568275
58632 1568275 1544720 1522656 1501682 1480860 1461107 1444700 1431826 1420007 1407912 1397280 1389803
$$ packed form
58705G938637l48493l28921l09114k89346k70936k53989k38098k23642k10272
58696E465826j95950j79933j64880j53388j44068j33752j22025j10851j01088
58687D159891r2184q4132p7052o9960o2339n5667n1098m7220m2657l9071l8641
58676C499870m0196m1038m1208m2642m5298m7521m9307n1765n4064n4296n2928
58665B979607n2240n2693n2796n2234n2168n2729n2994n3128n3920n4635n4026
58654B396044n2884n2796n2988n1432m8530m6539m5587m3556m0061l7304l6449
58643A887918l6049l4712l2899l1362k9910k8352k6995k5895k4915k4349k4205
58632A568275k3555k2064k0974k0822j9753j6407j2874j1819j2095j0632p477
$$ plain form
58621 1389803 1384571 1380354 1378174 1379453 1383414 1388450 1394433 1401507 1408096 1412484 1415329 1418461 1422107 1425338
58607 1425338 1428324 1432001 1436111 1439646 1442799 1446580 1450838 1454454 1457265 1460112 1463008 1464754 1464520 1462757
58593 1462757 1460498 1458557 1457325 1456739 1456553 1456943 1458389 1460967 1464836 1471565 1483476 1500959 1521933 1544806
58579 1544806 1570289 1599146 1629964 1661068 1693497 1730132 1772479 1819877 1871255 1926075 1983962
58568 1983962 2044962 2110138 2180792 2257235 2339247 2427553 2524063 2630791 2749088 2879560 3022296
58557 3022296 3177544 3346413 3530352 3729882 3944747 4175367 4422833 4686894 4964935
58548 4964935 5253156 5547489 5842864 6132643 6409086 6663216 6884412 7062215 7189381
58539 7189381 7262103 7277701 7234829 7136677 6991377 6807830 6593068 6354506 6101823 5844162
$$ packed form
58621A389803n232m217k180J279L961N036N983P074O589M388K845L132L646L231
58607A425338K986L677M110L535L153L781M258L616K811K847K896J746k34j763
58593A462757k259j941j232n86j86L90J446K578L869O729J1911J7483K0974K2873
58579A544806K5483K8857L0818L1104L2429L6635M2347M7398N1378N4820N7887
58568A983962O1000O5176P0654P6443Q2012Q8306R6510J06728J18297J30472J42736
58557C022296J55248J68869J83939J99530K14865K30620K47466K64061K78041
58548D964935K88221K94333K95375K89779K76443K54130K21196J77803J27166
58539G189381P2722J5598m2872r8152j45300j83547k14762k38562k52683k57661
$$ plain form
58529 5844162 5587039 5333759 5088059 4853289 4630424 4419213 4220565 4036255 3867208
58520 3867208 3713563 3575467 3452399 3342645 3244759 3158579 3083720 3018249 2960058 2908391
58510 2908391 2862923 2822589 2786471 2754527 2726505 2701626 2680204 2663573 2650976 2638444 2622426
58499 2622426 2602746 2580297 2553654 2520015 2478089 2428245 2371375 2309558 2246367 2184448 2123868
58488 2123868 2064430 2008022 1956732 1910264 1867361 1828295 1793675 1762213 1732279 1704790 1682129
58477 1682129 1664724 1650603 1637597 1624186 1609120 1592156 1574459 1556653 1537427 1515629 1492543
58466 1492543 1470258 1448974 1427651 1406022 1384104 1361156 1337232 1314431 1294408 1275858 1256660
58455 1256660 1237197 1219226 1202813 1187102 1173121 1162958 1156554 1151716 1146913 1142036 1137057 1132198
$$ packed form
58529E844162k57123k53280k45700k34770k22865k11211j98648j84310j69047
58520C867208j53645j38096j23068j09754r7886q6180p4859o5471n8191n1667
58510B908391m5468m0334l6118l1944k8022k4879k1422j6631j2597j2532j6018
58499B622426j9680k2449k6643l3639m1926m9844n6870o1817o3191o1919o0580
58488B123868n9438n6408n1290m6468m2903l9066l4620l1462k9934k7489k2661
58477A682129j7405j4121j3006j3411j5066j6964j7697j7806j9226k1798k3086
58466A492543k2285k1284k1323k1629k1918k2948k3924k2801k0023j8550j9198
58455A256660j9463j7971j6413j5711j3981j0163o404m838m803m877m979m859
$$ plain form
58443 1132198 1128834 1128220 1129765 1132269 1135863 1140862 1145994 1150135 1154824 1162600 1173644 1186401 1200667
58430 1200667 1217482 1236627 1256746 1277456 1298873 1319496 1337016 1351092 1363226 1374190 1383475
58419 1383475 1390824 1396336 1399544 1400273 1399756 1399022 1396914 1391675 1383594 1373958 1362255 1346927 1328349 1308709
58405 1308709 1289231 1269482 1249080 1228235 1207066 1186046 1166496 1149212 1133566 1119334 1107874
58394 1107874 1099755 1092954 1085518 1078323 1072904 1068568 1064419 1062413 1064993 1071011 1077257 1082933 1089363 1096452
58380 1096452 1102987 1109793 1119078 1130934 1143636 1157053 1172646 1190280 1207883 1224098 1238728 1251063
58368 1251063 1260325 1267221 1272598 1275522 1275218 1273728 1273598 1274138 1273187 1271428 1271496 1273817 1277041 1281657 1289237
58353 1289237 1298688 1307274 1315173 1325078 1337425 1349901 1361732 1374508 1388397 1401260 1412116 1422141
$$ packed form
58443A132198l364o14J545K504L594M999N132M141M689P776J1044J2757J4266
58430A200667J6815J9145K0119K0710K1417K0623J7520J4076J2134J0964R285
58419A383475P349N512L208P29n17p34k108n239q081r636j1703j5328j8578j9640
58405A308709j9478j9749k0402k0845k1169k1020j9550j7284j5646j4232j1460
58394A107874q119o801p436p195n419m336m149k006K580O018O246N676O430P089
58380A096452O535O806R285J1856J2702J3417J5593J7634J7603J6215J4630J2335
58368A251063R262O896N377K924l04j490j30N40r51j759O8K321L224M616P580
58353A289237R451Q586P899R905J2347J2476J1831J2776J3889J2863J0856J0025
$$ plain form
58341 1422141 1431620 1438999 1443340 1444763 1442253 1434275 1421979 1408923 1397136 1385922 1374423 1362661
58329 1362661 1350314 1337295 1325401 1316669 1310546 1305386 1301886 1301870 1304629 1307961 1311941 1317801 1323846 1326679
58315 1326679 1326251 1325634 1325841 1324938 1322379 1320294 1320112 1321443 1324500 1330211 1337998 1346737 1357523 1372017 1388637
58300 1388637 1404171 1418491 1433735 1449688 1464298 1478013 1492908 1508174 1521383 1533817 1549372
58289 1549372 1568278 1587114 1605036 1624423 1644748 1661255 1670834 1674542 1673610 1667921 1659337 1651677 1646118
58276 1646118 1640787 1635421 1632094 1631005 1630289 1630357 1633784 1640606 1648549 1657950 1671360 1688208 1705341 1722968
58262 1722968 1744385 1769487 1794490 1818631 1845203 1875227 1906096 1937146 1970364 2004830 2036750
58251 2036750 2065992 2096273 2127958 2157106 2182429 2206438 2228854 2246155 2258966 2272471 2288058
$$ packed form
58341A422141R479P379M341J423k510p978j2296j3056j1787j1214j1499j1762
58329A362661j2347j3019j1894q732o123n160l500j6K759L332L980N860O045K833
58315A326679m28o17K07r03k559k085j82J331L057N711P787Q739J0786J4494J6620
58300A388637J5534J4320J5244J5953J4610J3715J4895J5266J3209J2434J5555
58289A549372J8906J8836J7922J9387K0325J6507R579L708r32n689q584p660n559
58276A646118n331n366l327j089p16O8L427O822P943R401J3410J6848J7133J7627
58262A722968K1417K5102K5003K4141K6572L0024L0869L1050L3218L4466L1920
58251B036750K9242L0281L1685K9148K5323K4009K2416J7301J2811J3505J5587
$$ plain form
58240 2288058 2302115 2314717 2331375 2353894 2377545 2400148 2426006 2457682 2491666 2525721 2562978
58229 2562978 2605042 2648212 2690253 2734137 2781780 2831088 2882248 2939449 3003058 3067817 3132234
58218 3132234 3201821 3279295 3359854 3440304 3524640 3615934 3710761 3806476 3906040 4010690 4115813
58207 4115813 4219150 4325138 4436029 4546756 4654098 4762925 4877815 4996310 5116084
58198 5116084 5240928 5374091 5513576 5659533 5818222 5993062 6179774 6375566 6584736
58189 6584736 6810275 7049370 7302594 7577619 7878001 8198533 8537655 8903422 9300353
58180 9300353 9721729 10162477 10628364 11124667 11647606 12195616 12777136 13397910 14052290
58171 14052290 14736356 15457465 16221118 17020884 17851462 18718712 19626405 20567018 21537381
$$ packed form
58240B288058J4057J2602J6658K2519K3651K2603K5858L1676L3984L4055L7257
58229B562978M2064M3170M2041M3884M7643M9308N1160N7201O3609O4759O4417
58218C132234O9587P7474Q0559Q0450Q4336R1294R4827R5715R9564J04650J05123
58207D115813J03337J05988J10891J10727J07342J08827J14890J18495J19774
58198E116084J24844J33163J39485J45957J58689J74840J86712J95792K09170
58189F584736K25539K39095K53224K75025L00382L20532L39122L65767L96931
58180I300353M21376M40748M65887M96303N22939N48010N81520O20774O54380
58171A4052290O84066P21109P63653P99766Q30578Q67250R07693R40613R70363
$$ plain form
58162 21537381 22549734 23615843 24734949 25909597 27157334 28493029 29915925 31428565
58154 31428565 33051512 34804385 36690984 38719774 40919376 43315725 45915168 48730688
58146 48730688 51803897 55181265 58894474 62989695 67552117 72678347 78457417 85011976
58138 85011976 92527964 101211133 111250984 122862905 136314085 151849078 169629320
58131 169629320 189796336 212538956 238063322 266640357 298777851 334988430 374675396
58124 374675396 414820615 450023272 474468131 484450940 479540702 461930025 435069825
58117 435069825 402637836 367938211 333478021 300786886 270608369 243246441 218762099
58110 218762099 197029480 177824043 160932015 146161763 133294154 122098063 112392096
$$ packed form
58162B1537381J012353J066109J119106J174648J247737J335695J422896J512640
58154C1428565J622947J752873J886599K028790K199602K396349K599443K815520
58146D8730688L073209L377368L713209M095221M562422N126230N779070O554559
58138H5011976P515988Q683169J0039851J1611921J3451180J5534993J7780242
58131A69629320K0167016K2742620K5524366K8577035L2137494L6210579L9686966
58124C74675396M0145219L5202657K4444859R982809m910238j7610677k6860200
58117D35069825l2431989l4699625l4460190l2691135l0178517k7361928k4484342
58110B18762099k1732619j9205437j6892028j4770252j2867609j1196091r705967
$$ plain form
58103 112392096 104042522 96912402 90864724 85809892 81699739 78473191 76050509 74377921
58095 74377921 73427513 73153379 73517259 74582980 76492080 79214756 82280692 84813155
58087 84813155 85912589 85080034 82353947 78141183 72970080 67343495 61681021 56277797
58079 56277797 51283482 46738735 42641584 38979603 35722908 32825394 30246378 27958018
58071 27958018 25929532 24121376 22500835 21049277 19748335 18572004 17498558 16518112
58063 16518112 15621776 14794236 14023484 13307226 12642328 12017019 11420441 10851577 10312395
58054 10312395 9800314 9313741 8857014 8432990 8037337 7665593 7318553 6995061 6687150
58045 6687150 6388814 6102938 5833603 5578319 5334074 5104231 4892432 4695387 4508320
$$ packed form
58103A12392096q349574p130120o047678n054832m110153l226548k422682j672588
58095G4377921r50408k74134L63880J065721J909100K722676L065936K532463
58087H4813155J099434q32555k726087m212764n171103n626585n662474n403224
58079E6277797m994315m544747m097151l661981l256695k897514k579016k288360
58071B7958018k028486j808156j620541j451558j300942j176331j073446r80446
58063A6518112q96336q27540p70752p16258o64898o25309n96578n68864n39182
58054A0312395n12081m86573m56727m24024l95653l71744l47040l23492l07911
58045F687150k98336k85876k69335k55284k44245k29843k11799j97045j87067
$$ plain form
58036 4508320 4332333 4170063 4019046 3875561 3740379 3614745 3495165 3378088 3265702
58027 3265702 3161460 3063601 2968077 2874103 2782162 2690689 2599466 2512248 2431369 2353760 2276607
58016 2276607 2202579 2135064 2072714 2013290 1958284 1908843 1861664 1814144 1769357 1730790 1696223
58005 1696223 1661934 1628770 1598699 1569427 1538251 1507743 1481914 1459834 1438409 1418206 1400935
57994 1400935 1384213 1364754 1344347 1327189 1313366 1300073 1286921 1274839 1261891 1245555 1227550
57983 1227550 1211497 1197392 1182925 1168526 1156456 1146509 1136965 1128161 1120898 1113206 1103192 1093373
57971 1093373 1087655 1085346 1082418 1077354 1071614 1065767 1059336 1053313 1048884 1044805 1039560 1034622 1032048 1030580
57957 1030580 1027802 1024280 1021657 1018628 1013163 1007072 1003876 1003388 1002711 1001369 1001066 1001405 1000267 997829 996067
$$ packed form
58036D508320j75987j62270j51017j43485j35182j25634j19580j17077j12386
58027C265702j04242r7859r5524r3974r1941r1473r1223q7218q0879p7609p7153
58016B276607p4028o7515o2350n9424n5006m9441m7179m7520m4787l8567l4567
58005A696223l4289l3164l0071k9272l1176l0508k5829k2080k1425k0203j7271
57994A400935j6722j9459k0407j7158j3823j3293j3152j2082j2948j6336j8005
57983A227550j6053j4105j4467j4399j2070r947r544q804p263p692j0014r819
57971A093373n718k309k928n064n740n847o431o023m429m079n245m938k574j468
57957A030580k778l522k623l029n465o091l196m88o77j342l03L39j138k438j762
$$ plain form
57942 996067 994853 992432 989163 987005 985895 984279 982485 981748 980537 975783 967312 957446 946689 933575
57928 933575 918477 903936 891361 880836 873785 872096 874555 877532 879384 881189 883412 885128 886487
57915 886487 888703 891490 893486 895203 898473 902812 905294 904284 900696 895641 889700 884656 882908 884373
57901 884373 886186 886038 884000 881074 877884 874803 871528 866635 859170 850259 841637 833393 824807 816243
57887 816243 808195 799742 790317 781867 776809 774914 774678 776368 780838 786534 790899 793973 797533 801429
57873 801429 803855 804497 804188 802018 796121 787006 776950 766401 754060 740104 725943 711061 693596
57860 693596 674304 656708 643018 632794 625603 621707 619905 618080 616515 617645 621886 626649 630151
57847 630151 633343 637358 641909 647218 654889 665613 677893 689792 700253 708609 714957 721085 728597
$$ packed form
57942I96067j214k421l269k158j110j616j794p37j211m754q471r866j0757j3114
57928I33575j5098j4541j2575j0525p051j689K459K977J852J805K223J716J359
57915H86487K216K787J996J717L270M339K482j010l588n055n941n044j748J465
57901H84373J813j48k038k926l190l081l275m893p465q911q622q244q586q564
57887H16243q048q453r425q450n058j895k36J690M470N696M365L074L560L896
57873H01429K426O42l09k170n897r115j0056j0549j2341j3956j4161j4882j7465
57860F93596j9292j7596j3690j0224p191l896j802j825j565J130M241M763L502
57847F30151L192M015M551N309P671J0724J2280J1899J0461Q356O348O128P512
$$ plain form
57834 728597 736012 740335 741611 743049 746221 749241 750485 750969 751627 750991 747440 741823 736125 730861 724984
57819 724984 717295 707235 695496 684266 675614 669354 663760 658202 653427 649528 645807 642649 641375
57806 641375 642094 643792 646628 651859 659347 667534 676008 685577 695482 703317 708433 712859 718008 722970
57792 722970 726961 730934 735449 739091 740346 739313 736529 731878 725695 719326 713626 708374 703631 699910
57778 699910 696511 691662 684952 677706 670484 662455 653897 646927 642616 639436 635616 631045 625885 619520
57764 619520 612115 605118 598742 590726 579051 564441 549055 534280 520810 509074 498309 486828
57752 486828 474420 463004 453893 446073 438256 430849 424676 419480 415105 412591 412604 414075 415569 416752
57738 416752 417718 418554 420565 426028 435308 445886 455507 464501 473693 482096 488583 494051 499806 505380
$$ packed form
57834G28597P415M323J276J438L172L020J244M84O58o36l551n617n698n264n877
57819G24984p689j0060j1739j1230q652o260n594n558m775l899l721l158j274
57806F41375P19J698K836N231P488Q187Q474R569R905P835N116M426N149M962
57792G22970L991L973M515L642J255j033k784m651o183o369n700n252m743l721
57778F99910l399m849o710p246p222q029q558o970m311l180l820m571n160o365
57764F19520p405o997o376q016j1675j4610j5386j4775j3470j1736j0765j1481
57752D86828j2408j1416r111p820p817p407o173n196m375k514J3J471J494J183
57738D16752R66Q36K011N463R280J0578R621Q994R192Q403O487N468N755N574
$$ plain form
57724 505380 510125 515548 523555 533149 541269 546469 549736 551980 552696 551215 547794 543175 537978 532452
57710 532452 526273 519076 511687 505822 501887 498172 493185 487540 482521 478131 474086 471469 471635 474214
57696 474214 477769 481668 485769 489176 491143 492640 495191 498504 501059 502736 505053 508735 512839 516601
57682 516601 520567 525364 530640 535900 541537 548323 556327 564802 573005 580977 589581 599581 610541 621020
57668 621020 630163 638663 647906 658654 670831 683991 697470 710684 723732 737298 751668 766585
57656 766585 782371 800265 821013 843905 867780 892179 917003 941953 967074 992961 1019775
57645 1019775 1047094 1075570 1107556 1144753 1186037 1228917 1272576 1318313 1367622 1421222 1479543
57634 1479543 1542678 1609728 1679310 1750990 1825628 1904581 1989395 2082146 2185144 2300008 2427433
$$ packed form
57724E05380M745N423Q007R594Q120N200L267K244P16j481l421m619n197n526
57710E32452o179p197p389n865l935l715m987n645n019m390m045k617J66K579
57696D74214L555L899M101L407J967J497K551L313K555J677K317L682M104L762
57682E16601L966M797N276N260N637O786Q004Q475Q203P972Q604J0000J0960J0479
57668F21020R143Q500R243J0748J2177J3160J3479J3214J3048J3566J4370J4917
57656G66585J5786J7894K0748K2892K3875K4399K4824K4950K5121K5887K6814
57645A019775K7319K8476L1986L7197M1284M2880M3659M5737M9309N3600N8321
57634A479543O3135O7050O9582P1680P4638P8953Q4814R2751J02998J14864J27425
$$ plain form
57623 2427433 2567860 2722185 2891945 3078884 3283810 3505579 3741640 3989625 4247644
57614 4247644 4512827 4780420 5044484 5298288 5533815 5742748 5919286 6061008 6165830
57605 6165830 6229060 6244530 6207653 6116554 5972089 5779274 5548329 5292243 5022849 4749750
57595 4749750 4481618 4225937 3987154 3766736 3565388 3383917 3221984 3077789 2949712
57586 2949712 2837122 2739185 2654127 2580306 2517016 2463601 2418754 2381522 2352310 2332022 2320481
57575 2320481 2316364 2318537 2326859 2341766 2363605 2392650 2429486 2474919 2529346 2592482 2664209 2745608
57563 2745608 2838610 2944435 3062901 3193366 3335744 3490142 3655920 3831385 4013773 4199061
57553 4199061 4382224 4558048 4721133 4864784 4980859 5061877 5103295 5103549 5062762 4982462 4866252
$$ packed form
57623B427433J40427J54325J69760J86939K04926K21769K36061K47985K58019
57614D247644K65183K67593K64064K53804K35527K08933J76538J41722J04822
57605F165830O3230J5470l6877r1099j44465j92815k30945k56086k69394k73099
57595D749750k68132k55681k38783k20418k01348j81471j61933j44195j28077
57586B949712j12590r7937q5058p3821o3290n3415m4847l7232k9212k0288j1541
57575B320481m117K173Q322J4907K1839K9045L6836M5433N4427O3136P1727Q1399
57563B745608R3002J05825J18466J30465J42378J54398J65778J75465J82388J85288
57553D199061J83163J75824J63085J43651J16075Q1018M1418K54m0787q0300j16210
$$ plain form
57542 4866252 4719666 4549083 4360990 4161812 3957520 3753059 3552312 3358389 3173593
57533 3173593 2999256 2835848 2683216 2540859 2408518 2286561 2175206 2073386 1979199 1891612
57523 1891612 1810785 1736496 1667552 1603234 1544089 1490484 1441501 1396193 1354812 1317672 1283813
57512 1283813 1252105 1222834 1196773 1173294 1150880 1129188 1109317 1092182 1077697 1065248 1054046
57501 1054046 1043406 1033642 1026218 1021968 1019737 1017931 1016820 1018023 1022277 1029184 1038647 1050801 1064594
57488 1064594 1078123 1090683 1103415 1117943 1135451 1156741 1181714 1208958 1237336 1267898 1302734
57477 1302734 1342194 1385135 1431873 1484653 1544655 1610561 1681102 1757233 1840722 1932159 2031633
57466 2031633 2140019 2258061 2384941 2518968 2658961 2803868 2951666 3099605 3244863
$$ packed form
57542D866252j46586j70583j88093j99178k04292k04461k00747j93923j84796
57533C173593j74337j63408j52632j42357j32341j21957j11355j01820r4187q7587
57523A891612q0827p4289o8944o4318n9145n3605m8983m5308m1381l7140l3859
57512A283813l1708k9271k6061k3479k2414k1692j9871j7135j4485j2449j1202
57501A054046j0640r764p424m250k231j806j111J203M254O907R463J2154J3793
57488A064594J3529J2560J2732J4528J7508K1290K4973K7244K8378L0562L4836
57477A302734L9460M2941M6738N2780O0002O5906P0541P6131Q3489R1437R9474
57466B031633J08386J18042J26880J34027J39993J44907J47798J47939J45258
$$ plain form
57457 3244863 3383762 3510752 3619255 3703656 3760239 3786904 3782837 3748305 3684422 3593678 3480978
57446 3480978 3353246 3217067 3076964 2936009 2796936 2661840 2531944 2408812 2294978
57437 2294978 2192029 2098788 2012866 1933584 1861917 1797954 1740331 1688485 1643734 1607197 1577747
57426 1577747 1552895 1531009 1512030 1496752 1486243 1481543 1483032 1490085 1501719 1517480 1537500 1562141
57414 1562141 1592104 1628560 1672417 1723389 1780309 1842560 1910940 1987068 2072272 2167076 2271217
57403 2271217 2383693 2502943 2627536 2756740 2889965 3025176 3157867 3281785 3390722
57394 3390722 3479503 3543579 3578447 3580405 3548316 3484580 3394039 3281646 3151156 3005999 2850876
57383 2850876 2691664 2533348 2378511 2228275 2084235 1948518 1822013 1703695 1592364
$$ packed form
57457C244863J38899J26990J08503Q4401N6583K6665m067l4532o3883r0744j12700
57446C480978j27732j36179j40103j40955j39073j35096j29896j23132j13834
57437B294978j02949r3241q5922p9282p1667o3963n7623n1846m4751l6537k9450
57426A577747k4852k1886j8979j5278j0509m700J489P053J1634J5761K0020K4641
57414A562141K9963L6456M3857N0972N6920O2251O8380P6128Q5204R4804J04141
57403B271217J12476J19250J24593J29204J33225J35211J32691J23918J08937
57394C390722Q8781O4076L4868J958l2089o3736r0541j12393j30490j45157j55123
57383B850876j59212j58316j54837j50236j44040j35717j26505j18318j11331
$$ plain form
57374 1592364 1488462 1393433 1307749 1230362 1159920 1095567 1036407 981105 928677 879268 833629
57363 833629 792021 753926 718620 685642 654861 626478 600752 577385 555315 533566 512223
57352 512223 492101 473507 455882 438654 421875 405771 390257 375255 361022 347726 335044
57341 335044 322688 311058 300887 292384 285195 279064 273988 269785 265960 262127 258265 254527 251051
57328 251051 247882 244731 240978 236389 231823 228702 227582 227567 227217 225672 222856 219140 215048 210973 206882
57313 206882 202429 197457 192102 186400 180351 174560 170202 167722 165795 162368 156868 150890 146357 143322
57299 143322 139998 134819 127986 120831 114309 108706 104564 102871 103879 106311 108288 108834 108128 106694 104895
57284 104895 103004 101238 99783 99092 99805 101847 104030 105368 106563 109189 113346 117128 118803 118705 118465
$$ packed form
57374A592364j03902r5029q5684p7387p0442o4353n9160n5302n2428m9409m5639
57363H33629m1608l8095l5306l2978l0781k8383k5726k3367k2070k1749k1343
57352E12223k0122j8594j7625j7228j6779j6104j5514j5002j4233j3296j2682
57341C35044j2356j1630j0171q503p189o131n076m203l825l833l862l738l476
57328B51051l169l151l753m589m566l121j120j5l50j545k816l716m092m075m091
57313B06882m453m972n355n702o049n791m358k480j927l427n500n978m533l035
57299A43322l324n179o833p155o522n603m142j693J008K432J977N46p06j434j799
57284A04895j891j766j455o91P13K042K183J338J195K626M157L782J675r8k40
$$ plain form
57269 118465 119013 119950 120472 120306 119896 120124 121723 124661 128175 131669 135387 140036 145872 152439 159142 165858
57253 165858 172959 180845 189563 198891 208654 218653 228324 237013 245043 254121 266056 281110 298105
57240 298105 316014 334783 354454 374152 392481 408767 423581 438120 453295 469517 487187
57229 487187 507054 529763 555203 582732 611991 643042 675759 709841 745478 783057 821752
57218 821752 859358 894323 927261 959656 991665 1022003 1049336 1072765 1091356 1104262 1111181 1112050
57206 1112050 1106766 1095908 1081071 1063448 1042574 1017584 989273 959744 930488 902003 874926
57195 874926 850204 828269 809162 793126 779895 767976 756172 745514 738072 734100 732020 731073
57183 731073 732109 735561 740404 745554 750886 756629 763197 771815 783860 799303 817073 836834 858798
$$ packed form
57269A18465N48R37N22j66m10K28J599K938L514L494L718M649N836O567O703O716
57253A65858P101P886Q718R328R763R999R671Q689Q030R078J1935J5054J6995
57240B98105J7909J8769J9671J9698J8329J6286J4814J4539J5175J6222J7670
57229D87187J9867K2709K5440K7529K9259L1051L2717L4082L5637L7579L8695
57218H21752L7606L4965L2938L2395L2009L0338K7333K3429J8591J2906O919Q69
57206A112050n284j0858j4837j7623k0874k4990k8311k9529k9256k8485k7077
57195H74926k4722k1935j9107j6036j3231j1919j1804j0658p442l972k080r47
57183G31073J036L452M843N150N332N743O568Q618J2045J5443J7770J9761K1964
$$ plain form
57170 858798 882032 905083 928453 954220 982674 1011464 1038817 1065543 1092959 1120812 1148446
57159 1148446 1176322 1205160 1235003 1266103 1299373 1335054 1372254 1410558 1450656 1492692 1535724
57148 1535724 1579743 1626457 1676945 1730052 1784181 1839186 1895471 1952730 2010710 2069658 2128974
57137 2128974 2186979 2243257 2299670 2357873 2417299 2476830 2536794 2597707 2658450 2717239 2773397
57126 2773397 2826906 2877405 2925024 2971188 3017356 3063693 3109771 3155480 3200439 3243593 3284119
57115 3284119 3321668 3355672 3386067 3414873 3444783 3475660 3504858 3531742 3559118 3589076 3620312
57104 3620312 3651148 3682400 3715193 3748497 3781085 3813710 3847070 3879544 3909130 3935736 3959523
57093 3959523 3979014 3993237 4004095 4014521 4025788 4038245 4052617 4068514 4083530 4095724 4105162
$$ packed form
57170H58798K3234K3051K3370K5767K8454K8790K7353K6726K7416K7853K7634
57159A148446K7876K8838K9843L1100L3270L5681L7200L8304M0098M2036M3032
57148A535724M4019M6714N0488N3107N4129N5005N6285N7259N7980N8948N9316
57137B128974N8005N6278N6413N8203N9426N9531N9964O0913O0743N8789N6158
57126B773397N3509N0499M7619M6164M6168M6337M6078M5709M4959M3154M0526
57115C284119L7549L4004L0395K8806K9910L0877K9198K6884K7376K9958L1236
57104C620312L0836L1252L2793L3304L2588L2625L3360L2474K9586K6606K3787
57093C959523J9491J4223J0858J0426J1267J2457J4372J5897J5016J2194R438
$$ plain form
57082 4105162 4111341 4111375 4102539 4084278 4055910 4014994 3960245 3893526 3816801 3729680 3632107 3526564
57070 3526564 3415188 3297446 3172917 3043273 2908912 2766610 2612790 2445651 2261728
57061 2261728 2054481 1819534 1557581 1269023 949745 595511 206236 -217710 -679148
57052 -679148 -1180417 -1721097 -2303552 -2936318 -3628238 -4384443 -5211877 -6122411 -7125431
57043 -7125431 -8223226 -9417937 -10715533 -12117272 -13614622 -15198328 -16865074 -18611901
57035 -18611901 -20437618 -22360377 -24426814 -26699078 -29241551 -32114941 -35356491 -38963568
57027 -38963568 -42931559 -47305083 -52115035 -57231709 -62410493 -67671078 -73637333 -81282513
57019 -81282513 -91113047 -102542379 -114093528 -124212333 -131926080 -136921414 -139261830 -139137853
$$ packed form
57082D105162O179L4q836j8261k8368m0916n4749o6719p6725q7121r7573j05543
57070C526564j11376j17742j24529j29644j34361j42302j53820j67139j83923
57061B261728k07247k34947k61953k88558l19278l54234B06236b17710m61438
57052f79148n01269n40680n82455o32766o91920p56205q27434r10534j003020
57043g125431j097795j194711j297596j401739j497350j583706j666746j746827
57035a8611901j825717j922759k066437k272264k542473k873390l241550l607077
57027c8963568l967991m373524m809952n116674n178784n260585n966255p645180
57019h1282513r830534j1429332j1551149j0118805p713747m995334k340416J23977
$$ plain form
57011 -139137853 -136772099 -132405850 -126328612 -118937004 -110745738 -102291193 -93993229 -86088588
57003 -86088588 -78656520 -71675518 -65072137 -58765033 -52699432 -46857423 -41251950 -35921279
56995 -35921279 -30919015 -26291336 -22058305 -18217489 -14757319 -11659446 -8895722 -6434996
56987 -6434996 -4252496 -2327194 -634081 853948 2159577 3302386 4303150 5180377 5945212
56978 5945212 6605419 7171972 7656837 8067587 8409985 8693533 8929273 9124301 9283358
56969 9283358 9413682 9523209 9615324 9689497 9745707 9784995 9808055 9817223 9817839 9813868 9803844 9784414
56957 9784414 9755727 9720090 9677791 9627924 9571063 9507071 9431910 9340087 9228970 9098254 8948074
56946 8948074 8781650 8607824 8436908 8275066 8125630 7993643 7884686 7799948 7736081 7689993
$$ packed form
57011a39137853K365754M366249O077238P391608Q191266Q454545Q297964P904641
57003h6088588P432068O981002O603381O307104O065601N842009N605473N330671
56995c5921279N002264M627679M233031L840816L460170L097873K763724K460726
56987f434996K182500J925302f34081H53948J305629J142809J000764Q77227P64835
56978E945212O60207N66553M84865M10750L42398K83548K35740J95028J59057
56969I283358J30324J09527R2115P4173N6210L9288K3060R168O16l971j0024j9430
56957I784414k8687l5637m2299m9867n6861o3992p5161r1823j11117j30716j50180
56946H948074j66424j73826j70916j61842j49436j31987j08957q4738o3867m6088
$$ plain form
56936 7689993 7661397 7650360 7651957 7649733 7612689 7504136 7300763 7005151 6639695 6231499 5804493
56925 5804493 5379269 4971398 4588515 4232901 3906971 3613231 3349979 3111262 2891393
56916 2891393 2687164 2496699 2319557 2157317 2010901 1877711 1754126 1639862 1536710
56907 1536710 1443879 1358201 1278615 1206986 1144394 1089746 1042367 1003122 972550 950129 935388
56896 935388 927377 922908 917460 907965 893092 871554 842535 807571 769687 730752 691479 653365
56884 653365 618327 586774 558233 533508 514048 499524 488322 480243 476725 478656 485867 498313
56872 498313 515714 536503 558985 582693 606501 626353 637519 638609 631023 615313 591082 560048
56860 560048 526091 492029 458835 427791 400455 376239 352846 329640 308248 289579 272839
$$ packed form
56936G689993k8596j1037J597k224l7044j08553k03373k95612l65456m08196m27006
56925E804493m25224m07871l82883l55614l25930k93740k63252k38717k19869
56916B891393k04229j90465j77142j62240j46416j33190j23585j14264j03152
56907A536710r2831q5678p9586p1629o2592n4648m7379l9245l0572k2421j4741
56896I35388q011m469n448r495j4873k1538k9019l4964l7884l8935l9273l8114
56884F53365l5038l1553k8541k4725j9460j4524j1202q079l518J931P211J2446
56872D98313J7401K0789K2482K3708K3808J9852J1166J090p586j5710k4231l1034
56860E60048l3957l4062l3194l1044k7336k4216k3393k3206k1392j8669j6740
$$ plain form
56849 272839 257920 246069 237411 230191 223353 217723 213809 210533 207271 205406 206790 211874 220057 230649
56835 230649 242968 256562 271669 288553 306699 325994 348112 374804 405051 435959 466426
56824 466426 497716 530179 561581 589122 611152 626497 634290 635382 632288 626971 619993 612120 605084
56811 605084 600175 597580 597614 601231 608878 620217 635367 655178 680057 709754 744361 784245 828946
56798 828946 877150 926988 974602 1013215 1036384 1042612 1034973 1016557 988815 954315 918001 884395
56786 884395 855473 831874 814085 801743 794118 792357 799303 816171 841262 872909 911749 959232
56774 959232 1015798 1081257 1154438 1230713 1301579 1358522 1396448 1412937 1406626 1378403 1332891 1276652
56762 1276652 1215122 1151977 1090278 1032823 981806 938782 904407 878088 859032 847924 846274
$$ packed form
56849B72839j4919j1851q658p220o838n630l914l276l262j865J384N084Q183J0592
56835B30649J2319J3594J5107J6884J8146J9295K2118K6692L0247L0908L0467
56824D66426L1290L2463L1402K7541K2030J5345P793J092l094n317o978p873p036
56811F05084m909k595L4L617P647J1339J5150J9811K4879K9697L4607L9884M4701
56798H28946M8204M9838M7614L8613K3169O228p639j8416k7742l4500l6314l3606
56786H84395k8922k3599j7789j2342p625j761O946J6868K5091L1647L8840M7483
56774I59232N6566O5459P3181P6275P0866N6943L7926J6489o311k8223m5512n6239
56762A276652o1530o3145o1699n7455n1017m3024l4375k6319j9056j1108j650
$$ plain form
56751 846274 854063 869747 892766 923836 962017 1003648 1045162 1084712 1119640 1144531 1153932 1146053
56739 1146053 1122624 1086626 1041689 992232 942189 893908 848863 808259 772219 740200 713348
56728 713348 694604 684987 681589 681057 683474 690847 703307 719148 737387 757588 777556 793563 802938
56715 802938 804775 798462 783428 760449 731663 699204 664946 631239 600289 572589 547113 523168
56703 523168 501064 481063 462715 445467 429252 414409 401408 390425 380878 371880 363544 357037
56691 357037 352755 349233 344677 338870 332850 327457 323070 320005 318181 316897 315740 315167 315509 316064 315844
56676 315844 314514 312044 308416 304328 301005 298422 294889 289498 283804 279820 277416 275088 272351 269848
56662 269848 267910 266540 266206 267146 268423 269037 269416 270534 272128 273211 273715 274164 274274 273454 272212 271494
$$ packed form
56751H46274P789J5684K3019L1070L8181M1631M1514L9550L4928K4891R401p879
56739A146053k3429l5998m4937m9457n0043m8281m5045m0604l6040l2019k6852
56728G13348j8744r617l398n32K417P373J2460J5841J8239K0201J9968J6007R375
56715H02938J837o313j5034k2979k8786l2459l4258l3707l0950k7700k5476k3945
56703E23168k2104k0001j8348j7248j6215j4843j3001j0983r547q998q336o507
56691C57037m282l522m556n807o020n393m387l065j824j284j157n73L42N55k20
56676C15844j330k470l628m088l323k583l533n391n694l984k404k328k737k503
56662B69848j938j370l34R40J277O14L79J118J594J083N04M49J10q20j242p18
$$ plain form
56646 271494 271016 269884 268505 268134 268662 268597 267314 265676 264213 262307 259557 256501 253498 250168 246491
56631 246491 243307 241021 238751 235564 231967 229417 228524 228297 227302 225370 223839 223843 224799 225354 225632 227246
56615 227246 230769 234691 237699 240620 244775 249559 253212 255266 256751 258473 260491 262889 265588 267707
56601 267707 268476 268603 269516 271441 273393 274787 275818 276450 276331 275671 275071 274612 274044 273665 273899 274273 273924
56584 273924 272949 272190 271944 271976 272441 273590 274768 274852 273438 270580 265895 259389 252731 248053 245404 242831
56568 242831 239032 234557 230418 226990 224488 223132 222399 221262 219473 217700 216263 214800 213381 212833 213588
56553 213588 215011 216164 216657 216679 216721 217155 217711 217784 217725 219030 222407 226538 229816 232416 235388 238619 241233
56536 241233 243219 245052 246419 247118 248478 251932 256714 260962 264430 267885 270541 270987 270457 272105 276492
$$ packed form
56646B71494m78j132j379l71N28o5j283j638j463j906k750l056l003l330l677
56631B46491l184k286k270l187l597k550q93k27r95j932j531MR56N55K78J614
56615B27246L523L922L008K921M155M784L653K054J485J722K018K398K699K119
56601B67707P69J27R13J925J952J394J031O32j19o60o00m59n68l79K34L74l49
56584B73924r75p59k46L2M65J149J178Q4j414k858m685o506o658m678k649k573
56568B42831l799m475m139l428k502j356p33j137j789j773j437j463j419n48P55
56553B13588J423J153M93K2M2M34N56P3n9J305L377M131L278K600K972L231K614
56536B41233J986J833J367O99J360L454M782M248L468L455K656M46n30J648M387
$$ plain form
56521 276492 280577 281991 281732 281663 281891 281996 282637 284375 286442 287971 289079 289857 289980 290315 293090 299152
56505 299152 306523 312918 318284 323815 330049 337160 345630 355105 363903 371063 377729 385132 392391 397829
56491 397829 401514 405009 409287 414123 418843 422538 424321 424477 424672 426066 428013 429434 430342 430938 430406
56476 430406 428069 424840 422043 419509 416292 412631 409649 407417 404739 400892 396473 392535 389656 387787
56462 387787 386391 384947 383682 383296 383597 383325 381988 380857 381158 382052 381610 379279 376185 373347 370689 367735
56446 367735 364359 360801 357474 354863 353349 353253 354790 357301 358700 356996 352745 348777 346960 346495 346044
56431 346044 345939 347016 348589 349228 348794 348150 347403 345936 343926 342411 341869 341794 341667 341485 341385 341531 342266
56414 342266 343773 345695 347638 349790 352508 355636 358802 362151 366238 371337 377163 383052 388369 393176
$$ packed form
56521B76492M085J414k59o9K28J05O41J738K067J529J108P78J23L35K775O062
56505B99152P371O395N366N531O234P111Q470R475Q798P160O666P403P259N438
56491C97829L685L495M278M836M720L695J783J56J95J394J947J421R08N96n32
56476D30406k337l229k797k534l217l661k982k232k678l847m419l938k879j869
56462C87787j396j444j265l86L01k72j337j131L01Q94m42k331l094k838k658k954
56446C67735l376l558l327k611j514r6J537K511J399j704m251l968j817m65m51
56431C46044j05J077J573O39m34o44p47j467k010j515n42p5j27j82j00J46P35
56414C42266J507J922J943K152K718L128L166L349M087N099N826N889N317M807
$$ plain form
56400 393176 398465 405059 412250 418382 422815 426277 429213 431178 432159 433059 434287 435251 435839 436857 438260
56385 438260 438621 437491 436680 437757 439696 440560 440304 440158 440214 439512 437941 436373 435231 434342 433860 434035 434372
56368 434372 434179 433623 433178 432521 430966 428595 425990 423374 420849 418729 416826 414270 411045 408682 408182
56353 408182 408207 406687 403375 399454 395572 391826 388857 387227 386231 384859 383343 382220 380616 377339 373141
56338 373141 370044 368709 368184 367857 367844 367731 367002 366666 368417 371905 374738 375683 376081 377519 379695 381524
56322 381524 383076 385244 388198 391145 393522 395939 399773 405665 412364 417561 420197 421315 422262 423036 423248
56307 423248 423682 425591 428962 432713 436248 439852 443897 448562 453893 459276 463487 466079 468015 470160
56293 470160 472065 473186 474071 475155 475646 475187 475440 478102 482262 485619 487678 489859 493058 497063 501864
$$ packed form
56400C93176N289O594P191O132M433L462K936J965R81R00J228R64N88J018J403
56385D38260L61j130q11J077J939Q64k56j46N6p02j571j568j142q89m82J75L37
56368D34372j93n56m45o57j555k371k605k616k525k120j903k556l225k363n00
56353D08182K5j520l312l921l882l746k969j630r96j372j516j123j604l277m198
56338C73141l097j335n25l27j3j13p29l36J751L488K833R45L98J438K176J829
56322C81524J552K168K954K947K377K417L834N892O699N197K636J118R47P74K12
56307D23248M34J909L371L751L535L604M045M665N331N383M211K592J936K145
56293D70160J905J121Q85J084M91m59K53K662M160L357K059K181L199M005M801
$$ plain form
56278 501864 507645 513746 519338 524704 530317 535374 539082 542593 547554 553418 558505 563238 569804 578817
56264 578817 588812 598975 609913 621486 632421 642586 653488 665894 678848 691470 703978 716635
56252 716635 729510 743505 759586 776642 792059 804875 816493 827866 837964 845625 851089 855102
56240 855102 858173 861268 865545 870786 875671 880056 885316 891925 898383 903336 907400 912313 919351 928830
56226 928830 939957 951150 961873 974010 989892 1009286 1030130 1051802 1075361 1100827 1127063
56215 1127063 1154741 1186632 1223924 1264660 1306945 1351526 1400007 1452571 1508957 1570152 1637639
56204 1637639 1711969 1793007 1880655 1974859 2076012 2185689 2305696 2436153 2575824 2724441
56194 2724441 2883148 3052642 3232524 3422251 3620584 3824009 4027921 4229566 4427580
$$ packed form
56278E01864N781O101N592N366N613N057L708L511M961N864N087M733O566R013
56264E78817R995J0163J0938J1573J0935J0165J0902J2406J2954J2622J2508J2657
56252G16635J2875J3995J6081J7056J5417J2816J1618J1373J0098P661N464M013
56240H55102L071L095M277N241M885M385N260O609O458M953M064M913P038R479
56226I28830J1127J1193J0723J2137J5882J9394K0844K1672K3559K5466K6236
56215A127063K7678L1891L7292M0736M2285M4581M8481N2564N6386O1195O7487
56204A637639P4330Q1038Q7648R4204J01153J09677J20007J30457J39671J48617
56194B724441J58707J69494J79882J89727J98333K03425K03912K01645J98014
$$ plain form
56185 4427580 4618456 4796180 4956028 5096189 5214920 5308893 5375676 5415629 5430125 5420112
56175 5420112 5387759 5337407 5273173 5196954 5109831 5013883 4911608 4805004 4695985 4586053
56165 4586053 4474860 4360781 4243592 4124947 4005754 3885091 3762276 3638044 3513084
56156 3513084 3387419 3261816 3137787 3015709 2895069 2776828 2663067 2553922 2447599
56147 2447599 2343957 2245245 2152607 2064984 1982287 1906398 1837750 1774129 1714303 1659635 1610632
56136 1610632 1565292 1522806 1485458 1454375 1426416 1397994 1369462 1343144 1319519 1298111 1279893
56125 1279893 1265813 1254541 1244215 1235031 1227961 1222480 1217701 1214266 1213102 1213708 1215429 1218870 1224474
56112 1224474 1231306 1238715 1247378 1257486 1268021 1279217 1293296 1311204 1331085 1351604 1373963 1398647
$$ packed form
56185D427580J90876J77724J59848J40161J18731R3973O6783L9953J4496j0013
56175E420112l2353n0352o4234p6219q7123r5948j02275j06604j09019j09932
56165D586053j11193j14079j17189j18645j19193j20663j22815j24232j24960
56156C513084j25665j25603j24029j22078j20640j18241j13761j09145j06323
56147B447599j03642r8712r2638q7623q2697p5889o8648o3621n9826n4668m9003
56136A610632m5340m2486l7348l1083k7959k8422k8532k6318k3625k1408j8218
56125A279893j4080j1272j0326r184p070n481m779l435j164O06J721L441N604
56112A224474O832P409Q663J0108J0535J1196J4079J7908J9881K0519K2359K4684
$$ plain form
56100 1398647 1422997 1444520 1464235 1484296 1504506 1523528 1541490 1559067 1575930 1592102 1608937
56089 1608937 1627190 1646476 1668171 1695823 1730728 1770151 1812140 1858957 1913364 1974942 2042816
56078 2042816 2118732 2204386 2298982 2402744 2519548 2652405 2799225 2956749 3125640 3307410
56068 3307410 3498662 3692429 3883223 4067213 4240066 4399151 4546251 4684334 4813063
56059 4813063 4930253 5034721 5123553 5189286 5224763 5229646 5208716 5166061 5104873 5030137 4945972
56048 4945972 4851255 4742057 4617238 4477970 4324084 4155891 3978488 3799681 3624432 3455048
56038 3455048 3295167 3149039 3017763 2900228 2796625 2707334 2629841 2560715 2499283 2445744
56028 2445744 2397635 2352242 2310549 2274441 2242007 2210138 2179940 2154774 2134487 2116278 2099688
$$ packed form
56100A398647K4350K1523J9715K0061K0210J9022J7962J7577J6863J6172J6835
56089A608937J8253J9286K1695K7652L4905L9423M1989M6817N4407O1578O7874
56078B042816P5916Q5654R4596J03762J16804J32857J46820J57524J68891J81770
56068C307410J91252J93767J90794J83990J72853J59085J47100J38083J28729
56059D813063J17190J04468Q8832O5733L5477M883k0930m2655o1188p4736q4165
56048D945972r4717j09198j24819j39268j53886j68193j77403j78807j75249j69384
56038C455048j59881j46128j31276j17535j03603q9291p7493o9126o1432n3539
56028B445744m8109m5393m1693l6108l2434l1869l0198k5166k0287j8209j6590
$$ plain form
56017 2099688 2086118 2075087 2065641 2059699 2059135 2061348 2062699 2064507 2070479 2080051 2089751 2099486 2111786
56004 2111786 2126215 2140192 2154154 2170480 2188548 2206365 2225704 2250039 2278579 2307826 2337674
55993 2337674 2370516 2405945 2442033 2480051 2521937 2564939 2605120 2644567 2688693 2738022 2789140
55982 2789140 2841895 2898656 2958081 3016933 3076674 3141023 3208330 3273884 3338459 3407010 3480170
55971 3480170 3554814 3631837 3715337 3805140 3898193 3996280 4104093 4220776 4341826 4468188
55961 4468188 4604618 4750305 4900397 5055653 5220827 5394467 5570632 5750414 5941361
55952 5941361 6145542 6358611 6580752 6817753 7070778 7335793 7613904 7911778 8231288
55943 8231288 8569275 8927686 9312708 9723589 10153906 10604373 11082781 11591243 12125953
$$ packed form
56017B099688j3570j1031r446n942n64K213J351J808N972R572R700R735J2300
56004B111786J4429J3977J3962J6326J8068J7817J9339K4335K8540K9247K9848
55993B337674L2842L5429L6088L8018M1886M3002M0181L9447M4126M9329N1118
55982B789140N2755N6761N9425N8852N9741O4349O7307O5554O4575O8551P3160
55971C480170P4644P7023Q3500Q9803R3053R8087J07813J16683J21050J26362
55961D468188J36430J45687J50092J55256J65174J73640J76165J79782J90947
55952E941361K04181K13069K22141K37001K53025K65015K78111K97874L19510
55943H231288L37987L58411L85022M10881M30317M50467M78408N08462N34710
$$ plain form
55934 12125953 12689594 13290597 13929495 14599645 15302196 16045982 16831435 17649171 18495970
55925 18495970 19377451 20294037 21240494 22221403 23251255 24337559 25479908 26686501 27973695
55916 27973695 29348246 30808986 32367371 34046645 35860449 37814507 39930024 42240636
55908 42240636 44764598 47506997 50492998 53771863 57386884 61374123 65796676 70749422
55900 70749422 76329738 82644879 89855729 98172248 107799660 118934491 131815244 146716772
55892 146716772 163888840 183576724 206120686 231950514 261453702 294905121 332377142
55885 332377142 373197573 414981362 453224500 482424918 498267083 499226113 486540146
55878 486540146 463070674 432194644 397181826 360820088 325149721 291444969 260426638
$$ packed form
55934A2125953N63641O01003O38898O70150P02551P43786P85453Q17736Q46799
55925A8495970Q81481R16586R46457R80909J029852J086304J142349J206593J287194
55916B7973695J374551J460740J558385J679274J813804J954058K115517K310612
55908D2240636K523962K742399K986001L278865L615021L987239M422553M952746
55900G0749422N580316O315141P210850Q316519R627412J1134831J2880753J4901528
55892A46716772J7172068J9687884K2543962K5829828K9503188L3451419L7472021
55885C32377142M0820431M1783789L8243138K9200418J5842165R59030j2685967
55878D86540146k3469472l0876030l5012818l6361738l5670367l3704752l1018331
$$ plain form
55871 260426638 232456944 207605901 185714398 166519900 149744260 135095976 122275182
55864 122275182 111022675 101139744 92450481 84780379 77983141 71953122 66595906 61813229
55856 61813229 57525812 53681316 50226207 47092569 44222341 41582236 39145827 36882299
55848 36882299 34771136 32806526 30976848 29257135 27629361 26092711 24646463 23279952
55840 23279952 21987082 20774088 19644337 18589587 17603257 16688075 15843324 15057694 14321733
55831 14321733 13635092 12995367 12392016 11817657 11274033 10761277 10272667 9805527 9365983
55822 9365983 8956836 8570935 8201909 7851407 7520574 7204371 6899594 6609114 6333266
55813 6333266 6066373 5806671 5560576 5332431 5118824 4917286 4731196 4561161 4400459
$$ packed form
55871B60426638k7969694k4851043k1891503j9194498j6775640j4648284j2820794
55864A22275182j1252507r882931q689263p670102o797238o030019n357216m782677
55856F1813229m287417l844496l455109l133638k870228k640105k436409k263528
55848C6882299k111163j964610j829678j719713j627774j536650j446248j366511
55840B3279952j292870j212994j129751j054750r86330r15182q44751p85630p35961
55831A4321733o86641o39725o03351n74359n43624n12756m88610m67140m39544
55822I365983m09147l85901l69026l50502l30833l16203l04777k90480k75848
55813F333266k66893k59702k46095k28145k13607k01538j86090j70035j60702
$$ plain form
55804 4400459 4244205 4094736 3953244 3814708 3676341 3542944 3418551 3300250 3185279
55795 3185279 3076858 2978005 2886667 2801727 2726549 2661392 2599127 2533659 2466520 2400568 2333698
55784 2333698 2263704 2193206 2124811 2057197 1990665 1930760 1881374 1839396 1800649 1765952 1737036
55773 1737036 1711588 1686833 1663389 1641747 1619593 1596116 1573933 1553354 1529974 1501390 1470955
55762 1470955 1441359 1410179 1375513 1340240 1306552 1271961 1235193 1200495 1171307 1144783 1117420
55751 1117420 1091150 1068862 1048632 1027701 1007974 992428 979799 967745 957653 951482 947357 942963
55739 942963 940091 941231 944722 947510 949555 951289 950019 943364 933511 923830 913864 901384 886560 870345
55725 870345 851758 830659 810349 793547 778600 763330 749681 740679 735536 731437 727396 722674
$$ packed form
55804D400459j56254j49469j41492j38536j38367j33397j24393j18301j14971
55795C185279j08421r8853r1338q4940p5178o5157o2265o5468o7139o5952o6870
55784B333698o9994p0498o8395o7614o6532n9905m9386m1978l8747l4697k8916
55773A737036k5448k4755k3444k1642k2154k3477k2183k0579k3380k8584l0435
55762A470955k9596l1180l4666l5273l3688l4591l6768l4698k9188k6524k7363
55751A117420k6270k2288k0230k0931j9727j5546j2629j2054j0092o171m125m394
55739I42963k872J140L491K788K045J734j270o655r853r681r966j2480j4824j6215
55725H70345j8587k1099k0310j6802j4947j5270j3649r002n143m099m041m722
$$ plain form
55713 722674 714447 701059 684959 668750 651202 630934 610868 594732 581936 570155 560297 554292
55701 554292 550261 544564 536762 528294 518098 503996 486843 469129 450759 430159 408221 387298
55689 387298 367564 348127 330640 318127 311067 307814 307720 310651 314625 317211 318478 319861 321260 321804
55675 321804 322089 323104 324450 325954 329123 334376 338938 340196 339035 337169 333749 327880 321904 318380
55661 318380 315929 311819 306597 302275 297973 291687 284763 280139 277238 272946 266937 261962 259360 258035
55647 258035 257525 258533 260709 263105 266377 271574 277497 282266 286604 292323 298425 302040 302587 301773 300199
55632 300199 297299 294088 292612 292955 293738 295037 297918 301731 304954 308077 312656 318151 322781 326737 331356
55617 331356 335789 337892 337934 338067 338508 337517 334807 331677 328148 323310 318220 315021 313373 311203 308850
$$ packed form
55713G22674q227j3388j6100j6209j7548k0268k0066j6136j2796j1781r858o005
55701E54292m031n697p802q468j0196j4102j7153j7714j8370k0600k1938k0923
55689C87298j9734j9437j7487j2513p060l253r4K931L974K586J267J383J399N44
55675C21804K85J015J346J504L169N253M562J258j161j866l420n869n976l524
55661C18380k451m110n222m322m302o286o924m624k901m292o009m975k602j325
55647B58035n10J008K176K396L272N197N923M769M338N719O102L615N47q14j574
55632C00199k900l211j476L43P83J299K881L813L223L123M579N495M630L956M619
55617C31356M433K103M2J33M41r91k710l130l529m838n090l199j648k170k353
$$ plain form
55602 308850 308822 311358 313808 314921 316322 319125 322408 325678 329660 333730 335645 334901 333816 334332 336030
55587 336030 337858 339277 339172 336327 331817 328373 326445 323299 316929 308620 300660 293634 287049 280680
55573 280680 274158 266778 258549 250201 241806 232959 224538 218447 215061 212496 208843 203761 197765 191547
55559 191547 186076 181781 177577 172277 166737 162755 160108 156858 152579 149003 147184 146162 144840 143181
55545 143181 141138 138365 135502 133949 133878 134049 133909 134076 134455 133740 131337 128319 125995 124860 125112 126665
55529 126665 128458 129166 128814 128515 128783 129467 130907 133449 136123 137724 138989 141882 146812 152362 157520
55514 157520 162296 166482 170056 174772 183132 195536 210242 225992 242662 259579 275583 290839
55502 290839 306271 321036 332772 340491 344932 346010 342441 334337 323731 311828 297930 281589
$$ packed form
55602C08850k8K536K450J113J401K803L283L270L982M070J915p44j085N16J698
55587C36030J828J419j05k845m510l444j928l146o370q309p960p026o585o369
55573B80680o522p380q229q348q395q847q421o091l386k565l653n082n996o218
55559A91547n471m295m204n300n540l982k647l250m279l576j819j022j322j659
55545A43181k043k773k863j553p1J71j40J67L79p15k403l018k324j135K52J553
55529A26665J793P08l52k99K68O84J440K542K674J601J265K893M930N550N158
55514A57520M776M186L574M716Q360J2404J4706J5750J6670J6917J6004J5256
55502B90839J5432J4765J1736P719M441J078l569q104j0606j1903j3898j6341
$$ plain form
55490 281589 263820 245734 228097 212601 201173 193347 186337 178289 169535 160540 151112 142206 135890
55477 135890 132608 130720 129498 130168 132987 135714 136284 135057 133271 131235 129223 128230 128632 129598 130802
55462 130802 133068 136479 139621 141578 142981 144291 144826 144260 143262 141853 139071 135032 131310 128416 125026
55447 125026 120589 116451 113321 109908 105407 100999 97422 93353 87969 82945 79949 78084 75941 74402
55433 74402 75022 76973 77992 77486 76473 75132 72466 68125 62948 57833 53213 49266 45782 42355 39342
55418 39342 37691 37189 36213 34169 32699 33253 34853 35759 35975 36441 36757 35677 33263 30873 29380 28804
55402 28804 29219 30612 32124 32755 32631 32504 32296 31266 29461 27922 27290 27016 26184 24835 24268 25823 29083
55385 29083 31793 32361 32016 33273 36626 40332 43234 45747 47794 48151 46835 45953 46730 47467 46006 42724
$$ packed form
55490B81589j7769j8086j7637j5496j1428p826p010q048q754q995r428q906o316
55477A35890l282j888j222O70K819K727N70j227j786k036k012r93M02R66J204
55462A30802K266L411L142J957J403J310N35n66r98j409k782m039l722k894l390
55447A25026m437m138l130l413m501m408l577m069n384n024k996j865k143j539
55433G4402O20J951J019n06j013j341k666m341n177n115m620l947l484l427l013
55418C9342j651n02r76k044j470N54J600R06K16M66L16j080k414k390j493n76
55402B8804M15J393J512O31j24j27k08j030j805j539o32k74q32j349n67J555L260
55385B9083K710N68l45J257L353L706K902K513K047L57j316q82P77P37j461l282
$$ plain form
55369 42724 39432 36664 33884 31434 30378 30948 32678 35660 40279 45914 51001 54217 55050 53840 51912
55354 51912 50892 51085 51273 50684 50121 50409 50919 50676 49836 49050 48440 48295 49628 52645 55588 56506 55494
55337 55494 53933 52377 50529 48584 47074 45814 44276 42680 41621 41082 40822 41160 42284 43288 42953
55322 42953 41144 38581 35838 33416 32081 32042 32372 32281 32338 33353 34671 34813 33386 31270 29306 27787
55306 27787 26849 26332 25696 25074 25809 28762 32410 33880 31902 27861 24080 21815 20865 20323 19605 19071 19498
55289 19498 20872 22237 22972 23424 23986 24498 25052 26383 28722 31125 32625 33208 33083 32050 30332 28903
55273 28903 28160 27367 26330 26290 27944 29805 30058 29151 29003 30248 31641 31729 29972 26779 23517 21816 21769
55256 21769 21598 20178 18924 19778 22267 24263 25025 25637 26800 27923 28401 28298 27620 26242 24677 23948
$$ packed form
55369D2724l292k768k780k450j056N70J730K982M619N635N087L216Q33j210j928
55354E1912j020J93J88n89n63K88N10k43q40p86o10j45J333L017K943R18j012
55337E5494j561j556j848j945j510j260j538j596j059n39k60L38J124J004l35
55322D2953j809k563k743k422j335l9L30r1N7J015J318J42j427k116j964j519
55306B7787r38n17o36o22P35K953L648J470j978m041l781k265r50n42p18n34M27
55289A9498J374J365P35M52N62N12N54J331K339K403J500N83j25j033j718j429
55273B8903p43p93j037m0J654J861K53r07j48J245J393Q8j757l193l262j701m7
55256B1769j71j420j254Q54K489J996P62O12J163J123M78j03o78j378j565p29
$$ plain form
55240 23948 24464 25669 26673 26745 25738 24681 25237 27785 30675 32232 32518 32204 30992 28737 27028 27676
55224 27676 30096 31962 32125 31169 29529 27023 24294 22833 23132 24161 24909 25225 25023 24020 22612 21930
55208 21930 22672 24630 27352 30360 32774 33661 32871 30884 28192 25581 24368 25153 26763 27715 28347 30074
55192 30074 32873 35176 36204 36826 37748 38335 37763 36308 34961 34429 34650 34649 33025 29455 25570 23475 23646
55175 23646 25223 27842 31754 36327 40005 41981 42739 42902 42773 43030 44351 45961 45891 43300 39571 36685
55159 36685 35348 35016 34768 33791 31910 30126 29942 31833 34940 38367 41932 45481 48380 50202 51334
55144 51334 52507 53917 54931 54466 51958 48327 45553 44718 44943 44898 44702 45388 47107 49023 50526 51330
55128 51330 50727 48160 44407 40924 38176 35791 34079 33866 34880 35840 36283 36841 37555 37451 36196 34752
$$ packed form
55240B3948N16J205J004P2j007j057N56K548K890J557K86l14j212k255j709O48
55224B7676K420J866J63r56j640k506k729j461K99J029P48L16k02j003j408o82
55208B1930P42J958K722L008K414Q87p90j987k692k611j213P85J610R52O32J727
55192C0074K799K303J028O22R22N87n72j455j347n32K21jj624l570l885k095J71
55175B3646J577K619L912M573L678J976P58J63j29K57J321J610p0k591l729k886
55159C6685j337l32k48r77j881j784j84J891L107L427L565L549K899J822J132
55144E1334J173J410J014m65k508l631k774q35K25m5j96O86J719J916J503Q04
55128E1330o03k567l753l483k748k385j712k13J014R60M43N58P14j04j255j444
$$ plain form
55112 34752 33917 33499 33354 33892 34876 35102 34136 33363 34298 36510 38075 37659 35542 32954 31008 30193 30528
55095 30528 32004 34480 37033 38222 37621 36471 35929 35463 34179 32918 33271 34854 35432 33835 30992 27966
55079 27966 24913 22500 22331 24823 28108 30162 30933 31351 31379 30328 28438 26899 26442 26676 26780 26501 26545
55062 26545 28004 31086 34693 37771 40628 44012 47346 49335 50113 51220 53278 55312 56704 58130 59910
55047 59910 61123 61291 61527 62855 64549 65302 65061 64640 64426 64588 65786 68367 71388 73471 74252 74135 73140
55030 73140 71038 68339 66144 65025 64713 64826 65385 66639 68741 71455 74072 75868 76764 77200 77460 77689
55014 77689 78396 79974 81624 81919 80756 79726 80028 81072 81754 82070 82682 83801 85443 87998 91516 95011
54998 95011 97397 98651 99218 98730 96449 92807 89523 87984 88016 88339 87836 86358 84525 82756 80656 77699
$$ packed form
55112C4752q35m18j45N38R84K26r66p73R35K212J565m16k117k588j946q15L35
55095C0528J476K476K553J189o01j150n42m66j284j261L53J583N78j597k843l026
55079B7966l053k413j69K492L285K054P71M18K8j051j890j539m57K34J04k79M4
55062B6545J459L082L607L078K857L384L334J989P78J107K058K034J392J426J780
55047E9910J213J68K36J328J694P53k41m21k14J62J198K581L021K083P81j17r95
55030G3140k102k699k195j119l12J13N59J254K102K714K617J796Q96M36K60K29
55014G7689P07J578J650K95j163j030L02J044O82L16O12J119J642K555L518L495
54998I5011K386J254N67m88k281l642l284j539L2L23n03j478j833j769k100k957
$$ plain form
54982 77699 74415 72142 71412 71349 71132 71281 72731 74951 75835 73738 69446 65941 65851 68969 72696 75186
54966 75186 77194 79975 82400 82057 78898 75689 74440 74300 73808 73340 74066 75895 78007 80381 83362 86444
54950 86444 88759 90234 91178 91461 91224 91640 93622 96348 98290 99131 99310 98448 96076 93666 93903 97431
54934 97431 101797 104236 104342 103450 102548 101604 100194 98043 95389 93300 92991 94321 95556 95359 94635 95642
54918 95642 99479 105054 110352 113911 115042 113680 110814 108487 108343 110076 111953 113029 114152 116579 120310
54903 120310 124231 127282 128877 128891 128163 128600 131696 136961 142525 147238 151503 156443 163130 172343 183867
54888 183867 196185 208077 220447 235132 251767 267611 281001 293273 306240 319292 330412
54877 330412 338793 344655 347176 344616 336724 325551 313335 300467 286022 269715 252744 236808
$$ packed form
54982G7699l284k273p30o3k17J49J450K220Q84k097m292l505r0L118L727K490
54966G5186K008K781K425l43l159l209j249j40m92m68P26J829K112K374K981L082
54950H6444K315J475R44K83k37M16J982K726J942Q41J79q62k372k410K37L528
54934I7431M366K439J06q92r02r44j410k151k654k089l09J330J235j97p24J007
54918I5642L837N575N298L559J131j362k866k327j44J733J877J076J123K427L731
54903A20310L921L051J595J4p28M37L096N265N564M713M265M940O687R213J1524
54888A83867J2318J1892J2370J4685J6635J5844J3390J2272J2967J3052J1120
54877C30412Q381N862K521k560p892j1173j2216j2868j4445j6307j6971j5936
$$ plain form
54865 236808 222626 209614 197169 185973 177461 171976 168175 164555 160868 157633 155008 152904 151723
54852 151723 152106 154019 156711 159598 162808 166896 172297 179011 186594 194509 202660 211581 222232 235636
54838 235636 252195 270748 288524 302765 312421 317830 319297 317027 312030 305494 297079 285426 270896
54825 270896 256229 243512 231828 219050 204945 191168 178993 168458 159312 151420 144430 138106
54813 138106 132967 129729 128135 127143 126140 125242 124526 123745 122782 121653 120118 118006 115991 115299 116315 117897
54797 117897 118394 117154 114924 112868 111471 110451 109622 109346 109880 110645 110715 109815 108272 106246 103840 101801
54781 101801 101066 101422 101528 100469 98418 95618 91921 87798 84763 83958 84934 86310 87071 86932 86264 86028
54765 86028 86913 88215 88565 88089 88532 90671 93039 94257 95293 97932 101926 105219 106611 106901 107544 109221
$$ packed form
54865B36808j4182j3012j2445j1196q512n485l801l620l687l235k625k104j181
54852A51723L83J913K692K887L210M088N401O714P583P915Q151Q921J0651J3404
54838B35636J6559J8553J7776J4241R656N409J467k270m997o536q415j1653j4530
54825B70896j4667j2717j1684j2778j4105j3777j2175j0535r146p892o990o324
54813A38106n139l238j594r92j003q98p16p81r63j129j535k112k015o92J016J582
54797A17897M97j240k230k056j397j020q29k76N34P65P0r00j543k026k406k039
54781A01801p35L56J06j059k051k800l697m123l035q05R76J376P61j39o68k36
54765H6028Q85J302L50m76M43K139K368J218J036K639L994L293J392K90O43J677
$$ plain form
54749 109221 111629 113925 115505 116808 118939 122062 124882 126366 127261 129171 132889 138444 145912 155093
54735 155093 164998 174742 184531 194929 205824 217183 230108 245816 263898 282721 301205 318948
54723 318948 334798 346646 352944 353747 350331 344441 337692 330826 323509 315254 306199 296545 285940 274301
54709 274301 262762 252836 244881 238197 232294 227291 223358 220527 218717 217389 215697 213654 212554 213515
54695 213515 216305 220445 226619 235846 247868 261499 276013 291109 306178 320964 336448 353743
54683 353743 372347 390590 407385 422284 434314 442205 445523 444362 438255 426798 411071 392974
54671 392974 373398 352452 331144 311076 292531 274739 258209 244881 235279 227127 217788 207054
54659 207054 196744 188350 181725 175509 168403 160523 153634 149465 147871 147289 146705 146110 145222 143169 139708
$$ packed form
54749A09221K408K296J580J303K131L123K820J484Q95J910L718N555P468R181
54735A55093R905R744R789J0398J0895J1359J2925J5708J8082J8823J8484J7743
54723C18948J5850J1848O298Q03l416n890o749o866p317q255r055r654j0605j1639
54709B74301j1539r926p955o684n903n003l933k831j810j328j692k043j100R61
54695B13515K790M140O174R227J2022J3631J4514J5096J5069J4786J5484J7295
54683C53743J8604J8243J6795J4899J2030P891L318j161o107j1457j5727j8097
54671C92974j9576k0946k1308k0068j8545j7792j6530j3328r602q152r339j0734
54659B07054j0310q394o625o216p106p880o889m169j594n82n84n95q88k053l461
$$ plain form
54644 139708 135730 132308 130179 130055 132192 135445 138101 140044 142855 147262 151813 154789 156346 157766
54630 157766 159524 161150 162500 163967 165400 165667 163771 160151 156532 154331 153465 153217 154099 157742 164420
54615 164420 171767 177053 179993 182156 184290 185801 186516 187268 188602 190375 192913 197085 202760 208458 213147
54600 213147 217436 222388 228015 233491 238058 241215 242768 243322 244303 246957 251416 256666 260977 262739 261856
54585 261856 260526 261787 266934 274749 283253 291540 299939 309248 320061 332285 345092 357621 369571
54572 369571 380649 389885 396245 399628 400506 398888 394537 387820 379365 369175 357120 344012 331049
54559 331049 318402 305562 292936 281792 272623 264752 257564 251014 244997 239434 235052 232919 233078
54546 233078 234535 236381 237908 238070 236323 233741 231766 230076 227390 224180 222516 222924 223411 222202 219598
$$ packed form
54644A39708l978l422k129j24K137L253K656J943K811M407M551K976J557J420
54630A57766J758J626J350J467J433K67j896l620l619k201q66k48Q82L643O678
54615A64420P347N286K940K163K134J511P15P52J334J773K538M172N675N698M689
54600B13147M289M952N627N476M567L157J553N54R81K654M459N250M311J762q83
54585B61856j330J261N147P815Q504Q287Q399R309J0813J2224J2807J2529J1950
54572C69571J1078R236O360L383Q78j618m351o717q455j0190j2055j3108j2963
54559C31049j2647j2840j2626j1144r169p871p188o550o017n563m382k133J59
54546B33078J457J846J527J62j747k582j975j690k686l210j664M08M87j209k604
$$ plain form
54531 219598 216394 212178 206375 199792 194100 190362 188379 186712 183355 177582 171069 165995 162336 158637
54517 158637 155009 153071 152887 152551 151349 150676 150860 149707 145758 140772 137258 135397 134159 133636 134174 134597
54501 134597 133455 131224 129415 128266 126873 124932 122907 121170 120209 120902 123258 125680 126709 126700 126696 126775 126897
54484 126897 128093 130937 133713 134171 132671 131709 132630 134616 136849 139800 144025 149142 154542 160040 165399
54469 165399 170045 173732 177000 180722 185409 190940 196707 202164 207283 212069 215701 216983 215900 213759
54455 213759 211317 207806 202521 196413 191125 187043 183070 177970 171500 164740 159552 156957 155871 154476
54441 154476 152797 152363 153218 153373 152062 151165 151951 152544 150693 147372 145215 144634 144001 142889 142577 143631
54425 143631 145279 147258 150193 153870 156845 158184 158333 158189 158545 160378 164258 169233 173399 175754 176721
$$ packed form
54531B19598l204m216n803o583n692l738j983j667l357n773o513n074l659l699
54517A58637l628j938j84l36j202o73J84j153l949m986l514j861j238n23N38M23
54501A34597j142k231j809j149j393j941k025j737r61O93K356K422J029rmP9J22
54484A26897J196K844K776M58j500r62R21J986K233K951M225N117N400N498N359
54469A65399M646L687L268L722M687N531N767N457N119M786L632J282j083k141
54455B13759k442l511n285o108n288m082l973n100o470o760n188k595j086j395
54441A54476j679m34Q55J55j311q97P86N93j851l321k157n81o33j112l12J054
54425A43631J648J979K935L677K975J339J49j44L56J833L880M975M166K355R67
$$ plain form
54410 176721 177140 177703 179051 181244 183352 184600 185536 187067 188860 190043 190940 192588 194798 196286 196609
54395 196609 196403 195623 193225 189011 184547 181711 181062 181824 182613 182049 179467 175292 170454 165754 162068 160221
54379 160221 159778 158950 156892 155223 155819 157916 158991 157947 155692 153228 151036 149849 149924 149800 148082 146281
54363 146281 147434 151643 155558 156935 157154 158096 159044 158523 157323 157416 158866 159851 159345 158182 157710 158767
54347 158767 161921 167481 174816 182341 188613 193321 197177 201017 205084 209264 213873 219615 226333 232350
54333 232350 235918 237266 238506 241577 246761 252875 258129 261039 261429 260569 259706 258741 257052 254970 253168
54318 253168 250930 246598 239888 232479 225973 220419 215212 210357 206348 203510 201771 200488 198433 194687
54304 194687 189713 184981 181669 180216 180618 182079 182910 182067 180580 180183 180833 181087 180600 180456 181012 181357 181292
$$ packed form
54410A76721M19N63J348K193K108J248R36J531J793J183Q97J648K210J488L23
54395A96609k06p80k398m214m464k836o49P62P89n64k582m175m838m700l686j847
54379A60221m43q28k058j669N96K097J075j044k255k464k192j187P5j24j718j801
54363A46281J153M209L915J377K19R42R48n21j200R3J450R85n06j163m72J057
54347A58767L154N560P335P525O272M708L856L840M067M180M609N742O718O017
54333B32350L568J348J240L071N184O114N254K910L90q60q63r65j689k082j802
54318B53168k238m332o710p409o506n554n207m855m009k838j739j283k055l746
54304A94687m974m732l312j453M02J461Q31q43j487l97O50K54m87j44N56L45o5
$$ plain form
54287 181292 181986 184062 186725 189538 193462 199192 205774 211784 216849 221330 225620 230336 235923 241376
54273 241376 244652 245041 243902 242396 240049 236470 232871 230517 228882 226687 223632 219730 214096 206194
54259 206194 197535 190402 185237 180844 176841 174202 173190 172202 169317 164266 158446 153483 150008 147578
54245 147578 145612 144221 143708 143332 141391 136991 131128 125566 121197 117887 115220 112838 110551 108631 107478
54230 107478 106737 105590 104275 104197 105734 107050 106171 103467 100965 99890 100064 101183 103137 105211 106289
54215 106289 106129 105584 105453 105853 106698 108081 110078 112742 116203 120158 123289 123975 121863 118375 115559 114667
54199 114667 115652 117575 119450 121012 122704 124856 127162 129065 130259 130510 129500 127382 125103 123620 122975
54184 122975 122559 122013 121431 120943 120574 120325 120056 119583 119267 120004 121993 123921 124145 122557 120548 119197 118272
$$ packed form
54287A81292O94K076K663K813L924N730O582O010N065M481M290M716N587N453
54273B41376L276L89j139j506k347l579l599k354j635k195l055l902n634p902
54259B06194q659p133n165m393m003k639j012r88k885n051n820m963l475k430
54245A47578j966j391n13l76j941m400n863n562m369l310k667k382k287j920j153
54230A07478p41j147j315p8J537J316q79k704k502j075J74J119J954K074J078
54215A06289j60n45j31M00Q45J383J997K664L461L955L131O86k112l488k816q92
54199A14667R85J923J875J562J692K152K306J903J194K51j010k118k279j483o45
54184A22975m16n46n82m88l69k49k69m73l16P37J989J928K24j588k009j351r25
$$ plain form
54167 118272 117193 116250 116289 117387 118277 117283 113869 109288 105665 104402 105386 107482 109507 110899 111864 112954
54151 112954 114257 115150 115122 114530 113905 112897 110918 108761 108318 110235 112967 114858 116188 118297 121452 124665
54135 124665 127161 128943 130082 130427 130004 128946 126938 123395 118368 112847 108083 104832 103109 102194 100998
54120 100998 98893 96261 93989 92583 92138 92852 94713 96583 96518 93808 90340 89038 90729 93317 94508
54105 94508 94594 95512 97587 98828 97939 96478 96798 98829 100458 100538 99812 98930 97373 94936 92877 92727 94639
54088 94639 97444 99630 99948 97928 94446 91237 89439 88970 89256 89763 89848 89134 88245 88135 88528 88274 87450
54071 87450 87594 89240 90850 91138 90936 91449 91967 91024 88981 87724 88108 89210 89912 90005 89795 89748 90438 91858
54053 91858 92838 92081 89768 87343 85812 85010 84424 83906 83538 83484 84010 85194 86659 87998 89204 90319 91084
$$ packed form
54167A18272j079r43L9J098Q90r94l414m581l623j263R84K096K025J392R65J090
54151A12954J303Q93k8n92o25j008j979k157m43J917K732J891J330K109L155L213
54135A24665K496J782J139L45m23j058k008l543n027n521m764l251j723r15j196
54120A00998k105k632k272j406m45P14J861J870o5k710l468j302J691K588J191
54105I4508Q6R18K075J241q89j461L20K031J629Q0p26q82j557k437k059j50J912
54088I4639K805K186L18k020l482l209j798m69K86N07Q5p14q89j10L93k54q24
54071H7450J44J646J610K88k02N13N18r43k043j257L84J102P02R3k10m7O90J420
54053I1858R80p57k313k425j531q02n86n18l68n4N26J184J465J339J206J115P65
$$ plain form
54036 91084 91409 91709 92179 92255 91523 90685 90894 92424 94727 97336 100027 102529 104840 107260 109262 109037 105486
54019 105486 100290 96621 95778 96326 96505 96166 96088 96697 98114 100517 103629 106384 107695 107369 105964 104086
54003 104086 102154 100648 100193 101289 103850 107055 109884 111925 113417 114468 114862 114853 115460 117326 119788 121758
53987 121758 123050 124224 125586 127201 129527 133005 137207 141269 145230 150095 156421 163494 170107 175704
53973 175704 180619 185546 190878 196573 202847 210794 221441 233811 244962 252838 258352 263716 269451
53960 269451 274356 277817 280540 283050 284980 286197 287384 289047 290937 292873 295182 297730 299303 298732
53946 298732 296292 293413 291060 288701 284920 279129 272620 267544 264559 261975 257712 251604 245102 239350
53932 239350 234660 231543 230877 232734 235873 238628 239763 238684 235807 232754 231126 230867 230666 229978 229474
$$ packed form
54036I1084L25L00M70P6p32q38K09J530K303K609K691K502K311K420K002k25l551
54019A05486n196l669q43N48J79l39p8O09J417K403L112K755J311l26j405j878
54003A04086j932j506m55J096K561L205K829K041J492J051L94rO07J866K462J970
53987A21758J292J174J362J615K326L478M202M062L961M865O326P073O613N597
53973A75704M915M927N332N695O274P947J0647J2370J1151P876N514N364N735
53960B69451M905L461K723K510J930J217J187J663J890J936K309K548J573n71
53946B98732k440k879k353k359l781n791o509n076k985k584m263o108o502n752
53932B39350m690l117o66J857L139K755J135j079k877l053j628k59k01o88n04
$$ plain form
53917 229474 229309 228366 226035 223583 222650 223092 223447 223152 223129 224227 226094 227893 229382 230739 231707 231514 229754
53900 229754 227093 224877 224029 224313 224667 224281 223472 223502 225294 228135 229963 229311 226747 223951 221741 219837
53884 219837 218319 218083 219521 221823 224284 227359 231619 236489 241029 245497 251115 258481 266955 275426
53870 275426 282998 289102 293534 296351 297539 297292 296826 297975 301212 304844 307032 307980 309191 311250 313422
53855 313422 315001 315973 316722 318088 321304 326802 333359 339387 344722 350328 356840 364425 373373 383462
53841 383462 393260 401483 408508 415093 420213 422059 420929 419117 417918 416653 414893 413456 412513 410595
53827 410595 406557 401192 395943 391095 386004 380097 372939 364289 354774 345637 337302 329127 320916 313537
53813 313537 307469 301895 295997 290128 284903 279935 274220 267207 259078 250749 243893 239864 237955 235584
$$ packed form
53917B29474j65r43k331k452r33M42L55k95k3J098J867J799J489J357R68j93j760
53900B29754k661k216q48K84L54l86q09L0J792K841J828o52k564k796k210j904
53884B19837j518k36J438K302K461L075M260M870M540M468N618P366Q474Q471
53870B75426P572O104M432K817J188k47m66J149L237L632K188R48J211K059K172
53855C13422J579R72P49J366L216N498O557O028N335N606O512P585Q948J0089
53841C83462R798Q223P025O585N120J846j130j812j199j265j760j437r43j918
53827D10595m038n365n249m848n091n907p158q650r515r137q335q175q211p379
53813C13537o068n574n898n869n225m968n715p013q129q329o856m029j909k371
$$ plain form
53799 235584 230857 224253 217362 210947 204824 198731 192682 187094 182940 180950 180342 179388 177562 175977 175369
53784 175369 175036 174388 173947 173853 172851 170103 166887 165082 164803 164801 164321 163284 161451 158992 157435 158491 161970
53767 161970 165813 168037 167886 165677 162665 160689 160771 162118 163329 164185 165354 166857 168059 168942 170151
53752 170151 171829 173523 175237 177519 180348 182969 185146 187748 191713 196942 202416 206925 209711 211043
53738 211043 212349 215286 220449 227252 234973 243352 252060 260143 266506 270937 274448 278387 283175 288175
53724 288175 293048 298681 305937 313694 319410 322014 323148 324917 327551 330127 332480 334978 337055 337495
53710 337495 336098 333853 331552 329391 327852 327603 328123 327536 324538 319901 315646 313227 312793 313541 314201 313628
53694 313628 311518 308519 305400 302278 298845 294920 290388 284885 278246 271356 265938 262966 261474 259437
$$ packed form
53799B35584m727o604o891o415o123o093o049n588m154j990o08r54j826j585o08
53784A75369l33o48m41r4j002k748l216j805k79km80j037j833k459j557J056L479
53767A61970L843K224j51k209l012j976Q2J347J211Q56J169J503J202Q83J209
53752A70151J678J694J714K282K829K621K177K602L965N229N474M509K786J332
53738B11043J306K937N163O803P721Q379Q708Q083O363M431L511L939M788N000
53724B88175M873N633P256P757N716K604J134J769K634K576K353K498K077M40
53710C37495j397k245k301k161j539k49N20n87k998m637m255k419m34P48O60n73
53694C13628k110k999l119l122l433l925m532n503o639o890n418k972j492k037
$$ plain form
53680 259437 255813 251293 247115 243795 241281 239555 238411 237144 235266 233234 231676 230190 227928 225153
53666 225153 223151 222433 222129 221406 220545 220197 220558 221768 224236 227917 231885 235123 237287 238492 239176 240439
53650 240439 243503 248182 252787 256212 259263 263209 267907 272395 276712 282014 289135 297804 306954 315085
53636 315085 320786 323831 325674 328213 332176 337061 342221 347331 352091 356082 358837 359860 359105 357792
53622 357792 358064 361098 365926 370638 374300 377237 380060 383203 386987 391300 395438 398745 401204 403011
53608 403011 404011 403933 402659 399926 395483 390101 385683 383657 383779 385011 386847 389071 391024 392008 391963 391132
53592 391132 389663 388094 387368 387658 387950 387448 386395 384824 381926 377918 375151 375564 377923 379370 379039 378332
53576 378332 378245 378493 379061 380491 382369 383396 383404 383781 385406 387521 389119 390264 391597 393596 396634 400763
$$ packed form
53680B59437l624m520m178l320k514j726j144j267j878k032j558j486k262k775
53666B25153k002p18l04p23q61l48L61J210K468L681L968L238K164J205O84J263
53650B40439L064M679M605L425L051L946M698M488M317N302P121Q669R150Q131
53636C15085N701L045J843K539L963M885N160N110M760L991K755J023p55j313
53622C57792K72L034M828M712L662K937K823L143L784M313M138L307K459J807
53608D03011J000p8j274k733m443n382m418k026J22J232J836K224J953R84m5q31
53592C91132j469j569p26K90K92n02j053j571k898m008k767M13K359J447l31p07
53576C78332q7K48N68J430J878J027QL77J625K115J598J145J333J999L038M129
$$ plain form
53560 400763 405162 408755 411630 414912 419100 423547 427701 431779 435993 440211 444597 449588 455074 460635
53546 460635 466773 474698 484558 494984 504849 514395 524263 534503 545045 556069 567158 576925 584332
53533 584332 589950 595493 602494 611504 621879 632066 640813 648331 655692 663070 669646 675427 682005 690838
53519 690838 701529 712289 721479 728402 733406 737746 742709 748412 753953 758917 763970 769648 775322 779783
53505 779783 782360 783337 783945 785905 789880 794143 795911 794584 792617 792630 794600 796638 797571 797816 798393 800000
53489 800000 802621 805234 806312 805277 803166 801457 800732 800901 801893 803361 804431 804816 805803 809030 814379
53474 814379 819959 824286 827719 831655 836990 843603 850821 857961 864726 871511 879391 889476 902071 916505
53460 916505 931994 948596 966879 986580 1006284 1025007 1043688 1064458 1088649 1116053 1145722
$$ packed form
53560D00763M399L593K875L282M188M447M154M078M214M218M386M991N486N561
53546D60635O138P925R860J0426R865R546R868J0240J0542J1024J1089R767P407
53533E84332N618N543P001R010J0375J0187Q747P518P361P378O576N781O578Q833
53519F90838J0691J0760R190O923N004M340M963N703N541M964N053N678N674M461
53505G79783K577R77O08J960L975M263J768j327j967J3J970K038R33K45N77J607
53489H00000K621K613J078j035k111j709p25J69R92J468J070L85R87L227N349
53474H14379N580M327L433L936N335O613P218P140O765O785P880J0085J2595J4434
53460I16505J5489J6602J8283J9701J9704J8723J8681K0770K4191K7404K9669
$$ plain form
53449 1145722 1176582 1207499 1237864 1268483 1301226 1337538 1377627 1420749 1465541 1510410 1554814
53438 1554814 1600236 1648753 1700451 1753337 1806037 1859313 1914384 1971019 2028197 2085755 2144232
53427 2144232 2203560 2262859 2321458 2379550 2437900 2497217 2557680 2618900 2680475 2742458 2804878
53416 2804878 2867095 2928289 2988299 3047056 3103425 3155927 3204816 3252119 3299087 3344747 3387484
53405 3387484 3426853 3463043 3495673 3524259 3549333 3572125 3593474 3613586 3632347 3649285 3663593
53394 3663593 3674530 3681358 3682973 3678650 3669501 3657915 3644794 3628351 3606417 3578911 3547140 3511830
53382 3511830 3473178 3432015 3389400 3345238 3298591 3249338 3198590 3147442 3096038 3043849 2990381
53371 2990381 2935741 2880811 2826710 2773958 2722716 2673744 2628065 2585369 2544150 2504156 2467436
$$ packed form
53449A145722L0860L0917L0365L0619L2743L6312M0089M3122M4792M4869M4404
53438A554814M5422M8517N1698N2886N2700N3276N5071N6635N7178N7558N8477
53427B144232N9328N9299N8599N8092N8350N9317O0463O1220O1575O1983O2420
53416B804878O2217O1194O0010N8757N6369N2502M8889M7303M6968M5660M2737
53405C387484L9369L6190L2630K8586K5074K2792K1349K0112J8761J6938J4308
53394C663593J0937O828J615m323r149j1586j3121j6443k1934k7506l1771l5310
53382C511830l8652m1163m2615m4162m6647m9253n0748n1148n1404n2189n3468
53371B990381n4640n4930n4101n2752n1242m8972m5679m2696m1219l9994l6720
$$ plain form
53360 2467436 2435782 2408247 2382500 2357706 2334639 2313885 2295798 2281821 2273959 2272653 2276502 2284189
53348 2284189 2295595 2310978 2330268 2353409 2380535 2411596 2446404 2484852 2526443 2570102 2615429
53337 2615429 2663737 2716662 2774075 2834616 2898008 2965343 3037115 3112482 3190785 3272435 3357944
53326 3357944 3447281 3540582 3638284 3740108 3845058 3952994 4065093 4181972 4302260 4423802
53316 4423802 4545651 4668205 4791886 4916302 5040268 5162345 5281819 5399297 5515656
53307 5515656 5630166 5740520 5844992 5943555 6036367 6122382 6200591 6271856 6338085 6399758 6455233
53296 6455233 6502523 6540833 6570227 6590592 6601492 6602844 6595352 6580025 6557071 6525296 6482826 6428472
53284 6428472 6362104 6283937 6194263 6094301 5986566 5873637 5756696 5635712 5510768 5382785
$$ packed form
53360B467436l1654k7535k5747k4794k3067k0754j8087j3977p862j306L849P687
53348B284189J1406J5383J9290K3141K7126L1061L4808L8448M1591M3659M5327
53337B615429M8308N2925N7413O0541O3392O7335P1772P5367P8303Q1650Q5509
53326C357944Q9337R3301R7702J01824J04950J07936J12099J16879J20288J21542
53316D423802J21849J22554J23681J24416J23966J22077J19474J17478J16359
53307E515656J14510J10354J04472R8563R2812Q6015P8209P1265O6229O1673N5475
53296F455233M7290L8310K9394K0365J0900J352p492j5327k2954l1775m2470n4354
53284F428472o6368p8167q9674r9962j07735j12929j16941j20984j24944j27983
$$ plain form
53274 5382785 5253237 5123676 4995324 4868570 4743005 4618421 4495579 4375435 4257918
53265 4257918 4142320 4028891 3919058 3813676 3712003 3613120 3517646 3427027 3341459 3259805
53255 3259805 3181768 3108995 3043204 2984090 2930067 2880654 2836718 2798207 2762876 2728281 2694513
53244 2694513 2664140 2639545 2620905 2606715 2595618 2587423 2582721 2581802 2583885 2587326 2590814 2594490 2599806
53231 2599806 2608189 2620001 2634840 2652465 2672989 2696281 2721766 2749177 2779127 2812459 2849265
53220 2849265 2889143 2932306 2979492 3030422 3083185 3135890 3188319 3241115 3293817 3344906 3393674
53209 3393674 3440872 3487217 3532292 3575433 3616779 3656784 3695254 3731514 3765072 3795544 3822263
53198 3822263 3844648 3862798 3877339 3888717 3896876 3901383 3901577 3896756 3886406 3870225 3848002 3819706
$$ packed form
53274E382785j29548j29561j28352j26754j25565j24584j22842j20144j17517
53265D257918j15598j13429j09833j05382j01673r8883r5474r0619q5568q1654
53255C259805p8037p2773o5791n9114n4023m9413m3936l8511l5331l4595l3768
53244B694513l0373k4595j8640j4190j1097q195m702r19K083L441L488L676N316
53231B599806Q383J1812J4839J7625K0524K3292K5485K7411K9950L3332L6806
53220B849265L9878M3163M7186N0930N2763N2705N2429N2796N2702N1089M8768
53209C393674M7198M6345M5075M3141M1346M0005L8470L6260L3558L0472K6719
53198C822263K2385J8150J4541J1378Q159M507J94m821j0350j6181k2223k8296
$$ plain form
53186 3819706 3785577 3745760 3700175 3649316 3594788 3537923 3478061 3413526 3344559 3273794 3203293
53175 3203293 3132608 3060844 2989174 2919777 2853060 2787681 2723014 2660065 2599856 2542121 2485906
53164 2485906 2430648 2376373 2323324 2271468 2220097 2168232 2115896 2064550 2015769 1969865 1926337
53153 1926337 1884933 1845500 1807471 1770663 1736031 1704479 1675275 1646819 1618608 1591145 1564158
53142 1564158 1536422 1507486 1478222 1449413 1421049 1393306 1366911 1341988 1317465 1292128 1265541
53131 1265541 1237747 1209184 1181162 1155175 1131013 1106624 1080708 1054537 1030134 1007368 984085
53120 984085 958896 932694 907237 883148 859880 837234 816132 797576 781026 764399 745942
53109 745942 725826 705652 686876 670163 655680 643000 630856 618039 604808 592691 582622
$$ packed form
53186C819706l4129l9817m5585n0859n4528n6865n9862o4535o8967p0765p0501
53175C203293p0685p1764p1670o9397o6717o5379o4667o2949o0209n7735n6215
53164B485906n5258n4275n3049n1856n1371n1865n2336n1346m8781m5904m3528
53153A926337m1404l9433l8029l6808l4632l1552k9204k8456k8211k7463k6987
53142A564158k7736k8936k9264k8809k8364k7743k6395k4923k4523k5337k6587
53131A265541k7794k8563k8022k5987k4162k4389k5916k6171k4403k2766k3283
53120I84085k5189k6202k5457k4089k3268k2646k1102j8556j6550j6627j8457
53109G45942k0116k0174j8776j6713j4483j2680j2144j2817j3231j2117j0069
$$ plain form
53098 582622 573896 565074 555248 544231 532378 520732 510737 503097 497023 490920 483762 475768 467989
53085 467989 461313 455613 449942 443742 437558 432166 427410 422624 417933 414170 411460 408701 404674 399013
53071 399013 392188 385335 380123 377730 377589 377804 377039 375348 373203 370775 368429 366879 366246 365700 364461
53056 364461 362507 360058 357270 354856 354019 355126 357181 359144 360987 362908 364382 364834 364583 364342 364368 364816
53040 364816 366292 369183 372915 376646 380252 383837 386781 388210 388160 387527 387055 386983 387213 387047 385184 380920
53024 380920 375159 369345 363657 357209 349907 342977 337406 332812 328195 323158 317987 313014 308201 303057
53010 303057 296903 289704 282683 277552 274974 274246 274490 275328 276159 275736 273352 269968 267227 265476 263583
52995 263583 260779 257789 255835 255134 254893 254306 253022 251035 248755 246943 245902 244827 242703 239748 237178
$$ packed form
53098E82622q726q822r826j1017j1853j1646r995p640o074o103p158p994p779
53085D67989o676n700n671o200o184n392m756m786m691l763k710k759m027n661
53071C99013o825o853n212k393j41K15p65j691k145k428k346j550o33n46j239
53056C64461j954k449k788k414q37J107K055J963J843J921J474M52k51k41K6M48
53040C64816J476K891L732L731L606L585K944J429n0o33m72p2K30j66j863m264
53024C80920n761n814n688o448p302o930n571m594m617n037n171m973m813n144
53010C03057o154p199p021n131k578p28K44Q38Q31m23k384l384k741j751j893
52995B63583k804k990j954p01k41n87j284j987k280j812j041j075k124k955k570
$$ plain form
52980 237178 235509 234062 232341 230752 229416 227441 224309 221082 219084 218097 217058 215905 215359 215249 214687
52965 214687 213781 213636 214297 214142 211747 207277 201747 196167 191878 190366 191730 194116 195416 195085 193939
52950 193939 193021 193070 194235 195714 196400 196295 196433 197042 196857 194956 192310 190706 190836 192096 193499 194205 194044
52933 194044 194073 195588 197932 198542 196176 192969 192016 193928 196937 199314 200187 199049 196502 194913 196238
52918 196238 199192 200396 198451 195285 193329 193127 194200 196582 200417 205033 209373 212951 215985 219031
52904 219031 222682 226981 231044 233921 235917 238299 241767 246026 250853 256469 262674 268680 274246 280014
52890 280014 286318 292558 298166 303321 308162 312162 314918 316897 318745 320465 321784 322722 323255 323002 321781
52875 321781 319931 317587 314393 310476 306875 304084 300893 295936 289986 285375 283133 281961 280399 278752
$$ packed form
52980B37178j669j447j721j589j336j975l132l227j998r87j039j153n46j10n62
52965B14687r06j45O61j55k395m470n530n580m289j512J364K386J300l31j146
52950A93939r18M9J165J479O86j05J38O09j85j901k646j604J30J260J403P06j61
52933A94044K9J515K344O10k366l207r53J912L009K377Q73j138k547j589J325
52918A96238K954J204j945l166j956k02J073K382L835M616M340L578L034L046
52904B19031L651M299M063K877J996K382L468M259M827N616O205O006N566N768
52890B80014O304O240N608N155M841M000K756J979J848J720J319R38N33k53j221
52875C21781j850k344l194l917l601k791l191m957n950m611k242j172j562j647
$$ plain form
52861 278752 277975 277452 275168 270212 264319 260432 259966 261738 263366 263291 261453 258592 255490 252732 250583
52846 250583 248823 247071 245524 245018 245967 247495 248144 247494 246625 246816 248126 249581 250514 251276 252555 254369
52830 254369 255950 256398 255305 252979 250512 249441 250830 254321 258261 260866 261335 260165 258847 259024 261201
52815 261201 264033 265498 265098 264367 264896 266494 267808 268128 267750 266966 265670 263988 262462 261540 261370 262162
52799 262162 264049 266512 268614 270020 271237 272547 273333 272942 271847 271341 272148 273702 274832 275030 275061 276413
52783 276413 279999 285258 290519 294330 296505 298034 300150 303443 307626 312031 316294 320546 324946 329269
52769 329269 333168 336745 340495 344583 348302 350502 350595 349168 347496 346472 346076 345802 345234 343953 341335
52754 341335 337089 331907 326966 322740 318753 314498 309898 304924 299528 294172 289564 285654 281723 277798
$$ packed form
52861B78752p77n23k284m956n893l887m66J772J628p5j838k861l102k758k149
52846B50583j760j752j547n06R49J528O49o50q69J91J310J455R33P62J279J814
52830B54369J581M48j093k326k467j071J389L491L940K605M69j170j318J77K177
52815B61201K832J465m00p31N29J598J314L20l78p84j296j682j526r22j70P92
52799B62162J887K463K102J406J217J310P86l91j095n06Q07J554J130J98L1J352
52783B76413L586N259N261L811K175J529K116L293M183M405M263M252M400M323
52769C29269L899L577L750M088L719K200R3j427j672j024l96k74n68j281k618
52754C41335m246n182m941m226l987m255m600m974n396n356m608l910l931l925
$$ plain form
52740 277798 274911 273388 271978 269493 266378 263607 260892 257175 252321 247080 241902 236960 232904 230267
52726 230267 228434 226463 224594 223544 222726 220789 217761 214860 212107 208175 203041 198739 196516 194991
52712 194991 192391 189132 186800 185808 185597 186084 187210 187698 186065 182703 179490 177435 176060 175055 174961 175876
52696 175876 176765 176752 176109 175310 173909 171212 167523 163910 160948 158404 156097 154334 153285 152478 151362 150091
52680 150091 149274 149002 148621 147587 146080 144471 142606 140127 137279 134801 133029 131633 130237 128831 127565
52665 127565 126605 126274 126737 127470 127628 127131 126767 126992 127320 127302 127439 128374 129659 130178 129747 129483 130314 131616
52647 131616 131757 129928 127159 125403 125731 127524 129342 130174 129851 128851 128270 129463 132756 136549 138629
52632 138629 138530 137873 138181 139317 140545 142144 144982 148918 152710 155591 158252 161951 166918 171998 175943
$$ packed form
52740B77798k887j523j410k485l115k771k715l717m854n241n178m942m056k637
52726B30267j833j971j869j050q18j937l028k901k753l932n134m302k223j525
52712A94991k600l259k332r92k11M87J126M88j633l362l213k055j375j005r4R15
52696A75876Q89j3o43p99j401k697l689l613k962k544k307j763j049q07j116j271
52680A50091q17k72l81j034j507j609j865k479k848k478j772j396j396j406j266
52665A27565r60l31M63P33J58m97l64K25L28j8J37R35J285N19m31k64Q31J302
52647A31616J41j829k769j756L28J793J818Q32l23j000n81J193L293L793K080
52632A38629r9o57L08J136J228J599K838L936L792K881K661L699M967N080L945
$$ plain form
52617 175943 178876 182153 186618 191538 195643 198605 200588 200872 198381 193733 189226 186183 183551 179926
52603 179926 175773 172506 170289 168045 165076 161439 157182 152463 148180 145223 143166 140775 137801 135117
52589 135117 133070 130875 127975 124942 122481 120328 117800 114959 112737 112062 113023 114612 115308 114359 112613
52574 112613 111701 112440 114379 116646 118453 118950 117577 114896 112291 110445 108808 106951 105632 105875 107491
52559 107491 109247 110289 110820 111500 112682 114164 115331 115597 114972 114261 114534 116389 119592 123124 125616 126153
52543 126153 125005 123440 122696 123265 125010 127479 130009 132041 133510 134520 134629 133240 130949 129548 129930
52528 129930 130772 130326 129022 129077 131546 135028 137613 139071 140501 142586 145053 147498 149887 152241 154385
52513 154385 156128 157399 158085 157995 157136 155978 155448 156548 159655 163988 167960 170388 171380 171942 172892 174315
$$ packed form
52617A75943K933L277M465M920M105K962J983K84k491m648m507l043k632l625
52603A79926m153l267k217k244k969l637m257m719m283k957k057k391k974k684
52589A35117k047k195k900l033k461k153k528k841k222o75R61J589O96r49j746
52574A12613r12P39J939K267J807M97j373k681k605j846j637j857j319K43J616
52559A07491J756J042N31O80J182J482J167K66o25p11K73J855L203L532K492N37
52543A26153j148j565p44N69J745K469K530K032J469J010J09j389k291j401L82
52528A29930Q42m46j304N5K469L482K585J458J430K085K467K445K389K354K144
52513A54385J743J271O86r0q59j158n30J100L107M333L972K428R92N62R50J423
$$ plain form
52497 174315 175873 177360 179083 181889 186523 192471 197672 200088 199767 198783 198888 199781 200048 199275 198606 199501
52481 199501 202564 207420 212921 217357 219184 218233 216105 215027 216171 218954 221759 223217 222902 221098 218214
52466 218214 214701 211379 209211 208415 208188 207766 207422 207797 208552 208573 207598 206772 207213 208645 209925 210420 210325 210017
52448 210017 209704 209545 209612 209738 209757 209824 210237 211037 211951 212614 212619 211673 210038 208654 208347 209016 209947 210840 212005
52429 212005 213504 214667 214877 214568 215014 216939 219505 220975 220532 219301 219265 221212 224152 226749 228681 230222
52413 230222 231100 230636 228942 227229 226695 227506 229005 230548 231928 233284 234821 236412 237425 237281 236356 235972
52397 235972 237121 239339 241180 241777 241645 241876 242779 243516 243078 241484 239954 239903 241785 244839 247776 249666
52381 249666 250414 250641 251126 252128 253232 253938 254352 255054 256272 257464 257923 257660 257462 258196 260185 263097 266079
$$ packed form
52497A74315J558J487J723K806M634N948N201K416l21r84J05Q93K67p73o69Q95
52481A99501L063M856N501M436J827r51k128j078J144K783K805J458l15j804k884
52466B18214l513l322k168p96k27m22l44L75P55K1r75q26M41J432J280M95r5l08
52448B10017l13j59O7J26J9O7M13Q00R14O63Nr46j635j384l07O69R31Q93J165
52429B12005J499J163K10l09M46J925K566J470m43j231l6J947K940K597J932J541
52413B30222Q78m64j694j713n34Q11J499J543J380J356J537J591J013j44r25l84
52397B35972J149K218J841N97j32K31R03P37m38j594j530n1J882L054K937J890
52381B49666P48K27M85J002J104P06M14P02J218J192M59k63j98P34J989K912K982
$$ plain form
52364 266079 267984 267937 266127 263917 262879 263627 265645 268021 270026 271118 270946 269597 267567 265262 262780
52349 262780 260299 258307 257141 256659 256664 257236 258139 258309 256774 254056 251908 251491 252399 253706 255271 257540
52333 257540 260458 263071 264144 263064 260342 257554 256530 258210 262055 266419 269544 270632 270368 270172 270579
52318 270579 270756 270218 270352 272972 277510 281236 282763 283920 287223 292723 298444 302981 306318 308775 310672
52303 310672 312811 315983 320005 324222 328668 333547 337958 340738 342625 345751 350483 354491 355968 356376
52289 356376 358621 363491 369362 374832 380004 385214 389948 393543 396057 398004 399801 401834 404605 408414
52275 408414 413044 417895 422200 425165 426398 426487 426890 428966 433053 438348 443458 447214 449561 451823 455649
52260 455649 461322 467376 472195 475731 479300 483940 489516 495268 500603 505207 509041 512700 517398 524100
$$ packed form
52364B66079J905m7j810k210j038P48K018K376K005J092j72j349k030k305k482
52349B62780k481j992j166m82NN72R03J70j535k718k148m17R08J307J565K269
52333B57540K918K613J073j080k722k788j024J680L845M364L125J088k64j96M07
52318B70579J77n38J34K620M538L726J527J157L303N500N721M537L337K457J897
52303C10672K139L172M022M217M446M879M411K780J887L126M732M008J477M08
52289C56376K245M870N871N470N172N210M734L595K514J947J797K033K771L809
52275D08414M630M851M305K965J233Q9M03K076M087N295N110L756K347K262L826
52260D55649N673O054M819L536L569M640N576N752N335M604L834L659M698O702
$$ plain form
52246 524100 532723 542585 553445 565699 579511 594284 609193 623971 638869 653946 668697 682498
52234 682498 695400 708380 722675 738820 756474 775143 794707 815017 835460 855508 875443
52223 875443 895799 916134 935239 952945 970953 991201 1013745 1036836 1058788 1079253 1098781
52212 1098781 1117895 1136689 1154829 1171738 1187070 1201210 1215009 1228724 1241391 1251654 1259289
52201 1259289 1265501 1271334 1276109 1278262 1277938 1277746 1280016 1283852 1286165 1285463 1283228 1281287 1279416 1276549 1273094
52186 1273094 1270509 1269189 1268295 1267602 1268043 1270122 1272981 1275648 1278385 1282147 1287209 1292996 1299082 1305868 1314328
52171 1314328 1325191 1338214 1352222 1366065 1379608 1393593 1408566 1424172 1439413 1453243 1465028
52160 1465028 1474958 1484115 1493643 1503631 1513062 1520872 1526683 1530597 1532889 1534093 1534747 1534709 1533126 1529386 1523657
$$ packed form
52246E24100Q623R862J0860J2254J3812J4773J4909J4778J4898J5077J4751J3801
52234F82498J2902J2980J4295J6145J7654J8669J9564K0310K0443K0048J9935
52223H75443K0356K0335J9105J7706J8008K0248K2544K3091K1952K0465J9528
52212A098781J9114J8794J8140J6909J5332J4140J3799J3715J2667J0263P635
52201A259289O212N833M775K153l24j92K270L836K313p02k235j941j871k867l455
52186A273094k585j320q94o93M41K079K859K667K737L762N062N787O086O786Q460
52171A314328J0863J3023J4008J3843J3543J3985J4973J5606J5241J3830J1785
52160A465028R930R157R528R988R431P810N811L914K292J204O54l8j583l740n729
$$ plain form
52145 1523657 1516296 1507446 1497729 1488607 1480954 1473567 1464148 1452019 1438976 1427137 1416818 1407105 1397723
52132 1397723 1389279 1382002 1375422 1369455 1364762 1361553 1358785 1355205 1350630 1345597 1340326 1334864 1329828 1325965
52118 1325965 1323030 1320088 1316901 1314150 1312197 1310641 1309145 1307633 1305379 1301250 1295497 1290149 1286691 1284293
52104 1284293 1281295 1277585 1274359 1272202 1270635 1269123 1267412 1265243 1262830 1261196 1260824 1260447 1258535 1255669
52090 1255669 1253870 1253606 1253180 1251285 1248539 1245824 1242582 1237640 1230748 1222449 1213337 1204200 1196162 1189853
52076 1189853 1184783 1179956 1174634 1168305 1160758 1152560 1144639 1137001 1128790 1120007 1112022 1105720 1100281 1094711
52062 1094711 1089472 1085428 1082080 1078291 1074228 1071120 1069343 1068042 1066626 1065373 1064424 1063314 1061876 1060796
52048 1060796 1060899 1062345 1064694 1067331 1069886 1072772 1077250 1084344 1093640 1103677 1113516 1123458 1134414 1147156
$$ packed form
52145A523657p361q850r717r122p653p387r419j2129j3043j1839j0319r713r382
52132A397723q444p277o580n967m693l209k768l580m575n033n271n462n036l863
52118A325965k935k942l187k751j953j556j496j512k254m129n753n348l458k398
52104A284293k998l710l226k157j567j512j711k169k413j634l72l77j912k866
52090A255669j799k64m26j895k746k715l242m942o892q299r112r137q038o309
52076A189853n070m827n322o329p547q198p921p638q211q783p985o302n439n570
52062A094711n239m044l348l789m063l108j777j301j416j253r49j110j438j080
52048A060796J03J446K349K637K555K886M478P094R296J0037R839R942J0956J2742
$$ plain form
52034 1147156 1162026 1178613 1195805 1212920 1230822 1251093 1274004 1298180 1322410 1346758 1371432
52023 1371432 1395669 1418700 1441231 1464825 1489839 1514749 1537601 1557582 1575087 1590902 1605794
52012 1605794 1620547 1635726 1651021 1665044 1676191 1684005 1689556 1694301 1698591 1701426 1701521 1698427 1692810
51999 1692810 1686068 1679627 1674109 1668888 1662727 1655015 1646174 1636865 1627343 1617922 1609583 1603319 1598796 1594290
51985 1594290 1588356 1581360 1575142 1571298 1569956 1570035 1570445 1571067 1572723 1576093 1580550 1584267 1585867 1585821 1585860 1587104
51969 1587104 1589377 1592399 1596788 1603236 1611081 1618371 1623287 1625167 1624520 1622621 1620901 1619962 1619116 1617336 1614541
51954 1614541 1611364 1607851 1603314 1597525 1591157 1584694 1577709 1569601 1560277 1549489 1536221 1519642 1500345
51941 1500345 1479875 1459123 1437737 1415068 1391189 1366900 1343023 1319697 1296261 1271997 1247042
$$ packed form
52034A147156J4870J6587J7192J7115J7902K0271K2911K4176K4230K4348K4674
52023A371432K4237K3031K2531K3594K5014K4910K2852J9981J7505J5815J4892
52012A605794J4753J5179J5295J4023J1147P814N551M745M290K835R5l094n617
51999A692810o742o441n518n221o161p712q841r309r522r421q339o264m523m506
51985A594290n934o996o218l844j342P9M10O22J656L370M457L717J600m6L9J244
51969A587104K273L022M389O448P845P290M916J880o47j899j720r39q46j780k795
51954A614541l177l513m537n789o368o463o985q108r324j0788j3268j6579j9297
51941A500345k0470k0752k1386k2669k3879k4289k3877k3326k3436k4264k4955
$$ plain form
51930 1247042 1222238 1197908 1173214 1147049 1119162 1090134 1060718 1031568 1003149 975392 947833
51919 947833 920554 894491 870202 846822 823093 799136 776374 755789 737036 719171 701464
51908 701464 683515 665408 647963 632155 618133 605333 593610 583492 575118 567667 560090 551809
51896 551809 542471 531856 520604 510415 502756 497584 493819 490675 487869 484811 480589 475114 469680
51883 469680 465820 463611 461527 458089 453472 449162 446101 443520 439935 434926 429454 424580 420473 416840
51869 416840 413656 410920 408019 403971 398406 392009 385900 380764 376651 373339 370606 368106 365355 362280
51855 362280 359745 359057 360507 362694 363667 362542 359573 355038 349132 343070 339077 338277 339256 339730 339282 339231
51839 339231 339901 339661 337382 334539 333480 334267 334732 333487 331332 329417 327564 325266 323046 321591 320400
$$ packed form
51930A247042k4804k4330k4694k6165k7887k9028k9416k9150k8419k7757k7559
51919I47833k7279k6063k4289k3380k3729k3957k2762k0585j8753j7865j7707
51908G01464j7949j8107j7445j5808j4022j2800j1723j0118q374p451p577q281
51896E51809r338j0615j1252j0189p659n172l765l144k806l058m222n475n434
51883D69680l860k209k084l438m617m310l061k581l585n009n472m874m107l633
51869D16840l184k736k901m048n565o397o109n136m113l312k733k500k751l075
51855C62280k535o88J450K187R73j125k969m535n906o062l993q00R79M74m48n1
51839C39231O70k40k279k843j059P87M65j245k155j915j853k298k220j455j191
$$ plain form
51824 320400 318615 316677 315770 315896 316024 316005 316755 318260 319128 318779 318478 319173 319813 319286 318868 320780 324815
51807 324815 328269 329290 328631 327935 327887 328696 330827 334090 336881 337550 336216 334465 333657 334369 337119 342364
51791 342364 349420 356232 360956 363663 366071 369650 374225 378354 380644 380558 378338 374599 369979 364870 359515
51776 359515 354607 351541 351373 353357 355282 355768 355817 357505 361576 366882 371914 376083 379599 382833 386065
51761 386065 389316 392186 394069 394654 394113 392956 391928 391704 392253 392669 392168 391022 389954 388974 387657 386422
51745 386422 386395 387785 389422 390466 391674 394199 397747 400805 402393 402762 402502 401841 401080 401079 402808 406458
51729 406458 411161 415476 418137 418643 417457 415710 414510 414390 415345 417312 420284 423804 426798 428577 429927
51714 429927 432388 436231 439957 442286 443771 445575 447384 447896 447200 447267 449804 454618 460461 466436 472009
$$ packed form
51824C20400j785j938r07J26J28j9P50J505Q68l49l01O95O40n27m18J912M035
51807C24815L454J021o59o96m8Q09K131L263K791O69j334j751q08P12K750N245
51791C42364P056O812M724K707K408L579M575M129K290q6k220l739m620n109n355
51776C59515m908l066j68J984J925M86M9J688M071N306N032M169L516L234L232
51761C86065L251K870J883N85n41j157j028k24N49M16n01j146j068r80j317j235
51745C86422k7J390J637J044J208K525L548L058J588L69k60o61p61jJ729L650
51729D06458M703M315K661N06j186j747j200j20R55J967K972L520K994J779J350
51714D29927K461L843L726K329J485J804J809N12o96O7K537M814N843N975N573
$$ plain form
51699 472009 476529 479544 481264 482292 483375 485595 489902 495729 500752 502886 502160 500022 497408 494379
51685 494379 491194 488449 486189 483918 481728 480535 480877 482219 483783 485347 486818 487695 487666 487312 487478 488133
51669 488133 488483 488133 487381 486297 484262 480869 476765 472963 469624 466137 462288 458558 455142 451447 447136
51654 447136 443127 440755 440116 439902 438929 437286 435879 435349 435553 435699 434809 432483 429440 426943 425504 424508
51638 424508 423229 421748 420526 419566 418452 416908 414954 412793 410946 410172 410775 412286 414335 417449 422257
51623 422257 428164 433886 439380 446187 455303 465602 475106 483130 490240 496613 501673 505343 508411 511170
51609 511170 512662 511980 509604 506580 502823 497332 490006 482201 475131 468499 461253 453102 444604 436052
51595 436052 427169 418109 410175 404853 402124 400097 396638 391186 384678 377925 370840 363490 357090 352990
$$ packed form
51699D72009M520L015J720J028J083K220M307N827N023K134p26k138k614l029
51685D94379l185k745k260k271k190j193L42J342J564J564J471Q77k9l54J66O55
51669D88133L50l50p52j084k035l393m104l802l339l487l849l730l416l695m311
51654D47136m009k372o39k14r73j643j407n30K04J46q90k326l043k497j439r96
51638D24508j279j481j222r60j114j544j954k161j847p74O03J511K049L114M808
51623D22257N907N722N494O807R116J0299R504Q024P110O373N060L670L068K759
51609E11170J492o82k376l024l757n491p326p805p070o632p246q151q498q552
51595D36052q883r060p934n322k729k027l459n452o508o753p085p350o400m100
$$ plain form
51581 352990 351089 350170 349693 350192 351781 353383 353999 353874 353750 353571 352710 350994 348855 346693 344676 342872
51565 342872 341155 339265 337378 336159 335811 335553 334560 332904 331016 328860 326505 324966 325434 327823 330993
51550 330993 334201 337482 340784 343724 346233 348612 350892 352861 354665 356778 359490 363049 367877 373798
51536 373798 379474 383855 387939 393842 402194 411791 421745 432306 443312 453601 462779 472051 482229
51523 482229 492084 499844 505405 509877 513628 516047 516950 517047 516956 516422 514688 511484 507796 505585 506081 508257
51507 508257 509766 509515 508384 507261 505863 504266 504185 507346 513445 521016 529703 540209 552376 564640
51493 564640 575403 583968 590356 595254 599963 605268 610274 613273 613739 612588 610540 607458 603560 600229
51479 600229 598975 600123 602935 606454 609893 612703 614785 616483 618004 618946 618615 616747 613852 610713 607472
$$ packed form
51581C52990j901r19m77M99J589J602O16j25j24j79q61j716k139k162k017j804
51565C42872j717j890j887j219l48k58r93j656j888k156k355j539M68K389L170
51550C30993L208L281L302K940K509K379K280J969J804K113K712L559M828N921
51536C73798N676M381M084N903Q352R597R954J0561J1006J0289R178R272J0178
51523D82229R855P760N561M472L751K419R03R7r1n34j734l204l688k211M96K176
51507E08257J509k51j131j123j398j597q1L161O099P571Q687J0506J2167J2264
51493E64640J0763Q565O388M898M709N305N006K999M66j151k048l082l898l331
51479F00229j254J148K812L519L439K810K082J698J521R42l31j868k895l139l241
$$ plain form
51464 607472 603373 597763 591367 585932 582308 579343 575121 568936 561760 555188 550289 546888 543445 538170
51450 538170 530958 523895 519188 516964 515635 513965 511851 509535 507088 504657 502393 500153 497968 496660
51436 496660 497080 498766 500180 500380 499673 498579 497047 495056 493221 492312 492586 493866 495907 498406 501019
51421 501019 503708 506984 511598 517875 525150 531937 537082 540994 545285 551004 557904 565770 575280 586524
51407 586524 597601 606381 613346 621069 630724 640619 648580 654301 658581 661542 662873 663245 664182 666410
51393 666410 668920 669888 668353 665095 661992 660435 660320 660598 660457 659633 657911 654920 650285 643515 634041
51378 634041 622077 609154 597010 586082 575933 566798 559440 553369 546544 537453 526632 515780
51366 515780 506243 498709 493333 489399 485657 481633 478149 476139 475607 476101 477389 479177 480980 482951 486104
$$ packed form
51464F07472m099n610o396n435l624k965m222o185p176o572m899l401l443n275
51450E38170p212p063m707k224j329j670k114k316k447k431k264k240k185j308
51436D96660M20J686J414K00p07j094j532j991j835r09K74J280K041K499K613
51421E01019K689L276M614O277P275O787N145L912M291N719O900P866R510J1244
51407E86524J1077Q780O965P723R655R895P961N721M280K961J331L72R37K228
51393F66410K510R68j535l258l103j557j15K78j41q24j722k991m635o770r474
51378F34041j1964j2923j2144j0928j0149r135p358o071o825r091j0821j0852
51366E15780r537p534n376l934l742m024l484k010n32M94J288J788J803J971L153
$$ plain form
51351 486104 491042 497226 504076 511901 520664 528506 532789 532509 528931 524022 518994 514009 508376 501079
51337 501079 491848 481661 471643 461789 451486 440934 430962 421533 411574 400608 389618 379794 371142
51324 371142 363038 355641 349941 346345 343810 340693 336196 330762 325134 319445 313457 307300 301400 295712
51310 295712 289729 283568 278471 275586 274444 273216 270576 267015 264179 263002 262592 261157 258204 255496
51296 255496 255265 257640 260642 262769 264444 266364 267624 266716 263859 260918 259050 257561 255425 253029 251903
51281 251903 253200 256695 260967 264491 267045 270085 275156 281921 288497 293934 299468 306767 315719 324805
51267 324805 333141 341067 348875 356119 362523 368594 374651 379850 382956 383789 383166 381584 378769 374594 369656
51252 369656 364578 359401 354003 348519 342830 336164 327911 318485 308741 298898 288894 279553 272304 267473
$$ packed form
51351D86104M938O184O850P825Q763P842M283k80l578m909n028m985n633p297
51337E01079r231j0187j0018r854j0303j0552r972r429r959j0966j0990r824q652
51324C71142q104p397n700l596k535l117m497n434n628n689n988o157n900n688
51310B95712n983o161n097k885j142j228k640l561k836j177m10j435k953k708
51296B55496k31K375L002K127J675J920J260r08k857k941j868j489k136k396j126
51281B51903J297L495M272L524K554L040N071O765O576N437N534P299Q952R086
51267C24805Q336P926P808P244O404O071O057N199L106Q33o23j582k815m175m938
51252C69656n078n177n398n484n689o666q253r426r744r843j0004r341p249m831
$$ plain form
51238 267473 263662 259220 253916 248876 245332 243557 242544 240608 236798 231931 227809 225440 224496 224294 224402
51223 224402 224280 223435 222374 222354 223633 224881 224984 224496 224496 224960 225313 225746 226711 227652 227707 227474 228630 231614
51205 231614 234884 236763 237034 236368 235189 233623 231799 229579 226481 222363 217921 214209 211864 210857 210585
51190 210585 210091 208701 206594 204438 202452 200386 198472 197587 198138 199353 200117 200123 199844 199779 200011 200172 199587
51173 199587 197907 195918 195207 196504 198738 200212 200382 199975 199757 199968 200732 202154 203759 204474 203564 201339
51157 201339 198810 196966 196364 196914 197759 197836 196984 196256 196713 198133 199397 200024 200695 202134 204048 205591 206426
51140 206426 206844 207142 207616 209115 212690 218231 223999 228162 230575 232445 234429 235794 235707 234725 234511 236279
51124 236279 239789 243607 246015 245987 243962 241781 241348 242996 245312 246726 246921 246518 245855 244653 242713 240277
$$ packed form
51238B67473l811m442n304n040l544j775j013j936l810m867m122k369r44k02J08
51223B24402j22q45j061k0J279J248J03m88%M64L53M33R65R41N5k33J156K984
51205B31614L270J879K71o66j179j566j824k220l098m118m442l712k345j007k72
51190B10585m94j390k107k156j986k066j914q85N51J215P64Ok79o5K32J61n85
51173A99587j680j989p11J297K234J474J70m07k18K11P64J422J605P15r10k225
51157B01339k529j844o02N50Q45P7q52p28M57J420J264O27O71J439J914J543Q35
51140B06426M18K98M74J499L575N541N768M163K413J870J984J365q7r82k14J768
51124B36279L510L818K408k8k025k181m33J648K316J414J95m03o63j202j940k436
$$ plain form
51108 240277 237613 234784 231960 229442 227152 224666 222080 220263 219691 219515 218437 216270 213897 211997 210572
51093 210572 209628 209326 209341 209011 208424 208551 209851 211546 212833 214064 215930 218063 219414 219826 220303 221649
51077 221649 223557 225230 226328 227007 227412 227450 226971 226001 224799 223705 222881 222176 221196 219453 216650 213115
51061 213115 209881 207908 207128 206628 205803 204833 204001 203269 202789 202997 203690 203727 202435 200687 199756 199613 199340 198759
51043 198759 198453 198366 197763 196791 196823 198727 201770 204823 207717 210719 213474 215432 216917 218776 221063 222898
51027 222898 223689 223910 224434 225546 226919 228344 230210 233141 237106 240996 243361 243686 242775 241917 241945 243145
51011 243145 245460 248351 250819 252222 252998 254134 256040 258401 260958 263714 266244 267623 267557 267031 267225
50996 267225 268110 268807 269125 269864 271463 273160 273994 274092 274332 274986 275276 274340 272210 269802 268089 267249 266501
$$ packed form
51108B40277k664k829k824k518k290k486k586j817n72j76j078k167k373j900j425
51093B10572r44l02J5l30n87J27J300J695J287J231J866K133J351M12M77J346
51077B21649J908J673J098O79M05L8m79r70j202j094q24p05r80j743k803l535
51061B13115l234j973p80n00q25r70q32p32m80K08O93L7j292j748r31j43k73n81
51043A98759l06q7o03r72L2J904L043L053K894L002K755J958J485J859K287J835
51027B22898P91K21N24J112J373J425J866K931L965L890K365L25r11q58K8J200
51011B43145K315K891K468J403P76J136J906K361K557K756K530J379o6n26J94
50996B67225Q85O97L18P39J599J697Q34R8K40O54K90r36k130k408j713q40p48
$$ plain form
50979 266501 265003 263058 261975 262435 263510 263943 263934 264730 266660 268665 269886 270672 271661 272854 274167 275929
50963 275929 278030 279268 278575 276543 274901 274686 275633 277224 279487 282713 286983 292069 297430 302364 306515
50948 306515 310189 313790 317178 319987 322404 325129 328645 332920 337604 342089 345645 348142 350545 354155
50934 354155 359402 365813 372973 380898 389614 399050 409324 420514 432148 443571 454944 467289 481355
50921 481355 496952 513552 531126 550137 571032 593816 617964 642818 668395 695605 725372
50910 725372 757874 793023 831093 872066 914882 958658 1004611 1055501 1112680 1174612 1238680
50899 1238680 1303512 1369093 1435484 1502192 1568275 1632454 1693532 1751126 1805557 1856631 1902957
50888 1902957 1942861 1975644 2001738 2022171 2038105 2050349 2058911 2063499 2064603 2063448 2060839 2056963
$$ packed form
50979B66501j498j945j083M60J075M33rP96J930K005J221P86R89J193J313J762
50963B75929K101J238o93k032j642k15R47J591K263L226M270N086N361M934M151
50948C06515L674L601L388K809K417K725L516M275M684M485L556K497K403L610
50934C54155N247O411P160P925Q716R436J0274J1190J1634J1423J1373J2345J4066
50921D81355J5597J6600J7574J9011K0895K2784K4148K4854K5577K7210K9767
50910G25372L2502L5149L8070M0973M2816M3776M5953N0890N7179O1932O4068
50899A238680O4832O5581O6391O6708O6083O4179O1078N7594N4431N1074M6326
50888A902957L9904L2783K6094K0433J5934J2244Q562M588J104j155k609l876
$$ plain form
50876 2056963 2052614 2049297 2047356 2045028 2040338 2033072 2023848 2012141 1996669 1977153 1954114 1927051 1894361
50863 1894361 1855324 1810966 1762727 1711370 1657564 1602351 1546421 1489755 1432665 1376619 1323400
50852 1323400 1273867 1227970 1185489 1146315 1110329 1077409 1047279 1019219 992532 967631 946020
50841 946020 928630 914719 902960 892918 884626 877288 869850 862928 858825 858952 861950 865030 866602
50828 866602 867008 867414 868935 872561 878617 885962 892537 897267 900957 905046 910066 915861 922640 930881 940333
50813 940333 950080 959840 970541 983246 998018 1014303 1032073 1051891 1073824 1096857 1119923 1143426
50801 1143426 1169362 1199621 1234378 1272627 1314200 1360517 1412947 1471089 1533522 1599999 1672073
50790 1672073 1751573 1839240 1935015 2038828 2150580 2269766 2395538 2526965 2663146 2803459
$$ packed form
50876B056963m349l317j941k328m690p266r224j1707j5472j9516k3039k7063l2690
50863A894361l9037m4358m8239n1357n3806n5213n5930n6666n7090n6046n3219
50852A323400m9533m5897m2481l9174l5986l2920l0130k8060k6687k4901k1611
50841I46020j7390j3911j1759j0042q292p338p438o922m103J27K998L080J572
50828H66602M06M06J521L626O056P345O575M730L690M089N020N795O779Q241R452
50813I40333R747R760J0701J2705J4772J6285J7770J9818K1933K3033K3066K3503
50801A143426K5936L0259L4757L8249M1573M6317N2430N8142O2433O6477P2074
50790A672073P9500Q7667R5775J03813J11752J19186J25772J31427J36181J40313
$$ plain form
50780 2803459 2947654 3095087 3243616 3389819 3530552 3663692 3787218 3898542 3995509 4077398
50770 4077398 4144228 4195685 4231723 4253798 4264434 4265676 4258973 4246513 4231522 4216733 4203241 4191124
50758 4191124 4180526 4171715 4164547 4158246 4151324 4141471 4126058 4103080 4071254 4028980 3973960 3904628
50746 3904628 3821754 3727998 3625958 3517274 3403543 3287230 3171118 3057189 2946552 2840343
50736 2840343 2740202 2647770 2564152 2490168 2426817 2374958 2334528 2304690 2285095 2276486 2279427
50725 2279427 2292642 2313523 2340411 2373506 2412955 2456722 2501297 2544188 2584653 2621938 2654076
50714 2654076 2679269 2697656 2710572 2718261 2719405 2713005 2699659 2680493 2655684 2624942 2589001 2549564
50702 2549564 2507658 2462829 2414403 2363102 2310935 2259687 2209926 2161592 2114996 2070833 2029330
$$ packed form
50780B803459J44195J47433J48529J46203J40733J33140J23526J11324R6967Q1889
50770D077398O6830N1457L6038K2075J0636J242o703j2460j4991j4789j3492j2117
50758D191124j0598q811p168o301o922r853j5413k2978l1826m2274n5020o9332
50746C904628q2874r3756j02040j08684j13731j16313j16112j13929j10637j06209
50736B840343j00141r2432q3618p3984o3351n1859m0430k9838j9595q609K941
50725B279427J3215K0881K6888L3095L9449M3767M4575M2891M0465L7285L2138
50714B654076K5193J8387J2916P689J144o400j3346j9166k4809l0742l5941l9437
50702B549564m1906m4829m8426n1301n2167n1248m9761m8334m6596m4163m1503
$$ plain form
50691 2029330 1990093 1953229 1920204 1892886 1871743 1855609 1843229 1834327 1829094 1827624 1830456 1838778
50679 1838778 1853276 1873390 1898536 1929490 1967554 2012895 2064914 2123897 2190839 2265589 2346528
50668 2346528 2432317 2522549 2616344 2711676 2806860 2901428 2994629 3084075 3166897 3241413 3306698
50657 3306698 3361454 3404544 3435980 3456073 3464061 3459063 3442239 3416721 3385385 3349841 3311690 3273395
50645 3273395 3237289 3204521 3175457 3150378 3129338 3111974 3097959 3087202 3079103 3071912 3063184 3050672
50633 3050672 3032670 3008018 2976236 2937584 2892645 2842075 2786959 2729331 2672009 2617702 2568196
50622 2568196 2524345 2486835 2456738 2435008 2421569 2415592 2417009 2427200 2447745 2479019 2520719 2573282
50610 2573282 2637814 2714741 2803377 2902739 3011875 3129270 3252794 3380434 3510281 3639545
$$ packed form
50691B029330l9237l6864l3025k7318k1143j6134j2380q902n233j470K832Q322
50679A838778J4498K0114K5146L0954L8064M5341N2019N8983O6942P4750Q0939
50668B346528Q5789R0232R3795R5332R5184R4568R3201Q9446Q2822P4516O5285
50657C306698N4756M3090L1436K0093P988m998j6824k5518l1336l5544l8151l8295
50645C273395l6106l2768k9064k5079k1040j7364j4015j0757q099p191q728j2512
50633C050672j8002k4652l1782l8652m4939n0570n5116n7628n7322n4307m9506
50622B568196m3851l7510l0097k1730j3439n977J417J0191K0545L1274M1700N2563
50610B573282O4532P6927Q8636R9362J09136J17395J23524J27640J29847J29264
$$ plain form
50600 3639545 3764571 3882352 3991397 4090778 4179168 4255518 4319926 4373017 4414856 4445109 4463875
50589 4463875 4471642 4468840 4456224 4435426 4408255 4375554 4337520 4295025 4249799 4203340 4156712 4111659
50577 4111659 4070875 4036526 4009108 3988282 3974095 3966496 3964153 3964786 3966777 3969793 3973756 3977824 3980512
50564 3980512 3980415 3976701 3969314 3958742 3945304 3928968 3910510 3892527 3878018 3867627 3859503 3852521 3848450
50551 3848450 3849832 3856847 3867854 3882253 3900564 3921526 3941254 3956307 3966135 3971403 3971148 3963065 3945822
50538 3945822 3919513 3883995 3838145 3780963 3712446 3633185 3543911 3445866 3341200 3232754 3123528
50527 3123528 3015992 2911294 2809184 2709294 2612582 2521126 2436474 2358597 2286509 2219617 2158469
50516 2158469 2104398 2058190 2018900 1984334 1953201 1926558 1906633 1894476 1889177 1888922 1892089 1897835
$$ packed form
50600C639545J25026J17781J09045R9381Q8390P6350O4408N3091M1839L0253J8766
50589D463875P767k802j2616k0798k7171l2701l8034m2495m5226m6459m6628m5053
50577D111659m0784l4349k7418k0826j4187p599k343O33J991L016L963M068K688
50564C980512r7l714p387j0572j3438j6336j8458j7983j4509j0391q124o982m071
50551C848450J382P015J1007J4399J8311K0962J9728J5053R828N268k55q083j7243
50538C945822k6309l5518m5850n7182o8517p9261q9274r8045j04666j08446j09226
50527C123528j07536j04698j02110r9890r6712r1456q4652p7877p2088o6892o1148
50516B158469n4071m6208l9290l4566l1133k6643j9925j2157n299k55L167N746
$$ plain form
50504 1897835 1906727 1920795 1941826 1969327 2000955 2035186 2072805 2115603 2164462 2219198 2279518
50493 2279518 2345608 2418224 2498548 2587312 2683633 2785313 2890832 3000679 3116142 3237015
50483 3237015 3360790 3483721 3602323 3714403 3819463 3918179 4010982 4097099 4175320 4245727
50473 4245727 4310459 4372630 4434472 4496379 4557557 4617441 4676404 4735260 4794767 4855983 4920598
50462 4920598 4990146 5065034 5144900 5229606 5318977 5411721 5505640 5598876 5689688 5774846 5849818
50451 5849818 5911547 5959959 5995638 6016947 6020722 6005194 5970772 5918243 5847788 5760242 5658322
50440 5658322 5546151 5428070 5307997 5189053 5073353 4962694 4859917 4769178 4694344 4637127
50430 4637127 4596828 4571639 4559951 4560497 4571448 4589534 4610193 4628694 4640941 4643232 4631810 4603299
$$ packed form
50504A897835Q892J4068K1031K7501L1628L4231L7619M2798M8859N4736O0320
50493B279518O6090P2616Q0324Q8764R6321J01680J05519J09847J15463J20873
50483C237015J23775J22931J18602J12080J05060R8716R2803Q6117P8221P0407
50473D245727O4732O2171O1842O1907O1178N9884N8963N8856N9507O1216O4615
50462D920598O9548P4888P9866Q4706Q9371R2744R3919R3236R0812Q5158P4972
50451E849818O1729M8412L5679K1309L775j5528l4422n2529p0455q7546j01920
50440E658322j12171j18081j20073j18944j15700j10659j02777r0739p4834n7217
50430D637127m0299k5189j1688N46J0951J8086K0659J8501J2247K291j1422k8511
$$ plain form
50418 4603299 4555527 4487563 4399204 4291123 4165680 4026953 3879520 3727148 3572595 3418209
50408 3418209 3266370 3119389 2979066 2846298 2721175 2603572 2493600 2391529 2297601 2212217
50398 2212217 2136045 2069445 2011799 1961698 1917774 1879139 1845325 1816376 1792903 1775369 1763188
50387 1763188 1755155 1750980 1751647 1757695 1767673 1779236 1791753 1807108 1827540 1853092 1881520 1910555
50375 1910555 1939914 1971132 2005811 2044246 2085482 2128262 2171785 2215945 2261229 2308295 2357392
50364 2357392 2408065 2459616 2511726 2564347 2616974 2668574 2718689 2768383 2819516 2872865 2927246
50353 2927246 2980752 3032730 3084327 3137307 3192715 3250509 3309782 3368965 3426440 3481736 3536020
50342 3536020 3590662 3645170 3697070 3743870 3784500 3818588 3845211 3863152 3871863 3871125 3859758 3835642
$$ packed form
50418D603299m7772o7964q8359j08081j25443j38727j47433j52372j54553j54386
50408C418209j51839j46981j40323j32768j25123j17603j09972j02071r3928q5384
50398B212217p6172o6600n7646n0101m3924l8635l3814k8949k3473j7534j2181
50387A763188q033m175O67O048R978J1563J2517J5355K0432K5552K8428K9035
50375A910555K9359L1218L4679L8435M1236M2780M3523M4160M5284M7066M9097
50364B357392N0673N1551N2110N2621N2627N1600N0115M9694N1133N3349N4381
50353B927246N3506N1978N1597N2980N5408N7794N9273N9183N7475N5296N4284
50342C536020N4642N4508N1900M6800M0630L4088K6623J7941Q711p38j1367k4116
$$ plain form
50330 3835642 3797472 3746064 3683640 3612119 3532287 3444291 3348752 3247628 3144150 3041615 2942084
50319 2942084 2846512 2756080 2672845 2598866 2535389 2483330 2443697 2416530 2399764 2390415 2387027 2389945
50307 2389945 2398905 2411391 2423860 2433531 2438224 2435552 2423788 2403190 2375111 2339800 2296329 2244901
50295 2244901 2187931 2128328 2067622 2006231 1944599 1883447 1823727 1766927 1714541 1666544 1621285
50284 1621285 1577733 1536869 1499884 1466089 1434126 1404397 1378451 1356382 1336811 1319365 1305034
50273 1305034 1293696 1283451 1273394 1265175 1260475 1258514 1257668 1258413 1262834 1271793 1284214 1298921 1315686
50260 1315686 1334498 1355055 1377132 1400515 1424603 1448896 1473738 1499689 1526370 1552969 1579728
50249 1579728 1607726 1637081 1666618 1695645 1724955 1755470 1786773 1817510 1846494 1872890 1896042
$$ packed form
50330C835642l8170n1408o2424p1521p9832q7996r5539j01124j03478j02535r9531
50319B942084r5572r0432q3235p3979o3477n2059l9633k7167j6766r349l388K918
50307B389945Q960J2486J2469R671M693k672j1764k0598k8079l5311m3471n1428
50295B244901n6970n9603o0706o1391o1632o1152n9720n6800n2386m7997m5259
50284A621285m3552m0864l6985l3795l1963k9729k5946k2069j9571j7446j4331
50273A305034j1338j0245j0057q219m700j961q46P45M421Q959J2421J4707J6765
50260A315686J8812K0557K2077K3383K4088K4293K4842K5951K6681K6599K6759
50249A579728K7998K9355K9537K9027K9310L0515L1303L0737K8984K6396K3152
$$ plain form
50238 1896042 1915813 1932622 1946548 1956822 1962724 1964651 1963784 1960870 1955656 1947297 1935162 1919578 1901907
50225 1901907 1883265 1862992 1839137 1810910 1779808 1747650 1714466 1679499 1643592 1608838 1575919
50214 1575919 1543383 1510078 1476854 1445028 1414439 1384386 1355659 1329985 1307521 1286367 1264914
50203 1264914 1243504 1223218 1204143 1185872 1169061 1155256 1145014 1137007 1129234 1120761 1112282 1105422
50191 1105422 1101526 1100586 1101150 1101557 1101426 1101651 1103058 1105544 1108578 1111932 1115598 1119458 1123307 1126809 1129120
50176 1129120 1129005 1125793 1120035 1113036 1106052 1100067 1095636 1092272 1088478 1083120 1076646 1070243 1064059 1057051
50162 1057051 1048592 1039385 1030554 1022595 1015567 1009680 1005108 1001531 998427 995821 994374 994642 996448 998983
50148 998983 1001409 1003234 1004185 1004077 1003157 1002488 1003339 1005898 1009026 1011661 1013957 1016411 1018372 1018391 1016009 1012276
$$ packed form
50238A896042J9771J6809J3926J0274N902J927q67k914n214q359j2135j5584j7671
50225A901907j8642k0273k3855k8227l1102l2158l3184l4967l5907l4754l2919
50214A575919l2536l3305l3224l1826l0589l0053k8727k5674k2464k1154k1453
50203A264914k1410k0286j9075j8271j6811j3805j0242q007p773q473q479o860
50191A105422l896r40N64M07j31K25J407K486L034L354L666L860L849L502K311
50176A129120j15l212n758o999o984n985m431l364l794n358o474o403o184p008
50162A057051q459r207q831p959p028n887m572l577l104k606j447K68J806K535
50148I98983K426J825R51j08r20o69Q51K559L128K635K296K454J961J9k382l733
$$ plain form
50132 1012276 1008347 1004468 1000563 996939 993788 990614 986757 982006 976306 969463 961890 955033 950064 946220
50118 946220 941378 934441 926442 919079 912808 906779 900232 893456 887425 882783 879281 876219 873417 871455
50104 871455 870672 870188 868559 865469 862204 860167 859431 859068 858411 857375 855797 853132 848947 843380 837177
50089 837177 831518 827610 825825 825204 824384 823123 822381 822705 823284 823095 822436 822523 823833 825569 826769 827409 828329
50072 828329 830529 834531 839915 845403 849818 853186 856698 861592 868381 876933 886683 896680 906116 915109
50058 915109 924565 935097 946483 958276 970278 982169 993361 1003633 1013336 1022490 1030340 1036442
50046 1036442 1041671 1047370 1053834 1060342 1066310 1071492 1075304 1077080 1077290 1077686 1079832 1083975 1089601 1096570
50032 1096570 1105273 1115944 1128208 1141318 1154729 1168496 1183096 1198780 1215308 1232486 1250674
$$ packed form
50132A012276l929l879l905l624l151l174l857m751n700o843p573o857m969l844
50118I46220m842o937p999p363o271o029o547o776o031m642l502l062k802j962
50104H71455p83m84j629l090l265k037p36l63o57j036j578k665m185n567o203
50089H37177n659l908j785o21q20j261p42L24N79j89o59Q7J310J736J200O40R20
50072H28329K200M002N384N488M415L368L512M894O789Q552R750R997R436Q993
50058I15109R456J0532J1386J1793J2002J1891J1192J0272R703R154P850O102
50046A036442N229N699O464O508N968N182L812J776K10L96K146M143N626O969
50032A096570Q703J0671J2264J3110J3411J3767J4600J5684J6528J7178J8188
$$ plain form
50021 1250674 1270412 1291687 1314038 1337307 1361898 1388378 1417061 1447777 1479679 1511667 1543595
50010 1543595 1576715 1612192 1649522 1687487 1726637 1769484 1817733 1870355 1925206 1981794 2041578
49999 2041578 2106073 2175745 2250742 2331774 2419810 2515289 2618074 2728328 2847256 2976496
49989 2976496 3116200 3263647 3414206 3563637 3708994 3847320 3974561 4086609 4181128 4257899
49979 4257899 4317840 4362455 4394105 4416004 4431480 4442987 4451222 4454678 4450352 4435316 4407393 4364051
49967 4364051 4301568 4216788 4109929 3984876 3846561 3698867 3545211 3389713 3236543 3088407
49957 3088407 2946521 2811856 2685635 2568770 2461702 2364931 2278951 2203224 2135825 2074659
49947 2074659 2018958 1969320 1926441 1889889 1857826 1827840 1798456 1770161 1744576 1722328 1702137
$$ packed form
50021A250674J9738K1275K2351K3269K4591K6480K8683L0716L1902L1988L1928
50010A543595L3120L5477L7330L7965L9150M2847M8249N2622N4851N6588N9784
49999B041578O4495O9672P4997Q1032Q8036R5479J02785J10254J18928J29240
49989B976496J39704J47447J50559J49431J45357J38326J27241J12048R4519P6771
49979D257899N9941M4615L1650K1899J5476J1507Q235L456m326j5036k7923m3342
49967D364051o2483q4780j06859j25053j38315j47694j53656j55498j53170j48136
49957C088407j41886j34665j26221j16865j07068r6771q5980p5727o7399o1166
49947B074659n5701m9638m2879l6552l2063k9986k9384k8295k5585k2248k0191
$$ plain form
49936 1702137 1682281 1662301 1642611 1623051 1602941 1582409 1562509 1543864 1526079 1508723 1491949
49925 1491949 1475906 1460542 1446397 1434384 1424103 1413495 1401356 1389292 1379992 1374195 1370687 1368739
49913 1368739 1368788 1370812 1373844 1377727 1383894 1393483 1405658 1418757 1432547 1448379 1467299 1488689 1510821
49900 1510821 1532436 1553914 1576984 1603101 1631981 1662010 1692135 1723117 1756971 1795574 1839573
49889 1839573 1887944 1938515 1989779 2042695 2100345 2165538 2239138 2320808 2410679 2509908 2620131
49878 2620131 2742951 2879632 3030887 3197058 3378456 3575088 3785719 4007608 4237142
49869 4237142 4470103 4701190 4924237 5133888 5327123 5503123 5662248 5805610 5935073
49860 5935073 6052826 6160615 6259184 6347932 6424818 6486898 6530945 6553235 6549228 6514856 6448720
$$ packed form
49936A702137j9856j9980j9690j9560k0110k0532j9900j8645j7785j7356j6774
49925A491949j6043j5364j4145j2013j0281j0608j2139j2064r300n797l508j948
49913A368739M9K024L032L883O167R589J2175J3099J3790J5832J8920K1390K2132
49900A510821K1615K1478K3070K6117K8880L0029L0125L0982L3854L8603M3999
49889A839573M8371N0571N1264N2916N7650O5193P3600Q1670Q9871R9229J10223
49878B620131J22820J36681J51255J66171J81398J96632K10631K21889K29534
49869D237142K32961K31087K23047K09651J93235J76000J59125J43362J29463
49860E935073J17753J07789R8569Q8748P6886O2080M4047K2290m007l4372o6136
$$ [...]
##END NTUPLES=NMR SPECTRUM
##END=
