##TITLE=coffee_type TORI02-ROVE100A-85-15
COFFEE_meoh_noesyp64 COFFEE_meoh {C:\Bruker\TOPSPIN} Administrator 11
##JCAMPDX= 6.0         $$ Bruker NMR JCAMP-DX V2.0
##DATA TYPE= NMR SPECTRUM
##DATA CLASS= NTUPLES
##ORIGIN= Bruker BioSpin GmbH
##OWNER= Administrator
$$ 1.72 TOPSPIN		Version 2.1
$$ 2012-05-29 13:28:25.720 -0700  Administrator@X
$$ Compression mode = diff/dup
##.OBSERVE FREQUENCY= 400.13188235
##.OBSERVE NUCLEUS= ^1H
##.ACQUISITION MODE= SIMULTANEOUS (DQD)
##.ACQUISITION SCHEME= undefined
##.AVERAGES= 64
##.DIGITISER RES= 22
##SPECTROMETER/DATA SYSTEM= spect
##.PULSE SEQUENCE= noesygpps1d.comp
##.SOLVENT NAME= COFFEE_meoh
##.SHIFT REFERENCE= INTERNAL, COFFEE_meoh, 1, 14.98061
##AUDIT TRAIL= $$ (NUMBER, WHEN, WHO, WHERE, PROCESS, VERSION, WHAT)
$$ ##TITLE= Audit trail, TOPSPIN		Version 2.1
$$ ##JCAMPDX= 5.01
$$ ##ORIGIN= Bruker BioSpin GmbH
$$ ##OWNER= Administrator
$$ $$ Z:/data/jwist/nmr/12-COFFEE-0203/132/pdata/1/auditp.txt
$$ ##AUDIT TRAIL=  $$ (NUMBER, WHEN, WHO, WHERE, PROCESS, VERSION, WHAT)
(   1,<2012-03-03 00:08:27.100 -0500>,<Administrator>,<TOPSPIN>,<go>,<TOPSPIN 2.1>,
      <created by zg
	started at 2012-03-02 23:56:56.740 -0500,
	POWCHK enabled, PULCHK disabled,
       configuration hash MD5:
       1A 1E CE 29 27 FD 77 03 67 4E F0 E3 C4 B2 CB 90
       data hash MD5: 64K
       F7 AC F7 0B FC FC BF 8B 5A 72 B9 83 24 8A 28 8F>)
(   2,<2012-03-03 00:08:31.771 -0500>,<Administrator>,<TOPSPIN>,<audit>,<TOPSPIN 2.1>,
      <user comment:
       ICON-NMR User ID: Administrator
       data hash MD5: 64K
       F7 AC F7 0B FC FC BF 8B 5A 72 B9 83 24 8A 28 8F>)
(   3,<2012-05-29 09:24:46.003 -0700>,<Administrator>,<X>,<proc1d>,<TOPSPIN 2.1>,
      <Start of raw data processing
       efp LB = 0.3 FT_mod = 6 PKNL = 1 PHC0 = 0 PHC1 = 0 SI = 128K 
       data hash MD5: 128K
       45 E6 E2 CD A1 26 94 D9 03 3A E5 1F 2E A0 24 51>)
(   4,<2012-05-29 09:24:46.565 -0700>,<Administrator>,<X>,<proc1d>,<TOPSPIN 2.1>,
      <pk PHC0 = 37.54578 PHC1 = 0 
       data hash MD5: 128K
       27 7B 0A 96 80 18 15 3D A3 8C C4 42 66 73 58 69>)
(   5,<2012-05-29 09:24:47.675 -0700>,<Administrator>,<X>,<proc1d>,<TOPSPIN 2.1>,
      <abs ABSG = 1 
       data hash MD5: 128K
       1D FC 75 0C DE 75 2B 7C D2 40 50 D8 2C A5 6C CB>)
(   6,<2012-05-29 09:24:47.753 -0700>,<Administrator>,<X>,<proc1d>,<TOPSPIN 2.1>,
      <abs ABSG = 2 
       data hash MD5: 128K
       A5 C8 1E F6 31 4C 81 68 FF 97 4C 59 22 0D E1 CB>)
(   7,<2012-05-29 09:24:47.847 -0700>,<Administrator>,<X>,<proc1d>,<TOPSPIN 2.1>,
      <abs ABSG = 3 
       data hash MD5: 128K
       D2 31 B0 3C 13 C2 FF 8F 4C 00 F9 F6 26 F5 1D 67>)
(   8,<2012-05-29 09:24:47.925 -0700>,<Administrator>,<X>,<proc1d>,<TOPSPIN 2.1>,
      <abs ABSG = 4 
       data hash MD5: 128K
       16 A7 5C 20 9E 58 3F 42 2B 55 CB 1E C4 26 48 4A>)
(   9,<2012-05-29 09:24:48.003 -0700>,<Administrator>,<X>,<proc1d>,<TOPSPIN 2.1>,
      <abs ABSG = 5 
       data hash MD5: 128K
$$ [...]
150 150 150 150 150 150 150 150
##$TP07= 0
##$TPNAME0= <>
##$TPNAME1= <>
##$TPNAME2= <>
##$TPNAME3= <>
##$TPNAME4= <>
##$TPNAME5= <>
##$TPNAME6= <>
##$TPNAME7= <>
##$TPOAL= (0..7)
0.5 0.5 0.5 0.5 0.5 0.5 0.5 0.5
##$TPOFFS= (0..7)
0 0 0 0 0 0 0 0
##$TUNHIN= 0
##$TUNHOUT= 0
##$TUNXOUT= 0
##$USERA1= <user>
##$USERA2= <user>
##$USERA3= <user>
##$USERA4= <user>
##$USERA5= <user>
##$V9= 5
##$VALIST= <valist>
##$VCLIST= <CCCCCCCCCCCCCCC>
##$VD= 0
##$VDLIST= <DDDDDDDDDDDDDDD>
##$VPLIST= <PPPPPPPPPPPPPPP>
##$VTLIST= <TTTTTTTTTTTTTTT>
##$WBST= 1024
##$WBSW= 4
##$XGAIN= (0..3)
0 0 0 0
##$XL= 0
##$YL= 0
##$YMAX_a= 14221227
##$YMIN_a= -6731232
##$ZGOPTNS= <>
##$ZL1= 120
##$ZL2= 120
##$ZL3= 120
##$ZL4= 120
##$ABSF1= 14.98061
##$ABSF2= -5.57192
##$ABSG= 5
##$ABSL= 3
##$ALPHA= 0
##$AQORDER= 0
##$ASSFAC= 0
##$ASSFACI= 0
##$ASSFACX= 0
##$ASSWID= 0
##$AUNMP= <proc_prof1d_extract>
##$AXLEFT= 0
##$AXNAME= <>
##$AXNUC= <1H>
##$AXRIGHT= 0
##$AXTYPE= 0
##$AXUNIT= <>
##$AZFE= 0.1
##$AZFW= 0.1
##$BCFW= 0
##$BC_mod= 0
##$BYTORDP= 0
##$COROFFS= 0
##$CY= 15
##$DATMOD= 1
##$DC= 0
##$DFILT= <>
##$DTYPP= 0
##$F1P= 0
##$F2P= 0
##$FCOR= 0.5
##$FTSIZE= 131072
##$FT_mod= 6
##$GAMMA= 0
##$GB= 0
##$INTBC= 1
##$INTSCL= 1
##$ISEN= 128
##$LB= 0.3
##$LEV0= 0
##$LPBIN= 0
##$MAXI= 10000
##$MC2= 0
##$MEAN= 0
##$ME_mod= 0
##$MI= 0
##$NCOEF= 0
##$NC_proc= -3
##$NLEV= 6
##$NOISF1= 0
##$NOISF2= 0
##$NSP= 0
##$NTH_PI= 0
##$NZP= 0
##$OFFSET= 14.98061
##$PC= 1
##$PHC0= 37.54578
##$PHC1= 0
##$PH_mod= 1
##$PKNL= yes
##$PPARMOD= 0
##$PPDIAG= 0
##$PPIPTYP= 0
##$PPMPNUM= 2147483647
##$PPRESOL= 1
##$PSCAL= 4
##$PSIGN= 0
##$PYNMP= <proc.py>
##$REVERSE= no
##$SF= 400.13
##$SI= 131072
##$SIGF1= 0
##$SIGF2= 0
##$SINO= 400
##$SIOLD= 131072
##$SPECTYP= <>
##$SREGLST= <1H.CDCl3>
##$SSB= 0
##$STSI= 131072
##$STSR= 0
##$SW_p= 8223.68421052632
##$SYMM= 0
##$S_DEV= 0
##$TDeff= 65536
##$TDoff= 0
##$TI= <>
##$TILT= no
##$TM1= 0
##$TM2= 0
##$TOPLEV= 0
##$USERP1= <user>
##$USERP2= <user>
##$USERP3= <user>
##$USERP4= <user>
##$USERP5= <user>
##$WDW= 1
##$XDIM= 131072
##$YMAX_p= 524123548
##$YMIN_p= -191538129
##$CURPLOT= <Network HP LaserJet P1505>
##$CURPRIN= <$Network HP LaserJet P1505>
##$DFORMAT= <normdp>
##$LAYOUT= <+/1D_H.xwp>
##$LFORMAT= <normlp>
##$PFORMAT= <normpl>
##$SURQMSG= 1
$$ End of Bruker specific parameters
$$ ---------------------------------
##NTUPLES= NMR SPECTRUM
##VAR_NAME=  FREQUENCY,     SPECTRUM/REAL,   SPECTRUM/IMAG
##SYMBOL=    X,             R,               I
##VAR_TYPE=  INDEPENDENT,   DEPENDENT,       DEPENDENT
##VAR_FORM=  AFFN,          ASDF,            ASDF
##VAR_DIM=   131072,        131072,          131072
##UNITS=     HZ,            ARBITRARY UNITS, ARBITRARY UNITS
##FACTOR=    0.0627417313425165, 1,          1
##FIRST=     8223.62146879498, 416,          -91286
##LAST=      0,             2939,            -92957
##MIN=       0,             -191538129,      0
##MAX=       8223.62146879498, 524123548,    0
$$ Real data points
##PAGE= N=1
##DATA TABLE= (X++(R..R)), XYDATA
$$ [...]
62962C113063o117j5704k4913l2638l9005m5217n1827n7820o1610o2562o1274
62951B654376n8630n4857m9582m2612l4654k7057k0670j5016q944k231L965Q508
62939B352596J1837J5436J9963K4424K7462K8977L0095L1712L3528L4576L4458
62928B645064L3722L2926L1671K9059K5105K1009J7598J4071R026K346m850j2069
62916B844678k0078k9335l8899m7569n5337o2709o9202p3614p5708p6436p6457
62905B219334p5396p3010p0093o7552o5081o1558n6566n0904m5769m1907l9461
62894A572037l7975l6416l3817l0117k6124k2549j9527j7087j5374j4130j2644
62883A306277j0819r685j0028j0999j1079j0135r355r275r189q801q947j0033
$$ y = [3113063, 3106946, 3091242, 3066329, 3033691, 2994686, 2949469, 2897642, 2839822, 2778212, 2715650, 2654376, 2595746, 2540889, 2491307, 2448695, 2414041, 2386984, 2366314, 2351298, 2342354, 2340123, 2344088, 2352596, 2364433, 2379869, 2399832, 2424256, 2451718, 2480695, 2510790, 2542502, 2576030, 2610606, 2645064, 2678786, 2711712, 2743383, 2772442, 2797547, 2818556, 2836154, 2850225, 2859251, 2861597, 2856747, 2844678, 2824600, 2795265, 2756366, 2708797, 2653460, 2590751, 2521549, 2447935, 2372227, 2295791, 2219334, 2143938, 2070928, 2000835, 1933283, 1868202, 1806644, 1750078, 1699174, 1653405, 1611498, 1572037, 1534062, 1497646, 1463829, 1433712, 1407588, 1385039, 1365512, 1348425, 1333051, 1318921, 1306277, 1295458, 1285773, 1275745, 1264746, 1253667, 1243532, 1234177, 1224902, 1215713, 1206912, 1197965, 1187932]
62871A187932j0986j0828j0190j0148j0406j0075r477r628j0269j0131r114q577
62859A068103r163r793r384q276p346o737o245n967n923n708n139m575m167l644
62845I76036l127l249l913m099l521l215l631l450j717N8k39k031k575p14J716
62830I42329K465J368l23j670k423k536k198j847j671j468j217j207j426j448
62816I26728j243j410k133k497j519M85K164K670K422K245K135J269p72l017l759
62801I23768k344M4J521J211l56k006k652j741L02K160K707K047J188J011J842
62786I28702L530N249N701M436K665J867J912J581P30M87J263J996J854J384J317
62771I64674J352R44L90J79J11K0O05K412M433M890L359J162l86j260k073k890
$$ y = [1187932, 1176946, 1166118, 1155928, 1145780, 1135374, 1125299, 1115822, 1106194, 1095925, 1085794, 1076680, 1068103, 1058940, 1049147, 1039763, 1031487, 1024141, 1017404, 1011159, 1005192, 999269, 993561, 988422, 983847, 979680, 976036, 972909, 969660, 965747, 961648, 958127, 954912, 951281, 947831, 946114, 946172, 945933, 943902, 941327, 940613, 942329, 944794, 946162, 945839, 944169, 941746, 939210, 937012, 935165, 933494, 932026, 930809, 929602, 928176, 926728, 925485, 924075, 921942, 919445, 917926, 918411, 920575, 923245, 925667, 927912, 930047, 931316, 930544, 927527, 923768, 921424, 921468, 922989, 924200, 923844, 921838, 919186, 917445, 917747, 919907, 922614, 924661, 925849, 926860, 928702, 932232, 937481, 943182, 947618, 950283, 952150, 954062, 955643, 956373, 956860, 958123, 960119, 961973, 963357, 964674, 966026, 966970, 967360, 967539, 967650, 967670, 968275, 970687, 975120, 980010, 983369, 984531, 984145, 982885, 980812, 977922]
62755I77922l170k786k654l953o396p793o187k456L21M74m55j29J604L223L976
62740I51541M271M390M526N717Q879J2802J4886J4461J3800J5210J8427K1692
62728A090602K4166K6165K8000K9802L1923L4531L7186L9657M2665M6939N1918
62717A483554N6315N9737O2857O6281P0170P4700P9827Q4482Q6965Q6455Q3513
62706B294856P8900P2634O4400N4307M2946L1022J9075P178n077j7904l0670m2425
62694B569242n2895o2425p0956p7884q2891q6150q7605q6972q4684q1929p9344
62683A715507p6377p2362o7520o2532n7785n3379m9157m4572l9436l5018l2963
62672A124406l2603l0936k6421k1310j8604j8042j7150j5254j3895j3527j2493
$$ y = [977922, 974752, 971966, 969312, 965359, 958963, 951170, 944983, 942527, 942848, 943322, 942867, 942738, 944342, 947565, 951541, 955812, 960202, 964728, 970445, 979324, 992126, 1007012, 1021473, 1035273, 1050483, 1068910, 1090602, 1114768, 1140933, 1168933, 1198735, 1230658, 1265189, 1302375, 1342032, 1384697, 1431636, 1483554, 1539869, 1599606, 1662463, 1728744, 1798914, 1873614, 1953441, 2037923, 2124888, 2211343, 2294856, 2373756, 2446390, 2510790, 2565097, 2608043, 2639065, 2658140, 2665318, 2660241, 2642337, 2611667, 2569242, 2516347, 2453922, 2382966, 2305082, 2222191, 2136041, 2048436, 1961464, 1876780, 1794851, 1715507, 1639130, 1566768, 1499248, 1436716, 1378931, 1325552, 1276395, 1231823, 1192387, 1157369, 1124406, 1091803, 1060867, 1034446, 1013136, 994532, 976490, 959340, 944086, 930191, 916664, 904171]
62661I04171r910p266o103n828m961l211j117J158L485N151N850O635Q812J2308
62647I09174J5963J8937K1101K2564K3747K5510K8385L1977L5728L9742M4191
62636A217019M8469N1847N4529N7255O0253O3283O6217O8700O9753O8756O6480
62625A892561O4025O0994N5797M7748L7769K6987J5720M002p828j9363l0237l9863
62613B108312m7809n4589o1242o7806p2923p5350p5327p4098p2511p0414o7136
62602A369107o2390n6951n2435m9906m8612m6542m2489l7294l2976l0810l0332
62591H78370k9841k7950k4763k1590j9455j8180j6983j5379j3267j0858r037q862
62579F62205r951j0320q926p427p899r549r709p778n901n432n068l464j673j394
$$ y = [904171, 894261, 886995, 880892, 875064, 870103, 866892, 865775, 866933, 870418, 875569, 881419, 888054, 896866, 909174, 925137, 944074, 965175, 987739, 1011486, 1036996, 1065381, 1097358, 1133086, 1172828, 1217019, 1265488, 1317335, 1371864, 1429119, 1489372, 1552655, 1618872, 1687572, 1757325, 1826081, 1892561, 1956586, 2017580, 2073377, 2121125, 2158894, 2185881, 2201601, 2205603, 2197775, 2178412, 2148175, 2108312, 2060503, 2005914, 1944672, 1876866, 1803943, 1728593, 1653266, 1579168, 1506657, 1436243, 1369107, 1306717, 1249766, 1197331, 1147425, 1098813, 1052271, 1009782, 972488, 939512, 908702, 878370, 848529, 820579, 795816, 774226, 754771, 736591, 719608, 704229, 690962, 680104, 671067, 662205, 652254, 641934, 633008, 625581, 617682, 608133, 598424, 590646, 584745, 579313, 574245, 570781, 569108, 567714]
62565E67714k205k366j551j069j562j999j185O66K337L158L858N658Q415J0111
62551E89980R139O801O152Q116J0342J0721J0403J1797J4773J6786J6449J5199
62539G26658J5231J7202K0299K3502K6177K8097K9453L0658L2020L3671L5667
62528A018635L7860L9890M1618M3200M4510M4879M3765M1190L7185L1446K4204
62517A448382J6636R626K705m900j2776j9799k5657l0789l5209l8458m0489m1530
62505A227742m1400m0038l8369l7468l7021l5881l3865l1657k9161k5717k1977
62494H55188j9776j9565j9614j8487j6787j5704j5293j5116j5307j5766j5454
62483F68319j3739j1633j0466j0042r282q048p036o356n384l839k008j48J488
$$ y = [567714, 565509, 563143, 561592, 560523, 558961, 556962, 555777, 556443, 558780, 561938, 565796, 571454, 579869, 589980, 599119, 605920, 612072, 620188, 630530, 641251, 651654, 663451, 678224, 695010, 711459, 726658, 741889, 759091, 779390, 802892, 829069, 857166, 886619, 917277, 949297, 982968, 1018635, 1056495, 1096385, 1138003, 1181203, 1225713, 1270592, 1314357, 1355547, 1392732, 1424178, 1448382, 1465018, 1474644, 1477349, 1472449, 1459673, 1439874, 1414217, 1383428, 1348219, 1309761, 1269272, 1227742, 1186342, 1146304, 1107935, 1070467, 1033446, 997565, 963700, 932043, 902882, 877165, 855188, 835412, 815847, 796233, 777746, 760959, 745255, 729962, 714846, 699539, 683773, 668319, 654580, 642947, 632481, 622439, 613157, 605109, 598073, 591717, 586333, 582494, 580486, 580338, 581826]
62470E81826K429K646L007M167N545O449P605J0076J2975J3993J2482J0599J0806
62457F84605J3280J6389J8839K0656K2557K5007K7714K9910L1292L2495L4216
62446I56960L6116L7290L7616L7758L7906L7417L5744L2770K8223K1827J4316
62435A313943P184J040m957j1511j7957k3058k6312k8014k8850k9791l1491l3252
62423A086974l3531l1948k9911k8618k7561k5636k2745j9369j5768j2581j1147
62412H28159j1749j2524j1505r104p087n910m827l936m040m600l950j770M88J973
62398G49618L380N100O233O246N962O120O363O519P296Q738R509R015Q847J0521
62384H49467J2827J3147J0759P212L968J228j110k962m631o750r393j1982j4045
$$ y = [581826, 584255, 586901, 589908, 594075, 599620, 606069, 613674, 623750, 636725, 650718, 663200, 673799, 684605, 697885, 714274, 733113, 753769, 776326, 801333, 829047, 858957, 890249, 922744, 956960, 993076, 1030366, 1067982, 1105740, 1143646, 1181063, 1216807, 1249577, 1277800, 1299627, 1313943, 1321127, 1322167, 1317210, 1305699, 1287742, 1264684, 1238372, 1210358, 1181508, 1151717, 1120226, 1086974, 1053443, 1021495, 991584, 962966, 935405, 909769, 887024, 867655, 851887, 839306, 828159, 816410, 803886, 792381, 783277, 776190, 770280, 765453, 761517, 757477, 752877, 748927, 747157, 747645, 749618, 752998, 758098, 764331, 770577, 776539, 782659, 789022, 795541, 802837, 811575, 821084, 830099, 838946, 849467, 862294, 875441, 886200, 893412, 897380, 898608, 897498, 894536, 889905, 883155, 873762, 861780, 847735]
62371H47735j5372j5704j5141j4547j4649j4983j4570j3323j1868j0425q907p637
62359F90609o723n100j794K018L966L689L330M496O348P565Q415R709J0949J1083
62345G48560J0324R859J0182J0863J1672J2791J3962J4412J3717J2107R957P677
62333H86083N967N367N343M525K230o15k420k634k258k642l925m769l762j012
62319H85478J864L395L719M409P028J1757J7128K1156K3220K4698K7382L1305
62307A062539L4989L7866M1285M6490N2598N7685O1285O4526O8038P1050P2813
62296A671164P3641P3864P2622O8602O1550N2303M1720L0349J8884P999k346j2589
62284B157763k2402l0719l7371m3619n0223n5846n8662n9113n9501o0889o1850
$$ y = [847735, 832363, 816659, 801518, 786971, 772322, 757339, 742769, 729446, 717578, 707153, 698246, 690609, 683886, 678786, 676992, 679010, 682976, 686665, 689995, 694491, 700839, 708404, 716819, 726528, 737477, 748560, 758884, 768743, 778925, 789788, 801460, 814251, 828213, 842625, 856342, 868449, 878406, 886083, 892050, 897417, 902760, 907285, 909515, 908900, 906480, 903846, 901588, 898946, 895021, 890252, 886490, 885478, 887342, 890737, 894456, 898865, 905893, 917650, 934778, 955934, 979154, 1003852, 1031234, 1062539, 1097528, 1135394, 1176679, 1223169, 1275767, 1333452, 1394737, 1459263, 1527301, 1598351, 1671164, 1744805, 1818669, 1891291, 1959893, 2021443, 2073746, 2115466, 2145815, 2164699, 2172698, 2170352, 2157763, 2135361, 2104642, 2067271, 2023652, 1973429, 1917583, 1858921, 1799808, 1740307, 1679418, 1617568]
62273A617568o0808n8058n4631n0532m5427m0181l6120l3265l0697k8428k7403
62262A152018k7623k7621k6130k3233j9638j5932j2853j1125j0417r275o659l023
62250I58489L34K305K270M09j890k893k387j863k388l195k993j830q88j069k481
62235I39930m579o141n755l324n20R54J144J178J591K261L416N531Q315J0797
62221I54798J2374J3074J3012J2500J2447J3676J5819J7674J8745J9628K0910
62210A124657K2527K4409K6960L0388L4115L7303L9766M2106M5041M8734N2710
62199A528716N6526O0331O4456O8359P0644P0426O8121O4389N8997N1462M2185
62188B204612L1932K0640P986m987j6271k5264l3565m2635n1551n8043o1269o2559
$$ y = [1617568, 1556760, 1498702, 1444071, 1393539, 1348112, 1307931, 1271811, 1238546, 1207849, 1179421, 1152018, 1124395, 1096774, 1070644, 1047411, 1027773, 1011841, 998988, 987863, 977446, 968171, 961512, 958489, 958823, 961128, 963398, 963807, 961917, 959024, 956637, 954774, 952386, 949191, 946198, 944368, 943480, 942411, 939930, 935351, 929210, 923455, 920131, 919611, 920565, 921709, 922887, 924478, 926739, 930155, 935686, 944001, 954798, 967172, 980246, 993258, 1005758, 1018205, 1031881, 1047700, 1065374, 1084119, 1103747, 1124657, 1147184, 1171593, 1198553, 1228941, 1263056, 1300359, 1340125, 1382231, 1427272, 1476006, 1528716, 1585242, 1645573, 1710029, 1778388, 1849032, 1919458, 1987579, 2051968, 2110965, 2162427, 2204612, 2236544, 2257184, 2265170, 2260183, 2243912, 2218648, 2185083, 2142448, 2090897, 2032854, 1971585, 1909026]
62176A909026o3435o3856o2785n9934n6119n1988m7272m1731l6259l2039k8893
62165A364715k5491k1318j7330j4313j1682q722o001m449l673k455o60N25K69
62152A249415q22j452p90R38K618L289L472M837P782J0246J0247Q903R220J2050
62138A319953J5220J6848J7655J9185K1434K3477K5279K7521L0236L2763L4775
62127A584346L6424L7725L8381L8098L6719L4482L2357L1386L1140K9695K5937
62116A956690K1265J8073J7140J7593J8999K1980K6526L1033L3824L5041L6308
62105B234472L8766M1778M3494M2376L8428L3101K7882K2930J7337J0737M089
62094B555390j458o012j0565j5407j9700k2678k4541k5820k6609k6957k7308k7753
$$ y = [1909026, 1845591, 1781735, 1718950, 1659016, 1602897, 1550909, 1503637, 1461906, 1425647, 1393608, 1364715, 1339224, 1317906, 1300576, 1286263, 1274581, 1265859, 1259858, 1255409, 1251736, 1249281, 1248621, 1249146, 1249415, 1248593, 1247141, 1246351, 1247289, 1249907, 1253196, 1256668, 1261505, 1269287, 1279533, 1289780, 1298683, 1307903, 1319953, 1335173, 1352021, 1369676, 1388861, 1410295, 1433772, 1459051, 1486572, 1516808, 1549571, 1584346, 1620770, 1658495, 1696876, 1734974, 1771693, 1806175, 1838532, 1869918, 1901058, 1930753, 1956690, 1977955, 1996028, 2013168, 2030761, 2049760, 2071740, 2098266, 2129299, 2163123, 2198164, 2234472, 2273238, 2315016, 2358510, 2400886, 2439314, 2472415, 2500297, 2523227, 2540564, 2551301, 2555390, 2553932, 2547920, 2537355, 2521948, 2502248, 2479570, 2455029, 2429209, 2402600, 2375643, 2348335, 2320582]
62082B320582k7301k4884k0919j6887j3495j0366p526n772n175m530l038j419
62070B179270m35N05K195M167N742P687J1135J5381J8418J9614K0392K2190K5074
62057B331335K8333L1145L2578L2333L1669L2346L4507L6852L8844M1143M3684
62046B714769M5251M5662M6539M9003N2146N4943N8028O2124O6070O8324O9432
62035C332291P1287P4446P7902Q0919Q3340Q4335Q2894P9853P7715P7806P8959
62024D201747P9655Q0231Q1951Q4687Q6546Q5662Q1854P6716P2399P0003O8954
62013E070405O8028O6993O6682O7619O9212P0629P1597P1947P1161O9201O7133
62002E830607O5910O4799O2198N7892N3326M9436M5542M1081L7061L4577L2835
$$ y = [2320582, 2293281, 2268397, 2247478, 2230591, 2217096, 2206730, 2199204, 2193432, 2188257, 2183727, 2180689, 2179270, 2178835, 2179340, 2181535, 2185702, 2191444, 2199131, 2210266, 2225647, 2244065, 2263679, 2284071, 2306261, 2331335, 2359668, 2390813, 2423391, 2455724, 2487393, 2519739, 2554246, 2591098, 2629942, 2671085, 2714769, 2760020, 2805682, 2852221, 2901224, 2953370, 3008313, 3066341, 3128465, 3194535, 3262859, 3332291, 3403578, 3478024, 3555926, 3636845, 3720185, 3804520, 3887414, 3967267, 4044982, 4122788, 4201747, 4281402, 4361633, 4443584, 4528271, 4614817, 4700479, 4782333, 4859049, 4931448, 5001451, 5070405, 5138433, 5205426, 5272108, 5339727, 5408939, 5479568, 5551165, 5623112, 5694273, 5763474, 5830607, 5896517, 5961316, 6023514, 6081406, 6134732, 6184168, 6229710, 6270791, 6307852, 6342429, 6375264]
61991F375264L0190K6628K3507K1057J8141J4768J2728J2794J3203J2268J0866
61980F571414J0621J1084J0796J0134J0598J1749J1466R272P070O178N807N133
61968F681322M499L597P00m696j0095j2709j2855j3094j4845j7326j9083j9193
61956F566222j7444j4693j2566j1764j1058r008n912k918N9M049R048J3874J7808
61943F525697K1086K3761K5502K6598K7898K9398K9808K7919K3665J7712J0648
61932F789692K877n269j3517k1417k8257l3573l7479m0153m1410m1532m1879m3650
61920F444433m6220m7767m7588m6873m7039m8152m9231m9603m9605n0079n1170
61909E911106n1724n0546m8382m7539m8852n0160m9026m5951m3303m1818m0148
$$ y = [6375264, 6405454, 6432082, 6455589, 6476646, 6494787, 6509555, 6522283, 6535077, 6548280, 6560548, 6571414, 6582035, 6593119, 6603915, 6614049, 6624647, 6636396, 6647862, 6657134, 6664204, 6670382, 6676189, 6681322, 6685821, 6689418, 6690118, 6685422, 6675327, 6662618, 6649763, 6636669, 6621824, 6604498, 6585415, 6566222, 6548778, 6534085, 6521519, 6509755, 6498697, 6489689, 6483777, 6480859, 6480918, 6484967, 6494015, 6507889, 6525697, 6546783, 6570544, 6596046, 6622644, 6650542, 6679940, 6709748, 6737667, 6761332, 6779044, 6789692, 6792569, 6787300, 6773783, 6752366, 6724109, 6690536, 6653057, 6612904, 6571494, 6529962, 6488083, 6444433, 6398213, 6350446, 6302858, 6255985, 6208946, 6160794, 6111563, 6061960, 6012355, 5962276, 5911106, 5859382, 5808836, 5760454, 5712915, 5664063, 5613903, 5564877, 5518926, 5475623, 5433805, 5393657]
61898E393657l7520l4717l2270k9671k6761k4118k1414j7243j1444n983k304P26
61886E150938N012J0528J5798K0114K3841K7234L0447L4194L8919M3467M6005
61875E446497M6388M6427M7532M9158N0011M9935M9927N0668N1770N2555N3266
61864E994134N5080N8892O4326P0383P6938Q5024R5554J08373J22979J39560J58674
61853G029917J80235K03448K27756K53497K81539L12496L46129L81376M17225
61844I633618M53798M92346N33873N77847O22535O66259P07705P44684P72593
61835A5205258P84309P71779P28219O49318N33378L81848K00997K889j96678l82593
61825A8678724n43868o74348p71736q36627q71737q81249q70294q44217q07210
$$ y = [5393657, 5356137, 5321420, 5289150, 5259479, 5232718, 5208600, 5187186, 5169943, 5158499, 5152516, 5150212, 5150938, 5155950, 5166478, 5182276, 5202390, 5226231, 5253465, 5283912, 5318106, 5357025, 5400492, 5446497, 5492885, 5539312, 5586844, 5636002, 5686013, 5735948, 5785875, 5836543, 5888313, 5940868, 5994134, 6049214, 6108106, 6172432, 6242815, 6319753, 6404777, 6500331, 6608704, 6731683, 6871243, 7029917, 7210152, 7413600, 7641356, 7894853, 8176392, 8488888, 8835017, 9216393, 9633618, 10087416, 10579762, 11113635, 11691482, 12314017, 12980276, 13687981, 14432665, 15205258, 15989567, 16761346, 17489565, 18138883, 18672261, 19054109, 19255106, 19257995, 19061317, 18678724, 18134856, 17460508, 16688772, 15852145, 14980408, 14099159, 13228865, 12384648, 11577438]
61816A1577438p61699p09773o54893o00861n49217m99279m51172m06935l67723
61807F575886l31881k97378k64721k35453k09026j83622j59491j38748j21699
61798D633867j05887q9460p3240n8520m4987l2236k1490j3773p683j018N992J1001
61786D202566J2731J2014R804O044P65n199j1129j6704k1024k2807k2235k1149
61774D123677k0456j8605j3866p043m90M736R059J2325J3557J2786J1200Q991
61762D135871M803j868r294j5725k1595k7954l3651l6132l4787l1694k8649k5071
61750C874254j9483j1770l052N831J4718K3566L2496M2104N2892O4477P6023Q7353
61738D239409R8925J10805J22389J33403J44564J57002J71332J87472K04931K23022
$$ y = [11577438, 10815739, 10105966, 9451073, 8850212, 8300995, 7801716, 7350544, 6943609, 6575886, 6244005, 5946627, 5681906, 5446453, 5237427, 5053805, 4894314, 4755566, 4633867, 4527980, 4438520, 4365280, 4306760, 4261773, 4229537, 4208047, 4194274, 4186591, 4185573, 4191565, 4202566, 4215297, 4227311, 4237115, 4243159, 4243924, 4238725, 4227596, 4210892, 4189868, 4167061, 4144826, 4123677, 4103221, 4084616, 4070750, 4063707, 4063217, 4067953, 4077012, 4089337, 4102894, 4115680, 4126880, 4135871, 4140674, 4138806, 4129512, 4113787, 4092192, 4064238, 4030587, 3994455, 3959668, 3927974, 3899325, 3874254, 3854771, 3843001, 3839949, 3845780, 3860498, 3884064, 3916560, 3958664, 4011556, 4076033, 4152056, 4239409, 4338334, 4449139, 4571528, 4704931, 4849495, 5006497, 5177829, 5365301, 5570232, 5793254]
61728E793254K41244K59822K79800L02328L28101L57484L90703M27521M67217
61719H847474N09614N55943O08081O66804P31431Q01165Q76050R56184J040611
61710A5593357J127413J214303J298326J375028J438419J481322J494965J468137
61702B6491270J388078J243853J030631P52671M23970O6540k93406o30334r23835
61693B9549438j161310j338329j456859j522513j542444j524699j477897j410279
61685A8115108j328789j239166j146332j053990r64205q78267p97778p24029o56688
61676I325864n94414n36952m85414m40119l99442l61516l26117k94071k65707
61667E622112k40722k18800j99459j81837j65578j51495j40587j32774j27180
$$ y = [5793254, 6034498, 6294320, 6574120, 6876448, 7204549, 7562033, 7952736, 8380257, 8847474, 9357088, 9913031, 10521112, 11187916, 11919347, 12720512, 13596562, 14552746, 15593357, 16720770, 17935073, 19233399, 20608427, 22046846, 23528168, 25023133, 26491270, 27879348, 29123201, 30153832, 30906503, 31330473, 31397013, 31103607, 30473273, 29549438, 28388128, 27049799, 25592940, 24070427, 22527983, 21003284, 19525387, 18115108, 16786319, 15547153, 14400821, 13346831, 12382626, 11504359, 10706581, 9982552, 9325864, 8731450, 8194498, 7709084, 7268965, 6869523, 6508007, 6181890, 5887819, 5622112, 5381390, 5162590, 4963131, 4781294, 4615716, 4464221, 4323634, 4190860, 4063680]
61658D063680j22987j19182j14282j07600j00481r5043r1717q8872q4799p9215
61648C059502p3020o7456o3400o0665n8132n5162n2429n0631m9061m6661m3863
61637B439022m1855m0413l8253l5526l4018l4396l5031l4380l2972l2005l1267
61626B048906k9678k7073k4308k2129k0744j9989j9272j7951j6240j5027j4311
61615A822184j2838j0019p128n562m897l888k573j897j851j647j596l109o541
61602A758638j0317j2675j3299j2850j1940j1026j0471j0052r047p296n695n025
61590A638945m861m126k370M1K606M844O025N471L363Q01j029j533o12J463L923
61575A652951N689O143N697N388O045P891J0657J3619J5813J6641J6389J5809
$$ y = [4063680, 3940693, 3821511, 3707229, 3599629, 3499148, 3404105, 3312388, 3223516, 3138717, 3059502, 2986482, 2919026, 2855626, 2794961, 2736829, 2681667, 2629238, 2578607, 2529546, 2482885, 2439022, 2397167, 2356754, 2318501, 2282975, 2248957, 2214561, 2179530, 2145150, 2112178, 2080173, 2048906, 2019228, 1992155, 1967847, 1945718, 1924974, 1904985, 1885713, 1867762, 1851522, 1836495, 1822184, 1809346, 1799327, 1792199, 1786637, 1781740, 1777852, 1775279, 1773382, 1771531, 1769884, 1768288, 1765179, 1758638, 1748321, 1735646, 1722347, 1709497, 1697557, 1686531, 1676060, 1666008, 1656961, 1649665, 1643970, 1638945, 1634084, 1629958, 1627588, 1627629, 1630235, 1635079, 1641104, 1646575, 1649938, 1650739, 1649710, 1648177, 1647565, 1649028, 1652951, 1658640, 1664783, 1670480, 1675868, 1681913, 1689804, 1700461, 1714080, 1729893, 1746534, 1762923, 1778732]
61563A778732J5261J4507J3184J0860O857R52n586j0681j3655j5871j8508k0639
61551A755413k0702j9177j8287j9105k0376k0561j9803j9274j9385j9460j8779
61540A540504j7349j5667j4114j2588j0923r561r385j0332j0775r125n865l079
61528A411741j976j821j282K19K609N646Q805J1493J3665J5654J7318J8284J9102
61515A519457K0996K4166K7435L0061L2754L6299M0258M3826M6992M9963N2403
61504A924610N4054N5200N5601N4019N0000M5303M2139M0463L8528L5685L3130
61493B428732L1792L1052K9950K8607K7732K7314K6400K4105K0565J6901J3929
61482B707079J1036O899J478l621p325j0595j4732j8988k1340k1270k0273j9504
$$ y = [1778732, 1793993, 1808500, 1821684, 1832544, 1839401, 1840353, 1834767, 1824086, 1810431, 1794560, 1776052, 1755413, 1734711, 1715534, 1697247, 1678142, 1657766, 1637205, 1617402, 1598128, 1578743, 1559283, 1540504, 1523155, 1507488, 1493374, 1480786, 1469863, 1460302, 1450917, 1440585, 1429810, 1420685, 1414820, 1411741, 1409765, 1407944, 1406662, 1406881, 1409490, 1415136, 1423941, 1435434, 1449099, 1464753, 1482071, 1500355, 1519457, 1540453, 1564619, 1592054, 1622115, 1654869, 1691168, 1731426, 1775252, 1822244, 1872207, 1924610, 1978664, 2033864, 2089465, 2143484, 2193484, 2238787, 2280926, 2321389, 2359917, 2395602, 2428732, 2460524, 2491576, 2521526, 2550133, 2577865, 2605179, 2631579, 2655684, 2676249, 2693150, 2707079, 2718115, 2725014, 2726492, 2722871, 2715546, 2704951, 2690219, 2671231, 2649891, 2628621, 2608348, 2588844]
61470B588844j8372j5922j2436q847n306j095M178R907J5095J9497K3979K9545
61458B629067L6160M2981M9767N7335O6216P5708Q4865R3777J03181J13466J24966
61447C477489J38465J54295J71291J87907K04048K20769K38381K56101K73287
61438E322033K89564L03677L13460L17156L13628L01311K78506K45222K03580
61429G888137J55925J03630M8278p144n9122j05045j43374j73375j95276k10025
61419G302609k18300k20381k17213k10566k01580j89946j75157j57739j38833
61410E572894j19483j00872q4108o8914n3496l6780j9896m520R311K2382L4246
61399E150764M3710N1074N8089O5648P2964P9146Q4082Q7405Q8219Q6721Q4868
$$ y = [2588844, 2570472, 2554550, 2542114, 2533267, 2527961, 2526866, 2531044, 2540951, 2556046, 2575543, 2599522, 2629067, 2665227, 2708208, 2757975, 2815310, 2881526, 2957234, 3042099, 3135876, 3239057, 3352523, 3477489, 3615954, 3770249, 3941540, 4129447, 4333495, 4554264, 4792645, 5048746, 5322033, 5611597, 5915274, 6228734, 6545890, 6859518, 7160829, 7439335, 7684557, 7888137, 8044062, 8147692, 8195970, 8188826, 8129704, 8024659, 7881285, 7707910, 7512634, 7302609, 7084309, 6863928, 6646715, 6436149, 6234569, 6044623, 5869466, 5711727, 5572894, 5453411, 5352539, 5268431, 5199517, 5146021, 5109241, 5089345, 5084825, 5094136, 5116518, 5150764, 5194474, 5245548, 5303637, 5369285, 5442249, 5521395, 5605477, 5692882, 5781101, 5867822, 5952690]
61388E952690Q4216Q3937Q2224P9208P7087P7229P8239P7448P3837O8886O4685
61377F799686O1711N8613N4005M8037M2023L6808L1924K6418J9996J2966N508
61366G197695k392j0351j7572k3682k9121l4423l9506m3918m7393m9656n0045
61355F849636m8101m4522m0753l7439l3887k9304k3969j8781j4232j0390p473
61344F540785n897n885p467j0509j4204j6995j7727j6815j5539j4328j2320q528
61332F394571k643N360J5631K8134M2475N8344P5778R4887J15602J37687J60667
61321G126493J83905K07195K30991K55221K78235K97933L13885L26995L36793
61312I557646L40353L34506L17924K90472K52110K03973J49463R2447L4885k2385
$$ y = [5952690, 6036906, 6120843, 6203067, 6282275, 6359362, 6436591, 6514830, 6592278, 6666115, 6735001, 6799686, 6861397, 6920010, 6974015, 7022052, 7064075, 7100883, 7132807, 7159225, 7179221, 7192187, 7197695, 7195303, 7184952, 7167380, 7143698, 7114577, 7080154, 7040648, 6996730, 6949337, 6899681, 6849636, 6801535, 6757013, 6716260, 6678821, 6644934, 6615630, 6591661, 6572880, 6558648, 6548258, 6540785, 6534888, 6529003, 6521536, 6511027, 6496823, 6479828, 6462101, 6445286, 6429747, 6415419, 6403099, 6394571, 6391928, 6397288, 6412919, 6441053, 6483528, 6541872, 6617650, 6712537, 6828139, 6965826, 7126493, 7310398, 7517593, 7748584, 8003805, 8282040, 8579973, 8893858, 9220853, 9557646, 9897999, 10232505, 10550429, 10840901, 11093011, 11296984, 11446447, 11538894, 11573779, 11551394]
61302A1551394p7078j25970j68092k05372k39194k68120k90199l06041l17782
61293I553546l25839l28597l25253l17240l06561k94159k80521k66453k52303
61284F856620k37316k20808k03463j86419j69653j52396j34872j18245j02775
61275E330673q7314p1068n4777l9579k5678j2738p75J0127K0166K9136L6190M1366
61263E175729M6443N2846N9138O2284O1349N8526N6206N4601N2667M9846M5987
61252E775622M0846L4847K9506K5916K3260J9869J5256J0040M279k739j1014j9329
61240E946359k6532l2470l7422m1589m5590n0472n6396o1911o5412o7064o8344
61229E393157o9939p0965p0491o8698o6094o2413n7262n1206m5240l9469l3480
$$ y = [11551394, 11474316, 11348346, 11180254, 10974882, 10735688, 10467568, 10177369, 9871328, 9553546, 9227707, 8899110, 8573857, 8256617, 7950056, 7655897, 7375376, 7108923, 6856620, 6619304, 6398496, 6195033, 6008614, 5838961, 5686565, 5551693, 5433448, 5330673, 5243359, 5172291, 5117514, 5077935, 5052257, 5039519, 5038744, 5048871, 5069037, 5098173, 5134363, 5175729, 5222172, 5275018, 5334156, 5396440, 5457789, 5516315, 5572521, 5627122, 5679789, 5729635, 5775622, 5816468, 5851315, 5880821, 5906737, 5929997, 5949866, 5965122, 5975162, 5979441, 5976702, 5965688, 5946359, 5919827, 5887357, 5849935, 5808346, 5762756, 5712284, 5655888, 5593977, 5528565, 5461501, 5393157, 5323218, 5252253, 5181762, 5113064, 5046970, 4984557, 4927295, 4876089, 4830849, 4791380, 4757900]
61218D757900k7777k3401j9927j5613j0420p144p899j0734j1834j0410q978q918
61206D594845q518o282l650k605k462j177J286L183M089N470Q274J2084J7051
61193D621588K4637L5438M7877O0044P1762Q3598R5093J05371J14663J23477J30523
61182E514071J33187J30172J22192J09573R0725O4047L0422p221m6096q4183j19240
61171E937649j48835j71741j88281j98948k03551k02242j96651j89112j80942
61162D257346j72011j61729j50074j37659j25292j13550j02687r2842q4154p6227
61152C041121o7862n8216m8377m0648l5674l1336k5507j8874j3555r684n321L32
61140B686399N754R689J3036J6971K0746K2827K3098K2401K0687J7416J3392J0309
$$ y = [4757900, 4730123, 4706722, 4686795, 4671182, 4660762, 4653618, 4645719, 4634985, 4623151, 4612741, 4603763, 4594845, 4586327, 4580045, 4576395, 4573790, 4571328, 4570151, 4571437, 4574620, 4578709, 4584179, 4592453, 4604537, 4621588, 4646225, 4681663, 4729540, 4789584, 4861346, 4944944, 5040037, 5145408, 5260071, 5383548, 5514071, 5647258, 5777430, 5899622, 6009195, 6099920, 6163967, 6194389, 6187168, 6141072, 6056889, 5937649, 5788814, 5617073, 5428792, 5229844, 5026293, 4824051, 4627400, 4438288, 4257346, 4085335, 3923606, 3773532, 3635873, 3510581, 3397031, 3294344, 3201502, 3117348, 3041121, 2973259, 2915043, 2866666, 2826018, 2790344, 2759008, 2733501, 2714627, 2701072, 2691388, 2686067, 2686399, 2692153, 2701842, 2714878, 2731849, 2752595, 2775422, 2798520, 2820921, 2841608, 2859024, 2872416, 2882725]
61128B882725Q302N684J598k561n235o852q925j1946j5413j9184k3483k7820l1216
61115B745674l3518l5507l7650l9757m1946m4736m7768m9595m9505m8651m8485
61104B268556m8799m8360m6918m5400m4370m3502m2533m1646m0663l8936l6376
61093A791053l3673l1158k8367k5290k3159k3207k5147k7587k9572l1080l2217
61082A480596l2651l1872k9745k6738k3644k0911j8360j5781j3464j1506r077
61071A246847n471j715L37O18R97K493M163N518P876J1781J5094J5842J5507J6849
61057A336736J9383J9941J7527J4782J4175J5253J6430J7245J7676J7154J5626
61046A521928J4221J3621J2817J0579P011K775k020o946j0390j1175j0418j0366
$$ y = [2882725, 2891027, 2896711, 2898309, 2895748, 2890513, 2883661, 2874736, 2862790, 2847377, 2828193, 2804710, 2776890, 2745674, 2712156, 2676649, 2638999, 2599242, 2557296, 2512560, 2464792, 2415197, 2365692, 2317041, 2268556, 2219757, 2171397, 2124479, 2079079, 2034709, 1991207, 1948674, 1907028, 1866365, 1827429, 1791053, 1757380, 1726222, 1697855, 1672565, 1649406, 1626199, 1601052, 1573465, 1543893, 1512813, 1480596, 1447945, 1416073, 1386328, 1359590, 1335946, 1315035, 1296675, 1280894, 1267430, 1255924, 1246847, 1241376, 1239661, 1239998, 1240616, 1241613, 1244106, 1248269, 1253787, 1261663, 1273444, 1288538, 1304380, 1319887, 1336736, 1356119, 1376060, 1393587, 1408369, 1422544, 1437797, 1454227, 1471472, 1489148, 1506302, 1521928, 1536149, 1549770, 1562587, 1573166, 1580177, 1582952, 1580932, 1573986, 1563596, 1552421, 1542003, 1531637]
61034A531637j1719j3209j3562j2766j1481j0271r541r451r694r821r848j0181
61022A400093j0943j1810j2530j3258j4274j5448j6142j5760j4370j2548j0583
61011A252427q290n855m147l557l213k230j128r32j325j100o6R57J892L368M906
60996A231707N024L686K832L726N366O506P650R882J2917J5642J7533J8510J8388
60983A359369J7633J7757J9618K2005K3057K2657K2453K3940K7222L1094L3785
60972A620590L4405L4251L5825L9956M4886M8763N1700N4606N7448N9874O2374
60961B144678O5369O8265P0624P3231P6721Q0304Q3255Q6500R1153R6602J01718
60950C038420J06949J13442J21092J29243J38387J49148J60543J71288J82029
$$ y = [1531637, 1519918, 1506709, 1493147, 1480381, 1468900, 1458629, 1449088, 1439637, 1429943, 1420122, 1410274, 1400093, 1389150, 1377340, 1364810, 1351552, 1337278, 1321830, 1305688, 1289928, 1275558, 1263010, 1252427, 1244137, 1238282, 1234135, 1230578, 1227365, 1225135, 1224007, 1223075, 1221750, 1220650, 1220584, 1221541, 1223433, 1226801, 1231707, 1236731, 1240417, 1243249, 1246975, 1252341, 1258847, 1266497, 1276379, 1289296, 1304938, 1322471, 1340981, 1359369, 1377002, 1394759, 1414377, 1436382, 1459439, 1482096, 1504549, 1528489, 1555711, 1586805, 1620590, 1654995, 1689246, 1725071, 1765027, 1809913, 1858676, 1910376, 1964982, 2022430, 2082304, 2144678, 2210047, 2278312, 2348936, 2422167, 2498888, 2579192, 2662447, 2748947, 2840100, 2936702, 3038420, 3145369, 3258811, 3379903, 3509146, 3647533, 3796681, 3957224, 4128512, 4310541]
60941D310541J94157K07231K20031K33383K49413K68557K89965L14322L43395
60932F630995L76853M12511M49893M90862N37086N90197O54370P34733Q32414
60923A1709914R44997J072685J219439J386594J570888J771822J995825K249589
60915B3921753K536021K860799L226211L590797L829969L769296L301596K492488
60907D9528930J563584P59056K20113l2076l8548J25586L22729L50984L5223o48960
60897E2186621j543691k408576l059594l434307l563950l514395l349736l121199
60889B8191173k863909k597060k330287k071314j827586j603451j399438j215116
60881A2283012j051755r11856p96395p02594o24762n57884n00209m51909m11928
$$ y = [4310541, 4504698, 4711929, 4931960, 5165343, 5414756, 5683313, 5973278, 6287600, 6630995, 7007848, 7420359, 7870252, 8361114, 8898200, 9488397, 10142767, 10877500, 11709914, 12654911, 13727596, 14947035, 16333629, 17904517, 19676339, 21672164, 23921753, 26457774, 29318573, 32544784, 36135581, 39965550, 43734846, 47036442, 49528930, 51092514, 51851570, 52071683, 52039607, 52001059, 52126645, 52449374, 52800358, 52835581, 52186621, 50642930, 48234354, 45174760, 41740453, 38176503, 34662108, 31312372, 28191173, 25327264, 22730204, 20399917, 18328603, 16501017, 14897566, 13498128, 12283012, 11231257, 10319401, 9523006, 8820412, 8195650, 7637766, 7137557, 6685648, 6273720]
60872F273720l77308l45365l15232k87219k61768k39321k20232k04422j91557
60863C831296j81467j73598j66432j58514j50016j42095j34658j26216j16362
60854B481938j06912r9602r3680q6961p8770p0603o4095n9273n5004n0466m5851
60843A670721m1976l9390l7734l6005l3539l0663k8172k6284k4458k2205j9715
60832A330580j7603j6294j5685j5133j3663j0762p292n113n022n423l960n43K379
60819A216466K966K185J978K325J638m50k423l278l959n738q257j0110j0672j0474
60805A172197j0177r985r915j0002j0244j0504j0418r412p253m675k921k310j842
60792A072539m40J776L917N539P040R046J1737J4591J6734J7844J8577J9690K0778
$$ y = [6273720, 5896412, 5551047, 5235815, 4948596, 4686828, 4447507, 4227275, 4022853, 3831296, 3649829, 3476231, 3309799, 3151285, 3001269, 2859174, 2724516, 2598300, 2481938, 2375026, 2275424, 2181744, 2094783, 2016013, 1945410, 1881315, 1822042, 1767038, 1716572, 1670721, 1628745, 1589355, 1551621, 1515616, 1482077, 1451414, 1423242, 1396958, 1372500, 1350295, 1330580, 1312977, 1296683, 1280998, 1265865, 1252202, 1241440, 1234148, 1229035, 1224013, 1218590, 1214630, 1214087, 1216466, 1219432, 1221617, 1223595, 1225920, 1227558, 1227108, 1224685, 1221407, 1217448, 1211710, 1203453, 1193343, 1182671, 1172197, 1162020, 1152035, 1142120, 1132118, 1121874, 1111370, 1100952, 1091540, 1084287, 1079612, 1076691, 1074381, 1072539, 1072099, 1073875, 1077792, 1083331, 1090371, 1099417, 1111154, 1125745, 1142479, 1160323, 1178900, 1198590, 1219368]
60779A219368K0699J9290J7720J6866J6272J5249J3990J3028J2336J1772J1545
60768A388135J1481J0619Q560O521N845N954N048K640J68r12o12J89P08M60o32
60753A444172j951k737l114l969n640p493r061j0709j2688j4330j5027j5362j6377
60740A325714j7792j7992j6037j2968j0650r804r767r763r475q363n674j799J264
60727A196894J964J397K181N122Q281R696R749J0113J1318J2505J2993J2974J2937
60714A308124J3232J4196J5803J7211J7338J5958J3809J1697J0051R396J0440
60703A457255J3259J6563J8153J6458J2018P444N466O622R027J0452J0233R061
60691A592011P788O994P078P822Q180P239N292L409K089J016k09j647l197m496
$$ y = [1219368, 1240067, 1259357, 1277077, 1293943, 1310215, 1325464, 1339454, 1352482, 1364818, 1376590, 1388135, 1399616, 1410235, 1418795, 1425316, 1431161, 1437115, 1442163, 1444803, 1444971, 1444059, 1443447, 1443636, 1444344, 1444804, 1444172, 1442221, 1439484, 1436370, 1432401, 1426761, 1419268, 1410207, 1399498, 1386810, 1372480, 1357453, 1342091, 1325714, 1307922, 1289930, 1273893, 1260925, 1250275, 1240471, 1230704, 1220941, 1211466, 1203103, 1197429, 1195630, 1196894, 1198858, 1200255, 1202436, 1207558, 1215839, 1225535, 1235284, 1245397, 1256715, 1269220, 1282213, 1295187, 1308124, 1321356, 1335552, 1351355, 1368566, 1385904, 1401862, 1415671, 1427368, 1437419, 1446815, 1457255, 1470514, 1487077, 1505230, 1521688, 1533706, 1541150, 1546616, 1553238, 1562265, 1572717, 1582950, 1592011, 1599799, 1606793, 1613871, 1621693, 1629873, 1637112, 1642404, 1645813, 1647902, 1648918, 1648709, 1647062, 1643865, 1639369]
60677A639369m921m449m183n156o808p639p360p284q407j0135j1405j2124j2816
60664A536682j3513j3702j3084j1725r762p410n206l825l651m564n985p133p558
60651A429564p607q017q955r915j0643j1525j2666j3252j2439j0477q298o256
60639A309514m082j960o66l72j90O66J784K280K062J658J018o03l396o451q649
60624A292613r651r721r267r020j0119j3140j7114k0091k0696j8960j5844j2486
60612A126504r827q338p955q302q826q648o924l887r81P31J770K945L605K707
60598A074574J255J759M741P638Q081O851O307P041P583O861N475M633M954O168
60584A153921P273P101N498L746L181L784M797O109P973R799J0582J0502J0880
$$ y = [1639369, 1634448, 1629999, 1625816, 1620660, 1613852, 1606213, 1598853, 1591569, 1583162, 1573027, 1561622, 1549498, 1536682, 1523169, 1509467, 1496383, 1484658, 1474896, 1467486, 1462280, 1458455, 1454804, 1450240, 1444255, 1437122, 1429564, 1421957, 1413940, 1404985, 1395070, 1384427, 1372902, 1360236, 1346984, 1334545, 1324068, 1315770, 1309514, 1305432, 1303472, 1302806, 1302434, 1302244, 1302910, 1304694, 1306974, 1309036, 1310694, 1311712, 1311109, 1307713, 1301262, 1292613, 1282962, 1273241, 1263974, 1254954, 1244835, 1231695, 1214581, 1194490, 1173794, 1154834, 1138990, 1126504, 1116677, 1108339, 1100384, 1092082, 1083256, 1074608, 1067684, 1063797, 1062816, 1063547, 1065317, 1068262, 1071867, 1074574, 1075829, 1077588, 1082329, 1089967, 1098048, 1104899, 1111206, 1118247, 1125830, 1132691, 1138166, 1142799, 1147753, 1153921, 1161194, 1168295, 1173793, 1177539, 1180720, 1184504, 1189301, 1195410, 1203383, 1213182, 1223764, 1234266, 1245146]
60571A245146J2315J3919J4772J5065J5441J6031J6786J8061K0167K2654K4528
60560A434885K5096K4345K2699K0643J8471J6201J3830J1455Q999O077K642l62
60548A604981j737j502j062j769l807o575r408j1628j2646j2760j3347j5438j8305
60535A494997k0188k0386j9754j9033j7662j4964j1704r454q582p923o461m317
60523A334569j810J251M575O760O845N878N582N876N220L397K224L064N034O527
60509A394992P238P669P603O441M630L538L907N133O052N897M631K815J218K68
60495A462032m6J59P57J381J685J923K660L930N471P651J1128J5461J9433K3040
60481A556665K7635L3509L9093M3459M7899N3433N8390O0329N9210N6555N2391
$$ y = [1245146, 1257461, 1271380, 1286152, 1301217, 1316658, 1332689, 1349475, 1367536, 1387703, 1410357, 1434885, 1459981, 1484326, 1507025, 1527668, 1546139, 1562340, 1576170, 1587625, 1596624, 1602701, 1605343, 1604981, 1603244, 1601742, 1600680, 1598911, 1595104, 1588529, 1579121, 1567493, 1554847, 1542087, 1528740, 1513302, 1494997, 1474809, 1454423, 1434669, 1415636, 1397974, 1383010, 1371306, 1361852, 1353270, 1345347, 1338886, 1334569, 1332759, 1334010, 1338585, 1345345, 1352190, 1358068, 1363650, 1369526, 1374746, 1378143, 1380367, 1383431, 1388465, 1394992, 1402230, 1409899, 1417502, 1423943, 1428573, 1432111, 1436018, 1441151, 1447203, 1453100, 1457731, 1460546, 1461764, 1462032, 1461986, 1462145, 1462902, 1464283, 1465968, 1467891, 1470551, 1474481, 1479952, 1487603, 1498731, 1514192, 1533625, 1556665, 1584300, 1617809, 1656902, 1700361, 1748260, 1801693, 1860083, 1920412, 1979622, 2036177, 2088568]
60470B088568M5321L5258K3829J2173M81j0232j7987k2144k3995k4454k2678j7867
60458B066273j1087m373J240O138J1211J6951K2848K7584L0356L1880L3323L4709
60446B267053L5604L6900M0263M5806N2134N8983O7927P9826R3336J06947J20976
60435C005755J36524J53842J72834J93855K16571K39142K60140K80541L02352
60426D961556L25792L49402L72659L96604M21093M42145M52358M43587M09530
60417H574726L47265K57921J46579K1458j07383k29480l35265m17303m71796m99869
60407G286853n06918m99391m81581m55462m22985l87262l51380l17173k85543
60398C579158k57056k31560k08000j85431j64083j45121j29559j17318j06934
$$ y = [2088568, 2133889, 2169147, 2192976, 2205149, 2205630, 2195398, 2177411, 2155267, 2131272, 2106818, 2084140, 2066273, 2055186, 2050813, 2052053, 2058191, 2069402, 2086353, 2109201, 2136785, 2167141, 2199021, 2232344, 2267053, 2302657, 2339557, 2379820, 2425626, 2477760, 2536743, 2604670, 2684496, 2777832, 2884779, 3005755, 3142279, 3296121, 3468955, 3662810, 3879381, 4118523, 4378663, 4659204, 4961556, 5287348, 5636750, 6009409, 6406013, 6827106, 7269251, 7721609, 8165196, 8574726, 8921991, 9179912, 9326491, 9347949, 9240566, 9011086, 8675821, 8258518, 7786722, 7286853, 6779935, 6280544, 5798963, 5343501, 4920516, 4533254, 4181874, 3864701, 3579158, 3322102, 3090542, 2882542, 2697111, 2533028, 2387907, 2258348, 2141030, 2034096]
60389B034096r6332q4719p3704o5568o0330n5624m9803m3941l9994l8051l6391
60378A389639l3733l0446k7747k6304k5623k4487k2234j9616j7913j7246j6494
60367A127796j4948j3154j1815j0901j0204r841r543q369n988l575k587l068l814
60354A019989l865l174k104q39P24K659M463N107M279L305L744N155N529M210
60340A049182K895L196M593N689O212O657O972O782O221N665N172M952N484O442
60326A126114O489N117L669L466L910L634K548J387P4j794l463l704k738k017
60312A142692k318l313m600n824o011m364j657M70J566K474L581M306M331L949
60298A135282L233K191J755L095N757P877Q469Q260P988P550P185P847R537J0665
$$ y = [2034096, 1937764, 1853045, 1779341, 1713773, 1653443, 1597819, 1548016, 1504075, 1464081, 1426030, 1389639, 1355906, 1325460, 1297713, 1271409, 1245786, 1221299, 1199065, 1179449, 1161536, 1144290, 1127796, 1112848, 1099694, 1087879, 1076978, 1066774, 1056933, 1047390, 1039021, 1033033, 1029458, 1026871, 1023803, 1019989, 1016124, 1012950, 1010846, 1010007, 1010731, 1013390, 1017853, 1022960, 1027239, 1030544, 1034288, 1039443, 1044972, 1049182, 1052077, 1055273, 1059866, 1065555, 1071767, 1078424, 1085396, 1092178, 1098399, 1104064, 1109236, 1114188, 1119672, 1126114, 1132603, 1137720, 1141389, 1144855, 1148765, 1152399, 1154947, 1156334, 1156408, 1154614, 1151151, 1147447, 1144709, 1142692, 1140374, 1137061, 1132461, 1126637, 1120626, 1116262, 1114605, 1115075, 1116641, 1119115, 1122696, 1127002, 1131333, 1135282, 1138515, 1140706, 1142461, 1145556, 1151313, 1159190, 1167659, 1175919, 1183907, 1191457, 1198642, 1206489, 1216026, 1226691]
60284A226691J0135Q903Q474Q729Q393O874M607K118j30j316q24O77J537P96p56
60269A284908j270M83L858O731P439O440N559N600N527M251K310R02R9j022k678
60254A329137l987m377m497n207o272o602n668m126k977k464k114j616j272j409
60240A276549j804k023j979j723r21Q34L122M761M959M040K833J854J369J694
60226A293565K836M038M357L816L529M479O534Q915J1202J3360J4909J4977J3556
60213A400073J2114J2202J3664J4962J5251J5350J6345J8146J9915K1369K2894
60202A582285K4637K6228K7500K8923L1075L3893L6722L9185M1875M5847N1202
60191A969372N6662O1117O5244P0613P7303Q3613Q8585R3539J00247J08567J16997
$$ y = [1226691, 1236826, 1245729, 1254203, 1262932, 1271325, 1278199, 1282806, 1284924, 1284794, 1283478, 1282654, 1283331, 1284868, 1285664, 1284908, 1283638, 1284121, 1287979, 1294710, 1302149, 1308589, 1314148, 1319748, 1325275, 1329526, 1331836, 1332738, 1332837, 1331815, 1329137, 1325150, 1320773, 1316276, 1311069, 1304797, 1298195, 1292527, 1288401, 1285424, 1282960, 1280846, 1279230, 1277958, 1276549, 1274745, 1272722, 1270743, 1269020, 1268099, 1268933, 1272055, 1276816, 1281775, 1285815, 1288648, 1290502, 1291871, 1293565, 1296401, 1300439, 1304796, 1308612, 1312141, 1316620, 1323154, 1332069, 1343271, 1356631, 1371540, 1386517, 1400073, 1412187, 1424389, 1438053, 1453015, 1468266, 1483616, 1499961, 1518107, 1538022, 1559391, 1582285, 1606922, 1633150, 1660650, 1689573, 1720648, 1754541, 1791263, 1830448, 1872323, 1918170, 1969372, 2026034, 2087151, 2152395, 2223008, 2300311, 2383924, 2472509, 2566048, 2666295, 2774862, 2891859]
60180B891859J24861J32609J40419J47870J54908J61769J67576J70349J69054
60171D261274J64919J59881J54227J46542J35789J22519J07917R2357P5540N7759
60161E478724M0102K3274P094q201k0978k9698l4856l8098l9615l8066l3199k6627
60149E279856j9367j0415R62J3361K5299L7821N2954P0383Q7700J03553J18510
60138E760617J32887J45592J55379J61737J64358J63085J58460J50987J39779
60129G132881J23497J02713P9841N6575L2965R130j3902l5577n6065p4484q8736
60118G268838r8117j04367j08815j10041j05808r6091q2632o6678m8808l0086
60108F417395j1568O880K5745M4198O0749P5119Q7906R8665J05927J09118J08936
$$ y = [2891859, 3016720, 3149329, 3289748, 3437618, 3592526, 3754295, 3921871, 4092220, 4261274, 4426193, 4586074, 4740301, 4886843, 5022632, 5145151, 5253068, 5345425, 5420965, 5478724, 5518826, 5542100, 5549194, 5540993, 5520015, 5490317, 5455461, 5417363, 5377748, 5339682, 5306483, 5279856, 5260489, 5250074, 5251036, 5264397, 5289696, 5327517, 5380471, 5450854, 5538554, 5642107, 5760617, 5893504, 6039096, 6194475, 6356212, 6520570, 6683655, 6842115, 6993102, 7132881, 7256378, 7359091, 7438932, 7495507, 7528472, 7537602, 7523700, 7488123, 7432058, 7357574, 7268838, 7170721, 7066354, 6957539, 6847498, 6741690, 6645599, 6562967, 6496289, 6447481, 6417395, 6405827, 6412707, 6438452, 6482650, 6543399, 6618518, 6706424, 6805089, 6911016, 7020134, 7129070]
60097G129070J05668R8745Q8274P5613O1784M6579L0069J3905K83r641j5562j7143
60085G607644j4526r174k754N144J7120L5082N7654Q1189J03432J25623J50611
60074H157045J79244K09439K38976K68232K99198L32368L65946L98210M29128
60065A0877786M58706M84906N04726N17141N23599N25330N21219N08840M86754
60056A5409007M55109M14674L66129L10260K48223J81443J11409L9207l4754j10011
60046A7390696j84431k53914l14554l64829m04907m34328m51710m56751m51015
60037A4074257m36197m12812l81311l43419l01373k56626k10457j65044j22514
60028A1444504q3006m5114q460K5088N3055P4328Q9077R7442R9024R3581Q1734
$$ y = [7129070, 7234738, 7333483, 7421757, 7497370, 7559154, 7605733, 7635802, 7649707, 7649990, 7640349, 7624787, 7607644, 7593118, 7583944, 7581190, 7586334, 7603454, 7638536, 7696190, 7777379, 7880811, 8006434, 8157045, 8336289, 8545728, 8784704, 9052936, 9352134, 9684502, 10050448, 10448658, 10877786, 11336492, 11821398, 12326124, 12843265, 13366864, 13892194, 14413413, 14922253, 15409007, 15864116, 16278790, 16644919, 16955179, 17203402, 17384845, 17496254, 17535461, 17500707, 17390696, 17206265, 16952351, 16637797, 16272968, 15868061, 15433733, 14982023, 14525272, 14074257, 13638060, 13225248, 12843937, 12500518, 12199145, 11942519, 11732062, 11567018, 11444504, 11361498, 11316384, 11307924, 11333012, 11386067, 11460395, 11549472, 11646914, 11745938, 11839519, 11921253]
60017A1921253O4740M3622J8780r158l8200o5456q9164j09779j28818j47191j65145
60006A1295484j82787j99583k13926k24465k31616k36564k38916k36756k29187
59997I301684k17517k03443j87233j68460j47488j25339j02597p9291n5468l1268
59987G983580o775J7626M1017O2681Q2888J02207J20155J35020J45286J50613
59977H834298J51228J46782J36534J20763J01236P9601N5655K8156k596l4068
59967I617589o3869r1814j18637j43414j63681j77886j86423j90106j88901j82645
59957H110213j72072j58400j42401j24372j04601q3446o1236l8324j4958Q883
59947G219286L3168N7293Q0445J02513J24196J46078J68039J89443K09230K25752
$$ y = [11921253, 11985993, 12029615, 12048395, 12039237, 12001037, 11935581, 11846417, 11736638, 11607820, 11460629, 11295484, 11112697, 10913114, 10699188, 10474723, 10243107, 10006543, 9767627, 9530871, 9301684, 9084167, 8880724, 8693491, 8525031, 8377543, 8252204, 8149607, 8070316, 8014848, 7983580, 7976805, 7994431, 8035448, 8098129, 8181017, 8283224, 8403379, 8538399, 8683685, 8834298, 8985526, 9132308, 9268842, 9389605, 9490841, 9570442, 9626097, 9654253, 9651657, 9617589, 9553720, 9461906, 9343269, 9199855, 9036174, 8858288, 8671865, 8481759, 8292858, 8110213, 7938141, 7779741, 7637340, 7512968, 7408367, 7324921, 7263685, 7225361, 7210403, 7219286, 7252454, 7309747, 7390192, 7492705, 7616901, 7762979, 7931018, 8120461, 8329691, 8555443]
59937H555443K37267K42769K41948K34392K19788J98896J73361J44244J11709
59928A0359817P6460M0337M604l1341o8262j04526j36447j61251j78840j90510
59918I610041j96765j96989j90795j78952j62733j42791j19274r3029o5969l9635
59908H223109j3865J2404L9039O4352Q6827J06358J23451J38046J49807J58956
59898I088484J65874J69890J69375J63516J53777J42966J32742J22360J10312
59889A0419296R6790Q3763P2865O4385N8733N7487O1907P1312Q4286J00883J22222
59878A1293929J48328J78084K11256K48862K90988L35516L79543M21035M58701
59869A3966242M91344N17857N36813N45474N40109N17855M77673M19442L43445
$$ y = [8555443, 8792710, 9035479, 9277427, 9511819, 9731607, 9930503, 10103864, 10248108, 10359817, 10436277, 10476614, 10481218, 10449877, 10381615, 10277089, 10140642, 9979391, 9800551, 9610041, 9413276, 9216287, 9025492, 8846540, 8683807, 8541016, 8421742, 8328713, 8262744, 8223109, 8209244, 8221648, 8260687, 8325039, 8411866, 8518224, 8641675, 8779721, 8929528, 9088484, 9254358, 9424248, 9593623, 9757139, 9910916, 10053882, 10186624, 10308984, 10419296, 10516086, 10599849, 10672714, 10737099, 10795832, 10853319, 10915226, 10986538, 11070824, 11171707, 11293929, 11442257, 11620341, 11831597, 12080459, 12371447, 12706963, 13086506, 13507541, 13966242, 14457586, 14975443, 15512256, 16057730, 16597839, 17115694, 17593367, 18012809, 18356254]
59860A8356254K51494J47581L6670p6347j86047k86183l71438m39279m89568n22984
59850A6420153n40515n43701n34311n13921m84365m48026m06996l62328l14787
59841A2271203k65915k17582j70724j25128q0366l6466O124M6673Q4306J18144
59831A1630269J47302J70760J87465J96491J96711J86553J64823J31795Q8929
59822A3101098L7786j9888q1362j43464k03999k61362l12802l54782l85594m06146
59812A0969485m17695m20442m15063m03651l87856l67625l43278l17326k92354
59803G604195k68261k43511k18269j94263j72118j51051j31297j14672j02177
59794F008576r2509q3720p5457o8990o5588o5000o5105o3175n8131n1477m5509
$$ y = [18356254, 18607748, 18755329, 18791999, 18715652, 18529605, 18243422, 17871984, 17432705, 16943137, 16420153, 15879638, 15335937, 14801626, 14287705, 13803340, 13355314, 12948318, 12585990, 12271203, 12005288, 11787706, 11616982, 11491854, 11411488, 11375022, 11381146, 11427819, 11512125, 11630269, 11777571, 11948331, 12135796, 12332287, 12528998, 12715551, 12880374, 13012169, 13101098, 13138884, 13118996, 13037634, 12894170, 12690171, 12428809, 12116007, 11761225, 11375631, 10969485, 10551790, 10131348, 9716285, 9312634, 8924778, 8557153, 8213875, 7896549, 7604195, 7335934, 7092423, 6874154, 6679891, 6507773, 6356722, 6225425, 6110753, 6008576, 5916067, 5832347, 5756890, 5687900, 5622312, 5557312, 5492207, 5429032, 5370901, 5319424, 5273915]
59783E273915m0962l7049l3218k9847k7538k6912k8896l3955m0878m7379n2191
59772D875090n5780n8810o0777o0661n8230n4217m9325m3429l5902k6766j7300
59761D353893r029k227L891R515J3997J7675K2570L0236L9816M9342N8075O6337
59749D654091P3735P9089Q1910Q2696Q2028Q0405P8545P6609P3340O7352N9133
59738E488933N0745M3600L7694L2698K8691K5945K5199K7918L4846M4569N4939
59727E895777O5845P9037R5265J13536J33363J55682J80713K06857K32997K60342
59717G419414K90494L22762L55006L86369M17355M47258M72574M87900M87257
59708A1086389M64754M15728L38905K38065J21852K034j09052k01399k69713l13849
$$ y = [5273915, 5232953, 5195904, 5162686, 5132839, 5105301, 5078389, 5049493, 5015538, 4974660, 4927281, 4875090, 4819310, 4760500, 4699723, 4639062, 4580832, 4526615, 4477290, 4433861, 4397959, 4371193, 4353893, 4344864, 4342637, 4346528, 4356043, 4370040, 4387715, 4410285, 4440521, 4480337, 4529679, 4587754, 4654091, 4727826, 4806915, 4888825, 4971521, 5053549, 5133954, 5212499, 5289108, 5362448, 5429800, 5488933, 5539678, 5583278, 5620972, 5653670, 5682361, 5708306, 5733505, 5761423, 5796269, 5840838, 5895777, 5961622, 6040659, 6135924, 6249460, 6382823, 6538505, 6719218, 6926075, 7159072, 7419414, 7709908, 8032670, 8387676, 8774045, 9191400, 9638658, 10111232, 10599132, 11086389, 11551143, 11966871, 12305776, 12543841, 12665693, 12667727, 12558675, 12357276, 12087563, 11773714]
59698A1773714l36971l42933l34980l16060k89283k57477k22557j85826j48721
59689I338906j12642p8130m4843j2482J8866M9261P8967J07896J35937J64131
59679I645867J94240K26461K58600K88553L16876L45986L77636M12228M49780
59670A2516227M90130N32371N75394O19022O63901P10555P59128Q09457Q60387
59661A8536572R09402R53842R92111J022972J044494J054747J052885J038622
59653B6605647J011860R74501R31849Q90410Q54635Q27014Q09871Q04333Q07943
59644C4518063Q15995Q25367Q34617Q40232Q35833Q16083P79002P23585O48098
59635D1636875N52830M42616L24564K04472Q7030k2007j16294j91278k44699k75349
$$ y = [11773714, 11436743, 11093810, 10758830, 10442770, 10153487, 9896010, 9673453, 9487627, 9338906, 9226264, 9148134, 9103291, 9090809, 9109675, 9158936, 9237903, 9345799, 9481736, 9645867, 9840107, 10066568, 10325168, 10613721, 10930597, 11276583, 11654219, 12066447, 12516227, 13006357, 13538728, 14114122, 14733144, 15397045, 16107600, 16866728, 17676185, 18536572, 19445974, 20399816, 21391927, 22414899, 23459393, 24514140, 25567025, 26605647, 27617507, 28592008, 29523857, 30414267, 31268902, 32095916, 32905787, 33710120, 34518063, 35334058, 36159425, 36994042, 37834274, 38670107, 39486190, 40265192, 40988777, 41636875, 42189705, 42632321, 42956885, 43161357, 43248387, 43226380, 43110086, 42918808, 42674109, 42398760]
59625D2398760k82726k67656k32075j78329j09201k7761O3861J64960K74640L90294
59615D2194767N08584O27208P44463Q57416R61393J050915J120124J162525J171110
59606E0398505J138827J058974R26435P39988N03840K27089p7392l93157p01235
59597E3821874r83397j225663j419352j560508j649668j691334j691954j658071
59589D1941927j596822j517174j429075j341569j262917j201951j166851j160934
59581C1264634j179839j213115j248466j275301j286517j279073j253587j212967
59573B1315769j160705j099708j032198r60508q87702q16856p49656o86305o26898
59564A3295233n72075n21911m75207m31011l90080l53674l21237k90675k61048
$$ y = [42398760, 42116034, 41848378, 41616303, 41437974, 41328773, 41301012, 41364873, 41529833, 41804473, 42194767, 42703351, 43330559, 44075022, 44932438, 45893831, 46944746, 48064870, 49227395, 50398505, 51537332, 52596306, 53522741, 54262729, 54766569, 54993658, 54916266, 54523109, 53821874, 52838477, 51612814, 50193462, 48632954, 46983286, 45291952, 43599998, 41941927, 40345105, 38827931, 37398856, 36057287, 34794370, 33592419, 32425568, 31264634, 30084795, 28871680, 27623214, 26347913, 25061396, 23782323, 22528736, 21315769, 20155064, 19055356, 18023158, 17062650, 16174948, 15358092, 14608436, 13922131, 13295233, 12723158, 12201247, 11726040, 11295029, 10904949, 10551275, 10230038, 9939363, 9678315]
59555I678315k33625k09951j89877j72254j56820j44487j36023j31117j28742
59546H175419j28013j28660j30845j34649j39543j44399j48148j50429j51388
59537F919345j50835j47948j42195j34380j26090j17871j08644r7476q5330p4073
59527E734503o4057n3838m2433l0791k0406j1363k531O721J5732K3431K9527L4752
59515E619247M0051M5437M9768N2044N2801N3780N6306O0503O5929P2054P8159
59504F246079Q3940R0547R9859J12075J25112J37265J49482J63868J80704J98288
59494G587219K15307K32051K49504K68444K89368L12010L34593L54835L72073
59485A0215404L87566M02194M14769M23125M25976M22939M13618L97984L77280
$$ y = [9678315, 9444690, 9234739, 9044862, 8872608, 8715788, 8571301, 8435278, 8304161, 8175419, 8047406, 7918746, 7787901, 7653252, 7513709, 7369310, 7221162, 7070733, 6919345, 6768510, 6620562, 6478367, 6343987, 6217897, 6100026, 5991382, 5893906, 5808576, 5734503, 5670446, 5616608, 5574175, 5543384, 5522978, 5511615, 5509084, 5515805, 5531537, 5554968, 5584495, 5619247, 5659298, 5704735, 5754503, 5806547, 5859348, 5913128, 5969434, 6029937, 6095866, 6167920, 6246079, 6330019, 6420566, 6520425, 6632500, 6757612, 6894877, 7044359, 7208227, 7388931, 7587219, 7802526, 8034577, 8284081, 8552525, 8841893, 9153903, 9488496, 9843331, 10215404, 10602970, 11005164, 11419933, 11843058, 12269034, 12691973, 13105591, 13503575, 13880855]
59476A3880855L53258L26177K94602K57798K17653J77610J40202J06294P6232
59467A5830681N0624K9790J3438J517n060n010K216J6137L5663N9538Q6560J15535
59455A6231629J44446J69592J86302J91163J82965J61202J24708P2977Q289o4856
59445A7408417j42397k21877l01082l76686m44672n01498n44805n73642n88278
59436A3713480n89487n78213n56246n26544m91985m54166m14203l73993l35275
59427I393368k97893k60549k23253j87530j54173j22532r2224o3697l6590r234
59417G945693J9204M7485P4207R9746J25296J50996J76079K00041K22787K44281
59407I305815K64683K83868L00179L10782L14007L10117K98984K78560K47056
$$ y = [13880855, 14234113, 14560290, 14854892, 15112690, 15330343, 15507953, 15648155, 15754449, 15830681, 15881305, 15911095, 15924533, 15926050, 15920990, 15915980, 15918196, 15934333, 15969996, 16029534, 16116094, 16231629, 16376075, 16545667, 16731969, 16923132, 17106097, 17267299, 17392007, 17464984, 17473273, 17408417, 17266020, 17044143, 16743061, 16366375, 15921703, 15420205, 14875400, 14301758, 13713480, 13123993, 12545780, 11989534, 11462990, 10971005, 10516839, 10102636, 9728643, 9393368, 9095475, 8834926, 8611673, 8424143, 8269970, 8147438, 8055214, 7991517, 7954927, 7945693, 7964897, 8012382, 8086589, 8186335, 8311631, 8462627, 8638706, 8838747, 9061534, 9305815, 9570498, 9854366, 10154545, 10465327, 10779334, 11089451, 11388435, 11666995, 11914051]
59398A1914051K05364J55632R8652L4809l3060j00180j63314k21787k74756l19588
59388A1295823l54060l78785l96022m06687m09821m04925l93700l78877l61751
59379G811195l41791l18800k94677k72146k52092k33151k13941j94461j75165
59370E514971j56062j37618j21355j08205r6881q5139p2455o0351n0065m0833
59360D586007l0806j9237p468K299R257J4883K1291K9029L7137M4824N1577N5759
59348D794552N5125M9821M3467M0050M0717M4523N0914N9913P0897Q2927R5764
59337E428670J08953J20445J27934J31550J34012J38214J45861J57934J74598
59328F668171J94629K16484K40258K67213K97220L28313L59421L92017M28078
$$ y = [11914051, 12119415, 12275047, 12373699, 12408508, 12375448, 12275268, 12111954, 11890167, 11615411, 11295823, 10941763, 10562978, 10166956, 9760269, 9350448, 8945523, 8551823, 8172946, 7811195, 7469404, 7150604, 6855927, 6583781, 6331689, 6098538, 5884597, 5690136, 5514971, 5358909, 5221291, 5099936, 4991731, 4894850, 4809711, 4737256, 4676905, 4626840, 4586007, 4555201, 4535964, 4528496, 4530795, 4540052, 4554935, 4576226, 4605255, 4642392, 4687216, 4738793, 4794552, 4849677, 4899498, 4942965, 4983015, 5023732, 5068255, 5119169, 5179082, 5249979, 5332906, 5428670, 5537623, 5658068, 5786002, 5917552, 6051564, 6189778, 6335639, 6493573, 6668171, 6862800, 7079284, 7319542, 7586755, 7883975, 8212288, 8571709, 8963726, 9391804]
59319I391804M67586N09186N52445N98001O45552O92838P36862P75551Q07818
59310A5177643Q32336Q46667Q47813Q33666Q04088P60956P07582O47880N85536
59301B2044167N23281M62718M04611L49028K95383K42754J90232J36706Q0622
59292B4729502K0567m3958j12762j85487k60961l36415m08553m75423n36079n88903
59282B1801528o32250o66897o95592p19261p35749p43451p43976p39489p29335
59273A5395528p11648o86975o57827o25465n89564n50690n10780m71118m31764
59264A0159697l93058l55914l20588k86740k54783k25536j98572j72489j46924
59255G805093j22817j00625p9934o0842m3847k8189j2184M260J9257L1804M3305
$$ y = [9391804, 9859390, 10368576, 10921021, 11519022, 12164574, 12857412, 13594274, 14369825, 15177643, 16009979, 16856646, 17704459, 18538125, 19342213, 20103169, 20810751, 21458631, 22044167, 22567448, 23030166, 23434777, 23783805, 24079188, 24321942, 24512174, 24648880, 24729502, 24750069, 24706111, 24593349, 24407862, 24146901, 23810486, 23401933, 22926510, 22390431, 21801528, 21169278, 20502381, 19806789, 19087528, 18351779, 17608328, 16864352, 16124863, 15395528, 14683880, 13996905, 13339078, 12713613, 12124049, 11573359, 11062579, 10591461, 10159697, 9766639, 9410725, 9090137, 8803397, 8548614, 8323078, 8124506, 7952017, 7805093, 7682276, 7581651, 7501717, 7440875, 7397028, 7368839, 7356655, 7360915, 7380172, 7411976, 7455281]
59244G455281N5395O7760P9185Q9264R7933J04441J08226J10037J10971J10891
59234H389384J08676J03610R5758Q5537P3835O2184N1886M3142L5530K9106K4526
59223I103174K2537K3944K9571L9458N2224O6017Q0130R5115J11190J27117J40856
59212I891333J51000J57297J59992J58834J52493J38714J15556Q3405M6032Q898
59202A1063554k4294n3243p9170j02093j20716j34043j41663j42919j37604j27647
59192A0000162j16289j04909r2204p7127o1086m6329l3790k3595j6103j0947o545
59181I411238k411o75l348q895j3566j5416j5021j2733p653P47J2060K6301M4103
59168I414731O5288Q8937J15177J45380J80004K17525K55858K93849L31140L67489
$$ y = [7455281, 7510676, 7578436, 7657621, 7746885, 7844818, 7949259, 8057485, 8167522, 8278493, 8389384, 8498060, 8601670, 8697428, 8782965, 8856800, 8918984, 8970870, 9014012, 9049542, 9078648, 9103174, 9125711, 9149655, 9179226, 9218684, 9270908, 9336925, 9417055, 9512170, 9623360, 9750477, 9891333, 10042333, 10199630, 10359622, 10518456, 10670949, 10809663, 10925219, 11008624, 11054656, 11063554, 11039260, 10986017, 10906847, 10804754, 10684038, 10549995, 10408332, 10265413, 10127809, 10000162, 9883873, 9778964, 9686760, 9609633, 9548547, 9502218, 9468428, 9444833, 9428730, 9417783, 9411238, 9408827, 9408152, 9404804, 9395909, 9382343, 9366927, 9351906, 9339173, 9331520, 9332267, 9344327, 9370628, 9414731, 9480019, 9568956, 9684133, 9829513, 10009517, 10227042, 10482900, 10776749, 11107889, 11475378]
59158A1475378M02087M32612M55144M66197M64426M49124M17927L68183L00435
59149A5231513K18431J25634K4012q3411j91219k93924l87919m70156n36951n85519
59139A3050491o15692o29024o27330o13008n89536n60195n26890m90962m54270
59130G943584m18431l83640l49337l15789k84366k56360k31947k10169j89891
59121E303654j70944j54066j39259j24967j09943r5343q3387p4086o5063n4770
59111D231826m4106l4421k5669j7402r996l717K242Q762J5578K1968K7956L4148
59099D207169M0905M8198N5688O2682O8767P4648Q1461Q9060R6104J02012J07635
59088E034329J13551J19103J23783J28242J32975J37001J38801J37997J35284
$$ y = [11475378, 11877465, 12310077, 12765221, 13231418, 13695844, 14144968, 14562895, 14931078, 15231513, 15449944, 15575578, 15599590, 15516179, 15324960, 15031036, 14643117, 14172961, 13636010, 13050491, 12434799, 11805775, 11178445, 10565437, 9975901, 9415706, 8888816, 8397854, 7943584, 7525153, 7141513, 6792176, 6476387, 6192021, 5935661, 5703714, 5493545, 5303654, 5132710, 4978644, 4839385, 4714418, 4604475, 4509132, 4425745, 4351659, 4286596, 4231826, 4187720, 4153299, 4127630, 4110228, 4100232, 4096515, 4098757, 4107519, 4123097, 4145065, 4173021, 4207169, 4248074, 4296272, 4351960, 4414642, 4483409, 4558057, 4639518, 4728578, 4824682, 4926694, 5034329, 5147880, 5266983, 5390766, 5519008, 5651983, 5788984, 5927785, 6065782, 6201066]
59079F201066J31288J26046J19135J09838R7806Q3809O9328N5175M1156K7167
59069G061814J3915K466o252j1600j3690j3451j1358o554J683J2337K4049L7373
59057G090732N3494P1207Q7818J03118J19653J38464J57361J74423J90485K06657
59047H393412K21979K35459K48266K61559K73761K82256K86573K87703K85181
59038A0776149K76875K61155K37516K05677J65633J18453O5954J0102m6380r9955
59028A1971179j48110j90563k27633k58621k83101l02601l18989l31998l40229
59019I569334l44086l45692l45954l43552l37271l27976l17786l08071k98536
59010F600410k87755k74634k59740k45008k31834k19845k07825j95144j81852
$$ y = [6201066, 6332354, 6458400, 6577535, 6687373, 6785179, 6868988, 6938316, 6993491, 7034647, 7061814, 7075729, 7078195, 7071943, 7060343, 7046653, 7033202, 7021844, 7015290, 7016973, 7029310, 7053359, 7090732, 7144226, 7215433, 7303251, 7406369, 7526022, 7664486, 7821847, 7996270, 8186755, 8393412, 8615391, 8850850, 9099116, 9360675, 9634436, 9916692, 10203265, 10490968, 10776149, 11053024, 11314179, 11551695, 11757372, 11923005, 12041458, 12107412, 12117514, 12071134, 11971179, 11823069, 11632506, 11404873, 11146252, 10863151, 10560550, 10241561, 9909563, 9569334, 9225248, 8879556, 8533602, 8190050, 7852779, 7524803, 7207017, 6898946, 6600410, 6312655, 6038021, 5778281, 5533273, 5301439, 5081594, 4873769, 4678625, 4496773]
59001D496773j68286j55202j43604j33654j24456j15472j07213j00015r3093q5807
58991C269971p8871p3410o9400o5909o2133n7575n2162m6947m3652m2479m1286
58980B636147l7957l2772k7557k3364k0044j7291j4955j2949j1515j0861r930
58969B416952o905j852K503M065M180N587Q535J0705J0448Q435O271M892M284
58956B478100L773K651J121K37M46R30J015J212K145L419M459N507O817P816P972
58941B527620P540O590M540J645n17j226k043m505p666r455r444q659p630o228
58927B490562m611k807p7L876P810J0353J1680J2723J3803J5220J7800K1477K4641
58914B622450K6341K7631K9281L0178K9948L1086L5716M1807M5634M6825M7978
$$ y = [4496773, 4328487, 4173285, 4029681, 3896027, 3771571, 3656099, 3548886, 3448871, 3355778, 3269971, 3191100, 3117690, 3048290, 2982381, 2920248, 2862673, 2810511, 2763564, 2719912, 2677433, 2636147, 2598190, 2565418, 2537861, 2514497, 2494453, 2477162, 2462207, 2449258, 2437743, 2426882, 2416952, 2410047, 2408195, 2410698, 2414763, 2418943, 2424530, 2433065, 2443770, 2454218, 2462653, 2468924, 2473816, 2478100, 2481873, 2484524, 2485645, 2485882, 2486328, 2487258, 2488273, 2489485, 2491630, 2495049, 2499508, 2505015, 2511832, 2519648, 2527620, 2535160, 2541750, 2546290, 2547935, 2547418, 2546192, 2544149, 2539644, 2531978, 2522523, 2513079, 2504420, 2496790, 2490562, 2485951, 2483144, 2483067, 2486943, 2494753, 2505106, 2516786, 2529509, 2543312, 2558532, 2576332, 2597809, 2622450, 2648791, 2676422, 2705703, 2735881, 2765829, 2796915, 2832631, 2874438, 2920072, 2966897, 3014875]
58903C014875N0246N2500N4258N6103N7533N7516N7149N8721O2120O5092O7149
58892C653262P0112P4505P8635Q1905Q5954R1523R7114J01952J07550J14886J22574
58881D679972J29417J36545J45272J54799J63956J73599J85294J98659K11945
58872F179458K24544K37504K52023K68559K86967L06653L27011L48289L71683
58863H802691L98038M27037M57986M90758N25684N63026O02839O44725O87739
58854A3600523P31148P75150Q19904Q64028R05049R41126R71129R92967J003052
58845B1604076R97601R73496R28062Q59264P66456O50168N11540L53126J80109
58836B7823898n15j81705l56324n16476o55334p69986q60866r28459r72603r94981
$$ y = [3014875, 3065121, 3117621, 3171879, 3227982, 3285515, 3343031, 3400180, 3458901, 3521021, 3586113, 3653262, 3723374, 3797879, 3876514, 3958419, 4044373, 4135896, 4233010, 4334962, 4442512, 4557398, 4679972, 4809389, 4945934, 5091206, 5246005, 5409961, 5583560, 5768854, 5967513, 6179458, 6404002, 6641506, 6893529, 7162088, 7449055, 7755708, 8082719, 8431008, 8802691, 9200729, 9627766, 10085752, 10576510, 11102194, 11665220, 12268059, 12912784, 13600523, 14331671, 15106821, 15926725, 16790753, 17695802, 18636928, 19608057, 20601024, 21604076, 22601677, 23575173, 24503235, 25362499, 26128955, 26779123, 27290663, 27643789, 27823898, 27823383, 27641678, 27285354, 26768878, 26113544, 25343558, 24482692, 23554233, 22581630, 21586649]
58826B1586649r99715r90457r68646r35469q93772q46877p96994p45961o96233
58817A3712525o49719o06297n64586n23904m84907m48847m16598l87969l61770
58808I267928l36937l13486k91864k71718k52261k33341k15061j96834j78429
58799F977997j61490j48147j37951j28053j16527j03887r1081p8045o4965n3067
58789E894784m3028l3834k4123j3612k489R429K2032L4409M5836N6680O7649P8868
58777F092601R0100J01375J13008J25424J39030J53651J68321J82371J96535K12120
58767G574536K29325K47317K65645K84459L03799L23886L45826L70690L98205
58758A0343688M27553M58973M93133N29588N67583O07806O51254O96669P41208
$$ y = [21586649, 20586934, 19596477, 18627831, 17692362, 16798590, 15951713, 15154719, 14408758, 13712525, 13062806, 12456509, 11891923, 11368019, 10883112, 10434265, 10017667, 9629698, 9267928, 8930991, 8617505, 8325641, 8053923, 7801662, 7568321, 7353260, 7156426, 6977997, 6816507, 6668360, 6530409, 6402356, 6285829, 6181942, 6090861, 6012816, 5947851, 5894784, 5851756, 5817922, 5793799, 5780187, 5777698, 5787127, 5809159, 5843568, 5889404, 5946084, 6013733, 6092601, 6182701, 6284076, 6397084, 6522508, 6661538, 6815189, 6983510, 7165881, 7362416, 7574536, 7803861, 8051178, 8316823, 8601282, 8905081, 9228967, 9574793, 9945483, 10343688, 10771241, 11230214, 11723347, 12252935, 12820518, 13428324, 14079578, 14776247, 15517455]
58749A5517455P83671Q24853Q64517Q99943R27683R44824R48289R34756R01640
58740B3547631Q46777P67611O62725N34203L86373K22797M7129j33316l08314
58731B6573616m70000o14936p40516q42725r18972r70545j000673j012098j007700
58722A8995451r91020r64472r28749q85339q37777p89266p40824o92926o46952
58713A1518126o03800n62953n24233m88699m56666m26835l98634l73272l51053
58704G331981l29761l07512k85397k65564k48259k32431k17657k03694j89656
58695E052050j75278j61740j49714j38107j26083j14706j04999r6030q6672p7753
58685C820968p0574o4647n8773n3147m8508m4471m0487l7403l6184l6179l6355
$$ y = [15517455, 16301126, 17125979, 17990496, 18890439, 19818122, 20762946, 21711235, 22645991, 23547631, 24394408, 25162019, 25824744, 26358947, 26745320, 26968117, 27015246, 26881930, 26573616, 26103616, 25488680, 24748164, 23905439, 22986467, 22015922, 21015249, 20003151, 18995451, 18004431, 17039959, 16111210, 15225871, 14388094, 13598828, 12858004, 12165078, 11518126, 10914326, 10351373, 9827140, 9338441, 8881775, 8454940, 8056306, 7683034, 7331981, 7002220, 6694708, 6409311, 6143747, 5895488, 5663057, 5445400, 5241706, 5052050, 4876772, 4715032, 4565318, 4427211, 4301128, 4186422, 4081423, 3985393, 3898721, 3820968, 3750394, 3685747, 3626974, 3573827, 3525319, 3480848, 3440361, 3402958, 3366774, 3330595, 3294240]
58674C294240l7269l9855m3209m5513m6529m7275m7876m7595m6722m6586m7600
58663B798211m8598m8362m6998m5807m6200m8356n0812n1897n1598n1078n0564
58652B257941m9286m7489m6401m5848m4130m1042l8663l7976l7150l4601l1447
58641A803908k9262k7555k5544k4248k4564k5032k4000k2462k2384k3387k3500
58630A531970k2169k0235j7962j5372j3653j3892j4905j4366j1667q007m305p89
58618A374648J994L575M509N514O314O560O811P331P095N715M850N943P728Q029
58604A456616O783N220L380Q81r95p74L78k2j950l005k226j201j113r76N05L088
58588A464589N585P143P764Q479J0786J4912J9121K1682K2996K4620K7188L0630
$$ y = [3294240, 3256971, 3217116, 3173907, 3128394, 3081865, 3034590, 2986714, 2939119, 2892397, 2845811, 2798211, 2749613, 2701251, 2654253, 2608446, 2562246, 2513890, 2463078, 2411181, 2359583, 2308505, 2257941, 2208655, 2161166, 2114765, 2068917, 2024787, 1983745, 1945082, 1907106, 1869956, 1835355, 1803908, 1774646, 1747091, 1721547, 1697299, 1672735, 1647703, 1623703, 1601241, 1578857, 1555470, 1531970, 1509801, 1489566, 1471604, 1456232, 1442579, 1428687, 1413782, 1399416, 1387749, 1379742, 1375437, 1374648, 1376642, 1380217, 1384726, 1390240, 1396554, 1403114, 1409925, 1417256, 1424351, 1430066, 1434916, 1440859, 1448587, 1456616, 1463399, 1468619, 1471999, 1472880, 1471885, 1471111, 1471489, 1471467, 1469517, 1466512, 1464286, 1463085, 1461972, 1460996, 1461501, 1464589, 1470174, 1477317, 1485081, 1493560, 1504346, 1519258, 1538379, 1560061, 1583057, 1607677, 1634865, 1665495]
58576A665495L5314M1227M6809N0464N2648N4811N7142N9249O2278O7918P5645
58565B269000Q3122Q9461R6091J04285J13651J23354J33354J44071J55953J69468
58555C481810J84547K00204K15508K30536K45419K59181K70598K79498K85798
58546E653099K87873K83227K70257K48139K15851J73042J21701O5542P977m8385
58536G278323j00956j47413j86512k17692k40340k54326k60663k60800k55905
58527E353716k47472k37365k26316k13496j98570j82927j67954j53587j39689
58518C586340j27162j16301j05652r4147q2883p3304o5158n7775n1539m6464m1245
58507B724710l5633l1718l0567k9696k6449k2052j9510j9143j9342k0415k4426
$$ y = [1665495, 1700809, 1742036, 1788845, 1839309, 1891957, 1946768, 2003910, 2063159, 2125437, 2193355, 2269000, 2352122, 2441583, 2537674, 2641959, 2755610, 2878964, 3012318, 3156389, 3312342, 3481810, 3666357, 3866561, 4082069, 4312605, 4558024, 4817205, 5087803, 5367301, 5653099, 5940972, 6224199, 6494456, 6742595, 6958446, 7131488, 7253189, 7318731, 7326708, 7278323, 7177367, 7029954, 6843442, 6625750, 6385410, 6131084, 5870421, 5609621, 5353716, 5106244, 4868879, 4642563, 4429067, 4230497, 4047570, 3879616, 3726029, 3586340, 3459178, 3342877, 3237225, 3143078, 3060195, 2986891, 2921733, 2863958, 2812419, 2765955, 2724710, 2689077, 2657359, 2626792, 2597096, 2570647, 2548595, 2529085, 2509942, 2490600, 2470185, 2445759]
58496B445759l1836m0976n0024n7197o0261n8730n5575n4028n3669n2139m9210
58485A882114m6106m2385l7044l1663k8624k6917k3581j8845j5843j5249j4257
58474A581600j1414q713p849p721o963o237o711q359j0744j3677j6524j8574k0347
58461A437767k2757k4972k5092k3095k1177k0926k1712k1914k0255j6382j1571
58450A207914q331p760q133p507o398o053n760m373k793k142j102J785M736N200
58436A159283M372N408Q171R860J0242J1831J4932J6768J5952J4150J2630J0699
58424A294298Q160O086M658L031J595J494J894Q33j344k525k589l306m705n041
58410A302539m258l886l717k381j068k488o029q220q389r517j2785j5647j6419
$$ y = [2445759, 2413923, 2372947, 2322923, 2265726, 2205465, 2146735, 2091160, 2037132, 1983463, 1931324, 1882114, 1836008, 1793623, 1756579, 1724916, 1696292, 1669375, 1645794, 1626949, 1611106, 1595857, 1581600, 1570186, 1561473, 1553624, 1545903, 1538940, 1532703, 1525992, 1517633, 1506889, 1493212, 1476688, 1458114, 1437767, 1415010, 1390038, 1364946, 1341851, 1320674, 1299748, 1278036, 1256122, 1235867, 1219485, 1207914, 1199583, 1191823, 1183690, 1176183, 1169785, 1163732, 1157972, 1153599, 1150806, 1148664, 1147562, 1149347, 1154083, 1159283, 1163655, 1169063, 1177234, 1187094, 1197336, 1209167, 1224099, 1240867, 1256819, 1270969, 1283599, 1294298, 1302458, 1308544, 1313202, 1316233, 1317828, 1319322, 1321216, 1322049, 1320705, 1318180, 1315591, 1312285, 1307580, 1302539, 1298281, 1294395, 1290678, 1288297, 1287229, 1284741, 1278712, 1270492, 1262103, 1252586, 1239801, 1224154, 1207735]
58397A207735j6499j6737j5629j2739j0197r211q376o828n814n893n671m431k935
58384A086775q56L011P282Q555O659N505P353R904J0692J0709J1849J3873J5673
58371A196984J6822J6562J3950R983O838M420P67l852o800p373p272o561l555
58358A230913P68L144L749O264J1013J3533J2120J1176J4112J8237K0021K0598
58346A365648K2038K2640K0318J7100J5826J5154J2081P034K522j269n761j0484
58334A482847j3658j5155j6070j6399j5386j3144j0207o808l840k694k828j392
58322A365266L315R726J5102J7693J6425J1282M852O01j243l343o304p620o187
58309A419565m089k622m43K854N150N427N594P052Q678R610J0738J2327J3443
$$ y = [1207735, 1191236, 1174499, 1158870, 1146131, 1135934, 1126723, 1118347, 1111519, 1105705, 1099812, 1094141, 1089710, 1086775, 1085919, 1088930, 1096212, 1104767, 1111426, 1116931, 1124284, 1134188, 1144880, 1155589, 1167438, 1181311, 1196984, 1213806, 1230368, 1244318, 1254301, 1261139, 1265559, 1266326, 1262474, 1255674, 1248301, 1241029, 1234468, 1230913, 1231681, 1234825, 1238574, 1244838, 1255851, 1269384, 1281504, 1292680, 1306792, 1325029, 1345050, 1365648, 1387686, 1410326, 1430644, 1447744, 1463570, 1478724, 1490805, 1497839, 1500361, 1499092, 1493331, 1482847, 1469189, 1454034, 1437964, 1421565, 1406179, 1393035, 1382828, 1376020, 1372180, 1369486, 1366658, 1365266, 1368581, 1378307, 1393409, 1411102, 1427527, 1438809, 1443661, 1444262, 1443019, 1439676, 1433372, 1425752, 1419565, 1415476, 1412854, 1412411, 1415265, 1420415, 1425842, 1431436, 1438488, 1447166, 1456776, 1467514, 1479841, 1493284]
58296A493284J4480J6630J8518J7659J5560J6374J9878K1316J9317J7939J9206
58285A690161J9723J6994J3211J0109N940M12l106l378l699n559n711k641O2L99
58271A732917J900O820J1410J2368J2345J4378J6383J6068J6041J8995K2678K4511
58259A906814K6358K9885L2205L1131K9924L1579L3286L1821K9545K9582K9662
58248B241792K6619K2699K1515K1643J9893J7371J6832J7548J7836J9107K2608
58237B465463K5816K6781K8008L1664L5200L6156L6642L8665M0008L9449M0623
58226B844475M5659N0457N1545N1973N5095N8530O0007O2916O9632P5584P6848
58215C502721P7664Q3313R1264R6637J00712J06505J11565J12978J14207J19221
$$ y = [1493284, 1507764, 1524394, 1542912, 1560571, 1576131, 1592505, 1612383, 1633699, 1653016, 1670955, 1690161, 1709884, 1726878, 1740089, 1750198, 1756138, 1756550, 1753444, 1750066, 1746367, 1740808, 1735097, 1732456, 1732518, 1732917, 1734817, 1741637, 1753047, 1765415, 1777760, 1792138, 1808521, 1824589, 1840630, 1859625, 1882303, 1906814, 1933172, 1963057, 1995262, 2026393, 2056317, 2087896, 2121182, 2153003, 2182548, 2212130, 2241792, 2268411, 2291110, 2312625, 2334268, 2354161, 2371532, 2388364, 2405912, 2423748, 2442855, 2465463, 2491279, 2518060, 2546068, 2577732, 2612932, 2649088, 2685730, 2724395, 2764403, 2803852, 2844475, 2890134, 2940591, 2992136, 3044109, 3099204, 3157734, 3217741, 3280657, 3350289, 3425873, 3502721, 3580385, 3663698, 3754962, 3851599, 3952311, 4058816, 4170381, 4283359, 4397566, 4516787]
58205D516787J24855J26594J26764J29664J34068J37892J44449J56276J68711
58196E766060J77395J86069J99070K12629K21952K30304K42505K56112K67756
58187G759852K81002K98984L16681L30059L45129L68198L94955M19333M44771
58178A0958964M76077N08986N39167N72391O13572O54825O87348P16295P50847
58169A6478472P89013Q25674Q65727R14857R67217J017017J071795J139115J211893
58160B5280780J283055J361925J458172J562777J664733J773096J901410K044040
58152C8329988K190646K350232K536973K746618K972118L227155L527817L868696
58144F1750243M246576M688662N224852N852627O564967P390163Q365429R499821
$$ y = [4516787, 4641642, 4768236, 4895000, 5024664, 5158732, 5296624, 5441073, 5597349, 5766060, 5943455, 6129524, 6328594, 6541223, 6763175, 6993479, 7235984, 7492096, 7759852, 8040854, 8339838, 8656519, 8986578, 9331707, 9699905, 10094860, 10514193, 10958964, 11435041, 11944027, 12483194, 13055585, 13669157, 14323982, 15011330, 15727625, 16478472, 17267485, 18093159, 18958886, 19873743, 20840960, 21857977, 22929772, 24068887, 25280780, 26563835, 27925760, 29383932, 30946709, 32611442, 34384538, 36285948, 38329988, 40520634, 42870866, 45407839, 48154457, 51126575, 54353730, 57881547, 61750243, 65996819, 70685481, 75910333, 81762960, 88327927, 95718090, 104083519, 113583340]
58136A13583340J0809659J2355941J4182731J6240340J8424929K0663919K2932219
58129B29193078K5308006K8126289L1840882L6236903L9589609L9018395L2303725
58122D61616887J9695398L992831j1122407k2940361l0458295l4035686l4705003
58115C52043364l3599389l1588757k9165300k6561112k3915532k1330506j8857078
58108A67025690j6516900j4339034j2352601j0565029q970602p560515o309237
58101I0411772n174583m126334l159022k277833j492791q04885j52824N88285
58093G3811785J443127K143420K213561J357507k48791k084134l657992m735261
58085G0243222n295310n418708n236271m892254m487650m063791l641446l245264
$$ y = [113583340, 124392999, 136748940, 150931671, 167172011, 185596940, 206260859, 229193078, 254501084, 282627373, 314468255, 350705158, 390294767, 429313162, 461616887, 481312285, 485305116, 474182709, 451242348, 420784053, 386748367, 352043364, 318443975, 286855218, 257689918, 231128806, 207213274, 185882768, 167025690, 150508790, 136169756, 123817155, 113252126, 104281524, 96721009, 90411772, 85237189, 81110855, 77951833, 75674000, 74181209, 73376324, 73223500, 73811785, 75254912, 77398332, 79611893, 80969400, 80720609, 78636475, 74978483, 70243222, 64947912, 59529204, 54292933, 49400679, 44913029, 40849238, 37207792, 33962528]
58077C3962528k886945k559305k259429j995912j768894j566262j384291j231158
58069A8310332j106742r99010r03264q25797p65941p12830o62507o20899n87501
58060A1125841n52883n14734m80538m52055m22306l90048l62374l40633l17874
58051G292396k92894k73386k62503k54562k46236k40087k35169k26060k13308
58042E048191k03662j98043j90045j77877j66895j58628j48149j34471j23183
58033C547238j16342j09477j00958r5061r3313r1462q7453q4376q3411q1493p7811
58022B526081p5361p4626p2536o8726o6040o4460o1281n7286n5620n4837n0628
58011A824680m4091m0462l9789l7087l1786k8683k8870k8049k4786k2540k2383
$$ y = [33962528, 31075583, 28516278, 26256849, 24260937, 22492043, 20925781, 19541490, 18310332, 17203590, 16204580, 15301316, 14475519, 13709578, 12996748, 12334241, 11713342, 11125841, 10572958, 10058224, 9577686, 9125631, 8703325, 8313277, 7950903, 7610270, 7292396, 6999502, 6726116, 6463613, 6209051, 5962815, 5722728, 5487559, 5261499, 5048191, 4844529, 4646486, 4456441, 4278564, 4111669, 3953041, 3804892, 3670421, 3547238, 3430896, 3321419, 3220461, 3125400, 3032087, 2940625, 2853172, 2768796, 2685385, 2603892, 2526081, 2450720, 2376094, 2303558, 2234832, 2168792, 2104332, 2043051, 1985765, 1930145, 1875308, 1824680, 1780589, 1740127, 1700338, 1663251, 1631465, 1602782, 1573912, 1545863, 1521077, 1498537, 1476154]
58000A476154k1490j9826k0578k2909k2064j8032j6358j8816k0842j9932j9047
57989A256260j9669j8799j5295j2508j2211j2050j0959j0997j2110j1249q375
57978A112038p123p966p133l917k414m003m702k482p37j882l460l383l374m450
57964A055012m536l161l232n404n975l149l76o03j896j676q90j272k447m075o952
57949A009368r998j0310p953o575p647q507p589o859p369p278o246o893r691j1209
57935H95244r719p952q137q890r283j1054j4187j4977j1282n421N25P537J5203
57922H17607J9352J7744J3823J1473J0015P681N914O433P562P191O292O194N487
57909I42768K957N52J06q4k153m837n826n475n217m869m185m529o232o948n367
$$ y = [1476154, 1454664, 1434838, 1414260, 1391351, 1369287, 1351255, 1334897, 1316081, 1295239, 1275307, 1256260, 1236591, 1217792, 1202497, 1189989, 1177778, 1165728, 1154769, 1143772, 1131662, 1120413, 1112038, 1104915, 1096949, 1089816, 1085899, 1083485, 1079482, 1074780, 1072298, 1071561, 1069679, 1066219, 1062836, 1059462, 1055012, 1050476, 1047315, 1044083, 1038679, 1032704, 1029555, 1029179, 1028576, 1026680, 1025004, 1024114, 1022842, 1020395, 1016320, 1009368, 999370, 989060, 981107, 974532, 966885, 958378, 950789, 943930, 936561, 929283, 923037, 916144, 906453, 895244, 885525, 877573, 869436, 860546, 851263, 840209, 826022, 811045, 799763, 794342, 794867, 802404, 817607, 836959, 854703, 868526, 879999, 890014, 897695, 903609, 910042, 917604, 924795, 931087, 937281, 942768, 945725, 946277, 946383, 946299, 944146, 939309, 933483, 928008, 922791, 917922, 913737, 909208, 902976, 896028, 890661]
57894H90661l872m689o175n939n001n559o970p235o521n973m882k128J014K427
57880H29158K251K003K029J970K250K823K106o44l509m525m553n454p011p830
57866H11064p982q672j0335j2464j4203j4209j1658q217o756p337o949m274j608
57853F96400o65J19K148L896M043M292O192P970P560O314O529P561P520O933P453
57838G74265Q461Q094O424M974M053L079K329K198J850N91q22j875l488n757o700
57823G97676n450m380n629p709q325q245r300j0479r567p129n450m677l252j201
57809G06883K39J380L311N085M816L269L260N640Q423R827R820Q737O847N251
57795G82788N107N804N614L978J763l78k270l361l259k737k875l751n013o817
$$ y = [890661, 886789, 882100, 875925, 869986, 864985, 859426, 852456, 845221, 838700, 832727, 827845, 825717, 826731, 829158, 831409, 833412, 835441, 837411, 839661, 842484, 844590, 843946, 840437, 835912, 831359, 825905, 818894, 811064, 803082, 794410, 784075, 771611, 757408, 743199, 731541, 723324, 716568, 709231, 702282, 698008, 696400, 695735, 695854, 698002, 701898, 705941, 710233, 716425, 724395, 731955, 738269, 744798, 752359, 759879, 766812, 774265, 782726, 790820, 797244, 802218, 806271, 809350, 811679, 813877, 815727, 816318, 815496, 813621, 810133, 804376, 797676, 792226, 787846, 782217, 774508, 766183, 757938, 748638, 738159, 728592, 721463, 716013, 711336, 708084, 706883, 707122, 708502, 711813, 716898, 721714, 724983, 728243, 733883, 742306, 752133, 761953, 770690, 777537, 782788, 787895, 793699, 799313, 803291, 805054, 804676, 802406, 799045, 795786, 793049, 790174, 786423, 781410, 774593]
57781G74593q970j0333j0404j0212j0270r288o594m080l742m776n291n317n719
57768F79597n705m196k558l153n776q081q952r107r007q520q250q925r823r753
57754E77791r027q744q765q243p320o481n210l236j882k127k549j448K32O28L66
57739E13985J471L798N431N944O467P107O982O352O072N602M073K709L216M462
57725E83671L778J263l10L19J758K921M084M869M193K473J312Q18k08j550j981
57710F07410k272m453p957r772q996p835p422o185l508j490j370j327K25J905
57696E46953K032J565K168L330L704L659M235M944M727M125M508N742O355N636
57682F03683M380L751M372O080P866Q532P947P174P106P673Q549R563J0199R840
$$ y = [774593, 765623, 755290, 744886, 734674, 724404, 715116, 708522, 704442, 700700, 695924, 690633, 685316, 679597, 673892, 669696, 667138, 663985, 658209, 650128, 641176, 632069, 623062, 614542, 606292, 597367, 587544, 577791, 568764, 560020, 551255, 543012, 535692, 529211, 524001, 520765, 518883, 516756, 514207, 512759, 512991, 513619, 513985, 515456, 519254, 524685, 530629, 537096, 544203, 551185, 557537, 563609, 569211, 573284, 575993, 579209, 583671, 587449, 588712, 588402, 588721, 590479, 593400, 597484, 602353, 606546, 609019, 610331, 611149, 610941, 609391, 607410, 605138, 600685, 592728, 582956, 573960, 566125, 558703, 552518, 549010, 547520, 546150, 544823, 545048, 546953, 548985, 550550, 552718, 556048, 559752, 563411, 567646, 572590, 577317, 581442, 585950, 591692, 598047, 603683, 608063, 611814, 616186, 622266, 630132, 638664, 646611, 653785, 660891, 668564, 677113, 686676, 696875, 706715]
57668G06715Q999R076J0323J1285J0897J0114J0617J2685J5130J6736J7234J7245
57656H57056J7686J8953K0627K2249K3930K5645K6612K6386K5967K6654K8448
57645A120213L0755L3923L8290M2413M4436M4922M6177M8905N1757N4314N7955
57634A614060O3177O8404P2400P5890P9880Q4266Q9072R5414J04087J14582J26307
57623B587539J39382J53547J67781J81817J96538K12133K27300K40996K53211
57614D360244K63078K67887K65238K54889K37500K13112J82182J46625J08016
57605F298771O5353J6084m0562j01512j60440k10207k46121k67916k78256k79432
57595D795762k72507k59246k42624k24616k05193j84462j64095j45614j28753
$$ y = [706715, 715714, 724790, 735113, 746398, 757295, 767409, 778026, 790711, 805841, 822577, 839811, 857056, 874742, 893695, 914322, 936571, 960501, 986146, 1012758, 1039144, 1065111, 1091765, 1120213, 1150968, 1184891, 1223181, 1265594, 1310030, 1354952, 1401129, 1450034, 1501791, 1556105, 1614060, 1677237, 1745641, 1818041, 1893931, 1973811, 2058077, 2147149, 2242563, 2346650, 2461232, 2587539, 2726921, 2880468, 3048249, 3230066, 3426604, 3638737, 3866037, 4107033, 4360244, 4623322, 4891209, 5156447, 5411336, 5648836, 5861948, 6044130, 6190755, 6298771, 6364124, 6380208, 6339646, 6238134, 6077694, 5867487, 5621366, 5353450, 5075194, 4795762, 4523255, 4264009, 4021385, 3796769, 3591576, 3407114, 3243019, 3097405, 2968652]
57586B968652j12746r7927q4792p2756o1140n0361m0963l2411k4036j6212r426
57575B365882k974M216J2088J9750K6732L3242L9875M7563N6937O7093P6166Q3909
57563B830479R2506J03769J16592J28382J38224J47404J57277J67524J76265J81210
57553D239632J80950J75350J64268J46359J20263Q6911M9123Q955l2747p4033
57543E065031j11403j42557j67654j86957j99390k04674k04809k01867j96069
57534C449651j87540j77946j68502j58100j45614j32560j21369j12275j04026
57525B141719r6393q9630q2724p4740o7063o1661n7783n2974m6979m1876l8444
57514A431452l5130l0996k7176k4603k2431j9709j7015j5347j4573j3725j2082
$$ y = [2968652, 2855906, 2757979, 2673187, 2600431, 2539291, 2488930, 2447967, 2415556, 2391520, 2375308, 2365882, 2362908, 2367124, 2379212, 2398962, 2425694, 2458936, 2498811, 2546374, 2603311, 2670404, 2746570, 2830479, 2922985, 3026754, 3143346, 3271728, 3409952, 3557356, 3714633, 3882157, 4058422, 4239632, 4420582, 4595932, 4760200, 4906559, 5026822, 5113733, 5162856, 5171811, 5139064, 5065031, 4953628, 4811071, 4643417, 4456460, 4257070, 4052396, 3847587, 3645720, 3449651, 3262111, 3084165, 2915663, 2757563, 2611949, 2479389, 2358020, 2245745, 2141719, 2045326, 1955696, 1872972, 1798232, 1731169, 1669508, 1611725, 1558751, 1511772, 1469896, 1431452, 1396322, 1365326, 1338150, 1313547, 1291116, 1271407, 1254392, 1239045, 1224472, 1210747, 1198665]
57503A198665r544o733m778m174l915k711q21N56J409K987N730Q651J0956J2843
57489A209121J4401J5118J5044J5308J6834J9376K2236K5186K8411L2163L6544
57478A449742M1003M4308M6084M8057N2503N9336O6161P1403P5932Q1166Q7173
57467B122868R3595J01123J10546J20957J30228J37082J41688J44285J44301J41114
57457C387787J34837J25457J11578R1109O3685L1781j190l3302o3809r1105j12760
57446C644068j27900j37921j44102j45978j43176j37406j30995j24291j16236
57437B436063j06927r7766q9248q0417p0883o1861n4615m8859m3327l7216l0573
57426A714371k3864j7510j1682o318j404K969O948J0929J4934J8732K2782K8137
$$ y = [1198665, 1189121, 1182388, 1177610, 1173436, 1169521, 1166810, 1165989, 1166545, 1167954, 1170941, 1176671, 1185322, 1196278, 1209121, 1223522, 1238640, 1253684, 1268992, 1285826, 1305202, 1327438, 1352624, 1381035, 1413198, 1449742, 1490745, 1535053, 1581137, 1629194, 1681697, 1741033, 1807194, 1878597, 1954529, 2035695, 2122868, 2216463, 2317586, 2428132, 2549089, 2679317, 2816399, 2958087, 3102372, 3246673, 3387787, 3522624, 3648081, 3759659, 3850768, 3914453, 3946234, 3945044, 3911742, 3847933, 3756828, 3644068, 3516168, 3378247, 3234145, 3088167, 2944991, 2807585, 2676590, 2552299, 2436063, 2329136, 2231370, 2142122, 2061705, 1990822, 1928961, 1874346, 1825487, 1782160, 1744944, 1714371, 1690507, 1672997, 1661315, 1654997, 1653593, 1656562, 1663510, 1674439, 1689373, 1708105, 1730887, 1759024]
57414A759024L4567L9956M2871M5075M9933N8513O8667P7979Q6177R4239J02318
57403B459319J09478J15113J19828J24560J28755J29963J25937J16846J04284
57394C534083Q8243O6846L9619R061k2080n3145q3580j10453j30497j43655j52285
57383C042157j57572j58979j56761j52432j46762j39426j30764j22017j13604
57374A763840j04950r6038q7456p9021p0274o2205n6433n2572m8586m4010m0600
57363A021695l9226l8242l5776l1957k8154k5443k4313k4371k4011k1883j8841
57352G09478j6756j5578j3724j1400j0703j1863j2234j0227p611o530o642o822
57340E79388p339q459q925p875o488n750m443j514J265J530j10j209j111r42q95
$$ y = [1759024, 1793591, 1833547, 1876418, 1921493, 1971426, 2029939, 2098606, 2176585, 2262762, 2357001, 2459319, 2568797, 2683910, 2803738, 2928298, 3057053, 3187016, 3312953, 3429799, 3534083, 3622326, 3689172, 3728791, 3737852, 3715772, 3662627, 3579047, 3468594, 3338097, 3194442, 3042157, 2884585, 2725606, 2568845, 2416413, 2269651, 2130225, 1999461, 1877444, 1763840, 1658890, 1562852, 1475396, 1396375, 1326101, 1263896, 1207463, 1154891, 1106305, 1062295, 1021695, 982469, 944227, 908451, 876494, 848340, 822897, 798584, 774213, 750202, 728319, 709478, 692722, 677144, 663420, 652020, 641317, 629454, 617220, 606993, 599382, 592852, 586210, 579388, 572049, 563590, 554665, 546790, 540302, 534552, 530109, 528595, 529860, 531390, 531280, 530071, 528960, 528018, 527123]
57325E27123k50M41j36j408j247Q02K769L179K660K185J641J036J424L396N727
57310E49342O675O112N444N677O376O534N985N589O080P088P751Q024Q656R790
57296F45123J0536J0335R953J0439J1688J2724J2933J2464J1802J1436J1568J1799
57284G82800J1565J1117J1404J2601J3530J2987J1160R343Q785R875J1706J2365
57272I19238J0586P397N158M920N813O830P642P705O574N579O830R777J1135R577
57258A024761Q145R999J3887J6245J6243J6080J7200J8859K0162K1201K2040K2344
57246A227166K2134K1858K1788K2225K3642K5601K6418K5184K3254K2487K3011
57235A484768K4023K5579K7841K9820L0795L2058L5054L8767M1092M2035M3132
$$ y = [527123, 526873, 527314, 527178, 525770, 524523, 525325, 528094, 531273, 533933, 536118, 537759, 538795, 540219, 543615, 549342, 556017, 562129, 567573, 573250, 579626, 586160, 592145, 597734, 603814, 610902, 618653, 626677, 635333, 645123, 655659, 665994, 675947, 686386, 698074, 710798, 723731, 736195, 747997, 759433, 771001, 782800, 794365, 805482, 816886, 829487, 843017, 856004, 867164, 876507, 885292, 895167, 906873, 919238, 929824, 937221, 942379, 947299, 953112, 959942, 967584, 975289, 981863, 987442, 994272, 1004049, 1015184, 1024761, 1032906, 1042905, 1056792, 1073037, 1089280, 1105360, 1122560, 1141419, 1161581, 1182782, 1204822, 1227166, 1249300, 1271158, 1292946, 1315171, 1338813, 1364414, 1390832, 1416016, 1439270, 1461757, 1484768, 1508791, 1534370, 1562211, 1592031, 1622826, 1654884, 1689938, 1728705, 1769797, 1811832, 1854964]
57224A854964M4326M4080M2381M0981M0393L9128L6311L2866K9584K5953K1640
57213B252607J7456J4194J1702R442O822K973k403q032j2239j5087j7947k1175
57201B238313k3735k4969k5063k4005k1738j9223j7553j6198j4003j1648j0956
57190B029222j1720j1490q971n508k644j70K609N328P189P918P677P059P227Q782
57176B042508J0637J1450J1862J3627J6798J9841K2332K5236K8307K9631K8465
57165B260694K6579K6026K7175K9282L1348L2145L1059K9231K8313K8117K7223
57154B577192K5764K5472K6969K9216L1586L4303L6850L8454M0196M4125N0080
57143B960207N5995O1290O7098P3020P7022P9145Q1948Q6254Q9629R0275Q9276
$$ y = [1854964, 1899290, 1943370, 1985751, 2026732, 2067125, 2106253, 2142564, 2175430, 2205014, 2230967, 2252607, 2270063, 2284257, 2295959, 2305401, 2312223, 2315196, 2312793, 2304761, 2292522, 2277435, 2259488, 2238313, 2214578, 2189609, 2164546, 2140541, 2118803, 2099580, 2082027, 2065829, 2051826, 2040178, 2029222, 2017502, 2006012, 1997041, 1991533, 1988889, 1988719, 1991328, 1996656, 2003845, 2011763, 2019440, 2026499, 2033726, 2042508, 2053145, 2064595, 2076457, 2090084, 2106882, 2126723, 2149055, 2174291, 2202598, 2232229, 2260694, 2287273, 2313299, 2340474, 2369756, 2401104, 2433249, 2464308, 2493539, 2521852, 2549969, 2577192, 2602956, 2628428, 2655397, 2684613, 2716199, 2750502, 2787352, 2825806, 2866002, 2910127, 2960207, 3016202, 3077492, 3144590, 3217610, 3294632, 3373777, 3455725, 3541979, 3631608, 3721883, 3811159]
57132C811159Q7808Q5164Q1167P7626P5770P4678P3630P3435P4202P4562P4265
57121D663466P4613P5121P3066O7954O3183O1426O1442O1355O1737O3359O5122
57110E391844O6594O9502P4148P7320P6330P2514O8403O4345O0459N8766O0355
57099F140580O2999O4293O4786O5573O5673O4390O3250O2722N9829N2062M0948
57088F807105K9028J6263K247j1229k2921l4370m6431n6982o5047p3393q3589
57077F460681r2607r8383j04685j15798j30081j43667j57029j72876j90922k09883
57067E044750k31468k57180k84281l10015l36376l65562l94641m20639m47164
57058A997424m79486n16349D48532a40833o28174o69901p14867p67051q28597
$$ y = [3811159, 3898967, 3984131, 4065298, 4142924, 4218694, 4293372, 4367002, 4440437, 4514639, 4589201, 4663466, 4738079, 4813200, 4886266, 4954220, 5017403, 5078829, 5140271, 5201626, 5263363, 5326722, 5391844, 5458438, 5527940, 5602088, 5679408, 5755738, 5828252, 5896655, 5961000, 6021459, 6080225, 6140580, 6203579, 6267872, 6332658, 6398231, 6463904, 6528294, 6591544, 6654266, 6714095, 6766157, 6807105, 6836133, 6852396, 6854643, 6843414, 6820493, 6786123, 6739692, 6682710, 6617663, 6544270, 6460681, 6368074, 6269691, 6165006, 6049208, 5919127, 5775460, 5618431, 5445555, 5254633, 5044750, 4813282, 4556102, 4271821, 3961806, 3625430, 3259868, 2865227, 2444588, 1997424, 1517938, 1001589, 448532, -140833, -769007, -1438908, -2153775, -2920826, -3749423]
57049c749423q94611r60335j028755j103979j183030j262665j347796j442976
57041a2973570j542149j638097j735395j842169j957292k081069k232053k438075
57033b8439869k717564l082569l543273m085794m664039n247749n857437o498933
57025f4137227p088363p554667q071277r081598j0926047j3367001j5518589j6317641
57017a52062410j5154771j2182437q141448l907728q9335L098320N682730P718177
57009a75038902R209326J0175503J0702326J0903407J0867830J0665337J0367436
57002a02147737J0026903R648280R205216Q683241Q091769P447172O766697O075531
56994c6202928N401344M760704M161096L612463L124965K698319K324853K001321
$$ y = [-3749423, -4644034, -5604369, -6633124, -7737103, -8920133, -10182798, -11530594, -12973570, -14515719, -16153816, -17889211, -19731380, -21688672, -23769741, -26001794, -28439869, -31157433, -34240002, -37783275, -41869069, -46533108, -51780857, -57638294, -64137227, -71225590, -78780257, -86851534, -95933132, -106859179, -120226180, -135744769, -152062410, -167217181, -179399618, -187541066, -191448794, -191538129, -188439809, -182757079, -175038902, -165829576, -155654073, -144951747, -134048340, -123180510, -112515173, -102147737, -92120834, -82472554, -73267338, -64584097, -56492328, -49045156, -42278459, -36202928, -30801584, -26040880, -21879784, -18267321, -15142356, -12444037, -10119184, -8117863]
56986h117863J728096J499475J304929J138727R99632e64035B17474O92932O18362
56977A528768N55042M97812M46496M04354L70327L39794L11692K87864K66460
56968E008609K43005K17371J93107J70612J47430J24557J05706R0537P5014N8396
56958F434344M3620L0567J5306l096k0633l4107m3803n0008n1801m9892m5958
56947F224539l8848k6208r648O839K3317M2628O2694P7263Q5940R5269J04980
56936F648765R8855N6183k8195j37410k43554l23246l66799l78432l69344l49317
56926D607506l23740k96154k69776k45920k23904k03816j86987j73204j60312
56917B523693j47637j36936j28751j20732j11188j01491r3243q5617p7523p0089
$$ y = [-8117863, -6389767, -4890292, -3585363, -2446636, -1447004, -564035, 217474, 910406, 1528768, 2083810, 2581622, 3028118, 3432472, 3802799, 4142593, 4454285, 4742149, 5008609, 5251614, 5468985, 5662092, 5832704, 5980134, 6104691, 6210397, 6300934, 6375948, 6434344, 6477964, 6508531, 6523837, 6520741, 6500108, 6466001, 6422198, 6372190, 6320389, 6270497, 6224539, 6185691, 6159483, 6149835, 6156674, 6179991, 6222619, 6285313, 6362576, 6448516, 6543785, 6648765, 6747620, 6803803, 6775608, 6638198, 6394644, 6071398, 5704599, 5326167, 4956823, 4607506, 4283766, 3987612, 3717836, 3471916, 3248012, 3044196, 2857209, 2684005, 2523693, 2376056, 2239120, 2110369, 1989637, 1878449, 1776958, 1683715, 1598098, 1520575, 1450486]
56907A450486o4601n9800n3605m6291l9842l4940l0373k4844j8120j0853m315
56896A062902K9J292r01o951j6564k7461l6467m2267m5786m7761m7802m6155m4265
56883G01843m2654m0044l5556l0259k5536k1421j7510j4153j1491q437l753K508
56871D53537R216J4894J7866J6763J1509L156p291j8769k9154l6061l9039l9605
56859C57022l8900l6868l3783l0685k7924k5042k2423k1060k0336j8201j4266
56848F7534j0633q741p502n576l427j940q66J5O2n85l47J425L201L773M229N876
56832D6498P976R317J0414J2165J3843J4636J5868J9301K3860K6326K4977K0752
56820B45933J5195R092L102j966n776q376r548r062p237m554j169K582N994R004
$$ y = [1450486, 1385885, 1326085, 1272480, 1226189, 1186347, 1151407, 1121034, 1096190, 1078070, 1067217, 1062902, 1062931, 1064223, 1063322, 1056371, 1039807, 1012346, 975879, 933612, 887826, 840065, 792263, 746108, 701843, 659189, 619145, 583589, 553330, 527794, 506373, 488863, 474710, 463219, 454782, 451029, 453537, 462753, 477647, 495513, 512276, 523785, 526941, 519650, 500881, 471727, 435666, 396627, 357022, 318122, 281254, 247471, 216786, 188862, 163820, 141397, 120337, 100001, 81800, 67534, 56901, 48160, 40658, 35082, 31655, 29715, 28849, 28864, 28926, 28341, 27994, 29419, 32620, 36393, 40622, 46498, 54474, 63791, 74205, 86370, 100213, 114849, 130717, 150018, 173878, 200204, 225181, 245933, 261128, 270220, 273322, 271356, 265580, 257204, 247656, 238594, 231357, 226803, 225634, 228216, 234210, 243214]
56806B43214J2457J6537K0132K2800K6219L2142L9910M7151N1879N2446M6823
56795F11710L4342J7744J527j1677k1649k8180l0377k8555k4923k1605j8868j5571
56783D63918j0559l610M227J1405J7681K4635L3541M3395N2330O0137O7565P3350
56771H38015P3843O6114N0337K9092N748j6254l3980m6060n2825n5322n4562n1577
56759G52569m7215m1655l4595k6030j6615p535j78M900R266J5873K5760L6151
56747F70696M3038M5043M3355L8552K9520J5781p40j6810k9841l8622m3365m5438
56735G11169m6214m5821m3580l9486l4359k8739k2713j6741j1543o898j726M352
56723D17701J0295J4811J7520J8861J9343J8882J6411J0595J668p940j5735k1438
$$ y = [243214, 255671, 272208, 292340, 315140, 341359, 373501, 413411, 460562, 512441, 564887, 611710, 646052, 663796, 665323, 653646, 631997, 603817, 573440, 544885, 519962, 498357, 479489, 463918, 453359, 449749, 453976, 465381, 483062, 507697, 541238, 584633, 636963, 697100, 764665, 838015, 911858, 977972, 1028309, 1057401, 1063149, 1046895, 1012915, 966855, 914030, 858708, 804146, 752569, 705354, 663699, 629104, 603074, 586459, 578924, 578746, 583646, 592912, 608785, 634545, 670696, 713734, 758777, 802132, 840684, 870204, 885985, 885245, 868435, 838594, 799972, 756607, 711169, 664955, 619134, 575554, 536068, 501709, 472970, 450257, 433516, 421973, 415075, 413349, 417701, 427996, 442807, 460327, 479188, 498531, 517413, 533824, 544419, 546087, 538147, 522412, 500974]
56711E00974k6093k9656l1067l0396k9118k8110k6882k5007k2871k0689j8075
56700B13010j5009j2106r666p589o232o110o601o441n603n157n084m091k109j046
56686A20166k089l909m661m234l313j702Q14L023L402K178Q76K22k65r61j655
56671A07892k295l201m317m966m482k947j263n62j130j974k022j660k172l612
56657G1289m459l722k222j217q83q47r96r00M39L080N278N280L406J317r8j021
56641G3724j505j242k60J121K801M478N113L816J070j662l291l448k086K69K200
56626H1098K388J000n38j133q93o64j197k443l293k510l57J307J154q3q82q76
56610G2078o42l56J53N05K15k41K7R55J640J745J709J723J432O57l66j297j594
$$ y = [500974, 474881, 445225, 414158, 383762, 354644, 326534, 299652, 274645, 251774, 231085, 213010, 198001, 185895, 176229, 168640, 162408, 156298, 149697, 143256, 137653, 132496, 127412, 123321, 121212, 120166, 118077, 114168, 109507, 105273, 101960, 100258, 101072, 104095, 107497, 109675, 110551, 110773, 110508, 109547, 107892, 105597, 102396, 98079, 93113, 88631, 85684, 84421, 83859, 82729, 80755, 78733, 77073, 74901, 71289, 66830, 63108, 60886, 59669, 58786, 57939, 56943, 56043, 56482, 59562, 64840, 70120, 73526, 74843, 74745, 73724, 72219, 70977, 70717, 71838, 74639, 79117, 84230, 88046, 89116, 87454, 84163, 80715, 78629, 78898, 81098, 83486, 84486, 83948, 82815, 81922, 81258, 80061, 77618, 74325, 71815, 71458, 72765, 73919, 73836, 72954, 72078, 71436, 71080, 71233, 71738, 71953, 71712, 71739, 72694, 74334, 76079, 77788, 79511, 80943, 81600, 81234, 79937, 78343]
56593G8343n51J707L674L879K616J323O69L69M25J222K488L403L755L882L610
56578A10814K459Q44j30j53J44L71M99K1j415k682k280r06r68k992m576l856j996
56561I3198q73j34J499L334L426J767N57J183K623L311L197L266L881M398M065
56546A28698K815J290K74J9J87M68R46J565J719R62j46n70j28L99N60Q65J788
56529A41711K744K668J390j15q02m38N44J550J962J390K04m99l4R81J470J332
56513A56058J317J507J040k76j161l58J725L648M736N408O155O963P601P824P484
56498B09671O885O661O910O946O398N733N128L821J746P10K223M882N885M861
56484B78460M044M499M498K488l53j887j939j910k495l205l611l785l767l490
$$ y = [78343, 77792, 79499, 83173, 87052, 89668, 90991, 91660, 92029, 92454, 93676, 96164, 99567, 103322, 107204, 110814, 113273, 114117, 113987, 113834, 113978, 114349, 114848, 114869, 113454, 110772, 108492, 107586, 106618, 103626, 99050, 95194, 93198, 92325, 92191, 93690, 97024, 100450, 102217, 102774, 103957, 106580, 109891, 113088, 116354, 120235, 124633, 128698, 131513, 132803, 133077, 133096, 133283, 133751, 134697, 136262, 137981, 138943, 138797, 138227, 138099, 138498, 139058, 139923, 141711, 144455, 147123, 148513, 148398, 147596, 147158, 147702, 149252, 151214, 152604, 152808, 152309, 152275, 153256, 154726, 156058, 157375, 158882, 159922, 159646, 158485, 158127, 159852, 163500, 168236, 173644, 179799, 186762, 194363, 202187, 209671, 216556, 223217, 230127, 237073, 243471, 249204, 254332, 258153, 259899, 260609, 262832, 267714, 273599, 278460, 282504, 287003, 291501, 293989, 293636, 291749, 289810, 287900, 285405, 282200, 278589, 274804, 271037, 267547]
56470B67547l147l001k953k817k707k767k877k945l113l359l381l145k998l049
56456B25288k979k716k603k653k507k348k870l849l879k258j57R41J023P76O1
56441A99270j451k864k781j322M6N93R80J666J947J159j60r75j013o94k21N65
56425A94745J484J762P53j237l001l378k169j55J618K554K782L009L882N236O060
56410B13945N496L758J835O12O41K302N327Q353R755R087P309N726N187N806O643
56395B91782O160M062K308K919N068O002M824L405L159K995J542m89j576j697
56381C30464j783j846j227j74K99k32j413k923m442n257m785l334j684l93L2r51
56365C00351k958m383m051k624j520j118r56r47j256j466j078n37o34j228j510
$$ y = [267547, 264400, 261399, 258446, 255629, 252922, 250155, 247278, 244333, 241220, 237861, 234480, 231335, 228337, 225288, 222309, 219593, 216990, 214337, 211830, 209482, 206612, 202763, 198884, 196626, 196469, 197410, 198433, 199209, 199270, 197819, 194955, 192174, 190852, 190898, 191491, 192471, 194137, 196084, 197243, 197083, 196108, 195095, 194401, 194180, 194745, 196229, 197991, 198744, 197507, 194506, 191128, 188959, 188804, 190422, 192976, 195758, 198767, 202649, 207885, 213945, 219441, 223199, 225034, 225646, 226287, 228589, 233916, 242269, 252024, 261111, 268420, 274146, 279333, 285139, 291782, 297942, 302004, 304312, 307231, 312299, 318301, 323125, 326530, 329689, 332684, 334226, 333737, 332161, 330464, 328681, 326835, 325608, 325434, 325733, 325501, 324088, 321165, 316723, 311466, 306681, 303347, 301663, 301270, 301302, 300351, 297393, 293010, 288959, 286335, 284815, 283697, 282741, 281794, 280538, 279072, 277994, 277457, 276823, 275595, 274085]
56350B74085j332j261j508j708j694j721j957k254k340j924r76j52k37r31j077
56335B53013m22ok39j7J248K123J139p95j532m07J538L304M335L990K260N50J13
56318B70195K00o95k229k548j003J125K523K932K523J640J256K188L898N139N607
56303B92751N795N633M745L684L336L333K678J724J785K864L503L011K171J569
56289C38582R41M49R06K260L276L200K522J818J132P98J476K940M035M146L685
56274C72166L049K343K135L188N226P182Q622R681R905Q706O971O433P424Q925
56260D61956J0668J3056J5075J4894J3064J2466J4039J5159J3762J1655J1694
56249F07488J3593J4848J4550J3782J3050J1703R844Q769R069R751R748R223Q832
$$ y = [274085, 272753, 271492, 269984, 268276, 266582, 264861, 262904, 260650, 258310, 256386, 255410, 255258, 255021, 254090, 253013, 252591, 252585, 252346, 252329, 253577, 255700, 256839, 256044, 254512, 254105, 255643, 258947, 263282, 267272, 269532, 270082, 270195, 270395, 269700, 267471, 264923, 263920, 265045, 267568, 270500, 273023, 274663, 275919, 278107, 282005, 287144, 292751, 298546, 304179, 308924, 312608, 315944, 319277, 321955, 323679, 325464, 328328, 331831, 334842, 337013, 338582, 339523, 339972, 340878, 343138, 346414, 349614, 352136, 353954, 355086, 355884, 357360, 360300, 364335, 368481, 372166, 375215, 377558, 379693, 382881, 388107, 395289, 403911, 413592, 423497, 432203, 439174, 445607, 453031, 461956, 472624, 485680, 500755, 515649, 528713, 541179, 555218, 570377, 584139, 595794, 607488, 621081, 635929, 650479, 664261, 677311, 689014, 698858, 707627, 716696, 726447, 736195, 745418, 754250]
56236G54250Q456P428N717M298M122N004N969O645P641R418J1551J3624J5900
56223H60023J8262J9566J9241J8813K0295K3678K7486L1202L5279L9156M1507
56212A154508M2592M4332M7619N1384N4852N8914O4538P1361P8638Q6313R4383
56201A849434J02380J10190J18456J27738J38004J49007J60244J70617J79365
56192C105435J87078J94605K01241K05484K07120K06727K03429J95351J82253
56183D888723J65527J45590J21695R4616O6934M0060J3320j3226l7475n7778p4650
56172E353336q8935j00272j08413j14216j18366j20734j21806j22948j24615j26129
56162D206902j27689j30419j33880j35959j36034j35843j36369j36363j34902
$$ y = [754250, 762706, 770134, 775851, 780149, 784271, 789275, 795244, 801889, 809530, 818948, 830499, 844123, 860023, 878285, 897851, 917092, 935905, 956200, 979878, 1007364, 1038566, 1073845, 1113001, 1154508, 1197100, 1241432, 1289051, 1340435, 1395287, 1454201, 1518739, 1590100, 1668738, 1755051, 1849434, 1951814, 2062004, 2180460, 2308198, 2446202, 2595209, 2755453, 2926070, 3105435, 3292513, 3487118, 3688359, 3893843, 4100963, 4307690, 4511119, 4706470, 4888723, 5054250, 5199840, 5321535, 5416151, 5483085, 5523145, 5536465, 5523239, 5485764, 5427986, 5353336, 5264401, 5164129, 5055716, 4941500, 4823134, 4702400, 4580594, 4457646, 4333031, 4206902, 4079213, 3948794, 3814914, 3678955, 3542921, 3407078, 3270709, 3134346, 2999444]
56153B999444j32874j30699j27296j22576j18201j14407j08908j00766r2583q6659
56143A864475q1596p5082o7762o1713n7076n2718m8637m5264m1871l7776l3804
56132A261176l0640k7351k3378k0173j8855j7995j5968j3736j2986j3010j1887
56121A055197r385o498l457k84J997K916L902O110Q310R041R223J0428J2096J2962
56107A112558J3754J5902J8777K0699K1652K2586K3122K2409K1322K1413K2351
56096A336545K2568K1724K0612J9556J8749J9188K1378K4036K5929K8002L2019
56085A590306L8183M5594N3857O2618P0910P8344Q5508R2116R6909J00768J07247
56074B422360J18076J30748J42597J54193J66062J75107J77949J75356J69874
$$ y = [2999444, 2866570, 2735871, 2608575, 2485999, 2367798, 2253391, 2144483, 2043717, 1951134, 1864475, 1782879, 1707797, 1640035, 1578322, 1521246, 1468528, 1419891, 1374627, 1332756, 1294980, 1261176, 1230536, 1203185, 1179807, 1159634, 1140779, 1122784, 1106816, 1093080, 1080094, 1067084, 1055197, 1045812, 1039314, 1035857, 1035573, 1037570, 1040486, 1044388, 1050498, 1058808, 1067849, 1077072, 1087500, 1099596, 1112558, 1126312, 1142214, 1160991, 1181690, 1203342, 1225928, 1249050, 1271459, 1292781, 1314194, 1336545, 1359113, 1380837, 1401449, 1421005, 1439754, 1458942, 1480320, 1504356, 1530285, 1558287, 1590306, 1628489, 1674083, 1727940, 1790558, 1861468, 1939812, 2025320, 2117436, 2214345, 2315113, 2422360, 2540436, 2671184, 2813781, 2967974, 3134036, 3309143, 3487092, 3662448, 3832322]
56065C832322J61374J48992J35467J25031J17787J09886R8503Q3323O3955L9725
56055D916365J2018j5774m0528o0019p3004q1188q9543j01887j17256j32532j46500
56044D070152j58776j67311j70364j68975j64478j55825j42631j28234j15861
56035B697697j04072r0158p5830o5067n8119n2091m5928m0509l5387k9800k5473
56024B075263k4160k3893k1792j8819j7456j6679j3996j0510q856p910m833q46
56012A905513O25L59K176O257R140R866J0783J2778J4779J7385K1889K6410K7970
55999B065930K7665K8905L1612L3210L3991L6061L8288L8023L6639L7545M0048
55988B447917M1046M1338M3892M7410M8372M8129N0872N5726N8143N8188N9892
$$ y = [3832322, 3993696, 4142688, 4278155, 4403186, 4520973, 4630859, 4729362, 4812685, 4876640, 4916365, 4928383, 4912609, 4872081, 4812062, 4739058, 4657870, 4568327, 4466440, 4349184, 4216652, 4070152, 3911376, 3744065, 3573701, 3404726, 3240248, 3084423, 2941792, 2813558, 2697697, 2593625, 2503467, 2427637, 2362570, 2304451, 2252360, 2206432, 2165923, 2130536, 2100736, 2075263, 2051103, 2027210, 2005418, 1986599, 1969143, 1952464, 1938468, 1927958, 1919102, 1911192, 1906359, 1905513, 1906138, 1906497, 1908673, 1914930, 1924070, 1933936, 1944719, 1957497, 1972276, 1989661, 2011550, 2037960, 2065930, 2093595, 2122500, 2154112, 2187322, 2221313, 2257374, 2295662, 2333685, 2370324, 2407869, 2447917, 2488963, 2530301, 2574193, 2621603, 2669975, 2718104, 2768976, 2824702, 2882845, 2941033, 3000925]
55977C000925O3306O5055O6086P0589P7476Q1399Q2315Q5585R2293R8059J02166
55966C885254J09047J19526J29026J35932J43584J52791J60407J66686J75883
55957E178136J88336J99817K09527K20562K32132K40152K46000K55440K68314
55948G238416K79095K88104L01699L20317L37382L51614L69352L92756M16894
55939A0295629M40692M69308N03202N36470N68477O05233O46575O84246P15791
55930A5465623P48229P85053Q22258Q60019R04912R57496J011138J066052J130340
55921B3751120J204583J280762J359228J449975J553964J660989J769952J892540
55913C5923113K032430K180817K337634K516596K723962K954079L210983L510903
$$ y = [3000925, 3064231, 3129286, 3195372, 3265961, 3343437, 3424836, 3507151, 3592736, 3685029, 3783088, 3885254, 3994301, 4113827, 4242853, 4378785, 4522369, 4675160, 4835567, 5002253, 5178136, 5366472, 5566289, 5775816, 5996378, 6228510, 6468662, 6714662, 6970102, 7238416, 7517511, 7805615, 8107314, 8427631, 8765013, 9116627, 9485979, 9878735, 10295629, 10736321, 11205629, 11708831, 12245301, 12813778, 13419011, 14065586, 14749832, 15465623, 16213852, 16998905, 17821163, 18681182, 19586094, 20543590, 21554728, 22620780, 23751120, 24955703, 26236465, 27595693, 29045668, 30599632, 32260621, 34030573, 35923113, 37955543, 40136360, 42473994, 44990590, 47714552, 50668631, 53879614, 57390517]
55905E7390517L858733M248643M693466N224323N855818O584835P429439Q429575
55897A03715349R601226J0935482J2454362J4215903J6250369J8552455K1152644
55890B06877790K4122453K7494572L1270949L5464902L9797968M3059182M2970544
55883D51058360L7309545K5654818J0100825n854505j9229708k8676211l4295152
55876D36067972l6871723l7291511l6284402l4350018l1805114k8899719k5872531
55869B04692954k2908166k0106373j7523066j5206919j3180987j1428903r924211
55862I4414329q650266p580664o670663n885072n212939m644050m154243l724914
55854D7891518l354523l038926k760163k505669k279870k086195j914720j757378
$$ y = [57390517, 61249250, 65497893, 70191359, 75415682, 81271500, 87856335, 95285774, 103715349, 113316575, 124252057, 136706419, 150922322, 167172691, 185725146, 206877790, 231000243, 258494815, 289765764, 325230666, 365028634, 408087816, 451058360, 488367905, 514022723, 524123548, 518269043, 499039335, 470363124, 436067972, 399196249, 361904738, 325620336, 291270318, 259465204, 230565485, 204692954, 181784788, 161678415, 144155349, 128948430, 115767443, 104338540, 94414329, 85764063, 78183399, 71512736, 65627664, 60414725, 55770675, 51616432, 47891518, 44536995, 41498069, 38737906, 36232237, 33952367, 31866172, 29951452, 28194074]
55846B8194074j618831j502038j397819j298186j206416j125381j048913r73029
55838A8023461r03368q43758p88868p35101o87331o48118o11360n73201n38454
55829A1693902n10046m82683m53164m26585m06088l86574l64714l45303l31370
55820G987375l17514k99545k81782k68461k56320k41797k27408k15224k01950
55811E677374j86260j73175j65619j59225j50806j44204j42288j41054j37423
55802D277320j35108j36655j37126j32116j25088j20215j14627j04650r3620q6575
55792C091540q2519p8599p6835p9882q4419q5392q3247q1275p9305p5504p0908
55781B213655o7034o2258n5331m9179m6482m4776m0443l4315k9110k4639j9895
$$ y = [28194074, 26575243, 25073205, 23675386, 22377200, 21170784, 20045403, 18996490, 18023461, 17120093, 16276335, 15487467, 14752366, 14065035, 13416917, 12805557, 12232356, 11693902, 11183856, 10701173, 10248009, 9821424, 9415336, 9028762, 8664048, 8318745, 7987375, 7669861, 7370316, 7088534, 6820073, 6563753, 6321956, 6094548, 5879324, 5677374, 5491114, 5317939, 5152320, 4993095, 4842289, 4698085, 4555797, 4414743, 4277320, 4142212, 4005557, 3868431, 3736315, 3611227, 3491012, 3376385, 3271735, 3178115, 3091540, 3009021, 2930422, 2853587, 2773705, 2689286, 2603894, 2520647, 2439372, 2360067, 2284563, 2213655, 2146621, 2084363, 2029032, 1979853, 1933371, 1888595, 1848152, 1813837, 1784727, 1760088, 1740193]
55770A740193j6698j6925j8888k0187k1331k3224k4414k4291k5574k9943l4632
55759A484086l6765l7541l8608l8280l5261l2359l2111l2157k9388k5407k3370
55748A122839k2345j9535j5640j3357j2470j0799q283o364m830k783j122r53j218
55735A003140q20j058l089n228n771o258q867j2660j5467j7258j8668j8465j5758
55722H73773j2590j1149j0393q430o191n629o377p345r567j4111j8925k1011k0287
55709G21768j8601j6607j4460j3529j4370j4780j2849j0240r545j0377j1099j2498
55697E62813j6123k0589k3111k3647k4274k5365k5468k4185k2194j9150j4190
55686C24517p866j223N957J3492J8624J8394J3776Q914O609O422O566N703L487
$$ y = [1740193, 1723495, 1706570, 1687682, 1667495, 1646164, 1622940, 1598526, 1574235, 1548661, 1518718, 1484086, 1447321, 1409780, 1371172, 1332892, 1297631, 1265272, 1233161, 1201004, 1171616, 1146209, 1122839, 1100494, 1080959, 1065319, 1051962, 1039492, 1028693, 1020410, 1014046, 1009216, 1006433, 1005311, 1004358, 1003140, 1002320, 1001262, 998173, 992945, 987174, 980916, 972049, 959389, 943922, 926664, 907996, 889531, 873773, 861183, 850034, 839641, 831211, 825020, 819391, 813014, 805669, 796102, 781991, 763066, 742055, 721768, 703167, 686560, 672100, 658571, 644201, 629421, 616572, 606332, 596787, 586410, 575311, 562813, 546690, 526101, 502990, 479343, 455069, 429704, 404236, 380051, 357857, 338707, 324517, 316651, 315428, 321385, 334877, 353501, 371895, 385671, 394585, 401194, 407616, 414182, 419885, 423372]
55673D23372J052M00J988L830M091L098J578r72m559p278p811p586q406r630r667
55658C83500q668p603o292m455l079k673j918j12Q90m93k456k100N78L355N024
55643C53498N662N105L469K227K552L593L953L559K550L09k747m435l860l040
55629C72395l381k996k7L735N427N251N133N259M988N227O576O902M233M35j411
55614D17746j768l123n133n357l901l253l837l553j843o08p67j020m72K33P84
55599C84128J658K489K280J411J265J743J466M26L60K064M133M667L029L6k586
55584D08569l508l525m891p925r854q646o137n285o148p007p763r294j0767j0670
55570C07149r608r303r587r117q117p699p295n685l756l423m481n276n630o196
$$ y = [423372, 424424, 424824, 426812, 430642, 434733, 437831, 439409, 438437, 433878, 426600, 418789, 411203, 402797, 393167, 383500, 374832, 367229, 360937, 356482, 353403, 350730, 348812, 348700, 349590, 349097, 346641, 344541, 345119, 348474, 353498, 359160, 364265, 367734, 369961, 372513, 376106, 380059, 383618, 386168, 386477, 383730, 379295, 375435, 372395, 369014, 366018, 365991, 369726, 375153, 380404, 385537, 390796, 395784, 401011, 407587, 414489, 418722, 419157, 417746, 415978, 412855, 407722, 402365, 398464, 395211, 391374, 387821, 385978, 385370, 384603, 383583, 383111, 383344, 384128, 385786, 388275, 390555, 391966, 393231, 394974, 396440, 396866, 397226, 399290, 403423, 408090, 411119, 411155, 408569, 405061, 401536, 396645, 388720, 378866, 370220, 364083, 358798, 352650, 345643, 337880, 328586, 317819, 307149, 297541, 288238, 278651, 269534, 261417, 253718, 246423, 240738, 236982, 233559, 229078, 223802, 218172, 211976]
55556B11976o017l945j736k141m356m972l214j656j636j630o57J52J73K99O13
55541A81253j71j958k717j540O1P69J091J601J697R75kq85j768j991n86J750K964
55524A80543K281Q91n2k50P13L095N659O606N950N241N118N044N026N463N749
55509B37077N363N773Q623J2375J3729J2307J0902J0975J0945R335O674L563l38
55496C47303m615p906j0122j2461j4762j5392j4261j3224j2962j2190j0584r512
55484B09312r115p775n501m592n561n694l503j501k152l696k878J66K515K662
55470A62687J530K35q64j297o32O87J790K420K733K749K748L309M218M284L008
55455A89605J437N16k71j751l605n086o227p288p698o748n024m205n336p657r107
$$ y = [211976, 205959, 202014, 200278, 198137, 193781, 188809, 185595, 183939, 182303, 180673, 180016, 180168, 180341, 180640, 181253, 181082, 179124, 176407, 174867, 174928, 175697, 176788, 178389, 180086, 181061, 181059, 180174, 178406, 176415, 175829, 177579, 180543, 182824, 183715, 183663, 183413, 184126, 187221, 192880, 199486, 205436, 210677, 215795, 220839, 225865, 231328, 237077, 242440, 248213, 256836, 269211, 282940, 295247, 306149, 317124, 328069, 337404, 344078, 347641, 347303, 342688, 334782, 324660, 312199, 297437, 282045, 267784, 254560, 241598, 229408, 218824, 209312, 200197, 192422, 186921, 182329, 176768, 171074, 167571, 166070, 163918, 160222, 157344, 157510, 160025, 162687, 164217, 164452, 163588, 162291, 161659, 162346, 164136, 166556, 169289, 172038, 174786, 178095, 182313, 186597, 189605, 191042, 191558, 191287, 189536, 185931, 180845, 174618, 167330, 159632, 152884, 147860, 143655, 138319, 130662, 121555]
55440A21555q156n387l064k669l399l556k612j039P81K175J653j300m574n528
55426H4880m334l274l186k839j666p49q05j292j771k295k382j546q80j928l884
55411E2049m155j965O75J870J607N08q76j330J38K247K629J190l5l95j109k064
55395E0984j493M70J275J79l80R18J893P96o11l20K72j042l162l172p75J510J855
55378D9197P85k09j67Q14J483O39j105j796q34M86J446K682L846L107M08j379
55362E9403m26J249R54q02j910k147k606l101k710j834j386q55Q04L118M784N511
55346E8046N537M403K035m2n26m34j449l041l289j873l26K70J19k98o03l47K54
55329E8436R9j170k190j779o75n7L51J102J364L35p88m15P64Q58k87j354k064
$$ y = [121555, 113399, 108012, 104948, 102279, 98880, 95324, 92712, 91673, 92454, 94629, 96282, 94982, 90408, 84880, 80546, 77272, 74086, 71247, 69581, 68832, 68027, 66735, 64964, 62669, 60287, 58741, 57861, 55933, 52049, 47894, 45929, 46604, 48474, 50081, 50589, 49713, 48383, 48521, 50768, 53397, 54587, 54552, 54157, 53048, 50984, 49491, 49961, 51236, 51415, 51035, 51953, 53846, 54642, 54031, 53711, 53983, 52941, 49779, 46607, 45832, 47342, 49197, 49982, 49773, 49606, 50420, 51903, 52542, 51437, 49641, 48807, 49293, 50739, 53421, 57267, 60374, 60782, 59403, 58977, 60226, 61180, 60378, 58468, 56321, 53715, 50614, 47904, 46070, 44684, 43829, 44633, 47751, 52535, 58046, 63583, 67986, 70021, 69979, 69453, 69019, 67570, 64529, 61240, 59367, 59041, 59311, 59430, 59132, 58529, 58182, 58436, 58535, 57365, 55175, 53396, 52721, 52664, 53015, 54117, 55481, 55816, 55028, 54613, 55377, 56235, 55948, 54594, 52530]
55312E2530l118m051l514j667k48p2k59k4L43L45k57j718l644m391k761q0J055
55295B8469N7j260j469j031p58n18O4Q62J700K526K821J882o0j807k520k264j303
55278B5391K06J635K107J610J142J358J614P75j216k950k867j055O91R84N27P83
55262C0735J418Q04r53j520L11K706L396K592J739J017j32j149j113m94k84j54
55246C8919N53P82r83l759m725k980o19M09M81P22J031P72K90M82J370J912J145
55229C5802p29k246j856M09K606K874J595Q35J766L290L449J543j314l341l602
55214D1081k550j302n93n22q22q29L54K590L948K623l86k061j145N03Q71K75p1
55197D1964j35l01J4J250K305J871L23j058j905k364j921l31J097R17k45o31j50
$$ y = [52530, 49412, 45361, 41847, 40180, 39932, 39860, 39601, 39577, 39920, 40265, 40008, 38290, 34646, 30255, 27494, 27414, 28469, 28526, 27266, 25797, 24766, 24008, 23490, 23554, 24416, 26116, 28642, 31463, 33345, 33285, 31478, 28958, 26694, 25391, 25597, 27232, 29339, 30949, 32091, 33449, 35063, 35838, 34622, 31672, 28805, 27750, 28441, 29425, 29952, 30735, 32153, 32957, 32004, 30484, 30795, 33501, 36897, 39489, 41228, 42245, 42113, 40964, 39851, 39357, 39073, 38919, 39472, 40254, 39271, 35512, 30787, 27807, 27188, 27597, 28078, 28800, 29831, 30603, 30893, 31375, 32745, 34657, 35802, 35073, 32827, 30971, 31380, 33986, 36860, 38455, 39290, 41056, 44346, 47795, 49338, 48024, 44683, 41081, 38531, 37229, 36636, 36114, 35292, 34463, 34817, 37407, 41355, 43978, 43592, 41531, 40386, 40889, 41760, 42035, 41964, 41829, 41528, 41542, 42792, 45097, 46968, 47291, 46233, 44328, 41964, 40043, 39712, 40809, 41726, 41481, 40850, 40700]
55180D0700l44j717k790k267p50K31O9n23n52R4N91M37M01J349K369J637p17k353
55162C5865k024j121r34n28J039K353J782M39N69J981K591J861J181J135P83j95
55146D6777p95m72J03L75N90Q61P97L21p2M6P54J757K133R07j232j912n0K311
55128E3199K650J444J055K021K587J621q1j468k461l304l993m423m208k785n32
55113D1322J013J095Q35J128Q59j024k980k752q52K95lk83K59R25J322J750J905
55096D4814J235L74L33O51L12r2N64J502J213N10J316K792K010j314l993l865
55080D8362k040l3K179M150M136J857l81r61r93j727k193j222K16N55J4k38l0
55063E1651J01Q7m9o30j452j525n09P55J707K691L622L690K971K575K552J657
$$ y = [40700, 40356, 38639, 35849, 33582, 32832, 33063, 33132, 32609, 32057, 32151, 32742, 33179, 33580, 34929, 37298, 38935, 38218, 35865, 33841, 32720, 31786, 31258, 32297, 34650, 36432, 36871, 37440, 39421, 42012, 43873, 45054, 46189, 46972, 46777, 45982, 45510, 45613, 45988, 46578, 47439, 48236, 48557, 48485, 48531, 49285, 51042, 53175, 54082, 52850, 50938, 50888, 53199, 55849, 57293, 58348, 60369, 62956, 64577, 64496, 63028, 60567, 57263, 53270, 48847, 44639, 41854, 41322, 42335, 43430, 44265, 45393, 46252, 45228, 42248, 39496, 38644, 38939, 38936, 38653, 38912, 39837, 41159, 42909, 44814, 46049, 46423, 46756, 47407, 47719, 47627, 48191, 49693, 50906, 51416, 52732, 55524, 57534, 56220, 52227, 48362, 46322, 46289, 48468, 52618, 56754, 58611, 58230, 57269, 56276, 54549, 52356, 51134, 51350, 51905, 51919, 51681, 51651, 51752, 51839, 51790, 51160, 49708, 48183, 47674, 48429, 50136, 52827, 56449, 60139, 63110, 65685, 68237, 69894]
55047F9894M6q9J981L564J962j738m241m131k631j364j094j968l296l609k149
55032E1137J12J850L016M166N072N096M216K803J119j80j36J070J790J092J56
55017H2379L20Q57J52j611k499j339J018K882L240K266R89L60K93r4j087j811
55001H6315j377L6J535K331J998O49r23j892k154j870p64J002J842M94j593j741
54985H3888P6J162K99p49o92q73k310l174j589J035J983J172O77J190J508J035
54969H4638N71O98J159J839K756L135K022k6j171m74J068J845J270J8p75o09k02
54952I7762n62j400j269K14J466J090m8j13J055J894J361K0r45q54K82J860K889
54935A04702K676J394j62j171j122j50P60N79n14j401j637j870k343k102l61K115
$$ y = [69894, 69940, 69851, 71832, 75396, 77358, 75620, 71379, 67248, 64617, 63253, 62159, 60191, 56895, 53286, 51137, 51249, 53099, 56115, 60281, 65353, 70449, 74665, 77468, 78587, 78407, 78271, 79341, 81131, 82223, 82379, 82699, 83556, 83708, 82097, 79598, 78259, 79277, 82159, 85399, 87665, 88654, 89014, 89307, 89213, 88126, 86315, 84938, 84974, 86509, 88840, 90838, 91487, 90564, 88672, 86518, 84648, 83884, 84886, 86728, 87222, 85629, 83888, 83964, 85126, 85425, 84676, 83984, 83111, 80801, 77627, 76038, 77073, 79056, 80228, 80905, 82095, 83603, 84638, 85209, 85907, 87066, 88905, 91661, 94796, 96818, 96792, 95621, 95147, 96215, 98060, 99330, 99348, 98573, 97964, 97762, 97200, 95800, 94531, 94745, 96211, 97301, 97253, 97140, 98195, 100089, 101450, 101470, 100525, 99671, 99953, 101813, 104702, 107378, 108772, 108610, 107439, 106317, 106167, 106927, 107506, 106992, 105591, 103954, 102084, 99741, 97639, 97278, 99393]
54919I9393L685L385J475q56k158j795n95L43J230K793M201L714J620M18J322
54904A18175K562K292J315J426K660L768M344M842N318N484N437N339N081M998
54890A73041N865P551Q872R520J0617J2528J3817J3624J3318J4211J5138J4138
54878C12240J1252P902M559P72l288o980j0132j2603j3791j3801j3866j4398j4082
54865B33784j2427j1383j2458j3798j2590r192o333n134m397l185j639K72K468
54852A43988L626K645Q93P91K479M103M978O043P440Q175Q304R047J0632J2128
54838B25272J3518J5509J7230J6542J3122Q928N157J072l599p494r820j1535j3328
54825B70574j4441j4523j4632j5177j4704j2193r130p693q026q630q463p389n482
$$ y = [99393, 103078, 106463, 107938, 107082, 104924, 103129, 102534, 102877, 104107, 106900, 111101, 114815, 116435, 116853, 118175, 120737, 123029, 124344, 125770, 128430, 132198, 136542, 141384, 146702, 152186, 157623, 162962, 168043, 173041, 178906, 186457, 195329, 204849, 215466, 227994, 241811, 255435, 268753, 282964, 298102, 312240, 323492, 331394, 335953, 336725, 333437, 326457, 316325, 303722, 289931, 276130, 262264, 247866, 233784, 221357, 209974, 197516, 183718, 171128, 161936, 155603, 150469, 146072, 142887, 141248, 141520, 143988, 147614, 150259, 151152, 151943, 154422, 158525, 163503, 169546, 176986, 185161, 193465, 202512, 213144, 225272, 238790, 254299, 271529, 288071, 301193, 310121, 315278, 316350, 312751, 305257, 295437, 283902, 270574, 256133, 241610, 226978, 211801, 197097, 184904, 175774, 168081, 160055, 151425, 142962, 135573, 130091]
54812A30091l226j804j935k870l309k959k402k008j697j395j025l13P76J559J117
54797A08600o71k692l385k206l49N06L01N69J881K571J141j233k302j924j724
54782I9083k120k016j321j365k357k678j475m8L83L90P89R93K00j132k158k808
54766H2360k941j775N31J998J245j86K41K416L767L003J726J863L040L540K915
54751A03743K448L099L948L292R93j052j045O83K443L459M362N551O357O313O170
54736A50764O769P675P945P825Q649J0931J3574J5311J6301J7590J9270J9876
54724C02480J7963J3818R213N624L179J102j400m691q370j1303j2574j2550j2373
54711B90118j2364j1815j0510r207q251o947n079l744l524l085r98J791K902J655
$$ y = [130091, 126865, 125061, 123126, 120256, 116947, 113988, 111586, 109578, 107881, 106486, 105461, 105148, 105924, 107483, 108600, 107929, 105237, 101852, 99646, 99297, 99803, 100104, 100673, 102554, 105125, 106266, 105033, 102731, 100807, 99083, 96963, 94947, 93626, 92261, 89904, 87226, 85751, 85703, 86086, 86476, 87265, 88258, 88458, 87326, 85168, 82360, 79419, 77644, 78175, 80173, 81418, 81232, 81473, 83889, 87656, 90659, 92385, 94248, 97288, 100828, 103743, 106191, 109290, 113238, 116530, 117523, 116471, 115426, 116109, 118552, 122011, 126373, 131924, 138281, 144594, 150764, 157533, 165208, 173153, 180978, 189627, 200558, 214132, 229443, 245744, 263334, 282604, 302480, 320443, 334261, 343474, 349098, 352277, 353379, 351979, 347288, 338918, 327615, 315041, 302491, 290118, 277754, 265939, 255429, 246222, 237971, 231024, 225945, 222201, 218677, 215592, 214594, 216385, 219287, 220942]
54697B20942r4j88J747M414O372P428Q783J1306J3767J4116J2796J2836J5600
54684C29825J8534J8813J7252J6225J5453J2843Q439M261O32m150j0276j5526
54672D12325j8472j9983k0923k0876j9945j9431j9665j9168j6971j4039j1601
54661B11251r773q483q000p765o586m729l975m793n412m572l251k632k336j810
54647A37134j541j565o74J376K679J747k69j522j975k258j678N14K965L547K211
54632A40691P36J50Mk13m29m52k5J178K695L224K337J325J271J375M96p77j081
54615A52505l63N71J820L882O008O739N877M532L513K962L055L726M137L817L711
54600B06492M688N602M733K748K107L473M674L799J628J76J08N98Q87J104J803
$$ y = [220942, 220848, 220660, 222407, 226821, 233193, 240621, 249404, 260710, 274477, 288593, 301389, 314225, 329825, 348359, 367172, 384424, 400649, 416102, 428945, 437384, 441645, 442277, 438127, 427851, 412325, 393853, 373870, 352947, 332071, 312126, 292695, 273030, 253862, 236891, 222852, 211251, 201478, 192995, 184995, 177230, 170644, 165915, 161940, 157147, 151735, 147163, 143912, 141280, 138944, 137134, 135593, 134028, 133354, 134730, 137409, 139156, 138887, 137365, 135390, 133132, 131454, 131968, 134933, 138480, 140691, 141427, 141577, 141581, 141368, 140939, 140487, 140462, 141640, 144335, 147559, 149896, 151221, 152492, 153867, 154363, 153586, 152505, 152142, 152713, 154533, 158415, 164423, 171162, 177039, 181571, 185084, 188046, 191101, 194827, 198964, 202781, 206492, 211180, 216782, 221515, 224263, 226370, 229843, 234517, 238316, 239944, 240120, 240228, 240826, 241713, 242817, 244620]
54585B44620L148M466M725L837L157M063O249Q145Q819Q699Q624Q973R705J0486
54571C37716J0754J0142Q750O658L631q8l394n536p143r045j0734j1278j1121
54558C19312j1497j2308j2366j1619j1258j1360j0388p803n333m459m069k224
54546B14628Q48L107L393K338R12l69r63n54K4n30k016k831k536k755m547o289
54530B01860n859l977l301m520n480m570k943k431l040l798m583n501n573l875
54516A42409j457l47q87j655j734j500j275q50m71p65j503j843j845k253k738
54501A21286k127o31P6n32r89l65K70k3k46P55K098K119Q68p8K98J658L006L376
54483A30819K393R13L22P26Q28J76mR58J752J283P89J916L816M320L311K844M039
$$ y = [244620, 247768, 252234, 256959, 260796, 263953, 268016, 274265, 282410, 291229, 299928, 308552, 317525, 327230, 337716, 348470, 358612, 367362, 374020, 377651, 377563, 374169, 368633, 361490, 352445, 341711, 330433, 319312, 307815, 295507, 283141, 271522, 260264, 248904, 238516, 230713, 225380, 220921, 216852, 214628, 215476, 218583, 221976, 224314, 225226, 224857, 223894, 223340, 223364, 222834, 220818, 217987, 215451, 212696, 208149, 201860, 196001, 192024, 188723, 184203, 178723, 174153, 171210, 168779, 165739, 161941, 157358, 151857, 146284, 142409, 140952, 140605, 139718, 138063, 136329, 134829, 133554, 132704, 132233, 131468, 129965, 128122, 126277, 124024, 121286, 119159, 118528, 118604, 118072, 117083, 116718, 116988, 116965, 116719, 117474, 119572, 121691, 122559, 122481, 122779, 124437, 127443, 130819, 133212, 134125, 134447, 135173, 136001, 136177, 136173, 137131, 138883, 140166, 140955, 142871, 146687, 151007, 154318, 157162, 161201]
54466A61201N681O246N908N906O799P734P260M896J959K56j84j090l305n441n896
54451A97930m975m012l650m099n768q099q921o782l180r24q01j403j543j240q32
54436A41701o34j045j754j465J48J209O2j892j933N5J649J566Q83N56J28o30r19
54419A37685m47k6N2P04K415M210M951M576L601K392J346Q76R36J219J729K340
54403A68559K274J266N34J150J985J275k76l61J076J586K94n51O75K137J282j407
54387A81498l310l069j508j03Lj721m444o052n164k669l91R56J565J183n42k683
54371A53549l424k159l55R1r66j717m88K082L514K460M97N9J212J952J346O20
54355A58273Q89J571J668J249P75K71m6N16J935K996K885K394K709L941N473O846
$$ y = [161201, 166882, 173128, 179036, 184942, 191741, 199475, 206735, 211631, 213590, 213846, 213662, 212572, 209267, 203826, 197930, 192955, 188943, 185293, 181194, 175426, 167327, 158406, 151624, 148444, 147520, 146719, 145316, 143773, 142533, 141701, 141067, 140022, 138268, 136803, 136951, 138160, 138222, 136330, 134397, 134452, 136101, 137667, 138550, 139106, 139234, 138604, 137685, 137238, 137212, 137264, 137968, 140383, 144593, 149544, 154120, 157721, 160113, 161459, 162335, 163271, 164490, 166219, 168559, 170833, 172099, 172633, 173783, 175768, 177043, 176767, 176406, 177482, 179068, 179362, 178811, 179486, 181623, 182905, 181498, 178188, 175119, 173611, 173508, 173511, 171790, 167346, 161294, 156130, 153461, 153070, 154026, 155591, 156774, 156232, 153549, 150125, 147966, 147611, 147702, 146736, 145019, 144531, 146613, 150127, 152587, 153084, 153143, 154355, 156307, 157653, 158273, 159162, 160733, 162401, 163650, 164425, 164696, 164650, 165166, 167101, 170097, 172982, 175376, 178085, 182026, 187499, 194345]
54339A94345P515O867N328M484N084N888N485M377M009M550M842M131K750J363
54325B61018L56l80j574l943o834q365p628n889m818m412l807l161l366m451n557
54310A97189o101n783m082j052J752K517J213o06j769k087j621p04m78j777l490
54295A73121l511j490P20J544J275R78J125J779K834L475K727J163Q24K584M763
54280A93911N370M614L962L675L030K381L017M666N050K805m44k153k123k319
54266B25442l774n233n173l952l123l379m170m956n807o684o966o177m713l485
54252A57850l042l270l742m115m247m236m293m527m798m728l893k264n60J74l82
54237A09927j460k170k456k678k780k521k188k185k156j467l92K20L76Q20J384
$$ y = [194345, 201860, 208727, 214055, 218539, 223623, 229511, 234996, 239373, 243382, 247932, 252774, 256905, 259655, 261018, 261374, 260994, 259420, 255477, 248643, 240278, 232650, 226761, 221943, 217531, 213724, 210563, 207197, 202746, 197189, 191088, 185305, 181223, 180171, 181923, 184440, 185653, 185047, 183278, 181191, 179570, 178866, 178388, 176611, 173121, 169610, 168120, 168840, 170384, 171659, 172637, 173762, 175541, 178375, 181850, 184577, 185740, 186564, 189148, 193911, 199281, 203895, 207857, 211532, 214562, 216943, 219960, 224626, 229676, 232481, 232037, 229884, 227761, 225442, 221668, 216435, 211262, 207310, 204187, 200808, 196638, 191682, 185875, 179191, 172225, 166048, 161335, 157850, 154808, 151538, 147796, 143681, 139434, 135198, 130905, 126378, 121580, 116852, 112959, 110695, 110135, 110309, 109927, 108467, 106297, 103841, 101163, 98383, 95862, 93674, 91489, 89333, 87866, 87474, 87694, 88070, 88890, 90274]
54222I0274R16p20j977j772r41m88K41K169M213M414K907J886K420K979J867l70
54206A08018j828j697p68o8Q9q3k75k55nL10P99J885L460M300L145M75j642j866
54188A13994j052p71j064q57j86l89j688k267p99J298J723N48j33N27J227J077
54172A11188R78J689K283J770Q93Q39J157N20j034k120k096j689j488j039K04
54157A12055J780K514J547p91k888k992j091P56P54m08o73M76J501J207K10k97
54141A13660j5P36J633J991R13j291k656j700N37J648P09j046k217k690k842k506
54125A04864j419j32K88n97k044k797k115l33J456K350K277J694Q32m44k072l513
54109I8295m180l879k794j393l32J8J06P36J912K716K604K088J694J075q9j013
$$ y = [90274, 91190, 90470, 88493, 86721, 85780, 85292, 85533, 87702, 91915, 96329, 99236, 101122, 103542, 106521, 108388, 108018, 106190, 104493, 103725, 103657, 103746, 103663, 103388, 103133, 103128, 103438, 104237, 106122, 109582, 113882, 117027, 117502, 115860, 113994, 112942, 112171, 111107, 110250, 110064, 109675, 107987, 105720, 104921, 106219, 107942, 108490, 108357, 108884, 110111, 111188, 112166, 113855, 116138, 117908, 118801, 119640, 120797, 121317, 120283, 118163, 116067, 114378, 112890, 111851, 112055, 113835, 116349, 117896, 117105, 114217, 111225, 110134, 110890, 111644, 111236, 110563, 111039, 112540, 113747, 113957, 113660, 113645, 114381, 116014, 118005, 118918, 117627, 114971, 113271, 113808, 115456, 116165, 115119, 112902, 110212, 107370, 104864, 103445, 103313, 103601, 103004, 100960, 98163, 96048, 95715, 97171, 99521, 101798, 103492, 104324, 103880, 101808, 98295, 94115, 90236, 87442, 86049, 85717, 85735, 85841, 86577, 88489, 91205, 93809, 95897, 97591, 98666, 98577, 97564]
54093I7564p86j4j54j314j992j234R8N93j04j332k181j899m50R47Q35n57j475
54076H6545j064l88l88m49mp3j545l047k526l63J004M26q03j167p23k20J86O96
54058G6097J159J110K29j170j826m16K406L806J924j386k656j148P30J085N35
54043H0479L32O63J395K619L598K828J51k491l272k318p86M84Q83Q9r83q06L86
54026H3251O05o85j362k9J439P63j084j436j11O78j2p58m02M85J116J643K217
54009H6318K334J713P54j59q99j033q2J431K308K238K071K364K625K316J737J560
53993A07596K121L286M433M584L364J754J050J124Q63K87P80K789M587M336K480
53978A45434J077J382L022N116P103Q538R005Q584P932P647P813Q189Q548Q667
$$ y = [97564, 96778, 96764, 96610, 95296, 93304, 92070, 92168, 92761, 92657, 91325, 89144, 87245, 86795, 87742, 88577, 88020, 86545, 85481, 85093, 84705, 84256, 84252, 84179, 82634, 79587, 77061, 76698, 77702, 78128, 77325, 76158, 75435, 75215, 75401, 76097, 77256, 78366, 78595, 77425, 75599, 75183, 77589, 81395, 83319, 81933, 79277, 78129, 78859, 79944, 80479, 80811, 81474, 82869, 85488, 89086, 91914, 92065, 89574, 86302, 83984, 83198, 83682, 84565, 84654, 83671, 82865, 83251, 83856, 83171, 81809, 81780, 83219, 83982, 82898, 81462, 81351, 82029, 82017, 81259, 80857, 81342, 82458, 84101, 86318, 88652, 90365, 91119, 90960, 90061, 89028, 88946, 90377, 92685, 94923, 96994, 99358, 101983, 104299, 106036, 107596, 109717, 113003, 117436, 122020, 125384, 127138, 128188, 129312, 130175, 130462, 131242, 134031, 138618, 142954, 145434, 146511, 147893, 150915, 156031, 163134, 171672, 180677, 189261, 197193, 204840, 212653, 220842, 229390, 238057]
53964B38057Q407Q021Q096Q706Q877P453M666K192J220J104M83p78j683j774j556
53949B91491j220l40P55N78j652m538n957n407m154l481l614m028m034l253k192
53934B48954k017l130m385m468l666l390m204n198n352m571l396k398j890j615
53920A99274o80J436L687M115K052q81k424j923n58M00R58J886L231L943L193
53905B17709J614O41Q27J450J723J510P68p33k650l877l798l081k671k544k127
53890B04761j248j06J127K064K119J422J000J339J634J306J330K809M919N775
53876B30251N018M131M346N492O751P352O627M564K420J613K022K477K702L398
53862B89164M348M109K234L45J59J395K511K766K678L073M369O364Q054Q167O528
$$ y = [238057, 246464, 254485, 262581, 271287, 280164, 287617, 292283, 294475, 295695, 296799, 297282, 296504, 294821, 293047, 291491, 290271, 289931, 290686, 291264, 289612, 285074, 279117, 273710, 269556, 266075, 262461, 258433, 254399, 251146, 248954, 246937, 243807, 239422, 234954, 231288, 227898, 223694, 218496, 213144, 208573, 205177, 202779, 200889, 199274, 198594, 200030, 203717, 207832, 209884, 209003, 206579, 204656, 204098, 204498, 205456, 207342, 210573, 214516, 217709, 219323, 219964, 220791, 222241, 223964, 225474, 226242, 225509, 222859, 218982, 215184, 212103, 209432, 206888, 204761, 203513, 203407, 204534, 206598, 208717, 210139, 211139, 212478, 214112, 215418, 216748, 219557, 224476, 230251, 235269, 239400, 243746, 249238, 255989, 263341, 269968, 274532, 276952, 278565, 280587, 283064, 285766, 289164, 293512, 297621, 299855, 300200, 300359, 301754, 304265, 307031, 309709, 312782, 317151, 323515, 331569, 339736, 346264]
53847C46264M677M484O189Q325R369Q997P760O125M259K377Q71j11q66j672k374
53832D04674k768l086l578l889l620l318l929n199n826n395n001n458o306p208
53818C40093q766j0936j2112j1280r816r500r821r135p497o244n450m126k597
53805B32813k247k896k839j802j483k608l770m019m390n598o297n286l748l463
53791A82367l964l408j534MJ6r91j828j820j073l94p20j943k651j834l69P7o61
53774A59274j207p41N1L53N26J231J956J411n76k449k588j143L14P25L60m4l3
53757A57420P37K348L856L812K180P31P00J130O77j68p3Q80J746K684M403O146
53741A89209O443N616N321N582M729K676J705L157N495O749O978P135P303P259
$$ y = [346264, 350941, 355425, 361614, 369939, 379308, 388305, 396065, 402190, 406449, 408826, 409697, 409586, 408720, 407048, 404674, 401906, 398820, 395242, 391353, 387733, 384415, 380486, 375287, 369461, 364066, 359065, 353607, 347301, 340093, 331327, 320391, 308279, 296999, 287183, 277683, 267862, 258727, 251230, 244986, 239536, 235410, 232813, 230566, 227670, 224831, 223029, 221546, 218938, 215168, 211149, 206759, 201161, 194864, 189578, 185830, 182367, 178403, 174995, 173461, 173465, 173481, 172490, 170662, 168842, 167769, 167375, 166655, 164712, 162061, 160227, 159858, 159935, 159274, 158067, 157326, 157377, 157730, 158256, 159487, 161443, 162854, 162278, 159829, 157241, 156098, 156412, 157137, 157497, 157453, 157420, 158157, 160505, 164361, 168173, 170353, 171084, 171784, 172914, 173591, 173423, 173350, 174230, 175976, 178660, 183063, 189209, 195652, 201268, 206589, 212171, 216900, 219576, 221281, 224438, 229933, 236682, 243660, 250795, 258098, 265357]
53727B65357P184O659M659J748M15J834M117N359O380Q215Q904N962R50j834j131
53712C24778r8j286l213l235j672j120k770n134o160n362l796k645k214k137k238
53697B81698k750l579l929l203j924j116r94r32n55k04k74o14p33l05M99R58L50
53680B62393j216k675l076k619k336k976m426n914o569o025m706l276j885l75
53666B14319Q70J103M43pM27J237J774K093K294J956R23j30n86n49j06J137K984
53649B30182M195M080L730M498O027O970P015O753O142M674K974K618M083N982
53635B99923O728O220N551N717O764P775P601N972L842K352J694J351J002P42
53621C63234P50J213K193L247L631L299K973K907K473J562J258K158K993K204
$$ y = [265357, 272541, 279200, 283859, 285607, 286022, 287856, 291973, 297332, 303712, 311927, 320831, 326793, 327743, 325909, 324778, 324680, 323394, 320181, 316946, 315274, 314154, 311384, 306250, 300090, 294728, 290932, 288287, 286073, 283936, 281698, 278948, 275369, 271440, 268237, 266313, 265197, 264203, 263271, 262716, 262512, 262238, 261624, 260891, 260586, 261085, 262043, 262393, 261177, 258502, 255426, 252807, 250471, 247495, 243069, 237155, 230586, 224561, 219855, 216579, 214694, 214319, 215189, 216292, 216735, 216728, 217155, 218392, 220166, 222259, 224553, 226509, 227432, 227302, 226716, 226167, 226061, 227198, 230182, 234377, 238457, 242187, 246685, 252712, 259682, 266697, 273450, 279592, 284266, 287240, 289858, 293941, 299923, 306651, 312871, 318422, 324139, 330903, 338678, 346279, 352251, 356093, 358445, 360139, 361490, 362492, 363234, 363984, 365197, 367390, 370637, 374268, 377567, 380540, 383447, 385920, 387482, 388740, 390898, 393891, 396095]
53607C96095J74j450k011k119k104j719j120q30q09n71r9K84N60O50l0j497k408
53590C80996j685l21L8l44j4R20R32j35p35m22o37j993k912k115o44r3k42J34
53572C70728J171K020K315K342K314K376K900L999N123N651N434M552L221K244
53558D16390K486L556M053L665L745N161O838P437P195O957O563N655N201O316
53544D91218Q156Q659P386O036O052P166Q536R931J1198J1729J1286J0494R940
53531F07787R327Q248P193P078P953Q974R530R698R586Q886P630O698O900P648
53517G23136P516O274N376N793O242M820J961K68J169L223M318M281M240M366
53503G82983L739K104M49k89o8P81K007L043L012J666j22j243j432j132n97M08
$$ y = [396095, 396269, 394819, 392808, 390689, 388585, 386866, 385746, 384916, 384107, 383536, 383437, 383721, 384281, 384931, 384901, 383404, 380996, 379311, 378990, 379028, 378684, 378670, 379590, 380522, 380387, 379652, 379230, 378593, 376600, 373688, 371573, 370929, 370836, 370594, 370728, 371899, 373919, 376234, 378576, 380890, 383266, 386166, 390165, 395288, 400939, 406373, 410925, 414146, 416390, 418876, 422432, 426485, 430150, 433895, 439056, 445894, 453331, 460526, 467483, 474046, 479701, 484902, 491218, 499374, 508033, 515419, 521455, 527507, 534673, 543209, 553140, 564338, 576067, 587353, 597847, 607787, 617114, 625362, 632555, 639633, 647586, 656560, 666090, 675788, 685374, 694260, 701890, 708588, 715488, 723136, 730652, 736926, 742302, 748095, 754337, 759157, 761118, 761386, 762555, 765778, 770096, 774377, 778617, 782983, 786722, 788826, 789275, 788986, 788918, 789699, 791706, 794749, 797761, 799427, 799305, 798062, 796630, 795498, 794901, 795309]
53487G95309K038L742M354L072M86j551j638l89K62n71j617j091J215L970O007
53472H13598P115P448P057O343O188P171Q973J0793J2087J2748J2997J3408J4520
53459I40446J6183J7673J8763K0090K2106K4308K6118K7831K9813L1408L1795
53448A206534L1583L2278L4275L6664L8871M1138M3087M3567M2574M2079M3840
53437A636490M7436N1189N4142N6204N7277N7379N7138N7205N7627N8363N9648
53426B250098O1089O1367N9958N8269N7860N8328N8345N8048N8621N9782N9748
53415B901513N7932N5967N5389N5599N4896N2557M9113M5278M1384L7654L4508
53404C441790L2380L1157K9838K7341K3927K1030J9102J6604J2271P266L459K49
$$ y = [795309, 797347, 801089, 805443, 808515, 809001, 807450, 805812, 805423, 805685, 805114, 803497, 802406, 803621, 807591, 813598, 820713, 828161, 835218, 841561, 847749, 854920, 863893, 874686, 886773, 899521, 912518, 925926, 940446, 956629, 974302, 993065, 1013155, 1035261, 1059569, 1085687, 1113518, 1143331, 1174739, 1206534, 1238117, 1270395, 1304670, 1341334, 1380205, 1421343, 1464430, 1507997, 1550571, 1592650, 1636490, 1683926, 1735115, 1789257, 1845461, 1902738, 1960117, 2017255, 2074460, 2132087, 2190450, 2250098, 2311187, 2372554, 2432512, 2490781, 2548641, 2606969, 2665314, 2723362, 2781983, 2841765, 2901513, 2959445, 3015412, 3070801, 3126400, 3181296, 3233853, 3282966, 3328244, 3369628, 3407282, 3441790, 3474170, 3505327, 3535165, 3562506, 3586433, 3607463, 3626565, 3643169, 3655440, 3662706, 3666165, 3666414]
53392C666414m656j1392j7091j9594k0108k1237k3956k7694l2068l7115m2354
53381C409149m6848m9946n1483n1737n1515n1697n2210n2247n1742n1609n2033
53370B846082n1768n0010m7862m6771m6341m5026m2404l9465l6936l4596l2159
53359B372744k9660k6774k2795j7670j2391p941m364j146K016N195Q748J3156
53347B279118J8287K3153K6870K9726L2797L6451L9943M2974M6711N2186N8186
53336B686402O2221O3669O4534O6764P0121P3466P6780Q0774Q5332Q9634R3457
53325C513154R7258J01147J04712J07823J10763J13575J15892J17558J18823J19898
53315D620603J20663J20868J20362J19171J17518J15714J13787J11348J08016
$$ y = [3666414, 3661758, 3650366, 3633275, 3613681, 3593573, 3572336, 3548380, 3520686, 3488618, 3451503, 3409149, 3362301, 3312355, 3260872, 3209135, 3157620, 3105923, 3053713, 3001466, 2949724, 2898115, 2846082, 2794314, 2744304, 2696442, 2649671, 2603330, 2558304, 2515900, 2476435, 2439499, 2404903, 2372744, 2343084, 2316310, 2293515, 2275845, 2263454, 2255513, 2251149, 2250003, 2252019, 2257214, 2265962, 2279118, 2297405, 2320558, 2347428, 2377154, 2409951, 2446402, 2486345, 2529319, 2576030, 2628216, 2686402, 2748623, 2812292, 2876826, 2943590, 3013711, 3087177, 3163957, 3244731, 3330063, 3419697, 3513154, 3610412, 3711559, 3816271, 3924094, 4034857, 4148432, 4264324, 4381882, 4500705, 4620603, 4741266, 4862134, 4982496, 5101667, 5219185, 5334899, 5448686, 5560034, 5668050]
53306E668050J03737R8616R2692Q6108P9234P2296O5132N7493M9413M1125L2894
53295F446790K4922J7099Q809m49j0150j9069k6812l4523m3613n4253o5474p6378
53283F166899q6713r6565j05805j13843j19904j23819j26413j28506j29655j28690
53273E006986j25780j22942j21901j22151j21773j19713j16597j13676j11547
53264C930906j09657j06701j01849r5815r0277q6005q2166p7750p2910o8358o4123
53253B975295n9641n4575m8999m3290l8250l4735l2525l0258k6966k3033j8981
53242B564042j4415r137m308j114J150M031P296R070Q681P807Q365J0500J3284
53229B605252J6258J9454K2656K5590K8483L1792L5490L9105M2307M5089M7515
$$ y = [5668050, 5771787, 5870403, 5963095, 6049203, 6128437, 6200733, 6265865, 6323358, 6372771, 6413896, 6446790, 6471712, 6488811, 6497620, 6497171, 6487021, 6467952, 6441140, 6406617, 6363004, 6308751, 6243277, 6166899, 6080186, 5983621, 5877816, 5763973, 5644069, 5520250, 5393837, 5265331, 5135676, 5006986, 4881206, 4758264, 4636363, 4514212, 4392439, 4272726, 4156129, 4042453, 3930906, 3821249, 3714548, 3612699, 3516884, 3426607, 3340602, 3258436, 3180686, 3107776, 3039418, 2975295, 2915654, 2861079, 2812080, 2768790, 2730540, 2695805, 2663280, 2633022, 2606056, 2583023, 2564042, 2549627, 2540490, 2536182, 2535068, 2536218, 2540249, 2547545, 2556615, 2565296, 2573103, 2581468, 2591968, 2605252, 2621510, 2640964, 2663620, 2689210, 2717693, 2749485, 2784975, 2824080, 2866387, 2911476, 2958991]
53218B958991M9507N0963N1836N2089N1594N0214M8208M6459M5931M6532M6898
53207C499222M5672M2793L9241L5799L2506K9186K5946K3140K1004J9244J6892
53196C830645J2906P299J281m053q769j3403j7918k2222k7162l3713m1151m7296
53184C636444n1024n3551n6566n9991o2512o3832o5154o7360o9674p0685p0085
53173B946010o8786o7538o6199o4389o2212o0054n8029n6119n4506n3351n2415
53162B282412n1257m9742m8006m6284m5037m4829m5384m5256m3272m0003l6996
53151A786346l4779l2706l0486k8531k6888k5223k4098k4678k6647k7982k7526
53140A476802k6358k5729k5264k4308k3619k4008k4495k3698k2236k1924k2935
$$ y = [2958991, 3008498, 3059461, 3111297, 3163386, 3214980, 3265194, 3313402, 3359861, 3405792, 3452324, 3499222, 3544894, 3587687, 3626928, 3662727, 3695233, 3724419, 3750365, 3773505, 3794509, 3813753, 3830645, 3843551, 3850850, 3852131, 3848078, 3839309, 3825906, 3807988, 3785766, 3758604, 3724891, 3683740, 3636444, 3585420, 3531869, 3475303, 3415312, 3352800, 3288968, 3223814, 3156454, 3086780, 3016095, 2946010, 2877224, 2809686, 2743487, 2679098, 2616886, 2556832, 2498803, 2442684, 2388178, 2334827, 2282412, 2231155, 2181413, 2133407, 2087123, 2042086, 1997257, 1951873, 1906617, 1863345, 1823342, 1786346, 1751567, 1718861, 1688375, 1659844, 1632956, 1607733, 1583635, 1558957, 1532310, 1504328, 1476802, 1450444, 1424715, 1399451, 1375143, 1351524, 1327516, 1303021, 1279323, 1257087, 1235163, 1212228]
53129A212228k3746k3746k4009k5290k6846k7705k7857k7572k6676k5172k3835
53118I29774k3542k4315k5209k4956k2945k0066j8268j8508j9359j8525j5622
53107F98459j2579j1483j2765j5350j7578j7918j5866j2440r360p684p528q584
53095E49324j0109j0958j0604r801r303q630p243o218o835q043p511n279l980
53082D44810m819n704m531k418j859l179m643n238n433n520m874l165j271n61
53068C91595j619l622m869m280k658j921k845m204m529l761k643j393Q4J309J565
53053C56209Q22l09j232j504q15M24J099O18l60r63j162j112l52J245K468K123
53037C57199R79R48K407L736L585K244N70j133k581l063k394j661k156l782n055
$$ y = [1212228, 1188482, 1164736, 1140727, 1115437, 1088591, 1060886, 1033029, 1005457, 978781, 953609, 929774, 906232, 881917, 856708, 831752, 808807, 788741, 770473, 751965, 732606, 714081, 698459, 685880, 674397, 661632, 646282, 628704, 610786, 594920, 582480, 573120, 565436, 557908, 549324, 539215, 528257, 517653, 507852, 498549, 489919, 482676, 476458, 469623, 461580, 454069, 448790, 444810, 439991, 434287, 429756, 427338, 425479, 422300, 417657, 412419, 406986, 401466, 396592, 393427, 392156, 391595, 389976, 386354, 381485, 377205, 374547, 372626, 369781, 365577, 361048, 357287, 354644, 353251, 353335, 354644, 356209, 357031, 356722, 355490, 353986, 353171, 353595, 354694, 355312, 354952, 353989, 352827, 351715, 351363, 352608, 355076, 357199, 358178, 359126, 361533, 365269, 368854, 371098, 371668, 370535, 367954, 364891, 362497, 360836, 358680, 354898, 349843]
53022C49843m641k687q04p59k802n334o552o290n695n436n115m428l822l631l548
53007B88299l391l466l728l537k909k950m035m566k977l94L52j671m349n145l716
52992B41817j498O8L51m29j301j366r39j122j920j920m96P98J85j852l299l184
52976B23893k197j181m82n33j577k691k458r12M20N93J41m04j398k745l136j779
52960B03554O1N18m22j165r04n30j109k349k987k330j147r21k107l293k675m64
52944A81730J088M04j484k342j407K12J286J631J658J698J896K252K531K293J164
52929A94610p59k543k828j212R14J814J528J563K416K842J931M34o50j289j404
52914A97367k71J845K973J991O10J046K764L570K994K448K524K492K283K759L803
$$ y = [349843, 345202, 342515, 341711, 340952, 338150, 332816, 326264, 319974, 314279, 308843, 303728, 299300, 295478, 291847, 288299, 284908, 281442, 277714, 274177, 271268, 268318, 264283, 259717, 256740, 256346, 256698, 255027, 250678, 245533, 241817, 240319, 240387, 240738, 240309, 239008, 237642, 236703, 235581, 233661, 231741, 231245, 232043, 232228, 230376, 227077, 223893, 221696, 220515, 220033, 219500, 217923, 215232, 212774, 211862, 212282, 212875, 213016, 212612, 211214, 208469, 205333, 203554, 203615, 204133, 203711, 202546, 201642, 201112, 200003, 197654, 194667, 192337, 191190, 190269, 188162, 184869, 182194, 181730, 182818, 183222, 181738, 179396, 177989, 178201, 179487, 181118, 182776, 184474, 186370, 188622, 191153, 193446, 194610, 193851, 191308, 188480, 187268, 188182, 189996, 191524, 193087, 195503, 198345, 200276, 200710, 200060, 198771, 197367, 197096, 198941, 201914, 203905, 204515, 205561, 208325, 211895, 214889, 217337, 219861, 222353, 224636, 227395, 231198]
52899B31198M172L584L184L558L975L984M204N036N967O623P143P314O707N784
52885C02433N446N356M453L270L613N483O454M919K032o39l163n694o860n678
52871C21425l635k921l576m155m301m769n414n066l392j543p89j376k650l577
52857B74261l385k275j224p54n24m22r24j764j627j78P77m23k807m037l437k134
52841B49123q85M22J356R16p89k210k168j033J21O31L72l02n51K78J725K531K035
52824B51572Q05j51l61q7J28J49N45J739K889K446L09j593j651n52Q4M5K58R21
52806B57495J436J739K101J928L81j740k416j011Q02J291O74L85J255K879M112
52791B71311L918K360Q64P14J300R32n10j072N44K993M008L278K560L240M883
$$ y = [231198, 235370, 238954, 242138, 245696, 249671, 253655, 257859, 262895, 268862, 275485, 282628, 289942, 296649, 302433, 307879, 313235, 317688, 320958, 324571, 330054, 336508, 341427, 343459, 342820, 339657, 333963, 327103, 321425, 317790, 314869, 311293, 307138, 302837, 298068, 292654, 287588, 284196, 282653, 281864, 280488, 277838, 274261, 270876, 268601, 267377, 266623, 266099, 265677, 264753, 262989, 261362, 261184, 261961, 261538, 258731, 254694, 251257, 249123, 248238, 248660, 250016, 250932, 250143, 247933, 245765, 244732, 244853, 245484, 245856, 245554, 245003, 245281, 247006, 249537, 251572, 252377, 252226, 251865, 251778, 251906, 252055, 252600, 254339, 257228, 259674, 259983, 258390, 256739, 256187, 256271, 256316, 256574, 257495, 258931, 260670, 262771, 264699, 265080, 263340, 260924, 259913, 260715, 262006, 262680, 263065, 264320, 267199, 271311, 275229, 277589, 278453, 279167, 280467, 281399, 280889, 279817, 280361, 283354, 287362, 290640, 293200, 296440, 301323]
52776C01323O169O434N979N289M460L503K723K422K222J383%p69k28P99J184J140
52760C44033J589K335K214J032n5l92q22k194l882m651m287l644l537m235n604
52745C17900p117q035q066p636p035n810l721j955k327m966p645q031o236m366
52731B34954l763l670k917j953k106l362m159l557k362j664j300o60o6k55j025
52716B02135j507j495j547j882k182k381k702k873k261r08L18P98O55O6j087k653
52700A80494l933m291l630k161k62J314J696P04r91k548l537l818l448k768k145
52685A50676j546p01K95R45P95l34k189l798l909k544j532k380m003l974j778
52670A24023O70J831K104K042R75j377l314k878o69P43P3j282j379k03O41K08
$$ y = [301323, 307492, 313926, 319905, 325194, 329654, 333157, 335880, 338302, 340524, 341907, 341907, 341138, 340910, 341709, 342893, 344033, 345622, 347957, 350171, 351203, 351148, 350756, 349934, 347740, 343858, 339207, 334920, 331276, 327739, 323504, 317900, 310783, 302748, 294682, 287046, 280011, 274201, 270480, 268525, 266198, 261232, 253587, 245556, 239320, 234954, 231191, 227521, 224604, 222651, 220545, 217183, 213024, 209467, 207105, 205441, 204141, 203481, 203415, 203160, 202135, 200628, 199133, 197586, 195704, 193522, 191141, 188439, 185566, 183305, 182397, 182715, 183513, 184168, 184234, 183147, 180494, 176561, 172270, 168640, 166479, 166217, 167531, 169227, 169931, 168940, 166392, 162855, 159037, 155589, 152821, 150676, 149130, 148429, 148724, 149669, 150464, 150130, 147941, 144143, 140234, 137690, 136158, 133778, 129775, 125801, 124023, 124693, 126524, 128628, 130670, 131645, 130268, 126954, 124076, 123407, 124150, 124223, 122941, 121562, 121359, 122000, 122208]
52654A22208o39n90J88K77q29j753j127L19Q38K79O4O63R01J69m52j47J41n01
52636A20009j017J76K668M491M658L730K418J105N29J308K671L068K306J794K328
52621A52242K991K779K143K048K412K532K469K935L991M693M197K654Q90m74j367
52606A87135j922k240k483l010l979m832m660l364j985j555j962k492k884l218
52592A46549l199k597k063k347k826k210q35o67k418m192m027k517j539j475j259
52577A12378m86K29N47N15l26k144l409k190Q67K906K592J524J191Q06n19j534
52561A12947q13O15Q09J3j8Q63J210O81L54M04j21r84o30J015J939J247O81J596
52543A21808K538J636k24p65J33N81j45o65Q3J263J490O70j34j47K59O8r92j743
$$ y = [122208, 121569, 120979, 121167, 121444, 120615, 118862, 117735, 118054, 118892, 119171, 119235, 119898, 120799, 120968, 120516, 120369, 120510, 120009, 118992, 119168, 121836, 126327, 130985, 134715, 137133, 138238, 138767, 140075, 142746, 145814, 148120, 149914, 152242, 155233, 158012, 160155, 162203, 164615, 167147, 169616, 172551, 176542, 181235, 185432, 188086, 188976, 188502, 187135, 185213, 182973, 180490, 177480, 173501, 168669, 164009, 160645, 158660, 157105, 155143, 152651, 149767, 146549, 143350, 140753, 138690, 136343, 133517, 131307, 130472, 129805, 127387, 123195, 119168, 116651, 115112, 113637, 112378, 111892, 112121, 112668, 113183, 112857, 110713, 107304, 105114, 105981, 108887, 111479, 113003, 114194, 115000, 114481, 112947, 112134, 112749, 113558, 113571, 113553, 114416, 115626, 116307, 116661, 117065, 116944, 115960, 115330, 116345, 118284, 119531, 120212, 121808, 124346, 125982, 125758, 124993, 125126, 125707, 125562, 124897, 124980, 126243, 127733, 128403, 128269, 128122, 128381, 128449, 127457, 125714]
52525A25714q48J244K562K185J339J358J834J852J734K172K634K222J395J235
52511A48632J579J549J336J667K039J446O19J258K989L463K011Q28J529K682K367
52496A75994J240J119J789J513K00j23J680M062M718L286J357L98L88M50J02l63
52480A97810m77j27N27J170J226J39j787l250l202j981o41M27J517K546K910K461
52464A99268J783J439J442J583J652J383P17J20R5N04Q33Q07L79m44j075n24J031
52447B10993J620j33k715l448k123r83j235j659j039Q6Q48J385J894J884J420
52432B06795J575K605L029J723k25r83l30N98J002P81o0j176j718j281m80K23
52416B12078J304K974M118L628J993N37k70o37l89N95J415R65m34j287o91Q39
$$ y = [125714, 124866, 126110, 128672, 130857, 132196, 133554, 135388, 137240, 138974, 141146, 143780, 146002, 147397, 148632, 150211, 151760, 153096, 154763, 156802, 158248, 158867, 160125, 163114, 166577, 168588, 169416, 170945, 173627, 175994, 177234, 178353, 180142, 181655, 181855, 181732, 183412, 187474, 192192, 195478, 196835, 197233, 197621, 198071, 198173, 197810, 197333, 197206, 197733, 198903, 200129, 200268, 198481, 195231, 192029, 190048, 189407, 189834, 191351, 193897, 196807, 199268, 201051, 202490, 203932, 205515, 207167, 208550, 209267, 209387, 209482, 209986, 210819, 211626, 212005, 211561, 210486, 209962, 210993, 212613, 212480, 209765, 206317, 204194, 203211, 201976, 200317, 199278, 199364, 200212, 201597, 203491, 205375, 206795, 208370, 210975, 214004, 215727, 215502, 214519, 214189, 214787, 215789, 216570, 216510, 215334, 213616, 212335, 211855, 212078, 213382, 216356, 220474, 224102, 226095, 226632, 226362, 225725, 225336, 225931, 227346, 228311, 227877, 226590, 225899, 226738]
52400B26738K147K342J401M24P17K066K609J194r77j911j239j25N20O39N08N90
52384B37643J301K102J655j69j526j018K49M70p7M4P63Q84O04J319L030M162M091
52367B55527L776L663K981J596O11M73K98k64k39P78J607J287M28j80r12k137
52351B69293l114l130k644k200j398j60K74r00k413k584j768j353j112K83K345
52336B49419K708M93k129k701j293M19J584K360K597J854N49k78m08n90j091j144
52320B52349k60J000K030L055M102M080K222n3m21J241K588K195J553K746N308
$$ y = [226738, 228885, 231227, 232628, 233052, 233769, 235835, 238444, 239638, 238661, 236750, 235511, 235386, 235906, 236545, 237053, 237643, 238944, 241046, 242701, 242532, 241006, 239988, 240237, 240707, 240630, 240674, 241437, 242321, 242925, 244244, 247274, 251436, 255527, 259303, 262966, 265947, 267543, 268154, 268627, 268925, 268661, 268422, 269200, 270807, 272094, 272522, 272342, 271430, 269293, 266179, 263049, 260405, 258205, 256807, 256647, 256921, 256021, 253608, 251024, 249256, 247903, 246791, 247074, 249419, 252127, 252620, 250491, 247790, 246497, 246916, 248500, 250860, 253457, 255311, 255860, 255582, 255174, 254584, 253493, 252349, 252089, 253089, 255119, 258174, 262276, 266356, 268578, 268525, 268104, 269345, 271933, 274128, 275681, 278427, 283735]
$$ [...]
##END NTUPLES=NMR SPECTRUM
##END=
