##TITLE=coffee_type TORI02-ROVE100A-90-10
COFFEE_meoh_noesyp64 COFFEE_meoh {C:\Bruker\TOPSPIN} Administrator 12
##JCAMPDX= 6.0         $$ Bruker NMR JCAMP-DX V2.0
##DATA TYPE= NMR SPECTRUM
##DATA CLASS= NTUPLES
##ORIGIN= Bruker BioSpin GmbH
##OWNER= Administrator
$$ 1.72 TOPSPIN		Version 2.1
$$ 2012-05-29 13:28:38.017 -0700  Administrator@X
$$ Compression mode = diff/dup
##.OBSERVE FREQUENCY= 400.13188235
##.OBSERVE NUCLEUS= ^1H
##.ACQUISITION MODE= SIMULTANEOUS (DQD)
##.ACQUISITION SCHEME= undefined
##.AVERAGES= 64
##.DIGITISER RES= 22
##SPECTROMETER/DATA SYSTEM= spect
##.PULSE SEQUENCE= noesygpps1d.comp
##.SOLVENT NAME= COFFEE_meoh
##.SHIFT REFERENCE= INTERNAL, COFFEE_meoh, 1, 14.98061
##AUDIT TRAIL= $$ (NUMBER, WHEN, WHO, WHERE, PROCESS, VERSION, WHAT)
$$ ##TITLE= Audit trail, TOPSPIN		Version 2.1
$$ ##JCAMPDX= 5.01
$$ ##ORIGIN= Bruker BioSpin GmbH
$$ ##OWNER= Administrator
$$ $$ Z:/data/jwist/nmr/12-COFFEE-0203/142/pdata/1/auditp.txt
$$ ##AUDIT TRAIL=  $$ (NUMBER, WHEN, WHO, WHERE, PROCESS, VERSION, WHAT)
(   1,<2012-03-03 00:31:55.053 -0500>,<Administrator>,<TOPSPIN>,<go>,<TOPSPIN 2.1>,
      <created by zg
	started at 2012-03-03 00:20:24.787 -0500,
	POWCHK enabled, PULCHK disabled,
       configuration hash MD5:
       1A 1E CE 29 27 FD 77 03 67 4E F0 E3 C4 B2 CB 90
       data hash MD5: 64K
       C9 2A E7 F0 34 58 80 2E B8 BA EC 82 F4 0D 85 61>)
(   2,<2012-03-03 00:31:59.818 -0500>,<Administrator>,<TOPSPIN>,<audit>,<TOPSPIN 2.1>,
      <user comment:
       ICON-NMR User ID: Administrator
       data hash MD5: 64K
       C9 2A E7 F0 34 58 80 2E B8 BA EC 82 F4 0D 85 61>)
(   3,<2012-05-29 09:24:51.425 -0700>,<Administrator>,<X>,<proc1d>,<TOPSPIN 2.1>,
      <Start of raw data processing
       efp LB = 0.3 FT_mod = 6 PKNL = 1 PHC0 = 0 PHC1 = 0 SI = 128K 
       data hash MD5: 128K
       2C 23 3D 12 63 4A 6C 8D 60 97 5D 00 AA C7 A4 31>)
(   4,<2012-05-29 09:24:52.003 -0700>,<Administrator>,<X>,<proc1d>,<TOPSPIN 2.1>,
      <pk PHC0 = 38.01819 PHC1 = 0 
       data hash MD5: 128K
       3D 2D F7 44 02 23 33 3C 47 5A 05 49 B8 D6 9C F3>)
(   5,<2012-05-29 09:24:53.222 -0700>,<Administrator>,<X>,<proc1d>,<TOPSPIN 2.1>,
      <abs ABSG = 1 
       data hash MD5: 128K
       98 FD 1D AC 22 4E 31 21 52 9A F5 93 7C EA 8B DD>)
(   6,<2012-05-29 09:24:53.300 -0700>,<Administrator>,<X>,<proc1d>,<TOPSPIN 2.1>,
      <abs ABSG = 2 
       data hash MD5: 128K
       BA 5F 82 7C 14 76 54 B9 58 53 B5 CA 58 7D 9E A4>)
(   7,<2012-05-29 09:24:53.394 -0700>,<Administrator>,<X>,<proc1d>,<TOPSPIN 2.1>,
      <abs ABSG = 3 
       data hash MD5: 128K
       98 05 52 E5 12 EB 7D 8B 8A 65 AF A5 5B B7 6C B3>)
(   8,<2012-05-29 09:24:53.456 -0700>,<Administrator>,<X>,<proc1d>,<TOPSPIN 2.1>,
      <abs ABSG = 4 
       data hash MD5: 128K
       94 45 78 99 EE 7E CD 72 7B 3A FA 6E B2 31 C8 57>)
(   9,<2012-05-29 09:24:53.534 -0700>,<Administrator>,<X>,<proc1d>,<TOPSPIN 2.1>,
      <abs ABSG = 5 
       data hash MD5: 128K
$$ [...]
150 150 150 150 150 150 150 150
##$TP07= 0
##$TPNAME0= <>
##$TPNAME1= <>
##$TPNAME2= <>
##$TPNAME3= <>
##$TPNAME4= <>
##$TPNAME5= <>
##$TPNAME6= <>
##$TPNAME7= <>
##$TPOAL= (0..7)
0.5 0.5 0.5 0.5 0.5 0.5 0.5 0.5
##$TPOFFS= (0..7)
0 0 0 0 0 0 0 0
##$TUNHIN= 0
##$TUNHOUT= 0
##$TUNXOUT= 0
##$USERA1= <user>
##$USERA2= <user>
##$USERA3= <user>
##$USERA4= <user>
##$USERA5= <user>
##$V9= 5
##$VALIST= <valist>
##$VCLIST= <CCCCCCCCCCCCCCC>
##$VD= 0
##$VDLIST= <DDDDDDDDDDDDDDD>
##$VPLIST= <PPPPPPPPPPPPPPP>
##$VTLIST= <TTTTTTTTTTTTTTT>
##$WBST= 1024
##$WBSW= 4
##$XGAIN= (0..3)
0 0 0 0
##$XL= 0
##$YL= 0
##$YMAX_a= 15446162
##$YMIN_a= -7333960
##$ZGOPTNS= <>
##$ZL1= 120
##$ZL2= 120
##$ZL3= 120
##$ZL4= 120
##$ABSF1= 14.98061
##$ABSF2= -5.57192
##$ABSG= 5
##$ABSL= 3
##$ALPHA= 0
##$AQORDER= 0
##$ASSFAC= 0
##$ASSFACI= 0
##$ASSFACX= 0
##$ASSWID= 0
##$AUNMP= <proc_prof1d_extract>
##$AXLEFT= 0
##$AXNAME= <>
##$AXNUC= <1H>
##$AXRIGHT= 0
##$AXTYPE= 0
##$AXUNIT= <>
##$AZFE= 0.1
##$AZFW= 0.1
##$BCFW= 0
##$BC_mod= 0
##$BYTORDP= 0
##$COROFFS= 0
##$CY= 15
##$DATMOD= 1
##$DC= 0
##$DFILT= <>
##$DTYPP= 0
##$F1P= 0
##$F2P= 0
##$FCOR= 0.5
##$FTSIZE= 131072
##$FT_mod= 6
##$GAMMA= 0
##$GB= 0
##$INTBC= 1
##$INTSCL= 1
##$ISEN= 128
##$LB= 0.3
##$LEV0= 0
##$LPBIN= 0
##$MAXI= 10000
##$MC2= 0
##$MEAN= 0
##$ME_mod= 0
##$MI= 0
##$NCOEF= 0
##$NC_proc= -3
##$NLEV= 6
##$NOISF1= 0
##$NOISF2= 0
##$NSP= 0
##$NTH_PI= 0
##$NZP= 0
##$OFFSET= 14.98061
##$PC= 1
##$PHC0= 38.01819
##$PHC1= 0
##$PH_mod= 1
##$PKNL= yes
##$PPARMOD= 0
##$PPDIAG= 0
##$PPIPTYP= 0
##$PPMPNUM= 2147483647
##$PPRESOL= 1
##$PSCAL= 4
##$PSIGN= 0
##$PYNMP= <proc.py>
##$REVERSE= no
##$SF= 400.13
##$SI= 131072
##$SIGF1= 0
##$SIGF2= 0
##$SINO= 400
##$SIOLD= 131072
##$SPECTYP= <>
##$SREGLST= <1H.CDCl3>
##$SSB= 0
##$STSI= 131072
##$STSR= 0
##$SW_p= 8223.68421052632
##$SYMM= 0
##$S_DEV= 0
##$TDeff= 65536
##$TDoff= 0
##$TI= <>
##$TILT= no
##$TM1= 0
##$TM2= 0
##$TOPLEV= 0
##$USERP1= <user>
##$USERP2= <user>
##$USERP3= <user>
##$USERP4= <user>
##$USERP5= <user>
##$WDW= 1
##$XDIM= 131072
##$YMAX_p= 562116107
##$YMIN_p= -151869646
##$CURPLOT= <Network HP LaserJet P1505>
##$CURPRIN= <$Network HP LaserJet P1505>
##$DFORMAT= <normdp>
##$LAYOUT= <+/1D_H.xwp>
##$LFORMAT= <normlp>
##$PFORMAT= <normpl>
##$SURQMSG= 1
$$ End of Bruker specific parameters
$$ ---------------------------------
##NTUPLES= NMR SPECTRUM
##VAR_NAME=  FREQUENCY,     SPECTRUM/REAL,   SPECTRUM/IMAG
##SYMBOL=    X,             R,               I
##VAR_TYPE=  INDEPENDENT,   DEPENDENT,       DEPENDENT
##VAR_FORM=  AFFN,          ASDF,            ASDF
##VAR_DIM=   131072,        131072,          131072
##UNITS=     HZ,            ARBITRARY UNITS, ARBITRARY UNITS
##FACTOR=    0.0627417313425165, 1,          1
##FIRST=     8223.62146879498, -830,         -102155
##LAST=      0,             3979,            -102122
##MIN=       0,             -151869646,      0
##MAX=       8223.62146879498, 562116107,    0
$$ Real data points
##PAGE= N=1
##DATA TABLE= (X++(R..R)), XYDATA
$$ [...]
$$ plain form
60691 1774762 1781482 1787626 1793576 1799000 1802996 1805350 1807086 1809208 1811294 1811958 1810374 1806659 1801100 1793848
60677 1793848 1785323 1776189 1766901 1757826 1749701 1743161 1737676 1731575 1723366 1712665 1699852 1685496 1670451
60664 1670451 1656052 1643661 1633760 1625402 1616681 1606192 1594253 1582303 1570949 1559329 1546767 1534129
60652 1534129 1522665 1512286 1502217 1492703 1484534 1477171 1469114 1460317 1452538 1446732 1441686 1436155 1431000
60639 1431000 1428047 1427755 1429190 1431622 1434898 1438577 1441772 1443725 1443874 1441682 1437120 1431007 1424084 1415907
60625 1415907 1405306 1391707 1375332 1356453 1335280 1312476 1289056 1265824 1243521 1223283 1206146
60614 1206146 1192017 1179858 1169049 1160007 1153371 1149094 1146493 1144784 1143473 1142550 1142416 1143471 1146017 1150718
60600 1150718 1158544 1169439 1181365 1191558 1198826 1204010 1208415 1212788 1217807 1224266 1232088 1239969 1246810
$$ packed form
60691A774762O720O144N950N424L996K354J736K122K086O64j584l715n559p252
60677A793848q525r134r288r075q125o540n485o101q209j0701j2813j4356j5045
60664A670451j4399j2391r901q358q721j0489j1939j1950j1354j1620j2562j2638
60652A534129j1464j0379j0069r514q169p363q057q797p779n806n046n531n155
60639A431000k953k92J435K432L276L679L195J953J49k192m562o113o923q177
60625A415907j0601j3599j6375j8879k1173k2804k3420k3232k2303k0238j7137
60614A206146j4129j2159j0809r042o636m277k601j709j311r23j34J055K546M701
60600A150718P826J0895J1926J0193P268N184M405M373N019O459P822P881O841
$$ plain form
60587 1246810 1253089 1260208 1268773 1278124 1287302 1295969 1304365 1312740 1320902 1328358 1335156 1342595 1352638 1366302
60573 1366302 1382861 1400816 1419245 1437944 1456734 1475267 1493518 1512124 1532166 1554543 1579132
60562 1579132 1604357 1627980 1648696 1666695 1682442 1695416 1704615 1709882 1711981 1711434 1708008 1701493 1692416
60549 1692416 1681751 1670246 1658180 1645531 1632238 1618559 1605267 1593246 1582857 1573864 1565884 1558540
60537 1558540 1551217 1543228 1534563 1526158 1519081 1513464 1508305 1502216 1494434 1485458 1476836 1470133 1466000 1464423
60523 1464423 1465572 1469684 1475859 1481859 1485947 1488722 1492364 1498073 1504805 1510602 1514515 1517009 1519147 1521923
60509 1521923 1525924 1530950 1535864 1539272 1540507 1539769 1537366 1533236 1527366 1520299 1512855 1505436 1498005 1490721
60495 1490721 1484207 1478864 1474100 1468745 1462460 1456622 1453530 1454637 1459719 1467716 1478085 1491105 1507156
$$ packed form
60587A246810O279P119Q565R351R178Q667Q396Q375Q162P456O798P439J0043J3664
60573A366302J6559J7955J8429J8699J8790J8533J8251J8606K0042K2377K4589
60562A579132K5225K3623K0716J7999J5747J2974R199N267K099n47l426o515r077
60549A692416j0665j1505j2066j2649j3293j3679j3292j2021j0389q993p980p344
60537A558540p323p989q665q405p077n617n159o089p782q976q622o703m133j577
60523A464423J149M112O175O000M088K775L642N709O732N797L913K494K138K776
60509A521923M001N026M914L408J235p38k403m130n870p067p444p419p431p284
60495A490721o514n343m764n355o285n838l092J107N082P997J0369J3020J6051
$$ plain form
60482 1507156 1526257 1548389 1573805 1602799 1635633 1672984 1716023 1765300 1819706 1877250 1936832
60471 1936832 1998354 2060656 2120104 2171974 2212873 2241397 2257221 2260883 2254419 2240945 2222875 2201159
60459 2201159 2176743 2152260 2131597 2117992 2112900 2116247 2127078 2144006 2165778 2191768 2221735 2254936
60447 2254936 2289780 2324625 2358961 2393805 2430999 2472165 2518282 2570031 2628259 2694100 2769011
60436 2769011 2855025 2954746 3070499 3203339 3353260 3520518 3706473 3913066 4141864 4393791
60426 4393791 4669538 4970128 5297414 5653939 6041583 6459897 6905775 7373866 7855026
60417 7855026 8332746 8781750 9171963 9475001 9668106 9735076 9667873 9469773 9156476 8752645
60407 8752645 8286160 7783709 7268410 6758304 6265635 5797688 5358827 4952189 4579892
$$ packed form
60482A507156J9101K2132K5416K8994L2834L7351M3039M9277N4406N7544N9582
60471A936832O1522O2302N9448N1870M0899K8524J5824L662o464j3474j8070k1716
60459B201159k4416k4483k0663j3605n092L347J0831J6928K1772K5990K9967L3201
60447B254936L4844L4845L4336L4844L7194M1166M6117N1749N8228O5841P4911
60436B769011Q6014R9721J15753J32840J49921J67258J85955K06593K28798K51927
60426D393791K75747L00590L27286L56525L87644M18314M45878M68091M81160
60417G855026M77720M49004L90213L03038J93105O6970o7203j98100l13297m03831
60407H752645m66485n02451n15299n10106m92669m67947m38861m06638l72297
$$ plain form
60398 4579892 4242129 3936690 3660224 3410408 3186489 2987284 2809377 2648425 2502124
60389 2502124 2370843 2255199 2153948 2064379 1983754 1909958 1841792 1779362 1723474 1674009 1629382
60378 1629382 1588015 1549582 1514144 1480836 1448338 1416310 1385588 1357164 1331465 1308244 1286658
60367 1286658 1265894 1246392 1230012 1218195 1210120 1203263 1195551 1186614 1177467 1169613 1163929 1159646 1154959
60354 1154959 1149395 1145089 1144624 1147996 1152765 1156802 1159606 1161237 1161706 1161849 1163377 1167184 1172354 1177302 1181184
60339 1181184 1183962 1186041 1188402 1192143 1197242 1202431 1206874 1211280 1216832 1223749 1231561 1240005 1248678 1256308
60325 1256308 1261464 1263968 1264968 1265737 1266917 1268585 1270220 1270683 1268945 1265016 1259808 1254216 1248756 1243856
60311 1243856 1239813 1236502 1233836 1232523 1233514 1236353 1238808 1238906 1237054 1235521 1235877 1237612 1239501 1241721 1245823
$$ packed form
60398D579892l37763l05439k76466k49816k23919j99205j77907j60952j46301
60389B502124j31281j15644j01251q9569q0625p3796o8166o2430n5888m9465m4627
60378A629382m1367l8433l5438l3308l2498l2028l0722k8424k5699k3221k1586
60367A286658k0764j9502j6380j1817q075o857p712q937r147p854n684m283m687
60354A154959n564m306m65L372M769M037K804J631M69J43J528L807N170M948L882
60339A181184K778K079K361L741N099N189M443M406N552O917P812Q444Q673P630
60325A256308N156K504J000P69J180J668J635M63j738l929n208n592n460m900
60311A243856m043l311k666j313R91K839K455R8j852j533L56J735J889K220M102
$$ plain form
60296 1245823 1252595 1260595 1267412 1272155 1276163 1281250 1287857 1295246 1302932 1311138 1319893 1328487 1336311 1343836
60282 1343836 1352127 1361396 1370560 1378437 1384943 1390738 1396043 1400460 1403835 1406611 1409162 1411441 1413585 1416286
60268 1416286 1420013 1424401 1429012 1434339 1441264 1449583 1457788 1464397 1469157 1472943 1476847 1481235 1485212 1487047
60254 1487047 1485539 1480837 1473743 1464819 1454851 1445538 1438312 1432516 1426076 1418418 1411582 1407820 1406951 1406806
60240 1406806 1405672 1403565 1401579 1400765 1401551 1403755 1407139 1411964 1418725 1427340 1437014 1446884 1456231 1464198
60226 1464198 1470258 1475167 1480425 1486438 1492221 1497338 1502954 1510165 1518423 1526681 1535172 1544816 1555566 1566729
60212 1566729 1578399 1591168 1604697 1618215 1632456 1649570 1670584 1694085 1718056 1742208 1768031
60201 1768031 1797241 1830725 1868380 1909318 1952450 1997335 2044575 2095499 2151679 2214451 2284226
$$ packed form
60296A245823O772Q000O817M743M008N087O607P389P686Q206Q755Q594P824P525
60282A343836Q291R269R164P877O506N795N305M417L375K776K551K279K144K701
60268A416286L727M388M611N327O925Q319Q205O609M760L786L904M388L977J835
60254A487047j508m702p094q924r968r313p226n796o440p658o836l762q69j45
60240A406806j134k107j986q14P86K204L384M825O761Q615R674R870R347P967
60226A464198O060M909N258O013N783N117N616P211Q258Q258Q491R644J0750J1163
60212A566729J1670J2769J3529J3518J4241J7114K1014K3501K3971K4152K5823
60201A768031K9210L3484L7655M0938M3132M4885M7240N0924N6180O2772O9775
$$ plain form
60190 2284226 2360209 2441290 2527319 2619233 2718160 2825086 2941020 3066407 3200226 3340786
60180 3340786 3487889 3643222 3807914 3980486 4158145 4339562 4525158 4714488 4904211
60171 4904211 5089029 5264259 5427223 5576607 5711232 5829769 5931290 6015413 6081552 6128414
60161 6128414 6154900 6161743 6151960 6129457 6097286 6057335 6011603 5963454 5917289 5876829 5844021 5819971
60149 5819971 5806664 5806964 5822918 5855089 5903975 5970899 6056472 6159104 6276500 6408219 6555162
60138 6555162 6716525 6888608 7066882 7247732 7427654 7602157 7766547 7917014 8050227
60129 8050227 8162720 8251625 8315463 8353489 8364980 8350060 8310650 8249613 8169430 8072575 7962673
60118 7962673 7844199 7721466 7599033 7482459 7376803 7284191 7204491 7139038 7092237 7068580
$$ packed form
60190B284226P5983Q1081Q6029R1914R8927J06926J15934J25387J33819J40560
60180C340786J47103J55333J64692J72572J77659J81417J85596J89330J89723
60171D904211J84818J75230J62964J49384J34625J18537J01521Q4123O6139M6862
60161F128414K6486O843r783k2503l2171l9951m5732m8149m6165m0460l2808k4050
60149E819971j3307L00J5954L2171M8886O6924Q5573J02632J17396J31719J46943
60138F555162J61363J72083J78274J80850J79922J74503J64390J50467J33213
60129H050227J12493Q8905O3838L8026J1491j4920l9410o1037q0183r6855j09902
60118G962673j18474j22733j22433j16574j05656r2612p9700o5453m6801k3657
$$ plain form
60108 7068580 7069193 7092330 7136188 7199777 7281649 7379362 7490254 7611395 7738475 7865832 7988159
60097 7988159 8101631 8203254 8290266 8360901 8415025 8453185 8475542 8482679 8477215 8463598 8446123
60086 8446123 8427787 8411277 8400503 8400749 8417404 8454428 8513649 8595519 8700945 8832381 8992973
60075 8992973 9184982 9409675 9668507 9963339 10295296 10664353 11070410 11513798 11993994
60066 11993994 12508403 13052967 13623127 14213226 14815443 15420293 16018022 16598849 17152392
60057 17152392 17668138 18136676 18549912 18900369 19181361 19387795 19515860 19561924 19523039 19399120
60047 19399120 19193853 18913237 18564390 18156518 17702023 17215273 16710281 16199973 15696919
60038 15696919 15213167 14758661 14340171 13962021 13627665 13340490 13103466 12918270 12784678
$$ packed form
60108G068580O13K3137M3858O3589Q1872R7713J10892J21141J27080J27357J22327
60097G988159J13472J01623Q7012P0635N4124L8160K2357P137n464j3617j7475
60086H446123j8336j6510j0774K46J6655L7024N9221Q1870J05426J31436J60592
60075H992973J92009K24693K58832K94832L31957L69057M06057M43388M80196
60066A1993994N14409N44564N70160N90099O02217O04850N97729N80827N53543
60057A7152392N15746M68538M13236L50457K80992K06434J28065M6064l8885j23919
60047A9399120k05267k80616l48847m07872m54495m86750n04992n10308n03054
60038A5696919m83752m54506m18490l78150l34356k87175k37024j85196j33592
$$ plain form
60029 12784678 12700603 12662517 12665862 12705300 12774935 12868273 12977703 13094152 13207921 13310524
60019 13310524 13395984 13460578 13501647 13516649 13503075 13459166 13384841 13281848 13152663 12999246
60009 12999246 12823102 12626238 12411343 12180904 11936912 11681924 11420052 11156410 10895635
60000 10895635 10640917 10394186 10157094 9932138 9722901 9532966 9364713 9219638 9099471
59991 9099471 9005943 8939336 8898485 8882821 8893395 8931002 8994191 9080290 9187765 9316104 9463349
59980 9463349 9624863 9794608 9966522 10134513 10292310 10434127 10554991 10650111 10714810 10745825
59970 10745825 10742278 10704780 10634027 10531058 10398659 10241665 10065540 9875025 9674272 9467896
59960 9467896 9261593 9061689 8873859 8701822 8547142 8410576 8293689 8198901 8128004 8081352
$$ packed form
60029A2784678q4075l8086L345L9438O9635R3338J09430J16449J13769J02603
60019A3310524Q5460O4594M1069J5002j3574m3909p4325j02993j29185j53417
60009A2999246j76144j96864k14895k30439k43992k54988k61872k63642k60775
60000A0895635k54718k46731k37092k24956k09237j89935j68253j45075j20167
59991I099471r3528o6607m0851j5664J0574L7607O3189Q6099J07475J28339J47245
59980I463349J61514J69745J71914J67991J57797J41817J20864R5120O4699L1015
59970A0745825l547l7498p0753j02969j32399j56994j76125j90515k00753k06376
59960I467896k06303j99904j87830j72037j54680j36566j16887r4788p0897m6652
$$ plain form
59950 8081352 8058891 8061389 8089882 8144316 8223897 8328958 8461237 8621487 8807466 9015232
59940 9015232 9241911 9485915 9744312 10011046 10278109 10537589 10782124 11004436 11197830
59931 11197830 11357401 11480221 11564471 11608973 11613536 11579015 11506631 11397800 11255259 11084181
59921 11084181 10891582 10684505 10469160 10251950 10040546 9842905 9664904 9509319 9377375
59912 9377375 9270973 9193072 9146119 9130450 9144212 9184665 9249623 9337866 9448281 9578845 9726802
59901 9726802 9889661 10065173 10249920 10438594 10625498 10806616 10979848 11143776 11296946
59892 11296946 11437997 11565557 11678182 11775435 11859262 11933710 12003322 12072474 12145935 12228774
59882 12228774 12325505 12440365 12578854 12747778 12953041 13198133 13485400 13817773 14198144
$$ packed form
59950H081352k2461K498K8493N4434P9581J05061J32279J60250J85979K07766
59940I015232K26679K44004K58397K66734K67063K59480K44535K22312J93394
59931A1197830J59571J22820Q4250M4502M563l4521p2384j08831j42541j71078
59921A1084181j92599k07077k15345k17210k11404j97641j78001j55585j31944
59912I377375j06402p7901m6953j5669J3762M0453O4958Q8243J10415J30564J47957
59901I726802J62859J75512J84747J88674J86904J81118J73232J63928J53170
59892A1296946J41051J27560J12625R7253Q3827P4448O9612O9152P3461Q2839
59882A2228774R6731J14860J38489J68924K05263K45092K87267L32373L80371
$$ plain form
59873 14198144 14627413 15103991 15624741 16185143 16778128 17393013 18015559 18628783 19213817
59864 19213817 19750433 20217306 20593088 20859271 21003549 21020986 20912765 20685231 20350392
59855 20350392 19925384 19429353 18880578 18296622 17695644 17095271 16509830 15949518 15422023
59846 15422023 14933829 14490108 14094694 13750550 13459385 13220844 13033269 12895822 12808950
59837 12808950 12772431 12783911 12839901 12937151 13072086 13239436 13432321 13643270 13864089 14084796
59827 14084796 14293489 14477522 14624503 14722535 14760858 14731392 14630017 14456552 14214146 13909094
59817 13909094 13550668 13149918 12717793 12264110 11798043 11328985 10866352 10418300 9990459
59808 9990459 9585717 9205299 8850423 8523120 8225286 7957133 7717170 7503679 7315264
$$ packed form
59873A4198144M29269M76578N20750N60402N92985O14885O22546O13224N85034
59864A9213817N36616M66873L75782K66183J44278J7437j08221k27534l34839
59855B0350392m25008m96031n48775n83956o00978o00373n85441n60312n27495
59846A5422023m88194m43721l95414l44144k91165k38541j87575j37447q6872
59837A2808950l6519J1480N5990R7250J34935J67350J92885K10949K20819K20707
59827A4084796K08693J84033J46981R8032L8323k9466j01375j73465k42406l05052
59817A3909094l58426m00750m32125m53683m66067m69058m62633m48052m27841
59808I990459m04742l80418l54876l27303k97834k68153k39963k13491j88415
$$ plain form
59799 7315264 7149494 7002205 6869287 6748527 6638414 6535872 6437045 6340472 6247737 6160455
59789 6160455 6078217 6000242 5927495 5861864 5804251 5754645 5713048 5678811 5649470 5621521 5592114
59778 5592114 5559111 5520089 5472775 5416522 5352405 5281934 5206521 5128089 5049326 4973231 4902886
59767 4902886 4841051 4788995 4746024 4711274 4685795 4671945 4670982 4682484 4705904 4741149 4787312 4842237
59755 4842237 4904050 4972237 5046764 5127041 5212468 5303243 5399805 5501644 5606889 5712669 5815541
59744 5815541 5912001 5999023 6074248 6136118 6184580 6221624 6250374 6273456 6292743 6310560 6330177
59733 6330177 6354759 6386535 6427371 6479676 6546403 6630496 6734393 6859563 7006535 7176087
59723 7176087 7370664 7594137 7850078 8140789 8467985 8833432 9238369 9682613 10164268
$$ packed form
59799G315264j65770j47289j32918j20760j10113j02542r8827r6573r2735q7282
59789F160455q2238p7975p2747o5631n7613m9606m1597l4237k9341k7949k9407
59778E592114l3003l9022m7314n6253o4117p0471p5413p8432p8763p6095p0345
59767D902886o1835n2056m2971l4750k5479j3850r63J1502K3420L5245M6163N4925
59755D842237O1813O8187P4527Q0277Q5427R0775R6562J01839J05245J05780J02872
59744E815541R6460Q7022P5225O1870M8462L7044K8750K3082J9287J7817J9617
59733F330177K4582L1776M0836N2305O6727Q4093J03897J25170J46972J69552
59723G176087J94577K23473K55941K90711L27196L65447M04937M44244M81655
$$ plain form
59714 10164268 10679230 11219652 11771880 12315045 12821356 13259262 13599301 13820001 13911052
59705 13911052 13873894 13721423 13476217 13165673 12815765 12447495 12077090 11717130 11377099
59696 11377099 11064297 10784992 10543911 10342794 10181014 10058114 9974356 9928555 9917459 9938610
59686 9938610 9992465 10080376 10201607 10353747 10535219 10746057 10986992 11259256 11564862 11905832
59676 11905832 12283330 12698363 13152766 13648538 14186807 14768586 15396151 16072587 16800395
59667 16800395 17581443 18417642 19310196 20258138 21258280 22305802 23393525 24510968 25645504
59658 25645504 26784442 27915191 29024432 30099639 31132561 32121006 33068050 33981096
59650 33981096 34871427 35752326 36636231 37533718 38453982 39403212 40380775 41377773 42379903
$$ packed form
59714A0164268N14962N40422N52228N43165N06311M37906L40039K20700R1051
59705A3911052l7158j52471k45206l10544l49908l68270l70405l59960l40031
59696A1377099l12802k79305k41081k01117j61780j22900q3758m5801j1096K1151
59686I938610N3855Q7911J21231J52140J81472K10838K40935K72264L05606L40970
59676A1905832L77498M15033M54403M95772N38269N81779O27565O76436P27808
59667A6800395P81048Q36199Q92554R47942J000142J047522J087723J117443J134536
59658B5645504J138938J130749J109241J075207J032922R88445R47044R13046
59650C3981096Q90331Q80899Q83905Q97487R20264R49230R77563R96998J002130
$$ plain form
59641 42379903 43370527 44330410 45236480 46063359 46787082 47388016 47852554 48174543 48355840
59632 48355840 48405232 48337171 48171729 47934189 47652411 47353359 47061790 46800875 46592153 46454244
59622 46454244 46402362 46449492 46607492 46886754 47295360 47838976 48520966 49341705 50297308 51378908
59612 51378908 52572515 53858283 55208497 56585385 57940643 59217239 60352537 61282052
59604 61282052 61944564 62289027 62281500 61909300 61181404 60126409 58789149 57225924 55498471
59595 55498471 53667962 51790419 49913939 48077298 46309255 44627922 43040161 41541720
59587 41541720 40118493 38748346 37403521 36055161 34680353 33268280 31821158 30350318
59579 30350318 28872062 27405830 25972519 24590933 23274467 22030849 20863998 19775182
$$ packed form
59641D2379903R90624R59883R06070Q26879P23723O00934M64538L21989J81297
59632D8355840M9392o8061j65442k37540k81778k99052k91569k60915k08722j37909
59622D6454244n1882M7130J58000K79262M08606N43616O81990Q20739R55603J081600
59612E1378908J193607J285768J350214J376888J355258J276596J135298R29515
59604F1282052O62512L44463p527l72200p27896j054995j337260j563225j727453
59595E5498471j830509j877543j876480j836641j768043j681333j587761j498441
59587D1541720j423227j370147j344825j348360j374808j412073j447122j470840
59579C0350318j478256j466232j433311j381586j316466j243618j166851j088816
$$ plain form
59571 19775182 18763171 17825239 16958921 16162521 15433807 14768794 14162106 13608317 13103007
59562 13103007 12643002 12225765 11848403 11507261 11198681 10919889 10668597 10441849 10235850
59553 10235850 10047012 9872562 9709841 9555497 9405743 9257120 9106773 8952394 8792460
59544 8792460 8626522 8455089 8279397 8101386 7923397 7747281 7573967 7404427 7241030
59535 7241030 7087209 6945486 6816222 6698589 6592216 6497431 6414423 6343298 6285036 6241314
59525 6241314 6212564 6196692 6190582 6192700 6203457 6223163 6250732 6284843 6325314 6372390 6425220 6482136
59513 6482136 6542107 6604828 6669514 6735176 6802703 6875373 6956193 7045580 7142992 7250203 7371145
59502 7371145 7508276 7660626 7826330 8006077 8203144 8420563 8659355 8919349 9200822
$$ packed form
59571A9775182j012011r37932q66318p96400p28714o65013o06688n53789n05310
59562A3103007m60005m17237l77362l41142l08580k78792k51292k26748k05999
59553A0235850j88838j74450j62721j54344j49754j48623j50347j54379j59934
59544H792460j65938j71433j75692j78011j77989j76116j73314j69540j63397
59535G241030j53821j41723j29264j17633j06373r4785q3008p1125n8262m3722
59525F241314k8750j5872o110K118J0757J9706K7569L4111M0471M7076N2830N6916
59513F482136N9971O2721O4686O5662O7527P2670Q0820Q9387R7412J07211J20942
59502G371145J37131J52350J65704J79747J97067K17419K38792K59994K81473
$$ plain form
59493 9200822 9505016 9833429 10186774 10564448 10964953 11386798 11828665 12288452 12762455
59484 12762455 13245698 13732781 14218062 14695471 15158886 15602911 16023186 16416185 16779003
59475 16779003 17109166 17404299 17662309 17882439 18066150 18216720 18338198 18435104 18512758 18577267
59465 18577267 18635245 18693884 18760863 18843173 18945579 19069973 19215352 19377381 19548212 19717623
59455 19717623 19874209 20004902 20094116 20125569 20086184 19968037 19766976 19481107 19111505 18663350
59445 18663350 18145430 17569113 16948216 16298340 15634455 14968939 14312438 13675722 13069108
59436 13069108 12499916 11971517 11485044 11041166 10640043 10280715 9961565 9681198 9438394
59427 9438394 9231413 9057997 8916415 8806138 8727028 8677938 8656838 8662657 8696346 8759322 8851262
$$ packed form
59493I200822L04194L28413L53345L77674M00505M21845M41867M59787M74003
59484A2762455M83243M87083M85281M77409M63415M44025M20275L92999L62818
59475A6779003L30163K95133K58010K20130J83711J50570J21478R6906P7654O4509
59465A8577267N7978N8639O6979Q2310J02406J24394J45379J62029J70831J69411
59455A9717623J56586J30693Q9214L1453l9385j18147k01061k85869l69602m48155
59445A8663350n17920n76317o20897o49876o63885o65516o56501o36716o06614
59436A3069108n69192n28399m86473m43878m01123l59328l19150k80367k42804
59427I438394k06981j73416j41582j10277p9110m9090k1100N819L3689O2976R1940
$$ plain form
59416 8851262 8970433 9116079 9289246 9490810 9719618 9973171 10249546 10548105 10868674
59407 10868674 11209902 11567351 11932544 12294631 12643551 12970967 13267949 13523205 13724723
59398 13724723 13862605 13929731 13921239 13835330 13674514 13444809 13153724 12809723 12422910 12004518
59388 12004518 11565261 11114632 10661198 10212199 9772808 9346817 8938065 8550245 8185395
59379 8185395 7843771 7525472 7231347 6962152 6717605 6496381 6296432 6115512 5952203
59370 5952203 5806239 5676976 5562097 5459234 5368650 5292639 5232030 5184827 5148658 5122897
59360 5122897 5107637 5102098 5105099 5115979 5134128 5158775 5190313 5230710 5281329 5341055 5407634 5479846
59348 5479846 5556765 5635633 5712611 5786199 5858874 5935183 6019166 6113685 6221041 6343416 6482902
$$ packed form
59416H851262J19171J45646J73167K01564K28808K53553K76375K98559L20569
59407A0868674L41228L57449L65193L62087L48920L27416K96982K55256K01518
59398A3724723J37882O7126q492q5909j60816k29705k91085l44001l86813m18392
59388A2004518m39257m50629m53434m48999m39391m25991m08752l87820l64850
59379H185395l41624l18299k94125k69195k44547k21224j99949j80920j63309
59370E952203j45964j29263j14879j02863r0584p6011o0609m7203l6169k5761
59360E122897j5260n539L001J0880J8149K4647L1538M0397N0619N9726O6579P2212
59348E479846P6919P8868P6978P3588P2675P6309Q3983R4519J07356J22375J39486
$$ plain form
59337 6482902 6641021 6817592 7010148 7215285 7431036 7657856 7898011 8155314 8435623
59328 8435623 8746094 9092597 9477938 9902995 10368949 10877893 11432076 12033923 12686793
59319 12686793 13394259 14157416 14972814 15832989 16728314 17647810 18578706 19506386 20415358
59310 20415358 21290338 22117203 22884437 23584742 24215229 24775745 25267200 25691317 26050842
59301 26050842 26348715 26586848 26765981 26886139 26946162 26942642 26870248 26723886 26500850 26201564
59291 26201564 25829499 25391132 24895604 24353683 23776229 23172675 22549658 21910501 21256266
59282 21256266 20587718 19906432 19214473 18514089 17808434 17102399 16402224 15714212 15043898
59273 15043898 14396191 13775740 13186840 12632899 12115998 11636883 11195327 10790495 10421288
$$ packed form
59337F482902J58119J76571J92556K05137K15751K26820K40155K57303K80309
59328H435623L10471L46503L85341M25057M65954N08944N54183O01847O52870
59319A2686793P07466P63157Q15398Q60175Q95325R19496R30896R27680R08972
59310B0415358Q74980Q26865P67234P00305O30487N60516M91455M24117L59525
59301B6050842K97873K38133J79133J20158O0023l520p2394j46362k23036k99286
59291B6201564l72065m38367m95528n41921n77454o03554o23017o39157o54235
59282B1256266o68548o81286o91959p00384p05655p06035p00175o88012o70314
59273A5043898o47707o20451n88900n53941n16901m79115m41556m04832l69207
$$ plain form
59264 10421288 10086807 9786604 9520128 9285772 9080872 8902933 8750524 8622700 8518081
59255 8518081 8435134 8373063 8331700 8310505 8308118 8322835 8353085 8397665 8456017 8528074 8613090
59244 8613090 8708635 8811264 8918149 9027494 9137404 9245025 9346970 9440109 9521918 9590544
59234 9590544 9644735 9683662 9707292 9717429 9717948 9713151 9705997 9698547 9693695 9695390 9707265 9732047 9772103
59221 9772103 9829347 9904401 9997041 10107807 10238077 10388017 10555221 10735708 10925411 11120294
59211 11120294 11315901 11507362 11689333 11855847 12001197 12121308 12213414 12274240 12299878 12288238
59201 12288238 12240857 12161861 12056383 11930935 11794072 11654888 11520463 11395000 11280781 11179162
59191 11179162 11090911 11016186 10954127 10902420 10857940 10818039 10780697 10743670 10704989 10664872 10625682
$$ packed form
59264A0421288l34481l00203k66476k34356k04900j77939j52409j27824j04619
59255H518081q2947o2071m1363k1195k387J4717L0250M4580N8352P2057Q5016
59244H613090R5545J02629J06885J09345J09910J07621J01945R3139Q1809O8626
59234I590544N4191L8927K3630J0137N19m797p154p450m852J695J1875K4782M0056
59221I772103N7244P5054R2640J10766J30270J49940J67204J80487J89703J94883
59211A1120294J95607J91461J81971J66514J45350J20111R2106O0826K5638j1640
59201A2288238m7381p8996j05478j25448j36863j39184j34425j25463j14219j01619
59191A1179162q8251p4725o2059n1707m4480l9901l7342l7027l8681m0117l9190
$$ plain form
59180 10625682 10589043 10554232 10520713 10491323 10471555 10466291 10478584 10511206 10568017 10653722 10773073
59169 10773073 10930110 11127399 11366305 11648514 11976459 12351193 12770251 13228367 13719262
59160 13719262 14235020 14763887 15290134 15796162 16263748 16673727 17006654 17245245 17376325
59151 17376325 17391107 17285332 17060161 16722488 16283788 15758581 15163604 14517332 13839129
59142 13839129 13147778 12459622 11787154 11139255 10522707 9942874 9402780 8902690 8441599
59133 8441599 8018685 7632778 7281389 6961512 6670945 6407955 6170351 5955972 5763561
59124 5763561 5591931 5438815 5301761 5179550 5071333 4974979 4888058 4810194 4742584 4685114
59114 4685114 4635871 4593822 4560176 4536349 4521983 4515721 4516864 4525574 4542324 4567584 4601275 4642414
$$ packed form
59180A0625682l6639l4811l3519k9390j9768n264J2293L2622N6811Q5705J19351
59169A0773073J57037J97289K38906K82209L27945L74734M19058M58116M90895
59160A3719262N15758N28867N26247N06028M67586M09979L32927K38591J31080
59151A7376325J4782j05775k25171l37673m38700n25207n94977o46272o78203
59142A3839129o91351o88156o72468o47899o16548n79833n40094n00090m61091
59133H441599m22914l85907l51389l19877k90567k62990k37604k14379j92411
59124E763561j71630j53116j37054j22211j08217r6354q6921p7864o7610n7470
59114D685114m9243m2049l3646k3827j4366o262J143Q710J6750K5260L3691M1139
$$ plain form
59102 4642414 4690261 4745643 4809738 4881637 4958972 5041326 5131037 5229816 5336525 5449490 5569244
59091 5569244 5697261 5833294 5975624 6122975 6274380 6427843 6580808 6731560 6878548
59082 6878548 7018620 7147564 7262580 7362945 7448138 7516518 7566350 7597482 7611897 7613102 7604733
59071 7604733 7588951 7566272 7537641 7506444 7477721 7455679 7442908 7441635 7454249 7482398 7526997
59060 7526997 7589756 7673557 7780436 7910019 8060956 8233350 8428809 8648330 8891150 9155677
59050 9155677 9440583 9744615 10065992 10402550 10752062 11111715 11477134 11842037 12198590
59041 12198590 12537675 12848954 13121422 13344603 13509824 13611247 13646728 13617955 13529114 13384854
59031 13384854 13189646 12948886 12669520 12358706 12022145 11664265 11289427 10902025 10505724
$$ packed form
59102D642414M7847N5382O4095P1899P7335Q2354Q9711R8779J06709J12965J19754
59091E569244J28017J36033J42330J47351J51405J53463J52965J50752J46988
59082F878548J40072J28944J15016J00365Q5193O8380M9832L1132J4415J205q369
59071G604733j5782k2679k8631l1197k8723k2042j2771j273J2614K8149M4599
59060G526997O2759Q3801J06879J29583J50937J72394J95459K19521K42820K64527
59050I155677K84906L04032L21377L36558L49512L59653L65419L64903L56553
59041A2198590L39085L11279K72468K23181J65221J01423L5481k8773q8841j44260
59031A3384854j95208k40760k79366l10814l36561l57880l74838l87402l96301
$$ plain form
59022 10505724 10103702 9699826 9298738 8904588 8520281 8147959 7789383 7445497 7116302
59013 7116302 6801622 6501755 6217319 5948953 5697094 5461392 5240325 5032220 4836797
59004 4836797 4654923 4486665 4330579 4185305 4050834 3927481 3814421 3710064 3613294 3523459
58994 3523459 3439649 3360905 3286954 3217893 3153265 3092186 3034362 2980201 2929728 2881898 2835439
58983 2835439 2790320 2748172 2711053 2679603 2652575 2628415 2607006 2589184 2574800 2562422 2551305
58972 2551305 2542493 2537265 2535434 2536266 2540287 2548714 2561241 2575661 2589995 2604079 2618712 2633884 2648224
58959 2648224 2659815 2667403 2671225 2672771 2673459 2673609 2672977 2671973 2671608 2672366 2674157 2677649 2684584 2695934 2710268
58944 2710268 2724842 2738125 2750445 2762181 2772294 2779174 2782381 2782862 2781626 2778856 2774449 2768848 2762955
$$ packed form
59022A0505724m02022m03876m01088l94150l84307l72322l58576l43886l29195
59013G116302l14680k99867k84436k68366k51859k35702k21067k08105j95423
59004D836797j81874j68258j56086j45274j34471j23353j13060j04357r6770q9835
58994C523459q3810p8744p3951o9061o4628o1079n7824n4161n0473m7830m6459
58983B835439m5119m2148l7119l1450k7028k4160k1409j7822j4384j2378j1117
58972B551305q812n228j831Q32M021Q427J2527J4420J4334J4084J4633J5172J4340
58959B648224J1591P588L822J546O88J50o32j004l65P58J791L492O935J1350J4334
58944B710268J4574J3283J2320J1736J0113O880L207M81j236k770m407n601n893
$$ plain form
58931 2762955 2757485 2752805 2749296 2747528 2748031 2751084 2756724 2764875 2775523 2788731 2804270 2821351 2839331
58918 2839331 2858943 2882095 2909797 2940725 2972723 3005328 3039892 3077535 3118297 3162335 3210400
58907 3210400 3262367 3316544 3371484 3427795 3487199 3550413 3617056 3687077 3760903 3838118 3917241
58896 3917241 3997348 4079187 4164233 4253182 4345857 4442263 4543092 4649201 4761027 4878735
58886 4878735 5002771 5134133 5274214 5424578 5586745 5761685 5949274 6148696 6359795
58877 6359795 6583842 6822672 7077554 7349500 7640180 7951355 8283434 8635823 9009201
58868 9009201 9406638 9832045 10288513 10778753 11306091 11873781 12483694 13136699 13834344
58859 13834344 14579410 15374885 16222917 17124494 18079273 19085399 20139555 21236703 22368999
$$ packed form
58931B762955n470m680l509j768N03L053N640Q151J0648J3208J5539J7081J7980
58918B839331J9612K3152K7702L0928L1998L2605L4564L7643M0762M4038M8065
58907C210400N1967N4177N4940N6311N9404O3214O6643P0021P3826P7215P9123
58896C917241Q0107Q1839Q5046Q8949R2675R6406J00829J06109J11826J17708
58886D878735J24036J31362J40081J50364J62167J74940J87589J99422K11099
58877F359795K24047K38830K54882K71946K90680L11175L32079L52389L73378
58868I009201L97437M25407M56468M90240N27338N67690O09913O53005O97645
58859A3834344P45066P95475Q48032R01577R54779J006126J054156J097148J132296
$$ plain form
58850 22368999 23524756 24688403 25840707 26958129 28012499 28972873 29808807 30492517
58842 30492517 30999589 31310503 31413594 31307106 30998496 30502276 29838547 29031986 28109850
58833 28109850 27099301 26025950 24914046 23786580 22663915 21561982 20492067 19462416
58825 19462416 18479852 17549932 16676112 15859285 15098186 14390233 13732357 13121604 12555238
58816 12555238 12030341 11543470 11090749 10668285 10272781 9902361 9556874 9236668 8940676
58807 8940676 8666336 8411723 8176802 7961751 7764873 7583336 7415344 7260362 7117882
58798 7117882 6987717 6871209 6770069 6683620 6608919 6544116 6490030 6447892 6417597 6399283 6394645
58787 6394645 6404746 6427788 6461139 6504912 6561843 6633994 6721251 6822750 6938146 7067392 7210756
$$ packed form
58850B2368999J155757J163647J152304J117422J054370R60374Q35934O83710
58842C0492517N07072L10914J03091j06488l08610m96220o63729q06561r22136
58833B8109850j010549j073351j111904j127466j122665j101933j069915j029651
58825A9462416r82564r29920q73820q16827p61099p07953o57876o10753n66366
58816A2555238n24897m86871m52721m22464l95504l70420l45487l20206k95992
58807H940676k74340k54613k34921k15051j96878j81537j67992j54982j42480
58798G117882j30165j16508j01140q6449p4701o4803n4086m2138l0295j8314m638
58787F394645J0101K3042L3351M3773N6931P2151Q7257J01499J15396J29246J43364
$$ plain form
58776 7210756 7369314 7544259 7735485 7941881 8163283 8401255 8657629 8933097 9227578
58767 9227578 9541464 9876364 10235132 10621270 11037822 11486753 11969633 12488637 13046473
58758 13046473 13645844 14289709 14981603 15724606 16519832 17366546 18263643 19210130 20203863
58749 20203863 21240028 22310321 23402469 24499983 25582411 26625570 27601524 28479641
58741 28479641 29229620 29824711 30242904 30467112 30486667 30299769 29914296 29346387 28618373
58732 28618373 27756599 26788696 25741314 24639728 23508118 22368325 21237885 20130123
58724 20130123 19056071 18025156 17043966 16115586 15240677 14418583 13647543 12925250 12249955
58715 12249955 11620413 11034569 10489188 9981033 9507436 9065328 8650901 8261120 7894900
$$ packed form
58776G210756J58558J74945J91226K06396K21402K37972K56374K75468K94481
58767I227578L13886L34900L58768L86138M16552M48931M82880N19004N57836
58758A3046473N99371O43865O91894P43003P95226Q46714Q97097R46487R93733
58749B0203863J036165J070293J092148J097514J082428J043159R75954Q78117
58741B8479641P49979N95091M18193K24208J9555j86898l85473n67909p28014
58732B8618373q61774r67903j047382j101586j131610j139793j130440j107762
58724B0130123j074052j030915r81190r28380q74909q22094p71040p22293o75295
58715A2249955o29542n85844n45381n08155m73597m42108m14427l89781l66220
$$ plain form
58706 7894900 7551967 7230991 6929650 6646306 6380872 6133812 5904548 5691007 5490812
58697 5490812 5302963 5128118 4967128 4819652 4684464 4560555 4447342 4344290 4250992 4167059
58687 4167059 4091105 4020512 3953367 3890272 3832946 3781476 3734466 3691445 3652960 3617868 3582635
58676 3582635 3544291 3502602 3458462 3411751 3362138 3310699 3259136 3208034 3157091 3106379 3056129
58665 3056129 3005856 2954954 2903840 2853327 2803132 2752141 2700027 2647554 2595262 2542797 2489633
58654 2489633 2435748 2381535 2327806 2275971 2227488 2182810 2141180 2101514 2063189 2026079 1990372
58643 1990372 1956450 1924548 1894374 1865293 1836944 1809500 1783415 1759074 1736639 1716007 1696942
58632 1696942 1679299 1663024 1647932 1633789 1620642 1608791 1598374 1589394 1582179 1577207 1574137 1571547
$$ packed form
58706G894900l42933l20976l01341k83344k65434k47060k29264k13541k00195
58697E490812j87849j74845j60990j47476j35188j23909j13213j03052r3298q3933
58687D167059p5954p0593o7145o3095n7326n1470m7010m3021l8485l5092l5233
58676C582635l8344m1689m4140m6711m9613n1439n1563n1102n0943n0712n0250
58665C056129n0273n0902n1114n0513n0195n0991n2114n2473n2292n2465n3164
58654B489633n3885n4213n3729n1835m8483m4678m1630l9666l8325l7110l5707
58643A990372l3922l1902l0174k9081k8349k7444k6085k4341k2435k0632j9065
58632A696942j7643j6275j5092j4143j3147j1851j0417q980p215m972l070k590
$$ plain form
58620 1571547 1568105 1563643 1558695 1553431 1547657 1541589 1535954 1531421 1528409 1527353 1528430 1530901 1533348 1535118
58606 1535118 1537290 1541715 1549022 1557935 1566830 1575517 1584915 1594995 1603921 1609753 1612531 1614062 1616005 1618912
58592 1618912 1622885 1628189 1635076 1643733 1654706 1668841 1686552 1707569 1731543 1758433 1788314 1821381
58580 1821381 1858247 1899565 1945019 1993299 2043465 2096019 2152443 2213968 2280998 2353399 2431306
58569 2431306 2515919 2609327 2712939 2826181 2947447 3076453 3215070 3365889 3530778 3710948
58559 3710948 3907440 4121101 4352635 4602906 4872578 5161271 5467578 5789680 6124718
58550 6124718 6467243 6809368 7142708 7458869 7747364 7994598 8186761 8314106 8372524 8362325
58540 8362325 8286853 8151837 7964746 7734183 7469781 7181837 6880157 6573085 6267549 5969147
$$ packed form
58620A571547l442m462m948n264n774o068n635m533l012j056J077K471K447J770
58606A535118K172M425P307Q913Q895Q687R398J0080Q926N832K778J531J943K907
58592A618912L973N304O887Q657J0973J4135J7711K1017K3974K6890K9881L3067
58580A821381L6866M1318M5454M8280N0166N2554N6424O1525O7030P2401P7907
58569B431306Q4613R3408J03612J13242J21266J29006J38617J50819J64889J80170
58559C710948J96492K13661K31534K50271K69672K88693L06307L22102L35038
58550F124718L42525L42125L33340L16161K88495K47234J92163J27345N8418j0199
58540H362325p5472j35016j87091k30563k64402k87944l01680l07072l05536k98402
$$ plain form
58530 5969147 5681670 5407222 5147411 4903876 4677305 4466970 4272128 4093206 3930833
58521 3930833 3784521 3653377 3537415 3436776 3349910 3273795 3206019 3145607 3091811 3043228
58511 3043228 2998576 2957520 2920130 2885852 2853469 2822078 2791912 2763882 2738047 2712684 2685439
58500 2685439 2655274 2622428 2586431 2545505 2498786 2448103 2396405 2345107 2294164 2244126 2196511
58489 2196511 2152101 2110270 2070444 2033288 1999958 1970835 1945386 1922787 1902282 1883246 1865163
58478 1865163 1847522 1829675 1810938 1790707 1768399 1743623 1716691 1688631 1660320 1631933 1603659
58467 1603659 1576503 1551683 1529370 1508649 1488669 1469323 1450762 1432731 1414559 1395643 1375963
58456 1375963 1356244 1337505 1320414 1305257 1292394 1282083 1273709 1265989 1258475 1252234 1248500 1247143
$$ packed form
58530E969147k87477k74448k59811k43535k26571k10335j94842j78922j62373
58521C930833j46312j31144j15962j00639q6866p6115o7776o0412n3796m8583
58511C043228m4652m1056l7390l4278l2383l1391l0166k8030k5835k5363k7245
58500B685439l0165l2846l5997m0926m6719n0683n1698n1298n0943n0038m7615
58489B196511m4410m1831l9826l7156l3330k9123k5449k2599k0505j9036j8083
58478A865163j7641j7847j8737k0231k2308k4776k6932k8060k8311k8387k8274
58467A603659k7156k4820k2313k0721j9980j9346j8561j8031j8172j8916j9680
58456A375963j9719j8739j7091j5157j2863j0311q374p720p514o241l734j357
$$ plain form
58444 1247143 1247140 1248010 1249948 1252887 1256321 1260122 1264940 1271738 1281197 1293313 1307098 1320957 1334002 1347048
58430 1347048 1361941 1379888 1400541 1422321 1443292 1462108 1478616 1493495 1507063 1518669 1527384
58419 1527384 1532874 1535374 1535298 1533130 1529122 1522711 1512814 1499089 1482418 1463848 1443841 1423015 1402597
58406 1402597 1383175 1363588 1342114 1318559 1294481 1271734 1251578 1234760 1221387 1210612 1201240
58395 1201240 1192866 1186062 1181504 1179265 1178800 1179307 1180206 1181409 1182923 1184293 1185178 1186646 1190919 1199123 1209923
58380 1209923 1221081 1231949 1243889 1258634 1276822 1297778 1320189 1343076 1366051 1388186 1406965
58369 1406965 1419562 1425494 1427006 1426630 1425549 1424520 1424560 1425718 1426746 1427314 1429265 1434265 1441258 1447835 1453252
58354 1453252 1458542 1464277 1469869 1474761 1478900 1482245 1485110 1488884 1495251 1504563 1515517 1526140 1534516
$$ packed form
58444A247143lQ70J938K939L434L801M818O798R459J2116J3785J3859J3045J3046
58430A347048J4893J7947K0653K1780K0971J8816J6508J4879J3568J1606Q715
58419A527384N490K500p6k168m008o411r897j3725j6671j8570k0007k0826k0418
58406A402597j9422j9587k1474k3555k4078k2747k0156j6818j3373j0775r372
58395A201240q374o804m558k239m65N07Q99J203J514J370Q85J468M273Q204J0800
58380A209923J1158J0868J1940J4745J8188K0956K2411K2887K2975K2135J8779
58369A406965J2597N932J512l76j081j029M0J158J028N68J951N000O993O577N417
58354A453252N290N735N592M892M139L345K865L774O367R312J0954J0623Q376
$$ plain form
58341 1534516 1539122 1539280 1535140 1527151 1516195 1504176 1492913 1481986 1469338 1454705 1440513 1428274
58329 1428274 1416267 1402501 1388003 1375031 1363760 1353222 1344073 1337666 1333267 1328991 1324950 1322898
58317 1322898 1323080 1323985 1325102 1327511 1331750 1337225 1343751 1351756 1361089 1371545 1384240 1400260 1418166
58304 1418166 1435069 1450123 1464886 1480384 1496063 1511620 1527508 1543520 1559076 1575010 1592784
58293 1592784 1611843 1630146 1647556 1666138 1686542 1706489 1723584 1737298 1747406 1752851 1753571 1751696
58281 1751696 1749658 1748233 1747180 1746488 1746324 1746848 1748645 1752448 1758329 1766091 1775963 1787624 1799270 1809690
58267 1809690 1820779 1835834 1855670 1878662 1904086 1932501 1962785 1991964 2018887 2045521 2073795
58256 2073795 2103412 2133615 2164834 2197573 2231438 2265869 2300107 2332178 2360000 2383867 2405732
$$ packed form
58341A534516M606J58m140p989j0956j2019j1263j0927j2648j4633j4192j2239
58329A428274j2007j3766j4498j2972j1271j0538r149o407m399m276m041k052
58317A322898J82R05J117K409M239N475O526Q005R333J0456J2695J6020J7906
58304A418166J6903J5054J4763J5498J5679J5557J5888J6012J5556J5934J7774
58293A592784J9059J8303J7410J8582K0404J9947J7095J3714J0108N445P20j875
58281A751696k038j425j053o92j64N24J797L803N881P762R872J1661J1646J0420
58267A809690J1089J5055J9836K2992K5424K8415L0284K9179K6923K6634K8274
58256B073795K9617L0203L1219L2739L3865L4431L4238L2071K7822K3867K1865
$$ plain form
58245 2405732 2425894 2442820 2456508 2469367 2483202 2497901 2513758 2532476 2554934 2580314 2608218
58234 2608218 2639377 2673645 2709644 2747136 2787345 2830339 2874537 2919385 2966056 3015047 3065771
58223 3065771 3118989 3176757 3239324 3304980 3373570 3446935 3525133 3605569 3686988 3771167 3859506
58212 3859506 3951022 4044793 4141204 4239715 4338685 4438656 4542551 4651520 4764026 4880113
58202 4880113 5002682 5132955 5268538 5407843 5552708 5704650 5862259 6024617 6193959
58193 6193959 6372750 6561392 6760846 6974016 7202106 7442690 7693769 7957087 8235495
58184 8235495 8529826 8839976 9166297 9508883 9868569 10249527 10657365 11094217 11559734
58175 11559734 12057005 12592406 13169243 13787503 14450849 15167197 15940438 16767909 17647981
$$ packed form
58245B405732K0162J6926J3688J2859J3835J4699J5857J8718K2458K5380K7904
58234B608218L1159L4268L5999L7492M0209M2994M4198M4848M6671M8991N0724
58223C065771N3218N7768O2567O5656O8590P3365P8198Q0436Q1419Q4179Q8339
58212C859506R1516R3771R6411R8511R8970R9971J03895J08969J12506J16087
58202D880113J22569J30273J35583J39305J44865J51942J57609J62358J69342
58193F193959J78791J88642J99454K13170K28090K40584K51079K63318K78408
58184H235495K94331L10150L26321L42586L59686L80958M07838M36852M65517
58175A1559734M97271N35401N76837O18260O63346P16348P73241Q27471Q80072
$$ plain form
58166 17647981 18583287 19574128 20616362 21709923 22863303 24086325 25384576 26763650
58158 26763650 28231817 29795233 31457396 33226146 35114034 37129967 39279850 41578837
58150 41578837 44054322 46734603 49644911 52816546 56287355 60090726 64260520 68854759
58142 68854759 73962093 79679922 86100905 93326596 101480279 110707616 121192316 133181177
58134 133181177 146966622 162823770 180967464 201559313 224754103 250842512 280500190
58127 280500190 314791216 354362917 397901232 441036189 477078276 499576270 505021785
58120 505021785 493902964 469780982 437460775 401438291 365072614 330380937 298251388
58113 298251388 268867641 242112341 217805183 195797634 175999639 158359895 142812513
$$ packed form
58166A7647981R35306R90841J042234J093561J153380J223022J298251J379074
58158B6763650J468167J563416J662163J768750J887888K015933K149883K298987
58150D1578837K475485K680281K910308L171635L470809L803371M169794M594239
58142F8854759N107334N717829O420983P225691Q153683R227337J0484700J1988861
58134A33181177J3785445J5857148J8143694K0591849K3194790K6088409K9657678
58127B80500190L4291026L9571701M3538315M3134957L6042087K2497994N445515
58120E05021785j1118821k4121982l2320207l6022484l6365677l4691677l2129549
58113B98251388k9383747k6755300k4307158k2007549j9797995j7639744j5547382
$$ plain form
58106 142812513 129241137 117488790 107380315 98728710 91343853 85056513 79732759
58099 79732759 75265667 71567807 68575692 66245679 64537133 63410457 62851346 62900462
58091 62900462 63668436 65311572 67918790 71310120 74892376 77766843 79089685 78433901
58083 78433901 75898943 71955222 67198145 62157911 57200108 52508324 48134638 44075564
58075 44075564 40320215 36860485 33690961 30811301 28221140 25910146 23858669 22046245
58067 22046245 20451808 19047601 17802137 16689889 15692227 14790650 13966727 13208167 12508005
58058 12508005 11857699 11246857 10669467 10124809 9612312 9130181 8678124 8256171 7861022
58049 7861022 7487923 7135519 6804715 6493690 6198292 5916521 5648603 5393592 5149864
$$ packed form
58106A42812513j3571376j1752347j0108475q651605p384857o287340n323754
58099G9732759m467092l697860k992115k330013j708546j126676n59111M9116
58091F2900462P67974J643136K607218L391330L582256K874467J322842o55784
58083G8433901k534958l943721m757077n040234m957803m691784m373686m059074
58075D4075564l755349l459730l169524k879660k590161k310994k051477j812424
58067B2046245j594437j404207j245464j112248r97662r01577q23923p58560p00162
58058A2508005o50306o10842n77390n44658n12497m82131m52057m21953l95149
58049G861022l73099l52404l30804l11025k95398k81771k67918k55011k43728
$$ plain form
58040 5149864 4918108 4700070 4495298 4302518 4122728 3956925 3802143 3653933 3511921
58031 3511921 3379059 3256166 3140968 3031741 2928220 2829507 2734647 2644778 2561486 2483514
58021 2483514 2408042 2334429 2263710 2195404 2128025 2062013 1999064 1939270 1881831 1827690 1778408
58010 1778408 1733153 1689775 1648113 1609434 1573551 1539508 1508272 1481596 1458830 1437745 1417783
57999 1417783 1399530 1381793 1362495 1342078 1322842 1305013 1286345 1265559 1243523 1221081 1198327
57988 1198327 1176172 1156355 1139704 1125936 1114645 1104760 1093916 1080470 1065566 1051469 1038995
57977 1038995 1028376 1020992 1017703 1016799 1016272 1016722 1019327 1022554 1024267 1025788 1030183 1037353 1044460 1050550
57963 1050550 1056900 1063270 1067837 1070957 1075099 1080548 1084840 1087042 1089015 1091543 1092764 1091713 1090232 1089884
$$ packed form
58040E149864k31756k18038k04772j92780j79790j65803j54782j48210j42012
58031C511921j32862j22893j15198j09227j03521r8713r4860q9869q3292p7972
58021B483514p5472p3613p0719o8306o7379o6012o2949n9794n7439n4141m9282
58010A778408m5255m3378m1662l8679l5883l4043l1236k6676k2766k1085j9962
57999A417783j8253j7737j9298k0417j9236j7829j8668k0786k2036k2442k2754
57988A198327k2155j9817j6651j3768j1291r885j0844j3446j4904j4097j2474
57977A038995j0619p384l289r04n27M50K605L227J713J521M395P170P107O090
57963A050550O350O370M567L120M142N449M292K202J973K528J221j051j481l48
$$ plain form
57949 1089884 1089675 1088294 1086146 1083683 1080027 1074879 1069847 1066377 1063918 1061371 1058831 1056719 1054640 1052217
57935 1052217 1049875 1047746 1044778 1039753 1032467 1023559 1014034 1004976 996579 987453 976229 963799 952485
57922 952485 942983 933894 924497 916264 911060 909200 909646 910827 911101 909858 908476 908863 910864 912414 912335
57907 912335 911492 911028 911022 911255 911760 912028 910770 906949 900400 891595 881817 873165 866930 861921 855628 846987
57891 846987 837027 827283 818964 813006 809185 805433 799849 793269 788225 785707 784710 784654 786069 788840 791750
57876 791750 794125 796285 798223 799407 799824 799664 798219 794727 789869 784554 777776 768015 756296 745289
57862 745289 735474 724886 712721 700503 689421 679366 670999 665819 663321 660890 657567 655320 655633
57849 655633 657613 660688 666238 674722 683748 691159 697993 706231 715332 723255 729612 735796 742872 751026
$$ packed form
57949A089884k09j381k148k463l656n148n032l470k459k547k540k112k079k423
57935A052217k342k129k968n025p286q908r525r058q397r126j1224j2430j1314
57922I52485r502r089r397q233n204j860M46J181K74j243j382L87K001J550p9
57907I12335q43m64oK33N05K68j258l821o549q805r778q652o235n009o293q641
57891H46987r960r744q319n958l821l752n584o580n044k518r97n6J415K771K910
57876G91750K375K160J938J184M17j60j445l492m858n315o778r761j1719j1007
57862G45289r815j0588j2165j2218j1082j0055q367n180k498k431l323k247L13
57849F55633J980L075N550Q484R026P411O834Q238R101P923O357O184P076Q154
$$ plain form
57835 751026 760157 769399 776910 781640 784688 787677 790352 790878 788042 782359 775486 768934 762772 755504
57821 755504 746202 736556 729291 724519 719587 712801 705225 698328 692280 687471 685253 685679 686655 686959 688185
57806 688185 692057 697682 703280 708873 715239 721830 727971 734849 743939 754234 763193 769871 775149 779409
57792 779409 781966 782576 781722 779367 774958 768792 762321 756915 752995 750103 747198 743273 738232 732773 727152
57777 727152 720925 714224 708045 702563 696505 689049 681136 673931 667209 660299 653310 646249 638182 628699
57763 628699 619160 611040 603772 595411 584699 571586 556826 542149 529601 519429 509658 498859
57751 498859 488045 478734 470769 463647 458198 454818 451496 446124 439897 436041 435804 437982 441780 447473
57737 447473 454348 460580 465750 471550 479435 489016 499076 508799 517735 525804 533624 541793 549860 556958
$$ packed form
57835G51026R131R242P511M730L048K989K675N26k836n683o873o552o162p268
57821G55504r302r646p265m772m932o786p576o897o048m809k218M26R76L04J226
57806F88185L872N625N598N593O366O591O141O878R090J0295Q959O678N278M260
57792G79409K557O10q54k355m409o166o471n406l920k892k905l925n041n459n621
57777G27152o227o701o179n482o058p456p913p205o722o910o989p061q067r483
57763F28699r539q120p268q361j0712j3113j4760j4677j2548j0172r771j0799
57751D98859j0814r311p965p122n449l380l322n372o227l856k37K178L798N693
57737D47473O875O232N170N800P885R581J0060R723Q936Q069P820Q169Q067P098
$$ plain form
57723 556958 563227 569501 575866 581736 587023 591899 595720 597607 597884 597541 596417 593361 588086 581366 573433
57708 573433 563793 552845 542295 533591 527004 522330 519345 517416 515819 514633 514363 514661 514585 514220 514918
57693 514918 517685 522217 527589 532999 537849 542103 546631 552388 559262 566513 573995 581904 589649 596289
57679 596289 602048 608235 615601 623881 632850 642632 652944 663190 673359 683839 694466 705003 716368
57666 716368 729986 745789 762271 778765 796225 815498 836332 858709 883692 911934 942239
57655 942239 972648 1002406 1032312 1063671 1097453 1134050 1173236 1214477 1257409 1301849 1347534
57644 1347534 1394460 1443417 1495625 1551872 1612600 1678619 1750868 1829457 1913805 2003933 2100875
57633 2100875 2205630 2318422 2439281 2568864 2708537 2860113 3025580 3206501 3403310
$$ packed form
57723E56958O269O274O365N870N287M876L821J887K77l43j124l056n275o720p933
57708E73433r640j0948j0550q704o587m674k985j929j597j186k70K98p6l65O98
57693E14918K767M532N372N410M850M254M528N757O874P251P482P909P745O640
57679E96289N759O187P366Q280Q969R782J0312J0246J0169J0480J0627J0537J1365
57666G16368J3618J5803J6482J6494J7460J9273K0834K2377K4983K8242L0305
57655I42239L0409K9758K9906L1359L3782L6597L9186M1241M2932M4440M5685
57644A347534M6926M8957N2208N6247O0728O6019P2249P8589Q4348R0128R6942
57633B100875J04755J12792J20859J29583J39673J51576J65467J80921J96809
$$ plain form
57624 3403310 3615411 3842149 4083565 4340026 4610698 4891755 5175982 5454545 5719046
57615 5719046 5961314 6172042 6341901 6465168 6541372 6573389 6566099 6527709 6469217 6399021 6318172
57604 6318172 6222353 6107206 5969542 5805243 5610594 5387203 5143588 4890922 4638507 4393159
57594 4393159 4160220 3943473 3745066 3566399 3408352 3270428 3150825 3047725 2959663 2884873
57584 2884873 2821833 2770644 2732433 2707039 2692570 2687399 2691202 2703846 2724800 2754132 2792685 2840787
57572 2840787 2898106 2965206 3044019 3136227 3242210 3361783 3494724 3640422 3798402 3969353
57562 3969353 4154092 4351191 4557067 4768531 4983172 5196509 5400552 5586007 5744277
57553 5744277 5866681 5944152 5970110 5943218 5866658 5745816 5587536 5399895 5190771 4966758
$$ packed form
57624C403310K12101K26738K41416K56461K70672K81057K84227K78563K64501
57615E719046K42268K10728J69859J23267P6204L2017p290l8390n8492p0196q0849
57604F318172r5819j15147j37664j64299j94649k23391k43615k52666k52415k45348
57594D393159k32939k16747j98407j78667j58047j37924j19603j03100q8062p4790
57584B884873o3040n1189l8211k5394j4469n171L803J2644K0954K9332L8553M8102
57572B840787N7319O7100P8813R2208J05983J19573J32941J45698J57980J70951
57562C969353J84739J97099K05876K11464K14641K13337K04043J85455J58270
57553E744277J22404P7471K5958k6892p6560j20842j58280j87641k09124k24013
$$ plain form
57543 4966758 4733890 4498163 4264228 4034583 3811217 3597172 3395386 3206887 3031372
57534 3031372 2868836 2719426 2582266 2455763 2338936 2231601 2133511 2043970 1962020 1886625
57524 1886625 1817180 1754193 1698535 1649444 1604164 1560395 1518342 1479631 1445040 1414158 1386371
57513 1386371 1360993 1337094 1314341 1293625 1275836 1260457 1246446 1234062 1224510 1217911 1212898 1208503
57501 1208503 1205295 1204131 1204717 1206236 1208975 1214356 1223260 1235177 1249545 1267158 1289182 1314948 1342156
57488 1342156 1369750 1399359 1433096 1471003 1511877 1555582 1602989 1654259 1708923 1767518 1831609
57477 1831609 1902239 1979703 2064742 2158531 2261484 2373344 2494297 2624639 2763723 2910845
57467 2910845 3066704 3231810 3403433 3576238 3746025 3910444 4065561 4204188 4318608
$$ packed form
57543D966758k32868k35727k33935k29645k23366k14045k01786j88499j75515
57534C031372j62536j49410j37160j26503j16827j07335r8090q9541q1950p5395
57524A886625o9445o2987n5658m9091m5280m3769m2053l8711l4591l0882k7787
57513A386371k5378k3899k2753k0716j7789j5379j4011j2384r552o599n013m395
57501A208503l208j164N86J519K739N381Q904J1917J4368J7613K2024K5766K7208
57488A342156K7594K9609L3737L7907M0874M3705M7407N1270N4664N8595O4091
57477A831609P0630P7464Q5039R3789J02953J11860J20953J30342J39084J47122
57467B910845J55859J65106J71623J72805J69787J64419J55117J38627J14420
$$ plain form
57458 4318608 4402995 4452660 4463751 4435655 4372166 4278837 4160547 4022373 3870589 3710808
57448 3710808 3546437 3380354 3216775 3059920 2912015 2773954 2646744 2530943 2425761
57439 2425761 2330079 2243476 2165473 2095195 2032867 1980001 1936755 1900660 1869481 1843836 1825261
57428 1825261 1813207 1805923 1803142 1805769 1813808 1826636 1844692 1868948 1899079 1933780 1972660 2016585
57416 2016585 2066665 2123963 2189428 2263040 2343978 2432711 2531550 2641785 2761676 2888996 3024013
57405 3024013 3167807 3318787 3473094 3627259 3777601 3917530 4038196 4132124 4194443 4221184
57395 4221184 4209165 4158182 4071485 3953743 3810073 3646823 3471033 3288333 3102611 2917761
57385 2917761 2738056 2566471 2404041 2251151 2108149 1974697 1850122 1734792 1629801
$$ packed form
57458D318608Q4387M9665J1091k8096o3489r3329j18290j38174j51784j59781
57448C710808j64371j66083j63579j56855j47905j38061j27210j15801j05182
57439B425761r5682q6603p8003p0278o2328n2866m3246l6095l1179k5645j8575
57428A825261j2054p284k781K627Q039J2828J8056K4256L0131L4701L8880M3925
57416B016585N0080N7298O5465P3612Q0938Q8733R8839J10235J19891J27320J35017
57405C024013J43794J50980J54307J54165J50342J39929J20666R3928O2319K6741
57395D221184j2019n0983q6697j17742j43670j63250j75790j82700j85722j84850
57385B917761j79705j71585j62430j52890j43002j33452j24575j15330j04991
$$ plain form
57376 1629801 1534937 1448236 1367950 1293925 1226808 1166881 1113739 1065968 1020990 976432 932109
57365 932109 889979 851944 818299 788110 760125 733304 707341 682757 659908 638192 616924
57354 616924 596567 578105 561414 545098 527897 509738 491843 476308 464718 456347 448437 439089
57342 439089 429088 420012 411858 403886 396544 390684 385523 379302 371721 364103 357467 351924 347536 344177
57328 344177 340723 335885 329775 323418 317017 309903 301863 293388 285075 277779 272429 268445 263449 256220
57314 256220 248904 244419 242694 241639 240850 241545 243222 243273 240413 236257 232915 230836 229458 228335 227204
57299 227204 226212 226226 227763 229866 231329 232519 234514 237021 238899 240163 241610 243003 243586 243798 244495 245084
57283 245084 244688 244339 245539 247339 247740 247458 248984 252068 253661 252803 252131 253572 255728 256876 257747 259737
$$ packed form
57376A629801r4864q6701q0286p4025o7117n9927n3142m7771m4978m4558m4323
57365I32109m2130l8035l3645l0189k7985k6821k5963k4584k2849k1716k1268
57354F16924k0357j8462j6691j6316j7201j8159j7895j5535j1590q371p910r348
57342D39089j0001r076q154p972p342n860n161o221p581p618o636n543m388l359
57328C44177l454m838o110o357o401p114q040q475q313p296n350l984m996p229
57314B56220p316m485j725j055p89O95J677N1k860m156l342k079j378j123j131
57299B27204r92J4J537K103J463J190J995K507J878J264J447J393N83K12O97N89
57283B45084l96l49J200J800M01k82J526L084J593q58o72J441K156J148Q71J990
$$ plain form
57267 259737 262562 265179 267217 268552 269222 270498 273947 278794 282424 284288 286922 292146 298694 304787
57253 304787 310700 317296 324060 330173 335879 341561 347065 352962 360597 369802 378409 385246 391899 400408
57239 400408 410980 423094 436977 452686 469395 486966 506730 529492 554252 579967 607076
57228 607076 636197 666748 697841 729292 760998 792948 826423 863396 903950 945974 988038
57217 988038 1030463 1072915 1113351 1150383 1184235 1214010 1236371 1248662 1251453 1246620 1234994 1217396
57205 1217396 1195823 1171610 1144225 1113717 1082706 1053979 1027591 1002213 978069 956661 938646
57194 938646 923646 911323 901248 892478 884369 877079 870660 864822 860021 857243 856000 854134 850208
57181 850208 844666 838373 832009 827220 825882 827645 830557 834630 842011 853002 865225 877874 893307
$$ packed form
57267B59737K825K617K038J335O70J276L449M847L630J864K634N224O548O093
57253C04787N913O596O764O113N706N682N504N897P635R205Q607O837O653Q509
57239D00408J0572J2114J3883J5709J6709J7571J9764K2762K4760K5715K7109
57228F07076K9121L0551L1093L1451L1706L1950L3475L6973M0554M2024M2064
57217I88038M2425M2452M0436L7032L3852K9775K2361J2291K791m833j1626j7598
57205A217396k1573k4213k7385l0508l1011k8727k6388k5378k4144k1408j8015
57194I38646j5000j2323j0075q770q109p290o419n838m801k778j243j866l926
57181H50208n542o293o364m789j338J763K912M073P381J0991J2223J2649J5433
$$ plain form
57168 893307 912777 934089 955696 979791 1008580 1040266 1071678 1102688 1135231 1169879 1206007
57157 1206007 1243670 1282942 1323003 1363974 1408083 1457136 1510542 1567245 1627322 1689945 1752327
57146 1752327 1812760 1872434 1932508 1992132 2051198 2111772 2174320 2235760 2294168 2352349 2413597
57135 2413597 2476941 2540053 2603940 2670951 2740738 2812278 2887631 2969452 3056362 3144624 3232789
57124 3232789 3321028 3407697 3490737 3571194 3651517 3731490 3809383 3885892 3963165 4040775 4116102
57113 4116102 4187844 4255943 4319062 4375488 4425821 4471933 4514088 4551638 4585383 4616905 4646989
57102 4646989 4676966 4709632 4746369 4785331 4824840 4866063 4909979 4954780 4999209 5045079 5093023
57091 5093023 5139094 5179369 5214500 5245668 5269639 5282412 5284458 5277577 5260101 5230506 5192548 5151250
$$ packed form
57168H93307J9470K1312K1607K4095K8789L1686L1412L1010L2543L4648L6128
57157A206007L7663L9272M0061M0971M4109M9053N3406N6703O0077O2623O2382
57146A752327O0433N9674O0074N9624N9066O0574O2548O1440N8408N8181O1248
57135B413597O3344O3112O3887O7011O9787P1540P5353Q1821Q6910Q8262Q8165
57124C232789Q8239Q6669Q3040Q0457Q0323P9973P7893P6509P7273P7610P5327
57113D116102P1742O8099O3119N6426N0333M6112M2155L7550L3745L1522L0084
57102D646989K9977L2666L6737L8962L9509M1223M3916M4801M4429M5870M7944
57091E093023M6071M0275L5131L1168K3971J2773K046o881j7476k9595l7958m1298
$$ plain form
57079 5151250 5106562 5056247 5001749 4945390 4884848 4816666 4742643 4666858 4589423 4509456 4431207
57068 4431207 4360438 4297195 4238259 4183317 4131544 4075066 4002989 3909260 3790070 3637721 3445130
57057 3445130 3212680 2942318 2628437 2262822 1844280 1374181 846851 254050 -405761
57047 -1133145 -1937815 -2832122 -3819404 -4900193 -6083583 -7379094 -8783008 -10286474 -11890339
57038 -11890339 -13598367 -15408011 -17332572 -19432366 -21808829 -24570983 -27811924 -31589163
57030 -31589163 -35895693 -40657064 -45756664 -51010751 -56126559 -60900189 -65745716 -72032284
57022 -72032284 -81496339 -94847655 -110783449 -126479721 -139191559 -147532312 -151529339
57015 -151529339 -151869646 -149267985 -144327143 -137631080 -129796242 -121463100 -113260585 -105707597
$$ packed form
57079E151250m4688n0315n4498n6359o0542o8182p4023p5785p7435p9967p8249
57068D431207p0769o3243n8936n4942n1773n6478p2077r3729j19190j52349j92591
57057C445130k32450k70362l13881l65615m18542m70099n27330B54050d05761
57047a133145q04670q94307r87282j080789j183390j295511j403914j503466j603865
57038a1890339j708028j809644j924561k099794k376463k762154l240941l777239
57030c1589163m306530m761371n099600n254087n115808m773630m845527o286568
57022g2032284r464055j3351316j5935794j5696272j2711838q340753l997027
57015a51529339l40307K601661M940842O696063P834838Q333142Q202515P552988
$$ plain form
57007 -105707597 -99073475 -93313472 -88141685 -83179985 -78094716 -72683441 -66900138 -60819181
56999 -60819181 -54574625 -48321993 -42223318 -36425401 -31033138 -26105656 -21672041 -17737249
56991 -17737249 -14276961 -11245899 -8598244 -6294346 -4292491 -2549394 -1031248 286279
56982 1430078 2431338 3314324 4093357 4782606 5399576 5956896 6459200 6910399 7316521
56973 7316521 7679609 7996616 8267389 8498033 8694824 8860877 9000430 9120285 9224613
56964 9224613 9313171 9386156 9446217 9494593 9530243 9554076 9569449 9577361 9575631 9563826 9544443 9518024
56952 9518024 9481520 9432944 9373849 9306177 9230559 9148647 9063142 8974098 8878177 8771641 8650171
56941 8650171 8505833 8330020 8122396 7894104 7661072 7438138 7241532 7091942 7008193 6994047
$$ packed form
57007a05707597O634122N760003N171787M961700N085269N411275N783303O080957
56999f0819181O244556O252632O098675N797917N392263M927482M433615L934792
56991a7737249L460288L031062K647655K303898K001855J743097a031248B86279
56982A430078J001260Q82986P79033O89249O16970N57320N02304M51199M06122
56973G316521L63088L17007K70773K30644J96791J66053J39553J19855J04328
56964I224613Q8558P2985O0061M8376L5650K3833J5373P912j730j1805j9383k6419
56952I518024l6504m8576n9095o7672p5618q1912q5505q9044r5921j06536j21470
56941H650171j44338j75813k07624k28292k33032k22934j96606j49590q3749j4146
$$ plain form
56931 6994047 7028618 7068131 7060664 6967956 6780385 6514075 6195544 5849755 5497749 5156583
56921 5156583 4836629 4540655 4267252 4013884 3776993 3552921 3340816 3142818 2960387
56912 2960387 2792215 2636215 2491391 2357184 2233189 2120125 2019021 1928990 1847913 1775463
56902 1775463 1712955 1660067 1614555 1575694 1544968 1522422 1505079 1489845 1474890 1456911 1430405
56891 1430405 1392119 1344229 1291249 1235762 1178948 1122843 1069235 1017440 965768 914788 867334
56880 867334 825631 789969 760111 736604 720339 711310 708081 708819 713351 723803 742010 766215
56868 766215 791127 810914 821015 817976 800165 769548 730982 688811 645101 601240 559385 521538
56856 521538 488637 461203 439511 422443 407645 393744 381288 371028 362620 355664 350587 347507
$$ packed form
56931F994047L4571L9513p467r2708j87571k66310l18531l45789l52006l41166
56921E156583l19954k95974k73403k53368k36891k24072k12105j97998j82431
56912B960387j68172j56000j44824j34207j23995j13064j01104r0031q1077p2450
56902A775463o2508n2888m5512l8861l0726k2546j7343j5234j4955j7979k6506
56891A430405l8286m7890n2980n5487n6814n6105n3608n1795n1672n0980m7454
56880H67334m1703l5662k9858k3507j6265r029l229P38M532J0452J8207K4205
56868G66215K4912J9787J0101l039j7811l0617l8566m2171m3710m3861m1855l7847
56856E21538l2901k7434k1692j7068j4798j3901j2456j0260q408o956n077l080
$$ plain form
56844 347507 345380 343041 340178 336757 332697 328676 326010 325062 324970 325509 327825 332515 338416 344275 350389
56829 350389 357489 365205 372875 380983 390395 400641 409991 416877 420434 420066 415370 406473 394219 380269
56815 380269 366910 355913 347405 340674 336068 334928 337436 342054 347904 356512 370174 389503 413632
56802 413632 442286 476713 518625 568314 623099 677140 723481 756878 774848 776885 764284 740837
56790 740837 711867 681501 651533 623112 598109 578111 563432 554151 551256 555880 568249 588208
56778 588208 615998 651960 696304 749653 812511 883296 957771 1030934 1098066 1153164 1188461
56767 1188461 1197996 1181727 1145171 1095694 1039829 982580 926933 873999 824864 781908 747071
56756 747071 719594 697319 680038 669857 668389 675484 690881 714932 746611 782437 818796 854392
$$ packed form
56844C47507k127k339k863l421m060m021k666r48r2N39K316M690N901N859O114
56829C50389P100P716P670Q108R412J0246R350O886L557l68m696q897j2254j3950
56815C80269j3359j0997q508o731m606j140K508M618N850Q608J3662J9329K4129
56802D13632K8654L4427M1912M9689N4785N4041M6341L3397J7970K037j2601k3447
56790G40837k8970l0366k9968k8421k5003j9998j4679r281k895M624J2369J9959
56778E88208K7790L5962M4344N3349O2858P0785P4475P3163O7132N5098L5297
56767A188461R535j6269l6556m9477n5865n7249n5647n2934m9135m2956l4837
56756G47071k7477k2275j7281j0181j468P095J5397K4051L1679L5826L6359L5596
$$ plain form
56744 854392 888967 920136 942839 951942 944635 920902 883448 837616 789718 743749 699819 656782
56732 656782 615994 581113 554125 533250 515713 501323 492021 488829 490966 497616 508872 524842
56720 524842 545173 569489 596610 622861 642747 652286 650933 639980 620626 594449 564320 533315
56708 533315 503201 474769 448780 425512 404116 383541 363761 345336 328461 313292 300499
56697 300499 290351 281837 273773 266265 259949 254296 248052 241074 234347 228239 222165 216254 212048 210929
56683 210929 212624 215649 218476 219948 219423 217207 214522 212488 211178 209870 208059 206085 204859 204929 205667
56668 205667 205591 203818 201082 198972 198269 198424 198558 198520 198801 199613 200156 198908 194955 189068 183116 178335 174698
56651 174698 171977 170327 169252 167064 162579 156771 151446 146701 141181 134836 129793 127823 128160 128678 128329
$$ packed form
56744H54392L4575L1169K2703R103p307k3733l7454m5832m7898m5969m3930m3037
56732F56782m0788l4881k6988k0875j7537j4390r302l192K137O650J1256J5970
56720E24842K0331K4316K7121K6251J9886R539j353j0953j9354k6177l0129l1005
56708E33315l0114k8432k5989k3268k1396k0575j9780j8425j6875j5169j2793
56697C00499j0148q514q064p508o316n653o244o978o727o108o074n911m206j119
56683B10929J695L025K827J472n25k216k685k034j310j308j811j974j226P0P38
56668B05667p6j773k736k110p03J55J34l8K81Q12N43j248l953n887n952m781l637
56651A74698k721j650j075k188m485n808n325m745n520o345n043j970L37N18l49
$$ plain form
56636 128329 127557 126945 126525 126153 125639 124525 122525 120347 119470 120798 123839 127330 130311 132446 133805 134815
56620 134815 136175 138281 140685 142573 143825 145162 147100 149317 151310 153129 154920 156274 156757 156798 157242
56605 157242 158171 159060 160049 162070 165414 169007 171525 172637 172879 173036 173965 176280 179694 183256 186514 189829
56589 189829 193256 196048 197742 198786 199360 198535 195576 191453 188048 186330 186016 186316 186127 184388 181450
56574 181450 179399 179638 180748 180225 177840 175529 174262 173075 171409 170250 170147 169786 167643 163842 159463
56559 159463 155160 151424 149049 148123 147521 146550 146311 148107 151121 153109 153077 151944 150753 149661 148845 149087
56543 149087 150842 153503 156079 158158 159953 161931 164643 168404 172865 177264 181300 185367 189745 193953
56529 193953 197182 199103 200045 200624 201323 202179 202770 202756 202501 202931 204699 207693 211301 214781 217463 219203
$$ packed form
56636A28329p72o12m20l72n14j114k000k178q77J328L041L491K981K135J359J010
56620A34815J360K106K404J888J252J337J938K217J993J819J791J354M83M1M44
56605A57242R29Q89R89K021L344L593K518J112K42J57R29K315L414L562L258L315
56589A89829L427K792J694J044N74q25k959m123l405j718l14L00j89j739k938
56574A81450k051K39J110n23k385k311j267j187j666j159j03l61k143l801m379
56559A59463m303l736k375r26o02r71k39J796L014J988l2j133j191j092q16K42
56543A49087J755K661K576K079J795J978K712L761M461M399M036M067M378M208
56529A93953L229J921R42N79O99Q56N91j4k55M30J768K994L608L480K682J740
$$ plain form
56513 219203 220844 223693 228097 232823 236192 237616 237875 238324 240094 243636 248466 253609 258745 264608 271770
56498 271770 279414 286048 291284 296144 301706 308253 315710 323841 331750 338282 343569 349210 356001 362165
56484 362165 364980 363935 361232 359286 358714 358855 359200 359769 360685 361965 363473 364698 364734 362657 357970 350989
56468 350989 343182 336818 333500 332822 332866 332006 329722 325988 320923 315276 310223 306091 301999 297229 292227
56453 292227 287684 283440 279127 275169 272098 269291 265508 260600 255693 251636 248083 244294 240133 236043
56439 236043 232473 229457 226412 222484 217596 212938 209908 208733 208712 209411 210585 211130 209574 206090 202975
56424 202975 202437 204629 208361 212876 218072 223587 228726 233143 236961 240316 243307 246231 249408 252943
56410 252943 257011 262031 268017 274023 278878 282403 285511 289213 293943 299584 305599 311334 316756 322644
$$ packed form
56513B19203J641K849M404M726L369J424K59M49J770L542M830N143N136N863P162
56498B71770P644O634N236M860N562O547P457Q131P909O532N287N641O791O164
56484C62165K815j045k703j946n72J41L45N69R16J280J508J225L6k077m687o981
56468C50989p807o364l318o78M4q60k284l734n065n647n053m132m092m770n002
56453B92227m543m244m313l958l071k807l783m908m907m057l553l789m161m090
56439B36043l570l016l045l928m888m658l030j175k1O99J174N45j556l484l115
56424B02975n38K192L732M515N196N515N139M417L818L355K991K924L177L535
56410B52943M068N020N986O006M855L525L108L702M730N641O015N735N422N888
$$ plain form
56396 322644 329376 335772 340087 342178 343747 346183 349093 351435 353230 355337 358036 360757 363022 364867
56382 364867 366265 366849 366500 365803 365586 366164 367286 368645 370190 371894 373471 374546 375048 375149 374784 373616
56366 373616 371703 369855 368799 368178 366975 364947 362901 361375 359706 356920 352964 348461 343625 338118
56352 338118 331957 325934 320894 316906 313243 309154 304747 301236 299982 300987 302558 302864 301681 300280
56338 300280 299900 300733 302239 303775 304943 305843 307005 308648 310113 310681 310963 312681 316698 321911 326515
56323 326515 329961 333121 336892 341263 345725 350010 354120 357878 360928 363376 366188 370372 375591 380050
56309 380050 382181 382078 380939 379569 378181 377232 377363 378494 379875 381202 382798 384589 385958 386932 388501
56294 388501 391188 394242 396877 399383 402234 405070 407489 410079 413458 416878 419152 420742 423606 428832
$$ packed form
56396C22644O732O396M315K091J569K436K910K342J795K107K699K721K265J845
56382C64867J398N84l49o97k17N78J122J359J545J704J577J075N02J01l65j168
56366C73616j913j848j056o21j203k028k046j526j669k786l956m503m836n507
56352C38118o161o023n040l988l663m089m407l511j254J005J571L06j183j401
56338C00280l80Q33J506J536J168R00J162J643J465N68K82J718M017N213M604
56323C26515L446L160L771M371M462M285M110L758L050K448K812M184N219M459
56309C80050K131j03j139j370j388r49J31J131J381J327J596J791J369R74J569
56294C88501K687L054K635K506K851K836K419K590L379L420K274J590K864N226
$$ plain form
56280 428832 435544 442307 448617 454684 460707 466920 473822 481795 490726 500197 509854 519531 529288 539336
56266 539336 549631 559648 568914 577704 586839 596995 608579 621968 637151 653249 669114 684504
56254 684504 700023 715803 730868 743994 754764 763703 771736 779584 787149 793501 797738 799812 800209
56241 800209 799360 798182 798706 802754 809578 815953 819282 820036 820760 823434 828440 835411 844175 854889 867760
56226 867760 882691 899216 917033 936644 959000 984318 1011809 1040940 1072464 1107681 1146976
56215 1146976 1189563 1234567 1281992 1332704 1387643 1447092 1510694 1578259 1650338 1727750 1810793
56204 1810793 1899600 1995279 2099952 2215364 2341846 2478928 2626456 2784879 2954904 3137180
56194 3137180 3331946 3538588 3755757 3982038 4216141 4456183 4699123 4941180 5178492
$$ packed form
56280D28832O712O763O310O067O023O213O902P973Q931R471R657R677R757J0048
56266E39336J0295J0017R266Q790R135J0156J1584J3389J5183J6098J5865J5390
56254F84504J5519J5780J5065J3126J0770Q939Q033P848P565O352M237K074L97
56241H00209q49j178N24M048O824O375L329P54P24K674N006O971Q764J0714J2871
56226H67760J4931J6525J7817J9611K2356K5318K7491K9131L1524L5217L9295
56215A146976M2587M5004M7425N0712N4939N9449O3602O7565P2079P7412Q3043
56204A810793Q8807R5679J04673J15412J26482J37082J47528J58423J70025J82276
56194C137180J94766K06642K17169K26281K34103K40042K42940K42057K37312
$$ plain form
56185 5178492 5407069 5622306 5818860 5991186 6134669 6246735 6326959 6375822 6393631 6381123
56175 6381123 6340741 6276415 6192054 6091044 5977037 5853953 5724621 5590257 5451746 5310572
56165 5310572 5168013 5024260 4878967 4731917 4582518 4429532 4272439 4112671 3952570
56156 3952570 3793398 3635137 3477940 3322831 3170971 3023071 2879776 2742104 2611288
56147 2611288 2488349 2373655 2266615 2165975 2070967 1982213 1901206 1828783 1764132 1705207
56137 1705207 1650090 1598254 1550611 1508094 1470188 1435274 1402343 1371647 1343451 1317131 1292232
56126 1292232 1269768 1251510 1238080 1228346 1220482 1213112 1205763 1199037 1194421 1193214 1195313 1199395 1204423
56113 1204423 1210674 1219095 1229868 1241950 1254212 1266839 1281169 1297880 1315780 1332947 1348649 1363289
$$ packed form
56185E178492K28577K15237J96554J72326J43483J12066Q0224M8863J7809j2508
56175F381123m0382o4326q4361j01010j14007j23084j29332j34364j38511j41174
56165E310572j42559j43753j45293j47050j49399j52986j57093j59768j60101
56156C952570j59172j58261j57197j55109j51860j47900j43295j37672j30816
56147B611288j22939j14694j07040j00640r5008q8754q1007p2423o4651n8925
56137A705207n5117n1836m7643m2517l7906l4914l2931l0696k8196k6320k4899
56126A292232k2464j8258j3430r734p864p370p349o726m616j207K099M082N028
56113A204423O251Q421J0773J2082J2262J2627J4330J6711J7900J7167J5702J4640
$$ plain form
56101 1363289 1376663 1387547 1395509 1402117 1409608 1418948 1429791 1441609 1453990 1466280 1477945 1489386
56089 1489386 1501981 1517425 1537211 1562166 1591904 1625145 1661312 1701589 1747859 1801025 1861218
56078 1861218 1929319 2007177 2096170 2196549 2308708 2434408 2576034 2734695 2909314 3097060
56068 3097060 3293913 3494755 3693785 3885747 4067050 4235781 4391219 4533948 4665892
56059 4665892 4788492 4899966 4994916 5067249 5112948 5130110 5118429 5080754 5024049 4955932 4879351
56048 4879351 4791715 4689105 4569661 4433169 4280349 4114340 3941357 3768022 3598537 3435319
56038 3435319 3281132 3138834 3009303 2890925 2781464 2680085 2587809 2506216 2435282 2372391
56028 2372391 2314315 2260307 2212149 2170860 2134728 2101387 2070494 2043187 2020022 2000707 1985064
$$ packed form
56101A363289J3374J0884P962O608P491R340J0843J1818J2381J2290J1665J1441
56089A489386J2595J5444J9786K4955K9738L3241L6167M0277M6270N3166O0193
56078A861218O8101P7858Q8993J00379J12159J25700J41626J58661J74619J87746
56068C097060J96853K00842J99030J91962J81303J68731J55438J42729J31944
56059D665892J22600J11474R4950P2333M5699J7162j1681l7675n6705o8117p6581
56048D879351q7636j02610j19444j36492j52820j66009j72983j73335j69485j63218
56038C435319j54187j42298j29531j18378j09461j01379r2276q1593p0934o2891
56028B372391n8076n4008m8158m1289l6132l3341l0893k7307k3165j9315j5643
$$ plain form
56017 1985064 1972925 1963555 1956292 1951323 1948981 1948873 1950693 1955253 1963518 1974991 1988146 2002251 2017832
56004 2017832 2035594 2055654 2077589 2100572 2123832 2147620 2173284 2201668 2231895 2262503 2293330
55993 2293330 2325478 2359652 2395329 2431596 2468373 2506791 2548344 2593367 2640593 2688775 2738389
55982 2738389 2790756 2845879 2902661 2961048 3022077 3085608 3150107 3215267 3282744 3353355 3425840
55971 3425840 3499901 3578596 3665827 3762753 3868280 3981740 4103334 4232861 4369807 4514145
55961 4514145 4665900 4824433 4988891 5158520 5332084 5508466 5688545 5875004 6069612
55952 6069612 6272378 6483977 6706840 6942784 7191681 7453386 7728607 8016833 8316190
55943 8316190 8626896 8952269 9294941 9655133 10034363 10437423 10868329 11327678 11816709
$$ packed form
56017A985064j2139r370p263m969k342j08J820M560Q265J1473J3155J4105J5581
56004B017832J7762K0060K1935K2983K3260K3788K5664K8384L0227L0608L0827
55993B293330L2148L4174L5677L6267L6777L8418M1553M5023M7226M8182M9614
55982B738389N2367N5123N6782N8387O1029O3531O4499O5160O7477P0611P2485
55971C425840P4061P8695Q7231R6926J05527J13460J21594J29527J36946J44338
55961D514145J51755J58533J64458J69629J73564J76382J80079J86459J94608
55952F069612K02766K11599K22863K35944K48897K61705K75221K88226K99357
55943H316190L10706L25373L42672L60192L79230M03060M30906M59349M89031
$$ plain form
55934 11816709 12340711 12905439 13513404 14167016 14872119 15634523 16455360 17333040 18266864
55925 18266864 19255690 20296962 21391643 22547300 23772562 25071897 26449762 27915691
55917 27915691 29480337 31150426 32932720 34838513 36878547 39058712 41388862 43893100
55909 43893100 46605022 49556872 52780043 56310850 60187535 64448054 69143604 74353782
55901 74353782 80181256 86736523 94137061 102515710 112021700 122826466 135148817 149274380
55893 149274380 165545655 184353586 206158256 231492338 260906506 294910509 333907362
55886 333907362 377875455 425571119 473611101 516395046 547517798 562116107 558684075
55879 558684075 539263076 508155376 470188729 429456740 388822365 349989405 313825193
$$ packed form
55934A1816709N24002N64728O07965O53612P05103P62404Q20837Q77680R33824
55925A8266864R88826J041272J094681J155657J225262J299335J377865J465929
55917B7915691J564646J670089J782294J905793K040034K180165K330150K504238
55909D3893100K711922K951850L223171L530807L876685M260519M695550N210178
55901G4353782N827474O555267P400538Q378649R505990J0804766J2322351J4125563
55893A49274380J6271275J8807931K1804670K5334082K9414168L4004003L8996853
55886C33907362M3968093M7695664M8039982M2783945L1122752J4598309l432032
55879E58684075j9420999l1107700l7966647m0731989m0634375l8832960l6164212
$$ plain form
55872 313825193 280692391 250674674 223700233 199617744 178249176 159409748 142900691
55865 142900691 128502497 115980903 105096156 95612120 87310687 80005325 73541548
55858 73541548 67788843 62638376 58005573 53825908 50045151 46615514 43497640 40659111
55850 40659111 38069980 35703335 33538696 31559616 29747823 28083373 26549555 25133295
55842 25133295 23821219 22599597 21458299 20390977 19390872 18449362 17558960 16715380
55834 16715380 15916596 15161674 14449887 13778966 13144768 12544122 11976643 11442080 10937738
55825 10937738 10460700 10010677 9587964 9190274 8814326 8459015 8124235 7807968 7507414
55816 7507414 7221684 6950423 6690992 6440030 6196907 5962697 5736586 5516196 5300839
$$ packed form
55872C13825193l3132802l0017717k6974441k4082489k1368568j8839428j6509057
55865A42900691j4398194j2521594j0884747r484036q301433p305362o463777
55858G3541548n752705n150467m632803m179665l780757l429637l117874k838529
55850D0659111k589131k366645k164639j979080j811793j664450j533818j416260
55842B5133295j312076j221622j141298j067322j000105r41510q90402q43580
55834A6715380p98784p54922p11787o70921o34198o00646n67479n34563n04342
55825A0937738m77038m50023m22713l97690l75948l55311l34780l16267l00554
55816G507414k85730k71261k59431k50962k43123k34210k26111k20390k15357
$$ plain form
55807 5300839 5091690 4889362 4693868 4506332 4328145 4158854 3997244 3843836 3700124
55798 3700124 3566220 3441526 3326589 3221663 3124643 3033450 2949752 2877198 2816283 2763596
55788 2763596 2715491 2669555 2623074 2573427 2520339 2465190 2408333 2349766 2291952 2238601 2190241
55777 2190241 2143919 2097662 2052484 2009537 1968199 1927758 1888500 1850248 1812033 1773849 1736617
55766 1736617 1700033 1662792 1625428 1590372 1558424 1527566 1496179 1465045 1435103 1405554 1375686
55755 1375686 1346588 1319526 1294176 1269818 1246913 1226334 1208297 1193070 1181374 1173081 1166829 1161841
55743 1161841 1158743 1157593 1156561 1153794 1149457 1144884 1140824 1137379 1134213 1129638 1120880 1106827 1089588
55730 1089588 1072005 1054634 1036538 1018012 1000579 984735 969591 954826 941473 930451 921478
$$ packed form
55807E300839k09149k02328j95494j87536j78187j69291j61610j53408j43712
55798C700124j33904j24694j14937j04926r7020r1193q3698p2554o0915n2687
55788B763596m8105m5936m6481m9647n3088n5149n6857n8567n7814n3351m8360
55777B190241m6322m6257m5178m2947m1338m0441l9258l8252l8215l8184l7232
55766A736617l6584l7241l7364l5056l1948l0858l1387l1134k9942k9549k9868
55755A375686k9098k7062k5350k4358k2905k0579j8037j5227j1696q293o252m988
55743A161841l098j150j032k767m337m573m060l445l166m575q758j4053j7239
55730A089588j7583j7371j8096j8526j7433j5844j5144j4765j3353j1022q973
$$ plain form
55719 921478 913757 906712 899687 891909 883471 875726 869689 864101 855795 842473 824935 806293 789195
55706 789195 774336 761439 750725 742825 737871 735298 734163 733020 729982 723825 714952 704634 693533
55693 693533 681500 668415 654453 639956 625942 614237 605828 599097 590928 579727 566486 552906
55681 552906 539722 527044 515067 503768 492676 481494 470550 460501 452115 446195 442846 440749
55669 440749 438099 434404 430538 427037 423374 419062 414210 408618 401574 393235 385215 378990 374466 370807
55655 370807 367853 365894 364602 363184 361360 359597 358548 358708 360302 363001 365940 368370 370194 371780
55641 371780 373647 376458 380660 385698 390119 393006 395059 397730 401571 405908 409975 413793 417860 422364
55627 422364 426977 431297 435296 439158 442695 445121 445593 443867 440422 436266 432720 430807 430288 429610 427424
$$ packed form
55719I21478p721p045p025p778q438p745o037n588q306j3322j7538j8642j7098
55706G89195j4859j2897j0714p900m954k573j135j143l038o157q873j0318j1101
55693F93533j2033j3085j3962j4497j4014j1705q409o731q169j1201j3241j3580
55681E52906j3184j2678j1977j1299j1092j1182j0944j0049q386n920l349k097
55669D40749k650l695l866l501l663m312m852n592p044q339q020o225m524l659
55655C70807k954j959j292j418j824j763j049J60J594K699K939K430J824J586
55641C71780J867K811M202N038M421K887K053K671L841M337M067L818M067M504
55627D22364M613M320L999L862L537K426M72j726l445m156l546j913n19o78k186
$$ plain form
55612 427424 424056 420950 418934 417707 416918 416815 417532 418452 418891 419191 420634 424069 428716 432594 434412 434877
55596 434877 435684 437329 438763 439250 439498 440342 441333 441558 440998 439911 437535 432804 426069 418798 411661 404076
55580 404076 395571 386365 376550 365934 354888 344226 333953 323215 311948 301635 293822 288345
55568 288345 283345 276738 267767 257697 248810 242124 236350 229868 223104 217722 213883 210025 205486 201572
55554 201572 199475 198659 198146 198046 198775 199692 199596 197998 195172 191490 187434 183832 181493 180825 181807 183623
55538 183623 184286 181902 176944 172288 170251 170420 171072 171679 172896 174851 176810 178394 180008 181920 183660
55523 183660 184541 184425 183882 183761 184450 185480 186112 186433 187463 190009 193854 198251 202765 207397 212389 218146
55507 218146 224985 232791 241354 251037 262451 275312 288355 300570 311793 321751 329363 333525 333997
$$ packed form
55612D27424l368l106k016j227p89j03P17R20M39L00J443L435M647L878J818M65
55596D34877Q07J645J434M87K48Q44R91K25n60j087k376m731o735p271p137p585
55580D04076q505r206r815j0616j1046j0662j0273j0738j1267j0313p813n477
55568B88345n000o607q971j0070q887o686n774o482o764n382l839l858m539l914
55554B01572k097q16n13j00P29R17r6j598k826l682m056l602k339o68R82J816
55538A83623O63k384m958m656k037J69O52O07J217J955J959J584J614J912J740
55523A83660Q81j16n43j21O89J030O32L21J030K546L845M397M514M632M992N757
55507B18146O839P806Q563R683J1414J2861J3043J2215J1223R958P612M162M72
$$ plain form
55494 333997 331086 325074 316425 305911 293997 280642 266302 252659 241645 233815 227995 222380 215979
55481 215979 209400 204332 201821 201021 200136 198511 197014 196422 196428 196461 196501 196765 197469 199097 201825 204377 204750
55464 204750 202727 200382 199269 198305 195589 191224 186977 183692 180402 175712 168974 160377 151027 142840
55450 142840 137404 134649 133033 130947 127661 123423 119168 115799 113214 110365 106727 103158 100860 100051
55436 100051 100196 100852 101442 100782 97860 93018 87801 83737 81488 80577 79553 77167 73960 71924 71895 72174
55420 72174 70675 67598 64806 63222 62183 60954 59543 58140 57034 57122 59326 63201 66889 68661 68076
55405 68076 65841 63191 61199 59961 58568 56438 54324 53340 53560 54380 55728 57778 59917 61214 61741
55390 61741 62228 62667 62457 61792 61393 60901 59128 56255 54249 54377 55628 56363 56331 56142 55699 54428 52532
$$ packed form
55494C33997k911o012q649j0514j1914j3355j4340j3643j1014p830n820n615o401
55481B15979o579n068k511q00q85j625j497n92OL3M0K64P04J628K728K552L73
55464B04750k023k345j113r64k716m365m247l285l290m690o738q597r350q187
55450A42840n436k755j616k086l286m238m255l369k585k849l638l569k298q09
55436A00051J45O56N90o60k922m842n217m064k249r11j024k386l207k036k9K79
55420G2174j499l077k792j584j039j229j411j403j106Q8K204L875L688J772n85
55405F8076k235k650j992j238j393k130k114r84K20Q20J348K050K139J297N27
55390F1741M87M39k10o65l99m92j773k873k006J28J251P35l2j89m43j271j896
$$ plain form
55373 52532 50937 50158 49990 50220 50923 52015 53097 53864 54496 55538 57392 59818 61967 63066 63030 62150 60461
55356 60461 58061 55945 55617 57455 60066 61772 62342 62825 64050 65903 67885 69733 71336 72465 72912
55341 72912 72819 72649 72763 73111 73414 73596 73859 74193 73968 72311 69020 65103 62216 61321 61712 61589 59791 56849
55323 56849 54206 52758 52603 53648 55586 57471 58364 58474 58643 58693 57638 55944 55949 58946 63021 65142 64500
55306 64500 62433 59856 56610 53112 50763 50171 50195 49283 47046 44216 41767 40315 39740 39179 37846 35914
55290 35914 34142 32877 32023 31749 32375 33551 34294 33947 32658 31116 30462 32005 36022 40844 44030 44496
55274 44496 42929 40527 38319 37335 38025 39362 39721 38868 38106 38397 39459 40737 41913 42250 40894 38369
55258 38369 36422 35708 34960 33200 31482 31316 32449 33518 34145 34979 36094 36678 36351 35779 35769 36395 37177
$$ packed form
55373E2532j595p79j68K30P03J092J082P67O32J042J854K426K149J099l6q80j689
55356F0461k400k116l28J838K611J706N70M83J225J853J982J848J603J129M47
55341G2912r3j70J14L48L03J82K63L34k25j657l291l917k887q95L91j23j798k942
55323E6849k643j448j55J045J938J885Q93J10J69N0j055j694NK997M075K121o42
55306F4500k067k577l246l498k349n92K4r12k237k830k449j452n75n61j333j932
55290C5914j772j265q54k74O26J176P43l47j289j542o54J543M017M822L186M66
55274D4496j567k402k208r84O90J337L59q53p62K91J062J278J176L37j356k525
55258C8369j947p14p48j760j718j66J133J069O27Q34J115N84l27n72j0O26P82
$$ plain form
55241 37177 37718 38095 38827 40351 42416 44254 45398 45904 45726 44584 42678 40836 39590 38806 38536 39354
55225 39354 41212 42749 42656 41212 39674 38604 37672 36744 36190 36188 36522 37129 38223 39868 41860 43985 45931
55208 45931 47186 47503 47384 47557 47967 47661 45619 41458 35733 30120 26989 27818 31678 35865 38371 39485
55192 39485 40820 43139 45541 46618 45979 44380 42665 41063 39614 38663 38354 37976 36667 34753 33615
55177 33615 33985 35156 36254 37481 39450 41844 43564 44063 43935 44228 45535 47664 49873 51514 52575
55162 52575 53381 53690 52600 49669 45765 42443 40779 40990 42633 44767 46365 47075 47307 47437 47495 47908 49632
55145 49632 52833 56188 58381 59741 61433 63470 64752 64844 64584 64804 65347 65438 64339 61736 58326 55897
55129 55897 55806 57317 58446 58476 58478 59158 59683 59282 58672 58793 59113 58503 57244 56829 57958 59850 61504 62570
$$ packed form
55241C7177N41L77P32J524K065J838J144N06j78j142j906j842j246p84k70Q18
55225C9354J858J537r3j444j538j070r32r28n54kL34O07J094J645J992K125J946
55208D5931J255L17j19J73M10l06k042m161n725n613l131Q29L860M187K506J114
55192C9485J335K319K402J077o39j599j715j602j449r51l09l78j309j914j138
55177C3615L70J171J098J227J969K394J720M99j28K93J307K129K209J641J061
55162E2575Q06L09j090k931l904l322j664K11J643K134J598P10K32J30N8M13J724
55145D9632L201L355K193J360J692K037J282R2k60K20N43R1j099k603l410k429
55129E5897r1J511J129L0KO80N25m01o10J21L20o10j259m15J129J892J654J066
$$ plain form
55111 62570 62879 62184 60747 59381 58468 57556 56304 55176 54675 54448 53853 53121 53184 54355 55819 56581 56460
55094 56460 56004 55796 56082 56767 57454 57674 57260 56430 55406 54153 52684 51389 50792 51069 52028 53481 55350
55077 55350 57352 58785 58777 56860 53461 49828 47253 46144 45921 45885 45925 46259 46936 48030 50033 53373 57473
55060 57473 60900 62692 63332 64176 66060 68581 70562 71122 70408 69377 68887 69113 69816 70870 72185 73373
55044 73373 73977 73983 73666 72968 71557 69663 68452 69190 72005 75524 77805 77838 76384 75217 75493 77055 79301
55027 79301 81937 84424 85514 84397 82062 80539 80939 83020 86321 90395 94029 95792 95915 96371 98351
55012 98351 100681 101459 100287 98103 95775 93925 93386 94574 96715 98626 99950 100780 100569 98658 95754
54997 95754 93747 93851 95721 98418 101361 104145 106247 107332 107459 106814 105736 105052 105705 107632 109406 109378
$$ packed form
55111F2570L09o95j437j366r13r12j252j128n01k27n95p32O3J171J464P62j21
55094E6460m56k08K86O85O87K20m14q30j024j253j469j295n97K77R59J453J869
55077E5350K002J433qj917l399l633k575j109k23l6M0L34O77J094K003L340M100
55060E7473L427J792O40Q44J884K521J981N60p14j031m90K26P03J054J315J188
55044G3373O04Ol17o98j411j894j211P38K815L519K281L3j454j167K76J562K246
55027G9301K636K487J090j117k335j523M00K081L301M074L634J763J23M56J980
55012I8351K330P78j172k184k328j850n39J188K141J911J324Q30k11j911k904
54997I5754k007J04J870K697K943K784K102J085J27o45j078o84O53J927J774k8
$$ plain form
54981 109378 107097 103533 100183 98059 97261 97271 97598 98105 98712 99126 99168 99190 99776 101043 102520 103683 104315
54964 104315 104372 103724 102104 99366 96023 93529 93488 96215 100320 103989 106340 107372 107275 106482 105886 106084 106498
54947 106498 106008 104515 103230 103291 104571 105878 105943 104268 101534 99186 98189 98207 98266 97918 97258 96213 94771
54930 94771 93752 94250 96101 97882 98734 99262 100140 100927 101084 101347 102890 105497 107785 109255 110971 113764
54914 113764 116731 118292 118360 118596 120520 124043 128025 131703 135125 138531 141864 144891 147443 149616 151992
54899 151992 155554 160868 167398 174131 180879 188342 196884 206111 215954 227255 240585 255234 270238
54886 270238 285847 302932 321213 339032 354757 367439 376116 379717 378124 372601 364662 354928 343352
54873 343352 330045 315495 300303 284951 269636 254324 239337 225829 215027 206862 199898 192896
$$ packed form
54981A09378k281l564l350k124p98J0L27N07O07M14M2K2N86J267J477J163O32
54964A04315N7o48j620k738l343k494m1K727M105L669K351J032r7p93n96J98M14
54947A06498m90j493j285O1J280J307O5j675k734k348r97J8N9l48o60j045j442
54930I4771j019M98J851J781Q52N28Q78P87J57K63J543K607K288J470J716K793
54914A13764K967J561O8K36J924L523L982L678L422L406L333L027K552K173K376
54899A51992L562N314O530O733O748P463Q542R227R843J1301J3330J4649J5004
54886B70238J5609J7085J8281J7819J5725J2682Q677L601j593n523p939r734j1576
54873C43352j3307j4550j5192j5352j5315j5312j4987j3508j0802q165o964p002
$$ plain form
54861 192896 186004 180173 175931 173004 170787 168864 167394 167234 169285 173418 178393 183210 188323 195224
54847 195224 204917 216970 229865 242199 253754 265524 278465 292337 305991 318575 329721 338546
54835 338546 343360 342842 337039 326954 313864 299404 285417 272679 260128 246291 231442 217605
54823 217605 206441 197800 190423 183339 176282 169304 162555 156334 151063 147138 144723 143524 142736 141451
54809 141451 139206 136131 132643 129217 126299 124131 122568 121275 120022 118529 116224 112822 109250 107239
54795 107239 107458 108527 108582 107529 106863 107391 108126 107730 106124 104013 101597 98690 95651 93173 91284 89506
54779 89506 88031 87774 89064 91132 93120 94727 95588 95098 93458 91954 91380 90982 89887 88864 89551 92322
54763 92322 96029 99580 102728 105509 108027 110710 113793 116584 118272 119357 121036 123140 124137 123619 123324
$$ packed form
54861A92896o892n831m242k927k217j923j470j60K051M133M975M817N113O901
54847A95224R693J2053J2895J2334J1555J1770J2941J3872J3654J2584J1146Q825
54835C38546M814n18n803j0085j3090j4460j3987j2738j2551j3837j4849j3837
54823B17605j1164q641p377p084p057o978o749o221n271l925k415j199p88j285
54809A41451k245l075l488l426k918k168j563j293j253j493k305l402l572k011
54795A07239K19J069N5j053o66N28P35l96j606k111k416k907l039k478j889j778
54779H9506j475k57J290K068J988J607Q61m90j640j504n74l98j095j023O87K771
54763I2322L707L551L148K781K518K683L083K791J688J085J679K104R97n18k95
$$ plain form
54748 123324 124878 127639 129898 131441 133809 138412 145315 153698 162728 172075 182049 193114 205028 216892
54734 216892 228428 240660 254825 271104 288981 308113 327865 346373 361253 371449 377692 381127
54722 381127 382138 380487 375862 367963 356652 342437 326627 310916 296930 285914 278190 272776 267961
54709 267961 262546 256497 250530 245440 241719 239265 237416 235716 234794 235989 239901 245656 251863 258002
54695 258002 264638 272614 282344 293718 306369 320027 334726 350595 367484 385086 403498 423141
54683 423141 443562 462397 476140 482309 480787 473113 460781 444466 424656 402485 379675 357727
54671 357727 337320 318472 301108 285313 271054 257851 245079 232730 221691 212846 205888 199385
54659 199385 192363 185572 180765 178755 178516 178206 176649 173749 170023 166215 163083 160980 159538 158131 156640
$$ packed form
54748A23324J554K761K259J543K368M603O903Q383R030R347R974J1065J1914J1864
54734B16892J1536J2232J4165J6279J7877J9132J9752J8508J4880J0196O243L435
54722C81127J011j651m625p899j1311j4215j5810j5711j3986j1016p724n414m815
54709B67961n415o049n967n090l721k454j849j700r22J195L912N755O207O139
54695B58002O636P976R730J1374J2651J3658J4699J5869J6889J7602J8412J9643
54683D23141K0421J8835J3743O169j522p674j2332j6315j9810k2171k2810k1948
54671C57727k0407j8848j7364j5795j4259j3203j2772j2349j1039q845o958o503
54659A99385p022o791m807k010k39l10j557k900l726l808l132k103j442j407j491
$$ plain form
54644 156640 155347 154049 151951 148851 145891 144375 144063 143703 143307 144768 149385 155536 159890 160652 158636
54629 158636 155398 151696 148091 145793 145961 148630 152911 157665 161571 163360 162937 161881 161989 163591 165833
54614 165833 168117 170427 172720 175067 178152 182684 188307 193973 199229 204309 209242 213962 219156 225662
54600 225662 232942 239483 244915 250368 256348 261833 266257 270811 276547 282452 286940 290342 294290 299158
54586 299158 303857 308006 312543 317890 323127 327676 332534 338914 346586 354585 362957 372549 383195 393298
54572 393298 401468 407603 411728 412688 409124 401459 391722 381191 369386 355906 342017 329224 317115
54559 317115 304161 290376 277668 267447 259291 252302 246383 241572 237423 233900 231828 231603 232374 233322
54545 233322 234731 236823 238642 239458 240394 242974 246439 248231 247057 244040 240760 237638 234488 231205 227271
$$ packed form
54644A56640j293j298k098l100k960j516l12l60l96J461M617O151M354P62k016
54629A58636l238l702l605k298J68K669M281M754L906J789m23j056J08J602K242
54614A65833K284K310K293K347L085M532N623N666N256N080M933M720N194O506
54600B25662P280O541N432N453N980N485M424M554N736N905M488L402L948M868
54586B99158M699M149M537N347N237M549M858O380P672P999Q372R592J0646J0103
54572C93298Q170O135M125R60l564p665r737j0531j1805j3480j3889j2793j2109
54559C17115j2954j3785j2708j0221q156o989n919m811m149l523k072k25P71R48
54545B33322J409K092J819Q16R36K580L465J792j174l017l280l122l150l283l934
$$ plain form
54530 227271 221846 215167 208963 204607 201482 197909 193232 188326 184372 181720 179681 176960 172490 166354
54516 166354 159817 154202 149893 146676 144659 144209 144988 145600 144637 141981 138827 136395 134876 133792 133088
54501 133088 133318 134652 136205 136779 136125 135195 135224 136752 139268 141568 142618 142302 141260 140025 138750 137800
54485 137800 137928 139399 141438 143057 144082 144977 146194 148255 151760 156507 161030 163913 165339 166607 168570
54470 168570 171400 175384 180637 186225 190793 194134 197079 199879 201973 203387 204879 206385 206753 205664
54456 205664 204344 203458 201589 197045 190317 183524 178020 173680 170038 166934 164224 161790 159714 157744
54442 157744 155007 151204 147729 146465 147501 149080 149864 150220 151046 152316 153309 153545 153014 152009 151167 151138
54426 151138 151773 152013 151112 149675 148995 149487 150273 150339 149698 149327 150173 152322 154975 157179 158676 160129 162473
$$ packed form
54530B27271n425o679o204m356l125l573m677m906l954k652k039k721m470o136
54516A66354o537n615m309l217k017m50P79O12r63k656l154k432j519j084p04
54501A33088K30J334J553N74o54r30K9J528K516K300J050l16j042j235j275r50
54485A37800J28J471K039J619J025Q95J217K061L505M747M523K883J426J268J963
54470A68570K830L984N253N588M568L341K945K800K094J414J492J506L68j089
54456B05664j320q86j869m544o728o793n504m340l642l104k710k434k076j970
54442A57744k737l803l475j264J036J579P84L56Q26J270R93K36n31j005q42k9
54426A51138O35K40r01j437o80M92P86O6o41l71Q46K149K653K204J497J453K344
$$ plain form
54409 162473 166018 170260 174527 178596 182491 185948 188481 190063 191270 192438 193049 192525 191412 190992 191530
54394 191530 191605 189719 186130 182541 180219 179028 178217 177484 177089 177429 178770 180929 182874 183063 180781 177084
54378 177084 173870 171945 170518 168689 166749 165494 164861 164051 162822 161705 160847 159687 158226 157667 158917
54363 158917 161042 162191 161771 160691 159700 158685 157788 158000 160001 163130 166147 168488 170259 171570 172539
54348 172539 173510 174604 175389 175730 176695 179801 185304 191904 198178 203740 208884 213822 218627 223484 228564
54333 228564 233836 239246 244828 250443 255695 260419 264932 269352 272871 274312 273540 271827 270565 269938 269090
54318 269090 267149 263705 258697 252635 246846 242577 239417 235295 228735 220805 214195 210497 208939 207663
54304 207663 205624 203178 201300 200444 199890 198244 194993 191461 189564 189543 189650 188412 186501 185803 187147 189752
$$ packed form
54409A62473L545M242M267M069L895L457K533J582J207J168O11n24j113m20N38
54394A91530P5j886l589l589k322j191q11p33l95L40J341K159J945J89k282l697
54378A77084l214j925j427j829j940j255o33q10j229j117q58j160j461n59J250
54363A58917K125J149m20j080r91j015q97K12K001L129L017K341J771J311R69
54348A72539R71J094P85L41R65L106N503O600O274N562N144M938M805M857N080
54333B28564N272N410N582N615N252M724M513M420L519J441p72j713j262o27q48
54318B69090j941l444n008o062n789m269l160m122o560p930o610l698j558j276
54304B07663k039k446j878q56n54j646l251l532j897k1J07j238j911o98J344K605
$$ plain form
54288 189752 192641 195627 198763 201646 203848 205701 208047 211181 214478 217275 219840 223148 227745 233198
54274 233198 238662 243595 247719 250734 252600 253840 254939 255460 254255 250692 245230 238773 232042 225777
54260 225777 220838 217464 214690 211010 205650 199013 192144 186086 181394 177723 173860 168646 162040 155069
54246 155069 148751 143319 138445 133797 129218 124757 120867 118298 117309 117037 116119 114000 111236 108357 105074
54231 105074 101220 97991 97254 99500 103207 106403 108149 108329 107090 105243 104418 105718 108537 111456 113773
54216 113773 115277 115265 113399 111298 111384 113544 114504 111593 106135 102084 102007 105378 110141 114663 118235 120800
54200 120800 122680 124237 125626 126865 127862 128212 127475 126052 125316 126383 128968 131907 134472 136712 138802
54185 138802 140639 141932 142340 141623 139939 137760 135351 132788 130640 129914 130790 132084 132565 132161 131235 129525
$$ packed form
54288A89752K889K986L136K883K202J853K346L134L297K797K565L308M597N453
54274B33198N464M933M124L015J866J240J099N21j205l563n462o457o731o265
54260B25777m939l374k774l680n360o637o869o058m692l671l863n214o606o971
54246A55069o318n432m874m648m579m461l890k569r89k72r18k119k764k879l283
54231A05074l854l229p37K246L707L196J746J80j239j847q25J300K819K919K317
54216A13773J504j2j866k101Q6K160R60k911n458m051p7L371M763M522L572K565
54200A20800J880J557J389J239R97L50p37j423p36J067K585K939K565K240K090
54185A38802J837J293M08p17j684k179k409k563k148p26Q76J294M81m04r26j710
$$ plain form
54169 129525 126888 124405 123405 123631 123717 123309 123278 123842 124041 123546 123405 124066 123913 121089 116234 112195 111174
54152 111174 112896 115381 116785 116628 115855 115805 116811 118011 118704 119392 120956 123283 125486 127087 128024 127680
54136 127680 125206 121194 117978 117380 118772 120136 120562 120793 121492 122050 121477 119748 117819 116671 116693 117684
54120 117684 119069 120348 121517 122701 123218 121649 117442 111981 107308 104124 101884 100534 100888 103016 105442
54105 105442 106625 106513 105956 105282 104233 102865 101578 100428 99229 98305 98431 99803 101627 102889 103175 102657
54089 102657 101701 100859 100921 102448 105002 107141 107665 106961 106641 107517 108489 108155 107053 107100 108858 110739 111398
54072 111398 111557 112466 113712 113890 112786 111460 110518 109692 109015 109027 109508 109201 107234 104084 100794 98118 96681
54055 96681 96996 98606 99834 99180 96736 93859 91690 90375 89497 88858 88738 89478 90801 91732 91500 90388
$$ packed form
54169A29525k637k483j000K26Q6m08l1N64J99m95j41O61j53k824m855m039j021
54152A11174J722K485J404j57p73n0J006J200O93O88J564K327K203J601R37l44
54136A27680k474m012l216n98J392J364M26K31O99N58n73j729j929j148K2R91
54120A17684J385J279J169J184N17j569m207n461m673l184k240j350L54K128K426
54105A05442J183j12n57o74j049j368j287j150j199r24J26J372J824J262K86n18
54089A02657r56q42O2J527K554K139N24p04l20Q76R72l34j102M7J758J881O59
54072A11398J59R09J246J78j104j326r42q26o77J2M81l07j967l150l290k676j437
54055I6681L15J610J228o54k444k877k169j315q78o39j20P40J323R31k32j112
$$ plain form
54039 90388 89428 89340 90115 91368 92605 93307 93407 93604 94597 96116 97422 98636 100638 103507 106000 106995 106661
54022 106661 105729 104366 102461 100552 99721 100516 102347 103978 104593 104480 104580 105165 105366 104528 103562 103942 105485
54005 105485 106337 105427 103835 103229 103987 105478 107296 109374 111530 113642 115880 118217 120204 121690 123159
53990 123159 124826 126106 126575 126765 127288 127901 128150 128236 128474 128733 129407 132022 137461 144205 149847 154110 158866
53973 158866 165321 172742 180013 186889 193421 199680 206679 216129 228386 241542 253404 263551 272804
53960 272804 281577 289728 297409 305023 312577 319661 325792 330408 333171 334840 337170 341094 345416 348088
53946 348088 348261 346333 342649 337456 331870 327411 324283 321202 317267 312979 309036 305210 301052 296720
53932 296720 292224 286704 279715 272734 267899 265086 261608 255383 247537 241012 237172 234683 231502 227125
$$ packed form
54039I0388r60q8P75J253J237P02J00J97R93J519J306J214K002K869K493R95l34
54022A06661r32j363j905j909q31P95J831J631O15j13J00N85K01q38r66L80J543
54005A05485Q52r10j592o06P58J491J818K078K156K112K238K337J987J486J469
53990A23159J667J280M69J90N23O13K49Q6K38K59O74K615N439O744N642M263M756
53973A58866O455P421P271O876O532O259O999R450J2257J3156J1862J0147R253
53960B72804Q773Q151P681P614P554P084O131M616K763J669K330L924M322K672
53946C48088J73j928l684n193n586m459l128l081l935m288l943l826m158m332
53932B96720m496n520o989o981m835k813l478o225p846o525l840k489l181m377
$$ plain form
53918 227125 222736 219888 219336 220665 222558 223572 223110 221767 220658 220434 221031 222118 223431 224581 224995
53903 224995 224585 224532 226789 232157 238868 243768 245329 245069 245505 247153 248421 248324 248097 249381 251652 252593
53887 252593 250920 247855 245525 244668 244492 244332 244648 246339 249503 253222 256502 259324 262749 267998 275439
53872 275439 284429 293917 302860 310110 314518 315777 315113 314585 315416 317160 318599 319080 318824 318370 318267 319075
53856 319075 321004 323507 325844 328337 332493 339394 348286 357324 365530 373475 382055 391276 400499 409417
53842 409417 418231 426959 435009 441584 446338 449464 451306 452197 452622 453061 453349 452589 450295 447442 445589
53827 445589 444784 443163 439004 432548 425380 418646 412483 406458 399726 391251 380834 369530 358271 346630
53813 346630 334191 322611 314533 310337 307624 304310 300537 296840 292266 285756 278157 271214 265306 259685
$$ packed form
53918B27125m389k848n52J329J893J014m62j343j109k24N97J087J313J150M14
53903B24995m10n3K257N368O711M900J561k60M36J648J268r7k27J284K271R41
53887B52593j673l065k330q57j76j60L16J691L164L719L280K822L425N249P441
53872B75439Q990R488Q943P250M408J259o64n28Q31J744J439M81k56m54j03Q08
53856C19075J929K503K337K493M156O901Q892R038Q206P945Q580R221R223Q918
53842D09417Q814Q728Q050O575M754L126J842Q91M25M39K88p60k294k853j853
53827D45589q05j621m159o456p168o734o163o025o732q475j0417j1304j1259j1641
53813C46630j2439j1580q078m196k713l314l773l697m574o510p599o943n908n621
$$ plain form
53799 259685 254317 249785 245582 240281 233720 227602 223356 220467 217544 214173 210892 207802 204110 199213
53785 199213 193843 189733 187984 187862 187554 186032 183667 181033 178193 175593 174477 175306 176577 176454 175029
53770 175029 173654 172723 171824 171603 173254 175921 176910 175422 174092 175483 178722 181302 182819 184853 187832
53755 187832 190290 191290 191745 192736 193890 194119 193209 192132 192234 194292 197816 201157 202990 203908 205867 209834
53739 209834 214607 218392 220992 223985 229051 236588 245739 255203 263877 271076 276634 281101 285756 291825
53725 291825 299315 306839 312979 317579 321327 324494 326762 328165 329329 330701 332154 333566 335170 337111
53711 337111 339184 341221 343123 344319 343859 341466 338023 334598 331440 328340 325389 322764 320144 316953
53697 316953 312994 308374 303214 297985 293773 291365 290202 288865 286543 283413 279915 276576 274534 275015
$$ packed form
53799B59685n368m532m203n301o561o118m246k889k923l371l281l090l692m897
53785A99213n370m110j749j22l08j522k365k634k840k600j116Q29J271j23j425
53770A75029j375r31q99k21J651K667R89j488j330J391L239K580J517K034K979
53755A87832K458J000M55R91J154K29r10j077J02K058L524L341J833R18J959L967
53739B09834M773L785K600K993N066P537R151R464Q674P199N558M467M655O069
53725B91825P490P524O140M600L748L167K268J403J164J372J453J412J604J941
53711C37111K073K037J902J196m60k393l443l425l158l100k951k625k620l191
53697C16953l959m620n160n229m212k408j163j337k322l130l498l339k042M81
$$ plain form
53683 275015 277838 281233 283704 285478 287653 290557 293530 295700 296221 294182 289348 283016 277254 273050
53669 273050 269742 266468 263522 261755 261066 260179 258091 255212 252725 251036 249438 247487 246053 246381 248327
53654 248327 250391 251668 252917 255186 258072 260139 260773 260868 261713 263882 267205 271241 275549 279893 284342
53639 284342 288979 293628 298186 302988 308327 313747 318564 323074 328390 334858 341460 347367 353436 361335
53625 361335 371424 382120 391327 398070 402827 406764 410766 414881 418478 420981 422493 423798 425825 428971
53611 428971 432574 435099 435433 434248 433641 435084 438015 440780 442385 442748 441761 439203 435703 432703 430865
53596 430865 429116 426144 422579 420708 421698 423836 424273 422241 419659 418526 418649 418426 417080 415198 413558
53581 413558 412511 412446 413725 415834 417381 417428 416261 414729 413580 413613 415459 418531 420948 421295 419960 418228
$$ packed form
53683B75015K823L395K471J774K175K904K973K170N21k039m834o332n762m204
53669B73050l308l274k946j767o89q87k088k879k487j689j598j951j434L28J946
53654B48327K064J277J249K269K886K067O34R5Q45K169L323M036M308M344M449
53639B84342M637M649M558M802N339N420M817M510N316O468O602N907O069P899
53625C61335J0089J0696R207O743M757L937M002M115L597K503J512J305K027L146
53611D28971L603K525L34j185o07J443K931K765J605L63r87k558l500l000j838
53596D30865j749k972l565j871R90K138M37k032k582j133J23k23j346j882j640
53581D13558j047o5J279K109J547M7j167j532j149L3J846L072K417L47j335j732
$$ plain form
53565 418228 416783 415840 415987 417740 420591 423501 426188 429114 432402 435615 438516 441350 444609 449145 455979
53550 455979 465021 474322 481764 487324 492600 498474 504659 511315 519268 528292 536928 544715 553027 562818
53536 562818 573022 582450 591892 602828 614926 626513 637046 647497 658475 669446 679863 689775
53524 689775 699085 707407 715112 723494 733287 743660 753279 761850 770115 778675 787402 795816 803533 810288
53510 810288 815995 821063 826435 832772 839457 844977 848700 851730 855269 858721 860732 861909 864604 869362
53496 869362 873477 874619 874464 876679 881951 887264 889975 890497 890448 890135 888960 887010 885104 883971 884112 885739
53480 885739 888234 890465 892203 894290 896824 898393 898150 897644 899178 903062 907816 912497 917229 921854 925993
53465 925993 930751 938496 950007 963062 974840 984935 995181 1007337 1021982 1039140 1058728 1080372
$$ packed form
53565D18228j445r43J47J753K851K910K687K926L288L213K901K834L259M536O834
53550D55979R042R301P442N560N276N874O185O656P953R024Q636P787Q312R791
53536E62818J0204R428R442J0936J2098J1587J0533J0451J0978J0971J0417R912
53524F89775R310Q322P705Q382R793J0373R619Q571Q265Q560Q727Q414P717O755
53510H10288N707N068N372O337O685N520L723L030L539L452K011J177K695M758
53496H69362M115J142j55K215N272N313K711N22m9l13j175j950j906j133J41J627
53480H85739K495K231J738K087K534J569k43n06J534L884M754M681M732M625M139
53465I25993M758P745J1511J3055J1778J0095J0246J2156J4645J7158J9588K1644
$$ plain form
53453 1080372 1103558 1128046 1153613 1179549 1205171 1230961 1258537 1289174 1322758 1358388 1395614
53442 1395614 1434746 1476212 1520012 1565751 1612951 1661294 1710739 1761563 1814326 1869678 1927887
53431 1927887 1988366 2049798 2111013 2171651 2231812 2291386 2350323 2409464 2470204 2532857 2595919
53420 2595919 2657658 2718040 2778415 2839561 2901018 2962403 3024336 3087454 3151213 3214297 3275730
53409 3275730 3334823 3390468 3441518 3487979 3531072 3571996 3611216 3648968 3685431 3719936 3750821
53398 3750821 3777011 3799381 3819824 3839134 3856473 3870633 3880910 3886748 3887529 3883210 3874554 3862241
53386 3862241 3846228 3826394 3803320 3777749 3749459 3717345 3680631 3639593 3595080 3547875 3498683
53375 3498683 3448223 3396887 3344345 3289867 3233240 3175283 3117340 3060215 3003748 2947621 2892407
$$ packed form
53453A080372K3186K4488K5567K5936K5622K5790K7576L0637L3584L5630L7226
53442A395614L9132M1466M3800M5739M7200M8343M9445N0824N2763N5352N8209
53431A927887O0479O1432O1215O0638O0161N9574N8937N9141O0740O2653O3062
53420B595919O1739O0382O0375O1146O1457O1385O1933O3118O3759O3084O1433
53409C275730N9093N5645N1050M6461M3093M0924L9220L7752L6463L4505L0885
53398C750821K6190K2370K0443J9310J7339J4160J0277N838P81m319q656j2313
53386C862241j6013j9834k3074k5571k8290l2114l6714m1038m4513m7205m9192
53375C498683n0460n1336n2542n4478n6627n7957n7943n7125n6467n6127n5214
$$ plain form
53364 2892407 2839482 2789813 2743213 2699032 2657155 2617952 2581561 2547808 2516817 2489120 2465055
53353 2465055 2444546 2427748 2415548 2408912 2407779 2410876 2416780 2425132 2436724 2452515 2472750 2497242
53341 2497242 2526231 2560331 2599394 2641931 2686298 2732343 2781436 2834946 2893127 2955465 3021592
53330 3021592 3091666 3166039 3244577 3326239 3409795 3495441 3585317 3681531 3783788 3889819 3998202
53319 3998202 4109670 4225368 4344988 4467420 4592321 4719862 4849284 4978770 5106895
53310 5106895 5233591 5359628 5485551 5611077 5735090 5856152 5973146 6085334 6191813
53301 6191813 6291479 6383826 6469312 6548593 6621810 6688903 6749820 6803851 6849458 6885541 6912201
53290 6912201 6929467 6936145 6931349 6916587 6894459 6865197 6826072 6774638 6711081 6636729 6551837 6456139
$$ packed form
53364B892407n2925m9669m6600m4181m1877l9203l6391l3753l0991k7697k4065
53353B465055k0509j6798j2200o636j133L097N904Q352J1592J5791K0235K4492
53341B497242K8989L4100L9063M2537M4367M6045M9093N3510N8181O2338O6127
53330C021592P0074P4373P8538Q1662Q3556Q5646Q9876R6214J02257J06031J08383
53319C998202J11468J15698J19620J22432J24901J27541J29422J29486J28125
53310E106895J26696J26037J25923J25526J24013J21062J16994J12188J06479
53301F191813R9666R2347Q5486P9281P3217O7093O0917N4031M5607L6083K6660
53290F912201J7266O678m796j4762k2128k9262l9125n1434o3557p4352q4892r5698
$$ plain form
53278 6456139 6350722 6237878 6119262 5995211 5866036 5733264 5599474 5467067 5337048
53269 5337048 5208730 5080761 4952681 4825411 4700236 4577675 4457474 4339249 4222939
53260 4222939 4109034 3998612 3892831 3792242 3696882 3606990 3522998 3444725 3371360 3302565
53250 3302565 3238851 3180458 3126486 3075734 3027817 2983016 2941805 2905121 2874277 2849520 2829227
53239 2829227 2811550 2796612 2785928 2779902 2777180 2776679 2779000 2785174 2794811 2806248 2818121 2830200 2842984
53226 2842984 2857120 2873138 2891331 2911748 2934563 2960534 2990932 3026806 3068189 3113990 3162634
53215 3162634 3212839 3263867 3315342 3367169 3419605 3473030 3527393 3581905 3635376 3686814 3735875
53204 3735875 3782908 3828408 3872187 3913306 3951160 3986256 4019271 4049598 4075732 4097016 4114000
$$ packed form
53278F456139j05417j12844j18616j24051j29175j32772j33790j32407j30019
53269E337048j28318j27969j28080j27270j25175j22561j20201j18225j16310
53260D222939j13905j10422j05781j00589r5360q9892q3992p8273p3365o8795
53250C302565o3714n8393n3972n0752m7917m4801m1211l6684l0844k4757k0293
53239B829227j7677j4938j0684o026k722n01K321O174R637J1437J1873J2079J2784
53226B842984J4136J6018J8193K0417K2815K5971L0398L5874M1383M5801M8644
53215C162634N0205N1028N1475N1827N2436N3425N4363N4512N3471N1438M9061
53204C735875M7033M5500M3779M1119L7854L5096L3015L0327K6134K1284J6984
$$ plain form
53193 4114000 4127009 4135583 4139685 4140114 4136891 4128371 4112985 4091014 4063600 4030867 3992283 3948227
53181 3948227 3899817 3847491 3791079 3730996 3668193 3603121 3535847 3466974 3397245 3326602 3255060
53170 3255060 3184223 3116277 3051295 2987192 2922625 2858339 2795306 2733248 2671792 2611561 2553159
53159 2553159 2496368 2441224 2388539 2338269 2288611 2238156 2188054 2140718 2097065 2056241 2017305
53148 2017305 1979727 1942615 1905001 1866985 1829751 1794467 1761704 1731289 1701811 1670881 1637058
53137 1637058 1601220 1565192 1529737 1495005 1462104 1432393 1405494 1379583 1353499 1326981 1299141
53126 1299141 1268859 1236995 1206146 1177457 1149467 1120915 1092778 1066284 1040595 1014135 987105
53115 987105 960900 935796 910806 885412 860068 835322 811658 789795 769871 750720 731208
$$ packed form
53193D114000J3009Q574M102M29l223q520j5386k1971k7414l2733l8584m4056
53181C948227m8410n2326n6412o0083o2803o5072o7274o8873o9729p0643p1542
53170C255060p0837o7946o4982o4103o4567o4286o3033o2058o1456o0231n8402
53159B553159n6791n5144n2685n0270m9658n0455n0102m7336m3653m0824l8936
53148B017305l7578l7112l7614l8016l7234l5284l2763l0415k9478l0930l3823
53137A637058l5838l6028l5455l4732l2901k9711k6899k5911k6084k6518k7840
53126A299141l0282l1864l0849k8689k7990k8552k8137k6494k5689k6460k7030
53115I87105k6205k5104k4990k5394k5344k4746k3664k1863j9924j9151j9512
$$ plain form
53104 731208 711949 694380 678502 663099 648046 634660 623494 613351 602944 592174 581306
53093 581306 570385 560106 551768 545252 538313 529086 518406 508379 499529 490829 482050 474393 468732
53080 468732 464474 460445 455997 451050 445857 440983 436916 433609 430843 428802 427557 426194 423516 419735
53066 419735 416489 414901 414400 413792 412546 410648 408107 405417 403871 404592 407402 411061 414310 416457 417631
53051 417631 419024 422203 427274 432144 434567 434717 434746 435829 436729 435689 432761 429494 426769 423835 419557
53036 419557 413970 408139 402644 396734 389310 380553 372068 365253 359924 354756 348665 341309 332734 323413
53022 323413 314707 308414 305197 303658 301434 297317 292171 287856 285397 284204 282823 280266 276547 272213
53008 272213 267767 263649 260495 258986 259312 260802 262167 262343 261374 260418 260460 261010 260501 258088 254561 251270
$$ packed form
53104G31208j9259j7569j5878j5403j5053j3386j1166j0143j0407j0770j0868
53093E81306j0921j0279q338o516o939r227j0680j0027q850q700q779p657n661
53080D68732m258m029m448m947n193m874m067l307k766k041j245j363k678l781
53066D19735l246j588n01o08j246j898k541k690j546P21K810L659L249K147J174
53051D17631J393L179N071M870K423J50K9J083R00j040k928l267k725k934m278
53036D19557n587n831n495n910p424q757q485o815n329n168o091p356q575r321
53022C23413q706o293l217j539k224m117n146m315k459j193j381k557l719m334
53008B72213m446m118l154j509L26J490J365J76r69r56M2N50n09k413l527l291
$$ plain form
52992 251270 248780 246981 245822 245138 244219 242581 241047 241069 242759 244404 244320 242627 240792 239867 239585 238975
52976 238975 237462 235374 233435 231792 229860 227412 225423 225055 225924 226249 224975 223001 221942 222357 223567
52961 223567 224524 224293 222344 219213 216549 215640 215952 215756 214107 211673 209639 208448 207718 206886 205748 204707
52945 204707 204475 205298 206536 207418 208024 208865 209630 209298 207818 206709 207114 207893 206838 203710 200878 200533 202215
52928 202215 203953 205132 207041 210580 214663 217534 218981 220358 222626 225185 226858 227501 228321 230828 235674
52913 235674 242275 249332 255719 261077 265701 270093 274739 280102 286463 293666 301216 308625 315532 321640
52899 321640 326961 332102 337764 343668 348366 350555 350453 349558 349039 348692 347507 344965 341464 337512 332930
52884 332930 327365 321503 317029 314794 313480 310935 306738 302574 299868 298010 295481 291998 288673 286379
$$ packed form
52992B51270k490j799j159o84r19j638j534K2J690J645q4j693j835r25k82o10
52976B38975j513k088j939j643j932k448j989l68Q69L25j274j974j059M15J210
52961B23567R57k31j949l131k664r09L12j96j649k434k034j191p30q32j138j041
52945B04707k32Q23J238Q82O06Q41P65l32j480j109M05P79j055l128k832l45J682
52928B02215J738J179J909L539M083K871J447J377K268K559J673O43Q20K507M846
52913B35674O601P057O387N358M624M392M646N363O361P203P550P409O907O108
52899C21640N321N141N662N904M698K189j02q95n19l47j185k542l501l952m582
52884C32930n565n862m474k235j314k545m197m164k706j858k529l483l325k294
$$ plain form
52870 286379 284823 283204 281122 278624 275893 273122 270504 268272 266815 266457 266756 266362 264246 261072 258698
52855 258698 258171 258745 259085 258834 258576 258793 259398 260059 260568 260994 261745 263163 264737 265238 264256 263229 264007 266427
52837 266427 268308 268105 266691 266004 266752 268240 269791 271210 272012 271404 269482 267836 268376 271698 276713 281574
52821 281574 284889 286400 286746 286527 285765 284462 283299 283081 283682 284421 285579 288442 293379 298759 302526 304139
52805 304139 304232 303081 300597 297521 295423 295239 296558 298539 300975 304255 308651 313751 318438 321588 323170
52790 323170 324308 325823 327253 328027 329126 332364 338059 344612 350699 356898 364558 373721 382690 389418
52776 389418 393159 395236 398064 402733 407509 409450 407581 403622 399575 395852 392030 388035 383683 378252
52762 378252 371716 365570 361202 358053 354586 350656 347554 345850 344558 342535 339535 335584 330428 324241
$$ packed form
52870B86379j556j619k082k498k731k771k618k232j457l58K99l94k116l174k374
52855B58698n27N74L40k51k58K17O05O61N09M26P51J418J574N01r82j027P78K420
52837B66427J881k03j414o87P48J488J551J419Q02o08j922j646N40L322N015M861
52821B81574L315J511L46k19p62j303j163k18O01P39J158K863M937N380L767J613
52805C04139R3j151k484l076k098j84J319J981K436L280M396N100M687L150J582
52790C23170J138J515J430P74J099L238N695O553O087O199P660R163Q969O728
52776C89418L741K077K828M669M776J941j869l959m047l723l822l995m352n431
52762C78252o536o146m368l149l467l930l102j704j292k023l000l951n156o187
$$ plain form
52748 324241 318053 312749 308066 303141 297779 292681 288585 285615 283406 281435 279163 276201 272716 269606
52734 269606 267932 267872 268335 267835 265713 262361 258409 254204 250028 246278 243148 240424 237800 235163 232542
52719 232542 230119 228336 227496 227253 226970 226557 226263 225602 223535 220100 216805 214693 212901 210016 206115 202422
52703 202422 199572 197351 195793 195179 195062 194508 193446 192716 192550 191953 189997 186992 183987 181704 180281 179422
52687 179422 178414 176427 173253 169546 166173 163570 161769 160592 159664 158593 157348 156295 155746 155645 155625
52672 155625 155150 153714 151271 148423 145924 144103 142966 142548 142709 142888 142679 142452 142733 143161 142792 141496
52656 141496 140340 140442 141910 143939 145439 145608 144570 143500 143570 144675 145748 146276 146862 148199 150201 152316
52640 152316 154077 155199 155738 156434 158414 162365 168260 175609 183289 189449 192791 194157 195760 198388 200384
$$ packed form
52748C24241o188n304m683m925n362n098m096k970k209j971k272k962l485l110
52734B69606j674o0M63n00k122l352l952m205m176l750l130k724k624k637k621
52719B32542k423j783q40k43k83m13k94o61k067l435l295k112j792k885l901l693
52703B02422k850k221j558o14j17n54j062p30j66n97j956l005l005k283j423q59
52687A79422j008j987l174l707l373k603j801j177r28j071j245j053n49j01k0
52672A55625m75j436k443k848k499j821j137m18J61J79k09k27K81M28l69j296
52656A41496j156J02J468K029J500J69j038j070P0J105J073N28N86J337K002K115
52640A52316J761J122N39O96J980L951N895P349P680O160L342J366J603K628J996
$$ plain form
52625 200384 199956 197539 195113 193941 193900 194430 195024 194920 193303 190125 186334 183078 180755 178720 175857 171661
52609 171661 166852 162665 159523 156860 154313 152465 152009 152588 152802 151178 147161 141640 136569 133366 131541
52594 131541 129596 127338 126245 126986 127805 126511 123496 121490 122438 125560 128577 129961 129738 128725 127588
52579 127588 126546 125548 124445 123032 121326 120059 120341 122198 123934 123994 123169 123573 125410 126446 125287 123453
52563 123453 123070 123958 124529 124445 124491 124564 123780 122426 121970 122923 124249 125169 126032 126984 127261 126584 126092 126972 128870
52544 128870 130402 130698 129869 128568 127628 127709 128774 130230 131812 133763 135910 137302 137288 136386 135542 135048 134703
52527 134703 134440 134185 133647 133064 133706 136608 140876 144167 145049 144265 143519 143741 144903 146983 150410 155531
52511 155531 161990 168744 174683 179316 182916 185994 188754 191155 193276 195216 196631 196908 196079 195194 195365
$$ packed form
52625B00384m28k417k426j172m1N30N94j04j617l178l791l256k323k035k863m196
52609A71661m809m187l142k663k547j848m56N79K14j624m017n521n071l203j825
52594A31541j945k258j093P41Q19j294l015k006R48L122L017J384k23j013j137
52579A27588j042r98j103j413j706j267K82J857J736O0q25M04J837J036j159j834
52563A23453l83Q88N71q4M6P3p84j354m56R53J326R20Q63R52K77o77m92Q80J898
52544A28870J532K96q29j301r40Q1J065J456J582J951K147J392j4r02q44m94l45
52527A34703k63k55n38n83O42K902M268L291Q82p84p46K22J162K080L427N121
52511A55531O459O754N939M633L600L078K760K401K121J940J415K77q29q85J71
$$ plain form
52496 195365 196689 198583 200917 204045 207666 210601 212258 213662 216188 219624 222396 223633 224020 224418 224548
52481 224548 223579 221407 218793 216602 215381 215327 216191 217426 218756 220301 221891 222875 223175 224004 226663 230836
52465 230836 234819 237435 238965 240181 241203 241552 240845 239162 237000 234967 233273 231640 229984 228911 228898
52450 228898 229244 228703 227271 226441 227345 229324 230798 230932 230006 228712 227737 227591 228134 228490 228057 227452 227731
52433 227731 228677 228616 226251 222177 218192 215494 214091 213790 215021 218273 223030 227742 230981 232435 232825
52418 232825 233087 233730 234772 236052 237610 239684 242186 244303 245080 244550 243884 244142 245238 246405 247254 247923
52402 247923 248588 249571 251649 255425 260187 264127 266070 266610 267232 268612 270106 270707 270170 269158 268447 268185
52386 268185 268073 268127 268774 270063 271296 271921 272388 273510 275334 277364 279666 282762 286367 289147 290127 289692
$$ packed form
52496A95365J324J894K334L128L621K935J657J404K526L436K772J237L87L98J30
52481B24548r69k172k614k191j221n4Q64J235J330J545J590R84L00Q29K659M173
52465B30836L983K616J530J216J022L49p07j683k162k033j694j633j656j073j3
52450B28898L46n41j432q30R04J979J474J34r26j294r75j46N43L56m33o05K79
52433B27731R46o1k365m074l985k698j403l01J231L252M757M712L239J454L90
52418B32825K62O43J042J280J558K074K502K117P77n30o66K58J096J167Q49O69
52402B47923O65R83K078L776M762L940J943N40O22J380J494O01n37j012p11k62
52386B68185j12N4O47J289J233O25M67J122J824K030K302L096L605K780R80m35
$$ plain form
52370 289692 288950 288715 289306 290526 291367 290491 287679 284394 282355 281932 282373 282963 283152 281998 278591 273232
52354 273232 267511 262948 259865 257658 255771 254215 253351 253328 253664 253512 252479 251108 250371 250717 251659 252178
52338 252178 251564 250139 249206 249839 251587 252907 253114 253248 254553 256760 258636 259713 260487 261173 261442 261502 262348
52321 262348 264459 267009 268915 270224 271985 275030 279164 283321 286383 288182 289794 292429 296015 299403
52307 299403 302003 304343 306902 309427 312007 315685 320943 326305 329779 331399 333112 336279 340520 345022
52293 345022 349598 354043 357736 360700 364104 368806 374089 378671 382457 386339 390628 394681 398130 401721
52279 401721 406678 413470 421147 427728 431590 432944 433688 435593 439026 443615 449169 455149 460233 463661
52265 463661 466558 470531 475363 479618 483277 487851 493587 498600 501677 504289 508540 514467 520718 526799
$$ packed form
52370B89692p42k35N91J220Q41q76k812l285k039m23M41N90J89j154l407n359
52354B73232n721m563l083k207j887j556q64k3L36j52j033j371p37L46R42N19
52338B52178o14j425r33O33J748J320K07J34J305K207J876J077P74O86K69O0Q46
52321B62348K111K550J906J309J761L045M134M157L062J799J612K635L586L388
52307B99403K600K340K559K525K580L678N258N362L474J620J713L167M241M502
52293C45022M576M445L693K964L404M702N283M582L786L882M289M053L449L591
52279D01721M957O792P677O581L862J354P44J905L433M589N554N980N084L428
52265D63661K897L973M832M255L659M574N736N013L077K612M251N927O251O081
$$ plain form
52251 526799 533041 539138 544481 549641 556015 563999 572739 581670 591131 601453 612563 624586 637759
52238 637759 651609 665334 679239 694763 712603 731725 750713 769412 788738 809443 831551
52227 831551 854600 878022 901523 925218 949222 973303 997419 1022235 1048205 1074297 1098768
52216 1098768 1121392 1143749 1166923 1190157 1212476 1234447 1257149 1280121 1301623 1320631 1337514
52205 1337514 1352937 1367123 1380277 1392722 1404282 1414265 1422487 1429806 1437131 1444163 1449628 1452725 1453947
52192 1453947 1454328 1454300 1453799 1453350 1454212 1456984 1460554 1463085 1463819 1463362 1462608 1462178 1462671 1464365 1466620 1468643 1471082
52175 1471082 1475714 1483119 1491759 1500075 1508478 1518333 1529817 1541946 1554237 1567111 1580804 1594986
52163 1594986 1609531 1624870 1641306 1658539 1675916 1692728 1708272 1722056 1733967 1743982 1751901
$$ packed form
52251E26799O242O097N343N160O374P984Q740Q931R461J0322J1110J2023J3173
52238F37759J3850J3725J3905J5524J7840J9122J8988J8699J9326K0705K2108
52227H31551K3049K3422K3501K3695K4004K4081K4116K4816K5970K6092K4471
52216A098768K2624K2357K3174K3234K2319K1971K2702K2972K1502J9008J6883
52205A337514J5423J4186J3154J2445J1560R983Q222P319P325P032N465L097J222
52192A453947L81k8n01m49Q62K772L570K531P34m57p54m30M93J694K255K023K439
52175A471082M632P405Q640Q316Q403R855J1484J2129J2291J2874J3693J4182
52163A594986J4545J5339J6436J7233J7377J6812J5544J3784J1911J0015P919
$$ plain form
52152 1751901 1757783 1762360 1766512 1770444 1773788 1776276 1777770 1777926 1776496 1773800 1770219 1765365 1758486 1749686
52138 1749686 1739934 1729640 1717989 1704141 1688747 1673818 1661150 1650886 1641468 1631099 1619439 1607708
52126 1607708 1596986 1586957 1576960 1567733 1560941 1556871 1553711 1549586 1544498 1539641 1535551 1531800 1528136
52113 1528136 1524932 1522309 1519515 1515565 1510306 1504568 1499386 1495280 1492245 1490111 1488637 1487303 1485414 1482607
52099 1482607 1479139 1475477 1471720 1467539 1462566 1456677 1450128 1443600 1437888 1433228 1428955 1424131 1418401 1412190
52085 1412190 1406227 1401035 1396611 1392281 1387141 1380918 1374166 1367361 1360274 1352664 1345201 1338914 1333849 1328898
52071 1328898 1322998 1316020 1308603 1301693 1296161 1292158 1288689 1284386 1278766 1272292 1265213 1257119 1247898 1238486
52057 1238486 1230258 1223942 1219397 1216059 1213423 1211355 1210145 1210000 1210497 1210873 1210912 1211146 1212129 1213942 1216394 1219250
$$ packed form
52152A751901N882M577M152L932L344K488J494J56j430k696l581m854o879q800
52138A749686r752j0294j1651j3848j5394j4929j2668j0264r418j0369j1660j1731
52126A607708j0722j0029r997r227o792m070l160m125n088m857m090l751l664
52113A528136l204k623k794l950n259n738n182m106l035k134j474j334j889k807
52099A482607l468l662l757m181m973n889o549o528n712m660m273m824n730o211
52085A412190n963n192m424m330n140o223o752o805p087p610p463o287n065m951
52071A328898n900o978p417o910n532m003l469m303n620o474p079q094r221r412
52057A238486q228o316m545l338k636k068j210j45M97L76L9K34R83J813K452K856
$$ plain form
52041 1219250 1222259 1225546 1230013 1236750 1245959 1257022 1269663 1284236 1300673 1318051 1335666 1353800
52029 1353800 1372985 1393178 1414232 1436347 1459451 1482824 1506139 1530312 1556466 1584516 1613527
52018 1613527 1642901 1672203 1700254 1725735 1748736 1770655 1792417 1813627 1833579 1852117 1869250
52007 1869250 1884866 1899200 1912755 1925139 1934659 1939768 1940579 1938591 1935349 1931820 1928603 1925888 1923207
51994 1923207 1919694 1914699 1908111 1900319 1892100 1884188 1876573 1868407 1859016 1848892 1839345 1831321 1824892 1819696
51980 1819696 1815311 1811172 1806675 1801691 1796840 1793113 1791368 1792095 1795190 1799676 1803969 1806960 1808923 1811211
51966 1811211 1814884 1819741 1824716 1829148 1833500 1838791 1845451 1852903 1860235 1867034 1873362 1879092 1883568 1885978
51952 1885978 1885925 1883671 1879984 1875661 1870945 1865303 1857914 1848356 1836691 1823086 1807767 1791276 1774137
$$ packed form
52041A219250L009L287M467O737R209J1063J2641J4573J6437J7378J7615J8134
52029A353800J9185K0193K1054K2115K3104K3373K3315K4173K6154K8050K9011
52018A613527K9374K9302K8051K5481K3001K1919K1762K1210J9952J8538J7133
52007A869250J5616J4334J3555J2384R520N109Q11j988l242l529l217k715k681
51994A923207l513m995o588p792q219p912p615q166r391j0124r547q024o429n196
51980A819696m385m139m497m984m851l727j745P27L095M486M293K991J963K288
51966A811211L673M857M975M432M352N291O660P452P332O799O328N730M476K410
51952A885978n3k254l687m323m716n642p389r558j1665j3605j5319j6491j7139
$$ plain form
51939 1774137 1756027 1735823 1712819 1687375 1659902 1629943 1597294 1563641 1531647 1501912 1471946
51928 1471946 1438976 1403207 1367370 1333522 1301336 1269445 1237255 1204836 1171854 1137644 1102287
51917 1102287 1066994 1033098 1000939 969901 939488 910191 883232 859448 838379 818540 798619
51906 798619 778307 757969 737821 717895 698756 681610 667217 655080 644183 634277 625671 617900
51894 617900 609601 600145 590601 582396 575661 569598 563817 558297 552438 545462 537854 531293 526849 524122
51880 524122 522293 521007 519933 518541 516842 515282 513243 508883 501569 493524 487749 484838 483095 481193
51866 481193 479151 476838 473290 468026 461848 455793 450210 445289 441532 439042 437019 434588 431602 428190
51852 428190 424140 419334 414309 409783 405962 402852 400883 400532 401328 401757 400383 397038 392997 389928 388420
$$ packed form
51939A774137j8110k0204k3004k5444k7473k9959l2649l3653l1994k9735k9966
51928A471946l2970l5769l5837l3848l2186l1891l2190l2419l2982l4210l5357
51917A102287l5293l3896l2159l1038l0413k9297k6959k3784k1069j9839j9921
51906G98619k0312k0338k0148j9926j9139j7146j4393j2137j0897r906q606p771
51894F17900q299r456r544q205o735o063n781n520n859o976p608o561m444k727
51880E24122j829j286j074j392j699j560k039m360p314q045n775k911j743j902
51866D81193k042k313l548n264o178o055n583m921l757k490k023k431k986l412
51852D28190m050m806n025m526l821l110j969l51P96M29j374l345m041l069j508
$$ plain form
51837 388420 387489 385782 383234 381144 380626 381512 382842 383758 383656 382151 379482 376555 374138 372299 370925
51822 370925 370266 370470 371091 371688 372517 373885 375148 375213 374032 372768 372328 372484 372689 373063 373970 375034 375345
51805 375345 374718 374212 375030 377087 379065 380027 380604 382124 384767 387274 388764 390181 393263 398320 403840
51790 403840 408466 412630 417699 423830 429354 432414 432807 431946 431311 431362 431798 432241 432468 432446 432459 432875 433443 433288
51772 433288 432098 430826 430484 430640 430111 428958 428481 429074 429479 428900 428613 430362 434042 438236 442417 447046
51756 447046 451730 454973 456160 456441 456997 457564 457537 457522 458510 459907 459833 457650 455143 454588 456179 458062 458614
51739 458614 457963 457274 457226 457601 457914 457932 457704 457589 458216 459927 462184 463949 464808 465327 466176 467328 468430 469451
51721 469451 470565 471758 473085 475008 477849 481039 483596 485359 487080 489084 490494 490200 488251 485894
$$ packed form
51837C88420r31j707k548k090n18Q86J330R16j02j505k669k927k417j839j374
51822C70925o59K04O21N97Q29J368J263O5j181j264m40J56K05L74R07J064L11
51805C75345o27n06Q18K057J978R62N77J520K643K507J490J417L082N057N520
51790D03840M626M164N069O131N524L060L93q61o35N1M36M43K27k2J3M16N68j55
51772D33288j190j272l42J56n29j153m77N93M05n79k87J749L680M194M181M629
51756D47046M684L243J187K81N56N67k7j5R88J397p4k183k507n55J591J883N52
51739D58614o51o89m8L75L13J8k28j15O27J711K257J765Q59N19Q49J152J102J021
51721D69451J114J193J327J923K841L190K557J763J721K004J410k94j949k357
$$ plain form
51707 485894 484409 484202 484796 485364 485462 485615 487113 490778 495809 500209 502680 503966 506024 509881 514561 518224
51691 518224 520144 521277 522954 525416 527911 530044 532462 535870 539627 541916 541615 539560 537544 536322
51677 536322 535198 533486 531506 529798 528054 525648 522857 520769 519957 519856 519571 518820 517959 517447 517418 517462 516769
51660 516769 514792 511804 508564 505555 502825 500290 497652 494210 489531 484284 479672 475987 472508 468818
51646 468818 465153 461199 455835 448890 442180 437584 434730 431677 427644 423817 421395 419905 417985 415239
51632 415239 412805 412179 413728 416370 418711 420396 422107 424294 426465 428026 429302 431291 434749 439958
51618 439958 447004 455674 465166 474362 482390 488862 493936 498351 502931 507736 512227 516451 521273 526877
51604 526877 531908 534962 536176 536418 535630 533274 529875 526615 523463 519060 512562 504368 494954 484409
$$ packed form
51707D85894j485k07N94N68R8J53J498L665N031M400K471J286K058L857M680L663
51691E18224J920J133J677K462K495K133K418L408L757K289l01k055k016j222
51677E36322j124j712j980j708j744k406k791k088q12j01k85p51q61n12k9M4o93
51660E16769j977k988l240l009k730k535k638l442m679n247m612l685l479l690
51646D68818l665l954n364o945o710m596k854l053m033l827k422j490j920k746
51632D15239k434o26J549K642K341J685J711K187K171J561J276J989L458N209
51618D39958P046Q670R492R196Q028O472N074M415M580M805M491M224M822N604
51604E26877N031L054J214K42p88k356l399l260l152m403o498q194r414j0545
$$ plain form
51590 484409 473439 463482 455215 448032 441585 436586 433234 429962 424976 418494 412318 407594 404006 400868
51576 400868 397825 394400 389924 384445 379108 375021 372036 369217 366500 365194 366280 368555 369404 367617
51562 367617 364572 362054 359886 356906 353685 352500 354405 357788 360431 361709 361954 360899 358176 354865
51548 354865 353124 354155 357259 360860 363820 365729 366743 367494 368865 371499 375416 379946 384064 387248
51534 387248 390226 394545 401021 408877 416641 423512 429554 435113 440752 447504 456377 467344 479239 490832
51520 490832 501783 512516 523422 534345 544803 554658 564316 573964 582693 588901 591841 592351 591765
51507 591765 590495 588105 584453 580158 575994 572300 569136 566706 565456 565802 567755 570893 574805 579523
51493 579523 585376 592501 600758 609944 619628 629041 637836 646901 657413 668836 678770 685316 688794 690679
$$ packed form
51590D84409j0970r957q267p183o447m999l352l272m986o482o176m724l588l138
51576D00868l043l425m476n479n337m087k985k819k717j306J086K275Q49j787
51562C67617l045k518k168k980l221j185J905L383K643J278K45j055k723l311
51548C54865j741J031L104L601K960J909J014P51J371K634L917M530M118L184
51534C87248K978M319O476P856P764O871O042N559N639O752Q873J0967J1895J1593
51520D90832J0951J0733J0906J0923J0458R855R658R648Q729O208K940N10n86
51507E91765j270k390l652m295m164l694l164k430j250L46J953L138L912M718
51493E79523N853P125Q257R186R684R413Q795R065J0512J1423R934O546L478J885
$$ plain form
51479 690679 691871 692809 694299 696801 699346 700485 700184 699674 699519 699083 698050 697192 697213 697845 698673 699969 701989
51462 701989 704085 705266 705307 704618 703217 700407 695444 688175 679119 669233 659587 650986 643748 637733 632416
51447 632416 627012 620884 614034 606982 600118 593406 586760 580358 574340 568516 562679 557049 552177 548457
51433 548457 545923 544447 543924 544217 544950 545419 544823 542842 539989 537243 535271 534169 533871 534478 535981 537903
51417 537903 539533 540584 541660 544021 548753 555950 564676 573828 582870 591617 599660 606607 612861 619543
51403 619543 627325 635801 644372 653295 663195 673665 683083 690169 695397 700496 706632 713308 719007 722576
51389 722576 723854 723300 721592 719698 718832 719713 721800 723602 723869 722380 719735 716785 714198 712033 709343
51374 709343 704526 696530 685674 673077 659558 645376 630775 616159 601771 587830 575124 564721
$$ packed form
51479F90679J192R38J490K502K545J139l01n10j55m36j033q58K1O32Q28J296K020
51462G01989K096J181M1o89j401k810m963p269r056r886r646q601p238o015n317
51447F32416n404o128o850p052o864o712o646o402o018n824n837n630m872l720
51433E48457k534j476n23K93P33M69n96j981k853k746j972j102k98O07J503J922
51417E37903J630J051J076K361M732P197Q726R152R042Q747Q043O947O254O682
51403F19543P782Q476Q571Q923R900J0470R418P086N228N099O136O676N699L569
51389G22576J278n54j708j894q66Q81K087J802K67j489k645k950k587k165k690
51374G09343m817p996j0856j2597j3519j4182j4601j4616j4388j3941j2706j0403
$$ plain form
51362 564721 556632 549345 541381 533077 526089 521330 518209 515865 514135 512863 511262 508918 506972 507243
51348 507243 510175 514502 519023 523953 530157 537639 545297 551895 556871 560348 562732 564358 565382 565748
51334 565748 565004 562059 555599 545312 532577 519381 506588 493783 480690 467955 456203 445036
51322 445036 433459 420875 407388 393534 380169 368205 357978 349099 341214 334522 329140 324364
51310 324364 319166 313360 307839 303678 301116 299201 296383 291827 286372 281782 278903 277076 275523 274363
51296 274363 273762 273044 271645 270288 269991 270278 269612 267616 265749 265541 267012 268968 270140 269902 268720 268101
51280 268101 269411 272526 276158 279423 282289 284631 286009 286697 287858 290230 293543 297559 302586 308288
51266 308288 313219 316702 320366 326512 335356 345045 354107 362660 371286 380058 388893 397756 405868 411590
$$ packed form
51362E64721q089p287p964q304o988m759l121k344j730j272j601k344j946K71
51348E07243K932M327M521M930O204P482P658O598M976L477K384J626J024L66
51334E65748p44k945o460j0287j2735j3196j2793j2805j3093j2735j1752j1167
51322D45036j1577j2584j3487j3854j3365j1964j0227q879p885o692n382m776
51310C24364n198n806n521m161k562j915k818m556n455m590k879j827j553j160
51296B74363o01p18j399j357k97K87o66j996j867k08J471J956J172k38j182o19
51280B68101J310L115L632L265K866K342J378O88J161K372L313M016N027N702
51266C08288M931L483L664O146Q844R689R062Q553Q626Q772Q835Q863Q112N722
$$ plain form
51252 411590 413753 412797 410223 407366 404911 402897 400532 396446 389839 381315 372094 362628 352487 341489
51238 341489 330247 319636 310303 302755 297139 292610 287684 281843 276248 272178 269217 265849 261630 257687
51224 257687 254979 253059 251015 248848 247354 247116 248082 249660 250838 250682 249161 247068 244863 242374 240126
51209 240126 239858 242521 246387 248555 248211 247107 246942 247643 248555 249825 251715 253548 254394 254394 254544 255288 255969
51192 255969 255564 253614 250476 247059 244277 242477 241260 239761 237224 233646 230132 228163 227984 228126 227196
51177 227196 225783 225497 226321 226310 224308 221699 220739 222100 224743 227389 229187 229596 228717 227495 226792 226464
51161 226464 225959 225582 226402 228993 232722 236158 237868 237231 235001 232720 231131 229625 227740 226465 227084
51146 227084 229240 231287 232432 233371 234690 235752 235669 234628 233781 234315 236861 241195 245944 249016 249087 246889
$$ packed form
51252D11590K163r56k574k857k455k014k365m086o607q524r221r466j0141j0998
51238C41489j1242j0611r333p548n616m529m926n841n595m070k961l368m219l943
51224B57687k708j920k044k167j494k38R66J578J178j56j521k093k205k489k248
51209B40126k68K663L866K168l44j104j65P01R12J270J890J833Q46%J50P44O81
51192B55969m05j950l138l417k782j800j217j499k537l578l514j969j79J42r30
51177B27196j413k86Q24j1k002k609r60J361K643K646J798M09q79j222p03l28
51161B26464n05l77Q20K591L729L436J710o37k230k281j589j506j885j275O19
51146B27084K156K047J145R39J319J062q3j041q47N34K546M334M749L072P1k198
$$ plain form
51130 246889 244806 244967 247609 251205 254101 255859 256991 257827 258276 258607 259527 261075 262106 261417 258958 255642
51114 255642 252651 251311 252542 255535 257872 258129 257583 258043 258764 257448 253962 250903 250061 250326 249792 248146
51098 248146 245795 242281 237229 231964 228560 227628 228121 228832 228995 227912 225388 222412 220316 219250 218410
51083 218410 217609 217541 218428 219551 220405 221345 222707 224159 225420 226905 229117 231937 235036 238545 242845 247999
51067 247999 253733 259424 263680 264584 261332 255551 250196 246937 245025 242551 238200 231839 224471 218123
51053 218123 214919 215181 216608 216280 213590 210519 208934 208576 208283 208277 210018 213899 218255 221106 222177 222629
51037 222629 223351 224288 225234 226457 228158 229849 230804 231091 231742 233697 236816 240088 242706 244667 246373 248016
51021 248016 249489 250564 250915 250229 248587 246555 244641 243017 242127 243107 246721 251958 256626 259619 261799
$$ packed form
51130B46889k083J61K642L596K896J758J132Q36M49L31R20J548J031o89k459l316
51114B55642k991j340J231K993K337K57n46M60P21j316l486l059q42K65n34j646
51098B48146k351l514n052n265l404r32M93P11J63j083k524k976k096j066q40
51083B18410q01o8Q87J123Q54R40J362J452J261J485K212K820L099L509M300N154
51067B47999N734N691M256R04l252n781n355l259j912k474m351o361p368o348
51053B18123l204K62J427l28k690l071j585l58k93oJ741L881M356K851J071M52
51037B22629P22R37R46J223J701J691R55K87O51J955L119L272K618J961J706J643
51021B48016J473J075L51o86j642k032j914j624q90R80L614N237M668K993K180
$$ plain form
51006 261799 264251 266484 267191 266345 265596 266593 269559 273570 277654 281268 284058 285574 285433 283773 281411
50991 281411 279311 277898 277169 277353 278888 281607 284611 287374 290337 293837 297115 299183 300222 301130 301953
50976 301953 301867 300707 299408 298735 298504 298308 298055 297428 295852 293619 292111 292168 292949 293280 293353 294061 295334 296416
50958 296416 297508 299730 303377 307406 310911 313984 316748 318748 320030 321905 325581 330577 335458 339766
50944 339766 344173 348777 352472 354513 355980 358949 364447 371733 379442 386978 394765 403530 413480 423961
50930 423961 433855 442562 450739 459742 470209 481676 493986 508451 526571 547752 569457 589986
50918 589986 610042 630967 652726 674871 698721 726801 760108 797335 836990 878935 923413
50907 923413 970009 1018543 1070045 1125760 1185770 1249518 1317100 1388975 1464592 1542230 1620211
$$ packed form
51006B61799K452K233P07q46p49R97K966M011M084L614K790J516j41j660k362
50991B81411k100j413p29J84J535K719L004K763K963L500L278K068J039R08Q23
50976C01953q6j160j299o73k31j96k53o27j576k233j508N7P81L31P3P08J273J082
50958B96416J092K222L647M029L505L073K764K000J282J875L676M996M881M308
50944C39766M407M604L695K041J467K969N498P286P709P536P787Q765R950J0481
50930D23961R894Q707Q177R003J0467J1467J2310J4465J8120K1181K1705K0529
50918E89986K0056K0925K1759K2145K3850K8080L3307L7227L9655M1945M4478
50907I23413M6596M8534N1502N5715O0010O3748O7582P1875P5617P7638P7981
$$ plain form
50896 1620211 1697681 1774401 1850426 1925778 1999658 2069915 2133979 2190435 2239447 2281886 2318506
50885 2318506 2349570 2374506 2392036 2401449 2403710 2400843 2394506 2385872 2376439 2367659 2359644 2351256 2341753
50872 2341753 2331399 2320301 2307771 2293163 2276173 2255640 2229268 2195603 2155584 2111127 2062788
50861 2062788 2009936 1952769 1892876 1831682 1769409 1705853 1641451 1577241 1514386 1454070 1397314
50850 1397314 1344255 1293904 1245286 1199070 1157564 1122576 1093409 1067564 1043458 1021608 1002690
50839 1002690 985561 968636 952754 940766 933729 929027 923339 916375 910581 907912 908308 910852 914928
50826 914928 919960 925080 929573 933215 936044 938237 940260 942780 946422 951940 960316 972076 986499 1002021
50812 1002021 1017496 1032884 1048836 1065930 1084163 1102972 1122114 1142785 1167289 1197085 1231559
$$ packed form
50896A620211P7470P6720P6025P5352P3880P0257O4064N6456M9012M2439L6620
50885B318506L1064K4936J7530R413K261k867o337q634r433q780q015q388r503
50872B341753j0354j1098j2530j4608j6990k0533k6372l3665m0019m4457m8339
50861B062788n2852n7167n9893o1194o2273o3556o4402o4210o2855o0316n6756
50850A397314n3059n0351m8618m6216m1506l4988k9167k5845k4106k1850j8918
50839A002690j7129j6925j5882j1988p037m702n688o964n794k669L96K544M076
50826I14928N032N120M493L642K829K193K023K520L642N518Q376J1760J4423J5522
50812A002021J5475J5388J5952J7094J8233J8809J9142K0671K4504K9796L4474
$$ plain form
50801 1231559 1269127 1308935 1350926 1395166 1442238 1493761 1551327 1615204 1685150 1762029 1847293
50790 1847293 1941183 2042957 2152756 2271567 2399199 2534081 2675556 2824705 2982265 3147257
50780 3147257 3318327 3494510 3673278 3849492 4018150 4177363 4326993 4465239 4588493
50771 4588493 4694190 4781905 4851637 4902856 4935781 4952201 4954449 4944574 4925146 4899957 4873093
50760 4873093 4847508 4824636 4804828 4787822 4773195 4760534 4748739 4735115 4715831 4687609 4648627
50749 4648627 4597846 4534347 4457773 4368725 4268034 4156035 4033167 3901018 3762285 3619899
50739 3619899 3476708 3335868 3200722 3073818 2956150 2847597 2748073 2658301 2579627 2513237
50729 2513237 2459504 2417944 2387760 2368445 2359999 2362643 2376179 2399422 2430096 2465366 2502677 2540361
$$ packed form
50801A231559L7568L9808M1991M4240M7072N1523N7566O3877O9946P6879Q5264
50790A847293R3890J01774J09799J18811J27632J34882J41475J49149J57560J64992
50780C147257J71070J76183J78768J76214J68658J59213J49630J38246J23254
50771D588493J05697Q7715O9732N1219L2925J6420K248r875j9428k5189k6864
50760D873093k5585k2872j9808j7006j4627j2661j1795j3624j9284k8222l8982
50749D648627n0781o3499p6574q9048j00691j11999j22868j32149j38733j42386
50739C619899j43191j40840j35146j26904j17668j08553r9524q9772p8674o6390
50729B513237n3733m1560l0184j9315q446K644J3536K3243L0674L5270L7311L7684
$$ plain form
50717 2540361 2577674 2614244 2649237 2680755 2706143 2723244 2731627 2732584 2727800 2717981 2702739 2681723
50705 2681723 2655548 2625373 2591614 2553552 2510540 2463423 2414358 2365248 2316752 2268900 2222179
50694 2222179 2177626 2136044 2097503 2061736 2028938 2000077 1976379 1958388 1945663 1937512 1933875 1935182
50682 1935182 1941511 1952306 1967023 1985755 2009245 2038589 2074722 2117700 2166628 2221046 2282249
50671 2282249 2352286 2431415 2517741 2609819 2708310 2813999 2925184 3038455 3151441 3263217
50661 3263217 3372221 3475565 3570854 3657321 3734484 3800774 3854220 3893643 3918343 3927377 3920306
50650 3920306 3898553 3865306 3824136 3778188 3730267 3682735 3637065 3594016 3554525 3519937 3491046
50639 3491046 3467200 3446828 3428796 3412769 3397962 3381814 3360473 3330812 3291815 3244019 3188191
$$ packed form
50717B540361L7313L6570L4993L1518K5388J7101Q383R57m784r819j5242k1016
50705B681723k6175l0175l3759l8062m3012m7117m9065m9110m8496m7852m6721
50694B222179m4553m1582l8541l5767l2798k8861k3698j7991j2725q151l637J307
50682A935182O329J0795J4717J8732K3490K9344L6133M2978M8928N4418O1203
50671B282249P0037P9129Q6326R2078R8491J05689J11185J13271J12986J11776
50661C263217J09004J03344R5289Q6467P7163O6290N3446L9423K4700R034p071
50650C920306k1753l3247m1170m5948m7921m7532m5670m3049l9491l4588k8891
50639C491046k3846k0372j8032j6027j4807j6148k1341k9661l8997m7796n5828
$$ plain form
50628 3188191 3125025 3055764 2982463 2907571 2833718 2763800 2700509 2645293 2598007 2557797 2524274
50617 2524274 2497974 2480183 2472412 2475680 2490011 2514928 2550476 2597470 2656584 2727654 2810034 2903277
50605 2903277 3007101 3120831 3242906 3370659 3500494 3628719 3752448 3869566 3978090
50596 3978090 4076256 4163306 4239279 4303716 4355472 4394335 4421836 4439515 4447167 4444103 4431613 4412645
50584 4412645 4389023 4360495 4326953 4290142 4252285 4214096 4175432 4137424 4102699 4073448 4050167
50573 4050167 4032596 4021128 4016626 4019026 4026582 4036814 4048113 4060134 4072515 4083590 4091034 4093795
50561 4093795 4092816 4089572 4084436 4076833 4066528 4054230 4041306 4029459 4020457 4015530 4015047 4019121 4028205
50548 4028205 4042432 4060513 4080060 4099057 4116402 4130995 4141208 4145485 4142800 4132316 4113404 4086350
$$ packed form
50628C188191o3166o9261p3301p4892p3853o9918o3291n5216m7286m0210l3523
50617B524274k6300j7791p771L268J4331K4917L5548M6994N9114P1070Q2380R3243
50605B903277J03824J13730J22075J27753J29835J28225J23729J17118J08524
50596C978090R8166Q7050P5973O4437N1756L8863K7501J7679P652l064j2490j8968
50584D412645k3622k8528l3542l6811l7857l8189l8664l8008l4725k9251k3281
50573D050167j7571j1468m502K400P556J0232J1299J2021J2381J1075P444K761
50561D093795r79l244n136p603j0305j2298j2924j1847r002m927m83M074R084
50548D028205J4227J8081J9547J8997J7345J4593J0213M277k685j0484j8912k7054
$$ plain form
50536 4086350 4051992 4009829 3957281 3891857 3813694 3725162 3628457 3524817 3415824 3303955 3191340
50525 3191340 3078956 2967678 2859395 2756483 2660479 2571481 2488411 2409730 2334697 2264473
50515 2264473 2201511 2147436 2101874 2063438 2030973 2003432 1979660 1959533 1944804 1937515 1937633 1943233
50503 1943233 1952988 1967425 1987625 2013762 2045463 2082733 2125814 2174498 2228137 2286053 2347764
50492 2347764 2413363 2484185 2562637 2650573 2747858 2852848 2964094 3081118 3203669 3330714
50482 3330714 3460012 3588205 3711523 3827270 3935043 4036072 4131095 4219279 4299536 4372362
50472 4372362 4439787 4503833 4565747 4626402 4686378 4745347 4802417 4857893 4914094 4973615 5037212
50461 5037212 5104288 5175004 5250584 5331385 5416044 5503158 5592590 5684076 5775255 5862269 5942017
$$ packed form
50536D086350l4358m2163n2548o5424p8163q8532r6705j03640j08993j11869j12615
50525C191340j12384j11278j08283j02912r6004q8998q3070p8681p5033p0224
50515B264473o2962n4075m5562l8436l2465k7541k3772k0127j4729p289J18N600
50503A943233R755J4437K0200K6137L1701L7270M3081M8684N3639N7916O1711
50492B347764O5599P0822P8452Q7936R7285J04990J11246J17024J22551J27045
50482C330714J29298J28193J23318J15747J07773J01029R5023Q8184Q0257P2826
50472D372362O7425O4046O1914O0655N9976N8969N7070N5476N6201N9521O3597
50461E037212O7076P0716P5580Q0801Q4659Q7114Q9432R1486R1179Q7014P9748
$$ plain form
50450 5942017 6012737 6072578 6118821 6148823 6160843 6153721 6126709 6080255 6016339 5937357 5844975
50439 5844975 5740609 5626723 5507054 5385677 5266312 5152432 5047286 4953418 4872399 4805284
50429 4805284 4753113 4716604 4695370 4687716 4691202 4703074 4720026 4737972 4752577 4759969 4756660 4739060
50417 4739060 4703828 4648878 4573622 4478332 4364074 4233514 4090863 3940325 3785070 3627963
50407 3627963 3472267 3320627 3174075 3033053 2898795 2772532 2654052 2542808 2440177
50398 2440177 2348629 2268349 2196612 2131323 2073361 2024282 1983354 1948537 1919163 1895669 1877357
50387 1877357 1862672 1851785 1846935 1849591 1858629 1871972 1888722 1908841 1931837 1957097 1985046 2016700
50375 2016700 2052019 2089579 2128268 2168677 2212306 2259572 2309048 2358817 2408339 2458750 2511344
$$ packed form
50450E942017P0720N9841M6243L0002J2020p122k7012m6454o3916p8982r2382
50439E844975j04366j13886j19669j21377j19365j13880j05146r3868q1019o7115
50429D805284n2171l6509k1234p654L486J1872J6952J7946J4605P392l309j7600
50417D739060l5232n4950p5256r5290j14258j30560j42651j50538j55255j57107
50407C627963j55696j51640j46552j41022j34258j26263j18480j11244j02631
50398B440177r1548q0280p1737o5289n7962m9079m0928l4817k9374k3494j8312
50387A877357j4685j0887m850K656R038J3343J6750K0119K2996K5260K7949L1654
50375B016700L5319L7560L8689M0409M3629M7266M9476M9769M9522N0411N2594
$$ plain form
50364 2511344 2565909 2620676 2673902 2725426 2776724 2829390 2883532 2937697 2990309 3040895 3089759
50353 3089759 3137095 3183252 3229616 3278028 3328866 3380590 3431757 3482740 3534639 3587250 3639269
50342 3639269 3690186 3740749 3791366 3840957 3887518 3928983 3963393 3989249 4006194 4014678 4014359 4003358
50330 4003358 3979571 3942248 3891869 3829093 3754665 3670090 3577475 3478543 3374317 3266123 3156625
50319 3156625 3049542 2948274 2854616 2768721 2690331 2620106 2559678 2510489 2472834 2446077 2429300
50308 2429300 2421335 2420493 2424863 2432909 2443340 2454303 2463158 2467261 2464662 2453841 2433293 2402086 2360922
50295 2360922 2312240 2258883 2202727 2144638 2085348 2025882 1967129 1909457 1853008 1798266 1746111
50284 1746111 1697450 1652859 1612357 1575312 1540737 1508062 1477678 1450452 1426688 1405744 1386741
$$ packed form
50364B511344N4565N4767N3226N1524N1298N2666N4142N4165N2612N0586M8864
50353C089759M7336M6157M6364M8412N0838N1724N1167N0983N1899N2611N2019
50342C639269N0917N0563N0617M9591M6561M1465L4410K5856J6945Q484l19j1001
50330D003358k3787l7323n0379o2776p4428q4575r2615r8932j04226j08194j09498
50319C156625j07083j01268r3658q5895p8390p0225o0428m9189l7655k6757j6777
50308B429300p965q42M370Q046J0431J0963Q855M103k599j0821k0548l1207m1164
50295B360922m8682n3357n6156n8089n9290n9466n8753n7672n6449n4742n2155
50284A746111m8661m4591m0502l7045l4575l2675l0384k7226k3764k0944j9003
$$ plain form
50273 1386741 1369462 1354477 1342668 1334776 1331170 1331616 1335203 1340783 1347760 1356399 1367259 1380398 1395343
50260 1395343 1411805 1430119 1450808 1473955 1499180 1526040 1554053 1582477 1610600 1638511 1667329
50249 1667329 1698376 1732012 1767206 1802179 1835650 1867720 1899412 1931118 1961876 1990579 2017463
50238 2017463 2043408 2067830 2088472 2103777 2114413 2121797 2125945 2125726 2120574 2110949 2097534 2080998
50226 2080998 2062293 2042100 2019977 1995007 1967306 1938015 1907759 1876063 1842514 1807657 1772453
50215 1772453 1737469 1702823 1668237 1632986 1596519 1559418 1523194 1489051 1457369 1428278 1401630
50204 1401630 1376223 1350247 1323144 1296290 1271417 1249290 1230311 1215098 1203382 1193296 1183093
50193 1183093 1173139 1165160 1159978 1157005 1155502 1155062 1154978 1154432 1153627 1153830 1156033 1160082 1165111 1170068 1173871
$$ packed form
50273A386741j7279j4985j1809p892l606M46L587N580O977Q639J0860J3139J4945
50260A395343J6462J8314K0689K3147K5225K6860K8013K8424K8123K7911K8818
50249A667329L1047L3636L5194L4973L3471L2070L1692L1706L0758K8703K6884
50238B017463K5945K4422K0642J5305J0636P384M148k19n152r625j3415j6536
50226B080998j8705k0193k2123k4970k7701k9291l0256l1696l3549l4857l5204
50215A772453l4984l4646l4586l5251l6467l7101l6224l4143l1682k9091k6648
50204A401630k5407k5976k7103k6854k4873k2127j8979j5213j1716j0086j0203
50193A183093r954p979n182k973j503m40q4n46q05K03K203M049N029M957L803
$$ plain form
50178 1173871 1175895 1176618 1177214 1178384 1179897 1181095 1181274 1179784 1176580 1172622 1168856 1164896 1159692 1153528 1148098
50163 1148098 1144132 1140109 1134166 1126477 1118748 1111810 1104773 1096553 1087550 1079601 1074476 1072267 1071110 1068805
50149 1068805 1065064 1061944 1061638 1064079 1067081 1068789 1069651 1071918 1077268 1084869 1091784 1095546 1096351 1096570 1098209
50134 1098209 1101288 1104543 1106831 1107608 1106819 1105015 1103055 1101028 1097891 1092843 1086719 1081278 1077238 1073698
50120 1073698 1069417 1063831 1056660 1047362 1035611 1022108 1008398 995754 984403 973865 963968 955215
50108 955215 947949 941467 934652 927638 922116 919495 919240 919650 919803 919946 920299 920483 920207 919617 918602 916536
50092 916536 913176 909326 906087 903682 901352 898149 893534 887434 880271 873010 866841 862469 859560 856979
50078 856979 853879 850692 848756 848740 849777 850587 851165 852720 856063 860825 866265 872075 878071 883917 889675
$$ packed form
50178A173871K024P23N96J170J513J198J79j490l204l958l766l960n204o164n430
50163A148098l966m023n943p689p729o938p037q220r003p949n125k209j157k305
50149A068805l741l120l06K441L002J708Q62K267N350P601O915L762Q05K19J639
50134A098209L079L255K288P77p89j804j960k027l137n048o124n441m040l540
50120A073698m281n586p171r298j1751j3503j3710j2644j1351j0538r897q753
50108I55215p266o482o815p014n522k621k55M10J53J43L53J84k76n90j015k066
50092I16536l360l850l239k405k330l203m615o100p163p261o169m372k909k581
50078H56979l100l187j936j6J037Q10N78J555L343M762N440N810N996N846N758
$$ plain form
50063 889675 896026 903294 910701 917440 924275 933149 944936 958157 970315 980180 988423 996259 1004049
50050 1004049 1011386 1018137 1024835 1031980 1039297 1045819 1050474 1052585 1052341 1051235 1051564 1054709 1059876 1064986
50036 1064986 1068714 1071148 1072763 1073774 1074707 1076726 1080847 1087279 1095719 1105690 1116410 1127209 1138582
50023 1138582 1152011 1168097 1185562 1202871 1220194 1238924 1259805 1282483 1306471 1331451 1356837
50012 1356837 1382117 1407625 1434116 1461589 1489428 1517649 1547079 1578216 1610818 1644635 1679561
50001 1679561 1714926 1749721 1783864 1818296 1853506 1888996 1924712 1961924 2001909 2044584 2089293
49990 2089293 2136231 2186240 2239837 2297468 2360233 2429375 2505317 2588108 2678431 2777061 2883488
49979 2883488 2996286 3115050 3240753 3373411 3510005 3645273 3774197 3893321 4000138
$$ packed form
50063H89675O351P268P407O739O835Q874J1787J3221J2158R865Q243P836P790
50050A004049P337O751O698P145P317O522M655K111k44j106L29L145N167N110
50036A064986L728K434J615J011R33K019M121O432Q440R971J0720J0799J1373
50023A138582J3429J6086J7465J7309J7323J8730K0881K2678K3988K4980K5386
50012A356837K5280K5508K6491K7473K7839K8221K9430L1137L2602L3817L4926
50001A679561L5365L4795L4143L4432L5210L5490L5716L7212L9985M2675M4709
49990B089293M6938N0009N3597N7631O2765O9142P5942Q2791R0323R8630J06427
49979B883488J12798J18764J25703J32658J36594J35268J28924J19124J06817
$$ plain form
49970 4000138 4092109 4166691 4222428 4260175 4283353 4296725 4304476 4309090 4311485 4311555 4308169 4298849 4279911
49957 4279911 4247263 4197360 4127911 4038274 3929722 3805464 3670098 3528472 3384627 3241536
49947 3241536 3101464 2966237 2837288 2715862 2603245 2500363 2406958 2321566 2242680 2169890
49937 2169890 2103800 2045050 1993459 1947759 1906009 1866601 1829026 1793404 1759419 1726421 1694580
49926 1694580 1664982 1638060 1612769 1587954 1563713 1540554 1518023 1495432 1473363 1452967 1434000
49915 1434000 1415204 1396869 1381418 1370577 1363044 1355812 1347095 1337222 1327565 1319726 1315416 1315782 1320362
49902 1320362 1327206 1334362 1341118 1347860 1355129 1363183 1372499 1384217 1399373 1417487 1436609 1455313 1474139
49889 1474139 1494231 1515207 1535822 1556704 1580686 1609699 1642597 1676999 1712190 1749112 1788463
$$ packed form
49970D000138R1971P4582N5737L7747K3178J3372P751M614K395P0l386r320j8938
49957D279911l2648m9903o9449q9637j08552j24258j35366j41626j43845j43091
49947C241536j40072j35227j28949j21426j12617j02882r3405q5392p8886p2790
49937B169890o6090n8750n1591m5700m1750l9408l7575l5622l3985l2998l1841
49926A694580k9598k6922k5291k4815k4241k3159k2531k2591k2069k0396j8967
49915A434000j8796j8335j5451j0841p533p232q717r873r657p839m310L66M580
49902A320362O844P156O756O742P269Q054R316J1718J5156J8114J9122J8704J8826
49889A474139K0092K0976K0615K0882K3982K9013L2898L4402L5191L6922L9351
$$ [...]
##END NTUPLES=NMR SPECTRUM
##END=
