
##TITLE=UV1038_TOFR01-ROVE100A_6307012_BynO12Bk5X
##JCAMPDX= 6.0         $$ Bruker NMR JCAMP-DX V2.0
##DATA TYPE= NMR SPECTRUM
##DATA CLASS= NTUPLES
##ORIGIN= BRUKER
##OWNER= Administrator
$$ 1.72 TOPSPIN		Version 2.1
$$ 2012-06-07 00:42:11.765 -0500  Administrator@TOPSPIN
$$ Compression mode = diff/dup
##.OBSERVE FREQUENCY= 400.13188235
##.OBSERVE NUCLEUS= ^1H
##.ACQUISITION MODE= SIMULTANEOUS (DQD)
##.ACQUISITION SCHEME= undefined
##.AVERAGES= 64
##.DIGITISER RES= 22
##SPECTROMETER/DATA SYSTEM= spect
##.PULSE SEQUENCE= noesygpps1d.comp
##.SOLVENT NAME= COFFEE_meoh
##.SHIFT REFERENCE= INTERNAL, COFFEE_meoh, 1, 14.98061
##AUDIT TRAIL= $$ (NUMBER, WHEN, WHO, WHERE, PROCESS, VERSION, WHAT)
$$ ##TITLE= Audit trail, TOPSPIN		Version 2.1
$$ ##JCAMPDX= 5.01
$$ ##ORIGIN= Bruker BioSpin GmbH
$$ ##OWNER= Administrator
$$ $$ C:\Bruker\TOPSPIN/data/COFFEE/nmr/UV1038_TOFR01-ROVE100A_6307012_BynO12Bk5X/12/pdata/1/auditp.txt
$$ ##AUDIT TRAIL=  $$ (NUMBER, WHEN, WHO, WHERE, PROCESS, VERSION, WHAT)
(   1,<2012-06-07 00:42:06.578 -0500>,<Administrator>,<TOPSPIN>,<go>,<TOPSPIN 2.1>,
      <created by zg
	started at 2012-06-07 00:30:36.453 -0500,
	POWCHK enabled, PULCHK disabled,
       configuration hash MD5:
       D5 CA 7A 23 FE 6B EE E2 50 67 74 61 24 F7 5E 3B
       data hash MD5: 64K
       4C 8D 21 C9 9C D0 DE B7 3D 1C 86 14 66 B4 F3 07>)
(   2,<2012-06-07 00:42:09.390 -0500>,<Administrator>,<TOPSPIN>,<proc1d>,<TOPSPIN 2.1>,
      <Start of raw data processing
       efp LB = 0.3 FT_mod = 6 PKNL = 1 PHC0 = 0 PHC1 = 0 SI = 128K 
       data hash MD5: 128K
       16 AB 8D CA F8 3B D2 07 D3 A9 16 7B 2B 01 B7 0E>)
(   3,<2012-06-07 00:42:10.578 -0500>,<Administrator>,<TOPSPIN>,<proc1d>,<TOPSPIN 2.1>,
      <pk PHC0 = 30.97046 PHC1 = 0 
       data hash MD5: 128K
       FB B4 73 38 C6 7F 70 BD A4 AD 96 CB E9 C6 CA A4>)
(   4,<2012-06-07 00:42:11.406 -0500>,<Administrator>,<TOPSPIN>,<proc1d>,<TOPSPIN 2.1>,
      <abs ABSG = 1 
       data hash MD5: 128K
       9D C9 B8 B7 95 3F 7B EA 9F 43 C7 53 86 F1 DD 5E>)
(   5,<2012-06-07 00:42:11.484 -0500>,<Administrator>,<TOPSPIN>,<proc1d>,<TOPSPIN 2.1>,
      <abs ABSG = 2 
       data hash MD5: 128K
       CB 08 6C 05 57 38 4A F1 95 2E 81 77 58 B9 1F D5>)
(   6,<2012-06-07 00:42:11.546 -0500>,<Administrator>,<TOPSPIN>,<proc1d>,<TOPSPIN 2.1>,
      <abs ABSG = 3 
       data hash MD5: 128K
       18 26 47 06 B1 16 7E 81 3A 85 F2 94 99 BA 32 CF>)
(   7,<2012-06-07 00:42:11.625 -0500>,<Administrator>,<TOPSPIN>,<proc1d>,<TOPSPIN 2.1>,
      <abs ABSG = 4 
       data hash MD5: 128K
       69 E4 0B D5 64 92 9F CA 8C 06 34 75 94 8E 23 94>)
(   8,<2012-06-07 00:42:11.671 -0500>,<Administrator>,<TOPSPIN>,<proc1d>,<TOPSPIN 2.1>,
      <abs ABSG = 5 
       data hash MD5: 128K
       1D 95 6D 05 B1 17 78 D4 79 B8 D4 8A 46 02 27 8B>)
$$ ##END=
$$ 
$$ $$ hash MD5
$$ $$ AF FC B8 87 99 CD B5 73 D2 1D 6E 91 D0 1B C7 AA
##$RELAX= 
##$RELAX= 
##$RELAX= 
##$RELAX= 
##$RELAX= 
##$RELAX= 
##$RELAX= 
##$RELAX= 
$$ [...]
150 150 150 150 150 150 150 150
##$TP07= 0
##$TPNAME0= <>
##$TPNAME1= <>
##$TPNAME2= <>
##$TPNAME3= <>
##$TPNAME4= <>
##$TPNAME5= <>
##$TPNAME6= <>
##$TPNAME7= <>
##$TPOAL= (0..7)
0.5 0.5 0.5 0.5 0.5 0.5 0.5 0.5
##$TPOFFS= (0..7)
0 0 0 0 0 0 0 0
##$TUNHIN= 0
##$TUNHOUT= 0
##$TUNXOUT= 0
##$USERA1= <user>
##$USERA2= <user>
##$USERA3= <user>
##$USERA4= <user>
##$USERA5= <user>
##$V9= 5
##$VALIST= <valist>
##$VCLIST= <CCCCCCCCCCCCCCC>
##$VD= 0
##$VDLIST= <DDDDDDDDDDDDDDD>
##$VPLIST= <PPPPPPPPPPPPPPP>
##$VTLIST= <TTTTTTTTTTTTTTT>
##$WBST= 2048
##$WBSW= 25
##$XGAIN= (0..3)
0 0 0 0
##$XL= 0
##$YL= 0
##$YMAX_a= 15150963
##$YMIN_a= -7149136
##$ZGOPTNS= <>
##$ZL1= 120
##$ZL2= 120
##$ZL3= 120
##$ZL4= 120
##$ABSF1= 14.98061
##$ABSF2= -5.57192
##$ABSG= 5
##$ABSL= 3
##$ALPHA= 0
##$AQORDER= 0
##$ASSFAC= 0
##$ASSFACI= 0
##$ASSFACX= 0
##$ASSWID= 0
##$AUNMP= <proc_prof1d_extract.lims>
##$AXLEFT= 0
##$AXNAME= <>
##$AXNUC= <1H>
##$AXRIGHT= 0
##$AXTYPE= 0
##$AXUNIT= <>
##$AZFE= 0.1
##$AZFW= 0.1
##$BCFW= 0
##$BC_mod= 0
##$BYTORDP= 0
##$COROFFS= 0
##$CY= 15
##$DATMOD= 1
##$DC= 0
##$DFILT= <>
##$DTYPP= 0
##$F1P= 0
##$F2P= 0
##$FCOR= 0.5
##$FTSIZE= 131072
##$FT_mod= 6
##$GAMMA= 0
##$GB= 0
##$INTBC= 1
##$INTSCL= 1
##$ISEN= 128
##$LB= 0.3
##$LEV0= 0
##$LPBIN= 0
##$MAXI= 10000
##$MC2= 0
##$MEAN= 0
##$ME_mod= 0
##$MI= 0
##$NCOEF= 0
##$NC_proc= -2
##$NLEV= 6
##$NOISF1= 0
##$NOISF2= 0
##$NSP= 0
##$NTH_PI= 0
##$NZP= 0
##$OFFSET= 14.98061
##$PC= 1
##$PHC0= 30.97046
##$PHC1= 0
##$PH_mod= 1
##$PKNL= yes
##$PPARMOD= 0
##$PPDIAG= 0
##$PPIPTYP= 0
##$PPMPNUM= 2147483647
##$PPRESOL= 1
##$PSCAL= 4
##$PSIGN= 0
##$PYNMP= <proc.py>
##$REVERSE= no
##$SF= 400.13
##$SI= 131072
##$SIGF1= 0
##$SIGF2= 0
##$SINO= 400
##$SIOLD= 131072
##$SPECTYP= <>
##$SREGLST= <1H.CDCl3>
##$SSB= 0
##$STSI= 131072
##$STSR= 0
##$SW_p= 8223.68421052632
##$SYMM= 0
##$S_DEV= 0
##$TDeff= 65536
##$TDoff= 0
##$TI= <>
##$TILT= no
##$TM1= 0
##$TM2= 0
##$TOPLEV= 0
##$USERP1= <user>
##$USERP2= <user>
##$USERP3= <user>
##$USERP4= <user>
##$USERP5= <user>
##$WDW= 1
##$XDIM= 131072
##$YMAX_p= 297844189
##$YMIN_p= -140228907
##$CURPLOT= <Network HP LaserJet P1505>
##$CURPRIN= <$Network HP LaserJet P1505>
##$DFORMAT= <normdp>
##$LAYOUT= <+/1D_H.xwp>
##$LFORMAT= <normlp>
##$PFORMAT= <normpl>
##$SURQMSG= 1
$$ End of Bruker specific parameters
$$ ---------------------------------
##NTUPLES= NMR SPECTRUM
##VAR_NAME=  FREQUENCY,     SPECTRUM/REAL,   SPECTRUM/IMAG
##SYMBOL=    X,             R,               I
##VAR_TYPE=  INDEPENDENT,   DEPENDENT,       DEPENDENT
##VAR_FORM=  AFFN,          ASDF,            ASDF
##VAR_DIM=   131072,        131072,          131072
##UNITS=     HZ,            ARBITRARY UNITS, ARBITRARY UNITS
##FACTOR=    0.0627417313425165, 1,          1
##FIRST=     8223.62146879498, -4102,        -52721
##LAST=      0,             -2986,           -54757
##MIN=       0,             -140228907,      0
##MAX=       8223.62146879498, 297844189,    0
$$ Real data points
##PAGE= N=1
##DATA TABLE= (X++(R..R)), XYDATA
$$ [...]
60929B160055J15446J25050J35041J43723J51115J58366J66074J74702J85406
$$ 2160055 2275501 2400551 2535592 2679315 2830430 2988796 3154870 3329572 3514978
60920C514978J98803K13878K29796K47673K68860K92753L18411L47133L81141
$$ 3514978 3713781 3927659 4157455 4405128 4673988 4966741 5285152 5632285 6013426
60911F013426M21129M67661N23361N90315O66784P50451Q43730R51358J074453
$$ 6013426 6434555 6902216 7425577 8015892 8682676 9433127 10276857 11228215 12302668
60902A2302668J213165J374003J565976J788898K034978K300076K569445K773905
$$ 12302668 13515833 14889836 16455812 18244710 20279688 22579764 25149209 27923114
60894B7923114K780497K473602J872416J155489N46166J69167J7843L1682J57906
$$ 27923114 30703611 33177213 35049629 36205118 36751284 36920451 36938294 36969976 37127882
60885C7127882L22897L87306J94091l08682j003705j679038k169248k430598k508790
$$ 37127882 37450779 37838085 38032176 37723494 36719789 35040751 32871503 30440905 27932115
60876B7932115k468426k357613k209821k048273j882827j713251j540044j368809
$$ 27932115 25463689 23106076 20896255 18847982 16965155 15251904 13711860 12343051
60868A2343051j205248j052213r12949p92121o91592o08500n39033m81228m33130
$$ 12343051 11137803 10085590 9172641 8380520 7688928 7080428 6541395 6060167 5627037
60859E627037l91547l54395l21729k93120k66505k41047k18482j99818j83141
$$ 5627037 5235490 4881095 4559366 4266246 3999741 3758694 3540212 3340394 3157253
60850C157253j66749j52222j41882j34807j28015j20397j13011j06201r9001r1234
$$ 3157253 2990504 2838282 2696400 2561593 2433578 2313181 2200170 2093969 1994968 1903734
60840A903734q4045p8173p3222o8732o4615o0536n6122n1785m8356m5835m3428
$$ 1903734 1819689 1741516 1668294 1599562 1534947 1474411 1418289 1366504 1318148 1272313 1228885
60829A228885m0710l7925l5264l2711l0429k8589k7017k5603k4664k4217k3422
$$ 1228885 1188175 1150250 1114986 1082275 1051846 1023257 996240 970637 945973 921756 898334
60818H98334k1616j9466j8132j7694j7322j6703j6178j5689j4680j3038j1338
$$ 898334 876718 857252 839120 821426 804104 787401 771223 755534 740854 727816 716478
60807G16478j0102r443r268r236q746p620o572o240o189n579m418l367k646k032
$$ 716478 706376 696933 687665 678429 669683 662063 655491 649251 643062 637483 633065 629698 627052 625020
60793F25020j630j699j948j927j877k273k762k570j793j320j565k179k918l807
$$ 625020 623390 621691 619743 617816 615939 613666 610904 608334 606541 605221 603656 601477 598559 594752
60779E94752m578m863m991n596o450o600n708m438l407k628k041j755j658j451
$$ 594752 590174 585311 580320 574724 568274 561674 555966 551528 548121 545493 543452 541697 540039 538588
60765E38588j117q09m23P7K94J07L01J453K647K592J728J694K786L557L159K510
$$ 538588 537471 536662 536239 536316 536610 536717 537018 538471 541118 543710 545438 547132 549918 553475 556634 559144
60749E59144K643L288L828M428N375O212O317N708M782L869L388L636M079L691
$$ 559144 561787 565075 568903 573331 578706 584918 591235 596943 601725 605594 608982 612618 616697 620388
60735F20388K289P92j52q17j464j786j771k064k895l560l572l341l238k912k278
$$ 620388 622677 623469 623317 622500 621036 619250 617479 615415 612520 608960 605388 602047 598809 595897 593619
60720E93619k113k880l782l848l206k492j750q26k08m84j393k157k420k271j798
$$ 593619 591506 588626 584844 580996 577790 575298 573548 572722 572514 572030 570637 568480 566060 563789 561991
60705E61991j206q90q89p79n35o91j133p30J030K951L644L377L285L451L088K186
$$ 561991 560785 559895 559006 558227 557692 557001 555868 555138 556168 559119 562763 566140 569425 572876 575964 578150
60689E78150J684K034K751L310L605L486K717J468J33j215k623l705m056m043
$$ 578150 579834 581868 584619 587929 591534 595020 597737 599205 599338 598123 595500 591795 587739 583696
60675E83696m389n157n850o369p026p675p735p129o468o197o200o318o555o707
$$ 583696 579307 574150 568300 561931 554905 547230 539495 532366 525898 519701 513501 507183 500628 493921
60661D93921o383n566m662l967l530l504m057m892n395n345n033m705m343m013
$$ 493921 487538 481972 477310 473343 469813 466309 462252 457360 451965 446620 441587 436882 432539 428526
60647D28526l849l709l320k805k579k694k729k472k217k291k615k941l130l095
$$ 428526 424677 420968 417648 414843 412264 409570 406841 404369 402152 399861 397246 394305 391175 388080
60633C88080k685j822o46M36R30O72J67K33J081K026K406K380K542L105L874M624
$$ 388080 385395 383573 382927 383363 384293 384965 385132 385365 386446 388472 390878 393258 395800 398905 402779 407403
60617D07403M977M408K994J877K141L430M406M519M535N251O415P196P174O665
$$ 407403 412380 416788 419782 421659 423800 427230 431636 436155 440690 445941 452356 459552 466726 473391
60603D73391O344O743P787Q843R404R603R716R533Q755P808P501P951Q526Q856
$$ 473391 479735 486478 494265 503108 512512 522115 531831 541364 550119 557927 565428 573379 581905 590761
60589E90761R106R102Q093N861L442K050J666J170k43k292m175n442o218o807
$$ 590761 599867 608969 617062 622923 626365 628415 630081 631251 631008 628716 624541 619099 612881 606074
60575F06074p312p609p591p377p201p181p154o742n690m203k959k492k575k501
$$ 606074 598762 591153 583562 576185 568984 561803 554649 547907 542217 538014 535055 532563 529988 527487
60561E27487k007j598j696j926j614p27Q6L54K78L73Q82J615K306L001L996N350
$$ 527487 525480 523882 522186 520260 518646 517919 518005 518359 518637 519010 519892 521507 523813 526814 530810 536160
60545E36160O676P645Q527R730J1047J1926J2457J3250J4232J4407J3188J1214
$$ 536160 542836 550481 559008 568738 579785 591711 604168 617418 631650 646057 659245 670459
60533F70459R393P827O236M709L357J802k52k361l965n263o735q176q980r065
$$ 670459 679852 687679 693915 698624 701981 703783 703531 701170 697205 691942 685207 677031 668051 658986
60519F58986q842q553q296q408r061r685r536q699p873p353o905o395n911n324
$$ 658986 650144 641591 633295 624887 615826 606141 596605 587906 580033 572680 565775 559380 553469 548145
60505E48145m465l560k927k370j504m89J71L73L88L05J34J76O74J314J711K075
$$ 548145 543680 540120 537193 534823 533319 532830 533001 533374 533762 534067 534201 534377 535051 536365 538076 540151
60489E40151K760L539M121M877O155P274P364O912P248Q629J0036J0902J1802
$$ 540151 542911 546450 550571 555448 561603 568877 576241 583153 590401 599030 609066 619968 631770
60476F31770J3248J4992J6851J9163K1934K4469K6381K8220L0696L3861L7389
$$ 631770 645018 660010 676861 696024 717958 742427 768808 797028 827724 861585 898974
60465H98974M1073M4724M8175N1482N4643N7005N7598N6050N2559M7096L9592
$$ 898974 940047 984771 1032946 1084428 1139071 1196076 1253674 1309724 1362283 1409379 1448971
60454A448971L0913K2617J5480R181L583p76l795o354r154j1907j4162j6145j8149
$$ 1448971 1479884 1502501 1517981 1527162 1530745 1529969 1526174 1519820 1510666 1498759 1484597 1468452 1450303
60441A450303j9789k0485k0097j8685j6209j2870r135n032p0N792J1778J7285
$$ 1450303 1430514 1410029 1389932 1371247 1355038 1342168 1333033 1328001 1327931 1333723 1345501 1362786
60429A362786K2541K7913L3302L8612M3969M8877N1991N2432N0715M7822M4064
$$ 1362786 1385327 1413240 1446542 1485154 1529123 1578000 1629991 1682423 1733138 1780960 1825024
60418A825024L9579L5303L2563L2058L3910L8244M5041N3841O4251P6418R0387
$$ 1825024 1864603 1899906 1932469 1964527 1998437 2036681 2081722 2135563 2199814 2276232 2366619
60407B366619J05472J20989J37291J55292J75196J96390K18395K41111K64144
$$ 2366619 2472091 2593080 2730371 2885663 3060859 3257249 3475644 3716755 3980899
60398C980899K86393L06264L21452L28417L22622L00072K59059K00836J28993
$$ 3980899 4267292 4573556 4895008 5223425 5546047 5846119 6105178 6306014 6435007
60389F435007M8282l6004j17939j91249k50879k94593l22857l37362l40225l34102
$$ 6435007 6483289 6447285 6329346 6138097 5887218 5592625 5269768 4932406 4592181 4258079
60379D258079l21701l04656k83709k60222k36462k14042j93062j73350j55455
$$ 4258079 3936378 3631722 3348013 3087791 2851329 2637287 2444225 2270875 2115420
60370B115420j39677j25247j11577r9480q9901q2127p4587o6979o0271n4822m9945
$$ 2115420 1975743 1850496 1738919 1639439 1549538 1467411 1392824 1325845 1265574 1210752 1160807
60359A160807m5353m1650l8982l6368l3027k9536k7030k5706k4738k3322k1335
$$ 1160807 1115454 1073804 1034822 998454 965427 935891 908861 883155 858417 835095 813760
60348H13760j9211j7496j6467j5893j5275j4386j3422j2493j1214r175o812n368
$$ 813760 794549 777053 760586 744693 729418 715032 701610 689117 677903 668728 661916 656548
60336F56548n636o816p168n984m424l965m507m763m231l694l715l719l144k592
$$ 656548 650912 644096 636928 630944 626520 622555 618048 613285 609054 605360 601645 597926 594782 592190
60322E92190l052m414n532n563m707l771l455l904m619m917m686m436m461m396
$$ 592190 589138 584724 579192 573629 568922 565151 561696 557792 553173 548256 543570 539134 534673 530277
60308E30277l830k949k214j771j495j301j122r72j103j691k179j714m94J26o12
$$ 530277 526447 523498 521284 519513 518018 516717 515595 514623 513520 511829 509650 507936 507442 507568 506956
60293E06956j770k056j527j156j285j490j547j567j369o20M66J315J802K176K355
$$ 506956 505186 503130 501603 500447 499162 497672 496125 494558 493189 492569 493035 494350 496152 498328 500683
60278E00683K013J328R47J161J675K196K670L012L146L215L302L095K440K006
$$ 500683 502696 504024 504971 506132 507807 510003 512673 515685 518831 522046 525348 528443 530883 532889
60264E32889K637M045M941M600L642L008K821K593K005J103l1j339k549l142k718
$$ 532889 535526 539571 544512 549112 552754 555762 558583 561176 563181 564284 564253 562914 560365 557223 554505
60249E54505j478l21j53r48j664j325m8J243J851J802J455J034N06k45j116j653
$$ 554505 553027 552706 552553 551605 549941 548616 548568 549811 551662 553464 554919 555953 556459 556214 555098 553445
60233E53445j452p32j31O1R9O7l54j165j690j373m55N54J490K254K570K570L007
$$ 553445 551993 551261 551130 551191 551290 551357 551003 549838 548148 546775 546320 546874 548364 550618 553188 555758 558765
60216E58765M182N304N621N600O087O825O878O185N609N612N904O291O818P158
$$ 558765 562947 568251 573872 579472 585559 592384 599262 605447 611056 616668 622572 628863 635681 642839
60202F42839O919O635P390R205J0840J1521J1957J3177J5227J7522J9843K2257
$$ 642839 649758 656393 663783 672988 683828 695349 707306 720483 735710 753232 773075 795332
60190G95332K4502K6137K7233K8459L0460L3310L6430L9118M1240M3328M5806
$$ 795332 819834 845971 873204 901663 932123 965433 1001863 1040981 1082221 1125549 1171355
60179A171355M8319N0235N1552N2757N3854N4284N3769N2609N0956M8499M5070
$$ 1171355 1219674 1269909 1321461 1374218 1428072 1482356 1536125 1588734 1639690 1688189 1733259
60168A733259M1026L6697L2000K6828K1405J5877J0120M362n36l983o499q971
$$ 1733259 1774285 1810982 1842982 1869810 1891215 1907092 1917212 1921574 1921038 1917055 1910556 1901585
60156A901585j1241j2267j1647j0307r186p827m954k48N193J0250J4952J9850
$$ 1901585 1890344 1878077 1866430 1856123 1846937 1839110 1834156 1833908 1839101 1849351 1864303 1884153
60144A884153K4890K9578L3904L8245M2526M6224M9237N1907N4038N4748N3591
$$ 1884153 1909043 1938621 1972525 2010770 2053296 2099520 2148757 2200664 2254702 2309450 2363041
60133B363041N1070M7594M2780L6340K9016K1874J5128Q297J088o363j3692k0132
$$ 2363041 2414111 2461705 2504485 2540825 2569841 2591715 2606843 2615140 2616228 2609865 2596173 2576041
60121B576041k4715k7295k8926l0478l1321l0175k6889k2575j8152j3618q544
$$ 2576041 2551326 2524031 2495105 2464627 2433306 2403131 2376242 2353667 2335515 2321897 2313353
60110B313353k553M608J2729K0934K8329L4850M0994M6969N2528N7248O0382O0946
$$ 2313353 2310800 2315408 2328137 2349071 2377400 2412250 2453244 2500213 2552741 2609989 2670371 2731317
60098B731317N8618N4287M8937M2400L3955K3800J3071K713o736j4619k0370k4152
$$ 2731317 2789935 2844222 2893159 2935559 2969514 2993314 3006385 3009098 3002362 2987743 2967373 2943221
60086B943221k6303k6391k3788j9018j3499p872j597N847J4343K3691L3885M4637
$$ 2943221 2916918 2890527 2866739 2847721 2834222 2826350 2824753 2830600 2844943 2868634 2902519 2947156
60074B947156N5494O6429P7612Q8669R9114J09351J20188J31379J41716J50554
$$ 2947156 3002650 3069079 3146691 3235360 3334474 3443825 3564013 3695392 3837108 3987662
60064C987662J58117J64204J67886J68751J67270J63549J56828J46619J33346
$$ 3987662 4145779 4309983 4477869 4646620 4813890 4977439 5134267 5280886 5414232
60055E414232J17447R8911P8080N5929L3062R433j4472l7340n8551p8891r8867
$$ 5414232 5531679 5630590 5708670 5764599 5797661 5807094 5792622 5755282 5696731 5617840 5518973
60044E518973j17103j31400j40759j45628j46734j44513j39383j31770j22035
$$ 5518973 5401870 5270470 5129711 4984083 4837349 4692836 4553453 4421683 4299648
60035D299648j10664r8253q4994p0666n5437m0194k5705j2039R16J2862K3360
$$ 4299648 4188984 4090731 4005737 3935071 3879634 3839440 3813735 3801696 3802612 3815474 3838834
60024C838834L2182L9024M3427M5268M4874M2491L8162L2173K5025J6892P962
$$ 3838834 3871016 3910040 3953467 3998735 4043609 4086100 4124262 4156435 4181460 4198352 4206314
60013D206314p24p905j3742j9600k5788l0866l3893l6005l8736m1886m4336m6084
$$ 4206314 4205590 4197685 4183943 4164343 4138555 4107689 4073796 4037791 3999055 3957169 3912833 3866749
60001C866749m8050n0342n2022n2466n1936n0881m9422m7442m4600m0524l5517
$$ 3866749 3818699 3768357 3716335 3663869 3611933 3561052 3511630 3464188 3419588 3379064 3343547
59990C343547l0580k6117k1131j4557o805Q43P982J5102K2103K7865L1422L2720
$$ 3343547 3312967 3286850 3265719 3251162 3244357 3245200 3253182 3268284 3290387 3318252 3349674 3382394
59978C382394L2150K9966K6267K1030J4167O002k577j0979j9628k9094l8757m7198
$$ 3382394 3414544 3444510 3470777 3491807 3505974 3511976 3509399 3498420 3478792 3449698 3410941 3363743
59966C363743n3873n9476o4479o8197o9668o8832o6389o2863n8364n2947m6790
$$ 3363743 3309870 3250394 3185915 3117718 3048050 2979218 2912829 2849966 2791602 2738655 2691865
59955B691865l9924l2183k3625j4868o736N40P558J4916K2431K9547L6366M3565
$$ 2691865 2651941 2619758 2596133 2581265 2574529 2575069 2582627 2597543 2619974 2649521 2685887 2729452
59943B729452N1275N8715O5110P0327P4274P6384P6170P3804O9575O3302N4834
$$ 2729452 2780727 2839442 2904552 2974879 3049153 3125537 3201707 3275511 3345086 3408388 3463222
59932C463222M4785L4165K3415J2305N92j1568k3639l4798m4247n1709n7350o1102
$$ 3463222 3508007 3542172 3565587 3577892 3578484 3566916 3543277 3508479 3464232 3412523 3355173 3294071
59920C294071o2503o1454n8635n4739m9812m3725l6765k9260k1108j2285l376
$$ 3294071 3231568 3170114 3111479 3056740 3006928 2963203 2926438 2897178 2876070 2863785 2860409
59909B860409M902J2326J8893K4501K9449L4634M0364M5487M8643N0006N0789
$$ 2860409 2865311 2877637 2896530 2921031 2950480 2985114 3025478 3070965 3119608 3169614 3220403
59898C220403N1273N0485M7863M4148M0275L6306L1907K7212K2663J8435J4560
$$ 3220403 3271676 3322161 3370024 3414172 3454447 3490753 3522660 3549872 3572535 3590970 3605530
59887C605530J1480R961J0476J2851J6565K1377K7517L5284M4592N5130O6797
$$ 3605530 3617010 3626971 3637447 3650298 3666863 3688240 3715757 3751041 3795633 3850763 3917560
59876C917560P9598R3154J06803J20210J33391J45908J56716J65054J70911J74210
$$ 3917560 3997158 4090312 4197115 4317325 4450716 4596624 4753340 4918394 5089305 5263515
59866E263515J73997J68958J58288J41679J18990R0627N7946K2863j2764m7080
$$ 5263515 5437512 5606470 5764758 5906437 6025427 6116054 6174000 6196863 6184099 6137019
59856F137019p8300j05384j28232j46608j59465j66043j67150j64471j58923j50537
$$ 6137019 6058719 5953335 5825103 5678495 5519030 5352987 5185837 5021366 4862443 4711906
59846D711906j39640j27267j14314j00998q7206p2795n7758m2573k8152j4917
$$ 4711906 4572266 4444999 4330685 4229687 4142481 4069686 4011928 3969355 3941203 3926286
59836C926286k194J0704K3208L4121M3226N1125N7664O1671O2436O0269N5268
$$ 3926286 3924092 3934796 3958004 3992125 4035351 4086476 4144140 4205811 4268247 4328516 4383784
59825D383784M6629L3837J7719l49j9601l9599n9367p7589r3503j06908j17534
$$ 4383784 4430413 4464250 4481969 4481620 4462019 4422420 4363053 4285464 4191961 4085053 3967519
59814C967519j25079j29773j32262j32814j31165j27342j22132j16325j09790
$$ 3967519 3842440 3712667 3580405 3447591 3316426 3189084 3066952 2950627 2840837
59805B840837j01922r2905q3903p5722o7900n9673n1365m4097l8308l3448k9192
$$ 2840837 2738915 2646010 2562107 2486385 2418485 2358812 2307447 2263350 2225042 2191594 2162402
59794B162402k5951k3929k2493k1036j9717j8734j7506j5302j2299r252o483l871
$$ 2162402 2136451 2112522 2090029 2068993 2049276 2030542 2013036 1997734 1985435 1976183 1969700 1965829
59782A965829j563N6Q65Q18n11l483p538j1536j4922j7941k0743k2972k4321k4936
$$ 1965829 1964266 1964322 1965187 1966005 1965494 1962011 1954473 1942937 1928015 1910074 1889331 1866359 1842038 1817102
59768A817102k5027k4610k3688k2372k0705j8762j6883j5370j3959j1984r150
$$ 1817102 1792075 1767465 1743777 1721405 1700700 1681938 1665055 1649685 1635726 1623742 1614592
59757A614592n706j810K769Q081J3472J8050K1621K4954K8995L3767L8205M1143
$$ 1614592 1608886 1607076 1609845 1617926 1631398 1649448 1671069 1696023 1725018 1758785 1796990 1838133
59745A838133M2280M1903L9980L6215L1101K6035K2089J9155J6736J4861J3617
$$ 1838133 1880413 1922316 1962296 1998511 2029612 2055647 2077736 2096891 2113627 2128488 2142105
59734B142105J2439J0697Q629P105O724P788J0705J5543K1456K7485L3827M1534
$$ 2142105 2154544 2165241 2173870 2180975 2187699 2195487 2206192 2221735 2243191 2270676 2304503 2346037
59722B346037N0928O1102P1091Q0801R0653J00931J11725J22954J34070J43997
$$ 2346037 2396965 2458067 2529158 2609959 2700612 2801543 2913268 3036222 3170292 3314289
59712C314289J51445J54953J52623J42300J22555R3658N7879J9004j8730n1808
$$ 3314289 3465734 3620687 3773310 3915610 4038165 4131823 4189702 4208706 4189976 4138168
59702D138168p8072r6598j07503j11968j11859j08697j02979r4660q4015p1895
$$ 4138168 4060096 3963498 3855995 3744027 3632168 3523471 3420492 3325832 3241817 3169922
59692C169922n9421m7636l6993k6993j6814o481L249J2325K1763L2024M2031N0660
$$ 3169922 3110501 3062865 3025872 2998879 2982065 2975584 2978833 2991158 3012921 3044945 3086976 3137636
59680C137636N8380O6419P5042Q3839R3120J03662J15250J26887J38403J50656
$$ 3137636 3196016 3262435 3337477 3421316 3514436 3618098 3733348 3860235 3998638 4149294
59670D149294J64000J77766J91468K05607K20814K37000K53594K69959K85372
$$ 4149294 4313294 4491060 4682528 4888135 5108949 5345949 5599543 5869502 6154874
59661F154874K99202L11337L21855L30139L34931L35325L31258L23052L11289
$$ 6154874 6454076 6765413 7087268 7417407 7752338 8087663 8418921 8741973 9053262
59652I053262K97295K83093K70577K61024K55209K53246K54248K56799K59921
$$ 9053262 9350557 9633650 9904227 10165251 10420460 10673706 10927954 11184753 11444674
59643A1444674K63010K64816K63353K57120K45824K29644K08364J81707J50269
$$ 11444674 11707684 11972500 12235853 12492973 12738797 12968441 13176805 13358512 13508781
59634A3508781J15716Q0228M5789J3855j4501l8146n5797o6511p0051o6629n6600
$$ 13508781 13624497 13704725 13750514 13764369 13749868 13711722 13655925 13589414 13519363 13452734 13396134
59623A3396134m0637j9761N177L3694O5098R8235J32267J67087K02469K37396
$$ 13396134 13355497 13335736 13340913 13374607 13439705 13537940 13670207 13837294 14039763 14277159
59613A4277159K70784L02012L29864L51710L64753L67503L58833L36321K97148
$$ 14277159 14547943 14849955 15179819 15531529 15896282 16263785 16622618 16958939 17256087
59604A7256087K40616J68689Q4416q638j05499k00127k87399l63891m26801m73634
$$ 17256087 17496703 17665392 17749808 17741170 17635671 17435544 17148145 16784254 16357453 15883819
59594A5883819n03560n18080n19625n10317m92442m69076m43558m18917l98216
$$ 15883819 15380259 14862179 14342554 13832237 13339795 12870719 12427161 12008244 11610028
59585A1610028l84555l79877l83842l94038m06909m18578m25730m26583m21075
$$ 11610028 11225473 10845596 10461754 10067716 9660807 9242229 8816499 8389916 7968841
59576G968841m10153l95030l76819l56283l33917l10569k87632k66025k45364
$$ 7968841 7558688 7163658 6786839 6430556 6096639 5786070 5498438 5232413 4987049
59567D987049k24918k05003j86636j70105j54918j40895j28252j16645j05306
$$ 4987049 4762131 4557128 4370492 4200387 4045469 3904574 3776322 3659677 3554371
59558C554371r4217q4202p5756o8620o2522n7395n2884m8593m4822m2247m1020
$$ 3554371 3460154 3375952 3300196 3231576 3169054 3111659 3058775 3010182 2965360 2923113 2882093
59547B882093m0947m2168m4631m7222m8743m9471n0403n1288n1016m9713m8671
$$ 2882093 2841146 2798978 2754347 2707125 2658382 2608911 2558508 2507220 2456204 2406491 2357820
59536B357820m8098m6800m4395m1977m0080l7741l4242l0173k6092k1717j7197
$$ 2357820 2309722 2262922 2218527 2176550 2136470 2098729 2064487 2034314 2008222 1986505 1969308
59525A969308j3616j1329r192o311l218m87K390N757Q757J0648J1955J3342J4484
$$ 1969308 1955692 1944363 1935171 1928860 1925642 1925155 1927545 1933302 1942059 1952707 1964662 1978004 1992488
59512A992488J5081J5806J7161J8513J9340K0305K2050K4051K5855K8304L2213
$$ 1992488 2007569 2023375 2040536 2059049 2078389 2098694 2120744 2144795 2170650 2198954 2231167
59501B231167L6828M0972M4849M9331N4317N9215O4361P0434P7090Q3560R0154
$$ 2231167 2267995 2308967 2353816 2403147 2457464 2516679 2581040 2651474 2728564 2812124 2902278
59490B902278R7630J05482J12323J17833J22927J27945J32013J34326J35038J34560
$$ 2902278 2999908 3105390 3217713 3335546 3458473 3586418 3718431 3852757 3987795 4122355
59480D122355J32759J29146J23406J15716J06790R7368Q7288P5568O1876M7458
$$ 4122355 4255114 4384260 4507666 4623382 4730172 4827540 4914828 4990396 5052272 5099730
59470E099730L3995K2028J1184J489o398j1974j5250j6396j5449j2214o229K725
$$ 5099730 5133725 5155753 5166937 5168426 5162028 5150054 5134804 5118408 5102959 5090745 5084516 5087241
59458E087241J3881K5798L7595M9175O0063O8952P4777P7176P5439O8183N4857
$$ 5087241 5101122 5126920 5164515 5213690 5273753 5342705 5417482 5494658 5570097 5638280 5693137
59447E693137L6584J4764j0119l7419o5307r1958j16865j39727j58977j72850
$$ 5693137 5729721 5744485 5734366 5696947 5631640 5539682 5422817 5283090 5124113 4951263
59437D951263j81284j85480j85990j82551j75461j65813j54513j42078j29171
$$ 4951263 4769979 4584499 4398509 4215958 4040497 3874684 3720171 3578093 3448922
59428C448922j16376j03635r0691p7933o6036n5108m4815l4975k5406j5742o046
$$ 3448922 3332546 3228911 3138220 3060287 2994251 2939143 2894328 2859353 2833947 2818205 2812159
59417B812159L083J1655K0743L0910M1022M9643N6951O4189P1812P9274Q6059
$$ 2812159 2815242 2826897 2847640 2878550 2919572 2969215 3026166 3090355 3162167 3241441 3327500
59406C327500R1855R6158R8605R9130R7066R0996Q0576O7474N3235L7174J7941
$$ 3327500 3419355 3515513 3614118 3713248 3810314 3901310 3981886 4049360 4102595 4139769 4157710
59395D157710l630k5025m4837o3301q0356r5052j06865j16026j22495j25992j27046
$$ 4157710 4154080 4129055 4084218 4020917 3940561 3845509 3738644 3622618 3500123 3374131 3247085
59384C247085j26631j24786j20908j15386j09520j03757r7416r0363q3572p7693
$$ 3247085 3120454 2995668 2874760 2759374 2649854 2546097 2448681 2358318 2274746 2197053
59374B197053p2117o5919n8855n1358m4275l8592l4504l0887k6589k2008j8331
$$ 2197053 2124936 2059017 2000162 1948804 1904529 1865937 1831433 1800546 1773957 1751949 1733618
59363A733618j5524j2405q593m986k193K66K937N787Q732J1855J4901J7557K0150
$$ 1733618 1718094 1705689 1697096 1692110 1689917 1690183 1693120 1698907 1707639 1719494 1734395 1751952 1772102
59350A772102K2960K4864K4024K0336J6047J3632J3839J6007J9245K2940K6999
$$ 1772102 1795062 1819926 1843950 1864286 1880333 1893965 1907804 1923811 1943056 1965996 1992995
59339A992995L1885L7787M3651M7770M9517M9785M9903N0884N3521N8148O4169
$$ 1992995 2024880 2062667 2106318 2154088 2203605 2253390 2303293 2354177 2407698 2465846 2530015
59328B530015P0704P7710Q5714R4646J03916J13518J24039J35627J47939J61000
$$ 2530015 2600719 2678429 2764143 2858789 2962705 3076223 3200262 3335889 3483828 3644828
59318C644828J75077J89851K04783K20106K36371K53143K69225K83927K96883
$$ 3644828 3819905 4009756 4214539 4434645 4671016 4924159 5193384 5477311 5774194
59309E774194L06882L12388L13096L09598L01733K88958K72286K54050K35444
$$ 5774194 6081076 6393464 6706560 7016158 7317891 7606849 7879135 8133185 8368629
59300H368629K16122J96422J78069J61902J46676J30962J14737R8125Q0104N9571
$$ 8368629 8584751 8781173 8959242 9121144 9267820 9398782 9513519 9611644 9691748 9751319
59290I751319L6601J1678j5251m4047p3667j03097j32009j59771j84797k05891
$$ 9751319 9787920 9799598 9784347 9740300 9666633 9563536 9431527 9271756 9086959 8881068
59280H881068k23370k38035k49842k58454k64213k67523k68003k65162k59483
$$ 8881068 8657698 8419663 8169821 7911367 7647154 7379631 7111628 6846466 6586983
59271F586983k51963k43111k33100k22415k11544k00430j88854j76977j65009
$$ 6586983 6335020 6091909 5858809 5636394 5424850 5224420 5035566 4858589 4693580
59262D693580j52836j40496j28605j17744j07853r8557q9622q0823p2013o3619
$$ 4693580 4540744 4400248 4271643 4153899 4046046 3947489 3857867 3777044 3705031 3641412
59252C641412n6409n0335m4369l7856l1364k5643k0543j5569j0777o460k450J557
$$ 3641412 3585003 3534668 3490299 3452443 3421079 3395436 3374893 3359324 3348547 3342087 3339637 3341194
59240C341194N363Q514J0861J2476J3493J4247J5119J5834J5535J3957J1923J0325
$$ 3341194 3346557 3355071 3365932 3378408 3391901 3406148 3421267 3437101 3452636 3466593 3478516 3488841
59228C488841R193Q213P412O818O020M827L850L870M897O379P988R710J1365J2658
$$ 3488841 3498034 3506247 3513659 3520477 3526497 3531324 3535174 3539044 3543941 3550320 3558308 3568018 3579383 3592041
59214C592041J3467J3895J4004J3660J2465R816N372o19p799j6266k6083l6328
$$ 3592041 3605508 3619403 3633407 3647067 3659532 3669348 3674720 3674101 3666302 3650036 3623953 3587625
59202C587625m5500n2940n9165o4663o9060p1722p2443p1304o8358o3707n7624
$$ 3587625 3542125 3489185 3430020 3365357 3296297 3224575 3152132 3080828 3012470 2948763 2891139
59191B891139n0764m4696m1638m2448m5089m6271m4660m1403l7606l2959k7200
$$ 2891139 2840375 2795679 2754041 2711593 2666504 2620233 2575573 2534170 2496564 2463605 2436405
59180B436405k1239j5817j0232l429M451J2482K0211K7777L5355M3126N1356N9972
$$ 2436405 2415166 2399349 2389117 2385688 2390139 2402621 2422832 2450609 2485964 2529090 2580446 2640418
59168B640418O8600P7334Q6830R7292J08177J19227J30981J43745J56923J69776
$$ 2640418 2709018 2786352 2873182 2970474 3078651 3197878 3328859 3472604 3629527 3799303
59158C799303J82022J93169K02146K08237K11475K11462K06600J95338J77618
$$ 3799303 3981325 4174494 4376640 4584877 4796352 5007814 5214414 5409752 5587370
59149E587370J54391J26385R4216N9157K2975j2830m7058p8414j05505j27124
$$ 5587370 5741761 5868146 5962362 6021519 6044494 6031664 5984606 5906192 5800687 5673563
59139E673563j42464j51499j55207j54779j50625j42898j32891j22663j13057
$$ 5673563 5531099 5379600 5224393 5069614 4918989 4776091 4643200 4520537 4407480
59130D407480j03360r3443q4857p8932p4999p1510o8098o5438o3804o2896o2586
$$ 4407480 4304120 4210677 4125820 4046888 3971889 3900379 3832281 3766843 3703039 3640143 3577557
59119C577557o2780o2905o2367o1363o0515n9943n9230n8057n6416n4444n2427
$$ 3577557 3514777 3451872 3389505 3328142 3267627 3207684 3148454 3090397 3033981 2979537 2927110
59108B927110n0563m8428m5285m1206l7253l4169l1541k8648k5516k2499j9497
$$ 2927110 2876547 2828119 2782834 2741628 2704375 2670206 2638665 2610017 2584501 2562002 2542505
59097B542505j6193j2659r167n809k609L04L008N788Q680J1510J4364J7372K0031
$$ 2542505 2526312 2513653 2504486 2498677 2496068 2496372 2499380 2505168 2513848 2525358 2539722 2557094 2577125
59084B577125K1568K2174K2838K3859K4502K4338K3767K2913K1171J8357J5222
$$ 2577125 2598693 2620867 2643705 2667564 2692066 2716404 2740171 2763084 2784255 2802612 2817834
59073B817834J2235Q919M909O43l462p419j0854j3009j4055j5157j6577j7111
$$ 2817834 2830069 2838988 2843897 2844540 2841078 2833659 2822805 2809796 2795741 2780584 2764007 2746896
59061B746896j6071j4410j2976j1160q340n282k819l58K935O546R503J1926J4341
$$ 2746896 2730825 2716415 2703439 2692279 2683939 2678657 2675838 2675480 2678415 2684961 2694464 2706390 2720731
59048B720731J6413J7688J8792K0534K2578K4303K6230K9168L2705L5899L8847
$$ 2720731 2737144 2754832 2773624 2794158 2816736 2841039 2867269 2896437 2929142 2965041 3003888
59037C003888M2076M4858M5595M3572L9000L1682K0993P153q683k5506m2727n9518
$$ 3003888 3045964 3090822 3136417 3179989 3218989 3250671 3271664 3278817 3270134 3244628 3201901 3142383
59025C142383p4833q7926r8198j04958j08121j08730j08041j06333j03323r9063
$$ 3142383 3067550 2979624 2881426 2776468 2668347 2559617 2451576 2345243 2241920 2142857
59015B142857r3809q7641q0987p4837o9616o4581n9171n4068m9944m6065m1462
$$ 2142857 2049048 1961407 1880420 1805583 1735967 1671386 1612215 1558147 1508203 1462138 1420676
59004A420676l6698l3124l0861k8789k6181k3200k0140j7198j4695j2692j0761
$$ 1420676 1383978 1350854 1319993 1291204 1265023 1241823 1221683 1204485 1189790 1177098 1166337
58993A166337q921q028q402q857q243p131o738o872o279m493k036P00L555O069
$$ 1166337 1157416 1149388 1140986 1132129 1123886 1116755 1110017 1103145 1096866 1092373 1090337 1091037 1094592 1100661
58979A100661Q063J0276J3203J5831J6710J5819J4163J2123R488O648M342K542
$$ 1100661 1108724 1119000 1132203 1148034 1164744 1180563 1194726 1206849 1216337 1222985 1227327 1229869
58967A229869Q86k50l59n5m10j334j873j721j260n61M40J213J342J385J791J687
$$ 1229869 1230755 1230505 1230146 1230091 1229681 1228347 1226474 1224753 1223493 1222932 1223372 1224585 1225927 1227312 1229103 1230790
58951A230790K15j620k132j451j084j429j701k001l470o130q460r536j0070j1025
$$ 1230790 1231005 1229385 1227253 1225802 1224718 1223289 1221588 1219587 1216117 1209987 1201527 1191991 1181921 1170896
58937A170896j2478j4073j5397j5806j5019j3933j3598j3608j2767j1119r736
$$ 1170896 1158418 1144345 1128948 1113142 1098123 1084190 1070592 1056984 1044217 1033098 1023362
58926A023362q653o813m200k240j549r42O86K814M363N209N891O717P766R113
$$ 1023362 1014709 1007896 1003696 1001456 999907 998965 999651 1002465 1006828 1012037 1017928 1024645 1032411 1041524
58912A041524J0619J2040J3522J5406J7415J8793J9195J8913J8303J7645J7334
$$ 1041524 1052143 1064183 1077705 1093111 1110526 1129319 1148514 1167427 1185730 1203375 1220709
58901A220709J7448J7316J6323J4971J4389J4995J6313J7740J8834J9366J9803
$$ 1220709 1238157 1255473 1271796 1286767 1301156 1316151 1332464 1350204 1369038 1388404 1408207
58890A408207K1142K3448K5381K5978K5989K6454K7033K7175K7760K9836L2627
$$ 1408207 1429349 1452797 1478178 1504156 1530145 1556599 1583632 1610807 1638567 1668403 1701030
58879A701030L4671L6228L8600M1715M4450M6875N0080N4058N7820O1385O5627
$$ 1701030 1735701 1771929 1810529 1852244 1896694 1943569 1993649 2047707 2105527 2166912 2232539
58868B232539P0325P4439P8276Q3200Q9231R5085J00741J07674J16344J25587
$$ 2232539 2302864 2377303 2455579 2538779 2628010 2723095 2823836 2931510 3047854 3173441
58858C173441J34927J45268J56814J68391J79598J91637K05271K19714K34181
$$ 3173441 3308368 3453636 3610450 3778841 3958439 4150076 4355347 4575061 4809242
58849D809242K48785K63221K76324K87717K98178L07604L14120L15976L12862
$$ 4809242 5058027 5321248 5597572 5885289 6183467 6491071 6805191 7121167 7434029
58840G434029L04579K89966K67924K38269K00961J55980J04692N0028n353n9922
$$ 7434029 7738608 8028574 8296498 8534767 8735728 8891708 8996400 9046428 9041075 8981153
58830H981153j12038j59426k00532k34969k62252k81605k93568l00075l02254
$$ 8981153 8869115 8709689 8509157 8274188 8011936 7730331 7436763 7136688 6834434
58821F834434k99672k92503k82680k72032k60673k48173k34888k21266k07182
$$ 6834434 6534762 6242259 5959579 5687547 5426874 5178701 4943813 4722547 4515365
58812D515365j92972j79876j68540j58207j48105j38507j29684j21092j12456
$$ 4515365 4322393 4142517 3973977 3815770 3667665 3529158 3399474 3278382 3165926
58803C165926j04524r7891r2135q6789q2098p8145p4225o9747o4834n9611n3926
$$ 3165926 3061402 2963511 2871376 2784587 2702489 2624344 2550119 2480372 2415538 2355927 2302001
58792B302001m8182m3188l8827l4039k8611k3625j9703j6123j2115p811l410J296
$$ 2302001 2253819 2210631 2171804 2137765 2109154 2085529 2065826 2049703 2037588 2029777 2026367 2027663
58780B027663O096J0343J4026J7663K1015K3490K5867K9774L5145M0223M4435
$$ 2027663 2033759 2044102 2058128 2075791 2096806 2120296 2146163 2175937 2211082 2251305 2295740
58769B295740M9156N4987O0597O5236P0194P6448Q2931Q8498R3883J00236J07362
$$ 2295740 2344896 2399883 2460480 2525716 2595910 2672358 2755289 2843787 2937670 3037906 3145268
58758C145268J14787J23076J32691J42898J53087J63866J75678J87785J99802
$$ 3145268 3260055 3383131 3515822 3658720 3811807 3975673 4151351 4339136 4538938
58749D538938K12746K27219K41956K55541K68134K80053K89954K96030K97932
$$ 4538938 4751684 4978903 5220859 5476400 5744534 6024587 6314541 6610571 6908503
58740F908503K95985K89377K76506K56364K28569J92955J50233J02164N0382m028
$$ 6908503 7204488 7493865 7770371 8026735 8255304 8448259 8598492 8700656 8751038 8747010
58730H747010n9077j11512j58878k00613k36352k64806k85404k99358l07728l10069
$$ 8747010 8687933 8576421 8417543 8216930 7980578 7715772 7430368 7131010 6823282 6513213
58720F513213l06379k98806k89651k79014k66119k51710k37436k23895k10905
$$ 6513213 6206834 5908028 5618377 5339363 5073244 4821534 4584098 4360203 4149298
58711D149298j98757j87618j76643j65216j54263j44834j36244j27091j17340
$$ 4149298 3950541 3762923 3586280 3421064 3266801 3121967 2985723 2858632 2741292
58702B741292j08010r9536r1731q4632p8161p1653o4850n8543n3215m8015m2086
$$ 2741292 2633282 2533746 2442015 2357383 2279222 2207569 2142719 2084176 2030961 1982946 1940860
58691A940860l5910l0318k5235k0412j6207j2525q310l254J307M415O941R709
$$ 1940860 1904950 1874632 1849397 1828985 1812778 1800253 1791943 1788689 1789996 1794411 1801352 1811061
58679A811061J1626J1212Q578M337j928j0207j8440k4308k7865l0621l3062l4785
$$ 1811061 1822687 1833899 1842477 1846814 1844886 1834679 1816239 1791931 1764066 1733445 1700383 1665598
58667A665598l6075l7390l8130l7719l7111l7555l8636l9181l9271l9563l9543
$$ 1665598 1629523 1592133 1554003 1516284 1479173 1441618 1402982 1363801 1324530 1284967 1245424
58656A245424l8324l6504l5396l4914l3907l2097l0094k8057k5813k3734k2098
$$ 1245424 1207100 1170596 1135200 1100286 1066379 1034282 1004188 976131 950318 926584 904486
58645I04486k0257j7789j5647j4746j4280j2991j1242j0186r807r381r054r257
$$ 904486 884229 866440 850793 836047 821767 808776 797534 787348 777541 768160 759106 749849
58633G49849r348q618p776p807q105p492o210n135l892j703O81J871K131K782
$$ 749849 740501 731883 724107 716300 708195 700703 694493 689358 685466 683763 684444 686315 688446 691228
58619F91228L939M737N225O108P022P049O618P028Q365R574J0247J0666J0546
$$ 691228 695167 699904 705129 711237 718259 725308 731926 738954 747319 756893 767140 777806 788352
58606G88352R455Q110P461O875N001K109k32j506k615m117n736p393r212j0651
$$ 788352 797807 805917 813378 820253 825254 827363 827131 825625 823010 818893 813157 805764 796552 785901
58592G85901j1109j1035j1217j1310j0479q910p333n691l684j920r04L69L054
$$ 785901 774792 763757 752540 741230 730751 721841 714508 708817 705133 703213 702309 702678 705732
58579G05732O327Q326Q731Q735R008R357R895J0937J2060J2802J3677J5266J7048
$$ 705732 712059 720385 729116 737851 746859 756216 766111 777048 789108 801910 815587 830853 847901
58566H47901J8516K0417K3309K6056K7590K9015L1920L5647L8477M0668M3878
$$ 847901 866417 886834 910143 936199 963789 992804 1024724 1060371 1098848 1139516 1183394
58555A183394M8325N2805N7038O1662O6343P0193P3651P7890Q2586Q6297Q8591
$$ 1183394 1231719 1284524 1341562 1403224 1469567 1539760 1613411 1691301 1773887 1860184 1948775
58544A948775Q9860Q9555Q6675Q1442P4473O4984N1894L6135J9596K647j4977
$$ 1948775 2038635 2128190 2214865 2296307 2370780 2435764 2487658 2523793 2543389 2546036 2531059
58533B531059l1580m4590n3866o1347o7733p1967p3736p3832p2195o8039o1965
$$ 2531059 2499479 2454889 2401023 2339676 2271943 2199976 2126240 2052408 1980213 1912174 1850209
58522A850209n5626m9455m2855l6315l0978k6428k1303j5818j1240p345k907J614
$$ 1850209 1794583 1745128 1702273 1665958 1634980 1608552 1587249 1571431 1560191 1552846 1549939 1551553
58510A551553M669O657R563J3647J7266J9912K2599K5058K5301K2303J6555P975
$$ 1551553 1556222 1562879 1572442 1586089 1603355 1623267 1645866 1670924 1696225 1718528 1735083 1743058
58498A743058m004j8019l1132m1980n1153n8435o2490o3502o3274o2353n9658
$$ 1743058 1739054 1721035 1689903 1647923 1596770 1538335 1475845 1412343 1349069 1286716 1227058
58487A227058n5381n1403m8327m4796m0301l6106l2703k8986k4679k1162j9144
$$ 1227058 1171677 1120274 1071947 1027151 986850 950744 918041 889055 864376 843214 824070
58476H24070j7670j6050j4662j3446j1726r797q616p887o672n663o262p577p253
$$ 824070 806400 790350 775688 762242 750516 740719 732103 724216 717544 711881 705619 698042 690789
58463F90789n234l736l380k662j423j391k648k957j568m55p26q97J12J281J907
$$ 690789 685555 681819 678439 675777 674354 672963 670315 667358 665790 665335 664609 663712 663824 665105 667012
58448F67012K892M387M963M345M314N688P060P718R001J1493J3528J3980J4172
$$ 667012 669904 674291 679254 683599 687913 693601 700661 708379 717380 728873 742401 756381 770553
58435G70553J5530J7659J9888K2467K5101K6529K6705K7058K7604K6213K1943
$$ 770553 786083 803742 823630 846097 871198 897727 924432 951490 979094 1005307 1027250
58424A027250J6682J2227Q077L328j486n823j0357j5492k0383k4351k7512k9542
$$ 1027250 1043932 1056159 1064236 1067564 1066078 1060255 1049898 1034406 1014023 989672 962160 932618
58412I32618k9750k8803k8220k7875k6342k3800k1870k0437j7745j4021j1691
$$ 932618 902868 874065 845845 817970 791628 767828 745958 725521 707776 693755 682064
58401F82064j1297j0530q237o085n152m210k602j640j741j270L55J412J050P99
$$ 682064 670767 660237 652000 645915 640763 636553 633951 632311 630570 629300 629655 631067 632117 632916
58387F32916J603K313K391L089M631N297M647M598N959P047P051P568R309J0471
$$ 632916 634519 636832 639223 642312 646943 652240 656887 661485 667444 674491 681542 689110 698419 708890
58373G08890R960R096Q564O897L566M30j406l154n340o529o374o556p280o452
$$ 708890 718850 727946 736510 743407 746973 747403 745997 742843 737503 730974 724600 718044 710764 704312
58359G04312l853k234k654k639q57N10K28O23L287O063P045P733R515J0672R865
$$ 704312 700459 698225 695571 692932 692075 692585 692813 693436 696723 702786 709831 717564 727079 737751 747616
58344G47616Q974R578R930Q351O263M991L026n88l563m079l925m937n690m727
$$ 747616 756590 766168 776098 784449 790712 795703 798729 798141 794578 790499 786574 781637 775947 771220
58330G71220l625l652k904o2K384K196J400K581M383M333L227K953K730J197l77
$$ 771220 767595 763943 761039 760977 763361 765557 766957 769538 773921 778254 781481 784434 787164 788361 787984
58315G87984m58k38r98j161O94K679K801K530L874N696O287O696Q156R167Q507
$$ 787984 787526 787288 786290 785129 785823 788502 791303 793833 797707 803403 809690 816386 824542 833709 842216
58300H42216Q126R627J0951J0117R112J0324J2286J2786J3022J4704J6109J5124
$$ 842216 850342 859969 870920 881037 890149 900473 912759 925545 938567 953271 969380 984504
58288I84504J3341J3051J2982J1068Q584P441O269L311M20QP60M40J30J637L494
$$ 984504 997845 1010896 1023878 1034946 1043530 1050971 1057240 1060551 1060971 1060979 1061739 1062179 1062309 1063946 1067440
58273A067440L736L852N858Q300R166R780J1842J3667J3511J3366J5260J7196
$$ 1067440 1071176 1075028 1080886 1089186 1098352 1108132 1119974 1133641 1147152 1160518 1175778 1192974
58261A192974J7005J6782J8973K1607K2037K1864K3368K4753K3789K2541K3383
$$ 1192974 1209979 1226761 1245734 1267341 1289378 1311242 1334610 1359363 1383152 1405693 1429076
58250A429076K4016K1633J8312J7022J6121J3263J0844J1773J3655J3065J1816
$$ 1429076 1453092 1474725 1493037 1510059 1526180 1539443 1550287 1562060 1575715 1588780 1600596
58239A600596J3016J4824J4404J4129J7278K1350K2412K2375K5091K8869K9952
$$ 1600596 1613612 1628436 1642840 1656969 1674247 1695597 1718009 1740384 1765475 1794344 1824296
58228A824296K9909L2481L6391L8429M0217M4773M9868N2043N3580N8162O3446
$$ 1824296 1854205 1886686 1923077 1961506 2001723 2046496 2096364 2148407 2201987 2260149 2323595
58217B323595O5563O6993P1982P8108Q0619Q1125Q3436Q4885Q0706P3182O7209
$$ 2323595 2389158 2456151 2528133 2606241 2686860 2767985 2851421 2936306 3017012 3090194 3157403
58206C157403O0861M9899L7786L1112K8632K4997K1735K4057L0143L4429L8304
$$ 3157403 3218264 3268163 3305949 3337061 3365693 3390690 3412425 3436482 3466625 3501054 3539358
58195C539358M6651N6971O3228O7398P5851Q7222R5476J01969J12599J26001J36788
$$ 3539358 3586009 3642980 3706208 3773606 3849457 3936679 4032155 4134124 4246723 4372724 4509512
58184D509512J47321J63782J83695K00291K15988K38099K64376K86702L05861
$$ 4509512 4656833 4820615 5004310 5204601 5420589 5658688 5923064 6209766 6515627
58175F515627L28286L51611L68659L82548M02128M25713M45629M65403M94995
$$ 6515627 6843913 7195524 7564183 7946731 8348859 8774572 9220201 9685604 10180599
58166A0180599N32145N66552N99473O40167O86212P27611P67694Q18542Q78132
$$ 10180599 10712744 11279296 11878769 12518936 13205148 13932759 14700453 15518995 16397127
58157A6397127R34221R88695J054797J132646J212395J299118J407651J534517
$$ 16397127 17331348 18320043 19374840 20507486 21719881 23018999 24426650 25961167
58149B5961167J664138J802326J973656K186412K432094K718192L065660L474544
$$ 25961167 27625305 29427631 31401287 33587699 36019793 38737985 41803645 45278189
58141D5278189L931016M447704N053338N742822O487810P298224Q216554R249149
$$ 45278189 49209205 53656909 58710247 64453069 70940879 78239103 86455657 95704806
58133I5704806J0370769J1603451J3015317J4641336J6499396J8634178K0864229
$$ 95704806 106075575 117679026 130694343 145335679 161835075 180469253 201333482
58126B01333482K2313975K1455103J7086679R494726N38352p523360j3317277
$$ 201333482 223647457 245102560 262189239 271683965 272222317 264698957 251381680
58119B51381680j6681445j8144944j8357963j7862242j7033763j6046526j4923380
$$ 251381680 234700235 216555291 198197328 180335086 163301323 147254797 132331417
58112A32331417j3669527j2340117j0999368r688056q451061p344878o394705
$$ 132331417 118661890 106321773 95322405 85634349 77183288 69838410 63443705
58105F3443705n579175m872936m273319l773671l343771k955530k605159k295258
$$ 63443705 57864530 52991594 48718275 44944604 41600833 38645303 36040144 33744886
58097C3744886k016197j759931j533102j339865j165619r92564q19771o53567
$$ 33744886 31728689 29968758 28435656 27095791 25930172 24937608 24117837 23464270
58089B3464270m88721l15107j35569M0214K16313M07668O16939Q32660J054086
$$ 23464270 22975549 22660442 22524873 22565087 22781400 23189068 23806007 24638667 25692753
58080B5692753J297445J570532J870080K223498K685827L216053L551004L299912
$$ 25692753 26990198 28560730 30430810 32654308 35340135 38556188 42107192 45407104
58072D5407104K263517O65588r77581k225612k945470l241545l268663l145325
$$ 45407104 47670621 48336209 47358628 45133016 42187546 38946001 35677338 32532013
58064C2532013k960926k771254k581094k370507k139964j909795j689375j476145
$$ 32532013 29571087 26799833 24218739 21848232 19708268 17798473 16109098 14632953
58056A4632953j278126j110295r71638q48807p40076o54783n91258n35736m82792
$$ 14632953 13354827 12244532 11272894 10424087 9684011 9029228 8437970 7902234 7419442
58047G419442m38575m03895l71225l38914l12612k91698k68771k43141k21268
$$ 7419442 6980867 6576972 6205747 5866833 5554221 5262523 4993752 4750611 4529343
58038D529343k03467j83423j61221j43963j32987j22884j13567j10858j14318
$$ 4529343 4325876 4142453 3981232 3837269 3704282 3581398 3467831 3356973 3242655
58029C242655j16496j15395j16177j19428j19260j14526j10901j09902j06474
$$ 3242655 3126159 3010764 2894587 2775159 2655899 2541373 2430472 2320570 2214096
58020B214096r9371r3827r1721q8659q2985p8512p6205p2046o5249o0177n8038
$$ 2214096 2114725 2020898 1929177 1840518 1757533 1679021 1602816 1530770 1465521 1405344 1347306
58009A347306n4828m9338m5198m3327m0218l5418l2793l2818l1313k7438k5241
$$ 1347306 1292478 1243140 1197942 1154615 1114397 1078979 1046186 1013368 982055 954617 929376
57998I29376k5680k4848k1736k0124k0964k0570j8139j7463j9130j8689j4884
$$ 929376 903696 878848 857112 836988 816024 795454 777315 759852 740722 722033 707149
57987G07149j2300j3213j4033j2485j1340j2127j1918r320p437p837p600n218
$$ 707149 694849 681636 667603 655118 643778 631651 619733 610413 602976 595139 587539 582321
57975E82321l626m635n848n733o205p824p924n977n293p058q115o947o238p176
$$ 582321 578695 574060 568212 562479 556274 548450 540526 534549 529256 522198 514083 507136 500898 493722
57961D93722o907m268k436l060l192r94Q40L38j71J217K571K438K862N075O752
$$ 493722 486815 482547 480111 477051 473859 472865 473705 474043 473872 475089 477660 480098 482960 488035 494787
57946D94787O525O802R141J1320J1775J2516J4678J5645J3649J1040R877Q409
$$ 494787 501312 508114 517255 528575 540350 552866 567544 583189 596838 607878 617755 626164
57934F26164N021J583k63k221n655q595r530j0419j2826j4673j4096j2959j3359
$$ 626164 631185 632768 632505 630284 624629 616034 606504 596085 583259 568586 554490 541531 528172
57921E28172j3942j2939j1564j1271j0694q459o158n540n492m561l713l890l682
$$ 528172 514230 501291 489727 478456 467762 459303 453145 447605 442113 437552 433839 429949 426267
57908D26267k023l78J81J095L055L915K524J347K373L637K785J037L93j11k030
$$ 426267 424244 423866 424047 425142 428197 432112 434636 435983 438356 441993 444778 445815 446208 446097 444067
57893D44067m114m655m755n965p009o123m474m056m163l130j632j208j190m9J802
$$ 444067 439953 435298 430543 424578 417569 411446 406972 402916 398753 395623 393991 392783 391593 391544 393346
57878C93346L164M384O107P443P692Q011R084R240P242M857M029L696J960o06
$$ 393346 396510 400894 407001 414444 422136 430147 439231 448471 455713 460570 464599 468295 470255 469649
57864D69649k596m559p389r816j0436j0393j1244j1988j1126r887j0237j1234
$$ 469649 467053 462494 455105 445289 434853 424460 413216 401228 390102 380215 369978 358744
57852C58744j0570q501p134o827o275n283m645m039k645j255j281k293k745k458
$$ 358744 348174 339673 332539 325712 319437 314154 309509 305470 302825 301570 300289 297996 295251 292793
57838B92793k314k265j632p49l12J27J293K629L244L502M115M681M602M356M400
$$ 292793 290479 288214 286582 285833 285521 285648 286941 289570 292814 296316 300431 305112 309714 314070 318470
57823C18470M136L301K872L192K917J344p0k07k92j481k590k407k197l402m708
$$ 318470 322606 325907 328779 331971 334888 336232 336162 335955 335663 334182 331592 329185 326988 323586 318878
57808C18878m161k538j866k016j479l07M59J114K453L621L469K975L740N055N080
$$ 318878 314717 312179 310313 308297 306818 306511 306970 308084 310537 314158 317627 320602 324342 329397 334477
57793C34477M075L831M597N156N215N319M995L458J551O56L15q03k280k723k468
$$ 334477 338552 342383 346980 352136 357351 362670 367665 371123 372674 373330 373645 372842 370562 367839 365371
57778C65371l047m423n151m915m612m277l195j724r51p84m30k34j044k142j981
$$ 365371 362324 357901 352750 347835 343223 338946 335751 334027 333076 332292 331862 331628 330584 328442 326461
57763C26461o16N24Q65P79O0j577l066l129k468k665l533l672l178l377m238m425
$$ 326461 325845 326369 327234 328013 328073 326496 323430 320301 317833 315168 311635 307963 304785 301408 297170 292745
57747B92745l863l881m749n203m623l760l131k437j661j146o28L00J056R90R16
$$ 292745 288882 285001 280252 275049 270426 266666 263535 261098 259437 258291 257663 257963 259019 260009 260925
57732B60925K049L849M832M976N447O281O567O540P332Q722R336Q986Q754Q741
$$ 260925 262974 266823 271655 276631 282078 288359 294926 301466 308798 317520 326856 335842 344596 353337
57718C53337P894O146M655L759K694J504J226J798J715K84j573l095m599o153
$$ 353337 361231 367377 372032 375791 378485 379989 381215 383013 384728 385012 383439 380344 375745 369592
57704C69592p041p067p009p265p286o705n903n288n027n442o538p230o393m473
$$ 369592 362551 355484 348475 341210 333924 327219 321316 316028 311001 305559 299021 291791 285398 280925
57690B80925k861j897q75K23N71M2n71p96p89n27KK09k30l91O26J970K198J534
$$ 280925 278064 276167 275292 275515 276086 276128 275557 274761 273972 273445 273447 273656 273426 273035 273661 275631 277829 279363
57672B79363J275J518J406J135J621K523K716K470L024M206M732M726N554P079
$$ 279363 280638 282156 283562 284697 286318 288841 291557 294027 297051 301257 305989 310715 316269 323348
57658C23348P516O398N344N352N594N483N759O724P414P317P287P886Q538Q897
$$ 323348 330864 337262 342606 347958 353552 359035 364794 371518 378932 386249 393536 401422 409960 418857
57644D18857R484J0370J0861J1021J1826J3268J4165J4387J5426J7910K0326K1265
$$ 418857 428341 438711 449572 460593 472419 485687 499852 514239 529665 547575 567901 589166
57632E89166K1363K2001K3505K5542K7981L0512L2632L4798L8328M3422M8549
$$ 589166 610529 632530 656035 681577 709558 740070 772702 807500 845828 889250 937799
57621I37799N2606N6404O1276O7298P3779Q0353Q6823R2839R8349J03559J08003
$$ 937799 990405 1046809 1108085 1175383 1249162 1329515 1416338 1509177 1607526 1711085 1819088
57610A819088J10647J11207J10098J06925J00298Q9475P4563N4887K9081k065
$$ 1819088 1929735 2040942 2151040 2257965 2358263 2447738 2522301 2577188 2606269 2604204
57600B604204l4400o3139q5754j01650j10745j13778j12787j09720j05041r8487
$$ 2604204 2569804 2506665 2420911 2319261 2208516 2094738 1981951 1872231 1767190 1668703
57590A668703r0509q2090p3883o6194n9225n2740m6254l9937l4555l0187k5968
$$ 1668703 1578194 1496104 1422221 1356027 1296802 1244062 1197808 1157871 1123316 1093129 1067161
57579A067161k1556j7693j4815j2209r154n899k800M41L965P121R375J1111J2879
$$ 1067161 1045605 1027912 1013097 1000888 991734 985835 983035 983476 987441 994562 1003937 1015048 1027927
57566A027927J4745J6837J9710K3493K7465L1042L4486L8205M2064M5779M9349
$$ 1027927 1042672 1059509 1079219 1102712 1130177 1161219 1195705 1233910 1275974 1321753 1371102
57555A371102N2762N5960N9158O2275O4197O3641O0767N6624N0962M2185K9812
$$ 1371102 1423864 1479824 1538982 1601257 1665454 1729095 1789862 1846486 1897448 1939633 1969445
57544A969445J5451Q57j3449k7181l9439m9662n8105o4693o8704p0204p0382o9744
$$ 1969445 1984896 1985753 1972304 1945123 1905684 1856022 1797917 1733224 1664520 1594316 1523934 1454190
57532A454190o7503o3564n9546n6735n4390n1272m7586m4213m1100l7752l4446
$$ 1454190 1386687 1323123 1263577 1206842 1152452 1101180 1053594 1009381 968281 930529 896083
57521H96083l1679k9140k6309k3505k1435k0141j9163j8080j6505j4264j2053
$$ 896083 864404 835264 808955 785450 764015 743874 724711 706631 690126 675862 663809
57510F63809j0947j0813j0280q733p107o136n254m023l180l203l195k309j144
$$ 663809 652862 642049 631769 623036 615929 609793 604539 600516 597336 594133 590938 588629 587485
57497E87485n40j20P73J724K163K672M065N922P182P577P424O831O120O256P691
$$ 587485 586945 586825 587598 589322 591485 594157 598222 604144 611326 618903 626327 633158 639278 645534 653225
57482F53225R484J0536J0995J1577J2378J3285J4628J6369J7632J8105J8912K0990
$$ 653225 662709 673245 684240 695817 708195 721480 736108 752477 770109 788214 807126 828116
57470H28116K3564K5415K6711K8234K9913L1460L3568L6867M0444M3033M4972
$$ 828116 851680 877095 903806 932040 961953 993413 1026981 1063848 1104292 1147325 1192297
57459A192297M7448N0300N2217N2649N1963M9977M5896L9700L2157K3530J3492
$$ 1192297 1239745 1290045 1342262 1394911 1446874 1496851 1542747 1582447 1614604 1638134 1651626
57448A651626K375q646j8593k7119l3976l8997m2429m4617m5600m5574m5102m4192
$$ 1651626 1654001 1645355 1626762 1599643 1565667 1526670 1484241 1439624 1394024 1348450 1303348 1259156
57436A259156m1973l8210l4343l1795l0049k7617k4316k1152j8513j5895j3183
$$ 1259156 1217183 1178973 1144630 1112835 1082786 1055169 1030853 1009701 991188 975293 962110
57425I62110j0822q873p016n262l710j952K96K470M025N484P491R575J1048J2416
$$ 962110 951288 942415 935399 930137 926427 924475 924771 927241 931266 936750 944241 953816 964864 977280
57411I77280J4478J6743J8295J9628K1945K5095K7960L0466L3441L6661L9058
$$ 977280 991758 1008501 1026796 1046424 1068369 1093464 1121424 1151890 1185331 1221992 1261050
57400A261050M0798M3253M6639M9451N0543N0156M8578M5395M0462L4154K6284
$$ 1261050 1301848 1345101 1391740 1441191 1491734 1541890 1590468 1635863 1676325 1710479 1736763
57389A736763J6245M647o623j6444k5252l3422m0310m5424m9074n1297n1503m9858
$$ 1736763 1753008 1757655 1751032 1734588 1709336 1675914 1635604 1590180 1541106 1489809 1438306 1388448
57377A388448m7751m6032m4024m0987l7467l4289l1374k8437k5940k4279k2798
$$ 1388448 1340697 1294665 1250641 1209654 1172187 1137898 1106524 1078087 1052147 1027868 1005070
57366A005070k0599j7790j5116j2931j1242j0195r692q988p485n630m359l886
$$ 1005070 984471 966681 951565 938634 927392 917197 907505 898517 891032 885402 881043 877157
57354H77157l629l071k137r67K07J041J377J465J644J947K218K471K844L391L999
$$ 877157 873528 870457 868320 867353 867560 868601 869978 871443 873087 875034 877252 879723 882567 885958 889957
57339H89957M490M781M966N202N435N480N484N838O424O532N995N751O561P711
$$ 889957 894447 899228 904194 909396 914831 920311 925795 931633 938057 944589 950584 956335 962896 970607
57325I70607Q018P614P645Q406R032R003Q726Q476P933P119O735P065P449P306
$$ 970607 978625 986239 993884 1002290 1011322 1020325 1029051 1037527 1045460 1052579 1059314 1066379 1073828 1081134
57311A081134O947O884O999O906O584O241N974N909O230O833P361P666P918Q184
$$ 1081134 1088081 1094965 1101964 1108870 1115454 1121695 1127669 1133578 1139808 1146641 1154002 1161668 1169586 1177770
57297A177770Q413Q770R413R982J0015R837J0226J1178J1807J1655J1303J1396
$$ 1177770 1186183 1194953 1204366 1214348 1224363 1234200 1244426 1255604 1267411 1279066 1290369 1301765
57285A301765J1837J2215J2375J2316J2133J2246J3035J4144J4801J4968J5420
$$ 1301765 1313602 1325817 1338192 1350508 1362641 1374887 1387922 1402066 1416867 1431835 1447255
57274A447255J6527J7774J8702J9475K0213K0645K0809K1301K2338K3242K3359
$$ 1447255 1463782 1481556 1500258 1519733 1539946 1560591 1581400 1602701 1625039 1648281 1671640
57263A671640K2930K2600K2610K2832K3104K3148K2707K2080K1992K2617K3233
$$ 1671640 1694570 1717170 1739780 1762612 1785716 1808864 1831571 1853651 1875643 1898260 1921493
57252A921493K3111K2288K1276K0648K0987K2585K4758K6193K6292K5674K5168
$$ 1921493 1944604 1966892 1988168 2008816 2029803 2052388 2077146 2103339 2129631 2155305 2180473
57241B180473K4949K4959K5338K6025K6586K6866K7226K7781K8126K8214K8673
$$ 2180473 2205422 2230381 2255719 2281744 2308330 2335196 2362422 2390203 2418329 2446543 2475216
57230B475216K9737L0629L0697L0500L0899L1655L1766L0979L0104K9856L0015
$$ 2475216 2504953 2535582 2566279 2596779 2627678 2659333 2691099 2722078 2752182 2782038 2812053
57219B812053K9753K8502K6469K4461K3111K2186K0970J9254J7500J5936J4174
$$ 2812053 2841806 2870308 2896777 2921238 2944349 2966535 2987505 3006759 3024259 3040195 3054369
57208C054369J1997R913Q495P677P194P197P889Q852R406R493R734J0577J1731
$$ 3054369 3066366 3076279 3084774 3092451 3099645 3106842 3114731 3123583 3132989 3142482 3152216 3162793 3174524
57195C174524J2516J2668J2659J3136J3998J4398J3888J3119J2937J3188J3214
$$ 3174524 3187040 3199708 3212367 3225503 3239501 3253899 3267787 3280906 3293843 3307031 3320245
57184C320245J3159J3798J5119J6217J6688J7129J8005J9021K0052K1644K4013
$$ 3320245 3333404 3347202 3362321 3378538 3395226 3412355 3430360 3449381 3469433 3491077 3515090
57173C515090K6346K7738K8219K8301K8139K7698K7117K6274K4548K1595J7976
$$ 3515090 3541436 3569174 3597393 3625694 3653833 3681531 3708648 3734922 3759470 3781065 3799041
57162C799041J4551J1615R093P051N503M111K518P60q97k172k740k453j741j208
$$ 3799041 3813592 3825207 3834300 3841351 3846854 3850965 3853483 3854243 3853346 3851174 3848434 3845981 3844240 3843032
57148C843032p72J37J521K852M300O767J0254J3305J4759J5041J4988J4434J2980
$$ 3843032 3842260 3842397 3843918 3846770 3851070 3857837 3868091 3881396 3896155 3911196 3926184 3940618 3953598
57135C953598J1289J0458J0519J0676J0621J0730J1207J1877J2587J3134J3092
$$ 3953598 3964887 3975345 3985864 3996540 4007161 4017891 4029098 4040975 4053562 4066696 4079788
57124D079788J2434J1935J2186J2521J1779R954Q298P858Q575R698J0459J0312
$$ 4079788 4092222 4104157 4116343 4128864 4140643 4150597 4158895 4166753 4175328 4185026 4195485 4205797
57112D205797R120P136M519J065l289q009j2474j6752k1374k6592l2233l8085
$$ 4205797 4214917 4222053 4226572 4227637 4224348 4216339 4203865 4187113 4165739 4139147 4106914 4068829
57100D068829m3922m9353n4004n7691o0076o0450n8291n3899m8192m2080l6247
$$ 4068829 4024907 3975554 3921550 3863859 3803783 3743333 3685042 3631143 3582951 3540871 3504624
57089C504624l1221k7388k5077k4711k6492k9827l3568l6913l9472m0420l8471
$$ 3504624 3473403 3446015 3420938 3396227 3369735 3339908 3306340 3269427 3229955 3189535 3151064
57078C151064l3168k5591j7375r639l253P35J539j007p076j7139l1065m7465o4565
$$ 3151064 3117896 3092305 3074930 3065291 3062038 3062773 3064312 3063305 3056229 3039090 3008025 2960560 2895995
57065B895995q1412r7840j13880j29721j45697j61817j77846j94212k12037k31747
$$ 2895995 2814583 2716743 2602863 2473142 2327445 2165628 1987782 1793570 1581533 1349786
57055A349786k52416k73139k94312B12985a28416l67953l97585m31634m70731
$$ 1349786 1097370 824231 529919 212985 -128416 -496369 -893954 -1325588 -1796319
57046a796319n15131n66011o25752o97141p82564q83596j000917j135332j290104
$$ -1796319 -2311450 -2877461 -3503213 -4200354 -4982918 -5866514 -6867431 -8002763 -9292867
57037i292867j473078j696798j976477k326723k758178l275856l880416m570995
$$ -9292867 -10765945 -12462743 -14439220 -16765943 -19524121 -22799977 -26680393 -31251388
57029c1251388n346242o201685p124844q092533r072712j0022682j0864909j1438782
$$ -31251388 -36597630 -42799315 -49924159 -58016692 -67089404 -77112086 -87976995 -99415777
57021i9415777j1476953j0680037q893628o265204l224796k72512K261176M296903
$$ -99415777 -110892730 -121572767 -130466395 -136731599 -139956395 -140228907 -137967731 -133670828
57013a33670828N909219P186555Q171336Q880329R334696R561995R585341R421293
$$ -133670828 -127761609 -120575054 -112403718 -103523389 -94188693 -84626698 -75041357 -65620064
57005f5620064R086316Q602825Q000927P315710O581980N830700N089007M380080
$$ -65620064 -56533748 -47930923 -39929996 -32614286 -26032306 -20201606 -15112599 -10732519
56997a0732519L720576L119764a308996H06989J720931J394760J129201R15012
$$ -10732519 -7011943 -3892179 -1308996 806989 2527920 3922680 5051881 5966893
56989E966893P43500O05583M92565L98517L20415K55754K01145J53300J10465
$$ 5966893 6710393 7315976 7808541 8207058 8527473 8783227 8984372 9137672 9248137
56980I248137P2970M3042K3434J4806J4210J6435J6621J1514k62j7567l6720n3591
$$ 9248137 9321107 9364149 9387583 9402389 9416599 9433034 9449655 9461169 9460907 9443340 9406620 9353029
56968I353029o5997p3950p8121p9205p8370p7243p7122p8601q1814q6517r1967
$$ 9353029 9287032 9213082 9134961 9055756 8977386 8900143 8823021 8744420 8662606 8576089 8484122
56957H484122r7237j01735j05398j08772j12993j19278j27948j37985j47517j54570
$$ 8484122 8386885 8285150 8179752 8070980 7957987 7838709 7710761 7572776 7425259 7270689
56947G270689j57547j55801j49965j41453j31656j21852j13355j06823j01560
$$ 7270689 7113142 6957341 6807376 6665923 6534267 6412415 6299060 6192237 6090677
56938F090677r6392r1090q6192q1732p7197p2529o8038o3537n8661n3795m9418
$$ 6090677 5994285 5903195 5817003 5735271 5658074 5585545 5517507 5453970 5395309 5341514 5292096
56927E292096m5011l9963l4989l1037k8084k7813l6059n7639q7489j11916j22153
$$ 5292096 5247085 5207122 5172133 5141096 5113012 5085199 5049140 4991501 4904012 4792096 4669943
56916D669943j23913j30249j47127j69420j89035k02444k10452k15076k18200
$$ 4669943 4546030 4415781 4268654 4099234 3910199 3707755 3497303 3282227 3064027
56907C064027k20791k21598k17871k08154j93629j76527j58478j40454j23068
$$ 3064027 2843236 2621638 2403767 2195613 2001984 1825457 1666979 1526525 1403457
56898A403457j06393r0574p6759o6588o0477n7181n5077n3118n0672m7496m4028
$$ 1403457 1297064 1206490 1129731 1063143 1002666 945485 890408 837290 786618 739122 695094
56887F95094m0899l8024l4816l1203k7739k4730k1978j9296j6627j3742j0451
$$ 695094 654195 616171 581355 550152 522413 497683 475705 456409 439782 426040 415589
56876D15589p048m035j542N62K280L601M549M662L117m5l511o236q623j1322j3744
$$ 415589 408541 404506 402964 403526 405806 409407 413956 418618 421735 421690 418179 411943 403320 391998 378254
56861C78254j4844j4750j4312j3637j2387j1093j0703j1032j0955j0050q877p803
$$ 378254 363410 348660 334348 320711 308324 297231 286528 275496 264541 254491 245614 237811
56849B37811o761n996n767n458m244k628j916k134j869m00J350K404L055L998
$$ 237811 231050 225054 219287 213829 209585 206957 205041 202907 201038 200638 201988 204392 207447 211445
56835B11445N281O713Q469J0589J2480J3599J4238J5184J6779J8465J9043J7464
$$ 211445 216726 223439 231908 242497 254977 268576 282814 297998 314777 333242 352285 369749
56823C69749J3778R201M957J248k171m923o320o425o002n491m783l780k393k06
$$ 369749 383527 392728 397685 398933 396762 391839 385519 379094 373092 367601 362818 359038 356645 356439
56809C56439K933O181Q489J0080J2211J5507J9394K3154K6614K9637L1697L2042
$$ 356439 359372 365553 374042 384122 396333 411840 431234 454388 481002 510639 542336 574378
56797E74378K9769K4035J5090M941l865j0111j3938j5568j5090j3251j1069q639
$$ 574378 604147 628182 643272 648213 644348 634237 620299 604731 589641 576390 565321 556682
56785E56682n384j404K539O343J0656J5567K0521K5553L1324L7712M3809M9439
$$ 556682 551298 549894 552433 558776 569432 584999 605520 631073 662397 700109 743918 793357
56773G93357N4936N8638N6338M4746K5114K615j7276l1443l9464m2755m3313m2423
$$ 793357 848293 906931 963269 1008015 1033129 1035744 1018468 987025 947561 904806 861493 819070
56761H19070m0307l6923l2626k7820k2548j6726j0439l917K486Q291J3403J8510
$$ 819070 778763 741840 709214 681394 658846 642120 631681 627764 630250 638541 651944 670454
56749F70454K4427L1061L7308M1429M0941L3167J7775j327j8342l0190l7655m2183
$$ 670454 694881 725942 763250 804679 845620 878787 896562 895235 876893 846703 809048 766865
56737G66865m3620m1775l8182l4721l1577k7845k3444j9146j5251j1308o976k417
$$ 766865 723245 681470 643288 608567 576990 549145 525701 506555 491304 479996 473020 470603
56725D70603J950N692Q741J1734J5318J8694J9568J6114Q554j353j1509j9903
$$ 470603 472553 478245 486986 498720 514038 532732 552300 568414 576968 575615 564106 544203
56713E44203k5062k7028k7277k7012k6113k4276k2169k0608j9373j7828j6116
$$ 544203 519141 492113 464836 437824 411711 387435 365266 344658 325285 307457 291341
56702B91341j4709j3321j1370r279q153q241q568q269p474o700n979n006l820
$$ 291341 276632 263311 251941 242662 234509 226268 217700 209431 201957 195257 189278 184272 180452
56689A80452k914k682k884k882k456k107k368l034l494l533l278k664j655q14
$$ 180452 177538 174856 171972 169090 166634 164527 162159 159125 155631 152098 148820 146156 144501 143687
56675A43687q01j349j608j443j488j826j748j084p17j255k120k498k368k112j811
$$ 143687 142886 141537 139929 138486 136998 135172 133424 132340 131623 130368 128248 125750 123382 121270 119459
56660A19459j440j161r27m57P8K0q12j716k028j770j140k47M22J96p17j244q98
$$ 119459 118019 116858 115931 115474 115552 115572 114760 113044 111016 109246 108106 107859 108281 108477 107760 106516 105618
56643A05618l28p7J25L71P7q28j328p14L81J095J474J700J329L44j25O21J404
$$ 105618 105290 105213 105338 105709 105786 104958 103630 102916 103297 104392 105866 107566 108895 109239 109114 109735 111139
56626A11139P08r50j678q48L23P15N41M65N15K99k56p07m50O57J904K317J775
$$ 111139 111847 110897 109219 108371 108694 109409 109950 110415 110930 111229 110973 110266 109816 110473 112377 114694 116469
56609A16469J075P84O94O78J078J803J929J009j6o0O34J084J024Q97R39J112J496
$$ 116469 117544 118328 119022 119700 120778 122581 124510 125519 125503 125443 126077 127161 128185 129082 130021 131133 132629
56592A32629K035K271J961J453R57J24r67j372o17K85J78o48j177j284j454j571
$$ 132629 134664 136935 138896 140349 141306 141430 140463 139091 138474 138759 138937 138289 137112 135828 134374 132803
56576A32803j261r84j423k170k237j631j242j340j394j282j443j828j806j253
$$ 132803 131542 130558 129135 126965 124728 123097 121855 120515 119121 117839 116396 114568 112762 111509
56562A11509p51n13q0O84J202J040M84Rk79m25l92k21n6J01L43N72N71L78K96
$$ 111509 110758 110245 110165 110849 112051 113091 113575 113584 113305 112880 112488 112267 112211 112312 112655 113227 113798 114176 114472
56543A14472N79J201J812J873J140J09m00j58M19J057J769K198J764P43K39P07
$$ 114472 115051 116252 118064 119937 121077 121186 120786 120628 121047 122104 123873 126071 127835 128578 128817 129524
56527A29524J446J890K342K874K732J605M82L10P61J154J544J981J820Q69K74
$$ 129524 130970 132860 135202 138076 140808 142413 142895 143205 143966 145120 146664 148645 150465 151334 151608
56512A51608R70K166K578K358K424K716K589K308K652L449L885L917M054M237
$$ 151608 152578 154744 157322 159680 162104 164820 167409 169717 172369 175818 179703 183620 187674 191911
56498A91911M135M176M921N799N789M987M293L900L429L104L467M153M320L970
$$ 191911 196046 200222 205143 210942 216731 221718 226011 229911 233340 236444 239911 244064 248384 252354
56484B52354L580K850J245n67j277q20k90j94j64k51r60k043k677k884l447m442
$$ 252354 255934 258784 260029 259462 258185 257365 257075 256881 256717 256466 255506 253463 250786 247902 244455 240013
56468B40013n101n176n134n088m749m356m413m584m191l652l967m824m851l789
$$ 240013 234912 229736 224602 219514 214765 210409 205996 201412 197221 193569 189602 184778 179927 176138
56454A76138k881k762k563j638p57q44j595k072j924j464j133j267j909k625k854
$$ 176138 173257 170495 167932 166294 165537 164693 163098 161026 159102 157638 156505 155238 153329 150704 147850
56439A47850k388j267L50J826K185J363M78J96k91j554k407j573L4N06l12j061
$$ 147850 145462 144195 144545 146371 148556 149919 150397 150593 150302 148748 146341 144768 144802 145308 144996 143935
56423A43935j235j340j139J33J905K632K117J612J586J299O94P12J427J774J486
$$ 143935 142700 141360 140221 140354 142259 144891 147008 148620 150206 151505 152199 152911 154338 156112 157598
56408A57598J582K466L219L253L104L174L115K861K833K870K343J545J420J778
$$ 157598 159180 161646 164865 168118 171222 174396 177511 180372 183205 186075 188418 189963 191383 193161
56394A93161J437L80P2J227K814L695L740L109J912R38J142K155K726K666K794
$$ 193161 194598 194978 195050 196277 199091 202786 206526 209635 211547 212485 213627 215782 218508 221174 223968
56379B23968L022K412J208P50J168J196O23O92J618J918R53o3l38o85j538j901
$$ 223968 226990 229402 230610 231360 232528 233724 234347 235039 236657 238575 239528 239465 239127 238442 236904 235003
56363B35003j359j166k133l201l217k611k206j947j729j980k535k505j947k038
$$ 235003 233644 232478 230345 227144 223927 221316 219110 217163 215434 213454 210919 208414 206467 204429
56349B04429k892l070k074j363j855k442k077j542j765k147j881j420j326j144
$$ 204429 201537 198467 196393 195030 193175 190733 188656 187114 185349 183202 181321 179901 178575 177431
56335A77431n71k42l39M5J134J675R89J65J11J91j03M0R75J507Q65R4O0o0q76
$$ 177431 176860 176618 176279 176324 177458 179133 180122 180287 180398 180589 180486 180526 181501 183008 183873 183967 184027 183967 183091
56316A83091j232k46R20R55N39Q10J280J054O33P40O89k08j005o41J40J69m7O10
$$ 183091 181859 181613 182533 183488 184027 184837 186117 187171 187804 188544 189233 189025 188020 187379 187519 187688 187641 188251
56298A88251J818K545K805K964K451Q70n81n42M96J150J183J180J137Q47Q13J377
$$ 188251 190069 192614 195419 198383 200834 201704 201123 200581 201077 202227 203410 204590 205727 206574 207387 208764
56282B08764J886J869J960K542K812K355K229L117L872L384K373J857J460Q37
$$ 208764 210650 212519 214479 217021 219833 222188 224417 227534 231406 234790 237163 239020 240480 241317
56268B41317J087K838M521M535L724L695M089L732L152L694N028N746N603N274
$$ 241317 242404 245242 249763 254298 258022 261717 265806 269538 272690 276384 281412 287158 292761 298035
56254B98035M808M168M291N676O915O496N173M668N065N262N017M589L525J676
$$ 298035 302843 307011 311302 316978 323893 330389 335562 340230 345295 350557 355574 360163 363688 365364
56240C65364L90P23J520J188K09m0K16k8l76J03Q65Q50N58J062J947K291K608
$$ 365364 365754 366477 367997 369185 369394 369354 369570 369542 369166 369269 370134 370984 371542 372604 374551 376842 379450
56223C79450L705M756M679M279M791N537N412N452P231R745J0689J0035R660J0205
$$ 379450 383155 387911 392590 396869 401660 407197 412609 418061 425292 435037 445726 455761 465421 475626
56209D75626J0963J2168J4586J7352J8887J9602K1067K3105K4288K4949K6822
$$ 475626 486589 498757 513343 530695 549582 569184 590251 613356 637644 662593 689415
56198F89415K9906L2334L3415L4395L6100L8039L9795M1343M2075M1340L9660
$$ 689415 719321 751655 785070 819465 855565 893604 933399 974742 1016817 1058157 1097817
56187A097817L7753L5038L0905K6508K3179K0036J5476J0050N462J676k393o226
$$ 1097817 1135570 1170608 1201513 1228021 1251200 1271236 1286712 1296762 1302224 1303900 1301507 1295281
56175A295281q578j0185j2726j5697j7189j7214j7388j7854j7458j6623j7009
$$ 1295281 1286703 1276518 1263792 1248095 1230906 1213692 1196304 1178450 1160992 1144369 1127360
56164A127360j8551j9653k0116k1068k2332k2691k2497k3118k4100k3857k2874
$$ 1127360 1108809 1089156 1069040 1047972 1025640 1002949 980452 957334 933234 909377 886503
56153H86503k3111k4341k4251k2359k0669k0188j9746j8623j7516j6499j4670
$$ 886503 863392 839051 814800 792441 771772 751584 731838 713215 695699 679200 664530
56142F64530j2286j0779j0355r821q835q062p332o031n016n515o519n987m319
$$ 664530 652244 641465 631110 621289 612454 604392 597060 591029 586013 580498 573979 567992 563673
56129E63673l700m359m507l708l271l290k503j086n71q75m04Q84J450J175J429
$$ 563673 559973 555614 551107 547399 544128 540838 538335 537249 536678 535803 535399 536283 537733 538908 540337
56114E40337K272K568K655L772N094M721L431L925O301P823P469P124P981R133
$$ 540337 542609 545177 547832 551604 556698 561419 564850 568775 575076 582899 590368 597492 605473 614606
56100F14606J0063J1336J2463J2293J1645J2373J3936J4219J3510J4008J5641
$$ 614606 624669 636005 648468 660761 672406 684779 698715 712934 726444 740452 756093
56089G56093J6315J6283J7965K1243K3239K3300K4025K6753L0022L3226L7569
$$ 756093 772408 788691 806656 827899 851138 874438 898463 925216 955238 988464 1026033
56078A026033M2669M6388M8922N3105N9782O6846P3623Q2041R2562J03164J13343
$$ 1026033 1068702 1115090 1164012 1217117 1276899 1343745 1417368 1499409 1591971 1695135 1808478
56067A808478J24898J37619J48215J54596J57161J55070J45896J30507J13970
$$ 1808478 1933376 2070995 2219210 2373806 2530967 2686037 2831933 2962440 3076410
56058C076410J00042Q8433P8458P0846O4421N5405M2050K6493J0881m448j8087
$$ 3076410 3176452 3264885 3343343 3414189 3478610 3534015 3576065 3602558 3613439 3608991 3590904
56047C590904k7454l3221l9777m9820o2266p6333r2982j10942j25914j35453j40687
$$ 3590904 3563450 3530229 3490452 3440632 3378366 3302033 3209051 3098109 2972195 2836742 2696055
56036B696055j42113j38313j30016j20699j11672j01101q9080p8679p0718o2625
$$ 2696055 2553942 2415629 2285613 2164914 2053242 1952141 1863061 1784382 1713664 1651039
56026A651039n3904m7409m3650l9366l3545k9298k7735k5592k1201j7292j5494
$$ 1651039 1597135 1549726 1506076 1466710 1433165 1403867 1376132 1350540 1329339 1312047 1296553
56015A296553j3584j0536q766q905p894m831l051l806l564l83K780L920N403Q605
$$ 1296553 1282969 1272433 1263667 1254762 1246868 1242037 1238986 1235180 1231616 1231233 1234013 1237933 1243336 1251941
56001A251941J0895J0956J1445J3429J4008J2395J2256J4959J6661J5413J4878
$$ 1251941 1262836 1273792 1285237 1298666 1312674 1325069 1337325 1352284 1368945 1384358 1399236
55990A399236J7573K0543K1348K2133K4295K5362K4679K5809K9729L2217L1387
$$ 1399236 1416809 1437352 1458700 1480833 1505128 1530490 1555169 1580978 1610707 1642924 1674311
55979A674311L1102L3411L4765L3504L3595L6913L9283L8525L8682M1951M4229
$$ 1674311 1705413 1738824 1773589 1807093 1840688 1877601 1916884 1955409 1994091 2036042 2080271
55968B080271M3348M3696M7797N1358N1764N3184N8129O2365O3560O6205P2473
$$ 2080271 2123619 2167315 2215112 2266470 2318234 2371418 2429547 2491912 2555472 2621677 2694150
55957B694150P7215P7838P9806Q6368R2411R4791R8711J07084J14070J16477J20998
$$ 2694150 2771365 2849203 2929009 3015377 3107788 3202579 3301290 3408374 3522444 3638921 3759919
55946C759919J32314J44743J53861J65345J83534K02519K17890K35911K61209
$$ 3759919 3892233 4036976 4190837 4356182 4539716 4742235 4960125 5196036 5457245
55937E457245K86779L06469L25714L49482L71613L87362M04122M28136M53094
$$ 5457245 5744024 6050493 6376207 6725689 7097302 7484664 7888786 8316922 8770016
55928H770016M73917M98759N34480N73673O09280O48052O95762P43967P86279
$$ 8770016 9243933 9742692 10277172 10850845 11460125 12108177 12803939 13547906 14334185
55919A4334185Q32404Q90361R50898J006142J066788J143320J228343J316054
$$ 14334185 15166589 16056950 17007848 18013990 19080778 20224098 21452441 22768495
55911B2768495J419322J546942J685324J826130J990434K200983K454022K744782
$$ 22768495 24187817 25734759 27420083 29246213 31236647 33437630 35891652 38636434
55903C8636434L094273L520465M011204M558473N186889N910052O696336P525934
$$ 38636434 41730707 45251172 49262376 53820849 59007738 64917790 71614126 79140060
55895G9140060Q444719R510551J0732342J2123411J3754332J5664636J7780663
$$ 79140060 87584779 97095330 107827672 119951083 133705415 149370051 167150714
55888A67150714K0004528K2225792K3959144K4006986K0934992J4281479N280554
$$ 167150714 187155242 209381034 233340178 257347164 278282156 292563635 297844189
55881B97844189l809538j1137634j6062202j8863270k0086933k0227137j9695323
$$ 297844189 294034651 282897017 266834815 247971545 227884612 207657475 187962152
55874A87962152j8777570j7595550j6194735j4655364j3080826j1536989j0067887
$$ 187962152 169184582 151589032 135394297 120738933 107658107 96121118 86053231
55867H6053231q735423p588337o617357n785320n079341m497792m012766l586171
$$ 86053231 77317808 69729471 63112114 57326794 52247453 47749661 43736895 40150724
55859D0150724l206396k877010k586461k319187k080751j882652j714789j558190
$$ 40150724 36944328 34067318 31480857 29161670 27080919 25198267 23483478 21925288
55851B1925288j412484j287237j178340j075632r82706r07300q42028p74763p08917
$$ 21925288 20512804 19225567 18047227 16971595 15988889 15081589 14239561 13464798 12755881
55842A2755881o54675o09244n63868n21466m89591m63772m34764m04943l81627
$$ 12755881 12101206 11491962 10928094 10406628 9917037 9453265 9018501 8613558 8231931
55833H231931l61434l36843l11407k93292k80029k64129k47670k37097k29253
$$ 8231931 7870497 7533654 7222247 6928955 6648926 6384797 6137127 5900030 5670777
55824E670777k16573k01114j90133j82469j72006j60136j52336j46536j36817
$$ 5670777 5454204 5253090 5062957 4880488 4708482 4548346 4396010 4249474 4112657
55815D112657j24830j16207j09424r9218q7253p8724p2025o2393n2398m8552n0504
$$ 4112657 3987827 3871620 3762196 3662978 3575725 3497001 3424976 3362583 3310185 3261633 3211129
55804C211129n3341n7333o5679p5682q1825q4997q9538r4011r3833r0287q8045
$$ 3211129 3157788 3100455 3034776 2959094 2877269 2792272 2702734 2608723 2514890 2424603 2336558
55793B336558q6381q1499p5037p1584p0048o5961o0087n6571n4594m9998m3389
$$ 2336558 2250177 2168678 2093641 2022057 1952009 1886048 1825961 1769390 1714796 1664798 1621409
55782A621409l8784l5933l1397k5575k1481j8634j5043j3167j6632k3045k7057
$$ 1621409 1582625 1546692 1515295 1489720 1468239 1449605 1434562 1421395 1404763 1381718 1354661
55771A354661k8511l0690l2890l2024k9559k9400l0598k9442k7067k7590l0146
$$ 1354661 1326150 1295460 1262570 1230546 1200987 1171587 1140989 1111547 1084480 1056890 1026744
55760A026744l0192k7676k6702k7856k7847k6202k5611k6020k4687k1761j9865
$$ 1026744 996552 968876 942174 914318 886471 860269 834658 808638 783951 762190 742325
55749G42325j8733j6037j2743j1748j2051j0182o680n179n723m956k463j108j384
$$ 742325 723592 707555 694812 683064 671013 660831 654151 648972 643249 638293 635830 634722 633338
55736F33338j111m27j605m074m952m360n031p054p952p590p994q870q213o835
$$ 633338 632227 631800 630195 626121 621169 616809 611778 604724 596772 589182 581188 572318 564105 557270
55722E57270p226q597q045n984n209n389l904j579j976n086p216p210p467q692
$$ 557270 550044 541447 533402 527418 522209 516820 512916 511337 509361 504275 497059 489849 482382 473690
55708D73690q912q078q494j0128j0303q622p626q114q234p634q049r398r634q819
$$ 473690 464778 456700 448206 438078 427775 419153 411527 403413 395179 387545 379496 370098 360464 351645
55694C51645r146j0566j0636q964p651p109n605l239k167k532k237r91o13j122
$$ 351645 342499 331933 321297 312333 304682 297573 291968 288729 286562 284030 281793 280802 280189 279067
55680B79067o38O22L89j387k282j706j422j619n63J481K106R45P2p2j182l209
$$ 279067 278429 279051 279440 278053 275771 274065 272643 271024 270461 271942 274048 274993 275065 274993 273811 270602
55664B70602m033l454l507m396m103k540k023l048l533k858k774l607l526k285
$$ 270602 266569 263115 259608 255212 251109 248569 246546 243498 239965 237107 234333 230726 227200 224915
55650B24915j838k436j966P3J598J807K207L117K819J124M9P6o30k307k705j146
$$ 224915 223077 220641 218675 218748 220346 222153 224360 227477 230296 231420 231469 231545 230915 228608 225903 224757
55634B24757Qp17j822j832j260o50L82J322J036M83J955N046O689N802M459L872
$$ 224757 224765 224048 222226 220394 219134 218484 218866 220188 221224 221707 223662 228708 235397 241199 245658 249530
55618B49530K782P29p47j162k035l747m732m621m885n595n110l686l754n567o384
$$ 249530 252312 253041 252294 251132 249097 245350 240618 235997 231112 225517 220407 216721 212967 207400 201016
55603B01016n119m001m360m486l249k093j765o99J559K772J871J096K174L410
$$ 201016 195897 191896 187536 183050 179801 177708 175943 175244 176803 179575 181446 182542 184716 188126
55589A88126K733Q69o02j696k677k707j701j240k060k903l087l665m835n016l760
$$ 188126 190859 191728 191126 189430 186753 184046 182345 181105 179045 176142 173055 169390 164555 159539 155779
55574A55779k793k845k395r64n67k134l556l153k235k257k243j193l83j054k186
$$ 155779 152986 150141 147746 146782 146215 144081 140525 137372 135137 132880 130637 129444 129061 128007 125821
55559A25821k543k724l235k923j323k30r30j988j742r54j041j669j926j961j869
$$ 125821 123278 120554 117319 114396 113073 112843 111913 109925 108183 107229 106188 104519 102593 100632 98763
55544I8763r13O49J040k52j366j118p46j181j219j66M10m97j325q52m84j415k045
$$ 98763 97850 98499 99539 99287 97921 96803 96057 94876 93657 93491 93901 93404 92079 91227 90743 89328 87283
55527H7283p63R75J002r4m62j71l70q08o56l55n14l94N39J076L55k83M51J412
$$ 87283 86520 87495 88497 88403 87941 87770 87400 86592 85936 85581 85067 84673 85212 86288 86643 86360 86811 88223
55509H8223J139O05J387K665K567J285L96J46k57o15k28M05L35j33k75m78j298
$$ 88223 89362 89967 91354 94019 96586 97871 98267 98413 98156 97541 97313 97718 98053 97920 97645 97167 95869
55492I5869k017j854j559k058k711k548k020j843j457m17M7j064k360j924l28
$$ 95869 93852 91998 90439 88381 85670 83122 81102 79259 77802 77385 77432 76368 74008 72084 71756
55477G1756L35l91j205j404j390j329r68m42O6Q72J862J960P14o45r18o15n98
$$ 71756 72091 71700 70495 69091 67701 66372 65404 64962 65028 65900 67762 69722 70436 69791 68873 68258 67660
55460F7660m26M67J227Q30j78p13q49r99p16K11O17l37j539j546p61l32j53L39
$$ 67660 67234 67701 68928 69758 69580 68867 68018 67019 66303 66514 67131 66794 65255 63709 62948 62616 62463 62802
55442F2802N48k26j146r83n8N77Q54J061O53o50j705j572j152j522j871j025J94
$$ 62802 63350 63124 61978 60995 60937 61514 62368 63429 64082 63432 61727 60155 59003 57481 55610 54585 54779
55425E4779J49r87j717j560j047k14R93J636R47j75m59k64n85j067q23l10m83
$$ 54779 54928 53941 52224 50664 49617 49403 50396 52032 52979 52804 52345 52081 51496 50429 49606 49296 48813
55408D8813r17o16N5J41p1J74K89o42j778j561k88L50j26p03q21p57m37L32Q37
$$ 48813 47896 47280 47335 47476 47405 47579 47868 47226 45448 43887 43599 43949 43823 43120 42299 41542 41105 41437 42274
55389D2274L20n74p05l14l20m31K79J428J742J062K85k75q97j271r32m26n08p05
$$ 42274 42594 42020 41315 41001 40681 40250 40529 41957 43699 44761 45046 44771 43874 42603 41671 41245 40737 40032
55371D0032k09M76L85pM20J262J088k11j261j255o16R3N62L52m84q48Q5J530K290
$$ 40032 39823 40299 40684 40677 41097 42359 43447 43236 41975 40720 40104 40197 40759 41111 40627 39779 39864 41394 43684
55352D3684K449K581K228R04l03j7J291K144K327K517K460J556N65O55J286J023
$$ 43684 46133 48714 50942 51846 51543 51526 52817 54961 57288 59805 62265 63821 64386 65041 66327 67350
55336F7350pn34m95q84j619j635r82p34j009r88p43j133j978k230j822j604j581
$$ 67350 67343 66809 66314 65430 63811 62176 61194 60460 59451 58463 57720 56587 54609 52379 50557 48953 47372
55319D7372j009q1K98K03M08O36Lj035j123k81J37l21q13r17r78q47j19N88L46
$$ 47372 46363 46282 46580 46783 47191 47827 47830 46795 45672 45391 45528 45207 44394 43477 42499 41652 41533 42121 42467
55300D2467k86o9O81N83l72r70j088j624k272j757l61K37j84m7J108J751J060
$$ 42467 42181 42112 42793 43376 43004 42034 40946 39322 37050 35293 34932 35169 34985 34938 36046 37797 38857
55283C8857K47L68P36M53k12p77j346j767j371j93Q19J134J044O52j17n46J23
$$ 38857 39104 39472 40208 40661 40449 39672 38326 36559 35188 34995 35814 36948 37992 38644 38527 37981 38104
55266C8104J025N64r12j356j70R46P22m3k70j07M3L31N91J72o84q24q1L51r6n56
$$ 38104 39129 39693 38781 37425 37255 38201 38923 38880 38610 38503 38546 38877 39468 39640 38956 38132 38051 38402 38306 37750
55246C7750m44l14m72l05L27N23j39q50r19n40J02J041J630J037l9O4J284J640
$$ 37750 37306 36992 36520 36215 36542 37065 36926 36076 35157 34617 34719 35760 37390 38427 38388 38452 39736 41376
55228D1376K84j156j114j59M84P48J011J014O04K81K04k02r06r15K2P55N22O8
$$ 41376 41660 40504 39390 39231 39715 40463 41474 42488 43092 43373 43577 43375 42469 41554 41576 42331 42853 42921
55210D2921J53L32Q3k34k94m60p08k78Q64J509J037L38K10J53l72p90n73k63l73
$$ 42921 43074 43406 43489 43255 42961 42501 41793 41515 42379 43888 44925 45263 45473 45626 45254 44464 43891 43628 43255
55191D3255m49j26O2k45m52k20k53j014j811j984j830j583p68N55J220O71k4J16
$$ 43255 42806 42680 42742 42497 42045 41825 41572 40558 38747 36763 34933 33350 32582 33137 34357 35028 35004 35120
55173C5120N16L61R4L74P06L71k22l48k25k93j41O12J203P41k72o73l15K2q7m68
$$ 35120 35636 35997 36091 36465 37171 37542 37320 36972 36747 36454 36313 36925 38128 38869 38597 37924 37609 37631 37544 37076
55153C7076r30j296j208o39p4K60P17J384J662J240O25K71O6R6P60J674J665N83
$$ 37076 36146 34850 33642 33003 32929 33189 33906 35290 36952 38192 38817 39088 39154 39250 40010 41684 43349 43932
55135D3932k14O7M62no98o98m23o34r26o24k53o65j443j541r83n33k52M00J289
$$ 43932 43718 43785 44247 44242 43544 42846 42423 41789 40863 40239 39986 39321 37878 36337 35354 34821 34569 34969 36258
55116C6258J685J335N50m19j289j468p36J60L59qk54j29K30P39J143R50K08l38
$$ 36258 37943 39278 39828 39409 38120 36652 35916 36076 36435 36427 36173 36044 36274 37013 38156 39106 39314 38976
55098C8976m12o44j299j584j094p47j205j456l39J369J950J190L37Kl73j063j502
$$ 38976 38564 37920 36621 35037 33943 33196 31991 30535 30196 31565 33515 34705 35042 35044 34671 33608 32106
55081C2106j331r35o56l59R7N48Q45R94J034J036J110J151R11N44N82J054J329
$$ 32106 30775 29840 29184 28825 28922 29470 30315 31309 32343 33379 34489 35640 36551 37095 37677 38731 40060
55064D0060J186J246J823K167J639Q33O51Q95P88L72L64Q55J168R11M46K28K01
$$ 40060 41246 42492 44315 46482 48121 48954 49605 50500 51288 51660 52024 52879 54047 54958 55404 55632 55833
55047E5833m6p86j761k199j579l97L64M61M54N16J77n61q98m68O8J47J27M44Q43
$$ 55833 55787 55001 53240 51041 49462 49065 49429 49890 50344 50860 51037 50476 49578 49110 49178 49325 49452 49896 50739
55028E0739J002J078J158R46N21M15N71K45n97r80o17n31j296j966j666r76o66
$$ 50739 51741 52819 53977 54923 55444 55859 56430 56675 56078 55098 54481 53950 52654 50688 49022 48046 47380
55011D7380l07O04J328J014K01j01k0k38n99n76m21n64o22j54L20K75L01R29J259
$$ 47380 47073 47677 49005 50019 50220 50119 50099 49861 49262 48686 48265 47701 47079 46925 47245 47520 47821 48750 50009
54992E0009K95j090j213j41N78M04L05Q12J210R33L95J13O2J82O57J412J980K013
$$ 50009 50304 49214 48001 47860 48438 48842 49147 49959 51169 52102 52497 52610 52672 52854 53511 54923 56903 58916
54974E8916J432L39p94j176n70K39M98M23M78M16r4m95j20N77O55J95J25P67J516
$$ 58916 60348 60687 59893 58717 58147 58386 58884 59307 59785 60201 60107 59612 59492 60069 60724 60919 61044 61811 63327
54955F3327J789J503Q74M26P84J774K261J632P18M79M83j45j103j437j212j270
$$ 63327 65116 66619 67493 67919 68703 70477 72738 74370 75088 75567 76050 75905 74802 73365 72153 70883
54939G0883j678j702j148n30j40O8j03p83j375j237o84l92k16L69J037J036N25
$$ 70883 69205 67503 66355 65825 65685 65753 65650 64867 63492 62255 61571 61179 60963 61332 62369 63405 63930
54922F3930L43O73R92J133J291J281Q63N58R94J647J448M33l45m35l48l79k20
$$ 63930 64273 64946 65938 67071 68362 69643 70506 71064 72058 73705 75153 75586 75241 74806 74458 74079 73859
54905G3859K27O47R85J411J700J514J190J376K001K467K650K861L033K856K603
$$ 73859 74086 74733 75718 77129 78829 80343 81533 82909 84910 87377 90027 92888 95921 98777 101380
54890A01380K878L673M447M927N132M915M304L911M220M833N168N393N823O069
$$ 101380 104258 107931 112378 117305 122437 127352 131656 135567 139787 144620 149788 155181 161004 167073
54876A67073N658M912M109K616l6k910m838o097p523q687q613p690p219p371p252
$$ 167073 172731 177643 181752 184368 184332 181422 176584 170487 162964 154277 145664 137974 130755 123384 116132
54861A16132o666o108n334l714j894j244j720j938j394r14q69o87k44q3l0P52
$$ 116132 109466 103358 98024 94310 92416 91172 89452 87514 86120 85206 84337 83650 83406 83323 83293 84045
54845H4045K084K818K779L047M009M816N123N680O698P258O909O307N738M575
$$ 84045 86129 88947 91726 94773 98782 103598 108721 114401 121099 128357 135266 141573 147311 151886
54831A51886K851J690J283J16k743n844p144o594n794n814o354o589n996m625
$$ 151886 154737 156427 157710 157826 155083 149239 142095 135501 129707 123893 117539 110950 104954 100329
54817A00329l163k400k385k560k663k866l019k628j770j106q99p96o69p61r68
$$ 100329 97166 94766 92381 89821 87158 84292 81273 78645 76875 75769 74870 74074 73405 72644 71676
54802G1676q70n67n66r13j288j785k499k679j648k91j08r18j161m61m8m31o62
$$ 71676 70806 70239 69673 68760 67472 65687 63188 60509 58861 58570 58462 57544 56383 55922 55874 55443 54781
54785E4781l02k89j036j538j161p10p62n40N05J420J198K74m41r10j342j304n55
$$ 54781 54479 54190 53154 51616 50455 49745 48983 48443 48948 50368 51566 51840 51399 50489 49147 47843 47288
54768D7288K22M26L86M53K54l20m71K73J184J543J664J937J966J573J494J994
$$ 47288 47510 47936 48322 48775 49029 48709 48238 48511 49695 51238 52902 54839 56805 58378 59872 61866
54752F1866K007P68o74r23k50J30N3K52P99J106J146J455K098K657L067L575M095
$$ 61866 63873 64641 63967 63044 62794 62924 62977 63229 64028 65134 66280 67735 69833 72490 75557 79132 83227
54735H3227M293M157L886L554L347L745M892O226P162P678P895P795P717Q218
$$ 83227 87520 91677 95563 99117 102464 106209 111101 117327 124489 132167 140062 147857 155574 163792
54721A63792Q929Q467O197L238Q91r49k945m749n475n134m524m068l663l326l113
$$ 163792 172721 181188 187385 190623 191514 190565 187620 182871 177396 172262 167738 163670 160007 156681 153568
54706A53568k668j684m79M59J168J825K192K105K039K478L190L707M110M696N285
$$ 153568 150900 149216 148737 149196 150364 152189 154381 156486 158525 161003 164193 167900 172010 176706 181991
54691A81991N519N433N177M638L827L190K937K596J786Q97M65M02L49K11j70j217
$$ 181991 187510 192943 198120 202758 206585 209775 212712 215308 217094 217991 218456 218858 219207 219418 219248 218031
54675B18031k868m289m974n505o560p799q404q232p765p360p154p146o957o101
$$ 218031 215163 210874 205900 200395 193835 186036 177632 169400 161635 154275 147121 139975 133018 126917
54661A26917m905m355m640m704l876k886k585k605k235j690j541j599j381j003
$$ 126917 122012 117657 113017 108313 104437 101551 98966 96361 94126 92436 90895 89296 87915 86912
54647H6912p27l49J49J49n00p71J7Q79N62m98q93l85Q8R4Q4L42P35J260J853J936
$$ 86912 86185 85836 85985 86134 85634 84863 84880 85759 86321 85823 84930 84545 84633 84727 84811 85153 85888 87148 89001 90937
54627I0937J163K88K14O28O08J73O7L33M25M99J261K580L463L459L061K695K314
$$ 90937 92100 92388 92602 93230 93838 94011 94078 94411 94836 95335 96596 99176 102639 106098 109159 111854 114168
54610A14168K070K338K908L057K611K156K103K213K186K038J854J669J649J903
$$ 114168 116238 118576 121484 124541 127152 129308 131411 133624 135810 137848 139702 141371 143020 144923
54596A44923K286K775L640M831N695N949O352P548Q867R285R081R309R967J0040
$$ 144923 147209 149984 153624 158455 164150 170099 176451 183999 192866 202151 211232 220541 230508 240548
54582B40548R244Q445Q188P951P054N371K898l73l842o425p683q252q873r597
$$ 240548 249792 258237 266425 274376 281430 286801 289699 289326 285484 279059 271376 263124 254251 244654
54568B44654j0088j0198j0019r704r367q859p775o073m481l833m105m571m639
$$ 244654 234566 224368 214349 204645 195278 186419 178644 172571 168090 164257 160152 155581 150942
54555A50942m142l160k116j700k104k604k433j827j487j510j501j449j674k148
$$ 150942 146800 143640 141524 139824 137720 135116 132683 130856 129369 127859 126358 124909 123235 121087
54541A21087k577k917l168l057k520k095k076j833q77l8m69j810k522j921p99
$$ 121087 118510 115593 112425 109368 106848 104753 102677 100844 99967 99929 99460 97650 95128 93207 92408
54526I2408l8L22N25N69M04N4n11j075j003k4J090J342P42ln59r16p23K14J156
$$ 92408 92370 92692 93217 93786 94190 94244 93733 92658 91655 91631 92721 94063 94805 94802 94243 93327 92604 92818 93974
54507I3974J203O27L58M86L73L0R0N67Q45Q70J126J489J336Q08O83R51Q58M15
$$ 93974 95177 95804 96162 96648 97021 97051 97141 97708 98553 99423 100549 102038 103374 104182 104865 105816 106674 107089
54489A07089N50J474K275K474K658L212L622L582L592L897L939L449L038L137
$$ 107089 107639 109113 111388 113862 116520 119732 123354 126936 130528 134425 138364 141813 144851 147988
54475A47988L292L243L627M865O087O034M558K570R66Q6k50o21j540k832l853
$$ 147988 151280 154523 158150 163015 169102 175136 179694 182264 183230 183316 183066 182445 180905 178073 174220
54460A74220m444n044n742n970n425m570l942l580l402l408l313k663j657j134
$$ 174220 169776 164732 158990 153020 147595 143025 139083 135503 132101 128693 125380 122717 121060 119926
54446A19926j419j848j706j008j18O83J053P98L68M64R42J029P13Q49J562J778
$$ 119926 118507 116659 114953 113945 113827 114510 115563 116361 116729 117193 118135 119164 119877 120726 122288 124066
54430A24066Q89k03m51q5J67L32P86J237J227J041J219J515J283N74O3K4J31J57
$$ 124066 124955 124752 124301 124216 124383 124715 125501 126738 127965 129006 130225 131740 133023 133597 133660 133684 133815 133972
54412A33972J90K36J85J10K28O13J213J897K203J465l23k099k699k095j188o19
$$ 133972 134162 134398 134583 134693 134921 135534 136747 138644 140847 142312 141989 139890 137191 135096 133908 133289
54396A33289l30j23n6j19l8L56P71P11J20m79n61l34n87j688k999l538l075k229
$$ 133289 132959 132836 132780 132661 132623 132979 133750 134461 134581 134102 133541 133207 132620 130932 127933 124395 121320 119091
54378A19091j597j224q40l17K35N13K75l24p76q17o47m14J28R82J474J037R4n59
$$ 119091 117494 116270 115430 115113 115348 115861 116136 115812 115036 114219 113572 113158 113286 114268 115742 116779 116873 116314
54360A16314q14r96r68m19K88N25M80Q17J442J698J683K152L016L239K462J529
$$ 116314 115500 114504 113536 113117 113405 113930 114410 115227 116669 118367 120050 122202 125218 128457 130919 132448
54344A32448J135J048J059J490K225K410J768J215J437J803J394M00l36n31n50
$$ 132448 133583 134631 135690 137180 139405 141815 143583 144798 146235 148038 149432 149832 149496 148965 148415
54329A48415p19j152j767k132j797j108r83j514j734j172p18j179j984k185j938
$$ 148415 147696 146544 144777 142645 140848 139740 138757 137243 135509 134337 133619 132440 130456 128271 126333
54314A26333j935j975j279J5Q35O36k8m82o94r02j008o76K06J346K242K594K488
$$ 126333 124398 122423 121144 121159 121994 122630 122602 122120 121426 120524 119516 118840 119046 120392 122634 125228 127716
54297A27716K125J530P26N6k02k95n64o90p1J044J659J389Q95P78R09J023J093
$$ 127716 129841 131371 132097 132153 131951 131656 131092 130402 130331 131375 133034 134423 135318 136096 137005 138028 139121
54280A39121Q45j62j528k081j461p14p60j213j374j452j899k364k314k110k391
$$ 139121 139966 139804 138276 136195 134734 134020 133260 132047 130673 129221 127322 124958 122644 120534 118143
54265A18143k922k964k517k284k498k671k378j728j066p37r72j610k110k149j978
$$ 118143 115221 112257 109740 107456 104958 102287 99909 98181 97115 96378 95406 93796 91686 89537 87559
54250H7559j865j621j005k43K39K39k92j229j959j759q55l77q47j458j395j041
$$ 87559 85694 84073 83068 82825 83064 83303 83011 81782 79823 78064 77209 76832 75985 74527 73132 72091
54234G2091j147j529j532j201j059j138j074q74p82o24j02M91N69R8m63q93j235
$$ 72091 70944 69415 67883 66682 65623 64485 63411 62537 61755 61131 61029 61520 62089 62187 61724 60831 59596
54217E9596j292p28L29J284J653J396Q51M89M76L82k58j013r50o3N30K28j64K18
$$ 59596 58304 57576 57905 59189 60842 62238 63089 63578 64054 64436 64178 63165 62215 62152 62682 62910 62746 62964
54199F2964J016J410J302R37J70r26j504r75m1K81O6o7j89o06q06j67P56R29N06
$$ 62964 63980 65390 66692 67629 67799 66873 65369 64394 64353 64634 64700 64633 64444 63838 63032 62865 63621 64550 65056
54180F5056M52P79N52m13j285j642j856j905j138M19J657J783J170M69k47r32
$$ 65056 65508 66287 66839 66426 65141 63499 61643 59738 58600 59019 60676 62459 63629 64098 63851 62919
54164F2919j130o09R3L37R2l19p90j346j823j929j549q65k72n5o5O0K29k5o21
$$ 62919 61789 61180 61273 61610 61702 61383 60593 59247 57424 55495 53946 53081 52809 52754 52689 52749 52978 52953 52332
54145E2332p12J9O09K12m97l40M93Q03K82k83n02p43r92p08K2L69J59Q2K95k6
$$ 52332 51620 51639 52248 52460 51963 51623 52116 52919 53201 52918 52416 51673 50681 49973 49995 50364 50523 50605 50900 50874
54125E0874j169k089j780n83N20J102J241J042P87Q55J059P56M3j36M76P77J3
$$ 50874 49705 47616 45836 45253 45773 46875 48116 49158 49945 50800 51859 52615 52658 52522 52998 53775 53788
54108E3788r14q40k27l68j246j596q92L2M59O44R01Q73K81l82m71k5N44J059J406
$$ 53788 52874 52034 51807 51439 50193 48597 47705 47737 48196 48840 49741 50614 50895 50513 50042 50017 50561 51620 53026
54089E3026J187K07r14j307r37n37m39j92M15P09Q9q83j079k49P68J268J277J016
$$ 53026 54213 54420 53506 52199 51262 50725 50286 50094 50509 51218 51307 50424 49345 49096 49864 51132 52409 53425
54071E3425M75j41k81K03P01O60K84P1L4o6j48M1M17O73O71M41K0l37j85M76R60
$$ 53425 53900 53759 53478 53681 54382 55042 55326 55397 55431 55365 55217 55258 55675 56348 57019 57460 57480 57143 56958 57434 58394
54050E8394P14O1l57m62n10m16o3K5p64j975k316j259K53R06M44k27r9Q55J606
$$ 58394 59108 59169 58812 58350 57840 57424 57361 57386 56622 54647 52331 51072 51325 52231 52675 52448 52349 53204 54810
54031E4810J186p9p84j13J224J996J845J172L07m83o79j67J52n46j608j626m46
$$ 54810 55996 55917 55133 55020 56244 58240 60085 61257 61564 61081 60402 60235 60387 59841 58233 56607 56161
54014E6161O06O21R5k13l47o19q05m78L16J163J695J644R28j45j021j422j372
$$ 56161 56767 57388 57483 57270 56923 56304 55499 55021 55337 56500 58195 59839 60767 60622 59601 58179 56807
53997E6807p78M30J765K332J778O23m15q68l97J090K903L801L154J565J43m10
$$ 56807 56029 56459 58224 60556 62334 62957 62542 61674 61277 62367 65270 69071 72225 73790 73933 73523
53981G3523J7J019J763J598Q81O95J512K640L221L194K945K607K214K046K282
$$ 73523 73540 74559 76322 77920 78801 79496 81008 83648 86869 90063 93008 95615 97829 99875 102157
53966A02157K589K580K430K539K844K914K709K614K776K793K326J632J259J336
$$ 102157 104746 107326 109756 112295 115139 118053 120762 123376 126152 128945 131271 132903 134162 135498
53952A35498J440J177O78L58L59L89J25m12q93r40m65J14Q8p15j578j789j726
$$ 135498 136938 138115 138793 139151 139510 139899 140024 139612 138719 137779 137314 137428 137516 136801 135223 133434 131708
53935A31708k351l594m207l568k672k644l042k583j068L79Q30M44j26m94o96j000
$$ 131708 129357 125763 121556 117988 115316 112672 109630 107047 105979 106358 107188 107632 107506 107012 106316 105316
53919A05316j586k142k065j353q03r00j097p81l29l66n64j86O14J035R50Q36P12
$$ 105316 103730 101588 99523 98170 97367 96467 95370 94589 94260 93894 93330 93144 93758 94793 95743 96579 97291
53902I7291J41p03j108r30o61m33P7P14Q47M77L00N53P05M85K90M17O71R64J422
$$ 97291 97432 96729 95621 94691 94030 93597 93674 94388 95235 95712 96012 96565 97270 97755 98045 98462 99133 100097 101519
53883A01519J794J677J359J556K161K316J917J876K586L255L287L205L570L926
$$ 101519 103313 104990 106349 107905 110066 112382 114299 116175 118761 122016 125303 128508 132078 136004
53869A36004L546K508J379M59q4K9P40J447J755J890K071K009J591J285J439J692
$$ 136004 139550 142058 143437 143896 143812 143841 144581 146028 147783 149673 151744 153753 155344 156629 158068 159760
53853A59760J611J420J584K128K792L438L885L834L303K836K933L552M333M919
$$ 159760 161371 162791 164375 166503 169295 172733 176618 180452 183755 186591 189524 193076 197409 202328
53839B02328M975M414L599K939K291J371M97J71J6p14j638j590n93k00j315k904
$$ 202328 207303 211717 215316 218255 220546 221917 222414 222585 222601 221887 220249 218659 218066 217866 216551 213647
53823B13647l606l454l300l457l835m459n089n035m162l329l106k925k273j801
$$ 213647 210041 206587 203287 199830 195995 191536 186447 181412 177250 173921 170815 167890 165617 163816
53809A63816k263l139l457l299l372l586l231k348j789j956k378k489k119j357
$$ 163816 161553 158414 154957 151658 148286 144700 141469 139121 137332 135376 132998 130509 128390 127033
53795A27033n40k59p59j549k039k259k437k336j731j023p28o36k63J89J29m29
$$ 127033 126493 126234 125475 123926 121887 119628 117191 114855 113124 112101 111373 110737 110474 110663 110792 110363
53779A10363r25j142j283j328j023n26k84l08j21M79J124J369J101N09k3n8M80
$$ 110363 109438 108296 107013 105685 104662 104136 103852 103544 103423 103902 105026 106395 107496 108005 107982 107924 108404
53762A08404J125J392J343J339J414J283Q14K37j28j09J66M27O28J053J675J766
$$ 108404 109529 110921 112264 113603 115017 116300 117114 117351 117223 117114 117280 117707 118335 119388 121063 122829
53746A22829Q06l91m67N14J052M89L0Q40K248K822K413J969J995K225K432K565
$$ 122829 123635 123244 122777 123291 124343 124832 124862 125702 127950 130772 133185 135154 137149 139374 141806 144371
53730A44371K405J918J664K140K944L283K970K355J634Q92M09K36q2p62j201q89
$$ 144371 146776 148694 150358 152498 155442 158725 161695 164050 165684 166576 166985 167221 167139 166377 165176 164287
53714A64287l30k09k10L36J054Q77l54j686k346k382k116j719j432j407j393j126
$$ 164287 163957 163748 163538 163874 164928 165805 165451 163765 161419 159037 156921 155202 153770 152363 150970 149844
53698A49844q89j137j783k378k682k558j771n90m6p47j845k119j620j298j322
$$ 149844 148955 147818 146035 143657 140975 138417 136646 136056 136010 135263 133418 131299 129679 128381 127059
53683A27059r58OQ75J113Q28J82p88j673j937j733j701j916j811j173m51KK54
$$ 127059 126101 126107 126982 128095 128923 129105 128317 126644 124707 122974 121273 119357 117546 116373 115922 115924 116178
53666A16178L51K73K53N17P11L61k33l30P3K82Q0k9K23N40P75J189J790K186K248
$$ 116178 116529 116802 117055 117572 118283 118644 118411 118081 118154 118436 118516 118487 118710 119250 120025 121214 123004 125190 127438
53647A27438K261K312K185J900J653J309P31M58J138K226K339J172P7L40J705
$$ 127438 129699 132011 134196 136096 137749 139058 139789 140247 141385 143611 145950 147122 147199 147539 149244
53632A49244L020L586L325K385J167L88N05J245J933K092J667J084J045J907L126
$$ 149244 152264 155850 159175 161560 162727 163115 163620 164865 166798 168890 170557 171641 172686 174593 177719
53617A77719L745L431K652J954J618J831K482K824K100O47l25j87N13J061J348
$$ 177719 181464 184895 187547 189501 191119 192950 195432 198256 200356 201003 200678 200491 201004 202065 203413
53602B03413J477J287P39J92j9OJ5j47n52j116j353p90K74R44Q35M74M06M13n1
$$ 203413 204890 206177 206916 207108 207089 207095 207110 206963 206411 205295 203942 203152 203426 204370 205205 205679 206085 206498 206447
53583B06447j000j836j975j423p21l88l86k99p7p8k44J04J175K105K126J680J530
$$ 206447 205447 203611 201636 200213 199492 199104 198718 198419 198342 198264 198020 198124 199299 201404 203530 205210 206740
53566B06740J361M43p71j025j41P63R69R62J263J644J757J716J667J605J754K415
$$ 206740 208101 208544 207773 206748 206607 207370 208339 209301 210564 212208 213965 215681 217348 218953 220707 223122
53550B23122L245L567L453L664M365M887M903M798M728M247L312K651K739L211
$$ 223122 226367 229934 233387 237051 241416 246303 251206 256004 260732 264979 268291 270942 273681 276892
53536B76892L692M286M866M805L953L095K900L097L196L273L534L690L363K658
$$ 276892 280584 284870 289736 294541 298494 301589 304489 307586 310782 314055 317589 321279 324642 327300
53522C27300J995J724K052K805L213K606J379N86N11N54M95P07J012N73o60j577
$$ 327300 329295 331019 333071 335876 339089 341695 343074 343660 344171 344725 345220 345927 346939 347512 346852 345275
53506C45275j555j251j276j205o53j67j50j1O74J078L36r29j402q13K4L77l3j173
$$ 345275 343720 342469 341193 339988 339335 339168 339018 339007 339681 340759 341095 340166 338764 337951 337975 338352 338319 337146
53488C37146k306k160m66J229J375M69J95R87J738J749J632K126L066L839M165
$$ 337146 334840 332680 332214 333443 334818 335287 335482 336469 338207 339956 341588 343714 346780 350619 354784
53473C54784M143M082M326M940N520N694N634N731N973O100O129O329O845P731
$$ 354784 358927 363009 367335 372275 377795 383489 389123 394854 400827 406927 413056 419385 426230 433961
53459D33961R065J0683J2064J2907J3428J3858J4061J4137J4783J6384J8249J9423
$$ 433961 443026 453709 465773 478680 492108 505966 520027 534164 548947 565331 583580 603003
53447F03003J9931K0564K1683K2969K4039K4714K4889K4813K5218K6496K8006
$$ 603003 622934 643498 665181 688150 712189 736903 761792 786605 811823 838319 866325
53436H66325K8885K9279L0009L1092L1571L0837K9519K8707K8862K9697L0721
$$ 866325 895210 924489 954498 985590 1017161 1047998 1077517 1106224 1135086 1164783 1195504
53425A195504L1687L2633L3672L4642L5184L5221L5168L5361L5558L5245L4220
$$ 1195504 1227191 1259824 1293496 1328138 1363322 1398543 1433711 1469072 1504630 1539875 1574095
53414A574095L2621L0626K8417K6286K4391K2673K1142J9970J9108J8197J7065
$$ 1574095 1606716 1637342 1665759 1692045 1716436 1739109 1760251 1780221 1799329 1817526 1834591
53403A834591J6000J5251J4681J4129J3590J2819J1249Q779O073L687J458q89
$$ 1834591 1850591 1865842 1880523 1894652 1908242 1921061 1932310 1941089 1947162 1950849 1952307 1951418
53391A951418l173n331p893j1123j4217j6230j7399j8795k0915k3353k5614k7514
$$ 1951418 1948245 1942914 1935021 1923898 1909681 1893451 1876052 1857257 1836342 1812989 1787375 1759861
53379A759861k8891k9600k9836k9976l0210l0581l1120l1499l1064k9715k8349
$$ 1759861 1730970 1701370 1671534 1641558 1611348 1580767 1549647 1518148 1487084 1457369 1429020
53368A429020k7827k7849k7467k6283k4536k2435k0140j8095j6523j4836j2281
$$ 1429020 1401193 1373344 1345877 1319594 1295058 1272623 1252483 1234388 1217865 1203029 1190748
53357A190748q965n637k701j31J992L738N779Q707J2042J4798J6949J9414K2565
$$ 1190748 1181783 1176146 1173445 1173314 1175306 1179044 1184823 1193530 1205572 1220370 1237319 1256733 1279298
53344A279298K5702K8146L0041L1816L3546L5060L6339L7560L9080M1242M3843
$$ 1279298 1305000 1333146 1363187 1395003 1428549 1463609 1499948 1537508 1576588 1617830 1661673
53333A661673M6111M7683M9282N1792N4979N7899O0241O2404O4437O5989O7277
$$ 1661673 1707784 1755467 1804749 1856541 1911520 1969419 2029660 2092064 2156501 2222490 2289767
53322B289767O9022P1255P3116P4122P4746P5405P5730P5292P4361P3466P2637
$$ 2289767 2358789 2430044 2503160 2577282 2652028 2727433 2803163 2878455 2952816 3026282 3098919
53311C098919P1554O9968O7696O4493O0398N5942N1813M8333M5279M2085L8387
$$ 3098919 3170473 3240441 3308137 3372630 3433028 3488970 3540783 3589116 3634395 3676480 3714867
53300C714867L4569L1518K9419K7175K3565J8653J3315P742J386n789j3194k0916
$$ 3714867 3749436 3780954 3810373 3837548 3861113 3879766 3893081 3900823 3902209 3896420 3883226 3862310
53288C862310k9904m0319n0727n9492o6327p1819p6213p9462q1899q3975q5541
$$ 3862310 3832406 3792087 3741360 3681868 3615541 3543722 3467509 3388047 3306148 3222173 3136632
53277C136632q6177q6067q5870q5746q5193q3950q2539q1555q0929q0154p9053
$$ 3136632 3050455 2964388 2878518 2792772 2707579 2623629 2541090 2459535 2378606 2298452 2219399
53266B219399p7784p6188p3666p0012o5972o2470n9467n6164n2324m8664m5662
$$ 2219399 2141615 2065427 1991761 1921749 1855777 1793307 1733840 1677676 1625352 1576688 1531026
53255A531026m2711l8900l4232k9455k5112k1344j8241j5799j3656j1416r167
$$ 1531026 1488315 1449415 1415183 1385728 1360616 1339272 1321031 1305232 1291576 1280160 1270993
53244A270993p176n385l654k170j038J98K008M086N806P207Q726J0243J1288J2134
$$ 1270993 1263817 1258432 1254778 1252608 1251570 1251768 1253776 1257862 1263668 1270875 1279601 1289844 1301132 1313266
53230A313266J3680J6122J8627K0474K1808K3054K4356K5841K7675K9638L1197
$$ 1313266 1326946 1343068 1361695 1382169 1403977 1427031 1451387 1477228 1504903 1534541 1565738
53219A565738L2226L3051L3635L3466L2484L1440L0975L0918L0803L0466K9779
$$ 1565738 1597964 1631015 1664650 1698116 1730600 1762040 1793015 1823933 1854736 1885202 1914981
53208A914981K8457K6601K4946K4037K3544K2740K1340J9517J7440J5174J2772
$$ 1914981 1943438 1970039 1994985 2019022 2042566 2065306 2086646 2106163 2123603 2138777 2151549
53197B151549J0141P062L544j57m001q343j3281j8280k2732k6677l0634l4851
$$ 2151549 2161690 2168752 2172296 2172139 2168138 2159795 2146514 2128234 2105502 2078825 2048191 2013340
53185B013340l8978m2384m4695m6133m7364m8791n0110n0719n0498m9806m8778
$$ 2013340 1974362 1931978 1887283 1841150 1793786 1744995 1694885 1644166 1593668 1543862 1495084
53174A495084m7231m5304m3664m2828m2585m2326m1673m0720l9913l9759m0349
$$ 1495084 1447853 1402549 1358885 1316057 1273472 1231146 1189473 1148753 1108840 1069081 1028732
53163A028732m1189m1690m1741m1465m0551l8464l5227l1520k7950k4797k2348
$$ 1028732 987543 945853 904112 862647 822096 783632 748405 716885 688935 664138 641790
53152F41790k0821j9841j8696j7317j6273j5679j4855j3479j2313j2162j2657
$$ 641790 620969 601128 582432 565115 548842 533163 518308 504829 492516 480354 467697
53141D67697j2698j1741j0136q464p158o597p042q216r320r629r111q394q083
$$ 467697 454999 443258 433122 424658 417500 410903 403861 395645 386325 376696 367585 359191 351108
53128C51108q081p781o999o316o223o350o120n818o150o928p145o432n536n049
$$ 351108 343027 335246 328247 321931 315708 309358 303238 297420 291270 284342 277197 270765 265229 260180
53114B60180m624l898l367l620m260m366l751l067k827k872k833k640k496k533
$$ 260180 255556 251658 248291 244671 240411 236045 232294 229227 226400 223528 220695 218055 215559 213026
53100B13026k661k685k602k653k980l361l419l025k264j306n90o83j512k086j696
$$ 213026 210365 207680 205078 202425 199445 196084 192665 189640 187376 186070 185480 184797 183285 181199 179503
53085A79503j036j276k252k648j967j169j146j591j799j616j128k99N19N78j64
$$ 179503 178467 177191 174939 172291 170324 169155 168009 166418 164619 163003 161875 161576 162095 162673 162509
53070A62509o69j83O89R25M34k12p65j203j203o23m9o5k38K10J029J126J63r09
$$ 162509 161840 161657 162346 163271 163705 163493 162728 161525 160322 159699 159650 159585 159347 159557 160586 161712 161875 160966
53052A60966j080m34K63N48N49M70K19l75j034j094l04N98O38j40p77p97p11r82
$$ 160966 159886 159452 159715 160263 160812 161282 161501 161126 160092 158998 158694 159292 159930 159790 159013 158216 157505 156523
53034A56523j245j064p09n17j17R21K072K354J637P27K64J40L0j28k68l72m37
$$ 156523 155278 154214 153505 152988 152871 153792 155864 158218 159855 160582 160846 160986 161016 160888 160620 160248 159811
53017A59811n01o50q36q61p66r28j448j825j676j403j602k097k163j640j151j164
$$ 159811 159310 158660 157824 156963 156197 155269 153821 151996 150320 148917 147315 145218 143055 141415 140264 139100
53001A39100j391j302q92o44r38j645k276k423k132j785j711j956k377k689k512
$$ 139100 137709 136407 135515 134871 133933 132288 130012 127589 125457 123672 121961 120005 117628 114939 112427
52986A12427j707p19k24l51o42p91r82j380j778j950j920j655j035l60k62q20
$$ 112427 110720 110001 109777 109426 108784 107993 107011 105631 103853 101903 99983 98328 97293 96933 96671 95851
52970I5851j267j009m36k83o52j138j449j470j087m52r4k65n94p38r15j311j451
$$ 95851 94584 93575 93139 92856 92204 91066 89617 88147 87060 86608 86514 86249 85655 84917 84002 82691 81240
52953H1240r11j49Q6j34j68K7j43p82j185q23p3L19Q6m42q00p67m30l8K44L79
$$ 81240 80329 80180 80266 80132 79964 79991 79848 79066 77881 77058 76985 77304 77390 76948 76148 75381 74951 74913 75157 75536
52933G5536L14J6l34m52l44k31q5L45Q78Q61J18o09n32J87P80P85L39j38j68M55
$$ 75536 75850 75866 75532 75080 74736 74505 74420 74765 75643 76504 76622 76013 75481 75668 76448 77233 77572 77434 77266 77721
52913G7721J270J472R54M58M18K77m87j359j478q76k11L58J179K204K827K673
$$ 77721 78991 80463 81417 81875 82293 82570 82083 80724 79246 78370 78159 78517 79696 81900 84727 87400
52897H7400J980J223P20N61N70M65K83M03R19J443J755K136K693K985K720K302
$$ 87400 89380 90603 91323 91884 92454 92919 93202 93605 94524 95967 97722 99858 102551 105536 108256 110558
52881A10558K137K012J662J343J201Q45J93k8N35R81M47m07m04K85N58J79j87
$$ 110558 112695 114707 116369 117712 118913 119758 119951 119923 120458 121439 121886 121479 121075 121360 121918 122097 121910
52864A21910m45j044j690j554q41p56j603k235j830r95o41p99j085j409j640j381
$$ 121910 121465 120421 118731 117177 116336 115580 113977 111742 109912 108917 108276 107477 106392 104983 103343 101962
52848A01962o67k49o57j489k011j993j620j072n35j96j3J84K59p1o03p92n84n14
$$ 101962 101295 101046 100389 98900 96889 94896 93276 92204 91669 91473 91460 91644 91903 91832 91229 90437 89853 89339
52830H9339p96r55n83R3N89O85M32Q7K6K79K62m15j043n59Q65J864J671Q90L00
$$ 89339 88543 87588 87005 87098 87687 88372 88804 88891 88917 89196 89458 89043 88000 87441 88306 90170 91841 92731 93031
52811I3031j34o28q65n55m2K17K66K77R9l55o88n07L2N39R31J241J233O36l86
$$ 93031 92897 92269 91404 90849 90807 91024 91290 91567 91666 91311 90623 90116 90148 90687 91618 92859 94092 94728 94342
52792I4342j237j340n56O69J608J931J953J988J777J051K84J69N67Q42J036J673
$$ 94342 93105 91765 91209 91878 93486 95417 97370 99358 101135 102186 102470 102639 103206 104048 105084 106757
52776A06757K479K435J317J14m42o79q94o21L65J273J265N99M8j67j67J94R44
$$ 106757 109236 111671 112988 113102 112660 111981 111087 110466 110831 112104 113369 113968 114016 113849 113682 113876 114820
52759A14820J517J426J031R49J059Q26K62j33k00k42m01n27n94p75j111j414j558
$$ 114820 116337 117763 118794 119743 120802 121628 121890 121757 121557 121315 120914 120387 119793 119018 117907 116493 114935
52742A14935j599j664j841k054k044j692j326j343j576j490j028o81o62p24q56
$$ 114935 113336 111672 109831 107777 105733 104041 102715 101372 99796 98306 97278 96597 95935 95211 94355
52727I4355j396k121k136j146j03M5l69l83K04P56P75L03l08o13l22K30K49m64
$$ 94355 92959 90838 88702 87556 87453 87498 87129 86746 86950 87706 88481 88784 88476 87863 87541 87771 88020 87556
52709H7556j105r73m87m91j034j494j570j421j111o19k37l00o34p89o78n69m69
$$ 87556 86451 85478 84991 84500 83466 81972 80402 78981 77870 77251 77014 76714 76080 75291 74613 74044 73575
52692G3575j54K98M68Q8p04j538j972j675p41K40O96N45P6l49m24n2K78j27j230
$$ 73575 73421 73719 74187 74275 73571 72033 70061 68386 67645 67885 68581 69126 69202 68853 68429 68377 68655 68528 67298
52673F7298k096k043j457j090j047r72p38m09J40Q81J325J116P10P76J193J263
$$ 67298 65202 63159 61702 60612 59565 58593 57855 57446 57586 58467 59792 60908 61618 62394 63587 64850
52657F4850P52J43j52k07k84m58o61p16m45Q6N81R21J251J515J319N90j27l24
$$ 64850 65602 65745 65593 65386 65102 64644 63983 63267 62822 62908 63489 64410 65661 67176 68495 69085 68958 68634
52639F8634j19J63M32N07j4r92j496r67o3L17K83L81M37m7p20o78J72J035J408
$$ 68634 68515 68678 69110 69617 69603 68611 67115 66148 66085 66402 66685 67066 67503 67456 66736 66058 66230 67265 68673
52620F8673J464J345R54M98M26P98J287J762K186K245J820J546K031K744K661
$$ 68673 70137 71482 72436 72934 73360 74158 75445 77207 79393 81638 83458 85004 87035 89779 92440
52605I2440J850J257J075N98k27m80Q2M30p0o27m11K6l36j389k214k452k404k219
$$ 92440 94290 95547 96622 97220 96993 96513 96595 97025 96955 96328 95917 95943 95607 94218 92004 89552 87148 84929
52587H4929j827j468j436j445r66j57K26j62p93r67n50P0M68N20L95L21L17K86
$$ 84929 83102 81634 80198 78753 77787 77630 77856 77694 76901 75934 75384 75454 75922 76442 76837 77158 77475 77761
52569G7761K97N36R19J075Q68N67L28n5n96p45j38O08N07m32j109p47R7L66j57
$$ 77761 78058 78594 79513 80588 81456 82023 82351 82296 81700 80955 80817 81425 81932 81500 80391 79644 79741 80107 79950
52550G9950p88r97r35q43n61J5L92N9n81m79P52K251K869K240P77q43j886j776
$$ 79950 79162 78165 77230 76387 75826 75841 76233 76292 75711 75232 75984 78235 81104 83344 84121 83278 81392 79616
52532G9616p21K43L32j12l04j60j52k92j57K34L54J14O7M75Q59Q22O02N33M64
$$ 79616 78895 79138 79470 79358 79054 78894 78742 78450 78293 78527 78881 78995 79062 79537 80396 81218 81820 82353 82817
52513H2817J92NK19N53M38j50o46o11j69L23O96R47R57M68m76j223j030pQ03O53
$$ 82817 83009 83014 83233 83786 84224 84074 83428 82817 82648 82971 83667 84614 85571 86039 85563 84340 83310 83303 84106 84759
52493H4759K1j09L88P87O88M45L79L13J27J04L82O13N61N25P65R87P70K18k85
$$ 84759 84780 84671 85059 85846 86534 86979 87358 87671 87798 87902 88284 88897 89458 89983 90748 91735 92505 92723 92438
52474I2438o00p18m78J50P37Q43O38N98P84Q87Q68J044J496J870J836J436Q58
$$ 92438 91838 91120 90642 90792 91529 92372 93010 93608 94392 95279 96147 97191 98687 100557 102393 103829 104687
52457A04687K67j09j6N12J041J159Q15K00n06j098j269r04l03J22L37O20R80R75
$$ 104687 104954 104845 104829 105341 106382 107541 108356 108556 108050 106952 105683 104779 104476 104598 104935 105555 106535 107510
52439A07510K82p26j315j136m49K63O31M71p9n40n94n93j109j909j990q89O07
$$ 107510 107792 107066 105751 104615 104166 104429 105060 105531 105452 104912 104318 103725 102616 100707 98717 97828 98435
52422I8435J415J291O49k08j076j515j252o64k95j32Q0J93O1K32J260K517K822
$$ 98435 99850 101141 101790 101582 100506 98991 97739 97075 96780 96648 96728 96921 96982 97214 98474 100991 103813
52405A03813K113J431J122L79j059k057j729q68o60q95n37M27R71O59J43j8j0
$$ 103813 105926 107357 108479 108858 107799 105742 104013 103145 102485 101590 101053 101480 102451 103110 103253 103235 103225
52388A03225o7L1L70N18J79k08l2N96R83P40K09q5q9r8j12K65J124J766J382J60
$$ 103225 103158 103189 103559 104077 104256 104048 104016 104612 105595 106335 106544 106459 106370 106272 106160 106425 107549 109315 110697 110857
52368A10857p95p68k26j7k93n21l23J35M21K36l62q48o81K0N04L80J79N08J095
$$ 110857 110062 109294 109068 109051 108758 108237 107914 108049 108470 108706 108344 107496 106815 106835 107339 107719 107898 108406 109501
52349A09501J249R25O03L32k75j088j315o26L15P73Q08P92O28M1o54p90k19M85
$$ 109501 110750 111675 112278 112610 112335 111247 109932 109306 109621 110394 111202 111994 112622 112663 112009 111219 111000 111485
52331A11485Q08P95P35O67M60J47o9j19k10n54j031j221q56j62L99O43P30P06
$$ 111485 112293 113088 113823 114490 114950 115097 115028 114909 114699 114145 113114 111893 111037 110875 111274 111917 112647 113353
52313A13353L94q6r3Q03K007K402J746J034J162J737J756J140Q45J395K044J820
$$ 113353 113747 113661 113568 114371 116378 118780 120526 121560 122722 124459 126215 127355 128200 129595 131639 133459
52297A33459Q49Q5l4P6J08M43J417K528K867K204J157L82J5j5L69J110J662J379
$$ 133459 134308 134393 134359 134435 134543 134986 136403 138931 141798 144002 145159 145541 145556 145541 145910 147020 148682 150061
52279A50061L23o52p95j66O41J274J740J912J397J57j054j279m86K75J0j052j735
$$ 150061 150384 149732 148937 148771 149412 150686 152426 154338 155735 155892 154838 153559 153073 153348 153358 152306 150571
52262A50571j286j90N28N46L60L86M73M81P24J416K083K070J493J071J105J253
$$ 150571 149285 149095 149623 150169 150529 150915 151388 151869 152593 154009 156092 158162 159655 160726 161831 163084
52246A63084J344J667K257K534K097J393J140J412J796K101K484K978L413L663
$$ 163084 164428 166095 168352 170886 172983 174376 175516 176928 178724 180825 183309 186287 189700 193363
52232A93363L743L717L721L859L936L624L121L145L963M830M938M483M188M212
$$ 193363 197106 200823 204544 208403 212339 215963 219084 222229 226192 231022 235960 240443 244631 248843
52218B48843M170L958L756L462K947K692L297M366M830M447M121M522N235N603
$$ 248843 253013 256971 260727 264189 267136 269828 273125 277491 282321 286768 290889 295411 300646 306249
52204C06249N603N464N069M299L464K974K917L212L772M274M292L868L498L395
$$ 306249 311852 317316 322385 326684 330148 333122 336039 339251 343023 347297 351589 355457 358955 362350
52190C62350L316L249L508L869L512K262J082P81J026J237J591K287K596J835
$$ 362350 365666 368915 372423 376292 379804 382066 383148 383929 384955 386192 387783 390070 392666 394501
52176C94501P30O03J484K178K063J679J610J871K469L441M120L527J940J021J738
$$ 394501 395231 395834 397318 399496 401559 403238 404848 406719 409188 412629 416749 420276 422216 423237 424975
52161D24975L146L877M029M564N519N944N534N165N554O175N990M859L665L207
$$ 424975 428121 431998 436027 440591 446110 452054 457588 462753 468307 474482 480472 485331 488996 492203
52147D92203L336L375L098K958L267L504K930J630M84M3k0j16o7L44O72L63k88
$$ 492203 495539 498914 502012 504970 508237 511741 514671 516301 516785 516828 516808 516692 516625 516969 517641 518004 517716
52130E17716m87j63j10p63j536j708j399j239j475j888k327k780l091l051k711
$$ 517716 517229 517066 516956 516193 514657 512949 511550 510311 508836 506948 504621 501841 498750 495699 492988
52115D92988k272j704r09j62N5k53n78o24o64j010j547k000k306k432k243j810
$$ 492988 490716 489012 488103 487941 487996 487743 487165 486541 485877 484867 483320 481320 479014 476582 474339 472529
52099D72529j589j855k279k351k093j923j997k113k137k150k157k022j712j308
$$ 472529 470940 469085 466806 464455 462362 460439 458442 456329 454192 452042 449885 447863 446151 444843
52085D44843q84n85p28j416k211k523k366k228k248j990j204l87l11j201k533
$$ 444843 443959 443374 442646 441230 439019 436496 434130 431902 429654 427664 426460 426073 425762 424561 422028
52070D22028l488l570k952k275k008k039j982j717j384j092r43j118j528j661
$$ 422028 418540 414970 412018 409743 407735 405696 403714 401997 400613 399521 398578 397460 395932 394271
52056C94271j262r29j364k187k318j513p11o35r20r27o78m67k07K38N93N57L49
$$ 394271 393009 392080 390716 388529 386211 384698 383987 383352 382432 381505 380827 380360 380153 380391 380984 381541 381890
52039C81890L82P52J382K263L099L242K588K071K585L710M237L859L509L999N050
$$ 381890 382272 383024 384406 386669 389768 393010 395598 397669 400254 403964 408201 412060 415569 419568 424618
52024D24618N842O083O100O205O318O191N830N551N584N743N683N470N513N900
$$ 424618 430460 436543 442643 448848 455166 461357 467187 472738 478322 484065 489748 495218 500731 506631
52010E06631O202O116N864N699N475N051M707M674M578L948L008K401K277K226
$$ 506631 512833 518949 524813 530512 535987 541038 545745 550419 554997 558945 561953 564354 566631 568857
51996E68857K034J866J753J488J120R88J042O80m11j620k057j677j375j922l093
$$ 568857 570891 572757 574510 575998 577118 578106 579148 579828 579417 577797 575740 574063 572688 570766 567673
51981E67673m022m179l758l140k413j692j430j932k688k882k527k394k670k571
$$ 567673 563651 559472 555714 552574 550161 548469 547039 545107 542419 539537 537010 534616 531946 529375
51967E29375j671p69p96j407j517q34l4L12J89l40j146j622j125mN70J23m72k59
$$ 529375 527704 526935 526139 524732 523215 522381 522347 522659 522848 522508 521362 519740 518615 518611 519181 519304 518832 518573
51949E18573M54N66m06j814k665k520j715j009j023j788k799l555m016m494n190
$$ 518573 519027 519593 519187 517373 514708 512188 510473 509464 508441 506653 503854 500299 496283 491789 486599
51934D86599n981o624p028p298p527p675p682p661p785q051q278q323q162p877
$$ 486599 480618 473994 466966 459668 452141 444466 436784 429123 421338 413287 405009 396686 388524 380647
51920C80647p765q280r454j0500j0491r518q557q212q236q384q856r464r354q219
$$ 380647 372882 364602 355148 344648 334157 324639 316082 307870 299634 291250 282394 272930 263576 255357
51906B55357p061o877p172o733n446m310l874l794l845m294n063n543n432n044
$$ 255357 248296 241419 234247 227514 222068 217758 213884 210090 206245 201951 196888 191345 185913 180869
51892A80869m538l634k447j746j984k618k859k580k076j470q55n70q09j159j074
$$ 180869 176331 172697 170250 168504 166520 163902 161043 158463 156387 154917 154062 153492 152683 151524 150450
51877A50450o14l86p68j511k041k010j546j097r72j014q78n45l45m55o72p59p37
$$ 150450 149836 149450 148682 147171 145130 143120 141574 140477 139505 138491 137613 137068 136723 136268 135596 134837 134100
51860A34100p38p91q10p14m88l06m50r81j548j784j704j469r97k78J89j12q42
$$ 134100 133362 132571 131761 131047 130559 130253 129803 128822 127274 125490 123786 122317 121320 121042 121231 121119 120277
51843A20277j046l28O97J227J030L44m16p19k82M79P94N03J45O8K7j20n8K79L13
$$ 120277 119231 118903 119600 120827 121857 122201 121785 121066 120784 121263 122057 122560 122705 122773 122800 122680 122622 122901 123214
51824A23214l23j098j240o95M9O93J135J126O02R2J80O22O22qn91n96k93k15l07
$$ 123214 122891 121793 120553 119858 119907 120600 121735 122861 123463 123555 123735 124357 124979 124971 124380 123784 123491 123276 122969
51805A22969j11M56Q91P16P3m91o51n45m18l16k44l71p05p95j21J137K085K006
$$ 122969 122858 123314 124205 124921 124994 124503 123852 123307 122889 122573 122329 121958 121253 120458 120337 121474 123559 125565
51787A25565J091J98l6K95N88M32Q1J11O09R88P81K95J04K36K83J51J05K47M53
$$ 125565 126656 126854 126818 127113 127701 128133 128214 128325 128934 129922 130703 130998 131102 131338 131621 131772 131877 132124 132577
51768A32577P54J209J527J420J232J521K077K169J816J832K381K453J409J61J1
$$ 132577 133331 134540 136067 137487 138719 140240 142317 144486 146302 148134 150515 152968 154377 154538 154549
51753A54549R02J682J716J414J330J490J703J943K281K749L336L878M129M101
$$ 154549 155451 157133 158849 160263 161593 163083 164786 166729 169010 171759 175095 178973 183102 187203
51739A87203M142M420M511L895K651J373M65j58p50j448k242k953l264l011k460
$$ 187203 191345 195765 200276 204171 206822 208195 208660 208502 207752 206304 204062 201109 197845 194834 192374
51724A92374k117k236k533k456j707o04J19M7m57p44o72o45r37j350j584j511
$$ 192374 190257 188021 185488 183032 181325 180721 180840 180887 180430 179686 179014 178369 177432 176082 174498 172987
51708A72987j121n76k93n32r29r69q13j002j342j067k05J66n03j354j450j122
$$ 172987 171866 171290 170997 170465 169536 168567 167754 166752 165410 164343 164138 164304 163801 162447 160997 159875
51692A59875j132j319j060n27l86n63m35l5M6j15K42J150J520O11r33j993k242
$$ 159875 158743 157424 156364 155837 155451 154888 154453 154418 154464 154349 154591 155741 157261 157872 156939 154946 152704
51675A52704k053j658j074n26l14l49k18K12O31P45O78P82J179J610J718J375
$$ 152704 150651 148993 147919 147393 147079 146730 146512 146724 147355 148100 148778 149560 150739 152349 154067 155442
51659A55442O91j36q36j046o45l9J98O3J66P75J291J036K20l55l87l19n24p65
$$ 155442 156133 155997 155161 154115 153470 153431 153629 153692 153858 154633 155924 156960 157180 156825 156438 156119 155595 154830
51641A54830o79m16m60r28j356j284q79p35j057j403j407j386j793k293k068r57
$$ 154830 154151 153735 153275 152347 150991 149707 148828 148093 147036 145633 144226 142840 141047 138754 136686 135729
51625A35729K43P92O17o7j030j636j036O60K058J960P43l62q38r92r63n01K61
$$ 135729 135972 136764 137381 137314 136284 134648 133612 134272 136330 138290 139033 138671 137833 136841 135878 135377 135638
51608A35638O73L04n78j355j553j098m11j12k91l37J69P55P29K28p1n1k07o89
$$ 135638 136311 136615 136037 134682 133129 132031 131620 131508 131217 130880 131049 131804 132533 132761 132690 132639 132432 131743
51590A31743r82o67J1M94M60M1k51P1P96J046L63n30n92J93J013J440J703J851
$$ 131743 130761 130094 130105 130599 131059 131100 130849 130920 131716 132762 133125 132595 132003 132196 133209 134649 136352 138203
51572A38203J588R41L84J28p8k92k70PK70N61J186J935K075J425P29O62J046J392
$$ 138203 139791 140732 141116 141244 141166 140874 140604 140611 140881 141442 142628 144563 146638 148063 148792 149454 150500 151892
51554A51892J620J866K011J833J319N96j35m79j27N94R64Q35P74J056J170P64
$$ 151892 153512 155378 157389 159222 160541 161137 161002 160523 160396 160990 161954 162789 163563 164619 165789 166553
51538A66553L23L87O20M14l4K7O99J229J036L53k39n32o99q39p81l99J6m5o09
$$ 166553 166876 167263 167883 168297 168263 168290 168989 170218 171254 171607 171368 170836 170137 169298 168517 168118 168134 168089 167480
51519A67480r66n39K17K88n29j406j699j662j614j201j38Q71P84l67j484j751
$$ 167480 166514 165975 166192 166480 165951 164545 162846 161184 159570 158369 158231 159102 159886 159519 158035 156284
51503A56284j328p48k13K81N98N33P2n31q58o25K5N03M21J03J37N21N97Mp63r69
$$ 156284 154956 154208 153995 154276 154874 155407 155479 154948 154090 153465 153490 153993 154414 154517 154654 155175 155772 155776 155013 154044
51483A54044n35j5K22M01Q70J496J735J262L73k85l04K12Q00J045Q93P02R45J722
$$ 154044 153509 153494 153716 154117 154987 156483 158218 159480 159853 159568 159264 159476 160276 161321 162214 162916 163861 165583
51465A65583K558K812K300J514J176J563K256K532K086J295P56O37O97P92J007
$$ 165583 168141 170953 173253 174767 175943 177506 179762 182294 184380 185675 186431 187068 187765 188557 189564
51450A89564J287J351J102Q20P75J002J514K265K727K177Q26k1M36J325J332N73
$$ 189564 190851 192202 193304 194124 194899 195901 197415 199680 202407 204584 205410 205389 205825 207150 208482 209055
51434B09055K02M63M07m85j534k041k217k493k758k763k622k424j946j256r62
$$ 209055 209257 209720 210127 209642 208108 206067 203850 201357 198599 195836 193214 190790 188844 187588 186626
51419A86626j370j912j912j489j146r78q02o65o23l54L03P60K66r85j874j599
$$ 186626 185256 183344 181432 179943 178797 177819 177017 176352 175729 175375 175678 176438 176704 175719 173845 172246
51403A72246m49N68O19l61j647k376k403k368k783l357l473k968k170j414r58
$$ 172246 171797 172365 172984 172623 170976 168600 166197 163829 161046 157689 154216 151248 149078 147664 146706
51388A46706j029j506j829j625j210j079j150j012o69m98o07p78r04r96q50l50
$$ 146706 145677 144171 142342 140717 139507 138428 137278 136266 135597 135099 134492 133714 132810 131814 130964 130614
51372A30614J3l96j281j501m91R14J450Q22k44j039j448j617j520j071m41K3J90
$$ 130614 130627 130231 128950 127449 126958 127872 129322 130144 129900 128861 127413 125796 124276 123205 122764 122787 122977
51355A22977K27K42Q4k94n20k22L63O87P46J025J491J388M00o79r64o43l64p3
$$ 122977 123204 123446 123530 123236 122716 122494 122857 123544 124290 125315 126806 128194 128594 127915 126951 126308 125944 125871
51337A25871O54J407J236J32p36n92k4Jn46r58p42M1J053J812J868J228M52L5
$$ 125871 126525 127932 129168 129300 128564 127972 127948 127949 127403 126445 125703 125744 126797 128609 130477 131705 132157 132192
51319A32192r4j68j23J20J54m81j502k044j686q91l07n5N6L2k14m73m10k47p06
$$ 132192 132098 131930 131807 131927 132081 131600 130098 128054 126368 125477 125170 125115 125171 125203 124989 124516 124106 123859 123153
51300A23153k078l551l915k879j362m52m48r85j642k069j885r64J96P99N33k44
$$ 123153 121075 117524 113609 110730 109368 108916 108468 107483 105841 103772 101887 100923 101119 101918 102451 102207
51284A02207j059j707k029j821j161n64m79p47q32m78R0N66R01J135J162Q54L62
$$ 102207 101148 99441 97412 95591 94430 93866 93387 92640 91808 91330 91420 91986 92887 94022 95184 96038 96400
51267I6400J20L74Q20Q29J27q28j249p92R4O37N19Q2j76k03k79m75m82j35K26
$$ 96400 96520 96894 97714 98543 98670 97842 96593 95801 95895 96532 97051 97133 96957 96754 96475 96000 95518 95383 95609
51248I5609J78j94m75n37n81n72j91N16Q88M26n22j182j233r54o22k28K48O20
$$ 95609 95787 95593 95118 94581 94000 93428 93237 93753 94641 95067 94545 93363 92130 91176 90554 90326 90574 91194
51230I1194O52L26j27m21m81n29p36q68n45N9K50k11o25k38O91J150O05n41j541
$$ 91194 91846 92172 92045 91624 91143 90614 89878 89010 88465 88524 88774 88563 87938 87700 88391 89541 90146 89605 88064
51211H8064j896j466n01L61N63J81k21k96j52LN5j30n56q66o87k07P3J75O13J389
$$ 88064 86168 84702 84201 84562 85125 85306 85085 84789 84637 84640 84695 84565 84009 83143 82456 82249 82322 82497 83110 84499
51191H4499J684R26l22j002p52p8L91M28K28K12O79J399J795J708J611J743J529
$$ 84499 86183 87109 86787 85785 85033 84955 85346 85774 86002 86214 86893 88292 90087 91795 93406 95149 96678
51174I6678M43r15j409q32o9K40L60N99N90m1q30r39k93L40L59j1j82P8M66N82
$$ 96678 97121 96206 94797 93965 93896 94136 94496 95095 95685 95644 94814 93875 93582 93922 94281 94270 94088 94166 94632 95214
51154I5214L85K15L73P53R85R53R32J087J130O81r4n91m30J38N32L66j91n08k4
$$ 95214 95599 95814 96187 96940 97925 98878 99810 100897 102027 102708 102614 102023 101593 101731 102263 102629 102438 101930 101906
51135A01906J063J862J783J193P90N82O5o78r49n62k65n62r04o12m4l3n84r55
$$ 101906 102969 104831 106614 107807 108597 109179 109244 108566 107617 107055 106790 106228 105324 104712 104668 104635 104051 103096
51117A03096q72p52p53n19m2J05k91o32n20m70r58j420j025r5K00m72j119q13
$$ 103096 102224 101472 100719 100200 100158 100263 99972 99340 98820 98350 97392 95972 94947 94852 95052 94580 93461 92648
51099I2648J58Q29O91r2j057j602j140K52J526J664R59O37J129J446P25k77j17
$$ 92648 92806 93635 94326 94234 93177 91575 90435 90687 92213 93877 94836 95473 96602 98048 98773 98496 98379
51082I8379J199K037J223m72j440j143l36J78K72K13K88P14J354J607J052J79
$$ 98379 99578 101615 102838 102366 100926 99783 99447 99625 99897 100110 100398 101112 102466 104073 105125 105304
51066A05304r0L82P91N98J86J33M15O87R03J133J249J200J338J913K490K379J568
$$ 105304 105214 105596 106387 106985 107171 107304 107719 108406 109309 110442 111691 112891 114229 116142 118632 121011 122579
51049A22579P91O06P45N42k73j251j665j189j99O34R75R04N05k84j354k315k823
$$ 122579 123370 123976 124721 125263 124990 123739 122074 120885 120686 121320 122295 123199 123704 123420 122066 119751 116928
51032A16928k741j995o58O11Q95P9q46r09k52L68O48P58O66K33k15j49L42O39
$$ 116928 114187 112192 111534 112145 113040 113119 112273 111364 111112 111480 112128 112886 113552 113785 113570 113421 113763 114402
51014A14402N92O78J072J187N81k97o67m17o1K2r4k61m92q11j036q61j42Q37J435
$$ 114402 114994 115672 116744 117931 118512 118215 117548 117131 117070 117092 116998 116737 116245 115434 114398 113537 113395 114232 115667
50995A15667J148J88o47p87m46k04k18k05k9Q1O3K62Q39J246Q72M1k48K89Q08
$$ 115667 116815 117003 116356 115569 115123 114919 114701 114496 114467 114548 114611 114873 115712 116958 117830 117871 117623 117912 118720
50976A18720O32K75N37J152J220P14N83J276K081K164J504N10m89r78l62J082
$$ 118720 119352 119627 120164 121316 122536 123250 123833 125109 127190 129354 130858 131368 130879 129901 129539 130621
50960A30621K071J855J261J462K255K519J962J381J322J498J634J917K395K625
$$ 130621 132692 134547 135808 137270 139525 142044 144006 145387 146709 148207 149841 151758 154153 156778
50946A56778K366J970J791J673J359R55P00O21P12J136J888K548K701K542K684
$$ 156778 159144 161114 162905 164578 165937 166892 167592 168213 168925 170061 171949 174497 177198 179740 182424
50931A82424L373M103M162L489K790K743L236L631L636L494L373L135K883L131
$$ 182424 185797 189900 194062 197551 200341 203084 206320 209951 213587 217081 220454 223589 226472 229603
50917B29603M026M945N365N718O685Q031Q929R197R431J0012J0780J1658J2837
$$ 229603 233629 238574 243939 249657 256342 264373 273302 282499 291930 301942 312722 324380 337217
50904C37217J4177J5168J5707J6208J6832J7237J7311J7443J7757J7731J7008
$$ 337217 351394 366562 382269 398477 415309 432546 449857 467300 485057 502788 519796
50893E19796J5958J5031J4047J2718J1355J0480R967R228Q100P003O255N702N127
$$ 519796 535754 550785 564832 577550 588905 599385 609352 618580 626680 633683 639938 645640 650767
50880F50767M585M181L815L302K691K228K058J982J595O50p32k182l428m530n895
$$ 650767 655352 659533 663348 666650 669341 671569 673627 675609 677204 677854 677122 674940 671512 666982 661087
50865F61087p884j0307j2410j3655j4407j5408j6669j7506j7714j7928j8420j8434
$$ 661087 653203 642896 630486 616831 602424 587016 570347 552841 535127 517199 498779 480345
50853D80345j7369j5869j4841j4025j2631j0953j0064j0037r744q508o848n386
$$ 480345 462976 447107 432266 418241 405610 394657 384593 374556 364812 356304 349456 344070
50841C44070m150l246l094l474l304j996l20O46P66N81M93P28J372J983J818R13
$$ 344070 339920 336674 333580 330106 326802 324806 324486 325132 325898 326479 326972 327700 329072 331055 332873 333786
50825C33786L00O38J369J810K152K655K762K062J468K168L761M653M181L227K728
$$ 333786 334086 334724 336093 337903 340055 342710 345472 347534 349002 351170 354931 359584 363765 366992 369720
50810C69720K612K557K792L692N071O328P136P721Q592R995J1574J2704J3275
$$ 369720 372332 374889 377681 381373 386444 392772 399908 407629 416221 426216 437790 450494 463769
50797D63769J3851J4840J5948J6891J8101K0097K2502K4415K5654K6929K8813
$$ 463769 477620 492460 508408 525299 543400 563497 585999 610414 636068 662997 691810
50786F91810L1175L3591L5729L7266L8007L8270L8677L9395L9876L9449L7912
$$ 691810 722985 756576 792305 829571 867578 905848 944525 983920 1023796 1063245 1101157
50775A101157L5525L2726K9844K6925K3895K0999J8665J6749J4500J1813R887
$$ 1101157 1136682 1169408 1199252 1226177 1250072 1271071 1289736 1306485 1320985 1332798 1342685
50764A342685R788J0817J1395J1332J1979J3966J5997J6479J5369J3762J2299
$$ 1342685 1352473 1363290 1374685 1386017 1397996 1411962 1427959 1444438 1459807 1473569 1485868
50753A485868J0654Q156M406m42n546r889j3271j6429j9885k3185k5628k7271
$$ 1485868 1496522 1504678 1509084 1508642 1503096 1493207 1479936 1463507 1443622 1420437 1394809 1367538
50741A367538k8546k9296k8898k7214k4809k2202j9426j6252j2529q243l544J309
$$ 1367538 1338992 1309696 1280798 1253584 1228775 1206573 1187147 1170895 1158366 1150123 1146579 1147888
50729A147888O149J0942J5441J9179K2126K5031K8522L2056L4349L4804L3934
$$ 1147888 1154037 1164979 1180420 1199599 1221725 1246756 1275278 1307334 1341683 1376487 1410421
50718A410421L2376L0154K7106K3383J9238J4733J0009N346P15m261r503j4239
$$ 1410421 1442797 1472951 1500057 1523440 1542678 1557411 1567420 1572766 1573481 1569220 1559717 1545478
50706A545478j8075k1830k6462l1491l5433l7754l9452m1473m3433m4388m4127
$$ 1545478 1527403 1505573 1479111 1447620 1412187 1374433 1334981 1293508 1250075 1205687 1161560
50695A161560m3092m1520l9356l6681l3636l0175k6402k2936k0208j7688j4481
$$ 1161560 1118468 1076948 1037592 1000911 967275 937100 910698 887762 867554 849866 835385
50684H35385j0615p041m319k039L39K804N220P724J0343J2779J4988J7479K0564
$$ 835385 824770 817729 813410 811371 811710 814514 819734 827458 837801 850580 865568 883047 903611
50671I03611K3701K6104K7701K9016L0311L1360L1901L1822L0989K9328K7106
$$ 903611 927312 953416 981117 1010133 1040444 1071804 1103705 1135527 1166516 1195844 1222950
50660A222950K4776K2486K0045J7328J4464J1642R011O758N072L920L135K711
$$ 1222950 1247726 1270212 1290257 1307585 1322049 1333691 1342702 1349460 1354532 1358452 1361587 1364298
50648A364298K845L602M717N836O855P927R137J0267J0970J1141J0940J0419R299
$$ 1364298 1367143 1370745 1375462 1381298 1388153 1396080 1405217 1415484 1426454 1437595 1448535 1458954 1468253
50635A468253P438N275L466K085N78j399l464m883n163m180k157K60K327L904
$$ 1468253 1475691 1480966 1484432 1486517 1487095 1485696 1482232 1477349 1472186 1468006 1465849 1466109 1468436 1472340
50621A472340N666Q360J2011J6002J9780K3319K7096L1652L7033M2685M8197N3978
$$ 1472340 1478006 1486366 1498377 1514379 1534159 1557478 1584574 1616226 1653259 1695944 1744141 1798119
50609A798119O0723O8252P5617Q2271Q8290R3156R5467R4533R1380Q7296Q2138
$$ 1798119 1858842 1927094 2002711 2084982 2173272 2266428 2361895 2456428 2547808 2635104 2717242
50598B717242P5183O7083N9507N2997M6398L8692L0250K1782J3178M065n178j3752
$$ 2717242 2792425 2859508 2919015 2972012 3018410 3057102 3087352 3109134 3122312 3126377 3121199 3107447
50586C107447k1406k8312l4253l8667m1505m3411m4793m5174m3829m0846l7100
$$ 3107447 3086041 3057729 3023476 2984809 2943304 2899893 2855100 2809926 2766097 2725251 2688151
50575B688151l3178k8895k4097j9503j6085j3881j2083j0450r871j1080j3479
$$ 2688151 2654973 2626078 2601981 2582478 2566393 2552512 2540429 2529979 2520108 2509028 2495549
50564B495549j5859j7870k0026k2406k4229k4804k4373k3634k2829k1620j9669
$$ 2495549 2479690 2461820 2441794 2419388 2395159 2370355 2345982 2322348 2299519 2277899 2258230
50553B258230j7025j3891j0298o266k290O99K157K538K666K633J838L9k386n369
$$ 2258230 2241205 2227314 2217016 2210750 2208460 2209159 2211316 2213854 2216520 2219153 2220991 2221030 2218644 2213275
50539B213275r546j5282k1873k8280l4057l9125m3203m6207m8660n0970n2615
$$ 2213275 2203729 2188447 2166574 2138294 2104237 2065112 2021909 1975702 1927042 1876072 1823457
50528A823457n2837n1910n0858n0106m9109m7266m4517m1142l7623l4609l2302
$$ 1823457 1770620 1718710 1667852 1617746 1568637 1521371 1476854 1435712 1398089 1363480 1331178
50517A331178k9887k6290k1546j6783j2876r729o912m249j557J441M628P455R554
$$ 1331178 1301291 1275001 1253455 1236672 1223796 1214067 1207155 1202906 1201349 1202790 1207418 1214873 1224427
50504A224427J1134J2582J4164J6148J8725K1657K4445K6998K9787L3227L7294
$$ 1224427 1235561 1248143 1262307 1278455 1297180 1318837 1343282 1370280 1400067 1433294 1470588
50493A470588M1768M6493N1315N6185O1298O6777P2198P6872Q0449Q2843Q3737
$$ 1470588 1512356 1558849 1610164 1666349 1727647 1794424 1866622 1943494 2023943 2106786 2190523
50482B190523Q2847Q0606P7858P4836P1207O7193O3811O1673O0249N8741N7081
$$ 2190523 2273370 2353976 2431834 2506670 2577877 2645070 2708881 2770554 2830803 2889544 2946625
50471B946625N5528N3802N1295M8056M5049M3358M3246M4056M4935M5637M6492
$$ 2946625 3002153 3055955 3107250 3155306 3200355 3243713 3286959 3331015 3375950 3421587 3468079
50460C468079M7656M8753M9389M9519M8933M6934M3087L7842L1700K4204J4621
$$ 3468079 3515735 3564488 3613877 3663396 3712329 3759263 3802350 3840192 3871892 3896096 3910717
50449C910717L278q708k0761l2850m4452n4743o3807p2346p9997q5208q7184q6691
$$ 3910717 3913995 3905287 3884526 3851676 3807224 3752481 3688674 3616328 3536331 3451123 3363939 3277248
50437C277248q4498q0199p3372o4709n5219m5151l4682k4800j6532r817m125J78
$$ 3277248 3192750 3112551 3039179 2974470 2919251 2874100 2839418 2814618 2798086 2788269 2784144 2784322
50425B784322K034Q75l091r592j8408k8901m0063n1043o1280p0325p7873q3776
$$ 2784322 2786356 2787231 2784140 2774548 2756140 2727239 2687176 2636133 2574853 2504528 2426655 2342879
50413B342879q7810q9719q9701q8458q6447q3607p9978p6024p1963o7492o2588
$$ 2342879 2255069 2165350 2075649 1987191 1900744 1817137 1737159 1661135 1589172 1521680 1459092
50402A459092n7960n4039n0262m6023m1726l8036l4592l0486k5818k1819j9310
$$ 1459092 1401132 1347093 1296831 1250808 1209082 1171046 1136454 1105968 1080150 1058331 1039021
50391A039021j7805j6251j4128j1684r374p320n224k919q70L11Q82J907L970O510
$$ 1039021 1021216 1004965 990837 979153 969779 962459 957235 954316 953446 953757 954639 956546 960516 967026
50377I67026Q738J0498J1883J2827J3673J5356J8203K1146K3002K4026K5388K7542
$$ 967026 975764 986262 998145 1010972 1024645 1040001 1058204 1079350 1102352 1126378 1151766 1179308
50365A179308L0048L2637L5422L8179M0348M1791M2795M3414M3502M3320M3367
$$ 1179308 1209356 1241993 1277415 1315594 1355942 1397733 1440528 1483942 1527444 1570764 1614131
50354A614131M3724M4211M5023M6437M8027M8990M9247M9399M9556M9011M7332
$$ 1614131 1657855 1702066 1747089 1793526 1841553 1890543 1939790 1989189 2038745 2087756 2135088
50343B135088M5008M2669M0267L7387L3967L0268K6301K1536J5338P722l08p664
$$ 2135088 2180096 2222765 2263032 2300419 2334386 2364654 2390955 2412491 2427829 2435551 2435243 2427579
50331B427579j4447k1816l0263l8664m5670n1361n6558o1031o3540o3619o2180
$$ 2427579 2413132 2391316 2361053 2322389 2276719 2225358 2168800 2107769 2044229 1980610 1918430
50320A918430o0103n7189n2890m7309m1058l4667k8503k2883j7922j3518r736
$$ 1918430 1858327 1801138 1748248 1700939 1659881 1625214 1596711 1573828 1555906 1542388 1532652
50309A532652o868n097m398m870o821j0352j5073k0273k5219k9383l2648l5240
$$ 1532652 1525784 1520687 1516289 1511419 1504598 1494246 1479173 1458900 1433681 1404298 1371650 1336410
50297A336410l7290l8647l9295l9511l9347l8350l6354l4110l2476l1292k9760
$$ 1336410 1299120 1260473 1221178 1181667 1142320 1103970 1067616 1033506 1001030 969738 939978
50286I39978k7665k5519k3618k1736j9751j7861j6181j4689j3484j2515j1215
$$ 939978 912313 886794 863176 841440 821689 803828 787647 772958 759474 746959 735744
50275G35744r127o761n092m285l659k866k258k033j864j523j146p48j23O38J175
$$ 735744 726617 719856 714764 710479 706820 703954 701696 699663 697799 696276 695130 694382 694259 694897 696072
50260F96072J460J743J905J697J574K404M196N892O673O678O405O226O663Q129
$$ 696072 697532 699275 701180 702877 704451 706855 711051 716943 723616 730294 736699 742925 749588 757717
50246G57717J0109J1548J2267J3004J3787J3530J1850J0014R175Q714P342N074
$$ 757717 767826 779374 791641 804645 818432 831962 843812 853826 863001 871715 879057 884131
50234H84131K904J144o74k577l962m739n605o990q488r512j0044j0576j1544j2943
$$ 884131 887035 888179 887505 884928 880966 876227 870622 863632 855144 845632 835588 825012 813468 800525
50220H00525j4286j5028j5138j5072j5039j4631j3431j1616r694p930o490n782
$$ 800525 786239 771211 756073 741001 725962 711331 697900 686284 676590 668660 662170 656388
50208F56388o116p100p801p596o697n832n511n526n197m283l406l292l737l930
$$ 656388 650272 643172 635371 627775 621078 615246 609735 604209 599012 594729 591323 588031 584294 580364
50194E80364l677l480l442k957j850r66j037j665j937j551p62J72Q89Q77J89k26
$$ 580364 576687 573207 569765 566808 564958 563992 562955 561290 559353 557802 557040 557212 558101 558978 559167 558941
50178E58941L47J346J679J183O18N29P82J055J127Q47M02L92J047J650J383N07
$$ 558941 559288 560634 562313 563496 564114 564643 565425 566480 567607 568454 568856 569248 570295 571945 573328 573835
50162E73835j02l10p36j484j865j505r05n64k82K15N65K80l71n64N0R04J240R61
$$ 573835 573733 573423 572687 571203 569338 567833 566928 566364 566082 566297 566862 567142 566771 566207 566257 567161 568401 569362
50144E69362O65Q69J446J917K072K067K024J976K151K861L910M653M801M775M996
$$ 569362 570027 570896 572342 574259 576331 578398 580422 582398 584549 587410 591320 595973 600774 605549 610545
50129F10545N291N320N141M918M563M054L694L650L693L740M165M978N346M656
$$ 610545 615836 621156 626297 631215 635778 639832 643526 647176 650869 654609 658774 663752 669098 673754
50115F73754L567L178L511L728L605L786M658N859O943P785Q277Q398Q639R635
$$ 673754 677321 680499 684010 687738 691343 695129 699787 705646 712589 720374 728651 737049 745688 755323
50101G55323J1294J2918J4207J5394J6436J6878J6669J6305J6076J5917J6116
$$ 755323 766617 779535 793742 809136 825572 842450 859119 875424 891500 907417 923533
50090I23533J7239J9058K0558K1388K2465K4566K7156K9313L1047L2942L5071
$$ 923533 940772 959830 980388 1001776 1024241 1048807 1075963 1105276 1136323 1169265 1204336
50079A204336L7179L9559M2873M7201N2081N7408O3635P0923P8686Q6205R3308
$$ 1204336 1241515 1281074 1323947 1371148 1423229 1480637 1544272 1615195 1693881 1780086 1873394
50068A873394J00217J06901J12740J16751J18098J16367J11454J03480R3108Q1770
$$ 1873394 1973611 2080512 2193252 2310003 2428101 2544468 2655922 2759402 2852510 2934280
50058B934280P1013O1439N2697M4518L7141L0445K3394J4810M359p852k2081l8522
$$ 2934280 3005293 3066732 3119429 3163947 3201088 3231533 3254927 3269737 3274096 3266244 3244163 3205641
50046C205641n6278p3535q8859j01754j11929j18803j22009j21912j19261j14643
$$ 3205641 3149363 3075828 2986969 2885215 2773286 2654483 2532474 2410562 2291301 2176658
50036B176658j08519j01561r4494q7666q0967p4137o7129o0224n3857m8243m3174
$$ 2176658 2068139 1966578 1872084 1784418 1703451 1629314 1562185 1501961 1448104 1399861 1356687
50025A356687l8292l3553k9253k5614k2549j9921j7771j6123j4716j3217j1672
$$ 1356687 1318395 1284842 1255589 1229975 1207426 1187505 1169734 1153611 1138895 1125678 1114006
50014A114006j0447r639q722p087m886l090k480k773k976k498j573o11M14J640
$$ 1114006 1103559 1093920 1085198 1078111 1073225 1070135 1067655 1064882 1061906 1059408 1057835 1057224 1057638 1059278
50000A059278K822L572L975M511N365O236O926P705Q879J0270J1449J2366J3383
$$ 1059278 1062100 1065672 1069647 1074158 1079523 1085759 1092685 1100390 1109269 1119539 1130988 1143354 1156737
49987A156737J4759J6374J8019J9695K1388K2821K3700K4247K5096K6566K8239
$$ 1156737 1171496 1187870 1205889 1225584 1246972 1269793 1293493 1317740 1342836 1369402 1397641
49976A397641K9513L0388L1368L2751L4382L6182L8370M0922M3354M5500M8129
$$ 1397641 1427154 1457542 1488910 1521661 1556043 1592225 1630595 1671517 1714871 1760371 1808500
49965A808500N2110N7103O1814O5713O9802P5326Q2392R0280R8771J08346J19262
$$ 1808500 1860610 1917713 1979527 2045240 2115042 2190368 2272760 2363040 2461811 2570157 2689419
49954B689419J31090J43267J55562J67755J79245J89128J96416K00057J99187
$$ 2689419 2820509 2963776 3119338 3287093 3466338 3655466 3851882 4051939 4251126
49945D251126J93664J84231J72137J58775J45597J33745J23261J13059J02032
$$ 4251126 4444790 4629021 4801158 4959933 5105530 5239275 5362536 5475595 5577627
49936E577627Q9887P6439O0517M0397J5430j3225m3536p3729j02457j28601j51465
$$ 5577627 5667514 5743953 5804470 5844867 5860297 5847072 5803536 5729807 5627350 5498749 5347284
49925E347284j70885j86812j98953k07140k11720k13284k12171k08484k02474
$$ 5347284 5176399 4989587 4790634 4583494 4371774 4158490 3946319 3737835 3535361
49916C535361j94514j84888j73935j62348j50942j40066j29597j19441j09728
$$ 3535361 3340847 3155959 2982024 2819676 2668734 2528668 2399071 2279630 2169902
49907B169902j00478r1570q3177p5861o9886o4774n9888n5231n1192m7710m4242
$$ 2169902 2069424 1977854 1894677 1818816 1748930 1684156 1624268 1569037 1517845 1470135 1425893
49896A425893m0640l7504l5386l4081l3003l1860l0554k8839k6676k4698k3561
$$ 1425893 1385253 1347749 1312363 1278282 1245279 1213419 1182865 1154026 1127350 1102652 1079091
49885A079091k2902k1665j9604j7669j6590j5881j4813j3641j2967j2387j0867
$$ 1079091 1056189 1034524 1014920 997251 980661 964780 949967 936326 923359 910972 900105
49874I00105q426o347n532n416m978l994k786j288P70L022M532M890M747N076
$$ 900105 891679 885332 879800 874384 869406 865412 862626 861338 862108 865130 869662 874552 879299 884375
49860H84375O067P064P531P855Q932J0957J3008J4039J4116J4209J4999J6377
$$ 884375 890442 897506 905037 912892 921824 932781 945789 959828 973944 988153 1003152 1019529
49848A019529J8134K0442K3377K6442K9019L1060L3082L5700L9299M3883M9030
$$ 1019529 1037663 1058105 1081482 1107924 1136943 1168003 1201085 1236785 1276084 1319967 1368997
49837A368997N4261N9760O6342P4468Q3549R2594J01205J09548J17509J24400
$$ 1368997 1423258 1483018 1549360 1623828 1707377 1799971 1901176 2010724 2128233 2252633
49827B252633J29401J31903J31404J27487J20082J09664R7190Q3934P1216N9918
$$ 2252633 2382034 2513937 2645341 2772828 2892910 3002574 3099764 3183698 3254914 3314832
49817C314832N0249M1990L4770K7885K0021R626m319k1845m2110o3696q4931j04283
$$ 3314832 3365081 3407071 3441841 3469726 3489747 3499373 3495054 3473209 3431099 3367403 3282472 3178189
49805C178189j20650j33363j42021j46483j46922j43879j38307j31387j23890
$$ 3178189 3057539 2924176 2782155 2635672 2488750 2344871 2206564 2075177 1951287
49796A951287j15694j06373r6351q6904p8802p1540o4340n7338n1115m5583m0258
$$ 1951287 1835593 1729220 1632869 1545965 1467163 1395623 1331283 1273945 1222830 1177247 1136989
49785A136989l5406l1980l0207k9085k7510k5307k2922k0667j8704j7281j6445
$$ 1136989 1101583 1069603 1039396 1010311 982801 957494 934572 913905 895201 877920 861475
49774H61475j5771j4781j3559j2591j2077j1735j1224j0552r895r279q610p975
$$ 861475 845704 830923 817364 804773 792696 780961 769737 759185 749290 740011 731401 723426
49762G23426p648p638p456o640n530n078n693o589o591n436l884k713j970j286
$$ 723426 715778 708140 700684 694044 688514 683436 677743 671154 664563 659127 655243 652530 650560 649274
49748F49274o21m43j153k417l180k727j634j280k153l085k610q67N11K79j092
$$ 649274 648653 648210 647057 644640 641460 638733 637099 635819 633666 630581 627971 627104 627615 627894 626802
49733F26802k142k028j192o55r00j475j685j528j633k217k602k079r36q5O9j26
$$ 626802 624660 622632 621440 620785 619885 618410 616725 615197 613564 611347 608745 606666 605730 605645 605714 605588
49717F05588l19n43q02q07l89J67L92P5n92j151j211q15l92k05n0K35K95k34r84
$$ 605588 605269 604726 603924 603117 602728 602895 603287 603362 602770 601619 600408 599593 599201 598996 598946 599181 599476 599242 598258
49698E98258j222q82o40q62j127r53m83j81k13m34o92q75q88p37m63m7M96Q17
$$ 598258 597036 596154 595514 594652 593525 592572 592089 591908 591695 591261 590569 589694 588806 588069 587606 587559 588055 588872
49680E88872M32o47j732k091j649r50n40m33k08L63Q61O92Ol92k42k67r45j494
$$ 588872 589304 588657 586925 584834 583185 582235 581695 581262 581054 581417 582278 582970 582976 582584 582342 582075 581130 579636
49662E79636r44K28O06k03j179j528j588j838k004j697j200j030j194j350j321
$$ 579636 578692 578920 579526 579323 578144 576616 575028 573190 571186 569489 568289 567259 566065 564715 563394
49647E63394j080o52k85l04n55n07l3M21O42Q94J164R83M49N10J579K593K305
$$ 563394 562314 561662 561377 561073 560518 560011 559978 560399 561041 561935 563099 564082 564531 565041 566620 569213 571518
49630E71518J002O3J82R16J706K441K995L017K451J739J392J547J945K131J847
$$ 571518 572520 572583 572765 573681 575387 577828 580823 583840 586291 588030 589422 590969 592914 595045 596892
49615E96892J401J418K053K791L291L838M531M711L913K878K668L130L190K556
$$ 596892 598293 599711 601764 604555 607846 611684 616215 620926 624839 627717 630385 633515 636705 639261
49601F39261K101K482L331M064M581M845M566L772L106K995L044K733K264K211
$$ 639261 641362 643844 647175 651239 655820 660665 665231 669003 672109 675104 678148 680881 683145 685356
49587F85356K634L150L676M500N596O425O570O288O174O426O655O413N743N110
$$ 685356 687990 691140 694816 699316 704912 711337 717907 724195 730369 736795 743450 749863 755606 760716
49573G60716M845M845M880N014N460O071O321N927N318N215N783O472O687O521
$$ 760716 765561 770406 775286 780300 785760 791831 798152 804079 809397 814612 820395 826867 833554 840075
49559H40075O538P011P586P822P740P656P608P355O899O606O730P165P701Q275
$$ 840075 846613 853624 861210 869032 876772 884428 892036 899391 906290 912896 919626 926791 934492 942767
49545I42767Q763Q904Q636Q314Q391Q984R871J0697J1140J1197J1358J2117J3208
$$ 942767 951530 960434 969070 977384 985775 994759 1004630 1015327 1026467 1037664 1049022 1061139 1074347
49532A074347J3848J3889J4130J5104J6223J6716J6898J7600J8721J9320J9144
$$ 1074347 1088195 1102084 1116214 1131318 1147541 1164257 1181155 1198755 1217476 1236796 1255940
49521A255940J9031J9633K0544K1107K1375K1725K2035K1959K1704K1878K2609
$$ 1255940 1274971 1294604 1315148 1336255 1357630 1379355 1401390 1423349 1445053 1466931 1489540
49510A489540K3320K3539K3510K3767K4327K4596K4098K3067K2191K1916K2130
$$ 1489540 1512860 1536399 1559909 1583676 1608003 1632599 1656697 1679764 1701955 1723871 1746001
49499A746001K2487K2741K2751K2390K1666K0814K0023J9190J8081J6728J5405
$$ 1746001 1768488 1791229 1813980 1836370 1858036 1878850 1898873 1918063 1936144 1952872 1968277
49488A968277J4283J3222J1982J0560R284Q516Q202P827P009O027N452N278M890
$$ 1968277 1982560 1995782 2007764 2018324 2027608 2036124 2044326 2052153 2059162 2065189 2070641 2075919 2080809
49475B080809L978L003K514K494K681L057L640M163M478M937N794O578O626O052
$$ 2080809 2084787 2087790 2090304 2092798 2095479 2098536 2102176 2106339 2110817 2115754 2121548 2128126 2134752 2140804
49461B140804N569N491N600N806O246O724O803O550O518O871P132O951O470N771
$$ 2140804 2146373 2151864 2157464 2163270 2169516 2176240 2183043 2189593 2196111 2202982 2210114 2217065 2223535 2229306
$$ [...]
##END NTUPLES=NMR SPECTRUM
##END=
