
##TITLE=UV1053_TOCA01-ROVE100D_6099910_yjoKhAglnJ
##JCAMPDX= 6.0         $$ Bruker NMR JCAMP-DX V2.0
##DATA TYPE= NMR SPECTRUM
##DATA CLASS= NTUPLES
##ORIGIN= BRUKER
##OWNER= Administrator
$$ 1.72 TOPSPIN		Version 2.1
$$ 2012-05-12 22:54:40.359 -0500  Administrator@TOPSPIN
$$ Compression mode = diff/dup
##.OBSERVE FREQUENCY= 400.13188235
##.OBSERVE NUCLEUS= ^1H
##.ACQUISITION MODE= SIMULTANEOUS (DQD)
##.ACQUISITION SCHEME= undefined
##.AVERAGES= 8
##.DIGITISER RES= 22
##SPECTROMETER/DATA SYSTEM= spect
##.PULSE SEQUENCE= zg30
##.SOLVENT NAME= COFFEE_meoh
##.SHIFT REFERENCE= INTERNAL, COFFEE_meoh, 1, 14.98061
##AUDIT TRAIL= $$ (NUMBER, WHEN, WHO, WHERE, PROCESS, VERSION, WHAT)
$$ ##TITLE= Audit trail, TOPSPIN		Version 2.1
$$ ##JCAMPDX= 5.01
$$ ##ORIGIN= Bruker BioSpin GmbH
$$ ##OWNER= Administrator
$$ $$ C:\Bruker\TOPSPIN/data/COFFEE/nmr/UV1053_TOCA01-ROVE100D_6099910_yjoKhAglnJ/10/pdata/1/auditp.txt
$$ ##AUDIT TRAIL=  $$ (NUMBER, WHEN, WHO, WHERE, PROCESS, VERSION, WHAT)
(   1,<2012-05-12 22:54:33.390 -0500>,<Administrator>,<TOPSPIN>,<go>,<TOPSPIN 2.1>,
      <created by zg
	started at 2012-05-12 22:53:26.796 -0500,
	POWCHK enabled, PULCHK disabled,
       configuration hash MD5:
       AF F2 23 6B 01 CD 40 DD E5 A1 38 A0 06 EA F7 77
       data hash MD5: 64K
       FA 9A 2B BE 0B AE AE FC BD EE 87 04 60 0E 3D 63>)
(   2,<2012-05-12 22:54:36.125 -0500>,<Administrator>,<TOPSPIN>,<proc1d>,<TOPSPIN 2.1>,
      <Start of raw data processing
       efp LB = 0 FT_mod = 6 PKNL = 1 PHC0 = 0 PHC1 = 0 SI = 32K 
       data hash MD5: 32K
       22 58 B9 93 70 D6 DD 3C 47 D0 E6 48 90 E2 16 B2>)
(   3,<2012-05-12 22:54:36.500 -0500>,<Administrator>,<TOPSPIN>,<proc1d>,<TOPSPIN 2.1>,
      <pk PHC0 = 213.783 PHC1 = 0 
       data hash MD5: 32K
       84 18 95 A7 00 A3 BB A7 2F FF 37 47 92 3C 90 C4>)
(   4,<2012-05-12 22:54:36.593 -0500>,<Administrator>,<TOPSPIN>,<proc1d>,<TOPSPIN 2.1>,
      <abs ABSG = 1 
       data hash MD5: 32K
       A9 D9 EC E4 F6 71 77 FA FB E3 A3 61 F4 45 7C A1>)
(   5,<2012-05-12 22:54:36.625 -0500>,<Administrator>,<TOPSPIN>,<proc1d>,<TOPSPIN 2.1>,
      <abs ABSG = 2 
       data hash MD5: 32K
       D5 01 2D DC 56 62 91 44 39 90 B7 69 BC DA 1F 75>)
(   6,<2012-05-12 22:54:36.656 -0500>,<Administrator>,<TOPSPIN>,<proc1d>,<TOPSPIN 2.1>,
      <abs ABSG = 3 
       data hash MD5: 32K
       2D 0F CD D3 C3 DA 66 9E DF E9 E4 92 83 DF 51 EA>)
(   7,<2012-05-12 22:54:36.687 -0500>,<Administrator>,<TOPSPIN>,<proc1d>,<TOPSPIN 2.1>,
      <abs ABSG = 4 
       data hash MD5: 32K
       61 47 C0 3D 45 D7 12 4C 68 A8 B5 60 E6 92 2F 4D>)
(   8,<2012-05-12 22:54:36.718 -0500>,<Administrator>,<TOPSPIN>,<proc1d>,<TOPSPIN 2.1>,
      <abs ABSG = 5 
       data hash MD5: 32K
       33 8A BB 39 DA 2F 7B B8 5D A9 3E 62 31 7A DE 73>)
$$ ##END=
$$ 
$$ $$ hash MD5
$$ $$ 9B DB D7 87 1C 7A 3A EC 51 9C 47 6F 5F 53 B1 9B
##$RELAX= 
##$RELAX= 
##$RELAX= 
##$RELAX= 
##$RELAX= 
##$RELAX= 
##$RELAX= 
$$ Bruker specific parameters
$$ --------------------------
$$ [...]
##$TP= (0..7)
150 150 150 150 150 150 150 150
##$TP07= 0
##$TPNAME0= <>
##$TPNAME1= <>
##$TPNAME2= <>
##$TPNAME3= <>
##$TPNAME4= <>
##$TPNAME5= <>
##$TPNAME6= <>
##$TPNAME7= <>
##$TPOAL= (0..7)
0.5 0.5 0.5 0.5 0.5 0.5 0.5 0.5
##$TPOFFS= (0..7)
0 0 0 0 0 0 0 0
##$TUNHIN= 0
##$TUNHOUT= 0
##$TUNXOUT= 0
##$USERA1= <user>
##$USERA2= <user>
##$USERA3= <user>
##$USERA4= <user>
##$USERA5= <user>
##$V9= 5
##$VALIST= <valist>
##$VCLIST= <CCCCCCCCCCCCCCC>
##$VD= 0
##$VDLIST= <DDDDDDDDDDDDDDD>
##$VPLIST= <PPPPPPPPPPPPPPP>
##$VTLIST= <TTTTTTTTTTTTTTT>
##$WBST= 2048
##$WBSW= 25
##$XGAIN= (0..3)
0 0 0 0
##$XL= 0
##$YL= 0
##$YMAX_a= 531749
##$YMIN_a= -632620
##$ZGOPTNS= <>
##$ZL1= 120
##$ZL2= 120
##$ZL3= 120
##$ZL4= 120
##$ABSF1= 14.98061
##$ABSF2= -5.57192
##$ABSG= 5
##$ABSL= 3
##$ALPHA= 0
##$AQORDER= 0
##$ASSFAC= 0
##$ASSFACI= 0
##$ASSFACX= 0
##$ASSWID= 0
##$AUNMP= <proc_prof1d_extract_pilot.lims>
##$AXLEFT= 0
##$AXNAME= <>
##$AXNUC= <1H>
##$AXRIGHT= 0
##$AXTYPE= 0
##$AXUNIT= <>
##$AZFE= 0.1
##$AZFW= 0.1
##$BCFW= 0
##$BC_mod= 0
##$BYTORDP= 0
##$COROFFS= 0
##$CY= 15
##$DATMOD= 1
##$DC= 0
##$DFILT= <>
##$DTYPP= 0
##$F1P= 0
##$F2P= 0
##$FCOR= 0.5
##$FTSIZE= 32768
##$FT_mod= 6
##$GAMMA= 0
##$GB= 0
##$INTBC= 1
##$INTSCL= 1
##$ISEN= 128
##$LB= 0
##$LEV0= 0
##$LPBIN= 0
##$MAXI= 10000
##$MC2= 0
##$MEAN= 0
##$ME_mod= 0
##$MI= 0
##$NCOEF= 0
##$NC_proc= -8
##$NLEV= 6
##$NOISF1= 0
##$NOISF2= 0
##$NSP= 0
##$NTH_PI= 0
##$NZP= 0
##$OFFSET= 14.98061
##$PC= 1
##$PHC0= 213.783
##$PHC1= 0
##$PH_mod= 1
##$PKNL= yes
##$PPARMOD= 0
##$PPDIAG= 0
##$PPIPTYP= 0
##$PPMPNUM= 2147483647
##$PPRESOL= 1
##$PSCAL= 4
##$PSIGN= 0
##$PYNMP= <proc.py>
##$REVERSE= no
##$SF= 400.13
##$SI= 32768
##$SIGF1= 0
##$SIGF2= 0
##$SINO= 400
##$SIOLD= 32768
##$SPECTYP= <>
##$SREGLST= <1H.CDCl3>
##$SSB= 0
##$STSI= 32768
##$STSR= 0
##$SW_p= 8223.68421052632
##$SYMM= 0
##$S_DEV= 0
##$TDeff= 65536
##$TDoff= 0
##$TI= <>
##$TILT= no
##$TM1= 0
##$TM2= 0
##$TOPLEV= 0
##$USERP1= <user>
##$USERP2= <user>
##$USERP3= <user>
##$USERP4= <user>
##$USERP5= <user>
##$WDW= 1
##$XDIM= 32768
##$YMAX_p= 451566406
##$YMIN_p= -681910
##$CURPLOT= <Network HP LaserJet P1505>
##$CURPRIN= <$Network HP LaserJet P1505>
##$DFORMAT= <normdp>
##$LAYOUT= <+/1D_H.xwp>
##$LFORMAT= <normlp>
##$PFORMAT= <normpl>
##$SURQMSG= 1
$$ End of Bruker specific parameters
$$ ---------------------------------
##NTUPLES= NMR SPECTRUM
##VAR_NAME=  FREQUENCY,     SPECTRUM/REAL,   SPECTRUM/IMAG
##SYMBOL=    X,             R,               I
##VAR_TYPE=  INDEPENDENT,   DEPENDENT,       DEPENDENT
##VAR_FORM=  AFFN,          ASDF,            ASDF
##VAR_DIM=   32768,         32768,           32768
##UNITS=     HZ,            ARBITRARY UNITS, ARBITRARY UNITS
##FACTOR=    0.250966925370066, 1,           1
##FIRST=     8223.43324360095, -161560,      -28421
##LAST=      0,             -159710,         -106866
##MIN=       0,             -681910,         0
##MAX=       8223.43324360095, 451566406,    0
$$ Real data points
##PAGE= N=1
##DATA TABLE= (X++(R..R)), XYDATA
$$ [...]
$$ plain form
19532 -139026 -9955 -186913 -57953 -63452 -248155 -309825 187207 -135905 86621 61531 237787
19521 237787 -220417 124756 -192098 -223210 -309337 -214766 198104 -5800 -22285 -277289 -368238
19510 -368238 -234833 -84248 -161001 147812 1688 -138639 -172050 96816 -300018 104844 85771
19499 85771 -347863 -423428 188994 -206004 196799 -50363 -223391 -188536 396535 42992
19488 65617 -385866 -575428 17399 497904 -260634 59811 -9586 -191256 -183627 -1256 61604
19476 288472 -474567 193377 -17512 153301 -32871 270934 -361136 -129714 -484763 132275
19465 -202408 -136770 11736 -175879 -144394 -81647 126010 -279800 -61046 -5927 -9502 -238315
19454 -238315 200273 153985 74921 6054 -221434 -51178 -194119 72402 248906 27815 -170122
$$ packed form
19532a39026i955j76958e7953n499j84703o1670A87207a35905H6621k5090J76256
19521B37787b20417A24756a92098l1112q6127R4571A98104e800j6485k55004r0949
19510c68238J33405h4248p6753A47812A688a38639l3411I6816c00018A04844j9073
19499H5771c47863p5565A88994b06004A96799e0363j73028L4855C96535D2992
19488F5617c85866j89562A7399M80505b60634E9811i586j81670P629a256F1604
19476B88472d74567A93377a7512A53301c2871B70934c61136a29714l55049A32275
19465b02408O5638A1736a75879L1485O2747A26010b79800f1046e927l575k28813
19454b38315B00273m6288G4921F054b21434e1178j42941G2402J76504B7815a70122
$$ plain form
19442 -121777 -116464 -313032 80008 -344885 -26391 -417602 -144879 -246027 22381 -465911
19431 319552 -102646 125378 117775 -21480 -138885 -216685 -126924 -170147 51768 -359597 -97127
19419 -578752 -57150 -150259 -54196 -115489 -31864 -25598 -204881 143480 79405 76842 -249341
19407 -75974 -102988 -5776 -58984 72098 71550 -159609 -14729 224517 -478348 25505 21189 -32443
19394 -38669 -291888 -268019 -286584 250633 -158884 162692 -218131 -524 -155346 -59771 -67277
19383 -67277 -67348 -420809 -46063 36230 286421 -109259 -111620 -471017 84726 -251533 -95612
19371 254605 12249 114286 -132404 207774 108809 -280515 -126480 -251394 -170835 227449
19360 478445 -282630 -405516 -230220 80372 -19925 -130482 156652 72757 -87717 25701
$$ packed form
19442a21777N313j96568H0008c44885b6391l91211a44879j01148B2381d65911
19431C19552a02646A25378p603b1480j17405p7800Q9761m3223E1768c59597i7127
19419e78752e7150r3109e4196o1293c1864O266j79283A43480o4075k563b49341
19407g5974k7014e776n3208G2098n48a59609a4729B24517d78348B5505m316c2443
19394c8669k53219K3869j8565B50633a58884A62692b18131e24j54822e9771p506
19383f7277p1l53461d6063C6230K50191a09259k361l59397H4726b51533i5612
19371B54605A2249J02037a32404B07774r8965b80515a26480j24914Q0559B27449
19360D78445b82630j22886J75296H0372a9925j10557A56652G2757h7717B5701
$$ plain form
19349 -47673 -44736 -207981 -30965 15361 150286 -128977 64916 48604 -109096 -30259 78915
19337 107260 -239459 -30447 -78957 -84046 86689 397911 -172979 -121479 -266567 -171326 -236644
19326 -236644 98836 -119189 208295 67341 79775 -110907 -80068 145793 29465 -241074
19315 -131585 82217 -298203 154181 -10625 -245818 -341060 -90137 -148208 96457 -107909 133594
19303 -122601 -64392 222929 -185777 229055 -124257 610 59667 -154354 -236279 -215181 -469794
19292 -469794 351364 -31006 69054 329807 -112393 -134474 -156276 -480520 -211136 -173278
19282 -173278 -78586 -364889 -67912 244429 -67185 117558 -77710 -166814 -194289 -300098 -171431
19271 -171431 -384920 -45605 -62462 230363 -207023 77597 45069 -377836 -107298 -143770
$$ packed form
19349d7673K937j63245c0965A5361J34925a28977F4916j6312a09096c0259G8915
19337A07260b39459c0447m8510n089H6689L11222a72979N1500j45088R5241o5318
19326b36644I8836a19189B08295F7341J2434a10907L0839A45793B9465b41074
19315a31585H2217b98203A54181a0625k35193r5242i0137n8071I6457a07909A33594
19303a22601N8209B22929a85777B29055a24257F10N9057a54354q1925K1098k54613
19292d69794C51364c1006F9054K60753a12393k2081k1802l24244b11136L7858
19282a73278g8586k86303f7912B44429f7185A17558g7710q9104k7475j05809J28667
19271a71431k13489d5605j6857B30363b07023G7597l2528c77836a07298l6472
$$ plain form
19261 -143770 40731 -241245 155930 65271 92144 -58476 -74514 -96916 142473 -87976 -221792
19250 -221792 -574572 -192992 -68074 101266 262833 106709 -161066 46961 61951 -305263
19239 1654 -283315 -147476 -139272 153980 -283734 -134338 102368 155254 82557 -126577 -64946
19228 -64946 195260 37269 277699 -16075 29492 -116107 -290814 -297969 177765 -109349 -5898
19216 -122886 -179153 328080 -22103 -39354 -298562 -403502 11710 -77184 59964 97208 141960
19205 141960 189298 -145080 -163815 60436 270975 -248279 -290254 -127636 -75372 -107502 -378876
19194 -378876 -3230 -296049 91 -232612 -180613 -111156 -261435 95263 -64426 -272734 42075
19182 -262016 45152 -30327 11430 -253202 137786 -430794 -79040 -66370 -183286 -186571 11157
$$ packed form
19261a43770D0731b41245A55930F5271K6873e8476j6038k2402A42473h7976j33816
19250b21792l52780a92992f8074A01266J61567A06709a61066D6961J4990c05263
19239A654b83315J35839Q204A53980b83734a34338A02368N2886p2697a26577O1631
19228f4946A95260C7269K40430a6075B9492a16107j74707p155A77765a09349e898
19216a22886n6267C28080b2103j7251k59208j04940A1710g7184E9964L7244M4752
19205A41960M7338a45080j8735F0436K10539b48279m1975a27636N2264l2130k71374
19194c78876c230k92819I1b32612N1999O9457j50279I5263f4426k08308D2075
19182b62016D5152c0327A1430b53202A37786d30794g9040J2670j16916l285A1157
$$ plain form
19170 -66130 251858 -88314 233836 -215807 232652 -290726 11681 -10076 -99 -203762 -198661
19159 -198661 -135602 -133643 215331 103559 -87076 -110403 -17426 36885 92516 -158614 -42728
19147 -342385 -44145 -63201 52485 -97937 117253 -156686 -76602 -241625 -48888 -461222 -321031
19136 -321031 -478941 -142002 167184 87012 -53919 261872 101321 -64727 -266771 -74804
19125 -68940 -5989 -85792 -62456 -7931 54296 -84321 -17031 -247366 139683 226383 -295132
19113 54671 258816 5006 -246660 -309380 -147153 92662 71159 260710 149282 -81353 91810
19101 -72269 -70935 105825 185797 -77540 29365 -108128 -1477 -152761 108215 -172852 -27493
19089 -44026 -57461 -85416 -83141 -184377 -58956 -81954 52930 -84222 159546 41085 112397
$$ packed form
19170f6130B51858h8314B33836b15807B32652b90726A1681a0076i9k03663N101
19159a98661O3059J959B15331A03559h7076k3327a7426C6885N5631a58614d2728
19147c42385d4145j9056E2485i7937A17253a56686g6602j65023d8888m12334J40191
19136c21031j57910a42002A67184q0172e3919B61872A01321f4727k02044g4804
19125f8940e989p9803K3336g931E4296h4321a7031k30335A39683Q6700b95132
19113E4671K04145E006b46660o2720a47153I2662k1503J89551j11428h1353I1810
19101g2269J334A05825P9972g7540B9365a08128a477j51284A08215a72852b7493
19089d4026j3435k7955K275j01236e8956k2998E2930h4222A59546D1085P1312
$$ plain form
19078 112397 -216632 -444392 -390463 291012 -40716 -246296 52063 -229135 65822 -101513
19067 -142638 15202 -160608 196595 -27656 -23910 -157695 -40629 177574 -154579 -143894 -429115
19056 -429115 96895 47428 -54029 224521 -14146 -63749 -218795 -103454 -167456 44754 -183059
19044 -161000 53119 62497 73009 -153995 96426 -34617 17090 -12402 -88419 -15005 205608
19032 -105022 -141329 -97137 111849 122533 16817 203784 -36348 -296191 -58957 -73666 -178228
19021 -178228 -28839 43251 8402 -67967 28604 -1189 -16348 -120482 -232914 -11668 -11642 -46402
19009 -46402 -130196 -239316 33916 -149871 -56669 118779 -369801 116163 33602 -168338
18998 23641 97256 -77003 -32462 4856 -40977 89818 322381 -88905 19391 -17045 36133 -294976
$$ packed form
19078A12397b16632k27760N3929B91012d0716k05580E2063b29135F5822a01513
19067a42638A5202a60608A96595b7656L746j33785d0629A77574a54579J0685k85221
19056d29115I6895D7428e4029B24521a4146m9603j55046a03454o4002D4754a83059
19044a61000E3119R378J0512a53995I6426c4617A7090a2402p6017a5005B05608
19032a05022l6307M4192A11849J0684A6817J86967c6348k59843e8957j4709j04562
19021a78228b8839D3251H402f7967B8604a189j5159j04134j12432a1668K6l4760
19009d6402q3794j09120C3916a49871e6669A18779c69801A16163C3602a68338
18998B3641P3615g7003c2462D856d0977H9818K32563h8905A9391a7045C6133b94976
$$ plain form
18985 -123826 121160 45981 136734 -114664 64133 9379 234213 -15411 -111616 129561 123710
18974 123710 84641 -272331 -261177 -371065 65361 -61915 -324997 -191863 133648 60278
18963 -357987 -281907 169730 -65430 -37488 -215693 -182240 -33098 -194442 68154 257093 174933
18952 174933 -84478 -262785 -82700 80237 -118432 -219090 153361 -144056 -182137 90926
18941 -39994 -283440 66768 -264143 -107003 -2054 -12048 88897 -100561 -271860 -155281 106639
18929 -34631 -156056 -166334 -4520 236982 -108931 -126040 -220726 -274939 -229358 119119 298184
18918 298184 -112508 -356 284371 -101840 87319 264146 215601 -64161 -208515 36939 6417
18906 -229254 7694 -72025 -248702 113259 231460 -319259 -115246 -127836 -173188 -229704 -49320
$$ packed form
18985a23826A21160D5981R0753a14664F4133I379K24834a5411r6205A29561n851
18974A23710l9069b72331J1154j09888F5361f1915k63082J33134A33648F0278
18963c57987P6080A69730f5430K7942j78205L3453c3098j61344F8154J88939q2160
18952A74933h4478j78307h2700H0237a18432j00658A53361a44056l8081I0926
18941c9994k43446F6768b64143a07003b054r994H8897a00561j71299J16579A06639
18929c4631j21425j0278d520B36982a08931j7109r4686n4213M5581A19119J79065
18918B98184a12508c56B84371a01840H7319J76827m8545f4161j44354C6939F417
18906b29254G694g2025j76677A13259J18201c19259a15246j2590m5352n6516d9320
$$ plain form
18894 -152711 -294577 132860 105915 -33216 -54880 -281275 -110141 -518410 183051 -131106
18883 -105839 -84178 13703 -209825 -84810 212232 40066 -109685 18945 7671 145360 -270865
18871 -39281 -223808 153172 -234810 -30110 -445592 111488 -82809 -138359 -70408 -364692
18861 -364692 225493 115190 -277610 227628 -254793 214812 28775 62091 -69512 -89104
18851 -89104 192805 -121407 166734 -154082 -160486 -103207 242748 151280 108246 -39710 -59113
18840 -59113 39972 91750 -20799 25648 -639542 88273 -64422 -135181 -157009 -75066 -68919 77842
18827 -392254 -66318 -193441 67776 -50162 -260845 -189274 -92727 -151712 -130359 -560743 15874
18815 -273236 -333109 -211770 -232651 929 -219861 -374232 -268577 -57306 185249 260982 80176
$$ packed form
18894a52711j41866A32860k6945c3216k1664k26395a10141m08269A83051a31106
18883a05839K1661A3703b09825h4810B12232D0066a09685A8945G671J37689b70865
18871c9281j84527A53172b34810c0110m15482A11488h2809n5550O7951k94284
18861c64692B25493j10303b77610B27628b54793B14812B8775L3316f9512j9592
18851h9104A92805a21407A66734a54082o404N7279B42748r1468m3034c9710j9403
18840e9113C9972N1778b0799B5648f39542H8273f4422p0759k1828g5066O147G7842
18827c92254f6318j27123F7776e0162k10683P1571i2727n8985K1353m30384A5874
18815b73236n9873J21339k0881I29b19861j54371J05655e7306A85249P5733H0176
$$ plain form
18803 -109513 489044 121168 -194737 38046 227868 -64237 -149287 7524 415329 160767
18792 137280 -66634 -62099 -38508 -82597 -166811 9906 120131 -168449 -100039 118025 -9393
18780 41948 -289778 144476 -3168 439453 -30703 -130986 54298 -365055 -38609 -71074 181622
18768 -21255 -80841 -13557 -20693 54874 -112333 -213717 185830 -62002 -219148 -84792 113614
18756 -269779 -81288 119037 126582 59387 -136299 113953 -24627 -114657 -120741 42212 -199397
18744 -124073 -167166 -100913 -52084 -47736 -39769 49185 52839 -21410 304513 -11412 -412817 -135222
18731 -161399 -131949 -329393 129835 44322 -124379 -132524 92399 -345451 17827 68252 -103073
18719 -173919 -226008 -157272 37398 -274938 -212924 19763 98140 153830 -62478 -73254 -253549
$$ packed form
18803a09513D89044A21168a94737C8046J89822f4237q5050G524M07805A60767
18792A37280f6634M535K3591m4089q4214I906J10225a68449O8410A18025i393
18780D1948b89778A44476c168D39453c0703j00283E4298c65055c8609l2465A81622
18768b1255n9586a3557p136E4874a12333j01384A85830f2002j57146h4792A13614
18756b69779h1288A19037P545E9387a36299A13953b4627r0030o084D2212a99397
18744a24073m3093O6253M8829M348P967D9185L654b1410C04513a1412m01405a35222
18731a61399K9450j97444A29835D4322a24379q145I2399c45451A7827N0425a03073
18719a73919n2089O8736C7398b74938O2014A9763P8377N5690f2478j0776j80295
$$ plain form
18708 -253549 -207108 38604 18772 -207102 72496 -43449 -222726 31911 64374 38618 -215254
18696 -300772 -200633 94323 -218457 -274372 -264270 334783 243518 -240565 -140706 -155496 28767
18684 64335 -5991 -71835 4590 5196 87761 43693 45780 268185 -116726 117569 -108559 213045
18671 -128061 -405188 -258585 -15282 187019 357571 282447 -17100 32927 -338806 238682
18660 62416 14359 236808 -377056 -90471 309199 -29029 -153622 -68507 203521 -60103 126470
18648 153316 -168498 39427 67727 44426 73468 111958 -52359 -4407 -205836 -287735 72982
18636 -99318 -32233 140173 204677 -265794 126401 146801 -43648 57300 -82225 -14937 -342605
18625 -342605 -257142 157639 -15879 -282240 41179 -175092 40704 -47283 -83671 -398641 135747
$$ packed form
18708b53549M6441C8604A8772b07102G2496d3449j79277C1911L2463k5756b15254
18696c00772J00139I4323b18457n5915J0102C34783r1265b40565R9859j4790B8767
18684F4335e991o5844D590O06Q2565D3693K087K22405a16726A17569a08559B13045
18671a28061k77127J46603a5282A87019J70552p5124a7100C2927c38806B38682
18660F2416A4359K22449c77056i0471C09199b9029j24593f8507B03521f0103A26470
18648A53316a68498C9427K8300k3301K9042L8490e2359d407k01429q1899G2982
18636i9318c2233A40173O4504b65794A26401K0400d3648E7300h2225a4937l27668
18625c42605Q5463A57639a5879k66361D1179a75092D0704d7283l6388l14970A35747
$$ plain form
18613 -137337 -29233 -78381 268988 -116764 -265349 201642 64285 -61001 107185 -57844
18602 241886 -204505 20664 205230 -518936 -9944 -226643 -147376 113128 -100030 -21846
18591 277511 -323741 -225593 -21968 -234665 -225588 -3051 233727 182185 -71378 20680 -403814
18579 181962 106632 -30855 158324 -159858 234348 -479126 63550 -35927 -391512 -298698
18569 -298698 -40609 -12293 -184316 245695 -152276 -415091 -13257 -108355 78091 6612 80453
18558 80453 -20050 -162743 308595 170944 -71216 -72316 197084 -293937 -101752 -61475 130691
18546 343981 -89945 451136 -144279 111397 -176896 164487 -116699 -8339 74160 -212815
18535 40349 -40889 22123 -52471 -109161 -301375 -361680 -75167 -120824 -42039 -232829 109041
$$ packed form
18613a37337b9233m9148B68988a16764j48585B01642F4285f1001A07185e7844
18602B41886b04505B0664J84566e18936i944k16699P9267A13128a00030b1846
18591B77511c23741R8148b1968k12697R077c051B33727n1542g1378B0680d03814
18579A81962p5330c0855A58324a59858B34348d79126F3550c5927l55585R2814
18569b98698d0609a2293j72023B45695a52276k62815a3257r5098G8091F612P3841
18558H0453b0050j42693C08595j37651g1216j100A97084b93937a01752M0277A30691
18546C43981h9945D51136a44279A11397a76896A64487a16699h339G4160b12815
18535D0349d0889B2123e2471n6690j92214o0305g5167m5657d2039j90790A09041
$$ plain form
18523 -28168 -64902 228764 226154 -350975 -138074 52501 -266646 14311 44714 -296136 116756
18511 -269802 116197 -156779 60214 84251 -67539 -97507 -86133 -206574 151407 -170410
18500 -72516 -103666 -187526 -8692 233168 -65837 -342812 -268183 -215073 -63034 319598 -248543
18488 -125651 -270488 -216536 65708 176309 -66845 -189146 23393 -385597 -42188 69462 -372513
18476 52490 104184 11988 -187750 -13048 -31340 -140486 102979 94806 -99385 31090 90934
18465 90934 -142333 208528 -232480 -54726 -297879 -208582 -24271 137692 -24435 66125 -50535
18453 -251491 -158925 225867 207063 35477 -81218 17715 213934 -23429 181699 150703 66654
18441 -293512 -230570 -237761 -351334 -96933 -47422 194411 -75669 11814 161525 -181155 63614
$$ packed form
18523b8168l6734B28764k610c50975a38074E2501b66646A4311L0403b96136A16756
18511b69802A16197a56779F0214K4037f7539k9968J1374j20441A51407a70410
18500g2516l1150q3860h692B33168f5837k76975P4629N3110f3034C19598b48543
18488a25651j44837N3952F5708J10601f6845j22301B3393c85597d2188F9462c72513
18476E2490N1694A1988a87750a3048j8292j09146A02979q173i9385C1090N9844
18465I0934a42333B08528b32480e4726k43153Q9297b4271A37692b4435F6125e0535
18453b51491R2566B25867j8804C5477h1218A7715J96219b3429A81699l0996F6654
18441b93512O2942p191j13573i6933d7422A94411g5669A1814J49711a81155F3614
$$ plain form
18429 19760 35095 -417628 -15199 53259 -151547 197850 -136469 -20632 195854 -12324 101480
18417 67102 31810 -23504 -39746 -32421 -315584 -89330 137716 -240946 240369 179244 33687
18405 -151569 -104451 -69932 -72694 15836 -282934 -297627 261668 -85006 184283 -35784 -118240
18394 -118240 -435575 244845 -31336 1377 -50877 -123642 -57732 175572 85965 126983 82781
18383 82781 8632 -185113 329623 -12343 251875 117652 -189686 -120957 254180 -121449
18372 -128502 -109544 -164707 -116064 -95679 136123 122238 -139832 -211039 -9379 38728 -321777
18360 118310 -241440 -57849 -157636 244447 76982 21634 90359 29865 19693 16423 -67395
18348 40347 -44796 -126702 -48122 -36269 68701 -164879 135349 1522 259761 -46249 -187714
$$ packed form
18429A9760J5335d17628a5199E3259a51547A97850a36469b0632A95854a2324A01480
18417F7102C1810b3504j6242P325k83163h9330A37716b40946B40369o1125C3687
18405a51569M7118L4519k762A5836b82934j4693B61668h5006A84283c5784q2456
18394a18240l17335B44845c1336A377e0877p2765e7732A75572H5965M1018m4202
18383H2781H632a85113C29623a2343B51875A17652a89686O8729B54180a21449
18372a28502J8958n5163M8643K0385A36123j3885a39832p1207i379C8728c21777
18360A18310b41440e7849r9787B44447G6982B1634O8725B9865j0172l270f7395
18348D0347d4796q1906d8122J1853F8701a64879A35349A522K58239d6249j41465
$$ plain form
18337 -187714 -42469 -148511 -125530 -12090 -361926 -19037 43698 -35114 -184140 134304 305711
18326 305711 6791 -95442 93358 22499 88953 -226886 -45457 68277 207796 -83735 -240837
18315 -240837 179186 -122951 -392293 -14488 89799 135373 24124 -146512 -335584 -39969
18304 184388 -87497 -343165 -230596 -17544 -250997 279853 208199 31498 -5094 82535 -9838
18292 90650 -89732 224572 -82564 -56532 -215116 -119445 -97162 -204732 174366 84589 194604
18281 194604 -20876 -169359 165260 170117 -129373 28912 -407331 -36812 -59091 -14269 43951
18269 -171128 100355 191963 31720 35001 162205 83922 135217 14748 54063 -254611 198847
18257 234263 -190706 -35495 -21358 73582 62230 -36101 -70351 -18656 175390 -226635 131525
$$ packed form
18337a87714d2469j06042K2981a2090l49836a9037D3698c5114j49026A34304J71407
18326C05711F791i5442I3358B2499O6454b26886d5457F8277J39519h3735j57102
18315b40837A79186a22951k69342a4488H9799M5574B4124a46512j89072c9969
18304A84388h7497k55668J12569a7544k33453B79853p1654C1498e094H2535i838
18292I0650h9732B24572h2564K6032j58584R5671K2283j07570A74366H4589J10015
18281A94604b0876j48483A65260M857a29373B8912d07331c6812k2279a4269D3951
18269a71128A00355R1608C1720L281J27204p8283N1295A4748L9315b54611A98847
18257B34263a90706c5495J4137G3582j1352c6101l4250a8656A75390b26635A31525
$$ plain form
18245 -460981 27848 71796 -102693 -58393 -117995 102495 -3773 310463 -387705 -143845 -22295
18233 -222433 4999 -27831 -61697 -267937 -249709 105809 12099 13766 217350 -85312 80471
18221 -133904 361734 -79709 130990 -36589 228480 139704 180976 -8930 -10520 -15887 101076
18209 25009 -197786 -419797 -14615 -156630 80264 -76730 -87472 -59084 -61544 -119205 -44829
18197 -10761 -105120 98965 -31196 -213199 -158451 -122803 -7184 6475 61109 -221578 -421354
18186 -421354 -126557 330830 -265157 284863 -455828 252093 241173 -84617 -467903 -222024
18175 -231313 100340 -321789 -17568 -67503 -145134 -256298 -217936 44187 -334926 96253 -189144
18163 -71141 163430 228733 100715 -59502 101079 40466 -96814 -127471 -229170 -348612 -403089
$$ packed form
18245d60981B7848M3948a02693M4300n9602A02495c773C10463c87705a43845b2295
18233b22433D999b7831l3866k06240J8228A05809A2099J667K03584h5312H0471
18221a33904C61734g9709A30990c6589B28480q8776M1272h930j590n367A01076
18209B5009a97786k22011a4615j42015H0264g6730j0742K8388k460n7661d4829
18197a0761r4359I8965c1196j82003N4748L5648g184F475N4634b21578j99776
18186d21354a26557C30830b65157B84863d55828B52093j0920h4617l83286b22024
18175b31313A00340c21789a7568m9935p7631j11164L8362D4187c34926I6253a89144
18163g1141A63430O5303A00715e9502A01079D0466i6814l0657j01699j19442n4477
$$ plain form
18152 -403089 -104868 -124178 -72964 13512 -19888 -282264 -149933 -72587 -450527 -147686
18141 -22781 -2950 -116329 135764 -119960 -363675 -25458 226219 324087 -211311 104102
18130 385614 -206138 207639 284597 -21439 56905 -184645 117765 252514 -191396 -284841
18120 -284841 -132826 24214 205991 -94416 31003 138995 185990 -48675 25718 -70146 -167354
18109 -167354 -70761 149287 -60996 122991 -26576 61542 173773 -117782 -345274 -96621
18098 24313 -111111 8979 -98096 -151423 553865 -161084 -174538 -32819 -297290 31457 96199
18087 96199 107282 -167938 -83553 124272 46806 -90074 -161552 -186537 178080 125396 -190067
18075 -169365 335038 -75077 -128854 28676 -46028 -233297 -401652 -144474 -166120 -365079
$$ packed form
18152d03089a04868j9310N1214A3512a9888k62376J32331g2587l77940a47686
18141b2781b950j13379A35764a19960k43715b5458B26219R7868b11311A04102
18130C85614b06138B07639P6958b1439E6905a84645A17765J34749a91396r3445
18120b84841a32826B4214J81777i4416C1003J07992M6995d8675B5718g0146r7208
18109a67354g0761A49287f0996A22991b6576F1542J12231a17782k27492i6621
18098B4313a11111H979i8096n3327E53865a61084j3454c2819k64471C1457O4742
18087I6199J1083a67938h3553A24272D6806i0074p1478k4985A78080n2684a90067
18075a69365C35038g5077n3777B8676d6028j87269j68355a44474k1646j98959
$$ plain form
18065 -365079 157404 -338003 -292069 164843 -40172 -151029 -38725 121994 53787 -163735
18054 131646 -301938 172487 -329510 -37146 -36220 14095 -43652 115648 -116264 -256281 -138148
18043 -138148 -11006 -123738 -138032 203767 -173575 60370 400728 27699 66824 -224279
18032 -101970 -138948 -121209 196587 -61461 -38349 -131789 -14795 -221249 62593 -105162 47007
18020 126611 -266979 -73686 -58095 86465 -38962 -104638 -164011 -303403 -165136 -131399 -121648
18009 -121648 -24310 296117 -33449 -51380 -1954 38717 93752 -282385 -197428 27694 248471
17998 248471 -213001 96526 16456 29545 -224830 -124078 -1443 25775 -309561 44168 102206
17987 102206 76510 339718 -85462 -753 -218970 -430281 164119 -131095 249461 -156841
$$ packed form
18065c65079A57404c38003M5934A64843d0172j10857c8725A21994E3787a63735
18054A31646c01938A72487c29510c7146R26A4095d3652A15648a16264j40017J18133
18043a38148a1006j12732j4294B03767a73575F0370L40358B7699L9125b24279
18032a01970l6978J7739A96587f1461K3112r3440a4795k06454F2593a05162D7007
18020A26611b66979g3686J5591H6465c8962o5676n9373j39392J38267L3737R751
18009a21648b4310B96117c3449j7931a954C8717N5035b82385Q4957B7694K20777
17998B48471b13001I6526A6456J3089b24830J00752a443B5775c09561D4168N8038
17987A02206k5696K63208h5462g53k18217k11311A64119a31095B49461a56841
$$ plain form
17976 -219853 -225901 -255057 -150400 439910 195950 -72868 221299 94358 99965 -37889 169892
17964 -68549 -148769 -1814 13919 157921 -183916 -66354 -4017 -344212 -29946 -192714 -229060
17953 -229060 -275624 44001 180268 167642 18877 278189 135638 -226101 -269282 -154678
17943 -154678 -45052 256352 -237302 -168431 -156499 78114 220194 244743 -3797 180072 107879
17932 107879 -7131 137380 -133646 115441 2121 -103919 52571 295012 177267 80243 97780
17921 97780 -198076 -79679 -44324 78529 -206160 -117068 402389 -130889 172326 31399 -25848
17909 -390151 147752 -112565 142239 83421 288047 -226434 24706 204946 160697 31199
17898 134514 176621 -80772 -16033 -111806 -188152 -210683 53217 -41666 477205 -84189 -179993
$$ packed form
17976b19853o048k9156J04657D39910A95950g2868B21299I4358N607c7889A69892
17964f8549q0220a814A3919J44002a83916f6354d017l40195b9946j62768l6346
17953b29060m6564D4001J36267j2626A8877K59312A35638b26101m3181J14604
17943a54678d5052B56352b37302O8871J1932G8114J42080K4549c797A80072p2193
17932A07879g131A37380a33646A15441B121a03919E2571K42441j17745H0243J7537
17921I7780a98076g9679L5355G8529b06160Q9092D02389a30889A72326C1399b5848
17909c90151A47752a12565A42239n8818K04626b26434B4706J80240m4249C1199
17898A34514M2107h0772a6033r5773p6346k2531E3217d1666D77205h4189r5804
$$ plain form
17887 -179993 21008 194841 -195444 174379 50092 167043 -117974 115456 39449 143787
17877 143787 -84459 297119 248892 -210291 -285091 60989 338870 -18503 -336058 -29868 112538
17865 -294559 -64611 131435 331730 79161 129177 -126574 250354 -85277 377260 -121418
17854 -68761 -65457 254775 -155353 107172 -83364 -91853 -18311 9457 -34199 -112907 111823
17842 -118114 -272476 133629 51532 20448 88071 86783 141839 -167835 -91011 99718 -349819
17830 -55428 -359400 -100351 -49197 293410 208091 -271592 -213671 87404 -11378 130438 64215
17818 -143337 -125685 -251344 100587 -47354 55473 -76822 294582 -81415 -2684 167839 -161642
17806 28876 171132 -58260 -58326 125890 40758 63883 190933 101613 -126246 -276893 84009
$$ packed form
17887a79993B1008J73833a95444A74379E0092J16951a17974A15456C9449J04338
17877A43787h4459B97119m8227b10291p4800F0989K77881a8503l17555b9868A12538
17865b94559f4611A31435K00295G9161N0016a26574B50354h5277C77260a21418
17854f8761L304B54775a55353A07172h3364q489a8311I457c4199p8708A11823
17842a18114j54362A33629E1532B0448O7623j288N5056a67835P6824I9718c49819
17830e5428l03972a00351d9197B93410q5319b71592N7921H7404a1378A30438F4215
17818a43337J7652j25659A00587d7354E5473g6822B94582h1415b684A67839a61642
17806B8876J42256e8260o6A25890D0758K3125J27050q9320a26246j50647H4009
$$ plain form
17794 -192101 -16491 -76567 -2903 29672 -276818 -4143 226109 -272814 -464370 -90758 -32859
17782 301628 326628 292696 71529 -99549 428 -257212 18444 86414 12319 -116161 -115074 218296
17769 38173 -194684 -97649 -198132 75558 -4443 -62426 -123746 171205 38463 35004 -191183
17757 67551 -38782 221558 66055 -121087 -137047 -124569 -180770 -7541 -275861 50521 222238
17746 222238 -109806 -180760 -24204 -11530 65470 -151113 23575 -56802 29474 165185 -33753
17734 -42202 349117 -168894 -189566 -143439 118058 -114906 53050 36868 98594 218785 -253214
17722 -39223 -107601 -239175 271174 35257 14855 -79872 -107079 -175059 -71897 46677 295933
17711 295933 -67097 69690 -37306 -292655 -196125 494806 -322503 -34694 -118271 -61364 216752
$$ packed form
17794a92101a6491o0076b903B9672b76818d143B26109b72814j91556i0758c2859
17782C01628K5000l3932G1529i9549D28b57212A8444O7970A2319a16161J087B18296
17769C8173a94684R7035j00483G5558d443n7983o1320A71205C8463l459a91183
17757F7551c8782B21558F6055a21087j5960J2478n6201g541k68320E0521J71717
17746B22238a09806p0954b4204a1530F5470a51113B3575e6802B9474J35711c3753
17734d2202C49117a68894k0672M6127A18058a14906E3050j6182O1726J20191b53214
17722c9223o8378j31574B71174C5257A4855g9872k7207o7980g1897D6677K49256
17711B95933f7097F9690c7306k55349R6530D94806c22503c4694q3577N6907B16752
$$ plain form
17699 -197138 5217 64070 -89585 -122920 100550 263820 102609 -98455 198838 -113008 92050
17687 -63554 -144486 -49103 145696 -256274 -19019 149317 -112729 53775 -39657 -40693 -297535
17676 -297535 -30509 139691 57031 319324 343249 347765 -73924 -140741 -31647 -33929 -63153
17665 -63153 -192805 -74287 219378 126885 -219847 77095 -436694 -292587 -872 -126252 -5472
17653 -8340 -97733 -380473 40832 -180332 227557 50212 -138281 90386 216758 -1528 418288
17641 142841 -59312 3398 -243175 212736 -35037 309196 132227 -82218 -222349 -331245
17631 -331245 121825 151880 -73084 121549 75697 28512 98647 34265 -113383 9624 65294
17620 65294 -225177 281336 -173758 -155886 -85413 14999 -90784 36879 -124779 171961 158788
$$ packed form
17699a97138E217N8853h9585l3335A00550J63270A02609i8455A98838a13008I2050
17687f3554q0932d9103A45696b56274a9019A49317a12729E3775c9657j036k56842
17676b97535c0509A39691E7031K62293K3925M516g3924o6817c1647k282k9224
17665f3153j29652g4287B19378r2493b19847G7095d36694J44107h72j25380e472
17653h340q9393k82740D0832a80332B27557E0212a38281I0386J26372a528D18288
17641A42841e9312C398b43175B12736c5037C09196A32227h2218j40131j08896
17631c31245A21825L0055g3084A21549m5852B8512P0135C4265a13383I624N5670
17620F5294b25177B81336a73758J7872P0473A4999i0784C6879a24779A71961j3173
$$ plain form
17609 158788 109952 114994 -345367 234714 -55648 -211152 -12426 -39297 166599 392988 -106285
17597 -28213 389428 -115078 33208 43257 123993 394023 115925 366510 -33174 62551 292564
17586 292564 79561 325253 60140 50923 -20781 77508 61188 -44748 -6592 164035 167515 -54824
17573 2105 -151873 30817 121367 342630 86997 57103 135642 -245593 121267 -19844 183076
17561 85585 101192 79384 -138052 58649 -86584 183728 66495 126431 -167398 313884 316554
17550 316554 -19951 -90351 204915 476702 -87813 164073 -310029 -223420 121823 140765
17540 140765 -123066 -249369 22591 -84882 -209301 34504 -126135 -119830 -130989 -82499 47645
17528 102510 -51459 -20650 195486 -25185 85998 204853 3917 43848 253448 -78465 248843
$$ packed form
17609A58788m8836N042c45367B34714e5648j55504a2426k6871A66599K26389a06285
17597b8213C89428a15078C3208J0049Q0736K70030A15925K50585c3174F2551K30013
17586B92564G9561K45692F0140r217b0781G7508j6320d4748f592A64035L480e4824
17573B105a51873C0817R0550K21263H6997k9894P8539b45593A21267a9844A83076
17561H5585J5607k1808a38052E8649h6584A83728F6495N9936a67398C13884K670
17550C16554a9951p0400B04915K71787h7813A64073c10029Q6609A21823J8942
17540A40765a23066j26303B2591h4882j24419C4504a26135O305j1159M8490D7645
17528A02510e1459b0650A95486b5185H5998J18855C917L9931K09600g8465B48843
$$ plain form
17516 440032 221507 418723 220990 362989 -3617 33278 250552 300900 -211606 153173
17505 89295 -152090 278392 272814 -20095 219560 200614 97226 86787 -77168 65077 176781
17494 176781 -3093 -69825 123613 -35040 -31283 138249 -174160 14019 431659 42809 151882
17483 151882 289235 -17294 319797 -139335 37009 185517 -9856 405051 13926 360040
17473 360040 -87005 166828 122048 236134 -80480 430566 -12402 485793 97544 -119075
17462 128637 -74800 9019 -8589 369541 109 193064 203405 29528 324408 122498 -111450
17450 84774 172487 166562 50546 333021 250767 290065 -163977 276138 303280 18743 37644
17439 37644 182770 332029 332177 276455 -79430 292402 137794 83634 -142211 4482 99209
$$ packed form
17516D40032k18525J97216j97733J41999c617C3278K17274N0348b11606A53173
17505H9295a52090B78392n578b0095B19560j8946I7226j0439g7168F5077J11704
17494A76781c093o6732A23613c5040L757A38249a74160A4019M17640D2809J09073
17483A51882J37353a7294C19797a39335C7009J48508i856D05051A3926L46114
17473C60040h7005A66828m4780J14086h0480D30566a2402D85793I7544a19075
17462A28637g4800I019h589C69541A09J92955J0341B9528K94880A22498a11450
17450H4774Q7713n925E0546K82475q2254L9298a63977B76138K7142A8743J8901
17439C7644J45126J49259J48n5722g9430B92402A37794n4160a42211D482R4727
$$ plain form
17428 99209 -215197 128507 -105423 -86663 247243 332160 261625 -86605 -192507 -47871 125376
17416 155571 116314 161542 267434 444046 -173043 347517 97433 106946 202087 141077 103387
17405 103387 397317 471068 304604 210642 388165 385098 408862 230345 467067 -8109 609430
17393 -13842 18083 16528 -220781 162092 341361 56973 -174351 158170 47680 275367 310479
17382 310479 283753 265311 242704 -104935 295722 214052 -93326 -28806 257672 155561 433657
17371 433657 254870 323282 -107 -33686 25017 313189 156869 155024 203546 172983 193260
17360 193260 18972 -27856 225014 75441 98465 267541 -19032 87681 82579 85649 -132541
17348 286787 146037 161333 236824 -118160 249280 129967 88175 -37254 55942 -105597
$$ packed form
17428I9209b15197A28507a05423J8760B47243Q4917p0535h6605j05902d7871A25376
17416A55571l9257M5228J05892J76612a73043C47517I7433R513R5141o1010l7690
17405A03387K93930P3751j66464r3962J77523l067K3764j78517K36722h109F09430
17393a3842A8083j555b20781A62092J79269E6973a74351A58170D7680K27687L5112
17382C10479k6726j8442k2607a04935B95722q1670i3326b8806B57672j02111K78096
17371D33657j78787O8412a07l3579B5017K88172j56320j845M8522l0563K0277
17360A93260A8972b7856B25014G5441K3024J69076a9032H7681n102L070a32541
17348B86787j40750J5296P5491a18160B49280j19313m1792c7254E5942a05597
$$ plain form
17337 142258 27795 226915 221817 -14207 -153982 141549 113456 23147 -119514 87742 110521
17326 110521 235396 162410 178374 329117 63634 -199299 489452 -34535 11123 21116 242362
17315 242362 175806 126402 519 130850 180602 -318749 296661 335197 48597 -13755 -45098
17304 -45098 185333 265210 116923 240078 35504 29573 349032 537211 32620 196703 8908
17292 333608 486668 287423 282460 81488 82376 -25782 205443 163262 114496 511983 281814
17281 281814 209982 55607 136409 94651 212912 -91745 316263 93740 -28702 64506 128992
17270 128992 70014 353268 313222 61429 407347 291845 90388 43552 -258764 232042
17259 -206856 90040 325974 114310 123558 543923 310679 65903 204505 172771 220570 306828
$$ packed form
17337A42258B7795J99120n098a4207j39775A41549k8093B3147a19514H7742K2779
17326A10521J24875p2986J5964J50743F3634a99299D89452c4535A1123R993K21246
17315B42362o6556m9404E19J30331M9752c18749B96661L8536D8597a3755l1343
17304d5098A85333P9877A16923J23155C5504n931L19459J88179C2620J64083H908
17292C33608J53060j99245m963H1488Q88b5782B05443m2181m8766L97487k30169
17281B81814p1832E5607Q0802m1758J18261i1745C16263I3740b8702F4506O4486
17270A28992n8978K83254m0046F1429L45918j15502I0388D3552b58764B32042
17259b06856I0040K35934A14310R248M20365k33244F5903J38602l1734M7799Q6258
$$ plain form
17248 306828 225023 363950 68729 335055 314338 254280 -184539 381967 67045 216318
17238 216318 289451 194304 550699 232861 602136 320152 100515 601966 255664 -25731
17227 56760 -107239 193804 281155 173796 312831 117574 255806 -26226 439260 168491
17216 397691 -180404 236084 127316 89287 289489 274210 261902 82117 292708 14072
17205 344100 4965 228003 271505 292098 190648 302658 377940 266773 282630 375473 206523
17194 206523 410030 46091 246706 -154107 488288 218764 -6964 447804 140056 214772
17184 214772 226194 339871 465834 293870 641984 356436 224984 295347 -93246 326725
17173 323370 233921 43181 489946 354197 -96754 156684 337494 249096 352638 304865
$$ packed form
17248C06828q1805J38927F8729K66326k0717o0058a84539C81967F7045J49273
17238B16318P3133r5147L56395B32861L69275k81984A00515N01451B55664b5731
17227E6760a07239A93804Q7351j07359J39035A17574J38232b6226D39260A68491
17216C97691a80404B36084j08768l8029K00202j5279j2308H2117K10591A4072
17205C44100D965K23038M3502K0593j01450J12010P5282j11167J5857R2843j68950
17194B06523K03507D6091K00615a54107D88288B18764f964D47804A40056P4716
17184B14772J1422J13677J25963j71964L48114k85548j31452P0363i3246C26725
17173C23370q9449D3181M46765j35749i6754A56684J80810q8398J03542m7773
$$ plain form
17163 304865 272197 244464 470196 364097 295878 195122 303802 102563 -17274 235535
17152 298842 453224 362401 395077 -37161 152289 5355 218758 192197 55842 465725 462061
17141 462061 13128 124142 163997 166362 31933 340583 236332 364137 211387 254445 -40178
17129 553906 153675 477184 476669 296055 258442 236209 341589 311608 536613 631095 279576
17117 193362 486778 46422 254683 401268 450590 66232 381614 485604 224881 -161503
17106 224037 296074 454850 486296 180189 270630 217827 452738 -38270 344933 -29055 460045
17094 336986 292005 463932 736459 251740 330405 709241 565147 59869 622685 300392
17083 221046 306765 597434 429566 180823 426557 348877 490615 310223 551576 482089
$$ packed form
17163C04865l2668k7733K25732j06099o8219j00756J08680A02563a7274B35535
17152B98842J54382r0823L2676c7161A52289E355K13403k6561E5842M09883l664
17141D62061A3128J11014L9855K365C1933L08650j04251J27805j52750M3058d0178
17129E53906A53675L23509n15j80614l7613k2233J05380k9981K25005R4482B79576
17117A93362K93416D6422K08261J46585M9322F6232L15382J03990B24881a61503
17106B24037P2037J58776L1446A80189R0441n2803K34911c8270C44933b9055D60045
17094C36986m4981J71927K72527B51740P8665L78836j44094E9869N62816C00392
17083B21046Q5719K90669j67868A80823K45734p7680J41738j80392K41353o9487
$$ plain form
17073 482089 455396 235537 358667 215535 424259 217781 436422 569887 618166 142758
17062 552218 270759 471259 372550 538472 38993 265192 34023 281431 491112 563876
17052 563876 542249 207034 437113 651074 479140 412190 533280 540564 314479 412142
17042 412142 681755 592341 556045 370321 558773 665704 730212 809184 395985 654915
17032 654915 546002 274276 165135 463352 343805 763373 323264 590703 507395 749688
17022 749688 699200 658329 490940 421680 777788 680072 544525 679029 327882 606493
17012 606493 773772 658815 309032 631953 692925 687857 540938 834158 400996 618155
17002 618155 318223 644727 641893 421186 893876 593091 677688 623718 340740 601171
$$ packed form
17073D82089k6693k19859J23130j43132K08724k06478K18641J33465M8279A42758
17062E52218B70759K00500r8709J65922C8993K26199C4023K47408K09681P2764
17052E63876k1627B07034K30079K13961j71934o6950J21090P284k26085R7663
17042D12142K69613q9414l6296j85724J88452J06931O4508P8972C95985K58930
17032F54915j08913k71726j09141K98217j19547M19568C23264K67439q3308K42293
17022G49688n0488m0871j67389o9260L56108r7716j35547J34504C27882K78611
17012F06493J67279j14957C09032L22921O0972n068j46919K93220D00996K17159
17002F18155k99932L26504k834k20707M72690l00785Q4597n3970k82978K60431
$$ plain form
16992 601171 376483 1079650 424761 331869 638083 887620 814827 584535 1020124 497978
16981 575063 714158 502976 832068 887511 763652 929488 706109 723817 678365 767565
16971 767565 1005747 852812 645043 926334 697589 583306 643473 1024869 817285 706464
16961 706464 652174 1140225 910127 772981 755539 891030 710692 980063 518592 943965
16951 943965 926921 946461 901957 751910 989923 568498 743813 908329 933772 946241
16941 946241 1069805 1110937 1080093 1005805 1113033 874943 1228418 1250416 1161710 898467
16931 898467 1112212 1031749 1237981 992114 1231466 797013 959944 1195776 1534413 1502311
16921 1502311 1181143 1101465 1109103 1312396 1398002 1372800 1392979 1142779 945538 1479971
$$ packed form
16992F01171k24688P03167D24761r2892L06214K49537p2793k30292M35589D97978
16981E75063J39095k11182L29092N5443j23859J65836k23379J7708m5452Q9200
16971G67565K38182j52935k07769K81291k28745j14283O0167L81396k07584j10821
16961G06464n4290M88051k30098j37146j7442J35491j80338K69371m61471M25373
16951I43965j7044J9540m4504j50047K38013m21425J75315J64516K5443J2469
16941I46241J23564M1132l0844p4288J07228k38090L53475K1998q8706k63243
16931H98467K13745q0463K06232k45867K39352m34453J62931K35832L38637l2102
16921A502311l21168p9678P638K03293Q5606k5202K0179k50200j97241N34433
$$ plain form
16911 1479971 1568550 1362579 1468096 1329594 1229904 1438037 1484439 1092749 1545232 1466268
16901 1466268 1563206 1352149 1399904 1684864 1738684 1579676 1368005 1492394 1523604 1826108
16891 1826108 1632875 1718555 1381894 1560650 1613059 1479043 1748778 1657668 1593472 1598289
16881 1598289 1510324 1858169 1832618 2009565 1955704 1631872 1791822 1944609 1960746 1993707
16871 1993707 1913381 2226540 2096655 1883181 2063792 2139565 2113918 2380104 2078575 2075502
16861 2075502 2271815 1936278 2376970 2154272 2385393 2296672 2854431 2441617 2498258 2736938
16851 2736938 2698409 2368394 2715441 3016549 2520593 2724859 2894145 2658336 2978053 2599077
16841 2599077 2763849 3040900 3143614 3157639 3412295 2996956 3531217 3250382 3244892 3605014
$$ packed form
16911A479971Q8579k05971J05517j38502r9690K08133M6402l91690M52483p8964
16901A466268R6938k11057M7755K84960N3820j59008k11671J24389L1210L02504
16891A826108j93233Q5680l36661J78756N2409j34016K69735r1110o4196M817
16881A598289q7965L47845k5551J76947n3861l23832J59950J52787J6137L2961
16871A993707q0326L13159j29885k13474J80611P5773k5647K66186l01529l073
16861B075502J96313l35537M40692k22698K31121q8721N57759m12814N6641K38680
16851B736938l8529l30015L47047L01108m95956K04266J69286k35809L19717l78976
16841B599077J64772K77051J02714J4025K54656m15339N34261k80835n490L60122
$$ plain form
16831 3605014 3494107 3452932 3561189 3632571 3604845 3698960 3729758 4066792 3763842 3725712
16821 3725712 4085232 4027055 4343801 4303531 4468886 4622753 4459468 4759373 4648283 4668611
16811 4668611 5064718 4661070 4994522 5417913 5484169 5291056 5370383 5409687 5692300 6025521
16801 6025521 5978515 6098459 6067601 6066571 6322712 6556050 6915420 7023964 6535895 7433278
16791 7433278 7447706 7593392 7513873 7906450 7913849 8235470 8581030 8254821 8776064 9298755
16781 9298755 9049346 9434181 9855585 9762247 10497222 10522189 10723640 11229043 11219656 11725063
16771 11725063 12153689 12171370 12785607 13242245 13249655 14078699 14435257 14795397 15278363 15896471
16761 15896471 16017039 16872123 17026356 17874931 18645026 18925715 19960982 20493089 21349397
$$ packed form
16831C605014j10907m1175J08257P1382k7726R4115L0798L37034l02950l8130
16821C725712L59520n8177L16746m0270J65355J53867j63285K99905j11090K0328
16811D668611L96107m03648L33452M23391O6256j93113P9327L9304K82613L33221
16801F025521m7006J19944l0858j030K56141K33338L59370J08544m88069Q97383
16791G433278J4428J45686p9519L92577P399L21621L45560l26209N21243N22691
16781I298755k49409L84835M21404r3338P34975K4967K01451N05403r387N05407
16771A1725063M28626J7681O14237M56638P410Q29044L56558L60140M82966O18108
16761A5896471J20568Q55084J54233Q48575P70095K80689J035267N32107Q56308
$$ plain form
16752 21349397 22212350 22960199 23898506 24445489 25918008 26918389 28083120 28970887 30111590
16743 30111590 31738554 33127905 34371804 36016790 37789486 39413277 41391471 43422974
16735 43422974 45472880 47941049 50209869 53114371 55923167 58894512 61927257 65586817
16727 65586817 69337478 73176175 77689721 82407590 86843435 92279601 97687812 103400328
16719 103400328 109361143 116152253 122882512 129902169 137237109 144646944 151739765 159193438
16711 159193438 166253036 173265372 179578267 185532805 189968021 193660442 196570478 198002863
16703 198002863 198154568 196857597 194478496 190659052 186087357 180242516 174424265 167204143
16695 167204143 160051880 152537006 144630262 137158268 129922620 122677995 115487365 108681256
$$ packed form
16752B1349397Q62953P47849R38307N46983J472519J000381J164731Q87767J140703
16743C0111590J626964J389351J243899J644986J772696J623791J978194K031503
16735D3422974K049906K468169K268820K904502K808796K971345L032745L659560
16727F5586817L750661L838697M513546M717869M435845N436166N408211N712516
16719A03400328N960815O791110O730259P019657P334940P409835P092821P453673
16711A59193438P059598P012336O312895N954538M435216L692421K910036J432385
16703A98002863J51705j296971k379101l819444m571695n844841n818251p220122
16695A67204143p152263p514874p906744p471994p235648p244625p190630o806109
$$ plain form
16687 108681256 102233011 96327886 90672668 85266618 80168353 75252837 70829088 66956432
16679 66956432 63162420 59299418 56162062 52898356 50193775 47672669 44835902 42892542
16671 42892542 40434824 38443471 36641034 34760105 33176241 31790088 30582213 29041601
16663 29041601 27900137 26091050 25175306 24388736 22836428 21849137 21560702 20787369 19738327
16654 19738327 19194757 18443245 17661831 17186131 16580358 15970686 15357997 14773920 14375463
16645 14375463 13828375 13565281 13115025 12611392 11964826 11514742 11591656 11157614 10544351
16636 10544351 10063891 10245848 10085174 9457982 9312831 9260558 8705101 8638245 8477922 7936543
16626 7936543 8249941 7715347 7411408 7304741 7072329 7129231 6820458 7003506 6777787 6334372
$$ packed form
16687A08681256o448245n905125n655218n406050n098265m915516m423749l872656
16679F6956432l794012l863002l137356l263706k704581k521106k836767j943360
16671D2892542k457718j991353j802437j880929j583864j386153j207875j540612
16663B9041601j141464j809087r15744p86570j552308r87291k88435p73333j049042
16654A9738327n43570p51512p81414m75700o05773o09672o12689n84077l98457
16645A4375463n47088k63094m50256n03633o46566m50084P6914m34042o13263
16636A0544351m80460J81957j60674o27192j45151n2273n55457o6856j60323n41379
16626G936543L13398n34594l03939j06667k32412N6902l08773J83048k25719m43415
$$ plain form
16616 6334372 6313635 5897364 6053271 5845640 5670353 5666288 5423549 5304956 5400463 5059251
16606 5059251 4839504 5104574 4843541 4591784 4565787 4469742 4327818 4529071 4343178 4347379
16596 4347379 4034053 4115950 4041925 3777916 3964330 3213552 3439221 3789608 3294931 3500827
16586 3500827 3369310 3490095 3561400 3089644 3147187 3017658 3240309 3170948 2785223 3125628
16576 3125628 2685949 2681601 2780681 2683186 2687307 2737695 2329302 2443928 2667800 2188382 2361930
16565 2361930 2372624 2185824 2466177 2318962 2154369 2227184 2085202 2183552 2218126 2391933
16555 2391933 2092887 1700250 2060245 2026859 2132428 1747111 2067697 1471541 1694035 1847811
16545 1847811 1621970 1723113 1789524 1671962 1837848 1707546 1452183 1720370 1745803 1774338
$$ packed form
16616F334372k0737m16271J55907k07631j75287m065k42739j18593R5507l41212
16606E059251k19747K65070k61033k51757k5997r6045j41924K01253j85893M201
16596D347379l13326Q1897p4025k64009J86414p50778K25669L50387m94677K05896
16586C500827j31517J20785P1305m71756N7543j29529K22651o9361l85725L40405
16576C125628m39679m348R9080r7495M121N0388m08393J14626K23872m79418J73548
16565B361930J0694j86800K80353j47215j64593P2815j41982R8350L4574J73807
16555B391933k99046l92637L59995l3386J05569l85317L20586n96156K22494J53776
16545A847811k25841J01143O6411j17562J65886j30302k55363K68187K5433K8535
$$ plain form
16535 1774338 1511800 1548711 1664015 1579994 1426893 1375585 1368414 1615253 1230145 1311710
16525 1311710 1341738 1460165 1332331 1585430 1574990 1102923 974367 1179901 1350374 1344957
16515 1344957 753652 1428528 1196323 1208576 1268846 1308770 1081589 1224493 1232494 1119027
16505 1119027 972202 1122245 1092613 1209855 1202807 1141064 813289 1037422 1116210 847859
16495 847859 884600 1166249 1163856 1207748 732440 1160025 1061083 855706 638793 1034244
16485 1034244 918828 654609 859353 795694 919161 966037 834976 671250 915316 546095
16475 546095 1126839 780449 980376 623466 1099476 867187 900806 585299 772302 726899
16465 726899 883731 436333 613478 913975 816497 416849 744475 451263 544144 552129
$$ packed form
16535A774338k62538L6911J15304q4021j53101n1308p171K46839l85108Q1565
16525A311710L0028J18427j27834K53099j0440m72067j28556K05534J70473n417
16515A344957n91305O74876k32205J2253O0270L9924k27181J42904Q001j13467
16505A119027j46825J50043k9632J17242p048o1743l27775K24133P8788k68351
16495H47859L6741K81649k393M3892m75308M27585r8942k05377k16913L95451
16485A034244j15416k64219K04744o3659J23467M6876j31061j63726K44066l69221
16475E46095N80744l46390J99927l56910M76010k32289L3619l15507J87003m5403
16465G26899J56832D36333J77145L00497r7478l99648L27626k93212R2881P985
$$ plain form
16455 552129 990147 672179 495230 479250 679559 620373 623872 810426 450240 257193
16445 257193 470585 520956 464581 452206 530144 702356 773797 576409 598876 506007 526896
16434 526896 500782 547809 694346 576130 667347 491167 742354 735381 332033 551242
16424 551242 245876 369350 207165 235372 823777 228204 274757 422096 656452 411231
16414 411231 469298 237866 344046 522829 534884 626738 592845 622868 588551 363596 464778
16403 464778 550813 558949 690271 327677 328700 659847 127958 375457 317735 227387 529939
16392 529939 450445 111280 335330 323204 518086 261623 561818 180196 790234 39655
16381 143100 352070 172437 127147 -26676 382876 419694 156403 314076 325915 264913
$$ packed form
16455E52129M38018l17968j76949j5980K00309n9186L499J86554l60186j93047
16445B57193K13392N0371n6375j2375P7938J72212P1441j97388K2467r2869K0889
16434E26896k6114M7027J46537j18216R1217j76180K51187o973C32033K19209
16424E51242B45876J23474j62185K8207N88405B28204M6553J47339K34356k45221
16414D11231N8067k31432J06180J78783J2055R1854l3893L0023l4317k24955J01182
16403D64778Q6035Q136J31322C27677J023L31147A27958K47499n7722r0348L02552
16392E29939p9494A11280K24050j2126J94882k56463L00195A80196O10038C9655
16381A43100K08970A72437m5290b6676C82876L6818A56403J57673J1839o1002
$$ plain form
16371 264913 280755 541185 565914 416405 276777 224925 471864 -329984 290948 296688
16361 296688 300475 159259 534641 210552 82771 285757 396124 307545 312945 316241 364641
16350 364641 454702 352887 342923 261872 208379 111833 181674 60338 273775 166475 259190
16339 259190 657798 473968 338606 242717 75223 207297 661506 146411 254086 433829
16329 433829 41381 465646 242814 478783 414744 589975 235438 358831 69857 122049
16319 122049 271113 150462 261306 194551 283774 529526 249633 380777 331962 280468
16309 280468 281689 176800 202656 131944 5571 120814 -132644 111219 204691 521424 545946
16298 545946 481272 220378 254401 -14896 136159 102115 248335 291018 196134 -107109 412377
$$ packed form
16371B64913J5842K60430K4729j49509j39628n1852K46939c29984B90948N740
16361B96688L787j41216L75382B10552H2771K02986J10367q8579N400L296M8400
16350C64641R0061j01815r964q1051n3493r6546O9841F0338K13437j07300R2715
16339B59190L98608j83830j35362r5889G5223J32074M54209A46411J07675J79743
16329D33829D1381M24265k22832K35969o4039J75231B35438J23393F9857N2192
16319A22049J49064j20651J10844o6755Q9223K45752B49633J31144m8815n1494
16309B80468J221j04889K5856p0712E571J15243a32644A11219R3472L16733K4522
16298E45946o4674B20378L4023a4896A36159l4044J46220M2683r4884a07109D12377
$$ plain form
16286 355489 -55908 197538 134262 -55379 -175306 314823 193662 -44073 364880 133365
16275 466215 109963 248099 268236 51511 387073 -286 50098 66251 -52094 167791 185109
16264 185109 189209 179538 341665 36259 -33821 229594 -56517 167625 120647 310038 395916
16253 395916 293972 183559 161319 27091 257043 142241 -43736 -43425 270745 343447 149224
16241 323048 -112988 92769 228845 280654 129219 -117645 105117 15431 -168153 -104467
16231 -104467 30157 -30406 125410 62445 74596 263947 234733 328250 400871 192897 -75937
16219 1469 72685 243885 230569 236304 -97971 70093 128810 135747 77978 -222336 376155 26566
16206 166535 69978 -50261 111290 20702 -144644 316052 387869 -18975 449497 95180 148804
$$ packed form
16286C55489e5908A97538o3276e5379j19927C14823j21161d4073C64880A33365
16275D66215A09963J38136K0137E1511L35562b86E0098J6153e2094A67791J7318
16264A85109M100r671J62127C6259c3821B29594e6517A67625m6978J89391Q5878
16253C95916j01944j10413k2240B7091K29952j14802d3736L11B70745P2702A49224
16241C23048a12988I2769J36076N1809A29219a17645A05117A5431a68153O3686
16231a04467C0157c0406A25410F2445J2151J89351k9214R3517P2621A92897g5937
16219A469P1216J71200j3316N735i7971G0093N8717O937n7769b22336C76155B6566
16206A66535F9978e0261A11290B0702a44644C16052P1817a8975D49497I5180N3624
$$ plain form
16195 148804 336990 67113 27089 345486 186438 303347 -10955 -39283 -164114 -74205
16184 183481 -9258 116229 102730 87089 296061 5909 62060 -77507 245566 -53112 136899
16172 -286292 -210400 287310 107134 -43303 12753 -246892 -86917 343648 113347 -11409
16161 186936 49385 -164917 -487953 37617 162742 -32867 -371476 109279 -80126 174249
16150 -85962 -110109 278078 299140 281987 145509 122562 -63916 -209436 -122328 63083 221754
16139 221754 82117 89544 -64200 -115552 -454329 187029 -65769 -187336 -50017 174077 74299
16127 97215 81641 13257 -230928 -65533 94431 29426 -56572 239099 146486 -180509 107738
16115 62258 -77682 225089 -37664 -116345 -258141 145354 163246 -260236 -111087 9111 -218765
$$ packed form
16195A48804J88186F7113B7089L18397j59048J16909a0955k8328j24831g4205
16184A83481i258A16229j3499j5641K08972E909N6151g7507B45566e3112A36899
16172b86292P5892B87310A07134d3303A2753b46892h6917C43648A13347a1409
16161A86936D9385a64917l23036C7617J25125c2867l38609A09279h0126A74249
16150h5962k4147B78078K1062j7153j36478k2947f3916j45520Q7108F3083J58671
16139B21754H2117P427f4200n1352l38777A87029f5769j21567e0017A74077G4299
16127I7215j5574A3257b30928f5533I4431B9426e6572B39099r2613a80509A07738
16115F2258g7682B25089c7664p8681j41796A45354J7892b60236a11087I111b18765
$$ plain form
16103 -73812 -66850 121269 35036 -196561 124724 219702 -3494 -200083 -113548 -65760 -131179
16092 -131179 -217161 -160555 66007 -93879 -167125 -60846 173578 -162876 50479 -205527 312967
16080 -133201 738 -127449 601 103449 62541 139371 147194 53542 189972 211793 -157323 -100685
16068 -100685 133477 21069 -18282 -106972 77152 -240252 -205572 26964 -200846 123827 181621
16057 181621 -62152 -88201 -59000 112210 97292 88218 215615 -82248 -45073 56373 -208483
16045 -94387 -31346 89993 210395 -91181 -174446 188177 148274 -189196 -285534 -117285 77897
16033 389270 -11785 16048 19814 151549 -92446 -50064 30837 -275044 125922 -167691 -323514
16022 -323514 -418440 366790 -39629 129077 85735 43603 179674 -146768 70417 42824 56311
$$ packed form
16103g3812O962A21269C5036a96561A24724R4978c494j96589Q6535M7788o5419
16092a31179q5982N6606F6007i3879p3246f0846A73578a62876E0479b05527C12967
16080a33201G38a27449F01J02848m0908P6830P823E3542J36430K1821a57323N6638
16068a00685A33477B1069a8282q8690G7152b40252L4680B6964b00846A23827N7794
16057A81621f2152k6049K9201A12210j4918r074J27397h2248L7175E6373b08483
16045i4387c1346H9993J20402i1181q3265A88177l9903a89196r6338a17285G7897
16033C89270a1785A6048L766J31735i2446M2382C0837b75044A25922a67691j55823
16022c23514r4926C66790c9629A29077m3342m2132J36071a46768G0417k7593J3487
$$ plain form
16011 56311 -129627 -127255 75866 11818 -40012 87641 118995 85347 84719 320985 23003 -165379
15998 80291 361027 67204 9120 -72791 312891 171744 18357 117848 93768 3840 137637
15987 137637 -2795 73528 -62979 55026 -33089 158245 -138923 -152567 -52406 -71728 72329
15975 98210 254925 -227537 137082 -534773 270263 190472 390993 553596 170774 78279
15964 15516 -251953 -280050 22655 178047 -141940 -219185 184542 -88368 -232816 -388150
15954 -388150 -223231 -300985 110542 -104899 -216166 -93792 116692 -134514 -110081 134181
15943 -201104 -40700 -73669 -90837 -338526 311140 155933 -6546 -87095 -52353 -109436 -260578
15932 -260578 -11368 -52829 80311 8518 -215100 76182 -14425 -45094 96444 248286 343946
$$ packed form
16011E6311a29627K372G5866A1818d0012H7641L1354l3648o28K36266B3003a65379
15998H0291K80736F7204I120g2791C12891j41147A8357R9491k4080C840J33797
15987A37637b795G3528f2979E5026c3089A58245a38923j3644e2406j9322G2329
15975I8210J56715b27537A37082e34773B70263p9791K00521J62603A70774G8279
15964A5516b51953k8097B2655J55392a41940p7245A84542h8368j44448j55334
15954c88150J64919p7754A10542a04899j11267i3792A16692a34514K4433A34181
15943b01104d0700l2969j7168k47689C11140j55207f546q0549L4742n7083j51142
15932b60578a1368m1461H0311H518b15100G6182a4425l0669I6444J51842R5660
$$ plain form
15921 343946 63020 -90818 347829 -210217 93351 69100 11716 -55171 -3073 -195305 -159437
15910 -159437 37326 93928 55923 33207 17910 -195981 -118643 -31160 564424 -77353 65551
15898 -288369 -126276 -62870 195568 -170131 -213087 -100039 -211659 -497437 -39912 -181510
15888 -181510 -218660 343553 -92022 -61763 39590 96631 105258 -216300 158023 101894 -408811
15876 -124798 -21385 38169 467 182227 -214276 191583 182528 15083 358966 60696 105272
15865 105272 -54181 -3763 -95113 94788 -286173 78642 151127 -207163 -141535 -89639 -202260
15854 -202260 31151 104223 -8772 210068 -16214 -66121 -61044 -54892 -139862 69380 -386427 202660
15841 -232682 -209980 154083 -265691 259308 -241463 435350 311487 -31577 64061 154873
$$ packed form
15921C43946F3020i0818C47829b10217I3351k4251A1716e5171c073j92232L5868
15910a59437C7326N6602l8005k2716j5297a95981P7338c1160E64424g7353F5551
15898b88369a26276f2870A95568a70131m2956a00039j11620k85778c9912j41598
15888a81510l7150C43553i2022L0259C9590N7041Q627b16300A58023n6129d08811
15876a24798b1385C8169D67J81760b14276A91583r055A5083L43883F0696M4576
15865A05272e4181c763r1350I4788b86173G8642P2485b07163O5628N1896j12621
15854b02260C1151P3072h772B10068a6214m9907N077O152q4970F9380c86427B02660
15841b32682K2702A54083b65691B59308b41463D35350j23863c1577F4061R0812
$$ plain form
15831 154873 -24007 -182333 -190596 103 -30388 -11081 -140863 -257195 -160067 70692 -52098
15819 -227034 -90680 350735 37075 108241 -13027 -140016 104873 -319915 -174468 -214730
15809 -214730 651 -188916 -14934 -102263 -260454 -131034 -89430 -68958 315643 -108359 141666
15797 -106299 -191168 -180056 99506 -277167 -108603 -538189 18826 -252594 -35429 168246
15786 -186114 -80959 244561 -202717 48853 270571 -105557 -219461 -13228 25505 71286
15776 71286 -67556 133718 84275 332791 29873 -86622 -31409 -61183 74051 136346 -108352
15764 -15045 -176262 118395 232974 -243009 -102506 12047 294083 -40015 -84597 140456
15753 1183 -42562 -195509 -79370 -73276 -138853 -335329 57958 149977 -27991 -51843 3879 -147466
$$ packed form
15831A54873b4007j58326q263A03c0388a1081j29782j16332R7128G0692e2098
15819b27034i0680C50735C7075P1166a3027j26989A04873c19915J45447m0262
15809b14730F51a88916a4934q7329j58191J29420M1604K0472C15643a08359A41666
15797a06299q4869J1112I9506b77167a08603m29586A8826b52594c5429A68246
15786a86114h0959B44561b02717D8853K21718a05557j13904a3228B5505M5781
15776G1286f7556A33718m9443K48516B9873h6622c1409k9774G4051O2295a08352
15764a5045j61217A18395J14579b43009a02506A2047K82036d0015m4582A40456
15753A183d2562j52947g9370O094o5577j96476E7958R2019b7991k3852C879a47466
$$ plain form
15740 -105751 -16726 66931 249450 74699 18708 -81941 138741 78863 -260178 115943 76412
15729 76412 41435 -137686 118123 121640 -31437 -7121 139697 -264991 -253891 -194407 203893
15717 -297310 -168900 -206715 -134417 114992 -76278 115501 -73016 -56275 -105868 22123 -154511
15705 -366282 118645 231112 -376152 20349 -289320 -44935 224795 -198376 -39595 475 103622
15694 103622 -12860 -188096 23269 433770 -3489 -141362 -305973 304021 10678 -175098
15683 222140 -247277 -436775 14025 -259827 99376 -35015 226724 87597 -67137 238161
15672 -138319 63311 -36463 -177557 -113475 32492 7622 -275613 -66823 -84259 -33437 157515
15660 -161104 -201926 -53128 -89506 204744 125895 433804 166466 -225939 -2580 73067 -138386
$$ packed form
15740a05751a6726F6931J82519G4699A8708h1941A38741n9878b60178A15943l9531
15729G6412l4977a37686A18123L517c1437g121A39697b64991J1100N9484B03893
15717b97310J28410l7815P2298A14992g6278A15501g3016J6741m9593B2123a54511
15705c66282A18645J12467c76152B0349b89320d4935B24795a98376c9595D75J03147
15694A03622a2860j75236B3269M10501c489j37873j64611C04021A0678a75098
15683B22140b47277j89498A4025b59827I9376c5015B26724H7597f7137B38161
15672a38319F3311c6463j41094O4082C2492G622b75613f6823j7436c3437A57515
15660a61104m0822e3128l6378B04744p8849L07909A66466b25939b580G3067a38386
$$ plain form
15648 -189659 -171361 29741 -296650 -123930 -110186 150341 -124708 -138405 -3397 -30321 -221097
15637 -221097 -183613 -453645 -124786 101085 -30385 -58038 281502 -209571 -198979 -101886
15627 -101886 -108692 -105118 -393076 -70715 -130839 285833 70963 41956 136779 48047 359768
15616 359768 228491 -97961 7552 -343202 -245043 121658 -169944 -142653 -305265 -350658 -195743
15605 -195743 -69870 264753 -205009 -193404 -95310 -93743 -2983 -176061 -15266 -177519 252023
15593 -238321 25941 48714 73033 79297 -219136 2228 -38717 -23958 -120026 -226936 -108653
15581 313065 179786 -288697 -95067 -36832 -73971 123597 -5979 -130818 -61961 169357 -90721
15569 -98073 293827 87860 -240534 128249 273467 -86218 363377 -230949 -13902 172186
$$ packed form
15648a89659J8298B9741b96650a23930J3744A50341a24708j3697c397k6924j90776
15637b21097L7484k70032a24786A01085c0385k7653B81502b09571J0592R7093
15627a01886o806L574k87958g0715o0124B85833G0963k9007R4823D8047L11721
15616C59768j31277i7961G552c43202R8159A21658a69944K7291j62612m5393J54915
15605a95743f9870B64753b05009J1605i5310J567b983j73078a5266j62253B52023
15593b38321B5941K2773K4319O264b19136B228c8717J4759r6068j06910a08653
15581C13065j33279b88697i5067c6832l7139A23597e979j24839f1961A69357i0721
15569i8073B93827H7860b40534A28249J45218h6218C63377b30949a3902A72186
$$ plain form
15558 350309 168553 51602 274443 -53628 -392958 187307 -90653 -133376 -160460 56184 -177579
15546 -407115 101191 101138 -78273 -6183 164136 48979 118751 -15949 -130594 85091 -117187
15534 184313 -290694 -31575 57112 32543 114321 -26494 151112 -28535 88654 160155 -16201
15522 413204 169556 268159 47357 -106545 -28551 11835 -456666 277701 -257645 -85470
15511 49422 147975 -76357 -104568 -66164 -315877 115337 -38664 -81430 -127692 15528 -73812
15499 152898 -153709 69125 -78155 -146941 -237038 -271290 34612 -18321 -53073 -31953 521265
15487 -115938 -245036 -134398 -119866 -245268 -176202 -794 -125586 -186517 -104215 35787 -138840
15475 -365057 123586 -142513 -300025 -147071 -231481 -302100 -59684 -97329 -119983 -29156 -392223
$$ packed form
15558C50309A68553E1602K22841e3628l39330A87307i0653m2723k7084E6184a77579
15546d07115A01191n3g8273f183A64136D8979O9772a5949j14645H5091a17187
15534A84313b90694c1575E7112k4569Q1778b6494A51112b8535H8654P1501a6201
15522D13204A69556R8603D7357a06545b8551A1835d56666B77701b57645h5470
15511D9422R8553g6357k8211L8404k49713A15337c8664m2766m6262A5528g3812
15499A52898a53709F9125g8155o8786r0097l4252C4612a8321l4752K1120E21265
15487a15938j29098J10638J4532j25402O9066g94j24792o0931Q2302C5787a38840
15475c65057A23586a42513j57512a47071q4410p0619e9684l7645k2654b9156l63067
$$ plain form
15464 -392223 -5456 272997 -56095 -213761 183449 115290 -95197 51146 22847 64702 113884
15453 113884 40740 -134800 71592 -291360 -74577 261791 147766 81492 -96036 -7716 153592
15441 199103 197843 -108455 -245632 192981 23727 -116817 321588 52201 168606 -230233
15430 156147 149477 147139 -360946 12897 39979 -78696 164118 -107547 345465 346905 -148202
15418 -93191 -48287 6178 -151739 -227028 52762 102480 -28318 146094 -174408 -109254 -44629
15406 -142855 -234817 -290882 -312997 93281 -48471 -7909 23972 -128649 -129176 91930 76876 159433
15394 159433 51445 37995 45703 -27432 -127735 -4328 -43383 -18299 153502 -285224 -53749
15382 -91478 -61961 139934 87100 -101903 -10663 -78837 174088 234369 -60718 364139 -73795
$$ packed form
15464c92223e456B72997e6095j57666A83449o8159i5197E1146B2847M1855M9182
15453A13884D0740a34800G1592b91360g4577B61791j14025o6274i6036g716A53592
15441A99103j260a08455j37177A92981B3727a16817C21588E2201J16405b30233
15430A56147o670k338c60946A2897K7082g8696A64118a07547C45465J440a48202
15418i3191M4904F178a51739p5289E2762M9718b8318A46094a74408O5154d4629
15406a42855r1962n6065k2115I3281d8471g909B3972a28649n27I1930j5054Q2557
15394A59433E1445j3450P708b7432j00303d328l9055a8299A53502b85224e3749
15382i1478K9517A39934n2834a01903a0663o8174A74088O0281f0718C64139g3795
$$ plain form
15370 -138509 522246 -47466 -56848 -46158 -73878 -1244 -20762 -112013 113538 154602 67243
15358 71911 -388934 -42 190187 -280988 115148 64727 -193877 396446 230838 -48513 45372
15346 -71819 94302 140353 98864 44408 154605 -193790 96879 -231621 -50422 -93872 237781
15334 -85136 -73602 103259 -103710 33480 -109663 123014 -157150 255495 -383954 -127241
15323 85049 21834 -60611 18083 445692 -113332 -49856 39509 154960 -194904 -387582 -156491
15311 313980 111213 170651 -197555 447580 184142 -145433 119425 44552 -233739 -78582
15300 5036 -5508 -12857 23104 120465 68692 56202 -67984 -191955 -200055 29611 256576 129103
15288 129103 134183 195699 -209354 22826 199964 -65314 156034 213494 -158939 66408 -60579
$$ packed form
15370a38509E22246d7466r382J0690k7720a244j9518r1251A13538M1064F7243
15358G1911c88934d2A90187b80988A15148n0421a93877C96446j65608d8513D5372
15346g1819I4302M6051m1489D4408J10197a93790I6879b31621e0422m3450B37781
15334h5136J1534A03259a03710C3480a09663A23014a57150B55495c83954a27241
15323H5049B1834f0611A8083M27609a13332d9856C9509J15451a94904j92678a56491
15311C13980A11213N9438a97555D47580A84142a45433A19425D4552b33739g8582
15300E036e508p349B3104R7361n1773j2490f7984j23971q100B9611K26965j27473
15288A29103N080O1516b09354B2826J77138f5314A56034N7460a58939F6408f0579
$$ plain form
15276 22071 101259 439094 108701 48926 129297 -12000 161405 -52398 138919 128371 -237478
15264 61777 7183 -40508 78053 188065 -53260 267414 61536 160403 -10841 143182 142104
15253 142104 220822 2718 49297 95162 -156135 115294 98983 314928 9848 -45271 -167630
15242 -167630 -94076 -47496 320812 129869 141899 622459 457972 838023 907279 934316
15232 934316 1484443 596092 473743 168281 -134859 358682 501550 119615 -203409 -218610
15222 -218610 293041 22711 371571 245465 129803 -247 -223477 207828 -162937 43905
15211 -141099 13710 112516 -267478 -256899 954 -53457 -123279 159569 619816 175262 -43267
15199 1618 107257 140461 -6656 31711 292296 -218541 325998 -406928 104387 315529 104598
$$ packed form
15276B2071P9188L37835A08701D8926Q0371a2000A61405e2398A38919j0548b37478
15264F1777G183d0508G8053J10012e3260B67414F1536R8867a0841A43182j078
15253A42104P8718B718M6579M5865a56135A15294j6311K15945I848d5271j22359
15242a67630P3554M6580C20812A29869J2030M80560j64487L80051O9256K7037
15232I34316N50127E96092j22349A68281a34859C58682J42868A19615b03409j5201
15222b18610B93041B2711L48860j26106j15662b47k23230B07828a62937D3905
15211a41099A3710R8806b67478J0579I54e3457o9822A59569M60247A75262d3267
15199A618J05639L3204f656C1711K60585b18541C25998d06928A04387K11142A04598
$$ plain form
15187 -1429 23397 109877 115393 -142494 253214 -18874 153648 353961 -103481 -132288 331626
15175 313879 -49884 -128268 16841 -43435 392318 192795 236095 163679 -112660 392656 -89030
15163 135998 87783 176965 -18878 138652 -135708 292788 122829 156167 19349 245512
15153 245512 71497 293260 155911 -422525 30014 47028 73905 38477 105499 -118711 -9860
15141 -124194 -161872 400292 232033 291711 -140476 -177008 -47509 -140519 -247319 49140 146483
15130 146483 50793 18534 129853 33175 368456 53095 -111654 130471 154551 111980 232119
15119 232119 -34033 267600 -128630 94990 239496 -44453 -147138 301669 121042 98623
15109 98623 290726 36264 -208447 182643 -45053 246062 208693 93697 420802 18913 245265
$$ packed form
15187a429B3397Q6480N516a42494B53214a8874A53648K00313a03481k8807C31626
15175C13879d9884p8384A6841d3435C92318A92795M3300p2416a12660C92656h9030
15163A35998m8215Q9182a8878A38652a35708B92788A22829L3338A9349K26163
15153B45512G1497K21763j37349d22525C0014J7014K6877l5428O7022a18711i860
15141a24194l7678D00292j68259N9678a40476l6532d7509r3010j06800D9140R7343
15130A46483E0793A8534J11319C3175L35281E3095a11654A30471K4080m2571J20139
15119B32119c4033B67600a28630I4990J44506d4453j02685C01669A21042k2419
15109I8623J92103C6264b08447A82643d5053B46062l7369I3697L27105A8913K26352
$$ plain form
15098 245265 -95224 -39409 176403 53808 255310 170302 15572 321313 33797 16239 47254
15087 47254 -188978 466719 41543 514835 299005 294299 -183173 -40381 24412 -81013 69538
15075 224219 245295 -49281 38873 64358 -22254 -144696 296643 343155 -48267 113873 155179
15064 155179 186611 130207 107918 21573 176122 208129 323620 78217 440473 323029 71448
15052 -241856 272749 412911 226146 97266 88658 119321 215909 -111590 138726 216330 231234
15041 231234 6670 102185 430019 198756 529515 163337 200711 236373 143310 314550 -94069
15029 225912 136171 -26257 54227 543620 224395 69596 39510 317106 404802 -90198 301863
15017 9145 64811 30517 26646 -55465 483528 201612 181419 104051 -35212 255166 176307
$$ packed form
15098B45265i5224c9409A76403E3808K01502q5008A5572L05741C3797A6239L1015
15087D7254a88978D66719D1543M73292k15830m706a83173d0381B4412h1013F9538
15075B24219K1076d9281C8873K5485b2254j22442B96643M6512d8267A13873M1306
15064A55179L1432n6404k2289B1573J54549L2007J15491G8217L62256j17444G1448
15052b41856B72749J40162j86765I7266q608L0663R6588a11590A38726P7604J4904
15041B31234F670R5515L27834A98756L30759A63337L7374L5662r3063J71240i4069
15029B25912q9741b6257E4227M89393B24395F9596l0086K77596Q7696i0198C01863
15017I145N5666C0517l871e5465D83528B01612k0193p7368c5212B55166p8859
$$ plain form
15006 176307 298407 10000 273876 397184 135574 -176195 -13775 188402 435149 383888
14996 383888 164097 16171 291615 124228 391567 -84284 485213 379531 273475 58759
14985 37990 314482 49983 225417 183359 43897 269726 239839 -60512 390397 205834 138656
14974 138656 296480 90928 46250 548347 348500 179587 278512 15405 291998 28591
14963 -2531 366878 348377 316368 340251 307921 -68931 156423 366780 327223 442674 289600
14952 289600 252893 36786 44227 110194 418622 293983 212853 240188 544057 196427 111232
14941 111232 376852 344980 98147 331878 168291 108553 174758 140782 388149 71912 164135
14930 164135 150292 209636 164541 389572 286941 294478 387394 401130 249558 121281 350830
$$ packed form
15006A76307J22100A0000K63876J23308A35574a76195a3775A88402K46747n1261
14996C83888A64097A6171K75444A24228K67339h4284D85213j05682j06056E8759
14985C7990K76492D9983J75434m2058D3897K25829k9887f0512C90397j84563o7178
14974A38656J57824I0928m4678N02097j99847j68913R8925A5405K76593B8591
14963b531C66878j8501l2009K3883l2330f8931A56423K10357l9557J15451j53074
14952B89600l6707C6786P441O5967L08428j24639q1130K7335L03869A96427q5195
14941A11232K65620l1872I8147K33731j63587n9738O6205l3976K47367G1912R2223
14930A64135j3843N9344m5095K25031j02631P537R2916J3736j51572A21281K29549
$$ plain form
14919 350830 266943 346474 57938 253821 499584 140503 138953 349241 569575 154241
14908 968881 513021 433536 329974 317745 306899 123159 270612 449593 293106 199608
14898 199608 199619 138633 294318 144332 227383 417895 320017 273292 95693 13592 329319
14887 329319 416433 468767 -61478 401273 22820 89556 150024 398839 454953 271654 345069
14876 345069 204550 390511 562463 417258 456104 263540 425519 381079 418037 211862
14866 211862 70546 97235 224425 206161 345134 267498 540667 321668 458788 469667
14856 469667 -60533 359688 173341 395210 373221 463379 716528 424428 634150 -51510
14845 410358 305872 348006 810619 318581 659848 543532 61415 563822 549010 608315
$$ packed form
14919C50830q3887P9531E7938J95883K45763A40503j550K10288K20334A54241
14908I68881m55860p9485j03562j2229j0846A23159J47453J78981j56487r3498
14898A99608J1o0986J55685A44332Q3051J90512r7878m6725I5693A3592L15727
14887C29319Q7114N2334f1478D01273B2820O6736O0468K48815N6114j83299P3415
14876C45069j40519J85961J71952j45205L8846j92564J61979m4440L6958k06175
14866B11862G0546K6689J27190j8264J38973p7636K73169k18999J37120J0879
14856D69667f0533C59688A73341K21869k1989R0158K53149k92100K09722e1510
14845D10358j04486M2134M62613C18581L41267j16316F1415N02407j4812N9305
$$ plain form
14835 608315 412014 604507 300260 726885 495988 494076 544150 301609 83021 311546
14825 311546 477688 524369 182004 540317 435867 691170 530728 789246 680257 554670
14815 554670 285608 699139 467793 791099 483675 421931 336685 573507 625735 653176
14805 653176 350885 545061 706722 531614 204670 473107 427316 694152 521204 291297
14795 291297 785691 381319 745376 339882 494070 544910 444405 624585 470511 441482
14785 441482 669489 702113 584440 389626 505184 273450 284387 668178 593281 562890
14775 562890 347555 690046 445698 372282 496185 479964 750073 955158 524148 486244
14765 486244 391561 657701 380695 507668 791015 127917 555908 582494 452736 484760
$$ packed form
14835F08315j96301J92493C00260M26625k30897j912N0074k42541H3021K28525
14825C11546J66142M6681A82004L58313j04450K55303j60442K58518j08989j25587
14815E54670k69062M13531k31346L23306l07424o1744q5246K36822N2228K7441
14805F53176l02291J94176J61661j75108B04670K68437m5791K66836j72948k29907
14795B91297M94394C81319L64057C39882J54188N0840j00505J80180j54074k9029
14785D41482K28007L2624j17673j94814J15558k31734J0937L83791p4897l0391
14775E62890k15335L42491k44348p3416J23903j6221K70109K05085m31010l7904
14765D86244r4683K66140k77006J26973K83347A27917M27991K6586j29758L2024
$$ plain form
14755 484760 726140 638955 507120 70778 1033300 559511 656247 631213 780447 710502
14745 710502 1049972 878877 913338 747826 872178 510888 488205 1043478 661686 672469
14735 672469 735074 604811 509573 656667 773216 590320 798669 806165 698723 574520
14725 574520 639065 795161 971080 821395 727427 752480 743704 659322 810810 795036 601250
14714 601250 794374 664099 790773 752343 876195 1158734 619283 708598 900482 695569
14704 695569 798662 1138181 754597 934143 831488 622140 971102 631527 875273 1023914
14694 1023914 904114 895575 844924 1168406 944888 844572 1196385 1031025 836306 848351
14684 848351 657996 1082565 1088283 911357 817451 1199047 697036 939165 1086450 750616
$$ packed form
14755D84760K41380q7185j31835G0778R62522m73789R6736k5034J49234o9945
14745G10502L39470j71095L4461j65512J24352l61290k2683N55273l81792J0783
14735F72469O2605j30263r5238J47094J16549j82896K08349P496j07442j24203
14725E74520O4545J56096J75919j49685r3968K5053q776q4382J51488j5774j93786
14714F01250J93124j30275J26674l8430J23852K82539n39451Q9315J91884k04913
14704F95569J03093L39519l83584J79546j02655k09348L48962l39575K43746J48641
14694A023914j19800q539n0651L23482k23518j00316L51813j65360j94719J2045
14684H48351j90355M24569N718j76926r3906L81596n02011K42129J47285l35834
$$ plain form
14674 750616 1246940 1093241 947041 1044325 1179032 862923 1084700 1219216 941815 562680
14664 562680 1022383 1147327 1200435 1105856 1289330 1311626 1039501 1150942 1073604 1090889
14654 1090889 1013944 1186725 1412132 1282959 1306702 859662 1092370 1045373 927467 1256564
14644 1256564 1237651 1172763 1115670 1112938 1209806 1131852 1013409 1042168 1298816 1370551 1298806
14633 1298806 1412447 1038953 1493157 1308496 1380512 1531786 1167018 1246520 1559149 1241747
14623 1241747 1270118 1444358 1333569 1421144 1641927 1603808 1070984 1369301 1521223 1186799
14613 1186799 1540497 1584760 1374380 1168927 1341023 1395308 1349749 1325576 1578710 1660225
14603 1660225 1448482 1560115 1498322 1351784 1502765 1759569 1644605 1632276 1744351 1657306
$$ packed form
14674G50616M96324j53699j46200R7284J34707l16109K21777J34516k77401l79135
14664E62680M59703J24944N3108r4579J83474K2296k72125J11441p7338J7285
14654A090889p6945J72781K25407j29173K3743m47040K32708m6997j17906L29097
14644A256564j8913o4888n7093k732R6868p7954j18443K8759K56648P1735p1745
14633A298806J13641l73494M54204j84661P2016J51274l64768P9502L12629l17402
14623A241747K8371J74240j10789Q7575K20783l8119n32824K98317J51922l34424
14613A186799L53698M4263k10380k05453J72096N4285m5559k4173K53134Q1515
14603A660225k11743J11633o1793j46538J50981K56804j14964j2329J12075q7045
$$ plain form
14593 1657306 1601517 1666019 1376630 1610042 1482491 1824210 1676154 1562783 1595532 1743851
14583 1743851 1765687 1673239 1558228 1697867 1774639 1952777 1974768 1766010 1999143 2035742
14573 2035742 2242445 2071124 1964941 1937000 2269480 2283692 1893428 2022969 2385833 2025238
14563 2025238 2190429 1948357 2084771 2191944 2221277 2465623 2400159 2382436 2433175 2337377
14553 2337377 2667088 2410982 2557981 2676422 2674467 3007675 2861366 2975109 2993445 3179085
14543 3179085 3328564 3580310 3617842 4156060 4446318 4795104 5900604 6577452 7780907
14534 7780907 10041786 14198753 21597642 32263626 30249568 17050882 11201078 7646582
14526 7646582 5663591 4151018 3902657 2773131 2907955 2886574 2545597 2745618 2559023
$$ packed form
14593A657306n5789O4502k89389K33412j27551L41719j48056j13371L2749J48319
14583A743851K1836r2448j15011J39639P6772J78138K1991k08758K33133L6599
14573B035742K06703j71321j06183k7941L32480J4212l90264J29541L62864l60595
14563B025238J65191k42072J36414J07173K9333K44346o5464j7723N0739r5798
14553B337377L29711k56106J46999J18441j955L33208j46309J13743J8336J85640
14543C179085J49479K51746L7532N38218K90258L48786J105500O76848J203455
14534G780907K260879M156967P398889J0665984k014058j3198686n849804l554496
14526G646582j982991j512573k48361j129526J34824k1381l40977K00021j86595
$$ plain form
14517 2559023 2644781 2323572 2638429 2461889 2462243 2121658 2585896 2483108 2385704 2652884
14507 2652884 2577388 2639941 2815993 2785983 2608900 2751075 3121444 2708393 2642888 3035842
14497 3035842 2962293 2591324 3026845 2873145 3138786 3048619 3105101 3399409 3351185 3172060
14487 3172060 3542892 3195964 3358320 3610218 3642359 3423761 3611993 3462150 3790149 3501092
14477 3501092 3488884 3634909 3916794 3929084 3986170 3793446 3623986 4043682 3626193 3945947
14467 3945947 3985646 3954932 4087659 4300220 3996998 3783340 4294437 4068788 4493719 4690339
14457 4690339 4524149 4594113 4784756 4845606 4596116 4951520 4782782 5115523 5151975 4848299
14447 4848299 4940459 5266514 5236451 5240195 5345069 5127246 5811855 5473075 5408350 5812729
$$ packed form
14517B559023Q5758l21209L14857j76540L54l40585M64238j02788r7404K67180
14507B652884p5496O2553J76052l0010j77083J42175L70369m13051o5505L92954
14497C035842p3549l70969M35521j53700K65641r0167N6482K94308m8224j79125
14487C172060L70832l46928J62356K51898L2141k18598J88232j49843L27999k89057
14477C501092j2208J46025K81885J2290N7086j92724j69460M19696m17489L19754
14467C945947L9699l0714J32727K12561l03222k13658N11097k25649M24931J96620
14457D690339j66190O9964J90643O0850k49490L55404j68738L32741L6452l03676
14447D848299R2160L26055l0063L744J04874k17823O84609l38780o4725M04379
$$ plain form
14437 5812729 5831865 5837359 5396013 6056588 6110271 6323974 6496795 5883596 5990160 6257821
14427 6257821 6483814 6429018 6608338 6784584 6871368 6719655 6957985 7006142 7022743 7015652
14417 7015652 7167863 7393323 7268174 7592546 7650718 7995500 7687305 7841110 7813050 8037487
14407 8037487 8176853 8460480 8540649 8483171 8472185 9213732 9220224 9120785 9623595 9561725 9518772
14396 9518772 9717531 9961254 9974302 10072020 10138612 10449638 10550529 10913852 10731547 11201092
14386 11201092 11506927 11394085 12083648 11883242 12196702 12235503 12685449 12895321 12785440
14377 12785440 13100835 13196294 13596856 13575440 13578927 13891658 14271696 14513612 14976323 15115374
14367 15115374 15528778 15789779 15876709 16479432 16482148 16823780 17337286 17693538 18061347 18196144
$$ packed form
14437E812729J9136N494m41346O60575N3683K13703J72821o13199J06564K67661
14427F257821K25993n4796J79320J76246Q6784j51713K38330M8157J6601p091
14417G015652J52211K25460j25149L24372N8172L44782l08195J53805k8060K24437
14407H037487J39366K83627Q0169n7478j0986P41547O492r9439N02810o1870m2953
14396I518772J98759K43723J3048R7718O6592L11026J00891L63323j82305M69545
14386A1201092L05835j12842O89563k00406L13460L8801M49946K09872j09881
14377A2785440L15395R5459M00562k1416L487L12731L80038K41916M62711J39051
14367A5115374M13404K61001Q6930O02723K716L41632N13506L56252L67809J34797
$$ plain form
14357 18196144 18947542 19153770 19514116 19534749 20304547 20469799 21376675 21705346 22056296
14348 22056296 22479348 23135580 23330927 24194342 24819216 25500752 25922167 26633673 26824658
14339 26824658 27549742 27877255 28775749 29654893 30253138 30928998 32162329 32644227 33186445
14330 33186445 34263789 34862402 36142601 37215406 38210795 39250817 40315207 41334027
14322 41334027 42427009 43681611 44899488 46051740 47545734 48862528 50686808 51803783
14314 51803783 53580754 55610992 57550122 58828093 61207312 63002925 65106513 67748378
14306 67748378 69607243 71813204 74603051 77323405 80288648 83182196 86192569 89693972
14298 89693972 92964892 96514742 100825359 104729252 108778624 113053786 117679815 122927089
$$ packed form
14357A8196144P51398K06228L60346K0633P69798J65252R06876L28671L50950
14348B2056296M23052O56232J95347Q63415O24874O81536M21415P11506J90985
14339B6824658P25084L27513Q98494Q79144N98245O75860J233331M81898N42218
14330C3186445J077344N98613J280199J072805R95389J040022J064390J018820
14322D1334027J092982J254602J217877J152252J493994J316794J824280J116975
14314E1803783J776971K030238J939130J277971K379219J795613K103588K641865
14306F7748378J858865K205961K789847K720354K965243K893548L010373L501403
14298H9693972L270920L549850M310617L903893M049372M275162M626029N247274
$$ plain form
14290 122927089 128052039 133816418 139302431 145770087 152508123 159563763 166638148 174268656
14282 174268656 182299187 191183265 200188127 209740417 219796118 230228769 241420120
14275 241420120 253180745 265620411 278046956 291115926 304596328 317981717 331323723
14268 331323723 344690166 357817805 370360851 382185042 393581874 404289357 413596397
14261 413596397 422823378 431133901 438756628 445039928 449088363 450255689 451566406 449134851
14253 449134851 440546015 433902483 427351452 419980438 411324067 401879433 391094133 379018932
14245 379018932 365971777 352558953 339372378 326338711 313611595 299996350 286548295
14238 286548295 273873599 261373478 249262260 237095381 225434889 214277797 203588656
$$ packed form
14290A22927089N124950N764379N486013O467656O738036P055640P074385P630508
14282A74268656Q030531Q884078R004862R552290J0055701J0432651J1191351
14275B41420120J1760625J2439666J2426545J3068970J3480402J3385389J3342006
14268C31323723J3366443J3127639J2543046J1824191J1396832J0707483R307040
14261D13596397R226981Q310523P622727O283300M048435J167326J310717k431555
14253D49134851q588836o643532o551031p371014q656371r444634j0785300j2075201
14245C79018932j3047155j3412824j3186575j3033667j2727116j3615245j3448055
14238B86548295j2674696j2500121j2111218j2166879j1660492j1157092j0689141
$$ plain form
14231 203588656 193377167 183997956 175303892 166768356 159110790 151586051 144497318 137883108
14223 137883108 132146352 126455548 120713013 115405954 110826620 106387807 101921851 98099054
14215 98099054 94297737 90028889 86800025 83737993 80344819 77565528 74509586 71853583
14207 71853583 69369270 67203404 64797665 62612740 60456987 58962716 56646600 54960942
14199 54960942 53574344 52310427 50240001 48540841 47060660 45855704 44545206 43641001
14191 43641001 42452165 41264077 39886860 38811167 37488050 36989160 36021909 34791965
14183 34791965 34080154 32907474 32208025 31274252 30681988 30144551 29031098 28532828 27893915
14174 27893915 27243156 26674715 25883207 24945983 24698766 24325584 23501949 23432448 22685198
$$ packed form
14231B03588656j0211489r379211q694064q535536p657566p524739p088733o614210
14223A37883108n736756n690804n742535n307059m579334m438813m465956l822797
14215I8099054l801317m268848l228864l062032l393174k779291l055942k656003
14207G1853583k484313k165866k405739k184925k155753j494271k316116j685658
14199E4960942j386598j263917k070426j699160j480181j204956j310498r04205
14191D3641001j188836j188088j377217j075693j323117m98890r67251j229944
14183C4791965p11811j172680o99449r33773n92264n37437j113453m98270o38913
14174B7893915o50759n68441p91508r37224k47217l73182q23635o9501p47250
$$ plain form
14165 22685198 22512234 21917767 21371392 20863507 19959287 19750146 19479730 19431503 18886262
14156 18886262 18650653 18122715 17820775 17442913 17193656 16951049 16565359 16352296 15808211
14147 15808211 15653000 15213159 15225408 14593342 14629129 14483462 13988385 13913160 13594719 13290525
14137 13290525 13353530 13095537 12725553 12452819 12409987 12098027 12261714 11835788 11730844 11514224
14127 11514224 11551510 11187621 10817248 10453606 10429020 10264603 10282566 10127823 10264326 9911554
14117 9911554 9589090 9273926 9582227 9206179 8961326 8670559 8977539 8862764 8669763
14108 8669763 8567246 8530232 8496097 8447122 8075522 8018501 8141960 7623391 7628245 7459214
14098 7459214 7588320 7569129 7461741 7138857 7381472 6955738 6971691 7052147 6696764 6453896
$$ packed form
14165B2685198j72964n94467n46375n07885r04220k09141k70416m8227n45241
14156A8886262k35609n27938l01940l77862k49257k42607l85690k13063n44085
14147A5808211j55211m39841J2249o32066L5787j45667m95077p5225l18441l04194
14137A3290525O3005k57993l69984k72734m2832l11960J63687m25926j04944k16620
14127A1514224L7286l63889l70373l63642k4586j64417J7963j54743J36503l52772
14117I911554l22464l15164L08301l76048k44853k90767L06980j14775j93001
14108H669763j02517l7014l4135m8975l71600n7021J23459n18569M854j69031
14098G459214J29106j9191j07388l22884K42615m25734J5953Q0456l55383k42868
$$ plain form
14088 6453896 6705758 6246578 6230496 6131177 6034381 6520670 6124439 6179172 6365307 5982979
14078 5982979 5826158 5944306 6142649 5376423 5763687 5437513 5574869 5687503 5453552
14069 5453552 5558207 5322498 5275396 4920741 5249140 4752868 4996286 4828724 4827061 5065330
14059 5065330 4802321 4624244 4638127 4713426 4511864 4580793 4561219 4492228 4034830 4261725
14049 4261725 4389631 4516395 4063547 4388656 4451347 4405571 4225206 4060744 4204463 4074133
14039 4074133 3937878 3737853 3926327 3904883 3705405 3767344 3925060 3876419 3506026 3997698
14029 3997698 3873780 3329400 3466604 3548083 3468778 3193354 3192092 3154576 3327106 3085431
14019 3085431 3295945 3432066 3023975 3315173 3574512 3041823 3332949 3036856 3030148 3143816
$$ packed form
14088F453896K51862m59180j6082r9319r6796M86289l96231N4733J86135l82328
14078E982979j56821J18148J98343p66226L87264l26174J37356J12634k33951
14069E453552J04655k35709m7102l54655L28399m96272K43418j67562j663K38269
14059E065330k63009j78077J3883P5299k01562O8929j9574o8991m57398K26895
14049D261725J27906J26764m52848L25109O2691m5776j80365j64462J43719j30330
14039D074133j36255k00025J88474k1444j99478O1939J57716m8641l70393M91672
14029C997698j23918n44380J37204Q1479p9305k75424j262l7516J72530k41675
14019C085431K10514J36121m08091K91198K59339n32689K91126k96093o708J13668
$$ plain form
14009 3143816 2823116 2830307 3001912 3193532 3095098 2683202 3058277 2636095 2673944 2650603
13999 2650603 2959845 2556254 2451650 2650795 2685409 2398810 2678583 2367815 2283053 2715789
13989 2715789 2427747 2652439 2444192 2356925 2664313 2612549 2782662 3006304 2529030 2430120
13979 2430120 2909435 3170992 3572392 3739490 4888678 6346229 9521206 15813898 27292083
13970 27292083 31234278 20343450 13894750 10308583 7964842 6653874 5139349 4640514
13962 4640514 3987905 3874974 3396907 3189792 2980387 2579489 3036755 2676355 2921807
13953 2921807 2821977 2682299 2194679 2621064 2397043 2378361 2434504 2371334 2535384 2506975
13943 2506975 2090071 2399010 2356001 2170092 1867326 2258713 2052589 1947682 2044114 2338382
$$ packed form
14009C143816l20700P191J71605J91620r8434m11896L75075m22182L7849k3341
13999B650603L09242m03591j04604J99145L4614k86599K79773l10768q4762M32736
13989B715789k88042K24692k08247q7267L07388n1764J70113K23642m77274r8910
13979B430120M79315K61557M01400J67098J149188J457551L174977O292692J1478185
13970B7292083L942195j0890828o448700l586167k343741j310968j514525m98835
13962D640514o52609j12931m78067k07115k09405m00898M57266l60400K45452
13953B921807r9830j39678m87620M26385k24021j8682N6143o3170J64050k8409
13943B506975m16904L08939m3009j85909l02766L91387k06124j04907R6432K94268
$$ plain form
13933 2338382 2252318 1974463 2029749 1713649 2145555 1932265 1956862 1867728 1692395 1687326
13923 1687326 1976193 1643391 1760388 1743591 1569853 1743644 1967883 1803896 1534283 1455384
13913 1455384 1533183 1537282 1570975 1736019 1817686 1637465 1830030 1370181 1427493 1316160
13903 1316160 1902877 1638308 1725139 1746790 1709961 1630769 1507911 1320268 1415704 1751841
13893 1751841 1540438 1704896 1683354 1537896 1645657 1617811 1300328 1497203 1630893 1460465
13883 1460465 1318258 1680161 1482882 1618358 1382027 1444801 1268559 1041676 1398250 1235508
13873 1235508 1114237 1740263 1086850 1572834 1147596 1168957 1163202 1573827 1170748 1211489
13863 1211489 1350618 924904 1219986 1355807 1473354 1206161 980957 1285984 1188093 1072608
$$ packed form
13933B338382q6064k77855N5286l16100M31906k13290K4597q9134j75333n069
13923A687326K88867l32802J16997j6797j73738J73791K24239j63987k69613p8899
13913A455384P7799M099L3693J65044Q1667j80221J92565m59849N7312j11333
13903A316160N86717k64569Q6831K1651l6829p9192j22858j87643R5436L36137
13893A751841k11403J64458k1542j45458J07761k7846l17483J96875J33690j70428
13883A460465j42207L61903j97279J35476k36331O2774j76242k26883L56574j62742
13873A235508j21271O26026o53413M85984m25238K1361n755M10625m03079M0741
13863A211489J39129m25714K95082J35821J17547k67193k25204L05027r7891j15485
$$ plain form
13853 1072608 1170286 1192296 888326 1137980 1134399 1604102 873394 935083 1021237 1209426
13843 1209426 1146902 1297357 1035261 1344286 954763 1007144 1055085 1263991 1113883 1039783
13833 1039783 1032534 1162182 1048326 1025953 825175 848054 1086643 1348369 1000471 745557
13823 745557 716827 911977 1395575 902763 1125529 868764 1005830 1126831 977119 904381
13813 904381 935617 955113 1111780 1059323 962995 974810 715613 1090996 757835 1020110
13803 1020110 980366 782140 1009351 800668 1053728 560560 893469 878374 844229 1225281
13793 1225281 1077041 956059 827724 740877 890205 926100 1043014 1094297 975641 1201518
13783 1201518 930102 475231 733470 797949 775881 894332 778401 795699 723248 709071
$$ packed form
13853A072608R7678K2010l03970K49654l581M69703p30708O1689Q6154J88189
13843A209426o2524J50455k62096L09025l89523N2381M7941K08906j50108p4100
13833A039783p249J29648j13856k2373k00778K2879K38589K61726l47898k54914
13823G45557k8730J95150M83598m92812K22766k56765J37066J21001j49712p2738
13813I04381L1236J9496J56667n2457r6328J1815k59197L75383l33161K62275
13803A020110l9744j98226K27211k08683K53060m93168L32909j5095l4145L81052
13793A225281j48240j20982j28335q6847J49328L5895J16914N1283j18656K25877
13783A201518k71416m54871K58239O4479k2068J18451j15931J7298p2451j4177
$$ plain form
13773 709071 925023 879961 778768 934384 982020 469300 641090 635081 635650 830676 613388
13762 613388 916528 921739 527705 800974 732416 491606 696062 447263 418687 586539
13752 586539 667057 875300 488152 636377 732100 544126 537343 590968 762816 792684 131565
13740 904464 650593 795258 620566 961122 926120 676759 676375 557552 527670 606768 643426
13729 643426 554174 651243 771450 744441 637072 571901 901218 700063 418510 599805
13719 599805 632758 181182 683989 645144 486881 399022 392329 649678 456351 529651 945188
13708 945188 438487 463326 983011 1008247 505752 616058 439477 910788 734997 715321
13698 715321 559540 383905 777564 408355 560203 493471 538496 610712 581767 422143
$$ packed form
13773G09071K15952m5062j01193J55616M7636D69300J71790o009N69J95026k17288
13762F13388L03140N211l94034K73269o8558k40810K04456k48799k8576J67852
13752E86539Q0518K08243l87148J48225R5723j87974o783N3625J71848K9868A31565
13740I04464k53871J44665j74692L40556l5002k49361l84j18823k9882P9098L6658
13729F43426q9252R7069J20207k7009j07369o5171L29317k01155k81553J81295
13719E99805L2953A81182N02807l8845j58263q7859o693K57349j93327P3300M15537
13708I45188D38487K4839N19685K5236n02495J10306j76581M71311j75791j9676
13698G15321j55781j75635L93659l69209J51848o6732M5025P2216k8945j59624
$$ plain form
13688 422143 457698 867949 442364 409023 652379 546406 760859 201249 336057 724922
13678 724922 546108 430166 777381 778764 424683 589244 647798 577179 408353 375473
13668 375473 639070 485831 638766 613106 479531 320690 882759 580205 467861 288064
13658 288064 214558 518844 406763 566005 351360 871816 718206 637369 341010 423006
13648 423006 539469 428025 639277 782823 538511 479242 275658 594350 657453 486246
13638 486246 473010 450578 221591 485180 516923 178914 381341 463983 449783 419215 294746
13627 294746 285888 267692 272458 391548 486412 313778 510498 623920 353228 462501 517295
13616 517295 727927 687403 499397 502406 290001 300797 205759 150100 353282 557340 483462
$$ packed form
13688D22143L5555M10251m25585l3341K43356j05973K14453B01249J34808L88865
13678G24922j78814j15942L47215J383l54081J64561N8554p0619j68826l2880
13668C75473K63597j53239J52935k5660j33575j58841N62069l02554j12344j79797
13658B88064p3506L04286j12081J59242k14645N20456j53610q0837k96359Q1996
13648D23006J16463j11444K11252J43546k44312n9269k03584L18692O3103j71207
13638D86246j3236k2432B21591K63589L1743A78914K02427Q2642j4200l0568j24469
13627B94746q858j8196M766J19090R4864j72634J96720J13422k70692J09273N4794
13616E17295K10632m0524j88006L009k12405J0796r5038n5659K03182K04058p3878
$$ plain form
13605 483462 459418 400049 507600 670153 430741 450986 476169 327726 324863 616440 546056
13594 546056 282760 337830 178791 724697 503399 387177 188383 244551 222341 284129
13584 284129 220649 323475 416575 357916 577094 857914 445903 303715 331378 444370
13574 444370 -68732 535542 393289 327658 198087 462761 349327 551135 281797 282369
13564 282369 -146543 457871 367912 352505 373216 604377 97699 341234 405475 247435
13554 247435 106550 539406 460678 841160 161097 430528 83215 26800 506453 295041
13544 295041 378105 429660 323113 308743 533245 327849 436235 429959 307901 119464
13533 484244 216451 363975 210235 376491 488538 212566 311436 61021 386964 343551
$$ packed form
13605D83462k4044n9369J07551J62553k39412K0245K5183j48443k863K91577p0384
13594E46056k63296N5070j59039N45906k21298j16222A88383N6168k2210O1788
13584B84129o3480J02826R3100n8659K19178K80820m12011j42188K7663J12992
13574D44370f8732E35542j42253o5631j29571K64674j13434K01808k69338N72
13564B82369a46543D57871q9959j5407K0711K31161I7699K43535O4241j58040
13554B47435A06550M32856p8728L80482A61097K69431H3215B6800M79653k11412
13544B95041Q3064N1555j06547j4370K24502k05396J08386o276j22058A19464
13533D84244B16451J47524j53740J66256J12047B12566R8870F1021L25943m3413
$$ plain form
13523 343551 314782 334307 341418 210592 -233464 232782 198838 185359 487605 49394 289915
13512 289915 264049 570227 256835 343132 128649 496480 187026 335426 -246880 367822
13501 60435 170894 329992 160238 231041 186931 536243 329899 387009 267856 416397
13491 416397 170274 130457 -10151 191843 529046 413212 401583 359947 549039 359126
13481 359126 450065 86066 5041 240478 65940 114690 406 254139 260150 213915 312937 223330
13469 223330 123268 264321 337155 324221 117381 463296 230616 404235 398687 163022
13458 264394 66873 588358 522575 90990 386167 522488 360843 378330 162628 81674
13448 81674 505350 272411 319595 327499 496223 377199 118229 259704 123748 123879 269421
$$ packed form
13523C43551k8769J9525P111j30826b33464B32782l3944j3479L02246D9394K40521
13512B89915k5866L06178B56835Q6297A28649L67831A87026J48400b46880C67822
13501F0435J10459J59098A60238P0803m4110L49312k06344N7110j19153J48541
13491D16397A70274l9817a0151A91843L37203j15834j1629m1636J89092j89913
13481C59126R0939H6066E041K35437F5940M8750D06K53733O011m6235R9022q9607
13469B23330j00062J41053P2834j2934A17381L45915B30616J73619n548A63022
13458B64394F6873N21485o5783I0990K95177J36321j61645J7487A62628q0954
13448H1674M23676k32939M7184P904J68724j19024A18229J41475A23748J31J45542
$$ plain form
13437 269421 182281 365034 409915 228159 -56908 172598 395225 169059 33032 276849
13427 276849 148277 206089 68425 95970 128405 195250 229785 78523 263478 -147463 252151
13415 287448 257502 457940 66263 310963 356498 159419 289607 491609 203536 367354
13405 367354 224016 407475 466825 155882 167819 289328 57662 327828 394312 68019
13394 107664 390800 193905 41528 196520 238188 236905 -111529 144486 651 358070 161912
13382 -57750 236250 12585 232198 255667 256163 209918 125934 17072 -40429 208994 280635
13371 280635 214770 -38984 -35713 204518 98188 162617 -212892 265682 353373 93930 9228
13359 436857 218889 253244 279068 301142 -24721 266620 300060 42527 298673 462221 439336
$$ packed form
13437B69421q7140J82753M4881j81756e6908A72598K22627A69059C3032K43817
13427B76849j28572N7812F8425K7545L2435O6845L4535G8523J84955a47463B52151
13415B87448k9946K00438F6263K44700M5535A59419J30188K02002B03536J63818
13405C67354j43338J83459N9350A55882J1937J21509E7662K70166O6484F8019
13394A07664K83136A93905D1528J54992M1668j283a11529A44486F51L57419A61912
13382e7750B36250A2585K19613K3469M96m6245q3984A7072d0429B08994P1641
13371B80635o5865c8984L271B04518I8188O4429b12892B65682Q7691I3930I228
13359D36857k17968L4355K5824K2074b4721B66620L3440D2527K56146J63548k2885
$$ plain form
13348 439336 269521 355655 -108881 248940 368298 380615 198178 340537 97009 296232
13338 296232 183570 323006 493606 263515 590299 347932 349916 299390 400584 383494
13328 383494 354028 126786 706066 94408 266253 97608 237348 78881 87458 251026 195486
13317 195486 230133 14912 381154 570714 237277 384540 171012 236533 243303 186258 129558
13306 129558 469539 337353 250441 96005 99804 -1642 295798 415539 145643 70819 205804
13295 205804 126025 -39853 -30384 227215 97057 -153767 210146 -109283 309875 12501 278895
13284 278895 325843 254303 268018 -142355 31059 57664 21035 200830 211914 600061 237456
13272 376855 -25284 172943 40118 365796 34640 91546 105507 289923 -95760 167508 219194
$$ packed form
13348D39336j69815Q6134a08881B48940J19358J2317j82437J42359I7009J99223
13338B96232j12662J39436J70600k30091L26784k42367J984n0526J01194j7090
13328C83494k9466A26786N79280I4408J71845I7608J39740G8881Q577J63568n5540
13317A95486L4647A4912L66242J89560B37277J47263A71012O5521O770n7045n6700
13306A29558L39981j32186q6912I6005L799a642B95798J19741A45643G0819J34985
13295B05804p9779c9853R469B27215I7057a53767B10146a09283C09875A2501K66394
13284B78895M6948p1540J3715a42355C1059K6605B1035J79795J1084L88147B37456
13272C76855b5284A72943D0118L25678C4640N6906J3961J84416i5760A67508N1686
$$ plain form
13261 219194 241003 99741 -188163 -60536 -37963 64128 150566 226043 316427 371055 381522
13250 381522 73039 160388 131827 176096 57313 295318 -38587 183959 356111 -44576 307638
13238 94686 176043 -80807 238488 31932 114665 -197535 183673 99120 -237500 173058 -57882
13226 -207543 -37546 210260 312019 202212 83936 -213943 153547 1518 113160 407969
13216 407969 213037 168004 -178302 -11822 230354 287809 312152 289453 209211 47786 291594
13205 291594 12951 -83251 10686 433560 233791 313956 -151719 -148642 491780 282335 314893
13194 314893 -44142 -219316 122644 263289 -19682 318873 86036 293481 -20507 250412
13183 298152 -4052 -6230 478160 -50282 200632 215714 157481 -293184 -119905 228472 198045
$$ packed form
13261B19194K1809I9741a88163f0536K2573F4128Q6438P5477R0384N4628J0467
13250C81522G3039Q7349k8561M4269E7313K38005c8587A83959J72152d4576C07638
13238I4686Q1357h0807B38488C1932Q2733a97535A83673q4553b37500A73058e7882
13226b07543c7546B10260J01759j09807H3936b13943A53547A518J11642K94809
13216D07969j94932m5033a78302a1822B30354N7455K4343k2699q0242D7786K43808
13205B91594A2951h3251A0686M22874j99769Q0165a51719L077D91780k09445L2558
13194C14893d4142j75174A22644J40645a9682C18873H6036K07445b0507B50412
13183B98152d052k178D78160e0282B00632J5082n8233b93184a19905B28472l0427
$$ plain form
13172 198045 807 209719 -153805 -316230 -27662 87668 -250825 15500 326459 281346 21787
13160 -1953 -58238 198036 316232 26164 -232989 40593 -82873 60654 233920 11798 226487
13149 226487 -159743 299359 100209 -73025 -79581 -235551 194731 -291396 -70930 377772
13138 -35144 -193257 387704 -61330 -13193 -227968 77277 -38180 463028 -52107 429738 -202731
13126 -119910 188427 53140 69638 -2696 52994 196884 16381 98350 301284 73759 220772
13115 220772 240294 26987 286067 55169 324992 207883 187032 113814 13828 358182 -166291
13103 236242 46740 -57790 235926 -38079 204856 98983 -66938 247043 260677 6391 72663
13092 72663 182652 -4 52228 237024 430051 14234 397814 25703 51101 -112760 -92284
$$ packed form
13172A98045H07K08912a53805j62425b7662H7668b50825A5500L10959m5113B1787
13160a953n6285A98036J18196B6164b32989D0593h2873F0654J73266A1798K14689
13149B26487a59743B99359A00209g3025o556j55970A94731b91396g0930C77772
13138c5144j58113C87704f1330a3193k14775G7277c8180D63028e2107D29738b02731
13126a19910A88427E3140J6498b696E2994J43890A6381Q1969K02934G3759J47013
13115B20772J9522B6987K59080E5169K69823j17109k0851p3218A3828L44354a66291
13103B36242D6740e7790B35926c8079B04856I8983f6938B47043J3634F391O6272
13092G2663J09989dE2228J84796J93027A4234L83580B5703K5398a12760K0476
$$ plain form
13081 -92284 10834 244655 186756 217440 123944 128409 631 -38223 214125 310730 387165 -290205
13068 369562 -87840 317171 193765 317705 -25698 -184792 43417 78999 178088 82347 -207947
13056 522222 282994 -175604 35514 140450 114453 -162953 23649 -17212 67992 13186 245775
13045 245775 195814 228541 165730 98006 57257 -341032 -63839 8217 226962 79098 129266
13034 129266 143291 254901 -89576 163721 112847 208673 18760 191397 162993 405062 -23431
13022 -647575 92085 215861 194153 -53909 97144 -112992 74728 183507 -2317 168052 20803
13010 -107686 -194022 82742 437632 65471 329803 306639 94932 282979 15227 63020 69238
12999 69238 264748 122296 297479 -187754 2639 311659 233406 179616 -81941 187765 212590
$$ packed form
13081i2284A0834K33821n7899L0684r3496M465F31c8223B14125R6605P6435b90205
13068C69562h7840C17171j23406J23940b5698j59094D3417L5582R9089H2347b07947
13056E22222k39228a75604C5514J04936k5997a62953B3649a7212F7992A3186K32589
13045B45775m9961L2727o2811o7724m0749c41032f3839H217K18745G9098N0168
13034A29266J4025J11610h9576A63721n0874R5826A8760J72637k8404K42069b3431
13022f47575I2085J23776k1708e3909I7144a12992G4728J08779b317A68052B0803
13010a07686q6336H2742L54890F5471K64332k3164I4932J88047A5227M7793O218
12999F9238J95510A22296J75183a87754B639L09020p8253n3790h1941A87765K4825
$$ plain form
12988 212590 231431 93787 -51719 429338 125983 116787 53509 19118 -97332 111547 -44882
12976 -78747 168963 -134384 -87558 198292 153604 -239835 11356 -97952 55026 149406 -50526
12964 10089 11373 374194 -118418 -20065 -70209 -60916 -299846 -254527 345395 200185 115570
12953 115570 10706 298439 121962 65545 106258 -96139 151433 -14044 137561 -145398
12942 -128209 -76775 -229624 248972 67146 29184 98505 -345447 -394094 233650 -96681 10584
12930 13116 77286 -31648 -79704 -19028 250193 -25334 244233 78925 -71040 38752 -44872
12918 109014 -131326 110278 -176754 -44634 7676 -168926 -35876 -41226 130021 115056 277973
12907 277973 11099 183668 153985 183945 11632 251007 -47751 -2060 34440 114119 321550
$$ packed form
12988B12590J8841I3787e1719D29338A25983r196E3509A9118i7332A11547d4882
12976g8747A68963a34384M6826A98292m4688b39835A1356i7952E5026R4380e0526
12964A0089J284L62821a18418b0065n0144R293k38930M5319C45395j45210q4615
12953A15570A0706K87733A21962n6417M0713i6139A51433a4044A37561a45398
12942a28209N1434j52849B48972F7146B9184O9321c45447m8647B33650i6681A0584
12930A3116O4170c1648m8056a9028B50193b5334B44233G8925g1040C8752d4872
12918A09014a31326A10278a76754d4634G676a68926c5876n350A30021j4965J62917
12907B77973A1099J72569k9683K9960A1632K39375d7751b060C4440P9679K07431
$$ plain form
12896 321550 -222387 -263984 -184027 -67002 -90587 65382 -79867 -195715 86281 310442 136675
12884 -189287 -12111 -9970 28405 -133218 -90720 168437 136685 19574 -15486 -131878 -209979
12873 -209979 -26577 55746 407818 99729 -37067 254891 -114057 465534 152478 -197252
12862 150070 140487 168726 184832 193324 217553 1470 83369 -107516 36211 47678 145158 13605
12849 -158098 -38954 52508 -67959 122490 201153 229840 -138516 210698 349193 400180 132898
12837 -213014 -285878 249078 201485 -103146 -179795 99165 23433 -213578 -217130 142898 122404
12826 122404 248678 -31173 280776 108144 -266158 -201579 91309 330668 -109731 -168992
12816 -168992 -92722 300473 338047 -249364 -78291 -28260 -91365 87163 175783 -95237 -102314
$$ packed form
12896C21550b22387m1597P9957f7002k3585F5382g9867j15848H6281K24161A36675
12884a89287a2111K141B8405a33218M2498A68437l1752A9574a5486j16392p8101
12873b09979b6577E5746L52072I9729c7067B54891a14057D65534A52478a97252
12862A50070r583K8239J6106Q492K4229A470Q1899a07516C6211J1467R7480A3605
12849a58098c8954E2508f7959A22490P8663K8687a38516B10698J38495N0987A32898
12837b13014p2864B49078m7593a03146p6649I9165B3433b13578l552A42898k0494
12826A22404J26274c1173B80776A08144b66158O4579I1309K39359a09731n9261
12816a68992P6270C00473L7574b49364g8291b8260o3105H7163Q8620i5237p077
$$ plain form
12805 -102314 86368 6670 -113756 314719 -196611 -163693 -242340 -2552 42491 123845 123077 53915
12792 344246 95450 207841 152620 -32937 274943 122063 -114824 48062 17402 -135778
12781 -181052 -445900 426393 -70058 -7019 118066 82327 89485 48709 -13464 346616 -154978
12769 374315 -37026 -238781 -415649 -67496 8568 510697 -269533 162350 149123 -152174
12758 -302723 -261747 -38576 58251 241629 -76714 123907 382685 -84081 -94424 180848 -116724
12746 81844 -106459 182123 220204 270606 25408 -19532 7097 32383 -7326 292220 26327
12734 422644 29839 122378 -265271 134046 -9637 -38881 -71672 68233 286803 6090 271844
12723 271844 155093 97659 -149509 147483 120233 -55718 363661 405998 52869 53192 -83529
$$ packed form
12805a02314H6368F670a13756C14719a96611L2918p8647b552D2491Q1354p68E3915
12792C44246I5450J12391n5221c2937B74943A22063a14824D8062A7402a35778
12781a81052k64848D26393g0058g019A18066l5739P158m0776a3464C46616a54978
12769C74315c7026k01755j76868f7496H568N02129b69533A62350j3227a52174
12758c02723M0976c8576E8251J83378g6714A23907K58778h4081j0343A80848a16724
12746H1844a06459A82123L8081N0402B5408a9532G097K5286g326B92220B6327
12734D22644B9839R2539b65271A34046i637k9244l2791F8233K18570F090K65754
12723B71844j16751n7434a49509A47483k7250e5718C63661M2337E2869L23h3529
$$ plain form
12711 201611 186959 -452046 -107071 75700 222390 -147809 70394 -118584 -41547 -9748 -55999
12700 -55999 -10651 -206420 221999 49253 15544 192230 182918 -102547 -47760 178952 93579
12689 93579 -154658 223385 170089 86719 152372 -148101 136177 244596 132862 253633
12679 253633 219975 323371 48650 2225 296452 109036 69183 82469 -183571 92179 28271
12667 233822 61714 -13146 146658 223283 138890 74798 62749 -26324 273938 135100 224838
12656 224838 111550 98270 79841 -145888 323014 61707 77097 212177 -140631 289759
12645 90765 295771 -180805 95877 163315 515571 150179 185677 -93019 208403 7213 -27353
12633 148520 209158 -78248 119267 -119368 -125312 41855 -26443 -326969 -172318 145062 -93220
$$ packed form
12711B01611j4652d52046a07071G5700J46690a47809G0394a18584d1547i748m6251
12700e5999a0651j95769B21999D9253A5544J76686r312a02547d7760A78952q5373
12689I3579a54658B23385n3296q3370O5653a48101A36177J08419j11734J20771
12679B53633l3658J03396D8650B225K94227A09036l9853J3286a83571I2179B8271
12667B33822F1714a3146A46658P6625q4393o4092j2049b6324B73938A35100Q9738
12656B24838A11550j3280j8429a45888C23014F1707J5390J35080a40631B89759
12645I0765K05006a80805I5877O7438L52256A50179L5498i3019B08403G213b7353
12633A48520O0638g8248A19267a19368n944D1855b6443l00526J54651A45062i3220
$$ plain form
12621 33883 136714 197161 333384 71988 99036 116300 42979 150583 189235 90756 282645
12610 282645 126203 397889 22136 332303 104571 -123356 239760 326895 100963 350776
12600 350776 45982 289990 -26422 -183412 -9336 -173755 -87689 -93488 -306123 171124 58623
12588 71371 37711 153092 209983 200724 248287 32798 12777 -84911 302678 364799 -96998
12576 118954 147946 172869 -67736 -47417 103327 133146 241954 -258113 79376 -110659 -6934
12564 -133082 -190510 -50233 4963 -81682 -82749 -328784 109014 -47835 -231916 253829 -299499
12552 242509 192624 127946 273739 -26620 -155501 67288 -199665 13599 -68719 95268 -83397
12540 -153836 7721 -145951 -574977 200774 390488 247115 -4220 132865 -144884 -188665
$$ packed form
12621C3883J02831O0447J36223G1988K7048J7264D2979J07604L8652I0756J91889
12610B82645A26203K71686B2136L10167A04571a23356B39760Q7135A00963K49813
12600C50776D5982K44008b6422j56990i336j64419Q6066n799k12635A71124E8623
12588G1371l3660J15381N6891r259M7563C2798A2777h4911C02678O2121i6998
12576A18954K8992K4923f7736K0319A03327K9819J08808b58113G9376a10659f934
12564a33082n7428e0233D963h1682j067k46035A09014d7835j84081B53829b99499
12552B42509m9885o4678J45793b6620j28881F7288a99665A3599f8719I5268h3397
12540a53836G721a45951m29026B00774J89714j43373d220A32865a44884m3781
$$ plain form
12530 -188665 -69983 -54719 107703 -37825 -357881 -109698 -268565 -22710 -227680 78409
12519 43060 -139611 258990 311219 129901 -140275 -82932 99292 -102548 -158997 -28434 -9172
12507 -122641 -344480 353747 58447 63386 -71756 14025 -67177 -101885 46414 31368 147283
12496 147283 227068 -177343 -25710 -237407 -20494 -2169 108015 378537 78303 245560 -76575
12484 -25577 -236530 44585 137746 -114042 38471 130212 153348 -110802 104741 -139930 206018
12472 238218 -44071 -301663 138644 -57563 58373 -290015 23674 -288102 -67132 -272849
12462 -272849 280079 -140351 -289819 -79976 203932 393422 -136230 333895 -16248 420165
12451 -133576 -138071 169385 -39909 -215944 216303 23246 -25737 99303 200673 25549 -109040
$$ packed form
12530a88665f9983J5264A07703c7825l20056a09698j58867b2710k04970G8409
12519D3060a39611B58990N2229A29901a40275N7343I9292a02548n6449b8434i172
12507a22641k21839C53747E8447M939g1756A4025f7177l4708D6414j5046J15915
12496A47283P9785a77343b5710k11697b0494b169A08015K70522G8303J67257g6575
12484b5577k10953D4585R3161a14042C8471R1741K3136a10802A04741a39930B06018
12472B38218d4071k57592A38644e7563E8373b90015B3674b88102f7132k05717
12462b72849B80079a40351j49468g9976B03932J89490a36230C33895a6248D20165
12451a33576m495A69385c9909j76035B16303B3246b5737I9303J01370B5549a09040
$$ plain form
12439 254375 -192896 5583 339294 -51752 -32049 104829 172137 89868 20989 163016 235624
12428 235624 -119581 -223274 115923 -229040 111155 372912 -126513 -109506 -159925 16115
12417 -175789 138572 7715 -122583 91869 18364 50259 -59560 -16062 38411 -177644 70910
12405 -192387 39760 19001 -209203 -386086 -372009 -55393 -191248 136396 -195206 -111319
12395 -111319 4245 -241859 180605 65287 -19160 104578 189789 -229930 137135 -288626
12384 177418 33572 -37525 -67831 -72946 -12169 -261639 191077 -164807 -21499 -127143 -165137
12373 -165137 -164269 -142641 46515 65737 232285 -73413 -382424 345726 -132043 -247723 -13456
12361 -168408 -86023 250200 -273334 -31577 136159 -153031 -58349 -193097 -77735 9630 80822
$$ packed form
12439B54375a92896E583L33711e1752J9703A04829O7308q2269B0989J42027P2608
12428B35624a19581j03693A15923b29040A11155K61757a26513J7007n0419A6115
12417a75789A38572G715a22583I1869A8364L1895e9560a6062C8411a77644G0910
12405a92387C9760A9001b09203j76883J4077e5393j35855A36396a95206Q3887
12395a11319D245b41859A80605F5287a9160A04578Q5211b29930A37135b88626
12384A77418C3572c7525l0306n115a2169k49470A91077a64807b1499j05644l7994
12373a65137Q68K1628D6515J9222J66548g3413l09011C45726a32043j15680a3456
12361a68408Q2385B50200b73334c1577A36159a53031e8349j34748g7735I630P1192
$$ plain form
12350 80822 -80347 -14297 -154092 -77396 53271 -28547 224053 -168678 -116324 -107056 -99837
12339 -99837 132592 -286369 190589 -8547 -136974 -28416 81030 -141801 -9174 37597 45293
12328 45293 66898 -101184 -44076 -226801 232898 -414177 458458 -47972 37803 26006 -275758
12316 -165531 154894 171426 -47478 -141174 41212 -65400 -147033 -112369 -62476 -107747 -97825
12305 -97825 -78521 103389 206315 20321 -204580 58920 30789 10010 125030 344715 -262205
12293 -122324 -108996 265270 -361317 128306 -29743 249 -220079 78728 -159268 289463 -42311
12281 212391 362940 208321 177103 -305995 -36110 194244 95511 306043 60478 -45059
12270 124751 -7579 175029 303359 27228 249614 149362 68997 106094 359810 253786
$$ packed form
12350H0822h0347a4297j39795P6696E3271b8547B24053a68678N2354R268P219
12339i9837A32592b86369A90589h547j28427b8416H1030a41801i174C7597P696
12328D5293K1605a01184d4076j82725B32898d14177D58458d7972C7803j1797b75758
12316a65531A54894J6532d7478r3696D1212f5400q1633L4664M9893m5271R922
12305i7825J9304A03389J02926B0321b04580E8920k8131A0010J15020K19685b62205
12293a22324J3328B65270c61317A28306b9743B49b20079G8728a59268B89463d2311
12281B12391J50549j54619l1218c05995c6110A94244I5511K10532F0478d5059
12270A24751g579A75029J28330B7228K22386j00252F8997L7097K53716j06024
$$ plain form
12260 253786 -1566 -155987 147856 -46265 -9152 -163601 194534 350931 128980 -60205 -95306
12249 -95306 -136965 12999 -47432 145930 416691 -51643 -36971 -250465 284739 79479 65787
12238 65787 54222 12790 141926 173643 142025 173098 75277 296807 67129 491583 186372
12226 62934 -39329 71468 -190427 -82566 -196960 205300 101021 225133 -20355 58225 319107
12215 319107 -36292 245419 549578 301754 -254307 416889 221099 170035 126925 -159099
12204 116792 82129 214143 202624 -7967 -92454 -91103 357744 200861 -39301 -131602 173780
12192 51434 165079 11586 -74408 295466 174861 170101 -9629 -1438 241055 58063 11466
12180 74405 324168 222243 183773 -200690 -161620 -12316 201328 -358941 106305 511669
$$ packed form
12260B53786a566j54421A47856d6265i152j54449A94534J56397A28980f0205l5101
12249i5306m1659A2999d7432A45930K70761e1643J4672k13494B84739G9479j3692
12238F5787j1565A2790J29136L1717l1618L1073G5277K21530F7129M24454A86372
12226F2934c9329G1468a90427h2566j14394B05300A01021J24112b0355E8225K60882
12215C19107c6292B45419L04159k47824b54307D16889j95790n1064m3110a59099
12204A16792l4663J32014j1519g967q4487J351C57744j56883c9301r2301A73780
12192E1434J13645A1586g4408B95466j20605m760i629a438B41055E8063A1466
12180G4405K49763j01925l8470b00690L9070a2316B01328c58941A06305M05364
$$ plain form
12170 511669 -143767 -201412 18142 103194 29070 181609 161282 8831 -21318 111837 3188
12158 145672 81966 357465 30433 41227 -54202 -144822 157312 -72326 82767 -249334 -61372
12146 -124831 104023 141743 36862 268883 -309883 83098 192519 255422 319622 -190211
12135 -169332 169876 -53938 -305418 306981 -138833 -88183 180729 311258 163544 -156723
12124 -27109 -211621 -49002 93202 -73398 -139004 -121170 -65956 -124672 79781 48635 -78754
12112 -51686 16248 -273898 274018 -30069 -213544 76368 117853 -240479 299594 70663 -260858
12100 130540 267875 -134371 107862 167978 -341592 99098 -156843 10516 128294 -199347
12089 -5393 150810 -54863 214506 -152155 179956 -16877 144150 -16082 352611 202139
$$ packed form
12170E11669a43767n7645A8142Q5052B9070J52539k0327H831b1318A11837C188
12158A45672o3706K75499C0433J0794e4202r0620A57312g2326H2767b49334f1372
12146a24831A04023L7720C6862K32021c09883H3098J09421O2903O4200a90211
12135a69332A69876e3938k51480C06981a38833N0650A80729J30529j47714a56723
12124b7109j84512d9002I3202g3398o5606J7834N5214n8716G9781l1146g8754
12112e1686A6248b73898B74018c0069j83475G6368M1485b40479B99594G0663b60858
12100A30540J37335a34371A07862O0116c41592I9098a56843A0516J17778a99347
12089e393A50810e4863B14506a52155A79956a6877A44150a6082C52611j50472
$$ plain form
12079 202139 -197279 86013 166028 -105079 -161201 -113872 12445 405743 142804 12012 -124860
12067 21694 37618 -217630 215201 96539 55388 184590 219416 -219137 179066 -97317 347563
12055 622148 1289132 516150 440833 207185 -114421 275735 139974 -283879 32633 -219189
12044 42691 119312 10045 -19074 -13702 137543 128367 -118989 307394 145764 108583 3069
12032 -187861 -47209 -440263 -83435 4782 -453322 -8961 222701 -191440 39603 256148 -8276
12020 91998 -100126 76747 -99000 -30105 -108515 66252 -295850 -42901 -154800 -224778 -80724
12008 28671 46348 -32165 -348552 -168666 -277716 101221 246915 174711 -31302 219421
11997 98900 60648 -77493 -147480 301199 223164 -139883 -112686 -223456 136899 -139839 -48835
$$ packed form
12079B02139a97279H6013Q0015a05079n6122M7329A2445L93298A42804A2012a24860
12067B1694J5924b17630B15201I6539m1151J29202L4826b19137A79066i7317C47563
12055F22148O66984E16150p5317B07185a14421B75735j35761b83879C2633b19189
12044D2691P6621A0045a9074N372A37543r176a18989C07394A45764l7181C069
12032a87861d7209l93054h3435D782d53322h961B22701a91440C9603K16545h276
12020I1998a00126G6747i9000c0105p8410F6252b95850d2901j11899o9978h0724
12008B8671J7677c2165l16387a68666j09050A01221J45694p2204c1302B19421
11997I8900l8252g7493o9987C01199p8035a39883K7197j10770A36899a39839d8835
$$ plain form
11985 27343 -318979 89219 -45116 -75539 358594 -245385 -376848 -40559 96021 261846 -177356
11973 -184218 -189920 23306 -6068 173100 -57671 -52943 112050 -159025 46739 -265377 -54140
11961 -298741 -196233 154675 -57052 -152768 124297 -207023 230774 -140605 182356 -153468
11950 19686 232247 44037 -103013 -7266 -110640 110055 -216073 11170 -205358 42141 59970
11939 59970 29223 -74449 19465 -16242 168494 -232786 -400900 -52555 125455 199615 13320
11927 -184987 -94646 -142022 42307 150974 429263 -243515 -97792 90686 26701 184846 -47445
11915 -49808 -96423 -288940 74304 120864 -210622 4435 265056 219981 278008 -175587 120348
11903 177884 166724 -124130 -282132 181287 -253403 -146049 -32870 269637 -109112 120319
$$ packed form
11985B7343c18979H9219d5116l0423C58594b45385j31463d0559I6021J65825a77356
11973a84218n702B3306f068A73100e7671M728A12050a59025D6739b65377e4140
11961b98741J02508A54675e7052r5716A24297b07023B30774a40605A82356a53468
11950A9686K12561D4037a03013g266j03374A10055b16073A1170b05358D2141J7829
11939E9970B9223g4449A9465a6242A68494b32786j68114e2555A25455P4160A3320
11927a84987R0341m7376D2307J08667K78289b43515i7792I0686B6701J58145d7445
11915d9808m6615j92517G4304M6560b10622D435K60621m5075N8027a75587A20348
11903A77884j1160a24130j58002A81287b53403J07354c2870B69637a09112A20319
$$ plain form
11892 -333924 -110163 -151966 -171212 -248018 -48532 131258 120181 76671 135727 76491 -171264
11880 -87817 162716 -293390 -186430 58318 34781 2227 28607 49092 -182340 87208 5337
11868 185813 -95842 -230467 108997 -39282 -48781 -57782 1334 -154483 -110780 -74639 -348710
11857 -348710 71420 -298427 -163493 -216843 -52770 9690 107307 -41715 -337715 164070 353603
11846 353603 -836 -78165 -120452 197192 -50328 -89433 -72548 227958 -119481 -93036 142306
11834 165268 -118927 93684 1865 303550 57620 43400 -100213 188727 -74911 13251 112744
11823 112744 -134225 -144137 246400 -65465 29059 47662 -185615 -35922 -89697 -65754 82511
11811 -309488 -405721 155326 202910 -153853 39607 -43008 68857 382966 198070 -339387
$$ packed form
11892c33924a10163m1803j9246p6806d8532A31258j1077m3510N9056n9236a71264
11880h7817A62716b93390J06960E8318k3537B227K6380K0485a82340H7208E337
11868A85813i5842j34625A08997c9282r499r001A334a54483M3703L6141k74071
11857c48710G1420b98427J34934n3350e2770I690R7617d1715k96000A64070J89533
11846C53603h36p7329m2287A97192e0328l9105J6885B27958a19481K6445A42306
11834A65268a18927I3684A865L01685E7620j4220a00213A88727g4911A3251R9493
11823A12744a34225r912B46400f5465B9059J8603a85615c5922n3775K3943H2511
11811c09488r6233A55326M7584a53853C9607d3008F8857L14109j84896c39387
$$ plain form
11800 -102924 -233476 -80480 37840 66201 -187466 -49242 -121420 -111538 -254732 -11875 -323967
11789 -323967 47408 -192452 -237064 -466620 100002 -254603 -198755 -99970 46604 112033 40540
11777 117286 -357724 347509 176540 100195 -402038 237397 -282165 411891 -161577 -11619
11766 -67330 -94674 -82012 12372 105647 305137 198505 41892 108419 -120419 19387 208663
11755 208663 140505 12765 53060 36374 111294 -236951 -139702 -121910 97150 14474 -35018
11743 -224338 96797 89284 -329315 -184155 -36926 -283461 -189116 88530 165240 -158701 49871
11731 -51165 195037 16777 -210602 -362670 -149174 -399446 -107375 -232948 -159577 -59813
11720 127973 71168 36785 192050 -383623 2004 -79870 143803 -34135 -26712 -21766 68856
$$ packed form
11800a02924j30552h0480C7840K8361a87466d9242p2178R882j43194a1875l12092
11789c23967D7408a92452m4612k29556A00002b54603N5848R8785D6604O5429D0540
11777A17286c57724C47509j70969p6345d02038B37397b82165D11891a61577a1619
11766f7330k7344J2662A2372R3275J99490j06632D1892O6527a20419A9387J89276
11755B08663o8158A2765M0295j6686P4920b36951R7249J7792I7150A4474c5018
11743b24338I6797p513c29315J45160c6926k46535R4345H8530P6710a58701D9871
11731e1165A95037A6777b10602j52068a49174k50272a07375j25573P3371e9813
11720A27973n6805l4383J55265c83623B004g9870A43803c4135P423M946F8856
$$ plain form
11708 237954 156572 145434 -112847 -17461 -321988 90384 -174194 301630 -219583 33743
11697 393327 -223474 -34407 247029 108629 68031 92625 -5296 79543 207264 86668 20093
11685 277476 -184527 -37640 -84154 -210499 -120494 96178 -113707 84905 -5328 236609 21559
11673 -177302 -212357 -98320 -81558 114694 80965 95284 195949 206720 -104205 -148554 186209
11661 105316 152556 -47125 127335 -236421 215423 255788 650236 -266548 -118844 -366960
11651 -366960 -84290 105870 73281 14657 -174083 -76347 99476 186867 -85644 240898 486623
11640 486623 146401 -82264 117911 232846 446372 -423745 23188 60911 154146 101985
11630 101985 -94923 73532 -103450 -133046 69574 78605 -93571 195457 -375012 -115441 -74227
$$ packed form
11708B37954q1382j1138a12847a7461l04527I0384a74194C01630b19583C3743
11697C93327b23474c4407B47029A08629m0598K4594e296G9543J27721H6668B0093
11685B77476a84527c7640m6514j26345R0005I6178a13707H4905e328B36609B1559
11673a77302l5055i8320J6762A14694l3729J4319J00665J0771a04205m4349A86209
11661A05316M7240d7125A27335b36421B15423M0365L94448b66548a18844k48116
11651c66960h4290A05870l2589A4657a74083g6347I9476Q7391h5644B40898K45725
11640D86623A46401h2264A17911J14935K13526d23745B3188L7723R3235n2161
11630A01985i4923G3532a03450k9596F9574R031i3571A95457c75012a15441M1214
$$ plain form
11619 -74227 24850 74149 93766 58352 247794 123298 178655 19269 50324 227839 53685
11607 340304 -149994 -85162 -95074 104578 11763 104393 -97770 -12953 -97029 156619 -46988
11595 -37433 -133529 85418 210455 54770 -188180 -143221 -5936 -105874 140406 -179736 13862
11583 -134407 -9409 159528 52522 -324102 153812 36738 137536 223228 -223940 192503
11572 -152583 -55551 209167 -41000 43904 276709 -119612 144643 85620 250385 121597
11561 -47134 -29255 62104 -75529 -269437 -164874 -216495 -158744 8320 -53819 -19147 351049
11549 127591 135935 -50186 132429 300956 -237126 -133328 -91984 126171 -3192 -247809 264282
11537 -123759 257860 218165 307505 144888 87539 312962 137354 -4184 355439 16720 -45096
$$ packed form
11619g4227B4850M9299J9617l5414J89442A23298N5357A9269L1055J77515E3685
11607C40304a49994O4832r912A04578A1763R2630i7770a2953q4076A56619d6988
11595c7433r6096H5418J25037E4770a88180M4959e936r9938A40406a79736A3862
11583a34407i409A59528E2522c24102A53812C6738J00798Q5692b23940A92503
11572a52583e5551B09167d1000D3904K32805a19612A44643n9023J64765A21597
11561d7134J7879F2104g5529j93908J04563n1621N7751H320e3819a9147C51049
11549A27591Q344e0186A32429J68527b37126J03798M1344A26171c192k44617B64282
11537a23759B57860l9695Q9340A44888n7349K25423A37354d184C55439A6720d5096
$$ plain form
11525 291962 47605 -179634 -351553 118240 -24732 51672 -1617 147589 -69468 -152732 274593
11513 183981 23374 99216 206856 -242212 185980 -137673 79934 164007 113725 266308
11503 266308 46253 134358 -144860 290163 103104 -56229 -85338 74839 -64980 90698 -22227
11491 372941 41652 112019 201779 73772 -20506 -174806 222315 238591 -93696 92645 -89707
11479 71272 472105 359544 222525 -28465 231065 -111246 -231816 332965 262038 296822
11469 296822 250354 -174152 200140 461985 -81547 59499 326870 238434 -45675 336858
11458 7296 -459569 -159997 95915 49663 102527 138715 -36758 191749 149978 352105 366475
11447 366475 132689 -280152 137183 -184021 -241634 -7512 274773 131514 -28926 -148994
$$ packed form
11525B91962D7605a79634j71919A18240b4732E1672a617A47589f9468q3264B74593
11513A83981B3374P5842J07640b42212A85980a37673G9934Q4073n0282J52583
11503B66308D6253Q8105a44860B90163A03104e6229k9109G4839f4980I0698b2227
11491C72941D1652P0367Q9760G3772b0506j54300B22315J6276i3696I2645h9707
11479G1272M00833j12561j37019b8465B31065a11246j20570C32965p0927L4784
11469B96822m6468a74152B00140K61845h1547E9499K67371q8436d5675C36858
11458G296d59569a59997I5915m6252N2864L6188c6758A91749m1771K02127J4370
11447C66475A32689b80152A37183a84021n7613g512B74773A31514b8926j20068
$$ plain form
11437 -148994 108317 203567 -35660 157849 116314 -211526 -259716 30202 -341229 -464258
11427 -464258 121687 -50744 237725 12235 3185 12896 310380 -36001 -161173 -50157 179007
11415 87211 167079 -55882 123677 11842 193425 92193 117569 146813 -37634 -326058 -249595
11404 -249595 114023 -105637 -168460 -29239 136594 176879 -168277 -40528 12997 89393 -148218
11392 -132342 -25216 337650 -85972 -64471 74013 -8279 -22794 214908 -277005 115982 -245244
11380 8150 221093 99362 18093 87208 -64741 -122692 202684 37560 449796 -241969 -119558
11368 -262626 -126527 -73686 365789 302606 -172858 160574 190870 126903 41543 -166412
11357 -109700 196654 272651 67531 323053 -48224 -28411 -371878 -59067 230872 -112266
$$ packed form
11437a48994A08317R5250c5660A57849m1535b11526m8190C0202c41229j23029
11427d64258A21687e0744B37725A2235C185R711K97484c6001j25172e0157A79007
11415H7211P9868e5882A23677A1842J81583I2193K5376K9244c7634k88424P6463
11404b49595A14023a05637o2823b9239A36594M0285a68277d0528A2997P6396a48218
11392a32342b5216C37650h5972K1501G4013h279j4515B14908b77005A15982b45244
11380H150K12943I9362A8093O9115f4741n7951B02684C7560M12236b41969a19558
11368b62626a26527N2841C65789o3183a72858A60574L0296o3967D1543a66412
11357a09700A96654P5997F7531K55522d8224J9813l43467e9067B30872a12266
$$ plain form
11346 -91359 -5192 -127881 367340 -120357 -242308 -101004 -277691 113602 -58224 199927
11335 108126 284922 190754 -90859 -112220 73195 -317896 -232906 -151034 154533 79986 -196046
11323 -31637 -207668 151534 -134059 194681 -201865 -41150 200356 -227627 123609 49159
11312 195999 -86937 -240343 -23236 208682 167083 183687 -211091 -58044 161940 -192015
11301 -121040 -61176 -272000 -32467 -84804 -92462 30777 -115711 -105155 -194390 -85755 74253
11289 -291700 -544296 31545 -122773 -112723 83198 -303811 182753 86035 216556 104303
11278 161294 -23158 145775 -110658 -36011 -202286 164635 -128073 -56859 199155 207511
11268 207511 52269 117735 -350142 182123 -89748 2594 132932 -138813 -88112 -52454 254800
$$ packed form
11346i1359e192j22689C67340a20357j21951a01004j76687A13602e8224A99927
11335A08126J76796r4168i0859k1361G3195c17896Q4990Q1872A54533p4547a96046
11323c1637j76031A51534a34059A94681b01865d1150B00356b27627A23609D9159
11312A95999h6937j53406b3236B08682m1599J6604b11091e8044A61940a92015
11301a21040N9864k10824c2467n2337p658C0777a15711J0556q9235h5755G4253
11289b91700k52596C1545a22773J0050H3198c03811A82753H6035J30521A04303
11278A61294b3158A45775a10658c6011j66275A64635a28073e6859A99155Q356
11268B07511E2269O5466c50142A82123h9748B594J30338a38813N0701L5658B54800
$$ plain form
11256 -36837 -122339 95506 -46353 9688 109 -191005 -231331 -208468 -67317 128281 -6492 36830
11243 79157 -269833 -242181 -74025 -52967 30068 168389 -3460 -83497 -67837 -149191 198056
11231 -173037 323589 -304726 -94670 -6137 87128 -264730 93965 -33414 -218388 -3137 -16811
11220 -16811 -172741 -416474 -318238 -18480 37575 -496582 30736 216451 113899 -132139
11209 23702 24995 -97829 165254 137214 -211288 -64987 -97252 -225738 -94156 49623 140061
11198 140061 114197 109884 124520 -147910 179610 138395 127331 -197844 -23179 111712 291359
11187 291359 -94127 -194088 14104 -175620 -269275 182418 -116783 291689 13729 251553
11177 251553 89493 -147988 245810 -120534 -428132 -227275 -131727 -101256 -191411 -281422
$$ packed form
11256c6837q5502I5506d6353I688A09a91005m0326K2863f7317A28281f492C6830
11243G9157b69833K7652g4025K1058C0068J38321c460q0037J5660q1354A98056
11231a73037C23589c04726i4670f137H7128b64730I3965c3414j84974c137j3674
11220a6811j55930k43733R8236a8480C7575d96582C0736J85715j02552a32139
11209B3702J293i7829A65254k8040b11288f4987l2265j28486i4156D9623R0438
11198A40061k5864m313J4636a47910A79610m1215j1064a97844b3179A11712J79647
11187B91359i4127r9961A4104a75620r3655A82418a16783B91689A3729K37824
11177B51553H9493a47988B45810a20534l07598K00857R5548L0471r0155r0011
$$ plain form
11167 -281422 -26542 -175305 130550 262147 32833 -81563 90147 192933 -43938 -96053 -137167
11156 -137167 71756 -89950 -113705 -102527 -79366 46749 133639 -24693 69731 -91482 -222704
11145 -222704 70814 -142507 -96809 -230297 -216997 -373659 144800 -123436 -192273 194977
11134 -104245 80253 -224345 -76464 -145800 -118889 316172 -80879 -292877 -228564 16008 188219
11123 188219 -510726 -377211 9522 200156 272524 123479 -74619 -118056 -112402 162008 -66249
11111 36612 -199748 241597 70249 102296 39795 72599 287139 191778 149006 86906 -38902
11099 41377 232966 62594 -249165 18227 -4656 207026 324530 309574 297016 240388 238776
11088 238776 119322 -126734 162516 138507 198578 58831 642012 246445 229414 237395 -127600
$$ packed form
11167b81422b6542j48763A30550J31597C2833h1563I0147J02786d3938n2115m1114
11156a37167G1756h9950k3755J1178K3161D6749Q6890b4693F9731i1482j31222
11145b22704G0814a42507M5698j33488J3300j56662A44800a23436o8837A94977
11134a04245H0253b24345g6464o9336K6911C16172h0879k11998O4313A6008J72211
11123A88219e10726J33515I522J90634P2368A23479g4619m3437N654A62008f6249
11111C6612a99748B41597G0249L2047C9795L2804K14540r5361m2772o2100c8902
11099D1377J91589F2594b49165A8227d656B07026J17504j4956j2558n6628j612
11088B38776A19322a26734A62516k4009O0071E8831N83181B46445j7031P981a27600
$$ plain form
11076 313188 376536 165276 120038 106568 536985 103722 -28259 49221 150739 540465
11066 540465 230484 154279 286379 297837 158484 226239 393119 2176 395997 309808 146074
11054 555545 299841 179105 497724 127456 415326 710351 583197 355482 523574 555344
11044 555344 364498 392480 892174 438580 835601 413060 417819 543454 623681 469062
11034 469062 515292 453592 345945 578328 698678 463525 832539 682371 449463 768917
11024 768917 770044 417206 582706 600979 637257 447260 486722 358967 668073 576591 225100
11012 764126 577091 982992 721049 532935 807270 544378 674748 611144 690518 852491
11002 852491 540894 419259 623863 715321 524044 359543 715038 741868 660666 560223
$$ packed form
11076C13188O3348A65276m5238j3470M30417A03722b8259D9221J01518L89726
11066E40465B30484p6205J32100J1458j39353O7755J66880B176L93821q6189A46074
11054E55545k55704j20736L18619A27456K87870K95025j27154k27715J68092L1770
11044E55344j90846K7982M99694D38580L97021D13060M759J25635Q0227j54619
11034D69062M6230o1700j07647K32383J20350k35153L69014j50168k32908L19454
11024G68917J127l52838J65500J8273L6278j89997L9462j27755L09106r1482B25100
11012G64126j87035M05901k61943j88114K74335k62892J30370o3604P9374J61973
11002H52491l11597j21635K04604R1458j91277j64501L55495K6830q1202j00443
$$ plain form
10992 560223 651261 727299 684322 466811 510442 634416 585099 547844 555018 601761 622996
10981 622996 699722 842834 775751 699287 545523 608966 746886 693841 878191 721138
10971 721138 479688 1012921 963631 1066744 1181369 1145263 1102584 1273643 1278596 1727076
10961 1727076 1838386 1902529 2265585 2492822 2581773 2353001 2449771 2138687 2146090 1926010
10951 1926010 1815254 1310575 1359439 1059590 1060147 1091118 1135448 1475477 1258566 1601121
10941 1601121 1267483 1124213 1014320 910268 970202 624832 307014 436925 635028 265033
10930 -96283 435929 361442 496258 -20002 257210 -34461 392314 171176 56281 34915 46999
10919 46999 44542 158692 34451 69355 -34796 135330 -57972 112300 302164 41609 46390
$$ packed form
10992E60223R1038P6038m2977k17511M3631J23974m9317l7255P174M6743K1235
10981F22996P6726J43112o7083p6464j53764O3443J37920n3045J84350j57053
10971G21138k41450N33233m9290J03113J14625l6106m2679J71059M953M48480
10961A727076J11310O4143L63056K27237Q8951k28772R6770l11084P403k20080
10951A926010j10756n04679M8864k99849N57L0971M4330L40029k16911L42555
10941A601121l33638j43270j09893j04052N9934l45370C07014J29911J98103B65033
10930i6283D35929p4487J34816b0002B57210c4461C92314A71176E6281k1366J2084
10919D6999k457J14150C4451L4904c4796A35330e7972A12300J89864D1609M781
$$ plain form
10908 46390 -528431 -36822 -199048 21689 149849 -24783 -124342 -106608 -199388 82700 -210574
10896 -82695 -510 111706 -115450 114070 -228117 -201826 -117374 20459 44149 -52600 -107336
10885 -107336 -93803 96493 87751 -119486 -116850 46796 -52462 34266 215626 303606 179372
10874 179372 -105495 -32744 180583 -155841 280617 -212415 -326870 102760 -37217 -121889
10864 -121889 149184 -24668 -10083 29179 84988 7790 -209447 400576 141501 137644 -312602
10852 -194647 -34454 46384 87599 -136709 144548 97560 -149139 -61513 -321253 309018
10841 -195108 72897 72328 185788 -38149 -59053 25581 229017 17561 -224273 -58508 105448
10829 -198008 -20142 243831 183452 -101820 20189 -144081 -75273 -81308 7704 -158088 83381
$$ packed form
10908D6390e28431c6822j62226B1689J28160b4783r9559J7734r2780H2700b10574
10896h2695e10A11706a15450A14070b28117K6291Q4452B0459K3690e2600n4736
10885a07336J3533I6493q742a19486K636D6796e2462C4266J81360Q7980j24234
10874A79372a05495c2744A80583a55841B80617b12415j14455A02760c7217q4672
10864a21889A49184b4668a0083B9179N5809G790b09447D00576A41501l857c12602
10852a94647c4454D6384M1215a36709A44548m6988a49139f1513k59740C09018
10841a95108G2897n69J13460c8149k0904B5581K03436A7561b24273e8508A05448
10829a98008b0142B43831o0379a01820B0189a44081O8808o035G704a58088H3381
$$ plain form
10817 -77582 279651 -16506 19813 -58627 141241 -299540 62158 -24764 20713 -157228 18843
10805 -247121 103489 -132324 -104290 -39363 87904 -142147 206166 -94290 -85735 -193198 -302180
10794 -302180 -10135 -36546 -189910 78438 -259902 -149365 -145265 90433 -59323 18590 124086
10783 124086 -102797 -209239 -212905 172692 29490 -148530 -152580 28515 257744 171394 -47208
10771 151135 -121215 -93011 83201 185336 40372 -251419 32594 -196658 88400 -37500 -171322
10760 -171322 -179458 217271 -2588 -2602 50239 -176076 -47855 74983 54425 -79155 143584 -17054
10747 -138936 -184420 -133442 219475 43801 -140957 -41815 130327 -62651 -382870 41067 -343881
10735 -82048 77186 -37065 164841 91999 -74721 -8346 10696 29128 240835 -47291 51527
$$ packed form
10817g7582B79651a6506A9813e8627A41241b99540F2158b4764B0713a57228A8843
10805b47121A03489a32324K8034c9363H7904a42147B06166i4290Q555j07463j08982
10794c02180a0135k6411j53364G8438b59902J10537M100I0433e9323A8590J05496
10783A24086a02797j06442l666A72692B9490a48530m050B8515K29229q6350d7208
10771A51135a21215K8204H3201J02135D0372b51419C2594a96658H8400c7500j33822
10760a71322q136B17271b588j4E0239a76076d7855G4983k0558g9155A43584a7054
10747a38936m5484N0978B19475D3801a40957d1815A30327f2651l20219D1067c43881
10735h2048G7186c7065A64841p2842g4721h346A0696J8432K11707d7291E1527
$$ plain form
10723 -129368 73868 136111 -121353 -27876 155937 -247237 -304072 -70090 206994 -151281
10712 -43406 -65245 230002 7925 -62364 -101334 -21450 -243557 -228307 9585 79000 -26611 172352
10699 137523 219050 16371 -58060 -34397 -70776 -168232 -253810 -210998 352649 -17270 -97005
10688 -97005 -86260 -29261 -8374 -78291 81603 -637852 120123 -146499 236377 20615 304825
10677 304825 -108902 145893 -39785 -32492 26277 94511 164177 41222 -114309 -149178 40954
10665 -113504 -40550 -120947 73887 -254720 -292743 85456 -92342 320578 -297720 -146889 -44526
10653 -115015 -17912 29758 -218854 -140805 85768 -203224 -413319 -191478 -315062 30158
10642 -246462 -171034 78670 17194 -272651 -387403 22169 -247281 -161465 2672 -79409 -304672
$$ packed form
10723a29368G3868O2243a21353b7876A55937b47237n6835g0090B06994a51281
10712d3406k1839B30002G925f2364l8970b1450k22107J5250I585O9415b6611A72352
10699A37523Q1527A6371e8060K3663l6379r7456q5578M2812C52649a7270p9735
10688i7005J0745b9261h374o9917H1603f37852A20123a46499B36377B0615K84210
10677C04825a08902A45893c9785P293B6277O8234O9666D1222a14309l4869D0954
10665a13504d0550q0397G3887b54720l8023H5456i2342C20578b97720a46889d4526
10653a15015a7912B9758b18854P8049H5768b03224k10095a91478j23584C0158
10642b46462P5428G8670A7194b72651j14752B2169b47281Q5816B672g9409k25263
$$ plain form
10631 -304672 -130630 -86699 206497 -201827 52772 90493 4596 -96044 -93104 -63062 146706
10619 54526 40520 45225 11799 -242486 43485 -2097 -242350 164441 -134498 235890 -65703
10607 -171025 -75548 128885 -30726 192331 -133080 -39039 63026 -328398 31293 217257
10597 217257 -54794 -518340 140649 218369 279825 -224307 -171486 -56925 -306087 -67456 -262500
10586 -262500 -190757 -358715 -217621 208601 -28711 28599 -114364 126028 -195506 -181301
10576 -181301 98081 165347 7100 206309 -129981 144441 -323703 -398659 -131105 -54605 49357
10564 41805 83096 191966 -81375 147333 221482 -60161 48501 -45075 158009 271295 -156106
10552 -341972 70055 -122531 -373843 123970 -29473 37110 221836 -29509 -144576 146587
$$ packed form
10631c04672a30630M3931B06497b01827E2772L7721D596i6044K940L0042A46706
10619E4526j4006M705A1799b42486D3485b097k40253A64441a34498B35890f5703
10607a71025g5548A28885c0726A92331a33080c9039F3026c28398C1293J85964
10597B17257e4794m63546A40649P7720O1456b24307N2821e6925k49162f7456j95044
10586b62500P1743j67958J41094B08601b8711B8599a14364A26028a95506J4205
10576a81301I8081O7266G100J99209a29981A44441c23703p4956a31105e4605D9357
10564D1805M1291J08870h1375A47333P4149f0161D8501d5075A58009J13286a56106
10552c41972G0055a22531k51312A23970b9473C7110J84726b9509j15067A46587
$$ plain form
10541 -261615 114277 245150 -140978 327113 -288766 -126682 175986 81228 -122679 -14205
10530 -138604 79353 94490 14515 72944 240467 -202596 181601 -52973 -314934 130818
10519 -2699 -89550 -286644 -95879 -308819 -230221 -34891 34772 49156 -63936 136147 -330362
10507 -238101 -129110 -9801 91011 252950 -30527 -157821 -118852 155087 -110291 -432233
10497 -432233 -49633 -11133 -47367 -46613 -165270 140660 211151 -211364 22643 30223 71362
10486 71362 101542 -146781 -357677 -243683 166424 -107805 39906 -85232 132752 -255674
10475 92096 77200 -15842 294778 -164884 8264 -66875 85429 185966 77643 379259 192432
10464 192432 927 36203 -90064 -284425 -106810 249013 -26663 -25431 -88024 -30800 74922
$$ packed form
10541b61615A14277J30873a40978C27113b88766a26682A75986H1228a22679a4205
10530a38604G9353J5137A4515N8429J67523b02596A81601e2973k61961A30818
10519b699q6851j97094i5879k12940P8598c4891C4772J4384f3936A36147c30362
10507b38101J08991i801I1011J61939c0527j27294L8969A55087a10291l21942
10497d32233d9633a1133l6234P54j18657A40660P0491b11364B2643P580M1139
10486G1362L0180a46781k10896J13994A66424a07805C9906h5232A32752b55674
10475I2096j4896a5842B94778a64884H264f6875H5429J00537G7643L01616j86827
10464A92432I27L5276i0064j94361a06810B49013b6663J232o2593c0800G4922
$$ plain form
10452 52122 -39241 -76444 483499 -112379 74767 -133019 -81555 217793 191089 -109832 -71715
10441 -71715 -116150 -11787 28470 152114 -209873 -363548 198327 475667 -78467 -38936 -157435
10430 -157435 5060 -148100 219815 260000 -153582 -207432 -74542 189806 380844 173272
10419 -117028 -33427 -84362 -93257 -130666 116491 284704 -230441 -202907 -4432 305540 -50818
10407 -223059 -124647 -193782 -131099 85092 -338648 -111290 182632 -68005 243793 220881 24093
10395 171753 -246692 -77098 107722 188213 167631 137908 -7781 -110540 -51299 -354160 181997
10383 -26014 -3066 66100 -47152 -176572 -46962 -237066 319685 172384 113103 88612 -26495
10371 126739 16228 -285800 269912 111094 155154 -226253 258749 124273 149796 -115314
$$ packed form
10452E2122c9241l7203D83499a12379G4767a33019N1464B17793k6704a09832L8117
10441g1715m4435a1787B8470J23644b09873j53675A98327K77340g8467c8936j18499
10430a57435E060a48100B19815M0185a53582n3850g4542A89806J91038A73272
10419a17028c3427n0935q895l7409A16491J68213b30441K7534d432C05540e0818
10407b23059R8412o9135O2683H5092c38648a11290A82632f8005B43793k2912B4093
10395A71753b46692g7098A07722Q0491k0582k9723g781j02759e1299l02861A81997
10383b6014c066F6100d7152j29420d6962j90104C19685j47301n9281k4491b6495
10371A26739A6228b85800B69912A11094M4060b26253B58749A24273K5523a15314
$$ plain form
10360 238698 138591 450124 108451 186867 251274 228599 78884 485070 597840 562827
10350 562827 239833 285585 386850 139265 281957 173778 279013 -4865 195342 371565
10340 371565 288400 192823 138874 94411 460128 428850 633966 277489 145276 178220 208985
10329 208985 -62252 214878 250257 113600 400008 -61465 -34076 160806 517063 170679
10318 496073 -98672 212374 -128539 12204 138418 -89793 -2189 473853 2722 1783 382355
10307 382355 -7694 178058 -64786 -236646 48756 342115 506667 345299 -47554 -11402 260092
10295 190029 89038 -16614 -136569 -7328 -258366 -238443 -8393 -127801 32332 79707 -45806
10283 -43020 -322052 99359 -207975 -29886 245742 -203673 267981 -64564 -83234 34936 86968
$$ packed form
10360B38698j00107L11533A08451P8416O4407k2675G8884M06186J12770l5013
10350E62827B39833M5752J01265A39265J42692j08179J05235d865A95342J76223
10340C71565q3165r5577n3949m4463L65717l1278K05116B77489j32213L2944L0765
10329B08985f2252B14878L5379A13600K86408f1465K7389A60806L56257A70679
10318D96073i8672B12374a28539A2204J26214h9793b189D73853B722r39L80572
10307C82355g694A78058f4786j71860D8756K93359J64552j61368d7554a1402B60092
10295A90029H9038a6614j19955g328k51038J9923h393j19408C2332M7375d5806
10283d3020k79032I9359b07975b9886B45742b03673B67981f4564j8670C4936N2032
$$ plain form
10272 86968 -26298 -190754 -217067 -436427 48085 -239806 -107160 -31746 176849 -48702 -241799
10261 -241799 -75843 30826 340394 164464 -134440 22365 32352 115525 -189197 -54729 29982
10249 45905 -234035 -75746 297651 161759 10615 79468 143408 278222 158650 297922
10239 297922 -85352 260388 14508 -144193 -343663 -218047 23566 82352 97483 130989 -11559
10227 -26531 -6288 142840 133 49720 142519 -122023 -47319 133015 63893 78970 -59834 296652
10214 151919 -64179 58345 -43483 193891 -29218 -377930 -84029 -34436 154902 -136952 -109263
10203 -109263 -177779 -204655 -124087 20629 151930 166655 -221796 -322668 -29563 284954 213293
10192 213293 -23616 -68661 333727 -116066 -99165 -72615 -168765 -64602 -55500 -151872 -39552
$$ packed form
10272H6968b6298j64456k6313k19360D8085b39806a07160c1746A76849d8702j93097
10261b41799g5843C0826L09568A64464a34440B2365R987Q3173a89197e4729B9982
10249D5905b34035g5746B97651j35892A0615O8853O3940J34814j19572J39272
10239B97922h5352B60388A4508a44193j99470J25616B3566N8786J5131L3506a1559
10227b6531f288A42840A33M9587R2799a22023d7319A33015F3893J5077e9834B96652
10214A51919f4179E8345d3483A93891b9218l48712h4029c4436A54902a36952K7689
10203a09263o8516k6876Q0568B0629J31301J4725b21796j00872b9563B84954p1661
10192B13293b3616m5045C33727a16066J6901K6550r6150f4602R102r6372c9552
$$ plain form
10180 -154818 -10185 147322 174125 -411370 -325035 -329878 -134202 -240175 -174511 72487 -118049
10168 -38311 -1084 -335728 24608 -67884 -84344 19106 -382041 -98498 74490 -2704 -172321
10157 -172321 -239434 -235874 -9381 -81517 -398824 -161596 -219854 201743 -111500 -316382 -20298
10145 46664 -187789 -101592 -10745 -117471 -350441 -210394 -142440 93856 -133673 -150089 -19775
10133 -84556 64032 -81766 -172421 -51351 -188244 -200023 -222617 -226879 195913 -188284 -42121
10121 -287447 94219 58514 -93257 92049 -19897 -83000 -36856 200322 -110989 -21902 -195350
10110 -195350 296076 -34189 8793 103162 149683 -30978 -68485 -80892 67284 -376 -385534 -242566
10098 -242566 -201345 175463 -85074 193165 32855 -124743 337889 33195 -36783 126858
$$ packed form
10180a54818a0185A47322K6803d11370Q6335m843a34202j05973O5664G2487a18049
10168c8311a084l34644B4608f7884j6460A9106c82041i8498G4490b704j69617
10157a72321o7113L560i381p2136l17307a61596n8258B01743a11500k04882b0298
10145D6664a87789Q6197a0745j06726k32970J40047O7954I3856a33673j6416a9775
10133h4556F4032h1766r0655e1351j36893j1779k2594m262A95913a88284d2121
10121b87447I4219l5705i3257I2049a9897o3103c6856B00322a10989b1902j73448
10110a95350B96076c4189H793R4369M6521c0978l7507j2407F7284c76l85158J42968
10098b42566M1221A75463h5074A93165C2855a24743C37889C3195c6783A26858
$$ plain form
10087 -83346 -154862 -111708 -87355 -127694 -421632 -69780 4733 -136529 3729 -100978 -251933
10076 -251933 20007 -167132 -311708 149202 132866 -185629 -55369 154104 35376 32438 -239774
10064 101528 -179245 -245069 -49296 -257735 56169 -134169 45686 59738 93726 -265697 29008
10052 -90096 165736 73883 -262812 -295047 139493 78092 -64573 -61697 43412 -9814 -105978
10041 -105978 -136623 51850 208589 -50779 -309751 152022 21004 214953 51085 -333576
10030 -311323 37756 -129364 -107737 -177606 134755 -254767 86337 -189260 -474910 338381
10019 -63814 68790 -446673 345649 -431370 83821 -146888 -192508 124548 -82972 -121459 14077
10007 88911 140365 -224383 47806 -128321 -234054 -240174 -20216 33948 -468450 180899 28957
$$ packed form
10087h3346p1516M3154K4353m0339k93938f9780D733a36529C729a00978j50955
10076b51933B0007a67132j44576A49202j6336a85629e5369A54104C5376k938b39774
10064A01528a79245o5824d9296k08439E6169a34169D5686J4052L3988b65697B9008
10052i0096A65736G3883b62812l2235A39493o1401f4573K876D3412i814r6164
10041a05978l0645E1850J56739e0779k58972A52022B1004J93949E1085c33576
10030c11323C7756a29364K1627o9869A34755b54767H6337a89260k85650C38381
10019f3814F8790d46673C45649d31370H3821a46888m5620A24548h2972l8487A4077
10007H8911N1454b24383D7806a28321j05733o120b0216C3948d68450A80899B8957
$$ plain form
9995 -167185 -360095 -60877 133411 60563 63350 -10261 -13219 153566 26870 -390467 -308664
9984 -308664 -264140 -189189 -115712 -36055 13421 387638 226164 -92709 237921 180647 214211
9973 214211 204668 26053 -64195 -113684 -147328 50998 -20102 352889 10192 -11765 258369
9961 296795 -259114 -272395 -85781 110510 228799 17040 -18066 -180339 -89476 -176120 89831
9949 -8970 -365507 14971 76523 158317 -152480 43947 -186587 -161100 -78511 168625 -80502
9937 36836 -107888 -198519 40375 -34562 -116408 -282609 -117822 -233907 -29202 -41425 -14050
9925 107685 9917 112803 -387330 -13930 -327656 -452933 -73464 -439992 225999 -173651
9914 -159016 -35566 -75475 -222983 -337034 -101513 -95483 279887 113047 -28448 19589 -139730
$$ packed form
9995a67185j92910f0877A33411F0563K787a0261k958A53566B6870c90467Q1803
9984c08664M4524P4951P3477c6055A3421L74217j61474i2709B37921n7274L3564
9973B14211r543B6053f4195m9489l3644E0998b0102C52889A0192a1765B58369
9961B96795b59114j3281h5781A10510J18289A7040a8066j62273h9476q6644H9831
9949h970l56537A4971O1552Q1794a52480D3947a86587K5487g8511A68625h0502
9937C6836a07888r0631D0375c4562q1846j66201a17822j16085b9202j2223a4050
9925A07685I917J02886c87330a3930l13726j25277g3464l66528B25999a73651
9914a59016c5566l9909j47508j14051a01513O030B79887A13047b8448A9589a39730
$$ plain form
9902 57103 145048 37759 -403496 56771 151562 -179397 -188334 -200894 91986 -266537 -121946
9890 42639 -22097 -258679 65106 -33106 140958 79591 -35888 -221989 198971 -125758 75570
9878 -52492 -190891 73236 37926 -143983 -131025 -14902 -34693 -185857 -32886 -243133 -644757
9867 -644757 75104 -315802 -551989 -412973 191796 -269215 -133228 171504 -13277 144323
9856 -85807 -180716 52832 -204661 94951 -59794 -179304 -248621 -75370 -203297 -172994 -441064
9845 -441064 -157407 153431 -224626 -211985 -332371 -135818 -366286 2451 57988 49151 184041
9834 184041 -38981 90720 87119 305725 64266 34800 109867 -44632 147840 -116387 -314602
9823 -314602 58330 57796 -226373 19403 -47587 -236860 -214550 62383 -301050 76325 -115650
$$ packed form
9902E7103Q7945C7759d03496E6771R4791a79397q937j2560I1986b66537a21946
9890D2639b2097k36582F5106c3106A40958o1367c5888j86101A98971a25758G5570
9878e2492j38399G3236l5310a43983J2958a4902j9791j51164c2886k10247m01624
9867f44757G5104c15802k36187J39016A91796b69215a33228A71504a3277A44323
9856h5807r4909E2832b04661I4951e9794j19510o9317g5370j27927L0303k68070
9845d41064a57407A53431b24626J2641j20386a35818k30468B451N5537q837J34890
9834A84041c8981I0720l601K18606F4266k9466P5067d4632A47840a16387j98215
9823c14602E8330n34b26373A9403d7587j89273K2310F2383c01050G6325a15650
$$ plain form
9811 9099 -259854 -134325 -367269 89198 -22173 -314108 32715 143041 -249169 16248 72486
9800 72486 -56332 51967 -159504 -34055 141393 -19685 -43218 -264608 -158871 -23014 49226
9788 11163 -106561 61702 -288812 -47202 -165997 48167 18462 75989 323148 -65939 112962
9776 136448 194972 -63906 38527 -223844 -163969 33263 -235973 -189867 -78456 309894 -349271
9764 -358169 -233407 -419811 -362216 -18843 -316133 -278572 -164298 -199801 -188823 -68583 -403999
9753 -403999 -42512 -202520 34728 14125 7437 -156742 151060 -240699 -120015 -50760 51939
9741 -231133 409586 73410 -45528 91183 76509 -79501 -109661 -228216 92331 297420 147012
9729 -75825 207627 3618 -18586 -486824 -76851 167549 -72362 -257529 -331703 53078 -230760
$$ packed form
9811I099b59854J25529k32944H9198b2173k91935C2715J10326b49169A6248N6238
9800G2486e6332E1967a59504c4055A41393a9685k3533k21390J05737b3014D9226
9788A1163a06561F1702b88812d7202j18795D8167A8462N7527K47159f5939A12962
9776A36448N8524f3906C8527b23844N9875C3263b35973M6106g8456C09894c49271
9764c58169J24762j86404N7595a8843k97290L7561J14274l5503J0978f8583l35416
9753d03999d2512j60008C4728A4125o688a56742A51060b40699a20015e0760E1939
9741b31133D09586G3410d5528I1183j4674g9501l0160j18555I2331K05089A47012
9729g5825B07627C618a8586m68238g6851A67549g2362j85167p4174E3078b30760
$$ plain form
9717 66150 -148143 66170 -122933 -187188 -206743 181115 -100910 196556 253298 -233089 50433
9705 6475 -313431 -285013 32229 -252610 151253 392459 266411 -181187 112064 -108431
9694 210909 -37315 -136805 -196868 82742 323799 -375602 -115810 -144504 42413 108066 62119
9683 62119 -203963 -306843 -26060 56488 -57734 -38856 -482015 207509 -81092 255877 -298470
9671 -309284 30626 -166942 171706 47723 235085 -244695 -167281 100152 -307456 -424300
9661 -424300 59012 -107494 -98826 -94093 -145251 4366 87583 19136 184510 -122201 21714 -186914
9648 95262 132457 -4758 -13903 -296073 54078 -170347 58310 241330 -45701 12866 -187573
9636 156831 122911 -53030 406237 -10386 -64116 10803 -28079 105341 -94261 -268760 -112189
$$ packed form
9717F6150a48143F6170a22933o4255j9555A81115a00910A96556N6742b33089E0433
9705F475c13431K8418C2229b52610A51253K41206j26048a81187A12064a08431
9694B10909c7315r9490o0063H2742K41057c75602a15810k8694D2413O5653m5947
9683F2119b03963j02880b6060E6488e7734J8878m43159B07509h1092B55877b98470
9671c09284C0626a66942A71706D7723J87362b44695P7414A00152c07456j16844
9661d24300E9012a07494Q668M733n1158D366Q3217A9136J65374a22201B1714a86914
9648I5262L7195d758r145k82170E4078a70347E8310J83020d5701A2866a87573
9636A56831l3920e3030D06237a0386n3730A0803b8079A05341i4261j74499a12189
$$ plain form
9624 220164 -204408 -45912 113507 -49552 239467 -98081 -32748 -42655 -121960 160914 11532
9612 -359284 199672 -439784 -17439 -69421 -378 -21143 179174 47716 -168492 -76622 -227817
9601 -227817 -144229 -92939 -69557 70476 -87427 -210686 -39472 -72875 230688 -76942 78285
9589 150627 -45839 -197755 -50121 55900 122982 151710 -101856 -79635 -121254 -74403 -52819
9578 -52819 -67849 -143494 -143553 -136991 -129607 -136701 -322136 -246307 24102 5802 169847 -234154 104091
9564 180287 59238 256091 -53769 208979 -205979 112564 -129443 -299067 -44543 -200400
9554 -200400 -135026 19894 -50025 10573 -227151 -103901 -147567 114132 -15756 246770 -573809
9542 86493 -186143 -160132 222739 12166 -26235 -10790 -155006 -109955 258609 -249738 23853
$$ packed form
9624B20164b04408d5912A13507d9552B39467i8081c2748r907p9305A60914A1532
9612c59284A99672d39784a7439n1982c78k0765A79174D7716a68492g6622j51195
9601b27817Q3588N1290K3382G0476h7427j23259c9472l3403B30688g6942G8285
9589A50627d5839j51916e0121E5900O7082K8728a01856K2221m1619M6851K1584
9578e2819j5030p5645n9O562P384p094j85435P5829B4102E802J64045b34154A04091
9564A80287E9238J96853e3769B08979b05979A12564a29443j69624d4543j55857
9554b00400O5374A9894e0025A0573b27151a03901m3666A14132a5756B46770e73809
9542H6493a86143K6011B22739A2166b6235a0790j44216M5051B58609b49738B3853
$$ plain form
9530 141146 -109995 -17401 158032 -69153 -377225 -182335 -117829 -139645 -134113 -5323 84096
9518 -109582 63078 -117389 195076 -299939 96236 149043 -42159 -74182 -150874 2189 -244930
9506 206266 70721 -182212 -88823 -330038 449865 -159138 -100801 -98531 -293211 -69983 -148008
9495 -148008 17488 -77259 163859 109622 46900 -142606 -297683 61639 -211440 10548 -229089
9483 -208015 -435596 -288388 258237 -70829 -145577 85162 76552 -124969 121015 -134726 115582
9471 -298910 -85939 -339825 74793 -112205 138148 -86305 -284371 -59355 172340 -289985
9460 148434 -36144 -159604 -11434 -175348 -259501 -142325 -132457 -332634 26944 -210763 287290
9448 -244289 -126322 142314 -44866 15239 103950 -78491 -34643 -28305 -110542 -82643 -269561
$$ packed form
9530A41146a09995a7401A58032f9153l08072a82335O4506k1816N532e323H4096
9518a09582F3078a17389A95076b99939I6236N2807d2159l2023p6692B189b44930
9506B06266G0721a82212h8823k41215D49865a59138N8337K270j94680f9983p8025
9495a48008A7488g7259A63859n4237D6900a42606j55077F1639b11440A0548b29089
9483b08015k27581J47208B58237g0829p4748H5162q610a24969A21015a34726A15582
9471b98910h5939k53886G4793a12205A38148h6305j98066e9355A72340b89985
9460A48434c6144j23460a1434j63914q4153J17176R868k00177B6944b10763B87290
9448b44289J17967A42314d4866A5239Q8711g8491c4643O338q2237K7899j86918
$$ plain form
9437 -269561 -5838 82599 -48238 111250 3608 -50475 -186654 -109051 62451 81734 166586 5780
9424 59457 -273060 18266 -67644 -387830 -308873 13984 -21698 113947 -138989 -273158 48728
9412 -78826 46677 97243 99518 -63792 -102083 -72889 25084 152790 157453 15256 -214892 -277965
9400 -277965 68164 -327607 -491202 124917 -103855 -93210 -35445 -99593 79061 132202 -3642
9388 16823 82834 -108331 -281938 53646 51036 -372197 45870 -11078 -242332 -17618 -53190
9377 -53190 44255 -265778 -153037 68470 -196015 -87993 11221 125934 166814 -249030 230640
9365 -205330 -222635 -426020 96480 -190384 -276265 -192095 114200 -124529 38989 -298078 111050
9353 75693 -227850 45510 82779 -255636 -213254 95964 -113470 -235351 -80099 -404975 -52052
$$ packed form
9437b69561e838H2599d8238A11250C608e0475j36179P7603F2451J9283Q4852E780
9424E9457b73060A8266f7644l20186P8957A3984b1698A13947a38989j34169D8728
9412g8826D6677N0566K275f3792l8291K9194B5084J27706M663A5256b14892o3073
9400b77965F8164c27607j63595A24917a03855J0645c5445o4148G9061N3141c642
9388A6823O6011a08331j73607E3646k610c72197D5870a1078k31254a7618l5572
9377e3190D4255b65778J12741F8470a96015h7993A1221J14713M0880b49030B30640
9365b05330j7305k03385I6480a90384q5881Q4170A14200a24529C8989b98078A11050
9353G5693b27850D5510L7269b55636M2382I5964a13470j21881h0099l24876e2052
$$ plain form
9341 27339 -85123 -46180 -243354 -101902 159539 -92608 -163351 5727 66692 61651 -215026
9329 -200859 -117499 -5774 -32206 -147703 -71729 22326 208843 -94138 -89084 154770 -323571
9317 -24045 219477 -69817 28389 -171161 -111845 -36845 101222 27214 -421017 -282931 91689
9305 -101704 165643 196301 -119328 100638 -106588 -39331 48608 30283 -190281 -165781 -250032
9294 -250032 -24886 -117710 50197 76493 107439 -176920 -77259 -95145 372066 -300719 28406
9282 -23220 -167136 356289 -159313 -233788 -96511 -45319 -29860 12018 223820 -293082 -319363
9271 -319363 -235781 -33778 -115665 -110094 188460 429703 56285 -117822 -372488 -34013 -465729
9260 -465729 69931 -56681 -136513 250722 114029 -390610 -318815 110504 -240653 -160011 -65984
$$ packed form
9341B7339h5123L8943j97174a01902A59539i2608p0743E727O0965n041b15026
9329b00859Q3360e774k6432j15497g1729B2326J86517i4138N054A54770c23571
9317b4045B19477f9817B8389a71161N9316c6845A01222B7214d21017J38086I1689
9305a01704A65643L0658a19328A00638a06588c9331D8608j8325a90281K4500q4251
9294b50032b4886r2824E0197K6296L0946a76920g7259j7886C72066c00719B8406
9282b3220j43916C56289a59313p4475i6511d5319J5459A2018K11802b93082k6281
9271c19363Q3582c3778q1887N571A88460K41243E6285a17822k54666c4013m31716
9260d65729F9931e6681p9832B50722A14029c90610P1795A10504b40653Q0642f5984
$$ plain form
9248 -179914 -298344 98101 88931 60272 -29727 -57046 -153209 31966 -264583 -73587 80244
9236 116077 -272661 -260499 -20499 -73505 -156540 48476 102992 394427 -73960 78980 34696
9224 -22087 -296331 204049 -164523 -10203 -151161 -23070 -106398 -412611 143224 36739 -486996
9212 -275788 21886 -24838 -229476 80735 17067 179195 -67757 275453 -92330 55472 -22297
9200 -170661 -654342 -263640 34188 97772 94326 63726 -13876 -76787 92608 -265429 326742
9188 -265516 29592 -228546 -256777 -124557 -209058 -33469 -253121 -6659 -357071 38207 -50074
9176 -171129 -361111 -79199 178835 -125577 -324702 -312571 -76470 33779 -153634 -193811 -353858
9165 -353858 -487455 -211544 81854 -51800 -170532 363607 89237 53274 -115184 -131788 -107976
$$ packed form
9248a79914j18430I8101r170k8659b9727k7319r6163C1966b64583g3587H0244
9236A16077b72661J2162b0499n3006q3035D8476N4516K91435g3960G8980C4696
9224b2087k74244B04049a64523a0203j40958b3070q3328l06213A43224C6739d86996
9212b75788B1886b4838k04638H0735A7067J62128f7757B75453i2330E5472b2297
9200a70661m83681b63640C4188O3584l446l0600a3876o2911I2608b65429C26742
9188b65516B9592b28546k8231a24557q4501c3469k19652f659l50412C8207e0074
9176a71129j89982g9199A78835a25577j99125J2131g6470C3779a53634m0177j60047
9165c53858j33597b11544H1854e1800j18732C63607H9237l5963a15184j6604K3812
$$ plain form
9154 -107976 -197565 38730 -97287 -84285 -2870 -112634 -206835 156398 201456 346133 201351
9143 201351 -133053 24356 -146161 -7444 145791 69467 -169743 -213122 -187459 -85025 -37008
9131 -183939 -188377 -38815 31620 98606 -227817 49707 315291 -118577 -110738 -114078 321251
9119 28336 84234 128844 135556 125784 -29950 -77887 171216 204605 -181542 84785 178879 81704
9106 -70788 -240347 100709 79890 -158696 -217456 -299973 -240319 -48457 -16999 -111937 -176438
9095 -176438 -52401 -407492 64153 -124166 10401 80991 149528 -26377 -123264 -64583 49182
9083 130654 -119687 72415 -102902 70683 66910 -46071 -29724 -80199 -14481 -24031 -117697 37211
9070 17638 -306688 221288 155111 -451064 -55403 18458 34489 -55310 21240 187525 -111776
$$ packed form
9154a07976q9589C8730i7287J3002b870j09764r4201A56398M5058J44677j44782
9143B01351a33053B4356a46161g444A45791F9467a69743m3379K5663h5025c7008
9131a83939m438c8815C1620O6986b27817D9707K65584a18577P839l340C21251
9119B8336N5898M4610O712r772b9950m7937A71216L3389a81542H4785R4094H1704
9106g0788j69559A00709k0819a58696n8760q2517N9654d8457a6999r4938o4501
9095a76438e2401l55091F4153a24166A0401P0590O8537b6377r6887N8681D9182
9083A30654a19687G2415a02902G0683l773d6071J6347n0475a4481r550r3666C7211
9070A7638c06688B21288o6177d51064e5403A8458J6031e5310B1240J66285a11776
$$ plain form
9058 -82044 102782 4812 -217001 -394438 -348008 -150582 241708 -59787 174511 -39719 -3233
9046 42729 217795 -143644 -202205 -158145 135536 74115 86462 -265757 -52700 239744 -6375
9034 67296 -204057 22152 52805 -153740 -312337 -418793 -303333 12460 77539 -274298 -134886
9022 -150951 100059 24637 87125 -216377 -152292 -239876 -111252 -153203 -10726 221306 -276068
9010 -326459 -64329 304604 30500 96000 -158634 -15733 314569 -129506 127738 -63584 -41468
8999 -41468 -104883 -2613 305722 199 -45278 -72758 -192740 137636 129230 -472830 170829 50023
8986 106465 -475714 -451415 -178161 -329176 158859 -200554 -96932 -255187 -208278 343664
8975 -247027 -196055 -201235 -369874 -215802 104229 131198 -188029 -135213 142064 -119817 99765
$$ packed form
9058h2044A02782D812b17001j77437M6430a50582B41708e9787A74511c9719c233
9046D2729J75066a43644n8561M4060A35536o1421J2347b65757e2700B39744f375
9034F7296b04057B2152L0653a53740j58597j06456J15460A2460O5079b74298a34886
9022a50951A00059B4637O2488b16377O4085q7584a11252m1951a0726B21306b76068
9010c26459f4329C04604C0500O5500a58634a5733C14569a29506A27738f3584K2116
8999d1468o3415b613C05722A99d5278k7480j19982A37636q406d72830A70829E0023
8986A06465d75714K4299a78161j51015A58859b00554i6932j58255M6909C43664
8975b47027N0972n180j68639J54072A04229K6969a88029N2816A42064a19817I9765
$$ plain form
8963 305505 420239 89936 111186 -4892 64276 37775 -138842 51555 55356 208991 -71409
8951 -322925 157841 130558 -216855 -218600 -314901 -110142 -167467 -133354 -93469 -262916 229126
8939 69542 174865 20333 273299 279302 238011 1092 -28502 -349114 -92344 -41208 -89759 -176722
8927 -176722 -240574 94344 189968 196574 203341 351 82586 228459 -116777 128507 122347 548503
8915 548503 47388 341126 346398 313690 559190 818583 1054689 1893688 3814587 9300911
8905 9300911 7539793 3174295 2042502 1456773 875673 567242 457997 114261 142300
8896 142300 515739 116441 99337 143473 172698 45812 -144390 -101332 134652 174907 70744
8884 -169370 204712 -187661 -137034 -29061 -420459 152548 89481 24867 -323011 -169460
$$ packed form
8963C05505J14734H9936K1250d892F4276k6501a38842E1555L801J53635g1409
8951c22925A57841k7283b16855j745r6301a10142n7325L4113L9885j69447B29126
8939F9542J05323B0333K52966O003m1291A092b8502l20612i2344d1208m8551q6963
8927a76722o3852I4344R5624O606O767C51Q2235J45873a16777A28507o160M26156
8915E48503D7388K93738N272l2708K45500K59393K36106Q38999J920899N486324
8905I300911j761118C174295j131793n85729n81100l08431j09245A14261K8039
8896A42300L73439A16441j7104M4136K9225D5812a44390M3058A34652M0255G0744
8884a69370B04712a87661N0627b9061l91398A52548o3067B4867c23011J53551
$$ plain form
8874 -169460 -314898 41816 121657 181996 294125 -266979 -161344 -118527 45710 -199343 -33889
8862 161025 57093 231894 240232 -256016 120852 194182 123970 -262648 -298238 40268 -105085
8850 -207825 49214 -346513 58796 -458496 -275380 -146339 241794 43982 -78478 -326925
$$ packed form
8874a69460j45438D1816P9841O0339J12129b66979J05635M2817D5710a99343c3889
8862A61025E7093J74801Q338b56016A20852P3330p0212b62648l5590D0268a05085
8850b07825D9214c46513E8796d58496J83116J29041B41794D3982g8478k48447
$$ [...]
##END NTUPLES=NMR SPECTRUM
##END=
